
##TITLE=AC1006_S-090_6278756_7JjdzsqALM
##JCAMPDX= 6.0         $$ Bruker NMR JCAMP-DX V2.0
##DATA TYPE= NMR SPECTRUM
##DATA CLASS= NTUPLES
##ORIGIN= BRUKER
##OWNER= Administrator
$$ 1.72 TOPSPIN		Version 2.1
$$ 2012-06-03 16:32:39.609 -0500  Administrator@TOPSPIN
$$ Compression mode = diff/dup
##.OBSERVE FREQUENCY= 400.13188235
##.OBSERVE NUCLEUS= ^1H
##.ACQUISITION MODE= SIMULTANEOUS (DQD)
##.ACQUISITION SCHEME= undefined
##.AVERAGES= 8
##.DIGITISER RES= 22
##SPECTROMETER/DATA SYSTEM= spect
##.PULSE SEQUENCE= zg30
##.SOLVENT NAME= COFFEE_meoh
##.SHIFT REFERENCE= INTERNAL, COFFEE_meoh, 1, 14.98061
##AUDIT TRAIL= $$ (NUMBER, WHEN, WHO, WHERE, PROCESS, VERSION, WHAT)
$$ ##TITLE= Audit trail, TOPSPIN		Version 2.1
$$ ##JCAMPDX= 5.01
$$ ##ORIGIN= Bruker BioSpin GmbH
$$ ##OWNER= Administrator
$$ $$ C:\Bruker\TOPSPIN/data/COFFEE/nmr/AC1006_S-090_6278756_7JjdzsqALM/10/pdata/1/auditp.txt
$$ ##AUDIT TRAIL=  $$ (NUMBER, WHEN, WHO, WHERE, PROCESS, VERSION, WHAT)
(   1,<2012-06-03 16:32:32.171 -0500>,<Administrator>,<TOPSPIN>,<go>,<TOPSPIN 2.1>,
      <created by zg
	started at 2012-06-03 16:31:25.546 -0500,
	POWCHK enabled, PULCHK disabled,
       configuration hash MD5:
       D5 CA 7A 23 FE 6B EE E2 50 67 74 61 24 F7 5E 3B
       data hash MD5: 64K
       96 0D AF EB B6 DA DB 0B 6A 76 F9 EC 89 69 90 E0>)
(   2,<2012-06-03 16:32:35.203 -0500>,<Administrator>,<TOPSPIN>,<proc1d>,<TOPSPIN 2.1>,
      <Start of raw data processing
       efp LB = 0 FT_mod = 6 PKNL = 1 PHC0 = 0 PHC1 = 0 SI = 32K 
       data hash MD5: 32K
       D6 55 E3 80 63 0C 43 A3 68 6B 01 6E A3 ED 9D 2C>)
(   3,<2012-06-03 16:32:35.640 -0500>,<Administrator>,<TOPSPIN>,<proc1d>,<TOPSPIN 2.1>,
      <pk PHC0 = 210.6793 PHC1 = 0 
       data hash MD5: 32K
       B2 D0 44 48 45 C8 34 D2 E4 6F A8 B6 5E 80 1A 02>)
(   4,<2012-06-03 16:32:35.718 -0500>,<Administrator>,<TOPSPIN>,<proc1d>,<TOPSPIN 2.1>,
      <abs ABSG = 1 
       data hash MD5: 32K
       2B 69 92 72 63 C9 FD D9 4F 91 4E 69 72 F5 8F 05>)
(   5,<2012-06-03 16:32:35.750 -0500>,<Administrator>,<TOPSPIN>,<proc1d>,<TOPSPIN 2.1>,
      <abs ABSG = 2 
       data hash MD5: 32K
       A1 10 A1 18 0B 72 2F 44 EB C7 45 9A 7A FB 11 03>)
(   6,<2012-06-03 16:32:35.765 -0500>,<Administrator>,<TOPSPIN>,<proc1d>,<TOPSPIN 2.1>,
      <abs ABSG = 3 
       data hash MD5: 32K
       1C E2 9D D4 2B 81 20 C3 94 89 29 F7 97 AE DD 6A>)
(   7,<2012-06-03 16:32:35.796 -0500>,<Administrator>,<TOPSPIN>,<proc1d>,<TOPSPIN 2.1>,
      <abs ABSG = 4 
       data hash MD5: 32K
       1C BB 39 65 98 BE 2D 84 5B F1 BA 2D C7 77 12 F8>)
(   8,<2012-06-03 16:32:35.828 -0500>,<Administrator>,<TOPSPIN>,<proc1d>,<TOPSPIN 2.1>,
      <abs ABSG = 5 
       data hash MD5: 32K
       D7 EB 44 9A 6E E2 5F 55 EC D5 36 4C E2 8C 4C D6>)
$$ ##END=
$$ 
$$ $$ hash MD5
$$ $$ 4D A6 BD 68 28 B8 46 E2 E6 99 BE 1E F4 1E 9F 90
##$RELAX= 
##$RELAX= 
##$RELAX= 
##$RELAX= 
##$RELAX= 
##$RELAX= 
##$RELAX= 
$$ Bruker specific parameters
$$ --------------------------
$$ [...]
150 150 150 150 150 150 150 150
##$TP07= 0
##$TPNAME0= <>
##$TPNAME1= <>
##$TPNAME2= <>
##$TPNAME3= <>
##$TPNAME4= <>
##$TPNAME5= <>
##$TPNAME6= <>
##$TPNAME7= <>
##$TPOAL= (0..7)
0.5 0.5 0.5 0.5 0.5 0.5 0.5 0.5
##$TPOFFS= (0..7)
0 0 0 0 0 0 0 0
##$TUNHIN= 0
##$TUNHOUT= 0
##$TUNXOUT= 0
##$USERA1= <user>
##$USERA2= <user>
##$USERA3= <user>
##$USERA4= <user>
##$USERA5= <user>
##$V9= 5
##$VALIST= <valist>
##$VCLIST= <CCCCCCCCCCCCCCC>
##$VD= 0
##$VDLIST= <DDDDDDDDDDDDDDD>
##$VPLIST= <PPPPPPPPPPPPPPP>
##$VTLIST= <TTTTTTTTTTTTTTT>
##$WBST= 2048
##$WBSW= 25
##$XGAIN= (0..3)
0 0 0 0
##$XL= 0
##$YL= 0
##$YMAX_a= 512285
##$YMIN_a= -613533
##$ZGOPTNS= <>
##$ZL1= 120
##$ZL2= 120
##$ZL3= 120
##$ZL4= 120
##$ABSF1= 14.98061
##$ABSF2= -5.57192
##$ABSG= 5
##$ABSL= 3
##$ALPHA= 0
##$AQORDER= 0
##$ASSFAC= 0
##$ASSFACI= 0
##$ASSFACX= 0
##$ASSWID= 0
##$AUNMP= <proc_prof1d_extract_pilot.lims>
##$AXLEFT= 0
##$AXNAME= <>
##$AXNUC= <1H>
##$AXRIGHT= 0
##$AXTYPE= 0
##$AXUNIT= <>
##$AZFE= 0.1
##$AZFW= 0.1
##$BCFW= 0
##$BC_mod= 0
##$BYTORDP= 0
##$COROFFS= 0
##$CY= 15
##$DATMOD= 1
##$DC= 0
##$DFILT= <>
##$DTYPP= 0
##$F1P= 0
##$F2P= 0
##$FCOR= 0.5
##$FTSIZE= 32768
##$FT_mod= 6
##$GAMMA= 0
##$GB= 0
##$INTBC= 1
##$INTSCL= 1
##$ISEN= 128
##$LB= 0
##$LEV0= 0
##$LPBIN= 0
##$MAXI= 10000
##$MC2= 0
##$MEAN= 0
##$ME_mod= 0
##$MI= 0
##$NCOEF= 0
##$NC_proc= -8
##$NLEV= 6
##$NOISF1= 0
##$NOISF2= 0
##$NSP= 0
##$NTH_PI= 0
##$NZP= 0
##$OFFSET= 14.98061
##$PC= 1
##$PHC0= 210.6793
##$PHC1= 0
##$PH_mod= 1
##$PKNL= yes
##$PPARMOD= 0
##$PPDIAG= 0
##$PPIPTYP= 0
##$PPMPNUM= 2147483647
##$PPRESOL= 1
##$PSCAL= 4
##$PSIGN= 0
##$PYNMP= <proc.py>
##$REVERSE= no
##$SF= 400.13
##$SI= 32768
##$SIGF1= 0
##$SIGF2= 0
##$SINO= 400
##$SIOLD= 32768
##$SPECTYP= <>
##$SREGLST= <1H.CDCl3>
##$SSB= 0
##$STSI= 32768
##$STSR= 0
##$SW_p= 8223.68421052632
##$SYMM= 0
##$S_DEV= 0
##$TDeff= 65536
##$TDoff= 0
##$TI= <>
##$TILT= no
##$TM1= 0
##$TM2= 0
##$TOPLEV= 0
##$USERP1= <user>
##$USERP2= <user>
##$USERP3= <user>
##$USERP4= <user>
##$USERP5= <user>
##$WDW= 1
##$XDIM= 32768
##$YMAX_p= 465229549
##$YMIN_p= -747564
##$CURPLOT= <Network HP LaserJet P1505>
##$CURPRIN= <$Network HP LaserJet P1505>
##$DFORMAT= <normdp>
##$LAYOUT= <+/1D_H.xwp>
##$LFORMAT= <normlp>
##$PFORMAT= <normpl>
##$SURQMSG= 1
$$ End of Bruker specific parameters
$$ ---------------------------------
##NTUPLES= NMR SPECTRUM
##VAR_NAME=  FREQUENCY,     SPECTRUM/REAL,   SPECTRUM/IMAG
##SYMBOL=    X,             R,               I
##VAR_TYPE=  INDEPENDENT,   DEPENDENT,       DEPENDENT
##VAR_FORM=  AFFN,          ASDF,            ASDF
##VAR_DIM=   32768,         32768,           32768
##UNITS=     HZ,            ARBITRARY UNITS, ARBITRARY UNITS
##FACTOR=    0.250966925370066, 1,           1
##FIRST=     8223.43324360095, -295381,      -128013
##LAST=      0,             52398,           106261
##MIN=       0,             -747564,         0
##MAX=       8223.43324360095, 465229549,    0
$$ Real data points
##PAGE= N=1
##DATA TABLE= (X++(R..R)), XYDATA
$$ [...]
19554B95379f6262j37150A27588c36610O9202h7029C4406d20786B1389a24427
19543A93314a0107m6993k37965B32851D8810b9258D1324a87410B6335K30354c04390
19531a48970H8052c28709A49298M50148j97999A01221d2536m0353B94770c34103
19520c51155d2922j68868B01145n6853a50838P5026A69256b34320J06862j65691
19510b93149A66773d6240A52581a61011c8127D5018R1897c43051B16061a3730
19499D315d1122p3839L6408a1779j74043L1880e9084A01183b45743C5764b48595
19487b48187B1129i2147o3389A23976c3154j09532A34455a32109A19309h6444
19476b90304J14735g359j114A2143a2451k96074M3772a11307k08936A51718a57177
$$ y = [295379, -66262, -203412, 127588, -336610, -267408, -87029, 34406, -420786, 21389, -124427, 193314, -10107, -57100, -295065, 232851, 48810, -29258, 41324, -187410, 26335, 256689, -304390, -148970, 88052, -328709, 149298, 599446, 401447, 101221, -42536, -82889, 294770, -334103, -351155, -42922, -211790, 201145, 144292, -150838, -75812, 169256, -234320, -127458, -293149, 166773, -46240, 152581, -161011, -38127, 45018, 136915, -343051, 216061, -13730, 4315, -41122, -114961, -78553, -11779, -185822, -153942, -59084, 101183, -245743, 35764, -248595, -248187, 21129, -92147, -155536, 123976, -33154, -142686, 134455, -132109, 119309, -86444, -290304, -175569, -7359, -8473, 12143, -12451, -308525, -264753, -111307, -320243, 151718, -157177]
19464H4639b18041C5462b33122B1540K6164b02807e2600m945F537i0537D2511
19452I9723a69799B15523d52566H2268b9186A21479M0994N692d0928C09073i8162
19440a95942P6949L3330A47632c11881b3353m42350d8704A36993B1240d5166j69135
19429b14301a9927j74738P2391A68127B7795J15255b4846m0834k43434M2180I8880
19417A64829a24587J3988j25557A00573J11950e7858A64604b62433C44059a7137
19406G7464c2295A6366K5585K0380A9469L5895f98k30597D2033e7522j73520d1044
19393c05268Q118G8676O919e6776A6474J02888h860b39o5973A31395D1266a17289
19380a65642P1884A21012a10990B3661K9743L1837b40942j62738C19283c43000
$$ y = [84639, -218041, 35462, -233122, 21540, 47704, -202807, -52600, -57545, 6537, -90537, 42511, 99723, -169799, 215523, -452566, 82268, -29186, 121479, 162473, 168165, -40928, 309073, -98162, -195942, -118993, -85663, 147632, -311881, -23353, -465703, -48704, 136993, 21240, -45166, -214301, -19927, -194665, -122274, 168127, 27795, 143050, -24846, -65680, -309114, -266934, 98880, 164829, -124587, -110599, -236156, 100573, 212523, -57858, 164604, -262433, 344059, -17137, 77464, -32295, 16366, 41951, 62331, 19469, 55364, -698, -231295, 42033, -57522, -231042, -41044, -305268, -297150, 78676, 85595, -56776, 16474, 119362, -8860, -239, -66212, 131395, 41266, -117289, -165642, -93758, 121012, -110990, 23661, 53404, 85241, -240942, -403680, 319283, -343000]
19369a7694B54859c57363M1307A00195D0262J98085a55059a9429l03019A6031
19358A2680F8c44037F1858c17394a55797B52751j07323a6663d882q1851c6478
19346b8774j05641E2942k2308i3420J7718c685l59926a1995j01101j56956A01040
19334F0704B9530a19586A84424f3395b7385D7646J70967D772b10906A37289E3020
19322b02396j42477A02577C4069a9290l03520B1438b8799D2979A4750b36410e8220
19310b17112j3114B36571k8226A03474d67782g1560j09101q0429h673I6584B5110
19298a63297j5096g7721A16167K30750a71769k30089g8480o3989N7855k18453
19288c03067l8392j02985A84698a17542A74096D0134a17332k07222A88224a28820
$$ y = [-17694, 254859, -357363, -316056, 100195, 40262, 238347, -155059, -19429, -322448, 16031, 12680, 68, -344037, 61858, -317394, -155797, 252751, 145428, -16663, -4882, -86733, -36478, -28774, -134415, 52942, 30634, -93420, -75702, -3685, -363611, -11995, -113096, -270052, 101040, 60704, 29530, -119586, 184424, -63395, -27385, 47646, 218613, 4772, -210906, 137289, 53020, -202396, -344873, 102577, 34069, -19290, -322810, 21438, -28799, 42979, 14750, -236410, -58220, -217112, -230226, 236571, 208345, 103474, -467782, -71560, -180661, -261090, -8673, 96584, 25110, -163297, -178393, -77721, 116167, 346917, -171769, -401858, -78480, -142469, -84614, -303067, -341459, -444444, 184698, -117542, 174096, 40134, -117332, -324554, 188224, -128820]
19277h4670j8079o0609A49088M2663g3631k98720E0722g2931I2598c25580R63
19266c24617f0944A8136c77717a22737H7167C7038J79653c91319C24419d14631
19255d8214q6025A23701D4130b42784k7705g4052B47266b14093P8908k72576E9191
19243b77670H7996b31137F9597c40290m569a01049B9544b9988j78425p9195A60412
19231a20811K0182A26400b11744G5241K56c46625J26972J08484j2470B95791b48140
19219h2594D3173N762R7941n4491h0826j3513j49216d9476j63649R4121B06909
19207h3160k19923O8878g9532a7634I0911e0604B42308G8427i4764p4389j94944
19196c64097f4987k27808K5173C0409b62105J15230k22211i8932p3046N0560K7405
$$ y = [-84670, -102749, -163358, 149088, 191751, -73631, -372351, 50722, -72931, 92598, -325580, -324617, -60944, 18136, -377717, -122737, 87167, 37038, 216691, -391319, 324419, -414631, -48214, -134239, 123701, 44130, -242784, -270489, -74052, 247266, -214093, -135185, -407761, 59191, -277670, 87996, -231137, 69597, -340290, -344859, -101049, 29544, -29988, -208413, -287608, 160412, -120811, -100629, 126400, -211744, 75241, 75497, -346625, -219653, -111169, -123639, 295791, -248140, -82594, 43173, 48935, 146876, 92385, -80826, -94339, -243555, -49476, -213125, -119004, 206909, -83160, -303083, -234205, -79532, -17634, 90911, -50604, 242308, 78427, -94764, -169153, -364097, -64987, -292795, -267622, 30409, -262105, -146875, -369086, -98932, -171978, -121418, -94013]
19185i4013c3913f657A40821c0202B68382b58958b4463I5949b50173J15605B07468
19173b91924c3483a4766q7274c5776j15905j19249J07363D3273b42988D5836b98198
19161B53J42720i5663D5450b6197C01724F3308M3725C9013g3883j40481b8818
19149B26152C0714b21479i2879H6037a18001c066j0454A62504a5214B5215f5355
19137a02700a4978m0364B22908f5395B18767e4662G4126J96435P2244b11667e0194
19125a57490o3469A33275K3039l5766J3887g511j9225k15743a19421G6795b03228
19113b02458l00457A84206G0199G906J05226a82186j35931j82966b7919k2145
19103e0064A45290L6867c7967p1666c3086k76594A89883a7399l1916D3810b57412
$$ y = [-94013, -33913, -6657, 140821, -30202, 268382, -258958, -24463, 95949, -250173, -134568, 207468, -291924, -33483, -14766, -102040, -35776, -151681, -270930, -163567, 43273, -242988, 45836, -298198, 253, 142973, -95663, 45450, -26197, 301724, 63308, 107033, 39013, -73883, -214364, -28818, 226152, 30714, -221479, -92879, 86037, -118001, -3066, -13520, 162504, -15214, 25215, -65355, -102700, -14978, -55342, 222908, -65395, 218767, -54662, 74126, 270561, 342805, -211667, -50194, -157490, -220959, 133275, 156314, 120548, 134435, -7511, -26736, -242479, -119421, 76795, -203228, -202458, -502915, 184206, 70199, 7906, 113132, -182186, -318117, -501083, -27919, -50064, 145290, 182157, -37967, -109633, -33086, -309680, 189883, -17399, -49315, 43810, -257412]
19091E0794O3320b00111H4942a96379a6498A42805a92044F904i0350I343J1519
19080B0862a34553m1947g8039q1727r3360b4068D1809i4811d300D7262P3877a8845
19067g386A36480b33436D9484b60164d4010r7759D1176e8122A53473A7211a42793
19055G2532e8474K7142o1905c1815l4653B9580a90174m939i3385p5501g7576H2111
19042H0526b1246b524q0054j7066q032D61117k4313e7894A19550a89153I8873
19030A19744f3101F7227A5589b88744d829l30317c7609j73915J01452o375B14219
19018a65597J5232L6689o7898g8819q4778A3080a19660A33437a0182B12533l9842
19007A72691e7791G3143H790L86327j64722j03707c19315R1480a11973e337A19111
$$ y = [50794, 114114, -200111, 84942, -196379, -16498, 142805, -192044, 6904, -90350, 9343, 20862, -134553, -176500, -78039, -159766, -253126, -24068, 41809, -94811, -4300, 47262, 121139, -18845, -7386, 136480, -233436, 49484, -260164, -44010, -141769, 41176, -58122, 153473, 17211, -142793, 72532, -58474, -31332, -93237, -31815, -66468, 29580, -190174, -195113, -93385, -168886, -77576, 82111, 80526, -21246, -2524, -82578, -99644, -107676, 461117, 436804, -57894, 119550, -189153, 98873, 119744, -63101, 67227, 15589, -288744, -4829, -335146, -37609, -211524, -110072, -116447, 214219, -165597, -150365, -113676, -181574, -78819, -163597, 13080, -119660, 133437, -10182, 212533, 172691, -57791, 73143, 8790, 395117, 230395, 126688, -319315, -227835, -111973, -5337, 119111]
18995a91911A06277a97353j2388D13820C1632N5160d7290J5401j1712B1384a57713
18983a74884j84097N5381A8607a95572k8721A60623c387j10104l91300A48026
18972i5845A58034J00218c4313n2305r6048B6471O9677K51025i373k52850g0148
18960i3168q6281o9114c5678C3664b7695B59475a34576b5101C04904C4232J29739
18949A63971N8790b11787P656R3255A45056d4206a0795r6125l3618A12491h2888
18937D7146e6032l31339G8486K704h2639f716j10721C72768a2693j70428A74142
18925B64684c98148D4091a97483F9065g9113A59743i3225A45633a5120j58682
18915a73802O1265A07971a15338b960j06324E2960c7926a2897C10110a69118j13042
$$ y = [-191911, 106277, -197353, -209741, 413820, 31632, 86792, -47290, -31889, -43601, 21384, -157713, -174884, -358981, -303600, 18607, -195572, -224293, 160623, -3387, -113491, -504791, 148026, -95845, 158034, 258252, -34313, -86618, -182666, 26471, 96148, 347173, -9373, -262223, -70148, -93168, -179449, -248563, -35678, 33664, -27695, 259475, -134576, -25101, 304904, 34232, 163971, 222761, -211787, -204131, -110876, 145056, -44206, -10795, -106920, -140538, 112491, -82888, 47146, -56032, -387371, 78486, 81190, -82639, -6716, -117437, 372768, -12693, -183121, 174142, 264684, -398148, 44091, -197483, 69065, -79113, 159743, -93225, 145633, -15120, -173802, -112537, 107971, -115338, -2960, -109284, 52960, -37926, -12897, 310110, -169118, -282160]
18904b82160a38982H3583K5563c3025D0250a25028j32262M3054i8198P424C51362
18892B07159a24357E3787a75614B01259a330j09176r910K1378D1719d1336B25929
18880a08378K9881k3243B60610l1385c56884J33088a08377B23285f4417j83564
18870b47981D2409e2559j19499B271b24704P3958l03471A29577D437a71094d5810
18858B1839b13007B623a72098f8559k61495a13781k6846A17858A4339b5389k56951
18847b82340B16308b97469a40204B3418D284K6795i3051j44367P5193A84479J4832
18836A99311g0450A12189b96134a05846F7804J51981b66728A31012K03161a1152
18825a6024m44312D8489a43460J2848C3548f3710A2346a08055a4506j4384A8908
$$ y = [-282160, -138982, 83583, 109146, -33025, 40250, -125028, -257290, -214236, -98198, -90774, 351362, 207159, -124357, 53787, -175614, 201259, -1330, -110506, -120416, -99038, 41719, -41336, 225929, -108378, -78497, -101740, 260610, 229225, -356884, -223796, -108377, 223285, -64417, -247981, 42409, -52559, -172058, 2271, -224704, -150746, -454217, 129577, 4437, -171094, -45810, 21839, -213007, 2623, -172098, -68559, -330054, -113781, -140627, 117858, 14339, -25389, -282340, 216308, -297469, -140204, 23418, 4284, 31079, -93051, -237418, -162225, 184479, 199311, -70450, 112189, -296134, -105846, 67804, 219785, -266728, 131012, 334173, -11152, -16024, -460336, 48489, -143460, -130612, 33548, -63710, 12346, -108055, -14506, -28890, 18908]
18813I1767C2966J11869F3707a66665a9118A37688A5229O0985o791B5277J58667
18802A83944F1673J0480e9193K8573B24876E5082b4841j9401A8469J48324d7100
18790F0819C0094b78044A79319H4154P3891a99287Q9796a5713E7812k46a06136
18778g2675K9507a8791p4680c8197A45a83572K2804j5573E0065c96057H085b36793
18765I1841a34182k94431h4498H4439p05b81362D463J92548k8668h4891k0584
18754a05475G2500l343a21259r4481B03009b08378B3872a52250n5357J02435l8274
18743a43446b5639D01040a55973f3077j73344j8509A64152b36754a8903A55766
18732b03245P0583f3071j5434b9987r4679c7350G5498k9790q356b17084A50562
$$ y = [91767, 32966, 144835, 63707, -166665, -19118, 137688, 15229, 76214, 69423, 25277, 183944, 61673, 72153, -59193, -30620, 224876, 55082, -24841, -44242, 18469, 166793, -47100, 60819, 30094, -278044, 179319, 84154, 158045, -199287, -109491, -15713, 57812, 57566, -106136, -72675, -43168, -18791, -93471, -38197, 145, -183572, -160768, -176341, 50065, -396057, 8085, -236793, 91841, -134182, -428613, -84498, 84439, 83734, -281362, 4463, 197011, 168343, -84891, -105475, 72500, 69157, -121259, -215740, 203009, -208378, 23872, -152250, -207607, -105172, -143446, -25639, 401040, -155973, -63077, -236421, -254930, 164152, -236754, -18903, 155766, -203245, -132662, -63071, -78505, -29987, -124666, -37350, 75498, 45708, 37352, -217084, 150562]
18720C0135b10233a4124A70601p6361R0412B7971b6226k72201r0550E521a53406
18708a10194D01073j90692I6404a48158d4371k22636I1555j1560a24236d2361
18697a18830j41921o0133D4151b5061k23342F2188a29392l06069c3970k95540
18687c29510a50683E9063b34245g8462B30384I453R5953b89754J21579A85853
18676b81754C07457a03147l90413g8157b2963D1994b90171f1082j89900B69806
18665A39143e877G0824c64875A31972J62844c08881Q5582O2473A03526b5472l37808
18654c63280e5231j25078k61981b4952B26814a39037B606b51176J00626M2169
18644a08381a3872k7268j10975o2696A4528J18410a13953l13070b1780j08448
$$ y = [30135, -210233, -14124, 170601, 94240, 184652, 27971, -26226, -298427, -388977, 5521, -153406, -110194, 401073, 210381, 96404, -148158, -44371, -267007, 91555, 79995, -124236, -42361, -118830, -260751, -320884, 44151, -25061, -248403, 62188, -129392, -435461, -33970, -329510, -150683, 59063, -234245, -78462, 230384, 9453, 105406, -289754, -168175, 185853, -281754, 307457, -103147, -493560, -78157, -22963, 41994, -290171, -61082, -250982, 269806, 139143, -5877, 70824, -364875, 131972, 294816, -308881, -223299, -160826, 103526, -25472, -363280, -55231, -180309, -442290, -24952, 226814, -139037, 2606, -251176, -150550, -108381, -13872, -41140, -152115, -214811, 14528, 132938, -113953, -427023, -21780, -130228]
18634a30228G6531a34581M5861l51064E13776A78563c05526B40320d1505j84768
18624b26273l4756D9752M3353K2396e748r8843r3311A68823a42662A24641O650
18613A31291b21803A82958c50147i265o4415k22771A54075a60308b8616q7824
18603a16440A12926f64648a00939J3959D4567a34743A84484d12244f4885N770
18593e9115A52087Q3755G7614D655f5060J8096J4949G9715a49314L0337D8920
18581A31834L3071n6566C3051a83615L5687b6748k5074B9212J08809D6989h5477
18569i826j50648J1007A6267J70147c24330a9756n7773j08923b14j90275J4350
18558a76139D822g1722B74323b08737B01702b00681q504e3491j97165c740p4607
$$ y = [-130228, 76531, -134581, -88720, -439784, 513776, 178563, -305526, 240320, -41505, -226273, -261029, 49752, 93105, 115501, -5748, -104591, -197902, 168823, -142662, 124641, 131291, -221803, 182958, -350147, -9265, -73680, -296451, 154075, -160308, -28616, -116440, 112926, -664648, -100939, -86980, 44567, -134743, 184484, -412244, -64885, -59115, 152087, 235842, 77614, 4655, -65060, -46964, -32015, 79715, -149314, -118977, 48920, 131834, 164905, 108339, 33051, -183615, -147928, -26748, -51822, 29212, 138021, 46989, -85477, -9826, -160474, -149467, 16267, 186414, -324330, -19756, -77529, -186452, -214, -190489, -176139, 4822, -71722, 274323, -208737, 201702, -200681, -209185, -53491, -250656, -3740, -78347]
18547g8347o3726j10901r2613e7841G0342c92597d4546A50877b44340B65068c03900
18535A7251a95365e079G1899a50004d0701l95176A08210k6328P5940a15497J783
18524a13714l53781a4998j29152e7204A88302c99361J72263M5257G9098P8197
18514A57295B5341M4940g4283B53348a90323O2468A21180a59995J8480k4837B23092
18502a10171o3192N2530H4101b31469A8925b0677A39805e7970A71978A3576L34414
18491C47990a00906a4936F5243L2118c1856k8564j05330k07389h7331A30755h7932
18479B70238D7732J88860A11100a22611j12525q5819H5792a8903j66840B22746
18468A37089b4814A59639b15808H8292g9572A18474Q3541p7204J8854B9729J82788
$$ y = [-78347, -142073, -252974, -345587, -57841, 70342, -392597, -44546, 150877, -244340, 265068, -303900, 17251, -195365, -5079, 71899, -150004, -40701, -435877, 108210, 81882, 157822, -115497, -113714, -467495, -14998, -144150, -57204, 188302, -399361, -227098, -181841, 79098, 157295, 25341, 70281, -74283, 253348, -190323, -127855, 121180, -159995, -141515, -166352, 223092, -110171, -173363, -120833, 84101, -231469, 18925, -20677, 139805, -57970, 171978, 13576, 347990, -100906, -14936, 65243, 97361, -31856, -60420, -165750, -373139, -87331, 130755, -87932, 270238, 47732, 236592, 111100, -122611, -235136, -320955, 85792, -18903, -185743, 222746, 137089, -24814, 159639, -215808, 88292, -79572, 118474, 202015, 124811, 143665, 29729, 212517]
18457B12517H5778M7689a0816p4336j1340r8640H6256a20983j06360q27D4645
18445g5124E2369d7404A15533d8334m1907A84068b23608F0545J0364F447a24494
18433c15002B7891b18957k33179a81645I3779g4945l9538I0620d3253D6926a50042
18421A35733B6140N7321J97396m4272B9550M3831R7138P5350a54427c5486A13991
18409e3038A79386g3530o0236c3419P390k16707b9915k0456J1518E0786A1459
18397b30774j36486f9951p0990N3892B12272I4740c30081A65150c0738j47950
18387a78688j9476B00713a12473B71489A01403b4431B47131j6867b5060k21057
18377b46117a7489k41401N7560j56647a31633B943c47934C26118b16166B10555
$$ y = [212517, 85778, 133467, -10816, -85152, -96492, -195132, 86256, -120983, -227343, -228170, 44645, -75124, 52369, -47404, 115533, -48334, -90241, 184068, -223608, 60545, 70909, 6447, -124494, -315002, 27891, -218957, -452136, -181645, 93779, -74945, -114483, 90620, -43253, 46926, -150042, 135733, 26140, 83461, 280857, 236585, 29550, 73381, 170519, 245869, -154427, -35486, 113991, -53038, 179386, -73530, -133766, -33419, -26029, -242736, -29915, -50371, -38853, 50786, 11459, -230774, -367260, -69951, -140941, -87049, 212272, 94740, -330081, 165150, -30738, -178688, -198164, 200713, -112473, 271489, 101403, -24431, 247131, 230264, -25060, -246117, -17489, -258890, -201330, -357977, -131633, 2943, -347934, 326118, -216166, 210555]
18366a72002o1585a01937c4865D6002M0696A9744K6923a80929J2154P0427G477
18354a69152B09389a54600d4255B58321G9602f0174I6665d06566A02675P710l3446
18343G6939K06317c08399c4118F0911c4804H1451a19850m6536E8237a34086B07590
18331d1940l45696J59711A64113n5746b29961A46310a63604a6440l15235A90670
18320a35220H2922l0617J45360m8009b63648b6038H200f7647E4163P0150b15036
18308b51727R6629j73099a04189c7671A67329b30893D5696a90069O7959r2436
18298b14546J6051k3272B9754O104Q2434a8356N160A47004c5659j48177D322N5992
18286F0314a31647D8511c52520B50721b78650f9343e065C3657a07039j47156N967
$$ y = [-172002, -233587, -101937, -34865, 46002, 86698, 19744, 46667, -180929, -168775, -98348, 7477, -169152, 209389, -154600, -44255, 258321, 79602, -60174, 96665, -406566, 102675, 110385, 76939, 283256, -308399, -34118, 60911, -34804, 81451, -119850, -166386, 58237, -134086, 207590, -41940, -387636, -227925, 164113, 108367, -229961, 146310, -163604, -16440, -331675, 190670, -135220, 82922, 52305, 197665, 149656, -263648, -26038, 8200, -67647, 54163, 124313, -215036, -251727, -155098, -328197, -104189, -37671, 167329, -230893, 45696, -190069, -122110, -214546, -198495, -221767, 29754, 35858, 118292, -18356, -13196, 147004, -35659, -183836, 4322, 60314, -131647, 48511, -352520, 250721, -278650, -69343, -5065, 33657, -107039, -254195, -248228]
18275b48228A06121a31020A6075a88056j6292o6458a18915K0686H434L1137Q217
18264D7788J06148c31779g9927D134Q5474h2712A12206l4879a0607A6824d12292
18252b91058A99090b61157g8526H8367A4790a07510I3145b06765N6645A0521a55328
18240b77095C17200a27901E6201d7266k28971C49542a0419H0293a92359g4843
18229a77211A97351f9641A61787e195k27592f9124j04544A7310a51984k1455A8072
18217a48310b0277k5465a6408B41657I8382a71122H052h8149M2704G5789a05459
18205b8525j15707j02924f019A36683a28264Q22f2870l4824c1186E7823b23987
18193A0587K32595q9514C2006J58606Q8842I1035a49852j1130P9407l4501A03209
$$ y = [-248228, 106121, -131020, 16075, -188056, -204348, -270806, -118915, -98229, 8434, 39571, 47788, 153936, -331779, -79927, 4134, 89608, -82712, 112206, 77327, -10607, 16824, -412292, -291058, 199090, -261157, -78526, 88367, 14790, -107510, 93145, -206765, -150120, 10521, -155328, -277095, 317200, -127901, 56201, -47266, -276237, 349542, -10419, 80293, -192359, -74843, -177211, 197351, -69641, 161787, -5195, -232787, -69124, -173668, 17310, -151984, -173439, 18072, -148310, -20277, -45742, -16408, 241657, 98382, -171122, 8052, -88149, -45445, 75789, -105459, -28525, -144232, -247156, -6019, 136683, -128264, -127442, -62870, -97694, -31186, 57823, -223987, 10587, 243182, 153668, 32006, 190612, 279454, 91035, -149852, -160982, -81575, -116076, 103209]
18181D6775m403i4686C91104l5519A23991b42232G1303q690a20422M4671n6856
18170a32607M6551D15777G9361h617l55460f2042A71327q3218e7922A66505c21228
18158c9896A8293f2466A25020a41544O4646A86918B4208a95904A24545i0229D3789
18146g2689b5773j23817D8163a79918B09304d8948G7102e7750n64m236B07376
18134A4803a05586L8109K7378j24221B33320b50073B20133i5465j888A84258c47663
18122A9320b8841E7835K32857a39354A32354J39157c16266n2917B52482e3165
18111a57304A90772E6153n673k4795J15442e6463D06423j85203c3711o157q1963
18100a21831b9763A11365b82652L5930A36363B1557i0498K8490j13330L9821A81977
$$ y = [46775, 42372, -94686, 391104, 355585, 123991, -242232, 71303, 62613, -120422, -75751, -132607, -86056, 415777, 79361, -8617, -364077, -62042, 171327, 88109, -57922, 166505, -321228, -39896, 18293, -62466, 125020, -141544, -76898, 186918, 24208, -195904, 124545, -90229, 43789, -72689, -25773, -149590, 48163, -179918, 209304, -48948, 77102, -57750, -58314, -62550, 207376, 14803, -105586, -67477, -40099, -164320, 233320, -250073, 220133, -95465, -97353, 184258, -347663, 19320, -28841, 57835, 290692, -139354, 132354, 271511, -316266, -369183, 252482, -53165, -157304, 190772, 56153, 50480, 25685, 141127, -56463, 406423, 221220, -33711, -39868, -121831, -29763, 111365, -282652, -246722, 136363, 21557, -90498, -62008, -175338, -135517, 181977]
18088a98880b3956k04129a06282G607h2272q6510a7195B25364d27883A572a94625
18076B89429a57720A26361a37119e5303a7775A67584R1441a77088L5921e4687
18065b18892O8412Q598j04119F4374b4963l03494B91036j03529b09074e3114j47128
18054b00242O352I8800c8489D7601i213B21356c5595j36556D0930a72980A03788
18042f6683l4322N6K9305Q477A60055c39577i5096A80565i7858B48305b06405
18030G1063c67921J64508A76a4331j939B29181I6418M0885E8222R6759e95F5641
18017A51426A8318h6664J2852j0933K6762b6179q2145k2766C26471a25373B71144
18005A98653F5750a37857A87126c3810n2399J2143D286a66394Q909f4280j32p9921
$$ y = [-198880, -23956, -228085, -106282, 7607, -82272, -168782, -17195, 225364, -427883, 1572, -194625, 289429, -157720, 126361, -137119, -55303, -17775, 167584, 259025, -177088, -141167, -54687, -218892, -150480, -141882, -246001, 64374, -24963, -328457, 291036, 187507, -209074, -53114, -200242, -193890, 98800, -38489, 47601, -9213, 221356, -35595, -172151, 40930, -172980, 103788, -66683, -101005, -100949, -71644, -63167, 160055, -339577, -95096, 180565, -97858, 248305, -206405, 71063, -367921, -203413, 176, -14331, -16270, 229181, 96418, 137303, 58222, 154981, -595, 65641, 151426, 18318, -86664, -73812, -84745, -57983, -26179, -108324, -131090, 326471, -125373, 271144, 198653, 65750, -137857, 187126, -33810, -86209, -74066, 4286, -166394, -157485, -64280, -64412, -144333]
17993a44333A08983f2552j81086c1369k80804a06671A07454l5809f0916k61142
17983c22058G3941N9826J69285a66812O8159j8122K559L5737D5896M63260D0832
17971h6957o3803A87662a91456H36L8660d2586B06100c92772a46144l2078k52543
17960d30765f2083j21875h2397B93182b11352H5958c00536D5398a5358r3754K2185
17949h6927k1267j5219E2024b53208D3896K60971b927C31426a25683e2240p6761
17938a29001A18648O5588b79120H9439e8653B11325I7329a54404L3165K0450A54600
17926A73041a82044n8506C64025H2348P6296o6922b01114F6566a20406g997B03408
17914E4008a97350l2293k4172E8052g5588l82590A40744l4509c8058A41160B4296
$$ y = [-144333, 108983, -62552, -243638, -31369, -312173, -106671, 107454, 71645, -60916, -322058, 73941, 133767, 303052, -166812, -98653, -116775, -114216, -78479, 45896, 509156, 40832, -86957, -150760, 187662, -191456, 836, 39496, -42586, 206100, -392772, -146144, -178222, -430765, -62083, -183958, -82397, 293182, -211352, 85958, -300536, 45398, -15358, -109112, -86927, -108194, -123413, 52024, -253208, 43896, 304867, -2927, 331426, -125683, -52240, -129001, 118648, 184236, -279120, 89439, -58653, 211325, 97329, -154404, -121239, -100789, 154600, 173041, -182044, -240550, 364025, 82348, 158644, 91722, -201114, 66566, -120406, -7997, 203408, 54008, -197350, -229643, -253815, 58052, -75588, -458178, 140744, 106235, -38058, 141160, 24296]
17902a91807r5774L2531a05011a5885A45566b8278A07575f5965A07687a82902
17891A01604b4065H8390b00574h4603m7394c2366C3262a81321a7362k3631k07524
17880b48517h7523A8125J23582F1852J53266H1350l2852A0251i3342C74084j81425
17869A92659d3825F2823b43537k1480d29j94340f3363B84221J6356e5025C1696
17857H3601e6567a1859C6461J18988b38861g9357k9375o5363m8013G0813e4219
17845H079b18652A65908A9700a79648d1711P922k8805b4824o7005A49772a76955
17833b33335A01956D0999a3010B66303D4176A7980J13752f19A62206d32518A45261
17821a17612o6042k2930l4110D6144O6363N587a38631D9404P5111D6469b15145
$$ y = [-191807, -287581, -255050, -105011, -15885, 145566, -28278, 107575, -65965, 107687, -182902, 101604, -24065, 88390, -200574, -84603, -131997, -32366, 33262, -181321, -17362, -40993, -248517, -87523, 18125, 141707, 61852, 215118, 81350, 48498, 10251, -93342, 374084, 192659, -43825, 62823, -243537, -265017, -429, -194769, -63363, 284221, 300577, -55025, 31696, 83601, -56567, -11859, 36461, 155449, -238861, -79357, -108732, -174095, -222108, 70813, -54219, 8079, -218652, 165908, 19700, -179648, -41711, -33789, -62594, -24824, -91829, 149772, -176955, -233335, 101956, 40999, -13010, 266303, 44176, 17980, 131732, -619, 162206, -432518, 145261, -117612, -183654, -206584, -240694, 46144, 112507, 118094, -138631, 49404, 124515, 46469, -215145]
17809A59065b5879A39295a19700C84192H5344c35001c7072j40842c5000j13654
17799a48654F2858O3162b14117A53707L6683B7074K1825J02262f0670K7378j4592
17788d7884l36098e5104D69409e3693p1860N1881n3728G5277J70365m5216C899
17776B52101g9056K7431j60206n4740B09444J51632A35392M3022h265F1904b05867
17764a88219a3228B88365c43906H1339b38223F6437a08614D6864a24264A14312
17753F8418a00752A52131d21146B7172J83516I3894L9187a1416k3912j67095i1682
17741B42307H8411J89613c8364B46309a7616F7882a16967D8185K626c23794J21749
17730b02045A48347a52217B2009R3825a02618I2733i8579I3133R7454c53685b0755
$$ y = [159065, -25879, 139295, -119700, 384192, 85344, -335001, -37072, -177914, -35000, -148654, 62858, 126020, -214117, 153707, 190390, 27074, 48899, 151161, -60670, -33292, -47884, -383982, -55104, 469409, -53693, -125553, -73672, -127400, 75277, 245642, 200426, 3899, 252101, -79056, -51625, -211831, -266571, 209444, 361076, 135392, 178414, -8265, 61904, -205867, -188219, -13228, 288365, -343906, 81339, -238223, 66437, -108614, 46864, -124264, 114312, 68418, -100752, 152131, -421146, 27172, 210688, 93894, 133081, -11416, -35328, -202423, -91682, 242307, 88411, 278024, -38364, 246309, -17616, 67882, -116967, 48185, 50811, -323794, -202045, 148347, -152217, 22009, 115834, -102618, 92733, -98579, 93133, 190587, -353685, -20755]
17718c6997p3955e981H1475a04590M771K9897j16549A59985g8464K6734k12109
17707b63839d4426B41471b81908P2927A24219b72575J08827A23476C4276R9071
17697A33347K3654J51955D3031j3701K84389c67188d5817A58712a77330L8628
17687a38702A6776f3511D0850A0731L29315E7314K07146A30042M3497i6169A55627
17675b19046d4390A48988a0695j55783C985J60448a4210j44436m5975I3644l1338
17664F2306M38883A79159b2438A5957a03897A16925a19474A92408Q8026I0508
17653C4498A0502R296K13966a62542A9052K77861e13850h5160n9094c6673k9374
17642f6047n3545M689m5654j53076B43268H2187M5727a43487D6693J13359a61389
$$ y = [-36997, -110952, -5981, 81475, -104590, -99819, -69922, -186471, 159985, -78464, -51730, -263839, -44426, 241471, -281908, -208981, 124219, -272575, -163748, 123476, 34276, 133347, 157001, 308956, 43031, 29330, 313719, -367188, -45817, 158712, -177330, -138702, 16776, -63511, 40850, 10731, 340046, 57314, 264460, 130042, 173539, -96169, 155627, -219046, -44390, 148988, -10695, -166478, 3985, 164433, -14210, -158646, -204621, 93644, 62306, 501189, 179159, -22438, 15957, -103897, 116925, -119474, 192408, 280434, 90508, 34498, 10502, 19798, 233764, -162542, 19052, 296913, -513850, -85160, -144254, -36673, -66047, -119592, -114903, -160557, -313633, 243268, 82187, 127914, -143487, 46693, 160052, -161389]
17630E584N2167a22974f3B34105j08421R5354b84870P2607A84492m5214J39169
17619B78447A6966b79261e490l2795A14345J7978N1234I0216M6846h5863A03053
17607B31940b05731A37971J48612f8563K3598M236j04297A01355B672a99578i8578
17595a03188A26372i2793A80089J16761D4766b50611h7557n5657E96O5623M05337
17584D71556A34140g5553c4932j33055M9987E4470P1960C1302K24168b63125i460
17572A17257a3972j77884B12068m9711C8688O1631B525g869A69228J45960a03322
17560A0829R7214K55567a79830A87077R7596j29139A5976a81998h9566A91319
17549f5843k02318h7285C46444A38690n0255c7805A72143p6041g7738A99900e0662
$$ y = [5584, 57751, -122974, -63, 234105, 125684, 221038, -284870, -212263, 184492, 139278, 278447, 16966, -279261, -5490, -38285, 114345, 132323, 183557, 90216, 137062, -85863, 103053, 231940, -205731, 137971, 286583, -68563, -44965, -40729, -145026, 101355, 2672, -199578, -98578, -103188, 126372, -92793, 180089, 296850, 44766, -250611, -87557, -143214, 596, 66219, 471556, 134140, -75553, -34932, -167987, -118000, 54470, 126430, 31302, 255470, -263125, -9460, 117257, -13972, -191856, 212068, 162357, 38688, 100319, 2525, -7869, 169228, 315188, -103322, 10829, 108043, 363610, -179830, 187077, 284673, 155534, 15976, -181998, -89566, 191319, -65843, -268161, -87285, 346444, 138690, 88435, -37805, 172143, 96102, -77738, 199900, -50662]
17537F6077R8631F3564b8062m8012D2015K14463H6785K89366A17632k0788N78
17526I7422g8708f510I883J5130J37830p1756q267K16430A39933b60921B07797
17514D08962A27458N02005l11977A4804L0616K07016h0665n2560A15699M3720
17504A59419A9846P0303a07181n8864f664l174E34387F18c90A00124J5578n1362
17492F4340A7383b66484B20892A05232g4264J2305B23966p4077a54323D34050
17481H684K01771c8727A78281k9195o7907J51684A3309g8514B15377I6822c0856
17469A32718D7255J10038c4099m7764j10598C22908j31599j8566G8574f8956C63392
17457B18504J49671A1258b0215l2259C00697a08516I0347g4668D8222L82969j22103
$$ y = [66077, 164708, 63564, -28062, -76074, 42015, 256478, 86785, 376151, 117632, 96844, 97422, -78708, -6510, 9883, 25013, 162843, 91087, 82820, 299250, 139933, -260921, 207797, 408962, 127458, 629463, 317486, 14804, 45420, 252436, -80665, -133225, 115699, 159419, 19846, 90149, -107181, -166045, -6664, -9838, 534387, 618, -390, 100124, 115702, 64340, 17383, -266484, 220892, 105232, -74264, -61959, 223966, 149889, -154323, 434050, 8684, 210455, -38727, 178281, 149086, 81179, 232863, 13309, -78514, 215377, 96822, -30856, 132718, 47255, 157293, -34099, -81863, -192461, 322908, 191309, 172743, 78574, -68956, 363392, 218504, 368175, 11258, -20215, -52474, 300697, -108516, 90347, -74668, 48222, 431191, 309088]
17446C09088A10441I495K05155p1885l8429K05217q7805J15092n9988p1985J37588
17435C42455g4541D07552J1282L736j08534Q0172I6323c1741A58561L222R0138
17424B51921K44914G1560L66626G4772K45115l494j38906J72569j45034J33145
17414C38167p9276E9123C963a2473C20365Q8815j98733o0477J15377L370o6105
17403B02612m3542K54196O4454H844L35198j50110m9345F1811b5695k9936A84204
17391F2066i1035B81758E0762e3880G5854K40759p9823i4144o8641B13849k0575
17380A93274d8907B63861C4354K242L8902J65477I3801J41284a20386k32335A29252
17368B86780B032K0854M9600J85334n5438o9791J28364b37484R4969A39783F8049
$$ y = [309088, 110441, 9495, 214650, 142765, 104336, 309553, 221748, 336840, 276852, 204867, 342455, -74541, 407552, 418834, 422570, 314036, 394208, 96323, -31741, 158561, 161783, 251921, 496835, 71560, 438186, 74772, 319887, 316393, 177487, 350056, 205022, 338167, 258891, 59123, 3963, -12473, 320365, 409180, 210447, 149970, 265347, 268717, 202612, 159070, 413266, 477720, 8844, 344042, 193932, 144587, 61811, -25695, -55631, 184204, 62066, -91035, 281758, 50762, -53880, 75854, 316613, 236790, -94144, -162785, 213849, 193274, -48907, 263861, 34354, 36596, 75498, 240975, 93801, 235085, -120386, -352721, 129252, 286780, 2032, 22886, 72486, 257820, 202382, 132591, 260955, -237484, -142515, 139783, 68049]
17356B06383N7265F700M4248L07458A42145J6691i1330b0663A71021N8779G0593
17344B37935J77328l8814A10393d6288C52552D6023R5629c2079B1366K77805l285
17333B95886f847j59751B16507O793n6968m5491c9553r2969F585L84257b5143
17321A35804a54447A51128J81680G8139J75756b42957I0911J5485b85564B02113
17310a36999C56517A63171a3144B21649c1384B76495C3828K58223q7101J33172
17300C38122H5053a2835l05476c0843H0548b61129A37010J13309J1691b64386
17289A85162J7688q3902b86353A69594P2954C1616K40899a02582A23992n3270
17279G0722L06572k117D5156K07430I7649N0243a548A70282J15464B3057O4904
$$ y = [206383, 263648, 6700, 50948, 358406, 142145, 158836, -91330, -20663, 171021, 229800, 70593, 237935, 415263, 376449, 110393, -46288, 352552, 46023, 141652, -32079, 21366, 299171, 295886, -6847, -166598, 216507, 223300, 166332, 120841, -39553, -132522, 6585, 390842, -25143, 135804, -154447, 151128, 332808, 78139, 253895, -242957, 90911, 106396, -285564, 202113, -136999, 356517, 163171, -13144, 221649, -31384, 276495, 33828, 292051, 204950, 338122, 85053, -12835, -318311, -30843, 80548, -261129, 137010, 250319, 262010, -264386, 185162, 202850, 118948, -286353, 169594, 242548, 31616, 272515, -102582, 123992, 70722, 377294, 375177, 45156, 252586, 97649, 147892, -1548, 170282, 285746, 23057, 87961]
17268H7961A3390O9499A0463J10929m4494B1689K71077F2751F317a27089B78921
17256A90216H1507K6146D8745J98227q9281P8980p7785L5523l8870i0428A39545
17244B30036c3824A21070K0897R127A2874i582B48223J0692k4562G0756K67000
17233C37756E0479K42035E8920g296E7759J39170K87494H8720L22953A87093J46347
17222C33440j59863L49569k60518A04784O8778B9550J48277H1081K0345K31366
17212C32792A51948K14952A25339L17060A34329A198L60960E2271j4596d4288
17201a02378A30749N2658K85905B09982q5850K16104b01280k0471B1800O13435
17191F35235A06675O5773m2964j4108J2065m3754K11626K0327A45283k6596L75068
$$ y = [87961, 13390, 82889, 10463, 121392, 76898, 21689, 292766, 62751, 6317, -127089, 278921, 190216, 81507, 107653, 48745, 246972, 157691, 236671, 158886, 194409, 155539, -90428, 139545, 230036, -33824, 121070, 141967, 151094, 12874, -9582, 248223, 258915, 234353, 70756, 337756, 50479, 292514, 58920, -7296, 57759, 196929, 484423, 88720, 411673, 187093, 333440, 173577, 523146, 262628, 104784, 173562, 29550, 177827, 81081, 101426, 332792, 151948, 366900, 125339, 442399, 134329, 1198, 362158, 52271, 37675, -44288, -102378, 130749, 183407, 469312, 209982, 124132, 340236, -201280, -221751, 21800, 635235, 106675, 172448, 129484, 115376, 127441, 83687, 295313, 315640, 145283, 118687, 493755]
17180D93755A86430p9644a3464C50467A59189L06709k07571b5317D3364K95503
17170C38867A30836M18280B72706e7817p4736C27144q4029D1645a9186B36600
17159C89520F0820J29313G8287J41757P8889F9121b9977A95106M76092n0904k30612
17148C89682O3775k15852J46005q6983L03902A2280J7809J73497N5283P8866K04201
17137E41936k30644j5025J23836j94414J49450I9848J91629I3259J59356j05976
17127A46639M2831L82664k5895j92631A69099K5982Q1301Q576Q8257j756A42821
17115b9385C02714M1663A47090J35288j07380p6440L15898L7118j89229k4419
17105B37926p8505J24983L4102o6439J79905A50731K61953r5026Q7872j66196
$$ y = [493755, 186430, 106786, -13464, 350467, 159189, 465898, 258327, -25317, 43364, 338867, 130836, 549116, 272706, -57817, -132553, 327144, 243115, 41645, -19186, 236600, 389520, 60820, 190133, 78287, 220044, 298933, 69121, -29977, 195106, 671198, 620294, 389682, 453457, 237605, 383610, 296627, 600529, 12280, 30089, 203586, 258869, 337735, 541936, 311292, 296267, 420103, 225689, 375139, 99848, 291477, 93259, 252615, 146639, 189470, 572134, 546239, 353608, 169099, 195081, 276382, 284958, 373215, 371459, 142821, -29385, 302714, 344377, 147090, 282378, 174998, 98558, 414456, 451574, 262345, 237926, 159421, 284404, 318506, 252067, 431972, 150731, 412684, 317658, 405530, 239334]
17095B39334K64407L69449l82077B44276Q8078p4219J82503l4207j16638L85410
17085F75203B37748j06501D2181K65040K70813j01062A60243K19613n396A36432
17074B91640j33917L62859j24686M7744M458B02207J13910H5081L24140J09177
17064E18398K210K3695q9790A84551M12190o8128k34274K3724r686K8734F9232
17052E87627G5287L59110R5090O3930j87125p6823q560k892j46380L47259j77169
17041C41727K605P8918L19028k49090n6523J44203k61176L96001k99503J91151
17031F07341B66758J66728k3333R9955N9288K22262l42865k5101N4503K59503
17021G37698k22454q1868K51598B84770L11532B91677L71173B75573J38519p8861
$$ y = [239334, 503741, 873190, 491113, 244276, 332354, 258135, 440638, 406431, 289793, 675203, 237748, 131247, 42181, 307221, 578034, 476972, 160243, 379856, 374460, 136432, 291640, 157723, 520582, 395896, 443640, 448098, 202207, 316117, 85081, 409221, 518398, 520608, 544303, 454513, 184551, 596741, 528613, 294339, 318063, 308377, 337111, 69232, 587627, 75287, 434397, 529487, 593417, 406292, 329469, 320909, 318017, 171637, 518896, 341727, 344332, 423250, 742278, 493188, 436665, 580868, 319692, 715693, 416190, 607341, 266758, 433486, 410153, 510108, 569396, 791658, 448793, 423692, 478195, 737698, 515244, 433376, 684974, 284770, 596302, 291677, 662850, 275573, 414092, 335231]
17011C35231K42412P3507k30619J34543p75L7204j07758j03003L30432j6466L7411
17000G32119k45766L07807l11691J64417k59644K39831K42962l85356J51302J2615
16990F48596n6317K28337l11150J5651j141J07295L03565P0245l29951l4610j84459
16979D56061L70413k94407N17268l67956M4478J29626O476J3603m28640K07738
16969F54660l7484K4935J59889j67154k48898K78336m8339M0716K25025D28539
16958G34193J85462l12574K02776M0744k16919j5577l4235P6345L24811j1921
16948I73105l59960M24823l22977j55408M32580r7998p9287k61054L59837M1166
16938I54827j22282K6240k09076M8660K23911k4521D30788N14356J09053k39145
$$ y = [335231, 577643, 651150, 420531, 555074, 554299, 591503, 483745, 380742, 711174, 694708, 732119, 486353, 794160, 482469, 646886, 387242, 627073, 870035, 484679, 635981, 648596, 592279, 820616, 509466, 525117, 523976, 631271, 934836, 1005081, 675130, 640520, 456061, 826474, 532067, 1049335, 681379, 725857, 855483, 861959, 875562, 446922, 654660, 617176, 642111, 802000, 634846, 385948, 664284, 615945, 656661, 881686, 428539, 734193, 919655, 607081, 809857, 850601, 633682, 618105, 583870, 660215, 985026, 973105, 613145, 1037968, 714991, 559583, 992163, 894165, 814878, 553824, 913661, 954827, 832545, 858785, 649709, 698369, 922280, 897759, 430788, 945144, 1054197, 815052]
16928H15052J68518P6238L5071j19357L4204m4406j38601J54332K05958N2093
16918A239102R0434j73320m12611M73299k58523J5291M7771L4674o4672J0854
16908A002299N39716r9705j33476M1018O9939k51884M21835o68021K29268J98941
16898A349930j20750j39212J63378k3862j98762L75996N1922P7153k64335L74557
16888A646015m04264J73898K72093j37615k52134K11040O9722K02607K73562m03539
16878A651385j78505J60708j24164K70676k27321L45943l07517L12174l56935
16869A546444J45671l70195M55749j62787M00249m2061r9422k80865L98228p0164
16859A920847n7216J12272K47424j63371j03183K05627j65115L64522l22915j14147
$$ y = [815052, 983570, 1059808, 1094879, 975522, 1009726, 965320, 826719, 981051, 1187009, 1239102, 1329536, 1156216, 743605, 1216904, 958381, 973672, 1021443, 1056117, 991445, 1002299, 1542015, 1442310, 1308834, 1349852, 1419791, 1167907, 1589742, 921721, 1150989, 1349930, 1229180, 1089968, 1253346, 1229484, 1030722, 1406718, 1458640, 1535793, 1271458, 1646015, 1241751, 1415649, 1687742, 1550127, 1297993, 1509033, 1578755, 1781362, 2054924, 1651385, 1472880, 1633588, 1509424, 1780100, 1552779, 1898722, 1591205, 1903379, 1546444, 1692115, 1321920, 1777669, 1614882, 2015131, 1973070, 1873648, 1592783, 1991011, 1920847, 1863631, 1975903, 2223327, 2059956, 1956773, 2162400, 1997285, 2361807, 2038892, 1924745]
16849A924745K52783l1600K34186j22349J71767J27071L8436K4308J34636l48147
16839B405836L07634j55016P5678J56487J14905r080k01878J4038q6723O39600
16829C261481l2461L03970m72039N4766k16855J04574L14476J04392q8420L94509
16819C728393j34255J62944m9997L11073l97447K14019K29605K2481M31759k50160
16809D268415l5255M74922j55480j73966J98288N21889Q3642m9410K60365j27206
16799E266204j5900p1725L02377p1992N43481j14800p8019O06663m6678J66463
16789F486074K90435Q3711r324M19004J25390J57126J75318Q6752M40285J37358
16779H392129M6228M67731K55527M8579K25472M12736K46777l0469P34190j02371
$$ y = [1924745, 2177528, 2145928, 2380114, 2257765, 2429532, 2556603, 2595039, 2619347, 2753983, 2405836, 2713470, 2558454, 2634132, 2790619, 2905524, 2896444, 2694566, 2708604, 2621881, 3261481, 3229020, 3532990, 3060951, 3115717, 2898862, 3003436, 3317912, 3422304, 3333884, 3728393, 3594138, 3757082, 3707085, 4018158, 3620711, 3834730, 4064335, 4086816, 4518575, 4268415, 4233160, 4708082, 4552602, 4378636, 4576924, 5098813, 5182455, 5133045, 5393410, 5266204, 5250304, 5178579, 5480956, 5408964, 5952445, 5837645, 5759626, 6366289, 6319611, 6486074, 6776509, 6860220, 6850896, 7269900, 7395290, 7552416, 7727734, 7814486, 8254771, 8392129, 8438357, 8906088, 9161615, 9210194, 9435666, 9848402, 10095179, 10064710, 10798900, 10696529]
16769A0696529M58060O01178P9597L77600M02207M75897L28249M25217J38245
16760A3982779O67334O98748K28775J120110J12931J007034R3909J335589O67675
16751A9914884R76801M90294Q13643J268995Q59232J293485R19710J197881J173785
16742B8908710J409478J558966J693335J441687J986216K129200K122059K110594
16734D3360245K150798K741574K821483L277143L182297L612910L936636M319127
16726F9402213M397369M732738N638119N788660O056887O435551O876154P383418
16718A16711109P950656P863351Q728184Q658331Q935519Q676623R061651Q271373
16710A84856797P600365O400665N305959M029296K891921P90480j163618k618142
$$ y = [10696529, 11154589, 11755767, 11835364, 12212964, 12615171, 13091068, 13419317, 13844534, 13982779, 14650113, 15348861, 15577636, 16697746, 16810677, 17817711, 17911620, 19247209, 19914884, 20891685, 21381979, 22195622, 23464617, 24323849, 25617334, 26537044, 27734925, 28908710, 30318188, 31877154, 33570489, 35012176, 36998392, 39127592, 41249651, 43360245, 45511043, 48252617, 51074100, 54351243, 57533540, 61146450, 65083086, 69402213, 73799582, 78532320, 84170439, 89959099, 96015986, 102451537, 109327691, 116711109, 124661765, 132525116, 141253300, 149911631, 158847150, 167523773, 176585424, 184856797, 192457162, 198857827, 204163786, 208193082, 211085003, 211875483, 210711865, 208093723]
16702B08093723l849803n544569p048993p740982q316360r038346q504985r199245
16694A48850440r053355q650888q510825p758084p695137o814053o496326o481478
16686H7390294n827076n090514n272045m044807m734076l790306l575356l242219
16678E1813895l103672k915573k900085k271794k334764j994480j843151j770373
16670C2680003j646398j876449j484866j422644j131738r59532j175213r01735
16662B2081428r18974j064027q66122p10722p45932r33269p93047K420r76647
16653A5075108o38812m88723p29154m28046m66592l52527r9556m71163n00872
16644A0899663j42499m54604n49059j74506m18074k82429P791m61469l64715m0037
$$ y = [208093723, 204243920, 198699351, 191650358, 183909376, 175593016, 166554670, 158049685, 148850440, 139797085, 131146197, 122635372, 114877288, 107182151, 100368098, 93871772, 87390294, 81563218, 76472704, 71200659, 67155852, 62421776, 58631470, 55056114, 51813895, 48710223, 45794650, 42894565, 40622771, 38288007, 36293527, 34450376, 32680003, 31033605, 29157156, 27672290, 26249646, 25117908, 24158376, 22983163, 22081428, 21162454, 20098427, 19232305, 18521583, 17775651, 16842382, 16049335, 16051755, 15075108, 14436296, 13947573, 13218419, 12790373, 12323781, 11971254, 11871698, 11400535, 10899663, 10757164, 10302560, 9753501, 9578995, 9160921, 8878492, 8886283, 8424814, 8060099, 8020062]
16634H020062l11685l66595m446m65136P7852j78301n9861l15422j1473l71168
16624F013827l55461o9453L1693k3959J7713n66676J12916k6799j80877K66247
16614E219171o42276l26827L02147k82104j89421R1800p2906l26429o2001j1763
16604C699391J29584k02645j92036J92369K830k3464j38991N3952n33305K78149
16594C265834P7994m07962J31536j91208j2900J77940j80326J1114k87055J41207
16584B726174R7872l12988o3767L9543M6056J89408m10678K47658m20217p1069
16574B067992j90565N49414m73370J93962N4891J33132l69210K19626l30544P0610
16564A925938K55171k21302j46342k2900k89616L53848k57002K50490l19166j32240
$$ y = [8020062, 7708377, 7341782, 7337336, 6872200, 6950052, 6771751, 6711890, 6396468, 6384995, 6013827, 5658366, 5588913, 5620606, 5596647, 5614360, 5047684, 5160600, 5133801, 4952924, 5219171, 4576895, 4250068, 4552215, 4270111, 4080690, 4172490, 4099584, 3773155, 3711154, 3699391, 3828975, 3626330, 3434294, 3626663, 3629493, 3606029, 3467038, 3520990, 2987685, 3265834, 3343828, 2935866, 3067402, 2876194, 2863294, 3041234, 2860908, 2872022, 2584967, 2726174, 2824046, 2511058, 2447291, 2486834, 2532890, 2722298, 2311620, 2559278, 2139061, 2067992, 1877427, 2426841, 1953471, 2147433, 2202324, 2335456, 1966246, 2185872, 1855328, 1925938, 2181109, 1959807, 1813465, 1790565, 1500949, 1854797, 1597795, 1848285, 1529119, 1396879]
16554A396879K43757j93789n9381L90786r0473k72595N126j24983M64802l85091
16544A375038o2669J54296l24619K58334j23148l5710m60157L14408r4014R6176
16534A097935m0712J70093j39493J18136k1677P0569J87409m08346L24465j74270
16524A184109j18022K15962l66910L9536q4401M92358M8319n06111P8339J16584
16514A099763k64375N9264p4558j08619O3827K44386Q2076l44622J8517O388J59842
16503I41889k40165J41750Q3190k85933n7354L50623k1122l25436K67371k3769
16493H31044o8565l29553L24140k13214P4524C02781L80662j2904L9203k40598
16483D69144M01756B85017L58525J74463k62724L51117n0303l92744K21965o4213
$$ y = [1396879, 1640636, 1446847, 1387466, 1778252, 1687779, 1415184, 1420310, 1295327, 1760129, 1375038, 1312369, 1466665, 1142046, 1400380, 1277232, 1241522, 781365, 1095773, 1001759, 1097935, 1057223, 1227316, 1087823, 1205959, 1184282, 1254851, 1442260, 1033914, 1358379, 1184109, 1066087, 1282049, 915139, 954675, 870274, 1362632, 1410951, 904840, 983179, 1099763, 835388, 894652, 820094, 711475, 775302, 1019688, 1101764, 757142, 775659, 782047, 941889, 701724, 843474, 926664, 640731, 583377, 934000, 912878, 587442, 854813, 831044, 762479, 432926, 757066, 543852, 618376, 302781, 683443, 670539, 709742, 469144, 870900, 285017, 643542, 818005, 555281, 906398, 856095, 463351, 685316, 621103]
16473F21103l7968o5964J99890j01186q5205m2621k05125K76399j94407J99427
16463E64343j38045Q246L22396k99868j56633j971J99836n1410K00152l15617
16453C31429N0998N9883A45235J37325I7176L50565M8495k19214J93853j10751
16443C60124L8460j42152K49533k45963K01619q4744n344j41808P0133r2518L52559
16432E59899j11861P0089k54367P5497j238k388O7444J80821k76915K8142q5510
16421B49613M17961C16829J13654A29227B5776b9691C77410j00427n3497J21943
16411C45429A02257K32917j02094K61055l4316r4373K1947A25840K19260A41516
16400A42197J38987j16315P905P0942Q6199J25512j95443m6290R6838j03416K41304
$$ y = [621103, 583135, 517171, 717061, 615875, 530670, 488049, 282924, 559323, 364916, 564343, 426298, 434544, 756940, 457072, 300439, 298468, 498304, 446894, 647046, 331429, 382427, 442310, 145235, 282560, 97176, 447741, 496236, 277022, 470875, 360124, 398584, 256432, 505965, 260002, 461621, 376877, 371533, 229725, 299858, 207340, 559899, 448038, 518127, 263760, 339257, 338019, 335631, 403075, 583896, 306981, 335123, 249613, 667574, 316829, 430483, 129227, 25776, -29691, 377410, 276983, 223486, 345429, 102257, 335174, 233080, 494135, 459819, 365446, 387393, 125840, 345100, 141516, 142197, 281184, 164869, 172774, 243716, 329915, 455427, 259984, 213694, 310532, 207116, 448420]
16389D48420A84671J94761k4664C5138J9898L02175q6815K8653J77093k33904
16379B42238q8131Q9059a16632B49032n5292E4845J40799J64010A51260o1150
16369I0110J25534J16091j43282p9921Q3986J8720J59026G181J40269J14496J71906
16358D33852B00891E4166H154a50197A36709a16545B03908a58479A86644L31795
16348E18439A94438J49439j45194k3939b71991C52000D6844a85634D06058D3177
16337a05439B46667Q1160a00887A47333O2605R6973A16671J50083q502q2997D255
16325a21629B99006r3853L37602B16194k8071J60576A37483m850o3995M1899M13486
16314E24023k20845a05275B87870o7833d329D9178M6630R5709A4487K939K20160
$$ y = [448420, 184671, 379432, 354768, 35138, 55036, 357211, 270396, 299049, 476142, 242238, 154107, 243166, -116632, 249032, 193740, 54845, 195644, 359654, 151260, 90110, 215644, 331735, 188453, 108532, 192518, 211238, 370264, 7181, 147450, 261946, 433852, 200891, 54166, 8154, -150197, 136709, -116545, 203908, -158479, 186644, 518439, 194438, 343877, 198683, 174744, -271991, 352000, 46844, -185634, 406058, 43177, -105439, 246667, 327827, -100887, 147333, 209938, 306911, 116671, 266754, 258252, 175255, 4255, -121629, 299006, 205153, 542755, 216194, 188123, 348699, 137483, 132633, 68638, 110537, 524023, 303178, -105275, 287870, 220037, -4329, 49178, 95808, 191517, 14487, 17426, 237586]
16303B37586a1515l647E59877j48021A88671a54417L4002B88336l6723i5222H1335
16291b9614A30404E509Q5920k2159Q1249B6558O3339J73134q5299P8187p0346
16280A85573D2856A3928b27k18295A30704M2522j7158d1008B28358D5330j016
16269D4314L78827c93374a71595A97585F5688Q7054n3451M3897b45813M1688K2059
16258a82066A56364b37415R3926A61326A2525a33011B50739B8238N5830L67226
16248D51294q3495a58678J3937G0528c03209A4048L1130K28733a29600A55503
16237A78881d2037D8901P6333R7509a30796M4459B58072G5176K761J00476J5363
16226A93776N9908G4527l073P8268k0328L8464o616a62931F4219J7949P0244a81844
$$ y = [237586, -11515, -15162, 559877, 411856, 188671, -154417, -120415, 288336, 251613, -95222, 81335, -29614, 130404, 5509, 91429, 69270, 150519, 26558, 89897, 263031, 177732, 255919, 185573, 42856, 13928, -227, -218522, 130704, 173226, 156068, -41008, 228358, 45330, 44314, 423141, -393374, -171595, 197585, 65688, 152742, 99291, 143188, -245813, -204125, -182066, 156364, -237415, -143489, 161326, 12525, -133011, 250739, 28238, 84068, 451294, 367799, -158678, -144741, 70528, -303209, 14048, 45178, 273911, -129600, 155503, 178881, -42037, 48901, 125234, 222743, -130796, -86337, 258072, 75176, 77937, 178413, 193776, 253684, 74527, 71454, 149722, 129394, 167858, 161242, -162931, 64219, 82168, 152412, -181844]
16213A89973a46739J1642I0842a37372j218A54778G0188c14390I2948C6047b25416
16201E7078a40732I8984b3907A24076j3047a95230K0780C4685a0505G5186h679
16189H8588c8692j06298j14707a08559j23250f4429j68637a2654k22129J04794
16179a29989B37476b7190G2248J90106A18356R0754A02827J58586d7790j16626
16169a64416B4511d45393E8781Q8713J38881c0325k4504j7163j29891B4212h820
16157B48025B1563d0079B01020C3656p530L19153A24569J46795J7963G5489a96172
16145a69969B00513q1535m1235b32000B25432A0521d590J212A80577a7877A62303
16133a75328k38065e3943I3874f3582q0450A9289P5867K20009A48644k7396H019
$$ y = [189973, -146739, -135097, 90842, -137372, -138590, 154778, 70188, -314390, 92948, 36047, -225416, 57078, -140732, 98984, -23907, 124076, 111029, -195230, -174450, 34685, -10505, 75186, -8679, 88588, -38692, -144990, -259697, -108559, -231809, -64429, -233066, -12654, -234783, -129989, 237476, -27190, 72248, 262354, 118356, 209110, 102827, 261413, -47790, -164416, 24511, -445393, 58781, 147494, 286375, -30325, -54829, -71992, -201883, 24212, -8820, 248025, 21563, -40079, 201020, 33656, 26126, 345279, 124569, 271364, 289327, 75489, -196172, -169969, 200513, 118978, 77743, -232000, 225432, 10521, -4590, -3378, 180577, -17877, 162303, -175328, -413393, -53943, 93874, -63582, -144032, 19289, 95156, 315165, 148644, 121248, 8019]
16121A74800a07576J5101B40650f2420j9133j70488A69613E3916a68853e0921
16110C5856a58271A76527E6633K96619D535K47287a26786B21687a21145H9674
16099B37307A07127o331D5957b53676H9048b84465e1369F1252J43526c14823G3715
16087i6052k344A18102i299j02375A39698a05160b7233j08813d5391G5673g8147
16075c5129B87544j35743a56032e3364j26909A22697B9700d49302a42005A8455
16064g9342F4805K09227F6615J82233c03242j9389f3571k65879O6200L1658J2763
16053b18829E5218a70218o6384P6773j24343A21927h1146L5608N947A12553a65745
16041C14788H5581c70431A45115e3659A76395d1156q999B12556M087d28388B09561
$$ y = [174800, -107576, -92475, 240650, -62420, -81553, -252041, 169613, 53916, -168853, -50921, 35856, -158271, 176527, 56633, 353252, 4535, 251822, -126786, 221687, -121145, 89674, 237307, 107127, 100796, 45957, -253676, 89048, -284465, -51369, 61252, 204778, -314823, 73715, -96052, -98396, 118102, -9299, -111674, 139698, -105160, -27233, -136046, -45391, 75673, -78147, -35129, 287544, 151801, -156032, -53364, -180273, 122697, 29700, -449302, -142005, 18455, -79342, 64805, 274032, 66615, 248848, -303242, -322631, -63571, -329450, -263250, -231592, -218829, 55218, -170218, -236602, -159829, -284172, 121927, -81146, -45538, -39591, 112553, -165745, 314788, 85581, -370431, 145115, -53659, 176395, -41156, -50155, 212556, 216643, -428388, 209561]
16029a80405P174A65079d3423n07151A94511e9257m1867c8171A17369c35428F1003
16017a03641C38211a16207c0966r2990N3658D0391e15873g2661D7753b727G6619
16005A02883e8769n8668n022A03447N2008C9483a13394j20046Q1667b5381m0622
15994f6003l78568a04573C0367d6872H6454g0327F2780A6721J1585O5821K39947
15983C34074g6753j0128C3111e3332j83287A48890a52970H6665f9590k4904k38610
15972c33104B04026c80418f6091B8199K00184j13462R9302K8277o8970Q5255a84648
15960A00177f1778n8717C7888A8341a68671d8409m97618E6574J6565e2262k74103
15949c26365c8218A13910J41798m8623p7540b177k4107k71242C7054b69000a9837
$$ y = [-180405, -173231, 165079, -43423, -550574, 194511, -59257, -101124, -38171, 117369, -335428, 61003, -103641, 338211, -116207, -30966, -123956, -70298, 40391, -515873, -72661, 47753, -2727, 76619, 102883, -58769, -117437, -122459, 103447, 155455, 39483, -113394, -233440, -151773, -25381, -66003, -444571, -104573, 30367, -46872, 86454, -70327, 62780, 16721, 28306, 94127, 334074, -76753, -86881, 33111, -53332, -236619, 148890, -152970, 86665, -69590, -94494, -333104, 204026, -380418, -66091, 28199, 228383, 114921, 214223, 242500, 173530, 258785, -184648, 100177, -61778, -120495, 37888, 18341, -168671, -48409, -546027, 56574, 73139, -52262, -326365, -38218, 113910, 255708, 207085, 129545, -2177, -26284, -297526, 37054, -269000, -19837]
15937D31928j78142a53011o7532P9878b8073j9327j05281b4514q0736Q981H0842
15925h315B13265a08472n8297A06340c07010a28760e9447k41800o2337D9604Q7279
15914A36883a16558A01758C856g3897k1219B03603O2345i8884A37204E856J14892
15903A20748h5941B72532a33283r7582L1801Q7521B28482d9382E4505d77022f7447
15891a63517l0959c4078A17757b81684A12721b71375E5223j3579f1667G8237c00661
15879a38176A9192R1476b34655g5447B14583I6148g358k54747k25571H3287g9107
15867B16324b6678j2540A05282a33027D05974d9866B29020G3804a39590C56439
15856i9048F4430b63621R6292P5010k25020A0284f4193p8702b824A37884e62667
$$ y = [431928, 253786, -153011, -220543, -140665, -28073, -47400, -152681, -24514, -105250, -96269, 80842, -8315, 213265, -108472, -166769, 106340, -307010, -128760, -59447, -301247, -363584, 49604, 136883, -116558, 101758, 3856, -73897, -95116, 203603, 265948, -98884, 137204, 5856, 120748, -85941, 272532, -133283, -230865, -199064, -111543, 228482, -49382, 54505, -477022, -67447, -163517, -194476, -34078, 117757, -281684, 112721, -271375, 55223, 41644, -61667, 78237, -300661, -138176, 19192, 110668, -234655, -75447, 214583, 96148, -7358, -262105, -487676, 83287, -79107, 216324, -26678, -39218, 105282, -133027, 405974, -49866, 229020, 73804, -139590, 356439, -99048, 64430, -263621, -167329, -92319, -317339, 10284, -64193, -142895, -2824, 137884, -562667]
15844a76602Q2029B24704b6992B24708J14950e5352j52597M6859f5678j8835B92511
15832C9976c76659G9882b451k9628C34983c2448j48896m6919I3742a3778D42513
15820g9B34287G4534a98659H8490a12226d1145j17503m6229A34972a60862g8667
15808a77799A4529a76254A2079f387q9482d7379k16034L8554G8970L27f4517m5143
15796a09660H0001J41471I4202a87603B39386a49326O9157q1529j09038J11001
15786a59735P165A8109c38559g5141j82639A56222c16632f5454p3043K3266r5570
15775b10801A63333F6448b2148r3475o2504B73546c00074n1105B44502A12751
15764G4832a19431A48690d66718a78104k9524k31039a06704a7758k39511A71197
$$ y = [-176602, -94573, 224704, -26992, 224708, 339658, -55352, -207949, -161090, -65678, -84513, 292511, 39976, -376659, 79882, -2451, -32079, 334983, -32448, -181344, -228263, 93742, -13778, 442513, -79, 234287, 74534, -198659, 88490, -112226, -41145, -158648, -204877, 134972, -160862, -78667, -177799, 14529, -176254, 12079, -6387, -95869, -47379, -263413, -224859, 78970, 79297, -64517, -109660, 80001, 221472, 94202, -187603, 239386, -149326, -80169, -161698, -270736, -159735, -152570, 18109, -338559, -75141, -257780, 156222, -316632, -65454, -138497, -115231, -210801, 163333, 66448, -22148, -115623, -178127, 273546, -300074, -351179, 244502, 112751, 74832, -119431, 148690, -466718, -178104, -207628, -438667, -106704, -17758, -257269, 171197]
15753d7464E603b00362E3961A6560b11997Q8103E8391m007k2267g5568B41877
15741B00150e4200q1390F632a03859p3850h8222b9643k94013B02842r1818J6427
15730A27451K08096A20329b7983k05802m1523A02752B7344L399N8954k5194c5588
15718A33851k8628a76966M8544j02373A067M3922b04056A48681E4976a42238j18800
15707b61038B74062a53147j72270P2325i8196A33171a90134A05028j8657e9071
15696A09434a77986g6655B7137K2908d00889a39886B11393O6820a12541A86206
15685b00628k24838A10542c22338A17141L3372N4537a92128A2764K7673a58886
15674a67150F4451N6867G966a1303A55879I675K23651a9670q5827B0507K35461
$$ y = [-47464, 5603, -200362, 53961, 16560, -211997, -123894, 58391, 54384, 32117, -75568, 241877, 200150, -54200, -135590, 6632, -103859, -177709, -88222, -29643, -323656, 202842, 111024, 127451, 335547, 120329, -27983, -233785, -275308, 102752, 27344, 30743, 89697, 64503, -35588, 133851, 105223, -176966, -128422, -230795, 1067, 44989, -204056, 148681, 54976, -142238, -261038, 274062, -153147, -325417, -253092, -98196, 133171, -190134, 105028, 86371, -59071, 109434, -177986, -76655, 27137, 50045, -400889, -139886, 211393, 278213, -112541, 186206, -200628, -425466, 110542, -322338, 117141, 150513, 205050, -192128, 12764, 40437, -158886, -167150, 64451, 121318, 7966, -11303, 155879, 9675, 233326, -19670, -105497, 20507, 255968]
15663B55968a8662A06445K76900I7673B5040a4183B1832J83438H7462b26441l4222
15652b60663D5325b39556J06631q5266b8825A22754b39827G376h2309B4754a05198
15640a41414p464a0161k76181a14357A19122c21634h0435I6912a62524L058D23142
15628B12800b05386j98280F0228Q7478h0310H2660e2738o1765B57263a91705k20613
15617d12318B63123i9187A13693O746a28815A76692G1087J27422J61140q5930
15607B73719n7922N94a29801E8656P1294b31603B31733b2214F6232L7719A4730
15595b0708A17352k7088a95305f680A11788b96747A90748E3531c03788E1407b63221
15583B0908M41330a18327a8252A7351a77350d1083C4718a58075f6843j00651C54940
$$ y = [255968, -18662, 106445, 383345, 97673, 25040, -14183, 21832, 205270, 87462, -226441, -260663, 45325, -239556, -132925, -218191, -28825, 122754, -239827, 7376, -82309, 24754, -105198, -141414, -148878, -10161, -286342, -114357, 119122, -321634, -80435, 96912, -162524, -159466, 423142, 212800, -205386, -403666, 60228, 147706, -80310, 82660, -52738, -114503, 257263, -191705, -412318, 263123, -99187, 113693, 120439, -128815, 176692, 71087, 198509, 359649, 273719, 215797, 216391, -129801, 58656, 129950, -231603, 231733, -22214, 66232, 103951, 14730, -20708, 117352, 90264, -195305, -6680, 111788, -296747, 190748, 53531, -303788, 51407, -263221, 20908, 462238, -118327, -18252, 17351, -177350, -41083, 34718, -158075, -66843, -167494, 354940]
15571a07487G6664r665J52193g9052H6716b19241h9406k24766a03913o7704h3943
15559A61758M7232C9276a13112A29666b3805q4357C7793J14395g7865C2145i9660
15547a95728A494L17103A9674d2518A26360m1068c18618c1794r8353j89652A9466
15535A65581a4282j16915d2362q1044N9940a1826C13982c7591j1632K2241m9594
15524g6576j28164A47313b13231C44975c20825h8010m1208A38502J10798k2885
15514B26415d2256I7411g5908A38919A3615J64867E9446L94968D22J80470a82264
15502A0263J70088a70484g412j59495q8231h3888B09267k9888c66347B21122a31999
15490I2770d9276A08260h3467n1329A36887a96320D9389a52815L8504B76325E8570
$$ y = [-107487, 76664, 66999, 219192, -79052, 86716, -219241, -89406, -314172, -103913, -171617, -83943, 161758, 208990, 39276, -113112, 129666, -23805, -108162, 37793, 152188, -77865, 32145, -99660, -195728, 1494, 318597, 19674, -42518, 126360, 85292, -318618, -31794, -130147, -319799, 19466, 165581, -14282, -131197, -42362, -123406, -63466, -11826, 313982, -37591, -49223, -26982, -76576, -204740, 147313, -213231, 344975, -320825, -88010, -129218, 138502, 249300, 226415, -42256, 97411, -75908, 138919, 13615, 178482, 59446, 454414, 422, 180892, -182264, 10263, 180351, -170484, -7412, -166907, -255138, -83888, 209267, 179379, -366347, 221122, -131999, 92770, -49276, 108260, -83467, -134796, 136887, -196320, 49389, -152815, -114311, 276325, 58570]
15478a07095I0881a00508L640A47677o5065J73312c3821A8701c2447A7439a5720
15466A39432i3905l97753A26068l8315b33769B2522J09803Q3441j04089a34891
15455A73359a06776l4183C7752J23013b45283a7744j22290B04787a09928k50284
15445c60212J77751J9867O1329A45598a42087k42570C71608A3383N2669a12614
15434f6116A28847a76879j19771K4526E3274N5573m7248a95191a1885A29511b8262
15422h1142E3084a04455F5884b37562B6291d4336G4531a62862P2008C7000i4401
15410D916N1846j2497J9700b86009o3861F5517i9622G1127e6486A17243i5183
15398a4845A18615m8507b07075B36415A6452L0359a51619C29575C6646K36878
$$ y = [-107095, 90881, -100508, -96868, 147677, 82612, 255924, -33821, 18701, -32447, 17439, -15720, 139432, -93905, -491658, 126068, 87753, -233769, 22522, 132325, 215766, 111677, -134891, 173359, -106776, -140959, 37752, 160765, -245283, -17744, -140034, 204787, -109928, -360212, -182461, -162594, -101265, 145598, -142087, -384657, 371608, 13383, 66052, -112614, -66116, 128847, -176879, -296650, -272124, 53274, 108847, 61599, -195191, -11885, 129511, -28262, -81142, 53084, -104455, 65884, -237562, 26291, -44336, 74531, -162862, -90854, 37000, -94401, 4916, 56762, 44265, 63965, -286009, -349870, 65517, -99622, 71127, -56486, 117243, -95183, -14845, 118615, 70108, -207075, 236415, 16452, 46811, -151619, 329575, 36646, 273524]
15388B73524I916M4251K2912C6607a49583G3157b3730A18437J6374a19524H3847
15376a20477n6977I3990k7900d81245a88325D29975j29320b7872l3427l32618
15366c93917A80216b34150A61421O8282C6959d6359B1567c82848a37414A17706
15355b41265G4130r010a95954L8754K2081j11023C1315a30287l879B05974c34483
15343F3173c31853a15119D61147a31767B6461b34309C7778a63855A15052p470
15333A07582C5819Q320N3893J16378p717J5823b00601G3886a11054J1661M2151
15322e7242C58819i6238A65774n2276L974k5972k5698d1292A05813f1466e816
15310B60585N790J55862i5113K7552j48129C6549M07083j80528p1300Q3105b23726
$$ y = [273524, 9916, 54167, 77079, 36607, -149583, 73157, -23730, 118437, 134811, -119524, 83847, -120477, -177454, 93990, 66090, -481245, -188325, 429975, 300655, -27872, -61299, -393917, 180216, -234150, 161421, 229703, 36959, -46359, 21567, -382848, -137414, 117706, -241265, 74130, 65120, -195954, -157200, -135119, -246142, 31315, -130287, -134166, 205974, -334483, 63173, -331853, -115119, 461147, -131767, 26461, -234309, 37778, -163855, 115052, 107582, 35819, 44139, 98032, 214410, 206693, 222516, -200601, 73886, -111054, -99393, -57242, 358819, -96238, 165774, 113498, 117472, 91500, 65802, -41292, 105813, -61466, -5816, 260585, 266375, 422237, -95113, -67561, -215690, 36549, 443632, 263104, 191804, 274909, -223726]
15298d758j76871k6014Q3406j3820A49605E3488a21573C7467r731h2050A39864
15286E36296i4045b2819D14347a4504B09835L6930C4240J19619j6884J25172g1442
15274A89876a53984C81085c50980i818A8415c7002B23285c7201B72104r9475P2640
15263B45269e4163j4132J0480B34160i1332k33685B50289F8882R0304d22186B71902
15251E13009E2230a67378A63851e1998B35638E7739K34456A34325Q6152c63913
15240b80788A29937n5149K20193e590F15482j71786N44813n5453J0470J60929
15230A104455m69065L3154B9485J75447M8266A23598M0699C762M3723N1750b499
15218d278l7675C7738R6401O165O6677i9923B25370J04975I8008Q0499a44435
$$ y = [-4758, -181629, -207643, -124237, -138057, 149605, 53488, -121573, 37467, 27736, -82050, 139864, 536296, -94045, -22819, 414347, -14504, 209835, 246765, 34240, 153859, 136975, 262147, -71442, 189876, -153984, 381085, -350980, -9818, 18415, -37002, 223285, -37201, 272104, 172629, 245269, -54163, -68295, -57815, 234160, -91332, -325017, 250289, 68882, 159186, -422186, 271902, 513009, 52230, -167378, 163851, -51998, 235638, 57739, 292195, 134325, 220477, -363913, -280788, 129937, 74788, 294981, -5590, 615482, 443696, 988509, 933056, 943526, 1104455, 635390, 668544, 29485, 204932, 253198, 123598, 164297, 3762, 47485, 99235, -2499, -4278, -41953, 37738, 134139, 140304, 206981, -99923, 225370, 330345, 98008, 178507, -144435]
15206b15974d9025K057F7558e4750A42710K63184c22584f7822B901a19740k9054
15195a48794d7202I2381K79904r7906e9031B7344a28430j257A50750G2807J78564
15184B51371E6596d7038F5978P2581F1771h3533B61528a07202A7220d2137A1609
15172b8295A48277K9477P9716e118j46959P2233F1953M0111C0295f897B76613
15160c0048r3088n5599C49653m4570j32523C6870J04631J09469a00332B08563
15149A62980a38A72953n3927K6867m9031c7159C89282g166j2953j82296F7226
15137A98930H0414f4670C15113A2659J16967c7860A60092a91072A12867a36390
15126a03772o6529K6370A77691K912j0031J49727i674A0154b61797J15337J6250
$$ y = [-215974, -49025, -46968, 67558, -54750, 142710, 405894, -322584, -67822, 2901, -119740, -148794, -47202, 92381, 372285, 274379, -59031, 27344, -128430, -129687, 150750, 72807, 251371, 56596, -47038, 65978, 138559, 61771, -83533, 261528, -107202, 17220, -42137, 11609, -28295, 148277, 177754, 257470, -5118, -152077, -79844, 61953, 102064, 30295, -6897, 276613, -30048, -123136, -178735, 349653, 305083, 172560, 36870, 141501, 250970, -100332, 208563, 162980, -138, 172953, 119026, 145893, 96862, -37159, 389282, -7166, -20119, -202415, 67226, 198930, 80414, -64670, 315113, 12659, 129626, -37860, 160092, -191072, 112867, -136390, -103772, -170301, -143931, 177691, 180603, 170572, 320299, -9674, 10154, -261797, -146460, -130210]
15115a30210R95K4506A18851k2415K08354C9368K10618p6013a8464B32170j09508
15104A22662i1625C19754r1649a2370D46783H5188C645N5661J60121i5440E9083
15092F0580J53037a74865d5625G7411J35800n7315O8070n5930Q7644l8502A6074
15080B89488E3618K1287K36342i2328C71120j06699A14658K43973A28649C5419
15069A39149C4304J61316E6561h9836c6837G9193m399d3239B66785A21524L73162
15058D94686F1030N68460B79842K9683j08186H7218O3583m5950J66789o9356O88
15047B02972e4210A44189D2947L8950K66166q0779F8734P8000r098M5780L64365
15036E47781k19341J17367H4955P7798K22612b7451e991A91079H8609K21882j1695
$$ y = [-130210, -129215, -104709, 118851, 96436, 304790, 39368, 249986, 173973, -18464, 232170, 122662, -91625, 319754, 228105, -12370, 446783, 85188, 3645, 59306, 219427, -95440, 59083, 60580, 213617, -174865, -45625, 77411, 213211, 155896, 223966, 168036, 255680, 217178, 16074, 289488, 53618, 74905, 311247, -92328, 371120, 264421, 114658, 358631, 128649, 35419, 139149, 34304, 195620, 56561, -89836, -36837, 79193, 74794, -43239, 266785, 121524, 494686, 61030, 629490, 279842, 309525, 201339, 87218, 150801, 104851, 271640, 202284, 202972, -54210, 144189, 42947, 81897, 348063, 267284, 68734, 146734, 137636, 183416, 547781, 328440, 445807, 84955, 162753, 385365, -27451, -5991, 191079, 88609, 310491, 298796]
15025B98796J82811H0121J70591h4538A73960J38873j52277J22998Q4073j03267
15015B64360k2543e822B12852K0415M9694a18256B26097j5208F8211c9341j72598
15004b11939B30924Q1609L5382A17774R7625f925l1026B56548a25462B09691p1794
14993A37897b1070D08997A01728h0543H7032K38894e8384j61383A21379J05702
14983B27081A13503c3007B70421C6066b0160B61663L3652k5665A29023J92867
14973C21890r029i7048C34872J26781j48467j10853J16960A51096n6222r885K09616
14962B94605q5672p2390L4398K37493A90190l2900J27724K4145A08114L06610
14952D14724j97762M04206G7586K01534j5580l4713J02235P1937i7498B2010K19047
$$ y = [298796, 481607, 80121, 250712, -84538, 173960, 312833, 160556, 283554, 367627, 264360, 241817, -5822, 212852, 233267, 282961, -118256, 226097, 210889, 68211, -39341, -211939, 230924, 312533, 347915, 117774, 215399, -6925, -37951, 256548, -125462, 209691, 137897, -21070, 408997, 101728, -80543, 87032, 325926, -58384, -219767, 121379, 227081, 113503, -33007, 270421, 36066, -20160, 261663, 295315, 269650, 129023, 321890, 312861, -97048, 334872, 461653, 313186, 202333, 319293, 151096, 94874, 84989, 294605, 208933, 136543, 170941, 408434, 190190, 157290, 285014, 309159, 108114, 414724, 216962, 621168, 77586, 279120, 263540, 228827, 331062, 402999, -97498, 22010, 241057]
14941B41057p2232J24776m3543r9539J44910L8348C8096K92469K62202B90973
14930C51671J52949k6102a12432D34369A51155L10647j32174A20775L15849n6000
14920C80624K875j61348J90145j42280J25137L51512B35184K27878j63549K28080
14910E27593O1840B20943k2037J76264j04000J5004L6128p2137k2217J05353q1624
14899B51677Q2013L29405A77526M1855K86430A15934N10785j68200M9695D297
14888D9422K03002o3749L04712j90619k5600l1550j09767J48289N9603Q5464j57965
14877B71242R7967K6816q2646G7321L1758O1336L77741A80069M04441o2875j95826
14866C25809H7589M45817A39261f071C5765J86137J46194L974J06252j60165E7984
$$ y = [241057, 168825, 293601, 250058, 150519, 295429, 333777, 38096, 330565, 592767, 290973, 351671, 504620, 478518, -112432, 434369, 151155, 461802, 329628, 120775, 436624, 380624, 383499, 222151, 412296, 270016, 395153, 746665, 235184, 463062, 299513, 527593, 589433, 220943, 198906, 375170, 271170, 286174, 322302, 250165, 227948, 333301, 251677, 333690, 663095, 177526, 219381, 505811, 115934, 626719, 458519, 508214, 4297, 49422, 252424, 188675, 493387, 302768, 277168, 245618, 135851, 284140, 343743, 429207, 271242, 369209, 396025, 313379, 77321, 109079, 170415, 548156, 180069, 584510, 521635, 325809, 87589, 533406, 139261, -6071, 35765, 221902, 368096, 372070, 478322, 318157, 57984]
14854C87891G6757L29813A79580J84172A71803J43017K28021k08375D6858L46335
14844C93193m333j90036p6218J67269K74921j49635o294A73156O71870D00181
14833I4110L50454A60325K23504j17900K89625B15880j9020D4011N35804J5985
14823E95800B47795K64076k32693P060L05057J09176m4748A62305Q2209K15597
14813D60111J02558B45906J66389N3161j08411M5957m6185J95564j28963K86989
14803G10407k14959j76855K18347k35272K94914B41865M92370l33973J92688j88769
14793D04181J62985J6515j68862K75985R4520B88800L94352k38999A70317J39264
14783C09581L33380k33283K877k6404o0003O2679L3905I8029M95060k3008j28540
$$ y = [387891, 76757, 406570, 179580, 363752, 171803, 314820, 542841, 334466, 46858, 393193, 388860, 198824, 122606, 289875, 564796, 415161, 408867, 173156, 845026, 400181, 94110, 444564, 160325, 383829, 265929, 555554, 215880, 196860, 44011, 579815, 595800, 247795, 511871, 279178, 286238, 591295, 700471, 655723, 162305, 244514, 460111, 562669, 245906, 412295, 465456, 357045, 403002, 356817, 552381, 423418, 710407, 495448, 318593, 536940, 301668, 596582, 241865, 734235, 400262, 592950, 404181, 567166, 583681, 414819, 690804, 785324, 288800, 683152, 444153, 170317, 309581, 642961, 409678, 412555, 386151, 326148, 388827, 422732, 98029, 593089, 570081, 441541]
14772D41541K32400o5742B91801L74572j13635j29511M09934j26942j23944J2565
14762E94840j64006L20984O8490m02949J20983K8660j01897J11070M6136j44248
14752D78063j41988L42892j63153j92051K61894o9169j28508M19213o1712q9713
14742F55768K6181o6143l8621k22945M48777K395j08904L13749m46043L3036K14407
14731H11657r3651j78464j18935L87309q6471k26384L16091l71726J07820R9122
14721F46368R8608j92013K69403j63996P562O2633k09881n4944n4959M52312j53759
14710G07334K71606l40530C01765K71402M73330l9671j65717n8463L03897m04954
14700F81589J20376q896J65710D73404K08962M20057j65762o3908k08536j8433
$$ y = [441541, 673941, 608199, 291801, 666373, 552738, 423227, 833161, 706219, 582275, 594840, 430834, 751818, 820308, 417359, 538342, 567002, 465105, 576175, 622311, 478063, 336075, 678967, 515814, 323763, 585657, 516488, 387980, 807193, 745481, 655768, 681949, 615806, 577185, 354240, 803017, 805412, 696508, 1010257, 564214, 597250, 811657, 718006, 539542, 420607, 807916, 721445, 495061, 811152, 439426, 547246, 646368, 744976, 552963, 822366, 658370, 665932, 728565, 518684, 463740, 408781, 861093, 707334, 978940, 638410, 301765, 573167, 1046497, 1006826, 841109, 782646, 1086543, 681589, 801965, 793069, 958779, 473404, 682366, 1102423, 936661, 872753, 664217, 645784]
14690F45784L26570j66525R2346k14838J72537J3766K75753m49647J89237j01072
14680G83911L07115k55222p0720J04310N6751k54416R0364J19267J67291K9747
14670A078398j8336j87654J4847K40745m07236J92494L8590n9057P895M8157l6810
14659I12033m5447J04205J4998l04894K56121r9876J16817J47191j9260K543K25362
14648A309793l08739j8119J58845k54810J70956K95275k24753j34765J33773o6211
14638A061245J74721j99884l5937K39017k11245J7348r2971j65855K4717N68637
14628A379793j35357j4480L92358m49189Q4217l06740L47458Q3484n08112J21820
14618I95252J09824K1198K2228J87542K2321l34357K26132K09725j39238O1791
$$ y = [645784, 972354, 805829, 898175, 683337, 855874, 869640, 1145393, 695746, 884983, 783911, 1091026, 835804, 765084, 869394, 926145, 671729, 762093, 881360, 1048651, 1078398, 1060062, 872408, 887255, 1128000, 720764, 913258, 951848, 892791, 900686, 948843, 912033, 866586, 970791, 985789, 680895, 937016, 837140, 953957, 1101148, 1081888, 1084431, 1309793, 1001054, 982935, 1141780, 886970, 1057926, 1353201, 1128448, 993683, 1127456, 1061245, 1235966, 1036082, 1000145, 1239162, 1027917, 1045265, 952294, 786439, 811156, 1379793, 1244436, 1229956, 1622314, 1173125, 1257342, 950602, 1298060, 1381544, 873432, 995252, 1105076, 1126274, 1148502, 1336044, 1358365, 1024008, 1250140, 1459865, 1320627, 1382418]
14608A382418L64297o05086K40264j48809K6700k74314M08201N05j37362J39395
14598A396209M6178l6333k177q0118K62008j11294m9481J29926P2621j25535o8211
14587A433793l99067j40996P38653L8453Q1666k39679r6971J84366n6893K9836
14577A573161l9181k5833L76007k49374k8246j7556j75914O63886k99348P1802
14567A849404j09966J41962p7459J64852l79423M11792o5066J44498o6765k17188
14557A796641O15677l20852k80916K61429J83399o0270M44417k27108l41893K78649
14547B349173J03104K33526j4912L5529L16614J91087L28879l52440N25571M00004
14537D116135O85071R32747J308420K327830M033555P372471R935809k500386
$$ y = [1382418, 1746715, 1141629, 1381893, 1233084, 1259784, 985470, 1393671, 1394176, 1256814, 1396209, 1442387, 1406054, 1403877, 1323759, 1585767, 1474473, 1424992, 1554918, 1627539, 1502004, 1433793, 1034726, 893730, 1632383, 1670836, 1752502, 1512823, 1415852, 1600218, 1543325, 1573161, 1533980, 1508147, 1884154, 1634780, 1606534, 1588978, 1413064, 2076950, 1777602, 1849404, 1739438, 1881400, 1803941, 1968793, 1589370, 2001162, 1936096, 2080594, 2013829, 1796641, 2412318, 2091466, 1810550, 2071979, 2255378, 2195108, 2639525, 2412417, 2070524, 2349173, 2452277, 2685803, 2670891, 2706420, 3023034, 3214121, 3543000, 3190560, 3716131, 4116135, 4801206, 5733953, 7042373, 9370203, 13403758, 20776229, 30712038, 28211652]
14529B8211652r340713p153823m549323k081580j039425r87123p1037J7435p18872
14520B287191P3877R9854k68818j30939L73351n283j57286k9210j21019J99478
14510B321196l8855k41737J0848K77774M1835k65680M41298k01513J44659k3275
14500B466550O1168o0501M02790m44523n5556K24338R5360J37161n14719L48720
14490B660788K08939m53111N77915n657j32358J28274j43715r4021K26124K09863
14480C183041m34838J3061J9656K63503j73393M7643L94723j0016J84264k47308
14470C240336N0068K3139L79987K44496l07744J42932K30677m79885J57829p9521
14460C602314k08022N26745Q1394j4857L93243k99388k8660L37527J00578l74509
$$ y = [28211652, 18870939, 11717116, 7167793, 5086213, 4046788, 3059665, 2988628, 3006063, 2287191, 2361068, 2460922, 2192104, 2061165, 2434516, 2429233, 2271947, 2242737, 2121718, 2321196, 2282341, 2040604, 2051452, 2329226, 2371061, 2105381, 2546679, 2345166, 2489825, 2466550, 2527718, 2467217, 2870007, 2425484, 2369928, 2594266, 2689626, 2826787, 2312068, 2660788, 2869727, 2416616, 2994531, 2988874, 2856516, 2984790, 2841075, 2747054, 2973178, 3183041, 2748203, 2761264, 2780920, 3044423, 2871030, 2918673, 3313396, 3303380, 3487644, 3240336, 3290404, 3313543, 3693530, 3938026, 3630282, 3773214, 4003891, 3524006, 3681835, 3602314, 3394292, 3921037, 4002431, 3987574, 4380817, 4081429, 4052769, 4390296, 4490874, 4116365]
14450D116365J63918o0197K11272r0724k76211M85085K86445l02138j04230L35794
14440D765379J16518q0345J59645j34538L27527n5740j01735j34475J90597L2741
14430E085574K06339K06710j33464K20604k55350L07972j87117O39154j17965
14421E972457j00118K70497j35722Q0502j19L79501l89457N92795k01172J73438
14411F642602K20286q3051m8488K52196K47590j60785M42066k21034L02198p2012
14401G521568J93839L1422j91580M33747J05934n3280J41017L50M84930J59328
14391H827275j79660M93753J35430O2387k82155N46291j14621K40776L11627J73763
14381A0214866j20642N83183k87327O87893j56550K65237N9529J54879M64123
$$ y = [4116365, 4280283, 4220086, 4431358, 4340634, 4064423, 4549508, 4835953, 4533815, 4429585, 4765379, 4881897, 4801552, 4961197, 4826659, 5154186, 5098446, 4996711, 4862236, 5052833, 5085574, 5291913, 5498623, 5365159, 5585763, 5330413, 5638385, 5451268, 6090422, 5972457, 5872339, 6142836, 6007114, 6087616, 6087497, 6466998, 6077541, 6670336, 6469164, 6642602, 6862888, 6779837, 6731349, 6983545, 7231135, 7070350, 7512416, 7291382, 7593580, 7521568, 7715407, 7746829, 7555249, 7988996, 8094930, 8041650, 8182667, 8183017, 8667947, 8827275, 8647615, 9141368, 9276798, 9339185, 9057030, 9603321, 9488700, 9729476, 10041103, 10214866, 10094224, 10677407, 10390080, 11077973, 10921423, 11186660, 11246189, 11401068, 11865191]
14372A1865191J75839K63299L12451j7501O14176r8879J85826L35111O15020J26267
14362A4376800M4418N68984J42043O05876K22917K35639L60908p2503O84784K21683
14352A7391549O63686J75430L55837K11110N02660M13390P05491K63692O38706
14343B1321551N68441M85564L96556N29159M03975P05223N76718P03001N58474
14334B6248662K73147J139363P79722O47553M72626P28941J121597M50211J119907
14325C2981729J208882Q85427O54101R57732J198424J266895R51235J313887J263273
14316D2681585J199518J737988J288227J439696J702814J759392J516500J725924
14308E5051644K181879K107271J921173K276206K573380K522590K534757K774711
$$ y = [11865191, 12041030, 12304329, 12616780, 12599279, 13213455, 13114576, 13300402, 13635513, 14250533, 14376800, 14421218, 14990202, 15132245, 15738121, 15961038, 16196677, 16557585, 16485082, 17169866, 17391549, 18055235, 18230665, 18586502, 18797612, 19300272, 19713662, 20419153, 20682845, 21321551, 21889992, 22375556, 22772112, 23301271, 23705246, 24410469, 24987187, 25690188, 26248662, 26521809, 27661172, 28440894, 29088447, 29561073, 30290014, 31411611, 31861822, 32981729, 34190611, 35076038, 35730139, 36687871, 37886295, 39153190, 40104425, 41418312, 42681585, 43881103, 45619091, 46907318, 48347014, 50049828, 51809220, 53325720, 55051644, 57233523, 59340794, 61261967, 63538173, 66111553, 68634143, 71168900, 73943611]
14300G3943611L020839L094995L688054K878187L679283L926342M171022M061671
14292A02464004N128141M990824N168232N694484O077721O600890O600024P182683
14284A49907003P789310P788607Q660962R111110R678942J0396173J1350562J1434774
14276B26117443J2033871J2994106J3341859J4109894J4376530J4405884J4594704
14269C21974291J5125885J5053406J4771671J4187969J3217870J2557197J1698090
14262D18586379J1050078R505872Q767208Q329876N593282K404096R92758j776606
14254D63452943p194292m288041m799831p336401j0901780j2356748j2281792
14247D04294058j4105977j4631197j4893561j4958194j4806569j5055527j4540025
$$ y = [73943611, 76964450, 80059445, 83747499, 86625686, 90304969, 94231311, 98402333, 102464004, 107592145, 112582969, 117751201, 123445685, 129523406, 136124296, 142724320, 149907003, 157696313, 165484920, 174145882, 183256992, 192935934, 203332107, 214682669, 226117443, 238151314, 251145420, 264487279, 278597173, 292973703, 307379587, 321974291, 337100176, 352153582, 366925253, 381113222, 394331092, 406888289, 418586379, 429636457, 439142329, 447909537, 456239413, 461832695, 464236791, 465229549, 463452943, 456258651, 451970610, 447170779, 439834378, 428932598, 416575850, 404294058, 390188081, 375556884, 360663323, 345705129, 330898560, 315843033, 301303008]
14240C01303008j4075001j3498409j3234000j2634312j2324153j1799047j1702048
14233B12036038j1679892j0606836j0004330r562356q425000q035926q047589
14226A45674109o734948p209480o234798n698909n427069m908005n086845m732980
14218I9641075m036985m022971l590747l805257l411321l102149l385672k958613
14210G1327360k700893k555513k576970k084253k225587j919694j835168k048625
14202E3380657j708042j809414j520606j593665j589435p93046j723666j646757
14194D0996026q13651j091904j015078r48233j468049r24572j079626p17741q66156
14185C2071016q96752q69338q02264o98288q08795o22191n42299p16886n35772
$$ y = [301303008, 287228007, 273729598, 260495598, 247861286, 235537133, 223738086, 212036038, 200356146, 189749310, 179744980, 170182624, 161757624, 153721698, 145674109, 138939161, 131729681, 125494883, 119795974, 114368905, 109460900, 104374055, 99641075, 95604090, 91581119, 87990372, 84185115, 80773794, 77671645, 74285973, 71327360, 68626467, 66070954, 63493984, 61409731, 59184144, 57264450, 55429282, 53380657, 51672615, 49863201, 48342595, 46748930, 45159495, 44366449, 42642783, 40996026, 40182375, 39090471, 38075393, 37127160, 35659111, 34734539, 33654913, 32937172, 32071016, 31174264, 30304926, 29502662, 28804374, 27995579, 27373388, 26831089, 26114203, 25578431]
14176B5578431q17363o24369p55108o56733j28033n95684q55817l15584n1723
14167B0778017o60160k17714o82137l37674n44372n77638k7417n31186n31261
14158A6668458L07219o75161l84113l06641j32418l70674l76826k7857l28039
14149A4373948L0576k19632m47590J8405l30677k08823l05750j84141m48074O3838
14139A2342080l03247k0604m44854k54955Q8914l51379l36968p0955J92739l82748
14129A0458023O2864m06019j05300j25842k41691j62865o633k87147O4165n24150
14119H725405J44779r9027n4558j33686m04130P0959K1684l92788L02027l52304
14109G828361n9715k07092J23081n62344J28385J128m7795O5431j57328o17015
$$ y = [25578431, 24761068, 24136699, 23381591, 22724858, 22596825, 22001141, 21145324, 20829740, 20778017, 20117857, 19900143, 19218006, 18880332, 18335960, 17758322, 17730905, 17199719, 16668458, 16975677, 16300516, 15916403, 15609762, 15477344, 15106670, 14729844, 14701987, 14373948, 14404524, 14184892, 13737302, 13755707, 13425030, 13216207, 12910457, 12726316, 12278242, 12342080, 12038833, 12018229, 11573375, 11318420, 11407334, 11055955, 10718987, 10648032, 10840771, 10458023, 10520887, 10114868, 10009568, 9883726, 9642035, 9479170, 9472537, 9185390, 9249555, 8725405, 8870184, 8771157, 8716599, 8582913, 8178783, 8249742, 8271426, 7878638, 8180665, 7828361, 7768646, 7561554, 7684635, 7122291, 7250676, 7251804, 7204009, 7269440, 7112112, 6495097]
14099F495097J08199J35302k95725m10831J58091J64848k31033j83197k78508
14090E662243O49107k40832k58208J01169m99672K35662j47439j18320J92575
14081E576285l350n33908J59903j23413m5949r0970N63771m71723j15780k60429
14071D654437k15365R6742O8792J38478l30788M39129m85228j8593l9299k49348
14061D058957k0996o2531J90438m93343J61545J15902J01112k79426j93057K90457
14051C869058n3323M7919l07838K70778j6520m12699J93756R0205L2538L9588
14041C753462k09305k025k12336K1368l446k25191K86910k70702P751k97923L07318
14030C155881k00544P5525k73127k07950N21639n2387k29504R8883J7276l87063
$$ y = [6495097, 6603296, 6738598, 6442873, 6032042, 6190133, 6354981, 6123948, 5940751, 5662243, 6311350, 6070518, 5812310, 5913479, 5413807, 5649469, 5502030, 5383710, 5576285, 5572935, 5039027, 5198930, 5075517, 5029568, 4938598, 5502369, 5030646, 4914866, 4654437, 4439072, 4535814, 4604606, 4743084, 4412296, 4851425, 4366197, 4347604, 4308305, 4058957, 4037961, 3975430, 4165868, 3672525, 3834070, 3949972, 4051084, 3771658, 3578601, 3869058, 3815735, 3863654, 3555816, 3826594, 3810074, 3397375, 3591131, 3681336, 3713874, 3753462, 3544157, 3542132, 3329796, 3351164, 3347718, 3122527, 3409437, 3138735, 3146486, 2848563, 3155881, 2955337, 3030862, 2757735, 2549785, 3071424, 3019037, 2789533, 2888416, 2905692, 2518629]
14020B518629K48272K46952k98218q6729Q3851M7243j44992J73868k16986n2980
14010B518910K03060k82257O0687l7395r1749J87337K56702m42038K64304j35642
14000B501919J17651m28149N28776o14355K74168k20610J42807j51204k14744
13991A936259P2348J53423O5349j09001J85238j78516j12240K376K62409l22584
13981A955061J30222K0685K59489M69790L27935M08198P03112J798015L482960
13972I555467O746056J0905175J82760p135902o303045m421305k271435j722471
13964E535300q33147o58431o12602p7892m58964K1602l74100L78007j29492n46058
13954B244223K18766l10485M87666m57064o3645q9750O3010m83345J28103K70621
$$ y = [2518629, 2766901, 3013853, 2715635, 2628906, 2712757, 2760000, 2615008, 2788876, 2571890, 2518910, 2721970, 2439713, 2500400, 2463005, 2371256, 2558593, 2815295, 2373257, 2637561, 2501919, 2619570, 2191421, 2720197, 2105842, 2380010, 2159400, 2302207, 2151003, 1936259, 2008607, 2162030, 2227379, 2118378, 2303616, 2125100, 2012860, 2015236, 2277645, 1955061, 2085283, 2105968, 2365457, 2835247, 3163182, 3571380, 4274492, 6072507, 9555467, 16301523, 27206698, 27389458, 20253556, 13950511, 9529206, 7257771, 5535300, 4702153, 4043722, 3431120, 3353228, 2894264, 2915866, 2541766, 2919773, 2790281, 2244223, 2462989, 2152504, 2640170, 2183106, 2119461, 2029711, 2092721, 1609376, 1737479, 2008100]
13944B008100j0509j20373k38227K38723k47672j05032P7230M21766j56725M548
13934A871829k40811K96687m24215N609N47415k55616O9282j29623j12634o4976
13924A562947k86082J29515N2942N554J39131j8655k17383j59254M46054j67038
13914A487731j80175L07654j75611m9301p421j96164K01000J06071j79002M3382
13904A358164M3649q1359j3071K57801k83198Q0421K65294m87543k6012l8907
13894A075239M03666k56377J37020j53590J24281j63741k36236N04466l83409
13885A051319L35906J1263m5229n11262N17304k75278j15866L61109p232l20386
13875A001648k0128K96761m90650P3169O7391K92790m75733N05585j38513j57308
$$ y = [2008100, 1997591, 1877218, 1638991, 1877714, 1630042, 1525010, 1602240, 2024006, 1867281, 1871829, 1631018, 1927705, 1503490, 1509099, 2056514, 1800898, 1870180, 1740557, 1627923, 1562947, 1276865, 1406380, 1459322, 1464876, 1604007, 1585352, 1367969, 1208715, 1654769, 1487731, 1307556, 1615210, 1439599, 1390298, 1382877, 1186713, 1387713, 1493784, 1314782, 1358164, 1401813, 1320454, 1307383, 1565184, 1281986, 1362407, 1627701, 1140158, 1114146, 1075239, 1478905, 1222528, 1359548, 1205958, 1330239, 1166498, 930262, 1434728, 1051319, 1387225, 1398488, 1353259, 841997, 1359301, 1084023, 968157, 1329266, 1322034, 1001648, 981520, 1278281, 787631, 860800, 928191, 1220981, 745248, 1250833, 1112320, 955012]
13865I55012j19026K85509p2705m14207M69397k42460J20368R2223L02813l87928
13855I88996o7912K52536j43716K0284j9324P5762j37297J35969l31919o1098
13845G12281M42832J32542k55059l60863R1104J03247K43154l60433k1269J04095
13835H31631p9893M5934K34858M0949m04020R4778l9000L43956l34134J73156
13825I08215j02553k05550P1162n8623L13380j49107K19728l35132R9682n5388
13815G05814L7483Q6363K55960j43161p7978k39320L52358k65460L35765l49028
13805F98796j03559j484m7776K73196n7255k89376N04633k12963R4906O3656k25536
13794F97238J70071m19372M28681m387l29337L85282j40794p0348l8154J62003
$$ y = [955012, 835986, 1121495, 1048790, 634583, 1103980, 861520, 981888, 1074111, 1376924, 988996, 921084, 1173620, 1029904, 1050188, 1030864, 1106626, 969329, 1105298, 773379, 712281, 1155113, 1287655, 1032596, 671733, 762837, 866084, 1109238, 748805, 727536, 831631, 751738, 797672, 1032530, 1073479, 669459, 764237, 725237, 1069193, 735059, 908215, 805662, 600112, 671274, 612651, 926031, 776924, 996652, 661520, 761202, 705814, 743297, 829660, 1085620, 942459, 864481, 625161, 977519, 712059, 1047824, 698796, 595237, 593753, 545977, 819173, 761918, 472542, 977175, 764212, 859118, 922774, 697238, 867309, 447937, 876618, 872231, 542894, 928176, 787382, 717034, 678880, 840883]
13784H40883k65422k5053K58211k04574J63974j23962j63281L52319J5059D11421
13773C85911J75002J99097p7128l8926k44732R4440N374L581L52670q5790j85225
13762E84274j44466R4021o1472j18790L08716j56113k18284L74357j19651k0275
13752E22317J99206k07481K59463q1717L4111J19951l72506J73695L240K64211
13742I14490l61638j8488B25995N76316o0593l68715p7707K67102p7195j49259
13732C35944J36033K20598l26666O7294L05683K85159D58385P4638n2900p6041
13722D04082p3489K7908J53184j37984J69567J40111j29597R403m6802J10506
13712F26889j63642f4116C50805k1711P3888K17037j73550A86785J17026J50499
$$ y = [840883, 575461, 550408, 808619, 604045, 768019, 644057, 480776, 833095, 848154, 411421, 385911, 560913, 760010, 682882, 643956, 399224, 493664, 499038, 502619, 855289, 769499, 584274, 439808, 533829, 472357, 353567, 662283, 506170, 287886, 662243, 542592, 522317, 721523, 514042, 773505, 691788, 725899, 845850, 473344, 647039, 650279, 914490, 552852, 534364, 225995, 802311, 741718, 373003, 295296, 562398, 485203, 335944, 471977, 692575, 365909, 433203, 738886, 1024045, 458385, 533023, 480123, 404082, 330593, 358501, 511685, 373701, 543268, 683379, 553782, 563185, 516383, 626889, 463247, -64116, 350805, 329094, 402982, 620019, 446469, 186785, 303811, 454310]
13702D54310K88606J09991C88048j74326K38123P1781O240j40577H3259N50622
13692F33881C4772O44960R971j59366n6910R352j83160R4539k1705K09725K7780
13681F09958k04823R9556k26115o6065L15777j89967L30993k97081P3383l0327
13671D15289L31778j70903j21231L84096C98693j87998g865F29707A96152J67652
13661C63804j3473J68005k18394K61053j036k77594L32613J30897j51798j58511
13651D35566A91723n1537N27845O3379k38317j55971o2702M9019L77955C38036
13640B59125A22373M53310k46703C2339N49779j53516m8697J63597A24031K64272
13630C88303G767M31186k00157J87397q4068L43424j86328D080J68829K32793
$$ y = [454310, 742916, 852907, 388048, 213722, 451845, 523626, 529866, 389289, 83259, 633881, 34772, 679732, 689703, 530337, 473427, 482779, 299619, 394158, 372453, 582178, 609958, 405135, 504691, 278576, 212511, 528288, 338321, 669314, 372233, 445616, 415289, 747067, 576164, 454933, 839029, 398693, 210695, -7865, 629707, 196152, 363804, 350331, 518336, 299942, 560995, 559959, 282365, 614978, 745875, 594077, 435566, 191723, 140186, 668031, 731410, 493093, 337122, 274420, 323439, 701394, 338036, 259125, 122373, 575683, 328980, 32339, 582118, 428602, 379905, 543502, 124031, 388303, 7767, 438953, 238796, 426193, 342125, 685549, 499221, 4080, 172909, 405702]
13620D05702l0732K21019j65036A16544J87863O6409M7151J44470j69670n7382
13610C35385j2749J77640n8869j67733R5729b0630D41309j61201A34474J19560
13600B54034J00138J45510J08016e6833B88965n966O835p0108R0653A25737J04946
13589B30683E1352K83080N9463j56166J22077P4910l5093C3585K96299l3837K54332
13578E50379B17352p7110J06079K22782B01049l5107K32129J35884B59690j00070
13568A59620K6225J51537I0038M35064A68444L1086N8288j2879C4085L57476l9005
13557C52556C1975L24675J13049A90455Q8614m4632m6005R8374D7345J70393n3165
13546A64573R8806A26704n0639P4352K34170j36359r9764K9083K5380K25652A24656
$$ y = [405702, 374970, 595989, 430953, 116544, 304407, 370816, 417967, 562437, 392767, 335385, 322636, 500276, 441407, 273674, 369403, -20630, 441309, 280108, 134474, 254034, 354172, 499682, 607698, -56833, 288965, 282999, 289834, 219726, 310379, 125737, 230683, 51352, 334432, 393895, 237729, 359806, 434716, 399623, 33585, 329884, 296047, 550379, 217352, 140242, 246321, 469103, 201049, 165942, 398071, 533955, 259690, 159620, 185845, 337382, 90038, 525102, 168444, 199530, 257818, 244939, 34085, 391561, 352556, 31975, 356650, 469699, 190455, 279069, 234437, 188432, 286806, 47345, 217738, 164573, 263379, 126704, 76065, 150417, 384587, 248228, 148464, 177547, 202927, 428579, 124656]
13534E00973h4224B1911J64850c4451m1243B41424R960a02408D63957b1684q899
13523c0583a3379B89552d1519F019K46656J63730M3409A03050K99043m5369j73205
13512A83519K13460J49512A07021R7191F8173J09196G563N45705k52198K63299
13502E64369B11814q1537J64876J11313I5032c7254m9272C36324J54214B10818
13491A77563a2732D10446o4831k8816Q6682P8442j64080q2971k2648k5189J53146
13480C40181r3814m935J64005D3166K49579f0955q3786A78236o3286K75127j92823
13469A97254K03840j22189F0291J46977J61826A83778K6314J21701j45503N4906
13459B41196j10365k1408M02330B987M69813E4929K04191D4460J78097D8898L82703
$$ y = [500973, -84224, 21911, 186761, -34451, -75694, 241424, 251384, -102408, 463957, -21684, -30583, -13379, 289552, -41519, 6019, 252675, 416405, 459814, 103050, 402093, 356724, 183519, 396979, 546491, 107021, 204212, 68173, 177369, 7563, 553268, 301070, 564369, 211814, 130277, 295153, 406466, 95032, -37254, -86526, 336324, 490538, 210818, 177563, -12732, 410446, 345615, 316799, 403481, 481923, 317843, 234872, 212224, 187035, 340181, 246367, 241432, 405437, 43166, 292745, -60955, -144741, 178236, 114950, 390077, 197254, 401094, 278905, 60291, 207268, 369094, 183778, 210092, 331793, 186290, 241196, 130831, 109423, 511753, 2987, 472800, 54929, 259120, 44460, 222557, 48898, 431601]
13448D31601k10603h7011A32134a51649B67279A15642k8443J16820J06988m184
13438C06823j1288D5931J87971A2806M08469H3376K54610H5602a12118B68390
13427I8836N1520J08259K4577K28435c1539C28090H8408K00246A12715J34558
13417B47273j6337O1636M0877A06223C6819M9977J56729J58576B8404J45001n4606
13406A18799L01767H9143J42371a67973B34638a19652A55092Q1594c4614H3480
13395D16960I680L65039j21823J48613j44276A12242k8652L96685j81555G2396
13384A88791P1345gB18364f283B88480L801L941A04429J25296q7443L41206A5518
13371e1603D26964H8860J80031d906D9083b75280A78580a5461B88640b33535R5443
$$ y = [431601, 220998, -87011, 132134, -151649, 267279, 115642, 87199, 204019, 311007, 306823, 295535, 45931, 233902, 12806, 421275, 83376, 337986, 85602, -112118, 268390, 98836, 150356, 258615, 283192, 511627, -31539, 328090, 88408, 288654, 112715, 247273, 230936, 292572, 333449, 106223, 36819, 86796, 243525, 402101, 28404, 173405, 118799, 420566, 89143, 231514, -167973, 234638, -119652, 155092, 236686, -34614, 83480, 416960, 9680, 374719, 252896, 401509, 257233, 112242, 83590, 480275, 298720, 72396, 188791, 260136, -7, 218364, -6283, 288480, 292281, 296222, 104429, 229725, 142282, 483488, 15518, -51603, 426964, 88860, 268891, -4906, 49083, -275280, 178580, -15461, 288640, -233535, -138092]
13360a38092B19376N4258A29919C0053a33817B08069b3535D21638i2445C44559
13349C53841j31618e9619A44441J59223A4078J09743K64010p504j38491q4691
13339A57145P3550N4264E9841M35592j86841A26443O8068J76285J5457j88146
13329A98107l1959b6484D99760r2299A88432O2064k6765J76461A66354J39226
13319C05580Q0721a0653r0117C12907D7829A5265M26513a6830A57741i8893B96886
13307a15976B57673b2266A5154J68949d197A88021a9000B06557J73169B5782a8409
13295b366C0943c4248A50331K55615j12595e1929B2561K6426g8169D6937K46051
13284B92988P4447A76333a00764M3761D24682p4653c7219B02767K78637k34013
$$ y = [-138092, 219376, 273634, 129919, 30053, -133817, 208069, -23535, 421638, -92445, 344559, 353841, 222223, -59619, 144441, 303664, 14078, 123821, 387831, 380327, 241836, 157145, 230695, 284959, 59841, 495433, 308592, 126443, 194511, 370796, 386253, 198107, 166148, -26484, 499760, 407461, 188432, 250496, 223731, 400192, 166354, 305580, 386301, -10653, -100770, 312907, 47829, 15265, 441778, -16830, 157741, -98893, 296886, -115976, 257673, -22266, 15154, 184103, -4197, 188021, -19000, 206557, 379726, 25782, -18409, -2366, 30943, -34248, 150331, 405946, 293351, -51929, 22561, 48987, -78169, 46937, 292988, 367435, 176333, -100764, -57003, 424682, 350029, -37219, 202767, 481404, 247391]
13274B47391I2832a25035B10257F4137j0778N4521J98192A5280Q813K08514j15542
13263A17065a20206C5148K13668n574j02899e8675A71492F0821a55501d2093A1215
13251h466j64930O1538A85862J1525B4245J13345B6756J03872d1286j31929c4675
13239C61325j12257k2805B7499K00293a50386B2543J9744a06481a6295E8535b05349
13227B18427l8323D7349K20836f8341E0303R6002l6424A9037h380A60997b19296
13215I0873J50116i733A86253e6074j86927A23290M8948G9790K51742d9881B02489
13203F2537k418K0551j5845L72971A02531L9927E236M44213E406J3403L23545
13192C42354A00150B201K82520K62313D2856J67522J3187b558A09936J75952b84382
$$ y = [247391, 92832, -125035, 210257, 64137, 53359, 107880, 306072, 15280, 24093, 232607, 117065, -120206, 35148, 248816, 243242, 140343, -58675, 171492, 60821, -155501, -42093, 11215, -8466, -173396, -111858, 185862, 197387, 24245, 137590, 26756, 130628, -41286, -173215, -34675, 361325, 249068, 226263, 27499, 227792, -150386, 22543, 42287, -106481, -16295, 58535, -205349, 218427, 180104, 47349, 268185, -68341, 50303, 146305, 109881, 19037, -8380, 160997, -219296, 90873, 240989, -9733, 186253, -56074, -243001, 123290, 172238, 79790, 331532, -49881, 202489, 62537, 60119, 80670, 64825, 437796, 102531, 142458, 5236, 449449, 5406, 18809, 342354, 100150, 2201, 284721, 547034, 42856, 210378, 223565, -2558, 109936, 285888, -284382]
13180b58541G969Q0032b15018C7594Q2280E3012e0941B96188M0435i4653c2841
13168A2906i7970p9215Q2216K6070D2454L01017F3266d80858A64848b43348B44922
13156a44992G6549P7840b32708A7463O8702J42902d5418D05473A27791a21991
13145b8415C5134R1706k1477i0587A06591J14451e1749A78201J57586A39976a90196
13133c47152B78093j3708n8481b39600B82794O4984j33237a46253l020C18804
13122I0516m0082C208c46209B0668O0020J16746G3986a30391q6213B13897b288
13110c880B55517E8417N674J87409B9287N5743J29116a88249E9971R1258h3341
13098D54382f9346B95538h1797G1396O2095a1841m98209b36283c1625E344h6713
$$ y = [-258541, 7969, 88001, -215018, 37594, 119874, 53012, -50941, 296188, 336623, -94653, -32841, 12906, -97970, -177185, -94969, -68899, 42454, 343471, 63266, -480858, 164848, -243348, 244922, -144992, 76549, 154389, -232708, 17463, 86165, 229067, -45418, 405473, 127791, -121991, -28415, 35134, 126840, 105363, -90587, 106591, 221042, -51749, 178201, 335787, 139976, -190196, -347152, 278093, 264385, 205904, -239600, 282794, 347778, 214541, -146253, -149273, 318804, 90516, 50434, 3208, -346209, 20668, 80688, 197434, 73986, -130391, -216604, 213897, -2288, -3880, 255517, 58417, 64091, 251500, 29287, 85030, 214146, -188249, 59971, 151229, -83341, 454382, -69346, 295538, -81797, 71396, 133491, -11841, -510050, -236283, -31625, 5344, -86713]
13086c17790A79046a22917L8042d1182F0013b7590D3828K7659a46925I4735a10093
13074A06637K37542r0411j01770L1712c27944R5454R0612L8668c9982p6985F002
13062H8191B0097b53546B05581n0092h8949r9394B70040k2296E2627a28270E2223
13050b9766C53053c4282k44477e2543r7857B7136E544a89812n604h6527E1935
13038h1662b48k6839K838K4A36454J24257b94667J43096B24453a10937D61692
13026B63058d819j67100B40948g5787B84933A37008P0387a11479B60210G1503
13015d3827B31527j23a08642c6650l1610k5037c8581B29135a3376j2072j23604
13004a49052c5062B6815h5856A49580B1892d72B88810d0677A52842a62170B07335
$$ y = [-317790, 179046, -122917, -84875, -41182, 60013, -27590, 43828, 71487, -146925, 94735, -110093, 106637, 344179, 253768, 151998, 183710, -327944, -232490, -141878, -103210, -39982, -116967, 6002, 88191, 20097, -253546, 205581, 155489, -88949, -188343, 270040, 247744, 52627, -128270, 52223, -29766, 353053, -34282, -278759, -52543, -150400, 27136, 5544, -189812, -195416, -86527, 51935, -81662, -248, -27087, -24249, -24225, 136454, 260711, -294667, -151571, 224453, -110937, 461692, 263058, -4819, -171919, 240948, -75787, 284933, 137008, 207395, -111479, 260210, 71503, -43827, 231527, 231404, -108642, -36650, -68260, -93297, -38581, 229135, -13376, -25448, -149052, -35062, 26815, -85856, 149580, 21892, -472, 288810, -40677, 152842, -162170, 207335]
12992C59268a14065B62286C3805K20227c3020A63589f5717k56212B85822c18011
12981B10829c5077j54464F5127L27A4731a08348J5150n4556A17094J56668a4689
12969D8278J75021b36761A73352l2373k1668L1390a2507B17192a05052C19639
12958B56149O4810F6690J52750o3736O5297g9346A56760D269d3429B4373b43431
12946b05441i3752A7589o362L37586g0924D18396E0549P0792a96051A71425b03121
12934B98556D0122J26686c7964j8358H4562O6558a44333C34490a48721I8552b62605
12922d1163j3614G636a3327G9621L577J61842B2627K09248r5191L9445C7184h5402
12909a3034B50854A8848a21595I450K91899f6045C51355L4911a84981e9099j53118
$$ y = [359268, -114065, 262286, 33805, 254032, -33020, 163589, -65717, -321929, 285822, -318011, 210829, -35077, -189541, 65127, 65454, 14731, -108348, -93198, -147754, 117094, 273762, -14689, 48278, 223299, -236761, 173352, 140979, 119311, 150701, -12507, 217192, -105052, 319639, 256149, 320959, 66690, 219440, 155704, 221001, -79346, 156760, 4269, -43429, 24373, -243431, -205441, -93752, 17589, 11227, 348813, -70924, 418396, 50549, 121341, -196051, 171425, -203121, 298556, 40122, 166808, -37964, -56322, 84562, 151120, -144333, 334490, -148721, 98552, -262605, -41163, -54777, 7636, -13327, 79621, 83198, 245040, 22627, 231875, 136684, 176129, 37184, -85402, -13034, 250854, 18848, -121595, 9450, 301349, -66045, 351355, 386266, -184981, -59099, -212217]
12898b12217R9568c9543k89973F5203b03632O8548B39523a05739b3649B495a61330
12886h0702B09402b15236L068A87032n3515a622D9271o035N0251J3273g3436F8106
12873D7835J20086a00521r2297A09373L29797b47943F1064a35824E8004f8716
12862c0454A20900a17123c5827j49403o5026b85l35609f1236A35919o5530c41494
12850A87335O2561A3318b04779A83100h0177j8310M7075A44543F4417b04440A69169
12838B73502d3111j16620B35628a39242A78081e5130A70320g9509m1054l6940
12828a57503B58511d7687C17431J14542g3580A32284a09844A69483a28471l6043
12818a64514j17451A4088Q5120r03D0948A5122L6261Q289N3754K5615J21901j1529
$$ y = [-212217, -112649, -39543, -329516, 65203, -203632, -135084, 239523, -105739, -23649, 2495, -161330, -80702, 209402, -215236, -212168, 187032, 133517, -1622, 49271, 43236, 93487, 106760, -73436, 68106, 47835, 167921, -100521, -192818, 109373, 439170, -247943, 61064, -135824, 58004, -68716, -30454, 120900, -117123, -35827, -185230, -250256, -285, -335894, -61236, 135919, 70389, -341494, 187335, 249896, 13318, -204779, 183100, -80177, -98487, -51412, 144543, 64417, -204440, 169169, 273502, -43111, -159731, 235628, -139242, 178081, -55130, 170320, -79509, -120563, -157503, 258511, -47687, 317431, 431973, -73580, 132284, -109844, 169483, -128471, -164514, -281965, 14088, 99208, 98305, 40948, 15122, 51383, 59672, 113426, 139041, 260942, 249413]
12806B49413f0837K5282j69210B51307a52322M7807m529A51871J89226D8255J63678
12795B11933K07992C0185i3921n9311N9826A36154E9700a25705l7908A8815g1979
12783g1502q2397C18359b49739J7998B78357q5388b48557H3054a2544A11961Q4554
12772A96515J23901c40424H4279K25413j02968a67236A30966C7650h2828A90437
12761C4307b50578i6176M7220M873B45817i068j64379p4177I5420a44676G5085
12749F8746a37663j26907J01659A01639J30048b19128K2015Q0803k62416a63790
12738F5914H070e3805A30408A7201k39M14584A2055J51514b4336p9740B99977
12726a53086B82860J34593i9078B74537a2325q887A91180a41335J9264F5692a08947
$$ y = [249413, -60837, -35555, -204765, 251307, -152322, -104515, -109044, 151871, 341097, 48255, 211933, 419925, 30185, -93921, -153232, -93406, 136154, 59700, -125705, -163613, 18815, -71979, -71502, -153899, 318359, -249739, -231741, 278357, 192969, -248557, 83054, -12544, 111961, 196515, 320416, -340424, 84279, 309692, 206724, -167236, 130966, 37650, -82828, 190437, 34307, -250578, -96176, -48956, -44083, 245817, -9068, -173447, -247624, 95420, -144676, 75085, 68746, -137663, -264570, -162911, 101639, 231687, -219128, -197113, -116310, -378726, -163790, 65914, 8070, -53805, 130408, 17201, 16962, 431546, 12055, 163569, -24336, -104076, 299977, -153086, 282860, 417453, -99078, 274537, -12325, -21212, 191180, -141335, -122071, 65692, -108947]
12714C56159a53843b3795A79233g8772k46827E1725J91383c215j19378d0510j74313
12703b14823j6064F9216c66439D6518J25562D256d2608F3436a09428A49165l4068
12692A15097O4842A4502d917C1260K77880C7685L61394j7444A81585L6311r9468
12681A18428J3407e2232A88771F0412J95146e15l761o205j12361j5821f2831b5295
12668b09306C6353d79471A33320k129i7782E27713D7324j4330J35022L6954p6350
12657A28620K44428A19002a51038q2277R2195A23350K372K8890d7949D8058j7915
12646C0143a58046A62234n7835a2185B65764m5392n6559b24720D5484G628J92903
12635B00531g2270B05445K44951n2454A32021f9357j38387J8328b2914j25375
$$ y = [356159, -153843, -23795, 179233, -78772, -325599, 51725, 243108, -3215, -122593, -40510, -214823, -230887, 69216, -366439, 46518, 172080, 4256, -42608, 63436, -109428, 149165, 115097, 179939, 14502, -4917, 31260, 309140, 37685, 399079, 381635, 181585, 217896, 118428, 131835, -52232, 188771, 60412, 255558, -515, -4276, -10481, -122842, -138663, -62831, -25295, -209306, 36353, -479471, 133320, 131191, -97782, 527713, 47324, 32994, 168016, 204970, 128620, 373048, 119002, -151038, -233315, -141120, 123350, 125722, 154612, -47949, 48058, 30143, -158046, 162234, 104399, -12185, 265764, 220372, 163813, -224720, 45484, 7628, 200531, -72270, 205445, 450396, 397942, 132021, -69357, -207744, -189416, -22914, -148289]
12625a48289J6749H6694b04769A58900a00312A12511M5913C0206a05603A87320
12614A50867J38217A27764P0717l4664B0118M1798j7192L66710c0723o4666b9223
12602B06823b23340J04609e4576k0853L3854E4357Q9135n5523P0299a8991C41819
12590c4967n8277l16708i0026D0466J57418E3118J22282b16435i5476j19354J07160
12579a07670E6475B2398m720J88447e0676A01639e741F0935B8284b05961h1221
12567b70142g1521k13988J41872G2243N1669J31475A1715O5400K467a44050B65470
12555A1347a19626B01665a32836k8129C54468A23244O7512I3198B4225J07970
12545A32195h6076j91509d0311G9563I403J92227m5068A365N5336J14568i1480
$$ y = [-148289, -131540, 86694, -204769, 158900, -100312, 112511, 158424, 30206, -105603, 187320, 150867, 289084, 127764, 198481, 163817, 20118, 61916, 44724, 411434, -30723, -95389, -29223, 206823, -223340, -118731, -54576, -75429, -41575, 54357, 143492, 87969, 158268, -18991, 341819, -34967, -93244, -409952, -90026, 40466, 197884, 53118, 175400, -216435, -95476, -214830, -107670, 56475, 22398, 17678, 206125, -50676, 101639, -5741, 60935, 28284, -205961, -81221, -270142, -71521, -285509, -143637, 72243, 123912, 255387, 11715, 77115, 79582, -144050, 265470, 11347, -119626, 201665, -132836, -160965, 354468, 123244, 190756, 93198, 24225, 132195, -86076, -277585, -40311, 79563, 9403, 201630, 156562, 1365, 56701, 171269, -91480]
12533b32712K211J03958A82166k7553k9753b05451F179h7039C78427a57515g3229
12521A75084A3058L01029c9042I2067a6528j75375F129c7244A70918b07486B60489
12509F5573h0292A74385Q7959N2123a7438j30260A41286M3586E6693j988d7137
12497I9768f9729B76526i2289B29296I0733J63282n9438C5446i2032c0210l9440
12486f9650A65123a62550a8878n2154A49706a04993c6115C8481a32738k96175
12476d28913A87669C3739a37327A51907k5159J53648b84754A20917J9836e7941
12465c9128B00605F4799c9933A0675a46395E9960O2409D852J80566A3167Q9626
12454A02793J46032C6599B425b17395j09729a36450r467K6596c6336D9068K09935
$$ y = [-232712, -230501, -126543, 182166, 154613, 124860, -205451, 6179, -87039, 378427, -157515, -73229, 175084, 13058, 314087, -39042, 92067, -16528, -191903, 6129, -37244, 170918, -207486, 260489, 65573, -80292, 174385, 262344, 314467, -17438, -147698, 141286, 184872, 56693, 54705, -47137, 99768, -69729, 276526, -92289, 229296, 90733, 254015, 194577, 35446, -92032, -30210, -69650, 165123, -162550, -18878, -71032, 149706, -104993, -36115, 38481, -132738, -428913, 187669, 33739, -137327, 151907, 126748, 280396, -284754, 120917, 140753, -57941, -39128, 200605, 64799, -39933, 10675, -146395, 59960, 122369, 4852, 185418, 13167, 102793, 248825, 36599, 2425, -217395, -327124, -136450, -145917, -119321, -36336, 49068, 259003]
12443B59003a36958N6103D13940d7606A79686a45660A85615g4379L3627J9094
12433b1658B3840b9609q2774q2332b9743H2500f244B081b30870B052e0021I2019
12420a76108B3505b36984A31259L3611a88280G5637a5385j75812E7023a40392
12409F1489a31426C96928G6276j5465a02623G8008L03752C6304J36896c9964k91053
12398c31017C4555K3010J05852E6451b89799B69785c34582a53873B960a2909m1176
12387e4085I324a64127A00509J36966o5004f416l08245a14277A23909f8649j1110
12376g9759A58382B1631b644A5413J98430h57p4464B165c03467J03652b5320q4438
12364a09758A5076i3071j42507A70855A8426R8114b17606j70513A61482a67856
$$ y = [259003, -136958, -80855, 413940, -47606, 179686, -145660, 185615, -74379, -40752, -21658, 23840, -29609, -112383, -194715, -29743, 82500, -6244, 2081, -230870, 2052, -50021, 92019, -176108, 23505, -236984, 131259, 164870, -188280, 75637, -15385, -191197, 57023, -140392, 61489, -131426, 396928, 76276, 60811, -102623, 78008, 381760, 36304, 173200, -39964, -331017, 34555, 57565, 163417, 56451, -289799, 269785, -334582, -153873, 2960, -12909, -54085, 9324, -164127, 100509, 237475, 172471, -6416, -314661, -114277, 123909, -68649, -79759, 158382, 21631, -2644, 15413, 213843, -857, -75321, 2165, -303467, -199815, -25320, -109758, 15076, -93071, -235578, 170855, 18426, 116540, -217606, -388119, 161482, -167856]
12353B0616J44543g2356E01532A00726J44417b08853D3506f2917q4564p3828A44041
12341B02374a89186I639a45597A75192b22657I643a36345j97207B54064a43208
12330i8725A75636b06886j32967a52663e9587B41424a13842J9926F4642b3680
12319A25585r324C2692i5444l50536B04155p3207c82485E00152b33124i4073c1004
12307i9032c3987A15409m7180N5405c70470A2142L12362A02283f7337B71993A6527
12295a41362O0902A6610R0647a93463G8245K35050h5151F8987q601o696O3398
12284A17088f8707l9131G9073g4421B61555J72916A64211a09970M6571m7283B43194
12272D5568J14194n1168d3890j90843C19808A12979R984d08769A2306J42641R5410
$$ y = [20616, 165159, -72356, 501532, 100726, 245143, -208853, 43506, -62917, -147481, -221309, 144041, 202374, -189186, 9639, -145597, 175192, -222657, 9643, -136345, -333552, 254064, -143208, -98725, 175636, -206886, -339853, -152663, -59587, 241424, -113842, -93916, 64642, -23680, 125585, 116261, 32692, -95444, -445980, 204155, 130948, -382485, 500152, -233124, -94073, -31004, -99032, -33987, 115409, 68229, 123634, -370470, 12142, 324504, 102283, -67337, 271993, 16527, -141362, -80460, 16610, 107257, -193463, 78245, 313295, -85151, 68987, 60386, 53690, 117088, -68707, -107838, 79073, -74421, 261555, 434471, 164211, -109970, -63399, -110682, 243194, 45568, 159762, 108594, -43890, -234733, 319808, 112979, 122963, -408769, 12306, 154947, 250357]
12261B50357C1489A2705L2957K99312j2373B0825J12237L57643a97540B3466L26603
12250C50069A35910a1428B63556j30644g0191j0872A04441j9564a29948A08387
12239I2136P2604E4184d2398A08253K96882c8475M900B13359A3333e5559I8051
12227A10046G896a20065b299B37726a9051A65407J70301J9935A07559J11800a41245
12215B54454M0114J19434j40796L0970I6915L07633q1373q8017A06171n570A4316
12203e1634C15804N4114j19351j06160K48516O6231a48039b813A02188C9692g5223
12191b8710C99692b77075C10454A15030J61158A09735K37926J48571C3250g9073
12180D07586j37422G0582K52546A49607N9543K70381k19771G1940j2381j0643
$$ y = [250357, 31489, 12705, 45662, 344974, 332601, 20825, 133062, 490705, -197540, 23466, 350069, 135910, -11428, 263556, 132912, -70191, -81063, 104441, 84877, -129948, 108387, 92136, 164740, 54184, -42398, 108253, 405135, -38475, -33575, 213359, 13333, -55559, 98051, 110046, 7896, -120065, -2299, 237726, -19051, 165407, 335708, 355643, 107559, 219359, -141245, 254454, 294568, 414002, 273206, 304176, 96915, 404548, 323175, 235158, 106171, 100601, 14316, -51634, 315804, 369918, 250567, 144407, 392923, 459154, -148039, -2813, 102188, 39692, -75223, -28710, 399692, -277075, 310454, 115030, 276188, 109735, 347661, 496232, 33250, -79073, 407586, 270164, 70582, 323128, 149607, 209150, 479531, 259760, 71940, 59559, 48916]
12170D8916L50006A62721J2523p9638b8440E06554k29314E4133J19839J42425
12160C16397p5036p0630n2081K8902c0848A20458E8275L00937A15034m1236h3518
12148C59996a37586A71534B7467a98511c6168A01581A7518K09023N0047b1656
12137a55328A09807J93471j48648h9800I7378d76062A01124J19927c0382A18656
12126B53023a4607A5650a08504K2451A72986D5448K09424e7101j9403C326d17728
12114B69386q1227G1979d1162p3188j11375n716b3386B31355a08424D3980R7817
12103A41797b015B26667I8003a36506m8838a165B16826a52344f4814k2235p031
12092i4080A44608m3305b90042O7026L3760O4087G3353f8934A6439M7181J11988
$$ y = [48916, 398922, 162721, 175244, 95606, -28440, 506554, 277240, 54133, 173972, 316397, 241361, 170731, 118650, 147552, -30848, 120458, 58275, 359212, 115034, 73798, -83518, 359996, -137586, 171534, 27467, -198511, -36168, 101581, 17518, 226541, 276588, -21656, -155328, 109807, 303278, 154630, -89800, 97378, -476062, 101124, 221051, -30382, 118656, 253023, -14607, 15650, -108504, -86053, 172986, 45448, 254872, -57101, -76504, 3326, -417728, 269386, 188159, 71979, -41162, -114350, -225725, -231441, -23386, 231355, -108424, 43980, 141797, -2015, 226667, 98003, -136506, -185344, -1165, 216826, -152344, -64814, -87049, -94080, 144608, 101303, -290042, -223016, -189256, -125169, 73353, -68934, 16439, 63620, 175608]
12081A75608o4030J41032i349H6512l0872b0433l20288J10685i982A41907a71487
12069H6134b55199j02468a04537N603J4103j87025J30117B5655l291J92250G1011
12057a84470A36887l9808J31430R5228O35214j15555r5733A32082N5545p4508
12047A13119a81137A41737O9568A7195a38056I1043b24789Q3214b4780C01248
12036a24001F9655J38672h0042B20831K5639b49587R4404k12984C1367K38195
12026B69562a53728B70440p6474d8190k03036d8454h561A40689o7476J6464f9219
12014b83234k4017D064K52236a30323j9127J540A06988d5804k53339J7527Q9261
12003a92355A19795e5357k35607A61452D0570J26395p8815j1848b34522p2525
$$ y = [175608, 111578, 252610, -9349, 86512, 55640, -20433, -340721, -230036, -9982, 141907, -171487, 86134, -255199, -357667, -104537, -98934, -84831, -271856, -141739, 25655, 22364, 214614, 71011, -184470, 136887, 97079, 228509, 323737, 958951, 843396, 747663, 132082, 187627, 113119, -181137, 141737, 211305, 17195, -138056, 91043, -224789, -141575, -24780, 301248, -124001, 69655, 208327, -80042, 220831, 246470, -249587, -155183, -368167, 31367, 269562, -153728, 270440, 193966, -48190, -251226, -48454, -8561, 140689, 73213, 89677, -69219, -283234, -307251, 4064, 256300, -130323, -149450, -147910, 106988, -45804, -299143, -281616, -192355, 119795, -55357, -290964, 161452, 40570, 166965, 88150, 76302, -234522, -307047]
11993c07047J47169G8651M7792K01287b37846G859r02j152c11337A92729n8668
11982A34061a67860B29780D3419b60889a7946k90379B7925N1655c95499J21084
11972b74415L9211O9085A26981k0793J16417A1178J63081d8837B42976r0909A2434
11960A69306j057b47166C8641J13686a35769b4964q4486B7891R4988K7197Q6614
11949B36690E3729g9038b95A19835A3105a23441E13203e0185B4988b02033g557
11937A48178i3197H4751e4369A16933L2553b74201J16239k5718C07695a00561
11926a24409B2153a68734C44125F9463a06234C25098a02342j87340g0554q409
11916g8963L8690B27646A8916a39992E4388g6352G4891b2531A18346K37817B9499
$$ y = [-307047, -159878, 78651, 126443, 327730, -237846, 7859, 6957, 5805, -311337, 192729, 134061, -167860, 229780, 43419, -260889, -17946, -308325, 27925, 79580, -395499, -274415, -235204, -166119, 126981, 106188, 222605, 11178, 174259, -48837, 242976, 152067, 12434, 169306, 168249, -247166, 38641, 152327, -135769, -24964, -109450, 27891, 122879, 150076, 236690, 53729, -79038, -295, 119835, 13105, -123441, 513203, -50185, 24988, -202033, -7557, 148178, -93197, 84751, -54369, 116933, 149486, -274201, -157962, -183680, 307695, -100561, -124409, 22153, -168734, 344125, 69463, -106234, 325098, -102342, -289682, -70554, -78963, -40273, 227646, 18916, -139992, 54388, -76352, 74891, -22531, 118346, 356163, 29499]
11904c0596j47334j08703F3322a1876p6475p822D9299i761j49007J474J6646q5418
11892b26066A62975b28857r6712P3197a26070a9973j18196n6050j29152A91587
11881b17234c8466k667A45468j4941j4805O5260P4849j22808a46394E0661a43420
11869a24079B42310Q397F5376Q9010J55668D8477f7988A22455c06931A48759c25176
11857G6267K3945c24011A71410a21596O0310A16712Q7099a97243D6114Q8533h8052
11845h3816k11347K432A8579K36077c15480C2545c06824j19290a37789A16680
11834a26858b0601o6057C07038p2627a15608I7948J24046e3931P454j696E9295
11822a9833A3271a1481j81687F9529D918a76529R064o8698h1899L8842J9105C5696
$$ y = [-30596, -177930, -286633, 63322, -11876, -88351, -96173, 49299, -9761, -158768, -157294, -140648, -226066, 162975, -228857, -325569, -252372, -126070, -19973, -138169, -194219, -323371, 191587, -217234, -38466, -41133, 145468, 130527, 115722, 180982, 255831, 133023, -146394, 50661, -143420, -124079, 242310, 250707, 65376, 154386, 310054, 48477, -67988, 122455, -306931, 148759, -325176, 76267, 100212, -324011, 171410, -121596, -61286, 116712, 203811, -197243, 46114, 134647, -88052, -83816, -295163, -292731, 18579, 254656, -315480, 32545, -306824, -426114, -137789, 116680, -126858, -20601, -86658, 307038, 234411, -115608, 97948, 221994, -53931, -46477, -48173, 59295, -19833, 13271, -11481, -193168, 69529, 4918, -176529, -167465, -236163, -81899, -43057, -23952, 35696]
11809b64257C16072d9554B25603a68749j35859a36031A5138N0701b39806D3921
11798B93360b696j14292B1832c06227a26221A72594h3868k8007F4359O3135f4971
11786A09316c79689a1785j18732j86740c5446k74624H3571a63309n7211A24247
11775b84441a41537a809l99073A68302O1616g9332a5008k9005k06302A17246h7219
11763d2658m9655j00366h7412h94j8681j28466F3305D18K54720b58131Q1698j26712
11751c03145a06018a5982k73883h2316F4838a22571f1156j96409B0701b10589
11740f363H4686j0697d47k06678B33732d6763k88906M6464d6553p0278A21832
11728A39257a36723f157j35471d1106C1306a89816A37936k687J56767b33282b1787
$$ y = [-264257, 316072, -49554, 225603, -168749, -304608, -136031, 15138, 65839, -239806, 43921, 293360, -2696, -116988, 21832, -306227, -126221, 172594, -83868, -111875, 64359, 127494, -64971, 109316, -379689, -11785, -130517, -317257, -35446, -310070, 83571, -163309, -220520, 124247, -284441, -141537, -1809, -400882, 168302, 229918, -79332, -15008, -44013, -250315, 117246, -87219, -42658, -92313, -192679, -87412, -894, -19575, -148041, 63305, 418, 255138, -258131, -176433, -303145, -106018, -15982, -289865, -82316, 64838, -122571, -61156, -257565, 20701, -210589, -6363, 84686, 73989, -447, -207125, 233732, -46763, -335669, -289205, -46553, -116831, 121832, 139257, -136723, -6157, -141628, -41106, 31306, -189816, 137936, 135249, 292016, -233282, -21787]
11716a35253R393G6418O7537e6658j60945l5699A57163b13677a5576j09251H7019
11704a955A4675L19989a19431A49903c8591l7206C9826b44259A92979p5914L9320
11693A56385d4969o3198E4877O0440D2350e8162A39193j99a3342k21581r2388
11682c27311d8933C05908b24569B5249J24817K04821q0079B6112J19566R9693
11672B45371M5295A6210J71727c24385F5031a15661H1004a30740F5413J00807
11662A66220G4907J6834j012a52781B41792c44507D0530c1699O528C6698a11365
11650D1768K5151K35501C6933M9878K8758a47500j02582C0110i7607A97594a22581
11638A31617b73762A8278a26152D9326f0711p7987N2019c0239B41319c072l307
$$ y = [-135253, -125860, 76418, 143955, -56658, -217603, -253302, 157163, -213677, -15576, -124827, 87019, -1955, 14675, 334664, -119431, 149903, -38591, -75797, 39826, -244259, 192979, 117065, 156385, -44969, -108167, 54877, 115317, 42350, -58162, 139193, 138994, -13342, -234923, -327311, -48933, 305908, -224569, 25249, 150066, 354887, 274808, 26112, 145678, 245371, 290666, 16210, 187937, -324385, 65031, -115661, 81004, -130740, 65413, 166220, 74907, 91741, 90729, -152781, 241792, -344507, 40530, -31699, -25171, 36698, -111365, 41768, 66919, 302420, 36933, 86811, 115569, -147500, -250082, 30110, -97607, 197594, -122581, 131617, -273762, 18278, -126152, 49326, -60711, -138698, -86679, -30239, 241319, -3072, -6379]
11627f379A45042l6235M7745J22198A29552K17409A6171N8801K19778H1151a24517
11615A8317K16688D2089R870J84184m7614K4950I6883q637b13003B27319Q7985
11604C15304j46756C6511B271h0311k38018A79760J66662h4733j9379N0245C53091
11592B07018a24823p6466A26042a64835n9762L5605a0874q888A56119G3521j5390
11581E8131f9345O839j25102P6806c4239m8757B83727I2998j2800L80032j15063
11570C45167A45490J40084r182a63877B48588E4846B675J74423O4355G4898a7297
11558B2582K3522M16621h7266A68261j2864q776J26915P758K111m7721I0384K10943
11546C01327e776A91373q6852h0837A22294B021K57607i6032c1828n1741j6898
$$ y = [-6379, 145042, 108807, 156552, 278750, 129552, 346961, 16171, 74972, 294750, 81151, -124517, 18317, 235005, 42089, 51959, 236143, 188529, 213479, 96883, 88246, -213003, 227319, 315304, 168548, 36511, 2271, -80311, -318329, 179760, 346422, -84733, -104112, -53867, 353091, 207018, -124823, -201289, 126042, -164835, -224597, -188992, -10874, -19762, 156119, 73521, 58131, -69345, -62506, -187608, -110802, -34239, -82996, 283727, 92998, 80198, 460230, 345167, 145490, 285574, 276392, -163877, 248588, 54846, 2675, 177098, 241453, 74898, -17297, 22582, 46104, 462725, -87266, 168261, 155397, 146621, 273536, 281294, 283405, 235684, 90384, 301327, -5776, 191373, 104521, -80837, 122294, 2021, 259628, -96032, -31828, -83569, -100467]
11535a00467C347b9669G3628J1939G671a28997O0255B62343J6059A8320f5052
11523A04784l2828H499g8803B29681b50230A79082d1063C14709q6256A07626o454
11512A01172J5691J03039P109r3628m4461k5259L47528H5758a20926B12686a60553
11500b12415J00867e4567A55833o1218J91276D666R9506R2308o3441n8428j1955
11489F2656K41594a51673B60239I3755k7597Q9483h3837A93175J6317C6556K39341
11478B75897A26183O6013j1535j4612a12289B7995L9235K78397m9315C930J15546
11467A19476L09208g5947q2884C12913D2204a15538c8608G8408N5385d1063C13168
11455D4795J80796n240B0943a91205G78a40570A79028J4117F0915K48660i8405
$$ y = [-100467, 3347, -29669, 73628, 85567, 7671, -128997, -68742, 262343, 278402, 18320, -65052, 104784, 71956, 8499, -78803, 229681, -250230, 179082, -41063, 314709, 228453, 107626, 101172, 116863, 219902, 227011, 133383, 88922, 63663, 411191, 85758, -120926, 212686, -160553, -212415, -111548, -54567, 155833, 94615, 285891, 4666, 104172, 196480, 133039, 74611, 62656, 304250, -151673, 260239, 93755, 66158, 155641, -83837, 193175, 209492, 36556, 275897, 126183, 192196, 180661, 166049, -112289, 27995, 67230, 345627, 296312, 3930, 119476, 428684, -75947, -158831, 312913, 42204, -115538, -38608, 78408, 133793, -41063, 313168, 44795, 225591, 220351, 20943, -191205, 778, -140570, 179028, 193145, 60915, 309575, -98405]
11443a34541f4844N547j4392A82346h12C88807B1553K19189q6434o0557l2822
11432F0929N64751A83929L09221g723j30469A37173d4870B59252f5638g858A17254
11420B37897C377J17003a57506N7511p2777A99725n0904b33191A02381d0585j34886
11409a75471C18770D8266J4651a24019K8606C15078a22302A45998K461m8503J0041
11398A09997K6701A3815e03855B37598c2876D41620a36273A36829K30573d58681
11387C3389e5107l622C8107c7055m2886A2257O6668R414a6409k9830I1474d6449
11374i3424c579k455r7523B15752D2030a4576j01166k5845b0650l9483D2853P9278
11362A22131a58135A11547P3899b21536C6077J21200A5857J02279J27723A3514
$$ y = [-134541, -64844, -59297, -73689, 182346, -812, 388807, 21553, 240742, 154308, 93751, 60929, 625680, 183929, 493150, -7723, -138192, 137173, -44870, 259252, -65638, -7858, 117254, 237897, 3377, 120380, -157506, -99995, -172772, 199725, 148821, -233191, 102381, -40585, -175471, 318770, 48266, 62917, -124019, -95413, 315078, -122302, 145998, 148459, 99956, 109997, 136698, 13815, -503855, 237598, -32876, 441620, -136273, 136829, 367402, -458681, 33389, -55107, -58729, 38107, -37055, -79941, 12257, 78925, 88339, -16409, -46239, 91474, -46449, -93424, -3579, -6034, -103557, 215752, 42030, -14576, -115742, -141587, -20650, -60133, 42853, 122131, -158135, 111547, 185446, -221536, 36077, 157277, 15857, 118136, 245859, 13514]
11351B18111j06771i9510l0984C0109R6181a42287B01557F4237d47853e202j86627
11340a91829p595j03757C9263M7258l0579f8201R869j00250B2628J0362a37501
11328B71099a15457A7434O1367R342l5042b15830B9376g4848b5877m9741K2739
11317e2879C19971A04452g8427C36065C6514b50387f7084A97119H8866l9857J07446
11306A56455J86096i5070C51706A20398k477D3959d6947F7959Q0655p1642J21219
11295A98191n959a9944j02517D0184K6197P9046h9169F65L07986e27715F0390
11283a67217A73370D6026q51b77804G3141a97561L8510D5166K350i4938j8975
11272a13913j61912A75151b2603B6393a47449A4858a51515l5273j03666a44827
$$ y = [218111, 111340, -99510, -130494, 30109, 126290, -142287, 201557, 64237, -447853, -5202, -191829, -199424, -303181, 39263, 86521, 55942, -68201, -58332, -158582, 22628, 32990, -137501, 271099, -115457, 17434, 78801, 88143, 53101, -215830, 29376, -74848, -25877, -75618, -52879, 319971, 104452, -78427, 336065, 36514, -250387, -67084, 197119, 88866, 49009, 156455, 342551, -95070, 351706, 120398, 117921, 43959, -46947, 67959, 148614, 76972, 198191, 192232, -19944, -122461, 40184, 66381, 145427, -89169, 665, 308651, -527715, 60390, -167217, 173370, 46026, 45175, -277804, 73141, -197561, -159051, 45166, 47516, -94938, -113913, -275825, 175151, -22603, 26393, -147449, 14858, -151515, -186788, -290454, -144827]
11261i037k13419a425l40414I3480b84765o2640A93385a11074i657j53654A09640
11249d15928E2141g3599C61494b46951A57144b24663a2077m7425E3153b9346C3904
11237a1017j64807j85894a64187P1135A27713a81066A55995f7509B06762c49619
11226D5466N0189c276l46078B25650i3525q7423F7963j6969K2331b15455L2358
11215a83097O1360n8470A86630a37587g419G5837g9695k62479H0531b02695P2567
11204a30128G4062D793a032p734A10398P0872H4624e2098j49291K4297k3187g0530
11191a57295B48337e2383p3426C45596l794j14589g080j4134G4462O61d08575
11179f8522l23147B94116a53305a8525A22208a84289b3495j88648i345m76876
$$ y = [-9037, -222456, -1425, -341839, 93480, -284765, -347405, 193385, -111074, -9657, -163311, 109640, -415928, 52141, -73599, 361494, -246951, 157144, -224663, -12077, -59502, 53153, -29346, 33904, -11017, -175824, -361718, -164187, -93052, 127713, -181066, 155995, -67509, 206762, -349619, 45466, 95655, -3276, -349354, 225650, -93525, -180948, 67963, 50994, 73325, -215455, -183097, -121737, -180207, 186630, -137587, -7419, 75837, -79695, -342174, 80531, -202695, -130128, 74062, 4793, -1032, -8766, 110398, 181270, 84624, -52098, -201389, -177092, -200279, -70530, -157295, 248337, -52383, -125809, 345596, 341802, 227213, -7080, -21214, 74462, 75123, -408575, -68522, -391669, 294116, -153305, -18525, 122208, -184289, -23495, -212143, -9345, -486221]
11169d86221e1909B70133h745H4625c79232H2214A2208Q1421c92668f3567h451
11157F6331J20787J24078a43090H5641A2467g7217k94455A430K03243D8630j0706
11146C7924M56138b95925k45503b67138i6356k24602f6914j80843B67455E8857
11135a2224n6311D0795i4158c8243k23390d1843D55584j70762A14904c1641j47791
11124a79432A80989c0726A22061a86325m5094p0449a15026a7795A48108c16896
11113A37347L10381l856C7093P4115b15678B29184J48248c8641D9774f5504I3910
11101E0428O2463b79522A67834G9653c76979A49606b18524M6808B48357n6490
11091A91867L197r0191l5096P1917Q9937b31985C61369E7350J02119J54971a39494
$$ y = [-486221, -51909, 270133, -8745, 84625, -379232, 82214, 12208, 93629, -392668, -63567, -8451, 66331, 187118, 311196, -143090, 85641, 12467, -77217, -371672, 1430, 204673, 48630, 37924, 494062, -295925, -541428, -267138, -96356, -320958, -66914, -247757, 267455, 58857, -12224, -68535, 40795, -94158, -38243, -261633, -41843, 455584, 284822, 114904, -31641, -179432, 180989, -30726, 122061, -186325, -231419, -301868, -115026, -17795, 148108, -316896, 137347, 447728, 443872, 37093, 111208, -215678, 229184, 377432, -38641, 49774, -65504, 93910, 50428, 112891, -279522, 167834, 79653, -376979, 149606, -218524, -171716, 248357, 191867, 195064, 104873, 69777, 141694, 231631, -231985, 361369, 57350, 159469, 314440, -139494]
11079E1604J38102E0267R2506L4106m5557J8245l6915J2509K66438Q7876k11072
11068B68403B8337J79537h792D98901A23145K5903J83235L4419j09839M8093E5711
11056D59899A20271K23370E6673K6604M45681m5320j12780L68286k60587J13037
11046E91594j87169J8621L03709M2177k43326r5207K85336A69503J61570J48260
11036D79333J60022J72803l4831n773j24695K43000j2672j11754l54233k2816
11026C88384L14386B52080M39275K14275k33352J26447l59030J04988k2573j32174
11016C89936N38299o2888D04505L16869P488k06623R8339M71320l79689j94000
11006E18209L46217j9074l57114k0127N6939L9705M47962k45573k39550K65968
$$ y = [51604, 189706, 50267, 142773, 176879, 131322, 149567, 112652, 125161, 391599, 479475, 268403, 28337, 207874, -8792, 498901, 123145, 149048, 332283, 366702, 256863, 304956, 55711, 459899, 120271, 343641, 56673, 83277, 528958, 483638, 370858, 739144, 478557, 591594, 404425, 423046, 726755, 768932, 525606, 430399, 715735, 169503, 331073, 479333, 639355, 812158, 777327, 771554, 646859, 889859, 877187, 765433, 411200, 388384, 702770, 252080, 691355, 905630, 672278, 798725, 439695, 544683, 522110, 389936, 928235, 865347, 404505, 721374, 728862, 522239, 620578, 1091898, 712209, 518209, 864426, 845352, 488238, 468111, 525050, 564755, 1012717, 767144, 527594, 793562]
10996G93562j98667n7415j28840L46913C46859M68696j95780o7157J8264l1603
10986E39279K31004B82963J17383M46219C99696J26653J68197l3238r0158M92004
10976A063154J43682n45563M62387k13057n2145K68644J84903Q6254K08532m84552
10966A122239Q894J64494J03249r8339N03245J44645p1278N94526j19929O9749
10956B421495L37050j2732J03008j89962l05246j91663K0114k40206N67226k96444
10946B212640m8891P864n3638R3720j56267L4182n5810k39028k40072m0990m51512
10935A062198k73189L9242l43885M62375l61945L5298j54799o9301j63048L68902
10925F01848A46957J11886K12777A99665B0754K89903p0905K33346A07478k3403
$$ y = [793562, 594895, 537480, 408640, 755553, 346859, 815555, 619775, 552618, 570882, 539279, 770283, 282963, 400346, 846565, 399696, 526349, 694546, 661308, 571150, 1063154, 1206836, 661273, 1123660, 910603, 858458, 1127102, 1312005, 1398259, 1606791, 1122239, 1131133, 1295627, 1398876, 1300537, 1803782, 1948427, 1877149, 2471675, 2351746, 2421495, 2758545, 2745813, 2848821, 2658859, 2353613, 2161950, 2182064, 1941858, 2509084, 2212640, 2163749, 2171613, 2117975, 2211695, 2055428, 2089610, 2033800, 1794772, 1554700, 1513710, 1062198, 789009, 828251, 484366, 946741, 584796, 620094, 465295, 395994, 232946, 601848, 146957, 258843, 471620, 199665, 20754, 310657, 239752, 473098, 107478, 84075]
10915H4075J57726p8465B9238b7053k02325E5139a54330c0304l916G7431L15157
10904C92588a41027A57602e4792A61998b80433A29351C5221J26768a92716A29213
10893B12234A3592J45116d7314r1962A0670L96722a52583M2742L4709F0343a46373
10881D10853a67139d6540o2792M1342A55814J35976N1449r8843A02541l4871a20185
10869e5033j62937A06017a38136O2385A52670a64924A77915f4210L1884B59463
10858c8763j79195e2812o43A00359a87212F3028i3183L0219E4491J13829n0226
10847A18094D1826a36088F7955H417a37061H5803c5426C4157h6361j00132r4383
10836b80876A67031b25618C46840C3168b78655C9745a89836B30400q0218c10829
$$ y = [84075, 241801, 163336, 29238, -27053, -229378, 55139, -154330, -30304, -34220, 77431, 392588, -141027, 157602, -54792, 161998, -280433, 129351, 35221, 161989, -192716, 129213, 212234, 13592, 158708, -47314, -139276, 10670, 407392, -152583, -109841, -75132, 60343, -146373, 410853, -167139, -46540, -109332, -67990, 155814, 291790, 343239, 244396, 102541, 67670, -120185, -55033, -217970, 106017, -138136, -75751, 152670, -164924, 177915, -64210, -32326, 259463, -38763, -217958, -52812, -53455, 100359, -187212, 63028, -93183, -62964, 54491, 168320, 118094, 41826, -136088, 67955, 8417, -137061, 85803, -35426, 34157, -86361, -186493, -280876, 167031, -225618, 346840, 33168, -278655, 39745, -189836, 230400, 150182, -310829]
10825B1975a57030C9066N9868O0804b4397A66160b68759c2359j63023B70968b29210
10813A20103D2357h102p3620n5709J7941A04554c1397l45159G6324l5938J37853
10802A78239f3209H5499a07195J5483k1690C08701a90523c4728A28846b2402A48058
10790B60883B7841b30439r8954B1703b0439m1880a4932j02273k61412a07146B08480
10778I6067b06785c4005A42336g7584k22895F5035e755n2567B8586b80552a04995
10766F1725a83956A72542a12036H0584J5162c04639a30297j02250P0819b9122
10755b67477A4001b11182j5050A86898J99429A64011a27322B17016a14492A24181
10744h3536A71526c94455G3025K14874j14594L1055c65826a60303B07109a50870
$$ y = [21975, -157030, 39066, 98934, 159738, -24397, 166160, -268759, -32359, -195382, 270968, -229210, 120103, 42357, -8102, -81722, -137431, -119490, 104554, -31397, -376556, 76324, 40386, 178239, -63209, 85499, -107195, -91712, -113402, 308701, -190523, -34728, 128846, -22402, 148058, 260883, 27841, -230439, -329393, 21703, -20439, -62319, -14932, -117205, -378617, -107146, 208480, 96067, -206785, -34005, 142336, -77584, -300479, 65035, -5755, -58322, 28586, -280552, -104995, 61725, -183956, 172542, -112036, 80584, 95746, -304639, -130297, -232547, -161728, -29122, -267477, 14001, -211182, -226232, 186898, 386327, 164011, -127322, 217016, -114492, 124181, -83536, 171526, -394455, 73025, 287899, 173305, 204360, -365826, -160303, 207109, -150870]
10733B7811a58988P8429j71385C91905b81792g8851j09843Q2232A12116D6678
10722A12696J22641C9053N3788K97970a22088l72550D1282b86994A38183a09659
10711a17056F6370k1478b8886j59964A59540a60832a3018j86243P2386A36427
10700a05366k57563a1709l59080a45558b1625j32841f0668A17957a30462G1047
10689b78110G0487b13533K574Q1715K1936j90454a26567n862e6523k64504c3285
10677a71307p9335l0061F1608a09704F9319a03408a4253m8718m88873g6071C83687
10665B0232b2280a1082M05A70404K59816p6680I4965a61760d7518A09608d6010
10653a93136B2837O9395K57543a20005m30869b35041f7922k07490g9858p6939
$$ y = [27811, -158988, -80559, -251944, 391905, -281792, -78851, -188694, -106462, 112116, 46678, 112696, 235337, 39053, 92841, 390811, -122088, -494638, 41282, -286994, 138183, -109659, -117056, 66370, 44892, -28886, -188850, 159540, -160832, -13018, -199261, -126875, 136427, -105366, -362929, -11709, -370789, -145558, -21625, -154466, -60668, 117957, -130462, 71047, -278110, 70487, -213533, -210959, -129244, -107308, -297762, -126567, -132429, -56523, -321027, -33285, -171307, -250642, -280703, 61608, -109704, 69319, -103408, -14253, -62971, -551844, -76071, 383687, 20232, -22280, -11082, -10677, 170404, 430220, 353540, 94965, -161760, -47518, 109608, -46010, -193136, 22837, 92232, 349775, -120005, -550874, -235041, -67922, -275412, -79858, -156797]
10643a56797c7512j35031c073j68843k2637B80047a4974j68699A3906Q2951b70164
10631a57762m40J6999q683d1667A09642b28867J09761m6140Q2043D8268f5761
10619c4893B59174a16740j44492B29993d4282G244c04648K8981M1675M9559f9735
10607I6439J4781c2599k28214i4989k1742C05563b5551B65228c1823A846J7980
10596A9826b63340b0125j67361F3637J44897a85167F3876r411d29763A1341D70
10584c68867G3446E640f4665j27873A57285c307B13014e4436o6563A9275a04681
10572A76789J90815e621k84608R7021M5029L5763b9818A81787a23765j69033P5105
10561b17693A23392h8084A70797g7213A22644R9928G2041B0970i8818A41107G0302
$$ y = [-156797, -37512, -172543, -3073, -171916, -194553, 280047, -14974, -183673, 13906, 96857, -270164, -157762, -158202, -141203, -149886, -41667, 109642, -228867, -119106, -165246, -83203, 48268, -65761, -34893, 259174, -116740, -261232, 229993, -44282, 7244, -304648, -275667, -233992, -184433, -69735, 96439, 111220, -32599, -260813, -94989, -116731, 305563, -25551, 265228, -31823, 1846, 19826, -263340, -20125, -187486, 63637, 208534, -185167, 63876, 54465, -429763, 11341, 470, -368867, 73446, 5640, -64665, -192538, 157285, -3307, 213014, -54436, -120999, 19275, -104681, 176789, 367604, -5621, -290229, -193208, -148179, -112416, -29818, 181787, -123765, -292798, -217693, 123392, -88084, 170797, -77213, 122644, 222572, 72041, 20970, -98818, 141107, 70302]
10549D2595j2434b7269B57866f1625A7601M2751L13462g6751F7904a85383J9171
10538a66212j37467I2694a47670p8020D289d594j44647j04942D8033g9614j66926
10527b46540P2735A21259a42332G0768A1085J00361A5217f2496C5967f3106b128
10515c58348E9853g962A7938L8933a93607j24445a08354c3154j08880m1264J3674
10504a69624q7110J5741a5027A0926a96023A82161E2354B5973i4077j96739J17791
10493a73025l94882E3653Q9496J00190f3383b4682j72121C6916J60865b965A5563
10481A70131a92234h4653l508A42375a13931m2332a9061k0941j03279A13127b08390
10469a19783p4293B18894j1384J35498Q2104j09970L27275B07584O3711G0714
$$ y = [42595, 30161, -27269, 257866, -61625, 17601, 60352, 373814, -76751, 67904, -185383, -166212, -303679, 92694, -147670, -225690, 4289, -4594, -149241, -254183, 48033, -79614, -246540, -173805, 121259, -142332, 70768, 11085, 111446, 15217, -62496, 35967, -63106, -2128, -358348, 59853, -7962, 17938, 56871, -193607, -318052, -108354, -33154, -142034, -183298, -169624, -256734, -240993, -15027, 10926, -196023, 182161, 52354, 25973, -94077, -290816, -173025, -567907, 53653, 143149, 243339, -63383, -24682, -196803, 36916, 197781, -2965, 15563, 170131, -192234, -84653, -88161, 142375, -113931, -156263, -19061, -40002, -143281, 113127, -208390, -119783, -194076, 218894, 207510, 343008, 425112, 315142, 642417, 207584, 271295, 70714]
10458B65271d5309l5616j14189A07565b2288A40320n3817M1414D6521a19026E4910
10446b02378A82802j563c6367H3174a74614E8280a09326R945k52232a01945k93879
10435c95824A30273m9713d0824B9986L0601L2383C5848P962J90511D6568R3578
10424A40146a55255d7239B6736o54N6269c99346a57949N9067A0751b79854R1345
10413a88509F7435a22840D3741K34201G9065f5529E2054J3762a55630B00204k8007
10402A72197o2277g0545k40471a13102H5201Q6971F7559b19894j2029K2110B16671
10390C99410A66142K52670j85112i737q2445r5470g4000B25142a6300e381k10917
10379b16298J5694C43918H1632J80773L9925L3195a03135D1148K15572b12629
$$ y = [265271, -45309, -80925, -195114, 107565, -22288, 140320, 86503, 127917, 46521, -119026, 54910, -202378, 182802, 181239, -36367, 83174, -174614, 58280, -109326, -99381, -351613, -101945, -395824, 130273, 80560, -40824, 29986, 60587, 92970, 35848, 43810, 234321, 46568, 140146, -155255, -47239, 26736, 26082, 82351, -399346, -157949, -98882, 10751, -279854, -188509, 67435, -122840, 43741, 277942, 79065, -65529, 52054, 65816, -155630, 200204, 172197, 109920, -70545, -311016, -113102, 85201, 172172, 67559, -219894, -231923, -209813, 216671, 399410, 166142, 418812, 233700, -9737, -92182, -187652, -74000, 225142, -16300, -5381, -216298, -200604, 343918, 81632, 262405, 302330, 335525, -103135, 41148, 256720, -212629]
10368A69162F5229B0814c137C38665a7826C40705o3789H2686J47906H1636Q843
10357I0479K43710q3268R1813J51459c3584A16110J49323H3630K2458J41340p6650
10346A70778K53530A98611J39676D2475K64975q4553K11110J58900j53339k07379
10336B32189K89749r2302J06309R9043r1093R6122B90161M35a478C95947A10153
10324A02216N8479m3431O5771J96435A80136n3049N0519K21827e9340A96523o9095
10313A27428K22058f2185J5904p5569C5998a5648A15200O9264a84675D9294r794
10302C9500L1511n520M41897G8810B8586c2316P053i82A09522D5864L16501a26944
10289a00255B68521c3155j5449A9921a10846Q725j04313F6974l228c17924h6992
$$ y = [169162, 65229, 20814, -3137, 338665, -17826, 340705, 276916, 82686, 230592, 81636, 90479, 334189, 250921, 342734, 494193, -33584, 116110, 265433, 83630, 106088, 247428, 170778, 424308, 198611, 338287, 42475, 307450, 222897, 434007, 592907, 439568, 232189, 521938, 429636, 535945, 634988, 543895, 640017, 290161, 290596, -1478, 395947, 110153, 102216, 160695, 117264, 183035, 379470, 180136, 127087, 177606, 399433, -59340, 196523, 127428, 349486, -62185, -46281, -121850, 35998, -15648, 115200, 184464, -184675, 49294, 39500, 71011, 65491, 507388, 78810, 28586, -32316, -25263, -982, 109522, 45864, 362365, -126944, -100255, 268521, -33155, -48604, 19921, -110846, -102121, -206434, 66974, 63746, -317924, -86992]
10277A65050O9130I7599J6037C3365a02906r2325h4857D9816a97660c2118k5097
10266e7215k39177A33288a03484k26083A70724F6913f8671J6877g569j30792e6246
10254f5892A70554b27507j50549A67041f5277J8009o4538N3777B04811K8375J56010
10243C89196E0268K01863j8183A9837L34608H5503C4991K60881a274A84029k7971
10232A56058A8250K6266d06071a98457k15284J17735B00932B963b39302A37652
10221a62537A29409K43711D8080J4193b40161f7862k81891G8580j0118a60000
10210c57018A54090h5243B9304A1810R4567a11412H571L02550a69589P0765j89212
10199b88036C59980b51507G23J2103d2967k9627p2668C38949D4688j5982h5989
$$ y = [165050, 234180, 97599, 113636, 33365, -102906, -195231, -84857, 49816, -197660, -32118, -57215, -296392, 133288, -103484, -329567, 170724, 66913, -68671, -51794, -7569, -138361, -56246, -65892, 170554, -227507, -378056, 167041, -65277, -47268, -111806, -58029, 204811, 233186, 389196, 50268, 252131, 233948, 19837, 354445, 85503, 34991, 295872, -1274, 184029, 156058, 18250, 44516, -406071, -198457, -413741, -296006, 200932, 2963, -239302, 137652, -162537, 129409, 373120, 48080, 62273, -240161, -67862, -349753, 78580, 68462, -160000, -357018, 154090, -85243, 29304, 11810, 106377, -111412, 8571, 311121, -169589, -98824, -288036, 359980, -251507, 723, 12826, -42967, -72594, -145262, 338949, 44688, 28706, -85989]
10187G1615b78483l2135a00100j20397J3406c3030m6492n9173N1171L9777r9307
10176a47054E7900a93482E6801Q7892m7849a5639j75393O3922e9032F0037a3511
10164a69913q3331B5250a9630j74748H4664c7246d057k01611g2395k683G683c23433
10151a63834g8066l37388g2296P638A92212J5135A7101b13998H210K46300d84
10139b36259i1456j21361D0719c04166D5975c94526a1834B6469b36230N0005A49261
10127d19904A37465a85491d6637A63279o2854b77860d9385j50563B91780a93909
10116b00387E984J61218a55649A55865d54737d2727I9353b71760d7940m9662j4762
10105a12364I2351b16149i2102j55332E9192K8803h8538j1879l8316B22752e7226
$$ y = [71615, -278483, -310618, -100100, -220497, -207091, -33030, -79522, -138695, -87524, -47747, -147054, 57900, -193482, 56801, 144693, 96844, -15639, -191032, -127110, -59032, 60037, -13511, -169913, -253244, 25250, -19630, -194378, 84664, -37246, -4057, -205668, -72395, -75078, 7683, -323433, -163834, -78066, -415454, -72296, -64658, 192212, 207347, 17101, -213998, 8210, 254510, -484, -236259, -91456, -212817, 40719, -304166, 45975, -394526, -11834, 26469, -236230, -186225, 149261, -419904, 137465, -185491, -46637, 163279, 100425, -277860, -49385, -199948, 291780, -193909, -200387, 5984, 167202, -155649, 155865, -454737, -42727, 99353, -271760, -47940, -97602, -112364, 92351, -216149, -92102, -247434, 59192, 87995, -88538, -100417, -138733, 222752, -57226]
10093A26661J26403B321J10336e8812K8996q3054o7888M3229j6810O9000l92230
10082d77569A08232m9486M7516a90870A4457b77816J21639C1581a05228J8370
10072h6858e876B49931q9451a80236A84553n478a74431A25430F0202b66356G5292
10060c55943A39833e1284I4290a35290c4980j4433D5009c07181c0192A53502a7756
10048f4224m3951I3333D051a19338j57335A16131c24258A40712B9262B400d9922
10036d1826D4121L50431b58316B7160a09795n31580A43355D6573b11006A06925
10025c42604a53281J5470k8087C27460C8981j1401J17672k9110c654l6272n3623
10014i3549n9492B3096b16575A04276g4332j47070H1340f0536l17805J29665B95004
$$ y = [126661, 253064, 2321, 112657, -58812, -29816, -112870, -180758, -137529, -154339, -85339, -477569, 108232, 58746, 106262, -190870, 14457, -277816, -156177, 31581, -105228, -86858, -5876, 249931, 160480, -180236, 184553, 179075, -174431, 125430, 60202, -266356, 75292, -355943, 139833, -51284, 94290, -135290, -34980, -49413, 45009, -307181, -30192, 153502, -17756, -64224, -108175, 93333, 4051, -119338, -276673, 116131, -324258, 140712, 29262, 2400, -49922, -41826, 44121, 394552, -258316, 27160, -109795, -641375, 143355, 46573, -211006, 106925, -342604, -153281, -137811, -165898, 327460, 38981, 27580, 145252, 116142, -3654, -39926, -93549, -153041, 23096, -216575, 104276, -74332, -221402, 81340, -60536, -378341, -248676, 295004]
10002B20725d75481a47330G7404b81507a25522L2279M2697E3567a7119k03198
9992b20317A28867N6510o0826f8652k44299i9334A02937a25897n0792H3490Q5932
9981A69422a52812A33568l5571c80299a31568f1830E965f6059A81429q7684g4801
9969c72393A99958e2119B6083L100M7362K2340b28530D8491j3851b00093i6623
9957D7091g3211f24A00011A8013L9734e06825J27215R7905f2697r2498C41171
9945B8648G675a22137n3013h3234G2614L3786b27285d9557k27703a9136r2607
9934a11743F3587a98178n3659a24281j8548j11711B54049d54818b05548c2651
9923A60794B8021a10168A37645b64639Q7043N8538q8938d9126k12338A23873a59318
$$ y = [220725, -475481, -147330, 77404, -281507, -125522, -93243, -50546, 53567, -17119, -220317, 128867, 185377, 124551, -68652, -312951, -99334, 102937, -125897, -176689, 83490, 169422, -152812, 133568, 97997, -380299, -131568, -61830, 5965, -66059, 181429, 93745, -74801, -372393, 199958, -52119, 26083, 29183, 76545, 98885, -228530, 48491, 34640, -200093, -96623, 47091, -73211, -624, 100011, 18013, 57747, -506825, -379610, -281705, -62697, -155195, 341171, 28648, 7675, -122137, -175150, -83234, 72614, 106400, -227285, -49557, -277260, -19136, -111743, 63587, -198178, -251837, -124281, -142829, -254540, 254049, -454818, -205548, -32651, 160794, 28021, -110168, 137645, -264639, -177596, -119058, -207996, -49126, -261464, 123873, -159318]
9911i4728G326a98732P1592m4985G3100b0227n3753a4279J187A69358f6791H8749
9898a76334j06218J9839l8937b6965F6387b85999N3625Q9516k1024j28328R7172
9887a95038c3897C12162b46557N2182G513R7567b0772A20334B2585J74589p7522
9876A19652i3349k06270f6617r6167E5589k4692b1598j08604j05983I813c19392
9864b27301G765a37833l8561A01646g7210k74905B2610a09762J889g818l7593
9853d5411A22577K61182a97145A43397a41919B8240a64848C1844a5728j92584
9843b08312M8535a3573n7497D4482a79774F9679c41607B26788C1340J32303F1548
9831e21744e8009p8479l0917K7349j57460G149a67766e252B13352a71038A1019
$$ y = [-94728, 7326, -198732, -127140, -172125, 73100, -20227, -73980, -14279, -13092, 169358, -66791, 88749, -176334, -282552, -262713, -301650, -26965, 66387, -285999, -232374, -142858, -163882, -292210, -195038, -33897, 312162, -246557, -194375, 7513, 105080, -20772, 120334, 22585, 197174, 119652, -93349, -299619, -66617, -162784, 55589, 30897, -21598, -130202, -236185, 9813, -319392, -227301, 7765, -137833, -176394, 101646, -77210, -352115, 22610, -109762, -107873, -7818, -45411, 122577, 383759, -197145, 143397, -141919, 28240, -164848, 31844, -15728, -208312, -159777, -13573, -71070, 44482, -179774, 69679, -341607, 226788, 31340, 163643, 61548, -521744, -58009, -136488, -167405, -140056, -297516, 7149, -167766, -5252, 213352, -171038, 11019]
9819C70055a16467K6366a748m4742q7168o3624A6997d30704A65751a4104A76894
9807B2351K0491j6228k596a25113k36856g5355k30132R3499a6775k21155B9010
9795h8099i1p514C25597a31753j5163E731f0398F2770J49251b50601A0592a46610
9782a23207R731n2725k1144j72356g439r0104j75015D3077a18589M1128A42457
9770g3711H7997b3658e065I3155b40380e522k14624A17742f3212a4535q4447K4053
9758g4929k1811J9846j10118N2718c1793A36005L51645A36539d3478D2506a10542
9746a6431e765l27764B13593I4632b44917P1691K2057C0886a29675b9358n9832
9735h9190c2630k03696j91887H686Q5283b62024a10055o2806A9901K17438a70884
$$ y = [370055, -116467, -90101, -1748, -46490, -133658, -197282, 16997, -430704, 165751, -14104, 176894, 22351, 42842, 26614, 24018, -125113, -361969, -75355, -305487, -211988, -16775, -237930, 29010, -88099, -91, -7605, 325597, -131753, -146916, 5731, -60398, 62770, 212021, -250601, 10592, -146610, -123207, -113476, -166201, -187345, -359701, -7439, -97543, -272558, 43077, -118589, -77461, 142457, -73711, 87997, -23658, -5065, 93155, -240380, -5522, -220146, 117742, -63212, -14535, -98982, -74929, -96740, -76894, -187012, -134294, -31793, 136005, 487650, 136539, -43478, 42506, -110542, -16431, -5765, -333529, 213593, 94632, -244917, -173226, -151169, 30886, -129675, -29358, -89190, -32630, -236326, -428213, 8686, 93969, -262024, -110055, -172861, 19901, 237339, -170884]
9723d75711a43818E2688c35143K7592D2313a22001k94769A75694j4315b00965
9712H7255J77941f8622a3575l78793J88981M3624g6158B22951b54313f8475B7336
9700A22724L32851a33272J1517B5807f1q8697a8744j78992B20393d82467G791
9688D7984J0914b47594A39335A5156a87775c2863H8222f8468k79689J65910j94871
9677c77118J13806a4803A9766J20048l6777l8650k455a66335A5314O4790b14510
9665g9449o7057r5782i7647K195m4571D1142i9134m4973f5661k53027D9830a40903
9652h5855K2831m653a002B18588b18991e1456l7943I093e59283g1215j6146M729
9640h2632o640E7802J36027K5290H926b25376n6779e3436D0363b12731D6264a55413
$$ y = [-475711, -143818, 52688, -335143, -307551, 42313, -122001, -416770, 175694, 161379, -200965, 87255, 265196, -68622, -13575, -392368, -203387, -159763, -76158, 222951, -254313, -68475, 27336, 122724, 455575, -133272, -121755, 25807, -61, -88758, -18744, -197736, 220393, -482467, 7791, 47984, 58898, -247594, 139335, 15156, -187775, -32863, 88222, -68468, -348157, -182247, -377118, -263312, -14803, 19766, 139814, 103037, 64387, 61932, -166335, 15314, 80104, -214510, -79449, -146506, -242288, -97647, -95452, -140023, 41142, -99134, -144107, -65661, -318688, 49830, -140903, -85855, -63024, -67677, -1002, 218588, -218991, -51456, -89399, 9093, -559283, -71215, -87361, -82632, -89272, 57802, 193829, 219119, 8926, -225376, -282155, -53436, 40363, -212731, 46264, -155413]
9627b64217J15524N0467M6479n4819B37927E4972b34601A87183c7550Q056j74069
9616b03563a1716k22919G1765c05903j22672a68761b569k04511A30350i1068c3600
9604A40941b95320b891B15079q8097a79767M0501D8650c3666G6139b94072e1201
9592c48755c9071L730l11381c067I8067b03881F0799h117A24260m3749b72678
9580i0838B2648a44432q0233n7062F6085a24137r5650D5911J48471a30898H2385
9568A35908A2091b39542c945p302B41499b87511A65478a71907G6709b32246b7336
9556D1913c29173f7284j23374O4051f1148j07839A4918a39587O6824l8953I9365
9544b33118I4022b41955J20391C8060a5351j3935p6287k91479A02489j3553J0180
$$ y = [-264217, -148693, -98226, -51747, -106566, 237927, 54972, -234601, 187183, -37550, -29494, -203563, -11716, -234635, 71765, -305903, -428575, -168761, -2569, -207080, 130350, -91068, -33600, 140941, -295320, -2891, 215079, 126982, -179767, -139266, 48650, -33666, 76139, -294072, -51201, -348755, -39071, -35341, -346722, -3067, 98067, -203881, 60799, -8117, 124260, 80511, -272678, -90838, 22648, -144432, -224665, -281727, 66085, -124137, -219787, 45911, 194382, -130898, 82385, 135908, 12091, -239542, -3945, -11247, 241499, -287511, 165478, -171907, 76709, -232246, -27336, 41913, -329173, -67284, -190658, -126607, -61148, -168987, 14918, -139587, -72763, -111716, 99365, -233118, 94022, -241955, -121564, 38060, -15351, -29286, -105573, -397052, 102489, 88936, 99116]
9533I9116f9700A00690b22730P3228J7768H2944a85513j23011g0769H4039b08144
9521g1653k1189j61194Q997j57904B87100c35798g9093B4318d8508j28958d8226
9509A98830a51239d3637k10809A33580h9609j46701D1281b06473l2816g0316j63293
9498b33609L6075j18900A40466a8333m5517b7316n5667A7034a65669l1805H4464
9486B55818a43159A75673A928e5095q0021C33299j56717J04114A12303N4678b1298
9474F8620R621B7666J43613C8578d4784m41444g8009n2003d2404F6008j6024a56333
9461A06652a51781o9189B91613A32446a60308j2978I8330e8278I5796l5150h4845
9449e3841j5319D3428a93702A62340b62917A2238c46299a25576j01166H1159a21039
$$ y = [99116, -69700, 100690, -222730, -149502, -131734, 82944, -185513, -308524, -70769, 84039, -208144, -71653, -92842, -254036, -245039, -402943, 287100, -335798, -79093, 24318, -48508, -177466, -48226, 198830, -151239, -43637, -254446, 133580, -89609, -236310, 41281, -206473, -239289, -70316, -233609, -197534, -316434, 140466, -18333, -63850, -27316, -82983, 17034, -165669, -197474, 84464, 255818, -143159, 175673, 1928, -55095, -135116, 333299, 176582, 280696, 112303, 166981, -21298, 68620, 78241, 27666, 171279, 38578, -44784, -486228, -78009, -130012, -42404, 66008, 49984, -156333, 106652, -151781, -220970, 291613, 132446, -160308, -173286, 98330, -58278, 95796, 60646, -84845, -53841, -69160, 43428, -193702, 162340, -262917, 12238, -346299, -125576, -226742, 81159, -121039]
9437c01859A7753P1088J02642h3277j64088A10967a49210j64815J17152k2118
9427b18991c5057l81294A54527D5783a71490G2220b08604Q5489J6778M3806j19729
9416a82260K7724B34503C5291c2960j80196A4743a05627P993A80784o9211l2016
9405G9557J9622a48100l8715R1993I6942c24172P6734o0912O9632a52l56462g5885
9392G7707a16212j20232F1512a22150l30516d2457b106l602j78933A45609B7704
9380i0836k53834I9931B7607K9879J88167b33096G0887J79948d1367C57272C0030
9368b78785Q0625B57680d2305F723K78529h0701E6191b26002Q1897r4863a0191
9356a56186B256K04539b37658e5088C4241b14864G4292g5351L6890D19259E2153
$$ y = [-301859, 17753, 88841, 191483, -83277, -247365, 110967, -149210, -314025, -196873, -218991, -35057, -416351, 154527, 45783, -171490, 72220, -208604, -123115, -106337, -62531, -182260, -154536, 234503, 35291, -32960, -213156, 14743, -105627, -97634, 180784, 111573, 79557, 99179, -148100, -186815, -94822, 96942, -324172, -247438, -308350, -238718, -152, -356614, -75885, 77707, -116212, -236444, 61512, -122150, -452666, -42457, -2106, -5708, -184641, 145609, 27704, -90836, -344670, 99931, 27607, 57486, 245653, -233096, 70887, 250835, -41367, 357272, 30030, -278785, -198160, 257680, -42305, 6723, 285252, -80701, 56191, -226002, -144105, -238968, -10191, -156186, 2256, 206795, -237658, -55088, 34241, -214864, 74292, -75351, -38461, 419259, 52153]
9344a79513n8411B8246b53627d4674A25222a25604d2931j60549a8465o0685A96793
9332c5141j66897b8552k45490A52079c2511j68520P4589m21808b64192L418E5069
9320c02728O7432R0450F185K41558a73356f2633C1919J02203g0436A02256m7075
9309E5181k0437K06564a58149j03250a5127K974k01584Q460e4933b1424j67039
9298a88463M5596B83182A03798g349j36039P884A80913b74877r9823a71591A03123
9286A21957j6121l700g7183I1439o161B7244f2526E7983a79770d7138O546C7952
9273c9833k01280J14750j96091f7699l4851A26729a20976j44548a19026j13298
9263b32324J14486n3036f9080q3645a1236m29625E957c79904a63799L6799e8572
$$ y = [-179513, -237924, 28246, -253627, -44674, 125222, -125604, -42931, -203480, -18465, -79150, 196793, -35141, -202038, -28552, -274042, 152079, -32511, -201031, -126442, -548250, -264192, -260774, 55069, -302728, -235296, -144846, 6185, 247743, -173356, -62633, 31919, 134122, -70436, 102256, 55181, 34744, 241308, -158149, -261399, -15127, -12153, -213737, -205277, -54933, -21424, -188463, -142867, 283182, 103798, -7349, -143388, -135504, 180913, -274877, -374700, -171591, 103123, 121957, 105836, 102136, -77183, 91439, 85278, 27244, -62526, 57983, -179770, -47138, -40592, 37952, -39833, -241113, -126363, -322454, -67699, -102550, 126729, -120976, -265524, -119026, -232324, -117838, -170874, -69080, -152725, -11236, -440861, 5957, -379904, -163799, -127000, -58572]
9251I1051d2477l66099D13788i7733j23171i4232L1650C7018K7772A0332j887
9240H445i4388L1857j06958A51950b39063e3261G8776b44127j85751A82852a47076
9228c91224a77846Q0531j5709A61594B8503b42587A22005a11428I1290e5336I1597
9216i1614n6161l06123a15033E6818A4547g2160k49488a25741a8784p8122b7140
9204d327A88004B2456c28905I224a67748B52655a9863k10286R9067N4991H623
9192e163l21562A0727J35344a87701j3858A0291K85847A17461O1290h3244c0075
9180A23933C4494b91781i5834n9016o1117J02552K7283a1204G7772a67256j52541
9169c19797J49291A22092n0692R5274a41602j15788h4255p8155k02359A29121
$$ y = [91051, -42477, -408576, 413788, -97733, -220904, -94232, -62582, 37018, 64790, 10332, 8445, -94388, -62531, -169489, 151950, -239063, -53261, 78776, -244127, -429878, 182852, -147076, -391224, -177846, -97315, -113024, 161594, 28503, -242587, 122005, -111428, 91290, -55336, 91597, -91614, -147775, -453898, -115033, 56818, 14547, -72160, -321648, -125741, -18784, -96906, -27140, -4327, 188004, 22456, -328905, 9224, -167748, 252655, -19863, -230149, -131082, -76091, 8623, -5163, -326725, 10727, 146071, -187701, -201559, 10291, 296138, 117461, 178751, -83244, -30075, 123933, 34494, -291781, -95834, -154850, -215967, -113415, -86132, -11204, 77772, -167256, -319797, -170506, 122092, 71400, 166674, -141602, -257390, -84255, -162410, -364769, 129121]
9158a55636A02121e6949j0717C2745O1859a60775B0132J23741a21090A36568a27301
9146a58552G0439a30976c8628F49a48667B82436C9621a34575f4794I7526l4322
9135F3204e7015j9373j50805J04113C81201I7005l9074Q3419n1509N3888C8336
9123G8654b26212e9771p0903j22708C3272D746K04017b52726J7052A14384i7383
9111g858r8056j12575G0426l736J38495a12758M7116j09109j11545B18117M6799
9100B64916g0441L233o4392l1296k0780b7081m7779p5569O5281b0985A59680a35899
9087B93458K4587c9699k04245k5371A90688E4914M8632a30633r2900B24545a27487
9075D110b03791m5819B20169I1001a18362b2565j25948l21955A00170a24846H4307
$$ y = [-155636, 102121, -56949, -67666, 32745, 94604, -160775, 20132, 143873, -121090, 136568, -127301, -158552, 70439, -130976, -38628, 649, -148667, 282436, 39621, -134575, -64794, 97526, 63204, -57015, -76388, -227193, -123080, 381201, 97005, 57931, 141350, 89841, 143729, 38336, 78654, -226212, -59771, -130674, -253382, 33272, 4746, 208763, -252726, -235674, 114384, -97383, -7858, -105914, -218489, 70426, 66690, 205185, -112758, -65642, -174751, -286296, 218117, 264916, -70441, -67208, -131600, -162896, -183676, -27081, -74860, -150429, -85148, -20985, 159680, -135899, 293458, 318045, -39699, -243944, -269315, 190688, 54914, 103546, -130633, -223533, 224545, -127487, 4110, -203791, -249610, 220169, 91001, -118362, -22565, -148513, -470468, 100170, -124846, 84307]
9063b0111j33808l34202a7059k881j72647n7173a23667C16446e0525A31200c4436
9051a91506e7787j91802A61984g5706A14962C6181a07578j09894H2699a37001
9040b66315E1214b31009A44024a56869j1427a1727r9250k00665g1698J8760A32691
9028A46097o0295l0596J19310H2371c4886H5846A5272J14384g8434k68339J64280
9017a82493h6930B01602a76582K5566b8013B75878n3077j8873l8375G98e9551
9005A85808a48560A18371i7266j71188P2660E3491L12386A77233E4329b32151
8994c8157j04490j05634a5043m3090l4619a9781k46445j40972J55729e455A85341
8982a39928D3591a88504c386j33518k20265a20971J9888k45745N2502l2028B17749
$$ y = [-20111, -153919, -488121, -17059, -19940, -192587, -249760, -123667, 316446, -50525, 131200, -34436, -191506, -57787, -249589, 161984, -75706, 114962, 36181, -107578, -217472, 82699, -137001, -266315, 51214, -231009, 144024, -156869, -168296, -11727, -110977, -311642, -71698, -52938, 132691, 146097, 85802, 55206, 174516, 82371, -34886, 85846, 15272, 129656, -78434, -346773, -182493, -86930, 201602, -176582, -151016, -28013, 275878, 222801, 203928, 165553, 798, -59551, 185808, -148560, 118371, -97266, -268454, -195794, 53491, 365877, 177233, 54329, -232151, -38157, -142647, -248281, -15043, -58133, -92752, -19781, -266226, -407198, -251469, -5455, 185341, -139928, 43591, -188504, -3386, -136904, -357169, -120971, -101083, -346828, -294326, -326354, 217749]
8970b70709A17219b09000R9153B49047q896a48499C6939J912f6304J972o5565
8959a29897A6337b53752J07497K0726A6151M2653a3564o80H5121a29296K6406
8948a02890G4340b43755M1823Q6793B0254M9314N335A9782i9055j21442H2638
8936b66910C22051H5684a98975I3439e6804H4942h4139E3255c5990n8512j74764
8925b69266a17671j38606f5227A34735J07461E7002K81100A60690n5925A8737
8914A78598j1990R2909n5551m3006P93861L76203J007148K477245L525722k361788
8904E979351k617049j533491o94489l17476A72720J21190L3298p9990j22380L2213
8894A57051R0476R5162O287A70719K8702a59045I7220a65852d4458C8490a19029
$$ y = [-270709, 117219, -209000, -109847, 249047, 240151, -148499, 36939, 38851, -66304, -64332, -129897, 16337, -253752, -146255, -125529, 16151, 58804, -13564, -14244, 85121, -129296, -102890, 74340, -243755, -201932, -115139, 20254, 69568, 74903, 19782, -99055, -220497, 82638, -266910, 322051, 85684, -198975, 93439, -56804, 84942, -84139, 53255, -35990, -94502, -269266, -117671, -256277, -65227, 134735, 242196, 57002, 338102, 160690, 104765, 18737, 178598, 166608, 259517, 203966, 160960, 954821, 1331024, 2338172, 4815417, 8341139, 5979351, 3362302, 1828811, 1134322, 816846, 172720, 293910, 327208, 247218, 124838, 157051, 247527, 342689, 348976, 170719, 199421, -159045, 97220, -165852, -44458, 38490, -119029]
8882A04774h429r4520M3389j53213A90053F1528b11901A22877n49h867l0613B1144
8869b77033c6925k79887A354M8720b78756i8180o2503a6665D7439e3877b3606
8857a10627o8529A11531R4894C5869K2291b30953C22963G9706c24453a11482k35941
8846c47423d8575A35116b60772G2989M2401d78054J38360O5285b1035D7150Q329
8835E5479P7322a3360j1163A46229D0515b00379i2933A11105F981a0054r0683
$$ y = [104774, -8429, -102949, -59560, -212773, 190053, 61528, -211901, 122877, 122328, -8867, -39480, 21144, -277033, -36925, -316812, 1354, 50074, -278756, -98180, -160683, -16665, 47439, -53877, -23606, -110627, -179156, 111531, 206425, 35869, 58160, -230953, 322963, 79706, -324453, -111482, -347423, -48575, 135116, -260772, 72989, 115390, -478054, -339694, -274409, -21035, 47150, 55479, 132801, -13360, -24523, 146229, 40515, -200379, -92933, 111105, 6981, -10054, -100737]
$$ [...]
##END NTUPLES=NMR SPECTRUM
##END=
