
##TITLE=AC1006_S-090_6278756_7JjdzsqALM
##JCAMPDX= 6.0         $$ Bruker NMR JCAMP-DX V2.0
##DATA TYPE= NMR SPECTRUM
##DATA CLASS= NTUPLES
##ORIGIN= BRUKER
##OWNER= Administrator
$$ 1.72 TOPSPIN		Version 2.1
$$ 2012-06-03 16:45:43.125 -0500  Administrator@TOPSPIN
$$ Compression mode = diff/dup
##.OBSERVE FREQUENCY= 400.13188235
##.OBSERVE NUCLEUS= ^1H
##.ACQUISITION MODE= SIMULTANEOUS (DQD)
##.ACQUISITION SCHEME= undefined
##.AVERAGES= 64
##.DIGITISER RES= 22
##SPECTROMETER/DATA SYSTEM= spect
##.PULSE SEQUENCE= noesygpps1d.comp
##.SOLVENT NAME= COFFEE_meoh
##.SHIFT REFERENCE= INTERNAL, COFFEE_meoh, 1, 14.96659
##AUDIT TRAIL= $$ (NUMBER, WHEN, WHO, WHERE, PROCESS, VERSION, WHAT)
$$ ##TITLE= Audit trail, TOPSPIN		Version 2.1
$$ ##JCAMPDX= 5.01
$$ ##ORIGIN= Bruker BioSpin GmbH
$$ ##OWNER= Administrator
$$ $$ C:\Bruker\TOPSPIN/data/COFFEE/nmr/AC1006_S-090_6278756_7JjdzsqALM/12/pdata/1/auditp.txt
$$ ##AUDIT TRAIL=  $$ (NUMBER, WHEN, WHO, WHERE, PROCESS, VERSION, WHAT)
(   1,<2012-06-03 16:45:37.921 -0500>,<Administrator>,<TOPSPIN>,<go>,<TOPSPIN 2.1>,
      <created by zg
	started at 2012-06-03 16:34:07.703 -0500,
	POWCHK enabled, PULCHK disabled,
       configuration hash MD5:
       D5 CA 7A 23 FE 6B EE E2 50 67 74 61 24 F7 5E 3B
       data hash MD5: 64K
       86 F3 B2 FB 50 C7 B6 AF 6B 28 7B 0A CB 4E 47 26>)
(   2,<2012-06-03 16:45:40.828 -0500>,<Administrator>,<TOPSPIN>,<proc1d>,<TOPSPIN 2.1>,
      <Start of raw data processing
       efp LB = 0.3 FT_mod = 6 PKNL = 1 PHC0 = 0 PHC1 = 0 SI = 128K 
       data hash MD5: 128K
       73 0D 6B 37 B0 9D F1 70 E0 C0 75 61 AA 2C 8D 42>)
(   3,<2012-06-03 16:45:42.093 -0500>,<Administrator>,<TOPSPIN>,<proc1d>,<TOPSPIN 2.1>,
      <pk PHC0 = 33.00293 PHC1 = 0 
       data hash MD5: 128K
       52 F9 27 40 E4 55 58 7A E3 0D B8 CA 5F 35 1C 89>)
(   4,<2012-06-03 16:45:42.781 -0500>,<Administrator>,<TOPSPIN>,<proc1d>,<TOPSPIN 2.1>,
      <abs ABSG = 1 
       data hash MD5: 128K
       49 50 F3 02 9C CD 7A E2 8D 6C BD 68 47 A8 25 FF>)
(   5,<2012-06-03 16:45:42.859 -0500>,<Administrator>,<TOPSPIN>,<proc1d>,<TOPSPIN 2.1>,
      <abs ABSG = 2 
       data hash MD5: 128K
       57 3E 88 F8 EA 18 4E CE 4C A3 4C 38 00 52 00 4D>)
(   6,<2012-06-03 16:45:42.921 -0500>,<Administrator>,<TOPSPIN>,<proc1d>,<TOPSPIN 2.1>,
      <abs ABSG = 3 
       data hash MD5: 128K
       E2 23 77 15 4C B5 2E 02 AF E6 A4 4C 26 D7 05 41>)
(   7,<2012-06-03 16:45:42.984 -0500>,<Administrator>,<TOPSPIN>,<proc1d>,<TOPSPIN 2.1>,
      <abs ABSG = 4 
       data hash MD5: 128K
       0C 55 52 5F F0 57 79 E6 27 8F AD 61 23 94 FF 48>)
(   8,<2012-06-03 16:45:43.046 -0500>,<Administrator>,<TOPSPIN>,<proc1d>,<TOPSPIN 2.1>,
      <abs ABSG = 5 
       data hash MD5: 128K
       71 15 CB 44 28 EF 97 31 AA BD 30 B7 00 2A C3 BD>)
$$ ##END=
$$ 
$$ $$ hash MD5
$$ $$ 7C 25 A5 00 58 40 3B 1B 52 90 32 0E 50 37 23 BE
##$RELAX= 
##$RELAX= 
##$RELAX= 
##$RELAX= 
##$RELAX= 
##$RELAX= 
##$RELAX= 
##$RELAX= 
$$ Bruker specific parameters
$$ [...]
##$TP07= 0
##$TPNAME0= <>
##$TPNAME1= <>
##$TPNAME2= <>
##$TPNAME3= <>
##$TPNAME4= <>
##$TPNAME5= <>
##$TPNAME6= <>
##$TPNAME7= <>
##$TPOAL= (0..7)
0.5 0.5 0.5 0.5 0.5 0.5 0.5 0.5
##$TPOFFS= (0..7)
0 0 0 0 0 0 0 0
##$TUNHIN= 0
##$TUNHOUT= 0
##$TUNXOUT= 0
##$USERA1= <user>
##$USERA2= <user>
##$USERA3= <user>
##$USERA4= <user>
##$USERA5= <user>
##$V9= 5
##$VALIST= <valist>
##$VCLIST= <CCCCCCCCCCCCCCC>
##$VD= 0
##$VDLIST= <DDDDDDDDDDDDDDD>
##$VPLIST= <PPPPPPPPPPPPPPP>
##$VTLIST= <TTTTTTTTTTTTTTT>
##$WBST= 2048
##$WBSW= 25
##$XGAIN= (0..3)
0 0 0 0
##$XL= 0
##$YL= 0
##$YMAX_a= 10861924
##$YMIN_a= -6580783
##$ZGOPTNS= <>
##$ZL1= 120
##$ZL2= 120
##$ZL3= 120
##$ZL4= 120
##$ABSF1= 14.96659
##$ABSF2= -5.58594
##$ABSG= 5
##$ABSL= 3
##$ALPHA= 0
##$AQORDER= 0
##$ASSFAC= 0
##$ASSFACI= 0
##$ASSFACX= 0
##$ASSWID= 0
##$AUNMP= <proc_prof1d_extract.lims>
##$AXLEFT= 0
##$AXNAME= <>
##$AXNUC= <1H>
##$AXRIGHT= 0
##$AXTYPE= 0
##$AXUNIT= <>
##$AZFE= 0.1
##$AZFW= 0.1
##$BCFW= 0
##$BC_mod= 0
##$BYTORDP= 0
##$COROFFS= 0
##$CY= 15
##$DATMOD= 1
##$DC= 0
##$DFILT= <>
##$DTYPP= 0
##$F1P= 0
##$F2P= 0
##$FCOR= 0.5
##$FTSIZE= 131072
##$FT_mod= 6
##$GAMMA= 0
##$GB= 0
##$INTBC= 1
##$INTSCL= 1
##$ISEN= 128
##$LB= 0.3
##$LEV0= 0
##$LPBIN= 0
##$MAXI= 10000
##$MC2= 0
##$MEAN= 0
##$ME_mod= 0
##$MI= 0
##$NCOEF= 0
##$NC_proc= -3
##$NLEV= 6
##$NOISF1= 0
##$NOISF2= 0
##$NSP= 0
##$NTH_PI= 0
##$NZP= 0
##$OFFSET= 14.96659
##$PC= 1
##$PHC0= 33.00293
##$PHC1= 0
##$PH_mod= 1
##$PKNL= yes
##$PPARMOD= 0
##$PPDIAG= 0
##$PPIPTYP= 0
##$PPMPNUM= 2147483647
##$PPRESOL= 1
##$PSCAL= 4
##$PSIGN= 0
##$PYNMP= <proc.py>
##$REVERSE= no
##$SF= 400.130005609133
##$SI= 131072
##$SIGF1= 0
##$SIGF2= 0
##$SINO= 400
##$SIOLD= 131072
##$SPECTYP= <>
##$SREGLST= <1H.CDCl3>
##$SSB= 0
##$STSI= 131072
##$STSR= 0
##$SW_p= 8223.68421052632
##$SYMM= 0
##$S_DEV= 0
##$TDeff= 65536
##$TDoff= 0
##$TI= <>
##$TILT= no
##$TM1= 0
##$TM2= 0
##$TOPLEV= 0
##$USERP1= <user>
##$USERP2= <user>
##$USERP3= <user>
##$USERP4= <user>
##$USERP5= <user>
##$WDW= 1
##$XDIM= 131072
##$YMAX_p= 427415997
##$YMIN_p= -355324169
##$CURPLOT= <Network HP LaserJet P1505>
##$CURPRIN= <$Network HP LaserJet P1505>
##$DFORMAT= <normdp>
##$LAYOUT= <+/1D_H.xwp>
##$LFORMAT= <normlp>
##$PFORMAT= <normpl>
##$SURQMSG= 1
$$ End of Bruker specific parameters
$$ ---------------------------------
##NTUPLES= NMR SPECTRUM
##VAR_NAME=  FREQUENCY,     SPECTRUM/REAL,   SPECTRUM/IMAG
##SYMBOL=    X,             R,               I
##VAR_TYPE=  INDEPENDENT,   DEPENDENT,       DEPENDENT
##VAR_FORM=  AFFN,          ASDF,            ASDF
##VAR_DIM=   131072,        131072,          131072
##UNITS=     HZ,            ARBITRARY UNITS, ARBITRARY UNITS
##FACTOR=    0.0627417313425165, 1,          1
##FIRST=     8223.62146879498, 1350,         -114318
##LAST=      0,             4341,            -113840
##MIN=       0,             -355324169,      0
##MAX=       8223.62146879498, 427415997,    0
$$ Real data points
##PAGE= N=1
##DATA TABLE= (X++(R..R)), XYDATA
$$ [...]
63640E11521q7N91M95Q4K07Q47J207J074J350K760M576N419N124M936N621O211
63624E51936N270K884O90k3M51R04O44lk88P3N55M75j8J15J481L146L525K304
63606E74121P67L0k47r25j898k338k124k106k879l960m478m191l559l135l154
63591E39924l438l468k804j722j158j625k460k624k007j311o96N43K674M759N832
63576E30419O208O816P710Q222Q384Q980J0138J0967J0979J0895J1457J2300J2753
63563F56228J3038J3842J5128J6338J7382J8599J9986K1353K3071K5748K9107
63552H69820L2129L4443L6726L9434M1955M3536M4457M5567M6884M7170M4954
63541A327075L9957L3596K8000K4183K1192J7424J2622Q030M631K008p75l898
$$ y = [511521, 511434, 512025, 512520, 512604, 512811, 513658, 514865, 515939, 517289, 520049, 524625, 530044, 535168, 540104, 545725, 551936, 557206, 560090, 560780, 560757, 561208, 562112, 562756, 562753, 562465, 562538, 563093, 563568, 563550, 563665, 565146, 568292, 571817, 574121, 574888, 574918, 574671, 573746, 571848, 569510, 567386, 565280, 562401, 558441, 553963, 549772, 546213, 543078, 539924, 536486, 533018, 530214, 528492, 527334, 525709, 523249, 520625, 518618, 517307, 516611, 517154, 519828, 524587, 530419, 536627, 543443, 551153, 559375, 567759, 576739, 586877, 597844, 608823, 619718, 631175, 643475, 656228, 669266, 683108, 698236, 714574, 731956, 750555, 770541, 791894, 814965, 840713, 869820, 901949, 936392, 973118, 1012552, 1054507, 1098043, 1142500, 1188067, 1234951, 1282121, 1327075, 1367032, 1400628, 1428628, 1452811, 1474003, 1491427, 1504049, 1512079, 1516710, 1518718, 1517943, 1514045]
63529A514045o953r827j2765j5854j9007k2410k6453l1066l5391l8168l8552l6705
63517A220894l3751l0936k8750k6912k4979k2549j9096j4457r664o392n090m338
63505I93980k690l76J572L215N502Q472J1024J2547J3691J5175J6937J8906K1510
63492A119465K4703K7452K9174L1035L4700M0183M6030N1205N5440N7801N6530
63481A573718N1128M3457L5958K9470K3498J7671J1945O078J50m796p878r843
63469A770556j2130j4676j6306j7462k0648k7286l5479m2089m6061m8511n0493
63458A439415n2002n2676n2123m9943m6585m3749m2647m2210m0422l7157l4095
63447I45806l1889k9344k5841k2762k1405k0953j9769j7729j5935j4815j3738
$$ y = [1514045, 1507092, 1497265, 1484500, 1468646, 1449639, 1427229, 1400776, 1369710, 1334319, 1296151, 1257599, 1220894, 1187143, 1156207, 1127457, 1100545, 1075566, 1053017, 1033921, 1019464, 1009800, 1003408, 998318, 993980, 991290, 990914, 992486, 995701, 1001203, 1009675, 1020699, 1033246, 1046937, 1062112, 1079049, 1097955, 1119465, 1144168, 1171620, 1200794, 1231829, 1266529, 1306712, 1352742, 1403947, 1459387, 1517188, 1573718, 1624846, 1668303, 1704261, 1733731, 1757229, 1774900, 1786845, 1792923, 1793073, 1788277, 1780399, 1770556, 1758426, 1743750, 1727444, 1709982, 1689334, 1662048, 1626569, 1584480, 1538419, 1489908, 1439415, 1387413, 1334737, 1282614, 1232671, 1186086, 1142337, 1099690, 1057480, 1017058, 979901, 945806, 913917, 884573, 858732, 835970, 814565, 793612, 773843, 756114, 740179, 725364, 711626]
63436G11626j2206j0355q423o552m954l680k456j286p24r85j284q27qL75O51J900
63420F60812M116N800N640L825J669M95Q79K154K726J610k89j245r78q39j699
63405F84676k867l542m108n102n862n278l418j351J85J088J196M96o3Q75L329
63390F60254N744O884P197P738Q562R044R271J0122J2026J4547J7297K0364K3633
63377H12683K6562K9172L2508L7236M2266M5548M6101M4448M1341L7171L2743
63366A227779K9393K7524K5858K3042J9739J8351K0573K5734L1576L6407M0340
63355A526316M4494M8909N1713N0944M7004M2234L7766L2182K4202J5567R533
63344A930864O872N094J839k424n797p824j0008j3890j9563k5973l2074l7515
$$ y = [711626, 699420, 689065, 680642, 674090, 669136, 665456, 663000, 661714, 660990, 660005, 658721, 657894, 657886, 658261, 658912, 660812, 664928, 670728, 676368, 680193, 681862, 682357, 683236, 685390, 688116, 689726, 689437, 688192, 687214, 686375, 684676, 681809, 678267, 674159, 669057, 663195, 657917, 654499, 653148, 653333, 654421, 655617, 656113, 656050, 656925, 660254, 665998, 672882, 680079, 687817, 696379, 705423, 714694, 724816, 736842, 751389, 768686, 789050, 812683, 839245, 868417, 900925, 938161, 980427, 1025975, 1072076, 1116524, 1157865, 1195036, 1227779, 1257172, 1284696, 1310554, 1333596, 1353335, 1371686, 1392259, 1417993, 1449569, 1485976, 1526316, 1570810, 1619719, 1671432, 1722376, 1769380, 1811614, 1849380, 1881562, 1905764, 1921331, 1930864, 1937736, 1942830, 1944669, 1942245, 1936448, 1928624, 1918616, 1904726, 1885163, 1859190, 1827116, 1789601]
63332A789601m2305m6064m8141m8628m8781m9684n0795n0622m8695m5843m2622
63321A267421l8698l4041k9547k5812k2227j8112j3880j0301p260m135q57K238
63309A064789N181Q184J1086J3783J6840K0834K5342K9361L2368L4325L5275L6003
63297A333371L8465M3900N0467N4397N4034N1463M9499M8238M5624M0590L4232
63286A844280K8057K2214J5947R271L511n6j958m371q900j4855k0305k4414k7993
63273A820428l1889l5972l9902m3798m7595n0490n1697n1140m9015m5406m0836
63262A332688l6433l2713k8932k4548k0760j9455k0835k3152k4808k5735k6665
63251A048652k7857k8854k8931k7685k5584k3757k2691k1430j8912j5882j4297
$$ y = [1789601, 1747296, 1701232, 1653091, 1604463, 1555682, 1505998, 1455203, 1404581, 1355886, 1310043, 1267421, 1228723, 1194682, 1165135, 1139323, 1117096, 1098984, 1085104, 1074803, 1067543, 1063408, 1062551, 1064789, 1069970, 1078154, 1089240, 1103023, 1119863, 1140697, 1166039, 1195400, 1227768, 1262093, 1297368, 1333371, 1371836, 1415736, 1466203, 1520600, 1574634, 1626097, 1675596, 1723834, 1769458, 1810048, 1844280, 1872337, 1894551, 1910498, 1919769, 1923280, 1923224, 1921266, 1916895, 1907995, 1893140, 1872835, 1848421, 1820428, 1788539, 1752567, 1712665, 1668867, 1621272, 1570782, 1519085, 1467945, 1418930, 1373524, 1332688, 1296255, 1263542, 1234610, 1210062, 1189302, 1169847, 1149012, 1125860, 1101052, 1075317, 1048652, 1020795, 991941, 963010, 935325, 909741, 885984, 863293, 841863, 822951, 807069, 792772]
63240G92772j4740j5610j5348j4194j3042j1646r280o505m902n084o083o767o881
63227F62690o447n279l692k859l562m916n286m299l172k914l092k772j864p75
63213F11761O64K743M537M358K017l62o29R15K217K172J645J955L317M981O135
63198F48426O423O127O085P000Q694J0331J1381J1909J2038J1827J1708J2342
63186G64291J3813J5515J7026J8422J9615K0202K0342K1046K3027K5959K9217
63175I88475L2665L6010L8208L8427L7261L6120L5660L5579L5663L6150L7089
63164A387307L8099L8904L9581M0170M0433M0019L8684L6531L4214L2338L0299
63153A796579K6418J9993J2663O647K032l018r486j6220k1666k5609k8638l0861
$$ y = [792772, 778032, 762422, 747074, 732880, 719838, 708192, 698912, 692407, 687505, 682421, 676338, 669571, 662690, 656243, 650964, 647272, 644413, 640851, 635935, 630649, 626350, 623178, 620264, 617172, 614400, 612536, 611761, 612425, 615168, 619705, 624063, 626080, 625718, 625089, 626004, 628221, 630393, 632038, 633993, 637310, 642291, 648426, 654849, 660976, 667061, 674061, 682755, 693086, 704467, 716376, 728414, 740241, 751949, 764291, 778104, 793619, 810645, 829067, 848682, 868884, 889226, 910272, 933299, 959258, 988475, 1021140, 1057150, 1095358, 1133785, 1171046, 1207166, 1242826, 1278405, 1314068, 1350218, 1387307, 1425406, 1464310, 1503891, 1544061, 1584494, 1624513, 1663197, 1699728, 1733942, 1766280, 1796579, 1822997, 1842990, 1855653, 1862300, 1864332, 1861314, 1851828, 1835608, 1813942, 1788333, 1759695, 1728834]
63141A728834l1919l1728l0509k8359k5244k1264j6638j1732p151l325J72M395
63129A525532R771J5475K0379K4308K8066L2438L7273M1377M3302M2736M1150
63118A861807M0623M1911M3979M5344M5334M4062M1988L9637L7045L3313K7469
63107B302512J9931J2122M402m426j4895k5411l4097m1173m8190n5499o1875o6361
63095A987040o9047p0045o9118o6777o4455o2899o1193n8108n3845m9665m6172
63084A315716m2768l8775l4448l0571k7562k5273k3525k2221k0914j8806j5784
63073A015069j3035j1849j1862j1330r319o677m538k871j283j68N5K49J639L836
63059I47916N079M525L153K307K403L261M430M889L646J299p6O86K502L823M616
$$ y = [1728834, 1696915, 1665187, 1634678, 1606319, 1581075, 1559811, 1543173, 1531441, 1524290, 1520965, 1521137, 1525532, 1535303, 1550778, 1571157, 1595465, 1623531, 1655969, 1693242, 1734619, 1777921, 1820657, 1861807, 1902430, 1944341, 1988320, 2033664, 2078998, 2123060, 2165048, 2204685, 2241730, 2275043, 2302512, 2322443, 2334565, 2338967, 2334541, 2319646, 2294235, 2260138, 2218965, 2170775, 2115276, 2053401, 1987040, 1917993, 1847948, 1778830, 1712053, 1647598, 1584699, 1523506, 1465398, 1411553, 1361888, 1315716, 1272948, 1234173, 1199725, 1169154, 1141592, 1116319, 1092794, 1070573, 1049659, 1030853, 1015069, 1002034, 990185, 978323, 966993, 957674, 950997, 946459, 943588, 942305, 942137, 942192, 942441, 944080, 947916, 952995, 957520, 960673, 962980, 965383, 968644, 973074, 977963, 981609, 982908, 982832, 983518, 986020, 989843, 994459]
63044I94459N489N949N112L598K963L267K968J622R33K243M304M954M107L547
63030A045515M095M560L820K581K340L505N309P040Q474R343R430R255R900J1792
63016A136959J4171J6034J7117J7587J7405J6708J6506J8092K1457K4988K7265
63005A344289K8719L0916L4403L8115M1017M3568M6781N0448N3382N5466N8281
62994A825385O3019O8664P3330P6851Q0689Q5206Q8612Q9356Q8479Q8402Q9952
62983B717945R1864R2988R3583R4054R3747R2047Q9924Q9013Q9127Q7896Q3392
62972C715580P6244O8217N9473M8611L5331K1431Q430m389j8434l3226m6856n8366
62960C872046o7956p5127p8672p8815p7356p4913o9893o1429n1511m2483l3855
$$ y = [994459, 999948, 1005897, 1011009, 1014607, 1017570, 1020837, 1023805, 1025427, 1026360, 1028603, 1032907, 1037861, 1041968, 1045515, 1049610, 1054170, 1057990, 1060571, 1062911, 1066416, 1071725, 1078765, 1087239, 1096582, 1106012, 1115267, 1125167, 1136959, 1151130, 1167164, 1184281, 1201868, 1219273, 1235981, 1252487, 1270579, 1292036, 1317024, 1344289, 1373008, 1403924, 1438327, 1476442, 1517459, 1561027, 1607808, 1658256, 1711638, 1767104, 1825385, 1888404, 1957068, 2030398, 2107249, 2187938, 2273144, 2361756, 2451112, 2539591, 2627993, 2717945, 2809809, 2902797, 2996380, 3090434, 3184181, 3276228, 3366152, 3455165, 3544292, 3632188, 3715580, 3791824, 3860041, 3919514, 3968125, 4003456, 4024887, 4033317, 4028928, 4010494, 3977268, 3930412, 3872046, 3804090, 3728963, 3650291, 3571476, 3494120, 3419207, 3349314, 3287885, 3236374, 3193891, 3160036]
62949C160036k3744j2512k341O468J6042K7213L7805M5839N2487N9971O7865P3558
62937C508687P6022P7227P9421Q2372Q4075Q3446Q1420P9384P7220P3350O6523
62926D369147N6920M5383L2200J7351J490j4265k9619m5356o2046p9045r5054
62915D197106j09063j20523j29069j34576j37310j37818j36805j34919j32264
62906C024759j28251j22467j15518j08492j01747r5051q8646q3166p8424p3555
62896B029442o8503o4175o0712n6987n2461m8233m5371m3339m1179l9168l8039
62885A471275l7357l6063l4051l1939k9778k7331k5158k4054k3607k2705k1167
62874A158065j9635j8089j6079j4172j3487j3569j2621j0283q412q296q764q202
$$ y = [3160036, 3136292, 3123780, 3121439, 3127907, 3143949, 3171162, 3208967, 3254806, 3307293, 3367264, 3435129, 3508687, 3584709, 3661936, 3741357, 3823729, 3907804, 3991250, 4072670, 4152054, 4229274, 4302624, 4369147, 4426067, 4471450, 4503650, 4521001, 4522491, 4508226, 4478607, 4433251, 4371205, 4292160, 4197106, 4088043, 3967520, 3838451, 3703875, 3566565, 3428747, 3291942, 3157023, 3024759, 2896508, 2774041, 2658523, 2550031, 2448284, 2353233, 2264587, 2181421, 2102997, 2029442, 1960939, 1896764, 1836052, 1779065, 1726604, 1678371, 1633000, 1589661, 1548482, 1509314, 1471275, 1433918, 1397855, 1363804, 1331865, 1302087, 1274756, 1249598, 1225544, 1201937, 1179232, 1158065, 1138430, 1120341, 1104262, 1090090, 1076603, 1063034, 1050413, 1040130, 1031718, 1023422, 1014658, 1006456]
62862A006456o961o367o388n959n048m744n433o186o106n295m408l924m010m459
62848I31168m708m493m390n130o371o856n906m125k508j367n52k21q50k364l630
62833H77697l293j284O51N34j623l607l430j447L60Q37O24Q11J446J781J504J160
62817H72721J409K210K883K985K776K642K264R33j283l211l756k989j776q20m34
62802H76554p55j555k159k113j685j298p84J84J296J898J806J221K10q96j109
62787H70815J97K065K929K644K321K315J832P91L45R40J285K46j454k439k499
62772H82333k139j290K11J653K220K229K392K522K194K059K974M295M634M079
62758I10366M033M965O001O762P853R288J0109J0120J0315J1002J1278J1103J2055
$$ y = [1006456, 999495, 993128, 986740, 980781, 975733, 970989, 965556, 959370, 953264, 947969, 943561, 939637, 935627, 931168, 926460, 921967, 917577, 912447, 906076, 899220, 893314, 889189, 886681, 885314, 884762, 884541, 883691, 881327, 877697, 874404, 873120, 873771, 874305, 872682, 869075, 865645, 864198, 864558, 865395, 866019, 866830, 868276, 870057, 871561, 872721, 874130, 876340, 879223, 882208, 884984, 887626, 889890, 890823, 889540, 886329, 882573, 879584, 877808, 876988, 876554, 875799, 874244, 872085, 869972, 868287, 866989, 866205, 866389, 867685, 869583, 871389, 872610, 872820, 871924, 870815, 871012, 873077, 876006, 878650, 880971, 883286, 885118, 885909, 886254, 887194, 888479, 888725, 887271, 884832, 882333, 880194, 878904, 879115, 880768, 882988, 885217, 887609, 890131, 892325, 894384, 897358, 901653, 906287, 910366, 914399, 919364, 925365, 932127, 939980, 949268, 959377, 969497, 979812, 990814, 1002092, 1013195, 1025250]
62745A025250J4731J7081J7062J5695J5585J7311J9297K0703K2311K4538K6642
62734A236206K8474L1278L5766M0535M3570M4835M6382N0053N5672O1704O7292
62723A741767P3237Q0726Q9433R7604J04180J09999J16288J22691J27700J30455
62713B794080J30949J28700J22646J12563R9618Q4986O8782N0837L1764J2607
62703C637532o204k4959m3674o1320p6134q6970r4501j00699j06726j11696j14074
62692B810575j13878j12550j10891j08329j04472j00143r6213r2134q6522p8948
62682A806495p0629o3292n7552n2456m6718m0534l5621l3048l1514k8785k4391
62671A321955j9815j6131j2905r544o288l343l49K551M444N270O541R357J2849
$$ y = [1025250, 1039981, 1057062, 1074124, 1089819, 1105404, 1122715, 1142012, 1162715, 1185026, 1209564, 1236206, 1264680, 1295958, 1331724, 1372259, 1415829, 1460664, 1507046, 1557099, 1612771, 1674475, 1741767, 1815004, 1895730, 1985163, 2082767, 2186947, 2296946, 2413234, 2535925, 2663625, 2794080, 2925029, 3053729, 3176375, 3288938, 3388556, 3473542, 3542324, 3593161, 3624925, 3637532, 3631328, 3606369, 3562695, 3501375, 3425241, 3338271, 3243770, 3143071, 3036345, 2924649, 2810575, 2696697, 2584147, 2473256, 2364927, 2260455, 2160312, 2064099, 1971965, 1885443, 1806495, 1735866, 1672574, 1615022, 1562566, 1515848, 1475314, 1439693, 1406645, 1375131, 1346346, 1321955, 1302140, 1286009, 1273104, 1263560, 1257272, 1253929, 1253580, 1256131, 1260575, 1265845, 1272386, 1281743, 1294592]
62658A294592J5749J8533K2440K7128L1094L4211L7974M3029M8005N1575N4531
62647A678861N8939O5780P4072Q2192Q9550R6917J05243J14364J23300J31727
62637B620945J40282J48953J56040J59663J59780J57649J53695J46945J36377
62628C980329J21742J03179Q1302N7582L3458Q856j7148m3840o8448q8777j05240
62617D062995j19533j32308j42934j50635j54880j55353j52651j48565j44693
62608B761443j40887j35786j28673j20191j11560j03768r7197r1249q4619p6806
62598A670707o9142o3428n9651n5935n0889m5099m0053l6443l3909l1796k9615
62587A154747k7183k4776k2855k1489k0297j9076j7943j6700j4727j1969r446
$$ y = [1294592, 1310341, 1328874, 1351314, 1378442, 1409536, 1443747, 1481721, 1524750, 1572755, 1624330, 1678861, 1737800, 1803580, 1877652, 1959844, 2049394, 2146311, 2251554, 2365918, 2489218, 2620945, 2761227, 2910180, 3066220, 3225883, 3385663, 3543312, 3697007, 3843952, 3980329, 4102071, 4205250, 4286552, 4344134, 4377592, 4386448, 4369300, 4325460, 4257012, 4168235, 4062995, 3943462, 3811154, 3668220, 3517585, 3362705, 3207352, 3054701, 2906136, 2761443, 2620556, 2484770, 2356097, 2235906, 2124346, 2020578, 1923381, 1832132, 1747513, 1670707, 1601565, 1538137, 1478486, 1422551, 1371662, 1326563, 1286510, 1250067, 1216158, 1184362, 1154747, 1127564, 1102788, 1079933, 1058444, 1038147, 1019071, 1001128, 984428, 969701, 957732, 948286]
62576I48286q147p830p532o907o318n888n229m176k972j746m99K97j4j062j433
62561H88830m04R98J440J144J407K643L968M783N664P332R502J1303J2442J3382
62547I64434J4630J6262J8141K0280K2857K5809K8523L0272L1262L2903L6427
62536A241800M1398M6275N0374N4315N8397O1491O2255O0702N7855N4341N0045
62525A839248M4658L7838K9141J8688P665k623j2011k1017k9360l6059m1062m5532
62513A789574n0003n3213n3708n1995n0213m9758m9989m9411m7524m5165m3180
62502A245415m1231l8243l3954k9543k6288k3909k0959j6856j2794j0349r753
62491I81536r898r594q319o176l775j941j044o15k6O94J152J494K255L384M242
$$ y = [948286, 940139, 932309, 924777, 917870, 911552, 905664, 900435, 896259, 893287, 891541, 891042, 891339, 891325, 890263, 888830, 888426, 889424, 890864, 892008, 893415, 896058, 900026, 904809, 910473, 917805, 927307, 938610, 951052, 964434, 979064, 995326, 1013467, 1033747, 1056604, 1082413, 1110936, 1141208, 1172470, 1205373, 1241800, 1283198, 1329473, 1379847, 1434162, 1492559, 1554050, 1616305, 1677007, 1734862, 1789203, 1839248, 1883906, 1921744, 1950885, 1969573, 1977238, 1974615, 1962604, 1941587, 1912227, 1876168, 1835106, 1789574, 1739571, 1686358, 1632650, 1580655, 1530442, 1480684, 1430695, 1381284, 1333760, 1288595, 1245415, 1204184, 1165941, 1131987, 1102444, 1076156, 1052247, 1031288, 1014432, 1001638, 991289, 981536, 971638, 962044, 953725, 947549, 943774, 941833, 940789, 940174, 940148, 940842, 941994, 943488, 945743, 949127, 953369]
62476I53369M793N961Q195J0400J1214J1003J1508J3464J5724J7264J8947K2247
62464A104089K6811L0715L3267L6149M1133M7620N3553N8148O2524O7693P3132
62453A634834P7798Q1568Q4973Q7979Q9866R0120Q8771Q5736Q0420P2274O1474
62442B535813M8802L5181K1496Q612k942j3222k2507l0605l6872m1032m3468m4509
62430B414747m3869m1315l7431l2948k7482j9949j0471j103O040J0853J4988J9982
62418B252042K6087L2369L7079L8267L5160K9157K2687J6827J0548K417p679j8716
62406B476245k9662l9789m8502n5632o1831o7956p3952p8675q0860q0087p6967
62395A782332p2816o9120o6637o4679o1654n6712n0689m5044m0127l5064k9495
$$ y = [953369, 958162, 964123, 972318, 982718, 993932, 1004935, 1016443, 1029907, 1045631, 1062895, 1081842, 1104089, 1130900, 1161615, 1194882, 1231031, 1272164, 1319784, 1373337, 1431485, 1494009, 1561702, 1634834, 1712632, 1794200, 1879173, 1967152, 2057018, 2147138, 2235909, 2321645, 2402065, 2474339, 2535813, 2584615, 2619796, 2641292, 2649904, 2646962, 2633740, 2611233, 2580628, 2543756, 2502724, 2459256, 2414747, 2370878, 2329563, 2292132, 2259184, 2231702, 2211753, 2201282, 2200179, 2206219, 2217072, 2232060, 2252042, 2278129, 2310498, 2347577, 2385844, 2421004, 2450161, 2472848, 2489675, 2500223, 2502640, 2494961, 2476245, 2446583, 2406794, 2358292, 2302660, 2240829, 2172873, 2098921, 2020246, 1939386, 1859299, 1782332, 1709516, 1640396, 1573759, 1509080, 1447426, 1390714, 1340025, 1294981, 1254854, 1219790, 1190295]
62384A190295k4527k1330j9238j6292j1787p358n009m630m322k851r61j28q53
62371A071009k515m306n762o668p165p908r603j2149j4494j5579j5181j3793j2021
62358I43865j0461r772j0266j1425j2321j2580j2390j1652j0027q094p343q153
62346H19381q751p403m969l650l630k900o66J234J206K88K56R49J293J811L770
62331G98219O331O935M898K513J867K355K431K353L559O104Q403R505J0205J1500
62317H77178J2940J3297J2409J1557J2027J3928J6544J9182K1243K2251K2612
62306A055168K3839K6876L0490L2819L4435L7956M4007M9779N3043N5613O0582
62295A504607O7470P2953P5817P8116Q1059Q2633Q0524P5187O8525O1182N2777
$$ y = [1190295, 1165768, 1144438, 1125200, 1108908, 1097121, 1089763, 1084754, 1080124, 1075802, 1072951, 1071990, 1071862, 1071009, 1068494, 1064188, 1058426, 1051758, 1044593, 1036685, 1027082, 1014933, 1000439, 984860, 969679, 955886, 943865, 933404, 923632, 913366, 901941, 889620, 877040, 864650, 852998, 842971, 834877, 827534, 819381, 810630, 803227, 798258, 794608, 790978, 788078, 787412, 788646, 789852, 790140, 790396, 791345, 792638, 794449, 798219, 804550, 811485, 816383, 818896, 820763, 823118, 825549, 827902, 831461, 837565, 845968, 855473, 865678, 877178, 890118, 903415, 915824, 927381, 939408, 953336, 969880, 989062, 1010305, 1032556, 1055168, 1079007, 1105883, 1136373, 1169192, 1203627, 1241583, 1285590, 1335369, 1388412, 1444025, 1504607, 1572077, 1645030, 1720847, 1798963, 1880022, 1962655, 2043179, 2118366, 2186891, 2248073, 2300850]
62284B300850M3564L4187K4457J3842K779p670j7151k6047l4466m2065m8588n3899
62272B189793n7716n9908o0755o0451n8739n5612n1851m8365m5389m2877m1147
62261A606983m0367l9880l8838l7393l6582l6966l7856l7805l5850l2488k9522
62250A203436k8516k9184k9719k8675k5997k2290j8192j4640j2658j2199j2017
62239I69349j1174r855q407o669m807l590l115k404j113k81m72m32J015L046M297
62224I25388N138O777R010J0676J1546J1941J1238Q943O729O979R398J1361J1768
62211A046892J2229J3956J5864J6743J7358J9079K1910K4949K7701L0087L2363
62200A279131L5747M1624M9260N5728N9353O1903O6102P2010P7419Q0903Q2795
$$ y = [2300850, 2344414, 2378601, 2403058, 2416900, 2419679, 2412009, 2394858, 2368811, 2334345, 2292280, 2243692, 2189793, 2132077, 2072169, 2011414, 1950963, 1892224, 1836612, 1784761, 1736396, 1691007, 1648130, 1606983, 1566616, 1526736, 1487898, 1450505, 1413923, 1376957, 1339101, 1301296, 1265446, 1232958, 1203436, 1174920, 1145736, 1116017, 1087342, 1061345, 1039055, 1020863, 1006223, 993565, 981366, 969349, 958175, 948320, 939913, 933244, 928437, 924847, 921732, 919328, 918215, 917934, 917462, 917030, 918045, 921091, 925388, 930526, 937303, 946313, 956989, 968535, 980476, 991714, 1000657, 1007386, 1014365, 1023763, 1035124, 1046892, 1059121, 1073077, 1088941, 1105684, 1123042, 1142121, 1164031, 1188980, 1216681, 1246768, 1279131, 1314878, 1356502, 1405762, 1461490, 1520843, 1582746, 1648848, 1720858, 1798277, 1879180, 1961975]
62189A961975Q3472Q2347P8671P2326O3726N3548M2492L0775J8137M810q013j9332
62177B464934k9413l9005m8103n6328o3930p1192p7131q0082p9752p7722p5606
62166A766670p3480p0465o6236o1460n7010n3021m8796m3680l8117l3431l0290
62155A190684k7706k4140j9471j5327j3334j3354j3547j2108q983n817m017l051
62143A029829j227J890M851O436P362Q979J1149J2652J3322J4292J6055J7520
62131A143110J7547J6470J5506J5228J5263J5103J4664J4128J3643J3182J2516
62120A306360J1379R750P957O529N962O499P874R400J0560J1558J3096J5696J9490
62107A442110K4392L0104L5887M0898M4918M8421N1791N4753N6655N6969N5320
$$ y = [1961975, 2045447, 2127794, 2206465, 2278791, 2342517, 2396065, 2438557, 2469332, 2487469, 2492279, 2484266, 2464934, 2435521, 2396516, 2348413, 2292085, 2228155, 2156963, 2079832, 1999750, 1919998, 1842276, 1766670, 1693190, 1622725, 1556489, 1495029, 1438019, 1384998, 1336202, 1292522, 1254405, 1220974, 1190684, 1162978, 1138838, 1119367, 1104040, 1090706, 1077352, 1063805, 1051697, 1042714, 1036897, 1032880, 1029829, 1028602, 1030492, 1035343, 1041779, 1049141, 1058120, 1069269, 1081921, 1095243, 1109535, 1125590, 1143110, 1160657, 1177127, 1192633, 1207861, 1223124, 1238227, 1252891, 1267019, 1280662, 1293844, 1306360, 1317739, 1327489, 1335446, 1341975, 1347937, 1354436, 1362310, 1371710, 1382270, 1393828, 1406924, 1422620, 1442110, 1466502, 1496606, 1532493, 1573391, 1618309, 1666730, 1718521, 1773274, 1829929, 1886898, 1942218]
62096A942218N1439M5573L8824L2567K7272K2037J5408O657l682j4323k3942l1639
62084B108409l7200m1226m4662m7700m9369m8689m6198m3608m1768l9723l6234
62073A632032l1583k7132k3481k0110j6779j4184j2814j1867j0094p381m713k720
62061A449174r94R21K519K926K178J249Q17O14J88l19o06r46j850l201m362n065
62045A443243n614o256o888p480q128q690q849q549p748n870k532J080K937K784
62031A373440K873N085Q499J1041J2529J4334J6546J7629J7174J7065J8959K1981
62019A537155K4165K5349K7195L0619L4262L5903L4784L2291L0485L0190L0674
62008A873072L1085L1700L3227L5358L7006L7912L8978M0687M2249M2861M2802
$$ y = [1942218, 1993657, 2039230, 2078054, 2110621, 2137893, 2159930, 2175338, 2181995, 2178313, 2163990, 2140048, 2108409, 2071209, 2029983, 1985321, 1937621, 1888252, 1839563, 1793365, 1749757, 1707989, 1668266, 1632032, 1600449, 1573317, 1549836, 1529726, 1512947, 1498763, 1485949, 1474082, 1463988, 1456607, 1451894, 1449174, 1448180, 1449101, 1451620, 1454546, 1456724, 1457973, 1458790, 1459404, 1459592, 1459273, 1458667, 1457721, 1455871, 1452670, 1448308, 1443243, 1437629, 1431373, 1424485, 1417005, 1408877, 1400187, 1391338, 1382789, 1375041, 1369171, 1366639, 1367719, 1370656, 1373440, 1376313, 1381398, 1389897, 1400938, 1413467, 1427801, 1444347, 1461976, 1479150, 1496215, 1515174, 1537155, 1561320, 1586669, 1613864, 1644483, 1678745, 1714648, 1749432, 1781723, 1812208, 1842398, 1873072, 1904157, 1935857, 1969084, 2004442, 2041448, 2079360, 2118338, 2159025, 2201274, 2244135, 2286937]
61997B286937M2474M1273L8406L4259K9728K4643J8009R669N38q763j8258k7477
61985B471438l5276m1362m6932n3103n9494o5066o9507p2936p4843p4513p2349
61974A806057o9759o7489o4808o0608n4925m9116m4763m2479m1572m0677l8774
61963A231087l5645l1722k7884k5255k4409k4459k3659k1435j9182j8367j8476
61952I60594j7803j5757j3235j0935q697o603n483n697o424o644o065m637k212
61939H50402O46K386K065O58j65p3p2p99j865k713l223l416l338l416m278o012
61923H26787p958r260r397q380o844n728n344n016m131l207l109l533l321k273
61909G49286j593k085k869k526r44O08J072P05O38J629L325M713N288N523O090
$$ y = [2286937, 2329411, 2370684, 2409090, 2443349, 2473077, 2497720, 2515729, 2525398, 2525936, 2517173, 2498915, 2471438, 2436162, 2394800, 2347868, 2294765, 2235271, 2170205, 2100698, 2027762, 1952919, 1878406, 1806057, 1736298, 1668809, 1604001, 1543393, 1488468, 1439352, 1394589, 1352110, 1310538, 1269861, 1231087, 1195442, 1163720, 1135836, 1110581, 1086172, 1061713, 1038054, 1016619, 997437, 979070, 960594, 942791, 927034, 913799, 902864, 894167, 887564, 882081, 876384, 869960, 863316, 857251, 852614, 850402, 851048, 853434, 855499, 856157, 855992, 855919, 855847, 855048, 853183, 850470, 847247, 843831, 840493, 837077, 832799, 826787, 818829, 809569, 800172, 791792, 784948, 779220, 773876, 768860, 764729, 761522, 758413, 754880, 751559, 749286, 747693, 745608, 742739, 740213, 739269, 739877, 740949, 741654, 742292, 743921, 747246, 751959, 757247, 762770, 768860]
61894G68860O980P776Q418R125R742R867R512R100Q936R312J0804J3528J6177
61881H98137J7051J6417J6679J9619K4221K7838K8877K7683K5509K3489K2307
61870A147827K1929K1574K0371J8138J5348J2643J0492Q935P392N115K181l20
61858A291625j481j595j667k145k523k061o36J107K408L382N137Q436J2418J5297
61844A327702J6307J6070J5096J3108J0199P363N044K249j877o380r674j1808
61832A383399j4266j7645k0793k2390k2393k1637k0686j9492j7913j6271j5404
61821A174509j5930j7410j8647j8986j8738j8066j6447j3886j1757j1264j1589
61810A001789j0788q235n110k643j039QQ65K137M212O520Q203R487J1432J4252
$$ y = [768860, 775840, 783616, 792034, 801159, 810901, 820768, 830280, 839380, 848316, 857628, 868432, 881960, 898137, 915188, 931605, 948284, 967903, 992124, 1019962, 1048839, 1076522, 1102031, 1125520, 1147827, 1169756, 1191330, 1211701, 1229839, 1245187, 1257830, 1268322, 1277257, 1284649, 1289764, 1291945, 1291625, 1290144, 1288549, 1286882, 1284737, 1282214, 1280153, 1279517, 1280624, 1283032, 1286414, 1291551, 1299987, 1312405, 1327702, 1344009, 1360079, 1375175, 1388283, 1398482, 1405845, 1410889, 1413138, 1411261, 1404881, 1395207, 1383399, 1369133, 1351488, 1330695, 1308305, 1285912, 1264275, 1243589, 1224097, 1206184, 1189913, 1174509, 1158579, 1141169, 1122522, 1103536, 1084798, 1066732, 1050285, 1036399, 1024642, 1013378, 1001789, 991001, 982766, 977656, 975013, 973974, 973982, 974847, 976984, 981196, 987716, 995919, 1005406, 1016838, 1031090]
61796A031090J7113J9708K2712K6253K9246L0927L1965L3360L5193L7221L9625
61785A354413M2133M3355M2253L9617L6862L3866K9450K3727J8319J4020R802
61774A687817M882M13j996k617l121m136m473k995q6L214O564R967J2591J3128
61760A719152J1455R070P293N546K030m000j1152j7257k1479k4797k8518l2699
61748A614644l6339l8822m0438m1365m1009l9103l6733l5114l3749l1233k7775
61737A212964k5269k4393k3541k1635k0098k0303k0530j8038j3441j0296j0172
61726A005248j0793r970q845r456j0895j0399p495m770m282n133n302m449l675
61713I09784l378k696j231k0j76j196j609j080p45j196j345j60J377J391j15j075
$$ y = [1031090, 1048203, 1067911, 1090623, 1116876, 1146122, 1177049, 1209014, 1242374, 1277567, 1314788, 1354413, 1396546, 1439901, 1482154, 1521771, 1558633, 1592499, 1621949, 1645676, 1663995, 1678015, 1687817, 1692699, 1693112, 1691116, 1688499, 1685378, 1681242, 1676769, 1673774, 1673688, 1676902, 1683466, 1693433, 1706024, 1719152, 1730607, 1739677, 1746970, 1752516, 1754546, 1750546, 1739394, 1722137, 1700658, 1675861, 1647343, 1614644, 1578305, 1539483, 1499045, 1457680, 1416671, 1377568, 1340835, 1305721, 1271972, 1240739, 1212964, 1187695, 1163302, 1139761, 1118126, 1098028, 1077725, 1057195, 1039157, 1025716, 1015420, 1005248, 994455, 984485, 975640, 966184, 955289, 944890, 937395, 932625, 928343, 923210, 917908, 913459, 909784, 906406, 903710, 902479, 902459, 902283, 901087, 899478, 898398, 897653, 896457, 895112, 894952, 896329, 897720, 897605, 896530]
61697H96530j08J812K923K905K744L072L482L219K007K91j075j569j587j999l005
61682I09642l937m297m423m877n627o159n928m544k131L14J546J449J138J406
61668H73572J863K036K299K908L039J950N50N19K048L695M389M438M390M114L449
61653I15259K732K065Q40j208l031l242j807j50L94l83j945l656m797m745l769
61638H92557l297m563o949q355p534n471m018l679l522k937k491k848l689m195
61624H29009m103l759l486l353l316l224k791j984j373j746l257n074n901n103
61610G80539l507k848l945n522n535l699j897j808l006l845l481k260q16L41P33
61595G39444L22j65k4N44R61J189J347J039J67J0J888M798O014M525K386J821
$$ y = [896530, 896422, 898234, 901157, 904062, 906806, 909878, 913360, 916579, 918586, 918877, 917802, 916233, 914646, 912647, 909642, 905705, 901408, 896985, 892108, 886481, 880322, 874394, 869850, 867719, 868033, 869579, 871028, 872166, 873572, 875435, 877471, 879770, 882678, 885717, 887667, 888217, 888736, 890784, 894479, 898868, 903306, 907696, 911810, 915259, 917991, 920056, 920896, 919688, 916657, 913415, 911608, 911458, 911852, 911469, 909524, 905868, 901071, 896326, 892557, 889260, 884697, 877748, 869393, 861859, 856388, 852370, 848691, 845169, 842232, 839741, 836893, 833204, 829009, 824906, 821147, 817661, 814308, 810992, 807768, 804977, 802993, 801620, 799874, 796617, 791543, 785642, 780539, 777032, 774184, 770239, 764717, 759182, 755483, 753586, 751778, 748772, 744927, 741446, 739186, 738370, 738711, 739444, 739766, 739601, 739577, 740121, 741082, 742271, 743618, 744657, 744824, 744834, 746722, 751520, 757534, 762059, 764445, 766266]
61579G66266K435K364J100l39j288j897k001j161K1J4j725l926n067m883l972
61564G45941k930k514l624o041p872p473n580m409m658m752l360j453j037k592
61550F87646m750o175o781p088p216o906o158n406n078n222n608o096o767p574
61536F00821q076p809o880n911n315m952m479l744k730j612r30j212k145k680
61522E42346k285j574j376j797k679m138n808o289m506j348J180K197K274J773
61508E17970L55j658k858k451j350q07q15n99l5K76M9l21k36N93J884K793K656
61491E15446J896J611J989J925O91q23j339r68p53q56k85J458L331L774K372L22
61475E29791p65m38K19K8o97n51R51K551K741J419k92j201o98R13K188J527r09
$$ y = [766266, 768701, 771065, 772165, 771826, 770538, 768641, 766640, 765479, 765500, 765514, 763789, 759863, 754796, 749913, 745941, 743011, 740497, 736873, 730832, 722960, 715487, 709907, 705498, 700840, 696088, 692728, 691275, 690238, 687646, 682896, 676721, 669940, 662852, 655636, 648730, 642572, 637166, 632088, 626866, 621258, 615162, 608395, 600821, 592745, 584936, 578056, 572145, 566830, 561878, 557399, 553655, 550925, 549313, 548383, 547171, 545026, 542346, 540061, 538487, 537111, 535314, 532635, 528497, 522689, 516400, 511894, 510546, 511726, 513923, 516197, 517970, 518325, 516667, 513809, 511358, 510008, 509201, 508386, 507787, 507752, 508028, 508077, 507756, 507520, 508113, 509997, 512790, 515446, 517342, 518953, 520942, 522867, 523558, 522735, 521396, 520428, 519675, 518819, 518534, 519992, 523323, 527097, 529469, 529791, 529026, 528588, 528807, 528835, 528138, 527587, 528538, 531089, 533830, 535249, 534957, 533756, 533058, 533971, 536159, 537686, 536777]
61458E36777l020l230k214j375p49K29Q48r6k042k998k211r08k72j80j77k14j7
61441E18151Q41J755J490K70l3J235K176J120o78r04J87J93j668l276k588l13
61425E17958J337J435Q86P29R64J108J131J444K176K875L092L045L319L920M077
61410E49496L227J858Q60L50l14j416k320k275j308j30N97O49J45m89o32N1J012
61393E49361J229M75n2J038L503N473N468L882K140R60J55l00J4J052J984K192
61377E78574K030K259L069M013M597M530L734K476J332P04N19N70Q37J135Q59
61362F11238k94j437j025J381M298N714N181M077L810M189L971K662J142M48N63
61347F45918P93P74M96j96j267j887j193L00J045N54J16P74J543P92j146k136
$$ y = [536777, 533757, 530527, 528313, 526938, 526189, 526418, 527266, 527170, 525128, 522130, 519919, 519011, 518739, 518559, 518382, 518168, 518151, 518992, 520747, 522237, 522507, 522474, 523709, 525885, 527005, 526327, 525423, 525610, 525803, 524135, 520859, 518271, 517958, 519295, 520730, 521616, 522345, 523309, 524417, 525548, 526992, 529168, 532043, 535135, 538180, 541499, 545419, 549496, 552723, 554581, 555441, 555791, 555477, 554061, 551741, 549466, 548158, 548028, 548625, 549274, 549419, 548930, 548298, 548349, 549361, 550590, 551065, 551013, 552051, 555554, 561027, 566495, 570377, 572517, 573477, 573632, 573332, 573346, 574398, 576382, 578574, 580604, 582863, 585932, 589945, 594542, 599072, 602806, 605282, 606614, 607318, 607837, 608407, 609244, 610379, 611238, 610944, 609507, 608482, 609863, 614161, 619875, 625056, 629133, 632943, 637132, 641103, 643765, 644907, 645355, 645918, 646711, 647485, 647981, 647785, 646518, 644631, 643438, 643738, 644783, 645337, 645453, 646227, 647770, 648562, 647416, 645280]
61331F45280j006R41J643O73o88j248j019o51m73l94m05o48r10m90R75K723L464
61314F47767K860J922J751K388L108L334K812J594M00M03J752K791J846m80j970
61299F72278j692p89j30J204M075P291Q844Q600Q347R337J0923J1655J0830Q895
61285G59668P035O437P261Q410Q829Q775R048R451R211Q672R000R995R858P777
61271H79427N278L998L500K550J445J384K217K548J808O98l37j531k513k141j94
61256H98137K055L519M602O177Q100R453R684R068Q599R611J2614J6113J7660
61243A015392J6698J5360J5524J6142J4852J1506Q392P003O172L928Jm095o792
61230A120083p608p161o654p143q676j0240j0856j0623j0503j1117j2051j2360
$$ y = [645280, 644274, 645215, 646858, 647531, 646843, 645595, 644576, 643925, 643452, 643058, 642653, 642005, 641095, 640605, 641580, 644303, 647767, 650627, 652549, 654300, 656688, 659796, 663130, 665942, 667536, 667936, 668339, 670091, 672882, 674728, 674248, 672278, 670586, 669797, 669667, 670871, 674946, 682237, 691081, 699681, 708028, 717365, 728288, 739943, 750773, 759668, 766703, 773140, 780401, 788811, 797640, 806415, 815463, 824914, 834125, 842797, 851797, 861792, 871650, 879427, 884705, 888703, 892203, 894753, 896198, 897582, 899799, 902347, 904155, 904853, 904516, 902985, 900472, 898331, 898137, 900192, 903711, 908313, 914490, 922590, 932043, 941727, 950795, 959394, 969005, 981619, 997732, 1015392, 1032090, 1047450, 1062974, 1079116, 1093968, 1105474, 1113866, 1120869, 1127041, 1130969, 1130970, 1126875, 1120083, 1112475, 1105314, 1098660, 1091517, 1082841, 1072601, 1061745, 1051122, 1040619, 1029502, 1017451, 1005091]
61218A005091j1556r941q076o205m346k790k046k123k229j513k1J393K034K030
61204I59702K070K699L945N438O843Q073R196J0058J0258R569Q388P560P630Q267
61190A059696Q595Q232P804Q001Q205O847L519R0j110J00J741K055R86n55j827
61175A112379k350j842o72K06K27k16l42L89K178M683O780P473P307P915R819
61160A153934J1706J2376J2184J1838J1102R777Q907R460J0605J0789R987R358
61148A282023R059Q092O227M477L404K523J770K105L898N968P092P608Q524R814
61134A362584J0622J0878J1547J3152J4738J4823J3103J0821R380Q866Q162O348
61122A495024L583O96j380j765j84K040K433k75m634q074r542r811r836j0051
$$ y = [1005091, 993535, 983594, 975518, 969313, 964967, 962177, 960131, 958008, 955779, 954266, 954245, 955638, 957672, 959702, 961772, 964471, 968416, 973854, 980697, 988770, 997966, 1008024, 1018282, 1027851, 1036239, 1043799, 1051429, 1059696, 1068291, 1076523, 1084327, 1092328, 1100533, 1107380, 1110899, 1110989, 1109879, 1109979, 1111720, 1113775, 1114761, 1114206, 1112379, 1110029, 1108187, 1107515, 1107721, 1107948, 1107732, 1107390, 1107779, 1109957, 1114640, 1121420, 1128893, 1136200, 1144115, 1153934, 1165640, 1178016, 1190200, 1202038, 1213140, 1222917, 1231824, 1241284, 1251889, 1262678, 1272665, 1282023, 1291082, 1299174, 1305401, 1309878, 1313282, 1315805, 1317575, 1319680, 1323578, 1329546, 1336638, 1344246, 1352770, 1362584, 1373206, 1384084, 1395631, 1408783, 1423521, 1438344, 1451447, 1462268, 1471648, 1480514, 1488676, 1495024, 1498607, 1499303, 1497923, 1496158, 1495974, 1498014, 1500447, 1500172, 1495538, 1487464, 1477922, 1468111, 1458275, 1448224]
61108A448224j0813j2138j3052j2487j1055j0597j1696j2927j3112j3066j4157
61097A313124j6027j6932j6012j4328j3604j4478j5980j6457j5021j2310r769
61086A152206q317p879q064q700r466r545q172n610l305k842m470o576o933m728
61072A057599j195J770L285L640L604M012N365P263Q722R607J1132J4150J7776
61059A146730K0645K2826K5238K7793K9678L1133L3182L5521L6417L5300L3923
61048A478386L4192L5887L7308L7351L6112L4004L1080K7167K2292J7053J2470
61037A803302R064O324L446K31l324p715j3181j8576k2278k4161k5577k7361k8947
61024A651247k9520k9056k8084k7315k7405k8167k8262k6696k4337k2756k1921
$$ y = [1448224, 1437411, 1425273, 1412221, 1399734, 1388679, 1378082, 1366386, 1353459, 1340347, 1327281, 1313124, 1297097, 1280165, 1264153, 1249825, 1236221, 1221743, 1205763, 1189306, 1174285, 1161975, 1152206, 1143889, 1136010, 1127946, 1119246, 1109780, 1100235, 1092063, 1086453, 1083148, 1080306, 1075836, 1069260, 1062327, 1057599, 1056404, 1058174, 1061459, 1065099, 1068703, 1072715, 1078080, 1085343, 1094065, 1103672, 1114804, 1128954, 1146730, 1167375, 1190201, 1215439, 1243232, 1272910, 1304043, 1337225, 1372746, 1409163, 1444463, 1478386, 1512578, 1548465, 1585773, 1623124, 1659236, 1693240, 1724320, 1751487, 1773779, 1790832, 1803302, 1812366, 1818690, 1822136, 1822367, 1819043, 1811328, 1798147, 1779571, 1757293, 1733132, 1707555, 1680194, 1651247, 1621727, 1592671, 1564587, 1537272, 1509867, 1481700, 1453438, 1426742, 1402405, 1379649, 1357728]
61013A357728k0527j8199j5707j3223j0270p427o011n805n072l251j639q27M88
61000A250258L263O604R318J1402J3180J4672J6484J9571K3355K5984K7205K8913
60988A450209L1938L4576L5590L6473L9149M3367M8034N3139N8723O3646O7220
60977A962064P0426P4076P7617Q1196Q6593R4169J01286J06147J10807J17550
60967B881931J24649J29256J32713J39062J49228J60513J71375J83005J96184
60958D267916K09902K23664K38586K56021K77236L04114L38151L79520M29205
60949F924315M90271N64318O49321P45244Q58895R97548J161413J351133J577128
60940A5319586J840255K093225K240470K203897J993503J698164J403303J133904
$$ y = [1357728, 1337201, 1319002, 1303295, 1290072, 1279802, 1272375, 1266364, 1260559, 1255487, 1252236, 1250597, 1249770, 1250258, 1253521, 1260125, 1269443, 1280845, 1294025, 1308697, 1325181, 1344752, 1368107, 1394091, 1421296, 1450209, 1482147, 1516723, 1552313, 1588786, 1627935, 1671302, 1719336, 1772475, 1831198, 1894844, 1962064, 2032490, 2106566, 2184183, 2265379, 2351972, 2446141, 2547427, 2653574, 2764381, 2881931, 3006580, 3135836, 3268549, 3407611, 3556839, 3717352, 3888727, 4071732, 4267916, 4477818, 4701482, 4940068, 5196089, 5473325, 5777439, 6115590, 6495110, 6924315, 7414586, 7978904, 8628225, 9373469, 10232364, 11229912, 12391325, 13742458, 15319586, 17159841, 19253066, 21493536, 23697433, 25690936, 27389100, 28792403, 29926307]
60932B9926307Q84897O81200N70892N53182N42015M27584J71461j72985n28600
60923C3055953q61406j176154j469690j712770j874965j949549j949705j892680
60915B0169034j794515j671621j537936j401474j267402j141798j028657r25866
60907I399765q28585p35666o49869n73312n05940m47386l97195l53683l15007
60898D593122k80888k51443k25255k00852j79134j61836j48166j35391j22550
60889B887607j11172j02440r5664q9725q4010p7772p0436o3021n7622n4921n3302
60878B027522n0842m7160m3142l9893l8199l8065l8411l7813l5678l2331k8374
60867A597614k4665k2384k1958k2145k1273j9290j7562j6768j6094j4657j2569
$$ y = [29926307, 30811204, 31492404, 32063296, 32616478, 33158493, 33586077, 33757538, 33584553, 33055953, 32194547, 31018393, 29548703, 27835933, 25960968, 24011419, 22061714, 20169034, 18374519, 16702898, 15164962, 13763488, 12496086, 11354288, 10325631, 9399765, 8571180, 7835514, 7185645, 6612333, 6106393, 5659007, 5261812, 4908129, 4593122, 4312234, 4060791, 3835536, 3634684, 3455550, 3293714, 3145548, 3010157, 2887607, 2776435, 2673995, 2578331, 2488606, 2404596, 2326824, 2256388, 2193367, 2135745, 2080824, 2027522, 1976680, 1929520, 1886378, 1846485, 1808286, 1770221, 1731810, 1693997, 1658319, 1625988, 1597614, 1572949, 1550565, 1528607, 1506462, 1485189, 1465899, 1448337, 1431569, 1415475, 1400818, 1388249]
60856A388249j0362q255o309m633l076j301P11K600M205N713P313R197J1802J5403
60842A411257J9410K2719K4872K6472K8308L0489L2545L3945L4352L3750L2530
60831A730649L1356L0624K9940K8344K5393K2028J9758J8585J6501J1925O056
60820A971159J540r10k974n879r007j1880j5556k0614k5298k7345k6999k6618
60808A799619k7785k9989l1793l2104l0766k8965k8587l0083l1431l0528k8101
60797A469487k6740k7264k7790k6650k4558k3131k2572k1991k1305k1448k2594
60786A203444k3217k1710j8626j6431j6667j8140j8745j8338j8388j9071j8671
60775I95440j6448j4258j4053j5231j5853j5421j4691j3589j1217p755m698l034
$$ y = [1388249, 1377887, 1369632, 1363323, 1358690, 1355614, 1354313, 1355024, 1357624, 1361829, 1367542, 1374855, 1384052, 1395854, 1411257, 1430667, 1453386, 1478258, 1504730, 1533038, 1563527, 1596072, 1630017, 1664369, 1698119, 1730649, 1762005, 1792629, 1822569, 1850913, 1876306, 1898334, 1918092, 1936677, 1953178, 1965103, 1971159, 1972699, 1971789, 1968815, 1962936, 1953929, 1942049, 1926493, 1905879, 1880581, 1853236, 1826237, 1799619, 1771834, 1741845, 1710052, 1677948, 1647182, 1618217, 1589630, 1559547, 1528116, 1497588, 1469487, 1442747, 1415483, 1387693, 1361043, 1336485, 1313354, 1290782, 1268791, 1247486, 1226038, 1203444, 1180227, 1158517, 1139891, 1123460, 1106793, 1088653, 1069908, 1051570, 1033182, 1014111, 995440, 978992, 964734, 950681, 935450, 919597, 904176, 889485, 875896, 864679, 856924, 852226, 849192]
60763H49192k409k177k228k715l711n113o250o001m094j741j52R35K156K800J815
60748H20307J4o06L31J130N86n46r71m23N49J229R44l19j452j469j067j604k733
60731H13900k826j855j753l313m687m100k393j605k389m051n962p530p822o689
60717G56925n547n671o388o213n103m183l761l213k575k665l486l920l411k726
60703F98063k614k682k128q95M59J451J812J466P81M75Q10J311J513J556J578
60688G02956J194L03l0J452M183N856N029K935J859K202K193L93k447m406m567
60673G19105l729l409m514o619q284q340p179o311o517o989o696n904n640o137
60659F32837o547o095m843l507l032l960n580o103m543k190j229j949k522j683
$$ y = [849192, 846783, 844606, 842378, 839663, 835952, 830839, 824589, 818588, 814494, 812753, 812601, 813536, 815692, 818492, 820307, 820321, 819715, 820046, 821176, 821762, 821216, 820245, 819822, 820371, 821600, 822544, 822225, 820773, 819304, 818237, 816633, 813900, 811074, 809219, 807466, 804153, 799466, 795366, 792973, 791368, 788979, 784928, 778966, 771436, 763614, 756925, 751378, 745707, 739319, 733106, 728003, 723820, 720059, 716846, 714271, 711606, 708120, 704200, 700789, 698063, 695449, 692767, 690639, 689744, 690203, 691654, 693466, 694932, 695713, 696188, 696998, 698309, 699822, 701378, 702956, 704150, 704453, 704423, 705875, 710058, 715914, 720943, 723878, 725737, 727939, 730132, 730525, 728078, 723672, 719105, 715376, 711967, 707453, 700834, 692550, 684210, 677031, 670720, 664203, 657214, 650518, 644614, 638974, 632837, 626290, 620195, 615352, 611845, 608813, 604853, 599273, 593170, 588627, 586437, 585208, 583259, 580737, 579054]
60645E79054m60n54j883k728j952k89O65J75j055j794j452k87J227K804L986L985
60629E79442K511N72j88R67L290N375O210N596M225L313L597M555N033M739M596
60614F33833N483P133Q621R425R526Q750O780M081K213K441L955M306K160r22
60600G07785k289j336K75J203J729K201J977Q37RM49J179P48m84j089j013j484
60584G10697k721l523l310l035l635m781n634n865n592n083m866n357o187o612
60570F44496o587o626o632n849m171k594k074k568l189k768n60K668M566L524
60556F11636Q75m70M21J824K219K081K253K293J500L88m2L14R13J486J981K091
60540F31763J607P95l4q29j454j521r50m4R48J689J373l42k140k166n53P17P26
$$ y = [579054, 578594, 578040, 576157, 573429, 571477, 571188, 571853, 572028, 570973, 569179, 567727, 567440, 568667, 571471, 575457, 579442, 581953, 582525, 582337, 583304, 586594, 591969, 598179, 603775, 608000, 611313, 614910, 619465, 624498, 629237, 633833, 639316, 646449, 655070, 664495, 674021, 682771, 689551, 693632, 695845, 698286, 702241, 706547, 708707, 707785, 705496, 704160, 704435, 705638, 707367, 709568, 711545, 712382, 712391, 712840, 714019, 714767, 714283, 713194, 712181, 710697, 707976, 704453, 701143, 698108, 694473, 689692, 684058, 678193, 672601, 667518, 662652, 657295, 651108, 644496, 637909, 631283, 624651, 618802, 614631, 612037, 609963, 607395, 604206, 601438, 600878, 603546, 608112, 611636, 612511, 612041, 612462, 614286, 616505, 618586, 620839, 623132, 624632, 625020, 624978, 625292, 626205, 627691, 629672, 631763, 633370, 634165, 634131, 633302, 631848, 630327, 629377, 629333, 630281, 631970, 633343, 633001, 630861, 628695, 628142, 628859, 629585]
60523F29585O58J361J732P37n56m47J099K908M323N277N568N399N747O985Q045
60508F78421Q179Q497J0301J2744J3814J2943J1137R134P106N549M733L650J400
60495G87608p39o93J017J431p07l026k726j28K201K828K718L634O272R841J2868
60480H22399J4485J5073J5502J5962J6008J5592J5100J4300J2280Q793M991K217
60468I72702O98j91q39j255j629k352l468m538n255n859o610o892n441k011J528
60453I28588K734J399q0M16K384M010M897O277Q899J2096J4967J7487K0065K2935
60439A047074K6257L0239L4661L8695M1487M2797M3012M2635M1663L9336L4876
60428A462732K8574K1654J4687O873k508j2495k1207k7771l2650l6471l9525m2103
$$ y = [629585, 630243, 631604, 633336, 634073, 633517, 633070, 634169, 637077, 641400, 646677, 652245, 657644, 663391, 670376, 678421, 686600, 695097, 705398, 718142, 731956, 744899, 756036, 765170, 772276, 777825, 782558, 786208, 787608, 786869, 786176, 787193, 788624, 787917, 784891, 782165, 782037, 784238, 787066, 789784, 793418, 799690, 809531, 822399, 836884, 851957, 867459, 883421, 899429, 915021, 930121, 944421, 956701, 965494, 970485, 972702, 973400, 973209, 972370, 971115, 969486, 967134, 963666, 959128, 953873, 948014, 941404, 934512, 929071, 927060, 928588, 931322, 932721, 932641, 933057, 935441, 939451, 944348, 950625, 959524, 971620, 986587, 1004074, 1024139, 1047074, 1073331, 1103570, 1138231, 1176926, 1218413, 1261210, 1304222, 1346857, 1388520, 1427856, 1462732, 1491306, 1512960, 1527647, 1534520, 1532012, 1519517, 1498310, 1470539, 1437889, 1401418, 1361893, 1319790]
60416A319790m4216m5101m4021m1530l8846l6159l2785k9020k6354k5386k4816
60405I31556k3244k0885j8705j6785j4652j2710j2168j3440j5324j5948j4331
60394G53364j1066p682n363m229l777l684l875m061l847l290k906l089l864n040
60380F87591o021n757l705q74R55J174P76O76N54k17j345j987j821j132k32O28
60364F69263J014M99p84k020k221j100L73O57o00j730q25J740L524K969J148J80
60348F72087Q16K248L535M336M625M487M150L721L053K211J782K319L630M910
60334G17910N425M900L647K568K651M000N633O427O028M751L138J943J921L039
60320G73981M286M857N109N744O415N989M230K412K033L274M925N551M677K987
$$ y = [1319790, 1275574, 1230473, 1186452, 1144922, 1106076, 1069917, 1037132, 1008112, 981758, 956372, 931556, 908312, 887427, 868722, 851937, 837285, 824575, 812407, 798967, 783643, 767695, 753364, 742298, 734616, 729253, 725024, 721247, 717563, 713688, 709627, 705780, 702490, 699584, 696495, 692631, 687591, 681570, 675813, 672108, 671234, 672189, 673363, 674139, 674815, 675369, 675152, 673807, 671820, 669999, 668867, 668635, 669263, 670277, 670776, 669992, 667972, 665751, 664651, 665024, 665681, 665081, 663351, 662526, 664266, 667790, 670759, 671907, 672087, 672903, 675151, 678686, 683022, 687647, 692134, 696284, 700005, 703058, 705269, 707051, 709370, 713000, 717910, 723335, 728235, 731882, 734450, 737101, 741101, 746734, 753161, 759189, 763940, 767078, 769021, 770942, 773981, 778267, 783124, 788233, 793977, 800392, 806381, 810611, 813023, 815056, 818330, 823255, 828806, 833483, 836470]
60306H36470J519O90K46P9N39J619K430K154J374J654L627O125P561P709P758
60291H81554Q770J0585J2287J3266J3498J3023J1715R739P766O257M731K327r03
60278I94615l753n201n561n982o963p834p734o841o284o666p115o409m991m889
60264I08392p010r466r660p533n424m799m750l889k171j32K200M559N795N368
60250H71480M664N473P746J0270J2979J6744K1034K3730K3848K2801K2112K1086
60238A063967J7954J2439N969j72n769j0925j5367j8691k0681k1278k0670j9391
60226I67385j7876j5996j3429j0510q143o896o604o909p630q349q275p042n283
60213H44443l966l399l357l853m989o141o261n259m355m403m556l459j461n49
$$ y = [836470, 837989, 838679, 838925, 839004, 839543, 841162, 843592, 845746, 847120, 848774, 852401, 858526, 866087, 873796, 881554, 890324, 900909, 913196, 926462, 939960, 952983, 964698, 974437, 982203, 988460, 993191, 995518, 994615, 990862, 985661, 980100, 974118, 967155, 959321, 951587, 944746, 938462, 931796, 924681, 918272, 913281, 908392, 901382, 891916, 882256, 874723, 869299, 864500, 859750, 855861, 853690, 853558, 855758, 860317, 866112, 871480, 876144, 881617, 889363, 899633, 912612, 929356, 950390, 974120, 997968, 1020769, 1042881, 1063967, 1081921, 1094360, 1100329, 1100157, 1094388, 1083463, 1068096, 1049405, 1028724, 1007446, 986776, 967385, 949509, 933513, 920084, 909574, 901431, 894535, 887931, 881022, 873392, 865043, 856768, 849726, 844443, 840477, 837078, 833721, 829868, 824879, 818738, 812477, 807218, 802863, 798460, 793904, 790445, 788984, 788435]
60199G88435j911m406n870n367l699k180j408j063m26P94J961K026P89p03j314
60184G65658r67k08Q36K258L456L444K210Q80K45m1l84l19O69J956K412J977J731
60167G85813K460L864N183N875N587M250K504J457J621K517L482M361N102N482
60153H39558N739O726Q592R836Q894O503N285O683R403J1350J2119J2665J3318
60140I56671J3349J2345J0861R513Q282P098O379O358O432N818M672L835L554
60127A055167L165K167R13j05j041k174l205l759m248n299o400o293m900l891
60113A020097m609o348p414p306o866o677o379n505m221l144k920l726m748m583
60099I45651k940j406j474k257j613O91K624K940K718L099L221J821k35o66J377
$$ y = [788435, 786524, 782118, 776248, 770881, 767182, 765002, 763594, 762531, 762105, 762899, 764860, 766886, 767675, 766972, 765658, 764691, 764483, 765319, 767577, 771033, 774477, 776687, 777567, 777812, 777771, 777387, 777068, 777737, 779693, 782105, 784082, 785813, 788273, 792137, 797320, 803195, 808782, 813032, 815536, 816993, 818614, 821131, 824613, 828974, 834076, 839558, 845297, 852023, 860615, 870451, 879345, 885848, 891133, 897816, 907219, 918569, 930688, 943353, 956671, 970020, 982365, 993226, 1002739, 1011021, 1018119, 1024498, 1030856, 1037288, 1043106, 1047778, 1051613, 1055167, 1058332, 1060499, 1061412, 1061307, 1060266, 1058092, 1054887, 1051128, 1046880, 1041581, 1035181, 1028888, 1023988, 1020097, 1015488, 1009140, 1001726, 994420, 987554, 980877, 974498, 968993, 964772, 961628, 958708, 954982, 950234, 945651, 942711, 941305, 939831, 937574, 935961, 936652, 939276, 942216, 944934, 948033, 951254, 953075, 952840, 952174, 953551]
60084I53551M354O116N748L952K329K110K998L569L135K564K834L677M423N052
60070A006412N385M281J261j852k650j292r5m2L63K333M732N671M917L655K780
60055A035859K468K785L775N067O091O595O607O129N119L569J546n69j909j701
60041A081431k12J345J862J138k37j229r87K31R12Mj499j755p10j17q31j640j418
60024A076288q77j129j780j894j854k695m054m440l534k780l318m594n583o351
60010A031405p523q915r720r930j0566j2119j3510j3197j1065q554p041o747p171
59997I05347p715p647o375m448l456m066m824l994j943n09l80o28o34q28j290
59982H56610j154j2J476K909M710O704P587O784N620N368N279L958J866Q35J356
$$ y = [953551, 957905, 964021, 969769, 973721, 976050, 978160, 981158, 984727, 987862, 990426, 993260, 996937, 1001360, 1006412, 1011797, 1016078, 1017339, 1015487, 1012837, 1011545, 1011450, 1011408, 1011771, 1014104, 1018836, 1024507, 1029424, 1033079, 1035859, 1038327, 1041112, 1044887, 1049954, 1056045, 1062640, 1069247, 1075376, 1080495, 1084064, 1085610, 1085041, 1083132, 1081431, 1081219, 1082564, 1084426, 1085564, 1085327, 1084098, 1083111, 1083342, 1084254, 1084258, 1082759, 1081004, 1080294, 1080177, 1079346, 1077706, 1076288, 1075411, 1074282, 1072502, 1070608, 1068754, 1066059, 1062005, 1057565, 1054031, 1051251, 1047933, 1043339, 1037756, 1031405, 1023882, 1014967, 1005247, 995317, 984751, 972632, 959122, 945925, 934860, 926306, 919265, 912518, 905347, 897632, 889985, 883610, 879162, 875706, 871640, 866816, 862822, 860879, 860370, 859990, 859362, 858728, 857900, 856610, 855456, 855444, 856920, 859829, 864539, 871243, 878830, 885614, 891234, 896602, 901881, 905839, 907705, 908540, 909896]
59967I09896J988J436Kj332k318l521n483p949r790r940q738p805q086q588p832
59952H31940n987m525m138m189m151m384n159n853n730m880l937l236k657k041
59938G71073j387o98J29R99J333L74j715l321k692m8K413K995K241J825K431L501
59922G79453M346M599M086L143K707L082L146J789k38j235j037j190k487l842
59908G96322m095l726l956m956n700n092k814L32K564K390L92r71k9K138L182
59893G75981K384J107P33J249K026K837L590L857L484L335M405O164O619M679
59879H22450J850P44J966L402K922R88k08K87J144P33p56j715j068P44K490L251
59863H39224K811J625O49P48J806K664K484K054K897N007O481O000M726M593N378
$$ y = [909896, 911884, 913320, 913322, 911990, 909672, 906151, 900668, 892719, 882929, 872989, 864251, 856446, 848360, 839772, 831940, 825953, 821428, 817290, 813101, 808950, 804566, 799407, 793554, 787824, 782944, 779007, 775771, 773114, 771073, 769686, 768988, 769117, 770116, 771449, 771823, 770108, 766787, 764095, 764047, 766460, 769455, 771696, 773521, 775952, 779453, 783799, 788398, 792484, 795627, 798334, 801416, 804562, 806351, 806113, 804878, 803841, 802651, 800164, 796322, 792227, 788501, 784545, 779589, 773889, 768797, 765983, 766315, 768879, 771269, 771661, 770690, 770661, 772799, 775981, 778365, 779472, 780205, 781454, 783480, 786317, 789907, 793764, 797248, 800583, 804988, 811152, 817771, 822450, 824300, 825044, 827010, 830412, 833334, 834322, 834114, 834401, 835545, 836278, 835522, 833807, 832739, 833483, 835973, 839224, 842035, 843660, 844309, 845057, 846863, 849527, 852011, 854065, 856962, 861969, 868450, 874450, 879176, 883769, 889147]
59848H89147N103L224J633J766K400J540n09j583p59N13N38n26j209o80M93J278
59832I02369J493J908L090M539N394N834O876Q759J0419J0961J0625R790Q111
59819I90168N609L527K917L078K746K149K297K691J648j018l409m211m343n212
59805I98637o648p545p631p507p504p428p076o350n098l357j394Q38L799P376
59791I43112J0299J1286J0578R703R719J0184R982Q712P042N886N458N243M759
59778A051963L943K751Q94j548l656m580m775n513p054q163p743o320n370n608
59764I99221o424o802o510o400p524r713j1229j0318p156l682j483m82J22M35
59750I22055j05j778m135o256p232o760n470m308l472k449j154k93l74j149k353
$$ y = [889147, 894250, 897474, 899107, 900873, 903273, 904813, 904304, 902721, 901962, 902475, 903013, 902487, 901278, 900598, 901091, 902369, 903862, 905770, 908860, 913399, 918793, 924627, 931503, 940262, 950681, 961642, 972267, 982057, 990168, 995777, 999304, 1002221, 1005299, 1008045, 1010194, 1012491, 1015182, 1016830, 1015812, 1012403, 1008192, 1003849, 998637, 991989, 984444, 976813, 969306, 961802, 954374, 947298, 940948, 935850, 932493, 931099, 931937, 935736, 943112, 953411, 964697, 975275, 984978, 994697, 1004881, 1014863, 1023575, 1030617, 1036503, 1041961, 1047204, 1051963, 1055906, 1058657, 1059551, 1058003, 1054347, 1049767, 1044992, 1039479, 1032425, 1024262, 1016519, 1010199, 1004829, 999221, 992797, 985995, 979485, 973085, 965561, 955848, 944619, 934301, 927145, 923463, 921980, 921498, 921620, 922055, 921950, 920172, 916037, 909781, 902549, 895789, 890319, 886011, 882539, 880090, 878936, 878643, 878269, 877120, 874767]
59735H74767m038n541n298k792J26J253Q20P19J279P99j325l032k395n35k2j234
59719H53551k144j547n73n41j007r78p41j131j725j310L3P47j13j732k793k884
59703H35112k216q88Q97K569L702M308M333L619K837L458N906Q510R379Q681P917
59688H98124P543O759N483M975O020P782Q866Q640P161M768K399J454K520M566
59674I77060N964O062N411M764M312L816L171K717K786L021K545J233J86K73P37
59659A024058K75q69j161m3J339J849J532Q49K3l98L20J855K886K962K938K979
59643A041394J852n96k079p87J690K536J799J859L302M123L352K653L272L724
59629A068094K279O9l27J504L495L953K973J239q93k858l839l958m418n932p776
$$ y = [874767, 870729, 865188, 859890, 857098, 857224, 858477, 859297, 860016, 861295, 862094, 860769, 857737, 855342, 854807, 854785, 853551, 851407, 849860, 849287, 848746, 847739, 846761, 846020, 844889, 843164, 841854, 841887, 842634, 842521, 840789, 837996, 835112, 832896, 832008, 832905, 835474, 839176, 843484, 847817, 851436, 854273, 857731, 863637, 872147, 881526, 890207, 898124, 905667, 912426, 917909, 922884, 928904, 936686, 945552, 954192, 961353, 966121, 968520, 969974, 972494, 977060, 983024, 989086, 994497, 999261, 1003573, 1007389, 1010560, 1013277, 1016063, 1019084, 1021629, 1022862, 1023048, 1023321, 1024058, 1024333, 1023464, 1022303, 1022260, 1023599, 1025448, 1026980, 1027829, 1027852, 1027454, 1027774, 1029629, 1032515, 1035477, 1038415, 1041394, 1043246, 1042650, 1040571, 1039784, 1041474, 1044010, 1045809, 1047668, 1050970, 1055093, 1058445, 1061098, 1064370, 1068094, 1070373, 1070442, 1070115, 1071619, 1075114, 1079067, 1082040, 1083279, 1082386, 1079528, 1075689, 1071731, 1067313, 1061381, 1053605]
59614A053605q952r405r365q310n750k737j421k837n796q169q779p880o401n020
59600I62783l718k062j55R84N59n96o39J014K982L854L827L729L405K246O87j51
59584I78749j36k66j116k274l359m453n286n153m159l559m153n130n181m155k892
59569I27477k035j705j961k664l176k928k285k146k691l170l045k794l241m563
59555H89073o184p389p681o752m649k076j13O98Q64J175J635J592Q89K13J06J84
59539H61585k01r56j421j176k90Q52J538J007o29k118k332j441k74Q40J700J399
59523H58083o16k914l034n20K231K591K73l053n686o854o614n551m243k776j186
59508H20131k41q68k625l728k995j057O57J269O20p96j663o12K131M597N167M146
$$ y = [1053605, 1044653, 1035248, 1025883, 1017573, 1011823, 1009086, 1007665, 1004828, 999032, 990863, 982084, 974204, 967803, 962783, 959065, 957003, 956848, 957832, 958391, 957795, 957156, 958170, 961152, 965006, 968833, 972562, 975967, 978213, 978900, 978749, 978613, 978347, 977231, 974957, 971598, 967145, 961859, 956706, 952547, 948988, 944835, 939705, 934524, 930369, 927477, 925442, 923737, 921776, 919112, 915936, 913008, 910723, 908577, 905886, 902716, 899671, 896877, 893636, 889073, 882889, 875500, 867819, 861067, 856418, 854342, 854229, 854927, 855791, 856966, 858601, 860193, 861082, 861295, 861401, 861585, 861384, 860428, 859007, 857831, 857541, 858393, 859931, 860938, 860309, 858191, 855859, 854418, 854144, 854984, 856684, 858083, 857467, 854553, 851519, 850999, 853230, 855821, 856094, 853041, 847355, 840501, 833887, 828336, 824093, 821317, 820131, 819890, 819022, 816397, 812669, 809674, 808617, 809274, 810543, 811163, 810367, 808704, 808092, 810223, 814820, 819987, 824133]
59492H24133K924K375K574L252L958M351M658N238N704N474N120N864P715R773
59478H93113J2452J7058K2348K4106J9961J2722O898L603J119j120k010j511j022
59465A007717j048p63j2L53J34o5l32j178j798p64J274J730n04l677n762o620
59449I88685o920o810o597p134q462r387r292q972q949q416o856n263m614m458
59435H86555m158m143m560m173k252m65q47k652l213j575O82K158L215M467N388
59420H74427N228M315L753M358O132Q143Q881P617N553M694N410O156N864N354
59406I55885N620N867M602K090L79Q14K659M346N193N425N368N340N870P245Q985
59391A025688J0276J0915J1326J1854J2572J3554J4463J3924J0525M925j5k137
$$ y = [824133, 827057, 829432, 832006, 835258, 839216, 843567, 848225, 853463, 859167, 864641, 869761, 875625, 883340, 893113, 905565, 922623, 944971, 969077, 989038, 1001760, 1008658, 1012261, 1013380, 1012260, 1010250, 1008739, 1007717, 1006669, 1005906, 1005894, 1006247, 1006381, 1006316, 1005984, 1004806, 1003008, 1002244, 1003518, 1005248, 1004744, 1001067, 995305, 988685, 981765, 974955, 968358, 961224, 952762, 943375, 934083, 925111, 916162, 907746, 900890, 895627, 891013, 886555, 882397, 878254, 873694, 869521, 867269, 866804, 865957, 863305, 860092, 858517, 859199, 861357, 864572, 869039, 874427, 879655, 883970, 887723, 892081, 898213, 906356, 915237, 922854, 928407, 933101, 938511, 944667, 950531, 955885, 961505, 967372, 971974, 974064, 974443, 975257, 977916, 982262, 987455, 992880, 998248, 1003588, 1009458, 1016703, 1025688, 1035964, 1046879, 1058205, 1070059, 1082631, 1096185, 1110648, 1124572, 1135097, 1140022, 1140007, 1137870]
59379A137870k311l033n302p961r616j0009r616r079r082r708r899q568o284m564
59365A032838l470j414K185N557O910O822P305R371J2585J6120J9290K1776K4297
59352A160172K8038L2263L3713L0061K3118J6586J1369N445j849q210j1552j2151
59340A307003j0588o213K60M867L956j188o042q885j2491j9233k6973l1300l0480
59327A162693k6576k2471j9283j6686j4443j2846j1934j0915q847n937l605k734
59315A006416k328q04J574K793J962Q80J819M585O932P501P112P137P674P887
59301A061140P395O751O739P627R004J0097J0313R772R431J0461J3223J6642J8932
59288A197527J9307J8793J8896J9563J9387J7887J6550J6823J7942J7824J5693
$$ y = [1137870, 1135559, 1132526, 1127224, 1119263, 1109647, 1099638, 1090022, 1080943, 1071861, 1062153, 1052254, 1043686, 1037402, 1032838, 1029368, 1027954, 1030139, 1035696, 1042606, 1049428, 1056733, 1066104, 1078689, 1094809, 1114099, 1135875, 1160172, 1188210, 1220473, 1254186, 1284247, 1307365, 1323951, 1335320, 1340765, 1338916, 1330706, 1319154, 1307003, 1296415, 1290202, 1290462, 1295329, 1299285, 1298097, 1292055, 1283170, 1270679, 1251446, 1224473, 1193173, 1162693, 1136117, 1113646, 1094363, 1077677, 1063234, 1050388, 1038454, 1027539, 1018692, 1012755, 1009150, 1006416, 1004088, 1003284, 1004858, 1007651, 1009613, 1010493, 1012312, 1016897, 1023829, 1031330, 1038442, 1045579, 1053253, 1061140, 1068535, 1075286, 1082025, 1089652, 1098656, 1108753, 1119066, 1128838, 1138269, 1148730, 1161953, 1178595, 1197527, 1216834, 1235627, 1254523, 1274086, 1293473, 1311360, 1327910, 1344733, 1362675, 1380499, 1396192]
59277A396192J2675R918P324M412J408j029k595l533m475o288r491j3463j6656
59264A374399j7894j7322j5999j4983j4770j5046j4894j3634j1701j0189r619
59253A218348r590r638r689r581q927p643n996l919j117K062M797P172J0263J4195
59239A190737J7008J6470J2428O614P50m314q133j0599j2225j3639j4735j4986
59227A165376j4516j4166j4392j4619j3827j1556q408n656m142l434k368m94J570
59214A059368L283M807O165O789O702P163R047J1264J2101J1570J1142J1302J0881
59201A171584Q952O094L326P82k006n191q471j1297j2923j2839j1454j0002r450
59188A107105r759j0219j0086q949p000n016l687k933k281j717j424r46L67K048
$$ y = [1396192, 1408867, 1418785, 1426109, 1430521, 1431929, 1430900, 1428305, 1424772, 1420297, 1414009, 1404518, 1391055, 1374399, 1356505, 1339183, 1323184, 1308201, 1293431, 1278385, 1263491, 1249857, 1238156, 1227967, 1218348, 1208758, 1199120, 1189431, 1179850, 1170923, 1163280, 1157284, 1153365, 1152248, 1154310, 1159107, 1166279, 1176542, 1190737, 1207745, 1224215, 1236643, 1243257, 1244007, 1239693, 1231560, 1220961, 1208736, 1195097, 1180362, 1165376, 1150860, 1136694, 1122302, 1107683, 1093856, 1082300, 1073892, 1068236, 1064094, 1060660, 1058292, 1057798, 1059368, 1062651, 1067458, 1073623, 1080412, 1087114, 1094277, 1103324, 1114588, 1126689, 1138259, 1149401, 1160703, 1171584, 1180536, 1186630, 1189956, 1190738, 1188732, 1183541, 1175070, 1163773, 1150850, 1138011, 1126557, 1116555, 1107105, 1097346, 1087127, 1077041, 1068092, 1061092, 1056076, 1052389, 1049456, 1047175, 1045458, 1044034, 1043088, 1043455, 1045503]
59174A045503K689J944J267J988L506M268L926L415L167K555J188l27j375k260
59160A071454l401m275m063l097k601k972l337l192l361m469n406m582k282l94
59146A024022J34J65N08P04L74L83J540L018L288K154Q00J39Q5K15K42j27r65
59129A036679j743j811j325j118j655k546l091k972k388j839j593j324n27O70
59115A013417J665K420L604N428P138Q070Q374Q228P466O614P104R305J1419J1658
59101A111910J0651J0164J0330R864Q512P327O616N494L673J981P19q94l139n123
59087A178085o319p422q921r973r655q448p605p703q537r812j1166j1960j1800
59074A058764j1080j0512j0329j0238r949r397q585p493o040m187k121k78J045
$$ y = [1045503, 1048192, 1050136, 1051403, 1053391, 1056897, 1061165, 1065091, 1068506, 1071673, 1074228, 1075416, 1075089, 1073714, 1071454, 1068053, 1063778, 1059715, 1056618, 1054017, 1051045, 1047708, 1044516, 1041155, 1036686, 1031280, 1026698, 1024416, 1024022, 1024156, 1024321, 1024829, 1025533, 1025907, 1026290, 1027830, 1030848, 1034136, 1036290, 1037090, 1037229, 1037314, 1037529, 1037771, 1037644, 1036679, 1034936, 1033125, 1031800, 1030682, 1029027, 1026481, 1023390, 1020418, 1018030, 1016191, 1014598, 1013274, 1012747, 1013417, 1015082, 1017502, 1021106, 1026534, 1033672, 1041742, 1050116, 1058344, 1065810, 1072424, 1079528, 1088833, 1100252, 1111910, 1122561, 1132725, 1143055, 1152919, 1161431, 1168758, 1175374, 1180868, 1184541, 1186522, 1187241, 1186347, 1183208, 1178085, 1171766, 1164344, 1155423, 1145450, 1135795, 1127347, 1119742, 1112039, 1103502, 1093690, 1082524, 1070564, 1058764, 1047684, 1037172, 1026843, 1016605, 1006656, 997259, 988674, 981181, 975141, 970954, 968833, 968555, 969600]
59061I69600J921K486K736K896L518M775O109P173Q503J0494J2229J2317J0657
59048A055414Q508P058O737P473Q528Q419O312L446K052K722L857L798K438O65
59034A127427p63j432j283p03j33M20R94J109L80q01j990l638o072q071p973o061
59018A091410m348m074m821o066p852r696j0425r791q958q804q857q338p234n960
59004I86186m945m711n375n935n244l745l003l449m002m074m372n322o184o299
58990I19526n824m782k795l15J302J605J599J961J973R60n23j604k093j943r05
58975I08142P38K098K777K952K363O14j293j421O43L348N460P041P918P476O632
58960I55488P675J0896J3539J3448J1785J0697J0194R122P539O265N386M917N558
$$ y = [969600, 971521, 974007, 976743, 979639, 983157, 987932, 994041, 1001214, 1009717, 1020211, 1032440, 1044757, 1055414, 1063922, 1070980, 1077717, 1085190, 1093718, 1102137, 1108449, 1111895, 1113947, 1116669, 1120526, 1124324, 1126762, 1127427, 1126664, 1125232, 1123949, 1123246, 1123113, 1123533, 1124527, 1125636, 1126016, 1125215, 1123225, 1119587, 1113515, 1105444, 1097471, 1091410, 1087062, 1082988, 1078167, 1072101, 1064249, 1054553, 1044128, 1034337, 1025379, 1016575, 1007718, 999380, 992146, 986186, 981241, 976530, 971155, 965220, 959976, 956231, 953228, 949779, 945777, 941703, 937331, 932009, 925825, 919526, 913702, 908920, 906125, 905810, 907112, 908717, 910316, 912277, 914250, 915210, 914687, 913083, 910990, 909047, 908142, 908880, 910978, 913755, 916707, 919070, 919684, 918391, 916970, 917613, 920961, 926421, 933462, 941380, 948856, 955488, 963163, 974059, 987598, 1001046, 1012831, 1023528, 1033722, 1042844, 1050383, 1056648, 1062034, 1066951, 1072509]
58947A072509P181P855O155L283J350P09O76J452L424N543O390O174N977N929
58933A134607N758O121P497Q529P528N134L660M137N548O562O525N135K684L47
58919A209772r10j265j079pJ926L652M928P400J1990J6509J8095J7023J5906J5922
58905A319862J6271J6579J7221J7491J6124J3654J2010J1515J0502Q079N057J946
58893A466311j746n674q335r483j0953j4040j7641k0006k1005k1535k1753k1110
58881A293030j9557j7835j6725j6421j6441j6008j4687j2584r853o569l431j797
58869A141122k177l452m382n042n824n982m642k509r64j5J260K605K690J317l2
58854A113973p5J026K291K881K524J907K361M400P035R218J1011J2504J2912J2208
$$ y = [1072509, 1079690, 1087545, 1093700, 1096983, 1098333, 1099042, 1099718, 1101170, 1104594, 1110137, 1116527, 1122701, 1128678, 1134607, 1140365, 1146486, 1153983, 1162512, 1170040, 1175174, 1178834, 1182971, 1188519, 1195081, 1201606, 1206741, 1209425, 1209772, 1208862, 1207597, 1206518, 1206511, 1208437, 1212089, 1217017, 1224417, 1236407, 1252916, 1271011, 1288034, 1303940, 1319862, 1336133, 1352712, 1369933, 1387424, 1403548, 1417202, 1429212, 1440727, 1451229, 1459308, 1464365, 1466311, 1464565, 1458891, 1450556, 1441073, 1430120, 1416080, 1398439, 1378433, 1357428, 1335893, 1314140, 1293030, 1273473, 1255638, 1238913, 1222492, 1206051, 1190043, 1175356, 1162772, 1152919, 1146350, 1142919, 1141122, 1138945, 1135493, 1131111, 1126069, 1120245, 1114263, 1109621, 1107112, 1106148, 1106133, 1107393, 1109998, 1112688, 1114005, 1113973, 1113898, 1114924, 1117215, 1120096, 1122620, 1124527, 1126888, 1131288, 1138323, 1147541, 1158552, 1171056, 1183968, 1196176]
58840A196176J2222J4220J6604J7137J6416J6748J8457J9965K0882K2174K3492
58829A394493K3388K2340K2753K5366K8233K9786L0317K9876K7430K3171J9236
58818A676389J6796J4526J1125P312L916m8n636j1634j5641j6770j6243j6016
58806A648076j7381k0062k2156k1935j9969j8345j7867j7635j7388j7949j8942
58795A438447j8478j6328j5086j6601j9103j9713j8301j6950j6690j6768j6474
58784A247955j5973j5489j4953j4387j3816j3123j2469j2278j2395j2107j1435
58773A099530j1311j1880j1885j0607r129q428p536n137k061m29o12q34J89J724
58759A021594K540K775L462M858O056O203N545N006N037N251N126M546L581K404
$$ y = [1196176, 1208398, 1222618, 1239222, 1256359, 1272775, 1289523, 1307980, 1327945, 1348827, 1371001, 1394493, 1417881, 1440221, 1462974, 1488340, 1516573, 1546359, 1576676, 1606552, 1633982, 1657153, 1676389, 1693185, 1707711, 1718836, 1726148, 1730064, 1730016, 1724380, 1712746, 1697105, 1680335, 1664092, 1648076, 1630695, 1610633, 1588477, 1566542, 1546573, 1528228, 1510361, 1492726, 1475338, 1457389, 1438447, 1419969, 1403641, 1388555, 1371954, 1352851, 1333138, 1314837, 1297887, 1281197, 1264429, 1247955, 1231982, 1216493, 1201540, 1187153, 1173337, 1160214, 1147745, 1135467, 1123072, 1110965, 1099530, 1088219, 1076339, 1064454, 1053847, 1044718, 1036290, 1028754, 1023617, 1021556, 1021127, 1020515, 1019681, 1019870, 1021594, 1024134, 1026909, 1030371, 1035229, 1041285, 1047488, 1053033, 1058039, 1063076, 1068327, 1073453, 1077999, 1081580, 1083984]
58745A083984J628J908K693K298K1k767m577n879p832r887j0400r138p376n942
58731A028734m967n229p470j0198j0525p810m562k949k330j217Q4L50k24j34J303
58716I72856K973L174J480o42j314n49l33j872l805m398m280n093o443o551n421
58701I39782m748m806m178k688j931k332k379j488j008j432j225L05J485J096
58687I14453N04J312K887L839M207M588M773M770N534P191Q121P370O405O928
58673I82882Q496R833J0814J1444J0528P479M192K975L525L762K883J813J413
58660A062039J928L512N795P527P980Q053Q813R760R844R148Q350P371N973M654
58646A160747L643J978r41l930n657o736q592j1140j3273j4888j6692j8580j9874
$$ y = [1083984, 1085612, 1087520, 1090213, 1092511, 1092532, 1089765, 1085188, 1079309, 1071477, 1061590, 1051190, 1042052, 1034676, 1028734, 1023767, 1018538, 1011068, 1000870, 990345, 982535, 977973, 975024, 972694, 971477, 971561, 971911, 971687, 971553, 972856, 975829, 979003, 980483, 979841, 978527, 977978, 977645, 975773, 971968, 967570, 963290, 958197, 951754, 945203, 939782, 935034, 930228, 926050, 923362, 921431, 919099, 916720, 915232, 914224, 912792, 911567, 911872, 913357, 914453, 914957, 916269, 919156, 922995, 927202, 931790, 936563, 941333, 946867, 954058, 962179, 969549, 975954, 982882, 991378, 1001211, 1012025, 1023469, 1033997, 1041476, 1045668, 1048643, 1052168, 1055930, 1058813, 1060626, 1062039, 1063967, 1067479, 1073274, 1080801, 1088781, 1096834, 1105647, 1115407, 1125251, 1134399, 1142749, 1150120, 1156093, 1160747, 1164390, 1166368, 1165427, 1161497, 1155840, 1149104, 1140512, 1129372, 1116099, 1101211, 1084519, 1065939, 1046065]
58633A046065k0616k1148k0958j9403j7078j5059j3454j2017j1366j1869j2159
58622H70938j0692q292p136p478p455o245n194n251n150l347n40J044M10j125
58608H04487j494J12K861N418O954P182O231M933M539N274N647M286J934L29l46
58593H58347j152j915j305M04J015m15k280l124l489l953l595j941m69n43j519
58578H34066k438l688n273n327k659P85K331K245K664L903M334L342J977R74K73
58563H37509K95J622L287L238R76j539j983J78L553O047O453N516N273O801R052
58548H86278J0269R799Q151O304N441O173P345O909M548K098P96j02j228j700
58534I51081j075o32j153j345k27Q61O56O39K824O255Q238Q094P404P266P509
$$ y = [1046065, 1025449, 1004301, 983343, 963940, 946862, 931803, 918349, 906332, 894966, 883097, 870938, 860246, 851954, 844818, 837340, 829885, 823640, 818446, 813195, 808045, 804698, 804158, 805202, 805612, 804487, 802993, 803105, 805966, 811384, 818338, 825520, 831751, 836684, 841223, 846497, 852144, 856430, 858364, 858693, 858347, 857195, 855280, 853975, 854379, 855394, 854979, 852699, 849575, 846086, 842133, 838538, 836597, 836128, 835585, 834066, 831628, 827940, 822667, 817340, 814681, 815466, 817797, 820042, 822706, 826609, 830943, 834285, 836262, 837236, 837509, 837804, 839426, 842713, 845951, 846927, 845388, 843405, 843583, 847136, 853183, 859636, 865152, 870425, 877226, 886278, 896547, 906346, 914497, 920801, 926242, 932415, 939760, 946669, 951217, 953315, 954111, 954009, 952781, 951081, 950006, 949374, 948221, 946876, 946649, 947510, 948166, 948805, 951629, 957884, 966122, 974216, 981620, 988886, 996395]
58519I96395Q091R253J0617J1762J3093J4770J5682J4997J3787J3504J3955J4385
58507A150291J5264J7179J9160K0142K0974K2937K5359K6830K7640K8737K9367
58496A403880K8259K6277K5105K3897K0055J3348O677K421J30j751l628m928n321
58483A534421n293n910p661r449r803r549j1466j6319k1174k3214k3198k3368
58471A368017k3882k3683k3097k2907k2204j9741j6394j3835j1885r473p108n916
58459A167892n374m438l853m860o601p297o922o410n447l623k454l433n215n476
58445A096489m442l832l641k982k637l609m503l746l019m631o818n952k641j047
58431A042989k221k773o48K060L082L121L714N001O686Q704J0136R861Q688Q686
$$ y = [996395, 1004486, 1013739, 1024356, 1036118, 1049211, 1063981, 1079663, 1094660, 1108447, 1121951, 1135906, 1150291, 1165555, 1182734, 1201894, 1222036, 1243010, 1265947, 1291306, 1318136, 1345776, 1374513, 1403880, 1432139, 1458416, 1483521, 1507418, 1527473, 1540821, 1547498, 1549919, 1550049, 1548298, 1544670, 1539742, 1534421, 1529128, 1523218, 1515557, 1506108, 1496305, 1486756, 1475290, 1458971, 1437797, 1414583, 1391385, 1368017, 1344135, 1320452, 1297355, 1274448, 1252244, 1232503, 1216109, 1202274, 1190389, 1180916, 1173808, 1167892, 1162518, 1158080, 1154227, 1149367, 1142766, 1135469, 1128547, 1122137, 1116690, 1113067, 1110613, 1107180, 1101965, 1096489, 1092047, 1088215, 1084574, 1081592, 1078955, 1075346, 1070843, 1067097, 1064078, 1059447, 1052629, 1046677, 1044036, 1042989, 1040768, 1037995, 1037347, 1039407, 1042489, 1045610, 1049324, 1054325, 1061011, 1069715, 1079851, 1089712, 1098400, 1107086]
58417A107086J0241J2056J3634J5236J5968J4802J3083J2829J3080J1283P757
58406A247055N054L196k47n101p885p011m788l186j373J249L154L523L992N857
58392A243489P993Q981Q984Q493P318N752M638L684J690j170l522n292p600j0079
58378A273359j0963j0034q899q174p043n657n185n271m237j967J43J950M474P209
58364A219705Q552Q752R394J0168R398P462O231N514L724J655J486K163K85m105
58350A290384p066o720n382n074n271n863p882j0177r743o768n076o165o992n218
58336A196987k533q91N00K383L298K428J450J699K283K370K513K639J829R07J839
58321A219701L893M032J972Q77K024K976K297J912L134M359M428M698O079P492
$$ y = [1107086, 1117327, 1129383, 1143017, 1158253, 1174221, 1189023, 1202106, 1214935, 1228015, 1239298, 1247055, 1252109, 1255305, 1255058, 1249957, 1242072, 1235061, 1230273, 1227087, 1225714, 1226963, 1230117, 1233640, 1237632, 1243489, 1251482, 1260463, 1269447, 1277940, 1285258, 1291010, 1295648, 1299332, 1301022, 1299852, 1296330, 1291038, 1283438, 1273359, 1262396, 1252362, 1243463, 1235289, 1228246, 1222589, 1217404, 1212133, 1207896, 1205929, 1206072, 1208022, 1212496, 1219705, 1228257, 1237009, 1246403, 1256571, 1265969, 1273431, 1279662, 1285176, 1288900, 1290555, 1292041, 1294204, 1294489, 1290384, 1283318, 1276598, 1271216, 1266142, 1260871, 1255008, 1247126, 1236949, 1227206, 1220438, 1215362, 1209197, 1202205, 1196987, 1194454, 1193563, 1194063, 1196446, 1199744, 1202172, 1203622, 1205321, 1207604, 1209974, 1212487, 1215126, 1216955, 1217862, 1219701, 1223594, 1227626, 1229598, 1230475, 1232499, 1235475, 1237772, 1239684, 1242818, 1247177, 1251605, 1256303, 1262382, 1269874]
58307A269874Q564J0440J2781J3563J2786J2710J3800J4384J4792J7085K0108
58296A420887K0009J6859J5336J7270J8873J7388J5024J3970J2679R901P631P223
58284A593050O953O020O584R311J1293J0906J0519J2053J4012J5130J6595J8664
58272A731090J9465J9032J9855K1762K1330J8195J6405J7434J7711J5569J4574
58261A932422J6804J8708J7248J4766J4131J4200J3596J3994J6103J7237J6220
58250B105429J5996J8312K0621K1117K1779K3619K4339K3443K4175K7484K9733
58239B356047K9252K9186L1184L2562L2483L4233L8368M0632L9885M0714M4781
58228B749327M7464M6944M8263N3809N8052N7111N5498N7692O0776O1348O2222
$$ y = [1269874, 1278438, 1288878, 1301659, 1315222, 1328008, 1340718, 1354518, 1368902, 1383694, 1400779, 1420887, 1440896, 1457755, 1473091, 1490361, 1509234, 1526622, 1541646, 1555616, 1568295, 1578196, 1585827, 1593050, 1600003, 1606023, 1612607, 1621918, 1633211, 1644117, 1654636, 1666689, 1680701, 1695831, 1712426, 1731090, 1750555, 1769587, 1789442, 1811204, 1832534, 1850729, 1867134, 1884568, 1902279, 1917848, 1932422, 1949226, 1967934, 1985182, 1999948, 2014079, 2028279, 2041875, 2055869, 2071972, 2089209, 2105429, 2121425, 2139737, 2160358, 2181475, 2203254, 2226873, 2251212, 2274655, 2298830, 2326314, 2356047, 2385299, 2414485, 2445669, 2478231, 2510714, 2544947, 2583315, 2623947, 2663832, 2704546, 2749327, 2796791, 2843735, 2891998, 2945807, 3003859, 3060970, 3116468, 3174160, 3234936, 3296284, 3358506]
58217C358506O6168P0247P2297P5778Q2418Q7579Q8737R0863R7444J04180J07654
58206D301871J11894J19814J26799J29696J33535J42157J50823J55583J61172
58197E533344J71800J82962J90289J97598K08148K17183K21636K27794K40581
58188G391335K54608K64541K74572K88807L02703L13337L27368L48948L70862
58179A0137081L87749M06493M32978M60994M85563N14270N53132N94479O31783
58170A4604522O72726P23695P75637Q20250Q65854R21562R80576J035726J096156
58161B2496704J170992J252152J331802J420267J527274J643020J758681J887284
58153C4488176K041866K212358K387845K580966K804800L048426L303687L592235
$$ y = [3358506, 3424674, 3494921, 3567218, 3642996, 3725414, 3812993, 3901730, 3992593, 4090037, 4194217, 4301871, 4413765, 4533579, 4660378, 4790074, 4923609, 5065766, 5216589, 5372172, 5533344, 5705144, 5888106, 6078395, 6275993, 6484141, 6701324, 6922960, 7150754, 7391335, 7645943, 7910484, 8185056, 8473863, 8776566, 9089903, 9417271, 9766219, 10137081, 10524830, 10931323, 11364301, 11825295, 12310858, 12825128, 13378260, 13972739, 14604522, 15277248, 16000943, 16776580, 17596830, 18462684, 19384246, 20364822, 21400548, 22496704, 23667696, 24919848, 26251650, 27671917, 29199191, 30842211, 32600892, 34488176, 36530042, 38742400, 41130245, 43711211, 46516011, 49564437, 52868124, 56460359]
58145E6460359L935879M327008M762669N279563N918330O685238P589025Q676837
58137A03634908R987870J1520200J3299496J5415706J7909292K0688511K3651410
58130B16107393K6757392K9740731L1796805L1885218K9520271K5095576J9308069
58123D10211455J2485353M719189l505209j1184591j7378859k1724073k4345851
58116C49277414k5509383k5492941k4636882k3300426k1751379k0156364j8632647
58109A89797392j7235188j5926897j4636770j3344420j2075912j0850664r681197
58102I6046344q601079p643407o801875o048463n376166m792843m288544l842226
58094D8651741l449780l116467k831541k576279k347603k150513j977207j815721
$$ y = [56460359, 60396238, 64723246, 69485915, 74765478, 80683808, 87369046, 94958071, 103634908, 113622778, 125142978, 138442474, 153858180, 171767472, 192455983, 216107393, 242864785, 272605516, 304402321, 336287539, 365807810, 390903386, 410211455, 422696808, 427415997, 423910788, 412726197, 395347338, 373623265, 349277414, 323768031, 298275090, 273638208, 250337782, 228586403, 208430039, 189797392, 172562204, 156635307, 141998537, 128654117, 116578205, 105727541, 96046344, 87445265, 79801858, 72999983, 66951520, 61575354, 56782511, 52493967, 48651741, 45201961, 42085494, 39253953, 36677674, 34330071, 32179558, 30202351, 28386630]
58086B8386630j669061j544539j434025j325242j222909j138516j067865r98136
58078A7986337r29051q68611q15502p63404p15373o76949o42032o01778n60573
58069A1413064n27587m99615m67925m35150m09663l89506l67171l44522l27897
58060G644028l14000k95444k75322k61887k53281k41586k27673k18362k12787
58051E343686k04896j95840j90997j88165j81217j72119j67149j64484j57593
58042C721226j47650j40627j35123j25179j12494j04018r9612r3493q5796q1295
58032B595939p8700p2538o4221o0103n9757n6935n1248m8285m8692m7476m3948
58021A964036m2506m3483m2444l8830l6526l5850l3373k9629k8729l0320k9803
$$ y = [28386630, 26717569, 25173030, 23739005, 22413763, 21190854, 20052338, 18984473, 17986337, 17057286, 16188675, 15373173, 14609769, 13894396, 13217447, 12575415, 11973637, 11413064, 10885477, 10385862, 9917937, 9482787, 9073124, 8683618, 8316447, 7971925, 7644028, 7330028, 7034584, 6759262, 6497375, 6244094, 6002508, 5774835, 5556473, 5343686, 5138790, 4942950, 4751953, 4563788, 4382571, 4210452, 4043303, 3878819, 3721226, 3573576, 3432949, 3297826, 3172647, 3060153, 2956135, 2856523, 2763030, 2677234, 2595939, 2517239, 2444701, 2380480, 2320377, 2260620, 2203685, 2152437, 2104152, 2055460, 2007984, 1964036, 1921530, 1878047, 1835603, 1796773, 1760247, 1724397, 1691024, 1661395, 1632666, 1602346, 1572543]
58010A572543k6511k4168k3523k2007k0099k0598k2147k0996j8520j9408k2923
57999A331643k3679k0765j8500j8300j7343j5313j5044j6221j5588j3550j3675
57988A143665j5549j5087j2097j0635j1583j1702j0340j0209j1201j0257p973
57977A017032q407j1577j2926j1230j0405j2184j3542j2867j2440j3060j2171
57966H86223r330q012r894j2146j2281j1169r867p895n861n546o258n426l460
57953G79078l488n665o499m815l500m074m279k574p63m08n58n08j236k698l071
57938G34942j874q42q73j031j014j548k192j902j670l207n262n061l171k879m739
57923F97677n953n381m886n174m545k642j483j784j840j046j045k510l907m274
$$ y = [1572543, 1546032, 1521864, 1498341, 1476334, 1456235, 1435637, 1413490, 1392494, 1373974, 1354566, 1331643, 1307964, 1287199, 1268699, 1250399, 1233056, 1217743, 1202699, 1186478, 1170890, 1157340, 1143665, 1128116, 1113029, 1100932, 1090297, 1078714, 1067012, 1056672, 1046463, 1035262, 1025005, 1017032, 1008625, 997048, 984122, 972892, 962487, 950303, 936761, 923894, 911454, 898394, 886223, 876893, 868881, 858987, 846841, 834560, 823391, 813524, 805629, 799768, 794222, 787964, 782538, 779078, 775590, 769925, 763426, 758611, 755111, 751037, 746758, 744184, 743421, 743013, 742455, 741947, 740711, 738013, 734942, 733068, 732226, 731353, 730322, 729308, 727760, 725568, 723666, 721996, 718789, 713527, 708466, 705295, 702416, 697677, 691724, 686343, 681457, 676283, 671738, 669096, 667613, 665829, 663989, 662943, 661898, 659388, 655481, 651207]
57909F51207m256l956k673j143j010j911j911q71l87o04k02P51R74N73L60o45
57893F34296l492o047n366k674j805l175l726k498j622j676o64J826L654L919
57879F10950L806L470K002P52K482O716R836J0202R419Q558P220O353P556R347
57865F98669Q526N473L624L585K594R3j360j394k785n950p760p173o989q313q376
57850F72464n928l900m424n621n621n475n814m989k934k640n152p144o227m771
57836F01824n457o803o346m932m476m266k853j257j077j399m12J439K438K328
57822E68751K073K125K418K856K749J326o48j554j531k061k873k125p2O74p21
57807E71387k148k311k355k941l167l193m364n769m652j377J93j256k312n81J745
$$ y = [651207, 646951, 642995, 640322, 639179, 638169, 636258, 634347, 633476, 633089, 632485, 632283, 633034, 634008, 634581, 634941, 634296, 630804, 624757, 619391, 616717, 614912, 611737, 608011, 605513, 603891, 602215, 601551, 603377, 607031, 610950, 614756, 618226, 620228, 620980, 623462, 630178, 640014, 650216, 659635, 668193, 675413, 681766, 689322, 698669, 707195, 712668, 716292, 719877, 722471, 722564, 721204, 719810, 717025, 711075, 703315, 696142, 689153, 680840, 672464, 666536, 662636, 658212, 652591, 646970, 641495, 635681, 630692, 627758, 625118, 619966, 612822, 606595, 601824, 596367, 589564, 583218, 578286, 573810, 569544, 566691, 565434, 564357, 562958, 562546, 563985, 566423, 568751, 570824, 572949, 575367, 578223, 580972, 582298, 581650, 580096, 578565, 576504, 573631, 571506, 571434, 572108, 571387, 569239, 566928, 564573, 561632, 558465, 555272, 550908, 545139, 540487, 539110, 539303, 538047, 535735, 535154, 536899]
57792E36899K231K006K411J867q38l345l001o92J146J782J309n94k856k913o20
57777E34792P73n01k180k329k473l873m564l145j982l235m961m481k585j148L04
57762D98412K242K692Q59L4K799O261O271L761K394K428J710O48J089J726k28
57747E33098l596m444k431j285k742m301l692j832m30L17O64L75l18o51m97k50
57731E07985K33J110J662J479J550K442K674R44j305j901j363j752l085l550k696
57716E04427j837j642j473p87N28K593M666M886K748N44M41J449J464P67Q88J392
57700E21054P88l46j88J031J406O41K92J000J910K554L069K987K043J582K902
57685E42725M765M868L156J379J72r05j221J18J820J615l02j727k106k854m087
$$ y = [536899, 539130, 541136, 543547, 545414, 544576, 541231, 538230, 537538, 538684, 540466, 541775, 541181, 538325, 535412, 534792, 535565, 535064, 532884, 530555, 528082, 524209, 519645, 516500, 514518, 511283, 506322, 501841, 499256, 498108, 498412, 500654, 503346, 504205, 504239, 507038, 513299, 519570, 523331, 525725, 528153, 529863, 530511, 531600, 533326, 533098, 529502, 525058, 522627, 521342, 518600, 514299, 510607, 508775, 508345, 508662, 509326, 509701, 509383, 508732, 508235, 507985, 508218, 509328, 510990, 512469, 514019, 516461, 519135, 520079, 518774, 516873, 515510, 513758, 510673, 507123, 504427, 502590, 500948, 499475, 498688, 499216, 501809, 506475, 511361, 514109, 514653, 515094, 516543, 518007, 518774, 519662, 521054, 521842, 521496, 521308, 522339, 523745, 524386, 524678, 525678, 527588, 530142, 533211, 536198, 538241, 539823, 542725, 547490, 552358, 555514, 556893, 557065, 556160, 554939, 555057, 556877, 558492, 558190, 556463, 554357, 551503, 547416]
57670E47416m130k682j615j937k395j897j071o52l46j40r29k959m989n699m810
57655E11165k724k76J085M17j296k274k489l544n853p668p417n728m380m134m093
57640D60791k883l45J817J648n40k298k149j239j087j344j226j459k829m166l858
57625D38833k456j640j455p41M61J208J758L250N678Q195J0952J4655J8818K2476
57611E19992K6191L1312L7556M3016M6022M5397L9987L0214J9146R617J064q366
57599H41148j7593k3602k6122k7918l0291l1549l0463k8302k6549k4997k3079
57588E50683k1072j9183j7178j5315j4003j2446r539o152m379m407m327l231k229
57575D17222k000j680p50J04N04Q20P32n44k261k611j665j529l002m425m589m426
$$ y = [547416, 543286, 540604, 538989, 537052, 534657, 532760, 531689, 531037, 530691, 530551, 529622, 526663, 521674, 515975, 511165, 508441, 508165, 509250, 509667, 508371, 506097, 503608, 500064, 494211, 486543, 479126, 473398, 469018, 464884, 460791, 457908, 457563, 459380, 461028, 460488, 458190, 456041, 454802, 453715, 452371, 451145, 449686, 446857, 442691, 438833, 436377, 434737, 433282, 432541, 433002, 434210, 435968, 439218, 444896, 453091, 464043, 478698, 497516, 519992, 546183, 577495, 615051, 658067, 704089, 749486, 789473, 819687, 838833, 848450, 849514, 841148, 823555, 799953, 773831, 745913, 715622, 684073, 653610, 625308, 598759, 573762, 550683, 529611, 510428, 493250, 477935, 463932, 451486, 441947, 435795, 431416, 427009, 422682, 419451, 417222, 415222, 413542, 412792, 412896, 413400, 414220, 414952, 414408, 412147, 409536, 407871, 406342, 403340, 398915, 394326, 389900]
57559C89900m749m609l208j560q72q75q75r42j087p33l5k05j537k538k036q61
57543C63178l96o65q41o94p20j506l353n631o583n087k585j730k929m109m054
57528C22295l924m893o226o659n937m267j841L27P82l35j294j420j939l508m892
57513B76269n082m747m447l416j541o44j981l984m253k632o83O78J342R31n95
57498B45215j922j735o61m01j297k087j833r19j52K01M04P80J224J102L5j223
57482B36731j475p12p5j18k47p4O6L04J398L116L904L005J564Q62Q20J185K493
57465B52747M628N737M331J505l28k81O11J161R39R4n87M7K010L432K256j560
57449B76742o236r907j1613j1403j0399j0057j0456j0052p884n213l903m058m423
$$ y = [389900, 385151, 380542, 377334, 375774, 374902, 374027, 373152, 372210, 371123, 370390, 370355, 370150, 368613, 366075, 364039, 363178, 362782, 362117, 361276, 360582, 359862, 358356, 355003, 349372, 342789, 337702, 335117, 333387, 330458, 326349, 322295, 318371, 313478, 307252, 300593, 294656, 290389, 288548, 288875, 289657, 289322, 288028, 286608, 284669, 281161, 276269, 271187, 266440, 261993, 258577, 257036, 256392, 254411, 250427, 246174, 243542, 242859, 243537, 244879, 245810, 245215, 243293, 241558, 240897, 240496, 239199, 237112, 235279, 234360, 234208, 234409, 234813, 235593, 236817, 237919, 237954, 236731, 235256, 234544, 234469, 234351, 234104, 234030, 234096, 234400, 235798, 238914, 242818, 245823, 247387, 248249, 249069, 250254, 252747, 257375, 263112, 267443, 268948, 268620, 268339, 268950, 270111, 271050, 271144, 270557, 270604, 272614, 276046, 278302, 276742, 270506, 260599, 248986, 237583, 227184, 217127, 206671, 196619, 188735, 183522, 179619, 175561, 171138]
57436A71138m431m498m731m714m376m007l556k808k078j761j460n02Q14J469J162
57421A35661O37N65P57P04K81j73j88L66Q71L79j179k502k293r29j10q15k158
57404A29874k503j366J40O54J7r40j678k376k968k818j938j609k710m063l877
57389A01839k382j523k120k965k934k353j799j072j33L62K79N59J633K308J389
57374I1088m90j590j088M97K192L111K717J425M46L40K12r12k550l400l116k479
57358H6403k067j611q55k57n04j488k200j845q87m81q67j140r04j034j827j731
57342F6705M92L050K774n91l893m571l301k081j617j495j420j209o83k36m63q60
57326E0601k53J172J810J175P26J392K061J532K17j190k915m680m896k954p78
$$ y = [171138, 166707, 162209, 157478, 152764, 148388, 144381, 140825, 138017, 135939, 134178, 132718, 132216, 133030, 134499, 135661, 136298, 136863, 137620, 138324, 138605, 138432, 138244, 138610, 139481, 139860, 138681, 136179, 133886, 132957, 132847, 132032, 129874, 127371, 126005, 126145, 126799, 126816, 125876, 124198, 121822, 118854, 116036, 114098, 112489, 109779, 105716, 101839, 99457, 97934, 95814, 92849, 89915, 87562, 85763, 84691, 84558, 84920, 85199, 85758, 87391, 89699, 91088, 90598, 89008, 87920, 88417, 90609, 93720, 96437, 97862, 98308, 98648, 98860, 97948, 95398, 91998, 88882, 86403, 84336, 82725, 81870, 81613, 81109, 79621, 77421, 75576, 74689, 74208, 73341, 72201, 71297, 70263, 68436, 66705, 67197, 70247, 73021, 72430, 68537, 63966, 60665, 58584, 56967, 55472, 54052, 52843, 52160, 51924, 51461, 50601, 50348, 51520, 53330, 54505, 55231, 56623, 58684, 60216, 60433, 59243, 56328, 51648, 46752, 43798, 43020]
57311D3020l34r20p89o4N4j60L81J084L09j677k668j642N9R64J210J447J450O54
57293D2378p78k043k503k191j793j999k516k230p42P87J002K1j034j601j885k061
57277B0812k133k300k664k963l238C348b518p113o649m879l236k403k113k085
57263c0996k060j433l6J092Q40l79j220j199o90M02K389M299M195J553j732l376
57247b8351k973j890j432j659j705q85O04K006K813K941K368J214K14J98R89J583
57231b3965J673J987K860L728M383c841C253Q053P839P567Q116Q683Q542Q757
57217F0810J0377J2012J1434Q837O565N850N852N813O177P207Q001P621O330N353
57203A68239N836P807R785R898Q047O165N737O075O025N943O538P059O556N843
$$ y = [43020, 42686, 41766, 40977, 40913, 40967, 40807, 41188, 42272, 42581, 40904, 38236, 36594, 36653, 37617, 38827, 40274, 41724, 42378, 41600, 39557, 37054, 34863, 33070, 31071, 28555, 26325, 25583, 26370, 27372, 27393, 26359, 24758, 22873, 20812, 18679, 16379, 13715, 10752, 7514, 3348, -2518, -9631, -16280, -21159, -24395, -26798, -28911, -30996, -33056, -34489, -34525, -33433, -32593, -32972, -34192, -35391, -36081, -35679, -33290, -28991, -24796, -23243, -24975, -28351, -31324, -33214, -34646, -36305, -38010, -38895, -38291, -36285, -33472, -30531, -28163, -26949, -26735, -26537, -25548, -23965, -22292, -20305, -17445, -13717, -9334, -3841, 3253, 11306, 19145, 26712, 34828, 43511, 52053, 60810, 71187, 83199, 94633, 103470, 110035, 115885, 121737, 127550, 133727, 140934, 148935, 156556, 162886, 168239, 174075, 181882, 191667, 201565, 209612, 215777, 221514, 227589, 233614, 239557, 246095, 253154, 259710, 265553]
57189B65553O083O383N154L164K605L493L814L208L602N645P352P252O411O207
57175C35926O399O686P983J0567J2831J3536J3819J5310J7547J8977J9418J9868
57163D98867K0661K1401K2134K3246K4630K6165K8417L1714L5105L7393L8662
57152H08395L9593L9953L9151L7940L7987L9711M1811M3006M3125M2366M0747
57141A253785L8748L7485L7526L8085L7988L7114L6418L6694L7752L8769L9237
57130A669601L9383L9732M0430M1258M2238M3811M6121M8402M9478M8945M7677
57119B157076M7035M7630M8833M9636M9815M9989N0437N0484M9530M8228M7746
57108B696439M8106M8227M7747M7585M8306M9027M8941M9093N1377N5946O0789
$$ y = [265553, 271636, 278019, 283173, 286337, 288942, 292435, 296249, 299457, 303059, 308704, 316056, 323308, 329719, 335926, 342325, 349011, 356994, 367561, 380392, 393928, 407747, 423057, 440604, 459581, 478999, 498867, 519528, 540929, 563063, 586309, 610939, 637104, 665521, 697235, 732340, 769733, 808395, 847988, 887941, 927092, 965032, 1003019, 1042730, 1084541, 1127547, 1170672, 1213038, 1253785, 1292533, 1330018, 1367544, 1405629, 1443617, 1480731, 1517149, 1553843, 1591595, 1630364, 1669601, 1708984, 1748716, 1789146, 1830404, 1872642, 1916453, 1962574, 2010976, 2060454, 2109399, 2157076, 2204111, 2251741, 2300574, 2350210, 2400025, 2450014, 2500451, 2550935, 2600465, 2648693, 2696439, 2744545, 2792772, 2840519, 2888104, 2936410, 2985437, 3034378, 3083471, 3134848, 3190794, 3251583]
57097C251583O3969O5299O5462O4454O1684N7121N1456M5174L8168L0344K1996
57086C816710J3228L638o955j7842k8231l8484m9681o1843p3693q4534r5318j06915
57074C270080j18252j27684j35887j45772j59134j74834j90921k07415k26046
57065A784135k48306k75016l06981l44567B22374b10663m84099n42356o08316
57056a845434o80208p57238q41612r36135j041369j156933j284378j426705j585760
57047a1555772j762612j960079k182351k431990k710171l020794l371870l771998
57039c2767637m228436m750496n352445o051898o869272p830887q964595j0280050
57031h7095716j1749634j3313126j4898900j6427826j7792812j8860835j9540363
$$ y = [3251583, 3315552, 3380851, 3446313, 3510767, 3572451, 3629572, 3681028, 3726202, 3764370, 3794714, 3816710, 3829938, 3833576, 3826621, 3808779, 3780548, 3742064, 3692383, 3630540, 3556847, 3472313, 3376995, 3270080, 3151828, 3024144, 2888257, 2742485, 2583351, 2408517, 2217596, 2010181, 1784135, 1535829, 1260813, 953832, 609265, 222374, -210663, -694762, -1237118, -1845434, -2525642, -3282880, -4124492, -5060627, -6101996, -7258929, -8543307, -9970012, -11555772, -13318384, -15278463, -17460814, -19892804, -22602975, -25623769, -28995639, -32767637, -36996073, -41746569, -47099014, -53150912, -60020184, -67851071, -76815666, -87095716, -98845350, -112158476, -127057376, -143485202, -161278014, -180138849, -199679212]
57024a99679212j9871130k0022148k0141197k0157280j9724597j8388791j5847267
57017c33831622j2092984p366855k032708L487365Q719203J3185425J6531731
57010c13400445J8641171J9635998J9774155J9333020J8551522J7625991J6714459
57003a83124129J5920482J5266852J4692480J4092138J3378375J2520440J1538373
56996h5714989J0474662R376077Q289859P259095O314058N469809M731335M096735
56988b9703359L556491L096176K703041K368468K084787J843711J638346J463287
56980a0949052J312262J179165J061896R61679Q77556Q04731P39177O80389O28218
56971b703979N80569N36404M98129M67854a78550B36380L80142L38588K94999
$$ y = [-199679212, -219550342, -239572490, -259713687, -279870967, -299595564, -317984355, -333831622, -345924606, -353291461, -355324169, -351836804, -343117601, -329932176, -313400445, -294759274, -275123276, -255349121, -236016101, -217464579, -199838588, -183124129, -167203647, -151936795, -137244315, -123152177, -109773802, -97253362, -85714989, -75240327, -65864250, -57574391, -50315296, -44001238, -38531429, -33800094, -29703359, -26146868, -23050692, -20347651, -17979183, -15894396, -14050685, -12412339, -10949052, -9636790, -8457625, -7395729, -6434050, -5556494, -4751763, -4012586, -3332197, -2703979, -2123410, -1587006, -1088877, -621023, -178550, 236380, 616522, 955110, 1250109]
56962A250109K54319K18479J86472J57645J34000J17706J07072R7341Q5697P3184
56952B682024O1368M9639L6795K3043R087n117j9347l2401m3792n5077o8303q3887
56940B554032j00629j16839j30669j40436j45422j45980j42680j36089j27294
56931A367994j17548j07289r6597q6343p7562o9941o2538n5875n1580m9992m9812
56920E42917n0022n0283m9592m6894m3263m1098m0741m0077l7925l5386l3276
56909G4360l0792A5899i177k3224k0374j5822j1492r053p465n118k434o64J94
56896a04629M04q98m125p636r625j0566j1900j3330j3245j1220q500o443n616
56883b07329n816n977m781k239K40K018M070O948R530J1060J2745J5556J7862
$$ y = [1250109, 1504428, 1722907, 1909379, 2067024, 2201024, 2318730, 2425802, 2523143, 2608840, 2682024, 2743392, 2793031, 2829826, 2852869, 2861956, 2856839, 2837492, 2805091, 2761299, 2706222, 2637919, 2554032, 2453403, 2336564, 2205895, 2065459, 1920037, 1774057, 1631377, 1495288, 1367994, 1250446, 1143157, 1046560, 960217, 882655, 812714, 750176, 694301, 642721, 592729, 542917, 492895, 442612, 393020, 346126, 302863, 261765, 221024, 180947, 143022, 107636, 74360, 43568, 15899, -9177, -32401, -52775, -68597, -80089, -89142, -96607, -101725, -104159, -104823, -104629, -104225, -105123, -109248, -116884, -126509, -137075, -148975, -162305, -175550, -186770, -195270, -201713, -207329, -213145, -219122, -223903, -226142, -225902, -223884, -219814, -212866, -203336, -192276, -179531, -163975, -146113]
56870a46113J7267J3791R347M802m28o149j0757j2929j2790j1292r413p990p485
56857a80139p828q640r346r037p188m753l475l728m069l438k456k088k391l240
56843b51816m742o062n394k285J343L477M085M051L627L162L835O250R385J2123
56829b18961J4514J6491J6951J5520J3771J3107J2709J1119Q578O273M493L075
56817h2360K424K534K236J102P90K807O163Q955J0973J2911J4487a468A5991K1610
56803C7601K6544K9855L1406L2522L2856L0733K6168K0918J5691R677K881l307
56791B93545p987j1239j2648j1404q112m762k486o57J742N170R803J5413K1082
56778B87460K6298L1843L8222M3698M5490M2694L6575K8546J9515J0670K975m058
$$ y = [-146113, -128846, -115055, -105708, -100906, -101334, -107483, -118240, -131169, -143959, -155251, -164664, -172654, -180139, -187967, -196607, -205953, -214990, -222178, -226931, -230406, -234134, -238203, -241641, -244097, -246185, -248576, -251816, -256558, -262620, -268014, -270299, -268956, -265479, -261394, -257343, -253716, -250554, -246719, -240469, -231084, -218961, -204447, -187956, -171005, -155485, -141714, -128607, -115898, -104779, -96201, -89928, -85435, -82360, -79936, -77402, -75166, -74064, -73274, -70467, -64304, -55349, -44376, -31465, -16978, -1468, 15991, 37601, 64145, 94000, 125406, 157928, 190784, 221517, 247685, 268603, 284294, 293971, 296852, 293545, 285558, 274319, 261671, 250267, 242155, 237393, 234907, 234250, 235992, 241162, 250965, 266378, 287460, 313758, 345601, 383823, 427521, 473011, 515705, 552280, 580826, 600341, 611011, 613986, 609928]
56766F09928j1424j8587k3837k6361k6548k4815k1737j8753j6858j4984j1448
56755C94576o509j702K773P828J3141J7337K0110K1883K1565J7326R826K195l608
56742E16741q304j2827j6757j9783k2498k4869k5781k4855k3125k1327j9120j6429
56730B81066j3780j0929p002k491Q41K620M506P430J0149J1364J1355J0375P422
56717C12926K057l982q603j1721j4410j6637j7279j6093j4388j3529j3389j2569
56705A72383j0338q125q242j0657j2286j0656p115m732m202m071m028m980o078
56692G6873m994j813L37l12j794j814j088j495k939l996m263m273m103l664l457
56677C7205l787m022l621l060k779k302j253j74N72J598L207M386M119K762J186
$$ y = [609928, 598504, 579917, 556080, 529719, 503171, 478356, 456619, 437866, 421008, 406024, 394576, 388067, 386365, 389138, 396966, 410107, 427444, 447554, 469437, 491002, 508328, 518154, 520349, 516741, 508437, 495610, 478853, 459070, 436572, 411703, 385922, 361067, 337942, 316615, 297495, 281066, 267286, 256357, 249355, 246864, 247705, 250325, 254831, 262261, 272410, 283774, 295129, 305504, 312926, 314983, 311001, 302398, 290677, 276267, 259630, 242351, 226258, 211870, 198341, 184952, 172383, 162045, 153920, 145678, 135021, 122735, 112079, 104964, 100232, 96030, 91959, 87931, 82951, 76873, 71879, 70066, 70403, 70091, 68297, 66483, 65395, 63900, 60961, 56965, 52702, 48429, 44326, 40662, 37205, 33418, 29396, 25775, 22715, 19936, 17634, 16381, 16207, 16779, 18377, 21584, 25970, 30089, 32851, 34037]
56662C4037l29j470j302N05K772M112M247L362J327j354l053k706j258k81n0Q6
56646C8645L68Q35J903L438M120L058J436J127K184L033K850K320K078J675M51
56631F9521j336k629k593j369Q9J012J559K172K515J920P85L56Q50J001oj346
56615G2501j988k156k442k478j685o66o06j558k408k425k044j980k197k032j154
56600D4682j20L34N76J932M782P556Q593Q369Q603R660J0414J0500J0863J1897
56586A38641J2744J2822J2500J1944J0925J0093J0568J1653J0886P467L831K578
56574B56652L296L790L106J939J074P61R55J088M33o14o11O74J382j5k495l984
56558B67431m081l996m499n132n074l984k347j457k179l487l407j687q8L79N96
$$ y = [34037, 33708, 32238, 30936, 31441, 34213, 38325, 42572, 45934, 47261, 45907, 42854, 40148, 38890, 38609, 38559, 38645, 39013, 39848, 41751, 45189, 49309, 52367, 53803, 54930, 57114, 60147, 62997, 65317, 67395, 69070, 69521, 68185, 65556, 62963, 61594, 61683, 62695, 64254, 66426, 68941, 70861, 71646, 72002, 72852, 73853, 73847, 72501, 70513, 68357, 65915, 63437, 61752, 61086, 60480, 58922, 56514, 54089, 52045, 50065, 47868, 45836, 44682, 44562, 44896, 45472, 47404, 52186, 59742, 68335, 76704, 85307, 94967, 105381, 115881, 126744, 138641, 151385, 164207, 176707, 188651, 199576, 209669, 220237, 231890, 242776, 250243, 254074, 256652, 259948, 263738, 266844, 268783, 269857, 270618, 271573, 272661, 273094, 272480, 271869, 272543, 273925, 273910, 271415, 267431, 263350, 259354, 254855, 249723, 244649, 240665, 238318, 236861, 234682, 231195, 227788, 226101, 226013, 226392, 226988]
56543B26988R19k6k677m753m228k335j455j463p05N90O31o82j473q19K84R68J470
56526B11234J853J635J039R81J557J996K216K815L323K379J66j102j74J301J130
56511B32349j89j45K193M862N573M520L768M413N502O003O699Q984J2253J3971
56497C10756J2655R614P243O523O810P148O878N600L494J456L13P1J68J32k32
56482C78629q69j414j610j841k611l562l829l348k872k737k744l204m639o293
56468C37056o537n193l850l437l136k346j882k325k867k812k671k714k125q27
56454B94334m38j956l946m512l709k633j530l85J2q21k010k785l652m739m677
56439B56553k882j294j691k765k128O3J876K830L721M096K811P04M6J322K761
$$ y = [226988, 227907, 227881, 225204, 220451, 216223, 213888, 212433, 210970, 210265, 210855, 211486, 210804, 209331, 208512, 208796, 209764, 211234, 213087, 214722, 215761, 216742, 218299, 220295, 222511, 225326, 228649, 231028, 231194, 230092, 229918, 231219, 232349, 232160, 232015, 234208, 239070, 244643, 249163, 252931, 257344, 262846, 268849, 275548, 284532, 296785, 310756, 323411, 333025, 340268, 346791, 353601, 360749, 367627, 373227, 376721, 378177, 378490, 378561, 378729, 378861, 378629, 377760, 376346, 374736, 372895, 370284, 366722, 362893, 359545, 356673, 353936, 351192, 347988, 343349, 337056, 330519, 325326, 321476, 318039, 314903, 312557, 310675, 308350, 305483, 302671, 300000, 297286, 295161, 294334, 293896, 291940, 287994, 283482, 279773, 277140, 275610, 275225, 275237, 274416, 272406, 269621, 265969, 261230, 256553, 253671, 252377, 250686, 247921, 245793, 245856, 247732, 250562, 254283, 258379, 261190, 261894, 261940, 263262, 266023]
56424B66023L037K294P13j602l268k497J55J976J478on97o2P60J326J441J062
56408B72233O06P72J778L150M105L868K209K58j36J311K775K889K523K758K647
56393C03746R03j483k499k120j919k399k786k884l005k570r23J027J869J911K258
56378B89126K513J660N38P98J864J733M47p1L71j06j852k693j386N94J692K357
56362B97585L348M045L638K400R24n08j303q63J2k92j817k880k611j782q09R67
56346C00054L319M425L215Q31r75j646j435o82j8o5n02n88n48r35r01P91L069
56329C07409L238Q72j335j311m2O88P57P53N19OJ32J413K904L547L559L646L866
56312C30621L971L948L747L391L487M535N734N850N109M702M615L819K460J755
$$ y = [266023, 269060, 271354, 272067, 270465, 267197, 264700, 264855, 266831, 268309, 268303, 267706, 267644, 268404, 269730, 271171, 272233, 272839, 273611, 275389, 278539, 282644, 286512, 288721, 288979, 288843, 290154, 292929, 295818, 298341, 301099, 303746, 304649, 303166, 300667, 298547, 296628, 294229, 291443, 288559, 285554, 282984, 282061, 283088, 284957, 286868, 289126, 291639, 293299, 293837, 294635, 296499, 298232, 298679, 298608, 298979, 298873, 297021, 294328, 292942, 293536, 295228, 297585, 300933, 304978, 308616, 311016, 311940, 311432, 310129, 309266, 309278, 308986, 307169, 304289, 301678, 299896, 299087, 300054, 303373, 307798, 311013, 311844, 310869, 309223, 307788, 307106, 307088, 307023, 306521, 305933, 305385, 304450, 303549, 304340, 307409, 310647, 311519, 310184, 308873, 308831, 309519, 310276, 311029, 311548, 311554, 311686, 313099, 316003, 319550, 323109, 326755, 330621, 334592, 338540, 342287, 345678, 349165, 353700, 359434, 365284, 370393, 375095, 379710, 383529, 385989, 387744]
56298C87744J656R92O7N21K133K385K55k005k058k82J706L317M443M591L804K883
56282D12152J821j74k396k581k25K232K873K850L879N304N456M385L318K669K237
56267D43800K338L195M129M552M886N577O214O412O438O280N351L790K631K080
56253E07673J207r8n61L80J689K621L591M455M162L151L706O564R250R416P935
56238E65141P048P197P398P295P132O837O447O451O785O818O863Q024R993J1070
56224F70499J1093J1915J4050J5537J5374J5288J6449J7228J6383J5856J7883
56213H37555K1441K4026K5138K5782K6242K6694K8260L1254L4006L5492L7311
56202A153201M0851M4597M6686M8277N1583N6293O0824O5626P2311Q0589Q8885
$$ y = [387744, 389400, 390392, 390459, 390980, 393113, 395498, 395753, 393748, 391690, 391408, 393114, 396431, 400874, 405465, 409269, 412152, 413973, 413799, 411403, 408822, 408597, 410829, 413702, 416552, 420431, 425735, 431191, 435576, 438894, 441563, 443800, 446138, 449333, 453462, 458014, 462900, 468477, 474691, 481103, 487541, 493821, 499172, 502962, 505593, 507673, 508880, 508782, 508221, 508601, 510290, 512911, 516502, 520957, 525119, 528270, 531976, 538540, 547790, 557206, 565141, 572189, 579386, 586784, 594079, 601211, 608048, 614495, 620946, 627731, 634549, 641412, 649436, 659429, 670499, 681592, 693507, 707557, 723094, 738468, 753756, 770205, 787433, 803816, 819672, 837555, 858996, 883022, 908160, 933942, 960184, 986878, 1015138, 1046392, 1080398, 1115890, 1153201, 1194052, 1238649, 1285335, 1333612, 1385195, 1441488, 1502312, 1567938, 1640249, 1720838, 1809723]
56191A809723R7006J05669J14380J22350J30604J40589J51529J61454J69926J77358
56181C180588J82720J84558J83401J80597J75453J66115J52472J35749J15827
56172D657480R1727O4481L7029J1193j3360l7289o0484q2573j02967j20691j35233
56161D309313j46849j55285j59701j60876j61445j62275j60840j55228j47471
56152B899343j40445j33756j25754j17541j11377j06589j00701r3620q7242q1751
56142A800567p5755o9415o4045n9123n3051m6522m1864l9313l7010l4472l2913
56131A247084l2164l0436k7282k4041k1351j8820j6937j6454j6060j3630r840
56120A020069p664q012q677p922o473n493m920m343l657k604j260n87q61m35J894
$$ y = [1809723, 1906729, 2012398, 2126778, 2249128, 2379732, 2520321, 2671850, 2833304, 3003230, 3180588, 3363308, 3547866, 3731267, 3911864, 4087317, 4253432, 4405904, 4541653, 4657480, 4749207, 4813688, 4850717, 4861910, 4848550, 4811261, 4750777, 4668204, 4565237, 4444546, 4309313, 4162464, 4007179, 3847478, 3686602, 3525157, 3362882, 3202042, 3046814, 2899343, 2758898, 2625142, 2499388, 2381847, 2270470, 2163881, 2063180, 1969560, 1882318, 1800567, 1724812, 1655397, 1591352, 1532229, 1479178, 1432656, 1390792, 1351479, 1314469, 1279997, 1247084, 1214920, 1184484, 1157202, 1133161, 1111810, 1092990, 1076053, 1059599, 1043539, 1029909, 1020069, 1012405, 1004393, 995716, 987794, 981321, 975828, 970908, 966565, 962908, 960304, 959044, 958457, 957596, 957161, 959055]
56105I59055M310M334K707K163L238M336N258P345J0393J2647J3815J5124J6556
56092A061281J6901J6505J7080J8917K0945K3315K7009L1235L4188L6172L9123
56081A342671M3321M7649N2559N9471O7372P3262P6008P6664P5368P1228O5179
56070B050752N9640N5265N1079M7396M5309M3689M0210L4984K9719K3907J5857
56059B497807O926L25m053r149j5301k0192k4336l1262m1180m9695n4296n7358
56047B198236o0815o2555o0445n6046n1796m7789m3395l9150l5183l0552k5464
56036A685046k1529j8854j5809j2261r789q185n456j885j54n27j8K571M951N851
56022A603952O953R029J0413J0917J2910J6564J8289J6223J3472J3578J6097J8767
$$ y = [959055, 963365, 967699, 970406, 972569, 975807, 980143, 985401, 992746, 1003139, 1015786, 1029601, 1044725, 1061281, 1078182, 1094687, 1111767, 1130684, 1151629, 1174944, 1201953, 1233188, 1267376, 1303548, 1342671, 1385992, 1433641, 1486200, 1545671, 1613043, 1686305, 1762313, 1838977, 1914345, 1985573, 2050752, 2110392, 2165657, 2216736, 2264132, 2309441, 2353130, 2393340, 2428324, 2458043, 2481950, 2497807, 2504733, 2505058, 2501005, 2491856, 2476555, 2456363, 2432027, 2400765, 2359585, 2309890, 2255594, 2198236, 2137421, 2074866, 2014421, 1958375, 1906579, 1858790, 1815395, 1776245, 1741062, 1710510, 1685046, 1663517, 1644663, 1628854, 1616593, 1606804, 1598619, 1593163, 1591278, 1591124, 1590597, 1590579, 1593150, 1598101, 1603952, 1610905, 1619934, 1630347, 1641264, 1654174, 1670738, 1689027, 1705250, 1718722, 1732300, 1748397, 1767164]
56010A767164K0783K2017K2139K2074K3374K5070K4627K2782K3415K7486L1439
55999B032370L2957L3806L5423L6248L5503L5281L6749L8294L9218M1224M4398
55988B441471M5993M5051M4156M4877M5730M6028M7406N0027N1795N2614N4658
55977B969806N7528N8545N8869O3127P1416P8149Q0865Q3521Q8738R3643R6307
55966C800514R9489J04727J09334J12620J18347J27458J35204J39284J44036J52593
55956E043606J61726J68780J76562J86934J96533K03594K12113K24428K36619
55947F810895K46123K56729K71027K85270K96925L09995L27343L45345L61479
55938I511131L79481M01494M23415M43868M68989N02070N37229N70046O05179
$$ y = [1767164, 1787947, 1809964, 1832103, 1854177, 1877551, 1902621, 1927248, 1950030, 1973445, 2000931, 2032370, 2065327, 2099133, 2134556, 2170804, 2206307, 2241588, 2278337, 2316631, 2355849, 2397073, 2441471, 2487464, 2532515, 2576671, 2621548, 2667278, 2713306, 2760712, 2810739, 2862534, 2915148, 2969806, 3027334, 3085879, 3144748, 3207875, 3279291, 3357440, 3438305, 3521826, 3610564, 3704207, 3800514, 3900003, 4004730, 4114064, 4226684, 4345031, 4472489, 4607693, 4746977, 4891013, 5043606, 5205332, 5374112, 5550674, 5737608, 5934141, 6137735, 6349848, 6574276, 6810895, 7057018, 7313747, 7584774, 7870044, 8166969, 8476964, 8804307, 9149652, 9511131, 9890612, 10292106, 10715521, 11159389, 11628378, 12130448, 12667677, 13237723, 13842902]
55929A3842902O46591O89795P31203P75291Q24875Q74661R22525R76371J041289
55920B1325503J111269J182472J262345J356078J457403J563452J684471J826857
55912C2769850J981289K140701K314628K512089K727355K958287L220982L529433
55904E4154614L880457M278031M752217N333834O033415O866024P867648R062284
55896A02228524J0450722J2067736J4008851J6354804J9110484K2243794K5646281
55889B22111196K8872439L0968403L0839346K7980798K2805355J6196153Q858288
55882C88631978J204608o295064j2951980j8137497k1606799k3497232k4114944
55875B83233070k3787790k2823933k1476044j9914256j8256723j6609377j5050856
$$ y = [13842902, 14489493, 15179288, 15910491, 16685782, 17510657, 18385318, 19307843, 20284214, 21325503, 22436772, 23619244, 24881589, 26237667, 27695070, 29258522, 30942993, 32769850, 34751139, 36891840, 39206468, 41718557, 44445912, 47404199, 50625181, 54154614, 58035071, 62313102, 67065319, 72399153, 78432568, 85298592, 93166240, 102228524, 112679246, 124746982, 138755833, 155110637, 174221121, 196464915, 222111196, 250983635, 281952038, 312791384, 340772182, 363577537, 379773690, 388631978, 389836586, 383541522, 370589542, 352452045, 330845246, 307348014, 283233070, 259445280, 236621347, 215145303, 195231047, 176974324, 160364947, 145314091]
55868A45314091j3604549j2261006j1017946r879411q837209p881920p021230
55861G4810820o265440n604738n019020m499662m044561l642603l280804k958660
55853C9495332k679907k437355k219571k024956j856244j708315j573656j452792
55845B3542536j347772j252488j160779j076830j006255r43789q81247q21068
55837A5052308p70190p26297o82007o37846n99451n65782n31253m96515m66667
55828I576300m41066m14597l87159l63042l42666l23007l04436k89506k76845
55819F433976k63374k50674k42086k35680k26962k16638k08911k03861j98053
55810D387737j91017j84842j79084j71983j64984j60069j54632j45046j33451
$$ y = [145314091, 131709542, 119448536, 108430590, 98551179, 89713970, 81832050, 74810820, 68545380, 62940642, 57921622, 53421960, 49377399, 45734796, 42453992, 39495332, 36815425, 34378070, 32158499, 30133543, 28277299, 26568984, 24995328, 23542536, 22194764, 20942276, 19781497, 18704667, 17698412, 16754623, 15873376, 15052308, 14282118, 13555821, 12873814, 12235968, 11636517, 11070735, 10539482, 10042967, 9576300, 9135234, 8720637, 8333478, 7970436, 7627770, 7304763, 7000327, 6710821, 6433976, 6170602, 5919928, 5677842, 5442162, 5215200, 4998562, 4789651, 4585790, 4387737, 4196720, 4011878, 3832794, 3660811, 3495827, 3335758, 3181126, 3036080, 2902629]
55801B902629j24791j18769j11084j01245r2844q6972q1482p6146p2662o9980
55791A966654o5204n9020n4943n3342n1212m7803m5469m4791m3559m0970l8649
55780A421692l7108l5026l2318l0304k8809k6502k3975k3053k3212k2090j9515
55769A119780j7706j7485j7445j6830j6408j6517j6750j7363j8650j9547j9094
55758I25985j8346j8425j8002j5475j2357j1408j2356j2549j1026r043p411o127
55746G73460n769o502o711n208l456k947k153O64L505L273R11j69M05L83k01P72
55730G50257K691K384m39k243j134N24N9k231m889p457r617j0674j0860j1117
55716F95254j1163r889p792o639o524n688l510j328r6M46J16j791m643o725p638
$$ y = [2902629, 2777838, 2659069, 2547985, 2446740, 2353896, 2266924, 2185442, 2109296, 2036634, 1966654, 1901450, 1842430, 1787487, 1734145, 1682933, 1635130, 1589661, 1544870, 1501311, 1460341, 1421692, 1384584, 1349558, 1317240, 1286936, 1258127, 1231625, 1207650, 1184597, 1161385, 1139295, 1119780, 1102074, 1084589, 1067144, 1050314, 1033906, 1017389, 1000639, 983276, 964626, 945079, 925985, 907639, 889214, 871212, 855737, 843380, 831972, 819616, 807067, 796041, 786998, 779587, 773460, 767691, 761189, 754478, 749270, 745814, 742867, 740714, 741378, 744883, 748156, 749067, 748898, 749303, 749686, 749485, 750257, 752948, 755332, 754893, 752650, 751516, 752040, 752099, 749868, 744979, 737522, 727905, 717231, 706371, 695254, 684091, 674202, 666410, 659771, 653247, 647559, 644049, 642721, 642625, 643071, 643187, 641396, 636753, 630028, 622390]
55701F22390q311q806q394p732q316r725r927q628p786q466r596j0360j1301j2439
55687D92603j2588j1298r621q353p273o425o348o640o071m504l149k796l150l727
55673D00660l963l028j320j166l862o961p152n111m315n627o432n200l300j918
55659C41305n82M48k54k248k925j443o6k33k99J196K878L050K408K208J892N49
55643C47884j151k281l259m409m757m031m019n872p696p065m586k685j954j198
55629B92921l86r15k865m220l358q30J810L686M558M209K706Q99nN53J987L164
55613C03914L361K649J475L81J26J339L396M371L010L86j290j225n04k86m93k81
55597C20329R65K951M376L967K123O47K85j71j361j667M9J667L55k900m306k545
$$ y = [622390, 614079, 605273, 596879, 589147, 580831, 571106, 561179, 552551, 544765, 536299, 526703, 516343, 505042, 492603, 480015, 468717, 459096, 450743, 443470, 437045, 430697, 424057, 417986, 413482, 410333, 407537, 404387, 400660, 396697, 393669, 392349, 391183, 387321, 380360, 373208, 368097, 363782, 358155, 351723, 346523, 343223, 341305, 340723, 341171, 340917, 338669, 335744, 334301, 334235, 334002, 333703, 334899, 337777, 340827, 343235, 345443, 347335, 347884, 346733, 344452, 341193, 336784, 332027, 327996, 323977, 318105, 310409, 303344, 298758, 296073, 294119, 292921, 292535, 291620, 288755, 284535, 281177, 280347, 282157, 285843, 290401, 294610, 297316, 298215, 298210, 298763, 300750, 303914, 307275, 309924, 311399, 311780, 311906, 313245, 316641, 321012, 324022, 324408, 323118, 321893, 321389, 321103, 320610, 320329, 321294, 324245, 328621, 332588, 334711, 335358, 335643, 335472, 334111, 332444, 332493, 334160, 334515, 331615, 327309, 324764]
55581C24764k32J88p49j533k068k980m356o122q213r743r504p768o190n632n555
55566B54307n653o129o152m259q61J622J911J202P43J01j235k515l036l158l066
55551B23822k275j195j262k560l184k210j326k098l443l463k245j144n58j39j09
55536A96611p36j353j287r66r98j026o29l04n10o91l73n5O5Q88K590L383J839
55519A96448o42j548o31L90Q77J934M075O094O722O189N721O274P786R093Q697
55504B57479O384L952L421M549M893K615j338m217m460l333l276m795n890n030
55490B50954l541l719n346o007m703k991k252j926j318j131j875k413j635m21
55476B11676m06j617k722k913k296j002Q45K578L474L548L253K719J871Q32k32
$$ y = [324764, 324532, 324720, 323971, 322438, 320370, 317390, 313034, 306912, 298699, 288956, 279452, 271684, 265494, 259862, 254307, 248654, 242525, 236373, 232114, 231253, 232875, 234786, 235988, 236731, 236832, 235597, 233082, 230046, 226888, 223822, 221547, 220352, 219090, 216530, 213346, 211136, 209810, 207712, 204269, 200806, 198561, 197417, 196859, 196720, 196611, 195875, 194522, 193235, 192269, 191271, 190245, 189616, 189312, 188802, 188111, 187738, 187683, 187748, 188636, 191226, 194609, 196448, 195806, 194258, 193627, 194017, 194894, 196828, 200903, 206997, 213719, 219908, 225629, 231903, 239689, 248782, 257479, 263863, 267815, 271236, 275785, 280678, 283293, 281955, 277738, 273278, 269945, 266669, 261874, 255984, 250954, 247413, 243694, 238348, 232341, 227638, 224647, 222395, 220469, 219151, 218020, 216145, 213732, 212097, 211676, 211270, 209653, 206931, 204018, 201722, 200720, 201565, 204143, 207617, 211165, 214418, 217137, 219008, 219840, 219608]
55461B19608j228j851j809j490j592j941j822j517k145l711m882n142n455o101
55447A78922n726l713j682j254j808j970j979k773l867l963l033k261k326k982
55433A39585l767m068l200j476m33q78j586j000N90J842K325K457K270J641J087
55418A35389J031R00J73m06J47J396K023J489K35j059j586p95M55L34j285k064
55402A36377m89J627J736K74m40J05M26j28p47j055j407j504p80o1q14k694l696
55385A26730k870j173L07J274J419N86k04L36J601J695L43o25j58O06N05K17R06
55368A31495K328L337L453K969K143J046j20r60j045j74J217K226K570K903L491
55353A56879L312J666j52l13P82R33p15k553k810j545O7J179J490R93K6q85j454
$$ y = [219608, 218380, 216529, 214720, 213230, 211638, 209697, 207875, 206358, 204213, 200502, 195620, 190478, 185023, 178922, 173196, 169483, 167801, 166547, 164739, 162769, 160790, 158017, 154150, 150187, 147154, 144893, 142567, 139585, 135818, 131750, 128550, 127074, 126641, 125763, 124177, 123177, 123767, 125609, 127934, 130391, 132661, 134302, 135389, 136420, 137320, 137493, 137087, 137234, 138630, 140653, 142142, 142377, 141318, 139732, 138937, 139392, 139726, 138441, 136377, 135888, 137515, 139251, 139525, 139085, 139190, 139616, 139488, 138741, 137686, 136279, 134775, 133995, 133934, 133120, 130426, 126730, 123860, 122687, 122994, 124268, 125687, 126273, 126069, 126405, 128006, 129701, 130044, 129419, 129261, 129867, 130372, 130589, 131495, 133823, 137160, 140613, 143582, 145725, 146771, 146651, 145691, 144646, 144472, 145689, 147915, 150485, 153388, 156879, 160191, 161857, 161705, 161392, 162174, 163107, 162392, 159839, 157029, 155484, 155551, 156730, 158220, 159213, 159239, 158354, 156900]
55336A56900j540j026l83p99k649m435m396k766j207m74r0P5l41q93n86M38J044
55319A36872J019J248J828J641K58j219j765j557j035n1J450K962M075M657M183
55304A54566K010j283l856m327k950r73L88M73l03o39K7M46o82k447k832j666
55288A35952m98J80J368K986L298J580o34j898k479k710j739O22K472J930l25
55273A40105k095k375j803j118m90lK65M66P81J244J921K679K766J571j39q92
55257A42883o29p37j632j870m96J269J738R54j9q57j755k270j723m44M84N43K08
55240A35647K00Q04J613J809R59l50j262j647j620o08J662L530K840J70j482q19
55224A41446P3q65k698l388k809k085j378k49P55P31K3k26L96J583L066M167L664
$$ y = [156900, 155360, 154334, 153951, 153152, 150503, 146068, 141672, 138906, 137699, 137225, 137135, 137210, 136869, 135976, 135390, 135828, 136872, 137891, 139139, 140967, 142608, 142866, 141647, 139882, 138325, 137290, 137239, 138689, 141651, 145726, 150383, 154566, 156576, 155293, 151437, 147110, 144160, 143187, 143575, 144048, 143745, 143106, 143133, 143579, 142897, 140450, 137618, 135952, 135454, 135634, 137002, 139988, 143286, 144866, 144232, 142334, 139855, 137145, 135406, 136028, 138500, 140430, 140105, 138010, 135635, 133832, 132714, 132224, 132221, 132486, 132952, 133733, 134977, 136898, 139577, 142343, 143914, 143775, 142883, 142254, 141517, 139885, 138015, 137519, 138788, 140526, 141480, 141461, 140604, 138849, 136579, 134856, 134412, 134896, 135439, 135647, 135847, 136651, 138264, 140073, 141032, 140682, 139420, 137773, 136153, 135545, 137207, 140737, 143577, 143747, 142265, 141446, 141519, 140654, 137956, 134568, 131759, 129674, 128296, 128047, 128802, 129533, 129556, 129330, 129726, 131309, 134375, 138542, 142206]
55207A42206J427o81r70r2L17J73M34R19O40j45j58Q10J667J760J257M7k012l710
55189A43889l288r17J124J229K02k36M60J557K034J225p63k893m076m194l718
55174A31635k583m80J922L278L241K699K150J141l97j519j659j558j915k041q78
55159A33036J218K761K996K564K305K209J809J018J98l92q24j224j487j381q06
55144A44000J38J145J739J522O07l69r74j417j894j948j057L26J138J063O89L71
55128A45079r0n64m52J96N01Q2m70q90j789l126l411j609J106K760K981K687K091
55111A45082O32j313k302j567J77J841K837K806J607j37j355j747j908k098j753
55096A40802n56Q25J591J752J711J465Q64L03M48J230J690J088k30j333j840k099
$$ y = [142206, 143633, 142952, 141982, 141890, 142207, 142380, 142814, 143733, 144373, 144228, 144070, 144880, 146547, 148307, 149564, 149611, 147599, 143889, 140601, 139684, 140808, 142037, 142239, 142003, 142463, 144020, 146054, 147279, 146516, 143623, 139547, 135353, 131635, 129052, 128572, 130494, 133772, 137013, 139712, 141862, 143003, 142606, 141087, 139428, 137870, 135955, 133914, 133036, 134254, 137015, 140011, 142575, 144880, 147089, 148898, 149916, 150114, 149722, 148898, 147674, 146187, 144806, 144000, 144138, 145283, 147022, 148544, 149151, 148782, 147808, 146391, 144497, 142549, 141492, 141818, 142956, 144019, 144708, 145079, 144989, 144425, 143973, 144169, 144670, 144752, 144282, 143392, 141603, 138477, 135066, 133457, 134563, 137323, 140304, 142991, 145082, 145714, 144401, 142099, 140532, 140709, 142550, 145387, 148193, 149800, 149663, 148308, 146561, 144653, 142555, 140802, 140246, 141071, 142662, 144414, 146125, 147590, 148454, 148757, 149205, 150435, 152125, 153213, 152983, 151650, 149810, 147711]
55080A47711k252j774l78J148J600O84q02j874j857l79K091L845L235O87j554
55065A50131j942r69J68J081J760J778Q01p01j942k510k236j196j68j48q97r75
55049A42035K50J683K200K067J932J720J425J665K275J795k07j579k20K738M356
55034A64135L784K636J961J019p76k595l364k862j440K62J345J468J469K086K474
55019A71602J468j86o37K69R86J013J483K552K558P20j170j213p5K47p01j659
55003A77257j740j326j048r52p63l84P3N30J121J860K069P44j953m196m483l548
54987A63261k982k535o66K353M046L117J281O56J059J190J004J160J131k15k526
54972A71334l986l441j341J226L289L921K789J059O42J954L180K389j01k156k335
$$ y = [147711, 145459, 143685, 143307, 144455, 146055, 146739, 145937, 144063, 142206, 141827, 143918, 147763, 150998, 151685, 150131, 148189, 147220, 147388, 148469, 150229, 152007, 152808, 152107, 150165, 147655, 145419, 144223, 144055, 143907, 143010, 142035, 142285, 143968, 146168, 148235, 150167, 151887, 153312, 154977, 157252, 159047, 158840, 157261, 157041, 159779, 164135, 167919, 170555, 172516, 173535, 172759, 170164, 166800, 163938, 162498, 162760, 164105, 165573, 167042, 169128, 171602, 173070, 172884, 172247, 172516, 173502, 174515, 175998, 178550, 181108, 181828, 180658, 179445, 179370, 179617, 178916, 177257, 175517, 174191, 173143, 172191, 171428, 171044, 171117, 171647, 172768, 174628, 176697, 177441, 175488, 171292, 166809, 163261, 160279, 157744, 157078, 159431, 163477, 166594, 167875, 168531, 169590, 170780, 171784, 172944, 174075, 173860, 171334, 167348, 163907, 162566, 163792, 167081, 171002, 173791, 174850, 175492, 177446, 180626, 183015, 182914, 180758, 178423]
54957A78423j292n71o65q01l37L61N47j4j089k315l050k564j017K64L25n8M61
54940A66608J756K518K319J918J585P09n07o59P99K381K529J619R06M60n19j854
54924A82568k341j427J32J312J739J597J419J855K905L417K248L2j144k16J398
54909A95494J442m65k458k637j070N61R02J29o25n37K76J106J394J202J168J803
54893A97685K746K967J922L08p43r87j193j957k871l106k586k212k779l751l532
54878A79911j306J728L499L318K239J309N64p6j92J71J34n17n64Q27K570L329
54862A96944L675M797N925N236L081J938K868M213M601N043O807Q901R319P715
54848B71063N304K878L41k117l772m327m207l933l792m011m638n182n014m166
$$ y = [178423, 177131, 176560, 175895, 175094, 174757, 175118, 175665, 175651, 174562, 172247, 169197, 166633, 165616, 165880, 166205, 166147, 166608, 168364, 170882, 173201, 175119, 176704, 177413, 176906, 176247, 177046, 179427, 181956, 183575, 184481, 184941, 184422, 182568, 180227, 178800, 178932, 180244, 181983, 183580, 184999, 186854, 189759, 193176, 195424, 195456, 194312, 194096, 195494, 196936, 196471, 194013, 191376, 190306, 190867, 191769, 191898, 191273, 190736, 191012, 192118, 193512, 194714, 195882, 197685, 200431, 203398, 205320, 205628, 204885, 203898, 202705, 200748, 197877, 194771, 192185, 189973, 187194, 183443, 179911, 178605, 180333, 183832, 187150, 189389, 190698, 191262, 191186, 190994, 191165, 191299, 190782, 190218, 191045, 193615, 196944, 200619, 205416, 211341, 216577, 219658, 221596, 224464, 228677, 233278, 238321, 245128, 254029, 263348, 271063, 276367, 279245, 279586, 277469, 273697, 269370, 265163, 261230, 257438, 253427, 248789, 243607, 238593, 234427]
54834B34427l399l270l367k764j274O3K16k69J29J522K051O25j044o77J187K085
54818B26241J504J468K972M263L720K421K399L759N045N418N022M109L113K953
54804B74407L913M748L978J644j193l970o433p684o975n236m367m925n638n388
54790B36881m493l799l454l083k540j992j594j323j020n65k27o20j929l349l776
54775B03117l066k146j847j969j725q83j89m28j285j497l57J308K119J663O10
54760A93425k52l60P04K538L503K303q9j349p16N45J566K854M241L933J083k240
54744B11689l327k085n56m8m00j301k510l038j841M23J724J062m95j362j150n10
54728A96275n4J73M71R81J331J022K48j36L33J284K368L714N019N178L732J875
$$ y = [234427, 231028, 227758, 224391, 221627, 220353, 220416, 220632, 220363, 220492, 222014, 224065, 224690, 223646, 222969, 224156, 226241, 227745, 229213, 232185, 236448, 240168, 242589, 244988, 248747, 253792, 259210, 264232, 268341, 271454, 274407, 278320, 283068, 287046, 288690, 287497, 283527, 277094, 269410, 262435, 257199, 252832, 247907, 242269, 236881, 232388, 228589, 225135, 222052, 219512, 217520, 215926, 214603, 213583, 213018, 212791, 212171, 210242, 206893, 203117, 200051, 197905, 196058, 194089, 192364, 191481, 191292, 190864, 189579, 188082, 187725, 189033, 191152, 192815, 193425, 193173, 192813, 193517, 196055, 199558, 201861, 201772, 200423, 199707, 200252, 201818, 204672, 208913, 212846, 213929, 211689, 208362, 206277, 205721, 205673, 205273, 203972, 201462, 198424, 196583, 197006, 198730, 199792, 199297, 197935, 196785, 196275, 196221, 196394, 196865, 197846, 199177, 200199, 200447, 200311, 200644, 201928, 204296, 208010, 213029, 218207, 221939, 223814]
54712B23814J029J063R38M93M22R54J715K667M053N569O557O974P320P823Q435
54697B79826R280J0226J0323Q619N327J502k021m647n738n425n097n862o995p148
54683B82170o496o182o185n452l941k745k193j633j117j463k335k271j205r30
54669B38022k146k962j723L10Q76Q3m4J202K425K573K438L219M701N641N416M637
54653B64668M284M609M955M532L207J514J5j163k180l143l932m290m078l515l010
54638B62473k696k497k721l919n873p333p362o398n282m009k351j079j137j951
54624B07865k010j030j56Q3M28J162J268P2j458j996j449n25M03J034O10j179
54608B03122l206l843k781j200k52q3j79j23J76N64Q76J082J099N85n63j538j155
$$ y = [223814, 224843, 225906, 226844, 227337, 227759, 228713, 230428, 233095, 237148, 242717, 249274, 256248, 263568, 271391, 279826, 289106, 299332, 309655, 318274, 323601, 325103, 323082, 318435, 312697, 307272, 302175, 296313, 289318, 282170, 275674, 269492, 263307, 257855, 253914, 251169, 248976, 247343, 246226, 244763, 242428, 240157, 238952, 238022, 235876, 232914, 231191, 231501, 232377, 232460, 232416, 233618, 236043, 238616, 241054, 244273, 248974, 254615, 260031, 264668, 268952, 273561, 278516, 283048, 286255, 287769, 287784, 286621, 284441, 281298, 277366, 273076, 268998, 265483, 262473, 259777, 257280, 254559, 250640, 244767, 237434, 230072, 223674, 218392, 214383, 212032, 210953, 209816, 207865, 205855, 204825, 204669, 204752, 205180, 206342, 207610, 207682, 206224, 204228, 202779, 202254, 202657, 203691, 204301, 203122, 199916, 196073, 193292, 192092, 191840, 191757, 191578, 191455, 191631, 192195, 193071, 194153, 195252, 195837, 195274, 193736, 192581]
54591A92581N89K132K094Q88J06N91J664K083J320J2o47j74M93Kj553k454j517
54574A98210K79J064N32M6M13O80l30k024k547j113R77J944J539Q54N69L25j49
54557B01269l70qM07M25M70Q21N80r55k460j813Q99L244L613K849K158J217m40
54540B11906j622q45J280K493J577o19k572l356k805j549q98j517k227j213J390
54525A99423L251K578J90j667j678j33J952L493L602K117oj353j112M63K360L245
54509B16725K250j34k170k546j735j183j345j394p47M3K52Mj56j06k4Q2K15K66
54491B08297M57J350K856L778L178J677N59N8m19p98l82O66J211Q22L60N84J205
54474B25459J710K073K259J947J218O46L90J94M17J698L210K968O02j796k594
$$ y = [192581, 193170, 195302, 197396, 198284, 198390, 198981, 200645, 202728, 204048, 204060, 203413, 203239, 203732, 203734, 202181, 199727, 198210, 198489, 199553, 200085, 200131, 200544, 201224, 200894, 198870, 196323, 195210, 196187, 198131, 199670, 200524, 201093, 201418, 201269, 200899, 200891, 201298, 201723, 202193, 203014, 203594, 202639, 200179, 198366, 199265, 202509, 206122, 208971, 211129, 212346, 211906, 210284, 209439, 210719, 213212, 214789, 214170, 211598, 208242, 205437, 203888, 202990, 201473, 199246, 198033, 199423, 202674, 205252, 205442, 203775, 202097, 201964, 203916, 207409, 211011, 213128, 213122, 211769, 210657, 211120, 213480, 216725, 218975, 218841, 216671, 214125, 212390, 211207, 209862, 208468, 207721, 207764, 208016, 208020, 207864, 207758, 207734, 207816, 208031, 208297, 208754, 210104, 212960, 216738, 219916, 221593, 222152, 222210, 221791, 220993, 220611, 221277, 222488, 223310, 223670, 224254, 225459, 227169, 229242, 231501, 233448, 234666, 235312, 235702, 235896, 236313, 238011, 241221, 244189, 244791, 242995, 240401]
54459B40401k758l697m579l769j701k11J36J18j26r83j730j221o5J6r24j023L08
54442B18192J392J030J97O5J57l56r08n59K37K02q12j549r50N35J302K05k000
54425B16380l098j834N09J758J575J355J809K172J862J329R60N00L1J68Q86J335
54409B27697J135P63L49m84j310r76M65J453J184P09J000J431J100L41j02k03
54393B34552j59J14K46m30j356r97N29R82n65j828o18J766K560J537N28M3q39
54376B36065j770j158R20K244J517q3j040j456k015k449k077j009o2J40m26j100
54360B26241p71J066L409M547L969K772K185K327K611K606K231J517N00p96k177
54345B52237k958k333n25J063J410J122J279J716J475O34L87J356K795L583L196
$$ y = [240401, 237643, 233946, 229367, 225598, 223897, 223686, 223822, 223940, 223814, 222831, 221101, 219880, 219815, 219831, 218907, 217884, 218192, 219584, 220614, 220811, 220876, 221033, 220677, 219769, 219210, 219447, 219649, 218837, 217288, 216338, 216873, 218175, 218380, 216380, 213282, 211448, 211957, 213715, 215290, 216645, 218454, 220626, 222488, 223817, 224777, 225277, 225308, 225476, 226362, 227697, 228832, 229595, 229944, 229460, 228150, 227174, 227639, 229092, 230276, 230985, 231985, 233416, 234516, 234857, 234755, 234552, 234393, 234507, 234753, 234323, 232967, 231970, 232499, 233481, 232916, 231088, 230470, 232236, 234796, 236333, 236861, 236904, 236065, 234295, 233137, 234057, 236301, 237818, 237735, 236695, 235239, 233224, 230775, 228698, 227689, 227627, 227767, 227341, 226241, 225470, 226536, 229945, 234492, 238461, 241233, 243418, 245745, 248356, 250962, 253193, 254710, 255210, 254414, 252237, 249279, 246946, 246421, 247484, 248894, 250016, 251295, 253011, 254486, 255120, 255507, 256863, 259658, 263241, 266437]
54330B66437J782J69l17R48K804L351K109K46j243k432l352l289j898j34P48O47
54314B66576N06J041J988K452J751J65j066q67M96J657J559L35j136j983j677
54299B71797k60J542K780L197L331L590L630K877J537O16Q55J828K448K407K660
54284C04835M024N667N942M540K817J737O95j127l320m964n823n919m918l069
54270C01117j856k426l942m798m803m678m100k225R2P08q25k485k614j763j043
54255B64359l22Q17J710J565Q69N18K99m20j109o44P81J680J362O88L86j71j704
54238B70664l386l625k188n27J22O5J32K83on54p39p72j460k587k733j258O42
54221B52073J597J878K631L993N046N097M005J756j121l033k636p39K78p95k754
$$ y = [266437, 268219, 268388, 268071, 269019, 271823, 275174, 277283, 277529, 276286, 273854, 270502, 267213, 265315, 265181, 265929, 266576, 267082, 268123, 270111, 272563, 274314, 274479, 273413, 272546, 273042, 274699, 276258, 276593, 275457, 273474, 271797, 271537, 273079, 275859, 279056, 282387, 285977, 289607, 292484, 294021, 294637, 295492, 297320, 299768, 302175, 304835, 308859, 314526, 320468, 325008, 327825, 329562, 330257, 329130, 325810, 320846, 315023, 309104, 304186, 301117, 299261, 296835, 292893, 288095, 283292, 278614, 274514, 272289, 272381, 273089, 272264, 269779, 267165, 265402, 264359, 264037, 264854, 266564, 268129, 268998, 269516, 269815, 269395, 268286, 267642, 268423, 270103, 271465, 272153, 272539, 272368, 270664, 267278, 263653, 261465, 260938, 261060, 261125, 261257, 261540, 261534, 260980, 260241, 259469, 258009, 255422, 252689, 251431, 252073, 253670, 255548, 258179, 262172, 267218, 272315, 276320, 278076, 276955, 273922, 271286, 270547, 270825, 270030, 267276]
54206B67276l723l204k019j036m87l7Q35K192L271L051J375q48k472k848j963
54191B59363l92R79J684K111K682K960K154M01j227j871j525p00j93p92k276l023
54175B60335j725O14J658Q77K21J268L015L370J879o9j148j264j146j465k339
54160B64081l265l557k967j652L20K749M567M290J808r84k020j219j58km64o83
54144B60844l81J33O09J090J547J625R29m68j917k643k298j210k79l57j313j896
54128B54015j152J80N63oJ52J782L278K869J063l73q44q58l34J070K337J843j11
54111B65474j406j121o60j212j858j370l47j36n09r5J288K227J789Q06N37P97
54095B64204L48j020j753n65J411J702k80k382k639j658j028o76M78K079K573
$$ y = [267276, 263553, 260349, 258330, 257294, 256807, 256770, 257605, 259797, 263068, 266119, 267494, 266646, 264174, 261326, 259363, 258971, 259950, 261634, 263745, 266427, 269387, 271541, 271942, 270715, 268844, 267319, 266619, 266426, 265634, 263358, 260335, 258610, 259224, 260882, 261759, 261980, 263248, 266263, 269633, 271512, 271443, 270295, 269031, 267885, 266420, 264081, 260816, 257259, 254292, 252640, 252960, 255709, 260276, 264566, 266374, 265390, 263370, 262151, 261993, 261991, 261527, 260844, 260463, 260596, 261205, 262295, 263842, 265467, 266396, 265928, 264011, 261368, 259070, 257860, 257581, 257224, 255911, 254015, 252863, 253043, 253606, 253600, 253752, 255534, 258812, 261681, 262744, 262371, 261527, 260669, 260335, 261405, 263742, 265585, 265474, 264068, 262947, 262287, 261075, 259217, 257847, 257500, 257364, 256855, 256760, 258048, 260275, 262064, 262870, 263407, 264204, 264552, 263532, 261779, 261214, 262625, 264327, 264047, 261665, 259026, 257368, 256340, 255664, 256142, 258221, 260794]
54080B60794J775J234J850K768K995K646K140J538J083J024O13j259l843m530
54066B70828j968K037M579M587K943Q69p53j351r74k40N56J596K500K175L34j682
54050B86036k318j337M14J905K229J097m76r86l19L57P28J695L105L153J238m73
54034B96048M1J762K482K121K080K326J529k70j372r19R9N61L99j52j131k183
54018C03421k447j527Q1J690K940L701M061M353M654M561L906L209K851K495K030
54003C39979K219L329M052L202J794J783L228M512N125O243Q221R493Q740O808
53989D08728N490N442N958O075N325M002L069L177L611L002J311J09O05K400M584
53974D62888O873Q975R955R446Q654Q921R708R416Q010P302Q163Q874P321M106
$$ y = [260794, 262569, 263803, 265653, 268421, 271416, 274062, 276202, 277740, 278823, 279847, 280460, 279201, 275358, 270828, 268860, 270897, 275476, 280063, 283006, 283875, 283122, 281771, 280797, 280557, 281113, 282709, 285209, 287384, 287718, 286036, 283718, 282381, 282795, 284700, 286929, 288026, 287550, 286564, 286245, 286602, 287330, 289025, 292130, 295283, 296521, 296048, 296089, 297851, 300333, 302454, 304534, 306860, 308389, 308119, 306747, 305828, 305927, 306488, 306887, 306735, 305604, 303421, 300974, 299447, 299528, 301218, 304158, 307859, 311920, 316273, 320927, 325488, 329394, 332603, 335454, 337949, 339979, 342198, 345527, 349579, 352781, 354575, 356358, 359586, 364098, 369223, 375466, 383687, 393180, 401920, 408728, 414218, 419660, 425618, 431693, 437018, 441020, 444089, 447266, 450877, 453879, 455190, 455299, 455904, 458304, 462888, 469761, 478736, 488691, 498137, 506791, 515712, 525420, 534836, 542846, 550148, 558311, 567185, 574506, 578612]
53960E78612J927K032K651J549r61k701k629j921k204l844o204q382r361q453
53946E40111o342m885n171o380p037o745o012n297n004n716p321q453p925o394
53932D51429n510n680n793n069l969l079k243j271p23j300k810m154m363l439
53918D02026k204j339p51k03j96j397l105l454j681P07J870J743J321Q71J95k6
53902C94377J100K900L570K606J400J232J955K999M445O305P741P947P358P215
53888D53150Q012Q923Q878P962P416Q131R407R835R255Q899R354R537Q425O743
53874E73927N817N661N534N587O454P578P643O571N573N280N337N896P747J0540
53860F65145J2456J2414J1324J0504J0145J0145J1211J3870J7082J9073J9288
$$ y = [578612, 580539, 582571, 585222, 586771, 585810, 583109, 580480, 578559, 576355, 572511, 566307, 557925, 548564, 540111, 533769, 528884, 523713, 517333, 510296, 503551, 497539, 492242, 487238, 481522, 474201, 465748, 457823, 451429, 445919, 440239, 434446, 429377, 425408, 422329, 420086, 418815, 418092, 416792, 413982, 409828, 405465, 402026, 399822, 398483, 397732, 397529, 397333, 395936, 392831, 389377, 387696, 388403, 390273, 392016, 393337, 394208, 394403, 394377, 395477, 398377, 401947, 404553, 405953, 407185, 409140, 412139, 416584, 422889, 430630, 438577, 445935, 453150, 461162, 470085, 478963, 486925, 494341, 502472, 511879, 521714, 530969, 539868, 549222, 558759, 567184, 573927, 579744, 585405, 590939, 596526, 602980, 610558, 618201, 624772, 630345, 635625, 640962, 646858, 654605, 665145, 677601, 690015, 701339, 711843, 721988, 732133, 743344, 757214, 774296, 793369, 812657]
53849H12657J8695J8310J8137J7674J7037J7338J9656K3411K6171K5647K1820
53838A036553J6385J0385L479m452j2164j8134k1969k4304k5892k7257k8597k9559
53826H74474k9432k7961k5712k3592k2290k1941k1793k0556j7818j4912j3406
53815F35061j3071j2508j1531j1225j1655j1362r791q459q630r411r430r056r301
53802D99631r560q354n889m060l911m605n147n656o442o968o586n631m932m427
53788D17463l115n26K151K993J396j125k536k383j856j963k339k039q86L51P34
53773D06320j11j622k482j666M44K362L082K879K491K182J966K028K340K336J529
53758D24078J68j067j680j354P1K082L443L431K833L116M732O751Q061Q332P887
$$ y = [812657, 831352, 849662, 867799, 885473, 902510, 919848, 939504, 962915, 989086, 1014733, 1036553, 1052938, 1063323, 1066802, 1062350, 1050186, 1032052, 1010083, 985779, 959887, 932630, 904033, 874474, 845042, 817081, 791369, 767777, 745487, 723546, 701753, 681197, 663379, 648467, 635061, 621990, 609482, 597951, 586726, 575071, 563709, 553918, 545459, 536829, 527418, 517988, 508932, 499631, 490071, 481717, 475828, 471768, 467857, 463252, 458105, 452449, 446007, 439039, 432453, 426822, 421890, 417463, 414348, 413822, 415973, 418966, 420362, 419237, 416701, 414318, 412462, 410499, 408160, 406121, 405235, 405586, 406320, 406209, 404587, 402105, 400439, 400883, 403245, 406327, 409206, 411697, 413879, 415845, 417873, 420213, 422549, 424078, 424246, 423179, 421499, 420145, 420216, 422298, 425741, 429172, 432005, 435121, 439853, 446604, 454665, 462997, 470884]
53743D70884P261P079P773R067R950R583Q222P017O791P223P468P332P281P418
53729E80349P165O283N379M743L500Q79k048l197k080m55k60j797m075n975o835
53714E81576o795o957q317j0224j0857r456p247n681m913m509m600n365o250o672
53700D83733o876p265p423o798n695m700l613k114j012j493l090l851k834j343
53686D25626j085j964k598k359j811j304l45J199K210J668L06k74l6n45k152k805
53670D13731r71J681K329R29p2M12R76O61N27J305J830J362J476L605O086O112
53654D41979L806J989K055K505J939J364K371M569O224O587O255N645M434K734
53640D94456J735K460M325N734N988N793N745N291L964K724K810L770L990L207
$$ y = [470884, 478145, 485224, 492997, 502064, 512014, 521597, 529819, 536836, 543627, 550850, 558318, 565650, 572931, 580349, 587514, 593797, 599176, 603919, 607419, 608298, 606250, 603053, 600973, 600518, 600258, 598461, 594386, 588411, 581576, 574781, 567824, 559507, 549283, 538426, 528970, 521723, 516042, 511129, 506620, 502020, 496655, 490405, 483733, 476857, 469592, 462169, 455371, 449676, 444976, 441363, 439249, 438237, 436744, 433654, 429803, 426969, 425626, 424541, 422577, 419979, 417620, 415809, 414505, 414160, 415359, 417569, 419237, 419543, 419269, 419233, 418688, 416536, 413731, 412760, 414441, 416770, 417699, 417627, 418039, 419015, 419676, 420203, 421508, 423338, 424700, 426176, 429781, 435867, 441979, 445785, 447774, 449829, 452334, 454273, 455637, 458008, 462577, 468801, 475388, 481643, 487288, 491722, 494456, 496191, 498651, 502976, 508710, 514698, 520491, 526236, 531527, 535491, 538215, 541025, 544795, 548785, 551992]
53626E51992K727K895K093p05l821m741l233j242k09J31M58O31Oj659l765n147
53610E36411m922l338j383M24K166L444L344K049J134J342J279m45k861l862l023
53595E31759j679q18m74o66j274j288J10J912K414J811J882L024L635K838J878
53580E45064J973K506K394J835J489J165N37K64J071K436L278L449L502L593L625
53565E78181L963M880N687N618N288N995P627Q622Q233P611Q037R059R272Q201
53551F76274O609N298M439L993M003M404N102O225P721Q724Q169O353M996N162
53537G57472N842N409L883K625K149J693J045J199K555L719L201J390k64j409
53523G90509k813m559n609n344m540m294m689m864m040k352q67p88k217l830m238
$$ y = [551992, 554719, 557614, 559707, 559002, 555181, 550440, 547207, 545965, 545756, 545887, 546345, 546976, 546982, 545323, 541558, 536411, 531489, 528151, 526768, 527192, 529358, 532802, 536146, 538195, 539329, 540671, 541950, 541505, 538644, 534782, 531759, 530080, 529262, 528788, 528122, 526848, 525560, 525670, 527582, 529996, 531807, 533689, 536713, 540348, 543186, 545064, 547037, 549543, 551937, 553772, 555261, 556426, 556963, 557227, 558298, 560734, 564012, 567461, 570963, 574556, 578181, 582144, 587024, 592711, 598329, 603617, 609612, 617239, 625861, 634094, 641705, 649742, 658801, 668073, 676274, 682883, 688181, 692620, 696613, 700616, 705020, 710122, 716347, 724068, 732792, 740961, 747314, 752310, 757472, 763314, 768723, 772606, 775231, 777380, 779073, 780118, 781317, 783872, 787591, 790792, 792182, 791918, 790509, 787696, 783137, 777528, 772184, 767644, 763350, 758661, 753797, 749757, 747405, 746538, 745750, 743533, 739703, 735465]
53508G35465l572l144l627m214l736j983K85K083K727K115R20J91L79R09R95O94
53492G26487Q00J707K822L372L541M281N895P433P992Q125R108J0975J2342J2302
53478H17182J1482J0829J0415J0103J0516J2279J4921J7344J8973J9761J9729
53467I73534J9462K0308K2824K5511K6493K6112K6329K7666K8504K7840K7042
53456A251625K8042L0922L4289L7011L8639L8934L8123L7354L7950M0174M3160
53445A656223M5744M7043M6735M5344M3896M2757M1206L8714L6046L4418L3971
53434B112097L3981L4198L4859L5503L5049L3359L1676L0986L0877L0660L0598
53423B473843L1042L1122K9645K6990K4666K3008K0767J7383J4147J2197J0697
$$ y = [735465, 731893, 728749, 725122, 720908, 717172, 715189, 715474, 717557, 720284, 722399, 723319, 723510, 723889, 724798, 725793, 726487, 727287, 728994, 731816, 735188, 738729, 743010, 748905, 756338, 764330, 772455, 781563, 792538, 804880, 817182, 828664, 839493, 849908, 860011, 870527, 882806, 897727, 915071, 934044, 953805, 973534, 992996, 1013304, 1036128, 1061639, 1088132, 1114244, 1140573, 1168239, 1196743, 1224583, 1251625, 1279667, 1310589, 1344878, 1381889, 1420528, 1459462, 1497585, 1534939, 1572889, 1613063, 1656223, 1701967, 1749010, 1795745, 1841089, 1884985, 1927742, 1968948, 2007662, 2043708, 2078126, 2112097, 2146078, 2180276, 2215135, 2250638, 2285687, 2319046, 2350722, 2381708, 2412585, 2443245, 2473843, 2504885, 2536007, 2565652, 2592642, 2617308, 2640316, 2661083, 2678466, 2692613, 2704810, 2715507]
53412B715507Q147M554Q37l128q044j2998j5754j5718j5015j5850j8019j9990
53400B604529k1331k2876k5027k7097k8266k8522k8572k9236l0737l2377l3127
53389B297361l2712l1718l0626k9317k7667k5940k4176k1931j9008j5858j2940
53378B025468j0269p909o202n143m173k929j503J84K403M779O498P683R387J1939
53364B030213J4695J7790K2285K7647L1091L1000K9523K9992L2945L6512L9437
53353B343130M1804M3755M5653M8784N3837N9232O2974O5582O9003P3277P6692
53342B983723P8900Q1179Q3652Q4981Q5247Q6439Q9257R1819R2524R2085R1683
53331C941489R1179R0282Q9575Q8969Q6961Q2919P8621P5969P4377P1872O7684
$$ y = [2715507, 2723654, 2728208, 2729045, 2725917, 2717873, 2704875, 2689121, 2673403, 2658388, 2642538, 2624519, 2604529, 2583198, 2560322, 2535295, 2508198, 2479932, 2451410, 2422838, 2393602, 2362865, 2330488, 2297361, 2264649, 2232931, 2202305, 2172988, 2145321, 2119381, 2095205, 2073274, 2054266, 2038408, 2025468, 2015199, 2007290, 2001088, 1995945, 1991772, 1988843, 1987340, 1987524, 1989927, 1994706, 2001204, 2008887, 2018274, 2030213, 2044908, 2062698, 2084983, 2112630, 2143721, 2174721, 2204244, 2234236, 2267181, 2303693, 2343130, 2384934, 2428689, 2474342, 2523126, 2576963, 2636195, 2699169, 2764751, 2833754, 2907031, 2983723, 3062623, 3143802, 3227454, 3312435, 3397682, 3484121, 3573378, 3665197, 3757721, 3849806, 3941489, 4032668, 4122950, 4212525, 4301494, 4388455, 4471374, 4549995, 4625964, 4700341, 4772213, 4839897]
53320D839897O2378N6352M9679M2769L5950K8990K1882J5163Q578N15r816k0602
53308E131735k9335l5919m2412n0075n8150o5372p1280p5859p9039q0829q1429
53297D462036q1052q0120p9357p9165p9034p8260p7003p6078p5845p5879p5588
53286C604655p4660p3007p0876o8972o8023o7921o7435o5087o0542n5214n1168
53275B881750m9124m7864m5934m3403m1244l9596l7712l5354l3084l1322l0210
53264B446903l0138l1076l1500k9687k6190k3367k2065k0559j7444j3698j0838
53253B190341q731o532m406k774r26K079N869R388J2425J5316J7813J9506K0860
53240B270228K2711K5177K7896L0753L3441L5125L5568L5966L7502L9610M0757
$$ y = [4839897, 4902275, 4958627, 5008306, 5051075, 5087025, 5116015, 5137897, 5153060, 5161638, 5162153, 5152337, 5131735, 5102400, 5066481, 5024069, 4973994, 4915844, 4850472, 4779192, 4703333, 4624294, 4543465, 4462036, 4380984, 4300864, 4221507, 4142342, 4063308, 3985048, 3908045, 3831967, 3756122, 3680243, 3604655, 3529995, 3456988, 3386112, 3317140, 3249117, 3181196, 3113761, 3048674, 2988132, 2932918, 2881750, 2832626, 2784762, 2738828, 2695425, 2654181, 2614585, 2576873, 2541519, 2508435, 2477113, 2446903, 2416765, 2385689, 2354189, 2324502, 2298312, 2274945, 2252880, 2232321, 2214877, 2201179, 2190341, 2181610, 2175078, 2170672, 2167898, 2166972, 2169051, 2174920, 2184308, 2196733, 2212049, 2229862, 2249368, 2270228, 2292939, 2318116, 2346012, 2376765, 2410206, 2445331, 2480899, 2516865, 2554367, 2593977, 2634734]
53229B634734M0427L9262L7837L6373L5126L3953L1890K8243K3694J9296J4965
53218B975800J0095N134J153j870n055q982j3237j7519k2021k6530l0120l2110
53206B834738l2887l3733l5942l9649m3242m4674m3844m2890m3493m5037m6193
53195B383154m6986m7911m8194m6902m5092m4807m6096m6856m5792m3968m3125
53184A877425m3789m5211m6150m5546m3470m1303m0076l8949l6472l2903k9854
53173A433702k7893k6146k4260k3013k2764k2884k3070k3837k5214k6271k6351
53162A161999k5653k4437k2987k2411k3824k6335k7494k6348k4374k2732k0658
53151H94746j7786j6030j7087j9364j9604j7093j4258j3302j4001j4951j5261
$$ y = [2634734, 2675161, 2714423, 2752260, 2788633, 2823759, 2857712, 2889602, 2917845, 2941539, 2960835, 2975800, 2985895, 2991029, 2992182, 2990312, 2985257, 2976275, 2963038, 2945519, 2923498, 2896968, 2866848, 2834738, 2801851, 2768118, 2732176, 2692527, 2649285, 2604611, 2560767, 2517877, 2474384, 2429347, 2383154, 2336168, 2288257, 2240063, 2193161, 2148069, 2103262, 2057166, 2010310, 1964518, 1920550, 1877425, 1833636, 1788425, 1742275, 1696729, 1653259, 1611956, 1571880, 1532931, 1496459, 1463556, 1433702, 1405809, 1379663, 1355403, 1332390, 1309626, 1286742, 1263672, 1239835, 1214621, 1188350, 1161999, 1136346, 1111909, 1088922, 1066511, 1042687, 1016352, 988858, 962510, 938136, 915404, 894746, 876960, 860930, 843843, 824479, 804875, 787782, 773524, 760222, 746221, 731270, 716009]
53140G16009j4533j2612j0174q711r073j0572j1935j2567j2326j0937q605o727
53128E87237o679p852q233p201o440p250q248p246m557k654k761l649l907l505
53114E07055k577p85J189J413n47k306j785k95n33k522l851l334k143j500j312
53099D86167j292j512j610j081n26j066k278k500j445p96j652l007l439k872j935
53084D59156r57l23n26j136r12L64J284P59n94j699k325k333r81J729M054M244
53068D59804K734J446J348J686J365J56j288k081j881j256r72q55q7J302K165
53053D63586J791P12l53j271j720r99O41J721J575J501K608L608K417o69l044
53038D72104l041j637p34q76j101m87O01P73p35k800l483k540j863k896m542m713
$$ y = [716009, 701476, 688864, 678690, 669979, 660906, 650334, 638399, 625832, 613506, 602569, 593964, 587237, 580558, 572706, 564473, 557272, 550832, 543582, 535334, 528088, 523531, 520877, 518116, 514467, 510560, 507055, 504478, 503693, 504882, 506295, 505748, 503442, 501657, 501362, 500829, 498307, 494456, 491122, 488979, 487479, 486167, 484875, 483363, 481753, 480672, 480146, 479080, 476802, 474302, 472857, 472061, 470409, 467402, 463963, 461091, 459156, 458199, 457876, 457350, 456214, 455302, 455666, 456950, 457709, 457115, 455416, 453091, 450758, 449777, 451506, 455560, 459804, 462538, 463984, 465332, 467018, 468383, 468539, 467251, 465170, 463289, 462033, 461061, 460206, 460119, 461421, 463586, 465377, 466089, 465736, 464465, 462745, 461746, 462387, 464108, 465683, 467184, 469792, 473400, 475817, 475148, 472104, 469063, 467426, 466692, 465816, 464715, 464228, 464829, 465602, 464867, 462067, 458584, 456044, 454181, 451285, 446743, 442030]
53022D42030l072j033L53J211J774J830J332N87k35r98j244p86n38j591l464m355
53006D31801l406j656l82L98J133J473Q04l56o40M44J811K090J077l29j293j659
52990D31310j593j153k67J001K329L069K491N17j755k882k605j953j652j282m97
52975D25078M3n2L17K156M203M122J708p66j560j113m21L94J208J176jj313j810
52958D33369j615j003J68J316J014q36k180j573k74qj32R18K541K827J851J474
52942D37857K046J894M69m85K26J274R56k65p79k31M44O73P31Q88J083J280J608
52925D49669K068K393K107Q34r78j881q60J093J933J292R55K063L272K877J574
52910D68411J415K614L319K528J379R59O14l83r18M20K564K901J089j21J315L719
$$ y = [442030, 438958, 437925, 438278, 439489, 441263, 443093, 444425, 445012, 444777, 443779, 442535, 441749, 441211, 439620, 436156, 431801, 428395, 426739, 426357, 426755, 427888, 429361, 430165, 429809, 429169, 429613, 431424, 433514, 434591, 434262, 432969, 431310, 429717, 428564, 428297, 429298, 431627, 434696, 437187, 437704, 435949, 433067, 430462, 428509, 426857, 425575, 425078, 425121, 425069, 425386, 427542, 431745, 435867, 437575, 436809, 435249, 434136, 433715, 434109, 435317, 436493, 436492, 435179, 433369, 431754, 430751, 430919, 432235, 433249, 432413, 430233, 428660, 428386, 428378, 428246, 429164, 431705, 434532, 436383, 437857, 439903, 441797, 442266, 441781, 442007, 443281, 444237, 443972, 443193, 442962, 443406, 444079, 444810, 445698, 446781, 448061, 449669, 451737, 454130, 456237, 457071, 456093, 454212, 453352, 454445, 456378, 457670, 458625, 460688, 463960, 466837, 468411, 469826, 472440, 475759, 478287, 479666, 480625, 481239, 480856, 479938, 480358, 482922, 485823, 486912, 486791, 488106, 491825]
52894D91825M012J842m05j193j400k162l067l260k930k719k688k709k987l337
52880D68822k847j307r6m44j520j620p72n46j442k154j757j170j582k532k588
52865D46445j421k79m48j837l217l512k699j566q15o05q42j459k215k633k398
52850D20499j590k92J498L275M017L311K097J573J742J644P35o00j641j798q15
52835D33655Q06J915J859J194O45K9q90j243j97J199J032n64j232K52K134K090
52819D42684K49j346j559j167j373k249k773j948N4J816K090J349J364K896M570
52804D44657M500K483K4j361j263k09R13J377J138Q07Q10Q01J99r58k157l103
52788D48658l849m357m446m217m073m208m271l629j962K69J832J503q30l784n515
$$ y = [491825, 495837, 497679, 497274, 496081, 494681, 492519, 489452, 486192, 483262, 480543, 477855, 475146, 472159, 468822, 465975, 464668, 464572, 464128, 462608, 460988, 460216, 459670, 458228, 456074, 454317, 453147, 451565, 449033, 446445, 445024, 444745, 444297, 442460, 439243, 435731, 433032, 431466, 430651, 430046, 429204, 427745, 425530, 422897, 420499, 418909, 418617, 420115, 423390, 427407, 430718, 432815, 434388, 436130, 437774, 438509, 437909, 436268, 434470, 433655, 434461, 436376, 438235, 439429, 440074, 440103, 439213, 437970, 437773, 438972, 440004, 439440, 438208, 438460, 440594, 442684, 442933, 441587, 440028, 438861, 437488, 435239, 432466, 430518, 430572, 432388, 434478, 435827, 437191, 440087, 444657, 449157, 451640, 451664, 450303, 449040, 448831, 449744, 451121, 452259, 453066, 453876, 454677, 454876, 453918, 451761, 448658, 444809, 440452, 436006, 431789, 427716, 423508, 419237, 415608, 413646, 413915, 415747, 417250, 416420, 412636, 407121]
52773D07121n191l484j673n03N5K06k0l41P5J870M297N516M451J894o54k614m186
52756D06819n122m809l432j980r53L2J137J728J375N94J34J49N31J337K362K863
52740D02765K377J352N15J00J03O05J186P85r39k639k743j566p93j079j424j025
52724C97580l74j52j07K32O02N90M63O13O84J44n71m87N20J535J889J820J693
52707D06674J350O16j46n01m91m17l21j48j14m44q26n32Q48K849M160L409N32
52690D16498k558l438j817P1K75m53m2J852L664M351M362M126L265J859R69J092
52674D34076J342J036R78K080L659M281L618K459J575J423K184L002K186n84l200
52659D60115l689k874k693k883j769K13O39j020k475k372k225l302m108k913p22
$$ y = [407121, 401930, 398446, 396773, 396270, 396325, 396531, 396511, 396170, 396245, 398115, 402412, 407928, 412379, 414273, 413619, 411005, 406819, 401697, 396888, 393456, 391476, 390523, 390555, 391692, 393420, 394795, 395389, 395523, 395672, 396203, 397540, 399902, 402765, 405142, 406494, 407009, 407109, 407212, 407817, 409003, 409788, 408849, 406210, 403467, 401901, 401108, 400029, 398605, 397580, 397206, 397054, 396947, 397179, 397781, 398371, 398834, 399447, 400131, 400275, 399704, 399217, 399737, 401272, 403161, 404981, 406674, 408024, 408640, 408494, 407993, 407502, 407085, 406764, 406616, 406502, 406058, 405232, 404700, 405548, 408397, 412557, 415966, 416498, 413940, 410502, 408685, 408756, 409031, 408578, 408536, 410388, 414052, 418403, 422765, 426891, 430156, 432015, 432984, 434076, 435418, 436454, 437432, 439512, 443171, 447452, 451070, 453529, 455104, 456527, 458711, 461713, 463899, 463315, 460115, 456426, 453552, 450859, 447976, 446207, 446420, 447059, 446039, 443564, 441192, 438967, 435665, 431557, 428644, 427922]
52644D27922N35J120K292L248K169j66q65P37J901O02j505j627L08K038K144J183
52628D42036J86l88k10J081L099M501M140K294M60j06L98O04m72k274l400l320
52612D48629k810k566k159r24O95J548J272O06J38l97j285k082k176j665j063
52597D35761m35O03K148L735M803M967M030K323R30R08K029K886K530J469P13
52582D69400L88j30j144k291l110l395l096k418j896j893k101j901j130k0J317
52567D46580K706L334K401N25l98O16K266K482R93m78m57O39J285P41l12p13%
52550D62210J288K140J837M92r71j462n67J166K770L549L329K414J522J433K113
52535D83263K460J448n54k173k654k261j193P94L235M579L867K007N27k75q89
$$ y = [427922, 428457, 429577, 431869, 435117, 437286, 437120, 436255, 436992, 438893, 439495, 437990, 436363, 436671, 438709, 440853, 442036, 442222, 441834, 441624, 442705, 445804, 450305, 454445, 456739, 457199, 457093, 457491, 458095, 457623, 455349, 451949, 448629, 445819, 443253, 441094, 440170, 440865, 442413, 443685, 444291, 444429, 444032, 442747, 440665, 438489, 436824, 435761, 435326, 435929, 438077, 441812, 446615, 451582, 455612, 457935, 458865, 459773, 461802, 464688, 467218, 468687, 469400, 469788, 469658, 468514, 466223, 463113, 459718, 456622, 454204, 452308, 450415, 448314, 446413, 445283, 445263, 446580, 449286, 452620, 455021, 455546, 455148, 455764, 458030, 460512, 461505, 461027, 460570, 461209, 462494, 463235, 462923, 462210, 462210, 463498, 465638, 467475, 467967, 466996, 465534, 464967, 466133, 468903, 472452, 475781, 478195, 479717, 481150, 483263, 485723, 487171, 486617, 484444, 481790, 479529, 478336, 479130, 482365, 486944, 490811, 492818, 493345, 493070, 492181]
52520D92181j030P6K033L234K786J424K80l39p65j344k350l819n087n209m055
52505D78016k485j228k43O43J177J105O09L9l49k45M31J004M82j137k661l025
52489D72133k196o54J120K295J920K29j075o43Q71J736J242J39o43q90q75q62
52473D73847q52n36L24J319J616J049M35M46P44P89Q36J387K132K330J888J339
52457D89093Q92L93P0M18J244J632J194P71J403K865L670K691O37l43J060L616
52441E11306M723L354J129M9Q1k96j714l217l771l466l068k916k620j591M0R90
52425D99013j45k922m825l863j048P42K25j132j348r1J768L496M570M361K818
52410E01619J107N98J290J971J876J506J656K328K921L075K877K437J815J389
$$ y = [492181, 491151, 491227, 493260, 496494, 499280, 500704, 500984, 500645, 499880, 498536, 496186, 492367, 487280, 482071, 478016, 475531, 474303, 474060, 474703, 475880, 476985, 477594, 477633, 477284, 477039, 477470, 478474, 478956, 477819, 475158, 472133, 469937, 469283, 470403, 472698, 474618, 474847, 473772, 473129, 474000, 475736, 476978, 477117, 476474, 475584, 474709, 473847, 472995, 472459, 472783, 474102, 475718, 476767, 477202, 477648, 478392, 479181, 480017, 481404, 483536, 485866, 487754, 489093, 489985, 490378, 490448, 490866, 492110, 493742, 494936, 495707, 497110, 499975, 503645, 506336, 506973, 506630, 507690, 511306, 516029, 519383, 520512, 520561, 520642, 520346, 518632, 515415, 511644, 508178, 505110, 502194, 499574, 497983, 498023, 499013, 498868, 495946, 491121, 487258, 486210, 486952, 487177, 486045, 484697, 484606, 486374, 489870, 494440, 498801, 501619, 502726, 503324, 504614, 506585, 508461, 509967, 511623, 513951, 516872, 519947, 522824, 525261, 527076, 528465]
52396E28465J742K785L346K181m65k877l675l221k919l444m157m141l239k025
52382E08356j123p60p81q38o93l20K10P54R61M06p77j597j060N72J808J413l03
52365E06228j896k294j719j118r11n71N58K186L223L009K165J973L068M834O039
52350E24774N944M954M242M658O048P758R570J1548J3096J3124J1546R737Q726
52337F35725P554M548r8m217o188o452o311o286o309o484o641n770l110L22K327
52322E92610J860L4j377j675j124M3J739L535M843N552N860N686M907M193M679
52307F31365O465Q186Q547P713O644N711M800M169M187M376L859K807K313K639
52293G03781K772K216K048L311N231O253O282O601P639Q251P571O553O901Q993
$$ y = [528465, 530207, 532992, 536338, 538519, 538054, 535177, 531502, 528281, 525362, 521918, 517761, 513620, 510381, 508356, 507233, 506473, 505692, 504854, 504161, 503841, 504051, 504805, 505766, 506172, 505395, 503798, 502738, 503310, 505118, 506531, 506228, 504332, 502038, 500319, 499201, 498290, 497719, 498277, 500463, 503686, 506695, 508860, 510833, 513901, 518735, 524774, 530718, 535672, 539914, 544572, 550620, 558378, 567948, 579496, 592592, 605716, 617262, 626999, 635725, 643279, 647827, 647729, 643512, 637324, 630872, 624561, 618275, 611966, 605482, 598841, 593071, 589961, 590283, 592610, 594470, 594504, 593127, 591452, 590328, 590371, 592110, 595645, 600488, 606040, 611900, 617586, 622493, 626686, 631365, 637830, 646016, 654563, 662276, 668920, 674631, 679431, 683600, 687787, 692163, 696022, 698829, 701142, 703781, 706553, 708769, 710817, 714128, 719359, 725612, 731894, 738495, 746134, 754385, 761956, 768509, 775410, 784403]
$$ [...]
##END NTUPLES=NMR SPECTRUM
##END=
