
##TITLE=AC1007_S-149_6114592_zZLpfeKMET
##JCAMPDX= 6.0         $$ Bruker NMR JCAMP-DX V2.0
##DATA TYPE= NMR SPECTRUM
##DATA CLASS= NTUPLES
##ORIGIN= BRUKER
##OWNER= Administrator
$$ 1.72 TOPSPIN		Version 2.1
$$ 2012-05-14 17:59:19.656 -0500  Administrator@TOPSPIN
$$ Compression mode = diff/dup
##.OBSERVE FREQUENCY= 400.13188235
##.OBSERVE NUCLEUS= ^1H
##.ACQUISITION MODE= SIMULTANEOUS (DQD)
##.ACQUISITION SCHEME= undefined
##.AVERAGES= 8
##.DIGITISER RES= 22
##SPECTROMETER/DATA SYSTEM= spect
##.PULSE SEQUENCE= zg30
##.SOLVENT NAME= COFFEE_meoh
##.SHIFT REFERENCE= INTERNAL, COFFEE_meoh, 1, 14.98061
##AUDIT TRAIL= $$ (NUMBER, WHEN, WHO, WHERE, PROCESS, VERSION, WHAT)
$$ ##TITLE= Audit trail, TOPSPIN		Version 2.1
$$ ##JCAMPDX= 5.01
$$ ##ORIGIN= Bruker BioSpin GmbH
$$ ##OWNER= Administrator
$$ $$ C:\Bruker\TOPSPIN/data/COFFEE/nmr/AC1007_S-149_6114592_zZLpfeKMET/10/pdata/1/auditp.txt
$$ ##AUDIT TRAIL=  $$ (NUMBER, WHEN, WHO, WHERE, PROCESS, VERSION, WHAT)
(   1,<2012-05-14 17:59:12.156 -0500>,<Administrator>,<TOPSPIN>,<go>,<TOPSPIN 2.1>,
      <created by zg
	started at 2012-05-14 17:58:05.671 -0500,
	POWCHK enabled, PULCHK disabled,
       configuration hash MD5:
       AF F2 23 6B 01 CD 40 DD E5 A1 38 A0 06 EA F7 77
       data hash MD5: 64K
       90 9D A4 E7 C7 03 FA 06 8F 03 CC 1A C1 8A 3E 71>)
(   2,<2012-05-14 17:59:15.296 -0500>,<Administrator>,<TOPSPIN>,<proc1d>,<TOPSPIN 2.1>,
      <Start of raw data processing
       efp LB = 0 FT_mod = 6 PKNL = 1 PHC0 = 0 PHC1 = 0 SI = 32K 
       data hash MD5: 32K
       C6 76 8E C9 38 73 BE 5F 42 60 09 D2 6F 4D 82 C3>)
(   3,<2012-05-14 17:59:15.640 -0500>,<Administrator>,<TOPSPIN>,<proc1d>,<TOPSPIN 2.1>,
      <pk PHC0 = 211.3934 PHC1 = 0 
       data hash MD5: 32K
       D7 43 C8 86 2C BA 65 FA 93 9D 0F 65 37 9B 3F 36>)
(   4,<2012-05-14 17:59:15.703 -0500>,<Administrator>,<TOPSPIN>,<proc1d>,<TOPSPIN 2.1>,
      <abs ABSG = 1 
       data hash MD5: 32K
       74 37 37 1D AD BD DF EE AA B1 E1 CF E1 B8 B2 81>)
(   5,<2012-05-14 17:59:15.734 -0500>,<Administrator>,<TOPSPIN>,<proc1d>,<TOPSPIN 2.1>,
      <abs ABSG = 2 
       data hash MD5: 32K
       C0 90 9F 92 C1 C1 5D 6F 84 A0 94 BC CF D9 E2 A8>)
(   6,<2012-05-14 17:59:15.765 -0500>,<Administrator>,<TOPSPIN>,<proc1d>,<TOPSPIN 2.1>,
      <abs ABSG = 3 
       data hash MD5: 32K
       58 B6 29 BC E5 EC B2 C2 36 7D 60 C1 DB 12 17 9B>)
(   7,<2012-05-14 17:59:15.796 -0500>,<Administrator>,<TOPSPIN>,<proc1d>,<TOPSPIN 2.1>,
      <abs ABSG = 4 
       data hash MD5: 32K
       C6 31 7D 24 5E 05 49 F6 EA B8 DA 6F 3F E9 E4 38>)
(   8,<2012-05-14 17:59:15.812 -0500>,<Administrator>,<TOPSPIN>,<proc1d>,<TOPSPIN 2.1>,
      <abs ABSG = 5 
       data hash MD5: 32K
       2A 7A 75 68 26 79 AD D0 8B 03 FA 36 D6 0B BC 3B>)
$$ ##END=
$$ 
$$ $$ hash MD5
$$ $$ 40 D3 50 A1 56 52 7A B2 C2 E4 75 10 FA 28 0A 31
##$RELAX= 
##$RELAX= 
##$RELAX= 
##$RELAX= 
##$RELAX= 
##$RELAX= 
##$RELAX= 
$$ Bruker specific parameters
$$ --------------------------
$$ [...]
##$TP= (0..7)
150 150 150 150 150 150 150 150
##$TP07= 0
##$TPNAME0= <>
##$TPNAME1= <>
##$TPNAME2= <>
##$TPNAME3= <>
##$TPNAME4= <>
##$TPNAME5= <>
##$TPNAME6= <>
##$TPNAME7= <>
##$TPOAL= (0..7)
0.5 0.5 0.5 0.5 0.5 0.5 0.5 0.5
##$TPOFFS= (0..7)
0 0 0 0 0 0 0 0
##$TUNHIN= 0
##$TUNHOUT= 0
##$TUNXOUT= 0
##$USERA1= <user>
##$USERA2= <user>
##$USERA3= <user>
##$USERA4= <user>
##$USERA5= <user>
##$V9= 5
##$VALIST= <valist>
##$VCLIST= <CCCCCCCCCCCCCCC>
##$VD= 0
##$VDLIST= <DDDDDDDDDDDDDDD>
##$VPLIST= <PPPPPPPPPPPPPPP>
##$VTLIST= <TTTTTTTTTTTTTTT>
##$WBST= 2048
##$WBSW= 25
##$XGAIN= (0..3)
0 0 0 0
##$XL= 0
##$YL= 0
##$YMAX_a= 485773
##$YMIN_a= -580154
##$ZGOPTNS= <>
##$ZL1= 120
##$ZL2= 120
##$ZL3= 120
##$ZL4= 120
##$ABSF1= 14.98061
##$ABSF2= -5.57192
##$ABSG= 5
##$ABSL= 3
##$ALPHA= 0
##$AQORDER= 0
##$ASSFAC= 0
##$ASSFACI= 0
##$ASSFACX= 0
##$ASSWID= 0
##$AUNMP= <proc_prof1d_extract_pilot.lims>
##$AXLEFT= 0
##$AXNAME= <>
##$AXNUC= <1H>
##$AXRIGHT= 0
##$AXTYPE= 0
##$AXUNIT= <>
##$AZFE= 0.1
##$AZFW= 0.1
##$BCFW= 0
##$BC_mod= 0
##$BYTORDP= 0
##$COROFFS= 0
##$CY= 15
##$DATMOD= 1
##$DC= 0
##$DFILT= <>
##$DTYPP= 0
##$F1P= 0
##$F2P= 0
##$FCOR= 0.5
##$FTSIZE= 32768
##$FT_mod= 6
##$GAMMA= 0
##$GB= 0
##$INTBC= 1
##$INTSCL= 1
##$ISEN= 128
##$LB= 0
##$LEV0= 0
##$LPBIN= 0
##$MAXI= 10000
##$MC2= 0
##$MEAN= 0
##$ME_mod= 0
##$MI= 0
##$NCOEF= 0
##$NC_proc= -8
##$NLEV= 6
##$NOISF1= 0
##$NOISF2= 0
##$NSP= 0
##$NTH_PI= 0
##$NZP= 0
##$OFFSET= 14.98061
##$PC= 1
##$PHC0= 211.3934
##$PHC1= 0
##$PH_mod= 1
##$PKNL= yes
##$PPARMOD= 0
##$PPDIAG= 0
##$PPIPTYP= 0
##$PPMPNUM= 2147483647
##$PPRESOL= 1
##$PSCAL= 4
##$PSIGN= 0
##$PYNMP= <proc.py>
##$REVERSE= no
##$SF= 400.13
##$SI= 32768
##$SIGF1= 0
##$SIGF2= 0
##$SINO= 400
##$SIOLD= 32768
##$SPECTYP= <>
##$SREGLST= <1H.CDCl3>
##$SSB= 0
##$STSI= 32768
##$STSR= 0
##$SW_p= 8223.68421052632
##$SYMM= 0
##$S_DEV= 0
##$TDeff= 65536
##$TDoff= 0
##$TI= <>
##$TILT= no
##$TM1= 0
##$TM2= 0
##$TOPLEV= 0
##$USERP1= <user>
##$USERP2= <user>
##$USERP3= <user>
##$USERP4= <user>
##$USERP5= <user>
##$WDW= 1
##$XDIM= 32768
##$YMAX_p= 438027760
##$YMIN_p= -657859
##$CURPLOT= <Network HP LaserJet P1505>
##$CURPRIN= <$Network HP LaserJet P1505>
##$DFORMAT= <normdp>
##$LAYOUT= <+/1D_H.xwp>
##$LFORMAT= <normlp>
##$PFORMAT= <normpl>
##$SURQMSG= 1
$$ End of Bruker specific parameters
$$ ---------------------------------
##NTUPLES= NMR SPECTRUM
##VAR_NAME=  FREQUENCY,     SPECTRUM/REAL,   SPECTRUM/IMAG
##SYMBOL=    X,             R,               I
##VAR_TYPE=  INDEPENDENT,   DEPENDENT,       DEPENDENT
##VAR_FORM=  AFFN,          ASDF,            ASDF
##VAR_DIM=   32768,         32768,           32768
##UNITS=     HZ,            ARBITRARY UNITS, ARBITRARY UNITS
##FACTOR=    0.250966925370066, 1,           1
##FIRST=     8223.43324360095, -94619,       -46115
##LAST=      0,             -41465,          52000
##MIN=       0,             -657859,         0
##MAX=       8223.43324360095, 438027760,    0
$$ Real data points
##PAGE= N=1
##DATA TABLE= (X++(R..R)), XYDATA
$$ [...]
19571b61719D25084a34622B22919a98946B4121a77854g326k00469a7752l2153
19561d9905B47628g7428m235B3209c45016i8773A25934h7365j40229R9300F2483
19549A75345b05511C4831K00152d9969k67752L0822h082j36630l6854L6121j38069
19538b83514B82301a70266h3206B25218k7822C9116b6326k48135J00776L9217
19528a34468J4719b4004l5717F1789f749q2895k28130B4252a8818c217l5128A42614
19515A1902b75488R0249j04192A6000a78750J9556C8056a88941N7473B22033a56918
19503d2910j08246j71378N5042J822H5183a79340n8951L5863a1464l41849A03148
19491e6260j85853B9077a65183H392J55291C2989c6373A97307A6371D528K3216
$$ y = [-261719, 425084, -134622, 222919, -198946, 24121, -177854, -7326, -207795, -17752, -49905, 247628, -77428, -81663, 23209, -345016, -98773, 125934, -87365, -227594, -128294, 62483, 175345, -205511, 34831, 234983, -49969, -317721, -286899, -8082, -144712, -181566, -145445, -283514, 282301, -170266, -83206, 225218, 197396, 39116, -26326, -274461, -173685, -134468, -119749, -24004, -59721, 61789, -6749, -89644, -317774, 24252, -18818, -3217, -38345, 142614, 11902, -275488, -185239, -289431, 16000, -178750, -159194, 38056, -188941, -131468, 222033, -156918, -42910, -151156, -322534, -267492, -265670, 85183, -179340, -238291, -202428, -11464, -353313, 103148, -56260, -242113, 29077, -165183, 8392, 163683, 32989, -36373, 197307, 16371, 4528, 27744]
19480B7744b5223C04169a0978j04405j22625P3520B3197b72437A2785a09361j07637
19469b16998A86161a8749k18153M9345e2976j80818O6782k014A70992j3044a73447
19457A0630K16728A04662h7396j28139a1207j05815K4633j12418k6870j46123
19447c77800J77411m8237D8435b22499j81082B76337b77779h8491j08664a8591
19436b75571J17806k293A0690b1687l00741M6523a10819j56940a02490D9868O5621
19425A15489f1814k57503H1169a00622M8294B04838f5433D17069a39950C72354
19414A7596J47852B5163c47189a52236R963C178g6782q2472H2944b54467h6683
19402a70907r7151h0390A84283a42200F4246J27463H6175a75193E295a00834P422
$$ y = [27744, -25223, 304169, -10978, -115383, -238008, -164488, 23197, -272437, 12785, -109361, -216998, 186161, -18749, -236902, -187557, -52976, -233794, -167012, -169026, 170992, 157948, -173447, 10630, 227358, 104662, -87396, -215535, -11207, -117022, -92389, -204807, -231677, -377800, -200389, -248626, 48435, -222499, -403581, 276337, -277779, -88491, -197155, -18591, -275571, -157765, -160058, 10690, -21687, -322428, -275905, -110819, -267759, -102490, 49868, 115489, -61814, -319317, 81169, -100622, -52328, 204838, -65433, 417069, -139950, 372354, 17596, 165448, 25163, -347189, -152236, -142273, 3178, -76782, -159254, 82944, -254467, -86683, -170907, -268058, -80390, 184283, -142200, 64246, 191709, 86175, -175193, 5295, -100834, -93412]
19391i3412l0460B27566h6669k4958D34852A39190C0592J91148e0204A65015b4329
19379b27637O7491M0386j8622A50188e71970a51462N5818k9445e7137B34620c84941
19367A13357e1975j38e953j2054k30535k4620A9352a11490E468a10650C34342
19355a6777j04482b6080r6768m1649P658n9831f3926E9998P8707b4664l5785r1694
19343a52143C04895d4979j84569A17142e5088J3626m1241j90695G8235J28711
19333B06946b02254Q0246B6419b06462e4805k5964k29996A09755b30898i7932
19322b68039J08178o9182p3169d0226J7842e35E8006C504b05548G8019m990j1685
19310F1344L75730A15470a97264j2748j5811k17362B0697a43706j48359h8366
$$ y = [-93412, -123872, 227566, -86669, -111627, 434852, 139190, 30592, 221740, -50204, 165015, -24329, -227637, -160146, -119760, -138382, 150188, -571970, -151462, -95644, -125089, -57137, 234620, -384941, 113357, -51975, -52113, -5953, -18007, -248542, -273162, 19352, -111490, 5468, -110650, 334342, -16777, -121259, -26080, -122848, -164497, -156839, -216670, -63926, 59998, 138705, -24664, -60449, -152143, 304895, -44979, -229548, 117142, -55088, -41462, -82703, -273398, 78235, 206946, -202254, -122008, 26419, -206462, -54805, -80769, -310765, 109755, -230898, -97932, -268039, -159861, -229043, -302212, -40226, -22384, -535, 58006, 3504, -205548, 78019, 73029, 61344, 437074, 115470, -197264, -210012, -225823, -443185, 20697, -143706, -292065, -88366]
19299B61044i590j68624e3603J948o1470A93231n8995a541A67435G6783b32400
19287h9859L4264A0813M0380f5173P772b3857B03525f6208j78543j77672A63749
19275H0019h6829I6139a05009A94760q4564a39028j39831B446K25411a43324j19613
19264b62937D0672c8763k8518D6878c16366a17837l0075A98231P323b3122A5642
19252F7654b368k20667B98549a48614n3481j52852j99512e362p2202C8874J18466
19241A57340f8764H4135a05960C45441A17000h1840D0706b00638F8410N0368l6804
19230H1974M2171a84336P0826A41385d7373l65037J18824A2999g2024A04797J25321
19219B30118j09515d2219D6481i1545A38816b1049k35801f1554k66800R945C58935
$$ y = [261044, -9590, -178214, -53603, -51655, -113125, 193231, 134236, -1541, 167435, 76783, -232400, -89859, -55595, 10813, 51193, -65173, -57401, -23857, 203525, -66208, -244751, -422423, 163749, 80019, -86829, 96139, -105009, 194760, 110196, -139028, -278859, 2446, 227857, -143324, -262937, 40672, -38763, -67281, 46878, -316366, -117837, -147912, 198231, 205554, -23122, 15642, 67654, -2368, -223035, 298549, -148614, -202095, -354947, -554459, -5362, -77564, 38874, 157340, -68764, 84135, -105960, 345441, 117000, -81840, 40706, -200638, 68410, 118778, 81974, 124145, -184336, -113510, 141385, -47373, -412410, -293586, 12999, -72024, 104797, 230118, 120603, -42219, 46481, -91545, 138816, -21049, -256850, -61554, -328354, -318409, 358935]
19207d1875D9346a65443K1883B25612h1006B5556a12222j792l0041j5992q0468
19196b40515O7572d5134q3965d9890A56262n2213b75503A22495b43002b5235B9371
19184b93521C2357J80626D9515B1724e6735k47546B41692h4006A07078b58744
19173F8407a65945j32314a07373J3849n0481H9831b02552h4801j42924j19371
19163c47096e4243j72717C5651J49039A6710g9149L1996b2588P83j25191A04537
19151f3828n0440h310A17706m0680k0197i5067G1840i0284g302C43842h2094J6860
19139f5234l3219j27543A39258c3626m330j31878E1744c35539b7619b284l48547
19128c50831A76405a84394j8401B56922a11995B7188b31586A02030a32539k06714
$$ y = [-41875, 49346, -165443, -143560, 225612, -81006, 25556, -112222, -114014, -144055, -160047, -240515, -172943, -45134, -129099, -49890, 156262, 104049, -275503, 122495, -243002, -25235, 29371, -293521, 32357, 212983, 49515, 21724, -56735, -304281, 241692, -84006, 107078, -258744, 68407, -165945, -298259, -107373, -93524, -144005, 89831, -202552, -84801, -227725, -347096, -54243, -226960, 35651, 184690, 16710, -79149, -47153, -22588, -21805, -146996, 104537, -63828, -114268, -8310, 117706, 77026, 56829, -95067, 71840, -90284, -7302, 343842, -82094, -65234, -98453, -225996, 139258, -33626, -37956, -169834, 51744, -335539, -27619, -2284, -350831, 176405, -184394, -202795, 256922, -111995, 27188, -231586, 102030, -132539, -339253]
19118c39253A37656c3784k5505A16619c11280L1119h2600d1187r2163F3799Q7490
19107A51289b48085b4086A40298n9926a77432B5234J2167O1735j8574A7681c6529
19095b58369H4116L2666a05971N1455l4522k8257k23024A55786o4086b75671h9905
19083h6717D657h5923A83767a66081k03816A19057h2493b7899j33003A58202b70866
19071e5220j02600B78682g479j11086K4372j87573A8257J90904b17205h7435A5388
19059A16210J31142e7514a7565j80320D9105O3462D4752d1591j02247I9929R1698
19048A91627O4476a49339K7515k26617a56806P4451p449o407A07364l3393a77868
19036a92703B7925J15086n8956a52431M5630c5966l52095N0692A81657b87143
$$ y = [-339253, 137656, -33784, -59289, 116619, -311280, -280161, -82600, -41187, -133350, 63799, 151289, -248085, -24086, 140298, 80372, -177432, 25234, 37401, 99136, 80562, 17681, -36529, -258369, 84116, 116782, -105971, -54516, -89038, -117295, -340319, 155786, 91700, -275671, -89905, -86717, 4657, -85923, 183767, -166081, -369897, 119057, -82493, -27899, -160902, 158202, -270866, -55220, -157820, 278682, -7479, -118565, -94193, -281766, 18257, 209161, -217205, -87435, 15388, 116210, 247352, -57514, -17565, -197885, 49105, 112567, 44752, -41591, -143838, 99929, 191627, 256103, -149339, -121824, -348441, -156806, -82355, -89804, -96211, 107364, 73971, -177868, -192703, 27925, 143011, 84055, -152431, -106801, -35966, -388061, -337369, 181657, -287143]
19025A96256c5242j73721A64069N5321a05790a9879l1722B4406J03490J00860
19015B28756J4410H4109c5251k11293e4414A58935I446J69178q4716P5258F9035
19003A88123i5554J8200L4262E0202J9671d7648M130I2272J90137a08716l04664
18992d13380a79289B0597a34957l4621l951e6194O415j05754N7918m3851k92653
18981d34119a38863c7124k03603D7824p181P4009l5714C8613K852J28567b56609
18969A06902a07182p3774H163b07445h6219A68197A4863N7947i6026r0286F5864
18957b6057B34553f1628b9752A29679f6328P913B80040b49206C0733K4465j6079
18946C9119J31924a91251G334L8160a32669O4920m4114K1105C26726j35498o7550
$$ y = [196256, -35242, -208963, 164069, 219390, -105790, -19879, -51601, 24406, 127896, 228756, 243166, 84109, -35251, -246544, -54414, 158935, 9446, 178624, 93908, 169166, 69035, 188123, -95554, -77354, -43092, 50202, 69873, -47648, -43518, 92272, 282409, -108716, -413380, -179289, 20597, -134957, -169578, -173529, -56194, -49779, -155533, -97615, -141466, -434119, -138863, -37124, -240727, 47824, 40643, 114652, 78938, 38613, 41465, 170032, -256609, 106902, -107182, -180956, 8163, -207445, -86219, 168197, 14863, 72810, -96026, -186312, 65864, -26057, 234553, -61628, -29752, 129679, -66328, -58415, 280040, -249206, 30733, 55198, 39119, 171043, -191251, 7334, 45494, -132669, -67749, -111863, -90758, 326726, 191228, 123678]
18935A23678J57925b34351C6358O1825j5912a28119q525f5293k51138c7505j14690
18924a52195e3543k5780l8500j0556A18191a51436R053O5031A17921a6170G4834
18912A60518c02584a5758l65787H5139p652J95803A08911J62843j29013i3540
18901c5012A81379c9555A91042a01155A79227E7800L9934a7108r8766j5956o8121
18890a99951c1671j60489A47032b83276J18312B1608d1632E6086b37106M4558
18880a92548B32943D0167a03648d277j63162q5856a5910n380j49643n1583H6124
18868F4792M8723i0599a2570q2809j22367g0039j45972f4238N075B34461a9242
18856a29161A02066g9618B9274G988c8580o0456A22356E9788J34597a30537d7891
$$ y = [123678, 281603, -234351, 36358, 98183, 82271, -128119, -136644, -65293, -316431, -37505, -152195, -53543, -79323, -117823, -128379, 118191, -151436, -142383, -77352, 117921, -16170, 74834, 160518, -302584, -15758, -381545, 85139, 77487, 273290, 108911, 271754, 142741, -93540, -35012, 181379, -39555, 191042, -101155, 179227, 57800, 97734, -17108, -115874, -131830, -199951, -31671, -192160, 147032, -283276, -164964, 21608, -41632, 56086, -237106, -192548, 232943, 40167, -103648, -4277, -167439, -253295, -15910, -21290, -170933, -222516, 86124, 64792, 113515, -90599, -12570, -95379, -217746, -70039, -216011, -64238, -59163, 234461, -19242, -129161, 102066, -79618, 29274, 7988, -38580, -99036, 122356, 59788, 194385, -130537, -47891]
18844g9380K8443j24149A9235p585e0316k49396H0392b84418I8963e2708A48593
18832C33906G6792J0933A677b29677j91738i8373A40642h4846A8930a33872k24922
18821c58794I21i6502L7616j64971K9316O2471O1999q2861d1555k4694B4299d8918
18808f1566p333k5374I4700a06617p951B22778c0275H9144J82466K62285j64630
18797C69265g6660A76055C2104M4427L10404D1766b85792K492i8629l8252M6938
18786h9943j37612b012k45903L2279A24639d9284K1243m7450A16360L9353i6862
18774a4598k36236B67396f57859A547J18210B2727J23809d01592J97766E1443
18763F1205h6711j54584L9941B06114e1384B94754I1820a97669M2892B37742R7569
$$ y = [-79380, -50937, -175086, 19235, 11650, -50316, -299712, 80392, -284418, 98963, -52708, 148593, 333906, 76792, 87725, 1677, -229677, -421415, -98373, 140642, -84846, 18930, -133872, -358794, 921, -96502, -58886, -223857, -194541, -132070, -70071, -152932, -41555, -66249, 24299, -48918, -61566, -68899, -94273, 94700, -106617, -114568, 222778, -30275, 89144, 271610, 533895, 369265, -76660, 176055, 32104, 76531, 386935, 41766, -285792, -283300, -98629, -136881, -89943, -227555, -2012, -247915, -215636, 124639, -49284, -28041, -75491, 116360, 155713, -96862, -14598, -250834, 267396, -657859, 1547, 119757, 22727, 146536, -401592, -203826, 51443, 61205, -86711, -241295, -201354, 206114, -51384, 294754, 91820, -197669, -154777, 237742, 335311]
18752C35311H3166J05450b23875G1194c41610d2268m5867E1429a02544l23450
18742d25994a88509j85475G8636D966b3981j55806H2854C9152a52234C8119a31288
18730a26279N155I3449K21374H1826P139K3541b08197B8597a25989k14385i7529
18718a65833k16235a1769r3695A55328d81190d5494k39117P9725A00667b12262
18707a40366E6769a52889n7718L9106D5575g579l44082f3373L0996n8508r84K6649
18695f5220A94276a84876q0014L057D6166a26308H3522K981d0828C1564c55221
18683b1143l84581J33530E745O444b44233D6912c9382m4404K0364o2160K4064
18672a01518k17987H9901L4194C1198b38478h4082B52458p8634a65797p7446a06012
$$ y = [335311, 83166, 188616, -223875, 71194, -341610, -42268, -88135, 51429, -102544, -425994, -188509, -373984, 78636, 4966, -23981, -179787, 82854, 39152, -152234, 38119, -131288, -126279, -121124, 93449, 314823, 81826, 88965, 112506, -208197, 28597, -125989, -340374, -97529, -165833, -382068, -11769, -105464, 155328, -481190, -45494, -284611, -204886, 100667, -212262, -140366, 56769, -152889, -210607, -171501, 45575, -7579, -351661, -63373, -32377, -90885, -91869, -65220, 194276, -184876, -264890, -261833, 46166, -126308, 83522, 86503, -40828, 31564, -355221, -21143, -405724, -272194, 5745, 12189, -244233, 46912, -39382, -83786, -63422, -125582, -101518, -319505, 89901, 124095, 31198, -238478, -84082, 252458, 173824, -165797, -243243, -106012]
18660b92605h9064F6904b6883B87746j27721b22973B38372b39326A0970b93693
18649f3491k8792k26460G3790a80404Q2863M6200q938j19620c4559k09130G698
18637I3043a77186F3344f0851j54270A41515d6968G8300A1388a27225A92228n7509
18626A34719b93339F0930J11930a71651a5044n9936j67726J05328j03783d5768
18615e5135o3334C236L8677a54279A70085b25003r4473a00886B2888b4729j8267
18604d2996k32110a2307A27267m2494l5906i427F8943J4936a26577k04782J8691
18593c12668f2936A65506f6855j58619J04099A5062a83003a9995j00303k55182
18583c75480h9748r2370H497N8464b72205g530k72751J17784G6279b42780e7133
$$ y = [-292605, -89064, 66904, -26883, 287746, 160025, -222973, 238372, -239326, 10970, -293693, -63491, -92283, -318743, 73790, -180404, -97541, -51341, -60279, -179899, -34559, -243689, 7698, 93043, -177186, 63344, -60851, -215121, 141515, -46968, 78300, 11388, -127225, 192228, 134719, -293339, 60930, 172860, -171651, -15044, -74980, -242706, -137378, -241161, -45768, -55135, -118469, 3236, 41913, -154279, 170085, -225003, -319476, -100886, 22888, -24729, -42996, -275106, -12307, 127267, 84773, 48867, -9427, 68943, 83879, -126577, -331359, -312668, -62936, 165506, -66855, -225474, -121375, 15062, -183003, -19995, -120298, -375480, -89748, -182118, 8497, 66961, -272205, -7530, -280281, -162497, 76279, -242780, -57133]
18571h817j39877k45859C40225G4509a63899B6900a63798N3222A53950f5423A65839
18559a98984A25113e4202b6447k6585G8059K9217L1426b70292r2620a31440B82820
18547c34712l1928f7755c1764A70557D7891J53884a82395d1579j90261a12170
18536c01153a34790d2054q4738C30309F7450a44265F3605a21143q9119A07320
18525f1959o1205M2350n0725b797k73985G0213b03183B4251b88112A28161c47569
18513a88176a1200B11707B4989l914i0281j4788j05548n1531F037M7491b03052
18501a7108D0449e3635m9722b92j17824m5992m0716E8314h8473B0218c13599B38625
18488H4322D1153P3066e17875h1876D2038K11548a48691A08057L5319o8508J16957
$$ y = [-8817, -148694, -394553, 340225, 74509, -163899, 26900, -163798, -110576, 153950, -65423, 165839, -198984, 125113, -54202, -26447, -53032, 78059, 107276, 138702, -270292, -362912, -131440, 282820, -334712, -366640, -67755, -31764, 170557, 47891, 201775, -182395, -41579, -231840, -112170, -301153, -134790, -42054, -126792, 330309, 67450, -144265, 63605, -121143, -210262, 107320, -61959, -123164, -80814, -131539, -2797, -276782, 70213, -203183, 24251, -288112, 128161, -347569, -188176, -11200, 211707, 24989, 21075, -90281, -105069, -210617, -262148, 6037, 53528, -203052, -17108, 40449, -53635, -103357, -292, -118116, -164108, -204824, 58314, -88473, 20218, -313599, 238625, 84322, 41153, 114219, -517875, -81876, 42038, 253586, -148691, 108057, 143376, 74868, 191825]
18477A91825H8966Q1049c42837J58638j4742E3322k1369a9930k13243j45226A1654
18465B17281a30074a1101k38967E2728i3267b9180A85678a06973j061B53110a63904
18453a2164k65177H5941b98382A6281h7007B83165A21309a06087k9279F9783l1966
18442C7817c32324F8763a32998q326I0676e09384d5206r4894B26599b15695d8037
18430b69342A3888f9722n4987A23305j3450m615a04307H9038c5533a5928B68151
18418c43367D90256f6466A43475d4590l35511h0395q8560a0838A13721b81143
18407a52725C3670e9430K5032j54035p9217A26312b28529f9938A96843c09462
18396a73690p699O3694B82659G4184h2237B39183e9641B98135g1798b8365j39610
$$ y = [191825, 88966, 170015, -342837, -184199, -198941, 53322, 31953, -19930, -233173, -378399, 11654, 217281, -130074, -11101, -250068, 52728, -93267, -29180, 185678, -106973, -108034, 253110, -163904, -12164, -277341, 85941, -298382, 16281, -87007, 283165, 121309, -106087, -135366, 69783, 37817, -332324, 68763, -132998, -141324, 90676, -509384, -45206, -140100, 226599, -215695, -48037, -269342, 13888, -69722, -124709, 123305, 109855, 105240, -104307, 89038, -35533, -15928, 268151, -343367, 490256, -66466, 143475, -44590, -380101, -80395, -168955, -10838, 113721, -281143, -152725, 33670, -59430, -34398, -188433, -267650, 126312, -228529, -69938, 196843, -309462, -173690, -181389, -117695, 282659, 74184, -82237, 239183, -59641, 298135, -71798, -28365, -167975]
18385a67975F365b13654M3655A82869a90028A10270g0027A32160i3263A09691
18374a22719K3253A94606c60810A4504c3899k05534M4422H2819j2399e2927b4822
18362F0668J65772l285I2366a02654a9284j65912k4474B94431A27674a02365L6528
18351f5837B35029D6229J0880g1741A7665J96963b4138o3735j98942M3411A32014
18339B4441c2977A88217e727j7459k13602L0446f1587A19829d06263a59691j4882
18328a74573k31519A95768d1573P111r8095E6576a86557B26905a47176r2793o3402
18317c03371N6878i9120K69B5779b5145F5910N4639a46299A52124b26837B4587
18305c15502i6655d7126J2059D467c70242f6241A77392G237a12842A13322K5745
$$ y = [-167975, 6365, -213654, -169999, 182869, -190028, 110270, -70027, 132160, -93263, 109691, -122719, -99466, 194606, -360810, 14504, -33899, -239433, -195011, 82819, 70420, -52927, -24822, 60668, 226440, 223155, 92366, -102654, -19284, -185196, -209670, 294431, 127674, -102365, -65837, 235029, 46229, 57109, -71741, 17665, 214628, -24138, -87873, -286815, -243404, 132014, 24441, -32977, 188217, -5727, -23186, -236788, -206342, -61587, 119829, -406263, -159691, -174573, -406092, 195768, -41573, -34462, -132557, 56576, -186557, 226905, -147176, -239969, -303371, -246493, -99120, -98851, 25779, -25145, 65910, 120549, -146299, 152124, -226837, 24587, -315502, -96655, -47126, -35067, 4467, -370242, -66241, 177392, 7237, -112842, 113322, 139067]
18294A39067O7858m9593k6831b22959a07558L4600B599a13375k74231J43641E8005
18282g0829n5519d7468G5500a19831H6817I669e1239p2791j48013E2164d7573
18270b71266h2177m4142K3565c8060A8002M9245i0035J0702A43324d73716A91045
18258a02445B17691a26721r253a8617j42994D1458b97682R4740A31879D2429b33298
18246c8138j35016b7782G4299e2162j98720d1898O276k65824g569h94k35560k3282
18234b59736J03458d6193B05106b45672j3222A67470J50106D8429b9596I4870
18223a90770b7171f480m681A56936D9414c792k75275Q6859M9145l768F66b92421
18210h2546B13782b46363d3129k60385g0467G8637a62801N2353K9130D625a33875
$$ y = [139067, 206925, 157332, 130501, -222959, -107558, -72958, 2599, -113375, -387606, -243965, 58005, -70829, -126348, -47468, 75500, -119831, 86817, 9669, -51239, -124030, -272043, 52164, -47573, -271266, -82177, -126319, -102754, -38060, 18002, 67247, -90035, -79333, 143324, -473716, 191045, -102445, 217691, -126721, -135974, -18617, -161611, 41458, -297682, -202942, 131879, 42429, -233298, -38138, -173154, -27782, 74299, -52162, -250882, -41898, -35622, -301446, -7569, -894, -236454, -259736, -156278, -46193, 205106, -245672, -258894, 167470, 317576, 48429, -29596, 94870, -190770, -27171, -6480, -11161, 156936, 49414, -3792, -279067, -192208, -143063, -146831, 666, -292421, -82546, 213782, -246363, -43129, -303514, -70467, 78637, -162801, -110448, -81318, 4625, -133875]
18198b04143H363a10801d6685J2618A47491a83324O4240A70945f0999B5152K91155
18187C16307e9647A82800b52940g668E7054K31587b03741K5290E7072J28254R1131
18176B76457D0628L1895a85064l87795I2163C9734b93823j0214J30034D7873b36496
18164a20894j67419B09235d4561A87947f0301A7606c60563A19388n1398L5458
18154A03448a79114A8749J7337c7827k05109B06633I7511b21474A60740A4215
18143a02830B57106D769N4230c1905j25194P1121E7679J12603O4814D1001f7094
18131A21412b61721i0455j51344J14435l34704R2602B09651i9913j32481c6017
18120b26502H766f7919G8646j2077j3379b84482a10888n7951D78617c82372A48616
$$ y = [-204143, 8363, -110801, -46685, -34067, 147491, -183324, -119084, 170945, -60999, 25152, 316307, -59647, 182800, -252940, -7668, 57054, 288641, -203741, -178451, 57072, 185326, 276457, 40628, 72523, -185064, -572859, 92163, 39734, -293823, -304037, -174003, 47873, -236496, -120894, -288313, 209235, -44561, 187947, -60301, 17606, -360563, 119388, 67990, 103448, -179114, 18749, 36086, -37827, -242936, 206633, 97511, -221474, 160740, 14215, -102830, 257106, 4769, 58999, -31905, -157099, -85978, 57679, 170282, 235096, 41001, -67094, 121412, -261721, -90455, -241799, -127364, -462068, -369466, 209651, -99913, -232394, -36017, -226502, 8766, -67919, 78646, 66569, 53190, -284482, -110888, -168839, 478617, -382372, 148616]
18108G1113J58762I485Q9236e990E0397a24537I2989a01543c7026k324B3291g63
18095h5196b2956D14720e8050j53599P8069l0069O4788m7601A28080P8687c18833
18083f8441R23a9975j31884e6302H5311b86843O8304F2648B021g1325A57809b32909
18070B17285A2106J77225Q26J54930C7279b58592C0395K10321n8893l857C826
18058a39717a3730j2079B18122q6917c36136l0438h0684o699a3922j7026P95n1023
18046h1176m2060A04973M0987c63825a35886H81d71753J89809A23425C7850J66530
18035B04380k2588I481L25155H1690b05968f5940q7065D0714A4891K39865a24945
18023b1062k08680H4559C8281a9099H8479a02645A11869a4127j22763F5074A8836
$$ y = [71113, 229875, 9485, 98721, -5990, 50397, -124537, 92989, -101543, -37026, -39350, 23291, -763, -85196, -22956, 414720, -58050, -211649, -133580, -163649, -98861, -146462, 128080, 206767, -318833, -68441, -67518, -19975, -151859, -56302, 85311, -286843, -218539, 62648, 2021, -71325, 157809, -232909, 217285, 12106, 189331, 190157, 345087, 37279, -258592, 30395, 240716, 181823, 177966, 3826, -139717, -13730, -25809, 218122, 131205, -336136, -366574, -80684, -87383, -13922, -30948, -30153, -81176, -123236, 104973, 145960, -363825, -135886, 881, -471753, -281944, 123425, 37850, 204380, 181792, 9481, 334636, 81690, -205968, -65940, -153005, 40714, 14891, 254756, -124945, -21062, -229742, 84559, 38281, -19099, 88479, -102645, 111869, -14127, -136890, 65074, 18836]
18011d1350j5225B37859B2614J89930l1077b21416O012a6723m8414G2084k1067
18000E1017b1410C01449i734l22336p5697J78222i9558q6444c4988C79014g2948
17988d0122A16746A3302a90291c4734k37395J18476A13029e8292k91743c4336
17977b30483c912j48773E4049g5977A40402F0781O4704a19486j16551e3987F2340
17965A05882a14655l4621F5390d9090A6484L08955E9534G492b30694j77376c8518
17953B2565b45070A3069E555J03942a19714d9989k6042A71541c79953c6701H0002
17941A35657b91554H794K0194c162k77025H8594a83286G7452B6508J03055C3493
17929g3D9335a74793A0138J8644L5360K088b17916E9435a76885q1277C9553a3782
$$ y = [-41350, -56575, 237859, 22614, 212544, 181467, -221416, -215404, -16723, -65137, 72084, 51017, -21410, 301449, -9734, -332070, -407767, -229545, -99558, -186002, -34988, 379014, -72948, -40122, 116746, 13302, -190291, -34734, -272129, -153653, 113029, -58292, -350035, -34336, -230483, -3912, -152685, 54049, -75977, 140402, 60781, 125485, -119486, -236037, -53987, 62340, 105882, -114655, -149276, 65390, -49090, 16484, 325439, 59534, 7492, -230694, -408070, -38518, 22565, -245070, 13069, 5555, 109497, -119714, -49989, -76031, 171541, -379953, -36701, 80002, 135657, -291554, 8794, 28988, -3162, -280187, 88594, -183286, 77452, 26508, 129563, 33493, -73, 49335, -174793, 10138, 28782, 64142, 66230, -217916, 59435, -176885, -258162, 39553, -13782]
17916C7522i5987j48385J21929A05557a51402B47154H7988A4272a3778A92483
17905A84819H9579c6223j61545A00865J49500h608m636B62231e925k05682k07079
17894d18686f2529A09357P5233e4607r6329B1268b1335o4819K4857e905o2618
17883f8523B67404a1407j61889r0271e5788C8972b31044A3600R4748b18078B3475
17871a39336c1558l1452r2696n7608o8615N9254F621c36569J43398G3186e5291
17859i8382D8769f2672f924l33667a27716B59967k2A1352J21773k3239Q5678b86203
17846h245D8084Q6493b26616g037B15859H7088K4943I974f5618m4396A90787E1131
17833c6892A1671J0051J69485B3096g5005b2582B0623L0252J75895d403j72699
$$ y = [37522, -95987, -244372, -122443, 105557, -151402, 247154, 87988, 14272, -13778, 192483, 184819, 89579, -36223, -197768, 100865, 250365, -8608, -13244, 262231, -5925, -211607, -418686, -62529, 109357, 184590, -54607, -150936, 21268, -21335, -86154, -61297, -5905, -68523, 267404, -11407, -173296, -263567, -55788, 38972, -231044, 13600, 108348, -218078, 23475, -139336, -31558, -63010, -155706, -213314, -281929, -222675, 6621, -336569, -193171, 73186, -55291, -98382, 48769, -62672, -6924, -340591, -127716, 259967, 259945, 11352, 133125, 109886, 195564, -286203, -8245, 48084, 134577, -226616, -7037, 215859, 87088, 112031, 9974, -65618, -110014, 190787, 51131, -36892, 11671, 21722, 191207, 23096, -75005, -22582, 20623, 50875, 226770, -4403, -177102]
17822a77102C7609P564M0573q763a03011C18389j30310g9245B6993N1815a68260
17810A09813e0923q1950B43923r1472o1699a68137d925j96609F5610p176O1647
17799A20081a34178G3722L35592b4752B26982i8444b2132B84562a79069a0937
17788b18026i0219C50226B9674h9068n6934B6467a99387O4593l751A22849K07599
17777C30448A37429b11411d5273l3799a2077j31457A24553L1827a57349a6212
17766a56104B94741c4977A71233b08997D8853a67104A68756d02153c9137j40685
17756a79822j5853j27385A43104e1437r9698j53125a06560C2214h0488j68115
17746b48603B77690C2398e162B1483J62715b16624R221A53317a29230M8741E5833
$$ y = [-177102, 37609, 45173, 85746, 76983, -103011, 318389, 188079, -79245, 26993, 78808, -168260, 109813, -50923, -132873, 243923, 152451, 90752, -168137, -4925, -201534, 65610, 58434, 120081, -134178, 73722, 409314, -24752, 226982, -98444, -22132, 284562, -179069, -10937, -218026, -90219, 350226, 29674, -89068, -146002, 26467, -199387, -134794, -138545, 122849, 330448, 137429, -211411, -45273, -79072, -12077, -143534, 124553, 156380, -157349, -16212, -156104, 294741, -34977, 171233, -208997, 48853, -167104, 168756, -402153, -39137, -179822, -195675, -323060, 143104, -51437, -151135, -304260, -106560, 32214, -80488, -248603, 277690, 32398, -5162, 21483, 184198, -216624, -207403, 153317, -129230, -80489, 55833]
17734A88161f3847Q722E55K76537a36032D0885b02089H7684K05133a27249C3943
17722a44305C92576b02299n9945B6002a87104F0120J42294K2292C3288A5125M7391
17711F2516B4972J96857g1267a7851j15596j35114j4106B58820e5111E0771a59208
17699A03226n033J37209C3934c04050C0372K07800r6546r183L5829b04465i3199
17687b23739a02425a852j32207j4593O5463m03882A68005a5566B780f2331A18389
17675d4376B83439H676i7018D50441c00456A62285G1851A6511c44995I1879D0992
17663a74859A95164b54526R6069a1647A65789q0161j3528b53140R5151C39537
17652A53970l1402a7780A59867a00011H7672b0951j03849A28650P5789h4019C66010
$$ y = [188161, -63847, -55125, 555, 277092, -136032, 40885, -202089, 87684, 292817, -127249, 33943, -144305, 392576, -202299, -262244, 26002, -187104, 60120, 202414, 224706, 33288, 15125, 62516, 24972, 221829, -71267, -17851, -133447, -268561, -282667, 258820, -55111, 50771, -159208, 103226, 98193, 235402, 33934, -304050, 30372, 238172, 141626, 132443, 168272, -204465, -93199, -223739, -102425, -1852, -134059, -148652, -83189, -487071, 168005, -15566, 2780, -62331, 118389, -44376, 283439, 8676, -97018, 450441, -300456, 162285, 71851, 16511, -344995, 91879, 40992, -174859, 195164, -254526, -158457, -11647, 165789, 85628, 72100, -253140, -157989, 339537, 153970, 122568, -17780, 159867, -100011, 87672, -20951, -124800, 128650, 204439, -84019, 366010]
17640e667G907a24260k16233a68563B44262a88515D6800a18809r4730g1042g543
17628a24717C83762e16004a34512c1899E7431b74912J18708k1413j08777e4044
17617A18699a61991k6621I5593c2282j14769A76162b0289A31930a05216d0608
17606G2555e4070n6558A42630F1293a12029C8997b63165J30375A26945c53158
17595B70562c1427m2136j31408A13400d4897p9199H8006a97227A94901a7552r3059
17584a10611k5369a3529G5938j5728j5312a08122A21555N7226o4593B7925a8518
17572D4480K47634A03951D3438D538b55896a07955A31758A7714R6228C849b69074
17560F04b6888a0661l60780a23171C6959a0848C93311b6095H561h960J464k9638
$$ y = [-5667, 7907, -124260, -340493, -168563, 244262, -188515, 46800, -118809, -213539, -71042, -7543, -124717, 383762, -516004, -134512, -31899, 57431, -274912, -156204, -177617, -286394, -54044, 118699, -161991, -188612, 95593, -32282, -147051, 176162, -20289, 131930, -105216, -40608, 72555, -54070, -110628, 142630, 61293, -112029, 38997, -263165, -132790, 126945, -353158, 270562, -31427, -73563, -204971, 113400, -44897, -124096, 88006, -197227, 194901, -17552, -110611, -135980, -13529, 75938, 60210, 44898, -108122, 121555, 178781, 114188, 27925, -18518, 44480, 292114, 103951, 43438, 4538, -255896, -107955, 131758, 17714, 113942, 3849, -269074, 604, -26888, -10661, -371441, -123171, 36959, -10848, 393311, -26095, 8561, -8960, -7496, -37134]
17548c7134C762K15153d6626B49275A17039n1490K20956F7806J01088A2903c37964
17536b38095g646D9256O2801b5626D21997a99872N1091B34140r7471R7064h2165
17524G3381l0149g6512C20909a66856G8616a33737A11911i2736C18481E8927d4709
17512B43101e2026D53335I3694J19760l7756J96560A75310C6542M5339f67I2921
17500b8073G1532b49432L4488N1531A88733c2587A28826b66111B6098J13530A2379
17488g2163A16187K2258Q0035G1010b34755a05786L3147A43568n8939J21102f534
17476B07125b85556e8564g594H9880J91081a45764j95280C41685b51998A88433
17465A53813b36315G7672K48205A58890p8292Q331J29088L426e5498f99C86791
$$ y = [-37134, 3762, 218915, -46626, 249275, 117039, 65549, 286505, 67806, 168894, 12903, -337964, -238095, -7646, 49256, 112057, -25626, 421997, -199872, -148781, 234140, 136669, 233733, -82165, 73381, 43232, -76512, 320909, -166856, 78616, -133737, 111911, -92736, 318481, 58927, -44709, 243101, -52026, 453335, 93694, 213454, 175698, 372258, 175310, 36542, 81881, -667, 92921, -28073, 71532, -249432, -214944, -163413, 188733, -32587, 128826, -266111, 26098, 139628, 12379, -72163, 116187, 138445, 218480, 71010, -234755, -105786, -72639, 143568, 84629, 205731, -6534, 207125, -285556, -58564, -7594, 89880, 280961, -145764, -341044, 341685, -251998, 188433, 153813, -236315, 77672, 325877, 158890, 80598, 88929, 218017, 221443, -55498, -699, 386791]
17453f2676C8056P8339b8069C7053a01421A95097J21751j42282J6538H579e6568
17441a22795F5319a59009A79451L05534n0705J9032j42545a67218A42207K97513
17431D39720b4178G5438a52868C80074h7318B96298a99472C23166Q3564j81194
17421B25536j11836H241J97729p1351K33648j2584A73864l0910N3094j7601J57079
17410C35526q8165E7795B7245c5251E1732K88571K7081a87689I8600K01701G8570
17398E33107g1780E66401A45368k1017K8300K00214a91822G1743J40843D8464
17387A30477b07982B38269f836A32649O5179r839M6038j13773R365J04205E6791
17375B13531J01889C9257L51362I2777f0543j51365f3763B3448K94727a5524F016
$$ y = [-62676, 38056, 116395, -28069, 37053, -101421, 195097, 316848, 174566, 191104, 8579, -56568, -122795, 65319, -159009, 179451, 484985, 434280, 453312, 310767, -167218, 142207, 439720, -24178, 75438, -152868, 380074, -87318, 296298, -199472, 323166, 406730, 225536, 113700, 8241, 205970, 134619, 368267, 355683, 173864, 142954, 196048, 178447, 335526, 247361, 57795, 27245, -35251, 51732, 340303, 367384, -187689, 98600, 300301, 78570, 533107, -71780, 566401, 145368, 124351, 152651, 352865, -191822, 71743, 212586, 48464, 130477, -207982, 238269, -6836, 132649, 197828, 187989, 234027, 120254, 129619, 233824, 56791, 213531, 315420, 39257, 390619, 92777, -60543, -211908, -63763, 23448, 318175, -15524, 6016]
17363C65356C6104j4463g5820H1661j3903b64638I980P872J43381h4781k94039
17352c78820B82616E2812J74608J58488j87089J79141C2443K11902p3927F7882
17341E5353L81813g6750B32465G6557J41778a65367E90L06429J29238H8583k4494
17330F4089K26921j8179m8308j04705f6295E354K32598a02293A51320E7043a02429
17318D3876M6532b87371J33591A8662J32029n1345m9533m037g4938A31889K14396
17307C46285a26386B0323K36151h0441J4452A74492C3910D10K44302j05817J58312
17296B97207J7860a07258E2753J28230G3964b2136A18884B7576a03285A60597
17285G1644J80122j22047M1557a72248E9846g4980A52483J10645K753n2654k5542
$$ y = [365356, 36104, 21641, -75820, 81661, 67758, -264638, 9980, 17852, 161233, -84781, -378820, 282616, 52812, 227420, 385908, 198819, 377960, 32443, 244345, 170418, 67882, 55353, 437166, -76750, 232465, 76557, 218335, -165367, 590, 307019, 436257, 88583, 64089, 291010, 272831, 224523, 119818, -66295, 5354, 237952, -102293, 151320, 57043, -102429, 43876, 90408, -287371, -153780, 18662, 150691, 99346, 49813, 45776, -74938, 131889, 346285, -126386, 20323, 256474, -80441, -65989, 174492, 33910, 410, 244712, 138895, 297207, 315067, -107258, 52753, 180983, 73964, -22136, 118884, 27576, -103285, 160597, 71644, 251766, 129719, 171276, -172248, 59846, -74980, 152483, 263128, 265881, 213227, 187685]
17274A87685n1281M5597K05619k0123h0768B42597a04188d5507D1486L87075A54771
17262b49893B08817J05019j48321K8691P4424k0326b1027a0205C07224A9838J0582
17251C0420J81023M9579p2066a367D64631A47144M2224F5765a59953A82955l6181
17240A46774J79451C4514b00936g1380B65889q4374K71898B2855a46655P2652
17230g4003N981D8321E900a28980B58022r9065q720P0549D1617L51347A28191
17218A92626J12140G8725J67444a0870D83007E8187J58050I8203J59269B8910
17207h6323A52701J43952a53708g0126A64241d2232B80610P0968j53172D025O7367
17196G1392a55631B28281j13456J19764J9937F8014L6519J79825r5263B5501K35881
$$ y = [187685, 136404, 182001, 387620, 367497, -80768, 242597, -104188, -45507, 41486, 428561, 154771, -249893, 208817, 313836, 165515, 194206, 268630, 248304, -21027, -10205, 307224, 19838, 30420, 211443, 261022, 188956, -1367, 464631, 147144, 189368, 65765, -159953, 182955, 146774, 326225, 34514, -200936, -71380, 265889, 181515, 453413, 22855, -146655, -74003, -68022, 48321, 5900, -128980, 258022, 158957, 150237, 220786, 41617, 392964, 128191, 192626, 304766, 78725, 246169, -10870, 483007, 58187, 216237, 98203, 257472, 28910, -86323, 152701, 296653, -153708, -70126, 164241, -42232, 280610, 351578, 198406, 4025, 71392, -155631, 228281, 114825, 234589, 254526, 68014, 104533, 284358, 189095, 25501, 261382]
17185B61382l614G6806B4378J05273K21551A24692n822O9593E6339B4872J42914
17174A67786n5119l8843K10466A3508K03170c15393B58739K04567B01573J28605
17164C30178D5502K68538r716O8788b8967I6083L37564C4031L66004B0639I066
17152C27381k8667q6477K7213J95509k09278E3204J14167o9797J46301G4458M0755
17141A15213b2983A04135J1900K38890j35426o6277J664J01853G7216M76539p3822
17130D79933A57737e3218C33101N5328I4430J0252N2884J10129P8228A45480m5537
17119I9943K89531j88317E2277J24894J9599J07327b9036B50523r6519a72444
17108I5872O9466D8482N54785j13791B13690K22198o8281j45895n3371o9670M17098
$$ y = [261382, 257768, 76806, 24378, 129651, 351202, 124692, 118870, 188463, 56339, 24872, 167786, 112667, 73824, 284290, 13508, 216678, -315393, 258739, 463306, 201573, 330178, 45502, 314040, 304324, 373112, -28967, 96083, 433647, 34031, 400035, 20639, 9066, 327381, 298714, 212237, 239450, 434959, 225681, 53204, 167371, 97574, 243875, 74458, 115213, -22983, 104135, 116035, 354925, 219499, 153222, 154886, 256739, 77216, 553755, 479933, 157737, -53218, 333101, 388429, 94430, 104682, 157566, 267695, 345923, 145480, 99943, 389474, 201157, 52277, 177171, 196770, 304097, -29036, 250523, 154004, -172444, 95872, 165338, 48482, 603267, 489476, 213690, 435888, 367607, 221712, 168341, 98671, 515769]
17097E15769A87103L89852j78785D4112K38641O9355O333j61889J295K28565p1464
17086C54948j29933J29037J48051I0358L89856A23441L52447A99039K08957M5329
17076D53325j42728k0882A3869L05561A59057K41562p7426I8274J89141J49185
17066D36600m0753g3667F47385B70984K0067J80119A79101K3921K32925j22844
17056C13103l4995J00993d406C16924J53191j62508j231J22743j5228J0492n3864
17045C70519q9255J46530L2797Q4111j25295O8064k02105K6354J8673R2477J63996
17034E86866k68523O1616J26290j2624k04603J56875J6585L71516B5336L90182
17024D15518p7701J47510k07027J24626N4287M8842A04216N10083j74091k04370
$$ y = [515769, 187103, 576955, 398170, 44112, 282753, 352108, 358441, 196552, 197847, 426412, 354948, 225015, 354052, 502103, 90358, 480214, 123441, 475888, 199039, 407996, 453325, 310597, 289715, 13869, 319430, 159057, 400619, 323193, 98274, 287415, 436600, 395847, -73667, 647385, 270984, 291051, 471170, 179101, 203022, 435947, 313103, 278108, 379101, -4406, 316924, 470115, 307607, 306376, 429119, 413891, 424383, 370519, 281264, 427794, 460591, 544702, 419407, 487471, 285366, 311720, 330393, 422870, 586866, 318343, 379959, 506249, 493625, 289022, 445897, 462482, 833998, 25336, 415518, 337817, 485327, 278300, 402926, 457213, 506055, 104216, 614299, 440208, 235838]
17014B35838K47059l1704N2083A94268J38068R6906K54248j51441k26620J73498
17004D78927J54945J06251A70607M6815J34702J85418o2633o6555j05887J5442
16994C17909K06598B7590J96135N83917k17945A11423N33107Q6889j08881j88266
16984D34272j23100L73389j00925o0731r4180K20397p4779B83934K56717L35068
16974H75719l68767Q6707j33093J18529j23130L25834j38572J16214k31581O05114
16964A132974l35811l52128L15219l00228L62169k11471N4397k49027J0167L5789
16954D62050J40728M06147k13797J8791B65631K97980m1938R4296J32509j10569
16944F37909o9258K86646j5087J3814J47641r3671Q4399j43778J41076j48568
$$ y = [235838, 482897, 451193, 503276, 194268, 332336, 429242, 683490, 532049, 305429, 478927, 633872, 740123, 170607, 217422, 352124, 537542, 474909, 408354, 302467, 317909, 524507, 27590, 223725, 807642, 589697, 111423, 644530, 731419, 622538, 434272, 311172, 684561, 583636, 522905, 428725, 649122, 574343, 283934, 540651, 875719, 506952, 593659, 460566, 579095, 455965, 781799, 643227, 759441, 527860, 1132974, 797163, 445035, 760254, 460026, 822195, 610724, 665121, 416094, 426261, 462050, 602778, 1008925, 795128, 813919, 265631, 563611, 521673, 615969, 748478, 637909, 568651, 855297, 840210, 854024, 1001665, 907994, 992393, 848615, 989691, 841123]
16934H41123Q9416p5435L9064m15840M21502K7648r1918r6690J38113j7253O1359
16923I21089q8942K17865k43194J10173j39813L808J18098j55665L18725j88394
16913H73750J59844O2580j21366Q9971o9150K90652N4795k89710J20057j07752
16903A063671L6716j99550K27558J62441J45252r2765j74626k5737N98279m71218
16893A270021j672R8560K97352l90767L51982j91287R3405l67668J94256L75289
16883A729471n64028J22188L30345k59817j6121M34734j66162j71809J1156j70102
16873A279855J16488j57179L81999J66810l20059N12920j13175j76075J30467
16864A822051l01762M04395k37671M68277m35236L30594j81o6722k12115M97868
$$ y = [841123, 930539, 855104, 894168, 478328, 899830, 927478, 835560, 738870, 876983, 859730, 921089, 832147, 1050012, 806818, 916991, 777178, 780986, 899084, 743419, 1062144, 873750, 1033594, 1096174, 974808, 1064779, 995629, 1286281, 1341076, 1051366, 1171423, 1063671, 1100387, 900837, 1128395, 1290836, 1436088, 1343323, 1168697, 1142960, 1741239, 1270021, 1268349, 1366909, 1664261, 1273494, 1625476, 1434189, 1527594, 1159926, 1354182, 1729471, 1165443, 1287631, 1617976, 1358159, 1342038, 1776772, 1610610, 1438801, 1449957, 1279855, 1396343, 1239164, 1621163, 1787973, 1467914, 1980834, 1867659, 1691584, 1822051, 1520289, 1924684, 1687013, 2155290, 1720054, 2050648, 2050467, 1983745, 1771630, 2269498]
16854B269498j45837j52071J70164k2198j69095J7400M6340p0638J30791K36113
16844B310467j54292J78027k28024M60799j64571K6517j80106K04829J7787K38609
16834B710042N7343l95531K65004k05942K17621L01224l07345J62335K47316k13057
16824B839010Q0975M2779q6063K53094K22495l26762N75530l80848L81053N9595
16814C660858p8043J9549m4810K75221n2584K53704k63723Q0013K60387j03034
16804D007538K54766K2647J17028O9802M0154N6013k05695L88255J28079O3923
16794D942510L21855P8001K2588l89568M46574J97056J84204J60854p5334R7928
16784E986668N34905r1641K43387J76727k67846N19032J07213N12791L13091Q0993
$$ y = [2269498, 2123661, 1971590, 2141754, 2119556, 1950461, 1967861, 2014201, 1943563, 2074354, 2310467, 2156175, 2334202, 2106178, 2566977, 2402406, 2428923, 2248817, 2453646, 2471433, 2710042, 2767385, 2371854, 2636858, 2430916, 2648537, 2949761, 2642416, 2804751, 3052067, 2839010, 2919985, 2962764, 2876701, 3129795, 3352290, 3025528, 3601058, 3220210, 3601263, 3660858, 3582815, 3602364, 3557554, 3832775, 3780191, 4033895, 3770172, 3850185, 4110572, 4007538, 4262304, 4284951, 4401979, 4471781, 4511935, 4567948, 4362253, 4750508, 4878587, 4942510, 5264365, 5342366, 5364954, 4975386, 5421960, 5619016, 5803220, 5964074, 5888740, 5986668, 6521573, 6429932, 6673319, 6850046, 6582200, 7101232, 7208445, 7721236, 8034327, 8115320]
16774H115320k36384M51740M15809L26460j37549M82085Q2932L19915L81005M64284
16764A0665617J81235J63352M83634K77986O15281K36260N87864R1016P96888
16755A4099133O53047K01485O35624O28302N87033P53011P48423O71325L90553
16746A9367936J165454O78504J056114Q23118J328101J334708J199484J210996
16738B8164415J137836J850037J205371J586307K197365K175037J703006K552495
16730D2571869K388784K899783K906197K950450L638645L756113L920358M296358
16722F9328557M733376N003964N656019O098706N991201P193412P151239P626687
16714A18783161Q001385Q555997Q545615R217440Q615825Q729291Q051034P425306
$$ y = [8115320, 7878936, 8330676, 8746485, 9072945, 8935396, 9417481, 9500413, 9820328, 10201333, 10665617, 10846852, 11010204, 11493838, 11771824, 12387105, 12623365, 13211229, 13302245, 14099133, 14752180, 14953665, 15589289, 16217591, 16804624, 17557635, 18306058, 18977383, 19367936, 20533390, 21211894, 22268008, 23091126, 24419227, 25753935, 26953419, 28164415, 29302251, 31152288, 32357659, 33943966, 36141331, 38316368, 40019374, 42571869, 44960653, 47860436, 50766633, 53717083, 57355728, 61111841, 65032199, 69328557, 74061933, 79065897, 84721916, 90820622, 96811823, 104005235, 111156474, 118783161, 126784546, 135340543, 143886158, 153103598, 161719423, 170448714, 178499748, 185925054]
16706A85925054O903765N671568M015306K103776J116259q67960k535442m225806
16698A98106520n772584p199480p892570q204230q616846r286324r308815q613489
16690A33212182q410205q214085p626063p369301o779823o697017n853400n331860
16682G6930428m958770m736702m788579m024536l422626l491592l130945k878473
16674D5498205k432510k469045k297452k460988j794873j766793j691352j696538
16666B8888654j299307j159486j533527j133800j413666p36913p99563j016881
16658A9795511q27769q56024p23132p96038o06507o07989o01586q46972l12379
16649A3617115l34953m19123q25169l76481m07439l08732m79506k18227k29715
$$ y = [185925054, 192828819, 198500387, 202515693, 204619469, 205735728, 204867768, 202332326, 198106520, 192333936, 185134456, 177241886, 169037656, 160420810, 151134486, 141825671, 133212182, 124801977, 116587892, 108961829, 101592528, 94812705, 88115688, 82262288, 76930428, 71971658, 67234956, 62446377, 58421841, 54999215, 51507623, 48376678, 45498205, 43065695, 40596650, 38299198, 35838210, 34043337, 32276544, 30585192, 28888654, 27589347, 26429861, 24896334, 23762534, 22348868, 21611955, 20812392, 19795511, 18967742, 18111718, 17388586, 16592548, 15986041, 15378052, 14776466, 13929494, 13617115, 13282162, 12863039, 12037870, 11661389, 11253950, 10945218, 10465712, 10247485, 10017770]
16640A0017770m02531k77198m39886k28552k39871j36368n8922k70719m00871
16631G562852j45466k86602l63629J43816m10696p4985l52095k2682j84420j67587
16621E698506m6133r3028P3914l33338j57282j66805j65822P5368o9881n97254
16611D218245J09557m24636Q9913p5357k16547K54845J6650n19744J71110k9928
16601C594108Q6431n87870N25558j21965k41937r9172j04388m76198M20581j34796
16591B860352l87030J44711J55221m638n8156N01944p34151r9496k43303K00875
16581B336329k34017K85321M759q0751j83434K54809m22697J35982l984j66111
16571A926206K25482j66951q6294J54431m08977L19635k07619K25529o2628j78765
$$ y = [10017770, 9615239, 9338041, 8898155, 8669603, 8429732, 8293364, 8234442, 7963723, 7562852, 7417386, 7130784, 6767155, 6910971, 6500275, 6425290, 6073195, 6050513, 5866093, 5698506, 5652373, 5559345, 5633259, 5299921, 5142639, 4975834, 4810012, 4885380, 4815499, 4218245, 4327802, 3903166, 3993079, 3917722, 3701175, 3956020, 3972670, 3452926, 3624036, 3594108, 3680539, 3092669, 3618227, 3496262, 3254325, 3155153, 3050765, 2574567, 2995148, 2860352, 2473322, 2618033, 2773254, 2768616, 2710460, 3212404, 2478253, 2378757, 2135454, 2336329, 2102312, 2387633, 2392392, 2311641, 2128207, 2383016, 1960319, 2096301, 2092317, 1926206, 2151688, 1984737, 1898443, 2052874, 1643897, 1963532, 1755913, 1981442, 1918814, 1740049]
16561A740049J28735k16188R8535n05986J16208R6936M76329m87568j61115J98554
16551A484489Q5552k32683L4525J77080m2882k40176O7432l32187L18296j15776
16541A203670R612L48532q1245j87465n9749J1073j97136J61803j13263J03762
16531A199594p1082r6337p6866J50773k866k57522K54033n5085j82904J12235
16521I73973r787j9107L10910m33393Q8037l66494K47330L807L20686q458j98519
16510I08985J4585K4136k54588j19225Q1236J57761K11059k48263m0715k8853
16500G06118j84166L20281k34307M0832k44005O09532D94649L25798j7247n2813
16490G50387K2238l64568N27151l88067N4296H6807M71903J94453j07188r4441
$$ y = [1740049, 1868784, 1652596, 1751131, 1245145, 1361353, 1458289, 1934618, 1447050, 1285935, 1484489, 1570041, 1337358, 1371883, 1548963, 1506081, 1265905, 1333337, 1001150, 1319446, 1203670, 1213282, 1561814, 1480569, 1293104, 1233355, 1244428, 1047292, 1209095, 1095832, 1199594, 1128512, 1032175, 955309, 1106082, 1103216, 845694, 1099727, 1044642, 861738, 973973, 964186, 945079, 1255989, 822596, 910633, 544139, 791469, 795276, 1115962, 1107504, 908985, 923570, 947706, 693118, 573893, 655129, 812890, 1023949, 775686, 734971, 706118, 521952, 842233, 607926, 648758, 404753, 1014285, 494649, 820447, 803200, 750387, 772625, 408057, 935208, 547141, 601437, 86807, 558710, 753163, 645975, 551534]
16480E51534K38013j7661k28632N146j84102L33463k25000B10095M46759j54608
16470E02246J25223L0631l24849J19479N5367l709o2455m7013p7382J751K05023
16459E24312J32330C05470j25259J18138j13068K66158j98290J99007J0864K25983
16449F89003K47238C74375p7199D0758L63754A67149J95450J70937B02171m0190
16439A61981J67780j3835K6149J45745j4348M0585l9267r9297N7303j62372J47836
16428D18260A38492J93512Q9594j10640K463p2463J33030N137A5913K52923m4452
16417B24384k2531j8758d7374b2673D48438I7045C522J48119E4135J40039O9661
16406B63835d201D09022N3464B15306G9970J38361h4267B92622p1514J53777A03731
$$ y = [551534, 789547, 771886, 543254, 548400, 364298, 697761, 472761, 210095, 656854, 502246, 627469, 658100, 333251, 452730, 508097, 504388, 441933, 394920, 317538, 319289, 524312, 656642, 305470, 180211, 298349, 185281, 451439, 253149, 452156, 463020, 689003, 936241, 374375, 297176, 40758, 404512, 167149, 362599, 533536, 202171, 161981, 329761, 315926, 342075, 487820, 473472, 514057, 474790, 375493, 432796, 270424, 418260, 138492, 332004, 421598, 310958, 313421, 240958, 373988, 379125, 15913, 268836, 224384, 201853, 183095, -47374, -22673, 448438, 97045, 3522, 151641, 54135, 194174, 263835, -4201, 409022, 462486, 215306, 79970, 218331, -84267, 292622, 221108, 374885, 103731]
16394B77987J66650i102H7264I6a40195B49449p3167J31631j19591B3128L33685
16383C56813k0801A50634o1924g1636C5280b7277A66107Q1343j10965E2678J81274
16372B33952L1909N2530N2871j17404A24757L9366o8377j6238J06619J74713p2293
16361B88547M1563F9248J35695c2793A55700F8589j3642K01038a09192B08675
16350h6628p0896A73578n2847a80698a2473B07567P6969A26130M6818J64471n7376
16339B80043r5700f0495C19837j17082p2372J49964j16574k4133j0872a1050G6170
16327D6056I331P2489L02008b5768B34993K6279M1433I6508k4168J8467L6405
16316A27212N5371g1065C78704a24231G9075h0315o5583d8402j10316e9684A21009
$$ y = [277987, 444637, -9102, 87264, 96, -140195, 249449, 176282, 307913, 188322, 23128, 356813, 336012, 150634, 88710, -71636, 35280, -27277, 166107, 247450, 136485, 52678, 233952, 265861, 318391, 371262, 253858, 124757, 164123, 95746, 79508, 186127, 360840, 288547, 330110, 69248, 204943, -32793, 155700, 68589, 54947, 255985, -109192, 208675, -86628, -157524, 173578, 120731, -180698, -12473, 207567, 284536, 126130, 172948, 337419, 280043, 184343, -60495, 319837, 202755, 130383, 280347, 163773, 139640, 128768, -11050, 76170, 46056, 9331, 81820, 383828, -25768, 234993, 261272, 302705, 96508, 72340, 90807, 127212, 182583, -71065, 378704, -124231, 79075, -80315, -145898, -48402, -158718, -59684, 121009]
16304A40326i2593D15803A53787O6732b7979B41072M5733m433A02344J13325p2456
16293A43213e8710A20721a4910B33617g3791M849D9849f4873h025E5048b89239
16281d3797B35251f490A78457F7294Q0229h930B12759I2148J53722a06357j84390
16270b90747A1527J21294a04722A31299a13978C43818e5462C794g6459k60457
16260c36916C20745l8874H9864J94208A23783L655b62965b0386I2047B6143J03965
16249A30108a75141C4397M351j8194K03830E7090j31L3375j535N3115F771J23760
16237A30531a00802A15452a16427A95683a2270A44227P5998j07430P922c4698
16226E3732O8938Q1061a85002J2792E6541g364A00512N4469B5513a15956A34995
$$ y = [140326, -92593, 415803, 153787, 220519, -27979, 241072, 286805, 282372, 102344, 215669, 143213, -58710, 120721, -14910, 233617, -73791, -68942, 49849, -64873, -8025, 55048, -289239, -43797, 235251, -6490, 178457, 67294, 147523, -8930, 212759, 92148, 245870, -106357, -290747, 11527, 132821, -104722, 131299, -113978, 343818, -55462, 3794, -76459, -336916, 320745, 281871, 89864, 284072, 123783, 127438, -262965, -20386, 92047, 26143, 130108, -175141, 34397, 38748, 20554, 224384, 57090, 56959, 90334, 88799, 141914, 6771, 130531, -100802, 115452, -116427, 195683, -12270, 144227, 220225, 112795, 120717, -34698, 53732, 122670, 203731, -185002, -172210, 56541, -7364, 100512, 154981, 25513, -115956, 134995]
16214B75956C8491d7320L277l2270A76933n3473a09266D8221f3609D2525d7494
16202b08534A10216N3912i2303o9482B47270I9800P2147D6583b3574k56620H8687
16190d9B55621a33139d3963J532D2724K15828j26470J030J9669e5915J0957A3039
16177A69348b4081j2679A4094J273i1518B9977d551j74832I4166k7464C2085K91776
16165C23861e8719n6040A40086a59159A78914n173a32678j47185D0075L7251C1297
16153d42674B78401A12160Q1532K5490h114j7948a1354j19943D7868J03518J9276
16142A70662j9314F9145M393e4145j23128j5939C4575a19461j07361k24447A69816
16130E3472j46j1837d43112b6461F2870j1625b4239l97992f2249j05114A76604
$$ y = [275956, 38491, -47320, -44043, -76313, 176933, 123460, -109266, 48221, -63609, 42525, -47494, -208534, 110216, 164128, -92303, -161785, 247270, 99800, 171947, 46583, -23574, -280194, 88687, -49, 255621, -133139, -43963, -42431, 42724, 258552, 132082, 133112, 152781, -55915, -44958, 13039, 169348, -24081, -36760, 14094, 15367, -91518, 29977, -4551, -179383, 94166, 66702, 32085, 323861, -58719, -114759, 140086, -159159, 178914, 173741, -132678, -279863, 40075, 77326, 31297, -442674, 278401, 112160, 193692, 219182, -8114, -26062, -11354, -131297, 47868, 151386, 170662, 151348, 69145, 73538, -54145, -177273, -193212, 34575, -119461, -226822, -451269, 169816, 53472, 53326, 41489, -443112, -26461, 62870, 51245, -24239, -422231, -62249, -167363, 176604]
16118I4256n842K49657J8163O189d3209F9916f0077j58219c0592A72567b98001
16106c07330a78j97504I9666r556B1677J13589c90326A90948K6464I3929b82916
16094h5945H752J24796D0540G479d8713q5109c9695j47139f2468B61341j1238
16083B50103a38940p9513A48686j9560b70722m7178c4804n977C9231d304q661
16072a2965j72697g450D7966a08375e1379G191J11355i0511p2935K0992O9289
16061g3165o9027I2110b67664F3404k7199L33951c28098l809b4387A99791c24917
16049c31488f3258D3059N7115B6609L30293a00302j22238d7068o8685B36764r9907
16038A36857E8849J04938p9989M6317a36052A03152b33102F6200a09171a6816
$$ y = [94256, 88414, 338071, 356234, 362423, -43209, 69916, -60077, -218296, -30592, 172567, -298001, -307330, -178, -197682, 99666, 90110, 21677, 135266, -390326, 190948, 217412, 93929, -282916, -85945, 8752, 133548, 40540, 7479, -48713, -133822, -39695, -186834, -62468, 261341, 250103, -138940, -218453, 148686, 129126, -270722, -317900, -34804, -40781, 39231, -4304, -12965, -185662, -7450, 47966, -108375, -51379, 7191, 118546, -90511, -163446, -142454, -73165, -142192, 92110, -267664, 63404, 36205, 370156, -328098, -331907, -24387, 199791, -324917, -331488, -63258, 43059, 100174, 26609, 356902, -100302, -222540, -47068, -115753, 236764, 136857, 58849, 163787, 83798, 130115, -136052, 103152, -233102, 66200, -109171, -16816]
16027a59950l6085A64790m5329a76928b8901i368r4393d3736B91658l2961c7838
16015h9318j34131f6771E4903K56082j43793b53050F206J74525a78485k34271
16005d12756g8982k38414n994e2896A2726K1439b4235I4818R7800b39011A33406
15993B71626a96687B48450q048e6068A26553b58161D3139a0718j64128A024a43259
15981a73530B7075b16l0736b386E9765a44875A6230N6324l0434M8945K02938B2579
15968A91933C9720K41874J01088J1567P1204I1403A4409c23558I3916h5743j11081
15957a96824G8110J40930a28004l9867A25092k811L3235J01190r0119a27689B4081
15945b0499H975a57317f8834r0981A27197J5544i1478j2002o3151B44680c69717
$$ y = [-159950, -196035, 164790, 119461, -176928, -28901, -9368, -103761, -43736, 291658, 258697, -37838, -89318, -223449, -66771, 54903, 310985, 167192, -253050, 6206, 180731, -178485, -412756, -78982, -317396, -323390, -52896, 12726, 34165, -24235, 94818, 192618, -239011, 133406, 271626, -196687, 248450, 240402, -56068, 126553, -258161, 43139, -10718, -174846, 1024, -143259, -173530, 27075, -216, -30952, -2386, 59765, -144875, 16230, 72554, 42120, 91065, 294003, 22579, 191933, 39720, 281594, 382682, 394249, 465453, 91403, 14409, -323558, 93916, -85743, -196824, 78110, 219040, -128004, -167871, 125092, 122281, 155516, 256706, 166587, -127689, 24081, -20499, 8975, -157317, -68834, -159815, 127197, 142741, -91478, -103480, -166631, 244680, -369717]
15933d5576E654a58268d0888k48436A35946n0543h6276A73110c57552B73555a29532
15921d6521k49608A0161g7869C16083i1081n3637A90132a5460k39307J8231a06309
15909d5388F6657K3027k7839b93119J02901J2761m2443k3945E7884a49111o6571
15898b15682j15785J63118D9195e6595k48259I1317C9899e15513A6399O2493j2600
15887F6292L2179c9621G7506a76819C8864P6341a43085M1005m2235p8234d3415
15875H2627e4164j75406B4333b61026D7044g4492j7674F1356a51201f5393G5614
15863H5289e794E499K3222J07369f0843p5584a5312A40852b61811J4324Q6903
15852a60584r4577k9271b3919C32019b41204a1005C6925K32621a28596I3043A7936
$$ y = [-45576, 5654, -158268, -40888, -289324, 135946, 85403, -86276, 173110, -357552, 273555, -129532, -46521, -296129, 10161, -77869, 316083, -91081, -144718, 190132, -15460, -254767, -236536, -106309, -45388, 66657, 89684, 61845, -293119, -190218, -177457, -219900, -243845, 57884, -149111, -215682, -331467, -168349, 49195, -56595, -304854, 91317, 39899, -515513, 16399, 78892, 66292, 98471, -39621, 77506, -176819, 38864, 115205, -143085, -102080, -144315, -222549, -43415, 82627, -54164, -229570, 24333, -261026, 47044, -74492, -92166, 61356, -151201, -65393, 75614, 85289, -5794, 5499, 28721, 136090, -60843, -136427, -15312, 140852, -261811, -247487, -160584, -255161, -284432, -23919, 332019, -241204, -11005, 36925, 269546, -128596, 93043, 17936]
15840a49399A1866b19050D6576R7997J14119c27906A39188b78099j2108A6481
15829H3114A873a17684M3032A5144a79759N5413m1888A80775b47378A15910b4122
15817a57294A02990M7490j0017l3621C9801d449B36028b8642j75634A36557i38
15805b53157G2834J27629o4067J9670D2165L5535b3835m822j8696A66091k6987
15794A39104e10080i3848K8139j11139a770j35855b4596r705k44131J33263r8164
15783b43333A58197E2761b81193f7793r4732k35144e7551j18757e2955q8933A54730
15771b67213j05748a6999A21157a02264j94248i044B05733M2951d9285K0227j10402
15760a39460m701j6230B3105a4203n1063J944A88872a65572c5882m7649L0398
$$ y = [-149399, 11866, -219050, 46576, 144573, 258692, -327906, 139188, -278099, -290207, 16481, 83114, 1873, -117684, -74652, 15144, -179759, -124346, -166234, 180775, -247378, 115910, -24122, -157294, 102990, 150480, 140463, 106842, 39801, -4449, 236028, -28642, -204276, 136557, -938, -253157, 72834, 200463, 136396, 156066, 42165, 77700, -23835, -28657, -47353, 166091, 139104, -510080, -93848, -65709, -176848, -1770, -137625, -24596, -34301, -278432, -145169, -243333, 158197, 52761, -281193, -67793, -162525, -397669, -57551, -176308, -52955, -141888, 154730, -267213, -372961, -16999, 121157, -102264, -296512, -9044, 205733, 248684, -49285, -29058, -139460, -144161, -160391, 23105, -14203, -65266, -63322, 188872, -165572, -35882, -83531, -53133]
15749e3133K094A92249d1161r3105A06606K30567a75351A96661N3429a24792H8707
15737a11645H2289d9848k66699e2426F0310J14890k4062j7664J73227a15422k15484
15726c30906A48784A3496b03612H7584a13873k22600J50394j13611I8167C7594
15715H3332b02330B14046a33752k38171F0769J05345a32320A03651c61812B13751
15704c32158J10313a6077I1675n923a79141B24790b43511G7562b3505j77651R1282
15693a09874j04043i1500A3148R3042E0481a35441C05158H7252B1852h5552A59873
15681C4413b88594A75856C3303L1134J50160L4143p3743m9522a92574l9308A80260
15669b57926A25123D7622c17801e4241b201A08554b71945C59185C4024a25562
$$ y = [-53133, -51039, 192249, -41161, -134266, 106606, 337173, -175351, 196661, 250090, -124792, 88707, -111645, 82289, -49848, -316547, -52426, 60310, 175200, 151138, 133474, 306701, -115422, -330906, 148784, 13496, -203612, 87584, -113873, -336473, -186079, -299690, 98167, 37594, 83332, -202330, 214046, -133752, -371923, 60769, 166114, -132320, 103651, -361812, 213751, -332158, -221845, -16077, 91675, 85752, -179141, 224790, -243511, 77562, -23505, -201156, -109874, -213917, -91500, 13148, 106190, 50481, -135441, 305158, 87252, 21852, -85552, 159873, 34413, -288594, 175856, 33303, 64437, 214597, 248740, 174997, 125475, -192574, -231882, 180260, -257926, 125123, 47622, -317801, -54241, -2201, 108554, -271945, 359185, 34024, -125562]
15658a53993q7260C23995r5923j12665L4293D4474J75461c8127A62175B930b28697
15646A00313k1363a54066A91820K7853e7695j74063L931F2427b94648B54993f5614
15634a89873P9907A65603L7775F9826A3944h1873C750J80666m004f0248k29541
15623b89789R2388g4074e521A54222L3865a51165e6480j1822j99175a26606e4258
15611a27240A58471J3232a45761r4422R2115e9109H3223c9020C82471E2078J67474
15600B19552p5541M262d12509a99007B36096q6958c5859l2497H7692K06292j18843
15589A75141l5746a74458h5928l185k13695b2079f365A9481J18774c28178i8561
15577c17071I3669h0381A14885J7845n75a71335e0561j33054A68641o0557C4305
$$ y = [-153993, -241253, 323995, 228072, 115407, 149700, 44474, 219935, -38127, 162175, 2930, -228697, 100313, 78950, -154066, 191820, 219673, -57695, -231758, -227827, 62427, -294648, 254993, -65614, -189873, -109966, 165603, 203378, 69826, 13944, -81873, 3750, 184416, 180412, -60248, -289789, -197401, -74074, -5521, 154222, 188087, -151165, -56480, -68302, -267477, -126606, -54258, -127240, 158471, 171703, -145761, -240183, -148068, -59109, 83223, -39020, 382471, 52078, 219552, 144011, 148273, -412509, -199007, 236096, 149138, -35859, -68356, 87692, 293984, 175141, 139395, -174458, -85928, -89113, -302808, -22079, -6365, 19481, 138255, -328178, -98561, -317071, 93669, -80381, 114885, 132730, 132155, -171335, -50561, -183615, 168641, 108084, 34305]
15565b85477a1716o6121q3886k1612A37972b01158A47097a75263L3160J3577m1564
15554a70090j29597J30140h1807j01235O7910B47107c477j05658D0961b3045A39988
15542B02491G5138d60512A81886a63088m0838A51501k9152b08751A54851d3687
15531d17914Q2338O3053C8376c6781r420j97108b0089A62671c91563B20726a39911
15519F3719j0889j4699J35037b50979B28838e5567k40704g1j58066H0347l3064
15508D7283j1421a11862B34195e7312a322m31309J21474J22626j25303A83505
15497a16863k4338A21627g7592K4587B0150b24351C09315I0349a14567B30851
15486b37527j4272a11055B00447D2504c18506A79072a40351B69116b60482A99288
$$ y = [-285477, -11716, -77837, -161723, -183335, 137972, -201158, 147097, -175263, -142103, -128526, -170090, -299687, -169547, -81807, -183042, -115132, 247107, -3477, -109135, 40961, -23045, 139988, 202491, 75138, -460512, 181886, -163088, -203926, 151501, 122349, -208751, 154851, -43687, -417914, -335576, -272523, 38376, -36781, -46201, -243309, -20089, 162671, -391563, 220726, -139911, 63719, 52830, 38131, 173168, -250979, 228838, -55567, -296271, -71, -158137, 80347, 47283, 35862, -111862, 234195, -57312, -1322, -432631, -311157, -188531, -313834, 183505, -116863, -141201, 121627, -77592, -53005, 20150, -224351, 309315, 90349, -114567, 230851, -237527, -251799, -111055, 200447, 42504, -318506, 179072, -140351, 269116, -260482, 199288]
15475a22698j15112D023a29819j57812B0214J57636m8926D2751g8532k6181j97025
15464c01738j0869B5386K81179a21179C0304a34185k96189J27837A59687b70588
15453a53927j693L7718F23000b18040f4460C407J00046K03304A7288a94332F4358
15441C16897c0649j1087a4618A77139K96909c98340a41109B20797F9069P192c01542
15429a90707h7782M0941j18837n846k34711f9013a6374I6978K4044c33858b2022
15417b3304A17216a21637B04610F8071b19429C81333A30802d5149j48885J4582
15407a79452b8874A36952n7206g1770j12920A96356r6574D951g6044B4102J43515
15396A67617e4577j60690A37214a36756j02258j70463a49033A9488M1670K7L4625
$$ y = [-122698, -237810, 4023, -129819, -287631, 20214, 177850, 128924, 42751, -78532, -104713, -301738, -312607, 25386, 306565, -121179, 30304, -134185, -430374, -302537, 159687, -270588, -153927, -155620, -117902, 623000, -218040, -64460, 3407, 103453, 306757, 17288, -194332, 64358, 316897, -30649, -41736, -14618, 177139, 474048, -398340, -141109, 220797, 69069, 76261, -301542, -190707, -87782, -46841, -165678, -171524, -406235, -69013, -16374, 96978, 121022, -333858, -22022, -23304, 117216, -121637, 204610, 68071, -219429, 381333, 130802, -45149, -194034, -179452, -28874, 136952, 79746, -71770, -184690, 196356, 99782, 4951, -76044, 24102, 167617, -54577, -215267, 137214, -136756, -239014, -409477, -149033, 19488, 61158, 61185, 95810]
15385I5810L9469R1353A10558a27431F6599J39677B1485J06357a40986O2589A92170
15373C9017L94840A33675F2764M7398J54178c83348a49449j1127H4979g1807j11483
15362a83290p1040m2293B9292c56111A89522A5271h3385j03278b9602j13797A11091
15350A07115J06705b39659i2635k08508C70536F6545Q5654b15325J8056g6924
15339f392A66891F9852a06501A93783A1680a17622j53138G6659f6849p6580F2032
15327B162J48517l9972E780b67737d260r1938K5798Q901C01482e1413A23244b47892
15314D1501a99942A28512J680c10988J41089A3672L3843N2864A4048e9401A22075
15302F3295a64537j91785J34112D2995O6934K57725G1367K6228a20221F6653R2427
$$ y = [95810, 135279, 226632, 110558, -127431, 66599, 206276, 21485, 127842, -140986, -78397, 192170, 39017, 433857, 133675, 62764, 110162, 264340, -383348, -149449, -160576, 84979, -71807, -183290, -254330, -296623, 29292, -356111, 189522, 15271, -83385, -186663, -29602, -143399, 111091, 107115, 213820, -239659, -92635, -301143, 370536, 66545, 152199, -215325, -197269, -76924, -6392, 166891, 69852, -106501, 193783, 11680, -117622, -270760, 76659, -66849, -143429, 62032, 2162, 150679, 110707, 5780, -267737, -4260, -96198, -70400, -61499, 301482, -51413, 123244, -247892, 41501, -199942, 128512, 130192, -310988, -169899, 13672, 47515, 100379, 14048, -59401, 122075, 63295, -164537, -356322, -222210, 42995, 109929, 367654, 71367, 97595, -120221, 66653, 159080]
15291A59080a13014m7688O8008L5528m3738k70703h6209A45633N4560b79503C97040
15279C7404J89306r7308B3988a84988L4518l2939P226G4091h3481A69649O9291
15268B38940a38371C70441e9541j4596b1074H1910b4685A88079h9376D2382H058
15256b186A02562h9433j12477B37405a1047j33186G886b9735l619E2904a4414
15244f3652J3152G8344K55550M3404c6325J3293k4088B64397O284J40881Q8252
15233D99814K99686J05026K0010M00772E95259j25692k32423L41234C5702K37795
15223B73497r0429E9844a37047M1784a2678E0712M143k141J32603n2890P2197
15212B04624a35803K1258b4771A08172E2349A088b48344B41377e6361K6409A12803
$$ y = [159080, -113014, -160702, -92694, -57166, -100904, -371607, -86209, 145633, 200193, -279503, 397040, 37404, 226710, 129402, 23988, -184988, -150470, -183409, -176183, 74091, -83481, 169649, 238940, -138371, 370441, -59541, -74137, -21074, 81910, -24685, 188079, -89376, 42382, 8058, -2186, 102562, -89433, -201910, 237405, -11047, -144233, 7886, -29735, -33354, 52904, -14414, -63652, -50500, 78344, 333894, 377298, -36325, -23032, -47120, 264397, 270681, 411562, 499814, 799500, 904526, 924536, 1325308, 595259, 469567, 237144, 578378, 35702, 273497, 183068, 59844, -137047, -95263, -12678, 50712, 54855, 52714, 185317, 132427, 204624, -135803, -114545, -24771, 108172, 52349, 1088, -248344, 241377, -56361, -29952, 112803]
15200B2997M6987r658h662j54496B78603c4025C7894a87268j07204M7728B39460
15188A90181A8513J43901N5249m8059p3341J11053e442D4613K4180P5715a89798
15176H2103J05166g6036r5739O0621A0447J9365M6679J16672a36817B70531a66405
15164A81719J24131G428i760D6301M09466H9263N7517K8961a44202B91L9552R4886
15152A34729J51974H1518A9345g8087A29608b6217C81046b13136a4447A18365
15141A81573J69922A15262a16470A15160j5334R0364N7043A07983J36600Q5219
15131C29802h0107B0314J24290j4918J78573h8135B4999K59907A01847K47362
15121C49209c20440a17854I5708J31090D3337L18694b11175A7002K26195n3846
$$ y = [22997, 69984, 60326, -8662, -163158, 278603, -34025, 37894, -187268, -294472, -246744, 239460, 190181, 18513, 162414, 217663, 169604, 96263, 207316, -5442, 44613, 68793, 144508, -189798, 82103, 187269, -76036, -171775, -111154, 10447, 29812, 76491, 193163, -136817, 270531, -166405, 181719, 305850, 7428, -9760, 46301, 455767, 89263, 146780, 175741, -144202, 291, 39843, 134729, 286703, 81518, 19345, -78087, 129608, -26217, 381046, -213136, -14447, 118365, 181573, 351495, 115262, -116470, 115160, 99826, 190190, 247233, 107983, 244583, 329802, -80107, 20314, 144604, 129686, 308259, -88135, 24999, 284906, 101847, 349209, -320440, -117854, 95708, 226798, 43337, 362031, -211175, 17002, 243197, 189351]
15111A89351q7013j1808L2382o0243K31613A22757M29956A8208K1106h3115j39108
15100b22223a2507A10337e7871E3087a25501b1559A49626m2828b69851k2528a5173
15088f9164E3150J83554C4360G454e9292a0462A43773J74912L8888A58686J14003
15077B72689D8587j6481J58749E9378M769R4384p0728m224M8944B2876J60684
15066A83560r855H4486i614A48535g5339A83493q0496J3968p968D0373O4669k3685
15054H1357J58678k9492a7881B08462J44053F8324a80662M144p0872B90647G8529
15042A28305N4265C1262R9640g565p659A20411J16542h3101A27532g5691B65382
15030a4942k86585A7298M5474P9733a60177A22134J37940m2068j04967L9775M5160
$$ y = [189351, 102338, 90530, 122912, 62669, 294282, 122757, 552713, 18208, 39314, -83115, -222223, -12507, 110337, -57871, 53087, -125501, -21559, 149626, 106798, -269851, -292379, -15173, -69164, 53150, 236704, 34360, 7454, -59292, -10462, 143773, 318685, 357573, 158686, 272689, 48587, 32106, 190855, 59378, 64147, 158531, 87803, 83579, 132523, 22876, 183560, 173705, 84486, -9614, 148535, -75339, 183493, 102997, 116965, 108997, 40373, 105042, 81357, 240035, 210543, -17881, 208462, 352515, 68324, -180662, -176518, -247390, 290647, 78529, 128305, 182570, 31262, 130902, -7565, -15224, 120411, 236953, -83101, 127532, -75691, 265382, -14942, -301527, 17298, 62772, 142505, -160177, 122134, 260074, 218006, 113039, 152814, 197974]
15019A97974L3110D1268K02073b33017A81462Q0440h7162F4922L92831k07425
15009B50328E6188b05348C90848q3522a04112A50124C4148e6217J117F4689i897
14997I0933K61080J96149a47258B01047O7953o868A07161L4805f8463B05093K5003
14986B30096a49451p2568h3755G4396R4819F1429J25192b40224C10189A03228
14975A88718H7365J51371g886C30557j00124o8424j0867K0691B4398K41301r5277
14964A70422k7418e3716A17825m4092L30794j22202p1764J37956l5067j49699
14954A63751K01396j70798O6475j16596r235J98751A09926N1678J36349j02740
14944A95213a55320A72100f4113A90383N2389q8834Q8746Q8138j10807A02594
$$ y = [197974, 231084, 41268, 243341, -233017, 181462, 261902, -87162, 64922, 457753, 250328, 56188, -205348, 390848, 307326, -104112, 150124, 34148, -56217, -55100, 64689, -9897, 90933, 352013, 548162, -147258, 201047, 269000, 262132, 107161, 141966, -68463, 205093, 230096, -149451, -222019, -83755, 74396, 169215, 61429, 186621, -240224, 310189, 103228, 188718, 87365, 238736, -7886, 330557, 230433, 162009, 151142, 171833, 24398, 265699, 170422, 143004, -53716, 117825, 73733, 404527, 282325, 210561, 348517, 313450, 163751, 365147, 194349, 260824, 144228, 134993, 333744, 109926, 161604, 297953, 195213, -155320, 172100, -64113, 190383, 242772, 153938, 242684, 330822, 220015, 102594]
14933E3003h278I9396L77626A89858M1302q3973J49754j21123j7539G0682B6005
14921A4332K73969d1302C4775J14894K43353A26426J16495A03972P5552n6958
14911A22566O8861j2474F2999N2627l9223J29977M7457K79547q9277b6195H1918
14899B27567J58474j57215Q4238J10498K8148A88893O8856K39224j26781b5769
14888C30512p4538I7358L8455K43223j10177J12147J2208M4505j60465K78495
14878E55749E7563J92254m7146J43459O8565j92765o6030L40576A24920h9007
14867D38920P181A91885L15209j08216j65838J22077R916A73580K18653n19J34030
14856E25744k19287A24723P3228J07032D6765K18454j1057J44036K67054l18113
$$ y = [53003, -8278, 99396, 477022, 189858, 231160, 147187, 296941, 175818, 158279, 70682, 26005, 14332, 288301, -41302, 34775, 149669, 393022, 126426, 242921, 103972, 179524, 122566, 191427, 178953, 62999, 115626, 76403, 206380, 253837, 533384, 444107, -26195, 81918, 227567, 386041, 228826, 313064, 423562, 451710, 188893, 257749, 496973, 370192, -25769, 330512, 255974, 97358, 135813, 379036, 268859, 381006, 393214, 437719, 277254, 555749, 57563, 249817, 202671, 346130, 414695, 221930, 155900, 496476, 124920, -89007, 438920, 446101, 191885, 507094, 398878, 233040, 355117, 365033, 173580, 392233, 391714, 525744, 306457, 124723, 197951, 304983, 46765, 265219, 254162, 398198, 665252, 347139]
14846C47139J5857m2620j6418i4406D82838j66031A38108N1197L18880j31092
14836C77093E3496i2744C55404j13639J35328A64906N58625C40026o6416l559
14826B70051J20944m7135R3132A44018R2786K88660k18606j50264J72087R0709
14816D19390K48012B19704L53178k28048l599r8765L70496k79101K61905k08821
14806C86949J82459J9492K5323j67475j89779j04487J56502K30475j97680J57209
14796D98988j81430O3438N9265A75721K37541J20694j98954N7358j21820O3593
14786C34133p2704j13766M25591M0129k62332L03270B38777O09869l49744J58
14776D99060j67537K02814n5132j83057L10870B09220J50469K75482k84708J70245
$$ y = [347139, 362996, 320376, 303958, -94406, 482838, 316807, 138108, 189305, 508185, 377093, 53496, -92744, 355404, 241765, 377093, 164906, 723531, 340026, 273610, 270051, 390995, 343860, 436992, 144018, 236804, 525464, 306858, 156594, 328681, 419390, 667402, 219704, 572882, 344834, 341235, 242470, 612966, 333865, 595770, 386949, 569408, 588900, 614223, 446748, 256969, 152482, 308984, 539459, 341779, 498988, 317558, 380996, 440261, 175721, 413262, 533956, 335002, 392360, 270540, 334133, 261429, 147663, 573254, 613383, 351051, 654321, 238777, 848646, 498902, 499060, 331523, 534337, 479205, 296148, 607018, 209220, 359689, 635171, 350463, 520708]
14766E20708B59689J07124J92660j61948R4699j14902J70884J68051j86265A63551
14755D31535M9861J17183J38545B43817K57363N58343n07264J01874k57119J65425
14745E62439q2181l4983L07487j62646O9467k06692n5758M2152J7092L22276k54010
14734E24643J69515k27359J81611j56003R5005J28010J74577l47576j00057K29665
14724F72031m4681j94256J25778L9172m5999j5707j22585m7342l4996L09083l1251
14713F09247L58039j77663k60993J28077m5603K48168k52523N36383C57416A66363
14702E71621J60532j4180o4506M1686n5992j08575J59321j45576q9636K02237
14692F56932o3905L3835K57316l91286M86971j45130r0976j7413J06257j05913
$$ y = [520708, 259689, 366813, 559473, 397525, 492224, 377322, 548206, 716257, 529992, 163551, 431535, 481396, 598579, 737124, 243817, 501180, 1059523, 552259, 654133, 397014, 562439, 480258, 445275, 752762, 590116, 659583, 452891, 397133, 439285, 456377, 778653, 524643, 694158, 466799, 648410, 492407, 587412, 715422, 889999, 542423, 442366, 672031, 627350, 433094, 558872, 598044, 552045, 536338, 413753, 366411, 331415, 640498, 609247, 967286, 789623, 528630, 656707, 611104, 859272, 606749, 1143132, 357416, 166363, 571621, 732153, 717973, 653467, 695153, 639161, 530586, 689907, 544331, 454695, 656932, 593027, 626862, 884178, 492892, 979863, 834733, 743757, 726344, 832601, 726688]
14682G26688p7113j02051R1989j5749J17375k21286J00796O6776R3179j02850
14672F77754M08889m98047J45753M40790n5170l39802j86443J48671J58762m5966
14662H55191j55698K61865l38879K3681J68343j7788j19088j064L79892l46096
14652G10359M90577j45835j94802k2962K21733q7814k58306L03205j02043m6845
14642H67267J22141K12766k21561j06225L0641j58597K19296l7862n1328M11410
14632A287948l96545K38100J1154j49778q5889J09410L66219j94955k18850J17364
14622A084178L9040l86151N16364j32594J41208j06846p600j43158J93939o8365
14612A130015P1660k16854J23061j51549M13674q3205q2665k50841J53735O2557
$$ y = [726688, 649575, 547524, 639513, 623764, 741139, 519853, 620649, 687425, 780604, 677754, 1086643, 588596, 734349, 1175139, 1119969, 780167, 593724, 742395, 901157, 855191, 699493, 961358, 622479, 646160, 814503, 796715, 677627, 676563, 1056455, 710359, 1200936, 1055101, 860299, 837337, 1059070, 971256, 712950, 1016155, 914112, 867267, 989408, 1202174, 980613, 874388, 905029, 746432, 965728, 927866, 876538, 1287948, 891403, 1129503, 1140657, 990879, 904990, 1014400, 1380619, 1185664, 966814, 1084178, 1123218, 737067, 1253431, 1120837, 1262045, 1155199, 1147599, 1004441, 1198380, 1130015, 1201675, 984821, 1107882, 956333, 1370007, 1286802, 1204137, 953296, 1107031, 1169588]
14602A169588k32869N20984n9254J32322r9936l15193K65439j42291j6836L6598
14592A258552R5292r9966j03895q8034M87797m14897M08661J68537m31513L9434
14582A319968K48900k04023K4117M82644k32860P7024m00128N2700L06007r6813
14572A577536l29040K11192J24916o8272Q3269K2170K16104L7849O961k88975
14562A593710P1853M09957k03526J2409j9959j40404J07048k07001K76277K22181
14552B122545j91137o5146J51260J59302J42899N6852o4181K40658m872J24275
14542B672455N7822K89710N3818N75947L76271N89134P43898J484797K211509
14533I055361L114220O605008R511732J485525j1129090p536971m727202j825137
$$ y = [1169588, 936719, 1457703, 1398449, 1530771, 1430835, 1115642, 1381081, 1238790, 1221954, 1258552, 1353844, 1253878, 1149983, 1061949, 1549746, 1134849, 1543510, 1712047, 1280534, 1319968, 1568868, 1364845, 1388962, 1871606, 1638746, 1715770, 1315642, 1368342, 1674349, 1577536, 1248496, 1459688, 1584604, 1516332, 1599601, 1621771, 1837875, 1875724, 1882685, 1593710, 1665563, 2075520, 1871994, 1884403, 1864444, 1724040, 1831088, 1624087, 1900364, 2122545, 1931408, 1866262, 2017522, 2176824, 2319723, 2376575, 2312394, 2553052, 2548180, 2672455, 2730277, 3019987, 3073805, 3649752, 4026023, 4615157, 5359055, 6843852, 9055361, 12169581, 18774589, 28286321, 29771846, 18642756, 11105785, 6378583, 4553446]
14525D553446j535878l92674n40658n43l58804P90769n21643l9652M0043J39045
14515B133451L01228l64466j29368k01231M3071J97983j0254m9830J76748j6062
14505B081270L17828j79690j39334K51481p3576J54534j05531n4320J27955k0231
14495B360386R0142P5581j39814l17115M41162Q6000J53289N9896o4844l08901
14485B435782L49713p6927J0889P438q0837Q3772J80592K65224m23428n5492J44648
14474B841374K42407K30496n94692N22286O2409l2556j14475O7848J2653K07434
14464C445184k223Q9871K8590N3091K25426m16766M30262k37680K36382J07841
14454C959978k05674J22942j90956K39326K15946M58j57418K10896Q2617l83761
$$ y = [4553446, 3017568, 2624894, 2084236, 2083693, 1724889, 2515658, 1994015, 1954363, 1994406, 2133451, 2434679, 2070213, 1940845, 1739614, 1782685, 1980668, 1970414, 1920584, 2097332, 2081270, 2399098, 2219408, 2080074, 2331555, 2257979, 2412513, 2306982, 2252662, 2380617, 2360386, 2450528, 2526109, 2386295, 2069180, 2510342, 2596342, 2749631, 2809527, 2744683, 2435782, 2785495, 2708568, 2719457, 2726895, 2646058, 2729830, 2910422, 3175646, 2752218, 2696726, 2841374, 3083781, 3314277, 2719585, 3241871, 3304280, 3271724, 3157249, 3225097, 3237750, 3445184, 3442961, 3532832, 3561422, 3614513, 3839939, 3423173, 3853435, 3615755, 3852137, 3959978, 3754304, 3877246, 3686290, 3925616, 4141562, 4142020, 3984602, 4195498, 4278115, 3894354]
14444C894354M57643r9043N8292l04648N37979j11812L22915j28984K49885o5445
14434D811136J58314j56950J707L1522L04201m07741L67234j93341M13516o598
14424E323000J38952o2363L0130N7629K50663m8851J46616J92942j02390J01329
14414F027657N1806p9566K93474O2933L06335K12055l63353k9847K57573R7385
14404F836452J46421M04020J28831m9557k09425K61588K56242l27727O19379j92620
14394G873604K16687P6419J98517J0834O3591K58682k71608K39179M67793L51451
14384I485149j16965J82395j96260P14759J9284J30075M4784K99100K5411J57257
14374A0744989J7011P55562K4751M27442j22288J53528M11960K24091K94799J22770
$$ y = [3894354, 4351997, 4252954, 4311246, 4006598, 4544577, 4432765, 4755680, 4626696, 4876581, 4811136, 4969450, 4812500, 4814207, 4845729, 5149930, 4742189, 5109423, 4916082, 5329598, 5323000, 5461952, 5399589, 5429719, 5487348, 5738011, 5689160, 5835776, 6028718, 5926328, 6027657, 6079463, 5999897, 6293371, 6356304, 6662639, 6874694, 6511341, 6481494, 6739067, 6836452, 6982873, 7386893, 7515724, 7466167, 7256742, 7518330, 7774572, 7446845, 8066224, 7873604, 8090291, 8166710, 8365227, 8376061, 8439652, 8698334, 8426726, 8665905, 9133698, 9485149, 9368184, 9550579, 9354319, 10069078, 10088362, 10218437, 10263221, 10562321, 10587732, 10744989, 10762000, 11517562, 11542313, 11969755, 11847467, 12000995, 12412955, 12637046, 12931845, 13054615]
14364A3054615P7392M21669M80617k26665N78403L59116r0962K55091M25081L97270
14354A5731627r9385O05438M23308L60831L61247J80318N66660M96861j11236
14345A8515669Q61278M43623J66449P28451N88868J25076O82229O34991K40652
14336B2987286Q01955P15223O65853L21745N39637P77995Q99782Q08712P58059
14327B9276247Q27936O95762N71649J214187N27169J133112J083874J209383Q54137
14318C7393456J187538J090079J494116J052693J129270J642876J690636J601324
14310D8281988J550053J738679K095567J476470K135569K090887K149165K624116
14302F4142494K335212K464693K653830L316049K764126L257653L510751L623796
$$ y = [13054615, 13132007, 13553676, 14034293, 13807628, 14386031, 14745147, 14654185, 14909276, 15334357, 15731627, 15632242, 16237680, 16660988, 17021819, 17383066, 17563384, 18130044, 18626905, 18515669, 19376947, 19820570, 19987019, 20715470, 21304338, 21429414, 22111643, 22746634, 22987286, 23789241, 24504464, 25170317, 25492062, 26031699, 26809694, 27709476, 28518188, 29276247, 30104183, 30799945, 31371594, 32585781, 33112950, 34246062, 35329936, 36539319, 37393456, 38580994, 39671073, 41165189, 42217882, 43347152, 44990028, 46680664, 48281988, 49832041, 51570720, 53666287, 55142757, 57278326, 59369213, 61518378, 64142494, 66477706, 68942399, 71596229, 74912278, 77676404, 80934057, 84444808, 88068604]
14294H8068604L887174L888386M440129M703313M934662N183177N767051O140059
14286A27012555O413054O872190P044115P643224Q134501Q342662R253503R446548
14278A90162352J0319157J0898993J1554103J2073257J2936750J2792510J3580680
14271B74317802J3566338J4246074J3738407J4225594J4113279J3157204J2640470
14264C70005168J1938823J1628911J0561932Q835195P878099P472821L680831
14257D32001780K685914J460330J879736o92550o938940n666103q039984j1520105
14249D05170078j0731740j0789479j3339982j3388872j3728214j3881992j4355884
14242C14953915j3680477j3520593j3185285j2541003j2261771j1827179j1686528
$$ y = [88068604, 91955778, 95844164, 100284293, 104987606, 109922268, 115105445, 120872496, 127012555, 133425609, 140297799, 147341914, 154985138, 163119639, 171462301, 180715804, 190162352, 200481509, 211380502, 222934605, 235007862, 247944612, 260737122, 274317802, 287884140, 302130214, 315868621, 330094215, 344207494, 357364698, 370005168, 381943991, 393572902, 404134834, 412970029, 420848128, 428320949, 432001780, 434687694, 436148024, 438027760, 437335210, 430396270, 424730167, 416690183, 405170078, 394438338, 383648859, 370308877, 356920005, 343191791, 329309799, 314953915, 301273438, 287752845, 274567560, 262026557, 249764786, 237937607, 226251079]
14235B26251079j0987520j1574123j0970652j0143415r441334q747937q396604
14228A55989494p458608p432814o828852o561372n886404n391389n329964m810750
14220A06289341m933194m340959l964259m137039k844767l658103l266433l429627
14212G5714960k822373l169124k608019k299570k454932k081163k154381j546271
14204E6579127k288502j848408k082106j472231j327422j312990j306001j718169
14196D3223298j041638j842490j007662j043690m59776j379632j209829n74306
14188C4664275j302462j043910p10609o66446q37494j076436n69299o08410j082598
14179B6766611l68271n77826o94356r15816m79716m30965o11079n60450j74800
$$ y = [226251079, 215263559, 203689436, 192718784, 182575369, 173134035, 164386098, 155989494, 148530886, 141098072, 134269220, 127707848, 121821444, 116430055, 111100091, 106289341, 101356147, 97015188, 93050929, 88913890, 86069123, 82411020, 79144587, 75714960, 72892587, 69723463, 67115444, 64815874, 62360942, 60279779, 58125398, 56579127, 54290625, 52442217, 50360111, 48887880, 47560458, 46247468, 44941467, 43223298, 42181660, 40339170, 39331508, 38287818, 37828042, 36448410, 35238581, 34664275, 33361813, 32317903, 31607294, 30940848, 30103354, 29026918, 28457619, 27849209, 26766611, 26398340, 25820514, 25126158, 24210342, 23730626, 23299661, 22688582, 22128132, 21953332]
14170B1953332p38569n48571o25030l60368j17014l81355q84780m55602j94448
14161A7647595k51807n78695Q554k63896l22109n86130N230q07466J49467l80382
14151A4620361l72128l76537k31223p7576l14381k88142m42988L97854n00794
14142A2414446j15861l71280l02763r8104Q5907l26543k17618k27879k04926n71821
14132A0063558J32572r1312N5348n1838l98581k28994K33958o29829q2865j56828
14122H845189L57249o56855L50274m65804J0433j80925k64467Q3395n28024K1696
14112G572161J66824M9560k52055k09522K9713k85375K36912l24296N3874o5233
14102F972563j76231Q0887j52870j98026k08429K09410o03506K84171l93643N5808
$$ y = [21953332, 21214763, 20666192, 20041162, 19680794, 19563780, 19182425, 18297645, 17842043, 17647595, 17395788, 16817093, 16825647, 16561751, 16239642, 15653512, 15658742, 14851276, 15000743, 14620361, 14248233, 13871696, 13640473, 13562897, 13248516, 12960374, 12517386, 12915240, 12414446, 12298585, 11927305, 11624542, 11526438, 11612345, 11285802, 11068184, 10840305, 10635379, 10063558, 10196130, 10104818, 10160166, 10108328, 9709747, 9480753, 9714711, 9084882, 9002017, 8845189, 9202438, 8545583, 8895857, 8430053, 8440486, 8259561, 7995094, 8078489, 7550465, 7572161, 7738985, 7788545, 7536490, 7326968, 7356681, 7071306, 7308218, 6983922, 7037796, 6972563, 6796332, 6877219, 6724349, 6526323, 6317894, 6527304, 5923798, 6207969, 5814326, 5870134]
14092E870134K12409j42950n7434k50933P8343k88466L37724k95737j50388k2263
14082E290439O1202l3360r9820j69360Q6952j01513K13459m40576Q2043m5830
14072D843636k26177J95102j41688n8584k00217k54662N50447k35310k88735k19847
14062C963965K59642R0517j65623l38399K08272p5040K72122k31083l49126L66522
14052D001769k91887Q7247J2320j65735P9493J11447j69078R6455j30572K49085
14042C880544m83515J91802J66403j92715n2388m7935j38122k35249o1483J40740
14032C168082p6909K72378k83829k46764L07170j57506j86036k147j8792o3168
14022B712479J09869L66479j13156m28915Q8927p4969J07373l35032N7406L41190
$$ y = [5870134, 6082543, 5939593, 5882159, 5631226, 5709569, 5421103, 5758827, 5463090, 5312702, 5290439, 5351641, 5318281, 5218461, 5049101, 5136053, 5034540, 5247999, 4807423, 4889466, 4843636, 4617459, 4812561, 4670873, 4612289, 4412072, 4157410, 4707857, 4472547, 4183812, 3963965, 4223607, 4314124, 4148501, 3810102, 4018374, 3943334, 4215456, 3984373, 3635247, 4001769, 3709882, 3797129, 3809449, 3643714, 3723207, 3834654, 3665576, 3762031, 3631459, 3880544, 3397029, 3588831, 3755234, 3562519, 3510131, 3462196, 3324074, 3088825, 3027342, 3168082, 3091173, 3363551, 3079722, 2832958, 3140128, 2982622, 2796586, 2794439, 2775647, 2712479, 2822348, 3188827, 3075671, 2646756, 2735683, 2660714, 2768087, 2433055, 2490461, 2831651]
14012B831651k03583M4644P3056k64753j34933j54557L25121p9244r7821l42531
14002A997050L36386j44634o603J44971j8032j15151k30004L13331O918k35352
13992B048880n31K56090l98010L67427j34819k43826j68335N88059l57748K23267
13982B180454J81079K5526r1094Q0800K17015L16735M36440Q20537J841345K884208
13972H893045N335164J0594839N678355j0381261p199412m301622k052411j050951
13964E515746j069931n53311n80169P8090l75767P4401l79712j34364n3259k44927
13954B276797K06312J54968l37192j7408j69412K18116j43630l96322L8331j5235
13944A815325K7465n88J69365j37493j60329K40791k94714M44587l64970R7370
$$ y = [2831651, 2628068, 2672712, 2745768, 2481015, 2346082, 2191525, 2516646, 2437402, 2339581, 1997050, 2333436, 2188802, 2182199, 2327170, 2309138, 2193987, 1963983, 2277314, 2284232, 2048880, 2048349, 2304439, 1906429, 2273856, 2139037, 1895211, 1726876, 2314935, 1957187, 2180454, 2361533, 2387059, 2295965, 2376765, 2593780, 2910515, 3346955, 4167492, 6008837, 8893045, 14228209, 24823048, 30501403, 20120142, 12920730, 8619108, 6566697, 5515746, 4445815, 3892504, 3312335, 3390425, 3014658, 3089059, 2709347, 2574983, 2521724, 2276797, 2483109, 2638077, 2300885, 2283477, 2114065, 2332181, 2188551, 1792229, 1830560, 1815325, 1842790, 1842202, 2011567, 1874074, 1713745, 1954536, 1659822, 2104409, 1739439, 1836809]
13934A836809j92407J24104k9565N3003l0989o8989j41463K03853r403o3919O5557
13923A746591j21088J1558k13069J07402K4106J54088m39817o6948J80306R8083
13913A481212j39915J30378k89383J84395K78914N8559m8631k93335K23327O6956
13903A652477k05441K9309j51522L3337l9771L1597K34003n28380L00484j26289
13893A229804l6972K98591k45915K99325k42905j9268J90403k67608K87551m9460
13883A443546k41404j97005K51908K13382j74793k24061j49694J40995Q4760O2166
13873A209800l6403n4235q9746J23111R5421j4275k97272L07829k55586K42613
13863A231257l94651M68708r0599j67240k05216J82703j02218J3589K59949r7773
$$ y = [1836809, 1644402, 1768506, 1738941, 1791944, 1760955, 1691966, 1550503, 1754356, 1744953, 1681034, 1746591, 1625503, 1637061, 1423992, 1531394, 1555500, 1709588, 1269771, 1202823, 1383129, 1481212, 1341297, 1471675, 1182292, 1366687, 1645601, 1704160, 1655529, 1362194, 1585521, 1652477, 1447036, 1476345, 1324823, 1358160, 1318389, 1349986, 1583989, 1055609, 1356093, 1229804, 1192832, 1491423, 1245508, 1544833, 1301928, 1282660, 1473063, 1205455, 1493006, 1443546, 1202142, 1005137, 1257045, 1470427, 1295634, 1071573, 921879, 1062874, 1147634, 1209800, 1173397, 1119162, 1029416, 1152527, 1247948, 1233673, 936401, 1244230, 988644, 1231257, 836606, 1305314, 1214715, 1047475, 842259, 1024962, 922744, 936333, 1196282, 1098509]
13853A098509K19508j5095k74696l654m6935J66507j59533j14880K64765J04464
13843A238960l44815j34904J23391N30701E05033L84380r0186N713o1157K11005
13833I54788p7600M77305m11070n772L5997m07570O78221n19137l1241K62340
13823I56261k68305k67616M70807l7156k41471L14674k98741L47992m7402k06304
13813G22739L85732J1336l74634K99524m15173L64702L407l03726J97719j72167
13803G19459j37647M24053l91016J71958j37504R6710J36647m4927J01859j77060
13793G62532k8392K94236m63487L07055j68942j56445K86425j33616K74963k61855
13783G12474L2446K31359k55692N7509L4700j21823J06980J45682l42038K57926
$$ y = [1098509, 1318017, 1302922, 1028226, 1024572, 977637, 1144144, 984611, 869731, 1134496, 1238960, 894145, 759241, 882632, 1413333, 505033, 889413, 799227, 804940, 743783, 954788, 877188, 1354493, 943423, 937651, 973648, 566078, 1244299, 725162, 693921, 956261, 687956, 420340, 891147, 853991, 612520, 927194, 628453, 976445, 929043, 722739, 1108471, 1119807, 745173, 1044697, 629524, 994226, 997633, 693907, 891626, 719459, 581812, 1005865, 614849, 786807, 649303, 746013, 882660, 837733, 939592, 762532, 734140, 1028376, 564889, 871944, 703002, 546557, 832982, 699366, 974329, 712474, 744920, 976279, 720587, 778096, 812796, 690973, 797953, 943635, 601597, 859523]
13773H59523l1554j90518K19233L21568l25936k24607l3591q288B75702O67668
13763I43370l40877k41501Q7400M0366J63423K17453J99070k59930C34246K58650
13753E92896Q8889j92560J68295K97295k22364C46948N52815P033l10681l2147
13743E63968N4975K15813l6800l05361L67533l70614j65871L30194B65287L88416
13733F53703j75456J37883k79829J02871K80863j92404L00119l01795r5326K86990
13723G17619k7970j56148M8514j96525K9468L52207k56954P4596j14788j85377
13713B84642J99468B03931L53090Q6400N498J56867k16289o3685k58519M92401
13703G59694B91961K86553j45445q8894J6191J31559K63049k59827N4431n3649
$$ y = [859523, 827969, 637451, 856684, 1178252, 852316, 627709, 594118, 585830, 275702, 943370, 602493, 360992, 448392, 488758, 652181, 869634, 1068704, 808774, 334246, 592896, 681785, 489225, 657520, 954815, 732451, 346948, 899763, 906796, 596115, 563968, 618943, 834756, 797956, 492595, 860128, 489514, 323643, 653837, 265287, 653703, 478247, 616130, 336301, 439172, 720035, 527631, 827750, 525955, 430629, 717619, 689649, 533501, 582015, 385490, 414958, 767165, 510211, 584807, 470019, 284642, 484110, 203931, 557021, 643421, 648919, 805786, 589497, 525812, 267293, 759694, 291961, 578514, 433069, 344175, 360366, 491925, 754974, 495147, 549578, 495929]
13693D95929J75847j78320l7403k0379j32744L2055J59224Q8180K0620j66081
13683D36928j34273L3452J41667j33256A53229N0785M78865l32891J43364p9605
13673D13747J97850j53000r6176K58469r6875p7471j85168N69460j60533l2258
13663F38045p6955B20888J01556J41092j22295K02716k42931K09393n528o5366
13653D39525J64428B73441Q5194K7666O9185J77580K62487m14186L7622q4921
13643D34068J43400B29292L33050M1700k77459G6516J89781J0290P5512o4731
13633B87368J42838A62138J46486L218Q1356N676L2764J17931m8627B40633K63057
13622E03690A69178K89328O373J1302A76661K11579J37666j07941J95698r6129
$$ y = [495929, 671776, 493456, 456053, 435674, 302930, 334985, 494209, 582389, 603009, 436928, 302655, 336107, 477774, 344518, 153229, 204014, 682879, 349988, 493352, 413747, 611597, 458597, 362421, 620890, 524015, 446544, 261376, 830836, 670303, 638045, 561090, 220888, 322444, 463536, 341241, 543957, 301026, 510419, 504891, 439525, 603953, 273441, 358635, 386301, 455486, 633066, 895553, 481367, 518989, 434068, 577468, 229292, 562342, 604042, 326583, 76516, 266297, 276587, 352099, 287368, 430206, 162138, 308624, 311842, 393198, 398874, 431638, 549569, 500942, 240633, 503690, 169178, 458506, 464879, 476181, 176661, 388240, 525906, 417965, 613663, 517534]
13612E17534k07406H5758M725L29392j05060J91291j17124k5140J76171p7865
13602D62148N5943H4712L39796r2287Q7165l8641L14841j74543B8104K46972M3770
13591C18846L3200J2144A63585K69582j43809n5389G6177O3746M04664N424H4263
13579C41515L1245A85314K5411L05722r9610K23613l6373k01617m1365C3024b6135
13567D60150j74319J35285L7064o748j90043E9752M20513j2555J05039n3923q3403
13556D35423A7138K99644n1685N0378D8025L52883G0655L29297j88498j5900J72484
13545C68038J04L4192J25637j19589j44632l8714P9551j43422R7736n4851n456
13534A98594J11210L6063J21989A82483o5281K10367Q9426H5330J91613K0529
$$ y = [517534, 310128, 85758, 90483, 419875, 314815, 506106, 388982, 363842, 540013, 462148, 518091, 84712, 424508, 332221, 419386, 380745, 695586, 521043, 28104, 275076, 318846, 352046, 364190, 163585, 433167, 289358, 233969, 76177, 139923, 544587, 550011, 84263, 341515, 372760, 185314, 210725, 516447, 416837, 640450, 604077, 402460, 361095, 33024, -26135, 460150, 285831, 421116, 458180, 451432, 261389, 59752, 480265, 467710, 572749, 518826, 435423, 17138, 316782, 265097, 315475, 48025, 400908, 70655, 399952, 211454, 195554, 368038, 368142, 402334, 527971, 408382, 263750, 225036, 304587, 161165, 258901, 204050, 198594, 309804, 345867, 467856, 182483, 117202, 327569, 416995, 85330, 276943, 297472]
13524B97472A11921L00657j72701A19181J33312O3127m9768Q4230J06828M617
13514D61527j67957L8348j60244J24341A08976M9964J50758h7549B17798L6432
13504B54230L2455H1635K7443J53480L50116k81421J87184a21618I4869K23259
13494C18128A08587O84826l60822j26427J97494D9693M81360j75312J64902B09183
13483B34275B5889J00023K86175J69902a97034D20444j54082j04496J13430p2954
13473B02342K01719J04506A55345p5693J93319r0989L69727j55942B3933J27921
13463A51854J11614r7291M63576k95681j04990K12347A71802M9224d6916C74413
13452d8276L648B11502n9612m8845J31183a75706D75676k25943A01381a37320
$$ y = [297472, 111921, 412578, 239877, 119181, 252493, 315620, 265852, 350082, 456910, 461527, 293570, 331918, 171674, 296015, 108976, 158940, 309698, -87549, 217798, 254230, 286685, 81635, 109078, 262558, 612674, 331253, 518437, -121618, 94869, 318128, 108587, 793413, 432591, 306164, 503658, 49693, 531053, 355741, 520643, 209183, 234275, 25889, 125912, 412087, 581989, -197034, 420444, 266362, 161866, 275296, 202342, 404061, 508567, 155345, 79652, 272971, 181982, 551709, 395767, 23933, 151854, 263468, 166177, 629753, 334072, 229082, 441429, 171802, 221026, -46916, 374413, -48276, -44628, 211502, 151890, 103045, 234228, -175706, 475676, 249733, 101381, -137320]
13441B22613o3579N304m8517b84494B90893n4643L21255A11403M07816c5595I6622
13429I1358a4664D16326D1879J84926K1664q111J75295p4893F7655K18347K16779
13418E02781k49706J3829n205G2069a25823A13888N9360j596G9744K60740A47723
13406D62128B19675p2425D5773J52247g6325B89360o8819m7355J97158N8743E3112
13394G0124J78756J39322j56531D6299P9758k5694J05029r4461Q4279l5112J2631
13383A72729h2095B04239J67186a67584B6143J7242J99316N4348A46895M73472
13373F20367A20706M07644D891a8126C62307P3998j03767A0478K96311r7903L3220
13362B42106D8830L6247I597M71772C5215L28103A73747J35168M9724A07303J73933
$$ y = [222613, 159034, 164338, 115821, -284494, 290893, 236250, 557505, 111403, 519219, -35595, 96622, 91358, -14664, 416326, 41879, 226805, 248469, 240358, 415653, 340760, 67655, 286002, 502781, 253075, 266904, 261699, 72069, -125823, 113888, 173248, 171652, 79744, 340484, 147723, 462128, 219675, 147250, 45773, 198020, -76325, 289360, 220541, 173186, 370344, 429087, 53112, 70124, 248880, 388202, 231671, 46299, 126057, 100363, 205392, 110931, 195210, 160098, 172729, -82095, 204239, 371425, -167584, 26143, 43385, 242701, 297049, 146895, 620367, 120706, 528350, 4891, -18126, 362307, 436305, 332538, 10478, 306789, 208886, 242106, 48830, 85077, 9597, 481369, 35215, 363318, 173747, 308915, 358639, 107303, 281236]
13351B81236o213A1912J94926j8260d6907B99723O6354D1684K67997e7753l7897
13340i5650P354A61767m00l0739P1214g9549C37970E4764j9698J67568K8786J24665
13328C56085m0656R4625I1743K68207e1828A85512J31392j51434E2654a68259
13317B62267I4168J60772E0893c0722B28028D9322K69556r4244H6234O3568L0783
13306A80585G0235N58840C11008a50372C66992f2395A24916J90799J17782A43672
13295a59498L2293B93519O62J0759d5772C06203R9927A5567J5918a7941C05448
13283B83562j19965m9654d3317E48864f2795F760J87575a25296A47493J8730p6884
13272H9339a55774B79715K3890i814D32858G0900R1662J25154j08082F6000J73897
$$ y = [281236, 275023, 11912, 206838, 188578, -46907, 299723, 366077, 41684, 309681, -57753, -95650, -88296, 161767, 161367, 130628, 201842, -79549, 337970, 54764, 35066, 202634, 231420, 356085, 315429, 410054, 91743, 359950, -51828, 185512, 316904, 165470, 52654, -168259, 262267, 94168, 254940, 50893, -30722, 228028, 49322, 318878, 224634, 86234, 149802, 180585, 70235, 629075, 311008, -150372, 366992, -62395, 124916, 315715, 433497, 143672, -159498, -127205, 293519, 294181, 304940, -45772, 306203, 406130, 15567, 31485, -17941, 305448, 283562, 163597, 113943, -43317, 548864, -62795, 6760, 194335, -125296, 147493, 166223, 89339, -155774, 279715, 303605, -9814, 432858, 70900, 162562, 287716, 179634, 66000, 239897]
13261B39897l2975K56092n8230H1218K43977b21141A62975O9486o9634J79841
13251C42668J47849j47167H0894K77064i3857B2077O9373C1219L36892j29324
13241B38787O3494H2697L06587A51125B0086a02044E5805Q193J33451M5716A05342
13229B85566A01874h7228A03743K7336Q3169b4241B71752a80178L9110B72939
13218b135A33518j5296e7646C212L07935E785e077j300A83446a2558A61324f8316
13205B08747I0821G031Q4725K46750o2805j5474b45663a00045B59098J30395A53111
13193d9765B34286n3311a14602c0580B69095J62688A91403L09127a31084d536
13182F1024N599K95622A58987a6705n924r9683A7327J08596N7046f0019K6879
$$ y = [239897, 206922, 463014, 404784, 81218, 325195, -221141, 162975, 232461, 162827, 342668, 490517, 343350, 80894, 357958, -93857, 22077, 91450, 31219, 368111, 238787, 302281, 82697, 389284, 151125, 20086, -102044, 55805, 63998, 197449, 243165, 105342, 285566, 101874, -87228, 103743, 131079, 214248, -24241, 271752, -180178, -141068, 272939, -2135, 133518, 118222, -57646, 3212, 311147, 5785, -5077, -6377, 183446, -12558, 161324, -68316, 208747, 90821, 7031, 91756, 338506, 275701, 260227, -245663, -100045, 259098, 389493, 153111, -49765, 234286, 180975, -114602, -30580, 269095, 431783, 191403, 500530, -131084, -4536, 61024, 66623, 362245, 158987, -16705, -22629, -122312, 17327, 125923, 182969, -60019, -33140]
13171c3140A21999a48639A14644J10280i7460A22613P1399M6326j19532a90523
13160f9394A44625N9083J397K73387A78177p618k8797F3626g3159C0749D278L36183
13148C40461E306a34138K1147j05124C0869L6662J32475L4933L1248h8003C67235
13136A72296g3215a8943n6354H2934a6352n05580C6598O9672K76726d9712f915
13124a3553A23884H114K15721a0708B26194b4173j32604j35074B6392K92507A19236
13112B07373J06093f020k03014B07411J59773H531g2958C39104H6657K3664b06844
13100H4512i5663j09914D7387e4602A33688E2022a52534F2965a52562G3774P4025
13089A47799k5649h9421D7764K8749B2234J4486L6236e7900B46709E8867L608
$$ y = [-33140, 121999, -148639, 114644, 224924, -97460, 122613, 194012, 240338, 120806, -190523, -69394, 144625, 203708, 205105, 478492, 178177, 170559, 141762, 63626, -73159, 30749, 4278, 340461, 5306, -134138, -112991, -218115, 30869, 67531, 200006, 234939, 266187, -88003, 367235, 172296, -73215, -18943, -75297, 82934, -16352, -521932, 36598, 106270, 382996, -49712, -6915, -13553, 123884, 8114, 223835, -10708, 226194, -24173, -156777, -291851, 26392, 318899, 119236, 207373, 313466, -6020, -209034, 207411, 367184, 8531, -72958, 339104, 86657, 110321, -206844, 84512, -95663, -205577, 47387, -54602, 133688, 52022, -152534, 62965, -152562, 73774, 147799, 122150, -89421, 47764, 76513, 22234, 36720, 72956, -57900, 246709, 58867, 62475]
13078F2475g85r1635r6205C05288n4890A09330L09671d29036B01746R5772k2344
13067B75174j1931j23813g3101A45057N7428I2028q103a60128C18685j45816o6826
13056A06043c9796j22352A90409R2914j19734J41086A47390K4662Q072G9949a69311
13044a18855E574Q0316Q371b75682c0257A2640M1255J14053J48063p2499D7269
13032a22013D76505a74348N2413G4694J07241J20620e2370B88507A0222K0918
13022C1140J15590O0103i7573E1195J14506p1127l1667J92882I2652b4806C88348
13010C7913b50350B21657q2050R3625H2552N3351j333K48219j32480F7544P9322
12999A46866d5161B54592g6901q1455B02390n9656b31642a07570E9522L00474
$$ y = [62475, -785, -92420, -188625, 305288, 250398, 109330, 419001, -429036, 201746, 297518, 275174, 263243, 139430, -73101, 145057, 202485, 92028, 83925, -160128, 318685, 172869, 106043, -39796, -162148, 190409, 283323, 163589, 304675, 147390, 172052, 180124, 79949, -169311, -118855, 5574, 85890, 94261, -275682, -30257, 12640, 53895, 167948, 316011, 243512, 47269, -122013, 476505, -174348, -121935, 74694, 181935, 302555, -52370, 288507, 10222, 31140, 146730, 206833, -97573, 51195, 165701, 94574, 62907, 255789, 92652, -24806, 388348, 37913, -250350, 221657, 139607, 233232, 82552, 135903, 134570, 382789, 250309, 67544, 146866, -45161, 254592, -76901, -158356, 202390, 142734, -231642, -107570, 59522, 359996]
12989C59996g6244K3697A06658B5539K49233n4035I7257D5962a94473F9312P0047
12978A39359o7375q564a16192M2628I1350j5309R1134J02437e6813j14346A28236
12966A07732J45869b8950B32355i7653L9978j11133A48119j5j7261O8326k2836
12955A76333e1519r4414B73158b34606B06528i7388E87487G3748Q5361P4260P5889
12944C09258l4605D0049d04442E996a27785j4128m8445C543L4447c23455A31562
12932B4366a598j09553M1431E3714P5893j7098b761B61421d9815B30622i9813
12920a34289A680J90982c7605B15260B749J4338a82445k26883A16776p823j6997
12909I1956a22292C17296h056A99560K24987b54364A30280J71695B7693e647C7537
$$ y = [359996, -76244, -52547, 106658, 25539, 274772, 220737, 97257, 45962, -194473, 69312, 139359, 71984, 63420, -116192, -73564, 91350, 76041, 167175, 269612, -56813, -171159, 128236, 107732, 253601, -28950, 232355, -97653, -57675, -168808, 148119, 148104, 130843, 199169, 176333, -51519, -145933, 273158, -234606, 206528, -97388, 587487, 73748, 159109, 233369, 309258, 274653, 40049, -404442, 5996, -127785, -141913, -190358, 3543, 37990, -323455, 131562, 24366, -1598, -111151, -69720, 53714, 129607, 112509, -2761, 261421, -49815, 230622, -99813, -134289, 1680, 192662, -37605, 215260, 2749, 17087, -182445, -409328, 116776, 108953, 91956, -122292, 317296, -8056, 199560, 424547, -254364, 130280, 301975, 27693, -5647, 37537]
12897F6772J2672L6471P622J55292a24279A20931b37821K224c6507a3996p2536
12886h6532j48821a2820A06454A0885J41303n1468J2981k8450b7492k4771A77729
12874D9704p046J28293J3744B7294j647K07625D4867J91018b8350A66678a5447
12862A90410a50083A51891D4876H7J48473f7912C0347c55910I3993c90905A59658
12850g7998B02974n8835J22405q4846K5039j6682G8899a13732a9458n4639G25
12838A5715k374b38474K1755B25721C7808R9510o4802j5418J11498j7152d4119
12826b316j88386m2783A5895K53847a18054G4471d478j26588I3752i683A05820
12814d551l3432j80862A65501K4155l1928Q2490B831J33991M8401c55716B38483
$$ y = [66772, 79444, 115915, 123537, 278829, -124279, 120931, -237821, -235597, -36507, -13996, -86532, -235353, -12820, 106454, 10885, 152188, 100720, 113701, 85251, -27492, -52263, 177729, 49704, 42658, 170951, 184695, 27294, 25647, 233272, 44867, 235885, -28350, 166678, -15447, 190410, -150083, 151891, 44876, 87, 148560, -67912, 30347, -355910, 93993, -390905, 159658, -77998, 202974, 144139, 266544, 181698, 206737, 190055, 78899, -113732, -19458, -74097, 725, 15715, 13341, -238474, -216719, 225721, 37808, 137318, 72516, 57098, 168596, 151444, -44119, -2316, -190702, -233485, 15895, 269742, -118054, 74471, -4478, -131066, 93752, -9683, 105820, -4551, -37983, -218845, 165501, 189656, 157728, 240218, 2831, 136822, 185223, -355716, 238483]
12802a37480q5303R211A69114a17062m2824G6693P6181d8590B63600C5049r859
12791B5190k282b63560F9007J52963p3827N9778L3104b5508j90321B62214A30423
12779e5797j44861B40595J16575a95520c0194A13127a5407B64396j06542a66018
12768F4420e2430A28488K68014c2147A6019h1262C82116A16102O1334a50446C1090
12756c8D2838a80645j80041A6899K50449e2495l23917I4101J14978J18296j43109
12745A84266O847G9860b63066g6619B8922i7860E564L37304a33023B27911G3017
12733b59961C23459b79088l0652J29189b5844a0872A79793G9472N3726a42925
12722a98401C47887o2761d1519A84966G368J26024C1349M8709i3899A38204C3171
$$ y = [-137480, -222783, -213572, 169114, -117062, -159886, 76693, 152874, -48590, 263600, 35049, 25190, 22908, -263560, 69007, 221970, 148143, 207921, 241025, -25508, -215829, 262214, 130423, -55797, -200658, 240595, 357170, -195520, -30194, 113127, -15407, 264396, 157854, -166018, 64420, -52430, 128488, 396502, -32147, 16019, -81262, 382116, 116102, 177436, -150446, 31090, -38, 42838, -180645, -360686, 16899, 267348, -52495, -376412, 94101, 209079, 327375, 184266, 191113, 79860, -263066, -76619, 28922, -97860, 5564, 342868, -133023, 227911, 73017, -259961, 323459, -279088, -309740, -180551, -25844, -10872, 179793, 79472, 133198, -142925, -198401, 347887, 285126, -41519, 184966, 7368, 133392, 31349, 80058, -93899, 138204, 33171]
12710b4646l3112A04040R9029b32662A55370a41998A73463n0931b00191A71653
12699b17629A53057k4971P8923Q0892M7631A39147J58824L8252f2381C22640A8736
12687B83713m425J09710A11393J36837j01554m2172k5159J46239b45850E6008
12676a46897A69224b4623h994j36295n0086A11462i1873j47173B64948G6098K92869
12665C68967A71023o6987A8070K10659i0603j2647F2576K60290E5967q160R0693
12654A38500K81076A8003g1742E7829K55985G535M89490d3485A63052L7182N995
12643B06229b09809M7347C42474j05197a38033d4074m6464A29986K18504a87054
12632H0616b28266A30947M187J38085b2534B13384A3826L6812J32610b4644B31957
$$ y = [-24646, -57758, 104040, 203069, -232662, 155370, -141998, 173463, 122532, -200191, 171653, -217629, 153057, 128086, 207009, 287901, 335532, 139147, 297971, 336223, -62381, 322640, 18736, 283713, 279288, 388998, 111393, 248230, 146676, 104504, 79345, 225584, -245850, 56008, -146897, 169224, -24623, -8994, -145289, -195375, 111462, -91873, -239046, 264948, 76098, 368967, 171023, 104036, 18070, 228729, -90603, -103250, 62576, 322866, 55967, 47807, 138500, 419576, 18003, -71742, 57829, 313814, 7535, 497025, -43485, 163052, 200234, 206229, -209809, -162462, 342474, 237277, -138033, -44074, -90538, 129986, 348490, -187054, 80616, -228266, 130947, 135134, 273219, -22534, 213384, 13826, 50638, 183248, -24644, 231957]
12620h7766A52463P0446j9678b5288l150A80273K0708J5145N1614M6969A04612
12608c1183f901l75053B97338Q7908g2713H7585M9293a10513D5184h9349F8292
12596b06837A06431B2031O3393A7405L29952b86382E125d7947I4757J82869j37806
12585A39820a07A55823R196F5874Q5894D4483M59859B00493N999G0719J01216
12574A71935K4708k7386b14322p4089C33462a692A28296J31891f8707p7645D0670
12562b23284B18122h7035J7978C15870b84172g6994c2817r634D44980A54883b46185
12550a62621B92244a10840r5997C40996c6838A09901d36883A03174j4649d8060
12539B32143a69577j792f7761O144l62791P4203B26577h4566A81530G0093e4142
$$ y = [-87766, 152463, 222909, 203231, -25288, -28438, 180273, 200981, 216126, 267740, 314709, 104612, -31183, -6901, -381954, 297338, 385246, -72713, 87585, 136878, -110513, 45184, -89349, 68292, -206837, 106431, 22031, 85424, 17405, 347357, -286382, 5125, -47947, 94757, 277626, 139820, -107, 155823, 165019, 65874, 151768, 44483, 504342, 200493, 206492, 70719, 171935, 196643, 169257, -214322, -288411, 333462, -1692, 128296, 260187, -68707, -146352, 40670, -223284, 218122, -87035, -69057, 315870, -284172, -76994, -32817, -42451, 444980, 154883, -246185, -162621, 292244, -110840, -206837, 340996, -36838, 109901, -436883, 103174, 88525, -48060, 232143, -169577, -171369, -67761, -61617, -424408, -350205, 226577, -84566, 181530, 70093, -54142]
12527C54269A68683h467G9317J86826A4129K74898a97111B34720G189J14334c1113
12515G6079P8432J81880a90607i2110A18560c0704j26368C5670b56361g6969G8463
12503B06880E0433a58159c5756E1777b67985J21202G5471M7990a45802N047M9021
12492i1734F3858J05817K1531E3408b5019A13456c6394n2652l18184c4313r6066
12481a30379m0358A9436N0964e5297A48718K6216a22582A11914h0332a6137k62616
12470b78753e9240C866J361a0791j32457e014E3460O1777k755R7209c03341A93850
12457C45458c9725E5176R029A6661K37925a07915F6149L9560f19442F5633C2744
12445A96659h980B1164I844b46963B57695b23307B45075D6602O4170b24508H0124
$$ y = [354269, 168683, -8467, 79317, 266143, 14129, 289027, -197111, 234720, 7189, 121523, -31113, 76079, 154511, 336391, -190607, -92110, 118560, -30704, -157072, 35670, -256361, -76969, 78463, 206880, 50433, -158159, -35756, 51777, -267985, -146783, 75471, 123461, -145802, -140755, -91734, 63858, 169675, 191206, 53408, -25019, 113456, -36394, -89046, -407230, -34313, -130379, -170737, 19436, 70400, -55297, 148718, 174934, -122582, 111914, -80332, -16137, -278753, -59240, 3866, 5227, -10791, -143248, -5014, 53460, 115237, 112482, 209691, -303341, 193850, 345458, -39725, 55176, 64205, 16661, 254586, -107915, 66149, 105709, -619442, 65633, 32744, 196659, -8980, 21164, 9844, -246963, 257695, -223307, 245075, 46602, 110772, -224508, 80124]
12433d4602B9559c7769H7101a5113B53345H5443J34871F2091b57414B42868D7377
12421i6421K794d3348j8352B32479A6729J18328e1821A03672A3143M0732A5623
12409I6166e8497A5207J68496E3135k141a98644N5621f5373A75543a82965f5526
12397B2402b25122A77881n5237i7489B98116f1881j68038G0964B3911a54643P2027
12386h2616q4715A16921a62247e4178C6235C494j289d9960D21136a02972B21871
12374b38082J16789J3354d9459m6556I7100g3497B17925j06671a65721a5037j20755
12363a35792j068B38024A023J67883b32360A40777o3414a23416m284M1306J099
12352h5295G4945B5564a8135A30229b9508B65474K04910f0818l6385r8805B39638
$$ y = [-44602, 29559, -37769, 87101, -15113, 253345, 85443, 220314, 62091, -257414, 242868, 47377, -96421, -93627, -43348, -61700, 232479, 16729, 135057, -51821, 103672, 13143, 53875, 15623, 96166, -58497, 15207, 183703, 53135, 50994, -198644, -143023, -65373, 175543, -182965, -65526, 22402, -225122, 177881, 122644, -97489, 298116, -61881, -229919, 70964, 23911, -154643, -82616, -167331, 116921, -162247, -54178, 36235, 3494, 2205, -49960, 421136, -102972, 221871, -238082, -121293, -107939, -49459, -96015, 97100, -73497, 217925, 111254, -165721, -15037, -135792, -136860, 238024, 1023, 168906, -232360, 140777, 77363, -123416, -127700, -86394, -85295, 74945, 25564, -18135, 130229, -29508, 265474, 470384, -60818, -97203, -196008, 239638]
12340B4712L720N9417N8000J26358B4897d8540j3716H6669b1773B57797B6482
12328A33693j881l3590c3102n6665r1778P7376J3404j2157A23913J7651a73341
12316E4933g1901g702A77555J53895C0636d8316B88936d4294A16027e6698q7581
12305a44279A76717J09955a63904N9568A8435E987M63341k18348c5673q0991B04861
12293d11498B18204D7150i7844A18090l1187J90714G6463J00635L7942b70884
12282f0687A88555a37220B18131a70213l6158A93282Q760a19892H9485b0744A85198
12270B4744J13430n2965g3013r0779g0207A29966E184J85150P7308A14566j3838
12259A00728M36337B10758k3836o7403C4043a20877a5641j08910C098L10615r5019
$$ y = [24712, 28432, 87849, 145849, 272207, 24897, -48540, -62256, 86669, -21773, 257797, 26482, 133693, 131812, 98222, -33102, -89767, -181545, -104169, -90765, -102922, 123913, 141564, -173341, 54933, -71901, -7702, 177555, 331450, 30636, -48316, 288936, -44294, 116027, -56698, -144279, 176717, 286672, -163904, -104336, 18435, 5987, 469328, 250980, -35673, -116664, 204861, -411498, 218204, 47150, -97844, 118090, 86903, 277617, 76463, 177098, 215040, -270884, -60687, 188555, -137220, 218131, -170213, -206371, 193282, 202042, -119892, 89485, -20744, 185198, 24744, 138174, 85209, -73013, -163792, -70207, 129966, 5184, 190334, 267642, 114566, 100728, 537065, 210758, 186922, 119519, 34043, -120877, -15641, -124551, 3098, 313713, 218694]
12248B18694a11256m3788L8158A4270m780a29167A45652K12096h7171j74672A65213
12236A5476P1783c4795C47089a59892B68412F8161Q8783B8694a52080A35544A8185
12224B31036a34934D7915b5554k2054l633A76792p660a82404A78577m2179b49783
12212B3665N9020Q2858b8039C65012G7096j4981K50927Q8083q0802A58723J50937
12201C09660P1089F8496J82276K8951j22182K6310j0036c0548B31027c8366B20915
12189B94622A01073k1380M48414B62077b43945E8458K25035A24310K00049n0691
12179B73668F7691j5361K30708L0523j46124M07555B15469k0279A8657J86987
12169B05644R1586a23874A50804J55918j24505p2722m6563b26159R8548E29531
$$ y = [218694, -111256, -155044, -116886, 14270, 9490, -129167, 145652, 357748, -87171, -261843, 165213, 15476, 87259, -34795, 347089, -159892, 268412, 68161, 156944, 28694, -152080, 135544, 18185, 231036, -134934, 47915, -25554, -47608, -51241, 176792, 169132, -182404, 178577, 136398, -249783, 23665, 82685, 165543, -28039, 365012, 77096, 62115, 313042, 401125, 320323, 158723, 309660, 380749, 68496, 250772, 279723, 157541, 183851, 173815, -30548, 231027, -38366, 220915, 294622, 101073, 79693, 528107, 262077, -243945, 58458, 283493, 124310, 324359, 273668, 67691, 52330, 283038, 313561, 167437, 574992, 215469, 195190, 18657, 205644, 297230, -123874, 150804, 306722, 182217, 109495, 62932, -226159, -127611, 529531]
12158B65545i23j4755j02586B91235Q9624j36408c3190B70365C1529K01494f5359
12146B29863G8532b02317G9540J33703d19218A21863c4007A62468a31453K9604
12136a01849q101j10659j00995C29248l2621c17220Q5024R9726A57129j4333o2238
12125H0558b908D4382a59544A54658b0432H3678R3003D8354P9162K9094E9327
12113F9377k7406J4154b19005A35473a07168m3127m086C14253D0470b17351b5834
12101B08948r4759J8361a35026k71738J92106G4239k2893i5438A86335m9069K8685
12090A65951e1007p8401L151O1700B5479M9262a27683A96863a86830d1693l613
12079d5306B12859e5384j86992A715K37307A10204n2128b36833a03767n2167m5269
$$ y = [265545, -923, -15678, -118264, 291235, 380859, 244451, -33190, 270365, 31529, 233023, -65359, 229863, 78532, -202317, 79540, 213243, -419218, 121863, -34007, 162468, -131453, -101849, -109950, -220609, -321604, 329248, 296627, -317220, -232196, -132470, 157129, 142796, 80558, -2908, 44382, -159544, 154658, -20432, 83678, 176681, 48354, 127516, 156610, 59327, 69377, 41971, 56125, -219005, 135473, -107168, -150295, -154381, 314253, 40470, -217351, -25834, 208948, 114189, 132550, -135026, -406764, -214658, 74239, 51346, -95438, 186335, 137266, 165951, -51007, -129408, -126257, -64557, 25479, 74741, -127683, 196863, -186830, -41693, -45306, 212859, -55384, -242376, 1715, 239022, 110204, 58076, -236833, -103767, -155934, -201203]
12068b01203A30699a18426a3603p6034B64562r8394C9766K82830J17453N14487
12058I54536K94375m38273B47664a0936k1963k21508a8364B72800c15118I2229
12047h291G2921L66498b5552B72311E7336a00960A40426J9428K4552c10132a27112
12035b30103E704L17098n4115j9017A24376b33313j20996A38260H473f6444d62
12023d4601D91473a02658D16626a15858k28533A37309a94582P9023q6701d4164
12012c91098a85425M2027H6268L2113a45333f4131j24659B03293h3252B68762
12001h207B48217L0021a67084B0946N0076a46751j93041A62023c32341A29479
11990b4966A1149a24593A08963a13669A10701b12051H2643j9572c0524A38746
$$ y = [-201203, 130699, -118426, -13603, -89637, 264562, 166168, 39766, 322596, 440049, 954536, 1248911, 810638, 247664, -10936, -32899, -254407, -18364, 272800, -315118, 92229, -8291, 72921, 439419, -25552, 272311, 57336, -100960, 140426, 159854, 184406, -310132, -127112, -230103, 5704, 322802, 268687, 249670, 124376, -233313, -354309, 138260, 8473, -66444, -462, -44601, 491473, -102658, 416626, -115858, -344391, 137309, -194582, -115559, -202260, -44164, -391098, -185425, -143398, 86268, 118381, -145333, -64131, -188790, 203293, -83252, 268762, -8207, 248217, 278238, -167084, 20946, 71022, -146751, -339792, 162023, -332341, 129479, -24966, 11149, -124593, 108963, -113669, 110701, -212051, 82643, 63071, -30524, 138746]
11979e4587j46882O0606H8018M0834e4980A51924e1809k50400J26180K8596d4741
11967A81173H0487K4013j3207K14103k5731l1600a26281d1643A58080Q2005b26586
11955A00999C6444J26864H728b91987C2161c73922c5904A8640b82200G2165k4982
11944D7183b06650b6264j32517J7793D0677c2429I3973e8251D26755D3094a37982
11932A65543a28806G791O0951L8901A1210d11815a35527A27485n9413N3927E2133
11920B36509C597a93039B88762a85544L5136L8940r839A34995a63084P4581A9401
11908a05447M9227A4776R1107D738J97999I1047b68470F8312a14649k2892M6952
11897i0589E6240g9334A66912d380B0627b87449A00957B2940R0143b18176I0656
$$ y = [-54587, -201469, -140863, 88018, 128852, -54980, 151924, -51809, -302209, -176029, -147433, -44741, 181173, 80487, 104500, 91293, 305396, 279665, 248065, -126281, -41643, 158080, 240085, -226586, 100999, 36444, 163308, 8728, -291987, 32161, -373922, -35904, 18640, -282200, 72165, 47183, -206650, -26264, -158781, -140988, 40677, -32429, 93973, -58251, 426755, 43094, -137982, 165543, -128806, 7791, 68742, 107643, 11210, -411815, -135527, 127485, 68072, 121999, 52133, 236509, 3597, -193039, 288762, -185544, -150408, -111468, -121307, 134995, -163084, -88503, 19401, -105447, -56220, 14776, 105883, 4738, 202737, 91047, -268470, 68312, -114649, -137541, -90589, 56240, -79334, 166912, -4380, 20627, -287449, 100957, 22940, 113083, -218176, 90656]
11885f3838c67A08004b05503a00495G3425b92860a07941G7153j3858a20501A18441
11873C34442c21356k0765c0795k13409m6801i32k28068A61214c7948E4338j014
11862E3324a72032a3640B320K0931i5928j55478A26247L7549l8217B2196Q8623
11851A10819e1503m03969J38348a14564j65476J15571G9114c2449j44889g0819
11840a29992e5782n9206F0816b69201H8674K9878J99688a4295A201g0444b4979
11828E7512i3922C4212f3299k34781I6783F06a14974b3564j6195j58208B36509
11816b26408A27132d38398J42890A58370a25488N3588G4519b5945j01562a1476
11805B6988f4086n400B27804c2073k46303N0412A77573K620a13280k0157B5658
$$ y = [-63838, -367, 108004, -205503, -100495, 73425, -292860, -107941, 77153, 63295, -120501, 118441, 334442, -321356, -342121, -30795, -244204, -291005, -932, -229000, 161214, -37948, 54338, 53324, -172032, -13640, 2320, 23251, -95928, -251406, 126247, 163796, 125579, 22196, 110819, -51503, -455472, -317124, -114564, -280040, -164469, 79114, -32449, -177338, -70819, -129992, -55782, -114988, 60816, -269201, 88674, 118552, 318240, -14295, 1201, -70444, -24979, 57512, -93922, 34212, -63299, -298080, 96783, 606, -114974, -23564, -39759, -197967, 236509, -226408, 127132, -438398, -295508, 158370, -125488, -71900, 74519, -25945, -127507, -11476, 26988, -64086, -69486, 227804, -32073, -278376, -227964, 177573, 180193, -113280, -133437, 25658]
11793G1725J35379a04275F5536J02852F190c3255C99053d6239a5715F7792c71290
11781b49188A06666B5658a09081L0963G1177Q786a38033A27059J4964d13212K04040
11770b09172h8395A67639L6092a60073D1146a40708I8647a0987B12002F0944b54314
11758a88913A45417K0295i3435I3054e7281J4165c34H9657P4426B8078f1800j1918
11746g3718G841J8612J32666h4351H6009e7815j13k5726B9141K46526a43855l3137
11734a76992j18410e6002q5065l1953N5119j7787M6486A39520a52207b361r5536
11723i7897H3744K8198e41570a66234B01550p7068B9500d16820A29723n8835b265
11711B00550e6551r0752p3368C8556J47634p5103a99199f0416F7317K1712f3833
$$ y = [71725, 207104, -104275, 65536, 168388, 6190, -33255, 399053, -46239, -15715, 67792, -371290, -249188, 106666, 25658, -109081, -78118, 71177, 79963, -138033, 127059, 142023, -413212, -209172, -88395, 167639, 203731, -160073, 41146, -140708, 98647, -10987, 212002, 60944, -254314, -188913, 145417, 165712, -93435, 93054, -57281, -43116, -334, 89657, 164083, 28078, -61800, -73718, 7841, 26453, 159119, -84351, 86009, -57815, -57928, -83654, 29141, 275667, -143855, -176992, -295402, -56002, -141067, -173020, -117901, -135688, -89202, 139520, -152207, -2361, -97897, 83744, 111942, -541570, -166234, 201550, 124482, 29500, -416820, 129723, 70888, -2265, 200550, -56551, -147303, -220671, 38556, 186190, 111087, -199199, -60416, 67317, 89029, -63833]
11699C65516a82870G242d3807k5785J5883l8844A69391q2575r770e707B33661
11687A82955B7893a2217A97673L9296b41074B47964A01435P6166J23001b9167
11676C85508b48249B32213r1095b4180B7483a21437D04197I4043l9076J64359
11666B19326I8140b05860C10876G4016j6158J49645e0325I7527a3534E6334a26233
11654b82820A47678m430B4515J29951a47964A90806m0969b71780A18450J3772
11644A32222A1057J69471b4385A39911A1946Q1648R7056J45791e1138A61072J84175
11633C45247A00557k5247K15700P6764a09087C89538a3215A37200f9484r6665
11623a66149A15868A4071J0124Q1991b45529A51268L2252j31j3352c41007B16393
$$ y = [365516, -182870, 7242, -43807, -69592, -53709, -92553, 169391, 86816, 77046, -5707, 233661, 182955, 27893, -12217, 197673, 236969, -241074, 247964, 101435, 177601, 300602, -29167, 385508, -248249, 232213, 141118, -24180, 27483, -121437, 404197, 94043, 54967, 219326, 98140, -205860, 310876, 74016, 57858, 207503, -50325, 97527, -13534, 56334, -126233, -282820, 147678, 143248, 24515, 154466, -147964, 190806, 149837, -271780, 118450, 132222, 11057, 180528, -24385, 139911, 11946, 93594, 190650, 336441, -51138, 161072, 345247, 100557, 75310, 291010, 367774, -109087, 389538, -13215, 137200, -69484, -166149, 115868, 14071, 24195, 106186, -245529, 151268, 183520, 183389, 170037, -341007, 216393]
11611A24927N4319i9608o8961B02219D2730L1164J28582o3805b48892c9641A10125
11599a80085C75258a66271p8423A02836m8232f4956j61261h1277k45995f0264
11588A7786a04644E2756L3103A2698J09815a83269B21291a91893B14069a3140
11577A39457a39168E94965a49384B0654Q1696M6313o140J01548E2011J88261a51454
11565B80535p2161K5791b4436C13448j56005g8252B9519j3856c9665A34024b8856
11553B41326A07090R9083r8247K99850B390c2348B69581I6825J69137g9871B01565
11541h0012D34639A1124g0630A77307P9389A24212g0414A64800B238R1514h4457
11529A43182c0632C78955A7695K39213G1733c3203F1357J52415D7377J38302A0955
$$ y = [124927, 179246, -99608, -168569, 202219, 42730, 73894, 202476, 138671, -248892, -39641, 110125, -180085, 375258, -166271, -244694, 102836, 54604, -64956, -226217, -81277, -327272, -60264, 17786, -104644, 52756, 85859, 12698, 122513, -183269, 221291, -191893, 214069, -13140, 139457, -139168, 594965, -149384, 20654, 102350, 148663, 142523, 244071, 52011, 240272, -151454, 280535, 208374, 234165, -24436, 313448, 157443, -78252, 29519, 15663, -39665, 134024, -28856, 241326, 107090, 206173, 107926, 407776, 2390, -32348, 269581, 96825, 265962, -79871, 201565, -80012, 434639, 11124, -70630, 177307, 256696, 124212, -70414, 164800, 2238, 93752, -84457, 143182, -30632, 378955, 17695, 256908, 71733, -33203, 61357, 213772, 47377, 185679, 10955]
11517A19456L10078A0757K92719j31998L9266m7987K76448b32283C54051a54417
11506G5086N8033R7794e2740A87311K28125B7164a40508G6540d9765B59291O4708
11495C23999A36055h0342b7198a2318A26450J86306h1481A31401L5365k9525K63866
11484D01107A95951q3735l9441J76134A3545d23896h6378L1976B47710d4919C86907
11472B48151K00821A29805j9995k2791a6781B84625b0152B654M1634K98993f1004
11460B55836P4455A04105J35136r8656K91030h31j13094b1475A72492a36850A99170
11448a01451B75518j34240E689b1780B8579J4518J45675D2588P7250J51810A30699
11436A32613J65144A12403K2876a5311o4301A85092g1528D18765j50722F642J86994
$$ y = [119456, 429534, 10757, 303476, 171478, 210744, 162757, 439205, -232283, 354051, -154417, 75086, 133119, 230913, -52740, 187311, 415436, 27164, -140508, 76540, -49765, 259291, 323999, 136055, -80342, -27198, -12318, 126450, 312756, -81481, 131401, 166766, 137241, 401107, 195951, 112216, 72775, 248909, 13545, -423896, -86378, -54402, 247710, -44919, 386907, 248151, 448972, 129805, 109810, 87019, -16781, 284625, -20152, 2654, 44288, 343281, -61004, 255836, 330291, 104105, 239241, 140585, 431615, -831, -113925, -21475, 172492, -136850, 199170, -101451, 275518, 141278, 5689, -21780, 28579, 43097, 188772, 42588, 119838, 271648, 130699, 132613, 297757, 112403, 135279, -15311, -79612, 185092, -71528, 418765, 268043, 6642, 193636]
11425A93636m9093a64059g4045c0911k1015a825B06193K54349h0876A18907k843
11414A16064B6833a49145O9295D7067a06297C1996a42015G6858c2720j63730A00567
11402A32409b28135e5956A96080L9177G1613J62857K1380a68304h1524j26752
11392b08276B70653C0547b60368C44588g7501J4777C53512p0492L72319a54652
11381A02627i531m4758A33388D373a29486d6697B04310f1640C0204J45951j5159
11370A60996b04163A5246a34416q5037a1856H9502c082A322J85979a10049A15183
11358C01694f9826a7176E2245e8058m8281A09074D2316K43145a27276m7876O2218
11347a12934j14221G2141h2433j75710b6485j34516M5026C4037d4420j42464a5909
$$ y = [193636, 144543, -164059, -74045, -30911, -51926, -1825, 206193, 460542, -80876, 118907, 116064, 26833, -149145, -79850, 47067, -106297, 31996, -142015, 76858, -32720, -196450, 100567, 132409, -228135, -55956, 196080, 235257, 71613, 234470, 255850, -168304, -81524, -208276, 270653, 30547, -260368, 344588, -77501, -62724, 353512, 283020, 655339, -154652, 102627, -9531, -54289, 133388, 4373, -129486, -46697, 204310, -61640, 30204, 176155, 160996, -204163, 15246, -134416, -219453, -11856, 89502, -3082, 1322, 187301, -110049, 115183, 301694, -69826, -17176, 52245, -58058, -106339, 109074, 42316, 285461, -127276, -175152, -112934, -227155, 72141, -82433, -258143, -26485, -161001, -115975, 34037, -44420, -186884, -15909]
11335d5095k90778B01299h1331R807j01399B57496m7734c4708B94560I1295M2275
11324A33570b98273a32016k10241A26486c25630h9854k54883J22762H2895A2367
11313c45364g6065l3869A66461c5964A29029a83146I1831J21839j3645i3476p0795
11302a64271p0493h2504K7229n9175r9190F084b6445n6469B1099O2588C7534b1261
11289e1464j36116B63057C4159k911K8390J00350a97595P4037A80441J17630i8394
11277a19771a7008k8564j8057K9553D4770M3821K7548a36324b139A49994d0715
11265b0550j3993m13023K00706J19038J7124d0290k51339d3120A10288N306e1672
11253a63007L7638G5900a78891C14091c94194B2802J05620D0106O1877a21031
$$ y = [-45095, -335873, 201299, -81331, -71524, -172923, 257496, 209762, -34708, 294560, 91295, 133570, -298273, -132016, -342257, 126486, -325630, -89854, -344737, -221975, 82895, 12367, -345364, -76065, -109934, 166461, -35964, 129029, -183146, 91831, 213670, 200025, -93476, -164271, -234764, -82504, -55275, -114450, -213640, 6084, -26445, -82914, 21099, 83687, 37534, -21261, -51464, -187580, 263057, 34159, 31248, 59638, 159988, -197595, -123558, 180441, 298071, -98394, -119771, -17008, -45572, -63629, -34076, 44770, 88591, 116139, -136324, -2139, 149994, -40715, -20550, -34543, -447566, -246860, -127822, -110698, -40290, -291629, -43120, 110288, 115594, -51672, -163007, -125369, 75900, -178891, 314091, -394194, 22802, 128422, 40106, 101983, -121031]
11242B52423b00941N509h1662I6860f713G1952h9771A26149a93598j96416A26368
11230B33957p6557b09430I7870a9899A25970J0263J22455I7545d7375A3214J41515
11219A54729M0338B0469L69910d5539q6348q8707B70661b50243A25166b95149
11208a85447b8504m2714D27570c32944a8343I311K68127a73558d0804A66593g5821
11196A22442b60772B39655g844q673j14523F9635e5374A22944a98013i7987A38287
11184b73223A56113D0970N3774g3380k7601O702j22252P4288f6860K7138q6088
11173a25810l16893a57358e0125D6078b20054E3592L6490K67628a57272d1421
11162A03875e9424A02391j5065a87432K9325q0703B08900l5054c6183O21j86383
$$ y = [252423, -200941, -195432, -81662, 96860, -6713, 71952, -89771, 126149, -193598, -390014, 126368, 233957, 157400, -209430, 97870, -19899, 125970, 136233, 258688, 97545, -47375, 13214, 154729, 195067, 20469, 390379, -45539, -131887, -220594, 270661, -250243, 125166, -295149, -185447, -28504, -71218, 427570, -332944, -18343, 9311, 277438, -173558, -40804, 166593, -75821, 122442, -260772, 239655, -7844, -16517, -131040, 69635, -55374, 122944, -198013, -97987, 138287, -273223, 156113, 40970, 94744, -73380, -100981, -94279, -216531, -142243, -66860, -39722, -125810, -442703, -157358, -50125, 46078, -220054, 53592, 90082, 357710, -157272, -41421, 103875, -59424, 102391, 87326, -187432, -158107, -238810, 208900, 173846, -36183, -35562, -221945]
11151b21945a0046B3090b48283C0289c78560E6872a67445A72857d7037J4962B81883
11139H2907J40642M8209d80123A8443a19001A17058J797b52612A77827f036k672
11128h708l85603G5410f6850A39975b05533R0594j23234A62716b29991b4811B19780
11116C9351J31621J10067G5809J76018b2855k13683e396D0601a22385M7368H0751
11104A67195q0331L8370L00037j71214a41150F3348L7385a66447O2816B42749
11093G3340K67935A14987E3548Q5929A6392J70198K0144b8463k6161B26536H5679
11081G1499J64162A01129K89874j41285r9355L39584k29244J64044p7039a66016
11070D01717p9982a28732B07646K8462Q5412j07276E2542K12914K73143e5864
$$ y = [-221945, -10046, 23090, -248283, 30289, -378560, 56872, -167445, 172857, -47037, -32075, 281883, 82907, 223549, 271758, -480123, 18443, -119001, 117058, 118855, -252612, 177827, -6036, -8708, -394311, 75410, -66850, 139975, -205533, -114939, -238173, 162716, -229991, -24811, 219780, 39351, 170972, 281039, 75809, 251827, -22855, -236538, -5396, 40601, -122385, -75017, 80751, 167195, 86864, 125234, 425271, 254057, -141150, 63348, 100733, -166447, -103631, 242749, 73340, 341275, 114987, 53548, 139477, 16392, 186590, 206734, -28463, -54624, 226536, 85679, 71499, 235661, 101129, 391003, 249718, 150363, 489947, 260703, 424747, 347708, -166016, 401717, 321735, -128732, 207646, 236108, 321520, 214244, 52542, 265456, 538599, -55864]
11059D14080p2367J80178j42276k6700j05530K7444J00595J41016k06520K21300
11049E31220j60973j0976O2291j17916J12228k5420L26516q9858k52536N5993
11039D30569L65973N0801l58405J42576n9399J93736j29007N69N5915N0320J20353
11028H64001l71816j26879J94860o6760J28286q2087l1764K42564P2259D07517
11017I32960m56075J81866J18475j94718K11975K80836j76293C72174M27846j75710
11007F24310j81961M6601j30405L33303k07904J61128O2033j73467J08253p1146
10997E70745K89248l62477J24308O9208k49972J15768p7553K2918K70784j20628
10987F52349P9665k94455K54820K07959k37779m151J64893k52293K39186j79030
$$ y = [414080, 341713, 521891, 379615, 352915, 247385, 274829, 375424, 516440, 309920, 531220, 370247, 359271, 421562, 303646, 415874, 390454, 716970, 627112, 374576, 430569, 796542, 847343, 488938, 631514, 572115, 765851, 636844, 637413, 693328, 743648, 864001, 492185, 365306, 560166, 493406, 621692, 539605, 507841, 750405, 822664, 407517, 932960, 476885, 658751, 777226, 582508, 794483, 1075319, 899026, 372174, 800020, 624310, 442349, 488950, 358545, 691848, 483944, 645072, 707105, 533638, 641891, 570745, 859993, 497516, 621824, 691032, 441060, 556828, 479275, 502193, 772977, 652349, 732014, 437559, 692379, 900338, 662559, 658408, 823301, 571008, 810194, 631164]
10977F31164l456j7629J12569L4746j7273j29264M02262p0402j87229J85231K69211
10966A209930j76992M41387O1288j02204L4265K13627r3913O79446Q9363J47848
10956B504045J08243K56723n57688M6900k01837J07830l84237j68491N5125P2566
10946A839179k98885M29702n8622k32930L05484k99928j47434j76832L6505k73268
10936A122971l45962k39048J13584J37116l70280p9619j6821L25535B15671Q8278
10926C03949o9159q5467c4406p7308M7848A13137M06C0862J18586a34882c1059
10914G5663r375K04639d7311p1918B2992P5731a4344C7066e0666B51622b35259
10902I342a12161c4424k4312m4492j87309f0733B4321K3232b68028J25625C83120
$$ y = [631164, 627708, 610079, 722648, 757394, 740121, 610857, 1013119, 942717, 755488, 940719, 1209930, 1032938, 1474325, 1535613, 1433409, 1467674, 1681301, 1587388, 2266834, 2356197, 2504045, 2612288, 2869011, 2311323, 2358223, 2156386, 2264216, 1879979, 1711488, 1766613, 1839179, 1540294, 1969996, 1911374, 1678444, 1983928, 1684000, 1536566, 1359734, 1396239, 1122971, 777009, 537961, 651545, 788661, 418381, 338762, 321941, 647476, 215671, 303949, 234790, 149323, -34406, -111714, -63866, 113137, 113543, 30862, 149448, -134882, -31059, 75663, 66288, 270927, -47311, -119229, 22992, 98723, -14344, 37066, -50666, 251622, -235259, 9342, -112161, -34424, -58736, -103228, -290537, -60733, 24321, 47553, -268028, -142403, 383120]
10890B4606O3449h2006B4714i5383K2960p2060f2143K2611j7570K2490B21694
10878b89533h432A80685K69387c15144D6137d2670G6919b18693H0564a96644E056
10866E67369a67424A18061m8629e6236j1977B45999h9991A2075J69454K1539J52957
10855C56025h2578M337j33923R8877J2309j0862C05631c49797F6699c19977A2603
10843B05362i6205k12562h6159A43541R3952F1375K2068a14266A45693k3827i190
10831A24680g8393j1454j22526A66655i1627A55980J79m8402a02650A68818c8577
10819B08631d2377A79819p8699g9361C6527b7851n4475J5757j62945a03865p406
10808a11271J2489B25799q4205c05594J28336A65286a17136f493A54449j8250
$$ y = [24606, 88055, -82006, 24714, -95383, -72423, -144483, -62143, -39532, -57102, -34612, 221694, -289533, -8432, 180685, 450072, -315144, 46137, -42670, 76919, -218693, 80564, -196644, 5056, 567369, -167424, 118061, 69432, -56236, -68213, 245999, -89991, 12075, 181529, 203068, 356025, -82578, -78241, -212164, -113287, -100978, -111840, 305631, -349797, 66699, -319977, 12603, 205362, -96205, -308767, -86159, 143541, 237493, 61375, 83443, -114266, 145693, 121866, -9190, 124680, -78393, -89847, -212373, 166655, -91627, 155980, 156159, 107757, -102650, 168818, -38577, 208631, -42377, 179819, 101120, -79361, 36527, -27851, -82326, -66569, -229514, -103865, -111271, -98782, 225799, 141594, -305594, -177258, 165286, -117136, -6493, 154449, 136199]
10798A36199D7618j3732e6942k60195A5441a46912D1969a21755I4774a82748K8041
10787a54707J1665D3433a11207F12c6493I734a1607B49789b99518a14742d0998
10775a32065f0313o9773K6521k2063A2696l353e1771G073J20773k337K83386f5481
10762c1590J1215p3037k21660B51099K8371a00897k5693F8223e2381F8015J70929
10751B38944I5760i2515c8398A07550M9643a34166N5965q9608A65197A8198b45713
10739b8854j16524B56978J09614b05731D5R103g1235B09499b38197C0260i0383
10727H5710O3323m1727d79239B76958c70067a68614g4296o2556e3721A74600G6610
10715A40735E2231h0539b909l32913A29065a47746D257c55256F7122J00923a80600
$$ y = [136199, 47618, 33886, -56942, -317137, 15441, -146912, 41969, -121755, 94774, -182748, -154707, -143042, 43433, -111207, 612, -36493, 9734, -11607, 249789, -299518, -114742, -40998, -132065, -60313, -130086, -103565, -125628, 12696, 9343, -51771, 7073, 127846, 125509, 408895, -65481, -31590, -20375, -93412, -315072, 251099, 279470, -100897, -126590, 68223, -52381, 68015, 238944, 95760, -92515, -38398, 107550, 157193, -134166, -78201, -167809, 165197, 18198, -245713, -28854, -145378, 256978, 366592, -205731, 45, 9148, -71235, 209499, -238197, 30260, -90383, 85710, 149033, 107306, -479239, 276958, -370067, -168614, -74296, -136852, -53721, 174600, 76610, 140735, 52231, -80539, -2909, -335822, 129065, -147746, 4257, -355256, 67122, 168045, -180600]
10703g7658A73626m1340a58137p0668K8117b6292j12242A01979J5947J76716G1331
10691a67755D8212M9987b45665B25726R8854A22302C0131J18721J32727n79g3211
10679c74579a19998j34526I7239a16958I4959a78543A3506a66486E0658c8158
10668I2484b74113A32035k9055h8880o8348I5086a20684a0905A31237J963b837
10656C5716a74494A0147K81483G452c04965a5438k08312e9513c722l01173A60762
10644a46036J6364D3589J24209b89415a03307N023j43970I7276A1525a34986B8263
10632A99500b0518g178j37352l4241A46183b89128C2540Q3334C294J69575q1356
10621I1513c50388D5106i6829B86845i870j64376r8437A53456a22177A77200b05552
$$ y = [-77658, 173626, 132286, -158137, -228805, -200688, -26292, -138534, 101979, 117926, 294642, 71331, -167755, 48212, 98199, -245665, 225726, 324580, 122302, 30131, 148852, 281579, 281000, -73211, -374579, -119998, -254524, 97239, -116958, 94959, -178543, 13506, -166486, 50658, -38158, 92484, -274113, 132035, 102980, -88880, -157228, 95086, -120684, -10905, 131237, 133200, -2837, 35716, -174494, 10147, 291630, 7452, -304965, -15438, -223750, -59513, -3722, -304895, 160762, -146036, -129672, 43589, 167798, -289415, -103307, -98284, -242254, 97276, 11525, -134986, 28263, 199500, -20518, -7178, -144530, -178771, 146183, -289128, 32540, 115874, 3294, 172869, 91513, -350388, 45106, -96829, 286845, -9870, -174246, -272683, 153456, -122177, 177200, -205552]
10609g9277l1873J3988E3984i0008A71877b97318A05063a13257j31915A36774
10598G6602b65358B86960b51645A69808a9290B1753e4831I4844c85616h4715B4537
10586a98098A94108b38545Q9974D2583f8686d988m59463h409D8402K520a93291
10574a5301j41256A08025J64581a35569k92514a8404q4482A0323e0109F7346M7901
10563A15247c16063J32833j82335K4299C38416F4616B4937c95283A24396M3480
10553A67876d4354N709G5698q703N5925a64835M0098C429a24962K7409F8478a45936
10540h8369A78537a16795a5211B3340b60955A97840g3881A12204a44893b98j46896
10529a47194j29526f3202l22237J85445B3260c99585G436a04579A18123Q2329
$$ y = [-79277, -111150, -97162, 53984, -90008, 171877, -297318, 105063, -113257, -245172, 136774, 76602, -265358, 286960, -251645, 169808, -19290, 21753, -54831, 94844, -385616, -84715, 24537, -198098, 194108, -238545, -148571, 42583, -68686, -4988, -464451, -8409, 48402, 50922, -193291, -15301, -156557, 108025, 272606, -135569, -428083, -18404, -102886, 10323, -50109, 67346, 115247, -316063, -183230, -365565, -341266, 338416, 64616, 24937, -395283, 124396, 167876, -44354, -38645, 75698, 66995, 122920, -164835, -124737, 3429, -124962, -97553, 68478, -145936, -88369, 178537, -116795, -15211, 23340, -260955, 197840, -73881, 112204, -144893, -298, -147194, -276720, -63202, -385439, -199994, 23260, -399585, 7436, -104579, 118123, 200452]
10519B00452k5833b92375a42163j05351c6468j9807b3824p3825B60970c4231j4346
10508d8577m2983H5839a38106l03168A11056B3586J39142b16010B5460c14447
10497b68284N5019A94390J28670a63827L3780k06325C2286O4197j7635B0285e1724
10485d3428B72805j0918a34509M4565k03480l5834A58657h7454F2035P3732o0847
10474G4920L8538c6376L759A35300K8433O5745J00429J40646M1621L6198k70572
10463B77800J43939a63139A44396k4839J12251j14414c1729r6061j20232b2767
10452B45155a46645j80938c2164F4308d3680A39796a6574n9451F6818a50728C26033
10440D1233M9769J92634n8325a22341H5302O0783b9988j52085A83750d7656j3846
$$ y = [200452, 174619, -292375, -142163, -247514, -36468, -56275, -23824, -97649, 260970, -34231, -48577, -91560, 85839, -138106, -441274, 111056, 23586, 162728, -216010, 25460, -314447, -268284, -213265, 194390, 323060, -163827, -130047, -336372, 32286, 96483, 78848, 20285, -51724, -43428, 272805, 261887, -134509, -89944, -293424, -329258, 158657, -87454, 62035, 135767, 74920, 113458, -36376, -32617, 135300, 163733, 229478, 329907, 470553, 512174, 548372, 277800, 421739, -163139, 144396, 119557, 231808, 117394, -31729, -127790, -248022, -22767, 245155, -146645, -327583, -32164, 64308, -43680, 139796, -16574, -76025, 66818, -150728, 326033, 41233, 91002, 283636, 225311, -122341, 85302, 146085, -29988, -182073, 183750, -47656, -61502]
10429f1502p14B90568D5678a24125g200j87648M0459O4603A01617b50742F0126
10417c5090l3939A47409o2245J28947p816c94060e2379H8879A3235a84397j39011
10406c23408A01034a92711A40570b01491H0441b00748j72293J33540I1285K4520
10396A15805a7210l23344A01141M0764L4203Q2561a02945k6354K7272b9243F2648
10384A41472J75688B5289O197P5510e9878A49926g9830J5260I0849R8412I0271
10372b75135R4627B22896O3247H2615j8161J25563a79062B05423k5056M9323A8126
10360A60882p594J39345R1109A71506n7222a0676A29599N08182j10141B28935
10349D91118o3567F9982K03145B1640K59926O1750A65781G9029J62971L5885J85055
$$ y = [-61502, -62216, 290568, 45678, -124125, -7200, -194848, -154389, -89786, 101617, -250742, 60126, -35090, -69029, 147409, 85164, 214111, 206295, -394060, -52379, 88879, 13235, -184397, -323408, 101034, -192711, 140570, -201491, 80441, -200748, -373041, -239501, 91285, 115805, -17210, -340554, 101141, 141905, 176108, 258669, -102945, -129299, -102027, -29243, 62648, 141472, 317160, 25289, 31486, 106996, -59878, 149926, -79830, -64570, 90849, 189261, 90271, -275135, -180508, 222896, 286143, 82615, 64454, 190017, -179062, 205423, 180367, 229690, 18126, 160882, 153288, 292633, 383742, 171506, 114284, -10676, 129599, 637781, 527640, 228935, 491118, 427551, 69982, 273127, 21640, 281566, 343316, 165781, 79029, 242000, 277885, 462940]
10338D62940a57298A11144M55819m0529A97131L22383j00260k02563J92519j26872
10328B82338J10300A05585B9474R6636l5152N84794C26652A27350J30168m9881
10318B07637H7313M5655e4620E2588I236J06385E3503J42572M9990J07375I0869
10306E5017d6773A63504N2771I2816c8626A73030A5441K40216J1722k1062J6126
10295B62443d8961B07453o307C1033P9353a25901G5638g5916A75137i648A50085
10283D49778E629a85868H0566c9493M490A99026h5961d0860p1634d0851k20479
10272b61330J28223e5780A10642e3026H8904b52944J17013B85621C6750a8192
10261B68469f7513k71495J30772G5706N0674a28278A72038l469p1400e7245p8229
$$ y = [462940, -157298, 111144, 566963, 526434, 197131, 519514, 419254, 216691, 409210, 282338, 392638, 105585, 29474, 126110, 90958, 675752, 326652, 127350, 257518, 207637, 87313, 132968, -54620, 52588, 9236, 115621, 53503, 196075, 246065, 353440, 90869, 55017, -46773, 163504, 216275, 92816, -38626, 173030, 15441, 255657, 267379, 246317, 262443, -48961, 207453, 201146, 31033, 110386, -125901, 75638, -75916, 175137, -9648, 150085, 449778, 5629, -185868, 80566, -39493, -35003, 199026, -85961, -40860, -112494, -40851, -261330, -133107, -55780, 110642, -53026, 88904, -252944, -135931, 285621, 36750, -18192, 268469, -67513, -339008, -208236, 75706, 126380, -128278, 172038, 168569, 97169, -57245, -135474]
10250a35474N9439k08833a8654k8625A35168l0774J93133A22146K59242K47260
10240F28648A58651l5959M835N5245a56872B39703r335q0770J0204l4459A2205
10228A00466a55547A5728a43457B1971a51154A19434a11475A17387b31001f8155
10217i0188B07955F1999e5948G3982a55663B2811a22895A9231H897M4619J21155
10206A74671F546N0200g3051I9000k6529L0743O5566a67027C9980e8247j21122
10195a79369l8314B10096E1497a86300N8403F3170J10652a00327A0254P9829k4179
10184F5904D865a56984B04101n9186f7388j17865n5607K4755H478c4027n7697
10173i1724j17584h8933k88786R9004g4294l490j32071h1915m1638p7801k36239
$$ y = [-135474, -76035, -284868, -18654, -47279, 135168, 104394, 297527, 122146, 381388, 628648, 158651, 122692, 127527, 182772, -156872, 239703, 230368, 149598, 159802, 125343, 12205, 100466, -155547, 15728, -143457, 21971, -151154, 119434, -111475, 117387, -231001, -68155, -90188, 207955, 61999, -55948, 73982, -155663, 22811, -122895, 19231, 8897, 53516, 174671, 6546, 56746, -73051, 99000, 72471, 103214, 168780, -167027, 39980, -58247, -179369, -217683, 210096, 51497, -186300, -127897, 63170, 173822, -100327, 10254, 90083, 65904, 4865, -156984, 204101, 144915, -67388, -185253, -240860, -216105, 8478, -34027, -91724, -209308, -88933, -377719, -278715, -74294, -77784, -209855, -81915, -123553, -201354, -437593]
10162d37593C48897H2758b53767A8603i7820n378b1314j15569q851k13645H9364
10150g2809k33442k5620E6059c21740B78448B660g7987j59856c1375k01132J03625
10139a28882e5367B27459F9741i7842C18849d87468a65427F6024j5702f4950A7264
10127F4201a80963l955j14715c3210A35049a84249a4741j90457F7526M1419b2230
10115a02641D2934b45769h9703l14242A09557n4141b07123B83823G3130c62507
10104a35049m1408A05576B9922b85533H0957P4700c72805A74450a80857d1964
10093c86810a10585B76475a14296o6542Q3293k36003J11317H863Q377a78015E7501
10081e5525n6915j89031B0378b09587L9961e5066l8395K3578o1776B58037d64741
$$ y = [-437593, 348897, 82758, -253767, 18603, -97820, -103198, -21314, -136883, -145734, -359379, 89364, -72809, -306251, -331871, 56059, -321740, 278448, 2660, -77987, -237843, -31375, -232507, -128882, -55367, 227459, 69741, -97842, 318849, -487468, -165427, 66024, 50322, -64950, 17264, 64201, -180963, -184918, -299633, -33210, 135049, -184249, -14741, -205198, 67526, 108945, -22230, -102641, 42934, -245769, -89703, -403945, 109557, 55416, -207123, 283823, 73130, -362507, -135049, -176457, 105576, 29922, -285533, 80957, 155657, -372805, 174450, -180857, -41964, -386810, -110585, 276475, -114296, -180838, -97545, -333548, -222231, 8863, 17240, -178015, 57501, -55525, -112440, -301471, 20378, -209587, -169626, -55066, -93461, -69883, -131659, 258037, -464741]
10069A85611K3720a37126N9370j59733J15414j44248e6639C360e9931B11634a41762
10057a85314C3928d37955a25230C83801b12631Q3882a8083I2143R3684b6291j17793
10046a44084E2681g5169C2007b2563A3816e9140j8042A34356o2043a01801B5938
10034a9726G6649b17406D7973O131Q8686h5825j5674l5527B26422a81105C486
10022b68273B02548b244m2031k52847l48476b19230h8523B35086a29035k8677
10012a57712d5793i545E1692g1735j06476G1742k9836a23040c7334O9k69598j2269
10000c19132A0722a13357B8994b39867g4826H6442c6355A97532b06474A63832
9989c07288F7919a74579j59283P2595A8185b77851a19409A1998c27239b3670n3672
$$ y = [185611, 209331, -137126, -77756, -237489, -122075, -266323, -56639, 3360, -59931, 211634, -141762, -185314, 33928, -437955, -125230, 383801, -212631, -128749, -18083, 92143, 185827, -26291, -144084, 52681, -75169, 32007, -22563, 13816, -59140, -77182, 134356, 72313, -101801, 25938, -19726, 76649, -217406, 47973, 54104, 142790, -85825, -101499, -137026, 226422, -181105, 3486, -268273, 202548, -2244, -44275, -297122, -645598, -219230, -88523, 235086, -129035, -157712, -45793, -9545, 51692, -71735, -178211, 71742, 41906, -123040, -37334, -37265, -306863, -319132, 10722, -113357, 28994, -239867, -74826, 86442, -36355, 197532, -206474, 163832, -307288, 67919, -174579, -333862, -261267, 18185, -277851, -119409, 11998, -327239, -23670, -77342]
9978g7342j91890A41762F8278J12760o3935b99386f925l44704a63427j8993J85
9967a82235D735J23119g4148f66j00754a147k35774j15860H827J24980a54130
9955D9497a71366f8842j67653A59741a3941k5404k01844J16471j06925j74601
9945d06244a62526c4864j20327A82644K6751b39711a14710A02732j7468a74754
9934a50431I543b83154d0383A32027g1293G4900K06984b21675R5290r4184a04473
9922a83362l6130b2941H173M292b47664o0969N7616f9414B94326h9920l6122o1002
9910a87044A61806a76227E6994B111K35382b46779k8028A55524f5875B20156e0880
9898b60303b0124l45057A98772q7644a88844C39447h6442b4863j07181G1430b11316
$$ y = [-77342, -269232, 141762, 68278, 181038, 117103, -299386, -6925, -351629, -163427, -182420, -182235, 4735, 127854, -74148, -666, -101420, -1147, -236921, -352781, 8827, 133807, -154130, 49497, -171366, -68842, -236495, 159741, -13941, -39345, -241189, -124718, -231643, -406244, -162526, -34864, -155191, 182644, 209395, -239711, -114710, 102732, 85264, -174754, -150431, 9543, -283154, -40383, 132027, -71293, 74900, 281884, -221675, -126385, -220569, -104473, -183362, -219492, -22941, 8173, 12465, -247664, -308633, -251017, -69414, 294326, -89920, -126042, -187044, 161806, -176227, 56994, 2111, 237493, -246779, -274807, 155524, -65875, 220156, -50880, -260303, -20124, -365181, 198772, 111128, -188844, 339447, -86442, -24863, -132044, 71430, -211316]
9886a36334e5603r3781N0608l0212L298a8127r8770j1081B66564f4505I0906A9745
9873c77171A12105b1356A63064a17388j53417R6372P605B81618c6900j85428q3235
9862c05563A11661n0129J03268b47639j11448A02275E003a45118G1945Q444f0029
9850H6652q400d9174a5561k47453E2846b3090E0571K25979e3349D3899a64443
9838d8533k3688m8312D5313b3398a313j07362B8198J9897m276J41854a56091C0579
9825d6954j95127E5438b48076a5066B51790B145c03482I0602m1507c20194a27914
9813A73486a27075e9966B22843o0902b67402A06680f5583k7044l4513o3404j32815
9802c23359G1057g9298k97949A56210k3014b46637A71308K5362c78421i0724k88427
$$ y = [-136334, -55603, -149384, -98776, -128988, -125690, -18127, -116897, -127978, 266564, -64505, 90906, 19745, -377171, 112105, -21356, 163064, -117388, -270805, -174433, -166828, 281618, -36900, -222328, -305563, 111661, 61532, 164800, -247639, -359087, 102275, 5003, -145118, 71945, 80389, -60029, 86652, 78252, -49174, -15561, -263014, 52846, -23090, 50571, 276550, -53349, 43899, -164443, -48533, -72221, -120533, 45313, -23398, -1313, -108675, 28198, 48095, 43819, 185673, -156091, 30579, -46954, -242081, 55438, -248076, -15066, 251790, 2145, -303482, 90602, 49095, -320194, -127914, 173486, -127075, -59966, 222843, 161941, -267402, 106680, -65583, -92627, -127140, -190544, -323359, 71057, -79298, -377247, 156210, 133196, -246637, 171308, 196670, -378421, -90724, -379151]
9791c79151J84791N2955q1268e0418H380c31718B03574a7858r8798J5188H0893
9779f2851j68334j84200c7189j28330H8777a58294a7298B15279A496c95374f5195
9767c13869e1703k29749C25034D2632b13430L6588d2956l92206a58590A77389
9756a39943B74405b45079i0521A16702a64688B63370a95817j2274B54536H6123
9745a48882c9375A57568G6307b60505a27250r3914j65R7909E9781P2086a02059
9733C3698J80410A04955B7703d9005A98481c9227j49537d4769E2959O085D273
9721a78993p5083O679p387B46900a81429c5781j01741A63369M6068a72966D9213
9709B2810a03345l78503e9491D2535a46438G0023C2496f5980A04990b34625D7567
$$ y = [-379151, -194360, -141405, -222673, -50418, 8380, -331718, 203574, -17858, -116656, -101468, 80893, -62851, -231185, -415385, -37189, -165519, 88777, -158294, -17298, 215279, 1496, -395374, -65195, -313869, -51703, -281452, 325034, 42632, -213430, -176842, -42956, -435162, -158590, 177389, -139943, 274405, -245079, -90521, 116702, -164688, 263370, -195817, -208091, 254536, 86123, -148882, -39375, 157568, 76307, -260505, -127250, -221164, -221329, -123420, 59781, 131867, -102059, 33698, 214108, 104955, 27703, -49005, 198481, -39227, -188764, -44769, 52959, 59044, 4273, -178993, -254076, -247397, -254784, 246900, -181429, -35781, -137522, 163369, 209437, -172966, 49213, 22810, -103345, -481848, -59491, 42535, -146438, 70023, 32496, -65980, 104990, -234625, 47567]
9697A96533A950a46522D7084b65183O7307b0844j30272r5000Q5493L1716k00186
9686c29093A11275C6066J72739r2032l7713b92067J25309K1109I7289b60340a29672
9674F7067b29882C1593b63708B0334O7805l9688b24116B67495F9164a11243B355
9662d6175B00382f8182A0395N8295b3964m1383G8923a69020C0188a17777j25145
9651b42922B43745c63539J62385A15246e05585a77092n2847A53698a79216Q6110
9641i3106E8910A1558J44595O2500a29849o3642g5528c3612A63333b74732N8480
9630b16252A29213a52279I012b69462a16251b5434o8730c8252m6316B5029d89121
9618C0549a77272A5641G506J81347g6881a7582n9535C1602a22334M329m0213n2265
$$ y = [196533, 1950, -146522, 47084, -265183, -197876, -20844, -151116, -246116, -160623, -128907, -329093, 111275, 36066, 208805, 116773, 79060, -292067, -166758, -145649, 97289, -260340, -129672, 67067, -229882, 31593, -263708, 20334, 88139, 48451, -224116, 267495, 69164, -111243, 2355, -46175, 200382, -68182, 10395, 68690, -23964, -65347, 78923, -169020, 30188, -117777, -242922, 243745, -363539, -201154, 115246, -505585, -177092, -229939, 153698, -179216, -93106, 58910, 11558, 156153, 218653, -129849, -193491, -75528, -33612, 163333, -274732, -216252, 129213, -152279, 9012, -269462, -116251, -25434, -94164, -38252, -84568, 25029, -489121, 30549, -177272, 15641, 7506, 188853, -76881, -17582, -77117, 31602, -122334, -118005, -158218, -210483]
9606b10483k20948D4771f3267K170A36193o3836b70981a5788l7115j56174B39644
9594c6018B58441j09241a25592D25627a3926l350A02818a08551A86901d7411j03892
9583a51303L7731l8277G4950H156d24272a01081k2460A51993d8439k00605E5017
9571b78958a4931j6562o6957k30461h3905C719a20204B04745E9639N7891E5761
9559a93426j70329a52139d8844G0723i4086n3045e6737n4951l0172B14318a43670
9547A34997b19284O9383k25989d0058q5286A83586C1596L8092P0855a06495A2246
9535f5569j38645f0319m6315E8551e6178H4183g4023K4516j28014k3916k4702
9524b26139A0314a75581c2027k7338e772j58025N5841j08767g4841B12794K1867
$$ y = [-210483, -431431, 44771, -63267, -61097, 136193, 72357, -270981, -15788, -52903, -209077, 239644, -36018, 258441, 149200, -125592, 425627, -13926, -17276, 102818, -108551, 186901, -47411, -151303, -113572, -151849, 74950, 8156, -424272, -101081, -123541, 151993, -48439, -249044, 55017, -278958, -14931, -31493, -98450, -328911, -83905, 3719, -120204, 204745, 59639, 117530, 55761, -193426, -363755, -152139, -48844, 70723, -94086, -147131, -56737, -111688, -141860, 214318, -143670, 134997, -219284, -149901, -375890, -40058, -125344, 183586, 31596, 69688, 140543, -106495, 12246, -65569, -204214, -60319, -106634, 58551, -56178, 84183, -74023, -49507, -177521, -201437, -226139, 10314, -175581, -32027, -59365, -5772, -163797, -107956, -216723, -74841, 212794, 234661]
9513B34661B7988K31617C3864d4248j62696A7946E109b12462r0782R6133h2357
9501a4144k52388I1777g042B39001a05378A682a26009A54667a6289A8383c00146
9489A4698l841d42383I7021h8252k32220b2636A16803b33639e2743j03820B0994
9477D4697a12605j85586e7249b6109j21933j80690h7829D1365c65141j39832b26930
9465b00134C3415K91093b36264D6592M7192g5049l78046A62652a36540A49815
9454i2436K5609K5368j5290r3409j79320J61086a6866m3043H6359f4842A55177
9442e7595G051b05486r7762R5962D4467c76101R3196B89906b03967i8426d1542
9430d22845D0659a86389B07818n0720g0508B50573E7078b11322N5819j00268A27870
$$ y = [234661, 27988, 259605, 33864, -44248, -206944, 17946, 5109, -212462, -303244, -207111, -82357, -14144, -266532, 91777, -7042, 239001, -105378, 1682, -126009, 154667, -16289, 18383, -300146, 14698, 10857, -442383, 97021, -88252, -320472, -22636, 116803, -233639, -52743, -156563, 20994, 44697, -112605, -298191, -57249, -26109, -148042, -328732, -87829, 41365, -365141, -504973, -226930, -200134, 33415, 324508, -236264, 46592, 93784, -75049, -453095, 162652, -136540, 149815, -92436, -66827, -41459, -56749, -150158, -329478, -168392, -16866, -59909, 86359, -64842, 155177, -57595, 7051, -205486, -303248, -207286, 44467, -376101, -282905, 289906, -203967, -98426, -41542, -422845, 40659, -186389, 207818, 157098, -70508, 250573, 57078, -211322, -155503, -255771, 127870]
9418A55647o7900a06888l8145o0126f7630K3953m4968J7650n0266j8285B84a65645
9405d38560b898j15867C8583b11446A80951J46995F3373c7080k23617C09635A34044
9393b37082B94366c83700I8475a49171D4326b13130N7477c2585j69505c7706r8062
9382a35768M052A27974a97081H6215a10474A33895a74143D4459b5515k5711M012
9371d7214j34342e3161B6490J43726Q1868a34130j60060a12896p6759M7842q7793
9360b29606a297A01242f4849C11165j46102j3667a38558a8465B06034c9024k88095
9349c27119i7310B1019N4903a76008I0697C9788c25918c8248a3557j05764j07477
9338b26798a08534B6492a80003l5041N4034m2014F6197a5731B3445O0669i2767
$$ y = [155647, 87747, -106888, -145033, -205159, -67630, -43677, -88645, -70995, -121261, -139546, 284, -165645, -438560, -2898, -118765, 38583, -211446, 180951, 327946, 63373, -37080, -260697, 309635, 134044, -237082, 294366, -383700, 98475, -149171, 44326, -213130, -155653, -32585, -202090, -37706, -135768, -131716, 127974, -197081, 86215, -110474, 133895, -174143, 44459, -25515, -51226, -47214, -181556, -53161, 26490, 170216, 252084, -134130, -294190, -112896, -189655, -141813, -229606, -1297, 101242, -64849, 311165, 165063, 151396, -138558, -18465, 206034, -39024, -327119, -97310, 21019, 75922, -176008, 90697, 39788, -325918, -38248, -13557, -119321, -226798, -108534, 26492, -180003, -215044, -161010, -203024, 66197, -15731, 23445, 84114, -92767]
9326B72333c23665a61819o3980d2552C07356b17432p632a11399A34782a46258
9315C7485b9924C2573h6298H5563c00901M0917A08562L1936K1292A1106K73810
9304B84916b59214J19967A24569i142A46150N7574a23628N5116j85157Q6020k0114
9293a87763D5167f3793p7695G748J3384L92h5692D9687J54436a43306f7477k04561
9281b72038c1695J1105F0975a77701f862D4653H02J56774c75538A71012c2897
9269B769J70179A9839K6007N6190e1510j13825D8478d3697k00996c0154n5117
9258h5271l27960A53480b30584j60696f8788j13353j611F5581c78901a77218j02745
9247b79963a00738c1561m4459j71524C965c01669A83836a85330a0253l69306a5803
$$ y = [272333, -323665, -161819, -225799, -42552, 307356, -217432, -225064, -111399, 134782, -146258, 37485, -29924, 32573, -86298, 85563, -300901, -259984, 108562, 140498, 161790, 11106, 284916, -259214, -139247, 124569, -9142, 146150, 203724, -123628, -68512, -253669, -167649, -187763, 45167, -63793, -141488, 7748, 21132, 21524, -85692, 49687, 204123, -143306, -67477, -272038, -31695, -20590, 60975, -177701, -6862, 44653, 802, 157576, -375538, 171012, -32897, 2769, 172948, 19839, 45846, 102036, -51510, -165335, 48478, -43697, -244693, -30154, -85271, -413231, 153480, -230584, -391280, -68788, -182141, -183752, 65581, -378901, -177218, -279963, -100738, -31561, -76020, -247544, 3965, -301669, 183836, -185330, -10253, -379559, -15803]
9235a33447d0711j48962B31286o6303E3993c23589e2032F3403c56070a29819A36890
9223b67463g1295l2949j5819F0320a4930D3105i3062n1189A06695a24368k45832
9212c70200E8126b4223q5945F4613i1480j1795A37366a19189n410l7469c0668
9200f8865A39076l7664j5477h7523b8775k17817B01467c09890a40615G3679a09300
9188A61940a44253j03624N4143D9011b19225i9725r998C27399j02039c8715K009
9177c6706H8961g1036m7509C01408h0921A04515h541q9061j66775A06540c9044
9165d8166j0024B23050j08117b70098j57693a84548M5144d8757a2050n7605p6122
9154a45777A18354a41879k75941a1869k39622M1823B35781A0896J68655b9084
$$ y = [-133447, -40711, -189673, 231286, 164983, 53993, -323589, -52032, 63403, -356070, -129819, 136890, -267463, -71295, -104244, -120063, 60320, -14930, 43105, -93062, -144251, 106695, -124368, -370200, 58126, -24223, -110168, 64613, -91480, -103275, 137366, -119189, -124599, -162068, -30668, -68865, 139076, 101412, 85935, -87523, -28775, -246592, 201467, -309890, -140615, 73679, -109300, 161940, -144253, -247877, -193734, 49011, -219225, -99725, -109723, 327399, 225360, -38715, -36706, 88961, -71036, -118545, 301408, -80921, 104515, -8541, -97602, -264377, 106540, -39044, -48166, -58190, 223050, 114933, -270098, -427791, -184548, -139404, -48757, -12050, -69655, -145777, 118354, -141879, -417820, -11869, -251491, -209668, 235781, 10896, 179551, -29084]
9143b66572f1370J9022r743D9779h0212G8499a45622a405n4099D61982b34621
9131c15766c1766A18755c35367F1969N9926b26199C7448O3137J85252a93870C03429
9119h6514L252c3354p0161a8402A23872l8863b46803L1694b6116j92008q4598
9108c02722J46626A63094l5444n5035a58068O538N2294E2910O6336a06931A42582
9096E32629D9012g188j78243B5552b58605f0946F8057a34506f0355r3829B6294
9084g0371b4218c802A21237F0372b59921A72214J32180b7503k38860D3840c44841
9072a75509d2242A13654b34483p5498B93969b96080A72936a64689P2381c0832
9061a67616H0476a17040m834k0794j6866B31739a96965A80574H5392A2816L6933
$$ y = [-266572, -61370, -42348, -52091, 49779, -80212, 78499, -145622, -1405, -55504, 461982, -234621, -315766, -31766, 118755, -335367, 61969, 121895, -226199, 37448, 100585, 285837, -193870, 303429, -86514, -83262, -33354, -103515, -18402, 123872, 85009, -246803, -215109, -26116, -218124, -302722, -156096, 163094, 127650, 72615, -158068, -151530, -99236, 52910, 119246, -106931, 142582, 532629, 49012, -7188, -185431, 25552, -258605, -60946, 68057, -134506, -60355, -154184, 26294, -70371, -24218, -3802, 121237, 60372, -259921, 172214, 304394, -27503, -266363, 43840, -344841, -175509, -42242, 113654, -234483, -309981, 293969, -296080, 172936, -164689, -92308, -30832, -167616, 80476, -117040, -121874, -142668, -159534, 231739, -196965, 180574, 85392, 12816, 49749]
9050D9749J89716d7544C23295a78011o9995p2359B25660c7662J7104k6311l94046
9039d40915G040c852E751a49327L7860j95595g5969E3177a76366B0431b70513
9027f3911H838a06444k15047D2069h0795L5569f230k828m24937G9756d13693J79403
9015b34290B11825q2639a10253j5340A2584a92590j38553A84361M1292m0675a6108
9003a97881E6M7334c5765H4352e7936J3499B075a23384m8426A89915q8757D1311
8990a34298c1502k0710p2519c7976B69358b50771M9049I7478a45767D536d3540
8978D0234L9921L0463Q1530a20329A50980n5977f2000k05924D7176J35736d60107
8966A8426a38772n324B98579i0330B5533f27434C57388h3942d084k14868J09361
$$ y = [49749, 239465, -47544, 323295, -178011, -248006, -320365, 225660, -37662, -20558, -46869, -440915, 7040, -3852, 5751, -149327, -111467, -307062, -75969, 53177, -176366, 20431, -270513, -63911, 8838, -106444, -321491, 42069, -80795, -45226, -6230, -9058, -433995, 79756, -413693, -234290, 211825, 129186, -110253, -125593, 12584, -192590, -331143, 184361, 225653, 184978, -16108, -197881, 56, 47390, -35765, 84352, -57936, -44437, 2075, -123384, -171810, 189915, 101158, 41311, -134298, -31502, -52212, -124731, -37976, 269358, -250771, -201722, 97478, -145767, 4536, -43540, 40234, 80155, 110618, 192148, -120329, 150980, 95003, -62000, -267924, 47176, 182912, -460107, 18426, -138772, -144096, 298579, -90330, 25533, -627434, 357388, -83942, -4084, -218952, -109591]
8955a09591J9584o8434L4220k78277L6064a72421e8985b9209C16369l5154h5662
8943A55177J81179j10582a5652j46247D3219b36821J07987o2207l4096P7876m6716
8932a93977K9486G1283a85935A43745g7290B62181h5454C151a23012A8853a64525
8920B18243F0121M5601b5787a1961A31683K44484b5603D33911r1923J14302N08888
8909I65178L85300J042205J784099N203752k365389C061448j509813o87853j05796
8900G57986k91449k19338j11387o6634h1311B82563o1308J00585Q5225b48148
8889D22990a25669A56252J09406a25523G7143e5995B10972i2553F5367i1523b4805
8877B91136a2980A22374a2538k39370n3034g0184c4592k6136k37407B37310d4066
$$ y = [-109591, -90007, -158441, -124221, -402498, -366434, -172421, -58985, -29209, 316369, 281215, -85662, 155177, 336356, 225774, -15652, -161899, 43219, -236821, -128834, -191041, -225137, -147261, -193977, -164491, 71283, -185935, 143745, -77290, 262181, -85454, 3151, -123012, 18853, -164525, 218243, 60121, 105722, -25787, -11961, 131683, 376167, -25603, 433911, 341988, 456290, 965178, 1350478, 2392683, 4176782, 9380534, 7015145, 3061448, 1551635, 863782, 757986, 466537, 247199, 135812, 69178, -81311, 282563, 221255, 321840, 407065, -248148, 422990, -125669, 156252, 265658, -125523, 77143, -55995, 210972, -92553, 65367, -91523, -24805, 291136, -12980, 122374, -12538, -251908, -304942, -70184, -34592, -60728, -298135, 237310, -44066]
8865B92039b98105H2746a75014C8517L35297e4691n9464l2850I3907c42680K4592
8854c18088e4369j57755g7982a5457m04652I0937A1480c43354j51764A53225a70570
8842a72376N9715d79p5432B3041K41574f9934B11225a74366j91262h2253k85769
$$ y = [292039, -298105, 82746, -175014, 38517, 373814, -54691, -114155, -147005, 93907, -342680, -318088, -54369, -212124, -77982, -15457, -420109, 90937, 11480, -343354, -495118, 153225, -170570, -172376, -112661, -479, -75911, 23041, 264615, -69934, 211225, -174366, -365628, -82253, -368022]
$$ [...]
##END NTUPLES=NMR SPECTRUM
##END=
