
##TITLE=AC1007_S-149_6114592_zZLpfeKMET
##JCAMPDX= 6.0         $$ Bruker NMR JCAMP-DX V2.0
##DATA TYPE= NMR SPECTRUM
##DATA CLASS= NTUPLES
##ORIGIN= BRUKER
##OWNER= Administrator
$$ 1.72 TOPSPIN		Version 2.1
$$ 2012-05-14 18:12:24.031 -0500  Administrator@TOPSPIN
$$ Compression mode = diff/dup
##.OBSERVE FREQUENCY= 400.13188235
##.OBSERVE NUCLEUS= ^1H
##.ACQUISITION MODE= SIMULTANEOUS (DQD)
##.ACQUISITION SCHEME= undefined
##.AVERAGES= 64
##.DIGITISER RES= 22
##SPECTROMETER/DATA SYSTEM= spect
##.PULSE SEQUENCE= noesygpps1d.comp
##.SOLVENT NAME= COFFEE_meoh
##.SHIFT REFERENCE= INTERNAL, COFFEE_meoh, 1, 14.96673
##AUDIT TRAIL= $$ (NUMBER, WHEN, WHO, WHERE, PROCESS, VERSION, WHAT)
$$ ##TITLE= Audit trail, TOPSPIN		Version 2.1
$$ ##JCAMPDX= 5.01
$$ ##ORIGIN= Bruker BioSpin GmbH
$$ ##OWNER= Administrator
$$ $$ C:\Bruker\TOPSPIN/data/COFFEE/nmr/AC1007_S-149_6114592_zZLpfeKMET/12/pdata/1/auditp.txt
$$ ##AUDIT TRAIL=  $$ (NUMBER, WHEN, WHO, WHERE, PROCESS, VERSION, WHAT)
(   1,<2012-05-14 18:12:19.125 -0500>,<Administrator>,<TOPSPIN>,<go>,<TOPSPIN 2.1>,
      <created by zg
	started at 2012-05-14 18:00:48.953 -0500,
	POWCHK enabled, PULCHK disabled,
       configuration hash MD5:
       AF F2 23 6B 01 CD 40 DD E5 A1 38 A0 06 EA F7 77
       data hash MD5: 64K
       29 85 86 C3 8F 7B 80 93 82 EC 46 0B 22 36 9D 1B>)
(   2,<2012-05-14 18:12:22.140 -0500>,<Administrator>,<TOPSPIN>,<proc1d>,<TOPSPIN 2.1>,
      <Start of raw data processing
       efp LB = 0.3 FT_mod = 6 PKNL = 1 PHC0 = 0 PHC1 = 0 SI = 128K 
       data hash MD5: 128K
       86 E2 7F E6 57 FB C6 96 39 16 9B 6A AF 24 97 19>)
(   3,<2012-05-14 18:12:23.296 -0500>,<Administrator>,<TOPSPIN>,<proc1d>,<TOPSPIN 2.1>,
      <pk PHC0 = 34.57947 PHC1 = 0 
       data hash MD5: 128K
       9E 6B 9D 5B 8F 81 73 E3 1C DF E3 A5 DC D9 9F 38>)
(   4,<2012-05-14 18:12:23.718 -0500>,<Administrator>,<TOPSPIN>,<proc1d>,<TOPSPIN 2.1>,
      <abs ABSG = 1 
       data hash MD5: 128K
       8C 8B 6B D7 36 2E A2 73 35 DF 24 6A B4 FD 8C 8C>)
(   5,<2012-05-14 18:12:23.796 -0500>,<Administrator>,<TOPSPIN>,<proc1d>,<TOPSPIN 2.1>,
      <abs ABSG = 2 
       data hash MD5: 128K
       68 16 BE 3F E9 EB 05 D5 05 C6 7B 40 00 24 2B 32>)
(   6,<2012-05-14 18:12:23.843 -0500>,<Administrator>,<TOPSPIN>,<proc1d>,<TOPSPIN 2.1>,
      <abs ABSG = 3 
       data hash MD5: 128K
       35 65 EE E0 F8 56 EE 7B 27 22 BF F7 43 14 A3 07>)
(   7,<2012-05-14 18:12:23.906 -0500>,<Administrator>,<TOPSPIN>,<proc1d>,<TOPSPIN 2.1>,
      <abs ABSG = 4 
       data hash MD5: 128K
       E7 70 AF 8A AF 56 12 79 49 5C D8 F5 8C 41 1A C2>)
(   8,<2012-05-14 18:12:23.953 -0500>,<Administrator>,<TOPSPIN>,<proc1d>,<TOPSPIN 2.1>,
      <abs ABSG = 5 
       data hash MD5: 128K
       2C CA D9 78 F2 F1 12 D2 A7 9F 90 2A FD 0A 65 35>)
$$ ##END=
$$ 
$$ $$ hash MD5
$$ $$ F3 82 8D 74 72 34 0D A8 68 8A 94 32 D4 B3 19 3A
##$RELAX= 
##$RELAX= 
##$RELAX= 
##$RELAX= 
##$RELAX= 
##$RELAX= 
##$RELAX= 
##$RELAX= 
$$ Bruker specific parameters
$$ [...]
##$TP07= 0
##$TPNAME0= <>
##$TPNAME1= <>
##$TPNAME2= <>
##$TPNAME3= <>
##$TPNAME4= <>
##$TPNAME5= <>
##$TPNAME6= <>
##$TPNAME7= <>
##$TPOAL= (0..7)
0.5 0.5 0.5 0.5 0.5 0.5 0.5 0.5
##$TPOFFS= (0..7)
0 0 0 0 0 0 0 0
##$TUNHIN= 0
##$TUNHOUT= 0
##$TUNXOUT= 0
##$USERA1= <user>
##$USERA2= <user>
##$USERA3= <user>
##$USERA4= <user>
##$USERA5= <user>
##$V9= 5
##$VALIST= <valist>
##$VCLIST= <CCCCCCCCCCCCCCC>
##$VD= 0
##$VDLIST= <DDDDDDDDDDDDDDD>
##$VPLIST= <PPPPPPPPPPPPPPP>
##$VTLIST= <TTTTTTTTTTTTTTT>
##$WBST= 2048
##$WBSW= 25
##$XGAIN= (0..3)
0 0 0 0
##$XL= 0
##$YL= 0
##$YMAX_a= 11709143
##$YMIN_a= -6489755
##$ZGOPTNS= <>
##$ZL1= 120
##$ZL2= 120
##$ZL3= 120
##$ZL4= 120
##$ABSF1= 14.96673
##$ABSF2= -5.5858
##$ABSG= 5
##$ABSL= 3
##$ALPHA= 0
##$AQORDER= 0
##$ASSFAC= 0
##$ASSFACI= 0
##$ASSFACX= 0
##$ASSWID= 0
##$AUNMP= <proc_prof1d_extract.lims>
##$AXLEFT= 0
##$AXNAME= <>
##$AXNUC= <1H>
##$AXRIGHT= 0
##$AXTYPE= 0
##$AXUNIT= <>
##$AZFE= 0.1
##$AZFW= 0.1
##$BCFW= 0
##$BC_mod= 0
##$BYTORDP= 0
##$COROFFS= 0
##$CY= 15
##$DATMOD= 1
##$DC= 0
##$DFILT= <>
##$DTYPP= 0
##$F1P= 0
##$F2P= 0
##$FCOR= 0.5
##$FTSIZE= 131072
##$FT_mod= 6
##$GAMMA= 0
##$GB= 0
##$INTBC= 1
##$INTSCL= 1
##$ISEN= 128
##$LB= 0.3
##$LEV0= 0
##$LPBIN= 0
##$MAXI= 10000
##$MC2= 0
##$MEAN= 0
##$ME_mod= 0
##$MI= 0
##$NCOEF= 0
##$NC_proc= -3
##$NLEV= 6
##$NOISF1= 0
##$NOISF2= 0
##$NSP= 0
##$NTH_PI= 0
##$NZP= 0
##$OFFSET= 14.96673
##$PC= 1
##$PHC0= 34.57947
##$PHC1= 0
##$PH_mod= 1
##$PKNL= yes
##$PPARMOD= 0
##$PPDIAG= 0
##$PPIPTYP= 0
##$PPMPNUM= 2147483647
##$PPRESOL= 1
##$PSCAL= 4
##$PSIGN= 0
##$PYNMP= <proc.py>
##$REVERSE= no
##$SF= 400.130005554234
##$SI= 131072
##$SIGF1= 0
##$SIGF2= 0
##$SINO= 400
##$SIOLD= 131072
##$SPECTYP= <>
##$SREGLST= <1H.CDCl3>
##$SSB= 0
##$STSI= 131072
##$STSR= 0
##$SW_p= 8223.68421052632
##$SYMM= 0
##$S_DEV= 0
##$TDeff= 65536
##$TDoff= 0
##$TI= <>
##$TILT= no
##$TM1= 0
##$TM2= 0
##$TOPLEV= 0
##$USERP1= <user>
##$USERP2= <user>
##$USERP3= <user>
##$USERP4= <user>
##$USERP5= <user>
##$WDW= 1
##$XDIM= 131072
##$YMAX_p= 477661287
##$YMIN_p= -97149332
##$CURPLOT= <Network HP LaserJet P1505>
##$CURPRIN= <$Network HP LaserJet P1505>
##$DFORMAT= <normdp>
##$LAYOUT= <+/1D_H.xwp>
##$LFORMAT= <normlp>
##$PFORMAT= <normpl>
##$SURQMSG= 1
$$ End of Bruker specific parameters
$$ ---------------------------------
##NTUPLES= NMR SPECTRUM
##VAR_NAME=  FREQUENCY,     SPECTRUM/REAL,   SPECTRUM/IMAG
##SYMBOL=    X,             R,               I
##VAR_TYPE=  INDEPENDENT,   DEPENDENT,       DEPENDENT
##VAR_FORM=  AFFN,          ASDF,            ASDF
##VAR_DIM=   131072,        131072,          131072
##UNITS=     HZ,            ARBITRARY UNITS, ARBITRARY UNITS
##FACTOR=    0.0627417313425165, 1,          1
##FIRST=     8223.62146879498, 2369,         -119540
##LAST=      0,             7848,            -120706
##MIN=       0,             -97149332,       0
##MAX=       8223.62146879498, 477661287,    0
$$ Real data points
##PAGE= N=1
##DATA TABLE= (X++(R..R)), XYDATA
$$ [...]
67254 100689 98547 96988 96465 96753 96833 95815 93713 91121 88572 86515 85488 85882 87758 91048 95613
67239 95613 100847 105456 107954 107495 104446 100396 97376 96535 97449 98985 100622 102437 104065 104635 103938 102867
67223 102867 102338 102373 102601 102994 103570 103918 103617 102758 101545 99840 97750 96294 96618 98533 100631 101987 103106
67206 103106 104856 107090 108936 110156 111441 113135 114273 113485 110712 107442 105079 103682 102553 101473
67192 101473 100649 99949 99137 98728 99557 101353 102746 103098 103383 104606 106178 106742 106027 105016 104677 105409 107305
67175 107305 109883 111750 111734 110526 110129 111341 112776 112913 112131 111933 112822 113904 114274 113812 112672 110813
67159 110813 108367 105943 104239 103558 103788 104617 105722 106957 108359 109749 110534 110415 110320 111892 115643 120039
67143 120039 122946 123707 123376 123213 123617 124461 125675 127130 128382 128992 129012 128975 129491 130801 132426 133236 132364
67126 132364 130278 128587 128426 129305 129835 129323 128333 127992 129089 131632 134794 137362 138637 138836 138477 137621
67110 137621 136046 133855 131544 129724 129075 130055 132103 133691 133965 133888 134855 136604 137712 137849 138039 138665
67094 138665 138926 138754 139597 142259 145309 146886 147096 147377 148368 149829 151858 154512 156547 156293 154002 151942
67078 151942 151891 153622 156048 158581 160937 162736 163992 165237 166619 167587 167852 167888 167986 167611 166365 164948
67062 164948 164429 164960 165896 166783 167640 168605 169846 171553 173483 174913 175568 176204 177633 179523 180903 181538
67046 181538 181850 181633 179973 176803 173681 172535 174179 178338 184335 191018 196595 199614 200255 200060 200229
67031 200229 200713 201060 201473 202498 204074 205557 206635 207611 208647 209304 209285 209321 210759 214217 219022 224029
67015 224029 228697 233192 237639 241586 244330 245715 246478 247628 249449 251329 252695 253798 255304 257326
67001 257326 259369 261172 263168 265863 269090 272090 274187 275271 275800 276495 277922 280284 283615 287972 293090
66986 293090 298009 301558 303400 304249 304900 305537 306242 307658 310498 314583 318969 323083 327246 331994 337268
66971 337268 342541 347417 351771 355402 357873 358867 358642 358039 358065 359411 362191 365924 369717 372758 374966
66956 374966 377179 380559 385695 392240 399243 405703 411028 415423 419915 425662 432968 440958 448240 453833
66942 453833 457622 460242 462677 465867 470544 477199 485766 495232 504090 511676 518741 526100 533147 538668
66928 538668 542947 547887 554721 562662 570381 577834 585761 594117 602078 609260 616091 623164 630947 639793
66914 639793 649383 658338 665418 671202 677829 686889 698188 710552 723003 735002 746423 757817 770113
66901 770113 783594 797476 810783 823302 835547 848353 862741 879470 898043 916487 932802
66890 932802 946772 960107 974899 992044 1010957 1030532 1050408 1071265 1093636 1116597 1138309
66879 1138309 1158050 1177096 1197243 1219088 1242220 1266397 1291649 1317716 1344521 1373037 1404449
66868 1404449 1438026 1470892 1500737 1528256 1556239 1586592 1619002 1652451 1687100 1724205 1764511
66857 1764511 1807282 1850896 1894093 1936589 1978863 2021697 2065917 2112294 2161444 2213756 2269202
66846 2269202 2327020 2385796 2444459 2503370 2563932 2626789 2690965 2755377 2820675 2888468 2958738
66835 2958738 3029268 3098279 3166721 3237060 3310330 3385411 3460997 3537037 3613946 3691407 3768703
66824 3768703 3845679 3922593 3999092 4073879 4145605 4213988 4280108 4345549 4410853 4474538 4533968
66813 4533968 4587496 4635487 4679077 4718422 4752727 4781496 4804795 4822395 4833618 4838271 4836916 4829864
66801 4829864 4816656 4797078 4772082 4743009 4710260 4673294 4631557 4584719 4532377 4474507 4412282
66790 4412282 4347528 4280921 4211315 4137353 4059473 3979892 3900811 3823015 3746088 3669441 3592773
66779 3592773 3515772 3438015 3359642 3281964 3206685 3134140 3062770 2990873 2918658 2847898 2779641
66768 2779641 2713114 2647218 2582437 2520514 2462415 2407246 2353309 2299863 2247596 2197619 2150239
66757 2150239 2104607 2059344 2013509 1967215 1921407 1876926 1833752 1791354 1749826 1710230 1673363
66746 1673363 1638508 1604036 1569176 1534484 1500605 1467511 1435327 1404841 1376410 1349020 1321355
66735 1321355 1293274 1265237 1236912 1207809 1179126 1153273 1131006 1110337 1089137 1067675 1047605
66724 1047605 1029299 1011586 993818 976754 961007 945631 928995 910679 891892 874046 857372
66713 857372 841133 824860 809004 794308 780961 768535 756309 743437 729397 714882 701753
66702 701753 691071 681382 670075 656568 643005 631477 621686 611965 601438 590295 578878 567758
66690 567758 558141 550800 544685 537651 528590 518057 506978 495859 485368 476619 470264 465799 462063
66677 462063 458014 452962 446755 440050 433838 428311 422610 416054 409221 403369 398931 394980 390293 384757
66663 384757 379594 376034 373817 371292 367098 361304 354636 347206 338812 330143 322659 317099 312788 308603
66649 308603 304062 299371 295109 292053 290617 290183 289580 288482 287614 287230 286286 283814 280478 277824 276412
66634 276412 275543 274568 273393 271653 268452 263459 257595 252060 247120 242449 238438 236348 236906 239179 241222
66619 241222 241686 240514 238229 235085 231153 226890 223145 220578 219244 218654 217961 216214 212953 208837 205388
66604 205388 203742 203608 203636 202804 201213 199502 197811 195766 193393 191441 190422 189779 188603 186890 185340
66589 185340 184045 182387 180356 178830 177989 176564 173726 170842 170010 171152 171903 170445 167404 164820 164154
66574 164154 165484 167840 170051 171775 173603 175609 176291 174069 169578 165123 161940 159530 157780 157766 159679
66559 159679 161644 161867 160652 159137 157245 154392 151243 149087 147946 146733 144945 142943 140946 139052
66545 139052 137913 138030 138575 138226 137053 136256 136156 135875 135048 134324 133905 133020 131344 129723 128922 128821 129327
66528 129327 130847 133083 134588 134529 134094 135030 137351 139466 140170 139520 138001 135820 133124 130239 127482 125089
66512 125089 123369 122696 123236 124681 126185 126768 126161 125173 124745 124782 124503 123825 123432 123385 122850 121691 121201 122372
66494 122372 124273 125084 124073 121635 118118 113854 109926 107500 106382 105417 104370 104298 105823 108045 109616
66479 109616 110054 109588 108515 107296 106650 106840 107188 106821 105717 104579 103925 103737 103794 103909 103819 103237 102164 101105
66461 101105 100876 102151 104945 108390 111091 111900 110526 107651 104614 102725 102412 102955 103366 103621 104720 107401
66445 107401 111060 114111 115146 113719 110422 106556 103385 101280 99715 98407 98118 99711 102495 104377
66431 104377 104087 102742 102568 104306 106478 107201 106076 104100 102255 100668 98934 96818 94670 93359 93599
66416 93599 95074 96449 96702 96342 96813 98726 101240 103245 104494 105285 105707 105752 105730 105927 105999 105308 103811 102272
66398 102272 101603 102297 104263 106810 108902 109970 110479 111241 112245 112626 111842 110392 109268 109059 109641 110310
66382 110310 110166 108921 107458 107005 107548 107714 106682 105527 105904 107746 109182 108798 107256 106420 107432 110025
66366 110025 113286 116463 118978 120225 119931 118810 118407 119780 122264 123989 123816 122466 121434 121163 120734
66351 120734 119190 116586 113702 111311 109905 109626 110043 110269 109815 109266 109669 111204 112732 112884 111445 109580
66335 109580 108827 109980 112674 115630 117319 116894 114974 113401 113717 115601 117055 116387 113863 111222 109843
66320 109843 109765 110335 111079 111720 111864 111203 109900 108363 106724 104916 103166 101981 101560 101603 101891 102735 104553
66303 104553 107081 109274 110059 109166 107291 105469 104179 103070 101643 100108 99320 99897 101668 103989 106200
66288 106200 107742 108314 108214 108055 107902 107213 106102 105949 107789 110380 111033 108615 104961 102971 103897 106651
66272 106651 109036 109296 107251 104625 103852 105922 109558 112691 114242 114154 112551 109852 107216 105788 105462
66257 105462 105211 104606 104223 104574 105565 107078 109096 110881 111030 109109 106557 105155 104976 104664 103492 102238
66241 102238 101946 102616 103500 104189 104844 105497 105644 104776 103149 101795 101726 103183 105536 107651 108421 107501 105839
66224 105839 105090 105975 107463 108103 107861 107839 108301 108093 106385 104051 102618 102480 102877 103205 103541 104096 104953 106220
66206 106220 107808 109061 109269 108595 107906 107562 106906 105203 102715 100590 99818 100366 101237 101463 101173 101437 102796
66189 102796 104356 104866 104346 103920 104252 105049 106074 107543 109214 110147 110071 110149 111466 113276 113794 112574 111114
66172 111114 110962 111924 112564 112022 110923 110526 111209 111947 111383 109275 106605 104322 102530 101141 100678 101832
66156 101832 104548 108108 111876 115336 117638 117918 116222 113619 111324 110004 109725 110022 110179 110132 111021 113962
66140 113962 118228 121549 122499 121739 120669 119897 119602 120257 121937 123733 125017 126671 129714 133117 134569
66125 134569 133503 131823 131183 130975 129848 127968 126507 125648 124495 122733 121117 120198 119523 118459 117057
66110 117057 115748 114732 114081 114064 114944 116588 118494 119985 120292 118904 116237 113759 113036 114619 117937 121996
66094 121996 125812 128357 128773 126967 123785 120328 117208 114608 112866 112570 113913 116140 117965 118570 118103
66079 118103 117201 116348 115921 116513 118533 121383 123618 124421 124540 125284 126872 128425 129321 129662 129382 128038 126102
66062 126102 125448 127405 130694 132439 131172 127922 124483 121852 120632 121428 123732 125462 125131 124145 125461
66047 125461 129786 134400 136229 135019 132770 131003 129740 128724 128300 128817 129989 131306 132575 133766 134771
66032 134771 135691 136974 138769 140359 140766 139917 138816 138555 139517 141454 143801 145733 146467 145918 144766 143518
66016 143518 141859 139449 137025 135906 136355 137162 137218 136932 137601 139723 142436 144477 145259 145076 144620 144438 144683
65999 144683 145320 146413 147936 149299 149645 148955 148402 149055 150545 151639 151897 151958 152165 151922 150766 149306 148343
65982 148343 147551 145958 143662 142212 142871 145026 146975 148108 149629 152773 156845 159711 160134 158876 157317
65967 157317 155856 154357 153490 154406 157090 160036 161943 162953 163761 164322 164279 164243 165599 168832 172722 175599
65951 175599 177018 177776 178472 178737 178176 177573 178370 180861 183626 185280 186227 188013 191201 194764 197554 199512
65935 199512 201236 203137 205510 208830 213384 218865 224794 231151 238222 245851 253050 258288 260347 259312
65921 259312 256757 254472 252961 251663 250550 250503 251681 252507 251104 247280 242396 237688 233493 229795 226683
65906 226683 224192 222121 219973 216960 212598 207678 204013 202559 202295 201691 200724 200470 201199 202104 202831 203994
65890 203994 205988 208411 211017 214253 218260 222059 224417 225202 225430 226170 227613 229079 229839 230057 230747 232604
65874 232604 235265 238142 241372 245108 248385 250018 250570 252057 255326 258879 260890 261442 262148 264301 268015
65859 268015 272491 276603 279714 282406 285808 289879 293193 295004 296715 300450 306689 313976 320491 325286
65845 325286 328484 331020 333792 336573 338311 338983 340222 343097 346057 346491 344012 340859 339090 338691 338628
65830 338628 338373 337749 336211 333178 328644 322886 315847 307395 298090 289286 282274 277234 273021 268165 262235
65815 262235 256127 250882 246649 243141 240564 239331 239024 238483 237077 235220 233451 231643 229504 227421 226255
65800 226255 226313 226848 226774 225931 225493 226751 229442 231780 232442 231961 231649 231765 231587 230983 230773 231451 232426 232790
65782 232790 232194 230918 229859 230582 234399 240781 247318 251732 253570 253723 253125 252455 252350 252990 253809 254396
65766 254396 255480 258269 262931 268416 273787 279059 284631 290527 296534 302671 309116 315815 322361 328230
65752 328230 333037 336716 339456 341338 341939 340477 336600 331098 325685 321798 319373 316860 312755 307227
65738 307227 302012 298511 296273 293639 289682 284995 280615 276795 273243 270134 268242 268008 268981 270460 272432
65723 272432 275607 280656 287563 295548 303426 310309 316388 322896 330856 339897 348807 357210 365899 375210
65709 375210 383833 390016 393526 395538 396710 396254 393137 387495 380410 372666 364120 354198 342808 330848
65695 330848 319898 311215 305002 300805 298482 298325 300233 303398 307221 312206 319463 329490 341765 355266
65681 355266 368888 381485 392220 401266 409857 419188 429187 438505 445566 449428 449803 446793 440912 433089
65667 433089 424210 414591 404140 392913 381162 368898 355926 342531 329604 317716 306433 295109
65655 295109 284097 274502 266732 260053 253830 248571 245102 243012 240655 236827 231903 227109 223157 220073
65641 220073 217996 217279 217661 218051 217642 216770 216180 215842 215173 214165 213487 213519 214087 215257 217604 221400 226085
65624 226085 230760 234637 237043 237870 238211 239521 241749 243416 244156 246010 251177 259321 268262 276626 284611
65609 284611 292845 301931 312792 325990 340658 355292 369584 384439 400363 416950 433801 450601
65597 450601 466421 480372 492986 505407 517090 526033 531713 535997 540341 543847 545257 545283 545424 545642
65583 545642 544962 543706 543484 545109 547716 549754 549785 546680 540249 531641 522167 511767 499480 485145
65569 485145 469583 453140 435229 415631 395405 376075 358448 342404 327393 313000 299416
65558 299416 287417 277541 269419 262300 256068 251087 247184 243563 239806 236276 233235 230184 226504 222448
65544 222448 219061 217193 216833 217309 217965 218525 218933 219115 219039 218756 218066 216474 214142 212618 213573 216574 219208
65527 219208 220030 220382 222444 226406 230776 234831 239244 244410 249611 254190 258494 263211 268592 274695 281768
65512 281768 290035 299610 310810 323923 338380 352845 366602 380431 395595 412084 428180 441707
65500 441707 451677 458810 464468 468973 471161 469776 464939 457764 448781 437455 423279 406792 389476
65487 389476 373014 358470 345519 332637 318883 305553 295229 288874 284670 280136 274681 269523
65475 269523 265698 263043 261015 259816 260365 263236 267689 271906 274386 275030 274574 273230 270552 266607 262420
65460 262420 258804 255331 251018 245686 240144 235246 231258 228054 225514 223657 222557 222149 222078 221920 221651
65445 221651 221697 222288 222917 222726 221534 220367 220729 223151 226515 229137 230563 231799 233596 235193 235436 234632
65429 234632 234342 235569 238129 241671 246103 250733 254232 256160 257694 260128 263301 266118 267862 268247 267050
65414 267050 264863 263621 264849 267387 268155 265495 260685 255827 251509 247337 243653 241371 240455 239803 238659
65399 238659 237227 235709 233761 231317 229133 227888 227258 226509 225477 224260 222479 219893 217543 217053 218562
65384 218562 220422 221398 222165 223966 226671 229141 230924 232540 234448 236775 240002 244798 250815 256368 259891
65369 259891 261444 262563 264595 267233 268693 267598 264633 261833 260109 258366 255596 252757 251428 251221
65355 251221 250012 246667 242234 238308 235495 233806 233422 234383 236220 238384 240562 242395 243527 244142 244770
65340 244770 245451 245859 246353 247920 250693 253518 255529 257420 260596 265668 272119 278721 283899 286551 287165
65325 287165 287505 288648 289930 290162 289089 287164 284791 282496 281086 280887 281430 282436 284357 287308 290373
65310 290373 292726 294554 296035 296543 296047 296292 298975 303363 307329 310351 313842 318757 324603 330927 338083
65295 338083 346067 354050 361673 369628 378398 387514 396555 405718 414679 422044 426848 429677 431241 430652
65281 430652 426457 419075 410928 404067 398591 393534 388331 382941 377246 371014 364264 357157 349633 341579
65267 341579 333332 325580 318615 312079 305710 299976 295513 292189 289318 286696 284684 283182 281318 278607
65253 278607 275697 273394 271489 269271 266793 264772 263409 262134 260616 259275 258583 258371 258177 257931 258017 258764
65237 258764 260028 261297 262248 263162 264583 266601 268844 271227 274039 276991 278854 278776 277504 276533 276227 275531
65221 275531 273487 270381 267366 265494 265155 265973 267096 267870 268228 268355 268234 267750 266885 265579 263938 262773
65205 262773 263119 264652 265500 264508 262755 261647 260462 257478 253016 249397 247881 247585 247735 248977 251622
65190 251622 254259 255295 254733 253464 251978 250759 250708 251767 252004 249611 245356 241746 240158 240034 240553 241523
65174 241523 242545 242731 241788 240487 239617 239212 239143 239659 240780 241766 241846 241151 240354 239633 238572 237059 235712
65157 235712 235181 235370 235604 235312 234253 232415 230288 229207 230559 234125 237781 239605 240051 241230 244166
65142 244166 247546 249336 248872 247125 245608 245374 246432 247620 247478 245726 243667 242823 243446 244630 245476 245820
65126 245820 246105 246887 248257 249614 250363 250975 252833 256720 261896 266994 271272 274618 276956 278457 280034
65111 280034 282803 286955 291544 295463 298409 301017 304200 308135 311850 314199 315495 317576 321817 327604
65097 327604 333305 338318 343486 349880 357953 367746 379079 391402 404006 416673 429902 444580 461598
65084 461598 481492 504074 528606 554604 582042 610379 637985 663399 686753 709081 730469
65073 730469 750017 767597 784346 800901 816070 827937 835676 839697 840531 838282 832918 824612 813857
65060 813857 801437 787932 772924 755142 733966 710563 686937 663878 640302 614721 587052
65049 587052 558990 532909 510470 491906 476249 462143 448580 435084 421520 407942 394613
65038 394613 382018 370745 361141 352883 344958 336474 327682 319935 314364 310806 308305 306346 305106 304640
65024 304640 304545 304619 305229 306646 308458 310092 311522 312898 313788 313564 312384 311040 309730 307811 305055 302380
65008 302380 300907 300871 301928 303747 305631 306236 304730 302002 299739 298415 297093 295129 293043 291545 290627
64993 290627 289931 289212 288190 286812 285905 286523 288098 288377 286204 283537 283339 285816 288042 287433 284442 281421
64977 281421 279694 278460 276184 272425 268325 265641 265352 266925 268686 269015 267459 264923 262677 261053 259238
64962 259238 256497 253234 250399 248285 246690 246025 247092 249526 251681 252693 253636 255694 258092 259178 259086
64947 259086 259792 262406 265740 268111 269556 271470 274580 278164 281256 283966 287325 292017 297501 302320
64933 302320 305205 305989 305853 306794 310361 316223 322047 325387 325847 325087 324838 325488 326427 326869 326261 324909 324465
64916 324465 326656 331017 334931 336551 336540 336099 334615 330738 324824 318597 312787 306783 300486 294882 290621
64901 290621 287441 285215 284323 284587 284992 284842 284332 283756 283072 282446 282169 281845 280667 278734 276980 275585 273709
64884 273709 271252 269498 269213 269283 268273 266467 265344 265644 266850 268066 268561 267947 266621 265758 266190 267608
64868 267608 269274 270967 272730 274340 275716 277291 279279 281140 282436 283612 285099 286327 286590 286304 286284
64853 286284 286181 284899 282430 280086 278985 279363 281373 285285 290539 295709 299937 303745 308011 312912 318199
64838 318199 323808 329668 335534 341561 348537 356893 365729 373402 379100 383559 388387 394812 402824 411089
64824 411089 417800 421951 423948 425055 426359 428167 430061 431400 431984 432298 432836 433092 431637 427511 421316
64809 421316 414658 408714 403641 399179 395307 392174 389664 387292 384483 380865 376398 371356 366250 361716
64795 361716 358279 355986 354103 351312 346522 339701 331941 324656 318709 314213 310849 308103 305413 302506
64781 302506 299692 297444 295600 293460 290934 289049 288754 289609 290445 291072 292345 294390 295883 295740 294763 294694
64765 294694 296013 297613 298633 299684 301897 305361 309114 312484 315910 320245 325576 331115 336215 341021
64751 341021 345906 350768 355449 360525 366899 374595 382782 391162 400424 410839 421231 430091 437180 443274
64737 443274 448752 453238 456304 457663 456913 453990 449723 445025 439564 432292 423340 414280 406223 398790
64723 398790 391501 384997 379958 375787 371666 368392 367777 370281 374486 379022 383822 389089 394209 398513
64709 398513 402331 406364 410531 414358 418229 423313 430304 439065 449410 461200 473475 484484 493187
64696 493187 500036 505818 510573 514312 517966 522433 527113 530618 532828 535114 538362 541844 544233 544722
64682 544722 542890 538615 532793 527093 522074 516252 507966 497667 487408 478473 470578 463235 456691 451208
64668 451208 446200 440621 433950 426593 419540 413632 408918 404841 401162 398412 397053 396747 397140 398894 402898
64653 402898 408548 413969 418272 422560 428087 434270 439334 442396 444072 445220 445942 445929 445179 444044 442754
64638 442754 441070 438315 433775 427240 419287 411005 403435 397187 392277 388154 383980 379237 374259 370072
64624 370072 367573 366757 366810 367000 367405 368684 371242 374882 379208 384054 389406 395207 401437 408166 415394
64609 415394 423102 431550 441115 451597 462178 472430 482796 493450 503127 509907 512958 512699 509550
64596 509550 503658 495957 488199 481288 474439 466777 459071 452971 448849 445496 442111 439780 440447 444639
64582 444639 450651 456119 460219 464087 469048 474923 480585 485937 492516 501870 514044 528120 543675
64569 543675 560911 579488 598032 615055 629930 642654 652850 659443 661482 659141 653579 645777
64557 645777 635803 623493 609484 595007 580808 566912 553534 541600 532034 524995 519973 516168
64545 516168 512621 508654 504636 501771 500650 500426 499820 498333 496012 492689 488295 483448 478828 474402 470066
64530 470066 466555 464511 462982 460337 456761 454273 453747 453373 451053 447263 444432 444233 446595 450750 455879
64515 455879 460917 465048 468642 472811 477894 483112 487806 492114 496124 499104 500066 498637 495052 489737
64501 489737 483212 475946 468021 459247 449756 439985 429923 419135 407903 397633 389485 383149 377767
64488 377767 373568 371694 372490 374755 376733 377355 376646 375553 375252 376001 376878 377290 378338 381605 386626 390901
64472 390901 392670 392492 391555 389827 386865 383393 380660 378701 376556 374077 372332 372058 372693 373235 373420 373773
64456 373773 374950 377228 380274 383346 385987 388404 390800 392725 393767 394700 396991 400968 405310 408618
64442 408618 410958 413534 417488 423348 431073 440107 449738 459837 470931 483201 495756 507354 517545
64429 517545 526589 534355 539883 542295 541885 540030 537959 535763 532827 529159 525776 523388 521106 517248
64415 517248 511418 505100 499942 495994 491963 486876 481194 476537 474334 474361 474586 473014 469922 467773 468642
64400 468642 472237 476709 480777 484584 489022 494779 501676 508365 513092 515447 517097 520140 524989 530552
64386 530552 536261 542994 551875 563004 575755 589700 604788 620972 638098 656081 674981 695111
64374 695111 717259 742617 772235 806534 845388 888585 936054 987793 1043826 1104393 1170210
64363 1170210 1242563 1323043 1413135 1513884 1625712 1748260 1880219 2019182 2161523 2302571
64353 2302571 2437633 2563684 2680113 2787253 2883940 2966867 3032304 3077800 3102004 3103794 3082611
64342 3082611 3039671 2978068 2901344 2811849 2710279 2596586 2471646 2338343 2200855 2062731
64332 2062731 1926077 1792813 1665968 1548767 1442486 1345839 1256554 1173207 1095819 1025438
64322 1025438 963367 910247 865496 827646 795119 766618 741147 718125 697305 678257 660257
64311 660257 643104 627521 614007 601700 589329 577016 565878 555823 545166 532929 520300
64300 520300 508973 499051 489738 481339 475170 471568 469205 466642 463802 461602 460816 461755 464540 469025
64286 469025 474444 479611 483868 487868 493099 500319 508447 515332 519698 521947 522896 522228 518790 512314 504343
64271 504343 497298 492808 490848 490132 489254 487665 485809 484384 483530 482770 481546 479620 477067 474081 470819
64256 470819 467342 463768 460510 458124 456695 455547 453832 451390 448797 446618 444874 443114 440694 437023
64242 437023 432046 426612 421920 418245 414558 409868 404760 401102 400200 401632 403914 405770 406503 405757 403724
64227 403724 401593 401110 403292 407621 412562 416729 419682 422109 425439 430835 438129 445781 452197 457113
64213 457113 461674 467374 475004 484318 494412 504525 514577 524624 533743 540159 543048 543688 543976 544083
64199 544083 542641 539228 535518 533402 532933 532915 532900 533477 534696 535205 533322 528491 521309 512480 502227 490711
64183 490711 478627 467093 456950 448386 441276 435567 431071 427128 423048 418951 415738 413968 413092 412080
64169 412080 410644 409550 409739 411247 412914 413173 411346 408280 405541 403936 403004 401902 400332 398427 396272
64154 396272 394032 392348 392061 393416 395671 397495 397680 395700 391924 387401 383420 381134 381206 383343 386223
64139 386223 388475 389979 391760 394425 397331 399785 402486 406964 413722 421667 429488 437012 445086 454549
64125 454549 465567 477789 490948 505327 521444 539075 556732 572404 584686 592970 596881 596107
64113 596107 590855 581952 570318 556671 541844 527037 513428 501585 491282 481757 472236 462468
64101 462468 452906 444267 436915 430687 425137 419834 414658 410087 407006 405905 406415 407877 410031 412750
64087 412750 415543 417997 420480 423533 426706 429069 431069 434643 440738 447642 452898 456380 460184 465384
64073 465384 470146 471760 469887 466878 465010 464278 463295 461619 460294 460194 460869 461569 462670 465264 469611
64058 469611 474901 480517 486784 494312 503249 513421 524707 537090 550738 565994 582791 600138
64046 600138 616916 633082 649110 664178 676222 684357 690071 695272 700385 705473 711958 721425 733207
64033 733207 744950 755503 765616 775635 784217 789967 792935 793595 791407 785493 776144 764674 752105
64020 752105 738625 724076 708377 691791 675287 660358 647842 637024 626332 614812 602796
64009 602796 591523 582431 576203 571882 567349 561574 556256 554364 556988 562297 567707 572280 576576 580908
63995 580908 584666 587400 589890 593709 599745 607429 615553 623658 632342 642240 653142 664366 675705
63982 675705 687687 701138 716772 734916 755015 775479 794513 811257 825835 838420 848826
63971 848826 857002 863197 867210 868106 865304 859713 853147 846620 839759 831926 823435 815381 808653 803454
63957 803454 799623 797057 795698 795127 794164 790922 783701 772245 758100 743494 729926 717995 708224
63944 708224 701207 696708 693350 689816 686080 683002 681026 679934 679647 680416 682152 684298 686676 689870 694470
63929 694470 700427 707521 716026 726443 738915 753254 769215 786338 803817 821010 837947 855117
63917 855117 873097 892722 915116 940881 969444 999679 1031087 1063991 1098949 1136503 1177197
63906 1177197 1221246 1268429 1318902 1373695 1433542 1497560 1564287 1634107 1709564 1793007 1884991
63895 1884991 1985430 2095223 2216073 2349576 2497356 2661456 2843725 3045310 3267582
63886 3267582 3513090 3784445 4082193 4404453 4748479 5111739 5491397 5883651 6283929
63877 6283929 6687107 7087082 7476627 7848240 8195038 8510403 8786901 9016392 9192125
63868 9192125 9311144 9374278 9383290 9337939 9236088 9076606 8861756 8597010 8289598 7947743
63858 7947743 7580403 7196375 6803251 6407419 6014817 5631097 5261122 4908739 4576975
63849 4576975 4267905 3982394 3720479 3482101 3267033 3074113 2901190 2746079 2607194
63840 2607194 2483050 2371607 2270522 2177914 2092717 2014498 1943157 1878517 1819832 1765668 1714537
63829 1714537 1665721 1619422 1576088 1535699 1497825 1462293 1429589 1400393 1374840 1352546 1333405
63818 1333405 1317995 1306927 1300092 1296901 1297131 1301086 1308846 1319700 1332618 1347240 1364139 1383889
63806 1383889 1405932 1428715 1451103 1473233 1495505 1517165 1536770 1553932 1569521 1583803 1595402
63795 1595402 1602710 1605418 1603895 1597967 1587427 1573163 1556567 1538021 1517044 1493636 1468310 1440936
63783 1440936 1410788 1377835 1342819 1305999 1267130 1226977 1187333 1148764 1109588 1068183 1025492
63772 1025492 984169 945800 910010 875953 843588 813417 785740 760402 737007 715369 695821
63761 695821 678783 663816 649587 635050 620225 605518 590884 576194 561984 549278 538943
63750 538943 531497 526884 523829 520141 514594 508246 503124 499888 497558 495120 492387 489403 486072 482552
63736 482552 479177 475850 472128 467946 463548 458838 453810 449682 448288 449713 451413 450548 446615 441206
63722 441206 435785 430620 425545 420717 416499 413232 411266 410658 410651 409978 408092 405929 405082 406151 408042 408926
63706 408926 407858 405426 403023 401667 401550 402364 403653 404857 405364 404797 403284 401507 400473 401032 403242
63691 403242 406199 408776 410510 411538 411822 411107 409913 409896 412412 416822 420876 422932 423295 423312 423850 425126
63675 425126 427410 430937 435335 440078 445621 453025 461889 469688 474225 476173 478019 480848 483612 485657
63661 485657 488261 492923 499365 506364 513597 521346 528850 534426 537247 538089 538227 538413 538798 538924 537769
63646 537769 534764 530912 527978 526388 524919 522777 520886 520440 521172 522060 523077 525055 527987 530573 531750
63631 531750 532057 533124 536142 540930 546224 550752 554246 557482 561316 565710 569853 573013 575024 576057
63617 576057 576352 576180 575765 575105 574169 573405 573731 575646 578437 580662 581565 581701 581981 582423 582302 581302 579800
63600 579800 577907 575011 570756 565833 561043 556012 549816 542819 536924 533675 532773 532663 531915 529787 526317
63585 526317 522572 520282 520459 522524 525192 527810 530296 532314 533597 535155 539107 546688 556781 566925
63571 566925 575639 583496 592117 602544 614664 627772 641333 655247 669763 685330 702296 720470
63559 720470 739086 757539 776198 796262 818837 844314 872510 903033 935566 970227 1007666
63548 1007666 1048328 1091483 1135514 1179372 1223249 1267525 1311520 1353606 1392174 1426040 1454305
63537 1454305 1476317 1491729 1500423 1502713 1499853 1493712 1485448 1474874 1461597 1446118 1428995 1409413
63525 1409413 1385776 1357726 1326623 1293952 1260180 1225393 1189985 1154238 1118165 1082537 1049428
63514 1049428 1020854 997205 977719 962169 951098 944421 940801 938962 939036 941992 947882 955323 962929
63501 962929 970912 980853 993861 1009330 1025736 1042397 1060081 1079916 1102201 1126483 1152371 1179934
63489 1179934 1209517 1241668 1277235 1317135 1361814 1411044 1464256 1520775 1579452 1637977 1692557
63478 1692557 1738391 1771107 1788731 1792798 1787245 1775684 1759792 1740484 1719851 1700574 1683066 1664338
63466 1664338 1640767 1611588 1578749 1543614 1505152 1461760 1413828 1363660 1313310 1263330 1213458
63455 1213458 1163818 1115292 1069118 1026327 987338 951898 919394 889215 860978 834711 810909
63444 810909 790232 772986 758997 747760 738216 728565 717252 704617 692914 684097 678064 673511
63432 673511 669814 667170 665428 663945 662586 661952 662481 663983 666004 667987 669192 669349 669420 670789 673534
63417 673534 676301 678076 679191 680381 681768 683148 684303 684561 682961 679519 675525 671955 668415 664366
63403 664366 660494 657876 656471 655500 654767 654522 654530 654531 655327 658004 662091 665826 668497 671307 675571 681216 687733
63386 687733 695623 705904 718573 732410 746325 760557 776509 795513 817737 842358 868806 897334
63374 897334 928117 960695 995333 1034187 1079295 1129147 1178811 1224031 1263877 1298919 1328691
63363 1328691 1352617 1372242 1390663 1410143 1431735 1456756 1486729 1521718 1560381 1602183 1648156
63352 1648156 1698639 1751346 1802514 1849246 1889922 1923015 1946766 1960180 1963809 1959466 1949426 1935707
63340 1935707 1919612 1901693 1881995 1860120 1835103 1805736 1771356 1732167 1688753 1641720 1592003
63329 1592003 1540961 1489666 1438411 1387480 1338178 1292442 1251326 1214351 1180571 1149999 1123641
63318 1123641 1102214 1085102 1070827 1058576 1048979 1043176 1041367 1042829 1047321 1055649 1068424 1084877
63306 1084877 1103589 1124062 1146720 1171508 1197513 1224425 1253695 1287523 1326857 1370810 1417899
63295 1417899 1467356 1519177 1573337 1629198 1685345 1739621 1789506 1833051 1869633 1899452 1922101
63284 1922101 1936101 1940424 1936233 1926440 1913430 1897750 1879013 1857216 1832631 1805023 1773812 1738872
63272 1738872 1700561 1659085 1614419 1566941 1517711 1468029 1419002 1371481 1326100 1283408 1244244
63261 1244244 1209692 1180110 1154415 1131161 1110406 1093664 1081538 1071905 1060888 1045278 1023892
63250 1023892 997402 967683 937093 907626 880485 856387 835700 817904 801615 786034 772089
63239 772089 761222 753159 745834 737696 729095 721116 714072 707796 702479 698115 693598 687520 679827 671793
63225 671793 664482 658171 653198 650079 648387 646737 644664 643446 643987 644821 643745 641033 639275 639863 641334
63210 641334 641875 641956 643203 645653 647674 648325 648503 649711 652730 657653 664267 671966 679907 687635 695247
63195 695247 702870 710554 718823 728754 741070 755460 770985 786779 802329 817645 833491 850886
63183 850886 870013 890119 910995 934062 961247 992923 1027624 1063729 1100817 1139295 1179310
63172 1179310 1220407 1261888 1303112 1343579 1383074 1421817 1460342 1499092 1538137 1577289 1616467
63161 1616467 1655772 1695162 1734234 1772658 1810713 1848870 1886516 1921349 1950465 1972108 1986213
63150 1986213 1993376 1993689 1986744 1972563 1952147 1926921 1897675 1864299 1826674 1785753 1743603 1702440
63138 1702440 1663752 1628203 1596118 1568087 1545294 1529139 1520160 1517416 1519395 1525490 1536093 1551331
63126 1551331 1570557 1593381 1620278 1651383 1685292 1720019 1754920 1790746 1827839 1865270 1902048
63115 1902048 1938282 1974528 2010426 2044636 2075855 2103370 2126715 2145362 2158910 2167106 2169397 2164691
63103 2164691 2151836 2130306 2100238 2062047 2016492 1965133 1910089 1852784 1793195 1730927 1667023
63092 1667023 1604125 1544665 1489380 1437812 1389830 1346158 1307574 1273908 1243789 1215319 1187302
63081 1187302 1160046 1134797 1112271 1092072 1073658 1057272 1043454 1032100 1022622 1014779 1008690 1004221
63069 1004221 1001071 999384 999482 1000886 1002389 1003475 1005051 1008300 1013362 1019680 1027205 1036295 1046392 1055638
63055 1055638 1062466 1067327 1072209 1078373 1085026 1090559 1094641 1098442 1102867 1107415 1111132 1114081 1117132 1120635
63041 1120635 1124021 1126717 1128786 1130503 1131904 1133121 1134718 1137119 1139817 1141620 1141955 1141708 1142454 1144783 1147717
63026 1147717 1149988 1151617 1153797 1157382 1162275 1168457 1176731 1187709 1200571 1213738 1226755 1240845 1257550
63013 1257550 1277288 1299184 1321794 1344034 1365957 1388819 1414046 1442151 1473018 1506962 1544770
63002 1544770 1586628 1631730 1679345 1729811 1784225 1843532 1908118 1977837 2052161 2130595 2213134
62991 2213134 2299986 2390711 2484058 2578845 2674600 2771176 2868257 2965621 3063460 3161972 3260806
62980 3260806 3359282 3456950 3553594 3648775 3741702 3831587 3917949 4000417 4078057 4148847 4210083
62969 4210083 4259559 4296099 4318636 4325341 4314451 4285755 4240456 4179838 4105202 4019088 3925108
62958 3925108 3826164 3724147 3621904 3523818 3433151 3350101 3274211 3207703 3154351 3115356 3088493
62947 3088493 3071731 3065767 3072150 3090409 3118251 3153611 3195371 3242698 3294871 3351522 3412077 3475041
62935 3475041 3538638 3602122 3665775 3729535 3792222 3852335 3909022 3961926 4010329 4052781 4087464
62924 4087464 4112560 4126176 4126272 4111201 4080516 4034933 3975155 3900887 3811491 3707696 3592269
62913 3592269 3468984 3341348 3212414 3085071 2961790 2844029 2732097 2625506 2523479
62904 2523479 2425726 2333204 2247770 2170480 2100384 2035420 1974199 1916295 1861195 1808192 1757567
62893 1757567 1710732 1668340 1628817 1589630 1549773 1510390 1473138 1438708 1406855 1377024 1348565
62882 1348565 1320870 1293749 1267526 1242572 1218919 1196398 1174902 1154396 1134966 1117047 1101347
62871 1101347 1088285 1077555 1068367 1060063 1052535 1046158 1041250 1037398 1033539 1029021 1024448 1020891 1018293
62858 1018293 1015273 1010606 1004253 996815 988790 980854 974058 968885 964413 959074 952070 943654 934548 925768
62844 925768 918605 913830 910832 908180 905067 901757 898748 896044 893249 889988 886417 883650 883217 885381
62830 885381 888289 889589 888673 886658 884607 882820 881601 881285 881266 880217 877803 875318 874158 874361 874989 875186
62814 875186 874589 873506 872992 873946 875775 876769 876086 874490 872821 870918 868653 866898 866495 867041 867575 867833
62798 867833 868093 868537 869565 871938 875650 879384 882073 884331 887269 890540 892846 893878 894360 894505 893859
62783 893859 892697 892125 892431 892519 891436 889663 888372 887947 887651 886491 884314 882226 881741 883216 885569 887965
62767 887965 891070 895798 901469 906480 910488 914618 919569 924874 930176 935910 942322 949003 955840 963312
62753 963312 971320 978892 985862 993917 1004946 1018932 1034277 1049733 1065159 1080791 1096809 1113721
62741 1113721 1132438 1153673 1177463 1203364 1230917 1259972 1290706 1323311 1357752 1394046 1432775
62730 1432775 1475074 1522017 1574220 1631959 1695372 1764543 1839718 1921510 2010653 2107604 2212488
62719 2212488 2325127 2444732 2569974 2699949 2834767 2974380 3116861 3258554 3395792
62710 3395792 3525746 3645719 3752585 3843119 3914157 3962577 3986243 3985268 3961361 3915671 3848371
62699 3848371 3760822 3656883 3541147 3416665 3285328 3149706 3013292 2879028 2748393 2621894
62689 2621894 2499806 2382436 2270109 2163110 2061737 1966696 1879341 1800795 1730588 1666830
62679 1666830 1608060 1554291 1505941 1462570 1423324 1387934 1356494 1328776 1304526 1284104 1268030
62668 1268030 1256106 1247534 1241656 1238019 1236106 1235734 1237558 1242515 1250788 1261805 1275129 1290785 1308681
62655 1308681 1328208 1348755 1370698 1395827 1426488 1463781 1506716 1553696 1604735 1661486 1725174
62644 1725174 1795571 1872159 1955020 2044120 2139129 2240829 2351343 2471631 2599682 2732482
62634 2732482 2868821 3008574 3149946 3289252 3423091 3548881 3663339 3762377 3843029 3904021
62624 3904021 3944017 3960770 3952722 3920247 3864694 3787380 3690357 3577097 3451362 3315959 3173432
62613 3173432 3027357 2881996 2740775 2605550 2476887 2354378 2237066 2124455 2017337
62604 2017337 1917375 1825800 1742538 1666349 1595726 1529958 1469472 1414867 1365662 1320473 1278513
62593 1278513 1240266 1206341 1176203 1148460 1121997 1096447 1071894 1048629 1027092 1007701 990720
62582 990720 976273 964105 953298 942691 931875 921505 912473 905188 899807 896552 895332 895371 895634
62569 895634 895450 894557 892946 891016 889446 888465 887563 886346 885424 885954 888485 892663 897842 903453 908922 913905
62553 913905 918908 925369 934863 948170 965013 984460 1005597 1027919 1051188 1075169 1099885 1126130
62541 1126130 1155182 1187624 1222807 1259947 1299529 1343160 1392037 1445915 1503544 1563731 1625910
62530 1625910 1689946 1755488 1821391 1885667 1945952 1999979 2045760 2081794 2107334 2122086 2125434
62519 2125434 2116453 2095179 2063423 2023664 1977348 1925026 1867907 1808115 1747123 1684879 1621226
62508 1621226 1557564 1496348 1439226 1386252 1336617 1289514 1244561 1202293 1164279 1131958 1104996
62497 1104996 1081358 1059238 1038429 1019571 1002816 987862 974871 964524 957132 952159 948637 945758
62485 945758 943168 941082 939996 939968 940310 940377 940483 941595 944372 949070 956100 965671 976720 987137 995614
62470 995614 1002845 1010600 1020191 1032115 1046570 1063791 1084332 1109325 1139813 1175406 1214385 1255796
62458 1255796 1300759 1350742 1405193 1462102 1520836 1583286 1651985 1727844 1809713 1895157 1981194
62447 1981194 2065005 2144682 2219299 2288081 2349638 2401938 2442940 2471498 2488023 2494017 2490574 2477718
62435 2477718 2455761 2426812 2393994 2359405 2323945 2289132 2257786 2232371 2213595 2201250 2195809
62424 2195809 2198536 2210446 2231582 2260962 2296967 2338284 2384874 2437634 2496792 2560833 2626850
62413 2626850 2691147 2749393 2797375 2832592 2854805 2864613 2862001 2846595 2818272 2776607 2720553 2650141
62401 2650141 2568313 2479839 2388116 2293759 2196369 2096694 1996823 1899268 1806533 1720921 1643875
62390 1643875 1575483 1515004 1461818 1415573 1375700 1341328 1311767 1286604 1265137 1246191 1228998
62379 1228998 1214111 1202829 1195518 1190956 1187571 1184812 1182856 1181425 1179632 1176855 1172968 1167621 1160038
62366 1160038 1149810 1137360 1123335 1108013 1091619 1074734 1057940 1041249 1024217 1006547 988561
62355 988561 971339 956316 944234 934286 924762 914677 904437 894898 886480 879337 873603 869009 864870
62342 864870 860948 857725 855323 852784 849139 844850 841474 840101 840659 842546 845423 849467 855204 862863
62328 862863 871614 879795 886295 891552 896904 903344 911080 919784 928946 938431 948969 961445 975492
62315 975492 989737 1003865 1019360 1037439 1057442 1078381 1100916 1126213 1153645 1181514 1209740
62304 1209740 1240010 1273317 1309119 1347199 1388756 1435199 1487199 1545243 1609629 1679330 1752240
62293 1752240 1827315 1905360 1987062 2071313 2155857 2238100 2314402 2380211 2432468 2471216 2497756
62282 2497756 2512239 2514442 2505904 2489263 2465523 2433600 2392824 2344599 2291198 2234019 2173680 2111192
62270 2111192 2048454 1987691 1930514 1877315 1827557 1780867 1737614 1698256 1662443 1629136 1597156
62259 1597156 1565150 1531647 1496047 1459351 1423168 1388201 1354307 1321492 1289763 1258270 1226019
62248 1226019 1193678 1163536 1137267 1114607 1094506 1076479 1060238 1045123 1030891 1018463 1008964
62237 1008964 1002344 997615 993988 991044 988257 985282 982593 981061 981006 982306 985199 990079 996553 1003645
62223 1003645 1011042 1019260 1028421 1037922 1047769 1059143 1072788 1087598 1101877 1115567 1130202 1146923
62211 1146923 1165670 1186231 1208763 1232912 1257701 1283207 1311421 1344341 1381664 1421611 1463903
62200 1463903 1510738 1564469 1625211 1691209 1760940 1834260 1912086 1995545 2084969 2178829 2273613
62189 2273613 2365339 2451283 2529892 2599350 2657233 2701873 2733237 2751880 2757523 2749346 2727313 2692374
62177 2692374 2645443 2587050 2518274 2441313 2358667 2272084 2182668 2091656 2000658 1911478 1826080
62166 1826080 1746409 1673663 1607788 1548102 1494214 1445873 1402244 1362204 1325446 1292569 1263843
62155 1263843 1238530 1215708 1195148 1176972 1160939 1146465 1132994 1120122 1107847 1097008 1088858
62144 1088858 1083654 1080170 1077105 1074460 1072906 1072425 1072523 1073469 1076291 1081513 1088674 1097096 1106426 1116460 1127170
62129 1127170 1138871 1151725 1165222 1178944 1193663 1210569 1229337 1248123 1265736 1282645 1299459
62118 1299459 1315746 1331261 1347173 1364818 1383879 1403021 1421936 1441605 1462805 1485633 1510678
62107 1510678 1539607 1574083 1614633 1660867 1712291 1768491 1828725 1891595 1955165 2017502 2077211
62096 2077211 2133182 2183734 2226484 2259609 2282909 2297078 2302223 2297869 2284311 2263097 2235899 2203470
62084 2203470 2165906 2123353 2076183 2025091 1971619 1918427 1868592 1824415 1786722 1754983 1727917
62073 1727917 1704205 1682924 1663530 1645764 1629852 1616527 1606246 1598256 1590935 1583322 1576029 1570358
62061 1570358 1566832 1564897 1563898 1563850 1565147 1567793 1571170 1574430 1576765 1577193 1574513 1568070 1558726 1548702 1540197
62046 1540197 1534170 1530208 1526941 1522446 1515106 1504760 1492692 1480022 1466572 1451976 1437426 1425326
62034 1425326 1417248 1412958 1411267 1410995 1411262 1412054 1414693 1420692 1429697 1439544 1448775 1458019 1468299 1479266
62020 1479266 1490391 1503007 1519461 1540242 1563368 1586909 1611086 1637397 1666471 1697403 1728792
62009 1728792 1759895 1790849 1822118 1853849 1885950 1918918 1954233 1993402 2036693 2083261 2132294
61998 2132294 2183178 2234293 2282468 2324309 2357953 2383262 2400683 2410342 2412055 2405684 2391416 2369808
61986 2369808 2341420 2306103 2262774 2210349 2149138 2081300 2009915 1937647 1866097 1795987 1727622
61975 1727622 1661221 1597128 1535966 1478548 1425462 1376656 1331579 1289811 1251407 1216580 1185261
61964 1185261 1157176 1132140 1109894 1089754 1070735 1052145 1033813 1015800 998226 981445 965957
61953 965957 951847 938481 925053 911408 898282 886840 878013 871990 868096 865259 862787 860787 859827
61940 859827 860372 862600 866586 872369 879682 887607 894609 899259 901220 901404 900851 899608 897115 893498 889648
61925 889648 885833 881064 874389 866123 857109 847379 836630 825635 815789 807026 797541 786452 775841
61912 775841 769008 766912 767207 766675 763851 759308 754411 750432 748272 748164 749370 750487 750365 748999 747679
61897 747679 748112 750939 754995 758504 761274 765257 772320 781767 790866 797914 803985 811332 820869 831909
61883 831909 843830 856963 871900 888741 907309 927423 948665 970340 992062 1014078 1036669
61872 1036669 1059426 1081337 1101368 1118959 1134356 1148712 1163401 1178814 1193969 1207383 1217873
61861 1217873 1224465 1226404 1224069 1219412 1214654 1210596 1206741 1202768 1199172 1196712 1196021 1197692 1201955 1208288
61847 1208288 1216177 1226231 1239606 1256145 1274031 1291539 1308112 1323217 1335250 1342626 1345419 1344904
61835 1344904 1341649 1334865 1323629 1308100 1289462 1269146 1248209 1227185 1206364 1186138 1166903 1148765
61823 1148765 1131745 1116223 1102484 1089719 1076382 1062064 1048172 1036062 1025243 1014377 1003375
61812 1003375 993251 984191 975181 965731 956836 949841 945322 943468 944595 948612 954676 962128 971371 983063
61798 983063 996705 1010906 1025136 1040669 1059469 1082476 1109209 1138784 1170792 1205096 1241167
61787 1241167 1278083 1315080 1351732 1387618 1422288 1455594 1487456 1517030 1542618 1562819 1577390
61776 1577390 1586678 1590840 1590179 1585691 1578471 1568930 1557369 1545097 1534196 1526234 1521729 1520523 1522003
61763 1522003 1525371 1530644 1538967 1550827 1564270 1576191 1585149 1591344 1593815 1589729 1577313 1557907 1534048
61750 1534048 1506889 1476688 1444466 1411414 1377425 1342080 1306846 1274568 1246527 1221351 1197241
61739 1197241 1174090 1152831 1133638 1115678 1098307 1081794 1066731 1053032 1039867 1026734 1014413
61728 1014413 1004298 996562 989547 981425 972009 962401 953350 944767 936643 929494 923714 919154 915559 912918
61714 912918 911196 910072 909161 908299 907581 907311 907865 909274 910923 911925 911890 911275 911103 912304 914875 917468
61698 917468 918346 917265 916083 917002 920521 925549 930974 936254 940766 943714 944880 944671 943223 940195 935709
61683 935709 930740 926134 921786 917235 912591 908344 904519 900583 896282 892234 889515 888711 889418 890706 891956
61668 891956 893053 893841 893923 893327 892938 893726 895789 898557 901607 904674 907159 908516 909242 910779 914227 919491
61652 919491 925618 931313 935140 936039 934038 930065 925011 919475 914333 910502 907698 904180 898413 890605
61638 890605 882176 874238 867104 860736 854785 848355 840564 831602 822838 815667 810417 806355 802413 797875
61624 797875 792627 787098 781989 777973 775410 774144 773500 772554 770567 767333 763275 759133 755318 751562 747500
61609 747500 743602 741021 740336 741006 742383 744515 747345 749770 750522 749637 748151 746698 745506 745405 747334
61594 747334 750704 753699 755731 758214 762275 766920 770449 772719 774917 777840 781501 785818 790539 794806
61580 794806 797913 800309 802892 805485 807010 807134 806756 806620 806273 804684 801345 796589 791363 786882 783915
61565 783915 782097 780223 777364 773470 768913 763932 758644 753153 747461 741659 736298 732079 728810 725053
61551 725053 719350 711751 703744 696653 690473 684391 677998 671580 665395 659314 653317 647809 643056 638714
61537 638714 634382 630234 626585 623150 619479 615872 612935 610292 606765 602053 597218 593124 589360 585319
61523 585319 581389 578242 575688 573195 571071 570163 570549 571306 571454 570564 568736 566648 565417 565691 566892 567805
61507 567805 567849 567457 567557 568999 572024 575791 578879 580776 582282 583945 584910 584291 582839 582033 582073 582246 582826
61490 582826 584846 587895 589934 589854 588802 588309 588417 588508 588825 589980 591658 592973 593874 595322 598093 601899
61474 601899 605604 608088 609182 609976 611795 614683 617350 618803 619419 620057 620758 620855 619841 617590 614155 609935
61458 609935 605745 602166 599067 596150 593570 591609 590092 588774 587967 588164 589168 590276 591246 592492 594196
61443 594196 595683 595890 594318 591615 589431 589412 591820 595087 597179 597388 596418 594816 592191 588496 585384
61428 585384 585190 588350 592697 595868 597833 600252 603711 606783 608048 607964 608082 609246 611421 614566 618513
61413 618513 622340 625121 627366 630569 635078 639342 641671 642014 641658 641795 642805 644321 645600 646169 646321
61398 646321 646577 646763 646418 646114 647327 650540 654352 657059 658388 659085 659567 659815 660080 660753 661683 662208 661885
61381 661885 660966 660447 661749 665746 671720 677678 682030 684610 686041 686866 687492 688098 688240 687406 686264 686228
61365 686228 687365 688039 687409 686804 687491 688525 688484 688126 689245 691572 692976 692553 691535 691088 691138 691571 692608
61348 692608 693468 692522 689654 686907 685852 685597 684364 681752 678395 674605 670786 668314 668426 670519 672757
61333 672757 674253 675568 677147 678305 678070 676358 674051 672364 672281 674220 677947 682798 687981 692769 696767
61318 696767 700225 703812 707864 712048 716000 719930 724239 728686 732379 734718 736159 737905 740759 744337
61304 744337 747521 749680 751119 752322 753352 754448 756588 760558 765693 770474 774478 778956 785428 794430
61290 794430 805712 818796 833038 847851 862998 878006 891243 900685 906067 909451 913218 918282
61278 918282 924550 931940 940029 947611 953703 958609 963173 967488 971145 974273 977319 980016 981443 981047
61264 981047 979052 976125 973284 971759 972036 973127 973535 972974 972543 973328 975456 978547 982469 987597 994643
61249 994643 1004210 1016182 1029732 1044206 1059681 1076286 1093497 1110669 1127783 1144839 1160798 1173977
61237 1173977 1183360 1188920 1190926 1189752 1186105 1180477 1172368 1160925 1146450 1130538 1114729 1099787 1086166
61224 1086166 1074170 1063451 1053303 1043763 1035656 1029344 1024256 1019952 1016770 1015029 1014499 1015228 1018028 1023334
61210 1023334 1030144 1036873 1042808 1048028 1052361 1055374 1057373 1059572 1063073 1068121 1074423 1081730 1089895 1098732
61196 1098732 1108114 1118106 1128739 1139592 1149779 1158550 1165918 1172441 1178336 1183099 1186262 1188185 1189695
61183 1189695 1191223 1192710 1194011 1194694 1193623 1189749 1183622 1177460 1173375 1171865 1172019 1172432 1171722 1169090 1165169
61168 1165169 1161902 1160989 1162682 1166442 1172186 1180109 1189457 1198355 1205241 1210335 1215609 1223280 1234005 1246308
61154 1246308 1257919 1267880 1277255 1287705 1299640 1311812 1322314 1329806 1334224 1336892 1339763 1344068 1349552
61141 1349552 1355073 1359908 1364486 1370088 1377906 1388135 1399849 1411865 1423644 1435204 1446509 1457617
61129 1457617 1469217 1482066 1495623 1507991 1517530 1523891 1527338 1528058 1526660 1524330 1521665 1518033 1512890
61116 1512890 1507022 1501563 1496487 1491127 1485498 1479786 1473054 1464082 1453504 1443426 1434562 1425240 1413917
61103 1413917 1401320 1389066 1377203 1364378 1349936 1334644 1319431 1304418 1289291 1273876 1258081
61092 1258081 1241898 1225877 1211321 1199572 1190942 1184405 1178454 1172322 1166330 1161007 1156064 1150529 1143748
61079 1143748 1135851 1127296 1118524 1110242 1103432 1098495 1094701 1091052 1087630 1085591 1085887 1088441 1092670 1098307
61065 1098307 1105476 1114310 1124907 1137450 1152037 1168477 1186618 1206852 1229839 1255650 1283549 1312877
61053 1312877 1343760 1376539 1410768 1445312 1479452 1513417 1547718 1582328 1616684 1650129 1682105
61042 1682105 1712061 1739349 1763142 1782545 1797101 1807163 1813370 1815664 1813265 1805828 1794205 1779709
61030 1779709 1762931 1743591 1721424 1696963 1671594 1646846 1623305 1600132 1576061 1550961 1525926
61019 1525926 1501757 1478167 1454920 1432894 1413160 1395501 1378877 1363241 1350019 1340605 1334953 1331763
61007 1331763 1329712 1328477 1328903 1332119 1338338 1346750 1356817 1369145 1384562 1402804 1422805 1443964 1466440
60994 1466440 1490522 1516574 1545297 1577040 1610899 1645565 1681228 1719738 1762628 1809778 1860301
60983 1860301 1913900 1970957 2031970 2097375 2167388 2241575 2319117 2399939 2485309 2576940 2675758
60972 2675758 2781633 2893865 3011614 3134278 3261895 3395173 3535024 3682147 3836855
60963 3836855 3999020 4168457 4346004 4534295 4736968 4957011 5196148 5455599 5736923
60954 5736923 6042262 6374463 6737238 7135280 7574731 8063615 8610595 9222705 9906057
60945 9906057 10670522 11532425 12510760 13622714 14886349 16325897 17969263 19841355 21966333
60936 21966333 24370373 27052206 29914985 32718647 35129759 36866516 37835729 38156668
60928 38156668 38072550 37841877 37679000 37724387 37996443 38341868 38459295 38026717 36858930
60919 36858930 34982525 32588907 29925006 27205229 24577369 22125099 19883458 17857871
60911 17857871 16041707 14425911 13000260 11752522 10668983 9734366 8930494 8236777
60903 8236777 7633163 7102321 6629740 6203907 5817130 5464938 5144042 4851506 4585369
60894 4585369 4344044 4124556 3922939 3737096 3567790 3415824 3279257 3154110 3036703
60885 3036703 2924553 2816268 2712025 2613560 2522408 2438160 2358954 2283294 2210796 2141667 2076269
60874 2076269 2014885 1957210 1902172 1848747 1796872 1747274 1700661 1657301 1616990 1579117 1543074
60863 1543074 1508921 1477289 1448399 1421586 1396083 1371831 1349249 1328622 1309986 1293167 1277674
60852 1277674 1263061 1249611 1238025 1228110 1218507 1208229 1197863 1188698 1181280 1175444 1171093 1168057 1165622
60839 1165622 1163080 1160567 1158584 1156935 1155000 1152870 1151219 1149956 1147897 1144151 1139101 1133476 1126895 1117954
60825 1117954 1105794 1091224 1076171 1062029 1048630 1034808 1019775 1003717 987233 970808 955052
60814 955052 940858 928781 918535 909557 901841 895688 890835 886426 881829 877021 872241 867818 864348
60801 864348 862371 861697 861596 861939 863567 867032 871357 874721 876314 876974 878012 879939 882568 885788 889637
60786 889637 893794 897630 900978 904400 908320 912158 914781 915810 915998 916049 915449 913007 908580 903706 900112
60771 900112 897827 895306 891415 886620 882030 877962 874035 870091 866110 861595 856146 850605 846377 843323
60757 843323 839530 833714 826759 820153 814064 808013 802422 798006 794145 789372 783315 776817 770202 762836
60743 762836 754626 746719 740256 735241 730856 726153 720357 713426 706504 700988 697088 694111 692026 691493
60729 691493 692199 692576 691689 690280 689323 688622 687511 686056 684953 685000 687071 691595 697518 702791 706564 709913
60713 709913 713850 717847 721184 724547 729085 734768 740825 747010 753187 758418 761795 763754 765359 766662
60699 766662 766858 765611 763128 759428 754771 750430 747630 745786 743087 738898 734494 731345 729644 728652 727605
60684 727605 726108 724354 723061 722638 722479 721574 719478 716182 711580 705865 699834 693877 687289 679700 672474
60669 672474 667225 663502 659595 655241 651608 648741 645244 640891 637449 636014 635318 633746 631480 629547
60655 629547 628209 627597 628578 631378 634287 635497 635681 637090 640390 643940 646239 647574 648908 650480 652173
60640 652173 654386 657690 662028 666870 671958 677408 683160 688680 693275 696470 698134 698572 698710 699918 703143
60625 703143 708029 713098 716869 718703 718753 717872 717813 720509 726086 731887 734508 733110 730159 728877 730474
60610 730474 733782 736740 737885 736889 734098 729620 723143 714932 706475 699338 693586 688181 682810 678281
60596 678281 675061 672616 670590 669618 670279 672016 673819 675510 677615 680287 682936 684856 685860 686469 687650
60581 687650 690080 693421 696396 697656 696470 692892 687804 682736 678959 676617 675032 673682 672297 670310
60567 670310 667280 663951 661927 661925 663083 664165 664686 664707 664492 664705 666113 668643 671459 674198 677074 679445
60551 679445 679551 676659 672654 670425 671036 673173 674932 675439 675105 675052 676268 678898 682324 685773 688536 689982
60535 689982 690326 691195 694181 698614 702101 703555 704217 705227 705979 706019 706857 710199 715331 719856 722350 723029
60519 723029 722677 722395 723713 727318 732107 736974 742983 752172 764511 777732 790074 801725 813708
60506 813708 826876 841957 858922 876086 891199 903634 914279 923329 929869 933745 935993 936767 934617
60493 934617 928878 921540 915565 912252 911111 911454 913091 916009 920374 926634 935118 945824 958874 974616
60479 974616 992943 1013114 1034584 1057368 1081302 1105749 1130409 1155440 1180037 1201633 1217518
60468 1217518 1226971 1231321 1232368 1231287 1228484 1223681 1216302 1206372 1194919 1183235 1172098 1162002 1153501
60455 1153501 1146798 1141527 1137631 1135937 1137150 1140628 1145139 1150683 1158658 1170064 1184321 1200252 1217741
60442 1217741 1238062 1262747 1292552 1327524 1367739 1413471 1464438 1519290 1576510 1635677 1697074
60431 1697074 1759733 1820736 1877061 1927507 1972023 2009526 2037428 2053307 2056242 2046316 2023655 1988562
60419 1988562 1942265 1887025 1825443 1759710 1691302 1621195 1550565 1481410 1416200 1356569 1302342
60408 1302342 1252095 1204733 1160438 1120223 1084919 1054660 1028925 1006708 986860 968686 952193
60397 952193 937505 924079 910848 897128 883132 869671 857733 848088 840634 834088 827021 819353
60385 819353 812102 805623 799112 792257 786178 781885 778815 776022 773959 773655 774632 775210 774688 773817 773103 772165
60369 772165 770963 770116 769531 768091 765409 762668 760923 759688 758168 756881 756852 757781 758230 757391 755729 754049
60353 754049 752885 752825 754543 758124 762696 766985 770165 772287 774071 776311 779392 783312 787837 792319 795798
60338 795798 798002 800079 803397 807575 810725 811952 812555 814304 817563 821817 826885 832554 837841 841936
60324 841936 845469 849658 854461 858791 862499 866934 873185 880626 887602 893056 897205 901023 905294 910012
60310 910012 914636 918901 922960 926550 928648 928667 927626 927393 928942 931919 935539 939080 941771 943353 944834
60295 944834 947837 953017 959880 968152 978181 989591 1000668 1009935 1017782 1025748 1034518 1043296 1050795
60282 1050795 1056097 1058616 1058008 1054466 1048882 1042529 1036585 1031692 1027596 1023171 1017130 1009002 999541 990314
60268 990314 982895 978069 975324 973075 969871 965696 961918 959612 958156 955908 952240 948335 945793 945058
60254 945058 945675 947633 951681 958404 967785 979789 994732 1012735 1033269 1055543 1079027 1103344 1127982
60241 1127982 1152305 1175454 1196005 1212059 1221950 1224684 1219720 1206962 1187321 1162893 1136196 1109371
60229 1109371 1083989 1060906 1040025 1020883 1003823 989883 979165 970280 962122 955297 950820 948188
60217 948188 946060 944300 943749 943953 942705 938429 932080 926070 921965 919577 917572 914388 909059 901775 893619
60202 893619 885743 878992 874073 871269 869861 868572 866957 865718 865345 865097 863836 861360 858417 855846 854395
60187 854395 854999 858247 863295 867975 870526 871066 870988 871107 871061 870690 871116 873438 876737 878727 878739 878693 880225
60170 880225 882212 882723 882608 885015 891165 898526 903942 907123 910025 913903 918349 922694 927126 932305 938588
60155 938588 945759 953261 960823 968904 978155 988417 998963 1009829 1021908 1035203 1048129 1059471
60143 1059471 1070117 1081552 1093318 1103581 1112026 1120512 1130487 1141198 1151035 1159450 1166668 1172576 1177129
60130 1177129 1181349 1186669 1193244 1199747 1204877 1208294 1209981 1209537 1206601 1201479 1194798 1186841 1177707 1167968
60116 1167968 1158602 1150180 1142531 1135336 1128673 1122735 1117291 1111742 1105649 1098916 1091580 1083780 1076015 1069217
60102 1069217 1064406 1062130 1061975 1062426 1061589 1058754 1055341 1053682 1054554 1056277 1056650 1055336 1053821 1053280 1053272 1052738
60086 1052738 1051670 1051241 1052463 1055106 1058099 1060727 1063286 1066510 1070552 1074858 1079105 1083939 1090318 1098264
60072 1098264 1106832 1115425 1124467 1134327 1144160 1152684 1159917 1167226 1175430 1183736 1190975 1197079 1202590 1207227
60058 1207227 1210051 1211020 1211492 1212885 1215474 1218742 1222403 1226649 1231673 1237331 1243182 1248720 1253624 1257746
60044 1257746 1260820 1262439 1262588 1261827 1260410 1257539 1252333 1245351 1238188 1231601 1225110 1218628 1213221 1209642
60030 1209642 1207215 1204894 1202416 1199564 1195409 1189508 1183117 1177816 1173472 1168966 1164602 1162147 1162321 1163563
60016 1163563 1163770 1162307 1159879 1157093 1153511 1147845 1139219 1128604 1118448 1110024 1101676 1090886 1077637
60003 1077637 1064291 1052381 1041282 1030232 1019698 1010027 1000403 990312 980755 972880 966481 961077
59991 961077 957441 956597 957845 959205 959682 959959 961008 963002 965550 968142 970340 972279 974937 979311 985356
59976 985356 992269 999575 1007227 1014825 1021544 1026985 1031487 1035445 1038860 1041679 1044074 1046116 1047401 1047166
59962 1047166 1044727 1039899 1033195 1025528 1017444 1008599 998054 985064 969656 952796 936133 921220
59950 921220 908671 898102 888853 880572 873255 867139 862516 859097 855751 851615 847393 844505 842784 840338
59936 840338 836337 832735 832116 834624 838124 840808 842443 843495 844388 845741 848304 852309 857416 863344 870097
59921 870097 877619 885597 893418 899998 904139 905684 905942 906257 906402 904971 901117 895453 889671 885728 884670
59906 884670 885433 885453 883361 880501 878904 878621 878445 878457 879983 883207 886689 889507 892213 895267 898024 899830
59890 899830 900846 901271 900997 900533 900954 902235 902866 901897 900330 899671 900183 901364 903034 904837 905640 904642 902475
59873 902475 900222 898038 895825 894494 895047 896807 898182 899300 902478 909516 919448 929615 938435 946632
59859 946632 955941 966952 978183 987143 992277 993823 993044 991257 989800 990075 992714 996922 1001327 1005441
59845 1005441 1009755 1014546 1019224 1023009 1025859 1028596 1032264 1037279 1042996 1048287 1052802 1057426 1063192 1069949
59831 1069949 1076508 1081950 1086406 1090698 1095717 1102090 1109940 1118775 1127875 1136913 1146059 1155420 1164556 1172664
59817 1172664 1179306 1184910 1190427 1196355 1202275 1207481 1211655 1214464 1214959 1212427 1207882 1203638 1200894 1198530
59803 1198530 1194797 1189449 1183655 1178535 1174516 1171528 1168998 1166095 1162705 1159783 1158105 1157297 1156918 1157900 1161757
59788 1161757 1168663 1177394 1187027 1197563 1208889 1220180 1230430 1238645 1243511 1244009 1240739 1235809 1231136
59775 1231136 1227536 1225387 1224882 1225116 1223974 1219739 1212266 1202276 1190463 1177970 1166759 1158242 1151763 1145297
59761 1145297 1137568 1128906 1120225 1111943 1103882 1095624 1086835 1077552 1068253 1059420 1051173 1043528 1036773 1031217
59747 1031217 1026679 1022617 1018799 1015548 1013340 1012318 1012128 1012041 1011279 1009486 1006995 1004646 1003363 1003703 1005478
59732 1005478 1007674 1009028 1008816 1007037 1004031 1000428 997490 996695 998328 1000732 1001502 999508 995623 991680 989011
59717 989011 987852 987748 988266 989222 990279 990782 990499 990310 991432 993903 996630 999096 1002119 1006396 1011248 1015704
59701 1015704 1020139 1025728 1032559 1039496 1045877 1052371 1060014 1069330 1080636 1094305 1110135 1126987 1143628
59688 1143628 1159708 1175635 1191731 1207731 1222907 1236585 1248731 1260044 1271205 1282126 1292340
59677 1292340 1301923 1311294 1320099 1327073 1331289 1332891 1332297 1329476 1324548 1318458 1312365 1306709 1301472 1296954
59663 1296954 1293569 1291094 1288789 1286151 1282973 1278756 1272746 1264650 1254950 1244592 1234745 1226618 1220821 1216842
59649 1216842 1213692 1211042 1209164 1207808 1206042 1203474 1200924 1199385 1198922 1199097 1199868 1201218 1202221 1201528 1199065
59634 1199065 1196563 1195951 1197567 1200314 1203245 1206320 1209584 1212204 1212901 1211171 1207615 1203064 1197918 1192665
59620 1192665 1188372 1185854 1184333 1181736 1176757 1170269 1164273 1159652 1155392 1149947 1142890 1135014 1127143 1119318
59606 1119318 1111317 1103578 1097052 1092031 1087642 1082903 1077978 1073865 1071042 1069119 1067831 1067627 1068913 1071331
59592 1071331 1074251 1077570 1081413 1085366 1088659 1091149 1093581 1096716 1100414 1103619 1104985 1103562 1099179 1092376
59578 1092376 1083978 1074769 1065484 1056757 1048839 1041601 1035111 1029908 1026316 1023663 1020732 1016997 1013029 1009602
59564 1009602 1006764 1003883 1000360 996216 992173 989088 986994 984788 981225 976220 970714 965256 959366 952645
59550 952645 945987 941109 938997 939208 940513 941781 942276 941771 940843 940763 942550 945934 949529 952198 954028 955794
59534 955794 957794 959666 961151 962350 963169 963299 963124 963911 966378 969422 971021 970220 967654 964404 961161
59519 961161 958314 955942 953506 950329 946551 942876 939247 934660 928783 922932 918818 916862 916441 917201 919175
59504 919175 921632 922741 920894 916254 910808 906826 905156 905003 905265 905678 906377 906961 907053 907576 910236 915363
59488 915363 921436 927268 933554 941291 949690 956932 962461 967274 972357 978104 985160 994578 1007043 1022844
59474 1022844 1042412 1065432 1089101 1108594 1120157 1123352 1120221 1113273 1104671 1096219 1089012 1083307 1079134
59461 1079134 1076580 1075261 1074371 1073858 1074780 1077630 1080988 1082874 1083145 1083410 1084503 1085006 1082658 1076548 1067485
59446 1067485 1056709 1044893 1032427 1020064 1008704 998459 988466 978176 968546 961143 955995 951197
59434 951197 945122 938331 932721 929398 928094 928119 928897 929760 930199 930386 930720 930959 930669 930538 932138 936009 940915
59417 940915 945558 950212 955929 962822 970049 977066 983891 990227 995323 998957 1001863 1004899 1008258 1011621
59403 1011621 1014608 1016876 1018350 1019638 1021755 1025063 1028939 1032854 1037227 1042596 1048431 1053713 1058592 1064523
59389 1064523 1072584 1082354 1092588 1102270 1110752 1117716 1123497 1128700 1132972 1135007 1134485 1133062 1132230 1130923
59375 1130923 1126919 1120352 1113986 1109668 1106340 1102422 1098573 1096650 1096958 1098138 1099329 1101034 1104077 1108969
59361 1108969 1116321 1126681 1139788 1154880 1171829 1191090 1212478 1235007 1258200 1282662 1309268
59350 1309268 1338821 1372429 1410364 1449414 1482641 1503468 1510018 1505069 1492919 1477563 1462825 1451889
59338 1451889 1446129 1445623 1450852 1462042 1476044 1485643 1483949 1469472 1446141 1418955 1390857 1363367
59326 1363367 1338189 1316924 1299758 1285492 1272956 1262021 1253373 1247700 1245135 1245085 1246492 1248461 1250762
59313 1250762 1253574 1256718 1259472 1261437 1263343 1266541 1271630 1277933 1284357 1290262 1295144 1298060 1298284 1296698
59299 1296698 1295805 1297725 1302300 1307513 1311629 1314589 1317464 1321196 1326310 1333488 1343639 1357022 1372589
59286 1372589 1388712 1404547 1420365 1436618 1453262 1470339 1488572 1508539 1529334 1548782 1565243
59275 1565243 1578697 1589747 1598113 1602714 1603081 1600147 1595463 1589833 1582865 1573713 1562186 1549055 1535250
59262 1535250 1520961 1505804 1489818 1473898 1459111 1445887 1433925 1422450 1410387 1396820 1381765
59251 1381765 1366224 1351151 1336763 1323246 1311530 1302561 1296015 1290612 1285726 1281978 1280222 1280733 1283572
59238 1283572 1288897 1296513 1305695 1315744 1325955 1334490 1338019 1333577 1320851 1302276 1281087 1259691
59226 1259691 1239474 1221180 1205081 1191142 1179293 1169445 1161364 1154866 1150172 1147770 1147904 1150375 1154820
59213 1154820 1160912 1168405 1177256 1187696 1199927 1213806 1229115 1245964 1264443 1283812 1302593 1319720
59201 1319720 1335177 1349103 1360587 1367989 1370588 1369410 1365997 1360556 1351943 1339796 1326189 1314379
59189 1314379 1305822 1299098 1292078 1284455 1277486 1271890 1267158 1262908 1259790 1258520 1258908 1260542 1263820 1269311
59175 1269311 1276246 1282642 1287254 1290835 1295079 1300813 1307572 1314475 1320715 1325294 1327193 1326391 1324260 1322203
59161 1322203 1319954 1315808 1308687 1299424 1289696 1280147 1270093 1258792 1246403 1233710 1221440 1210067
59149 1210067 1199882 1190925 1182924 1175466 1168213 1160952 1153627 1146388 1139566 1133581 1128887 1125849 1124475 1124241
59135 1124241 1124300 1123872 1122504 1120339 1118361 1118043 1120180 1124075 1128271 1132023 1135721 1140010 1145158 1151362 1159019
59120 1159019 1168210 1178273 1188230 1197457 1205820 1213541 1221201 1229521 1238780 1248521 1257869 1265893 1271770 1275300
59106 1275300 1277490 1279963 1283331 1286740 1289400 1291743 1294278 1296171 1296193 1294650 1292899 1291064 1287753 1282303
59092 1282303 1275662 1268302 1258807 1245829 1230438 1214997 1200257 1185151 1169319 1154173 1141118 1130062
59080 1130062 1120305 1111740 1104318 1097226 1089610 1081617 1073774 1065754 1056880 1047819 1040642 1036791 1035644 1035470
59066 1035470 1035316 1035560 1037125 1040685 1046418 1054089 1063362 1074161 1086526 1099901 1112994 1124836 1135800
59053 1135800 1146992 1158690 1169940 1179806 1188331 1195870 1202054 1206190 1208506 1210243 1212360 1214768 1217155
59040 1217155 1220012 1224178 1229547 1234808 1238558 1240222 1239836 1237452 1233168 1227568 1221758 1216910 1213699 1211993
59026 1211993 1210945 1209640 1207783 1205613 1203101 1199609 1194577 1188198 1181014 1173168 1164494 1155179 1145799 1136785
59012 1136785 1128315 1120658 1114136 1108714 1104077 1100027 1096309 1092138 1086566 1079462 1071545 1063430 1055356 1047988
58998 1047988 1042498 1039332 1037575 1036134 1034901 1034125 1033321 1031669 1029072 1025935 1022219 1017654 1012770 1008779
58984 1008779 1006380 1005440 1005774 1007278 1009060 1009461 1007575 1004239 1001089 999113 998506 999339 1001577 1004693 1008032
58969 1008032 1011698 1016602 1023425 1031836 1040994 1050641 1061349 1073645 1087233 1101361 1115790 1130978
58957 1130978 1147270 1164343 1181561 1198362 1213922 1226931 1236382 1242516 1246458 1248892 1249492 1247749 1244003
58944 1244003 1239517 1235678 1233115 1231434 1229830 1228054 1226730 1226724 1228454 1231836 1236418 1241329 1245596 1248946 1251940
58929 1251940 1255009 1257845 1260162 1262424 1265128 1267874 1269921 1271247 1272264 1272943 1273203 1273893 1276310 1280923 1287460
58914 1287460 1296035 1306994 1319766 1333101 1346612 1361031 1376860 1393919 1412190 1431729 1451422
58903 1451422 1469207 1484111 1496992 1508997 1520542 1532046 1543933 1555007 1562332 1563918 1560455 1553536
58891 1553536 1543524 1530446 1515575 1500342 1484362 1466117 1445191 1422537 1399229 1376371 1355664
58880 1355664 1338357 1323772 1310249 1297365 1285930 1276124 1267297 1259576 1253969 1250493 1247670 1244377 1241076
58867 1241076 1238709 1237464 1237116 1237623 1238763 1239959 1240929 1241874 1242632 1242302 1240188 1236679 1232960 1230162 1228808
58852 1228808 1228540 1228433 1228161 1228696 1231169 1235333 1240192 1245830 1253175 1261902 1270362 1278332 1288377 1303301
58838 1303301 1323000 1344781 1366078 1386013 1405045 1424184 1444193 1464665 1484241 1502476 1521120
58827 1521120 1542651 1567736 1594780 1621673 1647190 1670976 1693241 1714608 1735466 1755079 1771759
58816 1771759 1784226 1792504 1797311 1798830 1796305 1788897 1776906 1762076 1746436 1730883 1715145 1699056
58804 1699056 1683281 1668570 1654907 1641810 1628930 1615825 1601659 1585996 1569674 1554017 1539071
58793 1539071 1523388 1505906 1487464 1469988 1454461 1440159 1425772 1410788 1395597 1380636 1365935
58782 1365935 1351576 1338072 1325847 1314477 1303001 1290996 1278878 1267051 1255288 1243206 1230911
58771 1230911 1218797 1207158 1196345 1186803 1178387 1170043 1161062 1152545 1146776 1144947 1146099 1148435 1150941
58758 1150941 1153445 1155992 1158896 1162855 1168078 1173526 1177842 1180995 1184154 1187887 1191381 1193688 1194829 1195175
58744 1195175 1194659 1193358 1192011 1190861 1188528 1183323 1175539 1167179 1159342 1151106 1141266 1130067 1118703 1108167
58730 1108167 1099140 1092001 1086232 1080648 1074914 1070011 1066591 1063923 1061506 1060664 1063170 1068810 1075625 1082113
58716 1082113 1087896 1092656 1095972 1098209 1100163 1101582 1101169 1098164 1092947 1086079 1077969 1069515 1061742 1054460
58702 1054460 1046517 1037803 1029858 1023951 1019571 1015433 1011095 1007023 1003912 1002516 1003430 1006458 1010749 1015820
58688 1015820 1021738 1028101 1033889 1038700 1043165 1047663 1051752 1055442 1059875 1065941 1073179 1080899 1089309 1098496
58674 1098496 1107297 1114574 1120997 1128194 1136465 1144584 1151639 1157897 1163888 1169682 1175201 1180445 1185330 1189886
58660 1189886 1194583 1199824 1205180 1209731 1213148 1216089 1219734 1225276 1233318 1243053 1252373 1259558 1264696 1268844
58646 1268844 1272163 1273695 1272718 1269417 1264204 1257132 1247958 1236122 1220846 1202035 1181048 1159786 1138969
58633 1138969 1118043 1096728 1075775 1056041 1037705 1020757 1005396 991529 978551 966243 955365
58622 955365 946690 939809 933528 927292 921518 916512 911784 906837 902094 898458 896095 894276 892496 891128
58608 891128 890778 891658 894011 898398 904747 911700 918068 924671 933395 944260 954697 962165 966342 968231
58594 968231 968392 967077 965086 963136 960770 957025 952055 947086 942793 938572 933578 927923 922565 918230
58580 918230 914592 910576 905655 900612 896559 893508 890796 888827 889017 891598 894838 897317 899829 903892
58566 903892 909277 914223 917395 918365 916695 912006 904870 896588 888058 879504 870909 862067 852893 844695
58552 844695 840368 841890 847901 855059 861625 868526 877072 887052 897167 906235 913775 920227 926554 932829
58538 932829 937555 939499 939782 940765 943082 945327 946742 948411 951392 955268 959475 964798 972461 982411 993395
58523 993395 1004428 1015665 1028099 1042569 1058715 1074982 1090206 1104991 1120704 1137331 1153399
58512 1153399 1168011 1181731 1195261 1208571 1221891 1236471 1253603 1273576 1296132 1321202 1348622
58501 1348622 1377736 1407849 1438765 1470654 1503766 1538185 1573156 1606638 1636386 1661485 1681933
58490 1681933 1696840 1704531 1704929 1700556 1694312 1687110 1678274 1667284 1654318 1639873 1624727 1609784 1595271
58477 1595271 1580418 1564231 1545834 1523913 1497088 1465748 1432583 1400225 1369085 1338572 1309672
58466 1309672 1284764 1264963 1248992 1234964 1222195 1210861 1200782 1191332 1182216 1173644 1165667 1157761
58454 1157761 1149242 1139958 1130429 1121472 1113992 1108910 1106657 1106407 1106354 1105343 1103913 1103226 1103297 1102940 1101287 1098648
58438 1098648 1095920 1093853 1092995 1093675 1095723 1098434 1100957 1102649 1103396 1103884 1105228 1107993 1111918 1116770 1122734
58423 1122734 1129530 1136180 1142551 1150165 1160344 1172363 1184806 1198014 1213609 1232116 1252713 1274876
58411 1274876 1298227 1320849 1339807 1353695 1363002 1367813 1367154 1361141 1351925 1341639 1330920 1320172
58399 1320172 1310722 1303782 1299527 1298009 1299674 1304173 1310026 1316464 1324533 1335386 1348377 1361655 1373807
58386 1373807 1384207 1392501 1398405 1401422 1400513 1394983 1385808 1374970 1363454 1351206 1339067 1328861 1321161
58373 1321161 1314859 1309470 1305862 1303950 1301992 1299482 1298646 1301301 1305960 1309913 1312836 1316400 1321457 1327506
58359 1327506 1334129 1341154 1347848 1353354 1357392 1359456 1358205 1352982 1345133 1336475 1327232 1316727 1305342
58346 1305342 1294414 1284811 1276691 1269874 1263277 1254967 1244228 1232953 1223795 1217650 1214012 1212619 1213177
58333 1213177 1214383 1215112 1216108 1218939 1223614 1228722 1233529 1238502 1243899 1249120 1253433 1256483 1258339 1259830
58319 1259830 1262393 1266794 1272464 1278687 1285687 1293814 1302561 1311262 1319953 1328761 1337357 1345791 1354891 1365073
58305 1365073 1375846 1387165 1399901 1414218 1429084 1444295 1461174 1480149 1499641 1518746 1538819
58294 1538819 1560520 1581421 1598903 1613613 1627469 1639946 1649208 1655706 1661580 1667337 1672067 1676533
58282 1676533 1683147 1692885 1704512 1716653 1728532 1739124 1748010 1756969 1768599 1783379 1799830 1817053
58270 1817053 1835105 1853494 1871774 1891399 1914568 1940983 1967634 1991852 2012977 2031290 2047148
58259 2047148 2061280 2074449 2086809 2098458 2109811 2120457 2129020 2135674 2143244 2154030 2167091 2180719
58247 2180719 2195730 2213652 2233337 2252452 2271100 2290929 2311873 2332947 2355185 2380436 2407988
58236 2407988 2435651 2463372 2492582 2522962 2553456 2585608 2621963 2661669 2701570 2741329 2783497
58225 2783497 2828690 2874793 2921014 2968640 3017552 3066152 3115382 3168862 3228128 3291299 3357135
58214 3357135 3426852 3501108 3578699 3659168 3743641 3832482 3925071 4022112 4124974 4232885 4344281
58203 4344281 4460722 4585452 4718226 4855937 4998532 5149614 5310608 5479165 5654201
58194 5654201 5837710 6030268 6229435 6434254 6647057 6869183 7099032 7336010 7582602
58185 7582602 7841180 8112522 8398657 8703271 9028196 9373247 9740104 10132288 10550922
58176 10550922 10995266 11468027 11975361 12520994 13105168 13729418 14396618 15105992 15854602
58167 15854602 16645122 17486077 18383222 19336760 20347927 21421657 22561811 23771181 25058080
58158 25058080 26436245 27917253 29510494 31231515 33102292 35142160 37366844 39796569
58150 39796569 42454865 45358281 48518568 51957704 55712138 59825386 64353528 69380195
58142 69380195 75007737 81326312 88406054 96325900 105199577 115179197 126461604 139295678
58134 139295678 153947545 170631254 189482956 210616373 234217407 260643380 290468846
58127 290468846 324239040 361668589 400559431 436418989 463614888 477661287 477096177
58120 477096177 463678565 441040434 412982115 382430481 351240500 320470682 290747286
58113 290747286 262516792 236136390 211861210 189828493 170076191 152560023 137151504
58106 137151504 123650784 111829348 101467678 92363867 84333544 77218469 70889663
58099 70889663 65237255 60165207 55598278 51482344 47770532 44414554 41371253 38607720
58091 38607720 36094582 33800688 31697984 29765436 27985090 26339995 24818225 23413014
58083 23413014 22116519 20918308 19810505 18788029 17842610 16963002 16142321 15378528 14666277
58074 14666277 13995126 13357801 12753690 12182116 11638712 11120969 10630930 10169229 9731936
58065 9731936 9316112 8923063 8553142 8202382 7867294 7548268 7245421 6955772 6677469
58056 6677469 6412394 6161615 5922439 5692922 5475099 5270515 5076199 4888305 4706676
58047 4706676 4532974 4367335 4209484 4060210 3919024 3783037 3650594 3523596 3404231
58038 3404231 3292076 3186352 3088151 2998173 2914771 2836255 2762723 2693844 2627446 2562182 2499208
58027 2499208 2439532 2382259 2327093 2275800 2229277 2185587 2142644 2100470 2059223 2017681 1975493
58016 1975493 1934533 1896253 1860004 1825302 1792956 1762350 1730566 1696232 1661587 1628705 1596449
58005 1596449 1563419 1531262 1502462 1476921 1453107 1430619 1409412 1388400 1367009 1346390 1327167
57994 1327167 1307876 1287501 1267527 1249526 1232718 1215880 1199630 1184796 1170671 1157092 1146066
57983 1146066 1138876 1133515 1127466 1121174 1116185 1111655 1105553 1097859 1089714 1080639 1069453 1057067 1045619
57970 1045619 1035362 1024680 1012594 999166 984283 968285 953119 940697 930561 921012 911742 903363
57958 903363 895207 885993 876267 867992 861810 856560 851387 846598 842543 839085 836079 833240 829971 826442
57944 826442 824081 823735 824136 823604 822420 821904 821956 821388 820156 819400 819429 819207 817806 815137 811582 808024 805696
57927 805696 804673 803023 798831 792641 786592 781601 776863 771717 766463 761433 756632 752341 748991 746411
57913 746411 743991 741357 738225 734210 729721 726494 726090 728109 730656 732127 731871 729944 727295 725657 726165
57898 726165 728340 730921 732893 733164 730503 724963 718433 712644 707501 702394 697930 694943 692853 690578
57884 690578 688272 686589 685111 683233 681897 682610 685159 688063 690993 694976 700372 706404 712743 719969
57870 719969 728055 735682 741511 745339 747801 749481 750315 749474 746257 741503 737395 735125 733497 730560 725807
57855 725807 719949 713526 706796 700070 693137 685401 677670 672509 671289 672023 671842 670550 669860 670179 670503
57840 670503 670892 672595 675654 678428 679837 680501 681585 683904 688043 693851 699807 704254 707176 709593 711701
57825 711701 713093 714262 716001 717580 717403 715444 713252 711552 709651 707306 705293 703756 701644 698235
57811 698235 693884 688998 683602 678073 672941 667921 662458 657104 652879 649485 645985 643133 642921 645585
57797 645585 649062 651954 655125 659717 665439 671626 678352 685650 693039 700391 707760 713937 717078 717610
57783 717610 718470 721302 724312 725411 725710 727791 731651 734609 734818 732863 729903 725981 720786 714872 709291
57768 709291 704381 699435 693601 686985 680810 676428 674190 673295 672448 670454 666700 661609 656284 651259 646124
57753 646124 640957 637145 635609 634890 632538 628058 622915 617946 612586 606690 601090 595868 589849 582588
57739 582588 575416 569697 565289 561460 558172 555713 554097 553378 553623 554183 554203 554221 555897 559638 563910 567527
57723 567527 571094 575370 579756 583485 586927 590615 594290 598133 603558 611251 619579 626586 632681 639609
57709 639609 647451 654469 659689 663954 668320 672796 676949 680823 684934 689827 695626 701709 707257 712397
57695 712397 717941 723345 725930 723392 716528 708323 700751 693550 685688 676709 666783 656692 647868 641487
57681 641487 637419 634726 632974 632257 632304 632632 633396 635059 637289 639267 640911 642674 644190 644509 643864 643830
57665 643830 645288 647470 649544 651773 654235 655733 655445 654848 656467 660859 666055 669972 672196 673334 673899
57650 673899 674320 675054 675963 676157 674980 672637 669480 665423 660777 656898 654947 654361 653506 651571 648850 645558
57634 645558 641737 638274 636411 635858 634814 632449 629923 628147 626096 622702 619263 618291 620552 624740 629575
57619 629575 634780 640343 646401 653919 664339 678480 696610 719168 746292 777201 811569 851185
57607 851185 898422 952668 1009368 1062364 1105734 1133890 1142665 1131750 1104940 1067251 1022707 974829
57595 974829 927118 881760 839022 798892 762381 730561 703518 681002 662974 648724 636644
57584 636644 625723 616160 607875 599875 592056 586036 582758 580634 577768 574856 573876 574603 574566 572343 569100
57569 569100 566673 565645 565546 565698 565385 564170 562322 560314 557855 554278 549934 546275 544274 543482 542926 542253
57553 542253 541562 540564 538458 534656 529414 523755 518836 515424 513820 513782 514279 513945 512537 511483 511911 512472
57537 512472 510640 506193 501635 498638 495966 491956 487185 482986 478905 473902 469137 466950 467169 466854 464179
57522 464179 460486 457617 455135 451644 447655 445369 445806 447466 448011 446516 443757 440871 438251 435584 432469
57507 432469 428748 424539 420383 417232 415706 415176 414026 411170 407092 403238 400741 399809 399824 399814 399273 398855
57491 398855 399811 402502 405933 408919 411021 412042 411518 409498 407269 406527 408054 411638 416766 422726 428446
57476 428446 433016 436279 438648 440714 443302 447104 451448 454056 453033 448935 444135 440347 437448 434474
57462 434474 430939 427115 423633 420961 419035 417511 416475 416437 417261 417690 416537 413919 410638 406699 401282
57447 401282 394101 386092 378573 372142 366523 361349 356971 354273 353407 353041 351596 349189 347505 347718 349410
57432 349410 351612 353707 355023 354945 354142 354481 356851 360173 363369 366992 371627 375938 378017 378067 378148 379598
57416 379598 382005 384357 385865 385943 384681 383275 382913 383352 383514 383088 382517 381946 381521 382298 385275 389466 392437
57399 392437 393037 392412 392106 392262 392115 391259 389921 388585 387708 387452 387681 388492 390321 392909 394606 393730 390516
57382 390516 386941 384705 384002 384006 383796 383079 382689 383973 386853 389121 388772 386583 385056 385089 385187 384007 382175
57365 382175 381061 380915 380996 381044 382003 385192 390635 396306 399780 400979 402295 405359 408892 410924 411904 413748
57349 413748 416598 418797 419956 421881 425960 431281 435949 438965 440366 440762 441278 442903 445425 447795 449647
57334 449647 451502 453410 454570 454590 454100 453830 453998 454688 455884 456960 457194 456930 457343 459023 461752 465422
57318 465422 469903 474100 476746 478350 480891 485107 489392 491816 491994 490558 488140 485559 483836 483192 482740
57303 482740 481675 480066 478274 476439 474799 473616 472677 471794 471783 473682 476891 479519 480891 482299 484773
57288 484773 487497 489126 489481 489258 489122 489755 491787 495009 498493 501890 505609 509359 511777 512214 511850 512366
57272 512366 514370 517647 521945 526862 531775 536405 540774 544492 547165 549613 553275 558061 562380 565864
57258 565864 570363 577314 585568 593000 599004 604233 609034 613537 618465 624573 631846 640189 650221 662329
57244 662329 675605 688774 701688 714968 728683 742321 755672 768872 781816 794225 806007
57233 806007 817068 827075 835827 843534 850443 856649 862508 868603 875142 881951 889075 896509 903344 908372
57219 908372 911876 915643 920753 926501 931955 937386 943531 950631 958899 968773 979900 990887 1001005
57206 1001005 1011244 1022864 1035670 1048515 1060743 1072516 1084436 1097404 1111998 1127486 1142390
57195 1142390 1156569 1171632 1188607 1206377 1223416 1240132 1258369 1279029 1301040 1322387 1341838
57184 1341838 1360098 1379338 1400909 1423605 1445201 1465433 1485868 1506829 1526436 1543360 1558722
57173 1558722 1574269 1590256 1606206 1622467 1639944 1659368 1681519 1706854 1734181 1761149 1786907
57162 1786907 1812884 1840223 1868084 1895457 1922795 1950564 1977771 2003471 2028363 2053412 2078073
57151 2078073 2101334 2123514 2145824 2169204 2194693 2223776 2257201 2294449 2335123 2379426 2426323
57140 2426323 2473097 2518145 2562812 2609254 2658099 2709486 2764343 2822724 2882469 2941541 3000444
57129 3000444 3060572 3121482 3181732 3241236 3300870 3360772 3420773 3481468 3543139 3604698 3665400
57118 3665400 3726493 3789537 3854115 3918818 3983325 4047995 4112727 4177872 4244781 4313586 4381781
57107 4381781 4446960 4509719 4572166 4635136 4698965 4765374 4836028 4910216 4986174 5063797 5144009
57096 5144009 5226477 5310051 5394469 5479724 5564863 5649247 5733705 5818424 5900956 5978295 6049656
57085 6049656 6115517 6175673 6230484 6282159 6332204 6379009 6420390 6457002 6490771 6521593 6548343
57074 6548343 6571721 6593190 6612001 6625673 6632535 6632085 6624265 6609923 6589757 6561031 6517924 6457111
57062 6457111 6379847 6286251 6171325 6029909 5861857 5668618 5448297 5198075 4917712 4605958
57052 4605958 4256832 3863946 3424787 2935887 2387837 1770776 1081403 319632 -516756
57042 -1427596 -2404299 -3434012 -4504559 -5600389 -6703977 -7815081 -8967588 -10221320
57034 -10221320 -11642972 -13298724 -15248427 -17529556 -20155572 -23142103 -26519493 -30316088
57026 -30316088 -34594456 -39586608 -45760924 -53579714 -63008518 -73207998 -82764642 -90321015
57018 -90321015 -95121668 -97149332 -96910101 -95104026 -92350520 -89044802 -85371863 -81426615
57010 -81426615 -77318173 -73178029 -69104938 -65121476 -61169430 -57135799 -52908194 -48445117
57002 -48445117 -43812324 -39152404 -34619217 -30333337 -26372829 -22776895 -19551178 -16679801
56994 -16679801 -14139425 -11903806 -9942220 -8222474 -6715854 -5395755 -4234902 -3209537
56986 -3209537 -2304266 -1507686 -805157 -180487 377448 875019 1319304 1718667 2079077
56977 2079077 2404562 2700728 2973785 3226650 3459720 3675000 3876072 4064509 4240049
56968 4240049 4404731 4564055 4723399 4884637 5045577 5200529 5341672 5461780 5555897 5620156
56958 5620156 5650886 5646815 5611325 5551116 5473559 5385981 5294998 5204009 5112233 5017788 4920496
56947 4920496 4820478 4716111 4605587 4488879 4365972 4234709 4092899 3941568 3783805
56938 3783805 3621366 3454649 3285186 3115913 2949559 2788697 2636618 2495998 2366906
56929 2366906 2247759 2137694 2036569 1943671 1858472 1782120 1716035 1659017 1607242 1556913 1505684
56918 1505684 1452146 1395765 1337378 1278377 1219255 1159729 1099950 1040773 983306 928955 879195
56907 879195 834452 793893 757044 724532 696313 670498 645349 621585 601341 585593 573645
56896 573645 564154 555337 545151 532670 518533 502836 483725 459676 432272 405095 380459 358485
56884 358485 338454 319538 301053 283597 269129 258420 249430 240074 231604 227040 227003 229509 233602
56871 233602 240563 251036 262933 272741 277295 274059 261653 241141 215704 188205 159732 130647
56859 130647 101983 75228 51384 30624 12471 -3782 -18569 -32088 -44984 -58225 -71907 -85196
56847 -85196 -98253 -113003 -130631 -149344 -166261 -180790 -194323 -207171 -217923 -225792 -231552 -235784
56835 -235784 -237928 -237601 -235459 -232229 -227996 -222765 -216555 -208561 -197418 -182762 -165762 -148010 -130889
56822 -130889 -116052 -105174 -98661 -95493 -94655 -95886 -98811 -102384 -105580 -107821 -108468 -106693 -102176 -95176
56808 -95176 -85813 -74022 -60160 -44542 -26256 -3582 24121 55996 91347 130251 171516 211042
56796 211042 243407 265009 275328 275788 268183 254112 235408 214760 195381 179467 167178 157766
56784 157766 151490 149616 152816 160827 173804 192750 218215 249684 286684 329324 376983 427408
56772 427408 477817 525869 568542 601008 618178 617535 599997 568706 528010 483017 438359 396563
56760 396563 358173 323612 294145 270737 252860 239290 229801 225372 226939 234678 248601 268973
56748 268973 295551 326807 360466 394407 426207 452013 467116 468388 455943 432458 401621 367392
56736 367392 333450 302066 273655 248039 225691 207104 191540 177581 164929 154926 149251 148672
56724 148672 152844 160696 171201 184322 200712 219605 237479 250022 255312 253931 246350 232044
56712 232044 211581 187747 163361 139130 114834 91747 72273 57283 45003 32781 19357
56701 19357 5357 -7712 -18650 -27188 -33986 -40108 -46373 -52925 -59092 -63719 -66127 -66932 -67647 -69332 -71946
56686 -71946 -75072 -78675 -82799 -86963 -90411 -92827 -94433 -95557 -96441 -97275 -97962 -97940 -96705 -94593 -92604 -91283
56670 -91283 -90116 -88362 -86235 -84779 -84520 -84769 -84523 -83657 -82615 -81176 -78387 -73986 -69263 -65983 -64869
56655 -64869 -65446 -66788 -67830 -67484 -65413 -62570 -60228 -58560 -56877 -55029 -53486 -51929 -49009 -44112 -38513
56640 -38513 -33964 -30811 -28215 -25762 -23885 -22908 -22529 -22336 -22145 -21726 -20822 -19615 -18716 -18435 -18488 -18640 -19213
56623 -19213 -20560 -22313 -23662 -24312 -24801 -25806 -27476 -29546 -31888 -34664 -37934 -41192 -43400 -43644 -41925
56608 -41925 -39263 -36926 -35643 -35633 -37052 -39807 -43048 -45536 -46796 -47375 -47658 -46993 -44532 -40459 -35739 -30961
56592 -30961 -26078 -21081 -16123 -10930 -4677 3433 13697 25650 37740 47746 54567 59421 64352
56579 64352 69706 74293 77917 82105 87754 93600 98038 101335 104763 108302 110596 110872 109765 108301 107011
56564 107011 106112 105760 105876 106128 106179 105854 105271 105045 106009 108432 111830 115711 119864 123595 125366 123950 119666
56547 119666 114103 108975 105362 103201 101046 97303 92419 88928 88374 89104 88284 85438 82592 81441 81828
56532 81828 82766 83481 83409 82505 81774 82410 84172 85590 85922 85937 86652 88252 90390 92582 94104 94523 94574 95560
56514 95560 97636 99624 100800 101780 103233 104834 106178 107830 110550 114092 117638 121119 125356 130972 137775
56499 137775 145341 153884 164287 176996 190771 202869 210944 214653 215149 213581 210887 208506 207890 208987
56485 208987 210112 209610 206950 202316 196297 190344 186286 184630 184037 183090 181881 181324 181602 181946 181365 179029
56469 179029 174622 169047 164200 161223 159355 157200 154710 153057 152801 153075 152578 150717 147749 144455 141782
56454 141782 140286 139710 139331 138685 137696 136296 134552 133202 133349 135079 136820 136697 134551 132130 131112 131366
56438 131366 131459 130503 128983 127983 128197 129663 131730 133139 132882 131352 129998 129470 128837 127110 124635 122152
56422 122152 119453 116254 113728 113531 115432 117541 119084 121336 125335 130184 134562 138664 143305 147808
56408 147808 150245 149754 147702 146412 147208 149675 152292 153667 153488 152448 151285 150123 148726 147058 145457
56393 145457 144400 144163 144392 144096 142584 140570 139760 141045 143518 145546 146450 146835 147690 149523 152064 154510
56377 154510 156294 157833 160156 163466 166437 167417 166121 163768 161748 160715 160836 162300 165109 168682 172060
56362 172060 174538 175980 176584 176676 176803 177626 179399 181672 183814 185612 187128 188384 189745 192120 195738
56347 195738 198875 199126 196237 192563 190326 189681 189998 191459 194132 196753 198045 198493 199311 200323 200591 200683
56331 200683 202339 205850 209481 211832 213271 214628 215831 216358 215890 213951 209855 203656 196420 189178 182121
56316 182121 175023 167869 161068 155638 152962 153540 156224 159642 163955 169956 176869 182794 187366 192249
56302 192249 198636 205874 212907 219376 224594 227181 226787 225011 223654 223083 223020 223668 225121 226753 228221
56287 228221 230216 233291 236832 240058 243173 246682 250356 253829 257471 261731 266189 270088 273395 276696
56273 276696 280557 285401 291255 297181 301822 305082 308354 312548 316962 320800 324704 329726 335639 341406
56259 341406 346636 351574 356161 360089 363406 366284 368524 369930 370904 372200 374525 378479 384150 390479
56245 390479 395924 400071 403789 407661 411582 416116 422532 430761 438935 446028 453448 462718 473082 482949
56231 482949 492458 502844 514124 525100 535093 544189 552399 560215 569550 582480 599051 617446 636178
56218 636178 655121 674687 695031 716031 737407 759252 782848 809965 840604 872556 904208
56207 904208 936565 971205 1007660 1044788 1083777 1127456 1176855 1230524 1287406 1348494 1415285
56196 1415285 1488239 1567383 1653232 1746388 1846954 1954896 2070787 2196186 2333303 2483562
56186 2483562 2645949 2817500 2996134 3182145 3376048 3575934 3778167 3979639 4177589
56177 4177589 4367757 4544610 4703514 4841430 4955592 5042857 5100511 5126799 5120819 5082914
56167 5082914 5015072 4920139 4800904 4660707 4504190 4336207 4160305 3979148 3795772 3613262
56157 3613262 3433751 3258876 3090532 2929920 2776587 2629869 2490569 2359758 2236868
56148 2236868 2120855 2012476 1913180 1822109 1736620 1655822 1581319 1514075 1452704 1395505 1342228
56137 1342228 1292959 1246953 1203664 1163744 1127970 1095902 1066305 1038329 1011922 987683 966455
56126 966455 948481 932986 919093 906765 896051 886033 875711 865456 856233 847814 839298 831126
56114 831126 824848 820862 818020 815638 814390 814874 816697 819346 822817 827132 832319 838924 847424 857127
56100 857127 866883 876818 888120 901147 915118 929750 945837 964060 984487 1007337 1033018 1061363
56088 1061363 1092024 1125642 1163461 1206022 1253553 1307356 1369140 1439098 1516294 1600787 1693458
56077 1693458 1793489 1897845 2003646 2109278 2212610 2309780 2396736 2471169 2532850 2583451
56067 2583451 2626377 2665338 2702209 2736567 2766916 2791293 2807338 2813709 2811735 2804291 2792833 2776365
56055 2776365 2752615 2718623 2670881 2607342 2529666 2441904 2347231 2247807 2147351 2051057 1962287
56044 1962287 1881263 1807325 1740500 1680674 1627516 1581728 1544322 1514143 1488251 1465314 1446384
56033 1446384 1431723 1419238 1407218 1396602 1389291 1385814 1385658 1388352 1393160 1399019 1405572 1413146 1421353
56020 1421353 1429192 1436927 1446261 1458162 1471931 1486677 1502131 1517869 1533466 1549697 1567767 1587203
56008 1587203 1606336 1624940 1644284 1664463 1684016 1702593 1721721 1742491 1764599 1788052 1813520
55997 1813520 1840571 1867827 1895275 1924240 1954787 1985564 2016471 2048955 2083381 2118716 2154929
55986 2154929 2192745 2230771 2266150 2298728 2331532 2366631 2403788 2443586 2487947 2536536 2586648
55975 2586648 2638251 2695291 2760069 2829839 2901214 2974787 3053141 3137096 3226069 3319550 3416182
55964 3416182 3513798 3612184 3713679 3819881 3930399 4045897 4169259 4302279 4444017 4593589
55954 4593589 4751519 4917410 5089764 5269234 5458462 5657737 5864838 6080298 6308273
55945 6308273 6550612 6804700 7069218 7347504 7643078 7956335 8287762 8639777 9013210
55936 9013210 9406889 9823326 10269984 10752300 11270063 11822663 12412282 13039317 13700797
55927 13700797 14396909 15133789 15916788 16746762 17625986 18561246 19557567 20615616 21739520
55918 21739520 22941019 24232349 25622304 27123493 28756020 30539404 32488131 34618957
55910 34618957 36953725 39510551 42302030 45348219 48683824 52351836 56405959 60926199
55902 60926199 66015488 71768581 78255536 85545061 93733601 102951497 113370799 125228732
55894 125228732 138826414 154484786 172509359 193192708 216807012 243566900 273597621
55887 273597621 306811830 342452310 378355080 410611650 434388959 445749012 443270432
55880 443270432 428346356 404171841 374363532 342035953 309472654 278143590 248872340
55873 248872340 222057770 197854744 176263983 157178456 140436226 125855077 113223513
55866 113223513 102290257 92793803 84502833 77223763 70788444 65055109 59915613 55287638
55858 55287638 51102354 47305741 43862069 40743387 37917797 35353222 33025161 30912252
55850 30912252 28989102 27230531 25618387 24138243 22774203 21512467 20345096 19264639
55842 19264639 18259599 17320034 16442523 15624344 14857621 14134703 13454697 12818943 12223817
55833 12223817 11663383 11135515 10639933 10173145 9730529 9311040 8915340 8541483 8186568
55824 8186568 7850356 7533427 7233753 6948532 6677228 6419549 6172494 5932405 5698007
55815 5698007 5469098 5244884 5026203 4816567 4617970 4427998 4243547 4064843 3893358
55806 3893358 3728689 3570350 3419947 3278615 3144699 3016786 2896647 2786532 2685910
55797 2685910 2593377 2509163 2432975 2361837 2292927 2226414 2163098 2101874 2042157 1985953 1934335
55786 1934335 1884321 1832530 1779864 1729468 1682136 1636885 1594065 1554535 1517316 1481096 1446553
55775 1446553 1414486 1383385 1351765 1321064 1293213 1267080 1240524 1214368 1190973 1170067 1149208
55764 1149208 1127341 1104891 1081472 1056610 1031939 1009698 989680 970205 951096 933090 915428
55753 915428 897024 879023 863227 848888 834214 820298 810162 804253 800091 796348 794141 794098 795204
55740 795204 797114 800887 806661 812818 818055 822315 825238 825758 823874 821029 818125 814695 810530 806522
55726 806522 803261 800084 796238 792058 788437 785619 782620 777451 768292 755102 739647 723400 706232
55713 706232 687936 669901 653941 640290 628189 617799 610096 605298 602673 601487 601025 600212 598339
55700 598339 595662 592460 588373 583647 579786 577581 575476 571346 564995 557523 549333 540379 531279 522310
55686 522310 512185 499760 486356 474566 465328 457740 451053 445143 439792 435265 432720 432200 431088
55673 431088 426650 419457 412270 406319 400979 396348 393473 392092 390484 387609 383458 377725 370442 363565
55659 363565 359360 357136 354081 349408 345120 342386 339983 337196 335642 336841 339878 342763 344689 345955
55645 345955 347053 348700 351491 354698 356406 355397 351898 346373 339014 330737 323104 316721 311066 306263
55631 306263 303428 302731 302637 301810 300457 299186 297954 296928 297159 299574 304192 310721 318759 327010 333678
55616 333678 338348 342325 346491 349932 351313 350559 348625 346616 345567 345930 346746 346461 345000 343867 343829 343894
55600 343894 343179 342258 341779 341233 340250 339890 341303 343902 346085 347143 347339 346615 344368 340402 335390 330459
55584 330459 326675 324546 323712 323425 323440 323954 324684 324823 323935 321993 318535 312939 305700 298199 290887 283070
55568 283070 274883 267874 262759 258076 252315 246227 241665 239082 237601 236860 237219 238418 239439 239762 239659
55553 239659 239084 237274 233837 229653 226185 223985 222073 218922 214172 209175 205528 203328 201429 199194
55539 199194 197016 195154 193141 190769 188683 187400 186431 184867 182375 179372 176903 176480 178967 183061 185861
55524 185861 185757 184016 182830 182572 181953 180325 178753 178831 181112 184831 188889 193085 198331 205318 213221
55509 213221 220503 226931 233761 241684 249680 256397 261568 265417 267699 268235 267574 266271 264172 261208 258036
55494 258036 254887 250600 244135 236577 230300 226225 223088 219485 215528 212260 210331 209728 210229 211658 213800
55479 213800 216175 217873 217919 216233 214044 212865 213061 213831 214552 215662 218007 221671 225738 229222 231938
55464 231938 234334 236650 238711 240644 243218 246948 251187 254631 256407 256132 253333 247658 239429 229229
55450 229229 217245 203894 190663 179049 168844 158849 149226 141466 135829 130604 124630 119009 115432
55437 115432 114160 114472 115687 116678 115866 113177 110861 110869 112215 112397 110644 108265 106372 104908 103608 102538
55421 102538 101752 101508 102491 104745 106854 107428 107038 107385 108925 110694 112189 113843 115687 117122 118187 119611
55405 119611 121280 122073 121676 121276 121805 122631 122710 122085 121471 121089 120734 120559 121072 122461 124246 125421 124914 122400
55387 122400 118808 115623 113562 112424 112156 113260 115929 119471 123009 126121 128422 129244 128458 127231 127115
55372 127115 128284 129181 128167 125261 122037 119911 118902 118211 117599 117547 118174 118890 119438 120463 122355 124203
55356 124203 124806 124318 123994 124539 125641 126990 128674 130435 131522 131649 131381 131229 130907 129899 128307 126885
55340 126885 126399 126951 127596 126853 124155 120682 118178 117105 116746 116835 117896 119799 121264 121406 120804 120340 119854
55323 119854 118911 118241 119227 122004 124938 126155 125093 122546 119702 117291 115452 114172 113763 114621 116473
55308 116473 118230 118885 118329 117055 115445 113733 112319 111520 111115 110660 110228 110327 111037 111825 112396 113127 114238
55291 114238 115027 114638 113377 112505 112615 113031 113145 113562 115133 117346 118659 118394 117429 116917 117176 118022 119296
55274 119296 120545 120927 120126 118932 118380 118661 119299 119955 120562 121185 122202 124060 126356 127843 128039 128073 128967
55257 128967 129794 128863 126326 124192 123792 124511 125114 125060 124308 123051 122049 122218 123441 124632 125164 125272 125026
55240 125026 124268 123924 125711 129569 132777 132899 130690 128819 128578 129214 129766 129885 129077 126838 123823 121623
55224 121623 120983 121249 121756 122760 124495 126249 127027 126539 125073 122976 120897 120013 121174 123761 125937 126197
55208 126197 124562 122298 120749 120537 121645 123873 126937 130236 132982 134764 135690 135723 134326 131239 127332
55193 127332 124085 122352 122171 123494 126194 129291 131181 131069 129477 127007 123511 119142 115320 113522 113484
55178 113484 113708 113520 113517 114031 114449 114426 114627 115565 116603 116958 117045 117847 119323 120373 120220 118971 116895 114178
55160 114178 111614 110651 112093 115117 118016 119779 120696 121615 122847 123817 123733 122597 121365 120909 121122 121448
55144 121448 122052 123805 127183 131684 136326 140091 141995 141630 139910 138509 138176 138240 137995 137698 137645 137127 135229
55127 135229 132158 129001 126641 125675 126831 130284 134611 137522 137897 136481 134459 132166 129548 127185 126166
55112 126166 126993 128987 130927 132177 133030 133820 134055 133073 131473 130955 132239 133941 134268 133218 132217 132068
55096 132068 132339 132520 132633 132607 132042 130908 129831 129395 129695 130536 131543 132148 132133 132127 132820 133788 133917 132935 131532
55077 131532 129954 127738 125202 123893 124704 126469 127466 127652 128407 130367 132562 133742 133819 133670 133911 134188
55061 134188 133671 132139 130367 129334 129334 130193 131995 134893 138344 141380 143697 145624 146916 146664 144944 143543
55045 143543 144159 146407 148379 148795 147874 146524 145559 145644 147163 149859 152871 155247 156388 156293 155618 155247 155503
55028 155503 155986 156344 156784 157524 158230 158522 158699 159425 160908 162864 165060 167308 169020 169435 168436 166835 165612
55011 165612 164970 164199 162436 159610 156563 154164 152516 151395 151165 152557 155480 158869 161835 164232 165839
54996 165839 166024 164801 163334 162519 161746 160014 157710 156180 155842 155830 155478 155145 155404 156218 157162 157873 158167
54979 158167 158092 157878 157366 155777 152764 149522 147928 148470 149868 150875 151522 152192 152419 151486 149751 148454
54963 148454 148196 148207 147328 145354 143126 141367 139825 137937 136192 136149 138644 142396 145108 145793 145404 145301
54947 145301 145918 147086 148766 150858 152889 154521 156150 158361 160921 162809 163273 162498 161176 159833 158685
54932 158685 157857 157400 157196 157084 157031 157002 156697 155769 154508 153982 155079 157494 160032 161927 163462 165183 167011
54915 167011 168410 169237 170120 172009 175251 178902 181124 180792 178742 176881 176008 175233 173675 171734 170181
54900 170181 168989 168010 168011 169760 172396 173934 173409 171630 169847 168621 167987 167716 167268 166307 165336 164902 164243
54883 164243 161996 158540 156244 156661 158698 160573 162473 165767 170222 173704 174754 174109 173380 173344 174072 175696
54867 175696 178077 180220 180994 180454 179824 180114 181326 183193 186051 190415 196000 201844 207471 213384 220220
54852 220220 227945 236243 245112 254370 262855 269007 272425 274154 275112 274806 272092 266886 260622 255088 251150
54837 251150 248438 245825 242166 237007 230913 225091 220435 216840 213494 209926 206644 204489 203477 202706
54823 202706 201643 200954 201550 203186 204759 205932 207576 210465 214332 218627 223507 229392 236072 242988 250078
54808 250078 257530 264760 270433 273708 274950 275073 274696 274049 273048 271090 267334 261714 255326 249353 243918
54793 243918 238504 233024 227659 221934 215141 207828 201830 198250 196355 194968 193954 193353 192036 188812
54779 188812 184526 181450 180505 180503 180355 180425 181033 181191 180016 178336 177468 177109 175782 173068 170193 168544 168626
54762 168626 170268 172682 174270 173546 170644 167374 165670 166382 169097 172221 173536 172004 169191 167793 168613
54747 168613 170102 171028 172006 173722 175162 175031 174087 174490 176955 179766 180823 179829 178100 176825 176028 175174
54731 175174 174406 174760 176965 180342 183420 185451 186688 187275 186834 185527 184578 184984 186285 187370 188190 189883
54715 189883 193286 197898 202330 205395 206825 207292 207756 208727 210300 212783 216645 221538 226035 229094 231546
54700 231546 235558 242612 252324 263039 273202 282205 290209 297204 302276 304184 302731 299125 294795 290411
54686 290411 286136 281956 277198 270535 261419 251160 241816 234418 228973 225611 224463 224518 223986 222228 220507
54671 220507 220316 221525 222671 222736 222302 223009 225878 230007 233052 233476 232256 232020 234595 239783 246266 252937
54655 252937 259321 265437 271583 277840 283597 287879 290156 290504 289185 286586 283416 280095 275958 270021
54641 270021 262743 256054 251119 247041 242515 237899 234548 232579 230551 227386 223506 219783 216263 212527
54627 212527 208774 205774 203899 202660 201274 199351 197120 195309 194802 195957 198008 199446 199305 197837 195722
54612 195722 193009 189520 185970 183603 182439 180862 177632 173638 170840 169884 169707 169239 168564 168386 169238 171311
54596 171311 174263 176947 178073 177480 176274 175559 175612 176318 177579 178984 179899 180308 180810 181408 181199 179942 178933
54579 178933 179308 180162 179626 177453 175322 174670 175486 177254 179699 182124 183218 182409 180759 179746 179600 179470
54563 179470 178878 178374 178953 181282 185141 189130 191291 190680 188207 185456 182977 180397 177811 176009 175294
54548 175294 175164 175425 176532 178261 179103 178069 176451 176582 179047 182184 184356 185519 186292 186625 186114 184908
54532 184908 183497 182056 180776 180421 181681 183949 185562 185573 184859 185167 187190 189683 190382 187947 183269 178982
54516 178982 177502 179405 183482 187898 191135 192378 191792 190464 189599 189573 189920 190069 189781 189034 187961 186893
54500 186893 186082 185473 185137 185723 187845 191029 193985 196078 197852 199855 201662 202492 202280 201623 201124 201267
54484 201267 202471 204558 206435 206986 206356 205818 206371 207841 209397 210462 210905 210617 209243 206501 202865 199792
54468 199792 198857 200359 202963 205012 205993 206462 206791 206550 205171 202842 200494 199011 198555 198592 198535 198277 197979
54451 197979 197546 196765 195945 195768 196250 196515 196162 196242 198032 201149 203793 204761 204400 203693 203411 204256 206661 209885
54433 209885 212238 212859 212516 212012 210694 207627 203714 201318 201730 204018 206488 208321 209439 209674 208821 207223
54417 207223 205768 205299 206105 207793 209623 211293 213367 216434 219861 222017 222029 220715 219445 218697 218227 218007
54401 218007 218140 218234 217835 217508 218619 221680 225389 227591 227066 224513 222164 222176 224759 227825 228990 227917
54385 227917 226123 224780 223735 222787 222662 223988 226160 227968 228720 228126 225976 222889 220628 220427 221339 221434
54369 221434 220342 219355 219247 219527 219955 221144 223002 224001 222968 220669 218700 217678 217447 218190 220059 222274
54353 222274 223868 225147 227202 230031 232266 232907 232382 231600 230819 229861 228866 228399 229032 230835 233011 234274
54337 234274 234276 234413 236288 239421 241588 241608 240634 240239 240513 240965 242091 244601 247753 250033 251327 252915 255196
54320 255196 256840 256742 255611 254849 254737 254691 254676 255283 256628 258087 259127 259724 259974 260018 260474 262231 265448 269271
54302 269271 272834 276141 279560 282938 285742 287848 289636 291348 292815 293820 294283 294058 293006 291404 289883
54287 289883 288702 287365 285133 281701 277315 272650 268834 267001 267230 268081 267717 265498 262164 258748 255895
54272 255895 254056 253569 254202 255093 255385 254635 252661 249638 246482 244369 243409 242465 240865 239642 240244 242449
54256 242449 244619 245838 246688 247754 248490 248101 246781 245366 244290 243498 243095 243354 244096 244581 244141 242771
54240 242771 241193 240350 240586 241095 240541 238407 235410 232499 230081 228566 228764 230842 233399 234754 234975 235545
54224 235545 237077 238580 239200 239369 239621 239504 238685 238234 239551 242342 244768 245408 244195 241690 238656 236445
54208 236445 236579 239241 242822 245545 247129 248524 250543 253211 256029 258254 259117 258367 256715 255477 255683
54193 255683 257507 260275 262826 264092 263828 262789 261966 261607 261134 260045 258646 257812 258010 258667 258632 257291
54177 257291 255136 253127 251701 250690 249950 249539 249347 249193 249512 251230 254417 257603 259049 258517 257194 256128
54161 256128 255407 254826 254571 254979 256062 257474 258638 258854 257825 256264 255406 255572 255639 254459 252442 251109
54145 251109 251175 251765 251705 251012 250571 250678 250580 249573 247963 246531 245415 244202 243073 243067 244774 247321 249177
54128 249177 249656 249084 247917 246496 245460 245384 245767 245275 243410 241249 240098 240081 240607 241526 243006 244730 246144
54111 246144 247297 248694 250432 252235 254123 256144 257530 257188 255332 253595 252957 252354 250182 246711 244163
54096 244163 244402 247136 250393 252358 252591 251770 250582 249116 247341 245748 244990 245045 245373 246029 247915 251575
54080 251575 256184 260042 261791 261035 258387 255200 252694 250958 249296 247684 247026 247579 248276 248492 249468 252662
54064 252662 257326 261159 263091 264067 265274 266977 269032 271067 272105 271555 270817 272223 275876 279234 280573
54049 280573 281000 281917 282394 281026 279081 279413 282650 286593 289340 291127 292815 294399 295722 297278 299390
54034 299390 301445 302704 303259 303764 304775 306673 309573 312957 316017 318590 321016 322847 322678 319970 316317
54019 316317 314114 314314 316001 317625 317985 316399 312929 308697 305566 305083 307435 311135 313911 314547 313971
54004 313971 314052 315336 316790 317819 319320 322121 325486 328205 330333 332625 334889 336350 337453 339810 344147
53989 344147 349487 354683 359675 364745 369572 373788 377854 382727 388947 396405 404504 412201 418523 423562
53975 423562 428526 434346 440747 447157 453908 461750 470606 479665 488448 496964 504914 511642 516885 520875
53961 520875 523719 525611 527677 531412 536683 541227 542962 542137 540387 538268 534810 529197 521720 513031
53947 513031 503524 493824 484938 477333 470445 463566 456666 449792 442309 433662 424669 417059 411558 407160
53933 407160 402620 398067 394592 392591 391178 389274 386763 384304 382298 380457 378319 375799 373080 370290
53919 370290 367616 365593 364799 365191 365976 366292 365798 364617 363022 361296 359665 358123 356445 354536 352699
53904 352699 351552 351752 353719 357281 361583 365670 369206 372426 375581 378978 383386 389459 396498 402810
53890 402810 407899 413559 422012 433609 447139 461571 476207 489522 499567 505931 510201 513998 517305
53877 517305 519203 519456 518798 518137 518064 518889 520721 523554 527394 532127 537289 542280 546922 551585 556796 562949
53861 562949 570195 578161 585893 592603 598449 604257 610756 618532 628287 640257 653587 667092 680508
53848 680508 694135 707495 719418 729314 737261 742964 746019 747223 748091 748777 747963 745092 741031 736047
53834 736047 729096 720101 711019 703216 695378 685679 674566 663636 653033 641977 630807 620286 609614
53821 609614 597484 584693 573376 563782 554024 543074 531809 520941 510289 500573 493529 489240
53809 489240 485384 480224 474475 469063 463003 455216 446856 439892 434334 428745 422793 417518 413457 410216
53795 410216 407770 406597 406370 405740 403675 400128 395413 389947 384708 380844 378442 376483 374395 372859 372653
53780 372653 373287 373387 372108 369746 367237 365524 365293 366774 369511 372528 375087 377351 380032 383156 385457
53765 385457 385485 383295 380566 378882 378335 378075 377830 378412 380815 385110 390263 394896 398247 400504 402300 404231
53749 404231 406925 411027 416430 421832 425856 428694 431964 436910 443527 451468 460734 470928 480808 489379
53735 489379 496923 504330 511924 519586 527416 535395 542721 548401 552372 555411 558013 560021 561320 562186
53721 562186 562804 562846 561694 558858 554308 548689 543052 538010 533128 527412 520317 512143 503634 495344 487244
53706 487244 478837 469946 461379 454279 448683 443325 437087 429992 422507 414836 407599 402212 399535 398597
53692 398597 397661 396129 394562 393376 392640 392675 393440 393492 391107 386643 382554 380701 380753 381470 382213 382648 382282
53675 382282 381294 380925 382045 383904 385133 385470 385652 386190 387164 388887 391713 395240 398602 401660 405107 409269
53659 409269 413426 416676 418963 420974 423375 426536 430712 435976 441828 447178 451071 453517 455481 457897
53645 457897 460827 463748 466494 469576 473510 478157 482828 486854 490022 492699 495533 498744 501688 503635
53631 503635 505078 507700 512637 519103 525154 529491 532137 533702 534668 535295 535617 535333 534149 532363 530772
53616 530772 529841 529267 528403 526807 524290 520950 517438 514708 513046 511566 509297 506644 505141 505638 507304
53601 507304 508730 509499 510232 511411 512742 513576 513443 512181 510129 508357 508244 510431 514221 518057 520496
53586 520496 520972 520204 519898 521453 524626 527852 530136 532078 534683 537808 540576 543025 546372 551448 557476
53571 557476 562721 566084 567926 569598 572420 576919 582772 589191 595285 600368 604567 609161 615681 624318
53557 624318 633735 642819 651911 661697 671627 680372 687360 692729 696138 697051 696407 696692 699798 705574 712754
53542 712754 720277 727294 732984 737255 740929 744517 747465 749240 750441 751929 753486 754322 754442 754417 754025
53527 754025 752257 748783 744477 740420 737115 734788 733546 732871 731679 729337 726188 722925 719936 717523
53513 717523 716098 715649 715393 714410 712383 709382 705283 699887 693567 687375 682531 679884 679599 680977 682697
53498 682697 683687 683970 684601 686758 690791 695829 700172 702469 702982 703508 705641 709159 712499 714712 716442
53483 716442 719049 723453 730115 739383 751126 764232 777176 789301 801234 814049 828312 843889
53471 843889 860265 876821 893069 908916 924744 941265 959234 979082 1000633 1023341 1047025
53460 1047025 1072127 1098889 1126626 1154441 1182565 1212275 1244406 1278692 1314637 1352098 1390550
53449 1390550 1428790 1466236 1503900 1543102 1583587 1623856 1663058 1701482 1739345 1776220 1811946
53438 1811946 1847107 1882201 1917068 1951544 1986025 2020899 2055927 2090543 2124315 2156863 2187886
53427 2187886 2217630 2246725 2275114 2301811 2326338 2349847 2374027 2399201 2424170 2447617 2468861
53416 2468861 2487434 2502804 2514598 2522511 2526106 2525471 2522035 2517656 2512431 2504266 2491268 2474002 2454699
53403 2454699 2434783 2414191 2392814 2371373 2350419 2329346 2307077 2283367 2258818 2233852 2208199
53392 2208199 2181375 2153264 2124362 2095817 2069002 2044445 2021167 1997633 1973427 1949589 1927400
53381 1927400 1907656 1891119 1878575 1869796 1863335 1858159 1854766 1853776 1854160 1854296 1854500 1857056 1863472 1872929
53367 1872929 1883804 1895637 1909005 1924394 1941952 1961761 1983633 2007011 2031626 2058041 2087246
53356 2087246 2119959 2156403 2196171 2238154 2281397 2326381 2374684 2426945 2482032 2538801 2597738
53345 2597738 2659860 2724831 2791376 2859208 2929344 3002689 3079337 3159006 3240961 3323575 3405327
53334 3405327 3486579 3569197 3653938 3739265 3823391 3906436 3989531 4072337 4152628 4228235 4298576
53323 4298576 4364216 4425740 4483485 4537765 4588646 4635350 4676236 4709709 4735272 4753666 4766001
53312 4766001 4772724 4773288 4766543 4751458 4727739 4695889 4656535 4609707 4555128 4493438 4426698 4357305
53300 4357305 4286515 4214281 4140297 4064853 3988895 3913693 3840385 3769487 3700824 3634086 3569267
53289 3569267 3506362 3445005 3384739 3325332 3266356 3206856 3146164 3085066 3025571 2969413 2917003
53278 2917003 2867641 2820301 2774433 2730597 2690175 2653927 2621037 2590091 2560589 2532628 2505424
53267 2505424 2477454 2448247 2418967 2390794 2363698 2337171 2311181 2285847 2261105 2237484 2216355
53256 2216355 2198445 2182641 2167310 2152554 2140228 2131841 2127277 2125573 2126178 2129134 2134461 2141783 2150578
53243 2150578 2160842 2173356 2188929 2207284 2227201 2248029 2270533 2295919 2324579 2356177 2390291
53232 2390291 2426271 2463022 2499634 2535742 2570545 2602255 2629736 2654238 2678008 2701270 2722053
53221 2722053 2739157 2753659 2766748 2777444 2783497 2783648 2778025 2767149 2751764 2733193 2712654 2690281
53209 2690281 2665518 2638137 2608069 2574664 2537418 2497489 2457287 2418242 2379760 2340678 2300849
53198 2300849 2260821 2220768 2180390 2139345 2097261 2053891 2009788 1966338 1924447 1883690 1843427
53187 1843427 1804187 1766865 1730887 1694497 1657035 1619733 1583840 1549106 1514867 1481606 1450304
53176 1450304 1420757 1391771 1362921 1335184 1309819 1287485 1268309 1251711 1235914 1218839 1200089
53165 1200089 1181164 1162950 1143951 1122064 1097436 1072118 1047184 1021701 994920 968047 943013
53154 943013 920381 899460 879878 861956 845672 830195 814658 798835 782899 767007 751298
53143 751298 735913 720864 706117 691873 678467 665915 653827 641735 629240 615932 601686
53132 601686 587259 574202 563846 556432 551172 546859 542398 537307 532003 527363 523680 520173 515665
53119 515665 509691 503092 497723 495167 495024 494648 491546 486232 481588 479170 477414 474265 470150 466888 464581
53104 464581 461448 456512 450852 446152 443433 443101 444617 445854 444542 441118 438682 439253 441334 442081 440637
53089 440637 438194 435937 434372 433852 434301 434818 434715 434475 434598 434333 432999 431877 432875 435556 437470 437484 436823
53072 436823 436354 435025 432187 429621 429537 431553 433391 434011 434453 435713 437333 438463 439172 440101 441454 442884
53056 442884 444122 445359 447117 449844 453390 456864 459311 460703 462000 463974 466106 466990 465979 464119
53042 464119 463159 463623 464240 463396 460869 457906 455878 455142 454914 453874 451133 447202 443853 442501 442672 442607
53026 442607 441286 439331 437928 437587 438099 438974 439575 439387 438569 437797 437338 436755 435820 435054 434875 434838 434343 433615
53008 433615 433229 432982 432049 430188 428037 426157 424498 422927 421650 420699 419527 417684 415690 414710 415277 416741
52992 416741 418239 419789 421879 424154 425424 425406 425687 427982 431743 434595 435210 434700 434822 435784 436587 436783
52976 436783 436938 437581 438469 438893 438188 436153 433382 431037 429826 429335 428774 428202 428483 430071 432250 433667
52960 433667 433447 431947 430599 430733 432332 434226 435682 437129 438872 439889 438927 436424 434262 433662 434290
52945 434290 435407 436787 438266 439430 440347 441783 444168 446995 449701 452405 455024 456418 455489 452814 450136
52930 450136 448309 446787 445281 444768 446156 448793 451254 453247 455710 459043 462275 464410 465856 467870
52916 467870 471033 474883 478635 481473 482460 481259 479099 478034 478849 480457 481712 482837 484379 485782 486308
52901 486308 486840 489313 494141 499373 502794 504078 504413 504663 504465 502823 499192 494153 489184 485602 483677
52886 483677 482888 482801 483116 483019 481345 477744 473268 469605 468014 468728 470538 471016 468282 463085 458195 455183
52870 455183 452831 449551 446183 444854 445605 445962 444067 440834 438514 438258 439770 442315 445112 447293 448428
52855 448428 448945 449417 449605 448820 447127 445633 445484 446940 449320 451468 452341 451643 449985 448192 446538 445008
52839 445008 444098 444583 446372 448301 449522 450536 452276 454571 456231 456476 455519 453687 450814 447010 443540
52824 443540 442214 443837 447562 451743 455125 457253 458168 458174 457878 458057 459164 460913 462551 463596 464223 464938
52808 464938 466079 467671 469455 470811 470942 469571 467460 465934 465807 466997 469033 471495 473877 475440 475483
52793 475483 473614 469755 464160 457590 451092 445405 440757 437287 435219 434309 433443 431306 427483 422718 418169
52778 418169 414537 411752 409232 406523 403911 402319 402396 403704 404970 405162 404293 403272 403114 404256 406424
52763 406424 408971 411151 412155 411387 409180 407023 406404 407323 408429 408728 408529 408530 408602 407990 406331 404005 401751
52746 401751 400253 399800 400049 400421 400945 402203 404116 405451 405190 403942 403259 403872 405275 406745 407964 408738
52730 408738 408905 408625 408188 407558 406559 405442 404648 404083 403234 401995 400867 400374 400709 401784 403063 403601 403019
52713 403019 402223 402314 402924 402638 401126 399674 399269 399184 398085 395776 393213 391412 390899 391688 393197 394619 395817
52696 395817 397395 399457 400972 401069 400481 400880 403005 406123 409166 411669 413542 414646 415002 415187 416188 418659
52680 418659 422236 425714 428246 430320 433134 436955 440655 443158 444789 446719 449398 452050 453572 453617 452975
52665 452975 453060 454786 457652 460198 461556 462251 463266 464727 465807 465546 463465 459924 456326 454494 455131
52650 455131 456984 457936 456726 453424 448832 444160 440865 439784 440207 440382 439152 436877 434870 434238 435151
52635 435151 436852 438373 439423 440390 441388 441949 442131 443159 445958 449408 451192 450330 447915 445272 442596
52620 442596 439766 437371 436107 435777 435623 435247 434666 433916 433176 432902 433187 433313 432653 431837 432196 434014 436109
52603 436109 437383 438121 439300 441127 442915 444265 445764 448353 452333 457129 461709 465055 466566 466489 466025
52588 466025 466666 469147 472951 476722 479120 479525 478306 476403 474367 471789 468056 463700 460419 459451 460302
52573 460302 461444 461818 461182 459507 457001 454704 454026 455212 456837 457384 456916 456658 457292 458448 459712 461245
52557 461245 462994 464040 463465 461661 460099 459707 460007 459972 459280 458514 458526 459891 462604 465821 468174 468859 468328
52540 468328 467532 466696 465404 463763 462678 462723 463385 463800 463864 464194 465283 467025 468916 470427 471305 471716 472022
52523 472022 472380 472742 473240 474225 475718 477194 478189 478928 480134 482369 485590 489138 492060 493634 493654 492098
52507 492098 488775 483927 479058 476362 476870 479584 482570 484435 484690 483580 482072 481249 481058 480192 477803
52492 477803 474812 472784 471962 471270 469992 468639 468164 468924 470468 471937 472769 473183 473849 474952 476103 477314
52476 477314 479200 481685 483404 483290 482104 481435 481701 482176 482423 482504 482143 481068 480025 480173 481486 483018
52460 483018 484730 487593 491551 494846 495999 495406 494337 493366 492486 491988 492420 494087 497009 500905 505070
52445 505070 508859 512437 516256 519773 521728 521988 521901 522357 522628 521754 519837 517155 513232 508017 502944 499409
52429 499409 496880 493911 490573 488414 488179 489022 490026 491166 492424 493045 492339 490599 488825 487918 488419 490540
52413 490540 494021 498029 501369 503016 502889 502238 502693 504381 505467 504215 501199 498781 498661 500640 503556
52398 503556 506559 509494 512778 516977 521830 525719 526849 525098 522109 519508 517672 516215 514831 513317
52384 513317 511303 508371 504222 498909 493370 489481 488629 490080 491541 491557 490587 489676 489163 489137 490012 491720
52368 491720 493005 492557 490547 488409 487379 487795 489395 491535 493473 495168 497595 501543 506341 510546 513659
52353 513659 516286 518744 520620 522028 524320 528848 535445 542691 549548 556446 564871 575857 588687 601230
52339 601230 612017 621662 631382 640190 644912 643591 637789 630690 623797 616715 609348 602600 596940 591882
52325 591882 587371 584409 583582 583918 584001 583540 583121 583066 583407 584517 586865 590303 594311 598767 603862 609527
52309 609527 615657 622642 630790 639349 646992 653336 659123 664844 670160 674891 679435 683585 685944 685584
52295 685584 683753 682917 684276 687053 690045 692915 695809 698654 701434 704636 708821 713891 719267 724808
52281 724808 731204 739336 749395 760784 772759 785078 798133 812615 828939 846741 864993 882950
52269 882950 901069 920764 943206 968738 997396 1029185 1063424 1098582 1133623 1169124 1206248
52258 1206248 1244928 1284076 1323298 1363210 1403908 1444305 1483375 1521000 1557088 1590921 1622193
52247 1622193 1651865 1681061 1709691 1737022 1763131 1788782 1813936 1837195 1856874 1872408 1884851
52236 1884851 1896114 1907147 1916622 1922162 1923338 1922478 1921683 1920035 1915064 1906345 1896074 1886336 1877431 1869008
52222 1869008 1861272 1854502 1848683 1844262 1842334 1843353 1846559 1851342 1858384 1868650 1881964 1897428 1914740
52209 1914740 1934059 1954927 1976402 1998372 2021784 2047169 2073558 2099360 2123939 2147712 2170816
52198 2170816 2192516 2212404 2231651 2252025 2273502 2293755 2310572 2324094 2335923 2346697 2355674
52187 2355674 2362394 2367342 2370731 2371755 2369581 2364250 2356046 2344697 2329793 2311644 2291380 2270622 2251103
52174 2251103 2233782 2217925 2201842 2185033 2168869 2154690 2142103 2130022 2118599 2109009 2101747 2096139
52162 2096139 2091323 2086789 2082196 2077637 2074124 2072941 2074390 2077720 2082178 2087489 2093503 2100193 2107889 2116689
52148 2116689 2125738 2134061 2142106 2151358 2162278 2173782 2185052 2196489 2208092 2218156 2224948 2229094
52136 2229094 2233064 2238508 2245075 2251601 2257332 2261919 2265264 2267806 2270257 2272825 2275215 2277532 2280380 2283742
52122 2283742 2286558 2288025 2288737 2289774 2290971 2290937 2288624 2284166 2278114 2270718 2262227 2253108 2243430 2232612
52108 2232612 2220508 2208302 2197451 2187856 2178098 2167734 2158383 2151906 2148244 2145980 2144541 2144741 2147116
52095 2147116 2150895 2155069 2159618 2164909 2170432 2174969 2177928 2179783 2181185 2182263 2183034 2184001 2185951 2189274
52081 2189274 2193635 2198214 2202293 2205890 2209917 2215353 2222113 2229023 2235233 2241410 2249230 2259918 2273700
52068 2273700 2290529 2310659 2334219 2360714 2389521 2420749 2455164 2493170 2534293 2577872 2623881
52057 2623881 2672598 2723546 2775267 2826329 2876139 2924495 2970769 3014077 3054155 3091348 3125529
52046 3125529 3155464 3179529 3196769 3207234 3211917 3212766 3212075 3210989 3208779 3204285 3197809 3190719 3183228
52033 3183228 3173824 3161465 3147368 3133741 3121292 3108996 3095924 3082221 3068230 3053772 3038735
52022 3038735 3023553 3008499 2993127 2977197 2961824 2948984 2939991 2935068 2934268 2937836 2945399 2955661
52010 2955661 2967658 2981886 2999420 3019972 3041523 3062016 3081020 3099701 3119590 3141311 3163857
51999 3163857 3184925 3202615 3217108 3230071 3242038 3251218 3255629 3255608 3253058 3248660 3241310 3230353 3216859
51986 3216859 3201965 3185084 3164725 3140508 3113561 3085214 3055861 3024740 2990328 2951475 2908808
51975 2908808 2864699 2821252 2778800 2736989 2696756 2660091 2627957 2599456 2573071 2547862 2523321
51964 2523321 2499101 2475474 2453438 2433775 2416139 2399276 2381868 2363072 2342644 2320759 2297570
51953 2297570 2273019 2247324 2221387 2196053 2171098 2145669 2119661 2093726 2067712 2040044 2009241
51942 2009241 1975376 1939579 1902857 1866035 1830080 1795524 1761924 1728663 1695920 1664003 1632126
51931 1632126 1599042 1565001 1532206 1502951 1477877 1456022 1435825 1415902 1395692 1375879 1357665
51920 1357665 1341279 1325690 1310089 1294886 1280600 1266392 1250656 1232809 1213568 1193604 1173046
51909 1173046 1152569 1133833 1117953 1104130 1090733 1077553 1066181 1058209 1053836 1052380 1053293 1056238
51897 1056238 1060759 1066512 1073500 1081581 1089978 1097858 1105230 1112513 1119049 1122776 1121935 1116975 1110354 1104493
51883 1104493 1100195 1097004 1094588 1093322 1093692 1095752 1099615 1106163 1116622 1131235 1148663 1166872 1184445
51870 1184445 1201118 1217500 1234321 1251416 1267251 1280038 1289626 1297692 1305529 1312140 1314950 1311616
51858 1311616 1300453 1280145 1250809 1215348 1178287 1142664 1108763 1075811 1043631 1012373 982120
51847 982120 953749 929198 909735 894444 881310 869383 859129 851125 845452 842249 841931 844644 849972
51834 849972 857204 865563 874215 882378 889333 894223 896231 895234 891780 886092 877712 866730 854689 843390
51820 843390 833236 823591 814454 806718 800982 797142 795155 795152 796707 799045 802221 807129 813946 821553 828898
51805 828898 835998 842957 848873 852618 854168 854267 853139 850444 846383 841963 837994 834369 830570 826571 823114
51790 823114 821240 821567 823902 827591 832217 837667 843412 848222 851012 851739 850967 848823 844865 838940 831643
51775 831643 823865 816214 808870 801609 793969 785824 777911 771456 767134 764644 763291 762632 762469 762661 763043
51760 763043 763156 761934 758288 752385 745872 740291 735614 730959 726374 722990 721393 720808 720297 719999 720530
51745 720530 721737 722870 723814 725322 727986 731612 735753 740136 744124 746355 745731 742739 739209 736590 734787
51730 734787 732825 730141 726816 722877 718093 712678 707614 703748 700845 698090 695402 693564 693010 693255 693938
51715 693938 695692 699219 703918 708337 711860 715162 718957 723184 727626 732528 737994 743320 747605 750896
51701 750896 754351 759387 766810 776435 787147 797566 806930 815232 822309 827246 829075 827751 823967 818232
51687 818232 810596 801144 790177 778043 765310 753035 742278 733243 725492 719137 715139 714085 715278
51674 715278 717750 721851 728950 739431 751722 763783 775102 786542 798362 809224 817452 822695
51662 822695 825945 828443 831206 835077 840071 844498 845718 842346 835260 826186 816034 805230 794936
51649 794936 786770 781210 776979 772210 765883 758159 749911 742184 735853 731458 729341 729871 733310 739368
51635 739368 746879 754028 759134 761578 762033 761545 760445 758508 756080 754296 753912 754547 755532 756893 758807
51620 758807 760552 760848 759154 756088 752683 749712 747510 745809 743849 741278 738915 738127 739564 743031 748393
51605 748393 755858 765352 776258 787942 800070 812436 824894 837290 848770 857274 860555 857976
51593 857976 850767 840573 828604 816286 805639 798236 794292 793317 795162 799679 805681 810924 813419
51580 813419 812599 809229 804286 797951 789670 779229 767532 756040 745628 736346 728097 721036 715393
51567 715393 711415 709443 709533 711015 712926 714816 716711 718450 719636 719984 719000 715684 709599 702113 695467
51552 695467 690551 686722 683655 681724 680215 677086 671652 666129 663120 662560 662441 661680 660764 660281 660467 662000
51536 662000 665703 671400 678156 685713 694575 704823 715990 728154 741836 756407 769553 778764 782799
51523 782799 781791 777034 770877 765681 762267 760034 758770 759308 762043 766221 771674 780215 793934 812625
51509 812625 834066 856489 879499 902893 926261 950196 976407 1005632 1036350 1066594 1096354
51498 1096354 1126946 1158451 1189296 1218691 1248193 1280094 1314973 1351481 1387741 1421995 1452291
51487 1452291 1476489 1492586 1498595 1492781 1475179 1448659 1417131 1382335 1343279 1299045 1251147 1202803
51475 1202803 1156923 1115287 1078638 1046750 1019008 995462 976619 961816 948914 936447 925076
51464 925076 915990 908822 902439 896905 893016 890286 886882 881465 873739 863482 850621 836341 822536
51451 822536 809783 797260 785019 774769 767578 762032 755734 747813 739125 730733 723133 716493 710771
51438 710771 705734 701294 697456 693721 689248 684118 679678 676955 675359 673784 672437 672587 674666 677439
51424 677439 679181 679217 678375 678183 679399 681043 681368 680081 678898 679210 679869 678395 674064 668630 664002 660350
51408 660350 656826 653042 649101 644793 639674 633903 628467 624444 622166 621085 620369 619657 619242 619445 619905
51393 619905 619760 618603 617068 616340 617184 619496 622711 626540 631336 637741 645986 655612 665827 676028
51379 676028 685975 695817 706139 717720 730835 744663 757525 767769 774600 778384 780378 781975 783888
51366 783888 785959 787642 788377 787512 784364 778840 771863 764778 758446 753049 748487 744558 740951 737590 734910
51351 734910 733221 731774 729153 724958 720589 717844 717026 717037 717255 718513 721832 726806 732007 736843 742095
51336 742095 748395 755044 761010 766444 772205 778241 783674 788630 794795 803646 815046 828162 842944
51323 842944 859995 879769 902840 930294 962777 999564 1039671 1083549 1132445 1186278 1243537
51312 1243537 1303417 1366533 1432794 1499459 1561953 1615747 1657117 1683487 1694382 1691485 1676639
51301 1676639 1650126 1611849 1563655 1509076 1450902 1390322 1328670 1268420 1211469 1157401 1104745
51290 1104745 1053698 1006533 965223 929586 898059 869537 843763 820394 798627 778052 759357
51279 759357 743761 731904 723309 716622 710110 702401 693452 684745 677981 673408 669810 666185 662691 659747
51265 659747 656996 654004 651561 651239 653436 656538 658399 658358 657449 656837 656392 654906 651607 647193 643112 639863
51249 639863 636563 632582 629109 628180 630068 632491 632933 631269 629511 629244 630101 630810 631001 631395 632503 633836
51233 633836 634577 634529 633954 632750 630507 627525 625083 624237 624750 625782 627308 629987 633719 637310 639947 642347
51217 642347 645875 650916 656689 662373 667830 673330 679018 684673 689660 693188 694896 695236 695114 695360 696728
51202 696728 699990 705325 711654 717231 721127 723788 726016 727761 728145 726431 722723 717846 712613 707107
51188 707107 700735 693169 685171 678077 672426 667438 662021 655872 649352 642649 635601 628270 621351 615813
51174 615813 612167 610090 608744 607595 606894 607249 608717 610586 612097 613163 614258 615840 618050 620805 623935
51159 623935 627282 630668 633717 635839 636745 636996 637539 638517 639008 638375 637496 638105 640981 645251 649445 652765
51143 652765 655219 657002 658187 658994 660046 662059 665150 668551 671302 673225 675043 677452 680336 682944
51129 682944 684515 684625 683423 681851 681197 681900 683133 684068 685168 687444 690529 692457 691723 688930 686028
51114 686028 684323 683668 683138 681996 680085 677804 675785 674458 673926 674285 675706 677960 680156 681454 682129
51099 682129 683493 686550 690896 695109 698053 699613 700347 700814 701320 701977 702631 702795 701900 699702 696327 692036
51083 692036 687155 682147 677377 672803 668340 664672 663182 664510 667353 669198 668421 665599 662920 662406 664371
51068 664371 667194 668734 668423 667957 669636 674107 680079 685954 691065 695352 698749 701397 703849 706379 708370
51053 708370 709045 708676 708420 708888 709615 710271 711665 714793 719190 723193 726042 728849 733003 738260 743183 746972
51037 746972 749954 752476 754479 756304 758775 761969 764776 766409 767597 769516 772087 774174 775093 775177 775223
51022 775223 776131 778700 782804 786971 789565 790243 789590 787886 785422 783636 784369 787792 792419 797455 803757
51007 803757 812020 821473 831122 840978 851143 861002 870742 882609 898979 919643 942564 967089 994601
50994 994601 1025544 1057231 1085555 1108238 1125931 1140842 1155055 1169879 1185876 1202952 1220286
50983 1220286 1236345 1249406 1258467 1263458 1264328 1260304 1250720 1236464 1219951 1203582 1188736 1176200
50971 1176200 1166487 1159029 1151592 1141484 1127586 1110866 1092938 1074623 1056123 1038169 1022318 1009900
50959 1009900 1000909 994203 988765 984604 982443 982705 984923 988086 991667 996381 1003734 1014487 1027640 1041353
50945 1041353 1054929 1069437 1086184 1105064 1124811 1144517 1164209 1183846 1202295 1217792 1229503
50934 1229503 1238423 1246460 1254641 1262448 1269041 1274668 1280398 1286717 1293120 1299144 1305147 1311908 1320028 1330085
50920 1330085 1342861 1359070 1379181 1403719 1433248 1467735 1506265 1547547 1590260 1632983 1674822
50909 1674822 1716688 1761126 1810135 1863742 1921409 1983987 2053156 2129401 2211818 2299772 2393545
50898 2393545 2493231 2598093 2707274 2820179 2935707 3051797 3166299 3277885 3385768 3488852
50888 3488852 3585438 3673695 3752506 3822126 3883764 3938072 3984288 4021570 4050864 4074552 4094213
50877 4094213 4109738 4120874 4128544 4134135 4138199 4140432 4140241 4136594 4127809 4112310 4089533 4059789 4023504
50864 4023504 3980796 3931260 3873752 3806974 3730984 3647644 3558920 3465052 3365200 3259660 3150546
50853 3150546 3040435 2931324 2825078 2723728 2628509 2539181 2455066 2376518 2304720 2240171
50843 2240171 2182091 2129383 2081511 2038124 1998347 1960990 1925424 1891923 1861149 1833435 1808501
50832 1808501 1785758 1765018 1746905 1732233 1720834 1711504 1703532 1697681 1694912 1694566 1694916 1695454 1697428
50819 1697428 1701791 1707915 1714987 1723618 1734938 1748732 1763648 1779048 1795664 1814528 1836079 1860327
50807 1860327 1887201 1916643 1948909 1984707 2024635 2068683 2116783 2169457 2227224 2289705 2356188
50796 2356188 2426993 2503510 2586992 2678006 2776901 2883979 2999339 3123494 3258124 3405303
50786 3405303 3565934 3739640 3926004 4124855 4335413 4556411 4787184 5027483 5275928
50777 5275928 5529741 5786137 6042563 6295128 6538261 6766668 6976569 7164542 7326871
50768 7326871 7461376 7568761 7650887 7708735 7743511 7758790 7759676 7750045 7732141 7708863 7684901
50757 7684901 7665098 7652424 7647407 7648305 7651417 7652083 7645917 7628792 7595882 7541831 7462568 7356725
50745 7356725 7225003 7068527 6888113 6685125 6462674 6225513 5978309 5724299 5466319
50736 5466319 5209048 4958956 4721331 4498111 4289287 4095480 3918167 3758233 3615675
50727 3615675 3490294 3381349 3286704 3203648 3130665 3067435 3013239 2966531 2926096 2891325 2861098
50716 2861098 2833500 2807045 2781206 2755485 2729030 2701731 2674680 2648863 2624036 2599405 2574654
50705 2574654 2549732 2524289 2498046 2471285 2444399 2417319 2389842 2362094 2334254 2306332 2278849
50694 2278849 2253331 2231413 2213515 2198851 2186727 2177474 2172069 2171041 2173887 2179690 2188446 2201494
50682 2201494 2220287 2245118 2275690 2312549 2356810 2408488 2466391 2530007 2600217 2677476 2760616
50671 2760616 2848621 2942440 3043525 3151167 3262957 3377768 3496626 3620276 3747289 3875314
50661 3875314 4003157 4130660 4257100 4380613 4499058 4610718 4713949 4806487 4885341 4947555
50651 4947555 4991366 5016767 5024865 5016908 4994507 4960929 4921385 4881135 4843200 4808381 4777417 4752436
50639 4752436 4735831 4728060 4727008 4729441 4732695 4734918 4734054 4726861 4708852 4675395 4623426 4552439 4463804
50626 4463804 4359276 4240695 4111149 3975412 3838424 3703642 3573375 3450008 3335740
50617 3335740 3231420 3136890 3052616 2979892 2919311 2870404 2833335 2809550 2799550 2800899 2809800
50606 2809800 2824263 2844538 2870619 2900602 2931766 2962399 2992211 3021631 3051050 3080290 3108564
50595 3108564 3135275 3160970 3187155 3215070 3244941 3276482 3309666 3344791 3382061 3421323 3462192
50584 3462192 3504417 3548165 3593799 3641427 3691162 3744014 3801868 3865868 3935153 4007711 4082029
50573 4082029 4157109 4231434 4303249 4371992 4438398 4502924 4564945 4623566 4678273 4728571 4774131
50562 4774131 4815515 4853216 4884896 4904540 4905633 4885146 4844495 4788258 4723136 4656685 4594612
50551 4594612 4538958 4489843 4448371 4416275 4393130 4375976 4362140 4350729 4340837 4329878 4314526
50540 4314526 4291882 4258916 4212413 4151113 4077029 3993227 3900978 3800351 3692775 3581241 3468408
50529 3468408 3356243 3247237 3143824 3046048 2951639 2859429 2771468 2690840 2618484 2553223 2493896
50518 2493896 2440085 2391280 2346798 2306569 2271172 2241049 2216364 2197367 2184082 2175734 2171282 2170516
50506 2170516 2173919 2181534 2192741 2207190 2225043 2246195 2270105 2296667 2326376 2359276 2394604 2432070
50494 2432070 2472703 2517701 2566924 2619253 2673947 2730798 2789187 2847859 2905756 2962538 3018334
50483 3018334 3073542 3128870 3185130 3242983 3303196 3366837 3434637 3506502 3582564 3664672 3755684
50472 3755684 3856811 3966507 4082629 4205085 4335764 4476368 4627100 4787023 4954754
50463 4954754 5128709 5307543 5490807 5678820 5871483 6067123 6262358 6452955 6634903
50454 6634903 6804954 6960321 7098019 7214809 7307807 7374888 7414469 7425573 7408513 7364971
50444 7364971 7296775 7205038 7091269 6959050 6813786 6661023 6506024 6354775 6213845 6088427
50434 6088427 5981283 5894079 5828712 5786368 5765967 5764574 5778915 5805306 5838120 5869369 5890284
50423 5890284 5893236 5872590 5824842 5748450 5643399 5511062 5354792 5180175 4993653 4800563
50413 4800563 4604810 4410073 4220281 4038593 3866703 3705515 3555940 3418694 3293888
50404 3293888 3181250 3080275 2989770 2907703 2832075 2761822 2696794 2637262 2583713 2536525 2495366
50393 2495366 2459254 2427624 2400951 2380032 2365100 2356048 2352861 2354993 2360670 2367855 2376099 2386945
50381 2386945 2402297 2422748 2447471 2475169 2504799 2535447 2565702 2593462 2616840 2635421 2650229
50370 2650229 2662360 2672236 2680539 2688920 2698838 2710105 2721555 2732927 2745154 2758980 2774450 2791929
50358 2791929 2812437 2836505 2863602 2893367 2926760 2965399 3010264 3061676 3120106 3186312 3260689
50347 3260689 3342825 3431440 3524501 3619706 3715375 3810764 3905375 3998231 4088058 4173613 4253193
50336 4253193 4324158 4383769 4430663 4464969 4486697 4494259 4484845 4456241 4408356 4343268 4264070 4173796
50324 4173796 4075338 3972008 3867605 3765750 3669323 3580571 3501410 3433427 3377796 3335333 3306286
50313 3306286 3289781 3283666 3285187 3291731 3300892 3310144 3316629 3317023 3307599 3285161 3248576 3199206 3139407
50300 3139407 3070842 2994649 2912796 2828346 2744096 2661313 2579930 2499769 2421718 2348056 2281481
50289 2281481 2223400 2173166 2129234 2090729 2057504 2029255 2005636 1986988 1973507 1963145 1951450
50278 1951450 1934592 1912290 1887314 1862681 1839943 1819539 1801637 1786466 1774465 1766173 1761598 1759844
50266 1759844 1759972 1762048 1766796 1774378 1784218 1795820 1808802 1822058 1834091 1844674 1855208 1866568
50254 1866568 1877313 1885025 1889034 1890917 1892485 1894208 1895622 1896359 1896433 1896223 1896579 1898530 1902465 1907841 1913926
50239 1913926 1920655 1928695 1938902 1951714 1966778 1983201 2000607 2019983 2042984 2070315 2101252 2134871
50227 2134871 2171106 2210439 2253419 2300910 2353750 2410677 2466457 2512946 2542667 2551893 2541420
50216 2541420 2515637 2480777 2442664 2404952 2369069 2335526 2304753 2276922 2251852 2229673 2211116
50205 2211116 2196704 2185794 2176786 2168250 2159727 2151712 2145144 2140815 2138970 2139299 2141406 2145543 2153029 2165724
50191 2165724 2184529 2208069 2233264 2257692 2281294 2305467 2330952 2357284 2384016 2411287 2438866
50180 2438866 2465602 2490547 2513928 2536029 2555441 2569438 2576246 2576157 2570119 2558094 2539523 2514997
50168 2514997 2486404 2455316 2422083 2386975 2351462 2317430 2285377 2254244 2222835 2190315 2155089
50157 2155089 2114642 2067600 2015440 1961306 1907651 1855838 1807350 1763747 1725267 1690622 1658681
50146 1658681 1629569 1603826 1581364 1561700 1544571 1529791 1516936 1505463 1494770 1484121 1473214
50135 1473214 1462957 1454726 1448427 1442192 1434618 1426456 1419236 1412958 1406262 1398488 1390300 1382199 1373418 1362744
50121 1362744 1349956 1336186 1323134 1311966 1302660 1294323 1286239 1278470 1271286 1264397 1257210 1249623 1242090
50108 1242090 1235118 1229195 1225131 1223754 1225050 1228020 1231734 1236342 1242828 1251798 1262711 1274401 1286247
50095 1286247 1298489 1311253 1323829 1335636 1347715 1362286 1380578 1401857 1424872 1449305 1475159
50084 1475159 1501676 1527924 1554059 1581063 1609558 1639703 1671969 1707081 1745344 1786808 1831840
50073 1831840 1880500 1931483 1982858 2034187 2087022 2142960 2201819 2261906 2321343 2378897 2434207
50062 2434207 2487551 2538820 2586375 2627404 2659529 2681416 2691861 2689389 2673558 2645978 2609321
50051 2609321 2565617 2515976 2461540 2404107 2345929 2289270 2235839 2186244 2140185 2097420 2058281
50040 2058281 2023038 1991227 1961935 1934290 1907491 1881117 1856070 1834421 1817306 1803277 1789800
50029 1789800 1776288 1764685 1757014 1753474 1753236 1755940 1761584 1769621 1779112 1789502 1800522 1811620 1822282
50016 1822282 1832791 1843763 1854724 1863933 1870048 1873459 1875490 1876717 1876540 1874141 1869288 1862322 1853840
50003 1853840 1844407 1834244 1823270 1811706 1800388 1790031 1780393 1770751 1761016 1751705 1742964 1734557 1726939
49990 1726939 1721370 1718596 1718317 1720394 1725552 1734045 1744457 1754966 1765446 1777357 1791785 1808424 1826242
49977 1826242 1844219 1861605 1878379 1895442 1913405 1931107 1946324 1958243 1968500 1979398 1991661
49966 1991661 2004223 2015585 2024915 2032166 2037684 2041845 2045185 2048879 2054642 2063539 2075106 2088111 2101972
49953 2101972 2116920 2133098 2150278 2168204 2186266 2202963 2216744 2227549 2236750 2245520 2254069 2262278
49941 2262278 2269761 2275045 2275832 2270554 2258754 2239855 2213062 2179076 2140573 2100148 2058866 2017517
49929 2017517 1977819 1941002 1906292 1872320 1839278 1808190 1778677 1749194 1719413 1690846 1664926
49918 1664926 1641536 1619512 1597504 1574219 1548894 1521953 1494548 1467382 1440535 1414301 1389259
49907 1389259 1365607 1343332 1322986 1305272 1289786 1275305 1261524 1249377 1239241 1230017 1220686 1211777
49895 1211777 1204415 1198676 1193911 1190184 1188262 1188309 1189518 1191233 1193801 1198088 1204618 1213342 1223951 1236019
49881 1236019 1248960 1262073 1274800 1286918 1298418 1309171 1318818 1327135 1334348 1340825 1346407 1350124
49869 1350124 1350517 1346179 1336365 1321504 1303069 1282591 1260845 1238296 1216055 1195699 1178074 1162841
49857 1162841 1149365 1137516 1127455 1119348 1113736 1111509 1112752 1115915 1118930 1121123 1123363 1126256 1128976
49844 1128976 1130460 1131303 1133742 1139640 1148877 1159736 1170345 1179504 1186809 1192919 1199793 1209859 1224272
49831 1224272 1242001 1260682 1278136 1293004 1304539 1312371 1316468 1317118 1315030 1311428 1307415 1302779 1295794
49818 1295794 1284858 1270315 1254237 1238484 1223283 1207570 1190369 1172015 1154374 1139556 1127989
49807 1127989 1118006 1107832 1097690 1089353 1083952 1080987 1079330 1078318 1077826 1078140 1079922 1083711 1089320 1096281
49793 1096281 1104682 1114706 1125433 1135328 1144208 1153658 1165044 1178139 1192280 1207711 1224726 1242240
49781 1242240 1258282 1271613 1282078 1289856 1295219 1298575 1299854 1298157 1292893 1284975 1275959 1266221 1255040
49768 1255040 1242474 1230011 1219139 1210155 1202661 1196326 1190728 1185273 1179935 1175585 1172943 1171584 1170628
49755 1170628 1170277 1171959 1176841 1184593 1193865 1203751 1214502 1226792 1240558 1254798 1268391 1280711 1291401
49742 1291401 1300104 1306886 1312598 1318222 1323776 1328215 1330385 1329831 1326864 1322288 1316891 1310732 1302786 1291763
49728 1291763 1277249 1259755 1239923 1218530 1197286 1178634 1163953 1152292 1141412 1130027 1118801
49717 1118801 1109396 1102865 1098833 1095947 1093107 1090331 1088337 1087448 1087325 1087702 1088840 1091045 1094227 1098157 1102674
49702 1102674 1107418 1112010 1116934 1123529 1132366 1142109 1150873 1158387 1165911 1174073 1181923 1188335 1193340 1197423
49688 1197423 1200126 1200219 1197134 1191589 1184664 1176645 1167119 1156156 1145031 1135412 1127775 1121110 1114459 1108368
49674 1108368 1104285 1102812 1103204 1104427 1105845 1106900 1107159 1107286 1109159 1114104 1121206 1127969 1132519 1134816 1136000
49659 1136000 1137273 1139463 1143124 1148716 1156670 1167176 1179851 1193884 1208765 1224532 1240920 1256519
49647 1256519 1269319 1278020 1282459 1282992 1280204 1275247 1269777 1265020 1261104 1257454 1253623 1249566 1245360 1240972
49633 1240972 1236327 1231469 1226561 1221602 1216254 1210307 1204480 1200314 1198699 1198770 1198841 1198378 1198511 1200702 1205526
49618 1205526 1212781 1221979 1232354 1243011 1253728 1265416 1279461 1296699 1317047 1339616 1362773 1384317
49606 1384317 1402120 1414852 1422400 1425920 1427388 1428549 1429978 1431348 1432555 1434168 1436958 1441617 1448849
49593 1448849 1458577 1468616 1475085 1474994 1468090 1455871 1439612 1420001 1397873 1374273 1350240 1327177
49581 1327177 1306763 1289542 1274400 1260647 1249817 1243667 1240961 1238413 1235056 1233311 1234810 1237233 1237028
49568 1237028 1233824 1230210 1227872 1225964 1223074 1218922 1213673 1207120 1199291 1190923 1182588 1173992 1164819 1155720
49554 1155720 1147814 1141530 1136507 1132449 1129501 1127843 1127382 1127882 1129085 1130598 1132042 1133443 1135309 1138151
49540 1138151 1141966 1146171 1149919 1152533 1153953 1154854 1156075 1157754 1159331 1160679 1162835 1166954 1172629 1178010
49526 1178010 1181824 1184647 1187726 1191208 1194240 1196473 1198547 1201010 1203480 1205157 1205737 1205716 1206242 1208727 1213948
49511 1213948 1221104 1228227 1234028 1239135 1245165 1252895 1261870 1271621 1282483 1294888 1308212 1320877 1331686
49498 1331686 1340808 1349209 1357255 1364141 1368684 1370240 1368604 1363643 1355895 1347436 1341112 1338202 1337288 1336023
49484 1336023 1333796 1332063 1332168 1333632 1335004 1335933 1337786 1342040 1348562 1355862 1362856 1369812 1377362 1385244
49470 1385244 1392696 1399977 1408743 1420699 1436223 1454490 1474565 1496111 1519314 1544340 1570854 1598069
49458 1598069 1625303 1652153 1677692 1699938 1717049 1729212 1738468 1746419 1752983 1757788 1761735 1766275
49446 1766275 1771917 1778520 1786533 1796664 1808385 1819834 1829254 1835575 1837450 1832828 1820090 1799210 1771732
49433 1771732 1740238 1707912 1677599 1650561 1626407 1604364 1584003 1564746 1545784 1527264 1510754
49422 1510754 1497659 1487646 1479460 1472748 1468147 1465779 1464747 1464170 1463795 1463396 1462392 1460506 1458327 1456940
49408 1456940 1457303 1459966 1464804 1470806 1476671 1481896 1486911 1492061 1497054 1501642 1506105 1510558 1514455 1517451
49394 1517451 1520287 1523971 1528304 1532019 1534372 1535830 1537003 1537476 1536007 1531676 1524773 1516781 1509411 1503390
49380 1503390 1498278 1493717 1490418 1489390 1490547 1492981 1496517 1502017 1509932 1519431 1529380 1539467 1549990
49367 1549990 1561285 1573821 1588109 1603896 1620170 1636719 1655067 1677022 1702676 1730737 1760536
49356 1760536 1792763 1828306 1866976 1907032 1944932 1975669 1994644 2000115 1994010 1980729 1965521 1953060
49344 1953060 1945948 1944104 1946399 1952966 1964984 1982215 2002104 2022046 2041621 2061855 2083054 2104219
49332 2104219 2124215 2142682 2159838 2175763 2189795 2200654 2207603 2211475 2213685 2214033 2210559 2202237 2190748
49319 2190748 2178597 2166229 2152354 2136737 2121225 2107757 2096420 2085999 2075849 2066746 2060095 2056503
49307 2056503 2055066 2054146 2052927 2051896 2051672 2052014 2052490 2053445 2055258 2056877 2056157 2051893 2044737 2036063 2026712
49292 2026712 2017157 2008049 1999965 1992885 1986345 1979946 1973527 1967009 1960363 1953700 1947325 1941624 1936700 1932099
49278 1932099 1927333 1922896 1920184 1919830 1920700 1921331 1921963 1923941 1927180 1929425 1928416 1923854 1916896 1908773 1900580
49263 1900580 1893531 1888518 1885758 1885417 1888045 1893806 1901900 1911614 1923522 1938693 1956886 1976459 1996126
49250 1996126 2015888 2035908 2055077 2071088 2081611 2085216 2081636 2071589 2056255 2036656 2013554 1988021
49238 1988021 1961893 1937300 1915545 1896547 1879630 1864955 1853840 1847249 1844149 1841957 1838815 1835049
49226 1835049 1832296 1831853 1834161 1839010 1845329 1851209 1855276 1858065 1861112 1864545 1866586 1865927 1863683 1862120
49212 1862120 1861954 1861862 1860605 1858660 1857388 1857216 1857298 1856851 1856176 1855993 1855991 1854718 1851267 1846723 1843200 1841358 1839575
49195 1839575 1836144 1831886 1829866 1832594 1840203 1851546 1866421 1886059 1911563 1942410 1976708 2012622
49183 2012622 2049141 2085301 2118887 2146417 2164806 2173022 2172055 2163590 2149266 2131049 2111399 2092324
49171 2092324 2074381 2057130 2040566 2025779 2014094 2005919 2000722 1998026 1998110 2001374 2007106 2013309 2018239
49158 2018239 2021947 2025791 2030463 2035255 2039639 2044762 2052559 2063690 2077277 2092652 2110462 2131713 2156284
49145 2156284 2182836 2209893 2236627 2262850 2288686 2314433 2340636 2368066 2397187 2427435 2457290
49134 2457290 2485508 2512154 2538070 2563689 2588929 2613993 2639347 2664859 2689863 2714328 2739109
49123 2739109 2764663 2790329 2815332 2839826 2864439 2889629 2916153 2945331 2977834 3012787 3049097
49112 3049097 3087355 3129384 3176212 3227629 3283611 3344974 3412445 3486010 3565150 3648183 3730576
49101 3730576 3804966 3864208 3904703 3926982 3934166 3930678 3921609 3911710 3904213 3900607 3901298 3906052 3914075
49088 3914075 3924394 3936455 3950105 3965028 3980642 3996684 4013561 4031891 4051877 4073377 4096469
49077 4096469 4121629 4149253 4179086 4210262 4241970 4274236 4308095 4344825 4384669 4426333 4468167
49066 4468167 4509994 4553258 4598930 4645804 4691735 4736332 4781287 4827947 4875780 4923948 4973205
49055 4973205 5025002 5079330 5134902 5191483 5250924 5315708 5387397 5466776 5554613 5651781 5759283
49044 5759283 5878970 6014323 6170339 6352027 6561025 6791120 7026752 7249074 7447727
49035 7447727 7628358 7806674 7991325 8169554 8309185 8377380 8361908 8277685 8153863 8013463
$$ [...]
##END NTUPLES=NMR SPECTRUM
##END=
