
##TITLE=AC1007_S-149_6114592_zZLpfeKMET
##JCAMPDX= 6.0         $$ Bruker NMR JCAMP-DX V2.0
##DATA TYPE= NMR SPECTRUM
##DATA CLASS= NTUPLES
##ORIGIN= BRUKER
##OWNER= Administrator
$$ 1.72 TOPSPIN		Version 2.1
$$ 2012-05-14 18:18:04.234 -0500  Administrator@TOPSPIN
$$ Compression mode = diff/dup
##.OBSERVE FREQUENCY= 400.13188235
##.OBSERVE NUCLEUS= ^1H
##.ACQUISITION MODE= SIMULTANEOUS (DQD)
##.ACQUISITION SCHEME= undefined
##.AVERAGES= 8
##.DIGITISER RES= 22
##SPECTROMETER/DATA SYSTEM= spect
##.PULSE SEQUENCE= zg30
##.SOLVENT NAME= COFFEE_meoh
##.SHIFT REFERENCE= INTERNAL, COFFEE_meoh, 1, 14.98061
##AUDIT TRAIL= $$ (NUMBER, WHEN, WHO, WHERE, PROCESS, VERSION, WHAT)
$$ ##TITLE= Audit trail, TOPSPIN		Version 2.1
$$ ##JCAMPDX= 5.01
$$ ##ORIGIN= Bruker BioSpin GmbH
$$ ##OWNER= Administrator
$$ $$ C:\Bruker\TOPSPIN/data/COFFEE/nmr/AC1007_S-149_6114592_zZLpfeKMET/40/pdata/1/auditp.txt
$$ ##AUDIT TRAIL=  $$ (NUMBER, WHEN, WHO, WHERE, PROCESS, VERSION, WHAT)
(   1,<2012-05-14 18:17:57.546 -0500>,<Administrator>,<TOPSPIN>,<go>,<TOPSPIN 2.1>,
      <created by zg
	started at 2012-05-14 18:16:51.078 -0500,
	POWCHK enabled, PULCHK disabled,
       configuration hash MD5:
       AF F2 23 6B 01 CD 40 DD E5 A1 38 A0 06 EA F7 77
       data hash MD5: 64K
       C7 D3 2D 6C 62 19 A5 CE D7 F3 97 55 21 40 7B 39>)
(   2,<2012-05-14 18:18:00.171 -0500>,<Administrator>,<TOPSPIN>,<proc1d>,<TOPSPIN 2.1>,
      <Start of raw data processing
       efp LB = 0 FT_mod = 6 PKNL = 1 PHC0 = 0 PHC1 = 0 SI = 32K 
       data hash MD5: 32K
       58 F3 7E B6 4D 4F 89 F7 00 EF 25 FF 29 C1 0E 68>)
(   3,<2012-05-14 18:18:00.593 -0500>,<Administrator>,<TOPSPIN>,<proc1d>,<TOPSPIN 2.1>,
      <pk PHC0 = 215.8429 PHC1 = 0 
       data hash MD5: 32K
       26 61 8B 4B 03 36 BB 1A B0 3F C8 59 90 6E 27 69>)
(   4,<2012-05-14 18:18:00.687 -0500>,<Administrator>,<TOPSPIN>,<proc1d>,<TOPSPIN 2.1>,
      <abs ABSG = 1 
       data hash MD5: 32K
       C3 6F 7D 9B D0 C0 0A 1C 1D 6E 91 75 DE 16 67 2B>)
(   5,<2012-05-14 18:18:00.718 -0500>,<Administrator>,<TOPSPIN>,<proc1d>,<TOPSPIN 2.1>,
      <abs ABSG = 2 
       data hash MD5: 32K
       C7 89 21 D0 7A FC FF 2A 4E 3F 6C 79 EA 07 20 C0>)
(   6,<2012-05-14 18:18:00.750 -0500>,<Administrator>,<TOPSPIN>,<proc1d>,<TOPSPIN 2.1>,
      <abs ABSG = 3 
       data hash MD5: 32K
       C1 B4 4E 61 38 1B A4 50 B4 95 75 8A AE B3 C5 F1>)
(   7,<2012-05-14 18:18:00.781 -0500>,<Administrator>,<TOPSPIN>,<proc1d>,<TOPSPIN 2.1>,
      <abs ABSG = 4 
       data hash MD5: 32K
       D5 BC B1 06 21 4D 6D 71 A3 F2 4A A6 CD 03 8D 54>)
(   8,<2012-05-14 18:18:00.812 -0500>,<Administrator>,<TOPSPIN>,<proc1d>,<TOPSPIN 2.1>,
      <abs ABSG = 5 
       data hash MD5: 32K
       0A 87 92 A1 29 43 CC 9C E0 26 54 FA D4 F2 3A 96>)
$$ ##END=
$$ 
$$ $$ hash MD5
$$ $$ D4 0F A8 EB 6B 57 6E CE E2 24 54 43 A7 1E A1 AA
##$RELAX= 
##$RELAX= 
##$RELAX= 
##$RELAX= 
##$RELAX= 
##$RELAX= 
##$RELAX= 
$$ Bruker specific parameters
$$ --------------------------
$$ [...]
150 150 150 150 150 150 150 150
##$TP07= 0
##$TPNAME0= <>
##$TPNAME1= <>
##$TPNAME2= <>
##$TPNAME3= <>
##$TPNAME4= <>
##$TPNAME5= <>
##$TPNAME6= <>
##$TPNAME7= <>
##$TPOAL= (0..7)
0.5 0.5 0.5 0.5 0.5 0.5 0.5 0.5
##$TPOFFS= (0..7)
0 0 0 0 0 0 0 0
##$TUNHIN= 0
##$TUNHOUT= 0
##$TUNXOUT= 0
##$USERA1= <user>
##$USERA2= <user>
##$USERA3= <user>
##$USERA4= <user>
##$USERA5= <user>
##$V9= 5
##$VALIST= <valist>
##$VCLIST= <CCCCCCCCCCCCCCC>
##$VD= 0
##$VDLIST= <DDDDDDDDDDDDDDD>
##$VPLIST= <PPPPPPPPPPPPPPP>
##$VTLIST= <TTTTTTTTTTTTTTT>
##$WBST= 2048
##$WBSW= 25
##$XGAIN= (0..3)
0 0 0 0
##$XL= 0
##$YL= 0
##$YMAX_a= 507288
##$YMIN_a= -587816
##$ZGOPTNS= <>
##$ZL1= 120
##$ZL2= 120
##$ZL3= 120
##$ZL4= 120
##$ABSF1= 14.98061
##$ABSF2= -5.57192
##$ABSG= 5
##$ABSL= 3
##$ALPHA= 0
##$AQORDER= 0
##$ASSFAC= 0
##$ASSFACI= 0
##$ASSFACX= 0
##$ASSWID= 0
##$AUNMP= <proc_prof1d_extract_pilot.lims>
##$AXLEFT= 0
##$AXNAME= <>
##$AXNUC= <1H>
##$AXRIGHT= 0
##$AXTYPE= 0
##$AXUNIT= <>
##$AZFE= 0.1
##$AZFW= 0.1
##$BCFW= 0
##$BC_mod= 0
##$BYTORDP= 0
##$COROFFS= 0
##$CY= 15
##$DATMOD= 1
##$DC= 0
##$DFILT= <>
##$DTYPP= 0
##$F1P= 0
##$F2P= 0
##$FCOR= 0.5
##$FTSIZE= 32768
##$FT_mod= 6
##$GAMMA= 0
##$GB= 0
##$INTBC= 1
##$INTSCL= 1
##$ISEN= 128
##$LB= 0
##$LEV0= 0
##$LPBIN= 0
##$MAXI= 10000
##$MC2= 0
##$MEAN= 0
##$ME_mod= 0
##$MI= 0
##$NCOEF= 0
##$NC_proc= -8
##$NLEV= 6
##$NOISF1= 0
##$NOISF2= 0
##$NSP= 0
##$NTH_PI= 0
##$NZP= 0
##$OFFSET= 14.98061
##$PC= 1
##$PHC0= 215.8429
##$PHC1= 0
##$PH_mod= 1
##$PKNL= yes
##$PPARMOD= 0
##$PPDIAG= 0
##$PPIPTYP= 0
##$PPMPNUM= 2147483647
##$PPRESOL= 1
##$PSCAL= 4
##$PSIGN= 0
##$PYNMP= <proc.py>
##$REVERSE= no
##$SF= 400.13
##$SI= 32768
##$SIGF1= 0
##$SIGF2= 0
##$SINO= 400
##$SIOLD= 32768
##$SPECTYP= <>
##$SREGLST= <1H.CDCl3>
##$SSB= 0
##$STSI= 32768
##$STSR= 0
##$SW_p= 8223.68421052632
##$SYMM= 0
##$S_DEV= 0
##$TDeff= 65536
##$TDoff= 0
##$TI= <>
##$TILT= no
##$TM1= 0
##$TM2= 0
##$TOPLEV= 0
##$USERP1= <user>
##$USERP2= <user>
##$USERP3= <user>
##$USERP4= <user>
##$USERP5= <user>
##$WDW= 1
##$XDIM= 32768
##$YMAX_p= 455039561
##$YMIN_p= -811360
##$CURPLOT= <Network HP LaserJet P1505>
##$CURPRIN= <$Network HP LaserJet P1505>
##$DFORMAT= <normdp>
##$LAYOUT= <+/1D_H.xwp>
##$LFORMAT= <normlp>
##$PFORMAT= <normpl>
##$SURQMSG= 1
$$ End of Bruker specific parameters
$$ ---------------------------------
##NTUPLES= NMR SPECTRUM
##VAR_NAME=  FREQUENCY,     SPECTRUM/REAL,   SPECTRUM/IMAG
##SYMBOL=    X,             R,               I
##VAR_TYPE=  INDEPENDENT,   DEPENDENT,       DEPENDENT
##VAR_FORM=  AFFN,          ASDF,            ASDF
##VAR_DIM=   32768,         32768,           32768
##UNITS=     HZ,            ARBITRARY UNITS, ARBITRARY UNITS
##FACTOR=    0.250966925370066, 1,           1
##FIRST=     8223.43324360095, -82158,       -107701
##LAST=      0,             65088,           -100894
##MIN=       0,             -811360,         0
##MAX=       8223.43324360095, 455039561,    0
$$ Real data points
##PAGE= N=1
##DATA TABLE= (X++(R..R)), XYDATA
$$ [...]
19576C9452M4357N0992b76778O5757B0080b11867H7759a13287j55345i8679d639
$$ 39452 83809 134801 -276778 -211021 20080 -211867 87759 -113287 -268632 -98679 -4639
19564D27921d6000D5623a46343K0704k8089j49898J14175n0974G6017d24762i9202
$$ 427921 -46000 45623 -146343 -125639 -153728 -303626 -189451 -240425 76017 -424762 -99202
19552G271P9550i920r4237H784O1724b0865q0981k71820f8119N052p0399n5936
$$ 7271 86821 -9920 -104157 8784 70508 -20865 -101846 -373666 -68119 -63067 -133466 -189402
19540a89402A8841R5914C7544j8495d55932F9478D37i8474B2819J47049R898i6343
$$ -189402 18841 114755 37544 19049 -455932 69478 437 -98474 22819 169868 179766 -96343
19527i6881A7311a42350d6855I5128b1755I9221j7341f3566b4114k39321M2063
$$ -96881 17311 -142350 -46855 95128 -21755 99221 81880 -63566 -24114 -263435 -221372
19516b21372G37b9126I7279K6114b7185F8400J52392c21935j10291a63552A7007
$$ -221372 737 -29126 97279 123393 -27185 68400 220792 -321935 -432226 -163552 17007
19504a31102q804l9770A45752b12834a04638D0358b01590O4545j9049j5719D3506
$$ -131102 -139906 -179676 145752 -212834 -104638 40358 -201590 -137045 -156094 -171813 43506
19492a32483F8727i7287k42138A78168g408A12258b07052B37668c14655h8847
$$ -132483 68727 -97287 -339425 178168 -7408 112258 -207052 237668 -314655 -88847
19481b31728A53496a58823H0407J46030m5315B6385b87743A3115a9236A52559
$$ -231728 153496 -158823 80407 226437 181122 26385 -287743 13115 -19236 152559
19470B24981a10306A81560b88979D45697f6260A7142h8127k41919a14446m7731
$$ 224981 -110306 181560 -288979 445697 -66260 17142 -88127 -330046 -114446 -162177
19460a62177m7727A74718a4203n07063d6373j79118e0107m8247j18268j05449
$$ -162177 -209904 174718 -14203 -521266 -46373 -225491 -50107 -98354 -216622 -322071
19450c22071h6738k4590j10821A07733A7920c7728C223J19401K40659d26353b3095
$$ -322071 -86738 -111328 -222149 107733 17920 -37728 3223 122624 363283 -426353 -23095
19438c7006A22987f4005A18760b73530O8599B55139a48942K243N3992j95340A98365
$$ -37006 122987 -64005 118760 -273530 -204931 255139 -148942 -146699 -92707 -288047 198365
19426H9877M2737C1752f4105l6786o3673B8625b97608i3015A2866b44419J17358
$$ 89877 132614 31752 -64105 -100891 -164564 28625 -297608 -93015 12866 -244419 -127061
19415a27061G3632K35762a40188G8033f1138k40051J48546B585a01318M6575A19206
$$ -127061 73632 309394 -140188 78033 -61138 -301189 -152643 2585 -101318 -54743 119206
19403f9852A8719P6077a4030A0895h5537A56742b00273e5169k39436g9197k6823
$$ -69852 18719 94796 -14030 10895 -85537 156742 -200273 -55169 -294605 -79197 -106020
19392a06020b6353k87413I5378D1709i4724A50954a47307k0824A57919b21735
$$ -106020 -26353 -313766 95378 41709 -94724 150954 -147307 -168131 157919 -221735
19381a04133I956b50748e5355k07525J24172G6983c31810A88908a49111A48992
$$ -104133 9956 -250748 -55355 -262880 -138708 76983 -331810 188908 -149111 148992
19370A919a67895F4590b48153b2267j23307k9866j59641C6703d3887j51954K6397
$$ 1919 -167895 64590 -248153 -22267 -145574 -175440 -335081 36703 -43887 -195841 -169444
19359a69444N6153B04820H5100B2418d556j00169B60314b22880b6126A25594l6381
$$ -169444 -113291 204820 85100 22418 -4556 -104725 260314 -222880 -26126 125594 89213
19348H9213c10012h9362j05353g0144E4588B4393b6537B05334c2309j26522r0227
$$ 89213 -310012 -89362 -194715 -70144 54588 24393 -26537 205334 -32309 -158831 -249058
19337b49058E2997a75455H9612b04346i7515J154G6595a06718p06A92030A8015
$$ -249058 52997 -175455 89612 -204346 -97515 -96361 76595 -106718 -107424 192030 18015
19325g0564J4168b7698H7297A9556K36340k3457a80230P9572j8392m8036B6598
$$ -70564 -56396 -27698 87297 19556 255896 232439 -180230 -100658 -119050 -167086 26598
19313a56159D3277a82748e3342A03342c52405J5313g0089m1759B21982d25015
$$ -156159 43277 -182748 -53342 103342 -352405 -337092 -70089 -111848 221982 -425015
19302A29858a49711p4006I3166b77493B19613i6041n4315i044k25454A11473d8685
$$ 129858 -149711 -223717 93166 -277493 219613 -96041 -150356 -9044 -234498 111473 -48685
19290a36262j18140A8628b43667C24820j33007a20621c6720j05299L6205c9782
$$ -136262 -254402 18628 -243667 324820 191813 -120621 -36720 -142019 -105814 -39782
19279a57006l0246J0829N5442A32668J35204d29276J53156J20409A12226h0171
$$ -157006 -187252 -176423 -120981 132668 267872 -429276 -276120 -155711 112226 -80171
19268a45751P0665G2213a28780o6249m66610H1313f9803D9955a04635B3805L5757
$$ -145751 -75086 72213 -128780 -195029 -661639 81313 -69803 49955 -104635 23805 59562
19257E9562A444J52749b21001e9132C87932a32729B3895a70862B35018B0406J98365
$$ 59562 1444 154193 -221001 -59132 387932 -132729 23895 -170862 235018 20406 218771
19246B18771a25817F2194a35132d997A25385g3077k5184k1636B05117a21915A86375
$$ 218771 -125817 62194 -135132 -4997 125385 -73077 -98261 -119897 205117 -121915 186375
19234a47070j10340r293a19736l8297K4716i034B0705M4337A105J5569c02778
$$ -147070 -257410 -266703 -119736 -158033 -133317 -9034 20705 65042 1105 16674 -302778
19222a6720B19312d77255a78969L8635C6917a9415F5206K02694a03308B73587
$$ -16720 219312 -477255 -178969 -140334 36917 -19415 65206 267900 -103308 273587
19211a04082C5925h4806A91866E8619K74301A885a5127A23158i3321j02755M1597
$$ -104082 35925 -84806 191866 58619 332920 1885 -15127 123158 -93321 -196076 -154479
19200a54479A85480L4482G7542f5126p6905f2290R395j5208A90582b23240a09782
$$ -154479 185480 219962 77542 -65126 -142031 -62290 -52895 -68103 190582 -223240 -109782
19188F6487a65247l2023D8490a06819Q625D7858O5628a76930k29341J36755J20159
$$ 66487 -165247 -197270 48490 -106819 -98194 47858 113486 -176930 -406271 -269516 -149357
19177a49357A93181d1221N071k8267k62328A15593J1605a73621k18867a67066
$$ -149357 193181 -41221 -36150 -64417 -326745 115593 127198 -173621 -392488 -167066
19166f9155C5140a17619A74836m6798E4159F870J20362c05321B0056b5411k08510
$$ -69155 35140 -117619 174836 128038 54159 6870 127232 -305321 20056 -25411 -233921
19155b33921A1946Q9383C0437i2429A97657b90900a29544A43811j5837F2549J39919
$$ -233921 11946 101329 30437 -92429 197657 -290900 -129544 143811 127974 62549 202468
19144B02468b85603C9137J0098j7190K1541j3725a21558b3052A32876k8957h3870
$$ 202468 -285603 39137 49235 32045 53586 39861 -121558 -23052 132876 103919 -83870
19132A15568d8892A05367D2974a95581d2704j22259P4789J0378N469j24205r1829
$$ 115568 -48892 105367 42974 -195581 -42704 -164963 -90174 -79796 -74327 -198532 -290361
19121b90361B01292f7885l38014M4085f2267C7163e8426m9520A05863M3667a19768
$$ -290361 201292 -67885 -405899 -361814 -62267 37163 -58426 -107946 105863 149530 -119768
19109a39073j38309J21163A49860f0396A84931H7480b74623a35912j16577B43918
$$ -139073 -277382 -156219 149860 -60396 184931 87480 -274623 -135912 -252489 243918
19098c19177G8738p65a19884l1356D3828a30441a8746m4896k32015J10119i2191
$$ -319177 78738 77973 -119884 -151240 43828 -130441 -18746 -63642 -295657 -185538 -92191
19086a16786H3001j4398b91350A10701A2383K76383d9135H0382b82862c8695r998
$$ -116786 83001 68603 -291350 110701 12383 288766 -49135 80382 -282862 -38695 -48693
19075d8693p1680K1613L7300l4360M942B5856J04398E7194a41158f2565K0808
$$ -48693 -120373 -98760 -61460 -95820 -90878 25856 130254 57194 -141158 -62565 -41757
19064d1757k8528B41498G1679j8518b61045A06367a27306r0581O9526b1849I9807
$$ -41757 -70285 241498 71679 53161 -261045 106367 -127306 -217887 -148361 -21849 99807
19052A10893a27268L336B6811a90263P3173p6418R3271n0720m9230f3449g459
$$ 110893 -127268 -123932 26811 -190263 -117090 -193508 -100237 -150957 -200187 -63449 -7459
19040B71682b20855Q5344q0090M7052L7483F6306K6218L17990A61408D0614J63902
$$ 271682 -220855 -135511 -215601 -168549 -131066 66306 92524 410514 161408 40614 204516
19029B04516a39423k7189A79981c4789o0507a3276B26622b21884a0876D4115B1237
$$ 204516 -139423 -166612 179981 -34789 -95296 -13276 226622 -221884 -10876 44115 21237
19017B68091a6759k17562j6494f2171m65961C2479j3959O3007K8009J7424J90441
$$ 268091 -16759 -234321 -250815 -62171 -528132 32479 18520 81527 109536 126960 317401
19006C17401C7516M8651N5397O3296c17768D30067j99520b25331I8744P9312c3035
$$ 317401 37516 86167 141564 204860 -317768 430067 230547 -225331 98744 178056 -33035
18994h0724F297g2108j5487F9139b14323i2435M3785r8129O0719k23485d4189
$$ -80724 6297 -72108 -87595 69139 -214323 -92435 -48650 -146779 -86060 -309545 -44189
18982a54804P4122A84629H2666c04470h3204F2289k5271a69813I9524b49904A69659
$$ -154804 -80682 184629 82666 -304470 -83204 62289 37018 -169813 99524 -249904 169659
18970A05377h1543b4303E2157a95086H377a18367C564b43263G0287a23964F1500
$$ 105377 -81543 -24303 52157 -195086 8377 -118367 3564 -243263 70287 -123964 61500
18958i8704L4692a5531j14001N5273m22065A02871b04038A29464g021I5541K01508
$$ -98704 -64012 -15531 -129532 -74259 -496324 102871 -204038 129464 -7021 95541 297049
18947B97049d516B05470a36097A81563g2279k2654i922j46744f8519C2697a54717
$$ 297049 -4516 205470 -136097 181563 -72279 -94933 -9922 -156666 -68519 32697 -154717
18935b7879C78546e5061j17536I4340J8577K41441c466j09352j26673A25149B9672
$$ -27879 378546 -55061 -172597 94340 112917 354358 -3466 -112818 -239491 125149 29672
18923a76754j07615J34947f3297a8276l25176J11077A40480d2381C09718a88464
$$ -176754 -284369 -149422 -63297 -18276 -343452 -232375 140480 -42381 309718 -188464
18912a09447A9616R0219c86281F6978Q783b01726A2689a8819j31462M0549J6757
$$ -109447 19616 109835 -386281 66978 75761 -201726 12689 -18819 -150281 -109732 -92975
18901i2975G749J23934B1849J05279c2437j50984Q895E6286b27410P1710N0678
$$ -92975 7749 131683 21849 127128 -32437 -183421 -174526 56286 -227410 -155700 -105022
18890a05022C1606f6593A51335d50398B04298a27748j28121o4214a07948d8572
$$ -105022 31606 -66593 151335 -450398 204298 -127748 -255869 -320083 -107948 -48572
18879G7549K45834c34922J32342R7636R965A17409a4953j39757r3491G688a45706
$$ 77549 323383 -334922 -202580 -104944 -94979 117409 -14953 -154710 -248201 7688 -145706
18867d397o3318o0316O0111K0496j95031i4097n3348A09696i2382h296A8424c8469
$$ -4397 -67715 -128031 -67920 -47424 -242455 -94097 -147445 109696 -92382 -8296 18424 -38469
18854f0279j81571G2760J40721E9576b06125R3776j0993e2231Q428p1031k38216
$$ -60279 -241850 72760 213481 59576 -206125 -112349 -123342 -52231 -43803 -114834 -353050
18843c53050A30232m6762a28761J09H1826i7328H0468h4861F3481b95241B73949
$$ -353050 130232 83470 -128761 -128652 81826 -97328 80468 -84861 63481 -295241 273949
18831a15372F5969e18339J48263Q808a13937I1565b4700D5719b08075d1111k0276
$$ -115372 65969 -518339 -370076 -361268 -113937 91565 -24700 45719 -208075 -41111 -61387
18820f1387q7128G3762a22876k4196j05190h3829A37943n7741a10763B60433h546
$$ -61387 -148515 73762 -122876 -147072 -252262 -83829 137943 80202 -110763 260433 -8546
18808F7965a37641G1902k5345a13036l67297B35924G5559K8671a27426C2692J88290
$$ 67965 -137641 71902 46557 -113036 -480333 235924 75559 104230 -127426 32692 220982
18797B20982J1062J80424a30617B38530a05749A45926L5577O594C4653J57563
$$ 220982 232044 412468 -130617 238530 -105749 145926 181503 188097 34653 192216
18787A92216b96937R8339l4856h7297j47183B23037A05504b54961P8291c4169
$$ 192216 -296937 -198598 -233454 -87297 -234480 223037 105504 -254961 -176670 -34169
18776b84242A5054b63893A17261k2197c46249A9414L40131C923J31842B9293a91854
$$ -284242 15054 -263893 117261 95064 -346249 19414 359545 3923 135765 29293 -191854
18764a3442E9990J20339a28677b133F9920C3578a05444J4268d1489C56256j77408
$$ -13442 59990 180329 -128677 -2133 69920 33578 -105444 -91176 -41489 356256 178848
18753A78848e0313k09267i9309j07644B00512H5435c1115k09549a05780E9848
$$ 178848 -50313 -259580 -99309 -206953 200512 85435 -31115 -240664 -105780 59848
18742a65892d5341h820A77416B1224K27747a19147F9880b1184p4289l47625a2989
$$ -165892 -45341 -8820 177416 21224 248971 -119147 69880 -21184 -95473 -443098 -12989
18730B703Q6845B801J31394b62395a11736A1943a37057d7650C41605i9160b8395
$$ 2703 89548 2801 134195 -262395 -111736 11943 -137057 -47650 341605 -99160 -28395
18718a65143J4578H3352a40324C696a14111F2821h5062A16758L1530b82748d7937
$$ -165143 -150565 83352 -140324 3696 -114111 62821 -85062 116758 148288 -282748 -47937
18706E4413O9767Q5710a37706p3655E8539B5507e3723o2230G9278B1478K0072
$$ 54413 124180 209890 -137706 -211361 58539 25507 -53723 -115953 79278 21478 41550
18695D1550i5692p2477A40232P3563a00838k6547J8609J4670k27744a547A61014
$$ 41550 -95692 -168169 140232 213795 -100838 -127385 -108776 -94106 -321850 -1547 161014
18683b2472B8989d04665a88799e4456B62088A24303f8437G3850Q8516a47096b2865
$$ -22472 28989 -404665 -188799 -54456 262088 124303 -68437 73850 162366 -147096 -22865
18671g8724A29556o4113a71671j37006j05658h6449K2078j58627O1778h704m0795
$$ -78724 129556 65443 -171671 -308677 -414335 -86449 -64371 -222998 -161220 -8704 -49499
18660d9499r7684A32671o5326b8635G0028P4655g7520l6532j39842l0686A36466
$$ -49499 -147183 132671 67345 -28635 70028 144683 -77520 -114052 -253894 -284580 136466
18648d29726a991j32666j04281h7695C36235a77381p7830h2471J9312l6784c8407
$$ -429726 -1991 -134657 -238938 -87695 336235 -177381 -255211 -82471 -63159 -99943 -38407
18636c02031g0029A36765a46898D3448a58464m5827H1374A8493a24089B0692M4861
$$ -302031 -70029 136765 -146898 43448 -158464 -204291 81374 18493 -124089 20692 65553
18625F5553K09153j33892K58593a83878L0057j97845I319b41955C7453M9408Q1398
$$ 65553 274706 140814 399407 -183878 -153821 -351666 9319 -241955 37453 86861 168259
18614A68259k2932a21636q8351J2474H4528b34144H8558c17481c0940j64628L7323
$$ 168259 145327 -121636 -209987 -197513 84528 -234144 88558 -317481 -30940 -195568 -158245
18603a58245a1109A45808g5322n9554d5431J6978J0582p6236k48177f689C14114
$$ -158245 -11109 145808 -75322 -134876 -45431 -28453 -17871 -94107 -342284 -6689 314114
18591B55074A17100e3441D862R0787j6235k750a61862A43421j2497b65151I3651
$$ 255074 117100 -53441 4862 95649 79414 76664 -161862 143421 130924 -265151 93651
18579b78870c0476k9192J9416k46299A06362L9189a12801j39746a26093A51977
$$ -278870 -30476 -59668 -40252 -286551 106362 145551 -112801 -252547 -126093 151977
18568h9117l23498J31458L4292a7231j35170L9897j41310J3595A7518L26040e2779
$$ -89117 -412615 -281157 -246865 -17231 -152401 -112504 -253814 -240219 17518 343558 -52779
18556a28313F8127j3364L5040a05404A28618b40753E4512N7970J55932c46008
$$ -128313 68127 54763 89803 -105404 128618 -240753 54512 112482 268414 -346008
18545a51183A1457a3659r1259I6185d23560a52230E4649b74755A343c76449A0198
$$ -151183 11457 -13659 -104918 96185 -423560 -152230 54649 -274755 1343 -376449 10198
18533b25380D4568M8970b27216i5593q4501K8991d5271A60794a21439j12807B5082
$$ -225380 44568 93538 -227216 -95593 -180094 -151103 -45271 160794 -121439 -234246 25082
18521A52023E1165K1835B9636i2018A04033a91637e7952A72352Q9519b8137B43959
$$ 152023 51165 73000 29636 -92018 104033 -191637 -57952 172352 261871 -28137 243959
18509D0694a22352A23698b70491e6637j48872c5699k00612A24142m3600J13595
$$ 40694 -122352 123698 -270491 -56637 -205509 -35699 -236311 124142 80542 194137
18499A94137A322J86929d09186D6752j1626c98798C0657a50432I8212b89492D3913
$$ 194137 1322 188251 -409186 46752 35126 -398798 30657 -150432 98212 -289492 43913
18487A37558a06034p3229Q815r6148a02444G5968j8399b06055a1711B79896a08750
$$ 137558 -106034 -179263 -170448 -266596 -102444 75968 57569 -206055 -11711 279896 -108750
18475a16013R058G3212g8227B9214c3498r7250c7656j70491F3841r446e166r899
$$ -116013 -106955 73212 -78227 29214 -33498 -130748 -37656 -208147 63841 54395 -5166 -15065
18463a5065A58635k4311a86379r6341J16745j65963J36477c5674C6882J87428
$$ -15065 158635 134324 -186379 -282720 -165975 -331938 -195461 -35674 36882 224310
18453B24310a80157A05708c25106J30620B38451I0442a17388P154j31632d6362
$$ 224310 -180157 105708 -325106 -194486 238451 90442 -117388 -110234 -241866 -46362
18442D9742h9297k6046M4263A48693d6564B31597A5935K60040f9915A55332J96
$$ 49742 -89297 -115343 -71080 148693 -46564 231597 15935 275975 -69915 155332 155528
18431A55528j4773o6241i3688B10943b07164C176c05103P3074h2366j66651L8054
$$ 155528 140755 74514 -93688 210943 -207164 3176 -305103 -232029 -82366 -249017 -210963
18420b10963i876l39509c5669H4679a0738k896j05683E5704K4012b0657C43118
$$ -210963 -9876 -349385 -35669 84679 -10738 -13634 -119317 55704 79716 -20657 343118
18408i8550p9760d3812k9952r3265A16608a23584m3113R676L7220d9981E456K32308
$$ -98550 -178310 -43812 -73764 -167029 116608 -123584 -166697 -157021 -119801 -49981 5456 237764
18396B37764d243I2466c23669b0871j36873D76273A2768a05249K6986q977M2924
$$ 237764 -4243 92466 -323669 -20871 -157744 476273 12768 -105249 -78263 -87240 -44316
18385d4316j42159a9708m32969B59106r0383o496g1665b4509B08219a89820A38335
$$ -44316 -186475 -19708 -452677 259106 168723 162227 -71665 -24509 208219 -189820 138335
18373A36830a33288a5818k4746j40603M7956k33650C67702a82906l30593g9953
$$ 136830 -133288 -15818 -40564 -181167 -133211 -366861 367702 -182906 -513499 -79953
18362e8122j07799K7327J8910I1503d00867d3690j03010B53162B7222d1024A60132
$$ -58122 -165921 -138594 -119684 91503 -400867 -43690 -146700 253162 27222 -41024 160132
18350B48035j5423A4795J9581J57672a10647K5489j46949c2369j27050B08286
$$ 248035 232612 14795 34376 192048 -110647 -85158 -232107 -32369 -159419 208286
18339a70629d0074l87588d5206A57435e2817B70441i6534q9663P8286o1162A50776
$$ -170629 -40074 -427662 -45206 157435 -52817 270441 -96534 -186197 -107911 -169073 150776
18327B15262d1417k62019o709F7232j6483O3754a34283R67m3608A88747b9988
$$ 215262 -41417 -303436 -310145 67232 50749 114503 -134283 -133316 -176924 188747 -29988
18315A08479C6257K59593b7052o1754L1093j7309A35531a03545A93401a39085
$$ 108479 36257 295850 -27052 -88806 -57713 -75022 135531 -103545 193401 -139085
18304b00181d5822A1774g4215F9830N0200a55268c6586A94941b06645a01699A96419
$$ -200181 -45822 11774 -74215 69830 120030 -155268 -36586 194941 -206645 -101699 196419
18292B05904d04969E4240c36707Q174b7134H9970g0210m5549j57982h5338o9362
$$ 205904 -404969 54240 -336707 -328533 -27134 89970 -70210 -115759 -273741 -85338 -154700
18281a54700k2706E15870a01769A1707c69732A12278b79932a37699o6057A47476
$$ -154700 -177406 515870 -101769 11707 -369732 112278 -279932 -137699 -203756 147476
18270B33168B782L5190a37691r9790a7936B44286a48886a8182C2420b09871A6144
$$ 233168 2782 37972 -137691 -237481 -17936 244286 -148886 -18182 32420 -209871 16144
18258c02170a09972A01685a13637a0644D2271J9811J43372I600c0138k40409a3176
$$ -302170 -109972 101685 -113637 -10644 42271 62082 205454 9600 -30138 -270547 -13176
18246a82561A21933a98722i7980l0789j00614M7168K6968C18595A3273K53213
$$ -182561 121933 -198722 -97980 -128769 -229383 -182215 -155247 318595 13273 266486
18236B66486b43418j72345a78377q4351M2653a7302A15115i930k65209J05254
$$ 266486 -243418 -415763 -178377 -262728 -220075 -17302 115115 -9930 -275139 -169885
18226a69885D6582Q177a10890b5025j73966J4169A33588l5476J17538c39632O6613
$$ -169885 46582 54759 -110890 -25025 -198991 -184822 133588 98112 215650 -339632 -273019
18215b73019j2584J18687B88996c0211j01179C31624a66341A06755j6159c8194
$$ -273019 -285603 -166916 288996 -30211 -131390 331624 -166341 106755 90596 -38194
18204b94404D1242d0222j46052a6360j33803H419J41684k5434c8494k99168a47523
$$ -294404 41242 -40222 -186274 -16360 -150163 8419 150103 124669 -38494 -337662 -147523
18192c7325A14258K9380k6571R2738a67938N3323A33081c66900d1173k20541e7409
$$ -37325 114258 143638 117067 209805 -167938 -114615 133081 -366900 -41173 -261714 -57409
18180b12713N3001A42972k6401a89696d4396B16064g0090a1767j50920E603J90099
$$ -212713 -159712 142972 116571 -189696 -44396 216064 -70090 -11767 -162687 5603 195702
18169A95702I5834a19637l7311k39412J93892P3042A78831h3176m7581o4274P1501
$$ 195702 95834 -119637 -156948 -396360 -202468 -129426 178831 -83176 -130757 -195031 -123530
18158a23530A14665d6564J2290B45502a57851f6611E1920J8062Q6834i1972c3010
$$ -123530 114665 -46564 -34274 245502 -157851 -66611 51920 69982 156816 -91972 -33010
18146H2137c27352a46282d5314l4041j62333l0934J22772A56585a63853C3890
$$ 82137 -327352 -146282 -45314 -79355 -241688 -272622 -149850 156585 -163853 33890
18135g4323A25867a34516A58414F7456a50379I5878N0094B6314b07061B46470
$$ -74323 125867 -134516 158414 67456 -150379 95878 145972 26314 -207061 246470
18124b62320A7851N923a1032k0316k2930D8159J06468a31771m8462h9658A6559
$$ -262320 17851 23774 -11032 -31348 -54278 48159 154627 -131771 -180233 -89658 16559
18112A48913f1608A7215K67125j08229J19531j05859h2078A44330K05184j36662
$$ 148913 -61608 17215 284340 176111 295642 189783 -82078 144330 349514 212852
18102B12852E0519R1369b07525A46409O494c54776E1399e6217A83060d11304g0277
$$ 212852 50519 141888 -207525 146409 152903 -354776 51399 -56217 183060 -411304 -70277
18090b18386M7148L1770j16543A07969R5910G4475f8966B49021I9814l1518g6959
$$ -218386 -171238 -139468 -256011 107969 203879 74475 -68966 249021 99814 68296 -76959
18078A28144a11163d6071A72387J41788b97719A7391d6751p6233L09D2921g7516
$$ 128144 -111163 -46071 172387 314175 -297719 17391 -46751 -122984 -122675 42921 -77516
18066c22331d2484j13130B43317D9343k2830b37121A9820a55008I1255i0589k3407
$$ -322331 -42484 -155614 243317 49343 26513 -237121 19820 -155008 91255 -90589 -113996
18055a13996D0850b28715q2035J02233A36917F4348f4731A14584a58158A03233
$$ -113996 40850 -228715 -310750 -208517 136917 64348 -64731 114584 -158158 103233
18044a52361E1662f14519A01980d09297a0234j67749B6345c31844J54083g0714
$$ -152361 51662 -614519 101980 -409297 -10234 -177983 26345 -331844 -177761 -70714
18033d5213n0719G173L8383B484e8234A15236C1312N3831e9408C11377O5563g5286
$$ -45213 -95932 7173 45556 2484 -58234 115236 31312 85143 -59408 311377 376940 -75286
18020b38684I815J72213G1056m46f7921k05434E294R643M8711b72663J28470C8891
$$ -238684 9815 182028 71056 70610 -67921 -273355 5294 14937 63648 -272663 -144193 38891
18007a20768b4933j37503D6748J44882c17282a55518k537B06474p6210b46394
$$ -120768 -24933 -162436 46748 191630 -317282 -155518 -158055 206474 130264 -246394
17996b9325j10014j7226D4676e4439j9004G6171J13008b29060B14092b2032p2261
$$ -29325 -139339 -156565 44676 -54439 -73443 76171 189179 -229060 214092 -22032 -94293
17985i4293c3755j47079j75558A5526J22446c6475A86612B6242b05845I4600j2739
$$ -94293 -33755 -180834 -356392 15526 137972 -36475 186612 26242 -205845 94600 81861
17974H1861d1778l697l1254H3872a58355L3364a2167B31987K30150a21965L2333
$$ 81861 -41778 -45475 -76729 83872 -158355 -124991 -12167 231987 462137 -121965 -89632
17963h9632A22655m6967a36333A65519b80076j56270P0796C5033J55212n4694
$$ -89632 122655 75688 -136333 165519 -280076 -436346 -365550 35033 190245 135551
17953A35551J03825q9235n4636d44828a78250G6496R9888a68401B73520a84323
$$ 135551 239376 150141 95505 -444828 -178250 76496 176384 -168401 273520 -184323
17942I2983D34K30148F3450L3666i3205L5535j97254B90050B2665J4159J5752
$$ 92983 434 230582 63450 97116 -93205 -57670 -254924 290050 22665 36824 52576
17931E2576i5209a3358B01164a84071o7188A65639e18404A76484L8114b50474
$$ 52576 -95209 -13358 201164 -184071 -251259 165639 -518404 176484 214598 -250474
17920A27490k0274C1277J84263B0019b8065j22867B01659c94829G5626l7077e5605
$$ 127490 107216 31277 215540 20019 -28065 -150932 201659 -394829 75626 38549 -55605
17908b32095a14026q0095A79998q8916f0418l907H6945O756a24028c7903j11692
$$ -232095 -114026 -194121 179998 91082 -60418 -64325 86945 93701 -124028 -37903 -149595
17897a49595j09591R0510b3298B54194a00280k00443a03371H2970J09382c03567
$$ -149595 -259186 -168676 -23298 254194 -100280 -300723 -103371 82970 192352 -303567
17886a29673j96900I8390c52114a24289j07443r213C75405a72824b7642j1777
$$ -129673 -326573 98390 -352114 -124289 -231732 -240945 375405 -172824 -27642 -39419
17876c9419A91523a89892F6702J77693b60960h5652m2802H8226l3727J3566k3675
$$ -39419 191523 -189892 66702 244395 -260960 -85652 -128454 88226 54499 68065 44390
17865D4390J3803K5176N2402J35319a95251E4979b61619B27045b09556C46180
$$ 44390 58193 83369 135771 271090 -195251 54979 -261619 227045 -209556 346180
17854b28886q7287J10158e0736A57638c0182A4095b2935C27959A34322a52228
$$ -228886 -316173 -206015 -50736 157638 -30182 14095 -22935 327959 134322 -152228
17843b6001k1734k07562b2979A12039b704k6191A94258b0443E0888g779j04959
$$ -26001 -47735 -255297 -22979 112039 -2704 -28895 194258 -20443 50888 -7779 -112738
17832a12738N4720m7748A99362Q7358d5218k088m5745j83108d5435E8443n032
$$ -112738 -58018 -105766 199362 286720 -45218 -47306 -93051 -276159 -45435 58443 53411
17821E3411J08701c03812H1269a74708j8395L3230a5972q3805B8471c34099A64983
$$ 53411 162112 -303812 81269 -174708 -193103 -159873 -15972 -99777 28471 -334099 164983
17809b78357J08199A0500a51861j31266a02421n0712k90457G7680M3611l8995
$$ -278357 -170158 10500 -151861 -283127 -102421 -153133 -443590 77680 121291 82296
17799H2296O8849b67536E8616O9932l2876L36583b68886e8004l06280h3676o1269
$$ 82296 151145 -267536 58616 128548 95672 432255 -268886 -58004 -364284 -83676 -144945
17788a44945B2781J48003J11873j37573F5207k893M1917c1074m20651A77898a65348
$$ -144945 22781 170784 282657 145084 65207 62314 104231 -31074 -451725 177898 -165348
17776a01730E0411J22887a27372F2025h5156G941a66446k17845B8175A0139K47335
$$ -101730 50411 173298 -127372 62025 -85156 7941 -166446 -384291 28175 10139 257474
17765B57474b50744A78485F6901b65452b1226j29272A50128C7284J66922a46587
$$ 257474 -250744 178485 66901 -265452 -21226 -150498 150128 37284 204206 -146587
17754A31720E8449P0960b4611B50858e5904A82785q7937C364h2434m1592H1730
$$ 131720 58449 129409 -24611 250858 -55904 182785 94848 3364 -82434 -124026 81730
17742G4105R3505K32071A27439K41164a19095A02653b22663a7442C9872c90846
$$ 74105 167610 399681 127439 368603 -119095 102653 -222663 -17442 39872 -390846
17731g3489M805G1885J59297e8525n7234A70879c1530A70872d48369A05055I17
$$ -73489 -68684 71885 231182 -58525 -115759 170879 -31530 170872 -448369 105055 917
17719I2890l3069f3056n7630n95A653b8069D4703c23276B33750A10257E0267d9583
$$ 92890 59821 -63056 -120686 -121281 1653 -28069 44703 -323276 233750 110257 50267 -49583
17706d9334F9759g0277G9599Q9958a75680A3269L807h1676j2427C196M111J29814
$$ -49334 69759 -70277 79599 169557 -175680 13269 17076 -81676 -94103 3196 7307 137121
17694A37121b12478E7774j6012J75048D5789L3446a80520B18177i6226B02311
$$ 137121 -212478 57774 41762 216810 45789 79235 -180520 218177 -96226 202311
17683b05392D0625g1774E1847g7076A0460h2071C11932g563k550k8757C0937a5288
$$ -205392 40625 -71774 51847 -77076 10460 -82071 311932 -7563 -10113 -38870 30937 -15288
17670f4560A65802F2283a09596k67196A46532l6261E1607P4039a53991A12426
$$ -64560 165802 62283 -109596 -376792 146532 110271 51607 125646 -153991 112426
17659a1789G860a33450H8390c13695N368a7854k13441A08847E3600d50073H706
$$ -11789 7860 -133450 88390 -313695 -308327 -17854 -231295 108847 53600 -450073 8706
17647a00149H2081l0557a27096F2914J13127b39532e9828B94373c8434r3292A77202
$$ -100149 82081 51524 -127096 62914 176041 -239532 -59828 294373 -38434 -131726 177202
17635a64000n5615D964b05311A4571K2049j4051a69508h2591C50138A34647c0225
$$ -164000 -219615 4964 -205311 14571 36620 22569 -169508 -82591 350138 134647 -30225
17623C68328a19699B04444o6372m5113e5815A48508f7898l98553A41058i8669
$$ 368328 -119699 204444 138072 92959 -55815 148508 -67898 -466451 141058 -98669
17612B1844M8282q622e6277B40441j20162A9952a31840M4967A10915h6986K7877
$$ 21844 70126 61504 -56277 240441 120279 19952 -131840 -86873 110915 -86986 -59109
17601e9109k38930m6920A26155d7553A49150a26682M2445A4223O9190j9222b45653
$$ -59109 -298039 -344959 126155 -47553 149150 -126682 -84237 14223 83413 64191 -245653
17589A23393L6316D7900a04686a6289l75267F6524N9351J41008A5418h2745B15781
$$ 123393 159709 47900 -104686 -16289 -391556 66524 125875 266883 15418 -82745 215781
17577A19888J59701m8729a29824b4046C37187A15477O1567b65456A03645d3644
$$ 119888 279589 230860 -129824 -24046 337187 115477 177044 -265456 103645 -43644
17566a15453A72297f2778B09923b2386A4844c4878j66728o5905C12320H5031e6365
$$ -115453 172297 -62778 209923 -22386 14844 -34878 -201606 -267511 312320 85031 -56365
17554G2246d43880D10359i1104j02995L8317N7843L873m2724A59079i0704B99548
$$ 72246 -443880 410359 -91104 -194099 -155782 -97939 -94066 -136790 159079 -90704 299548
17542A82845J13234H1795o497a17932B287P1422a08958e1037A26172a40161A20907
$$ 182845 296079 81795 75298 -117932 2287 73709 -108958 -51037 126172 -140161 120907
17530B46170o0987a57587A0676J76357g2593A30182l96A6175N7442q493A096i9936
$$ 246170 185183 -157587 10676 187033 -72593 130182 129786 16175 73617 65124 1096 -99936
17517B21612j01132b52503A16622b137C22992a3406j30414B30912j14268J61242
$$ 221612 120480 -252503 116622 -2137 322992 -13406 -143820 230912 116644 277886
17507B77886i195m2759E249J04887c07232B81152j31535Q9130J50554a51552D19552
$$ 277886 -9195 -51954 5249 110136 -307232 281152 149617 238747 389301 -151552 419552
17495a14471A2861c147B12361a16968j58712B14028b62752A05286a58296K226
$$ -114471 12861 -3147 212361 -116968 -275680 214028 -262752 105286 -158296 -156070
17485a56070I1290l4638f7090B04009a32802B8781J37327M2779C9660f4215A92608
$$ -156070 91290 56652 -67090 204009 -132802 28781 166108 208887 39660 -64215 192608
17473B11984a41988A5649K19258A05592K2160M4411l4818J8097G4699a19527G790
$$ 211984 -141988 15649 234907 105592 127752 172163 137345 155442 74699 -119527 7790
17461F076J47781n5736J99491A47236K9339G5388f2475B08962i1232R060D05183
$$ 6076 153857 98121 297612 147236 176575 75388 -62475 208962 -91232 -82172 405183
17449a0493C67979f2516H1170f6287C91925A1096a76472A55174D5444M85805G3509
$$ -10493 367979 -62516 81170 -66287 391925 11096 -176472 155174 45444 531249 73509
17437C57859B1883J625a654B65118J45647j95045K11508G2793e3855D65300A42299
$$ 357859 21883 23508 -1654 265118 410765 215720 427228 72793 -53855 465300 142299
17425B5a6503B52099d273C8096a19872n8476B16023a92785A40900M52434A04845
$$ 25 -16503 252099 -4273 38096 -119872 -178348 216023 -192785 140900 593334 104845
17413B15985J09557a46898B30301K73117B44292J04494f3757C48944a13322A29979
$$ 215985 325542 -146898 230301 503418 244292 348786 -63757 348944 -113322 129979
17402D40720q3996J4343o7419m5123r0941K218b4442E67079r6121k00931O86G8561
$$ 440720 356724 371067 303648 258525 167584 169802 -24442 567079 470958 270027 270713 78561
17389h1560j6964l2483A25656a234j2733l75588B69035a20946B1238d6685G9551
$$ -81560 -98524 -131007 125656 -1234 -13967 -389555 269035 -120946 21238 -46685 79551
17377A60209b14627C12006d2782B18751a00986B69414A32552J34809A28785C8370
$$ 160209 -214627 312006 -42782 218751 -100986 269414 132552 267361 128785 38370
17366E2071J88204a02158F1760L14111D7485Q6618J01241c1350j8738A62413Q2066
$$ 52071 240275 -102158 61760 375871 47485 134103 235344 -31350 -50088 162413 244479
17355B44479L7897P7064G5196a59966C74863q2475A45415J53223r6189d5373C00253
$$ 244479 282376 359440 75196 -159966 374863 292388 145415 298638 202449 -45373 300253
17343C07308H4988M2932m5764J01636C2698K23998E471K35668M9765q3373J40267
$$ 307308 84988 127920 82156 183792 32698 256696 5471 241139 290904 207531 347798
17332C47798E0233N1063L1818K16653B7644N6621K08834a9978M268B29911d2062
$$ 347798 50233 101296 133114 349767 27644 84265 293099 -19978 -15710 229911 -42062
17320e8082D63987j40656A39332f4182A70883Q5293f2296c591C73611A43088B6156
$$ -58082 463987 323331 139332 -64182 170883 256176 -62296 -3591 373611 143088 26156
17308D5150O6612a83414A25394K63007E4431J96132J38562i2763B20106b3917
$$ 45150 111762 -183414 125394 388401 54431 250563 389125 -92763 220106 -23917
17297A18692a18503A54169l1817m1449M0349J30576L30080a40652C90880d1705
$$ 118692 -118503 154169 122352 80903 121252 251828 581908 -140652 390880 -41705
17286a8250B30994j05867P7787o8640K7414h3064A04425l2976R4407O2134j3130
$$ -18250 230994 125127 202914 134274 161688 -83064 104425 71449 165856 227990 214860
17275B14860D1119i7125G151K70399g480A39986n6987J52232A16428J30500r5634
$$ 214860 41119 -97125 7151 277550 -7480 139986 82999 235231 116428 246928 151294
17264A51294C1985L05236A64760K6668R5139I5332a98057C50990k8134j25476
$$ 151294 31985 337221 164760 191428 286567 95332 -198057 350990 322856 197380
17254A97380e9360r2101A80506L302P7208I2591M6284B1778i0926A09900a4646
$$ 197380 -59360 -151461 180506 183808 261016 92591 138875 21778 -90926 109900 -14646
17242F0833K02879J62048j36349c8495a7613D4266d6353A47110D8591J82503b1723
$$ 60833 263712 425760 289411 -38495 -17613 44266 -46353 147110 48591 231094 -21723
17230A24769b7873j44410C05398q667J90877j46520A16266L2544K9269e9582B92757
$$ 124769 -27873 -172283 305398 296731 487608 341088 116266 148810 178079 -59582 292757
17218F5053K99588k9205h3109D57046j89796J52357G4354A4996K74668p8913C4868
$$ 65053 364641 335436 -83109 457046 267250 419607 74354 14996 289664 210751 34868
17206A1818J42645o8380C5921N7433P3660H1292L8317Q286J74559K6628h8834
$$ 11818 154463 86083 35921 93354 167014 81292 119609 127895 302454 329082 -88834
17194C5780Q4643c14803C48624a58083D06287A83324J66789j54775N0488F7782
$$ 35780 120423 -314803 348624 -158083 406287 183324 350113 195338 245826 67782
17183a04159B31415N9930b0541A15712K31538A39290J08936n9074D1085K10041
$$ -104159 231415 291345 -20541 115712 347250 139290 248226 189152 41085 251126
17173B51126R4009d1788D37285A24061K38087G7585K49180I4391f3962C29772
$$ 251126 345135 -41788 437285 124061 362148 77585 326765 94391 -63962 329772
17162A00020J88913j8175q4448O4798q995J22229O8704f4673A51089J34465K4098
$$ 100020 288933 270758 186310 251108 242113 364342 433046 -64673 151089 285554 309652
17151C09652E5711j5885L43111j29418q1602M2335E6480J91187K35725g750B00509
$$ 309652 55711 39826 382937 253519 171917 214252 56480 247667 483392 -7750 200509
17139B89522H7861J38871F6258J83578O0981L5288L445N4524p9442d4421B09471
$$ 289522 87861 226732 66258 249836 310817 346105 349550 404074 324632 -44421 209471
17127D88559F5148J57880j5433J20724R8659f359B82146k187l9994a69150B19693
$$ 488559 65148 223028 207595 328319 426978 -6359 282146 279959 239965 -169150 219693
17115C93722A59621K92571k05008l9322J44357B6469K20557K85113a9132E5726
$$ 393722 159621 452192 247184 207862 352219 26469 247026 532139 -19132 55726
17104B51438K51519j08834j30000j04820m819J9789m7114L09059B10076B8974
$$ 251438 502957 394123 264123 159303 154484 174273 127159 436218 210076 28974
17093I4279J65506c591D04237J83584J76179C11159m8136J80440C5726K03591
$$ 94279 259785 -3591 404237 587821 764000 311159 263023 443463 35726 239317
17083B39317J33146I7052K63563j14815R1509R7216k10552E6083L55014j0360
$$ 239317 372463 97052 360615 245800 337309 434525 223973 56083 411097 400737
17073D00737m6243K11447j33213j48848N1302K16111F5381J10722J50336j02126
$$ 400737 354494 565941 432728 283880 335182 551293 65381 176103 326439 224313
17063B24313J80579J78619B25815a609D52478m993r861n2592D7646L75530j78682
$$ 224313 404892 583511 225815 -1609 452478 447485 437624 385032 47646 423176 244494
17052B44494K11778j85985J7781I4726K71087j32423J63857J55124o8187p67F4654
$$ 244494 456272 270287 288068 94726 365813 233390 397247 552371 484184 483417 64654
17040F00220j75813O0164j53250J7930j2273K93878M1010L9780B26882N56678
$$ 600220 424407 484571 331321 349251 336978 630856 671866 711646 226882 783560
17030G83560j40387B72744L33054Q2656B74918K6361L15936k37273M7528l0644
$$ 783560 643173 272744 605798 688454 274918 301279 617215 379942 427470 396826
17020C96826J26442R140B26788J45371M0925K44553n8107k3659B66776K13345
$$ 396826 523268 532408 226788 372159 413084 657637 599530 575871 266776 480121
17010D80121A79592L72751o8315j25155L47552j71437K3459j90674K93845n640
$$ 480121 179592 552343 484028 358873 706425 534988 558447 367773 661618 655978
17000F55978K99383k10954l29037K34474j89893J85543K39826k04711k3334j25938
$$ 655978 955361 744407 415370 649844 459951 645494 885320 680609 657275 531337
16990E31337J41769j42482R4935k60443J00258K88515N0151C08985M67056l58818
$$ 531337 673106 530624 625559 365116 465374 753889 804040 308985 776041 417223
16980D17223q4115J79636L7374M66544k56595J24215m11090L97718m05147N56021
$$ 417223 333108 512744 550118 1016662 760067 884282 473192 870910 465763 1021784
16970A021784l95582M0652M31139l25092k01124K80415l24020O6527L24309k95790
$$ 1021784 626202 666854 1097993 772901 571777 852192 528172 594699 919008 623218
16960F23218n3176M66427l32763J4941n4974k28448L48947j85892j15776K19902
$$ 623218 570042 1036469 703706 718647 663673 435225 784172 598280 482504 702406
16950G02406o702O5129j17472L979L35313j61020J52793j15309k41554Q842l4511
$$ 702406 695704 760833 643361 647340 982653 821633 974426 859117 617563 626405 591894
16939E91894J35096m1344L49357l81149J49323J62238m25183L58655j22040J10410
$$ 591894 726990 685646 1035003 653854 803177 965415 540232 898887 776847 887257
16929H87257M3841j47020J69985j96264L6220L3892L11902k98427N7934Q9205
$$ 887257 931098 784078 954063 757799 794019 827911 1139813 841386 899320 988525
16919I88525K52709k90424J49341J63539l29677O1508J17892j66079m6704M16536
$$ 988525 1241234 950810 1100151 1263690 934013 995521 1113413 947334 900630 1317166
16909A317166m5052j87513J32754m7224P2991m6533r9836J46454K18571j12793
$$ 1317166 1272114 1084601 1217355 1170131 1243122 1196589 1096753 1243207 1461778 1348985
16899A348985k94414K99739j81130J11476j45835M24106l86694j675J54893k34781
$$ 1348985 1054571 1354310 1173180 1284656 1138821 1562927 1176233 1174558 1329451 1094670
16889A094670N2748K41920l9740R8157K64134j56382k95045L26464n8452j49373
$$ 1094670 1147418 1389338 1349598 1447755 1711889 1555507 1260462 1586926 1528474 1379101
16879A379101K72581K2806j46521J91272q3114j41893j03408j39600L33112L64918
$$ 1379101 1651682 1674488 1527967 1719239 1636125 1494232 1390824 1251224 1584336 1949254
16869A949254o56022O62106p6750l49079J88598J1909J03761J5111o106j66122
$$ 1949254 1293232 1955338 1878588 1529509 1718107 1730016 1833777 1848888 1842782 1676660
16859A676660J18284M02625l18070n8608J33320K96433j37499m7524N06553k31675
$$ 1676660 1794944 2197569 1879499 1820891 1954211 2250644 2113145 2065621 2572174 2340499
16849B340499R0617l71955L67492P727j74192j1792j42213N08576j97644k3027
$$ 2340499 2431116 2059161 2426653 2434380 2260188 2248396 2106183 2614759 2417115 2394088
16839B394088L53049j65758m8721j50879L28694K39599l17426K74967m57083M95040
$$ 2394088 2747137 2581379 2532658 2381779 2710473 2950072 2632646 2907613 2450530 2945570
16829B945570j9685O7777K21370j52764l48733L76525k08559J76265J55175K94663
$$ 2945570 2925885 2993662 3215032 3062268 2713535 3090060 2881501 3057766 3212941 3507604
16819C507604r7892R4563Q1652K912l12731M38114L60117L3595m94936O1235L67807
$$ 3507604 3409712 3504275 3585927 3588839 3276108 3714222 4074339 4107934 3612998 3674233 4042040
16808D042040M7338L88021k79508K24532j42770L23878O6558J28727p0386R8503
$$ 4042040 4089378 4477399 4197891 4422423 4279653 4603531 4670089 4798816 4728430 4826933
16798D826933j23623K30228J75565Q9244O0009J15000J64933r7759J58256J71169
$$ 4826933 4703310 4933538 5109103 5198347 5258356 5373356 5538289 5440530 5598786 5769955
16788E769955K31885O22192m28899K11142J89407L79472m04965L98714M78061
$$ 5769955 6001840 6624032 6195133 6406275 6595682 6975154 6570189 6968903 7446964
16779G446964J83688K25139N4891K15843K65487L5542L56603K88096J66937M9482
$$ 7446964 7630652 7855791 7910682 8126525 8392012 8427554 8784157 9072253 9239190 9288672
16769I288672K60931N62899j77607P21467K04903P77302J69021J10311O68979
$$ 9288672 9549603 10112502 9934895 10656362 10861265 11638567 11807588 11917899 12586878
16760A2586878M67215N4839N12881N70358K34258P68334J61051R32524M61720
$$ 12586878 13054093 13108932 13621813 14192171 14426429 15194763 15355814 16288338 16750058
16751A6750058M23777Q85352P18952P67184N85844P82064J260208J169691O35025
$$ 16750058 17173835 18059187 18778139 19545323 20131167 20913231 22173439 23343130 23978155
16742B3978155J137189J163176J536145J105473J362851J776227J349049K379422
$$ 23978155 25115344 26278520 27814665 28920138 30282989 32059216 33408265 35787687
16734C5787687J303285K195541K398663K154970K523541K885692K833080L166637
$$ 35787687 37090972 39286513 41685176 43840146 46363687 49249379 52082459 55249096
16726E5249096L685607L948500L745761M769134M909251N173580N408713O138848
$$ 55249096 58934703 62883203 66628964 71398098 76307349 81480929 86889642 93028490
16718I3028490O360409O832305P490993Q079283Q294863Q576318Q947003R297509
$$ 93028490 99388899 106221204 113712197 121791480 130086343 138662661 147609664 156907173
16710A56907173R188028Q872729Q854327Q083856O647281N944310N044020K559584
$$ 156907173 166095201 174967930 183822257 191906113 198553394 204497704 209541724 212101308
16702B12101308J236257m96268k644444m386552n245435p050887p791691q800910
$$ 212101308 213337565 212841297 210196853 205810301 200564866 193513979 185722288 176921378
16694A76921378r222626r347367q942464r204007r315340q007864q427558p517392
$$ 176921378 167698752 158351385 149408921 140204914 130889574 122881710 114454152 106936760
16686A06936760p123884o634040o241360n941919n199717n109412m745502m049333
$$ 106936760 99812876 93178836 86937476 80995557 75795840 70686428 65940926 61891593
16678F1891593m101326l575870l123825l493790k457511l015781k028151k216852
$$ 61891593 57790267 54214397 51090572 47596782 45139271 42123490 40095339 37878487
16670C7878487k170283k059606j564689j437070j775688j564312j644589r51039
$$ 37878487 35708204 33648598 32083909 30646839 28871151 27306839 25662250 24711211
16662B4711211p04000j298061j192131p98712q70004j219695o53239o97721n31839
$$ 24711211 24007211 22709150 21517019 20718307 19848303 18628608 17975369 17277648 16745809
16653A6745809o42321q03100m24506p57619n9904q60293o47902k4003o46793m37082
$$ 16745809 16103488 15300388 14875882 14118263 14058359 13198066 12550164 12526161 11879368 11442286
16643A1442286m35803m18301l76627k01014n03699l21255q9771j43146k98478
$$ 11442286 11006483 10588182 10211555 10010541 9506842 9185587 9095816 8952670 8654192
16634H654192k79465l22203j83975j50201n55653K02947R5996o97717j52525k10370
$$ 8654192 8374727 8052524 7868549 7718348 7162695 7365642 7461638 6763921 6611396 6401026
16624F401026l40924J27436l01663j28783j66917k63964L76836l84832m01671
$$ 6401026 6060102 6187538 5885875 5757092 5590175 5326211 5703047 5318215 4916544
16615D916544J70314k7002j12218j02791m36469k20866q4467O8526L5735j78041
$$ 4916544 5086858 5059856 4947638 4844847 4408378 4187512 4103045 4171571 4207306 4029265
16605D029265k74046j34293L1327K51902n87967J83784o4647m30432j04188L16130
$$ 4029265 3755219 3620926 3652253 3904155 3316188 3499972 3435325 3004893 2900705 3216835
16595C216835J73658l56600N9093j25022J80762j09453N2048l50158j34645R9430
$$ 3216835 3390493 3033893 3092986 2967964 3148726 3039273 3091321 2741163 2606518 2705948
16585B705948j56924o265N7947R3805n00947O3467p305J78876k53372L84317m32902
$$ 2705948 2549024 2542759 2600706 2694511 2193564 2257031 2249726 2428602 2175230 2559547 2126645
16574B126645n170P5378K0994R9696k35324k60820J39408K613k69339p6869L44749
$$ 2126645 2121475 2196853 2217847 2317543 2082219 1821399 1960807 1963420 1694081 1617212 1961961
16563A961961l47924o3980O9506M269J25206K4076l17111L30911j39086J57237
$$ 1961961 1614037 1550057 1619563 1623832 1749038 1773114 1456003 1786914 1647828 1805065
16553A805065k96978j0215k22554Q7379r1106K96521K3770k44764K1147K56482
$$ 1805065 1508087 1497872 1275318 1362697 1271591 1568112 1591882 1347118 1368265 1624747
16543A624747k46721r0862R4637m04781M06374l68984J31090l24352L94992j58640
$$ 1624747 1378026 1287164 1381801 977020 1383394 1014410 1145500 821148 1216140 1057500
16533A057500R0572J23810m43742L53135L5382k38300R2357k30009L29228K7470
$$ 1057500 1148072 1271882 828140 1181275 1216657 978357 1070714 840705 1169933 1197403
16523A197403k09682k72126M18337l5061m34880M70828l99522K74490j7278O319
$$ 1197403 987721 715595 1133932 1098871 663991 1134819 735297 1009787 992509 998828
16513I98828M2802m02549m403J52409j33219q8869L35129l62978K17664N0485
$$ 998828 1041630 639081 634678 787087 653868 564999 900128 537150 754814 805299
16503H05299r6059J81055J0630J12894B92220K96414J10419j0221q5266M3113
$$ 805299 709240 890295 900925 1013819 292220 588634 699053 688832 603566 646679
16493F46679R8048o854K16389D30164K62865R5545B12726M31766k00831L2879
$$ 646679 744727 737873 954262 430164 693029 788574 212726 644492 443661 476540
16483D76540j87888K23214m88j02308l3100M7880J53474K9658k79849J93365j26549
$$ 476540 288652 511866 511378 409070 375970 423850 577324 606982 327133 520498 393949
16472C93949L3441P90J41824R6600A93095M39393M8699l18511J05705R0371k42473
$$ 393949 427390 428180 570004 666604 193095 632488 681187 362676 468381 558752 316279
16461C16279J95085J03295B49306J93130j49348L07367B14122N7593J28758j01873
$$ 316279 511364 614659 249306 442436 293088 600455 214122 271715 400473 298600
16451B98600J40913n1892J88294j05309k6504J80318C11778j12118L16109k54337
$$ 298600 439513 387621 575915 470606 444102 624420 311778 199660 515769 261432
16441B61432O2254K14957j3085l9370n560L49202A48687N182K32812o7658m028
$$ 261432 323686 538643 525558 486188 480628 829830 148687 153869 386681 319023 314995
16430C14995O0202A21507K68357J0264j7599J58569m7557j72644K74071k52052
$$ 314995 375197 121507 389864 400128 382529 541098 493541 320897 594968 342916
16420C42916K44856o5146I8954J58903p8208P4157k7482k1628K53288K1607A50681
$$ 342916 587772 522626 98954 257857 179649 253806 226324 204696 457984 479591 150681
16408C61257O788j52003K34904A34970P1154C2689J41966P9902M31611B86248
$$ 361257 368045 216042 450946 134970 206124 32689 174655 254557 686168 286248
16397A73419M10269B03430K31058c50223D7292L23693k6926J89468B61316C2505
$$ 173419 583688 203430 434488 -350223 47292 370985 344059 533527 261316 32505
16386A90461D5487J04740M79433k96579j30856n6543h3657C6011J30338J12588
$$ 190461 45487 150227 629660 333081 202225 145682 -83657 36011 166349 278937
16376B78937I9189L8489K03412C2647L01461I6853K06615j10824K01589j30571
$$ 278937 99189 137678 341090 32647 334108 96853 303468 192644 394233 263662
16366B63662j30372J26316I0917J46123p7792R8339A05658K57496G0369M8357
$$ 263662 133290 259606 90917 237040 159248 257587 105658 363154 70369 118726
16356A18726K18978A082N871K14640G6059J54204E0348H118b59356E1062R9797
$$ 118726 337704 1082 6953 221593 76059 230263 50348 8118 -259356 51062 150859
16345A50859D5535g8410A53135K62784j84437J27741F764e3341m2950B1714M05688
$$ 150859 45535 -78410 153135 415919 231482 359223 6764 -53341 -96291 21714 427402
16334D27402o9097A17894J02138k9657b01112B50134n5608h6855l87197A74284
$$ 427402 358305 117894 220032 190375 -201112 250134 194526 -86855 -474052 174284
16323B99908j22246P4412r2429b3255B22526J55830j20330a34758A04140l9383
$$ 299908 177662 252074 159645 -23255 222526 378356 258026 -134758 104140 64757
16313F4757a67167A36152d1613C20430p1872G4239b93586B13062c7600k3414F5127
$$ 64757 -167167 136152 -41613 320430 248558 74239 -293586 213062 -37600 -61014 65127
16301A16045k6907a04189A02166b1853a0282D5797e6285b4773L779A65177K60929
$$ 116045 89138 -104189 102166 -21853 -10282 45797 -56285 -24773 -20994 165177 426106
16290D26106A71054a30806C57419C8309c8303B86953b0682m3524j05731B09547
$$ 426106 171054 -130806 357419 38309 -38303 286953 -20682 -64206 -169937 209547
16279C25579A50313C9610J18130F757J9745J02171k7951K92273a98649d1053j12885
$$ 325579 150313 39610 157740 6757 26502 128673 100722 392995 -198649 -41053 -153938
16268a53938b4256B43849r8808d6553j42984F9340K8798M1972N4607A2501a331
$$ -153938 -24256 243849 145041 -46553 -189537 69340 98138 140110 194717 12501 -1331
16256a67545A10576a08531A12387i6201I2825g9326A25626K13283J5517H2813
$$ -167545 110576 -108531 112387 -96201 92825 -79326 125626 338909 354426 82813
16245F634Q7755J21956d1340F0112R9157D5469a45453D24193a41887j96036F0334
$$ 6634 94389 216345 -41340 60112 159269 45469 -145453 424193 -141887 -337923 60334
16233h2048B86190E258M8404j535K90644e6436A1090M25321C6403c667j59110
$$ -82048 286190 5258 53662 52127 342771 -56436 11090 436411 36403 -3667 -162777
16222a62777D5902a24160a1140j97142C77215i0507a4382m5922r1195K7403C33629
$$ -162777 45902 -124160 -11140 -208282 377215 -90507 -14382 -60304 -151499 -124096 333629
16210F5866j5553g495k0474i760A33923i0232A24191a24490B36005p6609a61461
$$ 65866 50313 -7495 -27969 -9760 133923 -90232 124191 -124490 236005 159396 -161461
16198C84638C5628g5425B82867h6386r1403Q1571q6918L3658b7539A87291c85208
$$ 384638 35628 -75425 282867 -86386 -177789 -96218 -183136 -149478 -27539 187291 -385208
16186h2801c7810o3570B7131c03080B78507I7134l1429J23240J43057H8617L1380
$$ -82801 -37810 -101380 27131 -303080 278507 97134 65705 188945 332002 88617 119997
16175A19997a12078k07095B53318K9246E769g4659A27608I888J55455C9763K3770
$$ 119997 -112078 -319173 253318 282564 5769 -74659 127608 9888 165343 39763 63533
16164F3533A6926R4954E1279f985A69224D8963K4426c48470A93196b3208G2927
$$ 63533 16926 111880 51279 -6985 169224 48963 73389 -348470 193196 -23208 72927
16152c14289B21186c15457i5633F9019a81054P8247j06792J1049n8435J25501
$$ -314289 221186 -315457 -95633 69019 -181054 -102807 -209599 -198550 -256985 -131484
16142a31484M1621j12854A59203a23928B9220J4745e7025m2716A3666a23897J8961
$$ -131484 -89863 -202717 159203 -123928 29220 43965 -57025 -99741 13666 -123897 -104936
16131a04936b3472G9717a87474B57193J76579I9211a65062A09646a1966B30762
$$ -104936 -23472 79717 -187474 257193 433772 99211 -165062 109646 -11966 230762
16120b55794o071d080r3688C0808d94775A16111a62221G8369g7965A89537A8230
$$ -255794 -261865 -4080 -97768 30808 -494775 116111 -162221 78369 -77965 189537 18230
16108C83650D9656h259D4496a71745k71874C2555j5721a37598d5284j06206j86653
$$ 383650 49656 -8259 44496 -171745 -443619 32555 16834 -137598 -45284 -151490 -338143
16097c38143E3771J61144p8180d8761B43245b12556h21A31732B6430c8008B21843
$$ -338143 53771 214915 136735 -48761 243245 -212556 -821 131732 26430 -38008 221843
16085g9037B32991L82a71848f5031b4143N224A28790b94543a38033B9840O3634
$$ -79037 232991 233373 -171848 -65031 -24143 -18919 128790 -294543 -138033 29840 93474
16074I3474c59611J25404D8357h1220a0847B1017q322a00436j41807c5055k64066
$$ 93474 -359611 -234207 48357 -81220 -10847 21017 12695 -100436 -242243 -35055 -299121
16063b99121a19877l0648j84447A3792b56317a26902C042b76042O0401A62234
$$ -299121 -119877 -150525 -334972 13792 -256317 -126902 3042 -276042 -215641 162234
16052A14856b48200B06164a6343A551a16882q2298C7384P9859K1008J01806d26989
$$ 114856 -248200 206164 -16343 1551 -116882 -199180 37384 117243 138251 240057 -426989
16040A88679A1144d2559J9520A56050n6558K1762a70385K9340A44231e0661E8585
$$ 188679 11144 -42559 -23039 156050 99492 121254 -170385 -141045 144231 -50661 58585
16028A09982A6913d8719A17186a6938B28813e0117K240A91032g6830J5593Q726
$$ 109982 16913 -48719 117186 -16938 228813 -50117 -47877 191032 -76830 -61237 -52511
16017e2511A03180h4459B1531e9638j18281A8641K04617F8682a2133B13792a13972
$$ -52511 103180 -84459 21531 -59638 -177919 18641 223258 68682 -12133 213792 -113972
16005a04571B24862a69527N2192n12886a68861B9231g6925r20J5525h135G9110
$$ -104571 224862 -169527 -117335 -630221 -168861 29231 -76925 -77845 -62320 -8135 79110
15993A25513M0797d41249a39524A7606b16351K0661c2109k1217L263C1471B120
$$ 125513 166310 -441249 -139524 17606 -216351 -195690 -32109 -53326 -50063 31471 2120
15981D70P4267k9922c66734J66105f322m76409K25721M2844O5574d2930m0964
$$ 470 74737 44815 -366734 -200629 -6322 -482731 -257010 -214166 -148592 -42930 -83894
15970h3894C9076a81557C21671J95300A48428K59960A57219m8852B427O7838a56120
$$ -83894 39076 -181557 321671 516971 148428 408388 157219 108367 2427 70265 -156120
15958g4187A11459a68117K4490A65109A1776b5411k93876A82019p4344i4155B23924
$$ -74187 111459 -168117 -143627 165109 11776 -25411 -319287 182019 107675 -94155 223924
15946A7539e16054A20487C7828c46312F7357d52233b23174r0438B37486B5508
$$ 17539 -516054 120487 37828 -346312 67357 -452233 -223174 -313612 237486 25508
15935A67337i8491A84617a18037N7068A08284a47653m853A55559m7158g8199D2796
$$ 167337 -98491 184617 -118037 -60969 108284 -147653 -152506 155559 108401 -78199 42796
15923G0984b33786g403j46087f1754B16658n982H1905a99195h821H1384b21783
$$ 70984 -233786 -7403 -153490 -61754 216658 210676 81905 -199195 -8821 81384 -221783
15911a17097d9232I7959D3123a02406j16491f3736j18932L7386r470C2073h8779
$$ -117097 -49232 97959 43123 -102406 -218897 -63736 -182668 -145282 -154752 32073 -88779
15899a09811j52B51260b9178q7377m2882B42781l767a5386j55367H8598M236e2361
$$ -109811 -109963 251260 -29178 -116555 -159437 242781 239014 -15386 -170753 88598 92834 -52361
15886B75741e2280A84239R9345A3552b74704A90919a09324L0962k4013D13P2682
$$ 275741 -52280 184239 283584 13552 -274704 190919 -109324 -78362 -102375 413 73095
15875G3095i4137A5213R10a05944a7465G16P1604a5208j84923G3361K26399d7103
$$ 73095 -94137 15213 16123 -105944 -17465 716 72320 -15208 -200131 73361 299760 -47103
15862b62810A86651i4895D4173N9263a61823F988a60728d6972F6709h1525B10803
$$ -262810 186651 -94895 44173 103436 -161823 6988 -160728 -46972 66709 -81525 210803
15850A28268a50590e3474A92717a05872q4566h3046B6058b4412o3254E9019i7327
$$ 128268 -150590 -53474 192717 -105872 -190438 -83046 26058 -24412 -87666 59019 -97327
15838A5001J67135E8381c7536C1699h2106e641k43989e4060j23555A59114a07390
$$ 15001 182136 58381 -37536 31699 -82106 -5641 -249630 -54060 -177615 159114 -107390
15826C00627j23974a16551M4030j28759F1824K00496A1296J67318a69003o2508
$$ 300627 176653 -116551 -72521 -201280 61824 262320 11296 178614 -169003 -231511
15816b31511h7408j59017H5713e1915k21807f2457r6504d8333k21o1454j50375
$$ -231511 -87408 -246425 85713 -51915 -273722 -62457 -158961 -48333 -48554 -110008 -260383
15805b60383R597A27053j3237p775a66520o6652A76670b06908A37476a30518k76124
$$ -260383 -250786 127053 113816 106041 -166520 -233172 176670 -206908 137476 -130518 -406642
15794d06642e2423F0246a09392C02331d2499l92896F981K51029A03170R6854q5103
$$ -406642 -52423 60246 -109392 302331 -42499 -435395 6981 258010 103170 200024 114921
15783A14921a63184D833J07896A2669P8213J17067g6257b3403l33642C9869K23294
$$ 114921 -163184 4833 112729 12669 90882 207949 -76257 -23403 -357045 39869 263163
15772B63163E5365a79016I693a08792j89008i5668A00773a81332k6475P7357j59192
$$ 263163 55365 -179016 9693 -108792 -297800 -95668 100773 -181332 -207807 -130450 -289642
15761b89642O6941A51147k4006K44404a06846r2440F8856b3846i482C6463f3545
$$ -289642 -222701 151147 127141 371545 -106846 -199286 68856 -23846 -9482 36463 -63545
15749A47837L5854c30334a55817B97741A00113D2437b42929a7825H5848K14249
$$ 147837 183691 -330334 -155817 297741 100113 42437 -242929 -17825 85848 300097
15739C00097D7760J32944c2567B0543O7465K10736j32420M4402i26D49053d04870
$$ 300097 47760 180704 -32567 20543 88008 298744 166324 210726 -926 449053 -404870
15727b32983B56055a94011B76959B6621a09204F034a90723j89045b5066p1606
$$ -232983 256055 -194011 276959 26621 -109204 6034 -190723 -379768 -25066 -96672
15717i6672L9845m9929c0918j74191P7560A26451a15500q5549k7046O427P6608
$$ -96672 -56827 -106756 -30918 -205109 -127549 126451 -115500 -201049 -228095 -221668 -145060
15706a45060d2162j93286i3592m2704A49269i4423l6385N0983q3838G3464N1997
$$ -145060 -42162 -235448 -93592 -136296 149269 -94423 -130808 -79825 -163663 73464 125461
15695A25461d1103A3716E283a13322A08280J850k6747C7354d24121K11810A61328
$$ 125461 -41103 13716 5283 -113322 108280 110130 83383 37354 -424121 -212311 161328
15683A64434E6005J15763a20473E0862b15050a5315A62572L7587D5670q02g0155
$$ 164434 56005 171768 -120473 50862 -215050 -15315 162572 200159 45670 44868 -70155
15671C3863J72520g554A2262K93150a94190h886C4013a64978B36136b2439A15448
$$ 33863 206383 -7554 12262 305412 -194190 -8886 34013 -164978 236136 -22439 115448
15659e5200B22314D6877N8157a009j30833a2604j49510A87522a40259G8671C9130
$$ -55200 222314 46877 105034 -1009 -131842 -12604 -162114 187522 -140259 78671 39130
15647A46469e0425l2889k54689N0722A63647b37667j01865c8743G8902b50812
$$ 146469 -50425 -83314 -338003 -287281 163647 -237667 -339532 -38743 78902 -250812
15636I166a03033A0569h4475n0398m4352D10824A45391a6399j22151C318e3815
$$ 9166 -103033 10569 -84475 -134873 -179225 410824 145391 -16399 -138550 3318 -53815
15624D3025M26302B1698R2262c67470Q6886d9027l08521G4078d25941a61850M4784
$$ 43025 469327 21698 113960 -367470 -280584 -49027 -357548 74078 -425941 -161850 -117066
15613a17066C7515J31344b29431m349a3932B61013i3501L3810q3530B49152A00506
$$ -117066 37515 168859 -229431 -233780 -13932 261013 -93501 -59691 -143221 249152 100506
15601d7248C14578J30985j73568D4922D29g6121q7908a6160k5717j78711h0772
$$ -47248 314578 445563 271995 44922 429 -76121 -164029 -16160 -41877 -220588 -80772
15589i465m80746a88283D0855i4495C09115g0251I7231a09556j1886b548k7776
$$ -9465 -490211 -188283 40855 -94495 309115 -70251 97231 -109556 -121442 -2548 -30324
15578c0324l8E0998b78871A68310J5956c66111a07642B39932a1271B33505R067
$$ -30324 -30362 50998 -278871 168310 184266 -366111 -107642 239932 -11271 233505 242572
15567B42572a0352B05321a16224B5257a61203A76447k7167a55032A54197B9218
$$ 242572 -10352 205321 -116224 25257 -161203 176447 149280 -155032 154197 29218
15556h5981j35733K1266A75270M2350A4555a20651L5223J6226j51468A509a33152
$$ -85981 -221714 -200448 175270 217620 14555 -120651 -85428 -69202 -220670 1509 -133152
15544B04734F0172c39382a11004k36728C64354A5572a69834B21253P1448b18528
$$ 204734 60172 -339382 -111004 -347732 364354 15572 -169834 221253 292701 -218528
15533A0337a47782F8927R0582g064k17837E5054b25331b8964G1396a1051A08244
$$ 10337 -147782 68927 159509 -7064 -224901 55054 -225331 -28964 71396 -11051 108244
15521B05305h0443A4044d7206k32709e6234j39472G4006J1375e1259k08912E4971
$$ 205305 -80443 14044 -47206 -279915 -56234 -195706 74006 85381 -51259 -260171 54971
15509b41014N3282j56031A9380b07498A6693K5851e7751j0997A87645a47798E3978
$$ -241014 -187732 -343763 19380 -207498 16693 42544 -57751 -68748 187645 -147798 53978
15497A19585i2012I2350a38054B75985a13970A44312b8046k25073a1161l67048
$$ 119585 -92012 92350 -138054 275985 -113970 144312 -28046 -253119 -11161 -378209
15487c78209I2276a48732R708B5937c93715A37596n7779a84218i0111H3818h6836
$$ -378209 92276 -148732 -139024 25937 -393715 137596 79817 -184218 -90111 83818 -86836
15475B55574b4258H987a96140e9702B41067a11871G0936d2972j48523a2868B71106
$$ 255574 -24258 8987 -196140 -59702 241067 -111871 70936 -42972 -191495 -12868 271106
15463B0245b13103m6758A39691e4928j39796d9879n5861A18064L5587E0243A3984
$$ 20245 -213103 -259861 139691 -54928 -194724 -49879 -105740 118064 153651 50243 13984
15451A2340J92996b61166f7836C8517K9829Q0663a65421A12738a05323G9457b62010
$$ 12340 205336 -261166 -67836 38517 68346 149009 -165421 112738 -105323 79457 -262010
15439D08869B5331a22301j49004i8725l3453M6244C966f8636l57512F0419G141
$$ 408869 25331 -122301 -271305 -98725 -132178 -85934 3966 -68636 -426148 60419 7141
15427e3490G0181j3175c38589A32328B2946K2888a92241Q1347P106A10903L31813
$$ -53490 70181 57006 -338589 132328 22946 45834 -192241 -110894 -103788 110903 442716
15416D42716j99719p5758a39688B16096a64574A43589a01078A92623f7704g261
$$ 442716 242997 167239 -139688 216096 -164574 143589 -101078 192623 -67704 -7261
15405a60943d5002j14240m4328j28289A28081a57864B72877f6841A86850c8111
$$ -160943 -45002 -159242 -203570 -331859 128081 -157864 272877 -66841 186850 -38111
15394B3220g6327e124k27796c4123F7639k0268c6939A64169c59064A20050a0005
$$ 23220 -76327 -5124 -232920 -34123 67639 47371 -36939 164169 -359064 120050 -10005
15382e9119q0235O8971A6879J71346f7768j94439Q3446L1602g0772p6016j64566
$$ -59119 -139354 -70383 16879 188225 -67768 -262207 -178761 -147159 -70772 -146788 -311354
15371c11354A29338J30819p7250i952G9332K92949p4342a06344D9495e5435B11581
$$ -311354 129338 260157 182907 -9952 79332 372281 297939 -106344 49495 -55435 211581
15359F3117J42557a34775A81947a4569C0879J04954a85540A57534b0568f430G8001
$$ 63117 205674 -134775 181947 -14569 30879 135833 -185540 157534 -20568 -6430 78001
15347i1604G2480g0646m18136B44838a7959j44961c4402a6826q9991A22451a36870
$$ -91604 72480 -70646 -488782 244838 -17959 -162920 -34402 -16826 -106817 122451 -136870
15335B55221b4441k33561E7291a51723M5264A37881b616p3115a0442B82068A38746
$$ 255221 -24441 -258002 57291 -151723 -106459 137881 -2616 -75731 -10442 282068 138746
15323g8065r2201A09791J37761i7818H5795A3030J57260B0275c80830A43335a18336
$$ -78065 -170266 109791 247552 -97818 85795 13030 170290 20275 -380830 143335 -118336
15311A36420a68178O3562e1391B11071L00460A26324B1077b37750D47515E6150
$$ 136420 -168178 -104616 -51391 211071 511531 126324 21077 -237750 447515 56150
15300C9716J25992c9988Q35A98365a13009B31718G1154J74254a38856j86497a12692
$$ 39716 165708 -39988 -39153 198365 -113009 231718 71154 245408 -138856 -325353 -112692
15288g688B03979P9103H4707c38872c4730k31781g1911A24408n6214d5003a2718
$$ -7688 203979 283082 84707 -338872 -34730 -266511 -71911 124408 68194 -45003 -12718
15276E20117e5455m2531a3753j36679k221B6759K31092c9202m514B18995H664
$$ 520117 -55455 -97986 -13753 -150432 -152653 26759 257851 -39202 -43716 218995 8664
15264a89297D1855m846J32099J42289a09699j05866j4806A39438J44963a74172
$$ -189297 41855 37009 169108 311397 -109699 -215565 -230371 139438 284401 -174172
15253B88481A24500e9125j55420E3422L49498d9514k8414k5662E4987c15269A4438
$$ 288481 124500 -59125 -214545 53422 402920 -49514 -77928 -103590 54987 -315269 14438
15241A64437J94048a08783M6570l8944C01361J23430J84577J41557M05228P5884
$$ 164437 358485 -108783 -62213 -101157 301361 424791 609368 750925 1156153 1232037
15231A232037k05676J00437l86546C23201k564a14597B72886b8140J2897q6995
$$ 1232037 1026361 1126798 740252 323201 320637 -114597 272886 -28140 -15243 -102238
15221a02238j03313c930j78915g8478F4226h1488l6753B25279r7831J26138d8692
$$ -102238 -205551 -3930 -182845 -78478 64226 -81488 -118241 225279 127448 253586 -48692
15209D2439R5759O8891P2570b3588A76047L2569f7757p3330d8910A34393B4383
$$ 42439 138198 207089 279659 -23588 176047 208616 -67757 -141087 -48910 134393 24383
15197H5480f9083C05557A50468g8242B3711b65943i4291J3612p1366O8213k40279
$$ 85480 -69083 305557 150468 -78242 23711 -265943 -94291 -80679 -152045 -83832 -324111
15186c24111I2094P6590D9633R3262F6150f3416C88141D044h2085G3278a47456
$$ -324111 92094 168684 49633 142895 66150 -63416 388141 4044 -82085 73278 -147456
15174c9669B55376c45588B20009I013b08967J8299B84441M1512P538j42790f4951
$$ -39669 255376 -345588 220009 9013 -208967 -190668 284441 325953 333491 190701 -64951
15162c02044h4654B84501d33A29484Q9627j4195a88022N5855D7500L527K47016
$$ -302044 -84654 284501 -433 129484 219111 204916 -188022 -132167 47500 51027 298043
15151B98043b96939c3490A27506P4255a8504C02350K7320a89011D25434I2564
$$ 298043 -296939 -33490 127506 201761 -18504 302350 329670 -189011 425434 92564
15140A9848J82951J15992A892J57143a70970A51983k3555J71950j3040j27457
$$ 19848 202799 318791 1892 159035 -170970 151983 128428 300378 287338 159881
15130A59881m8325A6239M4774k2391J07687k1801g0112B10387h7559F3361L4837
$$ 159881 111556 16239 61013 38622 146309 124508 -70112 210387 -87559 63361 98198
15119I8198K25240j44176D4851N5185J65075r9866F6202b8696B63470A08120M2845
$$ 98198 323438 179262 44851 100036 265111 165245 66202 -28696 263470 108120 150965
15108A50965k5118e5880B85426B630c8790C07017A40805O2610r2810K09015A3117
$$ 150965 125847 -55880 285426 2630 -38790 307017 140805 203415 110605 319620 13117
15096A09802h2592C90307F4498L86331A84440a12742A07543L9614j4399E9320
$$ 109802 -82592 390307 64498 450829 184440 -112742 107543 147157 132758 59320
15085e0542D4153j6277J28747J90067a95585F703J17115O2888P4081I3360J11073
$$ -50542 44153 27876 156623 346690 -195585 6703 123818 186706 260787 93360 204433
15074B04433b37486A11137b7057F10391A8230c7914A25284J03537c7304q5937
$$ 204433 -237486 111137 -27057 610391 18230 -37914 125284 228821 -37304 -123241
15064a23241L6809c8266F7645k0173b13888B97390b89441B47365E998L76645a96687
$$ -123241 -86432 -38266 67645 47472 -213888 297390 -289441 247365 5998 382643 -196687
15052b63199G0911h9095F0880K78969j59384o3706i2550D47149B14253A04768
$$ -263199 70911 -89095 60880 339849 180465 116759 -92550 447149 214253 104768
15041A29770P7931J06010A49607K5150a67316C8185L2966Q5500A22a37202B09699
$$ 129770 207701 313711 149607 174757 -167316 38185 71151 156651 122 -137202 209699
15029C88919f3409C5129J91337f018A0171L04694A26661R6368l4401j3353L7909
$$ 388919 -63409 35129 226466 -6018 10171 314865 126661 223029 188628 175275 213184
15018B13184a50319D36781q4772D6606K52763j43968J66740g3167D06882c52737
$$ 213184 -150319 436781 352009 46606 299369 155401 322141 -73167 406882 -352737
15007E53229A71323K39041J1974A50426E4867N227a75662C20670A28027h9953
$$ 553229 171323 410364 422338 150426 54867 60094 -175662 320670 128027 -89953
14996A56449R492J82587A10964l9270M700K53244r2216K1204l2982j3011D9238
$$ 156449 165941 348528 110964 71694 76394 329638 237422 258626 225644 212633 49238
14984B72438l4517E966J26548a3803A31090N08667B23995G0386a2814D05542j05950
$$ 272438 237921 5966 132514 -13803 131090 639757 223995 70386 -12814 405542 299592
14973B99592l5270j9610A1780L71756a36782l8045K8063c1445A6863b7619A77991
$$ 299592 264322 244712 11780 383536 -136782 -174827 -146764 -31445 16863 -27619 177991
14961A36845o2353K88088J27047b03719E75481k31011K1412j626L3208p6819A30614
$$ 136845 74492 362580 489627 -203719 575481 344470 365882 364256 397464 320645 130614
14949a81996g6275F4169L99783A88762J44631O7584n4228o0703A22467J1589D6144
$$ -181996 -76275 64169 463952 188762 333393 400977 346749 286046 122467 134056 46144
14937A63464l2385J51086A34172K88928k06512R2635L9838j65875J45031j05981
$$ 163464 131079 282165 134172 423100 216588 309223 349061 183186 328217 222236
14927B22236j5087K76628j49242n1028J53993a58130C34195J4744j02210G3137
$$ 222236 207149 483777 334535 283507 437500 -158130 334195 348939 246729 73137
14916C27519J19381j68372j38275L50990m5q7006j25707J30159a5778H4657L21022
$$ 327519 446900 278528 140253 491243 491198 404192 278485 408644 -15778 84657 405679
14905D05679N4869a14785H5181J13429L03157J06393k69634A64742K92668j98826
$$ 405679 460548 -114785 85181 198610 501767 608160 338526 164742 457410 258584
14895B58584K76691A65794L23858k0278I1091l36a6561D68768q9143K08288G068
$$ 258584 535275 165794 489652 469374 91091 90755 -16561 468768 379625 587913 7068
14883B70570P0539j46939D3639M04870j61946L0785j53354K04046l1235F4773
$$ 270570 341109 194170 43639 448509 286563 317348 163994 368040 336805 64773
14872A51396K24164f1097D13073O737B06499Q7536J3312A07465K38962R5487J39158
$$ 151396 375560 -61097 413073 419810 206499 294035 307347 107465 346427 441914 581072
14861E81072B61726P2445E1301O3211J78112J22945P2428B25182N31J48539J52084
$$ 581072 261726 334171 51301 114512 292624 415569 487997 225182 225713 374252 526336
14850E26336j82703A33719M85754j29217j31700O0922j12185R2075j72240r6807
$$ 526336 343633 133719 619473 490256 358556 419478 307293 399368 227128 130321
14840A30321L78871A06838J14577J57585A21163K14405A28130M26162A94296P3357
$$ 130321 509192 106838 221415 379000 121163 335568 128130 554292 194296 267653
14830B67653J67419j69242L49248B63694A07078K38472L8617j9726j13272M22069
$$ 267653 435072 265830 615078 263694 107078 345550 384167 364441 251169 673238
14820F73238C5965K34122J21465L650A72855K51080N6689k30910O0251J58568
$$ 673238 35965 270087 391552 395202 172855 423935 480624 249714 309965 468533
14810D68533J0191j87731O6818m0275o6779O4516L49302j19607k20664P2290A22689
$$ 468533 478724 290993 357811 317536 250757 315273 664575 544968 324304 396594 122689
14798D36881L4688J90661j05945k58589J8985K9532r209K43530j31773J11358
$$ 436881 471569 662230 556285 297696 316681 346213 337004 580534 448761 560119
14788E60119j44795q695J88151j45022k3531L678K4326n2022n7317K11765A39100
$$ 560119 415324 406629 594780 449758 426227 429905 454231 402209 344892 556657 139100
14776C18391J74123J80720j36796k15483j2631M47831k78650M6941j56984R6322
$$ 318391 492514 673234 536438 320955 308324 756155 477505 524446 367462 463784
14766D63784j57797K47009k2090k20991J91197B25349L88158o8165J90588l11856
$$ 463784 305987 552996 530906 309915 501112 225349 613507 545342 735930 424074
14756D24074J23254J62214o2911r6824J91263l07735K70023B91485J82037K79706
$$ 424074 547328 709542 646631 549807 741070 433335 703358 291485 473522 753228
14746G53228l28646j39544L97701k70661L55385k4606p7763K36B61467L60558
$$ 753228 424582 285038 682739 412078 767463 742857 665094 665330 261467 622025
14736F22025p9033L02193l01810J0575J17030m4754k50459L64776K5027j55551
$$ 622025 542992 845185 543375 553950 670980 626226 375767 740543 765570 610019
14726F10019k10925M53348C89306O2778M61166j14093j69668O8316k25178M91157
$$ 610019 399094 852442 389306 452084 913250 799157 629489 697805 472627 963784
14716I63784J7446r3115j48200J49490k9077k39918j17439K51887q0658k79180
$$ 963784 981230 888115 739915 889405 860328 620410 502971 754858 674200 395020
14706C95020k2324L03579k05914K25805K07619j21977k65868k1023K8894m1049
$$ 395020 372696 676275 470361 696166 903785 781808 515940 494917 523811 482762
14696D82762M11266N6106l13240p9344K01675m5569k05877L2879J73221k63546
$$ 482762 894028 950134 636894 557550 759225 713656 507779 540658 713879 450333
14686D50333K2486K32616q9550m5268J92457k554K3166j72726J52216j8061L14268
$$ 450333 472819 705435 615885 570617 763074 760520 783686 610960 763176 745115 1059383
14675A059383l16390C58648J34483P6917M60672r4240J69055k85432q4901o1001
$$ 1059383 742993 358648 493131 570048 1030720 936480 1105535 820103 735202 674201
14665F74201J50450j78970N2439J84511Q107o4398K44547o1554l01734N35337
$$ 674201 824651 645681 698120 882631 890738 826340 1070887 1009333 707599 1242936
14655A242936m48969Q8587k19897K81729K08236m5122j14811j62253K67674l10950
$$ 1242936 793967 882554 662657 944386 1152622 1107500 992689 830436 1098110 787160
14645G87160L50256l49149l3176K48894L89317l72533K88655o07245P63346l85206
$$ 787160 1137416 788267 755091 1003985 1393302 1020769 1309424 702179 1465525 1080319
14635A080319j00386j4104K9917j11713J86039q5344K54603m39337L63927j71463
$$ 1080319 979933 965829 995746 884033 1070072 984728 1239331 799994 1163921 992458
14625I92458K63594J1495K1944j18407k07300J67998N7482J12361o1458o1044
$$ 992458 1256052 1267547 1289491 1171084 963784 1131782 1189264 1301625 1240167 1179123
14615A179123J9011k39514R9591j32122Q5422R6525Q5549Q8627k48366J36791
$$ 1179123 1198134 958620 1058211 926089 1011511 1108036 1193585 1282212 1033846 1170637
14605A170637K07083k34572K94598l86416J88682o8784L60770k07024n3163J86006
$$ 1170637 1377720 1143148 1437746 1051330 1240012 1171228 1531998 1324974 1271811 1457817
14595A457817l01854P9168Q1617K443L70269m73988J34223m3170M0388K39283
$$ 1457817 1155963 1235131 1316748 1319191 1689460 1215472 1349695 1306525 1346913 1586196
14585A586196k40790M1971N3082N07065o16330L31280j46021n3410J62314Q0790
$$ 1586196 1345406 1387377 1440459 1947524 1331194 1662474 1516453 1463043 1625357 1706147
14575A706147k16386M6568K04824p2698l7364l9844K33431L00687k19886k22062
$$ 1706147 1489761 1536329 1741153 1668455 1631091 1591247 1824678 2125365 1905479 1683417
14565A683417J00386l3525J71466m28177M40831k22269K01320P0497K3955J37460
$$ 1683417 1783803 1750278 1921744 1493567 1934398 1712129 1913449 1983946 2007901 2145361
14555B145361q9096m8545j14130L31118O4676n3189p2381o8252P0695L83175l22142
$$ 2145361 2056265 2007720 1893590 2224708 2289384 2236195 2163814 2095562 2166257 2549432 2227290
14544B227290L57733K97882J27580K96408J42762J74557N94003J21137J087600
$$ 2227290 2585023 2882905 3010485 3306893 3449655 3624212 4218215 4339352 5426952
14535E426952J232785K511222L747857O693775J0318647k211773q365115o762562
$$ 5426952 6659737 9170959 12918816 19612591 29931238 27719465 19354350 12591788
14527A2591788m578168k749986j642617q50234K3872m07181o5227K3495k04670
$$ 12591788 8013620 5263634 3621017 2770783 2794655 2387474 2322247 2345742 2141072
14518B141072j46288j05103J82584k26142J65298J25410j17263M56098j78734
$$ 2141072 1994784 1889681 2072265 1846123 2011421 2136831 2019568 2475666 2296932
14509B296932J76299l88710P7510J09773O9061n22164M65370m6275N5322L19372
$$ 2296932 2473231 2084521 2162031 2271804 2340865 1818701 2284071 2237796 2293118 2612490
14499B612490j80070K05845l09100J10955j6235J94967k7261j3435K8324M094
$$ 2612490 2432420 2638265 2329165 2440120 2423885 2618852 2591591 2578156 2606480 2610574
14489B610574L73096m31522L63848k79975j8432L16565P6492o4124l32512M98577
$$ 2610574 2983670 2552148 2915996 2636021 2617589 2934154 3010646 2946522 2614010 3112587
14479C112587k64682K13386n0584J89709j57647k2636J96546Q4732J14447j12585
$$ 3112587 2847905 3061291 3010707 3200416 3042769 3020133 3216679 3301411 3415858 3303273
14469C303273J28956k37820J93232M52354n97786K98686k24608N7538O6684K93041
$$ 3303273 3432229 3194409 3387641 3839995 3242209 3540895 3316287 3373825 3440509 3733550
14459C733550l217j48809K99458K21175l37831K82635q368J80794l9544r2747
$$ 3733550 3730333 3581524 3880982 4102157 3764326 4046961 4038593 4219387 4179843 4087096
14449D087096l60283L55007J27465j1279K39300K10828m65467J93038l3006M93125
$$ 4087096 3726813 4081820 4209285 4198006 4437306 4648134 4182667 4375705 4342699 4835824
14439D835824O863j70060Q1218j5582Q9194L46604l67938L18998j06268m4591
$$ 4835824 4842687 4672627 4753845 4738263 4827457 5174061 4806123 5125121 5018853 4974262
14429D974262K23098m50718O26828Q9788j00165L28795k45648j6522N39854k48687
$$ 4974262 5197360 4746642 5373470 5463258 5363093 5691888 5446240 5429718 5969572 5720885
14419E720885K65100n56842L77960L26513J3071k7990J75753L5702K44622j82703
$$ 5720885 5985985 5429143 5807103 6133616 6146687 6118697 6294450 6330152 6574774 6392071
14409F392071K81510J02433J66088K24881j36789L41376j03080J61391J78596
$$ 6392071 6673581 6776014 6942102 7166983 7030194 7371570 7268490 7429881 7608477
14400G608477M6585J60000j8165j64245M42122L40540n4830p5602O750L42026
$$ 7608477 7655062 7815062 7796897 7632652 8074774 8415314 8360484 8284882 8291632 8633658
14390H633658J00614O2643N24368K98184k72509J27551M27807k23194K43013K41517
$$ 8633658 8734272 8796915 9321283 9619467 9346958 9474509 9902316 9679122 9922135 10163652
14380A0163652j28453L31869N2325M44164K01735j20064M38395R9488P99010j20222
$$ 10163652 10035199 10367068 10419393 10863557 11065292 10945228 11383623 11483111 12282121 12161899
14370A2161899j04038L27462L86315o9223N20274L08468K45205L680L44234M41720
$$ 12161899 12057861 12385323 12771638 12702415 13222689 13531157 13776362 13780042 14124276 14565996
14360A4565996p5127L31126L62177J06161P96908L5966M40780J94529N53905N10626
$$ 14565996 14490869 14821995 15184172 15290333 16087241 16123207 16563987 16758516 17312421 17823047
14350A7823047K00181R5965N06449L84802M10998P12599N9553P40971N77072J73423
$$ 17823047 18023228 18119193 18625642 19010444 19421442 20134041 20193594 20934565 21511637 21685060
14340B1685060P54803J47884P35874N49024N67848M89578M39942Q61601P66982
$$ 21685060 22439863 22587747 23323621 23872645 24440493 24930071 25370013 26231614 26998596
14331B6998596O87152O55340N81471P10450J079849L93320R08966R83360J042282
$$ 26998596 27685748 28341088 28922559 29633009 30712858 31106178 32015144 32998504 34040786
14322C4040786J001775O11621J113219J402895J019730J071823J262336J430288
$$ 34040786 35042561 35654182 36767401 38170296 39190026 40261849 41524185 42954473
14314D2954473J429293J413448J551936J522969J562480J695064J820256K193972
$$ 42954473 44383766 45797214 47349150 48872119 50434599 52129663 53949919 56143891
14306E6143891J721916J928850K428233K236270K194515K837678K834150K757868
$$ 56143891 57865807 59794657 62222890 64459160 66653675 69491353 72325503 75083371
14298G5083371K937268L477615L352721L768918L965397L739089M536379N086644
$$ 75083371 78020639 81498254 84850975 88619893 92585290 96324379 100860758 105947402
14290A05947402M761853M931111N883301N757396O699614O573147P044677P502015
$$ 105947402 110709255 115640366 121523667 127281063 133980677 140553824 147598501 155100516
14282A55100516Q073727Q109460R296432R452481J0386648J0548263J1519299
$$ 155100516 163174243 171283703 180580135 190032616 200419264 210967527 222486826
14275B22486826J1937260J2607234J3462010J3407584J4357587J4125072J4709032
$$ 222486826 234424086 247031320 260493330 273900914 288258501 302383573 317092605
14268C17092605J4883960J4647596J4744107J3970265J3292915J2296298J1358629
$$ 317092605 331976565 346624161 361368268 375338533 388631448 400927746 412286375
14261D12286375J0817105J0260582R415715N872553K999240K824337N63654m702406
$$ 412286375 423103480 433364062 442779777 448652330 451651570 454475907 455039561 450337155
14253D50337155m394508l241364l609301m375746r999157j3458117j3968314j4523296
$$ 450337155 445942647 442701283 439091982 434716236 424717079 411258962 397290648 382767352
14245C82767352j4902244j4544810j4653063j3759692j4589014j3855844j3511783
$$ 382767352 367865108 353320298 338667235 324907543 310318529 296462685 282950902
14238B82950902j2961722j2306687j2144640j2444351j2615900j2189692j1148708
$$ 282950902 269989180 257682493 245537853 233093502 220477602 208287910 197139202
14231A97139202j0167516r779842q729307q429870q406501p218834p073723o633063
$$ 197139202 186971686 177191844 168462537 160032667 151626166 144407332 137333609 130700546
14223A30700546n800620n816581n214691m948233n345774m203358m185078l736086
$$ 130700546 124899926 119083345 113868654 108920421 103574647 99371289 95186211 91450125
14215I1450125l857748l521823l338091l437685l091624k833346k408448k752780
$$ 91450125 87592377 84070554 80732463 77294778 74203154 71369808 68961360 66208580
14207F6208580k534665k135477k087434j852599k338584j721984j756837j752623
$$ 66208580 63673915 61538438 59451004 57598405 55259821 53537837 51781000 50028377
14199E0028377j044353j841235j590132j275342j583099j165211q82468r43823
$$ 50028377 48984024 47142789 45552657 44277315 42694216 41529005 40646537 39702714
14191C9702714j018287j381292p15778j560292j020788m93992j161190q76533
$$ 39702714 38684427 37303135 36587357 35027065 34006277 33512285 32351095 31474562
14183C1474562r74782o84344q27187q94240k75177q10791n20466j276911k73433
$$ 31474562 30499780 29815436 28988249 28094009 27818832 27008041 26487575 25210664 24937231
14174B4937231l55634p90333m53993o69134p60660k85621n93515n41215l9672
$$ 24937231 24581597 23791264 23337271 22668137 21907477 21621856 21028341 20487126 20447454
14165B0447454p82495k29095m80709m44576l93802m00163j31421l81177n11868
$$ 20447454 19664959 19435864 18955155 18510579 18116777 17716614 17585193 17204016 16692148
14156A6692148l16371j68145o77440l6037m39294l02951r753m05216l30769q4736
$$ 16692148 16375777 16207632 15530192 15494155 15054861 14751910 14742157 14336941 14006172 13921436
14146A3921436m33972N4931k31358j15286l99251k24883j88609l18509M0414m42600
$$ 13921436 13487464 13542395 13311037 13195751 12796500 12571617 12383008 12064499 12104913 11662313
14136A1662313k14229k79442J96758k87968k86788m49315J53317k13644l69763
$$ 11662313 11448084 11168642 11365400 11077432 10790644 10341329 10494646 10281002 9911239
14127I911239q1646R4402l01009J69331o66125J64406Q987m40057r1686j29081
$$ 9911239 9829593 9923995 9622986 9792317 9126192 9290598 9299585 8859528 8767842 8638761
14117H638761j2653j27510m34866J69056l05416p7899J37356k13927n9806j57538
$$ 8638761 8626108 8498598 8063732 8232788 7927372 7849473 7986829 7772902 7713096 7555558
14107G555558j2759k30741j46768j60191J26260l16802R025J36964k3088l44126
$$ 7555558 7542799 7312058 7165290 7005099 7131359 6814557 6823582 6960546 6937458 6593332
14097F593332j34057j84610K23205j52407j02731j31505K37650l3848r3566j94720
$$ 6593332 6459275 6274665 6497870 6345463 6242732 6111227 6348877 6315029 6221463 6026743
14087F026743J3043k00050k11946j4503M7064o972q0181l77804j74155J32204
$$ 6026743 6039786 5839736 5627790 5613287 5660351 5653379 5573198 5195394 5021239 5153443
14077E153443J12009k29579j78025j32731K47865j50686q6623m293J57392j72331
$$ 5153443 5265452 5035873 4857848 4725117 4972982 4822296 4735673 4731380 4888772 4716441
14067D716441j39946N10180o16441L2723L9818j69718j43850L22481k32631j75952
$$ 4716441 4576495 5086675 4470234 4502957 4542775 4373057 4229207 4551688 4319057 4143105
14057D143105K43368m41196L48847j21397j12042n5540k05449K22463k52796P7425
$$ 4143105 4386473 3945277 4294124 4172727 4060685 4005145 3799696 4022159 3769363 3846788
14047C846788j52083Q6154k90214K76707K16021O5920k75301J83052l78376N1225
$$ 3846788 3694705 3780859 3490645 3767352 3983373 4049293 3773992 3957044 3578668 3629893
14037C629893N7711r8105j29359j91818k6866j66076L23928l22919J29851m5295
$$ 3629893 3687604 3589499 3460140 3268322 3241456 3075380 3399308 3076389 3206240 3160945
14027C160945j09716N7920j72148O1528j31087J84217l07295J15191j08250N1206
$$ 3160945 3051229 3109149 2937001 2998529 2867442 3051659 2744364 2859555 2751305 2802511
14017B802511l6293K74621O1106n6165k21911j51939j81540J92154K1597l22733
$$ 2802511 2766218 3040839 3101945 3045780 2823869 2671930 2490390 2682544 2704141 2381408
14007B381408L12268J40207j36635N6540n79763N25189j07775P4033o0085k73343
$$ 2381408 2693676 2833883 2697248 2753788 2174025 2699214 2591439 2665472 2605387 2332044
13997B332044K15110m15591M03344k16858j86316r8646M35120o3733k86620m5622
$$ 2332044 2547154 2131563 2534907 2318049 2131733 2033087 2468207 2404474 2117854 2072232
13987B072232K59283j98576j22860M39008k2577j58033m6316N31421k42355L00740
$$ 2072232 2331515 2132939 2010079 2449087 2426510 2268477 2222161 2753582 2511227 2811967
13977B811967M00633L66659N14623J810201L229657O025013J1641468J493790
$$ 2811967 3212600 3579259 4093882 5904083 9133740 15158753 26800221 28294011
13969B8294011p565287o151029m319452k731148k102444j135783n25879j98729
$$ 28294011 20728724 14577695 10258243 7527095 5424651 4288868 3762989 3564260
13961C564260q1663j85597m17763R7384k59673J85611m12249K15258j66619l07942
$$ 3564260 3482597 3297000 2879237 2976621 2716948 2902559 2490310 2705568 2538949 2231007
13951B231007p184j13833j118M7917R1886j01725o462j52893J18986j91933m206
$$ 2231007 2223823 2109990 2108872 2156789 2248675 2146950 2140488 1987595 2106581 1914648 1910442
13940A910442l013m43106O01918j38667l75283J57535K81423k03119Q0085k25084
$$ 1910442 1907429 1464323 2066241 1927574 1552291 1709826 1991249 1788130 1868215 1643131
13930A643131j03234O6495k36048K81840J21703r7408l195k50372Q9222L3323
$$ 1643131 1539897 1606392 1370344 1652184 1773887 1676479 1673284 1422912 1512134 1545457
13920A545457k2821j09644K71167j08812K3231J46590r4048j18852l49478M47249
$$ 1545457 1522636 1412992 1684159 1575347 1598578 1745168 1651120 1532268 1182790 1630039
13910A630039m9462k5940l96985K03844k1087J97051O3019m03451M06633L877
$$ 1630039 1580577 1554637 1157652 1361496 1340409 1537460 1600479 1197028 1603661 1607538
13900A607538N5650l71252J90636k14881j94231M25940j06489k2718o3416K96932
$$ 1607538 1663188 1291936 1482572 1267691 1073460 1499400 1392911 1370193 1306777 1603709
13890A603709n98771J99297Q917J51278l52929L39039j43166J14045l6967J45746
$$ 1603709 1004938 1204235 1213152 1364430 1011501 1350540 1207374 1321419 1284452 1430198
13880A430198j80660O7054K91023m84879k15497K11940J71208K52947m54376K61902
$$ 1430198 1249538 1316592 1607615 1122736 907239 1119179 1290387 1543334 1088958 1350860
13870A350860J19307k82397j36753p4956l3832O6277L91309k82730o5502k365
$$ 1350860 1470167 1187770 1051017 976061 942229 1008506 1399815 1117085 1051583 1049218
13860A049218L5393j62332R5783l264p3502K80865j99653o6832J46669J380k256
$$ 1049218 1084611 922279 1018062 1014798 941296 1222161 1022508 955676 1102345 1103725 1101469
13849A101469J40155q7444l34636K28972j49338j24201L11455l6208j2793J73607
$$ 1101469 1241624 1154180 819544 1048516 899178 774977 1086432 1050224 1037431 1211038
13839A211038m39994j84265N31068m97113J46819O0579R144J58915J41108l47166
$$ 1211038 771044 586779 1117847 620734 767553 828132 837276 996191 1137299 790133
13829G90133J40685j96389M60591k31591o1247J9914K54394Q3468m72527L9689
$$ 790133 930818 734429 1195020 963429 902182 922096 1176490 1259958 787431 827120
13819H27120m2328r4102K99578l42488J89427M11836l78678p1886J14434R5302
$$ 827120 784792 690690 990268 647780 837207 1249043 870365 798479 912913 1008215
13809A008215j72866K56984j97521m6253j7233J45625k13144P0405j61429K40842
$$ 1008215 835349 1092333 894812 848559 831326 976951 763807 834212 672783 913625
13799I13625m33K10928m33594k06681K01481j76218L07827j03091K86341k71138
$$ 913625 913192 1124120 690526 483845 685326 509108 816935 713844 1000185 729047
13789G29047J72563k7245j66243J29665l75495M55693p3226l40100J49021j44935
$$ 729047 901610 874365 708122 837787 462292 917985 844759 504659 653680 508745
13779E08745M50376m4924k88932J84102l45082K6945N22136m11327L98331l08915
$$ 508745 959121 914197 625265 809367 464285 491230 1013366 602039 1000370 691455
13769F91455n7158j53473J62922j74089L41866l70839M67909R6676m15273p0627
$$ 691455 634297 480824 643746 469657 811523 440684 908593 1005269 589996 519369
13759E19369M27837l23317Q1448k66730L09554C45973O04589D07539L57269l4979
$$ 519369 947206 623889 705337 438607 748161 345973 950562 407539 764808 729829
13749G29829j80620L11696k25621P6331j07014J29142C45897L64412l21725J13067
$$ 729829 549209 860905 635284 711615 604601 733743 345897 710309 388584 501651
13739E01651j31004K22210j4815L84445k01999C49049N8577L76875A75592N04829
$$ 501651 370647 592857 578042 962487 760488 349049 407626 784501 175592 680421
13729F80421J06398k84350K49235M1160C31936L25539L6328J29543p7900l51946
$$ 680421 786819 502469 751704 792864 331936 657475 693803 823346 745446 393500
13719C93500l1664L07786k46474m0513K70494k86411M56365k31566j44515k1227
$$ 393500 361836 669622 423148 382635 653129 366718 823083 591517 447002 425775
13709D25775K31549J28999Q915l16403J87550j31913K46745j84351r4559J06874
$$ 425775 657324 786323 795238 478835 666385 534472 781217 596866 502307 609181
13699F09181j7484L1511B87684J49190j6723L66141B00368K16701J94277A79265
$$ 609181 591697 623208 287684 436874 420151 786292 200368 417069 611346 179265
13688D41919K70852j02402k13373J55237R7459A75113M91799l00956Q9233n9127
$$ 441919 712771 610369 396996 552233 649692 175113 666912 365956 455189 396062
13678C96062r8788j075J44829K77959k23538A57454M24158m6791L470j8989o5758
$$ 396062 297274 296199 441028 718987 495449 157454 581612 534821 538291 519302 453544
13667D53544B10371R0555L0065r8730J78234L73414k73252n8009p9740L4202m450
$$ 453544 210371 300926 330991 232261 410495 783909 510657 452648 372908 407110 402660
13656D02660J53708j67343l8307m9894J01283K13398B33707L55476j91540J17391
$$ 402660 556368 389025 350718 300824 402107 615505 233707 589183 397643 515034
13646E15034B13906L55941K82489k98232A99121K04779J54683J39539q1555P0736
$$ 515034 213906 569847 852336 554104 199121 403900 558583 698122 616567 687303
13636F87303k47963J59604q9681j94384l1352J92168r5238N1116J20589M0618
$$ 687303 439340 598944 509263 314879 283527 475695 380457 431573 552162 592780
13626E92780k35206q2188I2133J41667F8925K85207l9519J84141J31595o1785
$$ 592780 357574 275386 92133 233800 68925 354132 314613 498754 630349 568564
13616E68564A63239L24192j95646K5713L34263n8690c4579D90336j20816P796
$$ 568564 163239 487431 291785 317498 651761 593071 -34579 490336 369520 377316
13606C77316L87325C31853K51306B65784L7514R9579J59560k76096k3308J14603
$$ 377316 764641 331853 583159 265784 303298 402877 562437 286341 263033 377636
13596C77636O2038m5054j55504K8333K95580k42077r0822O9380m157q5078L15332
$$ 377636 439674 394620 239116 267449 563029 320952 230130 299510 295353 210275 525607
13585E25607k37045b4934I713M18797P7586j59596D8704L14952A71912N8558c6123
$$ 525607 288562 -24934 9713 428510 506096 346500 48704 363656 171912 230470 -36123
13573D45046C8165L84666k8154j37129H7156Q0706K27653l588F8945L3247L49120
$$ 445046 38165 422831 394677 257548 87156 167862 395515 391927 68945 102192 451312
13562D51312M0057j73968m5898P5810j54873P1054J58097Q4932k52006J96035
$$ 451312 491369 317401 271503 347313 192440 263494 421591 506523 254517 450552
13552D50552e7316C51977j38724M0795J82331R1196E6560N43723J4356k9721A14491
$$ 450552 -57316 351977 213253 254048 436379 527575 56560 600283 614639 584918 114491
13540C74267F1227M77913k41154J72319k3603m8165r7744A6925K8611K82535j62148
$$ 374267 61227 539140 297986 470305 446702 398537 300793 16925 45536 328071 165923
13529A65923J45686K7582j65074M4925g273D81541e5081A15566j6196m6437L56496
$$ 165923 311609 339191 174117 219042 -7273 481541 -55081 115566 99370 52933 409429
13518D09429N1982I1012M63976l7984I6448J75739J36599E1155K60186A04877
$$ 409429 461411 91012 554988 517004 96448 272187 408786 51155 311341 104877
13507C52739O578A61831d450F91220A91661J37019J41776A82010J13995n3779
$$ 352739 359317 161831 -4450 691220 191661 328680 470456 182010 296005 242226
13497B42226R8321j30884J12324j07230n1012b4199A63561Q7901J32039j08757
$$ 242226 340547 209663 321987 214757 163745 -24199 163561 251462 383501 274744
13487B74744a53668A23110K93866A13265K15376j8139A48643j7228R9953L77856
$$ 274744 -153668 123110 416976 113265 328641 310502 148643 131415 231368 609224
13477F09224q2946j2669A77091K74456A16992L11105G1242K98316A37067K91604
$$ 609224 526278 513609 177091 451547 116992 428097 71242 369558 137067 428671
13467D28671A11232L095n2589J54888L84426B89989r3610J54355A23860J26339
$$ 428671 111232 114327 61738 216626 601052 289989 196379 350734 123860 250199
13457B50199J7907J44940a74330A71821r215K2980d695j15237A24019J56222a63367
$$ 250199 268106 413046 -174330 171821 162606 185586 -4695 -119932 124019 280241 -163367
13445a8964B86156I6952L49738B22823N1914k7290J74566j20089k3166M5196K5600
$$ -18964 286156 96952 446690 222823 274737 247447 422013 301924 278758 323954 349554
13434C49554A25303k3357K7167K8697q969J93904A795L93830c4000A57500J17853
$$ 349554 125303 101946 129113 157810 148841 342745 1795 395625 -34000 157500 275353
13423B75353N2934q2056k9134e744I4044K8505b2119G0044K14441K21613j34006
$$ 275353 328287 246231 217097 -5744 94044 122549 -22119 70044 284485 506098 372092
13412C72092c0383C0208K14259Q9343j04359q1502O2279L15342g593A20275K05598
$$ 372092 -30383 30208 244467 333810 229451 147949 210228 525570 -7593 120275 325873
13401C25873j24856o2480K1590O3301C1324J8958J39853d5280j11503C33217q9593
$$ 325873 201017 138537 160127 223428 31324 50282 190135 -45280 -156783 333217 243624
13390B43624C9592N1472J66192k6547j9285K11917b65165D4607J20393K24074
$$ 243624 39592 91064 257256 230709 211424 423341 -265165 44607 165000 389074
13380C89074O3492j64334L4399j47874b72985C29744q4923j1031j7422N9309P0909
$$ 389074 452566 288232 322631 174757 -272985 329744 244821 233790 216368 275677 346586
13369C46586r1523A27120O6444B5745L10285f7846B02608J57769J12842A90014
$$ 346586 255063 127120 193564 25745 336030 -67846 202608 360377 473219 190014
13358C21085A49040b8067B16823j05197M56698d7911D38187j66825J08308b6392
$$ 321085 149040 -28067 216823 111626 568324 -47911 438187 271362 379670 -26392
13347C50665j42109r6816Q2797m272M03221k66781D7547P7146J09282g1551B80659
$$ 350665 208556 111740 194537 190265 593486 326705 47547 124693 233975 -71551 280659
13335D81497J39434B80662L1649m5336K56469A73918K11227j74701K5239J27039
$$ 481497 620931 280662 312311 266975 523444 173918 385145 210444 235683 362722
13325C62722j32846c9341E45905B18088K68342p537o8763j03297r508q2756o3814
$$ 362722 229876 -39341 545905 218088 486430 478893 410130 306833 297325 214569 150755
13314A50755K44466o2898E2072a13785A61340G7171j2801K23630o0177L6691j18427
$$ 150755 395221 332323 52072 -113785 161340 77171 64370 288000 227823 264514 146087
13303A46087Q1748m6889C869d901A73783c5757D18775K6109j16144j38895f4124
$$ 146087 227835 180946 3869 -4901 173783 -35757 418775 444884 328740 189845 -64124
13291D6140Q1165J15010j14402D3687K17926C0400L44925G8247P661b40194M6401
$$ 46140 127305 242315 127913 43687 261613 30400 375325 78247 85908 -240194 -193793
13280a93793e4402B79775m7342j00230K4380o1166J94635a34290B29089l7400
$$ -193793 -54402 279775 232433 132203 156583 95417 290052 -134290 229089 191689
13270A91689c112B29230r6327K25710j65820q9394b73998C35452n0324A08145
$$ 191689 -3112 229230 132903 358613 192793 103399 -273998 335452 285128 108145
13259G5710J75242B6851L9192B4317J94360H403J11783O4087G0440K596Q7794
$$ 75710 250952 26851 66043 24317 218677 8403 120186 184273 70440 73036 160830
13248A60830a4554j4062C65420j63533j00182K57230q084G2589J49265D3611M1748
$$ 160830 -14554 -28616 365420 201887 101705 358935 350851 72589 221854 43611 85359
13237H5359K27666D464J76564O6143J06172e5009B54419j16988c1974B74899j21099
$$ 85359 313025 4464 181028 247171 353343 -55009 254419 137431 -31974 274899 153800
13226A53800b5988B00214b72849A65157p975R9384A1208L24483A19379c6245A84982
$$ 153800 -25988 200214 -272849 165157 157182 256566 11208 335691 119379 -36245 184982
13214A50576J98501A59165f7795B85612j30135o9754J58410b75491F594a23262
$$ 150576 349077 159165 -67795 285612 155477 85723 244133 -275491 6594 -123262
13203b60623A02262a18499C48915a55747d6266A85371I0206a34856N7836A41302
$$ -260623 102262 -118499 348915 -155747 -46266 185371 90206 -134856 -77020 141302
13192a2324k9594D8884K46438j27253a76598f3004B11637I735N9705M2957K9623
$$ -12324 -41918 48884 295322 168069 -176598 -63004 211637 9735 69440 112397 142020
13181A42020g8324A42438F652i3725A48920R0659a7823E05369B2150a61024B15158
$$ 142020 -78324 142438 6652 -93725 148920 239579 -17823 505369 22150 -161024 215158
13169c6414A02385b484j70022M0187N9806I001g5704k6040A82816m9350K34101
$$ -36414 102385 -2484 -172506 -132319 -72513 9001 -75704 -101744 182816 133466 367567
13158C67567D1569K29980c23236B15277n0782B873J32096a32991B92213j29891
$$ 367567 41569 271549 -323236 215277 164495 2873 134969 -132991 292213 162322
13148A62322J82447d7063K768a078G1638J05119n8673J69390i4724A3064F053
$$ 162322 344769 -47063 -44295 -1078 71638 176757 118084 287474 -94724 13064 6053
13136a34931O1332G5992L45139H1787f4131B36919C8530a18573D96257A48514
$$ -134931 -73599 75992 421131 81787 -64131 236919 38530 -118573 496257 148514
13125c12290I6830K2667J18629e6333j30929D17739j70935L4246A36763d3915
$$ -312290 96830 119497 238126 -56333 -187262 417739 246804 281050 136763 -43915
13114a94346A07630C8842J58430Q5679A04836P8761O4055b4901D2097A9500R9170
$$ -194346 107630 38842 197272 282951 104836 183597 247652 -24901 42097 19500 118670
13103A18670a74718I9917K8313a57747M9760B69798b17174R3657e3385A23480
$$ 118670 -174718 99917 128230 -157747 -107987 269798 -217174 -123517 -53385 123480
13092D27216B0927K90145A11372O2854h51j45868G1182K84825A55591n0611a62877
$$ 427216 20927 311072 111372 174226 -851 -146719 71182 356007 155591 104980 -162877
13080c09261A80032E7290a66100E1417J33157a64633B4974N1881b4574A5848a201
$$ -309261 180032 57290 -166100 51417 184574 -164633 24974 76855 -24574 15848 -1201
13068e6761B1020b17600H7883C2204L8879a09029C35341a00509C80397H4211J82453
$$ -56761 21020 -217600 87883 32204 71083 -109029 335341 -100509 380397 84211 266664
13057B66664o5139J08810R0482b98105E62739c02110C68610A45813J56515c25722
$$ 266664 201525 310335 400817 -298105 562739 -302110 368610 145813 302328 -325722
13046C52531J59434D7429a14505N0013B45725h909l4436B37J24257a44058A90629
$$ 352531 511965 47429 -114505 -64492 245725 -8909 -43345 237 124494 -144058 190629
13034C19757C0168J10735h5205A52801a10142B91238M5555j01507M055E4654M5967
$$ 319757 30168 140903 -85205 152801 -110142 291238 336793 235286 239341 54654 100621
13023A00621J67477A21101A4126b19853B5077K18870k3754a28336D1070K41259
$$ 100621 268098 121101 14126 -219853 25077 243947 220193 -128336 41070 282329
13013B82329a18407B17348f6987m3218B47859O1077n3560L16732A82857a02408
$$ 282329 -118407 217348 -66987 -110205 247859 308936 255376 572108 182857 -102408
13002B41506F4324O7572J35505A14919b70525D60348a881B9820K77189b62745
$$ 241506 64324 131896 267401 114919 -270525 460348 -1881 29820 307009 -262745
12991A67618k3917a28148p717A55947N9349p3004P1464f668j1505F8096e4151
$$ 167618 143701 -128148 -135865 155947 215296 142292 213756 -6668 -18173 68096 -54151
12979i9069A4521a12521G9610g7566j85871h6380c9631H3208i0502A63793J58311
$$ -99069 14521 -112521 79610 -77566 -263437 -86380 -39631 83208 -90502 163793 322104
12968C22104b003l2753D3525K37857D6097J50640a74A87831K5190o3857h0663
$$ 322104 -2003 -34756 43525 281382 46097 196737 -174 187831 213021 149164 -80663
12956A8340h7832E1077a73967A18174M2751K17178A54910F9611b64372C15620
$$ 18340 -87832 51077 -173967 118174 160925 378103 154910 69611 -264372 315620
12945B3882J11382K12810h1745H7595e753q1130j28947R6088A2756g5159m0890
$$ 23882 135264 348074 -81745 87595 -5753 -86883 -215830 -119742 12756 -75159 -116049
12934a16049A27831n0542K28152i0223A93167I4195e2056j5791k7342C46503a27380
$$ -116049 127831 77289 305441 -90223 193167 94195 -52056 -67847 -95189 346503 -127380
12922B04166c09101c1840C8036a43444H201b7353n2724H4534M6221i0132P5k00314
$$ 204166 -309101 -31840 38036 -143444 8201 -27353 -80077 84534 130755 -90132 -90057 -290371
12910b90371a6877A68916c0179N932o124H7559J73799a23426B45891f8372b2478
$$ -290371 -16877 168916 -30179 -24247 -30371 87559 261358 -123426 245891 -68372 -22478
12898a63721B09445H7429g8588A404b1351A78853k2103d183A36758l3636h32A52140
$$ -163721 209445 87429 -78588 1404 -21351 178853 156750 -4183 136758 103122 -832 152140
12885a29569B43169b34160P4257e4810B48199R6947A39297M4822B5465b13799
$$ -129569 243169 -234160 -159903 -54810 248199 345146 139297 184119 25465 -213799
12874b1003l46632A03029N5915a08913G4095J04863J23825m3760B5795g7849A08336
$$ -21003 -367635 103029 158944 -108913 74095 178958 302783 259023 25795 -77849 108336
12862B2866R0318l304M7666b11408a6780j9481B78893B5826J86078m5612P3143
$$ 22866 113184 109880 157546 -211408 -16780 -36261 278893 25826 211904 166292 239435
12851B39435e9339A79560N446B0368a11247n6463A59658h8967b5145C4874b37348
$$ 239435 -59339 179560 185006 20368 -111247 -167710 159658 -88967 -25145 34874 -237348
12839b01141A92430a37547e0221A1378a84569K5504H633O7298J64959b64808a05345
$$ -201141 192430 -137547 -50221 11378 -184569 -159065 8633 75931 240890 -264808 -105345
12827A16180J08572A01594m9391d27637H6386i6826B34081g529j50512C09219
$$ 116180 224752 101594 52203 -427637 86386 -96826 234081 -7529 -158041 309219
12816D5463J27512J6569P5920a22543p4426I3057e6683j36816A43814b00551A47740
$$ 45463 172975 189544 265464 -122543 -196969 93057 -56683 -193499 143814 -200551 147740
12804a21383a4382B4099a86471G3211i2730k6708p113H085M9605K6574J1336K46
$$ -121383 -14382 24099 -186471 73211 -92730 -119438 -126551 8085 57690 84264 95600 95846
12792I5846g5223A98712F2240b37280l4142m287C33068L3430A0806d94o0810F5721
$$ 95846 -75223 198712 62240 -237280 -271422 -275709 333068 366498 10806 -494 -61304 65721
12779a6176j29386B4408j0035a33816B78877C1148d9994A31218A2421J69991A9390
$$ -16176 -145562 24408 14373 -133816 278877 31148 -49994 131218 12421 182412 19390
12767b7098q382j23041q3390B08711D5868a25754n3002A32179l3107l2104h0948
$$ -27098 -35480 -158521 -241911 208711 45868 -125754 -178756 132179 99072 66968 -80948
12755A43383b02978j62855A09869b78655A5988b4763C43330g5382a882D21881
$$ 143383 -202978 -365833 109869 -278655 15988 -24763 343330 -75382 -1882 421881
12744D709b35617M1497n4853A50824o141d3951l38307B5351a35927A192b4371
$$ 4709 -235617 -194120 -248973 150824 144683 -43951 -382258 25351 -135927 1192 -24371
12732B8282M202b48177B00303c8110A18205b133j60390M3874c365D8796J82541
$$ 28282 32484 -248177 200303 -38110 118205 -2133 -162523 -118649 -3365 48796 231337
12721B31337o2110k202J55694r9621f4823C49426E7185f6533A29338B4779J06232
$$ 231337 169227 167025 322719 223098 -64823 349426 57185 -66533 129338 24779 131011
12710A31011e9740A35946c0924p371B08970q8436m5575d6385a5185H470K13434
$$ 131011 -59740 135946 -30924 -38295 208970 120534 74959 -46385 -15185 8470 221904
12699B21904c6627l2676B37493J26033F1182J44803r9538d32B94339J25274B03410
$$ 221904 -36627 -69303 237493 363526 61182 205985 106447 -432 294339 419613 203410
12687e7250j04323A26621J30113h7719A76119G617K33782L484j14353J38780o7119
$$ -57250 -161573 126621 256734 -87719 176119 7617 241399 244883 130530 269310 202191
12676B02191r4720p664L3193k8091a31758C0294p234f9081A20048L6412A1865
$$ 202191 107471 99807 133000 104909 -131758 30294 23060 -69081 120048 156460 11865
12664A86208b43B37853j5330F4101K67214A26035J6582D7612K60369L9976b18705
$$ 186208 -243 237853 222523 64101 331315 126035 142617 47612 307981 347957 -218705
12652E5099n116N6561i3116L2645j26968C70341b33432A07483k150K8494J05035
$$ 55099 49983 106544 -93116 -60471 -187439 370341 -233432 107483 105333 133827 238862
12641B38862I4825K8163d3024n2778n3440M5069A59406o8715L87183A9563J25330
$$ 238862 94825 122988 -43024 -95802 -149242 -104173 159406 90691 477874 19563 144893
12630A44893G775L26974q8238d9056J8032B1044J4647H54a11677B42009k5811
$$ 144893 7775 334749 246511 -49056 -31024 21044 35691 854 -111677 242009 216198
12619B16198J9310d7650B69010D4312j6827L19413D8395J17633d9621A26482P3305
$$ 216198 235508 -47650 269010 44312 27485 346898 48395 166028 -49621 126482 199787
12608A99787J37507a44343A41193n5703P5775b39318A83939a39970d7236j8661
$$ 199787 337294 -144343 141193 85490 161265 -239318 183939 -139970 -47236 -65897
12598f5897L662j4812K3156c45j75041O3116C2458f6728B19180o6604b9206l95963
$$ -65897 -62235 -77047 -53891 -345 -175386 -112270 32458 -66728 219180 152576 -29206 -425169
12586d25169B9173L98280A44962J4294m2909j056d1496G8270k4157J76772J24016
$$ -425169 29173 427453 144962 159256 116347 115291 -41496 78270 54113 230885 354901
12575C54901m6710p4968E4384L50761a59601A4986J24290c6590A74340b65769
$$ 354901 308191 233223 54384 405145 -159601 14986 139276 -36590 174340 -265769
12564B66917c2041k01008B3623J63989C1663i9543A10247a69945A61928a15675
$$ 266917 -32041 -233049 23623 187612 31663 -99543 110247 -169945 161928 -115675
12553h8364C4735K58721j31333M0189G7511O0635m6296d7594A2515a62488B53338
$$ -88364 34735 293456 162123 202312 77511 138146 91850 -47594 12515 -162488 253338
12541A82967j1199n7624e054l02597J07243C6496d6160C71556A09332B1757J39309
$$ 182967 171768 114144 -5054 -307651 -200408 36496 -46160 371556 109332 21757 161066
12530A61066d2757A01382a30508A40153A3564a50738n1634A32992a84740B41238
$$ 161066 -42757 101382 -130508 140153 13564 -150738 -202372 132992 -184740 241238
12519b02605j5624A41295O756a74830C08067b5864j87976b2276D9062L73713m0819
$$ -202605 -218229 141295 148051 -174830 308067 -25864 -213840 -22276 49062 422775 381956
12508C81956A5311J45566g4084J9171H2066c0283A36946M698G170K89303j05860
$$ 381956 15311 160877 -74084 -54913 82066 -30283 136946 141644 7170 296473 190613
12497A90613i1346j47329P7114C42891D0189c43475h4427o5708B61667J54704
$$ 190613 -91346 -238675 -161561 342891 40189 -343475 -84427 -150135 261667 416371
12487D16371a18317B8581d2353A00452g573j66953A47825J05364R9191f7124p0638
$$ 416371 -118317 28581 -42353 100452 -7573 -174526 147825 253189 352380 -67124 -137762
12476a37762a2089H3243J6001k5003k0799b07521C6121J34852Q7352g3499o7052
$$ -137762 -12089 83243 99244 74241 53442 -207521 36121 170973 258325 -73499 -140551
12465a40551l420g1134C72505b73836h4189G7107c2758A4117o776d1879a5704
$$ -140551 -143971 -71134 372505 -273836 -84189 77107 -32758 14117 7341 -41879 -15704
12453c6815J1994A49402c12152o963N8011i013m2324m897K2817C6819f0184k2697
$$ -36815 -24821 149402 -312152 -319115 -261104 -9013 -51337 -56234 -33417 36819 -60184 -82881
12441h2881F2136a90063O18A65791J56192b8237A47196J80484A14165J34153a73319
$$ -82881 62136 -190063 -189445 165791 321983 -28237 147196 327680 114165 248318 -173319
12429c4074j34763K5457D16376a66148P8096j68093A4625i8928A34530b73542
$$ -34074 -168837 -143380 416376 -166148 -88052 -256145 14625 -98928 134530 -273542
12418F3382a62338k04068J77697C18717a52593o0470A04295K8927a36873A59082
$$ 63382 -162338 -366406 -188709 318717 -152593 -213063 104295 133222 -136873 159082
12407A75727A2691i017j89599A86395c55133A26739E2111M0849a2645e30q9258
$$ 175727 12691 -9017 -198616 186395 -355133 126739 52111 92960 -12645 -530 -89788
12396h9788F7841l970n557h540H602c4867C48772a03601B42888a9812B54560b6750
$$ -89788 67841 63871 58314 -8540 8602 -34867 348772 -103601 242888 -19812 254560 -26750
12383c35898a03635K0276l4430e4298E5676b34637e6303n2328d6218B23654b50398
$$ -335898 -103635 -83359 -117789 -54298 55676 -234637 -56303 -108631 -46218 223654 -250398
12371a81951f1168B58899e3519n15B2880b68429B09143M1122c5219B8358f6260
$$ -181951 -61168 258899 -53519 -54034 22880 -268429 209143 250265 -35219 28358 -66260
12359F0083J50644p3107d3693j49040K0757b1659m4152j31179O497F2484K65487
$$ 60083 210727 137620 -43693 -192733 -171976 -21659 -65811 -196990 -190493 62484 327971
12348C27971D1188e3577I6402J63467F1865g8219J5197C9283L02305B2599L0930
$$ 327971 41188 -53577 96402 259869 61865 -78219 -63022 39283 341588 22599 53529
12337E3529f2725K6940C12084j28870a73373j63438F7549J21075F6553J58805
$$ 53529 -62725 -35785 312084 183214 -173373 -336811 67549 188624 66553 225358
12327B25358H015b575j34238C3946K66466e0311d235j77461D75575f8374b7480
$$ 225358 8015 -2575 -136813 33946 300412 -50311 -4235 -181696 475575 -68374 -27480
12315H5705b92562G5639c2280B43819j16357B7554K35040C7270K23607c32966
$$ 85705 -292562 75639 -32280 243819 127462 27554 262594 37270 260877 -332966
12304a95347D44099F3206Q4431I368J60634K14225d3913B46130M7674E8575b92306
$$ -195347 444099 63206 147637 9368 170002 384227 -43913 246130 293804 58575 -292306
12292i3667B7876b82303A33903j8130b55122h640j70053f6443F6558A2541J45236
$$ -93667 27876 -282303 133903 115773 -255122 -8640 -178693 -66443 66558 12541 157777
12281A57777b74047B2826J8823M7542h8568C05330f3374C4209c3505B0713P4657
$$ 157777 -274047 22826 41649 89191 -88568 305330 -63374 34209 -33505 20713 95370
12270I5370i6331K5292j1017K5188A42999D0508J27435o9714K25192b52374a8232
$$ 95370 -96331 -71039 -82056 -56868 142999 40508 167943 98229 323421 -252374 -18232
12258e0300B82968n2290r9699K8610D7661L308a41957F9618J87076E6256e3299
$$ -50300 282968 230678 130979 159589 47661 50969 -141957 69618 256694 56256 -53299
12246B31713I6066Q6694A8721M5882b37300C26176c076I2419a39929E3336b4551
$$ 231713 96066 182760 18721 64603 -237300 326176 -3076 92419 -139929 53336 -24551
12234B07257e7716A17764n248K24438f0309b0738A17187A0696P0099i0276A46394
$$ 207257 -57716 117764 112516 336954 -60309 -20738 117187 10696 80795 -90276 146394
12222a30106A67929a2788j78123g7312B15815i8880C98108j04818J5624p7133
$$ -130106 167929 -12788 -190911 -77312 215815 -98880 398108 293290 308914 231781
12212B31781l0948p5776d6391I8824K03466N2103A8687K45800K59207j67433E4788
$$ 231781 200833 125057 -46391 98824 302290 354393 18687 264487 523694 356261 54788
12200D7152J0106L56255G60a3314A61729E1806j4382J6906r094c7530B35601J7759
$$ 47152 57258 413513 760 -13314 161729 51806 37424 54330 45236 -37530 235601 253360
12188B53360k2855m4768o9350R798a39685C6653L2460J56229m7719H7777K13101
$$ 253360 230505 185737 116387 126185 -139685 36653 69113 225342 177623 87777 300878
12177C00878B1956M16348f5503B42066k3450m685G3658N339K05153j37033g6548
$$ 300878 21956 438304 -65503 242066 218616 213931 73658 78997 284150 147117 -76548
12165A48178M2378B3164a06665J0061I4073A6654J39082c114F6119B7162J10219
$$ 148178 190556 23164 -106665 -96604 94073 16654 155736 -3114 66119 27162 137381
12154A37381M6610H7562n607a3755m9139A91471K1889R6886B9254P3989h6050
$$ 137381 183991 87562 81955 -13755 -62894 191471 213360 310246 29254 103243 -86050
12142b36043l93C94K90699g5114D01192B6945c4573C7101M12325a012A67705f0953
$$ -236043 -236436 394 291093 -75114 401192 26945 -34573 37101 449426 -1012 167705 -60953
12129C95752E7614K14647I8807b17992B0316c7253o0899r7064a2980E8017J9538
$$ 395752 57614 272261 98807 -217992 20316 -37253 -98152 -195216 -12980 58017 77555
12118G7555O4032a85736D9283b965k37666A35435a41093G3111h1333j20375I6948
$$ 77555 141587 -185736 49283 -2965 -240631 135435 -141093 73111 -81333 -201708 96948
12106A73812j2835N830b08236A60035B6849a9749j45477A06866a10659I3416K4107
$$ 173812 160977 166807 -208236 160035 26849 -19749 -165226 106866 -110659 93416 117523
12095A17523a65994A68615M5762A04770l6819k1796I221c999j76410o9225f1006
$$ 117523 -165994 168615 214377 104770 67951 46155 9221 -3999 -180409 -249634 -61006
12083A89576q8712h8005B56343c85452A07140a2986A46368n1489a46149A78357
$$ 189576 100864 -88005 256343 -385452 107140 -12986 146368 94879 -146149 178357
12072A40497g9384B29685j09005k3776j9040j2869J38723o9346h086A06712K5007
$$ 140497 -79384 229685 120680 96904 77864 64995 203718 134372 -8086 106712 131719
12061A31719L6664K75470O48383O0963n10344J5266B88747o4601g0129D147Q209
$$ 131719 168383 443853 1092236 1153199 642855 658121 288747 224146 -70129 4147 12356
12050A2356N546K44595G0757K01737a35917D3439O8451b4222B17322L9681i9436
$$ 12356 17902 262497 70757 272494 -135917 43439 111890 -24222 217322 257003 -99436
12038B12990B3239b02431A14473g3324L6574l3500A98172e25551A38064B0178
$$ 212990 23239 -202431 114473 -73324 -36750 -70250 198172 -525551 138064 20178
12027c0806A1523b37016B3114K72094h5608o219B16357f2113K2149m4269A37787
$$ -30806 11523 -237016 23114 295208 -85608 -91827 216357 -62113 -39964 -84233 137787
12015d4338m8324j56229C9542M0384b52540C18610j48983e1348B74339G3255c4495
$$ -44338 -92662 -248891 39542 79926 -252540 318610 169627 -51348 274339 73255 -34495
12003c5432j14105L237B466N8508c49969D20644I6711J12558R3785a12246C988
$$ -35432 -149537 -146300 2466 60974 -349969 420644 96711 209269 303054 -112246 3988
11991E9681j9692L84176D8152a0995G0133b60355J26492E7432J20521c12111G3097
$$ 59681 39989 424165 48152 -10995 70133 -260355 -133863 57432 177953 -312111 73097
11979b96232r4144E6217b77465E6222f9463F5231f497l1261p288k73737e6007
$$ -296232 -390376 56217 -277465 56222 -69463 65231 -6497 -37758 -45046 -318783 -56007
11967c61814a46356A05379D4036J41838a61321e4688A62711a93829A21120l9652
$$ -361814 -146356 105379 44036 185874 -161321 -54688 162711 -193829 121120 81468
11957H1468P3629a65628j07685H8117h3386c6368l5947A03916J85239a47390D5908
$$ 81468 155097 -165628 -273313 88117 -83386 -36368 -72315 103916 289155 -147390 45908
11945a55568o2167L4616H6143d2623A455J21314c7094H9809C4176d8443o385h552
$$ -155568 -217735 -183119 86143 -42623 1455 122769 -37094 89809 34176 -48443 -54828 -8552
11932f5992A8209a67616E4161a89354A95170K2572f301l07059g5078j27246f4118
$$ -65992 18209 -167616 54161 -189354 195170 217742 -6301 -313360 -75078 -202324 -64118
11920i4863N394d2031j25494l82029b43144L8194I8527b45352e6531j33748B15464
$$ -94863 -89469 -42031 -167525 -549554 -243144 -204950 98527 -245352 -56531 -190279 215464
11908C80548a45308j53935C03580j16296C5490K22233A23R1184O9470E2334J80302
$$ 380548 -145308 -299243 303580 187284 35490 257723 123 91307 160777 52334 232636
11897B32636F2631a39661I3743J05503A1835d071k03839A93865j7325d9751r3924
$$ 232636 62631 -139661 93743 199246 11835 -4071 -207910 193865 176540 -49751 -143675
11886a43675K7974H7858K5924m5458c6526o9570J3746r5277B48278b39859a097
$$ -143675 -115701 87858 113782 68324 -36526 -106096 -92350 -187627 248278 -239859 -1097
11874G1617c3799B41949A07844J17680F8255J50345J13413q3831a1779j3423k2950
$$ 71617 -33799 241949 107844 225524 68255 218600 332013 248182 -11779 -25202 -48152
11863d8152m4920o6747k99267b25190a1904l32834L2115N8594A58021b18076j74310
$$ -48152 -93072 -159819 -459086 -225190 -11904 -344738 -312623 -254029 158021 -218076 -392386
11852c92386A48724b14311r1576D0829K43346E7893Q5111J47109b68789A84047
$$ -392386 148724 -214311 -305887 40829 284175 57893 143004 290113 -268789 184047
11841A9041b89720B60430c72120e8576E3814b88159h7615A26672R23c29844a18317
$$ 19041 -289720 260430 -372120 -58576 53814 -288159 -87615 126672 127595 -329844 -118317
11829D2318b03518C11869a03215B3735g7194A05667F03J77936H2146f817F364
$$ 42318 -203518 311869 -103215 23735 -77194 105667 603 178539 82146 -6817 6364
11817F9870b8563E1268f7293B83140c25220E0868a60498L8258e7055j99914e091
$$ 69870 -28563 51268 -67293 283140 -325220 50868 -160498 -122240 -57055 -256969 -5091
11805A19231b84288A12909a7825r9694A44755g0653j59957R1679j679C93223b2747
$$ 119231 -284288 112909 -17825 -117519 144755 -70653 -230610 -138931 -140610 393223 -22747
11793c26670h5579L419j18579I7584a54554A56415A7088J5440a4795n7621H1576
$$ -326670 -85579 -82160 -200739 97584 -154554 156415 17088 32528 -14795 -72416 81576
11781a36985l02581F3394b04920A23097N8949j5789f9174A05701D7155j4961N6200
$$ -136985 -439566 63394 -204920 123097 182046 166257 -69174 105701 47155 32194 88394
11770H8394a12539A31289E9263J99909c45186O2665E7387b02209K7702A60158
$$ 88394 -112539 131289 59263 259172 -345186 -282521 57387 -202209 -174507 160158
11759C21176p5512p5258p3777b34048h5373d1970C5827M9727O5901n4937i3250
$$ 321176 245664 170406 96629 -234048 -85373 -41970 35827 85554 151455 96518 -93250
11747d4445j35313g3750B60983j27214F1513j941a26851A83074a1953j28564D11729
$$ -44445 -179758 -73750 260983 133769 61513 59572 -126851 183074 -11953 -140517 411729
11735A617b3412n9768A8041J97071a31516q3272Q3381l2281e4180B8740O1487
$$ 1617 -23412 -83180 18041 215112 -131516 -214788 -131407 -163688 -54180 28740 90227
11724I0227K8620L0787e3074I28J09449D0488P4696K98241j03557c42663A69157
$$ 90227 118847 149634 -53074 928 110377 40488 115184 413425 309868 -342663 169157
11712a39759L4439A759h4794r7369B6569J39912K9140e2990A16206E6011P5646
$$ -139759 -105320 1759 -84794 -182163 26569 166481 195621 -52990 116206 56011 131657
11701A31657B3061a67475A81438Q4582e9693B1535L0969M8639a38076o8583e6993
$$ 131657 23061 -167475 181438 266020 -59693 21535 52504 101143 -138076 -206659 -56993
11689E4479J89269I5434j383a05295A4155L568g5602A46581m4578D4706R9241
$$ 54479 243748 95434 94051 -105295 14155 17723 -75602 146581 102003 44706 143947
11678A43947J23769b18706F4456a60856j369g9074D58702j40540a45658A91116
$$ 143947 267716 -218706 64456 -160856 -162225 -79074 458702 318162 -145658 191116
11667b8734B86342C6968a16562D24919G4872c8233A71010G3691c05262K4910H6689
$$ -28734 286342 36968 -116562 424919 74872 -38233 171010 73691 -305262 -280352 86689
11655B0727L94434b30669A70856i121F853a77779f4594D15155A30839a31865H3725
$$ 20727 415161 -230669 170856 -9121 6853 -177779 -64594 415155 130839 -131865 83725
11643A27896e8809j33643B92088b71312A97640g7569A62658E7774J92329a62429
$$ 127896 -58809 -192452 292088 -271312 197640 -77569 162658 57774 250103 -162429
11632c6452j73646E2502k4211j1252a17044l6892A4351b45263A28194c73495E35424
$$ -36452 -210098 52502 28291 17039 -117044 -153936 14351 -245263 128194 -373495 535424
11620g214k5540B7722h0806A28327e6776o0029D6245a33157K791B2794L04103
$$ -7214 -32754 27722 -80806 128327 -56776 -116805 46245 -133157 -130366 22794 326897
11609C26897c27B17477A5742O9691J1670a19640j0607b6983H2731c505B55549
$$ 326897 -327 217477 15742 85433 97103 -119640 -130247 -26983 82731 -3505 255549
11597F5092P3330m2952m5063b7051r7056D4333R0561a44215K987J2106C30412
$$ 65092 138422 95470 50407 -27051 -124107 44333 134894 -144215 -141228 -129122 330412
11585e00165B67495J83655G7496k3633j6230e369D07575G3156J72439Q1485A54034
$$ -500165 267495 451150 77496 53863 37633 -5369 407575 73156 245595 327080 154034
11573C00728a17913A67356i1885p9543A15015K11972A53532k2519k1746Q3543
$$ 300728 -117913 167356 -91885 -171428 115015 326987 153532 131013 109267 192810
11563A92810E3723J43208N2761q8879L02306D9709L57442g4043A18308e2921A62809
$$ 192810 53723 196931 249692 160813 463119 49709 407151 -74043 118308 -52921 162809
11551B29029C3717h5117j91412C35659A11919L33216J44689A79140F9543O988
$$ 229029 33717 -85117 -276529 335659 111919 445135 589824 179140 69543 76531
11541G6531i9399j75610B97523c3270B68159A13313g44j28748l7184A6082l721
$$ 76531 -99399 -275009 297523 -33270 268159 113313 -744 -129492 -166676 16082 12361
11530A2361d5409A8692L02472a9296C4529J68693b06551R7545A71651J7971A2157
$$ 12361 -45409 18692 321164 -19296 34529 203222 -206551 -109006 171651 189622 12157
11518a00260D6284j2100L37658h4172a1919F1743Q1868J337e6568B62658J29156
$$ -100260 46284 34184 371842 -84172 -11919 61743 143611 144948 -56568 262658 391814
11507C91814G4857h632I97a57635h706A22314m4738P888R9390a78785D94186A8101
$$ 391814 74857 -8632 997 -157635 -8706 122314 77576 85464 184854 -178785 494186 18101
11494B0217M9913L0740A6067c8254A54093l7487N0933a55234E3095M3677c97882
$$ 20217 70130 100870 16067 -38254 154093 116606 167539 -155234 53095 96772 -397882
11482A60350p6728L47313G2701P6603J18974f5101m7093A95390L6692J4293o3377
$$ 160350 83622 430935 72701 149304 268278 -65101 -112194 195390 232082 246375 182998
11471A82998J62600H0067K88506a83967A13548a36130A91816e5625k43232C20150
$$ 182998 345598 80067 368573 -183967 113548 -136130 191816 -55625 -298857 320150
11460A36043f3480A74131p8511N9297M4522m1970J58884n6903j08266m4886L00284
$$ 136043 -63480 174131 95620 154917 199439 157469 316353 259450 151184 106298 406582
11449D06582j69894j13247n3793K0274A8025J04184J78035p2263l130A07296a64890
$$ 406582 236688 123441 69648 89922 18025 122209 300244 227981 224851 107296 -164890
11437a09307F771f3448a3466B33681l81K14380D5698a8357q3315I7237O2864l410
$$ -109307 6771 -63448 -13466 233681 233300 447680 45698 -18357 -101672 97237 160101 156691
11425A56691j7128h3124A79429l4859a32245D88223b4860C57478a00319C12825
$$ 156691 139563 -83124 179429 144570 -132245 488223 -24860 357478 -100319 312825
11414F9308C3744d6354A42539c820J251F7907b64566F1081K30210k2720j8325
$$ 69308 33744 -46354 142539 -3820 -2569 67907 -264566 61081 291291 268571 250246
11403B50246F9054j2797R1233K651q134d5087o0104H8015j8091l1805J52069a38013
$$ 250246 69054 56257 147490 150141 142007 -45087 -105191 88015 69924 38119 190188 -138013
11390e2226k77696a23821l30647A80976l0739K65996B9767L2079j8038b91711
$$ -52226 -329922 -123821 -454468 180976 150237 416233 29767 61846 43808 -291711
11379B61032A24171b2750j74299Q00d7896A8512J7142b11531j68716b8996A48362
$$ 261032 124171 -22750 -197049 -196249 -47896 18512 35654 -211531 -380247 -28996 148362
11367A0939h9234j50855O209a11968F3763I956J46183K568m1682P9387o2584E5610
$$ 10939 -89234 -240089 -233880 -111968 63763 9956 156139 158707 117025 196412 133828 55610
11354C38129A20198a76428b9349F0860Q3857d22788a49679f0423B78428b92234
$$ 338129 120198 -176428 -29349 60860 144717 -422788 -149679 -60423 278428 -292234
11343a44278H0289a95760N1116q5352Q2535m2588A39931N1015a90034F6170g6168
$$ -144278 80289 -195760 -144644 -229996 -147461 -190049 139931 190946 -190034 66170 -76168
11331I1804e825C9702K21742b90765B46125h622B5094M1038J7124a59842g5886
$$ 91804 -5825 39702 261444 -290765 246125 -8622 25094 66132 83256 -159842 -75886
11319A95491b73038J28861f0522a6457o3316m38B31721b90111a6836G685O0693
$$ 195491 -273038 -144177 -60522 -16457 -79773 -80211 231721 -290111 -16836 7685 68378
11308F8378e521I6283L217e0423A8911K09518h580k33781l4441a16616d7349G0574
$$ 68378 -5521 96283 99500 -50423 18911 228429 -8580 -242361 -276802 -116616 -47349 70574
11295i5521A65827m6430a17015o0646A38599i3178D9308d5315n48804d2557F6687
$$ -95521 165827 119397 -117015 -177661 138599 -93178 49308 -45315 -594119 -42557 66687
11283a30548j9182C504g6838k65032d87k22828A81086b25897J1546j5316f0962
$$ -130548 -149730 3504 -76838 -341870 -487 -223315 181086 -225897 -214351 -229667 -60962
11271e8820j16095A5330J25032a58472C5071c98592I0538B2229b02255A78683
$$ -58820 -174915 15330 140362 -158472 35071 -398592 90538 22229 -202255 178683
11260G5679b9930D4058i9397j51046g4264q162j25579C63131A51664d15515J35873
$$ 75679 -29930 44058 -99397 -250443 -74264 -82426 -208005 363131 151664 -415515 -279642
11249b79642G661b40944M4991c7679l6306A2295b72905A51970c8328l14940d0534
$$ -279642 7661 -240944 -195953 -37679 -73985 12295 -272905 151970 -38328 -353268 -40534
11237c2944B02218i787K195n5982I863b30815B482M1309c38901B72313f2594F1290
$$ -32944 202218 -9787 -7592 -63574 9863 -230815 2482 43791 -338901 272313 -62594 61290
11224b55994A5445J19397c01093A04764n235h4380B71449g7431o9992d9271k08810
$$ -255994 15445 134842 -301093 104764 99529 -84380 271449 -77431 -147423 -49271 -258081
11213b58081e6844n6166A790Q4103a9732A43905l7917c0444j31897g6385g945
$$ -258081 -56844 -113010 1790 85893 -19732 143905 105988 -30444 -162341 -76385 -7945
11201a70337I8362f6166a3567A28024J69017m6228D218a12779A20494i9601D4732
$$ -170337 98362 -66166 -13567 128024 297041 250813 4218 -112779 120494 -99601 44732
11189d1805G0810g0084D5764e2146D1690a38479A83923a57016I8693b87503K7936
$$ -41805 70810 -70084 45764 -52146 41690 -138479 183923 -157016 98693 -287503 -259567
11178b59567J15464B59202H0908a24928n4989I0966a43711G5563K8849c71088
$$ -259567 -144103 259202 80908 -124928 -179917 90966 -143711 75563 104412 -371088
11167D6251b13951i2907l0820C84421c3678A13314J44266G3041c00793j39244
$$ 46251 -213951 -92907 -123727 384421 -33678 113314 257580 73041 -300793 -440037
11157d40037a9965j05772N8939k31304H4229Q5685j0116o4639J79389g3052B25290
$$ -440037 -19965 -125737 -66798 -298102 84229 169914 159798 95159 274548 -73052 225290
11145A67720H1944j6846c0453B7595b1095A92869b44451I9318b32978e7279A93408
$$ 167720 81944 65098 -30453 27595 -21095 192869 -244451 99318 -232978 -57279 193408
11133b16537d3423j61650Q4456a3652r0994A90899b46448e2523A17176L11633
$$ -216537 -43423 -205073 -120617 -13652 -104646 190899 -246448 -52523 117176 428809
11123D28809D9464J30339R0718c4458j60520F0279J59034a64131C1501J09893
$$ 428809 49464 179803 270521 -34458 -194978 60279 219313 -164131 31501 141394
11113A41394a35227B56568b7857m9028j89143A59004c5203E3835J78866a86992
$$ 141394 -135227 256568 -27857 -76885 -266028 159004 -35203 53835 232701 -186992
11102b051k06337I9586i0511A03345k9877A726a08148b5767H3876K5787i4551
$$ -2051 -208388 99586 -90511 103345 73468 1726 -108148 -25767 83876 109663 -94551
11090I1897D442L10321A48190J29890d9752A34708K81433k07819K5750c37034
$$ 91897 4442 314763 148190 278080 -49752 134708 416141 208322 234072 -337034
11079b14992C11385G2249O497R3556J07764j36592F3388K347L47824A65090L06866
$$ -214992 311385 72249 78746 172302 280066 143474 63388 65735 413559 165090 471956
11068D71956K8922L1121A98072K50059b30347C76554K00494a37867j17408b07
$$ 471956 500878 531999 198072 448131 -230347 376554 577048 -137867 -255275 -207
11057B87705N5974P462M5405o6520H2211K21137r6867o394J45722j14193M066
$$ 287705 343679 351141 396546 330026 82211 303348 206481 200087 345809 231616 235682
11046B35682R6q3184L22849J14847j54983M1630J66257j34811Q7842R8636L7063
$$ 235682 235778 152594 475443 590290 435307 476937 643194 508383 596225 694861 731924
11035G31924q394J5223R2400m03171J42104K82822j66907J38257j89728j90065
$$ 731924 723530 738753 831153 427982 570086 852908 686001 824258 634530 444465
11025D44465J77567M04279E02512Q6161L87120l9145k53963J08378P7565r7715
$$ 444465 622032 1026311 502512 588673 975793 936648 682685 791063 868628 770913
11015G70913J2178j91353l9975J51353j61793B28874L41142J7117j15915K85165
$$ 770913 783091 591738 551763 703116 541323 228874 570016 587133 471218 756383
11005G56383k11386J821A65562P18996j3899l18516K9981m5824j4701J92735j39782
$$ 756383 544997 546818 165562 884558 870659 552143 582124 536300 521599 714334 574552
10994E74552j75653O4926K03509J54184C57388J12464M1100J85467j82043k1638
$$ 574552 398899 463825 667334 821518 357388 469852 510952 696419 514376 492738
10984D92738J04919L08911k34412k0204Q6042O0507N9055j84186K330K37428q2867
$$ 492738 597657 906568 672156 651952 737994 798501 857556 673370 675700 913128 830261
10973H30261m4754j10020K52831p9080p1637L80159l26533J88080j0026K34841
$$ 830261 785507 675487 928318 849238 777601 1157760 831227 1019307 1009281 1244122
10963A244122K29133k3266K05326K58791R0799K59270M78285k79644J18885l4494
$$ 1244122 1473255 1449989 1655315 1914106 2004905 2264175 2742460 2462816 2581701 2547207
10953B547207k30835Q5866l83656j49374K95605j32571K66034m24349L27867n01428
$$ 2547207 2316372 2402238 2018582 1869208 2164813 2032242 2298276 1873927 2201794 1700366
10943A700366K16473j16561j18023L25215m10893r1723j61937j80088k87683L0363
$$ 1700366 1916839 1800278 1682255 2007470 1596577 1504854 1342917 1162829 875146 905509
10933I05509j60573q4670k2885k2146j98093L7667r2806I1528M22677k05794L70375
$$ 905509 744936 660266 637381 615235 417142 454809 362003 91528 514205 308411 678786
10922F78786k74728j59181L81881B57362B2811b9796A36936B3647N8032a25603
$$ 678786 404058 244877 626758 257362 22811 -29796 136936 23647 81679 -125603
10911B80243j28504b05703B2952Q5568e9502H1897l9659K35325b37703I9934e1640
$$ 280243 151739 -205703 22952 108520 -59502 81897 42238 277563 -237703 99934 -51640
10899H4866L1364b86347B18917b38141i3108N188A96545b93726c8386j51391G232
$$ 84866 116230 -286347 218917 -238141 -93108 -87920 196545 -293726 -38386 -189777 7232
10887B32671l2853Q3771Q4521H0237b6853A83922a47124o1520A9197c5814M594
$$ 232671 199818 283589 368110 80237 -26853 183922 -147124 -208644 19197 -35814 -31220
10876c1220a0554A18563h96A59912C351b2765I7497K1038a05044C42374A36149
$$ -31220 -10554 118563 -896 159912 3351 -22765 97497 118535 -105044 342374 136149
10864d00311a31513r0945f9391p398C01985f9780j84069j19584e8911B26930b92497
$$ -400311 -131513 -222458 -69391 -76789 301985 -69780 -253849 -373433 -58911 226930 -292497
10852g7521A77923q5463R5264d1481B35609r2545a55970C7877p286K2970K15713
$$ -77521 177923 92460 187724 -41481 235609 143064 -155970 37877 30591 53561 269274
10841B69274c5954a3702C7282a45993j78356Q9909F6752a03119A13495a17935
$$ 269274 -35954 -13702 37282 -145993 -324349 -234440 66752 -103119 113495 -117935
10830A51888i9096A83256a62608A29342J89877b08804f3713J2895B50884E8251
$$ 151888 -99096 183256 -162608 129342 319219 -208804 -63713 -50818 250884 58251
10819f9131D12345C1746a49807j32107I5528J47804h2308I5723a4433I2320b35443
$$ -69131 412345 31746 -149807 -281914 95528 243332 -82308 95723 -14433 92320 -235443
10807a96186e2427A43118E9888a10576B54131D8009b48735e2469A64463B4082
$$ -196186 -52427 143118 59888 -110576 254131 48009 -248735 -52469 164463 24082
10796D4203K03004g3238B5607P0300F972a75491r6316Q8134J4354j56812A29263
$$ 44203 247207 -73238 25607 95907 6972 -175491 -271807 -183673 -169319 -326131 129263
10784f6828n6061p0416M7644A27442F1979J87861j19482i8681A20280c00316A80277
$$ -66828 -122889 -193305 -145661 127442 61979 249840 130358 -98681 120280 -300316 180277
10772c2804C32075b547r4414c6975l16200g0789A7068a75775j79404A37623e8562
$$ -32804 332075 -2547 -96961 -36975 -353175 -70789 17068 -175775 -355179 137623 -58562
10760A93190d4525o5375B7875b07256A8347O3934J29987k47H5283a97645R4122
$$ 193190 -44525 -109900 27875 -207256 18347 82281 212268 212021 85283 -197645 -103523
10749a03523I5366b01273b1765j80038C4544h5171A50086A9165e53l22867J09214
$$ -103523 95366 -201273 -21765 -201803 34544 -85171 150086 19165 -553 -323420 -214206
10738b14206h1697o80j10373i4659l181B8451a19283N1452h591m2859m8879H32
$$ -214206 -81697 -82377 -192750 -94659 -97840 28451 -119283 -67831 -8591 -51450 -100329 832
10725a11174l5776O6380B48538i7586A02192a51787j04174A79833G4321a21191
$$ -111174 -146950 -80570 248538 -97586 102192 -151787 -255961 179833 74321 -121191
10714a04388l2087l4271c562j20059R050A94068a81706A61825d781j96238H2195
$$ -104388 -136475 -170746 -3562 -123621 -114571 194068 -181706 161825 -4781 -201019 82195
10702H38f5141H2627A3778a94421L9099D1921K7593M9728a76575B99846e0329
$$ 838 -65141 82627 13778 -194421 -155322 41921 69514 119242 -176575 299846 -50329
10690A96970f24907a76531A972K44162h4004A61947D7173N2754A9806l440Q453
$$ 196970 -624907 -176531 1972 246134 -84004 161947 47173 99927 19806 16366 24819
10679B4819a19638A81553a02866M7635j5280D569J45454B0799L9940b60717A178
$$ 24819 -119638 181553 -102866 -55231 -70511 4569 150023 20799 60739 -260717 1178
10667c29572g5733k53569a49314H9281J5156a25260Q884e7103j31205I2395N3444
$$ -329572 -75733 -329302 -149314 89281 104437 -125260 -116376 -57103 -188308 92395 145839
10656A45839B8249F904a57545L3776B05659c19123P9504a05377l9241F5029d07494
$$ 145839 28249 6904 -157545 -123769 205659 -319123 -239619 -105377 -144618 65029 -407494
10644A04807a80538d1708B15125E8133L1710b8800k71030e3948l28647C21452
$$ 104807 -180538 -41708 215125 58133 89843 -28800 -299830 -53948 -382595 321452
10633A0949i1702j11207r6105J32755G9408b15755A02300g1561j1968r4141j49530
$$ 10949 -91702 -202909 -299014 -166259 79408 -215755 102300 -71561 -83529 -177670 -327200
10622c27200K2871a11153A20991n5156g952j20427c5610p9456a1376j05925m673
$$ -327200 -304329 -111153 120991 65835 -7952 -128379 -35610 -115066 -11376 -117301 -121974
10611a21974B17084m2985L8050c15208a00663k31406C38953a1186A51653J3817
$$ -121974 217084 174099 212149 -315208 -100663 -332069 338953 -11186 151653 165470
10601A65470c34558f3676C58132a18586A78840G6209P7632b09593Q1846K0352
$$ 165470 -334558 -63676 358132 -118586 178840 76209 153841 -209593 -127747 -107395
10591a07395A04319b46371g066k24320j77978A0176c5630j37761O6027o549H3302
$$ -107395 104319 -246371 -7066 -231386 -409364 10176 -35630 -173391 -107364 -113913 83302
10579d2911k0955A80797a61579C25641a9856n4678L0636b0854k81850a12121B14930
$$ -42911 -63866 180797 -161579 325641 -19856 -74534 -43898 -20854 -302704 -112121 214930
10567H8126h0159K3962A22246N2964a77297N2170k9161B9795K6374N7948d1935
$$ 88126 -80159 -56197 122246 175210 -177297 -125127 -154288 29795 56169 114117 -41935
10555i013C549a93995G808A91M6960K39843a71777K9193A21590b65758d6355I9196
$$ -9013 3549 -193995 7808 191 47151 286994 -171777 -142584 121590 -265758 -46355 99196
10542e0160l3614q9449k42822K07118e6803m0294B33335i9640A9675d7873B61706
$$ -50160 -83774 -173223 -416045 -208927 -56803 -97097 233335 -99640 19675 -47873 261706
10530g2756j73456A37555b6864l52093A04240i758m4426m14381A99706D6906K10973
$$ -72756 -246212 137555 -26864 -378957 104240 -9758 -54184 -468565 199706 46906 257879
10519B57879K9159a07751j77042a29656G6481J2751o083k9996O5931M3258F2860
$$ 257879 287038 -107751 -284793 -129656 76481 89232 83149 53153 119084 162342 62860
10507a87707A58018p485j5970b00755f0363j12664G6397b52733P6462D702a64749
$$ -187707 158018 150533 134563 -200755 -60363 -173027 76397 -252733 -176271 4702 -164749
10495h7458j7068j84046i3066I1484c84848e556j10018j48013c0583A45792D2977
$$ -87458 -104526 -288572 -93066 91484 -384848 -5556 -115574 -263587 -30583 145792 42977
10483a27802q5879f8889P203B38394b0055C3687L81516a13539k98274h0673j26366
$$ -127802 -213681 -68889 -61686 238394 -20055 33687 415203 -113539 -411813 -80673 -207039
10472b07039R6321A7668c0421j15836q0367D29380j06866R6978p9701L13338B37231
$$ -207039 -110718 17668 -30421 -146257 -226624 429380 322514 419492 339791 653129 237231
10460A12422M6177r175G859b72339C20081g4445B3042b34297j83062a31666j51997
$$ 112422 158599 149424 7859 -272339 320081 -74445 23042 -234297 -417359 -131666 -283663
10449b83663I4934e864A99731L7251H3712e3856p2756B0906L707K79376a85351
$$ -283663 94934 -5864 199731 236982 83712 -53856 -126612 20906 24613 303989 -185351
10437C36920a30586Q36B02749p5543b7250d645F1438J9070A7534b63210B59000
$$ 336920 -130586 -129750 202749 127206 -27250 -4645 61438 80508 17534 -263210 259000
10425A23019D6389K20279m5204E3296j1626d22008a26391k60795a63695c1676
$$ 123019 46389 266668 221464 53296 41670 -422008 -126391 -387186 -163695 -31676
10414a51648C5172a4108n9952j26343k99785A00586b9250B07013A923f9713r9841
$$ -151648 35172 -14108 -74060 -200403 -500188 100586 -29250 207013 1923 -69713 -169554
10403a69554B1315f0315l3481j3913j3614A9115a33159b827H2585a27951A2370
$$ -169554 21315 -60315 -93796 -107709 -121323 19115 -133159 -2827 82585 -127951 12370
10391A77492f3498q9401A73531j7512a86164D3514a39012E4193b7216k98715A33753
$$ 177492 -63498 -152899 173531 156019 -186164 43514 -139012 54193 -27216 -325931 133753
10379a46326F7770Q4047c7489D90571A41860b131A31586J408J1751C7224f0245
$$ -146326 67770 151817 -37489 490571 141860 -2131 131586 132994 144745 37224 -60245
10367B76136o5439o1196l1898R7267k3965J42704M7520A06924f9518F16455j94723
$$ 276136 210697 149501 117603 214870 190905 333609 381129 106924 -69518 616455 421732
10356D21732A94235N7090M0094K9786K04263k5824k47283K79375j95076j48798
$$ 421732 194235 251325 291419 321205 525468 499644 252361 531736 336660 187862
10346A87862J07071J41206H2420l351L24148D1960a8785D279M8468N91040j95223
$$ 187862 294933 436139 82420 79069 403217 41960 -18785 4279 52747 643787 448564
10335D48564K92071n697l63667o4384L68546G9003M73455q1710A38569K41973
$$ 448564 740635 734938 371271 306887 675433 79003 552458 470748 138569 380542
10325C80542R9529G9505K81719j20513k9274D7184a09154G4938L19657C2621P0649
$$ 380542 480071 79505 361224 240711 211437 47184 -109154 74938 394595 32621 103270
10314A03270R385M2331D6040M535J57772J52142a24314A88054L63742b7997H9803
$$ 103270 112655 154986 46040 50575 208347 360489 -124314 188054 551796 -27997 89803
10302D4633M864j2374R1537P6089H139a1312E7671A2127c6159B06531J817M1032
$$ 44633 49497 37123 128660 204749 8139 -11312 57671 12127 -36159 206531 208348 249380
10290B49380a91551d7215j3082a581k13593L1921h9048A40593h5778B92994c25293
$$ 249380 -191551 -47215 -60297 -1581 -215174 -183253 -89048 140593 -85778 292994 -325293
10278A83507A742J09475N0318K7253j1413N1415H2405Q6918e5925j31614B57967
$$ 183507 1742 111217 161535 188788 177375 228790 82405 169323 -55925 -187539 257967
10266a49117H918a77255H3618c3238J6020A2662b66827G988h5928j80164f5875
$$ -149117 8918 -177255 83618 -33238 -17218 12662 -266827 7988 -85928 -266092 -65875
10254c2971r033I7230a6013A73239M4368H6250d204C81626o5066m1940j07810
$$ -32971 -42004 97230 -16013 173239 217607 86250 -4204 381626 316560 274620 166810
10243A66810Q7020J15634N3006j12767A44723e9705C01249f8142G3986M3215b72232
$$ 166810 253830 369464 422470 309703 144723 -59705 301249 -68142 73986 117201 -272232
10231i34q0344r2878f0305A13471B9260K26786B8709J63810B5387j2370P1273
$$ -934 -81278 -174156 -60305 113471 29260 256046 28709 192519 25387 13017 84290
10220H4290a09909E9884i9600l0554A8044D729a61707B24624c2712k33439E2974
$$ 84290 -109909 59884 -99600 -130154 18044 4729 -161707 224624 -32712 -266151 52974
10208H938b65961A04368e4414D0718b17459f0686H6668D0875J20364i4351A84143
$$ 8938 -265961 104368 -54414 40718 -217459 -60686 86668 40875 161239 -94351 184143
10196a93198C3875d4658I1130a16310D0186a05619J8225B03662e0150k06005D4749
$$ -193198 33875 -44658 91130 -116310 40186 -105619 -87394 203662 -50150 -256155 44749
10184A23429c50472H3322b43546D823M9648g061k3299j00679J410j28550h7486
$$ 123429 -350472 83322 -243546 4823 54471 -7061 -30360 -131039 -129629 -258179 -87486
10172I5270g3279j65261R6895k0346N2111j57016a18788A22248a30200J0716j54078
$$ 95270 -73279 -238540 -141645 -161991 -109880 -266896 -118788 122248 -130200 -119484 -273562
10161b73562A65437a96761c3884j87047i9149a511j24136O628M1397j68517O4571
$$ -273562 165437 -196761 -33884 -220931 -99149 -1511 -125647 -119019 -77622 -246139 -181568
10150a81568P8953j73154h0593b5859l2130l60936a45932C01588c43485a22115
$$ -181568 -102615 -275769 -80593 -25859 -57989 -418925 -145932 301588 -343485 -122115
10139F315a99728h0504L8360l12358a25815H5934f3997G8379J91903b18143j37372
$$ 6315 -199728 -80504 -42144 -354502 -125815 85934 -63997 78379 270282 -218143 -355515
10128c55515g5920B8496a69523l8090B1188L58409c21902P1327i8426M5647j75957
$$ -355515 -75920 28496 -169523 -207613 21188 379597 -321902 -250575 -98426 -52779 -228736
10117b28736E2905R3803b12994A04682c48746R0921A21189e40024A65368a28223
$$ -228736 52905 146708 -212994 104682 -348746 -257825 121189 -540024 165368 -128223
10106A47691f3780j76911A34888B7262j31P159b09710B7597h145k5113q4511N8236
$$ 147691 -63780 -240691 134888 27262 27131 34290 -209710 27597 -8145 -33258 -117769 -59533
10094e9533I3772c7487A5804b49849i7124a994m7557j86422g3758C15117a22988
$$ -59533 93772 -37487 15804 -249849 -97124 -1994 -49551 -235973 -73758 315117 -122988
10082A14735e5283A2618J95781A04152g161H1761b09086G7403J4263h6181j0045
$$ 114735 -55283 12618 208399 104152 -7161 81761 -209086 77403 91666 -86181 -96226
10071i6226A08530b58621r3986A11718J59697a28149d7269J598k33264C65327
$$ -96226 108530 -258621 -352607 111718 271415 -128149 -47269 -45671 -278935 365327
10060G6082B0112b41093e8949B38368e817A51595p1408l5349c40051A30002m06
$$ 76082 20112 -241093 -58949 238368 -5817 151595 80187 44838 -340051 130002 129596
10049A29596c9199o8440A07868D6086b79850a08371A0492g8796n3718E2088k5429
$$ 129596 -39199 -107639 107868 46086 -279850 -108371 10492 -78796 -132514 52088 26659
10038B6659g0195A65333a4834l53874a3025j05015A25439a48569j79561e7871
$$ 26659 -70195 165333 -14834 -368708 -13025 -118040 125439 -148569 -328130 -57871
10027E4665i8642A59759a13878A19016b05618j90082c3816k99836g2977k91264
$$ 54665 -98642 159759 -113878 119016 -205618 -395700 -33816 -333652 -72977 -364241
10017c64241B04071h9196k36115A92355q0826J52388b07916I0298f932E3126J87014
$$ -364241 204071 -89196 -325311 192355 111529 263917 -207916 90298 -6932 53126 240140
10006B40140a42661L2137j70435A08615J54499F9784J8094L082g6026l6680B1899
$$ 240140 -142661 -110524 -280959 108615 263114 69784 87878 90960 -76026 -112706 21899
9994e8732j44399B02998a32659j0986j68742G3028h7654l6846M3576A56231g4325
$$ -58732 -203131 202998 -132659 -143645 -312387 73028 -87654 -124500 -80924 156231 -74325
9982e7444a0948j52475K9385B45500K4724d46541A12067m4952R5851b8266C9955
$$ -57444 -10948 -163423 -134038 245500 270224 -446541 112067 67115 162966 -28266 39955
9970A60165a96471d5639j94780c957C5018K78069F9607O690l7139a08390M4223
$$ 160165 -196471 -45639 -240419 -3957 35018 313087 69607 76297 39158 -108390 -64167
9959f4167o0001j91301l3132A94933b40685c020k83798g0407j0099J2513A17828
$$ -64167 -124168 -315469 -348601 194933 -240685 -3020 -286818 -70407 -80506 -67993 117828
9947F546e663A54547b01491M7775I4698a63027j64035a07255p5795b6620q7159
$$ 6546 -5663 154547 -201491 -153716 94698 -163027 -327062 -107255 -183050 -26620 -113779
9936a13779r9390J03134H1378c60848d495r2191H415O7227i658n6057r3343J78
$$ -113779 -213169 -110035 81378 -360848 -4495 -96686 8415 75642 -9658 -65715 -159058 -158880
9924a58880A15332J20552a18073j9156k06247b5387A21803c02740k9519A14425
$$ -158880 115332 235884 -118073 -137229 -343476 -25387 121803 -302740 -332259 114425
9913I8852a57704l5932Q6367l64088a83468A8584f8097E7213a10628A51210g8121
$$ 98852 -157704 -193636 -107269 -471357 -183468 18584 -68097 57213 -110628 151210 -78121
9901f4099o68j56268e8863C73630c08940a18927A14511g53l37603a61099q4938
$$ -64099 -64767 -221035 -58863 373630 -308940 -118927 114511 -753 -338356 -161099 -246037
9890b46037A35930a31998i560E7536a41068d8600D8861a06457j91318R5311B34064
$$ -246037 135930 -131998 -9560 57536 -141068 -48600 48861 -106457 -297775 -202464 234064
9878d09625F7633b21496A5392g3280j94873B48995G7L7957c12057O9600i9577
$$ -409625 67633 -221496 15392 -73280 -268153 248995 77 38034 -312057 -242457 -99577
9866a25531j95341h6025A47590K7253j5330A6391N94206A19704b46066C6377h2151
$$ -125531 -320872 -86025 147590 174843 159513 16391 610597 119704 -246066 36377 -82151
9854C0984d95507B70848c32738J11742j27274c5324H4312a70600J0280A00985
$$ 30984 -495507 270848 -332738 -220996 -348270 -35324 84312 -170600 -160320 100985
9843d08058G343c64515i4425o9241J4416A33210m0027b6670q1992A18834e4793
$$ -408058 7343 -364515 -94425 -163666 -149250 133210 93183 -26670 -108662 118834 -54793
9831e3385B060K04107a43628B63410a00174k35413e1153K1587j41143f0109B34416
$$ -53385 2060 206167 -143628 263410 -100174 -335587 -51153 -29566 -170709 -60109 234416
9819E8194g9117L5775D4615G154a22880d3319G4734K56488b27191F9002O1127
$$ 58194 -79117 -43342 44615 7154 -122880 -43319 74734 331222 -227191 69002 130129
9808A30129a62670a872r4240I5776c7843F8419K852f2615l87623D652a18571j00527
$$ 130129 -162670 -1872 -96112 95776 -37843 68419 71271 -62615 -450238 4652 -118571 -219098
9796b19098a05065C1978J12188b65269A47793B6421A0385J93367G869c49466A85600
$$ -219098 -105065 31978 144166 -265269 147793 26421 10385 203752 7869 -349466 185600
9784B7633c52239A7795d0727o3662l5233e2633b0841j6404j41431b456G2335a3417
$$ 27633 -352239 17795 -40727 -104389 -139622 -52633 -20841 -37245 -178676 -2456 72335 -13417
9771a01890r1372l52151A89458i6370A5957R5503g5669A11447a69595I0508e6493
$$ -101890 -193262 -545413 189458 -96370 15957 111460 -75669 111447 -169595 90508 -56493
9759A29170a47986j06062e2171E9705c02527e0959o3320k68897A0244J76587A4223
$$ 129170 -147986 -254048 -52171 59705 -302527 -50959 -114279 -383176 10244 186831 14223
9747a00638o4151l85139i6725B21813g0181j1553A59697a85582o3215j7085a4079
$$ -100638 -164789 -549928 -96725 221813 -70181 -81734 159697 -185582 -248797 -265882 -14079
9735B7095e6077j1350m9553k3717K5500M5973b5470B18094a27635r8383d7395
$$ 27095 -56077 -67427 -116980 -140697 -115197 -69224 -25470 218094 -127635 -226018 -47395
9723a09178k67017h4105l02724q1260f1704p1571A52951h3369A8480p905a11150
$$ -109178 -376195 -84105 -386829 -468089 -61704 -133275 152951 -83369 18480 10575 -111150
9711I9827D9394a53522k63168J23525A00061a87794O9797C4602c73443c7153k52429
$$ 99827 49394 -153522 -416690 -293165 100061 -187794 -117997 34602 -373443 -37153 -289582
9700b89582b8729q1123A46996l1811a05531o8661A8828a31826h592k7947E6424
$$ -289582 -28729 -109852 146996 115185 -105531 -174192 18828 -131826 -8592 -36539 56424
9688I3658h5045m6486q8L2695k386l21472q0979B49603h3464K5089B85155E5131
$$ 93658 -85045 -131531 -131619 -98924 -101310 -422782 -503761 249603 -83464 -58375 285155 55131
9675a61732b7956k2864A2385c25173P2886A53923c2172j30074O6204L7737D2434
$$ -161732 -27956 -50820 12385 -325173 -252287 153923 -32172 -162246 -96042 -58305 42434
9663B21915a1394H8631a70633a9206p3674K9463q7579M3311D30689d4988A53667
$$ 221915 -11394 88631 -170633 -19206 -92880 -63417 -150996 -107685 430689 -44988 153667
9651b17659N2498B29507e1973L941j60850D9083a74669P8276A84573I503a00148
$$ -217659 -165161 229507 -51973 -48032 -208882 49083 -174669 -96393 184573 9503 -100148
9639a01508D8870e80713a66690A09976D6554a11190D4748J58236c35391Q0544
$$ -101508 48870 -580713 -166690 109976 46554 -111190 44748 202984 -335391 -254847
9629b54847A27994C1503a10914r0114N5318K3634q2076A07345d09038J71179o6356
$$ -254847 127994 31503 -110914 -201028 -145710 -122076 -204152 107345 -409038 -237859 -304215
9618c04215q3352J75974G9954B8497d06910b4086r9987d8051p7332p3864A6404
$$ -304215 -387567 -211593 79954 28497 -406910 -24086 -124073 -48051 -125383 -199247 16404
9606A29856D736a09333j47866F6053L5388c61125G3888A6672a78677a163I9148
$$ 129856 4736 -109333 -257199 66053 101441 -361125 73888 16672 -178677 -1163 99148
9594c4484j00360d6276o0518d0240j47102N5424f1482C0195a86140e5319a7272
$$ -34484 -134844 -46276 -106794 -40240 -187342 -131918 -61482 30195 -186140 -55319 -17272
9582c7340k9049k36365G0876j0540e1504j7948A48135O691J9999c98752J00151
$$ -37340 -66389 -302754 70876 60336 -51504 -69452 148135 154826 174825 -398752 -298601
9571b98601D369b7694I9087J3322a66346a7150A70010a67374A4024f4656E446
$$ -298601 4369 -27694 99087 112409 -166346 -17150 170010 -167374 14024 -64656 5446
9559h804G2277c05319A10159b39390a18708j66164D4221R8276K0040f1706A84655
$$ -8804 72277 -305319 110159 -239390 -118708 -284872 44221 142497 162537 -61706 184655
9547A0297K05414D0935a34521N2070k60573B05158a45279B13688g446r595I567
$$ 10297 215711 40935 -134521 -82451 -343024 205158 -145279 213688 -7446 -17041 9567
9535D4047k0829a95853O0266k71748h6825A73245b40819D689J54430d14245b04763
$$ 44047 23218 -195853 -135587 -407335 -86825 173245 -240819 4689 159119 -414245 -204763
9523a48573A02432b41049I4294N4833K75287a51591q0920b5063m2669r7515p98
$$ -148573 102432 -241049 94294 149127 424414 -151591 -232511 -25063 -67732 -165247 -166045
9512a66045D3345J51248d8787n786F1606J08206f944C04703b83991j63431h7731
$$ -166045 43345 194593 -48787 -54573 61606 169812 -6944 304703 -283991 -447422 -87731
9500A0063g9506b603k44716H5098I163R7011a22642j05827K9242B06510c98575
$$ 10063 -79506 -2603 -247319 85098 9163 106174 -122642 -228469 -199227 206510 -398575
9488a28866k96042b4421I3805c14049g9413A49380d3936J3866C36688d4419k13788
$$ -128866 -424908 -24421 93805 -314049 -79413 149380 -43936 -30070 336688 -44419 -258207
9477b58207B95813c55948R4693n541B68406E3384J87604a64471B97056B8181O0899
$$ -258207 295813 -355948 -261255 -266796 268406 53384 240988 -164471 297056 28181 89080
9466H9080a16966B6128J44389a59614g4798j183G7191e6645l86933a11887A5295
$$ 89080 -116966 26128 170517 -159614 -74798 -75981 77191 -56645 -443578 -111887 15295
9454C2666a01635N608L4139l2998p6415a2795j1890C43433h6503j86477i2542
$$ 32666 -101635 -96027 -61888 -94886 -171301 -12795 -24685 343433 -86503 -272980 -92542
9442A29955c06449a5167r4780a9293j17561G0749j6287b0345r9885B6208J54517
$$ 129955 -306449 -15167 -109947 -19293 -136854 70749 54462 -20345 -120230 26208 180725
9431A80725a40078J2555j37586A71674E5503f0884E0312a49026I497f2733B63807
$$ 180725 -140078 -127523 -265109 171674 55503 -60884 50312 -149026 9497 -62733 263807
9419d1545m9182C62399d0179j09400D7467h3668j24922P2607j41556a23301G2812
$$ -41545 -90727 362399 -40179 -149579 47467 -83668 -208590 -135983 -277539 -123301 72812
9407d2128G6217J31998b06311A3372b05990n5291D5114f4679I2003m5680d69665
$$ -42128 76217 208215 -206311 13372 -205990 -261281 45114 -64679 92003 46323 -469665
9395b51819E5897a02250n8776k18330P5668J41751J3054k50791e7049p9603K201
$$ -251819 55897 -102250 -161026 -379356 -303688 -161937 -148883 -399674 -57049 -136652 -134451
9384a34451B22385G6175e4917j06078a4754k09259F243J39571b89789I7593c5298
$$ -134451 222385 76175 -54917 -160995 -14754 -224013 6243 145814 -289789 97593 -35298
9372b8945a0041D0147a64551M9102e7594k93688f9054r7124A24185g4068a7763
$$ -28945 -10041 40147 -164551 -115449 -57594 -351282 -69054 -166178 124185 -74068 -17763
9360A35736p122b00568h8835m9185F9402a44460k00938F6924b18226e2273H9858
$$ 135736 128614 -200568 -88835 -138020 69402 -144460 -345398 66924 -218226 -52273 89858
9348B06875b28821B34134f4201j14629d9167j4800j98425M3534c1140j37501A91652
$$ 206875 -228821 234134 -64201 -178830 -49167 -63967 -262392 -218858 -31140 -168641 191652
9336B2622b6205A12484a38614A0941f8668j85786L2575r7672A6406K40947a92855
$$ 22622 -26205 112484 -138614 10941 -68668 -254454 -221879 -319551 16406 257353 -192855
9324a45124e1867D4605c02998H6418b07927A9511g407k4938j15852l7888e7862
$$ -145124 -51867 44605 -302998 86418 -207927 19511 -7407 -32345 -148197 -186085 -57862
9312c6128j47633C24534b98890I3953j6897J40601e3971B9721b99871A97435b35857
$$ -36128 -183761 324534 -298890 93953 77056 217657 -53971 29721 -299871 197435 -235857
9300C528a11843l03652c7541A3549K27339a85886Q7949n7355L148c0033k40964
$$ 3528 -111843 -415495 -37541 13549 240888 -185886 -97937 -155292 -152144 -30033 -270997
9289b70997a1269j46464A67101a16034J3785N0061j14869L6428A43880E8596h8862
$$ -270997 -11269 -157733 167101 -116034 -102249 -52188 -167057 -130629 143880 58596 -88862
9277A16034e2651A94077a3050G6358b39202B49195a72627m6825h5327k80538I3419
$$ 116034 -52651 194077 -13050 76358 -239202 249195 -172627 -219452 -85327 -365865 93419
9265B57508a85068L4830d2045K796j17671k5100O8575E5021B1843J34847C6502
$$ 257508 -185068 -150238 -42045 -39249 -156920 -182020 -113445 55021 21843 156690 36502
9253A17216K20713c7961a6326A65429H1570K8652A5557N2693d32358a4026l07495
$$ 117216 337929 -37961 -16326 165429 81570 110222 15557 68250 -432358 -14026 -321521
9242c21521G0295J64551b50374a19148k19155c7067j30452f02G9891b70446J06982
$$ -321521 70295 234846 -250374 -119148 -338303 -37067 -167519 -602 79891 -270446 -163464
9231a63464A4521J36620n6614E778a45310N2839l23553A93202a6461j22180f0177
$$ -163464 14521 151141 94527 5778 -145310 -92471 -416024 193202 -16461 -138641 -60177
9219a95799f6363j16042k32244A1819J92085a09243j0807j34978H3063a58996
$$ -195799 -66363 -182405 -414649 11819 203904 -109243 -120050 -255028 83063 -158996
9208c1174j13310C9324C433f3292k1480c9257j35209g1635A13063R4584b1597
$$ -31174 -144484 39324 3433 -63292 -84772 -39257 -174466 -71635 113063 207647 -21597
9196f4835D3705a06753G6686M5297k6801g6379k39545j0276C13136f9416p8839
$$ -64835 43705 -106753 76686 121983 95182 -76379 -315924 -326200 313136 -69416 -148255
9185a48255L1354F4032h9799l3795B50821b92362C7623J61825e0655E0769a41311
$$ -148255 -116901 64032 -89799 -123594 250821 -292362 37623 199448 -50655 50769 -141311
9173A1935g0162j09j39708J2664r75D1279N8322C5104O3963b27181B97873a61030
$$ 11935 -70162 -70271 -209979 -197315 -198290 41279 99601 35104 99067 -227181 297873 -161030
9160A38284n5160J26939F2422i907A74522G6809a84598e3346F8853g6947A09449
$$ 138284 83124 210063 62422 -9907 174522 76809 -184598 -53346 68853 -76947 109449
9148c28581J45122P0011A4364g3490j3665A02933c07594a2830j09057M1205C57249
$$ -328581 -183459 -113448 14364 -73490 -87155 102933 -307594 -12830 -121887 -80682 357249
9136A41275l5794m8559P8627a49372m927H5557J63957c6987m23669a46783B67875
$$ 141275 105481 56922 135549 -149372 -154299 85557 249514 -36987 -460656 -146783 267875
9124a133j40494l75153e3104j17032m8341a05565b8239o1290l00744h492B3391
$$ -1133 -141627 -516780 -53104 -170136 -218477 -105565 -28239 -89529 -390273 -8492 23391
9112D6744D808b3007H1143C327i4034C409J72018a00387o5269G3091h1135G345
$$ 46744 4808 -23007 81143 3327 -94034 3409 175427 -100387 -165656 73091 -81135 7345
9099b29088d3384A36812a69877j33649q2190J13441f0638A76031l5469D0053J38538
$$ -229088 -43384 136812 -169877 -303526 -385716 -272275 -60638 176031 140562 40053 178591
9088A78591c09412a05491A64929h3207a2635A92417P8776j24696F8754B1833b1740
$$ 178591 -309412 -105491 164929 -83207 -12635 192417 271193 146497 68754 21833 -21740
9076c28275o8854F1986a89735Q5420D2732b39062N6428I257a29535j81593G9628
$$ -328275 -397129 61986 -189735 -104315 42732 -239062 -182634 9257 -129535 -311128 79628
9064b77218J29842A21234i3015n9275j16535A9388b76871a25561j13613c3762
$$ -277218 -147376 121234 -93015 -152290 -268825 19388 -276871 -125561 -239174 -33762
9053a31833D9464h6442D9344O965a15328a5822B7293k358J76177b2555F9642h2143
$$ -131833 49464 -86442 49344 56309 -115328 -15822 27293 24935 201112 -22555 69642 -82143
9040d46818f4317k58071B8149h6117A6309a75521I1123a62096d9815l14190j50164
$$ -446818 -64317 -322388 28149 -86117 16309 -175521 91123 -162096 -49815 -364005 -514169
9029e14169H0267f6690m0864j37985A13304b4419p5883E0151f6513A12809a04016
$$ -514169 80267 -66690 -107554 -245539 113304 -24419 -100302 50151 -66513 112809 -104016
9017c76505A0240L6401d05749J08389g5147o5027d5962k05439A71885C665d67228
$$ -376505 10240 46641 -405749 -297360 -75147 -140174 -45962 -251401 171885 3665 -467228
9005a60233A11882a17527M8705C2199O6134a78062I8293i8614G5098H29b14219
$$ -160233 111882 -117527 -68822 32199 98333 -178062 98293 -98614 75098 829 -214219
8993b60826d8069A47594g8970j74743O840J08602j52850e589J125A10124b21373
$$ -260826 -48069 147594 -78970 -253713 -246873 -138271 -291121 -5589 -4464 110124 -221373
8981C22271a3691j47338q2328G1569b85701J37436B02994G7827a00971o5501n4463
$$ 322271 -13691 -161029 -243357 71569 -285701 -148265 202994 77827 -100971 -166472 -220935
8970b20935o5386R903C2340b32177A83611B033a50311F8908a32843j79264A50542
$$ -220935 -286321 -276418 32340 -232177 183611 2033 -150311 68908 -132843 -312107 150542
8958a98712B7475a46788A915f5927o9321a0259n1218A75379a31602c2585A57758
$$ -198712 27475 -146788 1915 -65927 -135248 -10259 -61477 175379 -131602 -32585 157758
8946f3629A03235j0865M4897F2653b07384Q5636B77409I0725B6353J42299d23707
$$ -63629 103235 92370 137267 62653 -207384 -121748 277409 90725 26353 168652 -423707
8934C7656J71628D9739a31278M4235j30608a5119A67445a40556l544A62649b2698
$$ 37656 209284 49739 -131278 -87043 -217651 -15119 167445 -140556 -144100 162649 -22698
8922h0631l9126h404C3334N32921j84617A06997f986B27203o6112a06182C74327
$$ -80631 -119757 -8404 33334 566255 381638 106997 -6986 227203 161091 -106182 374327
8910C61349j03999J223637R03472K167916N606651k853652l180560k034580m47281
$$ 361349 257350 1480987 2384459 4552375 10159026 7305374 4124814 2090234 1642953
8901A642953m42424D19426k3465j86847K6595F4927i1902B37934B2915N10305
$$ 1642953 1200529 419426 395961 209114 235709 64927 -91902 237934 22915 533220
8891E33220b06508A77685f4821A04238b26944B13085a41667K7792C9143K0058
$$ 533220 -206508 177685 -64821 104238 -226944 213085 -141667 -113875 39143 59201
8881E9201f5550D0894e328B52537A15781d5255A02742b25097a6078p6381j3326
$$ 59201 -65550 40894 -5328 252537 115781 -45255 102742 -225097 -16078 -92459 -105785
8870a05785o9836j95995h7945M0868E4566J49240l3234A999L3140K70519a74520
$$ -105785 -175621 -371616 -87945 -47077 54566 203806 170572 1999 35139 305658 -174520
8858G5606a60572N1194j4464j08269e1211A68131C2340b11583A37209a8776A09290
$$ 75606 -160572 -109378 -123842 -232111 -51211 168131 32340 -211583 137209 -18776 109290
8846g3425j23406H6521R0409d87761b42689B56126b12040A32962a8299C5023K1318
$$ -73425 -196831 86521 176930 -487761 -242689 256126 -212040 132962 -18299 35023 56341
8835E6341j980e4283A31717P2839c4493r1000A13716d59322i9829D4128R3583
$$ 56341 54361 -54283 131717 204556 -34493 -125493 113716 -459322 -99829 44128 137711
8824A37711a82899d5616l2670E0226B2432d9600C9930k583M2495A646J09904h9317
$$ 137711 -182899 -45616 -78286 50226 22432 -49600 39930 37347 79842 1646 111550 -89317
8811b63200B70962I2727b6190m8660k37948A2423i3534C3334J69115l2929Q5509
$$ -263200 270962 92727 -26190 -74850 -312798 12423 -93534 33334 202449 169520 255029
$$ [...]
##END NTUPLES=NMR SPECTRUM
##END=
