
##TITLE=AC1007_S-149_6114592_zZLpfeKMET
##JCAMPDX= 6.0         $$ Bruker NMR JCAMP-DX V2.0
##DATA TYPE= NMR SPECTRUM
##DATA CLASS= NTUPLES
##ORIGIN= BRUKER
##OWNER= Administrator
$$ 1.72 TOPSPIN		Version 2.1
$$ 2012-05-14 18:31:08.625 -0500  Administrator@TOPSPIN
$$ Compression mode = diff/dup
##.OBSERVE FREQUENCY= 400.13188235
##.OBSERVE NUCLEUS= ^1H
##.ACQUISITION MODE= SIMULTANEOUS (DQD)
##.ACQUISITION SCHEME= undefined
##.AVERAGES= 64
##.DIGITISER RES= 22
##SPECTROMETER/DATA SYSTEM= spect
##.PULSE SEQUENCE= noesygpps1d.comp
##.SOLVENT NAME= COFFEE_meoh
##.SHIFT REFERENCE= INTERNAL, COFFEE_meoh, 1, 14.96668
##AUDIT TRAIL= $$ (NUMBER, WHEN, WHO, WHERE, PROCESS, VERSION, WHAT)
$$ ##TITLE= Audit trail, TOPSPIN		Version 2.1
$$ ##JCAMPDX= 5.01
$$ ##ORIGIN= Bruker BioSpin GmbH
$$ ##OWNER= Administrator
$$ $$ C:\Bruker\TOPSPIN/data/COFFEE/nmr/AC1007_S-149_6114592_zZLpfeKMET/42/pdata/1/auditp.txt
$$ ##AUDIT TRAIL=  $$ (NUMBER, WHEN, WHO, WHERE, PROCESS, VERSION, WHAT)
(   1,<2012-05-14 18:31:03.859 -0500>,<Administrator>,<TOPSPIN>,<go>,<TOPSPIN 2.1>,
      <created by zg
	started at 2012-05-14 18:19:33.609 -0500,
	POWCHK enabled, PULCHK disabled,
       configuration hash MD5:
       AF F2 23 6B 01 CD 40 DD E5 A1 38 A0 06 EA F7 77
       data hash MD5: 64K
       56 4D A0 7B 18 72 46 57 75 41 26 16 B3 E5 40 C0>)
(   2,<2012-05-14 18:31:06.687 -0500>,<Administrator>,<TOPSPIN>,<proc1d>,<TOPSPIN 2.1>,
      <Start of raw data processing
       efp LB = 0.3 FT_mod = 6 PKNL = 1 PHC0 = 0 PHC1 = 0 SI = 128K 
       data hash MD5: 128K
       B8 B5 4B A4 9C 7B 77 B5 33 20 69 49 9B B0 B6 62>)
(   3,<2012-05-14 18:31:07.875 -0500>,<Administrator>,<TOPSPIN>,<proc1d>,<TOPSPIN 2.1>,
      <pk PHC0 = 37.6886 PHC1 = 0 
       data hash MD5: 128K
       79 D4 97 EB 4A 78 35 02 B6 CB 3A 2C 59 0A 60 84>)
(   4,<2012-05-14 18:31:08.109 -0500>,<Administrator>,<TOPSPIN>,<proc1d>,<TOPSPIN 2.1>,
      <abs ABSG = 1 
       data hash MD5: 128K
       A3 EA D1 67 4B 60 64 F0 4F F3 FF 4B BF 17 67 20>)
(   5,<2012-05-14 18:31:08.187 -0500>,<Administrator>,<TOPSPIN>,<proc1d>,<TOPSPIN 2.1>,
      <abs ABSG = 2 
       data hash MD5: 128K
       7F 4D 88 3D 61 46 E0 B8 A3 A9 DD FE F1 99 18 EE>)
(   6,<2012-05-14 18:31:08.234 -0500>,<Administrator>,<TOPSPIN>,<proc1d>,<TOPSPIN 2.1>,
      <abs ABSG = 3 
       data hash MD5: 128K
       6B 0E C8 7F 13 1A 3A 98 16 01 CA 17 4B BA 6B DB>)
(   7,<2012-05-14 18:31:08.484 -0500>,<Administrator>,<TOPSPIN>,<proc1d>,<TOPSPIN 2.1>,
      <abs ABSG = 4 
       data hash MD5: 128K
       90 35 76 71 B2 9A DF A2 B8 92 B8 E4 0A E5 E8 A5>)
(   8,<2012-05-14 18:31:08.531 -0500>,<Administrator>,<TOPSPIN>,<proc1d>,<TOPSPIN 2.1>,
      <abs ABSG = 5 
       data hash MD5: 128K
       BD 5A 29 E7 FA DF 5E 3F 32 4A 75 10 E7 3D 66 F1>)
$$ ##END=
$$ 
$$ $$ hash MD5
$$ $$ DF B2 83 12 E2 DC 6E FC F5 38 2C 90 28 64 71 BB
##$RELAX= 
##$RELAX= 
##$RELAX= 
##$RELAX= 
##$RELAX= 
##$RELAX= 
##$RELAX= 
##$RELAX= 
$$ Bruker specific parameters
$$ [...]
##$TP07= 0
##$TPNAME0= <>
##$TPNAME1= <>
##$TPNAME2= <>
##$TPNAME3= <>
##$TPNAME4= <>
##$TPNAME5= <>
##$TPNAME6= <>
##$TPNAME7= <>
##$TPOAL= (0..7)
0.5 0.5 0.5 0.5 0.5 0.5 0.5 0.5
##$TPOFFS= (0..7)
0 0 0 0 0 0 0 0
##$TUNHIN= 0
##$TUNHOUT= 0
##$TUNXOUT= 0
##$USERA1= <user>
##$USERA2= <user>
##$USERA3= <user>
##$USERA4= <user>
##$USERA5= <user>
##$V9= 5
##$VALIST= <valist>
##$VCLIST= <CCCCCCCCCCCCCCC>
##$VD= 0
##$VDLIST= <DDDDDDDDDDDDDDD>
##$VPLIST= <PPPPPPPPPPPPPPP>
##$VTLIST= <TTTTTTTTTTTTTTT>
##$WBST= 2048
##$WBSW= 25
##$XGAIN= (0..3)
0 0 0 0
##$XL= 0
##$YL= 0
##$YMAX_a= 11679958
##$YMIN_a= -6271687
##$ZGOPTNS= <>
##$ZL1= 120
##$ZL2= 120
##$ZL3= 120
##$ZL4= 120
##$ABSF1= 14.96668
##$ABSF2= -5.585851
##$ABSG= 5
##$ABSL= 3
##$ALPHA= 0
##$AQORDER= 0
##$ASSFAC= 0
##$ASSFACI= 0
##$ASSFACX= 0
##$ASSWID= 0
##$AUNMP= <proc_prof1d_extract.lims>
##$AXLEFT= 0
##$AXNAME= <>
##$AXNUC= <1H>
##$AXRIGHT= 0
##$AXTYPE= 0
##$AXUNIT= <>
##$AZFE= 0.1
##$AZFW= 0.1
##$BCFW= 0
##$BC_mod= 0
##$BYTORDP= 0
##$COROFFS= 0
##$CY= 15
##$DATMOD= 1
##$DC= 0
##$DFILT= <>
##$DTYPP= 0
##$F1P= 0
##$F2P= 0
##$FCOR= 0.5
##$FTSIZE= 131072
##$FT_mod= 6
##$GAMMA= 0
##$GB= 0
##$INTBC= 1
##$INTSCL= 1
##$ISEN= 128
##$LB= 0.3
##$LEV0= 0
##$LPBIN= 0
##$MAXI= 10000
##$MC2= 0
##$MEAN= 0
##$ME_mod= 0
##$MI= 0
##$NCOEF= 0
##$NC_proc= -3
##$NLEV= 6
##$NOISF1= 0
##$NOISF2= 0
##$NSP= 0
##$NTH_PI= 0
##$NZP= 0
##$OFFSET= 14.96668
##$PC= 1
##$PHC0= 37.6886
##$PHC1= 0
##$PH_mod= 1
##$PKNL= yes
##$PPARMOD= 0
##$PPDIAG= 0
##$PPIPTYP= 0
##$PPMPNUM= 2147483647
##$PPRESOL= 1
##$PSCAL= 4
##$PSIGN= 0
##$PYNMP= <proc.py>
##$REVERSE= no
##$SF= 400.130005573351
##$SI= 131072
##$SIGF1= 0
##$SIGF2= 0
##$SINO= 400
##$SIOLD= 131072
##$SPECTYP= <>
##$SREGLST= <1H.CDCl3>
##$SSB= 0
##$STSI= 131072
##$STSR= 0
##$SW_p= 8223.68421052632
##$SYMM= 0
##$S_DEV= 0
##$TDeff= 65536
##$TDoff= 0
##$TI= <>
##$TILT= no
##$TM1= 0
##$TM2= 0
##$TOPLEV= 0
##$USERP1= <user>
##$USERP2= <user>
##$USERP3= <user>
##$USERP4= <user>
##$USERP5= <user>
##$WDW= 1
##$XDIM= 131072
##$YMAX_p= 409988761
##$YMIN_p= -40285177
##$CURPLOT= <Network HP LaserJet P1505>
##$CURPRIN= <$Network HP LaserJet P1505>
##$DFORMAT= <normdp>
##$LAYOUT= <+/1D_H.xwp>
##$LFORMAT= <normlp>
##$PFORMAT= <normpl>
##$SURQMSG= 1
$$ End of Bruker specific parameters
$$ ---------------------------------
##NTUPLES= NMR SPECTRUM
##VAR_NAME=  FREQUENCY,     SPECTRUM/REAL,   SPECTRUM/IMAG
##SYMBOL=    X,             R,               I
##VAR_TYPE=  INDEPENDENT,   DEPENDENT,       DEPENDENT
##VAR_FORM=  AFFN,          ASDF,            ASDF
##VAR_DIM=   131072,        131072,          131072
##UNITS=     HZ,            ARBITRARY UNITS, ARBITRARY UNITS
##FACTOR=    0.0627417313425165, 1,          1
##FIRST=     8223.62146879498, 5717,         -111286
##LAST=      0,             7617,            -110279
##MIN=       0,             -40285177,       0
##MAX=       8223.62146879498, 409988761,    0
$$ Real data points
##PAGE= N=1
##DATA TABLE= (X++(R..R)), XYDATA
$$ [...]
61389F11961K325J358Q37J974M135N350M441K079k94j789j971m74K246M426M616
61374F41220L597L415M364M496K583R3q59l30O4k58m20m3O8m80p21L41K144L072
61356F62346K204J74j508j693l98J342K333K089Q88o59j864k207j824j547j909
61341F57767k227j461J72J232R40P9l23l38m38k80P22K011K247J078m57j414j846
61324F57464j804o04K012M653N409M092K415J877K394L144L810M376M404L419
61310F97061J851Q42J087K174L163L413K945K273K003K358L014L497L621L495
61296G32797L325L432M237N904Q090J0192J1664J2068J1337J0273J0139J1135
61284H34593J1831J0908R020P926P991P818O497N011M810N896O925O724N179L108
$$ y = [611961, 614286, 615644, 616481, 618455, 622590, 627940, 632381, 634460, 634166, 632377, 630406, 629932, 632178, 636604, 641220, 644817, 648232, 652596, 657092, 659675, 659768, 658909, 658579, 658643, 658385, 657965, 657922, 657990, 657510, 656789, 657130, 659274, 662346, 664550, 664724, 663216, 661523, 661125, 662467, 664800, 666889, 667777, 667118, 665254, 663047, 661223, 659676, 657767, 655540, 654079, 654251, 655483, 656423, 656502, 656179, 655841, 655403, 655123, 655845, 657856, 660103, 661181, 660724, 659310, 657464, 655660, 655056, 657068, 661721, 667130, 671222, 673637, 675514, 677908, 681052, 684862, 689238, 693642, 697061, 698912, 699754, 700841, 703015, 706178, 709591, 712536, 714809, 716812, 719170, 722184, 725681, 729302, 732797, 736122, 739554, 743791, 749695, 757785, 767977, 779641, 791709, 803046, 813319, 823458, 834593, 846424, 857332, 866352, 874278, 882269, 890087, 896584, 901595, 906405, 912301, 919226, 925950, 931129, 934237]
61270I34237J564Q73J79j453l379l717j774P83J866J365P94J224K393L430L624
61255I42009K823J911K505N240Q647J0700J1249J1835J3211J4379J4493J4360
61243A053362J5086J6025J5332J2485R177P233O259M187J02m276o488o237n578
61230A116669o248p784q668q496q289r050j0743j2461j3011j1634q785o047m692
61217A000761m344l548j545R62K720L114K517J843J767K217K754L436M603N748
61203A023005N645M284L580M924P002P579O857P098Q972J0344R346O863M976M248
61189A114723L810L180K762K962L767M821N381M647K682O08n89r26q09m92o02
61174A145925j991m143m805k612P41K444K149J999L295N002N812O025O594P562
$$ y = [934237, 935801, 936674, 936853, 935400, 932021, 928304, 926530, 927313, 929179, 930544, 931338, 932562, 934955, 938385, 942009, 944832, 946743, 949248, 954488, 963135, 973835, 985084, 996919, 1010130, 1024509, 1039002, 1053362, 1068448, 1084473, 1099805, 1112290, 1121467, 1128700, 1134959, 1139146, 1139248, 1134972, 1128484, 1122247, 1116669, 1110421, 1102637, 1093969, 1085473, 1077184, 1068134, 1057391, 1044930, 1031919, 1020285, 1011500, 1005453, 1000761, 996417, 992869, 991324, 992286, 995006, 998120, 1000637, 1002480, 1004247, 1006464, 1009218, 1012654, 1017257, 1023005, 1028650, 1032934, 1036514, 1041438, 1048440, 1056019, 1062876, 1069974, 1078946, 1089290, 1098636, 1105499, 1110475, 1114723, 1118533, 1121713, 1124475, 1127437, 1131204, 1136025, 1141406, 1146053, 1148735, 1149343, 1148754, 1147828, 1147019, 1146527, 1145925, 1143934, 1139791, 1134986, 1132374, 1133115, 1135559, 1137708, 1139707, 1143002, 1148004, 1153816, 1159841, 1166435, 1173997]
61160A173997Q345Q750Q921Q817Q434Q077P920P736P443P337P363O809N356L832
61146A279137L302L806M715N777O998P850P681O910O775P693Q714R052R325J0607
61132A378342J2702J4133J3821J2234J0647R615Q569O850M816L534L383L440K511
61119A484597M54j901l856n380o673p776q578q816q188p008o568p929j0311j1703
61105A390364j1364j0687j1040j1942j2368j2693j3886j5395j5640j4459j3438
61094A247452j3464j3538j2541j0924r764r147q453p499o636o243o651p977r402
61081A125213r576q398p481p902q557p991o878o776p018n261j400J391Q02j114
61067A049054k66M455J0132J3548J4505J5111J6869J9208K0621K0759K1102K3426
$$ y = [1173997, 1182342, 1191092, 1200013, 1208830, 1217264, 1225341, 1233261, 1240997, 1248440, 1255777, 1263140, 1269949, 1275305, 1279137, 1282439, 1286245, 1290960, 1296737, 1303735, 1311585, 1319266, 1326176, 1332951, 1340644, 1349358, 1358410, 1367735, 1378342, 1391044, 1405177, 1418998, 1431232, 1441879, 1451494, 1460063, 1466913, 1471729, 1475263, 1478646, 1482086, 1484597, 1485051, 1483150, 1479294, 1473914, 1467241, 1459465, 1450887, 1442071, 1433883, 1426875, 1420307, 1412378, 1402067, 1390364, 1379000, 1368313, 1357273, 1345331, 1332963, 1320270, 1306384, 1290989, 1275349, 1260890, 1247452, 1233988, 1220450, 1207909, 1196985, 1187221, 1178074, 1169621, 1162122, 1155486, 1149243, 1142592, 1134615, 1125213, 1115637, 1107239, 1099758, 1091856, 1083299, 1075308, 1068430, 1061654, 1054636, 1049375, 1047975, 1049366, 1050168, 1049054, 1048788, 1053243, 1063375, 1076923, 1091428, 1106539, 1123408, 1142616, 1163237, 1183996, 1205098, 1228524]
61055A228524K7672L1700L3540L3488L3440L4257L4638L3044L0162K8444K9085
61044A577994L0344K9610K6634K3612K2068K0838J7763J2500O676J787k046n437
61032A762343q804j2233j5515j8151j9778k0689k1525k2551k3606k4439k4597
61021A550455k3510k1549k0459k1553k3667k4363k2994k1092j9525j7165j3152
61010A321426q729n629l844k308p63N55K175M818P936J0249J1524J2650J4188
60997A364248J5991J8049K0510K3064K5394K7998L1456L5070L7559L8985M0614
60986A678938M2857M4919M6656M9235N3328N8103O2617O6899P0941P4026P6052
60975B324571P8483Q2793Q8814R5549J02656J09987J16609J21798J26505J32363
$$ y = [1228524, 1256196, 1287896, 1321436, 1354924, 1388364, 1422621, 1457259, 1490303, 1520465, 1548909, 1577994, 1608338, 1637948, 1664582, 1688194, 1710262, 1731100, 1748863, 1761363, 1768039, 1769826, 1767780, 1762343, 1753539, 1741306, 1725791, 1707640, 1687862, 1667173, 1645648, 1623097, 1599491, 1575052, 1550455, 1526945, 1505396, 1484937, 1463384, 1439717, 1415354, 1392360, 1371268, 1351743, 1334578, 1321426, 1312697, 1307068, 1303224, 1300916, 1300153, 1300708, 1302883, 1307701, 1315637, 1325886, 1337410, 1350060, 1364248, 1380239, 1398288, 1418798, 1441862, 1467256, 1495254, 1526710, 1561780, 1599339, 1638324, 1678938, 1721795, 1766714, 1813370, 1862605, 1915933, 1974036, 2036653, 2103552, 2174493, 2248519, 2324571, 2403054, 2485847, 2574661, 2670210, 2772866, 2882853, 2999462, 3121260, 3247765, 3380128]
60965C380128J39518J46749J53561J60842J69440J79433J91046K05052K21865
60956D947634K41042K61997K84577L09121L37113L71774M16454M71921N36364
60947H177997O08391O88445P76887Q73330R79766J102216J246892J416961J616101
60938A7486986J849256K105844K335250K450793K379238K117704J738363J333731
60930C3797165R62944O52736M30803L26147L23479L35534K47940J884l71063p92071
60920C5915498j198787j563681j869419k090927k207816k222999k160462k047920
60912B0553487j905811j748460j587445j431371j285343j152329j033702r28282
60904I480744q32886p45001o64181n90510n23068m60867m04326l54702l12294
$$ y = [3380128, 3519646, 3666395, 3819956, 3980798, 4150238, 4329671, 4520717, 4725769, 4947634, 5188676, 5450673, 5735250, 6044371, 6381484, 6753258, 7169712, 7641633, 8177997, 8786388, 9474833, 10251720, 11125050, 12104816, 13207032, 14453924, 15870885, 17486986, 19336242, 21442086, 23777336, 26228129, 28607367, 30725071, 32463434, 33797165, 34760109, 35412845, 35843648, 36169795, 36493274, 36828808, 37076748, 37078632, 36707569, 35915498, 34716711, 33153030, 31283611, 29192684, 26984868, 24761869, 22601407, 20553487, 18647676, 16899216, 15311771, 13880400, 12595057, 11442728, 10409026, 9480744, 8647858, 7902857, 7238676, 6648166, 6125098, 5664231, 5259905, 4905203, 4592909]
60895D592909k75969k44314k16586j92578j72151j55109j41269j30340j21770
60886B942823j14764j08462j02277r6237r0907q6655q2999p8938p4113o9355o5688
60875A972428o3000o0148n6458n2539m9397m7205m5430m3661m1744l9384l6455
60864A437007l3615l1705l0395k8286k4830k1391j9755j9982k0435j9605j7335
60853A169673j4509j2219j1145j1058j0915r827p956o129m748l621k752k534l007
60840A069253l540l524k924j914n23R09J324k91l669p126q879q484p069o242o786
60825A010515q316j0047j1569j2820j3688j4096j4301j4578j4668j4104j3040
60814H69288j2202j1803j1263j0292r481r189q578o692m131k497k207j980q18
$$ y = [4592909, 4316940, 4072626, 3856040, 3663462, 3491311, 3336202, 3194933, 3064593, 2942823, 2828059, 2719597, 2617320, 2521083, 2430176, 2343521, 2260522, 2181584, 2107471, 2038116, 1972428, 1909428, 1849280, 1792822, 1740283, 1690886, 1643681, 1598251, 1554590, 1512846, 1473462, 1437007, 1403392, 1371687, 1341292, 1313006, 1288176, 1266785, 1247030, 1227048, 1206613, 1187008, 1169673, 1155164, 1142945, 1131800, 1120742, 1109827, 1100000, 1092044, 1085915, 1081167, 1077546, 1074794, 1072260, 1069253, 1065713, 1062189, 1059265, 1057351, 1056828, 1057737, 1059061, 1058770, 1055101, 1047975, 1039096, 1030612, 1023543, 1017301, 1010515, 1002199, 992152, 980583, 967763, 954075, 939979, 925678, 911100, 896432, 882328, 869288, 857086, 845283, 834020, 823728, 814247, 805058, 796480, 789788, 785657, 783160, 780953, 778973, 778155]
60801G78155O14J236J237J513K095K224J808J477J190J33j480j757O29M277O380
60786G99731N951M600M079M215L715K191O04NL58O22j81j921l430l717k954k019
60770H11849j399j093j324k431m014n006m904m254l681l234k878k824k924k628
60756G69255k090k400m079o045o921o662o142n764n446n372n743o209o443o796
60742F93143p433p462o116m293l638m353n191n361m991l960k000o0J54j456k954
60727F34029k905j990j463j354j073n87l1R09K216K948K479J651J792L079M685
60712F44385N920O428N786M043K266J713K479L598M285M485M445M347M182L643
60698G02005K375O52o16r74r75j265j744k153k805m002n266n925o000n774n047
$$ y = [778155, 778769, 780005, 781242, 782755, 784850, 787074, 788882, 790359, 791549, 791682, 790202, 788445, 789074, 793351, 799731, 805682, 810282, 814361, 818576, 822291, 824482, 825086, 825091, 825449, 826071, 825890, 823969, 820539, 816822, 813868, 811849, 810450, 809357, 808033, 805602, 801588, 796582, 791678, 787424, 783743, 780509, 777631, 774807, 771883, 769255, 767165, 764765, 760686, 754641, 747720, 741058, 734916, 729152, 723706, 718334, 712591, 706382, 699939, 693143, 685710, 678248, 672132, 667839, 664201, 659848, 654657, 649296, 644305, 640345, 638345, 638285, 638439, 636983, 634029, 631124, 629134, 627671, 626317, 625244, 624657, 624626, 625535, 627751, 630699, 633178, 634829, 636621, 639700, 644385, 650305, 656733, 662519, 666562, 668828, 670541, 673020, 676618, 680903, 685388, 689833, 694180, 698362, 702005, 704380, 705032, 704416, 703442, 702467, 701202, 699458, 697305, 694500, 690498, 685232, 679307, 673307, 667533, 662486]
60683F62486l681k450k281k898l201k910k838l490m410n187o188p698q817p983
60669E98454m800j084M46j122l646m093j915M96R33j32q35o52o06j268j857j549
60653E76770n82K45N60N63N22M75M05O34J781L927N939O372N121L448K278J462
60637F09920J031J818L949N836N897M591L575L450L516L261K914K761K871L234
60623F58624L479K988J997J722K479K795J646L81O97J725J364k63j111o77o08
60608F77238j673k686k912l229m094m587m384m608n587n719l916j521m01n84j085
60593F30252j611k085j759m21P17O80K33M45R74J233J798K996L318J407j397k756
60577F34024k867l788n642o091l990j097N56R85J049P89J21k25K39O62j6j550
$$ y = [662486, 658805, 656355, 654074, 651176, 647975, 645065, 642227, 638737, 634327, 629140, 622952, 615254, 606437, 598454, 593654, 592570, 593016, 591894, 588248, 584155, 582240, 582736, 583669, 583537, 582702, 582050, 581444, 580176, 578319, 576770, 576188, 576433, 576993, 577556, 578078, 578553, 578958, 579592, 581373, 585300, 591239, 597611, 602732, 606180, 608458, 609920, 610951, 612769, 616718, 622554, 628451, 633042, 636617, 640067, 643583, 646844, 649758, 652519, 655390, 658624, 662103, 665091, 667088, 668810, 671289, 674084, 675730, 676111, 676808, 678533, 679897, 679634, 678523, 677846, 677238, 675565, 672879, 669967, 666738, 662644, 658057, 653673, 649065, 643478, 637759, 633843, 632322, 631921, 631337, 630252, 628641, 626556, 624797, 624376, 625093, 625773, 626006, 626451, 627425, 628658, 630456, 633452, 636770, 638177, 636780, 634024, 631157, 627369, 621727, 615636, 611646, 610549, 611105, 612090, 613139, 613928, 614049, 613824, 614063, 614725, 614709, 613159]
60561F13159k807l091k278m33J765K906K247Q64L86R13J223Q13M34M90L03l44
60545F16550k47J391L096K742P83k7J460L063K557R64P97K172K966K374J782J940
60529F44363J664L38o44k33L71j13n95O51K996M408M634N122O080O043M626L598
60513F83309M416O319P749Q386R003J0199J2048J4204J5783J5807J4328J2490
60501H14041J1132R888Q036N567L044R79l58j003j322j485r52Q08L164M814N476
60486H61829O013O794P236P320Q149J0311J2863J4896J6931J9696K2453K3897
60474A018388K4036K3874K3584K2307J9631J6098J2233Q020L418j325n731q926
60462A155607r796q382o717o973q737r385p465m383k292j548j192q59q41o52J040
$$ y = [613159, 610352, 607261, 604983, 604550, 606315, 609221, 611468, 612332, 612718, 613631, 614854, 615667, 616101, 616591, 616894, 616550, 616303, 617694, 620790, 623532, 624315, 624288, 625748, 628811, 631368, 632332, 633129, 635301, 638267, 640641, 642423, 644363, 646027, 646365, 645721, 645488, 645859, 645746, 645151, 645802, 648798, 653206, 657840, 662962, 669042, 675085, 679711, 683309, 687725, 694044, 701793, 710179, 719182, 729381, 741429, 755633, 771416, 787223, 801551, 814041, 825173, 835061, 843097, 848664, 851708, 852687, 852329, 851326, 850004, 848519, 847567, 848375, 851539, 856353, 861829, 867842, 874636, 881872, 889192, 897341, 907652, 920515, 935411, 952342, 972038, 994491, 1018388, 1042424, 1066298, 1089882, 1112189, 1131820, 1147918, 1160151, 1168171, 1171589, 1170264, 1164533, 1155607, 1145811, 1137429, 1130712, 1123739, 1115002, 1105617, 1098152, 1093769, 1091477, 1089929, 1088737, 1087878, 1087037, 1086385, 1087425]
60447A087425M673Q870J1849J3548J5815K0361K6693L2467L6030L8215M1215M5862
60435A383023N0760N4062N5383N5567N5301N4431N2166M7528M0052L0683K1340
60424A900296J2957M306o267j8277k9303l7769m4325n0203n5329n8798o0438o0896
60412A495954o0618n9532n7575n4749n0832m5798m0544l6498l4251l3097l2042
60401I90418l0700k8984k6556k3205j9446j6207j3987j2673j2006j1725j1271
60390G83658r990p898n900m853m679m741m762m771m439l378k285k669m680o151
60376G12462n061k390r70j604k106p99Q64N37j463k610j614K84J364J175K2j825
60360F96266l720m512l596j681r5L38k46q48j78K091M569N451M622L591L268K986
$$ y = [1087425, 1092098, 1100968, 1112817, 1126365, 1142180, 1162541, 1189234, 1221701, 1257731, 1295946, 1337161, 1383023, 1433783, 1487845, 1543228, 1598795, 1654096, 1708527, 1760693, 1808221, 1848273, 1878956, 1900296, 1913253, 1917559, 1911292, 1893015, 1863712, 1825943, 1781618, 1731415, 1676086, 1617288, 1556850, 1495954, 1435336, 1375804, 1318229, 1263480, 1212648, 1166850, 1126306, 1089808, 1055557, 1022460, 990418, 959718, 930734, 904178, 880973, 861527, 845320, 831333, 818660, 806654, 794929, 783658, 773668, 765770, 759870, 755017, 750338, 745597, 740835, 736064, 731625, 728247, 725962, 723293, 718613, 712462, 707401, 705011, 704041, 702437, 700331, 699532, 700396, 700933, 699470, 696860, 695246, 695530, 696894, 698069, 698091, 696266, 692546, 688034, 684438, 682757, 682662, 683000, 682754, 681906, 681728, 683819, 688388, 693839, 698461, 702052, 705320, 708306]
60344G08306K058J077R83J815L083M490N497N165L458J956K221L842N103N156
60330G54210M574M077L705L310K996L014L525M439N203N217M715M685N470O210
60316H15350O174N765N550N271M774M911O123O915N432K140o06j485j146l64R55
60301H65759K595L458K969J954J621K439M335O931R215R988R199Q142P956Q685
60287I45246R905J1204J1690J0132O383J981j165k306k017j624k448m668o730
60274I75583p004o100o251q071r562r041p399o317n728m683l618l818n131n903
60260H86957n236l804k411j005N24J758K453L183M754P274J0116J2571J4341J5558
60246I47033J6524J7515J8867K0824K2880K3536K1571J7506J2878Q058K005n491
$$ y = [708306, 710364, 711441, 712424, 714239, 717322, 721812, 727309, 732474, 735932, 737888, 740109, 743951, 749054, 754210, 758784, 762861, 766566, 769876, 772872, 775886, 779411, 783850, 789053, 794270, 798985, 803670, 809140, 815350, 821524, 827289, 832839, 838110, 842884, 847795, 853918, 860833, 866265, 868405, 867799, 866314, 865168, 864804, 865759, 868354, 871812, 874781, 876735, 878356, 880795, 885130, 892061, 901276, 911264, 920463, 928605, 936561, 945246, 955151, 966355, 978045, 988177, 994560, 996541, 995376, 993070, 991053, 989429, 986981, 982313, 975583, 968579, 962479, 956228, 948157, 938595, 929554, 922155, 915838, 910110, 905427, 901809, 897991, 892860, 886957, 881721, 877917, 875506, 874501, 875025, 876783, 879236, 882419, 887173, 894447, 904563, 917134, 931475, 947033, 963557, 981072, 999939, 1020763, 1043643, 1067179, 1088750, 1106256, 1119134, 1127192, 1129197, 1123706]
60234A123706j2645j7577k0212k1352k1052j9198j6850j5452j5055j4489j3051
60223I36773j1044r049p734p742q753r083p586n481m782n362n261l762k353k286
60209H46495k915l040k522j927j684k172l602n260n868n136m031l204k346j455
60195H01333j326k117k671k187j378r98m64Q95K188K167J265J022J793K499K472
60180H04493K158J978J708J296J212J632K025J940J615J530J740J891J661J152
60166H28031J063K140M179N869O175N489M770M117L121K306K822M585O124O703
60152H87494P354Q936J0369J0117Q755Q559J0451J2722J3294J2269J1415J1695
60140A013430J2362J2400J1893J1474J1078J0066Q422P003O407O259N968N556
$$ y = [1123706, 1111061, 1093484, 1073272, 1051920, 1030868, 1011670, 994820, 979368, 964313, 949824, 936773, 925729, 916680, 908946, 901204, 892451, 883368, 875782, 870301, 865519, 860157, 854896, 851134, 848781, 846495, 843580, 840540, 838018, 836091, 834407, 832235, 828633, 823373, 817505, 812369, 808338, 805134, 802788, 801333, 800007, 797890, 795219, 793032, 791654, 790656, 790192, 791087, 793275, 795442, 796707, 797729, 799522, 802021, 804493, 806651, 808629, 810337, 811633, 812845, 814477, 816502, 818442, 820057, 821587, 823327, 825218, 826879, 828031, 829094, 831234, 835413, 841282, 847457, 852946, 857716, 861833, 864954, 867260, 870082, 874667, 880791, 887494, 894848, 903784, 914153, 924270, 933025, 941584, 952035, 964757, 978051, 990320, 1001735, 1013430, 1025792, 1038192, 1050085, 1061559, 1072637, 1082703, 1091125, 1098128, 1104535, 1110794, 1116762, 1122318]
60128A122318N129M091J833r55k741l158l587n156o938p165n823m876n732p543
60114A079697q585q550q430q550p971o195m428m264n533o449n834m336l248k907
60100I94417k771k451j982j348m49M84J000R97P92N62J43n45j187j325p73K68
60084I85832J301J745J392P34O31J563L300N286P007Q025Q030P245O539O768P884
60069A053282Q877Q768P649O557O193O041N119L525K597L268M827N829N828N519
60055A133879N457N422N067M464L716K702J492O23N75J224J946K049J170m79k211
60040A167096l521m581n689o561o747o468o161n467l802j904j368k262k796k053
60026A107716j443k295l515l320k174j901k574k399p19R28J057j84k066m297o395
$$ y = [1122318, 1127447, 1131538, 1133371, 1132416, 1129675, 1126517, 1122930, 1117774, 1110836, 1103671, 1097848, 1092972, 1087240, 1079697, 1071112, 1062562, 1054132, 1045582, 1037611, 1031416, 1026988, 1022724, 1017191, 1010742, 1004908, 1000572, 997324, 994417, 991646, 989195, 987213, 985865, 985416, 985900, 986900, 987897, 988689, 989251, 989394, 988849, 987662, 986337, 985564, 985832, 987133, 988878, 990270, 991004, 991635, 993198, 996498, 1001784, 1008791, 1016816, 1024846, 1032091, 1038630, 1045398, 1053282, 1062159, 1070927, 1078576, 1085133, 1091326, 1097367, 1102486, 1106011, 1108608, 1111876, 1116703, 1122532, 1128360, 1133879, 1139336, 1144758, 1149825, 1154289, 1158005, 1160707, 1162199, 1162822, 1163397, 1164621, 1166567, 1168616, 1169786, 1169307, 1167096, 1163575, 1158994, 1153305, 1146744, 1139997, 1133529, 1127368, 1121901, 1118099, 1116195, 1114827, 1112565, 1109769, 1107716, 1106273, 1103978, 1100463, 1097143, 1094969, 1093068, 1090494, 1088095, 1087376, 1088304, 1089361, 1089177, 1087111, 1082814, 1076419]
60011A076419p573p929q506r547j0040r668r698j0928j2192j2113j1140j0425
59999I56660r836q707p680p941r088r489q599p201n591l302p42P23P68O30J043
59984H81648J256Q46J008K817N356O914P295P652Q476R066Q834Q007P038O235
59970I62448N962O288O353N043K510K10r86j913l752o294q330r426j0302j1415
59956I36396j2263j2458j2612j3353j4079j3728j2518j1593j0905r019n736l418
59944H04714m143o585p585o411n220n107m187r65K458K829M22j138K26K612L289
59929G75209K406K153L340M529M375L402L002L663M786N698O162N999M885K804
59915H32413M06j339j924j673j520k206l495m155l156r99N76N34k85m18L29R96
$$ y = [1076419, 1068846, 1060917, 1052411, 1042864, 1032824, 1023156, 1013458, 1002530, 990338, 978225, 967085, 956660, 946824, 938117, 930437, 922496, 913408, 903919, 895320, 888119, 882528, 879226, 878484, 879207, 879975, 880605, 881648, 882904, 883750, 884758, 887575, 892931, 899845, 907140, 914792, 923268, 932334, 941168, 949175, 956213, 962448, 968410, 974698, 981051, 986094, 988604, 988814, 987828, 985915, 982163, 975869, 967539, 958113, 947811, 936396, 924133, 911675, 899063, 885710, 871631, 857903, 845385, 833792, 822887, 813868, 808132, 804714, 800571, 793986, 786401, 779990, 774770, 769663, 765476, 764511, 766969, 769798, 770220, 769082, 769308, 771920, 775209, 777615, 779768, 783108, 787637, 792012, 795414, 798416, 802079, 806865, 812563, 818725, 824724, 829609, 832413, 832819, 831480, 829556, 827883, 826363, 824157, 820662, 816507, 813351, 812352, 812928, 813462, 813177, 812759, 813088, 814084]
59899H14084J182J471K068K180J373N37N89R23K82j119j582j79J894K692J641
59884H28036j26j139q81R0Q44Q80L01n68j528k305k364j395J12J181J399J320
59868H23857J827L324N436P247P961P774P833Q776R584Q741O456M550L892L341
59854I10599J895O21J091K827L968M027M183M899N136M426L959M512M889L816
59840I60848K375K709M814O340N744M176L722M842O112N934M090K053J778L685
59826A019222N877O187M877M279N599P448Q049P524P000O628N927N342N803O843
59812A106605O665M375J128j343k459k749k894l285l910m259l753k540j531j390
59798A088660j866k306k439k409k337k088j254O39L570O649Q825R986J0797J1354
$$ y = [814084, 815266, 816737, 818805, 820985, 822358, 822895, 823484, 824407, 824689, 823570, 821988, 821809, 823703, 826395, 828036, 827910, 826771, 825890, 825980, 826824, 827704, 828005, 827437, 825909, 823604, 821240, 819845, 819957, 821138, 822537, 823857, 825684, 829008, 834444, 841691, 849652, 857426, 865259, 874035, 883619, 892360, 898816, 903366, 907258, 910599, 912494, 913115, 914206, 917033, 921001, 925028, 929211, 934110, 939246, 943672, 947631, 952143, 957032, 960848, 963223, 965932, 970746, 977086, 982830, 987006, 990728, 995570, 1001682, 1007616, 1011706, 1013759, 1015537, 1019222, 1025099, 1031286, 1036163, 1040442, 1046041, 1053489, 1061538, 1069062, 1076062, 1082690, 1088617, 1093959, 1099762, 1106605, 1113270, 1117645, 1118773, 1117430, 1114971, 1112222, 1109328, 1106043, 1102133, 1097874, 1094121, 1091581, 1090050, 1088660, 1086794, 1084488, 1082049, 1079640, 1077303, 1075215, 1073961, 1074600, 1078170, 1084819, 1093644, 1103630, 1114427, 1125781]
59784A125781J0757Q571N986M620M458L812J524j507l320l152k241k484m520p256
59770A141029r040r130q119p196p139p831q572q813q602q280p942p548p331p587
59756A027899p958p623o482n477n371n809n995n761n373m892m342l921l409k122
59742I53364k92L55j349m056n377m831l759k814j459J10O84J52k2P81J250M11
59726I33148o55o02L1j41j206k157k453k198j457n45l07j001j615j250m58j35
59710I16999Q8J026K229K557K043J871K736M416O604Q902J0245R662P691O026
59696I83095N852P255R766J2429J3877J3593J2822J2968J3513J3081J2069J2395
59684A122715J4558J6771J7412J6733J5490J3536J0623P460N019L514K636K025
$$ y = [1125781, 1136538, 1145109, 1151095, 1155715, 1160173, 1163985, 1165509, 1164002, 1160682, 1157530, 1155289, 1152805, 1148285, 1141029, 1131989, 1122859, 1114740, 1107544, 1100405, 1092574, 1084002, 1075189, 1066587, 1058307, 1050365, 1042817, 1035486, 1027899, 1019941, 1012318, 1005836, 1000359, 994988, 989179, 983184, 977423, 972050, 967158, 962816, 958895, 955486, 953364, 953072, 953427, 952078, 948022, 942645, 937814, 934055, 931241, 929782, 929892, 930576, 930728, 930706, 931487, 932737, 933148, 932493, 931891, 931922, 931781, 930575, 928418, 925965, 923767, 922310, 921765, 921458, 920457, 918842, 917592, 917134, 916999, 917087, 918113, 920342, 922899, 924942, 926813, 929549, 933965, 940569, 949471, 959716, 969378, 977069, 983095, 988947, 996202, 1005968, 1018397, 1032274, 1045867, 1058689, 1071657, 1085170, 1098251, 1110320, 1122715, 1137273, 1154044, 1171456, 1188189, 1203679, 1217215, 1227838, 1235298, 1240317, 1243831, 1246467, 1248492]
59672A248492J114n55k413l166k540j838k321l810n402o594p134o669n376m303
59658A197485m365n340o265o404n570m166l140l325m458n465n791n671n084l746
59644A128695k255j857k427k196l53J407J235j53o03M22J514J612J056M56mjR05
59627A127453K211K508J129q20j655j065m13j174l316n407o340o593p302q352
59613A090864q359o728m831m426n551o779p118o979p326q381r108p997m775j277
59599A001229K48k13n48L41J084L85n26L95K847M589M487L369K150R09j14m71
59583A020161o86j934m078n508n400m777m723n009n173n562o289o429n438m388
59569I54767m491n229n234m421l815l675l268k435j971k271k786l177l898n191
$$ y = [1248492, 1249606, 1249051, 1246638, 1243472, 1240932, 1239094, 1236773, 1232963, 1227561, 1220967, 1213833, 1207164, 1201788, 1197485, 1193120, 1187780, 1181515, 1175111, 1169541, 1165375, 1162235, 1158910, 1154452, 1148987, 1143196, 1137525, 1132441, 1128695, 1126440, 1124583, 1122156, 1119960, 1119607, 1121014, 1122249, 1122096, 1121493, 1121915, 1123429, 1125041, 1126097, 1126553, 1126549, 1126548, 1127453, 1129664, 1132172, 1133301, 1132481, 1130826, 1129761, 1129348, 1128174, 1124858, 1119451, 1113111, 1106518, 1099216, 1090864, 1082505, 1075777, 1070946, 1066520, 1060969, 1054190, 1047072, 1040093, 1032767, 1024386, 1015278, 1007281, 1002506, 1001229, 1001477, 1001264, 1000716, 1001057, 1002141, 1002526, 1002000, 1002395, 1005242, 1009831, 1014318, 1017687, 1019837, 1020746, 1020632, 1020161, 1019475, 1017541, 1013463, 1007955, 1002555, 997778, 993055, 988046, 982873, 977311, 971022, 964593, 959155, 954767, 950276, 945047, 939813, 935392, 931577, 927902, 924634, 922199, 920228, 917957, 915171, 911994, 908096, 902905]
59555I02905o368o710o417o026n412l984j692O15J814J309m33k032k158o82J295
59540H66024K615K877K173P86n58q82j6J048J464J516J610J109n44k165j977l82
59524H74698J91j308l046l039j823j062q72l57R4r01l180m678l993j890L6R35
59508H49805N40j107l085l828k941j861k016l004l431k802j634l49Q72J505J080
59493H27744J43j40N90J560K084K387L069M248N462O118N921N165M683N294P227
59478H81555J0192J3715J7064J9048J8586J5749J1929Q685O543M950L170J004
59466A012190j233l056l988l601j888K68J505J354Q53J238K185K094K10k400m178
59451A001553m656m393m133m543o008p999r199r032q544q955r796r621q265p158
$$ y = [902905, 896537, 889827, 883410, 877384, 871972, 867988, 866296, 866911, 868725, 870034, 869601, 867569, 865411, 864729, 866024, 868639, 871516, 873689, 874475, 873917, 873035, 873019, 874067, 875531, 877047, 878657, 879766, 879222, 877057, 875080, 874698, 874889, 873581, 870535, 867496, 865673, 864611, 863739, 863382, 863476, 862575, 859395, 854717, 850724, 848834, 848870, 849805, 850345, 849238, 846153, 842325, 839384, 837523, 835507, 832503, 829072, 826270, 824636, 824287, 825159, 826664, 827744, 827887, 827747, 828337, 829897, 831981, 834368, 837437, 841685, 847147, 853265, 859186, 864351, 869034, 874328, 881555, 891747, 905462, 922526, 941574, 960160, 975909, 987838, 996523, 1003066, 1008016, 1011186, 1012190, 1010957, 1007901, 1003913, 1000312, 998424, 998692, 1000197, 1001551, 1002404, 1003642, 1005827, 1007921, 1008131, 1005731, 1001553, 996897, 992504, 988371, 983828, 977820, 969821, 960622, 951590, 943046, 934091, 924295, 914674, 906409, 899251]
59437H99251p206p511o743m919l115j976j245n76j26k46q92j441j068N20K600
59422H65307L928L996L657M178N675O871O488M598K490J393J625K718L968M814
59408I21706N055M889M649M447M242M122M118L793K616Q78k93j63Q73K140L543
59393I66615N091O220O454O269O508P277Q143Q910R299Q473O117L494K015J082
59379A051967r97m031n864n554m716m888n361m801l454k404j799j277j030r91
59365A004800J62L475P705J0436J1021J1067J2057J3857J5636J7123J8517K0037
59353A145893K1863K4129K6713K9140L0543K9701K5760J9244J1833M824j364n954
59341A362325p476n620k264O22L003N416O608M512q11p034j2266j6316j9374k1121
$$ y = [899251, 892045, 884534, 877791, 872872, 869757, 867781, 866536, 865960, 865834, 865588, 864696, 863255, 862187, 862707, 865307, 869235, 873231, 876888, 881066, 886741, 893612, 900100, 904698, 907188, 908581, 910206, 912924, 916892, 921706, 926761, 931650, 936299, 940746, 944988, 949110, 953228, 957021, 959637, 960515, 960222, 960059, 960932, 963072, 966615, 971706, 977926, 984380, 990649, 997157, 1004434, 1012577, 1021487, 1030786, 1039259, 1045376, 1048870, 1050885, 1051967, 1050970, 1046939, 1041075, 1035521, 1030805, 1025917, 1020556, 1015755, 1012301, 1009897, 1008098, 1006821, 1005791, 1004800, 1004962, 1008437, 1016142, 1026578, 1037599, 1048666, 1060723, 1074580, 1090216, 1107339, 1125856, 1145893, 1167756, 1191885, 1218598, 1247738, 1278281, 1307982, 1333742, 1352986, 1364819, 1369643, 1368279, 1362325, 1354849, 1349229, 1346965, 1347587, 1350590, 1356006, 1362614, 1367126, 1366315, 1359281, 1347015, 1330699, 1311325, 1290204]
59327A290204k1458k0762j9108j6401j3308j0860r025o970m787l482k970j713
59315A159360R84L698M774M390L804L460K871J905J220J475K625L947M625M506
59301A203644M196M159L971L070J971J931L371N432P054P731P422O693P003R598
59287A277246J3772J7091J7774J6302J4485J3678J3987J4540J4291J3122J2047
59276A438335J1854J1969J1474J0469R204O571J461m600q423r144r192j0594j2393
59263A446991j2890j2462j2663j3851j5214j6133j6151j4680j2122j0315j0465
59252A300045j1398j1408j0913j1560j3214j3790j2124r317o927n256l836k448
59240A187854j037P31L147N984Q484R600Q434M994M81l713p328j1046j5032j8243
$$ y = [1290204, 1268746, 1247984, 1228876, 1212475, 1199167, 1188307, 1179282, 1172312, 1167525, 1164043, 1161073, 1159360, 1160344, 1164042, 1168816, 1173206, 1177010, 1180470, 1183341, 1185246, 1186466, 1187941, 1190566, 1194513, 1199138, 1203644, 1207840, 1211999, 1215970, 1219040, 1221011, 1222942, 1226313, 1231745, 1238799, 1246530, 1253952, 1260645, 1267648, 1277246, 1291018, 1308109, 1325883, 1342185, 1356670, 1370348, 1384335, 1398875, 1413166, 1426288, 1438335, 1450189, 1462158, 1473632, 1484101, 1493305, 1499876, 1501337, 1496737, 1488314, 1479170, 1469978, 1459384, 1446991, 1434101, 1421639, 1408976, 1395125, 1379911, 1363778, 1347627, 1332947, 1320825, 1310510, 1300045, 1288647, 1277239, 1266326, 1254766, 1241552, 1227762, 1215638, 1206321, 1199394, 1194138, 1190302, 1187854, 1186817, 1187548, 1190695, 1196679, 1205163, 1214763, 1223197, 1228191, 1228672, 1224959, 1217631, 1206585, 1191553, 1173310]
59226A173310j9369j8121j5355j2224r469p398o161n650n119l522o73K262M072
59213A076583N057O466Q615J0628J2006J3214J4405J4907J4544J4183J4154J3336
59201A218098J0972Q305O948O345M568J288j728l235m009n216o619p356p592q197
59187A212572r079q913o838l734j368n56p20j006j084p25N28K600M391M934M748
59172A195750N143O346P235O863N397L448J486No69j010j985l891o185q443j0524
59157A198966j1888j1877j0822r750q887p785o932p596r616j1103j0967j0066
59145A081677r080p246m455k715l690o081p247o436m723k850r81K30K47j76m8
59130A026426K85K96J059L734O829P520N720M339N097O398O274N375N621P290
$$ y = [1173310, 1153941, 1135820, 1120465, 1108241, 1098772, 1091374, 1085213, 1079563, 1074444, 1070922, 1070249, 1072511, 1076583, 1081640, 1088106, 1096721, 1107349, 1119355, 1132569, 1146974, 1161881, 1176425, 1190608, 1204762, 1218098, 1229070, 1237375, 1244323, 1250668, 1255236, 1256524, 1254796, 1251561, 1247552, 1242336, 1235717, 1228361, 1220769, 1212572, 1203493, 1194580, 1187742, 1184008, 1182640, 1182084, 1181364, 1180358, 1179274, 1178549, 1179077, 1181677, 1186068, 1191002, 1195750, 1200893, 1207239, 1214474, 1221337, 1226734, 1230182, 1231668, 1231673, 1231004, 1229994, 1228009, 1224118, 1217933, 1209490, 1198966, 1187078, 1175201, 1164379, 1154629, 1145742, 1137957, 1131025, 1123429, 1113813, 1102710, 1091743, 1081677, 1072597, 1065351, 1060896, 1058181, 1054491, 1048410, 1041163, 1034727, 1030004, 1027154, 1026173, 1026403, 1026650, 1026474, 1026426, 1026711, 1027007, 1028066, 1031800, 1038629, 1046149, 1051869, 1056208, 1061305, 1067703, 1073977, 1079352, 1084973, 1092263]
59116A092263Q890R265Q652P974P827Q051P976P363O940P419Q079P322M821K180
59102A195022J015J123J104K90n94n43J97j1k542o656r873j0648j0007r974j1076
59087A136827j2359j3157j3594j3605j2859j1747j1261j1718j2495j3059j3340
59076I97633j3080j1834r778p626n671l742k134j497j637j466m54P59J474J833
59062I42780K398L517N347P729R918J1214J1929J2828J3650J3275J1584R917R290
59049A065376R218Q919Q601Q613Q255O547L932K130K207L289L458J684j171l209
59035A127849l337k192j234j230j814k187j927j259r20j404k169k103j201j005
59021A103867k694n348p034p096o385n800n708o421p947r422r883r502r042q454
$$ y = [1092263, 1101153, 1110418, 1119070, 1127044, 1134871, 1142922, 1150898, 1158261, 1165201, 1172620, 1180699, 1188021, 1192842, 1195022, 1196037, 1197160, 1198264, 1198554, 1197960, 1197417, 1197614, 1197603, 1195061, 1188405, 1178532, 1167884, 1157877, 1147903, 1136827, 1124468, 1111311, 1097717, 1084112, 1071253, 1059506, 1048245, 1036527, 1024032, 1010973, 997633, 984553, 972719, 962941, 955315, 949644, 945902, 943768, 942271, 940634, 939168, 938714, 939473, 940947, 942780, 945178, 948695, 954042, 961771, 971689, 982903, 994832, 1007660, 1021310, 1034585, 1046169, 1056086, 1065376, 1074594, 1083513, 1092114, 1100727, 1108982, 1115529, 1119461, 1121591, 1123798, 1127087, 1130545, 1132229, 1131058, 1127849, 1124512, 1122320, 1121086, 1119856, 1118042, 1115855, 1113928, 1112669, 1111749, 1110345, 1108176, 1106073, 1104872, 1103867, 1101173, 1095825, 1088791, 1081695, 1075310, 1069510, 1063802, 1057381, 1049434, 1040012, 1030129, 1020627, 1011585, 1003131]
59007A003131p134n316l911l198l004l735n611p143o262l302r77j073k654l972
58993I45839m461m237l424k737l229m603n161m219l039k557j829K6J879K060P30
58978I11038o45j249j047J8J573K383J863J395K655N196P114P633P598P749Q106
58963I61380Q939J0764J3129J4727J5064J4930J4950J4762J4071J3375J2914J1769
58951A120774R033N410K686J693J595J312P83L77j58j220k149j681J82J852K164
58936A142653J709J491J333P56M61J393K883L415L039L249M428N168M565L426
58922A179969K588J659L45m36J17J404K566L961O390R551J2341J4122J4927J5004
58908A264508J4983J5744J7252J8189J7571J6163J5363J5310J5001J3790J1805
$$ y = [1003131, 995997, 990681, 986770, 983572, 980568, 976833, 971222, 964079, 957817, 954515, 953538, 952465, 949811, 945839, 941378, 937141, 933717, 930980, 927751, 923148, 917987, 913768, 910729, 908172, 906343, 906369, 908248, 910308, 911038, 910393, 909144, 908097, 908115, 909688, 912071, 913934, 915329, 917984, 923180, 930294, 937927, 945525, 953274, 961380, 970319, 981083, 994212, 1008939, 1024003, 1038933, 1053883, 1068645, 1082716, 1096091, 1109005, 1120774, 1129807, 1135217, 1137903, 1139596, 1141191, 1142503, 1143286, 1143663, 1143505, 1142285, 1140136, 1138455, 1138637, 1140489, 1142653, 1144362, 1145853, 1147186, 1147942, 1148403, 1149796, 1152679, 1156094, 1159133, 1162382, 1166810, 1171978, 1176543, 1179969, 1182557, 1184216, 1184561, 1184125, 1184242, 1185646, 1188212, 1192173, 1198563, 1208114, 1220455, 1234577, 1249504, 1264508, 1279491, 1295235, 1312487, 1330676, 1348247, 1364410, 1379773, 1395083, 1410084, 1423874, 1435679]
58897A435679R219O073K689n25l573o767j0213j3733j6848j8703j8725j7709j7371
58884A329493j8188j8599j7167j4794j3614j4254j5283j5180j3727j1512r021
58873A168154o652m911m064l626k638p46R88J069m09j484r03j9p07k183j994M
58857A139879J143K1j453j268l65o69j792j920p54N32J606L264N661P967R649
58842A161501J0738J1176J1142J1645J3443J5708J7085J7714J8734K0128K0700
58831A329714K0261K0272K1840K4185K5603K5185K3451K1845K1597K2425K2494
58820A578872K0358J6733J3505J1400R571P238M530J637j758n718r493j2088j3119
58807A621668j2986j2508j2381j2749j3347j4094j5112j6082j6233j5306j3909
$$ y = [1435679, 1444898, 1450971, 1453660, 1453135, 1449562, 1442795, 1432582, 1418849, 1402001, 1383298, 1364573, 1346864, 1329493, 1311305, 1292706, 1275539, 1260745, 1247131, 1232877, 1217594, 1202414, 1188687, 1177175, 1168154, 1161502, 1156591, 1152527, 1148901, 1146263, 1145517, 1146505, 1147574, 1147165, 1145681, 1144778, 1144759, 1144052, 1141869, 1139875, 1139879, 1141022, 1141043, 1139590, 1138322, 1137957, 1137288, 1135496, 1133576, 1132822, 1133354, 1134960, 1138224, 1143885, 1151852, 1161501, 1172239, 1183415, 1194557, 1206202, 1219645, 1235353, 1252438, 1270152, 1288886, 1309014, 1329714, 1349975, 1370247, 1392087, 1416272, 1441875, 1467060, 1490511, 1512356, 1533953, 1556378, 1578872, 1599230, 1615963, 1629468, 1640868, 1650439, 1657677, 1662207, 1663844, 1662086, 1656368, 1646875, 1634787, 1621668, 1608682, 1596174, 1583793, 1571044, 1557697, 1543603, 1528491, 1512409, 1496176, 1480870, 1466961]
58796A466961j2627j1630j1415j2850j5680j8024j8333j7140j6061j5810j6068
58785A301323j6451j6587j5912j4355j2660j1387j0445j0117j1161j2955j3262
58774A156031j1304r487j0147j1975j2004j0045q413p950p170n398l983l748l671
58761A050736k885j957j170N21L652O730P866P086N888N232M891M447L958L604
58747A098599L101J803m17k621l725m013m797o274p039o392n668o115o926o962
58733A042554p037q373r893r506p539o356o734p053o190m843l649k154k41J359
58719I64345K487L700M579L850J704J30J45M99n0r68j367j624k467l670m709n687
58703I60897o775p604p866p743p318o475n499m742l623j312J482K989K819K407
$$ y = [1466961, 1454334, 1442704, 1431289, 1418439, 1402759, 1384735, 1366402, 1349262, 1333201, 1317391, 1301323, 1284872, 1268285, 1252373, 1238018, 1225358, 1213971, 1203526, 1193409, 1182248, 1169293, 1156031, 1144727, 1135240, 1125093, 1113118, 1101114, 1091069, 1082656, 1074706, 1067536, 1062138, 1058155, 1054407, 1050736, 1047851, 1045894, 1044724, 1045245, 1048897, 1055627, 1063493, 1070579, 1076467, 1081699, 1086590, 1091037, 1094995, 1098599, 1101700, 1103503, 1103086, 1100465, 1096740, 1092727, 1087930, 1081656, 1074617, 1068225, 1062557, 1056442, 1049516, 1042554, 1035517, 1027144, 1017251, 1007745, 1000206, 993850, 987116, 980063, 973873, 969030, 965381, 963227, 962986, 964345, 966832, 970532, 975111, 978961, 980665, 980795, 980940, 981439, 981389, 980421, 979054, 977430, 974963, 971293, 966584, 960897, 954122, 946518, 938652, 930909, 923591, 917116, 911617, 906875, 903252, 901940, 903422, 906411, 909230, 911637]
58689I11637K687L042K998L058L265K802J911K383M917P565Q148O959N885N908
58675I73165O648P417P642P012O103O051O962P499O691N209M223L987M169M634
58661A057412N165N330N253N687O834P968Q559Q817Q916Q726Q410Q123P120M660
58647A156980J791N00Q57P95j031m012p341j0831j3677j4855j5347j7295k0302
58634A056232k1420j9909j8657j9283j9241j6413j3353j3568j5856j6108j3323
58623H69101j0152q339p192o305o482p618q284p882p124o134m092j070J466K326
58609G92219J608J67o60O32M074P338Q025O570N277N123N245N046M636L442O95
58594H49437k575m166l679l022l515m368m582m587n095n704n619m770l619k641
$$ y = [911637, 914324, 917366, 920364, 923422, 926687, 929489, 931400, 933783, 938700, 946265, 954413, 961372, 967257, 973165, 979813, 987230, 994872, 1001884, 1007987, 1014038, 1021000, 1028499, 1035190, 1040399, 1044622, 1048609, 1052778, 1057412, 1062577, 1067907, 1073160, 1078847, 1085681, 1093649, 1102208, 1111025, 1119941, 1128667, 1137077, 1145200, 1152320, 1156980, 1158771, 1159271, 1160128, 1160923, 1159892, 1155880, 1148539, 1137708, 1124031, 1109176, 1093829, 1076534, 1056232, 1034812, 1014903, 996246, 976963, 957722, 941309, 927956, 914388, 898532, 882424, 869101, 858949, 850610, 843418, 837113, 830631, 823013, 814729, 806847, 799723, 793589, 789497, 788427, 789893, 792219, 793827, 793994, 793334, 793966, 798040, 805378, 813403, 819973, 825250, 830373, 835618, 840664, 845300, 848742, 849437, 846862, 842696, 839017, 835995, 832480, 828112, 823530, 818943, 813848, 808144, 802525, 797755, 794136, 791495]
58580G91495k449l495n109n709m543k543j073l80K12J128K035K438K491K983M281
58565G81762N421M920K702M17n55m60r7N04J481K317K612K855L342L337K455J896
58549H14909K819M345M758M099L929M862N880N927M831K930R17k68m86p40j460
58534H57252j467QJ469J294O52J867M648O547O886P286Q283Q374P221O900Q638
58519I25858J0722J1237J0947J1618J3106J4035J4288J4932J6111J6733J6225
58508A075812J5403J5472J6891J9230K1686K3774K5751K8112L0591L2165L2274
58497A337161L1519L0754K9897K8132K5035K1075J7021J3062Q761M041r9k491
58485A543868l494m838p383j0010j1479j2278j3558j5145j6227j7399k0158k4374
$$ y = [791495, 789046, 785551, 780442, 774733, 770190, 767647, 766574, 766194, 766406, 767534, 769569, 772007, 774498, 777481, 781762, 787183, 792103, 794805, 795222, 794667, 794207, 794110, 794614, 796095, 798412, 801024, 803879, 807221, 810558, 813013, 814909, 817728, 822073, 826831, 830930, 834859, 839721, 845601, 851528, 856359, 859289, 860206, 859938, 859452, 858712, 857252, 855785, 855793, 857262, 858556, 859208, 861075, 865723, 872270, 879156, 886442, 894725, 903099, 910320, 917220, 925858, 936580, 947817, 958764, 970382, 983488, 997523, 1011811, 1026743, 1042854, 1059587, 1075812, 1091215, 1106687, 1123578, 1142808, 1164494, 1188268, 1214019, 1242131, 1272722, 1304887, 1337161, 1368680, 1399434, 1429331, 1457463, 1482498, 1503573, 1520594, 1533656, 1542417, 1546458, 1546359, 1543868, 1540374, 1535536, 1528153, 1518143, 1506664, 1494386, 1480828, 1465683, 1449456, 1432057, 1411899, 1387525]
58473A387525k7900k9053k8238k6803k5480k4348k3279k1914j9996j8024j6802
58462A125688j6136j4830j2314r569q013p996q682q984q371p048n547m166k993
58449A011039k448l040m318m901m068k582j383m79N4o39k667m213l629j892j194
58434I73640j691j596k35J093J427J394J767K397L095M237N896P477Q612R568
58420A017081J0557J1604J3125J5522J8134J9633J9690J9268J9086J8688J7213
58409A199601J4276J0156N774K328J35j825m410o848p839p479o722n500k974N78
58395A189251L771O014P833R333R897R587R358R524R246P826N446K520o59l588
58381A275359n911p983j0180j1849j2119j1324j0390r173o848l726j255k88n29
$$ y = [1387525, 1359625, 1330572, 1302334, 1275531, 1250051, 1225703, 1202424, 1180510, 1160514, 1142490, 1125688, 1109552, 1094722, 1082408, 1072839, 1064826, 1056830, 1048148, 1039164, 1030793, 1023745, 1018198, 1014032, 1011039, 1008591, 1005551, 1001233, 996332, 992264, 989682, 988299, 987820, 987874, 987235, 984568, 980355, 976726, 974834, 973640, 971949, 970353, 970118, 971211, 972638, 974032, 975799, 978196, 981291, 985528, 991424, 998901, 1007513, 1017081, 1027638, 1039242, 1052367, 1067889, 1086023, 1105656, 1125346, 1144614, 1163700, 1182388, 1199601, 1213877, 1224033, 1229807, 1232135, 1232270, 1230445, 1226035, 1219187, 1211348, 1203869, 1197147, 1191647, 1188673, 1189251, 1193022, 1199036, 1206869, 1216202, 1226099, 1235686, 1245044, 1254568, 1263814, 1271640, 1277086, 1279606, 1278947, 1275359, 1269448, 1261465, 1251285, 1239436, 1227317, 1215993, 1205603, 1196430, 1189582, 1185856, 1184601, 1184313, 1183784]
58368A183784j299j671m45K464N213O162O131O835P927P772O466N535N029L461
58354A243364O65j911l895o354r154j0504r837q808q669q811q591q492q669q256
58340A142078o952n564m418k995j576j251j785j587l34M95M21R68K898M632M836
58325A129866M596N556P261P944O923N114L841L846M852N786O049O358P373Q183
58311A213548P710O933P698R720J1080J1387J1961J2982J3158J2468J2470J3420
58299A344535J3777J3195J3428J5396J7693J8847J8924J8194J6358J3737J1292
58288A515376R094O793N396O088P444O855M702L880N077O200O805R061J3184J6028
58274A621983J5880J5013J5662J6943J7790J9406K2416K4542K3726K1216J9389
$$ y = [1183784, 1182485, 1180814, 1180369, 1182833, 1188046, 1194208, 1200339, 1207174, 1215101, 1222873, 1229339, 1234874, 1239903, 1243364, 1244029, 1242118, 1238223, 1231869, 1222715, 1212211, 1202374, 1193566, 1184897, 1176086, 1167495, 1159003, 1150334, 1142078, 1135126, 1129562, 1125144, 1122149, 1120573, 1119322, 1117537, 1115950, 1115616, 1116111, 1116532, 1117500, 1120398, 1125030, 1129866, 1134462, 1140018, 1147279, 1155223, 1162146, 1167260, 1171101, 1174947, 1179799, 1185585, 1191634, 1197992, 1205365, 1213548, 1221258, 1228191, 1235889, 1245609, 1256689, 1268076, 1280037, 1293019, 1306177, 1318645, 1331115, 1344535, 1358312, 1371507, 1384935, 1400331, 1418024, 1436871, 1455795, 1473989, 1490347, 1504084, 1515376, 1524470, 1531263, 1536659, 1542747, 1550191, 1557046, 1561748, 1565628, 1570705, 1576905, 1583710, 1592771, 1605955, 1621983, 1637863, 1652876, 1668538, 1685481, 1703271, 1722677, 1745093, 1769635, 1793361, 1814577, 1833966]
58263A833966J8645J8298J8226J7886J5918J2543J0286J0839J3100J5309J6829
58252B001845J7129J5762J4231J4931J7337J8346J7289J7136J9687K3156K5695
58241B202544K7616K8909K8457K7052K7211K8653K8315K6183K6190K9518L2139
58230B512787L1517L0605L2384L5379L7709M0689M4930M7768M8190M9600N3951
58219B965509N7858N8599N9099O2527O6557O7943O8541P1537P5513P7465P8517
58208C709665Q1671Q6675R1684R7203J04252J11404J17422J23709J30942J37067
58198D791694J41806J48599J58614J67828J74079J81351J92533K03695K10885
58189F371084K16977K25921K35830K43975K53227K66790K81655K94066L06671
$$ y = [1833966, 1852611, 1870909, 1889135, 1907021, 1922939, 1935482, 1945768, 1956607, 1969707, 1985016, 2001845, 2018974, 2034736, 2048967, 2063898, 2081235, 2099581, 2116870, 2134006, 2153693, 2176849, 2202544, 2230160, 2259069, 2287526, 2314578, 2341789, 2370442, 2398757, 2424940, 2451130, 2480648, 2512787, 2544304, 2574909, 2607293, 2642672, 2680381, 2721070, 2766000, 2813768, 2861958, 2911558, 2965509, 3023367, 3081966, 3141065, 3203592, 3270149, 3338092, 3406633, 3478170, 3553683, 3631148, 3709665, 3791336, 3878011, 3969695, 4066898, 4171150, 4282554, 4399976, 4523685, 4654627, 4791694, 4933500, 5082099, 5240713, 5408541, 5582620, 5763971, 5956504, 6160199, 6371084, 6588061, 6813982, 7049812, 7293787, 7547014, 7813804, 8095459, 8389525, 8696196]
58180H696196L23437L42306L59788L77992M00273M24916M49951M78862N14400
58171A2368121N52371N88957O28283O75001P25633P75420Q27344Q85811R48015
58162A8974956J010301J076278J149761J227356J307276J396844J501208J614076
58154B9258056J730754J860038K011033K179466K360819K565236K804233L075638
58146D7845273L379443L736059M170369M690732N301237O015208O832609P726481
58138H9697411Q686874R764955J1042540J2571562J4363427J6395661J8588146
58131A81110576K0836324K3147152K5646261K8229619L0153771L0189315K7418595
58124C66731613K1921561J4644806O690781j165606q410838j4579946j9289929
$$ y = [8696196, 9019633, 9361939, 9721727, 10099719, 10499992, 10924908, 11374859, 11853721, 12368121, 12920492, 13509449, 14137732, 14812733, 15538366, 16313786, 17141130, 18026941, 18974956, 19985257, 21061535, 22211296, 23438652, 24745928, 26142772, 27643980, 29258056, 30988810, 32848848, 34859881, 37039347, 39400166, 41965402, 44769635, 47845273, 51224716, 54960775, 59131144, 63821876, 69123113, 75138321, 81970930, 89697411, 98384285, 108149240, 119191780, 131763342, 146126769, 162522430, 181110576, 201946900, 225094052, 250740313, 278969932, 309123703, 339313018, 366731613, 388653174, 403297980, 409988761, 408823155, 400412317, 385832371, 366542442]
58117C66542442k2406043k4060527k4521859k4087359k3046012k1650305k0095686
58110B06674651j8535939j7093023j5821875j4686579j3608170j2534780j1454827
58103A02939458j0369740r288794q240873p261237o367006n561700m854166m252337
58095D6743605l744853l308840k932403k613903k344952k111305j907248j733779
58087B6046322j585246j451432j330241j225609j135136j051273r72354r01755
58079A6393276q38725p80008p27517o84616o47673o10543n74385n44015n17900
58070A0467894m90912m63740m40382m19287l96085l72348l52731l35946l17310
58061F879153k97834k82132k69593k56141k42579k32711k25199k15869k06320
$$ y = [366542442, 344136399, 320075872, 295554013, 271466654, 248420642, 226770337, 206674651, 188138712, 171045689, 155223814, 140537235, 126929065, 114394285, 102939458, 92569718, 83280924, 75040051, 67778814, 61411808, 55850108, 50995942, 46743605, 42998752, 39689912, 36757509, 34143606, 31798654, 29687349, 27780101, 26046322, 24461076, 23009644, 21679403, 20453794, 19318658, 18267385, 17295031, 16393276, 15554551, 14774543, 14047026, 13362410, 12714737, 12104194, 11529809, 10985794, 10467894, 9976982, 9513242, 9072860, 8653573, 8257488, 7885140, 7532409, 7196463, 6879153, 6581319, 6299187, 6029594, 5773453, 5530874, 5298163, 5072964, 4857095, 4650775]
58052D650775k01551k00266j95984j86983j77112j67481j55481j41867j30929
58043C093121j23211j15143j06222r9729r5931r1053q3734p6730p1681o7536o4249
58032B097902o2784o1584n8108n3528n0852m9197m5364m0212l7662l7825l7047
58021A563739l4689l3951l5792l7595l8212l9048l9787l8304l5204l3446l3141
58010A164570l1553k8340k5820k4057k0936j7310j6568j8488j8894j6299j3755
57999I32550j3168j2881j2043j2310j3709j3577j1335r886j0713j1699j1257j0594
57987G89378j0401r337p303o409p158p435o643o929q881r851q335o343n710n628
57973F83015n539o869r808j1817j1463j0638j1035j1458j0801j0598j2151j3744
$$ y = [4650775, 4449224, 4248958, 4052974, 3865991, 3688879, 3521398, 3365917, 3224050, 3093121, 2969910, 2854767, 2748545, 2648816, 2552885, 2461832, 2378098, 2301368, 2229687, 2162151, 2097902, 2035118, 1973534, 1915426, 1861898, 1811046, 1761849, 1716485, 1676273, 1638611, 1600786, 1563739, 1529050, 1495099, 1459307, 1421712, 1383500, 1344452, 1304665, 1266361, 1231157, 1197711, 1164570, 1133017, 1104677, 1078857, 1054800, 1033864, 1016554, 999986, 981498, 962604, 946305, 932550, 919382, 906501, 894458, 882148, 868439, 854862, 843527, 833641, 822928, 811229, 799972, 789378, 778977, 769640, 762337, 755928, 748770, 741335, 734692, 727763, 718882, 709031, 700696, 694353, 688643, 683015, 677476, 670607, 660799, 648982, 637519, 626881, 615846, 604388, 593587, 582989, 570838, 557094]
57961E57094j3298j1533j0244r409q295p515p732p799o300l805j965j393j730
57948D66076k637l540l596k960k872l696m135l226j739p88l39Q5M14M41K24k69
57932D37443r73j189m74K39j74j047r57k82n21j388j126K17N24q89k164k022j661
57915D23556k413l698m346m288l984l478k740j825n49Q28J009o10k238j807j64
57900C93253K65n54n93K69j2j740k805k483k544l628l934k750k000k637k622m56
57884C65029J961K238J019M55J012J883K874M023M613M258L879M344N276O067
57870D08931O696O773N449L124J425P27m03k478m042m375m838o085o338m381k210
57855C97975k436m503n735n144m132l942m203l920k810j608j295j708j290P25
$$ y = [557094, 543796, 532263, 522019, 512610, 504315, 496800, 489068, 481269, 474969, 471164, 469199, 467806, 466076, 463439, 459899, 456303, 453343, 450471, 446775, 442640, 439414, 437675, 436887, 436548, 436633, 437047, 437488, 437712, 437443, 436470, 435281, 434807, 435046, 434872, 433825, 432868, 432586, 432065, 430677, 429551, 429768, 430292, 429403, 427239, 425217, 423556, 421143, 417445, 413099, 408811, 404827, 401349, 398609, 396784, 396235, 397063, 398072, 397462, 395224, 393417, 393253, 393518, 392964, 392371, 392640, 392628, 390888, 388083, 385600, 383056, 379428, 375494, 372744, 370744, 368107, 365485, 365029, 366990, 369228, 370247, 370702, 371714, 373597, 376471, 380494, 385107, 389365, 393244, 397588, 402864, 408931, 415627, 422400, 427849, 430973, 432398, 433125, 432722, 430244, 426202, 421827, 416989, 410904, 404566, 400185, 397975, 395539, 391036, 385301, 380157, 376025, 372083, 367880, 363960, 361150, 359542, 358247, 356539, 355249, 355974]
57841C55974K420J307j921l962l250j293N16K530M563M965L452K251K900M154
57827C74606M489M337M339L728K262J508K250K699J217j095k421k938l586m024
57813C87371l952m550o383p489n899k651l05J95q38l444o948q795p139l589j044
57798C24540R7J320K859L734M067M755N438N211M804N670P261P550O131M671M301
57783C92409M442M235L470K113L73r56j418j759k629l226k731k222l210m920n060
57768C78911l146j162q01j696k587k907k935l278m252n257n271m439m253n238
57754C31689n718m049j115Q08O61j218m268p415q840p910o508o586p357o854n334
57739B59986m666n001m568k719q94k77m37n44k97M38J555K224J864J414K180L747
$$ y = [355974, 358394, 359701, 357780, 353818, 350568, 349275, 349791, 352321, 356884, 361849, 365301, 367552, 370452, 374606, 379095, 383432, 387771, 391499, 393761, 395269, 397519, 400218, 401435, 400340, 397919, 394981, 391395, 387371, 383419, 378869, 372486, 364997, 359098, 356447, 356142, 356337, 355499, 352055, 345107, 336312, 329173, 325584, 324540, 324637, 325957, 328816, 332550, 336617, 341372, 346810, 352021, 356825, 362495, 369756, 377306, 383437, 388108, 392409, 396851, 401086, 404556, 406669, 407042, 406086, 404668, 402909, 400280, 397054, 394323, 392101, 388891, 383971, 378911, 375765, 374603, 373802, 372106, 369519, 366612, 363677, 360399, 356147, 350890, 345619, 341180, 336927, 331689, 325971, 321922, 320807, 321615, 322276, 321058, 316790, 309375, 300535, 292625, 286117, 279531, 272174, 265320, 259986, 255320, 250319, 245751, 243032, 242138, 241861, 241424, 240880, 240583, 241021, 242576, 244800, 246664, 248078, 250258, 254005]
57723B54005M584M363M096M217M380M871O373Q256Q905P926O492N441M566L824
57709C32299L661M011M346M708N196M689J968j888m106l651k291j855k152k279
57695C42656k335k884l754m304m159l304k075j238j226j374q11J1j34j199j765
57680C12105j159l71l91r07j175j180j252j269r07k63J55j0m74l22J014K624K718
57663C08936R45q50r47J72J056J480J945K014R37o39j423j451j616j744j110m52
57647C07253j282l225m251l760l368m065m708m084k770k053k273k922l361l005
57633B62126j950j566l113n574o399m771k549j497j224n92M45J431K538M045N510
57618B46860O378O868P687R358J2154J5939K0032K3939K8277L4015M0709M6398
$$ y = [254005, 258589, 262952, 267048, 271265, 275645, 280516, 286889, 295145, 304050, 311976, 318468, 323909, 328475, 332299, 335960, 339971, 344317, 349025, 354221, 358910, 360878, 358990, 354884, 351233, 348942, 347087, 344935, 342656, 340321, 337437, 333683, 329379, 325220, 321916, 319841, 318603, 317377, 316003, 315192, 315203, 315069, 313870, 312105, 310946, 310575, 310184, 309277, 308102, 306922, 305670, 304401, 303494, 303231, 303386, 303376, 302902, 302580, 303594, 306218, 308936, 309881, 309031, 308084, 308256, 309312, 310792, 312737, 314751, 315688, 315049, 313626, 312175, 310559, 308815, 307705, 307253, 305971, 302746, 298495, 294735, 291367, 287302, 282594, 278510, 275740, 273687, 271414, 268492, 265131, 262126, 260176, 258610, 255497, 249923, 243524, 238753, 236204, 234707, 233483, 232891, 233336, 234767, 237305, 241350, 246860, 253238, 260106, 267793, 277151, 289305, 305244, 325276, 349215, 377492, 411507, 452216, 498614]
57606D98614M9065M7335M0309K8443J4402J368r694j9533k7773l2748l4347l4581
57594E20860l4736l4115l2400l0889l0169k8757k5525k1579j8199j4881j1250
57583B38360r044r766j1681j1578q850n576l129j070P65J451P45j43k11J62K70
57568A80705J32j01p72k005l125l437l175l110l432l617l267k695k456k562k526
57553A44557k278k549l934n681o160m676k426j283j894l196l663k858j776j687
57539A00496k664l582l679l521m049n111n712n366m540l947m047m936o006o064
57525C7272m592k607j449j087o61k09n42j542k088j808j623k171k888k998k362
57510H645j076O99K139K068L27j977l799B232b309k614J11J414R1k484l957l591
$$ y = [498614, 547679, 595014, 635323, 663766, 678168, 679536, 669842, 650309, 622536, 589788, 555441, 520860, 486124, 452009, 419609, 388720, 358551, 329794, 304269, 282690, 264491, 249610, 238360, 229316, 219550, 207869, 196291, 187441, 181865, 178736, 177666, 178431, 179882, 180627, 180484, 180273, 180435, 180705, 180837, 180736, 179964, 177959, 174834, 171397, 168222, 165112, 161680, 158063, 154796, 152101, 149645, 147083, 144557, 142279, 139730, 135796, 130115, 123955, 119279, 116853, 115570, 113676, 110480, 106817, 103959, 102183, 100496, 97832, 94250, 90571, 87050, 83001, 77890, 72178, 66812, 62272, 58325, 54278, 49342, 43336, 37272, 32680, 30073, 28624, 27537, 26876, 26667, 26125, 24583, 22495, 20687, 19064, 16893, 14005, 11007, 8645, 7569, 8268, 10407, 12475, 12802, 10825, 7026, 2232, -2309, -4923, -4812, -3398, -3307, -5791, -9748, -13339]
57494a3339k556k100k164j786n95L51l30k243l089j506Q10J261q9q71j42M50m06
57477b8344j600j501l86K45j80r27j049j95J063J331m13l328n139m487k160R1
57461d6979J065M18j333k806k894k221k473m070n661o148n880n478m856l905k989
57446i6210k178j018M84J645K105K005J209l51j678j596o72m79r91p58J66l2j712
57429a00061k846k326j741k534l710l913l668l771l422j843q9O33Q95J514J733
57414a25149Q85K37J013J957J238m39j002m33n52j942l365l948l924l447k485
57399a41356j710j868k535k802k711k639k126r73n83k252m722n466m044k326j635
57384a79748j610j573j262l49R97J354l09k566k945j231N36J040O63k57j735k617
$$ y = [-13339, -15895, -17995, -20159, -21945, -22540, -22189, -22519, -24762, -27851, -29357, -28547, -27286, -27375, -28246, -28388, -27938, -28344, -29944, -31445, -31831, -31586, -31766, -32693, -33742, -33937, -32874, -31543, -31956, -35284, -40423, -44910, -47070, -46979, -45914, -45496, -46829, -49635, -52529, -54750, -57223, -61293, -66954, -73102, -78982, -84460, -89316, -93221, -96210, -98388, -99406, -98922, -97277, -95172, -93167, -91958, -92309, -93987, -95583, -96255, -96734, -97725, -98483, -98317, -98349, -100061, -102907, -105233, -106974, -109508, -113218, -117131, -120799, -124570, -127992, -129835, -129924, -129291, -128396, -126882, -125149, -124264, -124027, -123014, -121057, -119819, -120258, -121260, -121693, -122245, -124187, -127552, -131500, -135424, -138871, -141356, -143066, -144934, -147469, -150271, -152982, -155621, -157747, -158720, -159303, -161555, -166277, -171743, -175787, -178113, -179748, -181358, -182931, -184193, -184542, -183545, -182191, -182500, -185066, -188011, -189242, -188706, -187666, -187003, -187260, -188995, -191612]
57368a91612j293J541L064K052L54j90j27n17p34J48J252J053k06r89q16n79o99
57351a88298m97L75J022M33j119k383k689k633l154m305n307n570n063l789j674
57336b24651O84J894J068j056k752k842j489N2L69p70j842j136R44K112J190m70
57320b28695j140j022j307k001k043q79J140L297M522L642P31k366l880l817l139
57305b36957k211j182p78j329j794j123J83J004J220J101K44j300j901l47J862
57290b43308K265R70K70J098K113K330K458L059L242K002k66k245k955k377j389
57275b32733j010j180q44J41J97j795m494n674m923l345j575K26J303J220R66
57260b53520J332J060j110l553l672k070j821l596m665l263j007n1l91j183k456
$$ y = [-191612, -192905, -191364, -188300, -186248, -185894, -186084, -186211, -186728, -187462, -187314, -186062, -185009, -185215, -186204, -187020, -187599, -188298, -188795, -188420, -187398, -186965, -188084, -190467, -193156, -195789, -198943, -203248, -208555, -214125, -219188, -222977, -224651, -223967, -222073, -221005, -222061, -224813, -227655, -229144, -229092, -228723, -229493, -231335, -232471, -231527, -229415, -228225, -228695, -229835, -230857, -232164, -234165, -236208, -237087, -235947, -232650, -228128, -224486, -223755, -226121, -230001, -233818, -236957, -239168, -240350, -241128, -242457, -244251, -245374, -245191, -244187, -242967, -241866, -241622, -242922, -244823, -245170, -243308, -241043, -240073, -239803, -238705, -236592, -234262, -231804, -228745, -225503, -223501, -223767, -226012, -228967, -231344, -232733, -233743, -234923, -235767, -235626, -235429, -237224, -241718, -247392, -252315, -255660, -257235, -257009, -255706, -254486, -253520, -252188, -251128, -252238, -255791, -259463, -261533, -263354, -266950, -271615, -274878, -275885, -275936, -276327, -277510, -279966]
57245b79966m081m893m189k837j889j403j406k495m543o064n905m608l383k630
57231c30292k134j764j373p67j97j32m08l18L91J491K974M764O117O515O729P614
57215c00790Q301P338N341M560N867P903R253R603Q722O319L242J057J76j10J87
57200b23031J636L573M463M282M483N514O407O853P443P738O583M680M232N537
57186a49607O469O056N841O868Q000Q428R277J1256J3130J3981J4728J5868a3723
57172E71J2829J3903J7038K0012K1773K2736K3336K3779K4299K4613K4115K3378
57160B52382K4114K6888L0288L2977L4933L6098L5820L4597L4368L5840L7417
57149F15722L7916L8423M0127M2231M3482M4107M4704M4842M4204M3734M4202
$$ y = [-279966, -284047, -288940, -293129, -295966, -297855, -299258, -300664, -303159, -307702, -313766, -319671, -324279, -327662, -330292, -332426, -334190, -335563, -336330, -336527, -336659, -337067, -337385, -336994, -335503, -332529, -327765, -321648, -315133, -308404, -300790, -292489, -285151, -279810, -275250, -269383, -261480, -252227, -242624, -233902, -227583, -224341, -223284, -223108, -223218, -223031, -221395, -217822, -213359, -209077, -204594, -199080, -192673, -185820, -178377, -170639, -164056, -159376, -155144, -149607, -143138, -137082, -131241, -124373, -116373, -107945, -98668, -87412, -74282, -60301, -45573, -29705, -13723, 571, 13400, 27303, 44341, 64353, 86126, 108862, 132198, 155977, 180276, 204889, 229004, 252382, 276496, 303384, 333672, 366649, 401582, 437680, 473500, 508097, 542465, 578305, 615722, 653638, 692061, 732188, 774419, 817901, 862008, 906712, 951554, 995758, 1039492, 1083694]
57138A083694M4907M4983M4761M4830M5082M5470M6342M7352M7736M8036M9557
57127A592750N1684N2276N1418N1810N4312N6117N5141N3388N3616N5070N4964
57116B182546N2459M8918M5659M3295M1928M0585L8033L5200L4680L6672L7890
57105B637865L6053L2929L1292L1440L2565L4869L8094M0382M0862M1225M2676
57094C040252M3701M2852M1163L9666L7199L2907K8281K4327J9399J2375N165
57083C367287n90o540j4624k3762l2253m0675m9662n7830o4713p2714q3179r3823
57071B826922j03013j12941j25220j37361j47599j59122j75183j93783k12006
57062A460694k31710k55865k82840l09754D2631c26778m02332m34601m69500n10693
$$ y = [1083694, 1128601, 1173584, 1218345, 1263175, 1308257, 1353727, 1400069, 1447421, 1495157, 1543193, 1592750, 1644434, 1696710, 1748128, 1799938, 1854250, 1910367, 1965508, 2018896, 2072512, 2127582, 2182546, 2235005, 2283923, 2329582, 2372877, 2414805, 2455390, 2493423, 2528623, 2563303, 2599975, 2637865, 2673918, 2706847, 2738139, 2769579, 2802144, 2837013, 2875107, 2915489, 2956351, 2997576, 3040252, 3083953, 3126805, 3167968, 3207634, 3244833, 3277740, 3306021, 3330348, 3349747, 3362122, 3367287, 3366697, 3360157, 3345533, 3321771, 3289518, 3248843, 3199181, 3141351, 3076638, 3003924, 2920745, 2826922, 2723909, 2610968, 2485748, 2348387, 2200788, 2041666, 1866483, 1672700, 1460694, 1228984, 973119, 690279, 380525, 42631, -326778, -729110, -1163711, -1633211, -2143904]
57052b143904n55605n99925o44891o93412p42958p89541q34558q79708r19117
57043h803619r44347r52250r38798q91114p98245o68821n31684m26558m00681
57034a5356117m93601o97063r38246j136380j278896j407454j516282j499654
57026b4323693j236902p33522j78294J27785p5910q40727j914200k827050l154846
57017c5157359k759226j803365n65227P38654J985704L099664M027335M739319
57009b5694501N210523N398138N259778M794782i72389B175801K183608J298412
57001E657821O07065J64250m7994r3579m4754M0458J25781J96151K49666K86775
56991G141640L06473L09531K99593K80107K53610K24226J97300J75766J59322
$$ y = [-2143904, -2699509, -3299434, -3944325, -4637737, -5380695, -6170236, -7004794, -7884502, -8803619, -9747966, -10700216, -11639014, -12530128, -13328373, -13997194, -14528878, -14955436, -15356117, -15849718, -16546781, -17485027, -18621407, -19900303, -21307757, -22824039, -24323693, -25560595, -26294117, -26472411, -26344626, -26420536, -27261263, -29175463, -32002513, -35157359, -37916585, -39719950, -40285177, -39546523, -37560819, -34461155, -30433820, -25694501, -20483978, -15085840, -9826062, -5031280, -972389, 2175801, 4359409, 5657821, 6264886, 6429136, 6381142, 6287563, 6242809, 6283267, 6409048, 6605199, 6854865, 7141640, 7448113, 7757644, 8057237, 8337344, 8590954, 8815180, 9012480, 9188246, 9347568]
56982I347568J47048J38108J30171J20209J07454R3463P9286O4712N0138L6715
56972A0314872K4510J2693J949n355p706n373J376J2637K6161L5721L3897J6787
56960A0462169j3894n2487r2737j30262j62922j89638k09641k23197k32244k39372
56950H915775k46085k52685k59882k69946k85436l06326l28274l44240l48648
56941F274253l40387l22196k97927k70867k43658k18202j95439j75840j59933
56932D049804j47513j37004j26893j17486j09786j03017r5245q6603p9770p6439
56922B970048p5113p3460p1206o9403o8127o6632o4879o3369o1807n9334n6053
56911B240665n3104n1104m9393m7000m3772m0100l6019l1055k5124j9176j4398
$$ y = [9347568, 9494616, 9632724, 9762895, 9883104, 9990558, 10084021, 10163307, 10228019, 10278157, 10314872, 10339382, 10352075, 10354024, 10348669, 10340963, 10335590, 10336966, 10349603, 10375764, 10411485, 10445382, 10462169, 10448275, 10395788, 10303051, 10172789, 10009867, 9820229, 9610588, 9387391, 9155147, 8915775, 8669690, 8417005, 8157123, 7887177, 7601741, 7295415, 6967141, 6622901, 6274253, 5933866, 5611670, 5313743, 5042876, 4799218, 4581016, 4385577, 4209737, 4049804, 3902291, 3765287, 3638394, 3520908, 3411122, 3308105, 3212860, 3126257, 3046487, 2970048, 2894935, 2821475, 2750269, 2680866, 2612739, 2546107, 2481228, 2417859, 2356052, 2296718, 2240665, 2187561, 2136457, 2087064, 2040064, 1996292, 1956192, 1920173, 1889118, 1863994, 1844818, 1830420]
56900A830420j0759p078k995l3J37k068m802p391j0845j5776k1092k5177k7427
56887A695114k8263k8400k8421k8383k7680k5987k4138k3125k2316j9984j5792
56876A422625j1458q531o610m372j368J685L517K854o86n728j0101j3150j6182
56863A352495k0214k4394k7273k8540k8660k7709k5618k2959k0572j8800j7681
56852A090075j7334j7442j6928j5056j2591j1115j1165j1526j0422p294l594j728
56840I53880k798n424p188p029n581l575j161J191K544K765K872L585M541N343
56826I43965O251P146O974M988J749j862n538q757j0243r429p561o170n197l858
56812I12458k533k137k034l30L554P999J1255J3337J5498J8688K2932K7527L1234
$$ y = [1830420, 1819661, 1812583, 1809588, 1809555, 1809692, 1807624, 1802822, 1795431, 1784586, 1768810, 1747718, 1722541, 1695114, 1666851, 1638451, 1610030, 1581647, 1553967, 1527980, 1503842, 1480717, 1458401, 1438417, 1422625, 1411167, 1402636, 1396026, 1391654, 1390286, 1391971, 1395488, 1398342, 1397656, 1391928, 1381827, 1368677, 1352495, 1332281, 1307887, 1280614, 1252074, 1223414, 1195705, 1170087, 1147128, 1126556, 1107756, 1090075, 1072741, 1055299, 1038371, 1023315, 1010724, 999609, 988444, 976918, 966496, 959202, 955608, 953880, 951082, 945658, 938470, 931441, 925860, 922285, 921124, 922315, 924859, 927624, 930496, 934081, 938622, 943965, 950216, 957362, 964336, 969324, 971073, 969211, 963673, 954916, 944673, 935244, 927683, 921513, 916316, 912458, 909925, 907788, 905754, 905424, 908978, 916977, 928232, 941569, 957067, 975755, 998687, 1026214, 1057448]
56799A057448L2747L1408K7384K1159J3323M897k665q256j1780j3885j5171j5719
56787A120890j5218j3361j0143n938j326L173P462J2015J7499K4055L1080L7852
56775A208040M3941M8579N0139M7132L9665K9300J7511N089p021j7431k5319l0904
56763A408721l4575l6212l5778l3769l0653k6573k2093j8223j5024j0930m628
56752A140263K955R544J4149J7782K1502K4626K5146K1429J3523L264o709j4613
56740A272861k0439k5257k9629l2920l4122l3140l1103k9282k7820k5824k2863
56729I60462j9711j7024j4014r605m597j090M20J758M151O133N521K222k309p382
56715I04935j3063j8407k1561k1956k0981k0240k0122k0276k0435k0331j9573
$$ y = [1057448, 1090195, 1121603, 1148987, 1170146, 1183469, 1188366, 1185701, 1177445, 1165665, 1151780, 1136609, 1120890, 1105672, 1092311, 1082168, 1076230, 1074904, 1078077, 1085539, 1097554, 1115053, 1139108, 1170188, 1208040, 1251981, 1300560, 1350699, 1397831, 1437496, 1466796, 1484307, 1489396, 1482375, 1464944, 1439625, 1408721, 1374146, 1337934, 1302156, 1268387, 1237734, 1211161, 1189068, 1170845, 1155821, 1144891, 1140263, 1143218, 1152762, 1166911, 1184693, 1206195, 1230821, 1255967, 1277396, 1290919, 1294183, 1287474, 1272861, 1252422, 1227165, 1197536, 1164616, 1130494, 1097354, 1066251, 1036969, 1009149, 983325, 960462, 940751, 923727, 909713, 900108, 895511, 894421, 894841, 896599, 900750, 906883, 912404, 914626, 912317, 904935, 891872, 873465, 851904, 829948, 808967, 788727, 768605, 748329, 727894, 707563, 687990]
56704F87990j8053j5970j3436j0616q282p319p573p872p391o310n071l818k874
56691E73405k850l757m700m901m510l975l252k227j333j115j498j993k359k565
56677E32370k512k307k506l360m144l937k972k434k804l220k719j617j058j578
56663D95202k453k547j526k38J46n49j295j189q16j541l442m807m201k400j395
56648D66949j821k337j640j83N80Q5q47j155o36J03M99O60J177K321L479L616
56632D70850K403P08k20P3J016J768J999J877J570J040L74R2P27J990K783K308
56616D91358Q61o51j637j831r95N84J698J342J49l17K15M21m41j362j316r34j413
56599D85731k491k675j137J520M118N723N923N077M083L392K657J716J226J523
$$ y = [687990, 669937, 653967, 640531, 629915, 621633, 614314, 606741, 598869, 591478, 585168, 580097, 576279, 573405, 570555, 566798, 562098, 557197, 552687, 548712, 545460, 543233, 541900, 540785, 539287, 537294, 534935, 532370, 529858, 527551, 525045, 521685, 517541, 513604, 510632, 508198, 505394, 502174, 499455, 497838, 496780, 495202, 492749, 490202, 488676, 488438, 488584, 488035, 486740, 485551, 484735, 483194, 479752, 474945, 470744, 468344, 466949, 465128, 462791, 461151, 460968, 461548, 461633, 460786, 459631, 458995, 459098, 459597, 460257, 461434, 463755, 467234, 470850, 473253, 473961, 473741, 473814, 474830, 476598, 478597, 480474, 482044, 483084, 483458, 483550, 484277, 486267, 489050, 491358, 492219, 491568, 489931, 488100, 487105, 487689, 489387, 490729, 490878, 490561, 490776, 491197, 490756, 489394, 488078, 487144, 485731, 483240, 480565, 479428, 480948, 485066, 490789, 496712, 501789, 505872, 509264, 511921, 513637, 514863, 516386]
56585E16386J749J076J50L2L33j63j396k139k109k297k936k741q78J565K914K873
56569E12419K431K435K908L381L383K842K160J736J563J679K484L835M348K839
56555E50443K33j340j339j197j796k278j941j636k148k611j866m74N0o16j498
56540E29986j947k133k128j668q97m54n56o26o9R08J467J023j15j049j303j406
56524E19033k067l052l505l210k789k606k346j835j315o69O98K756M460M978M569
56509E13100L883L216K814K998L497L650L706M759O814Q220Q063P711Q639R879
56495E90949R382P115M848L272J403j067k880l295l383m212n080m775l703l355
56481E85219l999m271l199j606r79j660k748l374l236k156j80J644J682l37k498
$$ y = [516386, 518135, 519211, 519361, 519393, 519726, 519563, 518167, 516028, 513919, 511622, 508686, 505945, 505067, 506632, 509546, 512419, 514850, 517285, 520193, 523574, 526957, 529799, 531959, 533695, 535258, 536937, 539421, 543256, 547604, 550443, 550676, 549336, 547997, 546800, 545004, 542726, 540785, 539149, 537001, 534390, 532524, 532050, 532100, 531484, 529986, 528039, 525906, 523778, 522110, 521213, 520759, 520203, 519577, 519508, 520416, 521883, 522906, 522791, 521742, 520439, 519033, 516966, 513914, 510409, 507199, 504410, 501804, 499458, 497623, 496308, 495639, 496337, 499093, 503553, 508531, 513100, 516983, 520199, 523013, 526011, 529508, 533158, 536864, 541623, 548437, 556657, 564720, 572431, 581070, 590949, 600331, 607446, 612294, 615566, 616969, 615902, 613022, 609727, 606344, 602132, 597052, 592277, 588574, 585219, 581220, 576949, 573750, 572144, 571165, 569505, 566757, 563383, 560147, 557991, 557811, 559455, 561137, 560800, 558302]
56466E58302k840j786j324k147k981k786k207k367l309m138l954k364P7J737J322
56451E29235l35j146o72o37k023l424l340k484k292k529k134j377j317j719j463
56436E02343o07j83r7Q69K722L700K640N99n86m26K04M40K46K09R28K363L626
56419E18990L674K145m06k761l531k221k68M1j699l284k809j165l51n13m55j88
56403E05199o67j358n33J740L205K725J850K113K688K163R73M30M02j80j202j411
56387E18137m59N06L64q81k571m040m715m372l477k635j686L5K377M078M104K857
56371E07622J668J372J708J905J516P35R4j26k15n76r64n86P18J767J201p17k182
56354E14940j963o70L82Q06R86J021Q61R36J545J901J057l50p20K6J24j303k723
$$ y = [558302, 555462, 553676, 552352, 550205, 547224, 544438, 542231, 539864, 536555, 532417, 528463, 526099, 526176, 527913, 529235, 528900, 527754, 527082, 526445, 524422, 520998, 517658, 515174, 512882, 510353, 508219, 506842, 505525, 503806, 502343, 501736, 501553, 501456, 502325, 505047, 508747, 511387, 511986, 511400, 510974, 511178, 511618, 511864, 512073, 513001, 515364, 518990, 522664, 524809, 524403, 521642, 518111, 515890, 515622, 515663, 513964, 510680, 507871, 506706, 506355, 505842, 505387, 505199, 504532, 503174, 502641, 504381, 507586, 510311, 512161, 514274, 516962, 519125, 520098, 520528, 520930, 520750, 519548, 518137, 517678, 518184, 518548, 517667, 515096, 511056, 506341, 501969, 498492, 495857, 494171, 494206, 496583, 500661, 504765, 507622, 509290, 510662, 512370, 514275, 515791, 516526, 516620, 516494, 516279, 515703, 514739, 514153, 514871, 516638, 517839, 517122, 514940, 512977, 512307, 512689, 513495, 514481, 515502, 516363, 517299, 518844, 520745, 521802, 521452, 520732, 520758, 520882, 519579, 516856]
56337E16856k321m31J244J829J576P57m03j141p46M61J551K166K513K617K370
56322E28898K020J795J429O96N0l7J24K9r3K31Q18J220J506J793J705J216J241
56305E44641K197K739J388j065k395j841n58N33J596K483K419J546J148J674J923
56290E58428R94k03l03O25J477J738J793K066K563L031L105K557J668J104J199
56275E81842J771K679M096N926P373P548O410M903M183M638N636O330O555O588
56261F56478O189M753K552Q78M97Q31J197J709K289K088J050P73K327M294M700
56246F92605L912L702M230M230L747M205N728O806O914P233Q236Q848Q764R334
56232G78494J0964J1762J0377Q532Q839J1171J3063J3074J2135J1748J2412J3930
$$ y = [516856, 514535, 514104, 515348, 517177, 518753, 519510, 519107, 517966, 517220, 517681, 519232, 521398, 523911, 526528, 528898, 530918, 532713, 534142, 534838, 534888, 534851, 534975, 535004, 534911, 535142, 535960, 537180, 538686, 540479, 542184, 543400, 544641, 546838, 549577, 550965, 549900, 547505, 545664, 545106, 545639, 547235, 549718, 552137, 553683, 554831, 556505, 558428, 559422, 559219, 558916, 559541, 561018, 562756, 564549, 566615, 569178, 572209, 575314, 577871, 579539, 580643, 581842, 583613, 586292, 590388, 596314, 603687, 611235, 617645, 622548, 626731, 631369, 637005, 643335, 649890, 656478, 662667, 667420, 669972, 670850, 671347, 672178, 673375, 675084, 677373, 679461, 680511, 681284, 683611, 687905, 692605, 696517, 700219, 704449, 708679, 712426, 716631, 722359, 729165, 736079, 743312, 751548, 760396, 769160, 778494, 789458, 801220, 811597, 820129, 828968, 840139, 853202, 866276, 878411, 890159, 902571, 916501]
56220I16501J6125J8664K0646K1035J9793J8453J9030K1942K5557K8263L0213
56209A156222L2203L3843L4534L5506L8721M3663M7444M8729M9610N2597N7511
56198A630583O2579O7321P2784P9792Q8118R7139J06426J15997J26330J37645
56188B584714J49041J59210J68135J77025J86204J94306K00002K03280K04277
56179D226194K02141J95903J85607J71658J53937J32402J07890Q1519N3802K4859
56169E535912n002l5186o4553r1171j13358j31231j46231j59028j69128j76575
56159D444449j82210j85686j85229j80481j73922j68139j63038j57044j49693
56150B899007j41564j32843j23738j15460j08960j03237r6465q8612q1375p5658
$$ y = [916501, 932626, 951290, 971936, 992971, 1012764, 1031217, 1050247, 1072189, 1097746, 1126009, 1156222, 1188425, 1222268, 1256802, 1292308, 1331029, 1374692, 1422136, 1470865, 1520475, 1573072, 1630583, 1693162, 1760483, 1833267, 1913059, 2001177, 2098316, 2204742, 2320739, 2447069, 2584714, 2733755, 2892965, 3061100, 3238125, 3424329, 3618635, 3818637, 4021917, 4226194, 4428335, 4624238, 4809845, 4981503, 5135440, 5267842, 5375732, 5457251, 5511053, 5535912, 5530910, 5495724, 5431171, 5340000, 5226642, 5095411, 4949180, 4790152, 4621024, 4444449, 4262239, 4076553, 3891324, 3710843, 3536921, 3368782, 3205744, 3048700, 2899007, 2757443, 2624600, 2500862, 2385402, 2276442, 2173205, 2076740, 1988128, 1906753, 1831095]
56140A831095p0479o4566n8003n1922m7186m3637m0478l7274l4390l2122k9854
56129A321184k6999k4348k3028k2141j9460j4941j1449j0783j0957r175n932m026
56117A137945m486n648n798m757k975q64Q58J634K068L209M793N438M761M105
56103A140283M709O196P402Q033Q747J0022J1563J2992J4635J7133K0268K2801
56091A284784K4032K5053K7635L2076L7092M1556M5361M8711N2027N6635O4057
56080A739019P3966Q4094R2559R9064J03352J04246J01214R5596Q9021Q1707P3564
56069B737402O5905O0446N6926N3102M7181L9488L1582K4303J6979Q606n33r197
56057C132190j7473k7346l9763n2344o2110o9590p7563q6068r1719r2507r0217
$$ y = [1831095, 1760616, 1696050, 1638047, 1586125, 1538939, 1495302, 1454824, 1417550, 1383160, 1351038, 1321184, 1294185, 1269837, 1246809, 1224668, 1205208, 1190267, 1178818, 1168035, 1157078, 1147903, 1141971, 1137945, 1133459, 1127811, 1122013, 1117256, 1114281, 1113417, 1114275, 1115909, 1117977, 1121186, 1125979, 1131417, 1136178, 1140283, 1144992, 1151188, 1158590, 1166623, 1175370, 1185392, 1196955, 1209947, 1224582, 1241715, 1261983, 1284784, 1308816, 1333869, 1361504, 1393580, 1430672, 1472228, 1517589, 1566300, 1618327, 1674962, 1739019, 1812985, 1897079, 1989638, 2088702, 2192054, 2296300, 2397514, 2493110, 2582131, 2663838, 2737402, 2803307, 2863753, 2920679, 2973781, 3020962, 3060450, 3092032, 3116335, 3133314, 3141920, 3141387, 3132190, 3114717, 3087371, 3047608, 2995264, 2933154, 2863564, 2786001, 2699933, 2608214, 2515707, 2425490]
56046B425490q7069q2863p7054p0978o5799o0367n3354m5982m0430l6749l3380
56035A771465k9710k6219k2935j9403j5596j1554o913j924J907L455L506L709
56023A649788M845O858R487J2002J3412J3601J3284J2666J1703J1710J4410J8817
56011A792583K1584K1414K0565K0991K1728K1695K2190K4515K7459K9353L0578
56000B054655L2036L3090L2948L2212L1325K9572K7209K6286K7624K9363L0198
55989B386518L1266L3088L3836L2962L3228L6364L9781M0748M0785M2617M5667
55978B796860M8174N1044N5697O0512O3295O5199O8410P2096P4327P5968P8964
55967C510546Q2777Q6062Q9673R4455R8621J00998J04216J10653J18199J24335
$$ y = [2425490, 2338421, 2255558, 2178504, 2107526, 2041727, 1981360, 1928006, 1882024, 1841594, 1804845, 1771465, 1741755, 1715536, 1692601, 1673198, 1657602, 1646048, 1639135, 1637211, 1639118, 1642573, 1646079, 1649788, 1654633, 1661491, 1670978, 1682980, 1696392, 1709993, 1723277, 1735943, 1747646, 1759356, 1773766, 1792583, 1814167, 1835581, 1856146, 1877137, 1898865, 1920560, 1942750, 1967265, 1994724, 2024077, 2054655, 2086691, 2119781, 2152729, 2184941, 2216266, 2245838, 2273047, 2299333, 2326957, 2356320, 2386518, 2417784, 2450872, 2484708, 2517670, 2550898, 2587262, 2627043, 2667791, 2708576, 2751193, 2796860, 2845034, 2896078, 2951775, 3012287, 3075582, 3140781, 3209191, 3281287, 3355614, 3431582, 3510546, 3593323, 3679385, 3769058, 3863513, 3962134, 4063132, 4167348, 4278001, 4396200, 4520535]
55957D520535J31282J42005J54011J62788J69120J77348J88232J99076K09172
55948F053569K19704K29893K38561K47807K59947K72804K83320K93552L07471
55939H406628L24267L40779L58043L79065M02814M27021M54188M87589N24182
55930A2104576N59217N95168O37775O85891P34167P83362Q38380Q98000R56824
55921A8793360J016191J082917J157920J236395J318552J409997J512109J622603
55913B9150044J744877J886117K047099K224793K423540K652123K912430L204481
55905D8245504L540870L942868M425086M997523N676149O473118P383503Q405178
55897I3089799R567150J0914121J2470629J4248717J6276337J8571956K1094857
$$ y = [4520535, 4651817, 4793822, 4947833, 5110621, 5279741, 5457089, 5645321, 5844397, 6053569, 6273273, 6503166, 6741727, 6989534, 7249481, 7522285, 7805605, 8099157, 8406628, 8730895, 9071674, 9429717, 9808782, 10211596, 10638617, 11092805, 11580394, 12104576, 12663793, 13258961, 13896736, 14582627, 15316794, 16100156, 16938536, 17836536, 18793360, 19809551, 20892468, 22050388, 23286783, 24605335, 26015332, 27527441, 29150044, 30894921, 32781038, 34828137, 37052930, 39476470, 42128593, 45041023, 48245504, 51786374, 55729242, 60154328, 65151851, 70828000, 77301118, 84684621, 93089799, 102656949, 113571070, 126041699, 140290416, 156566753, 175138709, 196233566]
55890A96233566K3757494K6431152K8786545L0079032K9274344K5642323J9326478
55883C79530934J1296730K754107n374508j2473076j8068867k1849154k3821843
55876C11994323k4326301k3833688k2747267k1346035j9813010j8261686j6758866
55869A64907470j5351023j4067520j2903650j1825090j0798786r809446q849723
55862H1302232p915855p018519o182005n425299m752913m164556l660580l234396
55854C8948109k871123k558405k290874k062583j864164j689734j538399j407115
55846B2665712j289708j184113j092833j014727r43773q77377q18631p68629p23450
55837A3952471o80535o41491o06608n72774n38939n08022m81222m55461m28510
$$ y = [196233566, 219991060, 246422212, 275208757, 305287789, 334562133, 360204456, 379530934, 390827664, 393581771, 388207263, 375734187, 357665320, 335816166, 311994323, 287668022, 263834334, 241087067, 219741032, 199928022, 181666336, 164907470, 149556447, 135488927, 122585277, 110760187, 99961401, 90151955, 81302232, 73386377, 66367858, 60185853, 54760554, 50007641, 45843085, 42182505, 38948109, 36076986, 33518581, 31227707, 29165124, 27300960, 25611226, 24072827, 22665712, 21376004, 20191891, 19099058, 18084331, 17140558, 16263181, 15444550, 14675921, 13952471, 13271936, 12630445, 12023837, 11451063, 10912124, 10404102, 9922880, 9467419, 9038909]
55828I038909m02075l78046l55915l35329l17178l00815k84091k67155k52611
55819F145694k41128k30757k21188k14677k11728k09622k06360k02674j99200
55810D208360j94828j88695j80987j71422j59668j47379j36746j27218j16785
55801B784632j06167r8151r2866q7465q0676p4107o8802o4093o0016n7415n5398
55790A939476n2288m9076m8179m8743m7389m3968m2063m2938m3449m1454l8962
55779A440967l7952l6978l4442l1928l1443l1864l0775k8102k5691k4469k3705
55768A103618k2218j9420j6099j4405j5528j7468j7047j4255j2281j3042j5078
55757I26777j6283j6174j4893j2427r624p838o921n646m382m796o464o640m209
$$ y = [9038909, 8636834, 8258788, 7902873, 7567544, 7250366, 6949551, 6665460, 6398305, 6145694, 5904566, 5673809, 5452621, 5237944, 5026216, 4816594, 4610234, 4407560, 4208360, 4013532, 3824837, 3643850, 3472428, 3312760, 3165381, 3028635, 2901417, 2784632, 2678465, 2580314, 2487448, 2399983, 2319307, 2245200, 2176398, 2112305, 2052289, 1994874, 1939476, 1887188, 1838112, 1789933, 1741190, 1693801, 1649833, 1607770, 1564832, 1521383, 1479929, 1440967, 1403015, 1366037, 1331595, 1299667, 1268224, 1236360, 1205585, 1177483, 1151792, 1127323, 1103618, 1081400, 1061980, 1045881, 1031476, 1015948, 998480, 981433, 967178, 954897, 941855, 926777, 910494, 894320, 879427, 867000, 857376, 849538, 842617, 836971, 832589, 827793, 821329, 814689, 810480]
55744H10480j219M77J476K699L615L926M659O110O792N813M412L850L582K678
55730H59350J383J18j445l392n030o069o858p198o680o413q090j1044j2714j2564
55716G73354j2883j4958j7209j8061j7868j6828j3940r581o345n443m851k836
55704F32551q91j063k727m203n463o931p584o550n052m519m396l741l350m154
55690E71927n141n132m963n615n936m738l540m373o176o443n401n351o520o822
55676D95776n683m875n116m791k908r88q59k223l467l799l757m389o230q520r559
55661D28612q457o156l993k093l53J13j570l732l505n08K685L917L548K918K497
55646D13923K203K135K200J978J390O87l48k140m117m875l909k243j111r21j612
$$ y = [810480, 809261, 809738, 811214, 813913, 817528, 821454, 826113, 832223, 839015, 844828, 849240, 853090, 856672, 859350, 860733, 860851, 859406, 856014, 850984, 844915, 838057, 830859, 824179, 817766, 809676, 798632, 785918, 773354, 760471, 745513, 728304, 710243, 692375, 675547, 661607, 652026, 645681, 640238, 635387, 632551, 631660, 630597, 627870, 623667, 618204, 611273, 603689, 597139, 592087, 587568, 583172, 579431, 576081, 571927, 566786, 561654, 556691, 551076, 545140, 540402, 536862, 532489, 526313, 519870, 514469, 509118, 502598, 495776, 490093, 485218, 480102, 475311, 472403, 471415, 470556, 468333, 464866, 461067, 457310, 452921, 446691, 438171, 428612, 420155, 413999, 410006, 407913, 407560, 407673, 406103, 402371, 398866, 398358, 401043, 404960, 408508, 411426, 413923, 416126, 418261, 420461, 422439, 423829, 424516, 424168, 422028, 417911, 413036, 409127, 406884, 405773, 404852, 403240]
55631D03240k958m168m269l210j841o42N38J435J341N49N97K293M431N211M302
55616D06849K827J998K314L447M267L621J740K71K18N70j39j485j701l28J049
55601D25518J015R5l59q2K72O42J645L172L996L224J471L8n13m36N2Q79J579J391
55583D43599N2j874l497m140l767l323m249o794r054q784o223l988l841m749m753
55568C74615l751l324m385o146p235p048n844m209k684j623j215j504k234k785
55554C20628k623j928j341j124j052j121j658k559l143l131l022l104k886k099
55540B89837j445j552j813j244j15K81n42j605j678n60J035K250K610K120J114
55525B88693o6j125j593j026K43R85L69q34r70N69K716M113M566M834N455O256
$$ y = [403240, 400282, 396114, 391845, 388635, 386794, 386152, 386690, 388125, 389466, 390015, 390612, 392905, 397336, 402547, 406849, 409676, 411674, 413988, 417435, 421702, 425323, 427063, 427334, 427552, 428122, 427983, 426498, 424797, 424469, 425518, 426533, 426628, 426269, 426187, 426459, 427101, 428746, 431918, 435914, 439138, 440609, 440647, 440134, 439698, 439750, 440629, 442208, 443599, 443651, 441777, 438280, 434140, 430373, 427050, 422801, 416007, 406953, 398169, 391946, 387958, 384117, 379368, 374615, 370864, 367540, 363155, 357009, 349774, 342726, 336882, 332673, 329989, 328366, 327151, 325647, 323413, 320628, 318005, 316077, 314736, 313612, 312560, 311439, 309781, 307222, 304079, 300948, 297926, 294822, 291936, 289837, 288392, 286840, 285027, 283783, 283668, 283949, 283407, 281802, 280124, 279564, 280599, 282849, 285459, 287579, 288693, 288627, 287502, 285909, 284883, 285126, 286111, 286480, 285646, 284676, 285245, 287961, 292074, 296640, 301474, 306929, 313185]
55509C13185O906P406P804P682O499M508K884K487K862K850J979P02n44j765k971
55494C62474m043n136o522p768p821o305m237k995k973l470l574k821j395J8Q49
55479C04281J271J826K439K358J283p4q38p65L1J412K722K770J173o78j040j31
55463C18040Oj771l961m206k363q25j503l530m719m579m553n458o389o474o162
55448B61553n871m933l192k235l224m617m111k142j117j561j596k86R99J064M73
55433B29204j60j218k494k629j355m29j098k317k707k549k351j275J226L555L725
55418B17128J984J10r91j467j313o80n29j394k196j703l98N26R84J355J076k91
55402B12201j560j451o84o52q37J19J480J163q21k164j673n03K37Q13J344J169
$$ y = [313185, 320091, 327497, 335301, 342983, 349482, 353990, 356874, 359361, 362223, 365073, 367052, 367754, 367210, 365445, 362474, 358431, 353295, 346773, 339005, 331184, 324879, 320642, 317647, 314674, 311204, 307630, 304809, 303414, 303432, 304281, 305552, 307378, 309817, 312175, 313458, 313384, 312546, 311781, 311812, 313224, 315946, 318716, 319889, 319211, 318171, 318040, 318046, 316275, 312314, 308108, 305745, 304920, 303417, 299887, 295168, 290589, 286036, 280578, 274189, 267715, 261553, 255682, 250749, 247557, 245322, 242098, 237481, 233370, 231228, 230111, 228550, 226954, 226668, 227667, 228731, 229204, 229044, 227826, 225332, 222703, 221348, 220919, 219821, 217504, 214797, 212248, 209897, 208622, 209848, 213403, 217128, 219112, 219222, 218231, 216764, 215451, 214771, 214242, 212848, 210652, 208949, 208551, 209077, 210061, 211416, 212492, 212201, 210641, 209190, 208506, 207854, 207017, 207136, 208616, 209779, 208958, 206794, 205121, 204618, 204855, 205668, 207012, 208181]
55386B08181M80N45J486J589q8k157k996k939l147l520l107j847o17N0M09Q13
55370A93135J217J288P95R4M0R51J896J706M62q36j770k531k738j600N54K259
55354A94922K708K413J897J055J16p6O43J251R67K32j89j75J21O20Q61K40q15
55337B06791j058k95J38m75q21N10K577K958Q69j743k364n69J745K485J459K08
55321B12415j57k58j125k362k745k101j244k36J543L479L660J440j355k607k180
55306B06167j181k75L14J50p62j429j001J0N15L61J88K11M5n59j453k265k415
55289A96621j414L34J528J354M53j1L11J079K002K694K359P20r58q41J257L313
55273B10801L205J037j040j310k98K95P3K53J350J898O65j002q72P55J450M52
$$ y = [208181, 208661, 209206, 210692, 212281, 212193, 210036, 207040, 204101, 200954, 197434, 194327, 192480, 191863, 191913, 192322, 193135, 194352, 195640, 196435, 196529, 196569, 197520, 199416, 201122, 201584, 200748, 198978, 196447, 193709, 192109, 192663, 194922, 197630, 200043, 201940, 202995, 203111, 203035, 203678, 204929, 205896, 206128, 205939, 205764, 205885, 206505, 207366, 207606, 206791, 205733, 205438, 205576, 205101, 204280, 204790, 207367, 210325, 211194, 209451, 207087, 206518, 208263, 210748, 212207, 212415, 212258, 212000, 210875, 208513, 205768, 203667, 202423, 202187, 203730, 207209, 210869, 212309, 210954, 208347, 206167, 204986, 204711, 205025, 205175, 204413, 202984, 201983, 201993, 202508, 202869, 203057, 203268, 203313, 202754, 201301, 199036, 196621, 195207, 195541, 197069, 198423, 198876, 198865, 199176, 200255, 202257, 204951, 207310, 208030, 207072, 206231, 207488, 210801, 214006, 215043, 214003, 212693, 212395, 212690, 212763, 213016, 214366, 216264, 216929, 215927, 215055, 215810, 217260, 217712]
55257B17712k30Q24K103J466q00k597k699j527j46L79n39k122k450p05J527K032
55241B12228N22j481k562k340j182J9K87k66l32Q22K108K069Q15l62o07J13J482
55224B11333K602K133j68k590l248k188p12N71J732K354J922R52K86l38j568k659
55208B10414k149k61J035O16m75o78K71J499J980J151n84j805j400J8Q01L24n60
55191B10197r10n04O20K197L259K839J375K95M6k61j120j842j926j876j943j319
55175B09127N11K443K840J496k16r15m15L33J18j378l116l673k849j771j280r56
55159B00299j09Q94R75k49j881k538j530M78J965J968J041N25R00J361J059K50
55143B05408q4N56J572J752N52j058j317K92K211K575J424M01M78J038J144P33
$$ y = [217712, 217482, 218306, 220409, 221875, 221075, 218478, 215779, 214252, 214106, 214485, 213946, 211824, 209374, 208669, 210196, 212228, 212750, 211269, 208707, 206367, 205185, 205204, 205491, 205225, 204893, 205715, 207823, 209892, 210707, 210345, 209738, 209851, 211333, 213935, 216068, 215900, 213310, 210062, 207874, 207162, 207733, 209465, 211819, 213741, 214693, 214979, 214641, 213073, 210414, 208265, 208004, 209039, 209655, 209180, 208502, 208773, 210272, 212252, 213403, 212819, 211014, 209614, 209632, 210433, 210757, 210197, 209287, 208783, 209403, 211600, 214859, 217698, 219073, 219368, 219414, 219153, 218033, 216191, 214265, 212389, 210446, 209127, 209638, 212081, 214921, 216417, 216201, 215286, 214871, 215204, 215322, 213944, 210828, 207155, 204306, 202535, 201255, 200299, 200190, 201084, 202059, 201810, 199929, 197391, 195861, 196339, 198304, 200272, 201313, 201838, 202738, 204099, 205158, 205408, 205324, 205880, 207452, 209204, 209756, 208698, 207381, 207673, 209884, 212459, 213883, 214284, 214762, 215800, 216944, 217677]
55127B17677K72nj61l84q69j485j612q75J31O09Q80J907L488M130L025J181n5
55110B27854n85j065j528j482j011r19j708k810l081j980k62P32N93K65O15R96
55094B14624J31j878l314k788o78J504K561K276J272L90jr2J04R56K122K163L01
55077B19653k130l274l178k995k511o10K002L014J905P24O70L78j174k353j446
55062B08675L65P99n6l19N25J306J482J622J793J378N34Q5n7o55j364q74P85J807
55044B17831J061l90r73o36l51m42l55L59J483K386K464J627N25J03P50K097L524
55027B31063M503M630L830K469Q93r75l115m799n119l950j902L50K115K627J914
55012B34534J261J773K743K596J358O00R80J292N71m03m84j4j68j161k023j810
$$ y = [217677, 217949, 217944, 217783, 217399, 216530, 215045, 213433, 212558, 212689, 213298, 214178, 216085, 219573, 223703, 226728, 227909, 227854, 227269, 226204, 224676, 223194, 222183, 221264, 219556, 216746, 213665, 211685, 211423, 212155, 212748, 213013, 213628, 214624, 214755, 212877, 209563, 206775, 206097, 207601, 210162, 212438, 213710, 214100, 214099, 214007, 214111, 215067, 217189, 219352, 219653, 217523, 214249, 211071, 208076, 205565, 204955, 206957, 209971, 211876, 212600, 213270, 213648, 212474, 210121, 208675, 209040, 209839, 209783, 209464, 209989, 211295, 212777, 214399, 216192, 217570, 218104, 218189, 218132, 217477, 216113, 215239, 216024, 217831, 218892, 218502, 217529, 216893, 216542, 216100, 215745, 216104, 217587, 219973, 222437, 224064, 224589, 224692, 225442, 227539, 231063, 235566, 240196, 244026, 246495, 247388, 246413, 243298, 238499, 233380, 229430, 227528, 227878, 229993, 232620, 234534, 235795, 237568, 240311, 242907, 244265, 244865, 245845, 247137, 247708, 247305, 246821, 246807, 246639, 245478, 243455, 241645]
54996B41645m69J167J849Q94q87j852j469q71j091j654j610j095q46p72k09P64
54980B33494J313J056L51m71j262j506o34Q84J710J210J75l71m61p72j472j980
54964B31264j704o49O10J298J013O2q23j157r40k85P13J677J984J474Q06P26J180
54947B37249J466J087J45q70j351q77K95J073N27r00j721j148J7N46L02J18N25
54930B36483J266J921K329K337J790R41L69K60J93r9k37J92R78J635J970J814
54914B54142P48j171k727k604j091J79K94l5J02N80R87J590K502K675J030j547
54898B55654k724j478P16J830J454M94l31p94o02L27J241J169K06n74n71k20k4
54881B55773J60M68M73j10p60r01q47j208j662j274M3J278J725J745J776J521
$$ y = [241645, 241176, 242343, 244192, 245086, 244199, 242347, 240878, 240007, 238916, 237262, 235652, 234557, 233711, 232939, 232730, 233494, 234807, 235863, 236214, 235743, 234481, 232975, 232341, 233225, 234935, 236145, 236320, 235949, 235488, 234716, 233244, 231264, 229560, 228911, 229521, 230819, 231832, 231894, 231071, 229914, 228974, 228689, 229402, 231079, 233063, 234537, 235343, 236069, 237249, 238715, 239802, 239947, 239077, 237726, 236849, 237144, 238217, 238744, 237844, 236123, 234975, 234992, 235538, 235840, 235958, 236483, 237749, 239670, 241999, 244336, 246126, 247067, 247436, 247696, 247889, 247790, 247553, 247745, 248723, 250358, 252328, 254142, 254890, 253719, 250992, 248388, 247297, 247476, 247770, 247735, 247837, 248417, 249404, 250994, 253496, 256171, 257201, 255654, 252930, 251452, 252168, 253998, 255452, 255946, 255615, 254821, 254219, 254546, 255787, 256956, 257162, 256588, 256017, 255797, 255773, 255933, 256401, 256874, 256764, 256004, 255103, 254256, 253048, 251386, 250112, 250155, 251433, 253158, 254903, 256679, 258200]
54865B58200P72M67J775M339O312O412N290M542M899N808O399O251N467M585M457
54850C25975N555P075P242N046J483j423k810l616m952o479o922n786l975k724
54836C13689k430k698l093l494l933m328m486m209l402k167r20l16p39j675j876
54821B73923n63J605L274L997M406M735M238K712J613K480M731O363O620O598
54807C26732P062P137N924M133L085K802K103K89k219m547n967o105n350m929
54793C30150n739p195p867p209n962m967m371m046l871l409k165n65R3q18k356
54778B69703l346l871m601n105m113j539R02J695J301J158J455J031n97k126j979
54763B49968k81J291J441M89l65m77k94o40j618k332j853l99Q22J066Q76J096
$$ y = [258200, 258972, 259439, 261214, 265553, 271865, 278277, 283567, 288109, 293008, 298816, 305215, 311466, 316933, 321518, 325975, 331530, 338605, 345847, 350893, 352376, 350953, 348143, 344527, 339575, 333096, 326174, 320388, 316413, 313689, 311259, 308561, 305468, 301974, 298041, 293713, 289227, 285018, 281616, 279449, 278529, 278213, 277474, 275799, 273923, 273360, 274965, 278239, 282236, 286642, 291377, 295615, 298327, 299940, 302420, 307151, 313514, 320134, 326732, 333794, 340931, 346855, 350988, 354073, 356875, 358978, 359267, 357048, 352501, 346534, 340429, 335079, 330150, 324411, 317216, 309349, 302140, 296178, 291211, 286840, 282794, 278923, 275514, 273349, 272784, 272877, 272059, 269703, 266357, 262486, 257885, 252780, 248667, 247128, 248030, 249725, 251026, 252184, 253639, 254670, 254073, 251947, 249968, 249687, 250978, 252419, 252908, 252543, 252066, 251772, 251132, 249514, 247182, 245329, 244930, 245752, 246818, 247694, 248790]
54747B48790J567J541J005O67O63L84j18K72K050L764L469J143j340k503k594
54732B58760k420j910n35J310K369K071J348J419K146K247J130k13m70L99J278
54717B68929J268M18o32j132o25N43J394J622K300M339O701P446O443N523N777
54702C10314O353O484O901Q154R082Q515P332P015O969N226J575j915l656m256
54688C74093m992n979o536o361n667m773m060l875m134m419m620n017n564n665
54674C02431m787l031r85N42Q52l0j082j188k88Q24J695K447L048L180K923K778
54658C09329K876K851K749L252M674O204O487M878K078k12n89O09J388J61k576
54643C44159n102o380o394n333l659k512k663l302l136k333j952j879j278q13
$$ y = [248790, 250357, 251898, 252903, 253570, 254233, 254617, 254499, 254771, 256821, 260585, 264054, 265197, 263857, 261354, 258760, 256340, 254430, 253895, 255205, 257574, 259645, 260993, 262412, 264558, 266805, 267935, 267722, 267252, 267651, 268929, 270197, 270615, 269983, 268851, 268226, 268769, 270163, 271785, 274085, 278424, 285125, 292571, 299014, 304537, 310314, 316667, 323151, 330052, 338206, 347288, 355803, 363135, 370150, 377119, 382345, 383920, 382005, 378349, 374093, 369101, 363122, 356586, 350225, 344558, 339785, 335725, 331850, 327716, 323297, 318677, 313660, 308096, 302431, 297644, 294613, 293628, 294170, 295022, 294992, 293910, 292722, 292434, 293258, 294953, 297400, 300448, 303628, 306551, 309329, 312205, 315056, 317805, 321057, 325731, 331935, 338422, 343300, 345378, 345166, 344577, 345186, 346574, 346735, 344159, 339057, 332677, 326283, 320950, 317291, 314779, 312116, 308814, 305678, 303345, 301393, 299514, 298236, 297423]
54629B97423k013m207m575k269pk21j758k185j474j324k182l132l775m178l727
54614B60396k074n16n05j279r68L67J030O73O52J329J338J81o84j90O96P67M12
54597B61625N04P79N93K67M09O54L29k20j38M62O27N6n48o18m37n70j061j393
54579B61320r94K62J843K852K695J506r2j388j866j449o61j94j62p3L60P95Q16
54562B65570M73L3m78j060j393j098k98M12N60J78k75k87L18J140J429P33n61
54545B65396j464j309n02j33p06j442j268l29J79k84q60o49lK54K04M42P54L23
54527B58603q66j861k038j673j084k08P58J182R36P64J311K284K914K804K045
54512B65871J074N79R56J606J503N96p9o3k49j394k635k422n93J325J762M51j656
$$ y = [297423, 295410, 291203, 286628, 284359, 284352, 284131, 282373, 280188, 278714, 277390, 275208, 272076, 268301, 264123, 260396, 258322, 257806, 257301, 256022, 255054, 255421, 256451, 257124, 257776, 259105, 260443, 260624, 259940, 259750, 260446, 261213, 261625, 262129, 262908, 263501, 263768, 264177, 264831, 265160, 264940, 264802, 265264, 265891, 265947, 265399, 264781, 264344, 263774, 262713, 261320, 260326, 260588, 262431, 265283, 267978, 269484, 269392, 268004, 266138, 264689, 264028, 263834, 263672, 263599, 263959, 264754, 265570, 266043, 266076, 265598, 264538, 263145, 262047, 261749, 262161, 262721, 262899, 262624, 262337, 262655, 263795, 265224, 265957, 265396, 263932, 262623, 262121, 261988, 261282, 259840, 258572, 258243, 258422, 258138, 257278, 256629, 256626, 256880, 257084, 257526, 258280, 258603, 257737, 255876, 253838, 252165, 251081, 250873, 251631, 252813, 253749, 254513, 255824, 258108, 261022, 263826, 265871, 266945, 267524, 268480, 270086, 271589, 272185, 272106, 272043, 271794, 270400, 267765, 265343, 264750, 266075, 267837, 268288, 266632]
54495B66632l218l315j945O9J721K431K145J287O13O59J221J678J850K035K249
54480B76112K200J927J712J304L21m79K05J895K202P7k303k387p08K66k01p44
54464B81399o98q23j229q55L30P64j96r88l40O41L81m70j32J392K337J730K35
54447B83478j434l083l992l011m47J587J610N38J59Q43J755K445K909K561P00
54432B86618j968l547l056j349L66J826K940K921J303p57j533q49j46l54p57l67
54416B81291N22Q06J47n88m09O43J511J206Mo39L43K194L022J960O3j098j096
54399B89882n43M4N92J071J395J572J472O22j193l148l756k272N49L116M201L542
54383B97146J694l60j574j188P39L007L825K333m43k513k916k328j816j684j748
$$ y = [266632, 263414, 260099, 258154, 258223, 259944, 262375, 264520, 265807, 266420, 267079, 268300, 269978, 271828, 273863, 276112, 278312, 280239, 281951, 283255, 283576, 283097, 283302, 285197, 287399, 287476, 285173, 282786, 282078, 282344, 282143, 281399, 280701, 279878, 278649, 277794, 278124, 278888, 278692, 277704, 277364, 278005, 278386, 277916, 277784, 279176, 281513, 283243, 283478, 282044, 278961, 274969, 271958, 271511, 273098, 274708, 275246, 275405, 276248, 278003, 280448, 283357, 285918, 286618, 284650, 281103, 278047, 276698, 277064, 278890, 281830, 284751, 286054, 285297, 283764, 282915, 282769, 282415, 281658, 281291, 281813, 282619, 282766, 282178, 281769, 282412, 283923, 285129, 285133, 284494, 284837, 287031, 290053, 292013, 292076, 290978, 289882, 289339, 289383, 289975, 291046, 292441, 294013, 295485, 296107, 294914, 291766, 288010, 285738, 286287, 289403, 293604, 297146, 298840, 298480, 296906, 295718, 296457, 299464, 303289, 305622, 305179, 302666, 299750, 297422, 295606, 293922, 292174]
54368B92174j842j642o79Q22J795J580P64J51k92o46j29J578K885J980j54l97
54352B97948K278N044M702J561j464k508k043j128j38O75Q35M42M29J288K113
54337C10034J644R8p62L42K550L689K710P20n42o65m28k71J78J035J670J615J183
54320C24800P77K84k89k90P06J903K087J225L66M4l55j364k205j464J162M158
54304C31545N449M469K862K822M720O729O900N000K101q08l064l926l217k099
54290C59483j946k402j825L2J164o7k613m181m118l544l111k282r92m08j313k737
54274C29140l216k796k808l814m791m495k961j180K46J557K939L714K950Q10j200
54259C14095j781j313j110j407r97P20K427K553J605J409K254K326M89j757k232
$$ y = [292174, 290332, 288690, 288011, 288833, 290628, 292208, 292972, 293123, 292831, 292185, 292056, 293634, 296519, 298499, 298345, 297948, 300226, 305270, 309972, 311533, 310069, 307561, 305518, 304390, 304252, 304927, 305762, 306204, 306633, 307921, 310034, 311678, 311776, 311014, 311356, 313906, 317595, 320305, 321025, 320483, 319818, 319390, 319119, 319297, 320332, 322002, 323617, 324800, 325577, 325861, 325572, 325282, 325988, 327891, 329978, 331203, 331569, 331613, 331258, 329894, 327689, 326225, 327387, 331545, 336994, 341463, 344325, 347147, 351867, 358596, 365496, 370496, 372597, 371789, 368725, 364799, 361582, 359483, 357537, 355135, 353310, 353342, 354506, 354439, 351826, 347645, 343527, 339983, 336872, 334590, 333598, 333190, 331877, 329140, 325924, 323128, 320320, 316506, 311715, 307220, 304259, 303079, 303325, 304882, 307821, 311535, 314485, 315295, 314095, 312314, 311001, 309891, 308484, 307487, 308207, 310634, 313187, 314792, 316201, 318455, 320781, 321270, 319513, 317281]
54244C17281j032k83j197k682k921j388R70K693K674Q46j554k860k564j633j094
54229C05256q73l92K85N54K26k57l99m7O76J370J447P81J40M67J606K269J465
54212C14574k85j406q08J015K414K076K64j515k114j628o39Q27K865M697N127
54197C25464M057K709K013J597O50q92k471l507l401j761O58J951J041q52j739
54182C25517j393j086j151n09J158K472K316J348N41l21j450j739l74J104N63
54167C26996j285j553M92K180J424k35j86J367K096J131k32r90j490j918j666
54152C26131o96m6k72o02m21l97j209k142k011r29r6j86q78j660k159j906o90
54135C09831P42J286Q05K30K37N51Q13J176J692J744Q09o09j488j488j066o06
$$ y = [317281, 316249, 315966, 314769, 312087, 309166, 307778, 308748, 311441, 314115, 314961, 313407, 310547, 307983, 306350, 305256, 304383, 303991, 304276, 304830, 305056, 304799, 304400, 304353, 305029, 306399, 307846, 308627, 308767, 309234, 310840, 313109, 314574, 314289, 312883, 312075, 313090, 315504, 317580, 317844, 316329, 314215, 312587, 311948, 312775, 315640, 320337, 325464, 329521, 332230, 334243, 335840, 336490, 335598, 333127, 329620, 326219, 324458, 325116, 327067, 328108, 327256, 325517, 324124, 323038, 321887, 321378, 322536, 325008, 327324, 328672, 329213, 328892, 327442, 325703, 325329, 326433, 326996, 325711, 324158, 324650, 326830, 328254, 328019, 327833, 329200, 331296, 332427, 332195, 331205, 329715, 327797, 326131, 325435, 325389, 325117, 324515, 324094, 323697, 322488, 320346, 318335, 317406, 317310, 317124, 316246, 314586, 312427, 310521, 309831, 310573, 311859, 312664, 312894, 313131, 313682, 314495, 315671, 317363, 319107, 319916, 319307, 317819, 316331, 315265, 314659]
54119C14659n7M86O23L42K88Q29J318Q58m05j456j773j775j820j599q98j83K16
54102C09653Q76K329L764L731K048m6j571k588l096k516r17K94m7j252j730j022
54086C07910O2Q66J378J482R07j6l68K94J546K805L717L887L017J516K89k53l38
54069C28701r2M91Q05J07j035r91O40K173K143J242Q97J103J146J499K986M486
54053C46301L764Q63j442j318j15K47L10J620L528L660J396j198k136j586o30
54038C53264M36J629K322K004J378J554K484L179L218L116L264L455L544L725
54024C88572L911L606K693J705R86K14q35j705k030k283k982l500k592j02K485
54009C88143L384K066m18k243k118l98J199J490J210J797L115L528K409J167J136
$$ y = [314659, 314602, 315088, 315711, 316053, 316341, 317170, 318488, 319346, 318941, 317485, 315712, 313937, 312117, 310518, 309620, 309437, 309653, 310529, 312858, 316622, 320353, 322401, 322355, 320784, 318196, 315100, 312584, 311667, 311961, 311914, 310662, 308932, 307910, 307972, 308838, 310216, 311698, 312605, 312589, 312221, 312515, 314061, 316866, 320583, 324470, 327487, 329003, 329292, 329039, 328701, 328609, 329100, 329905, 330012, 328977, 327986, 328626, 330799, 332942, 334184, 335081, 336184, 337330, 338829, 341815, 346301, 350065, 350928, 349486, 348168, 348053, 348300, 348610, 350230, 353758, 357418, 358814, 357616, 355480, 353894, 353264, 353700, 355329, 357651, 359655, 361033, 362587, 365071, 368250, 371468, 374584, 377848, 381303, 384847, 388572, 392483, 396089, 398782, 400487, 401473, 401687, 400852, 399147, 397117, 394834, 391852, 388352, 385760, 385658, 388143, 391527, 393593, 393175, 390932, 388814, 388416, 389615, 391105, 392315, 394112, 397227, 400755, 403164, 404331, 405467]
53994D05467J663J432P61J068K543L928M655N538O931P668O800N278M693N014
53980D63439M965M309M277N440O506O102M930N055P177R619J0300Q983P078N726
53966E53906M956M626N133O565P834P630O034M330L144J786j42j623j609q60j200
53951F00510l131n237o162o178o449p489q791r474q824o738m076k297k257l556
53937E19851n201o488p112p042o771p107q064q419p121m775l102k967l656l883
53923D38143k919j004O46N44j455l371l030p41J011P22n94j338j430j574j660
53908D21950j134k71J94K97N76Q82O41J90O16K117L555L962L647L486L938N089
53892D49735O828Q557R408R376R625J1001J2743J3268J1998R736P474N568M080
$$ y = [405467, 407130, 408562, 409323, 410391, 412934, 416862, 421517, 427055, 433986, 441654, 448454, 453732, 458425, 463439, 468404, 472713, 476990, 482430, 488936, 495038, 499968, 505023, 512200, 521819, 532119, 541102, 548180, 553906, 558862, 563488, 568621, 575186, 583020, 590650, 596684, 601014, 604158, 605944, 605802, 604179, 602570, 601710, 600510, 597379, 592142, 585980, 579802, 573353, 565864, 557073, 547599, 538775, 532037, 527961, 525664, 523407, 519851, 514650, 508162, 501050, 494008, 487237, 480130, 472066, 463647, 456526, 451751, 448649, 445682, 442026, 438143, 435224, 434220, 434866, 435410, 433955, 430584, 427554, 426813, 427824, 428546, 427952, 426614, 425184, 423610, 421950, 420816, 420545, 420739, 421036, 421612, 422494, 423135, 423325, 423941, 426058, 429613, 433575, 437222, 440708, 444646, 449735, 456563, 465120, 474528, 483904, 493529, 504530, 517273, 530541, 542539, 552275, 559749, 565317, 569397]
53879E69397L251L201L476L321K488J638J772L103M636N084M272L250K997L372
53865F15258L608L445L331L657M364N369O901R108J1431J2793J2557J1263J0206
53852G13291J0262J1229J2257J2641J2044J0441Q378O953O775O907N634K558p92
53839H18578k764l298l394l578l730l881m241m642m849n289o667q906j1226j3219
53825G38894j4917j5887j5471j4178j3515j3861j3671j1775r364q354q582q195
53813E91124o604n342n685o821p107o128m806m139m517n714o929p234o528n713
53799E07857n480n466n185n081n752o509n940l935k091j737k355k560j988j585
53785D52193k115l005k971j605m5K32q31j857j861j396j383j477o62R09J892J609
$$ y = [569397, 572648, 575849, 579325, 582646, 585134, 586772, 588544, 591647, 596283, 601367, 605639, 608889, 611886, 615258, 618866, 622311, 625642, 629299, 633663, 639032, 645933, 655041, 666472, 679265, 691822, 703085, 713291, 723553, 734782, 747039, 759680, 771724, 782165, 790543, 797496, 804271, 811178, 816812, 819370, 818578, 815814, 812516, 809122, 805544, 801814, 797933, 793692, 789050, 784201, 778912, 772245, 763339, 752113, 738894, 723977, 708090, 692619, 678441, 664926, 651065, 637394, 625619, 616255, 607901, 599319, 591124, 584520, 579178, 573493, 566672, 559565, 553437, 548631, 544492, 539975, 534261, 527332, 520098, 513570, 507857, 502377, 496911, 491726, 486645, 480893, 474384, 468444, 464509, 462418, 460681, 458326, 455766, 453778, 452193, 450078, 447073, 444102, 442497, 442452, 442684, 441853, 439996, 438135, 436739, 435356, 433879, 433217, 434126, 436018, 437627]
53769D37627Q14L76K90L90R79K018K556J875N92j00J61R55J888K573K384J256
53753D56634L67R79K766M232M660M677M978N442N666N580N368N420O321Q185J0019
53738E31294J0561R804Q873Q436Q067P294O257N173M155L705M332N320N064L214
53724F21549J360Q85J175Q70j43j056j708k547l522m164m541n087n709o080o587
53709E84695p864r412r855q755p186o225n785n344m983n087n522n727n395m673
53695D92882l832l050k464k204k334k734l084l066k723k439k415k455k392k384
53681D55306k455k236j605j100j114j098k95R70J675J579J367J308Q77J0k03J236
53665D54222L833N896O015M075J325l82j5J602K661K420J874K153L023L492L332
$$ y = [437627, 438441, 438817, 439107, 439497, 440476, 442494, 445050, 446925, 447517, 447417, 447578, 448533, 450421, 452994, 455378, 456634, 457001, 457980, 460746, 464978, 469638, 474315, 479293, 484735, 490401, 495981, 501349, 506769, 513090, 521275, 531294, 541855, 551659, 560532, 568968, 577035, 584329, 590586, 595759, 599914, 603619, 607951, 613271, 618335, 621549, 622909, 623794, 624969, 625839, 625696, 624640, 622932, 620385, 616863, 612699, 608158, 603071, 597362, 591282, 584695, 576831, 567419, 557564, 548809, 541623, 535398, 529613, 524269, 519286, 514199, 508677, 502950, 497555, 492882, 489050, 486000, 483536, 481332, 478998, 476264, 473180, 470114, 467391, 464952, 462537, 460082, 457690, 455306, 452851, 450615, 449010, 447910, 446796, 445698, 445403, 446373, 448048, 449627, 450994, 452302, 453179, 453189, 452986, 454222, 458055, 463951, 469966, 474041, 475366, 474984, 474969, 476571, 479232, 481652, 483526, 485679, 488702, 492194, 495526]
53650D95526L259L866M924N665N484M562L936M596O278P547P329N892M104K414
53636E65382J024L70O34J143J068N39L86R70J861K613L168L505L457K949K052
53621E91121Q52l56j032j012q77j120j314r46p53j950m107n078l623j020O96J127
53605E70608J181J148M98o41j128l09J051J758J448N07o34j488j359j2J574J920
53589E76122P30o40p80K53J463K478L717M997N145L511J211J6M22J632L034M588
53573F07899N833N931N109M753N341N430L867J936J763L230M381M702N824Q349
53559F74348J0112R092O616N734P151Q653Q440P180O319N933N214M164L664M162
53545G66782N024N308M726L819L317L319L231K595J793J559K039K761L367L719
$$ y = [495526, 498785, 502651, 507575, 513240, 518724, 523286, 527222, 531818, 538096, 545643, 552972, 558864, 562968, 565382, 566406, 566776, 567410, 568553, 569621, 570160, 570546, 571516, 573377, 575990, 579158, 582663, 586120, 589069, 591121, 591973, 591617, 590585, 589573, 588696, 587576, 586262, 585316, 584563, 582613, 578506, 573428, 569805, 568785, 569481, 570608, 571789, 572937, 573435, 572794, 571666, 571357, 572408, 574166, 575614, 576121, 575487, 573999, 572640, 572628, 574202, 576122, 576852, 576212, 575432, 575685, 577148, 579626, 583343, 588340, 593485, 596996, 598207, 598223, 598645, 600277, 603311, 607899, 613732, 619663, 624772, 629525, 634866, 640296, 644163, 646099, 647862, 651092, 655473, 660175, 665999, 674348, 684460, 693552, 700168, 705902, 713053, 721706, 730146, 737326, 743645, 749578, 754792, 758956, 762620, 766782, 771806, 777114, 781840, 785659, 788976, 792295, 795526, 798121, 799914, 801473, 803512, 806273, 809640, 813359]
53531H13359L502K489J127J9j146l066n040n200l130j011r91k375k812j674o99
53516G93352j338k897l679l019j729j086j668k876l479k949k041j702j871j969
53502G61049k028k321k267j042P84J563Q08j28j7Q12J514K072K807L598M403N641
53486G77248P123P458N839L752L552N530P705Q529Q473Q714R459J0254J1093J2309
53472H87038J3700J4537J4496J4163J4468J5843J7953J9989K1175K1266K0917
53461A075545K1394K3441K6273K8159K8418K8338K9550L1885L3781L4525L4892
53450A396201L5474L5772L5578L5900L7438L9036L9109L8064L7849L9142M0453
53439A810016M0289L9003L7874L7273L6623L5583L4491L3711L3152L2421L1102
$$ y = [813359, 816861, 819350, 820477, 820496, 819350, 816284, 811244, 806044, 802914, 801903, 800912, 798537, 795725, 794051, 793352, 792014, 789117, 785438, 782419, 780690, 779604, 777936, 775060, 771581, 768632, 766591, 764889, 763018, 761049, 759021, 756700, 754433, 753391, 754175, 755738, 756546, 756418, 756401, 757213, 758727, 760799, 763606, 767204, 771607, 777248, 784371, 791829, 797668, 801420, 804972, 810502, 818207, 826736, 835209, 843923, 853382, 863636, 874729, 887038, 900738, 915275, 929771, 943934, 958402, 974245, 992198, 1012187, 1033362, 1054628, 1075545, 1096939, 1120380, 1146653, 1174812, 1203230, 1231568, 1261118, 1293003, 1326784, 1361309, 1396201, 1431675, 1467447, 1503025, 1538925, 1576363, 1615399, 1654508, 1692572, 1730421, 1769563, 1810016, 1850305, 1889308, 1927182, 1964455, 2001078, 2036661, 2071152, 2104863, 2138015, 2170436, 2201538]
53428B201538K8996K6454K4469K4093K5405K7280K8350K8245K7544K6590K4822
53417B493786K1726J7997J4993J3021J0886P437K933j408m671o706p885r023j1027
53404B542059j4014j6999j8884j9501j9378j9115j9494k1461k4920k7972k8594
53393B311727k7097k5810k6179k7228k7333k6462k5881k6156k6389k5414k3150
53382B024628k0504j8243j6234j3911j1220q757o985n724m585l309j499J286M616
53369A919559P015P652P759R375J2763J6094J7787J8257J9132K1412K4690K7692
53357B109187K9499L0626L2726L6638M0997M3680M4488M5310M7597N0875N4101
53346B565724N7243O0774O4481O7608O9775P1164P2236P3570P5532P7737P9447
$$ y = [2201538, 2230534, 2256988, 2281457, 2305550, 2330955, 2358235, 2386585, 2414830, 2442374, 2468964, 2493786, 2515512, 2533509, 2548502, 2561523, 2572409, 2579846, 2582779, 2581371, 2576700, 2569994, 2562109, 2553086, 2542059, 2528045, 2511046, 2492162, 2472661, 2453283, 2434168, 2414674, 2393213, 2368293, 2340321, 2311727, 2284630, 2258820, 2232641, 2205413, 2178080, 2151618, 2125737, 2099581, 2073192, 2047778, 2024628, 2004124, 1985881, 1969647, 1955736, 1944516, 1935759, 1928774, 1923050, 1918465, 1915156, 1913657, 1914943, 1919559, 1926574, 1934226, 1941985, 1951360, 1964123, 1980217, 1998004, 2016261, 2035393, 2056805, 2081495, 2109187, 2138686, 2169312, 2202038, 2238676, 2279673, 2323353, 2367841, 2413151, 2460748, 2511623, 2565724, 2622967, 2683741, 2748222, 2815830, 2885605, 2956769, 3029005, 3102575, 3178107, 3255844, 3335291]
53335C335291Q0628Q1881Q3111Q3304Q2169Q0938Q0716Q0851P9933P7721P5058
53324D221601P2352O9291O5778O2131N8422N4370M9778M4491L8177L1019K4153
53313D791563J8437J2937N765l503j3275k1995k9714l7204m4530n1175n6888o1634
53301D508784o5176o7474o9232p1201p2994p3334p1771o9522o8113o7620o6869
53290C745478o5244o3537o2729o2691o2659o2471o2563o2948o2952o1909n9472
53279C056303n5468n0395m5971m3868m3485m2178l8495l4219l2210l2967l4439
53268B602608l4718l3636l1955l0204k8644k7369k6199k4888k3637k2784k2001
53257B296573k0439j7844j5013j2941j1835j1100j0025q296o049l499o02K614
$$ y = [3335291, 3415919, 3497800, 3580911, 3664215, 3746384, 3827322, 3908038, 3988889, 4068822, 4146543, 4221601, 4293953, 4363244, 4429022, 4491153, 4549575, 4603945, 4653723, 4698214, 4736391, 4767410, 4791563, 4810000, 4822937, 4828702, 4825199, 4811924, 4789929, 4760215, 4723011, 4678481, 4627306, 4570418, 4508784, 4443608, 4376134, 4306902, 4235701, 4162707, 4089373, 4017602, 3948080, 3879967, 3812347, 3745478, 3680234, 3616697, 3553968, 3491277, 3428618, 3366147, 3303584, 3240636, 3177684, 3115775, 3056303, 3000835, 2950440, 2904469, 2860601, 2817116, 2774938, 2736443, 2702224, 2670014, 2637047, 2602608, 2567890, 2534254, 2502299, 2472095, 2443451, 2416082, 2389883, 2364995, 2341358, 2318574, 2296573, 2276134, 2258290, 2243277, 2230336, 2218501, 2207401, 2197376, 2189080, 2183031, 2179532, 2178930, 2181544]
53245B181544N524P363Q490J0391J3790J7551K0231K2005K3896K5745K6566K6656
53233B389752K7674L0188L2743L4017L4531L5246L5579L4167L0988K7412K4363
53222B736660K1557J8523J5414J2423R184N274Q99l385p411j1377j5110j7964
53210B764687j9748k1358k3836k6998k9733l1857l4581l8444m1650m1815l9171
53199B415496l6738l7040l9607m2116m3012m2397m1172m0237m0235m1102m1816
53188A970024m1265l9588l8245l8420l9550l9864l8410l6185l4969l5255l5822
53177A552451l5238l3150l0029k6580k3780k2586k2798k2914k2000k1022k1233
53166A271121k1976k1637k0445k0366k1984k3310k2614k0924k0564k2083k3852
$$ y = [2181544, 2187068, 2194431, 2202921, 2213312, 2227102, 2244653, 2264884, 2286889, 2310785, 2336530, 2363096, 2389752, 2417426, 2447614, 2480357, 2514374, 2548905, 2584151, 2619730, 2653897, 2684885, 2712297, 2736660, 2758217, 2776740, 2792154, 2804577, 2813761, 2819035, 2819934, 2816549, 2809138, 2797761, 2782651, 2764687, 2744939, 2723581, 2699745, 2672747, 2643014, 2611157, 2576576, 2538132, 2496482, 2454667, 2415496, 2378758, 2341718, 2302111, 2259995, 2216983, 2174586, 2133414, 2093177, 2052942, 2011840, 1970024, 1928759, 1889171, 1850926, 1812506, 1772956, 1733092, 1694682, 1658497, 1623528, 1588273, 1552451, 1517213, 1484063, 1454034, 1427454, 1403674, 1381088, 1358290, 1335376, 1313376, 1292354, 1271121, 1249145, 1227508, 1207063, 1186697, 1164713, 1141403, 1118789, 1097865, 1077301, 1055218, 1031366]
53155A031366k4192k2903k0966j9505j8922j8709j8156j7369j7065j7365j7578
53144H18636j7315j6814j5935j4063j1651j0514j1545j3202j3515j2631j1962
53133F69489j1545j0148p770o154o427p600q113p777p492p688p871p441o424n338
53119E61701m572m015l449l179l728m767n057l994k554j944j933j494p35r72k766
53104E16542m891n621m484k607j687k559m312m991l635j332K82J041J816K662
53090D86224K678J656N49P7k0j36k38m46j088j831j739o32N59J170J515J760J269
53073D91327j31j276j022J95J025Q61Lj139k104k154j057J94M05k52m69M51J910
53056D86767L043L734M384N144N517M768K848Q65L9J04l26j480j684J02K111J651
$$ y = [1031366, 1007174, 984271, 963305, 943800, 924878, 906169, 888013, 870644, 853579, 836214, 818636, 801321, 784507, 768572, 754509, 742858, 732344, 720799, 707597, 694082, 681451, 669489, 657944, 647796, 640026, 633872, 627445, 619845, 611732, 603955, 596463, 588775, 580904, 573463, 567039, 561701, 557129, 553114, 549665, 546486, 542758, 537991, 532934, 528940, 526386, 524442, 522509, 521015, 520280, 519308, 516542, 511651, 506030, 501546, 498939, 497252, 494693, 490381, 485390, 481755, 480423, 480705, 481746, 483562, 486224, 488902, 490558, 491107, 491184, 491164, 491028, 490790, 490344, 489256, 487425, 485686, 485054, 485613, 486783, 488298, 490058, 491327, 491196, 489920, 488898, 489093, 490118, 490979, 490982, 489843, 487739, 485585, 484528, 484722, 485127, 484875, 484406, 484857, 486767, 489810, 493544, 497928, 503072, 508589, 513357, 516205, 517070, 517109, 517213, 516887, 515407, 513723, 513825, 515936, 517587]
53040E17587j310m073m659l849l480m055m578l839j426J740L555K359j092m028
53026D88852m504l093j521o30l55o62j434k006j873j556j785k128j372O75K687
53011D69295L259K245N51q44j439j298q25l50J38P07J176J368J412J302M98j321
52995D75874l243l767k582r43m4K23M90P74Q61J185K263L474L447J857J4p74o61
52978D78448n47m00O96K702L870K607l39k516k624j769j473j490o15R23J437K14
52962D79124j364j699q93r6J82J18k35p20n56P31K178K380J457P82P79M83m44
52945D82207q00K26J456J255j13q77j12J406K426K375J382N5p19m43N01J395K117
52928D93737K905L511L311K296J245Q13J008J516J945J822J027K74M52J430K206
$$ y = [517587, 516277, 512204, 507545, 503696, 500216, 496161, 491583, 487744, 486318, 488058, 491613, 493972, 492880, 488852, 484348, 481255, 479734, 479104, 478749, 478087, 476653, 474647, 472774, 471218, 469433, 467305, 465933, 466608, 469295, 472554, 474799, 475350, 474506, 473067, 471769, 470944, 470594, 470732, 471439, 472615, 473983, 475395, 476697, 477195, 475874, 472631, 468864, 466282, 465339, 465295, 465518, 466008, 466782, 467643, 468828, 471091, 474565, 478012, 479869, 479883, 479109, 478448, 477901, 477501, 478197, 480899, 484769, 487376, 487037, 484521, 481897, 480128, 478655, 477165, 476550, 477473, 478910, 479124, 477760, 476061, 475168, 475072, 475254, 475372, 475137, 474417, 473861, 474592, 476770, 479150, 480607, 481389, 482168, 482651, 482207, 481407, 481633, 483089, 484344, 484231, 483354, 483242, 484648, 487074, 489449, 490831, 490886, 490167, 489724, 490225, 491620, 493737, 496642, 500153, 503464, 505760, 507005, 507818, 508826, 510342, 512287, 514109, 515136, 515410, 515862, 517292, 519498]
52913E19498K274K057J886J472P42K47L25O53J105K069L212L031P88j849k584
52898E34926j474o71j118j284K74K526L202J554j234l711n152n122l518j231J88
52883E18155J23n12o80n53q58j475j632j285j297k023k562j938n33L17j01j164
52867E01982j746j320l29K28l35j629k380j758m15K24k84q99n05O29J208N71m94
52850D92748o96K01J136J147O65Q92J986K591J526p27k803m103m808m712l296
52835D81747r87P50J017M06oJ44O69J303J686J524J314K074L756M784L876J714
52819E05771n3p94r70q36l34J40J03M3Q50K153K437J123n65j258q93m7J159K690
52801E10719L825L793K813J796J145M92n14j721k762l452l783l742l277k435j687
$$ y = [519498, 521772, 523829, 525715, 527187, 527929, 528176, 528501, 529154, 530259, 532328, 535540, 538571, 539359, 537510, 534926, 533452, 532781, 531663, 530379, 530653, 533179, 536381, 537935, 536701, 532990, 527838, 522716, 519198, 517967, 518155, 518278, 517766, 517086, 516533, 515675, 514200, 512568, 511283, 509986, 507963, 505401, 503463, 502930, 503247, 503146, 501982, 500236, 498916, 498587, 498815, 498480, 496851, 494471, 492713, 492298, 492522, 492238, 491339, 490834, 491463, 492671, 493242, 492748, 492052, 492253, 493389, 494536, 495201, 496093, 498079, 500670, 502196, 501469, 498666, 494563, 489755, 485043, 481747, 480760, 481510, 482527, 482933, 482927, 483071, 483740, 485043, 486729, 488253, 489567, 491641, 495397, 500181, 504057, 505771, 505718, 504924, 503954, 503118, 502784, 502924, 503027, 503070, 503920, 506073, 508510, 509633, 509068, 507810, 506917, 506870, 508029, 510719, 514544, 518337, 521150, 522946, 524091, 524583, 524069, 522348, 519586, 516134, 512351, 508609, 505332, 502897, 501210]
52786E01210j793k939m120m072k908k067k411l173l319l122l543m548n077m492
52772D53626l222j994j151o67k36O25J937K830K440J177L03K45K32k50o76n97
52756D54622n17r30j214n48O11R87K83m80n21k54l84p28n54L21J311J822J800
52739D55627J510J130O76J89j77l03k40j94m36j198k466l715m016k765m38J632
52723D44816K309J473q0j164q82N89J762J175p45j847q39J066J843J268P22Q50
52707D52316Q90L50j41j23k17r80j788j779j157o81l97J67Q97J122O57P5j6N67
52689D49762J614K544K624J824J198J687K753L006K127J311J672L014M352M959
52675D84447M588L365J849P74M12M12M82P81J500K444L308L976M275L723J952
$$ y = [501210, 499417, 496478, 492358, 488286, 485378, 483311, 480900, 477727, 474408, 471286, 467743, 463195, 458118, 453626, 450404, 448410, 447259, 446592, 446356, 446981, 448918, 451748, 454188, 455365, 455668, 455913, 456145, 455895, 455219, 454622, 454105, 453175, 451961, 451413, 452024, 453011, 453294, 452814, 452293, 452039, 451655, 450927, 450373, 450694, 452005, 453827, 455627, 457137, 458267, 458943, 459132, 458955, 458652, 458412, 458218, 457782, 456584, 454118, 450403, 446387, 443622, 443184, 444816, 447125, 448598, 448518, 447354, 446472, 447061, 448823, 449998, 449253, 447406, 446567, 447633, 449476, 450744, 451466, 452316, 453206, 453556, 453415, 453292, 453075, 452095, 450307, 448528, 447371, 446690, 446293, 446460, 447357, 448479, 449136, 449211, 449195, 449762, 451376, 453920, 456544, 458368, 459566, 461253, 464006, 467012, 469139, 470450, 472122, 475136, 479488, 484447, 489035, 492400, 494249, 495023, 495435, 495847, 496329, 497110, 498610, 501054, 504362, 508338, 512613, 516336, 518288]
52660E18288o43k888l631k824j737j662k271j908M1J886J685j06j278r28l34o71
52644E01019j414j670j693k127k636k378j339k58L99P90J204J672J795Q54j320
52629D92898l474l891k473r22l17J54J369K547K578J948J797J927J396M52Q8N0
52613D96127q30k313k640j142O90J240N51n08j400j629n46J527K918K428Q60p3
52597D95260J19M80J58n81p65K09J778K485J535R6J43J846L119K378O97K38J336
52580E10531K309J836L28j043j734j956k108k335k373j736l18J296K309K399J680
52565E09085L45j154j887j135O11J911J841Q72J37J65N95P68L27o47j681k074
52549E08079j353J33J237J061J0n54J44J409K005J619J003R25J375J721J280o6
$$ y = [518288, 517645, 514757, 511126, 508302, 506565, 504903, 502632, 500724, 500765, 502651, 504336, 504230, 502952, 502024, 501690, 501019, 499605, 497935, 496242, 494115, 491479, 489101, 487762, 487504, 487903, 488693, 489897, 491569, 493364, 494218, 492898, 489424, 485533, 483060, 482138, 481821, 481975, 483344, 485891, 488469, 490417, 492214, 494141, 495537, 495989, 496077, 496127, 495297, 492984, 490344, 489202, 489892, 491132, 491683, 491175, 489775, 488146, 487600, 489127, 492045, 494473, 495333, 495260, 495379, 495859, 496017, 495436, 494671, 494880, 496658, 499143, 500678, 500774, 500917, 502763, 505882, 508260, 508957, 509195, 510531, 512840, 514676, 515004, 513961, 512227, 510271, 508163, 505828, 503455, 501719, 501401, 502697, 505006, 507405, 509085, 509430, 508276, 506389, 505254, 505865, 507776, 509617, 510489, 510626, 510791, 511386, 512154, 512481, 511834, 510153, 508079, 506726, 506859, 508096, 509157, 509167, 508613, 508757, 510166, 512171, 513790, 514793, 515718, 517093, 518814, 520094, 520028]
52533E20028j608k337k018j268l39J248L199L711J683r60j092J536L937L979K852
52518E32551K545K783K023K64r67q63n8N83P15K42o16j101o76J46M76K14k62j044
52500E36955k310l334l121j899q80n46l06J25J50n50j304j365q06j47K66K93r6
52483E21125n36m58K45J073J542J487Q93Kn35l08R2j97q54o84N39J555J396O07
52465E26984J75J72J98K89N26M09l69r29j94J414K257J692R35J301K375K642J643
52448E41520P38J542L957O122O250M331J941N96M85P86P88M85J41l66j437l032
52432E64847m385m739m157l344k772k453k372k581k759k419j650r76l35Q50K269
52417E33024K601J494M61P03J175L70r82r45N30J656J866K433L731M293L427K676
$$ y = [520028, 518420, 516083, 514065, 512797, 512458, 513706, 516905, 520616, 522299, 521339, 520247, 521783, 525720, 529699, 532551, 535096, 537879, 539902, 540166, 539199, 538336, 538278, 538861, 539576, 539818, 539202, 538101, 537425, 537571, 538047, 538261, 537999, 536955, 534645, 531311, 528190, 526291, 525411, 524865, 524559, 524684, 524834, 524284, 522980, 521615, 520809, 520662, 520928, 521221, 521125, 520589, 520131, 520376, 521449, 522991, 524478, 525371, 525373, 524838, 524530, 524622, 524425, 523571, 522887, 523426, 524981, 526377, 526984, 527159, 527331, 527529, 527818, 528344, 528753, 528384, 527455, 527261, 528675, 530932, 532624, 533559, 534860, 537235, 539877, 541520, 542258, 543800, 547757, 553879, 560129, 564460, 566401, 566997, 567482, 568268, 569056, 569541, 569682, 569316, 567879, 564847, 560462, 555723, 551566, 548222, 545450, 542997, 540625, 538044, 535285, 532866, 531216, 530240, 529905, 530755, 533024, 535625, 537119, 537580, 538283, 539458, 539828, 538846, 537901, 538431, 540087, 541953, 544386, 548117, 552410, 555837, 558513]
52401E58513L270M073L602K455J872J283m54k334k202k30Q96l65k603l785l724
52386E60267l281k647j522k15N53N00k32j543l164m381m566l856k870j930r69
52371E30144p8L43M3n67o09M46K033K926K675K284K867L857L544J537l47j94J658
52354E52562L222L279K372J654J820L175N607P987Q614P241O072P513J0995J3316
52340F35429J2484J0059Q845R250R108O604K136k604o140p663p170n635m172k803
52326F57728r93N42Q1k439m596m527l459l567m406l539l56K947M499M926N728
52311F48569O914P352O597N444N040N809O915O781M839K643K253L560M547M257
52297G21520L836M108M074L005K182K768L420K318N51R21L633N879O093O007P336
$$ y = [558513, 561783, 565856, 569458, 571913, 573785, 575068, 574614, 572280, 570078, 569848, 570744, 570379, 567776, 563991, 560267, 556986, 554339, 552817, 552602, 553155, 553655, 553423, 551880, 548716, 544335, 539769, 535913, 533043, 531113, 530144, 530066, 530409, 530452, 529885, 529276, 529722, 531755, 534681, 537356, 539640, 542507, 546364, 549908, 551445, 551098, 550904, 552562, 555784, 559063, 561435, 563089, 564909, 568084, 573691, 581678, 590292, 597533, 603605, 611118, 622113, 635429, 647913, 657972, 666817, 676067, 685175, 691779, 693915, 691311, 685171, 677508, 670338, 664703, 660531, 657728, 656735, 657277, 657358, 654919, 650323, 645796, 642337, 638770, 634364, 630825, 630469, 633416, 637915, 642841, 648569, 655483, 662835, 669432, 674876, 679916, 685725, 692640, 699421, 704260, 706903, 709156, 712716, 717263, 721520, 725356, 729464, 733538, 736543, 738725, 741493, 744913, 747231, 747782, 748703, 752336, 758215, 764308, 770315, 777651]
52282G77651Q837Q484O985O852Q776J0980J2021J2331J2731J3199J3812J5543
52270I08202J8972K2915K5467K6215K6605K8080L0510L2604L3494L3624L4157
52259A220845L5715L7670L8776L8489L7530L6957L6880L6367L4749L2677L1568
52248A618223L1985L2827L2369L0058K7096K5099K4396K3888K2492K0237J7866
52237A906536J5758J3759J1830J0261R054P537M963J401k187m749n886o057o209
52224A956011p092q497r231q240n864l540k068o89J579M263O002O678P824J0477
52210A947613J3761J6402J8727K1779K4975K6342K5345K3815K3451K3799K3721
52199B189730K3522K4091K4797K4077K1858J9615J7930J5823J2964J0839J0543
$$ y = [777651, 786488, 794972, 801957, 808809, 817585, 828565, 840586, 852917, 865648, 878847, 892659, 908202, 927174, 950089, 975556, 1001771, 1028376, 1056456, 1086966, 1119570, 1153064, 1186688, 1220845, 1256560, 1294230, 1333006, 1371495, 1409025, 1445982, 1482862, 1519229, 1553978, 1586655, 1618223, 1650208, 1683035, 1715404, 1745462, 1772558, 1797657, 1822053, 1845941, 1868433, 1888670, 1906536, 1922294, 1936053, 1947883, 1958144, 1967198, 1974735, 1979698, 1981099, 1978912, 1974163, 1968277, 1962220, 1956011, 1948919, 1940422, 1931191, 1922951, 1917087, 1913547, 1911479, 1910790, 1912369, 1916632, 1922634, 1929312, 1937136, 1947613, 1961374, 1977776, 1996503, 2018282, 2043257, 2069599, 2094944, 2118759, 2142210, 2166009, 2189730, 2213252, 2237343, 2262140, 2286217, 2308075, 2327690, 2345620, 2361443, 2374407, 2385246, 2395789]
52188B395789J0804R540O566L371P77j689m265o380p854r534j2041j4687j6335
52175B354062j6933j7471j8547j9551j9431j8054j6459j5599j5014j3290r919
52164B173794o265m172l925m112l391j850n93l09m62K19K273M666N750N290M834
52149B171747N656P168Q081Q391Q928R536R278Q464Q688J0265J1186R650O553
52136B283591M376M325N550O662O924O396N789N848O174N334L059J403K260M313
52122B352004M383J714j183k329k791m268o203p110p478r009j1525j2932j2401
52109B280872j1514j1487j1243r476p184o332o715o106l585j067p11j976k346
52096B201130n66J960L099K581K107L148N135O122N003K743J245J342K243K781
$$ y = [2395789, 2406593, 2416133, 2422699, 2426070, 2426847, 2425158, 2420893, 2414513, 2406659, 2397125, 2385084, 2370397, 2354062, 2337129, 2319658, 2301111, 2281560, 2262129, 2244075, 2227616, 2212017, 2197003, 2183713, 2173794, 2167529, 2163357, 2159432, 2155320, 2151929, 2150079, 2149486, 2149177, 2148715, 2148934, 2151207, 2155873, 2161623, 2166913, 2171747, 2177403, 2184571, 2192652, 2201043, 2209971, 2219507, 2228785, 2237249, 2245937, 2256202, 2267388, 2277038, 2283591, 2287967, 2292292, 2297842, 2304504, 2311428, 2317824, 2323613, 2329461, 2335635, 2340969, 2344028, 2345431, 2347691, 2352004, 2356387, 2358101, 2356918, 2354589, 2351798, 2347530, 2341327, 2334217, 2326739, 2317730, 2306205, 2293273, 2280872, 2269358, 2257871, 2246628, 2237152, 2229968, 2223636, 2216921, 2210815, 2207230, 2206163, 2205452, 2203476, 2201130, 2200564, 2202524, 2205623, 2208204, 2210311, 2213459, 2218594, 2224716, 2229719, 2232462, 2233707, 2235049, 2237292, 2240073]
52082B240073K753K771L209L708L785L573L699M467N523O498P800J0269J3980
52069B312108J7778K0314K1322K1673K2499K4577K8090L2468L6722M0463M4283
52058B622297M8481N1806N2567N0906M8808M7624M6704M4859M2012L8664L4908
52047C129636L0964K7687K5283K2317J7467J1823P799N869L975N09l628o513p549
52034C265639p587p702q601j0536j2876j4319j4275j3739j4131j5605j7076j7799
52022C111393j8169j8822j9395j8511j5221j0394o205l816k020J001N049Q260
52010C013150J0033J1998J5380J9044K1268K2233K3186K3960K3199K0827J8491
51999C222769J7201J6019J3733J0688Q188O842O171N326L422k14n329j0330j3425
$$ y = [2240073, 2242826, 2245597, 2248806, 2252514, 2256299, 2259872, 2263571, 2268038, 2273561, 2280059, 2287859, 2298128, 2312108, 2329886, 2350200, 2371522, 2393195, 2415694, 2440271, 2468361, 2500829, 2537551, 2578014, 2622297, 2670778, 2722584, 2775151, 2826057, 2874865, 2922489, 2969193, 3014052, 3056064, 3094728, 3129636, 3160600, 3188287, 3213570, 3235887, 3253354, 3265177, 3272976, 3278845, 3282820, 3283329, 3279701, 3273188, 3265639, 3258052, 3250350, 3241749, 3231213, 3218337, 3204018, 3189743, 3176004, 3161873, 3146268, 3129192, 3111393, 3093224, 3074402, 3055007, 3036496, 3021275, 3010881, 3004676, 3000860, 2998840, 2999841, 3004890, 3013150, 3023183, 3035181, 3050561, 3069605, 3090873, 3113106, 3136292, 3160252, 3183451, 3204278, 3222769, 3239970, 3255989, 3269722, 3280410, 3288598, 3295440, 3301611, 3306937, 3310359, 3310145, 3304816, 3294486, 3281061]
51986C281061j4455j5284j7977k2654k7279k9775l0190l0533l2511l5865l9067
51975B985471m1063m1768m1350l9888l7705l5359l3174l1175k9422k7927k6367
51964B600273k4441k2454k0979k0056j9435j9352k0163k1280k1647k1456k2106
51953B366904k3899k5070k4166k2398k2268k4404k7070k8722k9765l1390l3649
51942B074103l5359l5578l4777l4399l5241l6412l6292l4682l3194l3140l3754
51931A691275l3367l1638k9539k7616k5647k3885k3071k2867k1777j9272j6757
51920A415839j5662j5675j5861j6377j7728j9111j9147j8069j7636j8669j9967
51909A221937j9978j8465j6118j3643j1811j1291j1503j0406o642j614J737K292
$$ y = [3281061, 3266606, 3251322, 3233345, 3210691, 3183412, 3153637, 3123447, 3092914, 3060403, 3024538, 2985471, 2944408, 2902640, 2861290, 2821402, 2783697, 2748338, 2715164, 2683989, 2654567, 2626640, 2600273, 2575832, 2553378, 2532399, 2512343, 2492908, 2473556, 2453393, 2432113, 2410466, 2389010, 2366904, 2343005, 2317935, 2293769, 2271371, 2249103, 2224699, 2197629, 2168907, 2139142, 2107752, 2074103, 2038744, 2003166, 1968389, 1933990, 1898749, 1862337, 1826045, 1791363, 1758169, 1725029, 1691275, 1657908, 1626270, 1596731, 1569115, 1543468, 1519583, 1496512, 1473645, 1451868, 1432596, 1415839, 1400177, 1384502, 1368641, 1352264, 1334536, 1315425, 1296278, 1278209, 1260573, 1241904, 1221937, 1201959, 1183494, 1167376, 1153733, 1141922, 1130631, 1119128, 1108722, 1102080, 1100466, 1102203, 1104495]
51897A104495J889K889N400P477P452N440K887J260J160J964K173O22k200m294
51883A138614l999j679P69K003K417L249N061P390R617J1673J3862J6237J8207
51870A223421J8872J7976J6446J5537J5266J4212J1250P000K994k88l761q304
51858A330621j3694j8970k3222k5934k7195k7726k8202k8506k8157k7379k6840
51847A054796k6258k4385k0824j6964j4426j3265j2312j0669q151n008j956Q8
51835I00666J140K423M580O306N984M103K505J461n93m081o923p196n814n243
51821H99318o404q214r608j0495j0589q899n127q21J979K979L742N482P544Q400
51807H69287P616O120M911M318M307M458L593O45l519o279o115m348l136k785
$$ y = [1104495, 1106384, 1109273, 1114673, 1122150, 1129602, 1135042, 1137929, 1139189, 1140349, 1142313, 1144486, 1145108, 1142908, 1138614, 1134615, 1132936, 1133705, 1135708, 1138125, 1141374, 1146435, 1153825, 1163442, 1175115, 1188977, 1205214, 1223421, 1242293, 1260269, 1276715, 1292252, 1307518, 1321730, 1332980, 1339980, 1342974, 1342686, 1338925, 1330621, 1316927, 1297957, 1274735, 1248801, 1221606, 1193880, 1165678, 1137172, 1109015, 1081636, 1054796, 1028538, 1004153, 983329, 966365, 951939, 938674, 926362, 915693, 907542, 902534, 900578, 900666, 901806, 904229, 908809, 915115, 921099, 925202, 927707, 929168, 928575, 924494, 917571, 910375, 904561, 899318, 892914, 884700, 875092, 864597, 854008, 845109, 839982, 839161, 841140, 844119, 847861, 853343, 860887, 869287, 876903, 883023, 887934, 892252, 896559, 901017, 904610, 905255, 901736, 895457, 889342, 884994, 881858, 879073]
51793H79073k331j780j884k167j225R79K869L598L856M006L301J682M36O7p72
51778H89708k975n164n747n438n919p063p408o792o470o846o898n937m440l007
51764H09604j848j331j734k291j807m51K95k53j241j929k722l882m464l554j777
51749G80615o70q66j588j593k49J928L533L519K345J379J101P17k57j074j049
51734G87791q14j317k206k314j515j097k108m006n174m557k713j391j830l360
51720G53389m044k957j325q48j480j648m06J595L365M730N803O216N716N160N851
51705G79117P831R558R678Q539P532P362P696Q227R075R875R310O336J674k548
51691H79262m714n084n284o658r001j0746j0555q780p049o398o327n948n319m926
$$ y = [879073, 876742, 874962, 873078, 870911, 869686, 870665, 873534, 877132, 880988, 884994, 888295, 889977, 890413, 890480, 889708, 886733, 881569, 875822, 870384, 864465, 857402, 849994, 843202, 836732, 829886, 822988, 817051, 812611, 809604, 807756, 806425, 804691, 802400, 800593, 800142, 800437, 800184, 798943, 797014, 794292, 790410, 785946, 782392, 780615, 779945, 779079, 777491, 775898, 775649, 777577, 781110, 784629, 786974, 788353, 789454, 790171, 789914, 788840, 787791, 786977, 785660, 783454, 781140, 779625, 778528, 776420, 772414, 767240, 762683, 759970, 758579, 756749, 753389, 749345, 746388, 745063, 744215, 742735, 741087, 740681, 742276, 745641, 750371, 756174, 762390, 768106, 773266, 779117, 786948, 796506, 806184, 814723, 822255, 829617, 837313, 845540, 854615, 864490, 873800, 880136, 881810, 879262, 874548, 869464, 864180, 857522, 848521, 837775, 827220, 818440, 811391, 804993, 798666, 792718, 787399, 782473]
51677G82473m443k996n85J667K888L500M616O784R481J1562J2115J1113R225P097
51663H54497N076L662L447M132M253K778M66j117j607j919k727l946n543p569
51649H53883r317r551p946n569l784l286m012n079n048l382j513j181j824j188
51635G91203J370L918M662L899K609J001n39q00M85J584R82m90j225j444k460
51620H04755m179n165m771l574k035l39P55M79m95o47M05J818L241N107P185Q395
51604H10935Q436Q344R039J0394J1898J3063J2995J0806O864K587j192m500o894
51591H92775p463o571n900n953n060j974J891M114M058K598J61l234o560q280
51577H54602q297q039q483r306j0018j0595j0705r578p266m970l433j905L56K341
$$ y = [782473, 778030, 775034, 774449, 776116, 779004, 782504, 787120, 793904, 803385, 814947, 827062, 838175, 847400, 854497, 859573, 863235, 866682, 870814, 875067, 877845, 878311, 877194, 875587, 873668, 870941, 866995, 861452, 853883, 844566, 835015, 827069, 821500, 817716, 814430, 810418, 805339, 800291, 796909, 795396, 794215, 792391, 791203, 792573, 796491, 801153, 805052, 807661, 808662, 808123, 807323, 807808, 809392, 810374, 809884, 808659, 807215, 804755, 800576, 795411, 790640, 787066, 785031, 784692, 785447, 785926, 785431, 784784, 785189, 787007, 790248, 795355, 802540, 810935, 819371, 827715, 836754, 847148, 859046, 872109, 885104, 895910, 902774, 905361, 904169, 899669, 892775, 885312, 878741, 872841, 866888, 861828, 859854, 861745, 865859, 869917, 872515, 872676, 869442, 862882, 854602, 846305, 838266, 829783, 820477, 810459, 799864, 789159, 779581, 772315, 767345, 763912, 762007, 762363, 764704]
51563G64704K193j57k462k616r73L17l1j133j345m76o1j506m439p243q762q930
51547G27080p945n826l135j232q70j034j53J643K735K583K693M242O076O380N611
51532G38848O050Q619J1650J3064J2393J0290P368M309K035Q53R1p14j033m18
51518H13405M73Q59J170K464N003Q193J1459J4319J6216J7195J8217J9930K1708
51505I50611K2969K4554K7413L0571L2118L1873L1333L1176L0745L0102L0480
51494A273945L2109L3473L3584L3261L3067L1524K6833J9279J0615J931o644j4896
51482A508081k2445k9289l5263l9454m1081m0590l9015l6785l4017l1353k9332
51471A129457k7449k4913k2029j9705j7902j5827j3390j1266r542p631n637m609
$$ y = [764704, 766897, 766740, 764278, 761662, 760689, 761006, 760975, 759842, 758497, 758021, 757960, 756454, 752015, 744772, 736010, 727080, 719135, 713309, 710174, 708942, 708072, 707038, 706885, 708528, 711263, 713846, 716539, 720781, 726857, 733237, 738848, 744898, 753517, 765167, 778231, 790624, 800914, 808282, 812591, 814626, 815479, 815570, 814856, 813823, 813405, 813878, 814737, 815907, 818371, 823374, 831567, 843026, 857345, 873561, 890756, 908973, 928903, 950611, 973580, 998134, 1025547, 1056118, 1088236, 1120109, 1151442, 1182618, 1213363, 1243465, 1273945, 1306054, 1339527, 1373111, 1406372, 1439439, 1470963, 1497796, 1517075, 1527690, 1529621, 1522977, 1508081, 1485636, 1456347, 1421084, 1381630, 1340549, 1299959, 1260944, 1224159, 1190142, 1158789, 1129457, 1102008, 1077095, 1055066, 1035361, 1017459, 1001632, 988242, 976976, 967434, 959803, 954166, 949557]
51459I49557n133o613q308j0059j1639j2282j1527r983q760q421q734q982q456
51446H30660p209o391p150r006j0076r219p267n761n327n736o726p797p812n887
51432G29296k666J65J641K090K012J274j54j449j601o43L52M65k63j225j944k173
51416G25177j825j291j556l183n096n218k952m08k25k361m231m165l474m185n758
51401F79249n612k898q8pk328m120l421j065R94J981K404K828L257L512L524L306
51385F81516L021L017L528M527N994P974J0151J1851J2882J3771J4687J4623J2602
51372H00144R262O205M018K094K97n28p4O86Q59O88N74Q3j269l059m604n879o846
51355H02651o781n284l421k614k829k975k740k751l042k689j190Q47K579L643
$$ y = [949557, 944424, 937811, 929503, 919444, 907805, 895523, 883996, 874013, 865253, 856832, 848098, 839116, 830660, 823451, 817060, 809910, 800904, 790828, 781609, 774342, 768581, 763254, 757518, 750792, 742995, 735183, 729296, 726630, 726795, 728436, 730526, 732538, 733812, 733658, 732209, 730608, 729965, 730317, 730782, 730519, 729294, 727350, 725177, 723352, 722061, 720505, 717322, 712226, 707008, 704056, 703648, 703423, 701062, 696831, 692666, 689192, 685007, 679249, 673637, 670739, 670651, 670644, 668316, 664196, 660775, 659710, 660704, 662685, 665089, 667917, 671174, 674686, 678210, 681516, 684537, 687554, 691082, 695609, 701603, 709577, 719728, 731579, 744461, 758232, 772919, 787542, 800144, 809406, 815611, 819629, 821723, 822020, 821492, 821418, 822104, 822963, 823651, 824225, 824308, 823039, 819980, 815376, 809497, 802651, 795870, 790586, 787165, 784551, 781722, 778747, 776007, 773256, 770214, 767525, 766335, 767182, 769761, 773404]
51341G73404L896L445L117L889N527O585O099M496K670J102K99J086L739P408
51327H26762J1057J4419J7569K0235K2267K4272K7016L0425L3897L7291M0986
51316A106196M5079M9187N3094N6932O0497O2637O1691N6728M8465L8817K9252
51305A668575J9725R398j839j3183k3872l3425m1031m5890m8487n0334n1976n2389
51293A335272n1073m9394m8684m8196m6473m3817m1481l9009l4594k8267k2602
51282H81682j9596j8596j7987j7308j6587j5202j2777j0203q439p188o082o017
51270G25700p606r031p712l974r66n61j291j152m69o85j660j937j061n1K67J35
51254F87946Q5J90K73J15n56j641k262j513L13J820J889N16j638l798n133n011
$$ y = [773404, 777300, 780745, 783862, 787751, 793278, 799863, 805962, 810458, 813128, 814230, 814529, 815615, 819354, 826762, 837819, 852238, 869807, 890042, 912309, 936581, 963597, 994022, 1027919, 1065210, 1106196, 1151275, 1200462, 1253556, 1310488, 1370985, 1433622, 1495313, 1552041, 1600506, 1639323, 1668575, 1688300, 1697698, 1695859, 1682676, 1658804, 1625379, 1584348, 1538458, 1489971, 1439637, 1387661, 1335272, 1284199, 1234805, 1186121, 1137925, 1091452, 1047635, 1006154, 967145, 932551, 904284, 881682, 862086, 843490, 825503, 808195, 791608, 776406, 763629, 753426, 744987, 737799, 731717, 725700, 718094, 709063, 701351, 697377, 696411, 695850, 694559, 693407, 692938, 692253, 690593, 688656, 687595, 687544, 687811, 687946, 688031, 688221, 688494, 688609, 688053, 686412, 684150, 682637, 682950, 684770, 686659, 687175, 685537, 681739, 676606, 671595]
51238F71595l538j497M61K109L285L706L313K208M34j642k826k117l87J09j426
51223F73787k993k181R29M140N770N885N297M675M600N319O219O337N603M807
51209G28194M282L449K036R34J159K526L847M231L697K795K070J818K002K256
51195G65296K060R78j053l435n049n127m150l570m401o260p869q307p681o803
51181G04629o298n979n077l298j400m25m90r23j385k079k692k132l8K087K263
51166F76763L77j605j918q18J29mp85j297j089j96J229K838L923L971L423L317
51150F88258L891M074K958J285O65J388J984J254k5j0J953M604O094N649L959
51135G27981K334J532J318J098P80P40R84R66L86k79m93m07m20l94M3O18O30J9
$$ y = [671595, 668057, 666560, 667021, 669130, 672415, 676121, 679434, 681642, 682076, 680434, 677608, 675491, 675104, 675213, 673787, 670794, 668613, 669542, 673682, 679452, 685337, 690634, 695309, 699909, 705228, 711447, 717784, 723387, 728194, 732476, 735925, 737961, 738895, 740054, 742580, 746427, 750658, 754355, 757150, 759220, 761038, 763040, 765296, 767356, 768334, 767281, 763846, 758797, 753670, 749520, 745950, 741549, 735289, 727420, 719113, 711432, 704629, 698331, 692352, 687275, 683977, 682577, 682152, 681662, 680739, 679354, 677275, 674583, 672451, 672413, 674500, 676763, 677140, 675535, 673617, 672799, 672928, 672924, 672139, 670842, 669753, 669557, 670786, 673624, 677547, 681518, 684941, 688258, 692149, 696223, 699181, 700466, 701131, 702519, 704503, 705757, 705732, 705722, 707675, 712279, 718373, 724022, 727981, 730315, 731847, 733165, 734263, 735043, 735783, 736767, 737733, 738119, 737840, 737347, 736940, 736520, 736126, 736169, 736787, 737417, 737436]
51117G37436n23p27j256k554l748l543k061q72j083k035k428k026j512r63M11
51102G12516K826N228O486O625O269N588M580L753L470L035J575l16j169q81r55
51087G58630k179l486l814l667l815l693k582j464j922l546m143k642l55R84J134
51072G23440P67J76p23j746k600l140l074j913J95K205L270L848M967O697P909
51057G40278P502N411K564L01k27J247L758N762O383N930N108M038K418N29n54
51042G90448j26J092J771J681J839K713L326K819K068K479L682L959K967K331
51028H23049L005L578K446L70o31k40mp29j418j077r8Q10J789L005L643K962J868
51011H42328K108L916N554N626M971N597Q198J1327J3011J2703J1700J2016J4832
$$ y = [737436, 736913, 736186, 734930, 732376, 728628, 725085, 723024, 722152, 721069, 719034, 716606, 714580, 713068, 712105, 712516, 715342, 720570, 727056, 733681, 739950, 745538, 750118, 753871, 757341, 760376, 761951, 761635, 760466, 759585, 758630, 756451, 752965, 749151, 745484, 741669, 737976, 735394, 733930, 732008, 728462, 724319, 721677, 721322, 722306, 723440, 724207, 724383, 723660, 721914, 719314, 716174, 713100, 711187, 711382, 713587, 716857, 720705, 725672, 732369, 740278, 747780, 753191, 755755, 756056, 755829, 757076, 760834, 766596, 772979, 778909, 784017, 788055, 790473, 791002, 790448, 790322, 791414, 793185, 794866, 796705, 799418, 802744, 805563, 807631, 810110, 813792, 817751, 820718, 823049, 826054, 829632, 832078, 832448, 831817, 831577, 831573, 830844, 829426, 828349, 828251, 829061, 830850, 833855, 837498, 840460, 842328, 844436, 848352, 853906, 859532, 864503, 870100, 878298, 889625, 902636, 915339, 927039, 939055, 953887]
50998I53887J9612K4409K7306K7927K7532K7403K7350K6139K3294J9941J7581
50987A222381J6482J5690J4364J2508J0523Q520O286L584L06l360o780r201j0429
50974A280874j0980j1451j1936j2308j2719j3549j4905j6416j7420j7253j5648
50963A126289j3242j1490j1438j2447j2546j0337o409k721o86k5P07K685N821
50950A054161Q987J1069J1822J1827J1791J2030J2537J3296J4348J5547J6398
50939A193813J6305J5248J4110J3971J4841J5436J4606J2768J1361J0933J0420
50928A343812Q601N764L489L020M240O183Q161J0310J3150J6835K0891K4710K8138
50915A497304L1364L4412L7112L9439M1515M3322M4935M7090N0835N6289O2191
$$ y = [953887, 973499, 997908, 1025214, 1053141, 1080673, 1108076, 1135426, 1161565, 1184859, 1204800, 1222381, 1238863, 1254553, 1268917, 1281425, 1291948, 1300468, 1306754, 1310338, 1310644, 1307284, 1300504, 1291303, 1280874, 1269894, 1258443, 1246507, 1234199, 1221480, 1207931, 1193026, 1176610, 1159190, 1141937, 1126289, 1113047, 1101557, 1090119, 1077672, 1065126, 1054789, 1048380, 1045659, 1044973, 1044948, 1045655, 1048340, 1054161, 1063148, 1074217, 1086039, 1097866, 1109657, 1121687, 1134224, 1147520, 1161868, 1177415, 1193813, 1210118, 1225366, 1239476, 1253447, 1268288, 1283724, 1298330, 1311098, 1322459, 1333392, 1343812, 1352413, 1358177, 1361666, 1364686, 1368926, 1375109, 1383270, 1393580, 1406730, 1423565, 1444456, 1469166, 1497304, 1528668, 1563080, 1600192, 1639631, 1681146, 1724468, 1769403, 1816493, 1867328, 1923617, 1985808]
50904A985808O7083P0658P3763P7468Q2444Q8660R5299J01243J06010J09785J12451
50893B970672J13321J12277J10266J07813J03895R7355Q8832Q0016P1434O2487
50883C918368N3460M5778L9949L4800K9385K4373K0669J7874J4907J1290P008
50872D217861J940l539q274j1764j5342k0799k8153l5941m3466n1506o0714p0261
50860C870042p8485q4383q8343r1776r5891j00391j03586j04213j02773j00574
50850B919627r8022r4776r0968q6936q1985p5052o6921o0208n6271n3418m9163
50839B105907m3411l8151l4691l2544l0751k8934k6819k3894k0121j6284j3118
50828A797189j0552q259o388n217m404l269j677o7J311K647M070N537P397J0243
$$ y = [1985808, 2052891, 2123549, 2197312, 2274780, 2357224, 2445884, 2541183, 2642426, 2748436, 2858221, 2970672, 3083993, 3196270, 3306536, 3414349, 3518244, 3615599, 3704431, 3784447, 3855881, 3918368, 3971828, 4017606, 4057555, 4092355, 4121740, 4146113, 4166782, 4184656, 4199563, 4210853, 4217861, 4219801, 4216262, 4207988, 4196224, 4180882, 4160083, 4131930, 4095989, 4052523, 4001017, 3940303, 3870042, 3791557, 3707174, 3618831, 3527055, 3431164, 3330773, 3227187, 3122974, 3020201, 2919627, 2821605, 2726829, 2635861, 2548925, 2466940, 2391888, 2324967, 2264759, 2208488, 2155070, 2105907, 2062496, 2024345, 1989654, 1957110, 1926359, 1897425, 1870606, 1846712, 1826591, 1810307, 1797189, 1786637, 1778378, 1771990, 1766773, 1762369, 1759100, 1757423, 1757356, 1758667, 1761314, 1765384, 1770921, 1778318, 1788561]
50814A788561J3831J6771J8056J8441J9556K1832K4257K6124K8053L0919L4664
50803B041065L8618M2478M6355N0370N4710N9810O5942P2794P9757Q6484R3037
50792B731420R9799J07445J16503J26712J37345J48389J60606J74069J87423J99370
50782D189081K10096K20421K30154K38330K44457K48345K49101K45709K38475
50773F314169K28560K16081J99947J79951J57685J34970J12454R0303O9233N0078
50763G753431L3133J8593P060j004n720p296n854k432N19O35k699q866j7815l0567
50749G731118m7881o9051r2070j14794j36163j56600j77064j97388k15681k29518
50739F294908k37665k40665k40176k37819k34184k28591k20039k08474j94820
$$ y = [1788561, 1802392, 1819163, 1837219, 1855660, 1875216, 1897048, 1921305, 1947429, 1975482, 2006401, 2041065, 2079683, 2122161, 2168516, 2218886, 2273596, 2333406, 2399348, 2472142, 2551899, 2638383, 2731420, 2831219, 2938664, 3055167, 3181879, 3319224, 3467613, 3628219, 3802288, 3989711, 4189081, 4399177, 4619598, 4849752, 5088082, 5332539, 5580884, 5829985, 6075694, 6314169, 6542729, 6758810, 6958757, 7138708, 7296393, 7431363, 7543817, 7634120, 7703353, 7753431, 7786564, 7805157, 7812217, 7811213, 7805493, 7798197, 7792343, 7789911, 7790430, 7791065, 7788366, 7779500, 7761685, 7731118, 7683237, 7614186, 7522116, 7407322, 7271159, 7114559, 6937495, 6740107, 6524426, 6294908, 6057243, 5816578, 5576402, 5338583, 5104399, 4875808, 4655769, 4447295, 4252475]
50730D252475j80047j64750j49560j34952j20630j06111r2193q0676p2059o4658
50720C086839n6727m8497m1243l5460l1054k8291k7153k6426k4953k3351k3053
50709B720631k3965k4656k4724k5246k6735k8155k8562k8395k8409k8392k7691
50698B425701k6312k4785k3479k2516k1866k1114j9647j7403j4888j2246q885
50687B212560m444N30N331J0042J5329K1516K8190L4459L9579M3716M8134N4063
50675B509005O1319O8569P5002Q1015Q7199R3569J00086J06903J13588J18915
50665C415170J22162J24013J25553J26942J27635J27308J25803J22609J17147
50656D534342J09372R9518Q7526P3350N7615M1475K5914J1546j183j1896k0239
$$ y = [4252475, 4072428, 3907678, 3758118, 3623166, 3502536, 3396425, 3304232, 3223556, 3151497, 3086839, 3030112, 2981615, 2940372, 2904912, 2873858, 2845567, 2818414, 2791988, 2767035, 2743684, 2720631, 2696666, 2672010, 2647286, 2622040, 2595305, 2567150, 2538588, 2510193, 2481784, 2453392, 2425701, 2399389, 2374604, 2351125, 2328609, 2306743, 2285629, 2265982, 2248579, 2233691, 2221445, 2212560, 2208116, 2208646, 2213977, 2224019, 2239348, 2260864, 2289054, 2323513, 2363092, 2406808, 2454942, 2509005, 2570324, 2638893, 2713895, 2794910, 2882109, 2975678, 3075764, 3182667, 3296255, 3415170, 3537332, 3661345, 3786898, 3913840, 4041475, 4168783, 4294586, 4417195, 4534342, 4643714, 4743232, 4830758, 4904108, 4961723, 5003198, 5029112, 5040658, 5039475, 5027579, 5007340]
50645E007340k5739k8117k7920k6252k3605j9660j4557r554n940m067m101o850
50633D810978j2907k1696l2258m4429n8327p3248q7985j01646j13133j20738j23641
50622D020970j23326j22015j20002j15988j09605j01806r3026q2880p1901o1532
50612C018889n1922m1539k9831j8462q945o32P650J5274K0599K3307K4607K5649
50600B984644K6714K7519K7588K6815K6167K6995K9142L0706L0427K9152K8322
50589C294191K8309K9140L1293L4414L6801L7778L9270M2986M7524N0580N2895
50578C725181N7024O2888O7678P0111P1581P2711P2040O9259O6621O5472O4001
50567D464567O0471N6405N4236N3463N1411M6410L8051K5705R511p809k2562l3349
$$ y = [5007340, 4981601, 4953484, 4925564, 4899312, 4875707, 4856047, 4841490, 4831936, 4825996, 4821929, 4817828, 4810978, 4798071, 4776375, 4744117, 4699688, 4641361, 4568113, 4480128, 4378482, 4265349, 4144611, 4020970, 3897644, 3775629, 3655627, 3539639, 3430034, 3328228, 3235202, 3152322, 3080421, 3018889, 2966967, 2925428, 2895597, 2877135, 2868190, 2867558, 2875208, 2890482, 2911081, 2934388, 2958995, 2984644, 3011358, 3038877, 3066465, 3093280, 3119447, 3146442, 3175584, 3206290, 3236717, 3265869, 3294191, 3322500, 3351640, 3382933, 3417347, 3454148, 3491926, 3531196, 3574182, 3621706, 3672286, 3725181, 3782205, 3845093, 3912771, 3982882, 4054463, 4127174, 4199214, 4268473, 4335094, 4400566, 4464567, 4525038, 4581443, 4635679, 4689142, 4740553, 4786963, 4825014, 4850719, 4860230, 4852421, 4829859, 4796510]
50555D796510m0952m5711m7239m6321m4529m1839l6924l0164k4177k0741j9230
50544D398683j8757j9864k3096k7821l3705m1769n2473o3983p3896q1772q8657
50533C872890r4876r9782j03003j04517j03968j01294r7685r4514r1518q7438
50523B894295q2450p8239p5185p1122o4025n5099m7812m3893m1416l7205l0406
50512B267443k3077j7602j4381j2136r542n842n42O124J2491J6511J7963J8791
50500B256201K0755K3820K7347L1635L7001M2258M5700M7344M8758N0693N2205
50489B683717N2405N1777N1342N1465N2017N2857N3623N3881N4019N5394N8824
50478C271321O3573O8383P3002P7910Q3111Q8234R3757J01013J10538J21054J30630
$$ y = [4796510, 4755558, 4709847, 4662608, 4616287, 4571758, 4529919, 4492995, 4462831, 4438654, 4417913, 4398683, 4379926, 4360062, 4336966, 4309145, 4275440, 4233671, 4181198, 4117215, 4043319, 3961547, 3872890, 3778014, 3678232, 3575229, 3470712, 3366744, 3265450, 3167765, 3073251, 2981733, 2894295, 2811845, 2733606, 2658421, 2587299, 2523274, 2468175, 2420363, 2376470, 2335054, 2297849, 2267443, 2244366, 2226764, 2212383, 2200247, 2190705, 2184863, 2184321, 2190445, 2202936, 2219447, 2237410, 2256201, 2276956, 2300776, 2328123, 2359758, 2396759, 2439017, 2484717, 2532061, 2580819, 2631512, 2683717, 2736122, 2787899, 2839241, 2890706, 2942723, 2995580, 3049203, 3103084, 3157103, 3212497, 3271321, 3334894, 3403277, 3476279, 3554189, 3637300, 3725534, 3819291, 3920304, 4030842, 4151896, 4282526]
50467D282526J38533J45494J52380J59193J65502J71299J76723J81169J83439
50458E756258J83047J80701J76908J70739J60747J46775J29833J10494Q8600O4684
50448G168786M0162J5644r671l5884o0800q1791r8483j12152j22840j28821j29067
50437F445083j24674j17314j07465r4948q0241o4307m7761l1169j5818l445M689
50426E762630P880N477k939j6852l4903n5661p7837r9882j20018j36980j50383
50415E080532j60347j67116j70970j72078j70300j65676j59067j51768j44179
50406C619031j35598j25712j15741j07309j00431r3454q5088p5904o7513o0757
50396B651524n5067m9437m3589l7970l2799k7448k1085j3930p421k816J42K740
$$ y = [4282526, 4421059, 4566553, 4718933, 4878126, 5043628, 5214927, 5391650, 5572819, 5756258, 5939305, 6120006, 6296914, 6467653, 6628400, 6775175, 6905008, 7015502, 7104102, 7168786, 7208948, 7224592, 7214921, 7179037, 7118237, 7036446, 6937963, 6825811, 6702971, 6574150, 6445083, 6320409, 6203095, 6095630, 6000682, 5920441, 5856134, 5808373, 5777204, 5761386, 5757941, 5762630, 5770510, 5775987, 5773048, 5756196, 5721293, 5665632, 5587795, 5487913, 5367895, 5230915, 5080532, 4920185, 4753069, 4582099, 4410021, 4239721, 4074045, 3914978, 3763210, 3619031, 3483433, 3357721, 3241980, 3134671, 3034240, 2940786, 2855698, 2779794, 2712281, 2651524, 2596457, 2547020, 2503431, 2465461, 2432662, 2405214, 2384129, 2370199, 2362778, 2359962, 2360104, 2362844]
50384B362844N831R355J3172J7473K2059K5914K8053K8462K7763K6356K4296K1701
50372B613279J8745J5552J2560J0650J0236J0518J0511J0587J1868J4083J5275
50361B753864J4414J3126J3883J7127K1351K5547L0237L5977M2033M7190N1288
50350C066037N5443O0907O7891P5312Q1634Q6201Q9509R1898R2410Q9889Q4985
50339C942116P9886P5605P0704O3343N3657M2998L1619J8591L812j1323k5718
50328D345290l9858n4509o8801q0432q7671r0543r0129q7272q2232p5288o7175
50317C521380n8706n0118m1086l1537k2158j3937p469k986q24j448n054j1363
50305C274694j9593k8484l6752m4080n1397n9449o7337p3136p5993p6763p6568
$$ y = [2362844, 2368675, 2378030, 2391202, 2408675, 2430734, 2456648, 2484701, 2513163, 2540926, 2567282, 2591578, 2613279, 2632024, 2647576, 2660136, 2670786, 2681022, 2691540, 2702051, 2712638, 2724506, 2738589, 2753864, 2768278, 2781404, 2795287, 2812414, 2833765, 2859312, 2889549, 2925526, 2967559, 3014749, 3066037, 3121480, 3182387, 3250278, 3325590, 3407224, 3493425, 3582934, 3674832, 3767242, 3857131, 3942116, 4022002, 4097607, 4168311, 4231654, 4285311, 4328309, 4359928, 4378519, 4382331, 4371008, 4345290, 4305432, 4250923, 4182122, 4101690, 4014019, 3923476, 3833347, 3746075, 3663843, 3588555, 3521380, 3462674, 3412556, 3371470, 3339933, 3317775, 3303838, 3296369, 3293383, 3292559, 3291111, 3286057, 3274694, 3255101, 3226617, 3189865, 3145785, 3094388, 3034939, 2967602, 2894466, 2818473, 2741710, 2665142]
50294B665142p5594p3612p0782o7388o3358n8676n3691m8580m2963l6647l0335
50283B043516k4980k0854j7844j6268j6568j8321k0333k1617k1733k0373j7467
50272A827158j3812j0748q767o970m311j068J437K477K867M102O691R585J1397
50259A820038J1966J2280J2905J3117J1971R680P476O227N695N057L900K647K122
50246A925081K514K908K354J409J737L886O389P732Q309R557J1894J4595J7118
50233B015483J9397K1373K3443K6813L1922L6959L9746M0959M3391M7506M9784
50222B396776M6469L7491K5660J3461K021p911j5654k1066k4310k5489k5131k4347
50210B377970k3727k2746k1091j9708j9500j9713j8828j6534j3648j0669p707
$$ y = [2665142, 2589548, 2515936, 2445154, 2377766, 2314408, 2255732, 2202041, 2153461, 2110498, 2073851, 2043516, 2018536, 1997682, 1979838, 1963570, 1947002, 1928681, 1908348, 1886731, 1864998, 1844625, 1827158, 1813346, 1802598, 1793831, 1786861, 1782550, 1781482, 1782919, 1785396, 1788263, 1792365, 1799056, 1808641, 1820038, 1832004, 1844284, 1857189, 1870306, 1882277, 1891957, 1899433, 1905660, 1911355, 1916412, 1920312, 1922959, 1925081, 1927595, 1930503, 1932857, 1934266, 1936003, 1939889, 1946278, 1954010, 1962319, 1971876, 1983770, 1998365, 2015483, 2034880, 2056253, 2079696, 2106509, 2138431, 2175390, 2215136, 2256095, 2299486, 2346992, 2396776, 2443245, 2480736, 2506396, 2519857, 2521878, 2513967, 2498313, 2477247, 2452937, 2427448, 2402317, 2377970, 2354243, 2331497, 2310406, 2290698, 2271198, 2251485, 2232657, 2216123, 2202475, 2191806, 2184099]
50199B184099n407m337l588j442K385O458R818J3099J6994K0899K3788K5604K6923
50186B315293K7854K7998K7213K5911K4777K4421K4931K5478K4737K2063J7982
50175B588658J3369Q486L066l008r455j5809k1548k6132k9223l0902l1603l1834
50163B414065l1845l1603l1168l1295l3293l7859m4010m9442n2147n1778m9668
50152A969957m7585m6181m4485m1243l6755l2815l0560k9039k6597k2966j9257
50141A592474j6368j4413j3356j3172j3297j2919j1913j0746r555q136o923o862
50129A454814q055r350r678r142q453q054q087q540r009q951q520q499r048r229
50115A332199q294o808n875n734n839n940o238o556o020l980j001J350J964J460
$$ y = [2184099, 2178692, 2174355, 2170767, 2169325, 2171710, 2178168, 2187986, 2201085, 2218079, 2238978, 2262766, 2288370, 2315293, 2343147, 2371145, 2398358, 2424269, 2449046, 2473467, 2498398, 2523876, 2548613, 2570676, 2588658, 2602027, 2610513, 2613579, 2610571, 2601116, 2585307, 2563759, 2537627, 2508404, 2477502, 2445899, 2414065, 2382220, 2350617, 2319449, 2288154, 2254861, 2217002, 2172992, 2123550, 2071403, 2019625, 1969957, 1922372, 1876191, 1831706, 1790463, 1753708, 1720893, 1690333, 1661294, 1634697, 1611731, 1592474, 1576106, 1561693, 1548337, 1535165, 1521868, 1508949, 1497036, 1486290, 1476735, 1468599, 1461676, 1454814, 1446759, 1437409, 1427731, 1418589, 1410136, 1402082, 1393995, 1385455, 1376446, 1367495, 1358975, 1350476, 1341428, 1332199, 1323905, 1317097, 1311222, 1305488, 1299649, 1293709, 1287471, 1280915, 1274895, 1270915, 1269914, 1271264, 1273228, 1274688]
50101A274688J641L452N859P296P732Q463R985J1315J1639J1661J2734J5269J8421
50088A400155K0883K1838K1756K2286K4536K7404K8704K8212K8201L0352L3599
50077A687926L6120L8089M0933M4770M8352N1114N3629N6048N7692N8336N8595
$$ y = [1274688, 1276329, 1279781, 1285640, 1292936, 1300668, 1309131, 1319116, 1330431, 1342070, 1353731, 1366465, 1381734, 1400155, 1421038, 1442876, 1464632, 1486918, 1511454, 1538858, 1567562, 1595774, 1623975, 1654327, 1687926, 1724046, 1762135, 1803068, 1847838, 1896190, 1947304, 2000933, 2056981, 2114673, 2173009, 2231604]
$$ [...]
##END NTUPLES=NMR SPECTRUM
##END=
