
##TITLE=AC1007_S-149_6114592_zZLpfeKMET
##JCAMPDX= 6.0         $$ Bruker NMR JCAMP-DX V2.0
##DATA TYPE= NMR SPECTRUM
##DATA CLASS= NTUPLES
##ORIGIN= BRUKER
##OWNER= Administrator
$$ 1.72 TOPSPIN		Version 2.1
$$ 2012-05-14 18:36:59.109 -0500  Administrator@TOPSPIN
$$ Compression mode = diff/dup
##.OBSERVE FREQUENCY= 400.13188235
##.OBSERVE NUCLEUS= ^1H
##.ACQUISITION MODE= SIMULTANEOUS (DQD)
##.ACQUISITION SCHEME= undefined
##.AVERAGES= 8
##.DIGITISER RES= 22
##SPECTROMETER/DATA SYSTEM= spect
##.PULSE SEQUENCE= zg30
##.SOLVENT NAME= COFFEE_meoh
##.SHIFT REFERENCE= INTERNAL, COFFEE_meoh, 1, 14.98061
##AUDIT TRAIL= $$ (NUMBER, WHEN, WHO, WHERE, PROCESS, VERSION, WHAT)
$$ ##TITLE= Audit trail, TOPSPIN		Version 2.1
$$ ##JCAMPDX= 5.01
$$ ##ORIGIN= Bruker BioSpin GmbH
$$ ##OWNER= Administrator
$$ $$ C:\Bruker\TOPSPIN/data/COFFEE/nmr/AC1007_S-149_6114592_zZLpfeKMET/20/pdata/1/auditp.txt
$$ ##AUDIT TRAIL=  $$ (NUMBER, WHEN, WHO, WHERE, PROCESS, VERSION, WHAT)
(   1,<2012-05-14 18:36:52.421 -0500>,<Administrator>,<TOPSPIN>,<go>,<TOPSPIN 2.1>,
      <created by zg
	started at 2012-05-14 18:35:43.375 -0500,
	POWCHK enabled, PULCHK disabled,
       configuration hash MD5:
       AF F2 23 6B 01 CD 40 DD E5 A1 38 A0 06 EA F7 77
       data hash MD5: 64K
       AC 53 1B 04 82 48 F1 1F 2B F0 8D 91 2D 38 EF 0B>)
(   2,<2012-05-14 18:36:55.015 -0500>,<Administrator>,<TOPSPIN>,<proc1d>,<TOPSPIN 2.1>,
      <Start of raw data processing
       efp LB = 0 FT_mod = 6 PKNL = 1 PHC0 = 0 PHC1 = 0 SI = 32K 
       data hash MD5: 32K
       2D A4 6D 2A 1A 45 01 C6 5D EE 6D 63 37 61 12 09>)
(   3,<2012-05-14 18:36:55.406 -0500>,<Administrator>,<TOPSPIN>,<proc1d>,<TOPSPIN 2.1>,
      <pk PHC0 = 214.8706 PHC1 = 0 
       data hash MD5: 32K
       A0 74 D7 D7 9A C1 83 E3 25 6E 17 07 04 21 5D 96>)
(   4,<2012-05-14 18:36:55.515 -0500>,<Administrator>,<TOPSPIN>,<proc1d>,<TOPSPIN 2.1>,
      <abs ABSG = 1 
       data hash MD5: 32K
       AF D1 E1 BC 7D DD 51 CB 00 A6 E3 FE 66 04 93 34>)
(   5,<2012-05-14 18:36:55.562 -0500>,<Administrator>,<TOPSPIN>,<proc1d>,<TOPSPIN 2.1>,
      <abs ABSG = 2 
       data hash MD5: 32K
       1F 1D 99 62 33 CE B7 EE E8 3B 8F 51 A3 8C 27 41>)
(   6,<2012-05-14 18:36:55.593 -0500>,<Administrator>,<TOPSPIN>,<proc1d>,<TOPSPIN 2.1>,
      <abs ABSG = 3 
       data hash MD5: 32K
       6B 02 EA CE B3 E6 36 94 06 B1 87 B1 77 97 36 19>)
(   7,<2012-05-14 18:36:55.625 -0500>,<Administrator>,<TOPSPIN>,<proc1d>,<TOPSPIN 2.1>,
      <abs ABSG = 4 
       data hash MD5: 32K
       55 68 76 8A 55 5B DF FE B5 87 93 4B 8D FD AB C9>)
(   8,<2012-05-14 18:36:55.656 -0500>,<Administrator>,<TOPSPIN>,<proc1d>,<TOPSPIN 2.1>,
      <abs ABSG = 5 
       data hash MD5: 32K
       43 0C 5E 86 4A C2 37 CB 4C AF 59 6B D2 75 F4 19>)
$$ ##END=
$$ 
$$ $$ hash MD5
$$ $$ 66 82 25 7E 9F 2C 80 C6 6E 7D 8E 26 F7 07 FF 78
##$RELAX= 
##$RELAX= 
##$RELAX= 
##$RELAX= 
##$RELAX= 
##$RELAX= 
##$RELAX= 
$$ Bruker specific parameters
$$ --------------------------
$$ [...]
150 150 150 150 150 150 150 150
##$TP07= 0
##$TPNAME0= <>
##$TPNAME1= <>
##$TPNAME2= <>
##$TPNAME3= <>
##$TPNAME4= <>
##$TPNAME5= <>
##$TPNAME6= <>
##$TPNAME7= <>
##$TPOAL= (0..7)
0.5 0.5 0.5 0.5 0.5 0.5 0.5 0.5
##$TPOFFS= (0..7)
0 0 0 0 0 0 0 0
##$TUNHIN= 0
##$TUNHOUT= 0
##$TUNXOUT= 0
##$USERA1= <user>
##$USERA2= <user>
##$USERA3= <user>
##$USERA4= <user>
##$USERA5= <user>
##$V9= 5
##$VALIST= <valist>
##$VCLIST= <CCCCCCCCCCCCCCC>
##$VD= 0
##$VDLIST= <DDDDDDDDDDDDDDD>
##$VPLIST= <PPPPPPPPPPPPPPP>
##$VTLIST= <TTTTTTTTTTTTTTT>
##$WBST= 2048
##$WBSW= 25
##$XGAIN= (0..3)
0 0 0 0
##$XL= 0
##$YL= 0
##$YMAX_a= 502616
##$YMIN_a= -586444
##$ZGOPTNS= <>
##$ZL1= 120
##$ZL2= 120
##$ZL3= 120
##$ZL4= 120
##$ABSF1= 14.98061
##$ABSF2= -5.57192
##$ABSG= 5
##$ABSL= 3
##$ALPHA= 0
##$AQORDER= 0
##$ASSFAC= 0
##$ASSFACI= 0
##$ASSFACX= 0
##$ASSWID= 0
##$AUNMP= <proc_prof1d_extract_pilot.lims>
##$AXLEFT= 0
##$AXNAME= <>
##$AXNUC= <1H>
##$AXRIGHT= 0
##$AXTYPE= 0
##$AXUNIT= <>
##$AZFE= 0.1
##$AZFW= 0.1
##$BCFW= 0
##$BC_mod= 0
##$BYTORDP= 0
##$COROFFS= 0
##$CY= 15
##$DATMOD= 1
##$DC= 0
##$DFILT= <>
##$DTYPP= 0
##$F1P= 0
##$F2P= 0
##$FCOR= 0.5
##$FTSIZE= 32768
##$FT_mod= 6
##$GAMMA= 0
##$GB= 0
##$INTBC= 1
##$INTSCL= 1
##$ISEN= 128
##$LB= 0
##$LEV0= 0
##$LPBIN= 0
##$MAXI= 10000
##$MC2= 0
##$MEAN= 0
##$ME_mod= 0
##$MI= 0
##$NCOEF= 0
##$NC_proc= -8
##$NLEV= 6
##$NOISF1= 0
##$NOISF2= 0
##$NSP= 0
##$NTH_PI= 0
##$NZP= 0
##$OFFSET= 14.98061
##$PC= 1
##$PHC0= 214.8706
##$PHC1= 0
##$PH_mod= 1
##$PKNL= yes
##$PPARMOD= 0
##$PPDIAG= 0
##$PPIPTYP= 0
##$PPMPNUM= 2147483647
##$PPRESOL= 1
##$PSCAL= 4
##$PSIGN= 0
##$PYNMP= <proc.py>
##$REVERSE= no
##$SF= 400.13
##$SI= 32768
##$SIGF1= 0
##$SIGF2= 0
##$SINO= 400
##$SIOLD= 32768
##$SPECTYP= <>
##$SREGLST= <1H.CDCl3>
##$SSB= 0
##$STSI= 32768
##$STSR= 0
##$SW_p= 8223.68421052632
##$SYMM= 0
##$S_DEV= 0
##$TDeff= 65536
##$TDoff= 0
##$TI= <>
##$TILT= no
##$TM1= 0
##$TM2= 0
##$TOPLEV= 0
##$USERP1= <user>
##$USERP2= <user>
##$USERP3= <user>
##$USERP4= <user>
##$USERP5= <user>
##$WDW= 1
##$XDIM= 32768
##$YMAX_p= 456830741
##$YMIN_p= -672151
##$CURPLOT= <Network HP LaserJet P1505>
##$CURPRIN= <$Network HP LaserJet P1505>
##$DFORMAT= <normdp>
##$LAYOUT= <+/1D_H.xwp>
##$LFORMAT= <normlp>
##$PFORMAT= <normpl>
##$SURQMSG= 1
$$ End of Bruker specific parameters
$$ ---------------------------------
##NTUPLES= NMR SPECTRUM
##VAR_NAME=  FREQUENCY,     SPECTRUM/REAL,   SPECTRUM/IMAG
##SYMBOL=    X,             R,               I
##VAR_TYPE=  INDEPENDENT,   DEPENDENT,       DEPENDENT
##VAR_FORM=  AFFN,          ASDF,            ASDF
##VAR_DIM=   32768,         32768,           32768
##UNITS=     HZ,            ARBITRARY UNITS, ARBITRARY UNITS
##FACTOR=    0.250966925370066, 1,           1
##FIRST=     8223.43324360095, 5701,         -226321
##LAST=      0,             -42674,          -58906
##MIN=       0,             -672151,         0
##MAX=       8223.43324360095, 456830741,    0
$$ Real data points
##PAGE= N=1
##DATA TABLE= (X++(R..R)), XYDATA
$$ [...]
$$ plain form
19573 -58227 -109697 -127255 175680 -200884 -352230 29767 -41203 48028 -73172 -249615 139921
19561 57319 29728 143241 -48270 -231148 -44181 -299767 -243744 184012 -149938 -90105 -243464
19550 -243464 112749 208394 -173845 -89446 184590 -13260 393281 90937 44598 65701 4554
19538 30717 106783 -36287 -78963 147263 -141807 -313844 100892 -5866 51376 -155433 142281
19526 16653 11121 175482 -11499 56891 12557 -374648 -23462 -221752 232288 -25017 -93539
19515 -93539 -107135 -217433 238577 157739 -1237 -195311 92435 108767 -27431 201336 1322
19503 198783 221473 327973 -335043 -136354 -37697 112211 134344 -286667 -193918 136774
19492 -112326 58276 -54853 257415 106759 125401 10595 121479 -256749 75473 -398405
$$ packed form
19573e8227n1470j7558A75680b00884j51346B9767d1203D8028g3172j76443A39921
19561E7319k7591J13513d8270j82878d4181k55586N6023A84012a49938N9833j53359
19550b43464A12749R5645a73845Q4399A84590a3260C93281I0937D4598K1103D554
19538C0717P6066c6287m2676A47263a41807j72037A00892e866E1376a55433A42281
19526A6653n532J64361a1499E6891A2557c74648b3462j98290B32288b5017o8522
19515i3539j3596j10298B38577q0838a237j94074I2435J6332b7431B01336A322
19503A98783K2690J06500c35043a36354c7697A12211K2133b86667R2749A36774
19492a12326E8276e4853B57415A06759J8642A0595J10884b56749G5473c98405
$$ plain form
19481 282547 -44749 -203811 -53213 16357 -304131 -493374 -95280 141049 -147517 -126852
19471 -126852 -207383 -74156 -416598 39010 -81466 328428 -148086 -76916 39241 -41043 -131855
19460 -131855 -353338 106599 -20138 96953 -317827 151438 -112974 48835 -76037 185747
19449 -445016 -30514 -29932 -81263 -214987 -155724 -4588 -180640 84739 -82666 -236360 -153030
19438 -153030 -174001 -363269 -30730 269053 -479271 145419 -187219 -13235 -80769 -165508
19428 -165508 13732 -181348 -186565 98899 -10274 64163 316729 -142913 118819 -51303 -238337
19417 -238337 -28216 -293127 364275 -123934 -213198 -341373 -29432 85386 -183015 -318309
19407 -318309 -21131 -68548 -47477 21013 -239534 -75096 25164 -120948 -94597 52062 -297334
$$ packed form
19481B82547d4749j59062e3213A6357c04131j89243i5280A41049a47517K0665
19471a26852q0531g4156l42442C9010h1466C28428a48086P1170C9241d1043r0812
19460a31855k21483A06599b0138I6953c17827A51438a12974D8835g6037A85747
19449d45016c0514N82n1331j33724N9263d588j76052H4739h2666j53694Q3330
19438a53030k0971j89268c0730B69053d79271A45419a87219a3235o7534q4739
19428a65508A3732a81348n217I8899a0274F4163K52566a42913A18819e1303j87034
19417b38337b8216k64911C64275a23934q9264j28175b9432H5386a83015j35294
19407c18309b1131m7417K1071B1013b39534g5096B5164a20948K6351E2062b97334
$$ plain form
19395 -77683 -79463 -177227 -107379 21541 -107678 -149434 173640 6777 302160 102336 -233782
19383 79016 53930 109290 272600 -161385 -356184 -78907 -267431 206303 14385 -142040
19372 66485 -121261 -128956 -54233 -157389 125748 151156 -449127 156441 -4195 -363524 -353586
19361 -353586 113710 -74528 90564 -52276 -60584 154180 83006 -79385 -95389 149013 -138870
19349 321101 -33019 247332 -459361 82085 -285356 191267 -60442 -266746 -153154 42010
19338 -5690 104792 -528230 -73117 -152599 -66043 -76418 202810 -56017 89179 -69742 -248712
19327 -248712 -118951 192769 -35544 -234330 -199528 -61277 -346553 89281 -336913 -296241
19317 -296241 155059 -154133 -73204 -73763 -194507 15320 -98854 -37274 -2116 -138686 202424
$$ packed form
19395g7683j780r7764O9848B1541a07678m1756A73640F777K95383A02336b33782
19383G9016k5086N5360J63310a61385j94799g8907j88524B06303A4385a42040
19372F6485a21261p695e4233j03156A25748K5408d49127A56441d195l59329R938
19361c53586A13710g4528I0564e2276q308A54180p1174g9385j6004A49013a38870
19349C21101c3019B47332d59361H2085b85356A91267f0442k06304J13592D2010
19338e690A04792e28230g3117p9482f6043j0375B02810e6017H9179f9742j78970
19327b48712a18951A92769c5544j98786L4802f1277k85276H9281c36913M0672
19317b96241A55059a54133g3204n59j20744A5320i8854c7274b116j36570B02424
$$ plain form
19305 -107389 -13154 36015 -145910 -130967 -195922 -100730 243459 -51440 -164094 -59722 213017
19293 -17811 174382 161718 -170281 -23063 -91737 11236 -102848 -71367 -23760 21473 -225227
19281 39469 59439 -201509 133590 -210420 -300561 -452764 -202595 -32607 -85273 -240307
19271 -240307 -235598 157028 24125 -127970 -46241 89035 -371711 -161521 -90570 9786 -121749
19259 -279926 1807 62907 -330877 -311619 97953 -273760 -241392 210367 -79771 294960 225851
19248 225851 -355911 53124 -76583 -45436 -189724 109614 37016 -231579 -276355 15491 10861
19237 10861 156132 124984 -158434 -281084 167166 -78051 315057 -44538 60729 -162552
19226 -243482 -33561 23816 -198548 -69392 -13587 -57317 341082 -165662 -250893 -466632 -125981
$$ packed form
19305a07389a3154C6015a45910J4943o4955R5192B43459e1440j12654e9722B13017
19293a7811A74382j2664a70281b3063o8674A1236a02848L1481b3760B1473b25227
19281C9469J9970b01509A33590b10420r0141j52203b02595c2607n2666j55034
19271b40307M709A57028B4125a27970d6241H9035c71711a61521P0951I786a21749
19259b79926A807O1100c30877J9258I7953b73760L2368B10367g9771B94960o9109
19248B25851c55911E3124g6583L1147j44288A09614C7016b31579m4776A5491m630
19237A0861J45271l1148a58434j22650A67166g8051C15057d4538F0729a62552
19226b43482c3561B3816a98548f9392a3587m3730C41082a65662q5231k15739a25981
$$ plain form
19214 33780 129016 76024 -89304 -107285 -201145 63737 -23763 32628 1560 85601 -185092 -232040
19202 -232040 -313712 -37783 -134036 120332 29082 213496 -545749 89055 393299 -250034
19191 162417 -212194 -202362 72765 -340977 -149097 -151417 -31171 305471 -252936 41944 -159745
19179 363326 376076 14350 -34194 -219183 111350 -293083 58601 243359 157234 -49935 151247
19167 -153431 191682 -107329 449654 -111319 -335320 -44101 -223556 -56617 -119488 -163426
19157 -163426 -130317 -51295 86847 -125045 -84903 -415509 -118821 -235056 -2366 -295638 -55461
19145 25870 74489 25017 97428 -293681 -82703 -173100 -98378 42430 45543 -217614 -140595
19134 -140595 38515 -155035 -244525 101875 206 -22620 -319568 342538 -142319 255080 17728
$$ packed form
19214C3780R5236n2992h9304j7981r3860F3737b3763C2628A560Q4041a85092m6948
19202b32040q1672c7783r6253A20332B9082J84414e45749H9055L04244b50034
19191A62417b12194R832G2765c40977a49097k320c1171C05471b52936D1944a59745
19179C63326J2750A4350c4194j84989A11350b93083E8601J84758q6125d9935A51247
19167a53431A91682a07329D49654a11319k24001d4101j79455e6617o2871m3938
19157a63426L3109e1295H6847a25045M0142l30606a18821j16235b366k93272e5461
19145B5870M8619B5017P2411b93681h2703r0397P4722D2430L113b17614P7019
19134a40595C8515a55035q9490A01875B06b2620k96948C42538a42319B55080A7728
$$ plain form
19122 -270823 80325 -53986 -271852 -54903 -92099 123479 -112633 219639 -99275 -7643 -243725
19111 -243725 -163112 -120627 106724 -141002 -131270 251016 -258795 86128 78129 -89569 63509
19099 -129276 20750 -122033 -327761 -152341 112407 -411631 -45248 -315884 109405 82067
19089 82067 15700 -236144 -381251 94889 -243400 26750 168803 55739 -77189 -119185 -231250
19078 -231250 165898 -335602 -8261 79512 -412060 210612 -157728 -145846 93096 80472 -208016
19066 74956 22901 -17570 -79507 -104228 299007 51662 -71428 -46285 -413 -32375 -71672 -423899
19054 -423899 15630 -108955 -134557 111261 48040 55581 18868 13987 -85504 -275542 -156719
19043 -156719 -231986 -28713 -64670 -79505 -65985 -43369 50281 -149671 48355 90380 -302754
$$ packed form
19122b70823H0325e3986k17866e4903l7196A23479a12633B19639i9275g643k36082
19111b43725Q0613M2485A06724a41002R732B51016b58795H6128p999h9569F3509
19099a29276B0750a22033k05728a52341A12407d11631d5248k70636A09405k7338
19089H2067A5700b36144j45107I4889b43400B6750J42053E5739g7189m1996j12065
19078b31250A65898c35602h261G9512d12060B10612a57728J1882I3096j2624b08016
19066G4956B2901a7570o1937k4721B99007E1662g1428K5143d13l1962l9297l52227
19054d23899A5630a08955k5602A11261D8040P541A8868m881h5504j90038J18823
19043a56719p5267b8713l5957j4835J3520K2616E0281a49671D8355M2025c02754
$$ plain form
19031 -113988 40523 -303212 4863 -257081 90580 100422 -71722 -144032 -191581 -276478 -15813
19019 -88437 -248379 20258 122464 -72213 -318519 129442 -192416 -90891 269034 297092
19009 297092 111023 106705 -69517 -75726 26762 -4851 -1007 -231779 210175 -188367 -328796
18998 -328796 242482 -212887 -6258 -140070 -297026 50001 195086 -187578 78821 -281177
18987 244627 217412 -259990 397231 86230 -18337 -124746 35359 -10254 283265 2685 -53070
18975 -4360 -215528 -163509 -54691 -100036 80123 -519215 -172045 -45469 -860 -181889 -322856
18964 -322856 -128488 70301 -583167 -106218 32078 -192652 87460 216279 30341 -143739
18953 -57782 -407549 -20270 -58093 -83332 -80268 -149128 267111 -164360 -109329 -160784 -137356
$$ packed form
19031a13988D0523c03212D863b57081I0580R842g1722p2310m7549q4897a5813
19019h8437j59942B0258J02206g2213k46306A29442a92416i0891B69034K8058
19009B97092A11023m318f9517o209B6762d851a007k30772B10175a88367j40429
18998c28796B42482b12887f258j33812j56956E0001J45085a87578G8821b81177
18987B44627k7215b59990C97231H6230a8337j06409C5359a0254B83265B685e3070
18975d360k11168N2019e4691m5345H0123e19215a72045d5469h60j81029j40967
18964c22856a28488G0301e83167a06218C2078a92652H7460J28819C0341a43739
18953e7782l49767b0270l7823k5239L064o8860B67111a64360N5031n1455K3428
$$ plain form
18942 -137356 -301048 132388 -65389 187641 -158360 -217151 -384429 125842 -88448 -272413
18932 -272413 -193095 -100584 -209893 -199644 165098 -138141 162700 72681 -18089 178086
18921 253371 155979 -19564 -250059 -92180 368943 17097 237949 -160307 -49197 193473
18910 93374 -65273 -10964 -83365 -21148 -16528 -7364 -101123 137528 -244375 -144923 186880
18898 54585 83706 -212053 -68499 -110622 -193700 -19815 50437 219239 -260859 254381 100167
18886 -358424 -167147 42533 -80957 95355 -88805 -363731 231088 298955 -258385 -222429 -301486
18875 -301486 94142 108116 178630 -155474 -7136 47854 -49164 -146894 -117081 37882 -22613
18863 -48826 -234503 315001 -30835 220652 -239997 -105624 137672 127485 -20744 -32957
$$ packed form
18942a37356j63692A32388f5389A87641a58360n8791j67278A25842h8448j83965
18932b72413P9318R2511j09309J0249A65098a38141A62700G2681a8089A78086
18921B53371r7392a9564k30495i2180C68943A7097K20852a60307d9197A93473
18910I3374f5273a0964p2401b1148M620g364r3759A37528b44375R9452A86880
18898E4585K9121b12053f8499m2123q3078a9815E0437J68802b60859B54381A00167
18886c58424a67147D2533h0957I5355h8805k74926B31088O7867b58385L5956p9057
18875c01486I4142J3974P0514a55474g136D7854d9164r7730K9813C7882b2613
18863d8826j85677C15001c0835B20652b39997a05624A37672j0187b0744j2213
$$ plain form
18853 -32957 -168969 246538 -288140 -16533 -295231 127146 -214228 89699 -46286 -136569
18843 -136569 59076 -146444 -117475 130223 113048 147935 161866 -138239 249183 163530 494671
18832 494671 -110520 72183 -58986 -132619 72301 110425 -107304 31347 -204753 -9 -201763
18821 -201763 -180449 198381 -408404 -560237 88796 230621 -40845 -211962 52408 -159797
18810 20113 116471 -55706 73100 94673 -41580 88100 -40993 22034 174541 102080 368869
18799 368869 171666 15149 -29914 -89924 72571 102292 -73939 -104438 321124 119447 349111
18788 349111 273512 -167208 15798 -28437 -334824 -373367 -253622 149823 -88969 -153479 -89879
18777 -89879 -119440 33342 -18567 -116836 -241504 -87988 171846 -269725 -63348 16510 -1669
$$ packed form
18853c2957j36012B46538b88140a6533k78698A27146b14228H9699d6286r0283
18843a36569E9076a46444K8969A30223j7175L4887J3931a38239B49183q5653L31141
18832D94671a10520G2183e8986p3633G2301L8124a07304C1347b04753ik01754
18821b01763K1314A98381d08404j51833H8796J41825d0845j71117E2408a59797
18810B0113R6358e5706G3100K1573d1580H8100d0993B2034J52507p2461K66789
18799C68869A71666A5149b9914o0010G2571K9721g3939l0499C21124A19447K29664
18788C49111p5599a67208A5798b8437l06387l8543J19745A49823h8969o4510O3600
18777h9879k9561C3342a8567r8269j24668h7988A71846b69725f3348A6510a669
$$ plain form
18765 115411 -75067 -3262 -110551 -30289 -157230 -67913 50443 208526 117415 242456 -202512
18753 -215802 -193404 -148610 -198021 -65036 -333454 22675 24665 -60284 -144391 -326833 348297
18741 242649 -195055 132530 -331962 -144430 -140576 -74757 -78827 -47217 53827 289141 -101071
18729 -75853 48029 -46148 -140221 34952 -242954 179891 353277 -325801 -32894 -378092 -333519
18718 -333519 -220625 -78653 227031 198532 -33174 -110482 -111638 12083 191830 -235995 88427
18706 -166302 101403 -14137 -245437 -107861 78818 -317362 -69025 32092 -169129 -202899
18696 -202899 -39487 132179 -119060 53505 -371156 45218 -350825 -76774 -278240 -29013
18685 -282501 197976 4434 299155 -137589 -6456 -132489 -73666 -86366 450675 -118136 -52920
$$ packed form
18765A15411g5067c262j07289c0289j26941f7913E0443J58083r1111J25041b02512
18753b15802K2398M4794m9411f5036k68418B2675J990f0284q4107j82442C48297
18741B42649a95055A32530c31962a44430L854O5819m070L1610E3827K35314a01071
18729g5853D8029d6148r4073C4952b42954A79891J73386c25801c2894l45198M4573
18718c33519J12894g8653B27031k8499c3174p7308j156A2083J79747b35995H8427
18706a66302A01403a4137k31300a07861G8818c17362f9025C2092a69129l3770
18696b02899c9487A32179a19060E3505c71156D5218c50825g6774k01466b9013
18685b82501A97976D434K94721a37589f456j26033N8823j2700D50675a18136e2920
$$ plain form
18673 -62872 62190 17980 132648 60994 -162336 -44569 -253677 -260912 78330 -93946 -234992
18662 -234992 -38667 37490 -127549 -206511 -42658 -272820 -75959 -2282 312970 -77276 -197830
18651 -197830 -72469 -157155 -166353 105468 -151148 252520 -392608 -97356 -170634 -32841 38337
18639 110780 -69451 72453 -307128 -103091 178158 99620 52741 -89980 93831 -46175 -304215
18628 -304215 -204912 -325617 -341200 -57648 -97529 -106294 -236952 -48879 -296056 -212603 -1240
18616 -193305 55252 -241276 -54957 116881 -206708 -326233 -207088 82499 -147768 219371
18605 57811 102874 46319 -172341 -500 -123243 444462 66174 35714 103999 -222108 -393079
18594 -393079 -23763 -185661 113674 -26888 -153721 -97229 -194589 -222389 -121288 -209699 29768
$$ packed form
18673f2872F2190A7980J14668F0994a62336d4569k09108p235G8330i3946j41046
18662b34992c8667C7490a27549p8962d2658k30162g5959b282C12970g7276j20554
18651a97830g2469q4686r198A05468a51148B52520c92608i7356p3278c2841C8337
18639A10780f9451G2453c07128a03091A78158p8538m6879h9980I3831d6175k58040
18628c04215R9303j20705j5583e7648l9881q765j30658d8879k47177Q3453a240
18616a93305E5252b41276e4957A16881b06708j19525J19145H2499a47768B19371
18605E7811M5063D6319a72341e00j22743D44462F6174l0460O8285b22108j70971
18594c93079b3763j61898A13674b6888j26833N6492r7360k7800J01101q8411B9768
$$ plain form
18582 292481 158671 -80612 137523 263001 -434706 165017 -30955 -4052 264428 188172
18572 188172 -69407 323839 -2492 9521 116830 -167343 80643 -57273 -181658 254353 -59565
18560 -179519 -279407 -136234 190038 -171188 -131781 -207943 74140 -140790 115710 231418
18550 231418 103655 -170814 98123 -136510 143158 -167257 180135 -150891 24145 28511
18540 28511 -253341 -145032 80687 88735 -112523 1572 407578 -70896 -28287 -180891 -101391
18529 -101391 120557 -204423 -73669 -139419 -33772 -206709 -259781 -171330 19029 161209 -32154
18517 225123 104231 -121574 -124683 170064 148797 -40158 65888 -28440 -331676 84884 -395804
18505 -89678 85433 157080 -13514 51364 102375 160277 -221320 -75470 -130033 -24244 201831
$$ packed form
18582B92481j33810h0612A37523J25478d34706A65017c0955d052B64428p6256
18572A88172f9407C23839b492I521J07309a67343H0643e7273j24385B54353e9565
18560a79519r9888a36234A90038a71188L9407p6162G4140a40790A15710J15708
18550B31418A03655a70814I8123a36510A43158a67257A80135a50891B4145M366
18540B8511b53341J08309H0687Q048a12523A572M06006g0896b8287j52604P9500
18529a01391A20557b04423g3669o5750c3772j72937n3072Q8451A9029J42180c2154
18517B25123A04231a21574l109A70064k1267d0158F5888b8440l03236H4884c95804
18505h9678H5433P1647a3514E1364N1011N7902b21320g5470n4563b4244B01831
$$ plain form
18493 5859 79753 118605 -430549 37453 -340507 134678 28534 104796 -235458 47258 -26048
18481 -179901 -122021 -102582 49240 120018 -326737 -10271 78500 -186170 -448868 -15849 182134
18469 -509570 123991 -6157 109358 -186819 -298166 113610 -171229 -52416 128519 161692
18459 161692 -183798 88648 68564 -1217 -177936 209867 -81556 -160041 -100744 82775 -343813
18447 133402 -25842 -343035 -232003 -22862 -159228 132520 -483340 -173917 -85792 -88087
18437 -88087 166138 -88960 -156433 203978 129793 -58527 -171939 -167225 78012 -108995 -139583
18426 -139583 39129 -194786 -74456 46691 82464 -30030 262533 -269237 41914 -116767 117967
18414 -87291 -208074 12715 329677 -43017 -93988 -56796 -40463 -36547 -138588 -224120 -188431
$$ packed form
18493E859P3894L8852d30549C7453c40507A34678B8534P6262b35458D7258b6048
18481a79901N7880J9439D9240P0778c26737a0271G8500a86170k62698a5849A82134
18469e09570A23991f157A09358a86819j11347A13610a71229e2416A28519L3173
18459A61692a83798H8648k0084a217j76719B09867h1556p8485N9297H2775c43813
18447A33402b5842l17193J11032b2862j36366A32520d83340a73917h5792k295
18437h8087A66138h8960o7473B03978p4185e8527j13412M714G8012a08995l0588
18426a39583C9129a94786g4456D6691L5773c0030B62533b69237D1914a16767A17967
18414h7291j20783A2715L16962d3017n0971L7192J6333L916j02041q5532L5689
$$ plain form
18403 -188431 -249192 -133386 -117448 -47144 -342397 171506 -114205 -34382 228648 125570
18393 125570 -98463 -46906 282916 -57558 121139 11160 15871 34969 -311154 104685 -12333
18381 -308968 -101756 2681 43206 -13388 -99831 2800 65336 31190 151540 -4654 -264689
18370 -264689 47235 18520 158508 -6624 22445 -3823 159743 -337268 -236012 -244961 104222
18358 -83881 14249 -92852 69838 180836 183394 -197633 198837 -68034 -21443 352363 -237721
18346 -300789 -234546 -261594 -16884 -216975 -218459 -293277 -84756 196066 -276626 6740 -283355
18334 -238672 52280 29493 -219692 -335178 142368 48229 37548 -57167 -87931 -276542 -4309
18322 -70445 -160100 -3027 -290681 -479642 -67505 -352634 -104994 -143635 60411 -207184 -104498
$$ packed form
18403a88431o0761J15806J5938d7144k95253A71506a14205c4382B28648j03078
18393A25570i8463d6906B82916e7558A21139A1160M711J9098c11154A04685a2333
18381c08968a01756B681M0525a3388q6443B800O2536C1190J20350d654k60035
18370b64689D7235A8520J39988f624B2445c823A59743c37268J01256q949A04222
18358h3881A4249i2852F9838J10998K558a97633A98837f8034b1443C52363b37721
18346c00789O6243k7048a6884k00091j484p4818h4756A96066b76626F740b83355
18334b38672E2280k2787b19692j15486A42368D8229j0681e7167l0764j88611d309
18322g0445q9655c027k87654j88961f7505k85129a04994l8641F0411b07184J02686
$$ plain form
18311 -104498 -195572 269955 -36282 158334 257453 -154956 26261 -136111 -257388 169789
18300 168625 14819 -132246 -118900 -251678 -108196 -71145 27632 -201095 202701 253068
18290 253068 55865 -58271 -67890 -129794 -149885 -50198 3806 326978 -370680 -176269 159009
18278 -177812 -207833 -29480 -206848 -120837 -145734 -30935 -134067 208023 -226292 -21271 118179
18266 201717 59577 -277489 42654 -204481 -359721 -73580 37094 122665 -38030 -131766 -75203
18255 -75203 5052 79467 101703 -151313 39028 98859 120264 127255 231765 143346 132209 55386
18242 286325 126453 -8319 -174323 -256354 -145091 328019 587190 270363 134488 57912
18231 -61885 -412156 -98460 -95192 253503 -425083 -317952 3427 -116804 251043 -166926 15470
$$ packed form
18311a04498r1074B69955c6282A58334R9119a54956B6261a36111j21277A69789
18300A68625A4819a32246J3346j32778a08196L7051B7632b01095B02701N0367
18290B53068E5865e8271r619o1904k0091e0198C806L23172c70680a76269A59009
18278a77812l0021b9480j77368Q6011k4897c0935j03132B08023b26292b1271A18179
18266B01717E9577b77489D2654b04481j55240g3580C7094Q5571c8030r3736N6563
18255g5203E052P4415K2236a51313C9028N9831K1405O991J04510q8419j1137E5386
18242B86325A26453h319j66004q2031J11263C28019K59171B70363A34488E7912
18231f1885l50271i8460L268B53503d25083J07131C427a16804B51043a66926A5470
$$ plain form
18219 35918 -220841 -367846 -374952 -162294 114375 -39129 -62661 -77304 97548 131005 -86112
18207 1014 170041 -79939 -132315 96342 155277 -124297 -254669 -45501 92917 -102166 159386
18195 260853 60712 14990 -200483 -15412 -162623 68148 -286784 408837 -281676 -35355
18184 -94896 -127730 18565 121688 5557 -37788 -145282 -61670 -324283 -29226 155653 -347623
18172 266976 53905 207800 38952 180566 89075 139013 -162160 -76131 -78144 -38311 -104692
18161 -104692 -9121 -405900 -280690 -108433 82285 -33233 -83466 -92835 60921 67477 275560
18150 275560 -301575 35843 -260063 124982 -63654 -232152 -4392 -12568 -169053 -41151 70478
18138 -248514 42028 -203475 -352904 -60067 102635 -219956 -245057 -123742 8529 -31120 -297243
$$ packed form
18219C5918b20841j47005p106a62294A14375c9129k3532j4643I7548L3457h6112
18207A014J69027g9939n2376I6342N8935a24297j30372d5501I2917a02166A59386
18195B60853F0712A4990b00483a5412j47211F8148b86784D08837b81676c5355
18184i4896l2834A8565J03123E557c7788j07494f1670k62613b9226A55653c47623
18172B66976E3905J53895C8952J41614H9075M9938a62160g6131k013c8311o6381
18161a04692i121l96779J25210a08433H2285c3233n0233r369F0921O556K08083
18150B75560c01575C5843b60063A24982f3654j68498d392q176j56485d1151G0478
18138b48514D2028b03475j49429f0067A02635b19956k5101J21315H529c1120k66123
$$ plain form
18127 -297243 -41600 41687 120585 12170 14898 15699 277151 -106853 232894 -117625 -165607
18116 -165607 333698 197003 -444335 24092 148827 54279 -176914 108611 -30089 -153070
18106 -153070 -259517 -274372 8839 -90172 -392424 -394805 53835 -58302 -256394 85783 11838
18094 -110115 254591 25869 -20698 -146158 126532 63412 -205008 156 63414 -38554 -5997
18082 -137778 -43773 136571 -62857 6989 304687 -68662 242482 187825 -179335 -193867 -305747
18071 -305747 4706 -18327 -184255 94794 -68620 228748 -80958 88089 -104958 32174 -200522
18059 -273334 172249 38663 -3543 -397875 -338951 -177652 53492 300486 108677 -268093
18048 66190 -121532 -34081 -100192 48580 -229327 1733 -134116 81975 -42989 -136600 -155924
$$ packed form
18127b97243d1600D1687P8898A2170K728Q01K61452a06853B32894a17625m7982
18116a65607C33698j36695d44335B4092J24735E4279a76914A08611c0089j22981
18106a53070j06447j4855H839i0172l02252k381E3835e8302j98092H5783A1838
18094a10115B54591B5869b0698j25460A26532o3120b05008A56O3258c8554e997
18082a37778d3773A36571f2857F989K97698f8662B42482n4657a79335j4532j11880
18071c05747D706a8327j65928I4794f8620B28748h0958H8089a04958C2174b00522
18059b73334A72249C8663c543l94332N8924J61299E3492K46994A08677b68093
18048F6190a21532c4081o6111D8580b29327A733a34116H1975d2989r3611j9324
$$ plain form
18037 -155924 109794 -10393 27492 132494 -29271 -16941 -221329 83027 114756 -164041 -199776
18026 -199776 -134744 -117211 -143663 148395 -219350 -281044 23800 119910 -298957 -25603 -75961
18015 -75961 149896 49591 49050 399100 -93589 -175058 43377 14315 342336 97201 287047
18004 287047 -58498 -90779 147517 62832 7637 -13654 -159476 77330 -311430 -3193 -131176
17993 -131176 -195036 -50595 50441 -199735 147009 -57930 53412 -260991 111794 206240 -175673
17981 92504 -87528 -240946 -343167 -154433 94650 -197165 41796 -114820 290483 144406
17970 357632 227077 38032 -192480 -303882 -80308 106261 35187 58601 159801 -59400
17959 285571 -187873 -19703 -80434 -184914 -107746 -128856 -219331 -35612 210617 -103128 -45307
$$ packed form
18037a55924A09794a0393B7492J05002b9271J2330k04388H3027L1729a64041l5735
18026a99776O5032J7533k6452A48395b19350o1694B3800R6110b98957b5603n0358
18015g5961A49896D9591n41L50050i3589q1469D3377A4315L28021I7201J89846
18004B87047e8498l2281A47517F2832G637a3654j45822G7330c11430c193j27983
17993a31176o3860e0595E0441a99735A47009e7930E3412b60991A11794R4446a75673
17981I2504h7528j53418j02221a54433I4650a97165D1796a14820B90483A44406
17970C57632j30555C8032a92480j11402h0308A06261C5187K3414J01200e9400
17959B85571a87873a9703o0731j04480P7168k1110r0475c5612B10617a03128d5307
$$ plain form
17947 82248 -47309 112584 -64391 14254 -127133 78337 -160346 -154484 217284 309921 -221395
17935 43078 240850 -40141 -158424 -61461 194220 114201 132683 141603 -155792 109011 195346
17924 195346 204279 -37802 -245204 -46998 303079 33474 -221746 -99532 -113118 -41990 29591
17912 14811 -181237 -17820 -109580 187767 -283003 -71523 -50997 45941 -158921 -302441 -246358
17901 -246358 -76981 -14394 -211484 -247922 33734 -132222 130188 27017 -274104 -285690 -325625
17890 -325625 11798 -123045 -95721 244810 14999 -247519 213743 215871 -177201 32317 -57017
17878 476354 -165792 172148 102256 48090 -414961 -39166 -50237 157980 126292 -183498
17867 -323775 -117678 -101840 52541 -52000 158012 -236725 131137 -113911 96413 -131600
$$ packed form
17947H2248d7309A12584f4391A4254a27133G8337a60346N862B17284R2637b21395
17935D3078J97772d0141j18283f1461A94220q0019J8482Q920a55792A09011Q6335
17924A95346Q933c7802k07402d6998C03079C3474b21746i9532j3586d1990B9591
17912A4811a81237a7820r1760A87767b83003g1523K0526D5941a58921j43520N6083
17901b46358g6981a4394j97090l6438C3734a32222A30188B7017b74104j1586l9935
17890c25625A1798a23045K7324B44810A4999b47519B13743K128a77201C2317e7017
17878D76354a65792A72148o9892D8090d14961c9166j1071A57980l1688a83498
17867c23775a17678J5838E2541e2000A58012b36725A31137a13911I6413a31600
$$ plain form
17856 -286507 -500451 153631 222670 55291 -65339 72389 147790 -237612 -362849 -8999 29142
17844 51884 67130 -101162 121947 52396 365233 81802 74152 190904 67680 -317230 -389579
17833 -389579 -22884 47764 -139936 -32927 103308 -86351 9844 158691 10131 86026 -278919
17821 -129729 -171540 -190738 121388 -174175 -52356 45155 -79357 -97229 18421 -208800 122812
17809 -57715 157590 160732 -45040 240156 -145127 -1377 -92934 16220 -211678 74080 166130
17798 166130 114198 135899 -48395 -315553 -73730 -1982 -162414 15936 -176514 -125078 181685
17786 161035 201594 -199176 -46765 -112348 -141233 38348 -193095 -192362 -15943 -79426 -21836
17774 78879 78887 172232 48633 71115 135988 9544 161161 23398 -26098 175738 -225013 49504
$$ packed form
17856b86507k13944A53631O9039E5291f5339G2389P5401b37612j25237h999B9142
17844E1884J5246a01162A21947E2396L12837H1802p650J16752F7680c17230p2349
17833c89579b2884D7764a39936c2927A03308h6351I844J48847A0131P5895b78919
17821a29729m1811j9198A21388a74175e2356D5155g9357j7872A8421b08800A22812
17809e7715A57590L142d5040B40156a45127a377r1557A6220b11678G4080R2050
17798A66130n1932K1701d8395k67158g3730a982j60432A5936a76514N1436A81685
17786A61035M0559a99176d6765o5583k8885C8348a93095P33a5943o3483b1836
17774G8879QR3345D8633K2482O4873I544J51617B3398b6098A75738b25013D9504
$$ plain form
17761 24690 329265 -165028 78501 106384 -130019 72300 122132 139151 -180381 36561 -3259
17749 -267970 111145 -80883 -26746 112374 321506 -95250 235028 -38656 -122677 2249 49794
17738 49794 -160426 51621 -78357 -100046 171329 130656 -133118 43858 84914 -147451 56698
17726 -130327 -31041 219378 -81951 -369020 -311884 38081 -260743 -183423 11149 -196186 280808
17714 -139695 324984 242401 132179 -291591 -45283 -56587 131672 -287939 -88988 77855
17703 103275 12983 -320490 -57992 -6968 -102657 65374 37402 448247 -145380 296637 119219
17691 -282020 157329 -241822 -35132 -275143 3781 -134644 81008 34957 -280415 117972
17680 289611 -67448 27709 -78226 218292 -296696 4642 142338 87457 -27254 452581 -236896
$$ packed form
17761B4690L04575a65028G8501K7883a30019G2300M9832J7019a80381C6561c259
17749b67970A11145h0883b6746A12374K09132i5250B35028c8656q4021B249M7545
17738D9794a60426E1621g8357k1689A71329m0673a33118D3858M1056a47451E6698
17726a30327c1041B19378h1951k87069N7136C8081b60743P7320A1149a96186B80808
17714a39695C24984q2583j10222b91591d5283j1304A31672b87939h8988G7855
17703A03275A2983c20490e7992f968r5689F5374k7972M10845a45380B96637A19219
17691b82020A57329b41822c5132k40011C781a34644H1008C4957b80415A17972
17680B89611f7448B7709g8226B18292b96696D642J37696n4881b7254D52581b36896
$$ plain form
17668 -19870 -49981 339074 -26020 -58202 -31378 -235525 -16097 236580 -65311 -236784 201987
17656 158847 135075 -25090 171655 197075 -138173 -118765 29478 -146669 -26887 -223926 407374
17644 -28420 -88964 162233 48221 24637 165531 -258339 28051 174155 4130 -62859 94216
17632 -16848 167788 -94217 157744 -42822 313511 134443 88757 193082 -35251 79501 48990
17621 48990 -23290 -11544 -148804 375857 -3985 63380 88033 216134 -63645 -360839 -303249
17610 -303249 -389722 67548 -4882 19538 147193 83037 -44140 141351 -26021 -224548 252386
17598 -98409 -204963 -132631 -61466 81524 364868 277286 -268475 -59536 -228801 -73740 -38120
17587 -38120 35786 202512 -39662 87894 -264503 -102570 -235902 -6524 211747 -192334 315657
$$ packed form
17668a9870l0111C39074b6020l2182K6824k04147a6097B36580f5311j71473B01987
17656A58847k3772b5090A71655K5420a38173J9408B9478a46669b6887j97039D07374
17644b8420o0544A62233D8221k3584J40894b58339B8051J46104D130f2859I4216
17632a6848A67788i4217A57744d2822C13511A34443m5686J04325c5251G9501l0511
17621D8990b3290a1544j37260C75857c985F3380K4653J28101f3645k97194N7590
17610c03249q6473F7548d882A9538J27655o4156d4140A41351b6021j98527B52386
17598i8409j06554P2332f1466H1524K83344q7582b68475e9536j69265g3740L5620
17587c8120C5786J66726c9662H7894b64503a02570j33332f524B11747a92334C15657
$$ plain form
17575 -58826 1023 -182331 135589 133004 -162278 360679 294966 -88139 482 -286918 18076
17563 -165820 235905 -298824 120107 172123 220115 -56870 -157279 -98658 -108160 -796 -30574
17552 -30574 -4878 -42277 -298756 108711 -169589 -58188 -138445 -119187 -125470 239832 468781
17541 468781 90104 115666 -56910 -71038 249430 180703 -8465 157408 -15124 -223970 -104802
17529 -26094 -60735 119154 -80634 258869 -141182 -118066 41005 -230398 920 -123270 102478
17517 -219955 1873 190267 -117394 -134403 112800 -2299 192897 -176121 -223674 -78038 161018
17505 -108374 148621 145132 69498 230501 139168 -124940 150310 109247 -17023 130097 -111969
17493 87933 66556 194736 146008 23794 -87908 71318 -178597 -32254 34480 92622 -246292
$$ packed form
17575e8826A023a82331A35589k585a62278C60679o5713h8139D82b86918A8076
17563a65820B35905b98824A20107N2016M7992e6870j00409N8621r502g96k9778
17552c0574d878l7399k56479A08711a69589e8188q0257J9258o283B39832K28949
17541D68781I0104K5562e6910j4128B49430o8727h465A57408a5124k08846a04802
17529b6094l4641A19154h0634B58869a41182K3116D1005b30398I20a23270A02478
17517b19955A873J88394a17394j7009A12800b299A92897a76121m7553g8038A61018
17505a08374A48621l489F9498J61003r1333a24940A50310m1063a7023A30097a11969
17493H7933k1377J28180m8728B3794h7908G1318a78597c2254C4480N8142b46292
$$ plain form
17481 247957 80783 -21606 220779 192552 -96767 -23629 44356 393122 107163 210580 56763
17469 376158 -97300 246432 -67473 215049 168132 -140505 -27118 10243 -250315 411277
17458 46384 121392 173177 -39213 2662 239007 40791 70071 153014 -57921 104137 11866
17446 147236 23607 -96332 -67609 171599 18168 174552 346638 213470 413368 116617
17435 25866 22208 294850 -77765 500997 35407 168454 329480 188954 106440 316272 211155
17424 211155 409871 203438 148633 10374 -151455 106204 164587 410769 247635 146051
17414 146051 -147789 95788 500810 572796 259003 497387 177802 227745 201166 196282 -53557
17402 205147 410829 -50404 160054 159002 -280557 257185 -232306 151766 125116 254707
$$ packed form
17481B47957H0783b1606B20779k8227i6767b3629D4356L48766A07163J03417E6763
17469C76158i7300B46432f7473B15049m6917a40505b7118A0243b50315D11277
17458D6384P5008N1785c9213B662K36345D0791K9280Q2943e7921A04137A1866
17446A47236B3607i6332K8723A71599A8168J56384J72086j33168J99898A16617
17435B5866l658K72642g7765E00997C5407J33047J61026j40526q2514K09832j05117
17424B11155J98716B03438n4805A0374a51455A06204N8383K46182j63134j01584
17414A46051a47789I5788M05022P1986B59003K38384A77802M9943k6579m884e3557
17402B05147K05682e0404A60054j052b80557B57185b32306A51766k6650J29591
$$ plain form
17392 254707 282608 307317 146140 235090 343516 70079 -101190 -95553 23243 168141 194268
17381 194268 396416 275537 188806 359254 97795 214970 82980 111537 322406 -202107
17370 428177 94243 323837 -137095 -72173 -26135 239183 -4787 98895 240784 179283 66318
17358 -60251 -123156 120123 257658 386686 244092 -14343 19923 -31842 -66330 182659 21467
17346 186576 31191 226596 17169 -83702 -105983 -76112 57577 12761 241579 -186168 538043
17334 206051 71169 14907 124644 -158136 320699 200310 21787 202224 73594 197427
17324 197427 112890 159393 -159674 449157 -85738 26124 -122193 468537 219332 234300
17314 234300 368292 87440 241335 330957 137078 271423 275820 218032 236123 282595 102533
$$ packed form
17392B54707K7901K4709A46140Q8950J08426G0079a01190N637B3243J44898K6127
17381A94268K02148j20879q6731J70448I7795J17175H2980K8557K10869b02107
17370D28177I4243K29594a37095O4922b6135B39183d787I8895J41889o1501F6318
17358f0251o2905A20123J37535J29028j42594a4343A9923c1842l4488A82659B1467
17346A86576C1191J95405A7169h3702k2281K9871E7577A2761K28818a86168E38043
17334B06051G1169A4907J09737a58136C20699j20389B1787J80437G3594J23833
17324A97427q4537M6503a59674D49157h5738B6124a22193D68537B19332J4968
17314B34300J33992H7440J53895Q9622A37078J34345M397n7788J8091M6472A02533
$$ plain form
17302 -78389 246533 -41205 -403516 170361 110814 -52982 16615 126911 194951 -12233 234020
17290 -71212 45899 127446 143972 -70933 107965 -70875 93086 282416 244613 412648 62925
17278 397903 275514 69506 271356 -10696 351595 113331 151629 -91654 277370 106866
17267 133752 96482 91623 125426 432205 -93067 79531 90557 102321 103533 104931 -111407 97579
17254 320004 43654 72252 -86097 180280 71812 65779 37043 -27225 -279529 60970 -110041
17242 316178 248209 141941 94025 317953 -56861 323754 -71848 320984 -232204 86722
17231 248059 183322 -214915 520335 -130803 -31168 405316 -17789 -223719 87319 155431
17221 155431 -8857 464215 -25690 -135515 -42558 168062 169541 716997 -117726 173016 101191
$$ packed form
17302g8389B46533d1205l62311A70361n9547e2982A6615J10296O8040a2233B34020
17290g1212D5899Q1547J6526g0933A07965g0875I3086J89330l7803J68035F2925
17278C97903j22389F9506K01850a0696C51595A13331L8298i1654B77370A06866
17267A33752l7270m859L3803L06779i3067G9531J1026J1764J212J398a11407I7579
17254C20004D3654K8598h6097A80280G1812o033k8736b7225k52304F0970a10041
17242C16178o7969j06268m7916K23928e6861C23754g1848C20984b32204H6722
17231B48059o4737b14915E20335a30803c1168D05316a7789k05930H7319O8112
17221A55431h857D64215b5690j09825d2558A68062J479N47456a17726A73016p1825
$$ plain form
17210 101191 -167169 75175 83916 343694 214627 211844 151596 261054 34692 380649 166037
17198 -277555 94954 325392 234167 35230 235644 -38350 408033 26941 422074 339033 119201
17186 -6760 -48948 499882 -61635 31295 -79390 125434 80412 521729 95577 -308960 249006
17174 14872 52258 483093 395446 269395 363660 483667 -168512 6191 338799 449774 148770
17162 162995 -48447 229083 -269437 45824 222378 351042 110619 292931 -7973 358360
17151 147656 307473 68478 238369 391614 251039 443430 51112 283508 9568 174600
17141 174600 288733 278531 240404 415927 165506 194343 88819 38122 266868 98322 433500
17130 433500 385020 175661 63899 176639 309353 123608 338952 230784 376148 54941
$$ packed form
17210A01191a67169G5175Q741K59778j29067k783o0248J09458C4692L45957A66037
17198b77555I4954K30438r1225C5230K00414c8350D08033B6941L95133q3041A19201
17186f760m2188D99882f1635C1295g9390A25434m5022M41317I5577c08960B49006
17174A4872L7386M30835q7647j26051R4265J20007a68512F191L32608J10975A48770
17162A62995d8447B29083b69437D5824J76554J28664A10619J82312g973C58360
17151A47656J59817F8478J69891J53245j40575J92391E1112K32396I568J65032
17141A74600J14133j0202l8127J75523A65506K8837H8819C8122K28746I8322L35178
17130D33500m8480A75661F3899J12740J32714A23608K15344j08168J45364E4941
$$ plain form
17119 151306 440700 61848 260720 -603 374575 445759 152332 87462 369657 547364 87910
17107 489057 254274 210766 120394 313910 115561 370167 589279 52091 140071 261206
17097 261206 547984 322638 563463 577885 294967 546854 182509 328567 253858 411717
17087 411717 68733 220786 27715 254790 321799 296070 331470 60678 359496 472775 175949
17075 400266 95474 521560 299580 430241 467741 317423 -2022 309153 471635 631596
17065 631596 26149 952 616881 548654 146141 250280 575416 153250 412143 209130
17055 209130 176777 151200 452459 600988 499946 30873 206428 29709 457727 309088
17045 309088 1013084 664929 335272 529970 318636 276987 470679 546620 430384 370350
$$ packed form
17119A51306K89394F1848J98872f03C74575P1184A52332o4870K82195J77707H7910
17107D89057k34783m3508r0372J93516A15561K54606K19112E2091Q7980J21135
17097B61206K86778k25346K40825J4422k82918K51887A82509J46058p4709J57859
17087D11717F8733J52053B7715K27075O7009k5729L5400F0678K98818J13279A75949
17075D00266I5474M26086k21980J30661L7500j50318b022C09153J62482J59961
17065F31596B6149I52O15929o8227A46141J04139L25136A53250K58893k03013
17055B09130l2353k5577L01259J48529j01042C0873J75555B9709M28018j48639
17045C09088P03996l48155l29657J94698k11334m1649J93692P5941j16236o0034
$$ plain form
17035 370350 643291 578809 466368 191791 202673 374261 -39354 454954 442986 571121
17025 571121 369620 512167 17578 297900 331016 333702 714727 418224 451400 599528
17015 599528 351456 348763 352418 335390 396651 388760 489098 580031 503611 563564 504918 785899
17003 785899 436814 689614 533995 503293 497157 397305 366164 509400 272227 277729 247373
16992 247373 505625 392210 799168 465054 603638 640187 524835 266840 804014 451704
16982 451704 376722 824252 640092 251802 641648 794670 457471 526793 632399 630455
16972 630455 422830 720216 755711 797305 766391 679399 374439 570804 525804 921766
16962 921766 827456 1041003 971244 763223 493761 676619 750130 687814 792410 823683
$$ packed form
17035C70350K72941o4482j12441A91791J0882J71588c9354D54954j1968J28135
17025E71121k01501J42547A7578K80322L3116K686L81025k96503L3176J48128
17015E99528k48072k693L655j7028O1261p891J00338R0933p6420N9953n8646K80981
17003G85899l49085K52800j55619l0702o136r9852l1141J43236k37173N502l0356
16992B47373K58252j13415M06958l34114J38584L6549j15352k57995N37174l52310
16982D51704p4982M47530j84160B51802L89846J53022l37199O9322J05606j944
16972F30455k07625K97386L5495M1594l0914q6992l04960J96365m5000L95962
16962I21766r4310K13547o9759k08021k69462J82858P3511o2316J04596L1273
$$ plain form
16952 823683 822450 525571 1094870 819640 708194 637340 766498 848622 540657 745098
16942 745098 424351 877339 929813 724120 878696 936135 800436 888813 772308 1067052
16932 1067052 696910 887802 729696 680124 891024 981734 371304 878380 664533 845144
16922 845144 672138 826921 773946 1113106 729756 907867 961323 995796 1201161 686111
16912 686111 993620 921342 1004835 1037704 993081 1119032 1007635 1166959 1063332 1313781
16902 1313781 1208581 1047433 1451301 1095209 1066117 1104995 1245338 926740 1160074 1685939
16892 1685939 1121033 1498373 1328017 1227882 1339442 1442847 1316825 1358827 1236557 1252212
16882 1252212 1357293 1208503 1436647 1563593 1139213 1383201 1602167 1132169 1725565
$$ packed form
16952H23683j233k96879N69299k75230j11446p0854J29158Q2124l07965K04441
16942G45098l20747M52988N2474k05693J54576N7439j35699Q8377j16505K94744
16932A067052l70142J90892j58106m9572K10900R0710C71304N07076k13847J80611
16922H45144j73006J54783n2975L39160l83350J78111N3456L4473K05365n15050
16912F86111L07509p2278Q3493L2869m4623J25951j11397J59324j03627K50449
16902A313781j05200j61148M03868l56092k9092L8878J40343l18598K33334N25865
16892A685939n64906L77340j70356j00135J11560J03405j26022M2002j22270J5655
16882A252212J05081j48790K28144J26946m24380K43988K18966m69998N93396
$$ plain form
16873 1725565 1589302 1854603 1291637 1539313 1602584 1655657 1730854 1496101 1778601 1475589
16863 1475589 1451446 2011504 1929797 1945468 1861590 1853508 1833370 1682409 1883828 1856416 1884549
16852 1884549 2050775 2006796 1967782 2026879 2194967 1820847 2271010 1940445 2172940 2423460
16842 2423460 2356875 2524758 2297180 2486784 2250489 2523692 2472789 2452977 2772590 2633908
16832 2633908 2649940 2554703 2641334 2529622 2978691 2649013 2851028 2937915 3049053 3095183
16822 3095183 3243466 3263375 3078358 2939228 3210662 3411604 3303964 3598533 3517534 3549397
16812 3549397 3485155 3504748 3987736 3403026 4041831 3941967 4282931 4105183 4245318 4075295
16802 4075295 4190180 4466690 4317235 4563416 4450254 4787464 4554919 4656996 4963669
$$ packed form
16873A725565j36263K65301n62966K47676O3271N3073P5197k34753K82500l03012
16863A475589k4143N60058q1707J5671q3878q082k0138j50961K01419k7412K8133
16852A884549J66226m3979l9014N9097J68088l74120M50163l30565K32495K50520
16842B423460o6585J67883k27578J89604k36295K73203n0903j9812L19613j38682
16832B633908J6032r5237Q6631j11712M49069l29678K02015Q6887J11138M6130
16822C095183J48283J9909j85017j39130K71434K00942j07640K94569q0999L1863
16812C549397o4242J9593M82988n84710O38805r9864L40964j77748J40135j70023
16802D075295J14885K76510j49455K46181j13162L37210k32545J02077L06673
$$ plain form
16793 4963669 5031577 5365440 5336652 5474336 5297383 5987621 5921863 5979962 5861305 6022056
16783 6022056 6456862 6532399 6836551 6727086 7056599 7484337 7511353 7759476 7581270 8168310
16773 8168310 8247686 8474136 8754636 9380176 9206405 9461483 9936997 9709402 10441567 10720614
16763 10720614 11052028 11131343 11525682 12055219 12044645 12937276 13216803 13462422 14354062 14616679
16753 14616679 15121560 15352441 16339167 16805598 17517546 17975564 18812490 19714190 20345578
16744 20345578 21383664 22006680 22997832 24225175 25391399 26106725 27658596 29071198
16736 29071198 30545774 31885797 33496598 35344438 37503071 39539954 41867255 43945472
16728 43945472 46755588 49416857 52277681 55724834 59359848 63545696 67606279 72169878
$$ packed form
16793D963669O7908L33863k8788J37684j76953O90238o5758N8099j18657J60751
16783F022056M34806P5537L04152j09465L29513M27738K7016K48123j78206N87040
16773H168310P9376K26450K80500O25540j73771K55078M75514k27595P32165K79047
16763A0720614L31414P9315L94339N29537j0574Q92631K79527K45619Q91640K62617
16753A4616679N04881K30881R86726M66431P11948M58018Q36926R01700O31388
16744B0345578J038086O23016R91152J227343J166224P15326J551871J412602
16736B9071198J474576J340023J610801J847840K158633K036883K327301K078217
16728D3945472K810116K661269K860824L447153L635014M185848M060583M563599
$$ plain form
16720 72169878 77013648 82359906 88089739 94329768 100844919 107981903 115881607 123708757
16712 123708757 132215456 140871896 150170713 159193086 168459637 177493070 185860893 193700615
16704 193700615 200235861 205858535 209812723 211922286 212394301 211192952 207661430 203031656
16696 203031656 196732418 189210528 181088562 171980930 162838993 153365499 144232365 135396701
16688 135396701 126488541 118545828 110982858 103186377 96386339 89972364 83642007 78380699
16680 78380699 73114436 68365984 64259194 59888940 56007796 52862167 49688355 46557222
16672 46557222 43750841 41113513 38835652 36827017 34950841 32628754 31136744 29555064
16664 29555064 27975960 26567237 25221292 24228566 23449748 21829538 21028216 20197547 19118710
$$ packed form
16720G2169878M843770N346258N729833O240029O515151P136984P899704P827150
16712A23708757Q506699Q656440R298817R022373R266551R033433Q367823P839722
16704A93700615O535246N622674L954188K109563M72015j201349l531522m629774
16696B03031656o299238p521890q121966r107632r141937r473494r133134q835664
16688A35396701q908160p942713p562970p796481o800038o413975o330357n261308
16680G8380699n266263m748452m106790m370254l881144l145629l173812l131133
16672D6557222k806381k637328k277861k008635j876176k322087j492010j581680
16664B9555064j579104j408723j345945r92726p78818j620210q01322q30669j078837
$$ plain form
16655 19118710 18549529 17933986 17063476 16414167 15472996 15014188 14632815 14021109 13595511
16646 13595511 12774423 12697548 11862906 11789181 11073988 10784904 10716455 10103854 9943557 9572259
16636 9572259 9641468 9108736 9024565 8529518 8265624 7941970 7686677 7820201 7158005 7181031
16626 7181031 6530890 6761688 6525465 6459680 6215625 6049690 5731777 5696469 5568492 5476686
16616 5476686 5249906 5138421 4578145 4921798 5107251 4957200 4521702 4515881 4300431 4380763
16606 4380763 4307220 4152423 4070004 3972807 3879079 3921180 3572126 3211298 3477329 3166376
16596 3166376 3678984 3669593 3298293 3071281 2936471 3097180 2987693 2699910 2852658 2725213
16586 2725213 3045751 2859358 2508547 2323645 2474797 2700977 2561711 2282840 2482328
$$ packed form
16655A9118710n69181o15543q70510o49309r41171m58808l81373o11706m25598
16646A3595511q21088p6875q34642p3725p15193k89084o8449o12601j60297l71298
16636I572259O9209n32732q4171m95047k63894l23654k55293J33524o62196K3026
16626G181031o50141K30798k36223o5785k44055j65935l17913l5308j27977r1806
16616E476686k26780j11485n60276L43653J85453j50051m35498n821k15450Q0332
16606D380763p3543j54797q2419r7197r3728M2101l49054l60828K66031l10953
16596C166376N12608r391l71300k27012j34810J60709j09487k87783J52748j27445
16586B725213L20538j86393l50811j84902J51152K26180j39266k78871J99488
$$ plain form
16577 2482328 2481005 2359142 2260619 2444930 2161315 2218374 1946226 2136927 2325264 1977852
16567 1977852 1602113 2126578 1745006 2027484 1734101 1935725 1273092 1588218 1555224 1621153
16557 1621153 1330370 1551395 1568891 1637668 1483096 1333017 1685366 1593586 1093466 1293128
16547 1293128 1181600 1160417 1434085 1453796 1037871 1370802 1340112 1175634 1445842 1155284
16537 1155284 1431001 1229764 1107725 1496573 986624 1260029 758472 1218182 977837
16528 977837 1168132 987116 1085061 937444 1099846 1217798 1078389 776084 1251558 917896
16518 917896 616780 1096678 1072849 1051507 1075504 714486 761780 789995 873557 911810 1021427
16507 1021427 812887 505245 616599 628926 746326 723783 754703 490945 726516 725779
$$ packed form
16577B482328j323j21863r8523J84311k83615N7059k72148J90701J88337l47412
16567A977852l75739N24465l81572K82478k93383K01624o62633L15126l2994O5929
16557A621153k90783K21025J7496O8777j54572j50079L52349r1780n00120J99662
16547A293128j11528k1183K73668J9711m15925L32931l0690j64478K70208k90558
16537A155284K75717k01237j22039L88848n09949K73405n01557M59710k40345
16528I77837J90295j81016R7945j47617J62402J17952j39409l02305M75474l33662
16518I17896l01116M79898k3829k1342K3997l61018M7294K8215Q3562L8253J09617
16507A021427k08540l07642J11354J2327J17400k2543L0920k63758K35571p37
$$ plain form
16497 725779 643304 848771 668488 715249 676211 824834 762928 587921 984536 923688
16487 923688 573958 1192957 570445 638750 646718 382280 768818 770429 752993 549038 508233
16476 508233 517991 482987 1038957 515553 590765 239898 597361 138820 623151 773422
16466 773422 453931 1031962 697332 616165 452624 490261 408606 515480 371178 605604
16456 605604 811524 549554 470729 671432 542100 450401 510352 385521 669253 532213
16446 532213 537587 309392 609364 405194 566389 317854 -158383 -15585 222930 302720
16436 302720 100135 478370 198882 550410 656297 436955 539571 177148 220738 215909
16426 215909 293889 465851 663214 17748 514793 625834 61674 20946 196917 351980
$$ packed form
16497G25779q2475K05467j80283M6761l9038J48623o1906j75007L96615o0848
16487I23688l49730O18999E70445O8305P968k64438L86538J611j7436k03955m0805
16476E08233R758l5004N55970E15553P5212B39898L57463A38820M84331J50271
16466G73422l19491N78031l34630q1167j63541L7637q1655J06874j44302K34426
16456F05604K05920k61970p8825K00703j29332r1699N9951j24831K83732j37040
16446E32213N374k28195K99972k04170J61195k48535a58383a5585B22930P9790
16436C02720A00135L78235A98882L51528J05887k19342J02616A77148M3590m829
16426B15909P7980J71962J97363A7748M97045J11041F1674B0946J75971J55063
$$ plain form
16416 351980 593748 521851 209929 346521 115250 40890 397198 235345 365233 348588
16406 348588 329095 84251 336915 428611 135962 211989 186405 183358 201323 538612 316860
16395 316860 231430 602372 120593 410126 121611 -8368 236619 24453 437814 264553
16385 264553 404105 181543 57117 10337 343423 421878 169676 343116 31980 47087
16375 47087 511020 187345 108243 157781 69466 177423 115059 166036 -73034 57973 187868
16364 187868 174035 -196931 314438 131383 476831 340186 258501 160617 278502 42939
16353 262800 98414 64394 -42688 324229 354948 23704 339441 167219 181562 -204579 203444
16341 139265 258698 564841 186703 153927 472679 207338 264900 594762 147574 -15672
$$ packed form
16416C51980K41768p1897B09929J36592A15250D0890L56308j61853J29888j6645
16406C48588j9493H4251K52664R1696A35962P6027k5584l047J7965L37289k21752
16395C16860q5430L70942A20593K89533A21611h368B36619B4453M13361j73261
16385B64553J39552A81543E7117A0337L33086P8455A69676J73440C1980J5107
16375D7087M63933A87345p9102M9538F9466J07957o2364N0977g3034E7973J29895
16364A87868j3833a96931C14438A31383L45448j36645q1685r7884J17885D2939
16353B62800I8414l4020d2688C24229L0719B3704L15737A67219J4343b04579B03444
16341A39265J19433L06143A86703l2776L18752B07338N7562L29862A47574a5672
$$ plain form
16330 -100592 213739 128585 299203 -13161 -92546 316442 -63219 78680 183838 108561 41892
16318 536853 195676 165048 -106854 582364 12076 16898 192454 -159005 109829 151405
16308 151405 434914 73124 220682 -116873 -346088 259385 417402 -72831 143294 -17944
16297 -117317 196150 -181541 -15572 -69318 -181904 102590 -340 295594 283132 295625 -222206
16285 -154054 20316 -277097 -4116 33996 38056 328187 29007 84275 -39484 -6090 -42164 166863
16272 229483 375012 26607 122918 137729 -135950 135103 -174630 -146578 -160085 43908 217732
16261 217732 92784 66572 104987 203518 7776 178522 -203937 325302 162761 80661 -36833
16249 -52031 -162835 2044 -100248 -48849 -60056 -123893 13758 -85071 -34990 -19229 248895
$$ packed form
16330a00592B13739q5154J70618a3161p9385C16442f3219G8680J05158p5277D1892
16318E36853A95676l0628a06854E82364A2076M822J75556a59005A09829M1576
16308A51405K83509G3124J47558a16873k29215B59385J58017g2831A43294a7944
16297a17317A96150a81541a5572n3746j12586A02590c40B95594j2462J2493b22206
16285a54054B0316b77097d116C3996M060K90131B9007N5268c9484f090l6074A66863
16272B29483J45529B6607R6311J4811a35950A35103a74630K8052j3507D3908J73824
16261B17732I2784k6212L8415R8531G776J70746b03937C25302j62541H0661c6833
16249e2031j10804B044a00248d8849j1207o3837A3758h5071c4990J5761B48895
$$ plain form
16237 19240 171477 -61329 288146 250627 213535 -120986 113130 -219820 -63497 78301 160631
16226 160631 -188293 104685 32912 -39487 -23889 362294 -82244 -127556 -58852 -71478 -25290
16214 -194394 -38355 -127528 204606 -93892 -167034 3886 147962 75168 -100687 -314963 75478
16202 94102 30033 81251 162341 -172253 64483 -297129 -99053 -270933 132621 35242 26647
16191 26647 110079 149495 -98225 -102965 -5455 224222 71567 149462 155697 203053 -51230 -57357
16179 -57357 -324932 -168894 32223 4915 39807 -238152 156593 -251281 228757 9374 -34849
16167 -17310 -16690 -13994 208734 110841 28882 -111104 -152317 213058 -85853 -166457 -121956 -113725
16155 -113725 168650 157177 102186 -51346 -247491 -37201 287675 33714 -315896 -237078 -49913
$$ packed form
16237A9240J52237f1329B88146l7519l7092a20986A13130b19820f3497G8301Q2330
16226A60631a88293A04685C2912c9487J5598C62294h2244m5312e8852j2626b5290
16214a94394c8355q9173B04606i3892p3142C886J44076p2794a00687k14276G5478
16202I4102C0033N1218Q1090a72253F4483b97129i9053j71880A32621C5242q595
16191B6647Q3432L9416i8225m740e455B24222G1567P7895O235M7356e1230o127
16179e7357k67575J56038C2223D915L4892b38152A56593b51281B28757I374c4849
16167a7310O20K696B08734r7893B8882a11104m1213B13058h5853q0604M4501Q231
16155a13725A68650j1473n4991e1346j96145c7201B87675C3714c15896P8818d9913
$$ plain form
16143 -270399 -213716 -134764 89191 -86067 40461 -130469 -283474 83876 157172 25480 -103736
16131 -2166 -86904 -315843 65931 109010 111440 -8439 32225 -236970 -293116 258182 14825 362040
16119 362040 -122387 142167 164029 -247997 135209 -98631 -7980 48513 -14379 125237 -9887
16107 -237533 -305299 135851 -141378 273538 80154 -34691 75027 -65428 209837 -48748 310527
16095 -184236 -78652 20246 316488 -178513 63563 -61704 183644 -66645 239702 282896 -229166
16083 81399 17938 -211050 -415781 -179837 -145685 79898 -295126 78487 100912 191737 -68889
16071 140711 6348 64024 287836 -28022 -85516 211205 39017 -258735 -50123 266674 -222631
16059 -90467 -36831 -130674 -132113 157666 -43279 77446 -167475 150784 -281047 26415 -436392
$$ packed form
16143b70399N6683P8952H9191h6067D0461a30469j53005H3876P3296B5480a03736
16131b166q4738k28939F5931M3079K430h439C2225b36970n6146B58182A4825L47215
16119C62040a22387A42167K1862b47997A35209i8631g980D8513a4379A25237i887
16107b37533o7766A35851a41378B73538H0154c4691G5027f5428B09837d8748C10527
16095a84236g8652B0246K96242a78513F3563f1704A83644f6645B39702M3194b29166
16083H1399A7938b11050k04731a79837L4152G9898b95126G8487K2425R0825f8889
16071A40711F348N7676K23812b8022n7494B11205C9017b58735e0123B66674b22631
16059i0467c6831r3843j439A57666d3279G7446a67475A50784b81047B6415d36392
$$ plain form
16047 182730 -288571 106742 361617 -64733 -75741 -24309 239020 -85659 -88746 72386 149042
16036 149042 -141282 -225659 4155 -112931 114590 -54137 70688 73117 1336 -128227 3567
16024 -377848 139963 142116 -135269 48230 -133513 -7415 21576 -51289 72262 12539 -258290
16012 -282847 12513 11356 -26061 -13424 -390253 -276767 -91509 -386290 111402 -150412 145820
16000 -94093 -27473 29807 -163459 76688 -31321 18709 -88306 -134792 -25792 59365 -579646
15988 -257250 243522 127139 139292 -228460 238548 -61217 -111709 191186 -249011 31734
15977 155480 -314366 10961 -163608 -41230 90583 263464 24625 51530 245003 59592 -176718
15965 35504 170269 7347 -54088 125804 95139 40222 -58366 21546 142954 -124604 1568
$$ packed form
16047A82730b88571A06742K54875f4733j1008b4309B39020h5659l087G2386P6656
16036A49042a41282q4377D155a12931A14590e4137G0688K429A336a28227C567
16024c77848A39963K153a35269D8230a33513g415B1576e1289G2262A2539b58290
16012b82847A2513j157b6061J2637l76829J13486i1509k94781A11402a50412A45820
16000i4093b7473B9807a63459G6688c1321A8709h8306m6486b5792E9365e79646
15988b57250B43522j16383J2153b28460B38548f1217n0492A91186b49011C1734
15977A55480c14366A0961a63608d1230I0583J72881B4625K6905J93473E9592a76718
15965C5504J34765G347e4088A25804l0665D0222e8366B1546J21408a24604A568
$$ plain form
15953 -31681 -13389 143506 -39157 -128674 -112858 -233564 -81287 141498 248444 161194 -128070
15941 220626 -122363 -311111 -139759 -180100 -102887 -17023 421611 -107512 -77625 295564
15930 101037 356274 -153785 17217 -122565 -213077 -206892 -25916 -208857 8213 -71824 156198
15918 -262421 -73627 -187924 -86240 -60280 -104382 63168 126924 -40379 -12818 68483 -251626
15906 210880 -99072 104237 -51398 115717 -214519 -32897 146943 -208430 34321 -63217
15895 -96479 -12388 31522 -234761 65018 -120805 -26447 -80991 -174482 -232501 -112609 61854
15883 -134830 -47745 -164589 -242510 -160310 202991 -292755 -131594 -80182 26666 41434 -131853
15871 -84606 64028 70593 -60394 -8556 -312185 -259036 -193160 -244601 -76909 103016 78995 -233022
$$ packed form
15953c1681a3389A43506c9157q9517J5816j20706h1287A41498J06946q7250a28070
15941B20626a22363j88748a39759m0341P7213a7023D21611a07512K9887B95564
15930A01037K55237a53785A7217a22565r0512O185b5916j82941H213g1824A56198
15918b62421g3627j14297h6240K5960m4102F3168O3756d0379a2818F8483b51626
15906B10880i9072A04237e1398A15717b14519c2897A46943b08430C4321f3217
15895i6479a2388C1522b34761F5018a20805b6447n4544r3491n8019a12609F1854
15883a34830d7745j16844p7921Q2200B02991b92755a31594N1412B6666J4768a31853
15871h4606F4028O565f0394h556l03629N3149O5876n1441g6909A03016k4021b33022
$$ plain form
15858 -322724 191783 19436 -169651 -116125 -135696 94372 -130158 16423 83339 123335 -856
15846 141908 14774 139630 35850 -171324 -48839 106343 300785 28947 -231819 115175
15835 -175664 176912 198550 122917 263949 188001 274106 145743 83336 25007 85423 -274100
15823 -28435 135797 -122168 -231015 190005 128686 -73328 161408 -258798 -295910 -10181
15812 -265067 -61885 -221696 60229 23040 -231479 23679 -218032 848 -322524 94210 -350758
15800 -244291 5307 -159148 45135 -327764 99819 -100798 314720 -15423 -98735 -299134 90384
15788 -102926 50724 153409 -119329 104160 329507 52152 -79727 -122077 -53056 -3755 -103622
15777 -103622 -46893 -10055 -1012 -181619 -102210 332 60341 110341 -144755 127216 47476
$$ packed form
15858c22724A91783A9436a69651N3526j9571I4372a30158A6423O6916L9996h56
15846A41908A4774J24856C5850a71324d8839A06343J94442B8947b31819A15175
15835a75664A76912K1638p5633J41032p5948Q6105j28363o2407B5007O0416b74100
15823b8435A35797a22168j08847A90005o1319g3328A61408b58798l7112a0181
15812b65067f1885j59811F0229B3040b31479B3679b18032H48c22524I4210c50758
15800b44291E307a59148D5135c27764I9819a00798C14720a5423q3312k00399I0384
15788a02926E0724J02685a19329A04160K25347E2152g9727m2350e3056c755r9867
15777a03622d6893a0055a012j80607P9409C32O0009N0000a44755A27216D7476
$$ plain form
15765 -80587 20934 29026 -53384 -239703 -90221 23996 -103107 -72538 128101 -62504 -172712
15754 -172712 -63620 123556 -106299 60341 5368 -189874 -209170 10657 -138460 109209 246
15742 21438 351912 140911 2260 -311443 -24670 95808 183417 16998 -54358 98165 93766
15731 93766 -238175 -80694 -104842 63813 -134893 -109018 -62180 -193281 -251593 -99822 172975
15719 -94545 -223648 -119195 -323623 181023 -106269 -128358 -80293 17643 -56949 245440
15708 -37272 -200266 -309569 -184108 40551 -80130 -106960 -105156 -147743 225556 -70286 -76753
15697 -76753 -51657 -154730 119306 38850 -158230 8389 -157562 -281536 -197058 -18090 -18804
15686 -18804 81584 -61621 -66036 -50549 -320082 -127511 -224317 -60032 142742 -167326 -53782
$$ packed form
15765h0587B0934Q092e3384j86319i0221B3996a03107L0569A28101f2504j10208
15754a72712f3620A23556a06299F0341E368a89874j9296A0657a38460A09209B46
15742B1438L30474A40911B260c11443b4670I5808Q7609A6998e4358I8165m399
15731I3766b38175h0694k4148F3813a34893K5875M6838j31101n8312i9822A72975
15719i4545j29103J04453k04428A81023a06269k2089M8065A7643e6949B45440
15708c7272j62994j09303J25461D0551h0130k6830J804m2587B25556g0286o467
15697g6753K5096j03073A19306C8850a58230H389a57562j23974Q4478a8090p14
15686a8804H1584f1621m415J5487k69533a27511r6806f0032A42742a67326e3782
$$ plain form
15674 58746 227842 -30492 8361 -223232 178256 -149592 -67744 -159768 -43410 200008 -175118
15662 282796 -7471 185031 -34772 297563 83633 -144901 92589 -56987 29971 225073 126940
15651 126940 -149225 163187 -197717 -155176 -163535 98632 63975 -76987 -496711 -33249 109825
15639 -176189 -151336 34180 -77952 -90464 -227579 -107657 264813 25278 -6272 223416 -294213
15627 123434 63153 74820 147892 248949 101419 -156742 -156817 -89607 90864 -7937 161664
15615 -30074 -108254 -168133 -160099 71395 -281515 -59311 -301161 102037 -99218 -40090 76861
15603 78704 -42277 112277 -254667 45997 -87594 317264 217800 190050 134406 -8919 -82295
15592 -82295 -40113 -93449 -51481 -403885 -57824 170268 89684 -36308 -188312 -85767 -343474
$$ packed form
15674E8746J69096c0492H361b23232A78256a49592f7744r2024d3410B00008a75118
15662B82796g471A85031c4772B97563H3633a44901I2589e6987B9971J95102r8133
15651A26940a49225A63187a97717M2541q359I8632l4657g6987m19724c3249A09825
15639a76189K4853C4180g7952j2512j37115a07657B64813B5278f272B23416b94213
15627A23434o0281J1667P3072J01057A01419a56742p5O7210I0864g937A61664
15615c0074p8180n9879Q034G1395b81515e9311k41850A02037i9218d0090G6861
15603G8704d2277A12277b54667D5997h7594C17264r9464k7750n5644h919p3376
15592h2295d0113n3336M1968l52404e7824A70268q0584c6308j52004h5767k57707
$$ plain form
15581 -343474 -108804 501936 -16086 243434 65767 2720 -79520 -196282 -75338 -119617 116813
15569 -274352 -74048 104259 90266 149566 -138191 186842 147363 244245 -90550 33176 -431313
15557 125378 124090 -118075 -65669 -76920 -99894 214599 62403 3248 -44541 47724 -28653
15545 -106177 -37397 -158736 25500 4115 -225284 266911 -34912 -100943 44455 95800 -155853
15533 -42607 204852 -72620 -1092 183117 -67215 -278710 -221920 -77144 -337115 -127221 -95012
15522 -95012 -139590 -144139 -13899 43912 -115274 -241898 257570 280918 203991 -87178 -76588
15511 -76588 65848 127163 53951 220813 -275218 -92764 -323048 174523 -29116 -345250 68854
15499 61945 123445 -169655 398629 15863 225543 -371225 -61105 -282763 8166 33830 -54442
$$ packed form
15581c43474a08804E01936a6086B43434F5767B720g9520j16762g5338m4279A16813
15569b74352g4048A04259j3993N9300a38191A86842l9479R6882i0550C3176d31313
15557A25378j288a18075N2406j1251k2974B14599F2403C248d4541D7724b8653
15545a06177c7397j21339B5500D115b25284B66911c4912o6031D4455N1345a55853
15533d2607B04852g2620a092A83117f7215k11495N6790g7144k59971a27221L2209
15522i5012m4578m549a3899D3912a15274j26624B57570K3348p6927h7178J0590
15511g6588F5848O1315E3951J66862b75218i2764k30284A74523b9116l16134F8854
15499F1945O1500a69655C98629A5863K09680c71225f1105k21658H166K5664e4442
$$ plain form
15487 106622 127286 81719 18897 -141091 104117 -19997 46942 197035 129490 162695 -221631
15475 -238578 -274623 -377193 302784 -3228 -243229 -40646 27061 -3777 -31099 112650 205683
15464 205683 164374 -42563 -126741 -68107 103758 10118 83106 5716 195991 -156102 53996
15452 -119048 -281062 265997 62997 -91049 143103 -27440 -290 -134728 305864 178840 -133689
15440 -11328 -52828 146789 341989 69229 -13272 -72344 10858 -299095 -267357 262962 142732
15429 142732 -75528 202265 -113848 -240269 127540 -265866 106418 39680 241406 -35010
15418 -20365 -344577 -45655 -199364 178035 -43826 83117 66940 145778 134387 -53983 119685
15406 14490 -132014 -49604 -410856 -251308 93737 249018 -344825 -139581 495643 -50573
$$ packed form
15487A06622K0664m5567A8897a41091A04117a9997D6942J50093o7545L3205b21631
15475b38578l6045j02570C02784c228k40001d0646B7061c777k7322A12650R3033
15464B05683m1309d2563q4178N8634A03758A0118P2988E716J90275a56102E3996
15452a19048j62014B65997F2997i1049A43103b7440b90j34438C05864j27024a33689
15440a1328m1500A46789J95200F9229a3272n9072A0858b99095L1738B62962j20230
15429A42732g5528B02265a13848j26421A27540b65866A06418C9680K01726c5010
15418b0365l24212d5655j53709A78035d3826H3117j6177P8838j1391e3983A19685
15406A4490a32014d9604l61252J59548I3737J55281c44825a39581D95643e0573
$$ plain form
15395 43545 234107 -66183 51949 29521 80043 -96342 99818 1091 -168385 124831 -160297
15383 -259478 -95328 100977 -141331 -15596 -51937 23643 -101160 -63955 133391 -255220
15372 162237 -245115 -87519 109106 94257 115617 5286 163857 -123572 187920 92478 182252
15361 182252 36478 28638 -338921 -33559 -10699 -412068 -19537 141912 174597 185060 -110605
15349 -126617 -102181 19468 -30159 -174079 42075 -2825 111413 52680 34929 35318 -24250 -109213
15337 -109213 -46717 -83314 148102 -418692 -223440 23115 -125558 -259862 238727 88120
15326 -29038 -176531 -204975 -391922 -45708 -141423 108215 -28508 26561 -15647 -19128 -296498
15315 -296498 90762 85132 -206484 294883 -61526 -116205 -67102 13758 -463 48690 262190
$$ packed form
15395D3545J90562f6183E1949k2428N0522i6342I9818A091a68385A24831a60297
15383b59478i5328A00977a41331a5596l6341B3643a01160L7205A33391b55220
15372A62237b45115h7519A09106j4849K1360E286J58571a23572A87920I2478Q9774
15361A82252C6478p840c38921c3559a0699m01369a9537A41912L2685J0463a10605
15349a26617K4436A9468c0159j43920D2075b825A11413E2680j7751L89b4250q4963
15337a09213d6717l6597A48102d18692J95252B3115a25558j34304B38727H8120
15326b9038j47493k8444j86947d5708r5715A08215b8508B6561a5647l481k77370
15315b96498I0762n630b06484B94883f1526n4679M9103A3758d63D8690K13500
$$ plain form
15304 262190 -293940 69018 13264 166228 44583 26505 -17067 -364467 -68164 -49303 -82102
15293 -82102 127808 -146760 198343 250154 37382 -74721 35212 34588 135875 -175564 -74654
15281 203834 91450 32715 -8442 -60094 -19552 -197132 178431 -141124 334276 140651 -285008
15269 496150 65473 235604 330893 111913 -298721 14568 -91929 269513 275485 69882 907
15257 73105 -10611 104583 255554 -43844 219769 217313 73937 -12307 181865 -83047 -133385
15246 -133385 160212 210070 -17865 304078 272851 34345 -97834 -150575 -154453 331254 612333
15235 612333 384818 898005 1198420 963616 1092816 903231 539509 355262 107144 158948
15225 158948 264578 -43126 37402 -55169 -219183 -221825 124119 139742 181352 -224415 221033
$$ packed form
15304B62190b93940F9018A3264J52964D4583j8078a7067l47400f8164J8861l2799
15293h2102A27808a46760A98343N1811C7382g4721C5212o24J01287a75564g4654
15281B03834I1450C2715h442n1652a9552j77580A78431a41124C34276A40651b85008
15269D96150F5473J70131R5289A11913b98721A4568i1929B69513N972F9882I07
15257G3105a0611A04583J50971d3844B19769k456G3937a2307A81865h3047n0338
15246a33385A60212M9858a7865C04078l1227C4345i7834n2741l878C31254K81079
15235F12333k27515N13187L00415k34804J29200j89585l63722j84247A07144N1804
15225A58948J05630d3126C7402e5169j64014k642A24119J5623M1610b24415B21033
$$ plain form
15213 259602 91142 22195 75133 -164761 -149425 386231 137563 300638 49089 176465
15203 176465 -27176 -94538 -5328 302959 -105905 -15224 63092 99459 -176793 85603 430780
15192 430780 -244276 -47777 205193 4257 -30478 179163 437463 -223567 -146650 -64243 142307
15180 -363479 182567 113222 110402 -48056 -19502 105382 26777 -92799 352374 24806 305043
15169 305043 8985 110247 -94909 -32245 -2597 -55714 -219609 74344 472553 278878 157855
15158 157855 -222707 -115446 24501 -247410 302057 365628 253735 109950 274450 230716
15148 230716 187214 -269881 -16105 484453 -101851 31565 -111374 474265 230861 -188532
15137 -369651 175121 -23684 207242 -41368 210973 27242 -55076 141207 45520 90500 -78805
$$ packed form
15213B59602I1142B2195N2938a64761J5336C86231A37563J63075D9089J27376
15203A76465b7176o7362e328C02959a05905a5224F3092L6367a76793H5603L45177
15192D30780b44276d7777B05193D257c0478A79163K58300b23567P6917f4243A42307
15180c63479A82567o9345k820d8056a9502A05382B6777i2799C52374B4806K80237
15169C05043H985J01262i4909c2245b597n3117j63895G4344L98209j93675j21023
15158A57855b22707J07261B4501b47410C02057O3571j11893A09950J64500m3734
15148B30716m3502b69881a6105D84453a01851C1565a11374D74265B30861a88532
15137c69651A75121b3684B07242d1368B10973B7242e5076A41207D5520M4980g8805
$$ plain form
15125 98442 99469 210396 300124 302179 163822 -65696 -5001 45387 -33095 -97362 -237102 17011
15112 42513 24587 117413 94705 -191626 144829 69438 250502 285679 166224 89461 10931
15100 -14256 -16232 4840 220703 184151 -181358 328384 -98384 301499 228681 137111 234748
15089 234748 443837 193534 103447 -65383 -133785 85661 512627 50511 174287 -89025 304429
15077 36096 -118928 -42937 286767 341854 18091 -153126 246696 -329979 85642 291901
15067 291901 123627 138978 -85117 -181464 -46928 154875 -11983 162187 -189050 -125889 253728
15055 419330 -118836 258655 102235 -297597 2819 -110508 -167976 -123411 200756 323463
15045 323463 240434 194942 141027 205967 259820 26919 157054 -287606 -165269 72484 237477
$$ packed form
15125I8442J027J10927Q9728K055j38357f5696e001D5387c3095o4267j39740A7011
15112D2513j7926R2826k2708a91626A44829F9438J81064L5177j19455p6763A0931
15100a4256j976D840K15863l6552a81358C28384i8384C01499p2818r1570R7637
15089B34748K09089A93534r0087f5383o8402H5661M26966E0511J23776h9025C04429
15077C6096a18928d2937B86767N5087A8091a53126B46696c29979H5642K06259
15067B91901A23627J5351h5117r6347d6928A54875a1983A62187a89050O3161B53728
15055D19330a18836B58655A02235b97597B819a10508n7468M4565B00756J22707
15045C23463q3029m5492n3915O4940N3853B6919J30135b87606J22337G2484J64993
$$ plain form
15034 237477 33734 35233 49448 153999 -105375 -97369 -23995 -249682 -203139 335962 -28179
15022 17917 230742 -9028 340264 -38800 -168242 211588 273218 -25176 -3363 148542 279329
15011 279329 279619 376693 224021 -5876 370508 -21960 275399 674038 216949 210628 -36777
14999 -215393 254670 185825 -91531 20032 -121597 304237 425822 70668 93816 259165
14989 259165 87248 333956 -109164 26702 147472 305675 376453 266477 130483 -130067
14978 92714 40096 9548 229570 227191 54105 87030 214198 157745 245758 -48519 298964
14966 -83220 150665 40927 -8201 554073 337451 -46053 419976 -15143 187911 223277 307605
14955 307605 -41588 145457 281362 53894 227573 266154 510090 311599 276588 376315
$$ packed form
15034B37477C3734J499J4215J04551a05375Q006b3995k25687M6543C35962b8179
15022A7917K12825i028C40264c8800j29442B11588O1630b5176c363A48542J30787
15011B79329K90R7074j52672e876C70508b1960B75399L98639B16949o321c6777
14999b15393B54670o8845i1531B0032a21597C04237J21585G0668K3148J65349
14989B59165H7248K46708a09164B6702J20770J58203P0778j09976A30483a30067
14978I2714D0096I548K20022k379E4105L2925J27168n6453Q8013d8519B98964
14966h3220A50665D0927h201E54073k16622d6053D19976a5143A87911L5366Q4328
14955C07605d1588A45457J35905E3894J73679L8581K43936j98491l5011R9727
$$ plain form
14945 376315 107616 227843 243353 30854 -2780 195216 34346 -166461 382916 261036
14935 261036 384369 335593 82937 472490 403124 147940 395467 230887 279433 322745
14925 322745 97926 93634 237662 -293274 491871 261830 411240 339521 224710 192512
14915 192512 413454 242925 285396 300389 305510 480703 293919 324669 278477 354948 -72236
14903 -3941 291928 583903 330140 184931 182218 242144 266984 352682 457147 -11037 536727
14891 157911 513972 173382 173813 507092 202321 -24037 199327 203566 213999 304391 359713
14880 359713 206949 354685 765416 372175 269019 259576 362063 242550 388810 392991
14870 392991 104767 135214 522783 320369 221677 275755 381664 396774 409912 345119 517193
$$ packed form
14945C76315A07616J20227J5510C0854b780A95216C4346a66461C82916j21880
14935B61036J23333m8776H2937L89553o9366A47940K47527j64580M8546M3312
14925C22745I7926m292J44028b93274D91871k30041J49410p1719j14811l2198
14915A92512K20942j70529M2471J4993N121J75193j86784L0750m6192P6471g2236
14903c941B91928K91975k53763j45209k713N9926K4840Q5698J04465a1037E36727
14891A57911L56061A73382M31L33279B02321b4037A99327M239J0433R0392N5322
14880C59713j52764J47736M10731C72175j03156r443J02487j19513J46260M181
14870C92991A04767L0447L87569k02414r8692N4078J05909J5110J3138o4793J72074
$$ plain form
14859 517193 433175 226000 25864 332639 -26840 469062 100072 434110 35041 520531
14849 520531 332416 86217 117125 -25583 131667 372481 209575 41353 361682 322236
14839 322236 334077 253161 234740 397904 907 486103 358657 339041 242743 485690 213907
14827 455027 526945 214344 394959 460653 135593 507216 406073 255550 581844 457322
14817 457322 87225 387604 594783 554205 259446 421094 493050 499221 389278 568266
14807 568266 281159 462881 532492 331594 379939 503708 518772 397367 395422 466641 216710
14795 423839 433464 490397 299713 379126 613837 518154 437484 666869 324318 49531 261064
14784 261064 417503 454763 232303 639171 421616 340812 416230 451130 360728 599812
$$ packed form
14859E17193q4018k07175B5864L06775b6840D69062A00072L34038C5041M85490
14849E20531j88115H6217L0908b5583A31667K40814j62906D1353L20329l9446
14839C22236J1841q0916j8421J63164I07M85196j27446j9616r6298K42947B13907
14827D55027P1918B14344J80615O5694A35593L71623j01143j50523L26294j24522
14817D57322H7225L00379K07179m0578B59446J61648P1956O171j09943J78988
14807E68266B81159J81722O9611k00898M8345J23769J5064j21405j945P1219B16710
14795D23839R625N6933j90684P9413K34711r5683q0670K29385C24318D9531K11533
14784B61064J56439L7260k22460M06868k17555q0804P5418L4900r0402K39084
$$ plain form
14774 599812 369924 149217 490371 740393 112849 618648 228687 431550 221730 678786
14764 678786 770313 884897 283177 675932 298464 276073 413132 647450 525777 210960
14753 436903 711825 477931 477005 670153 305648 653909 496758 380185 541220 436538
14743 436538 344293 724433 620838 419886 433359 418897 710180 688776 403410 834528
14733 834528 493705 855202 414128 961159 472162 476426 548196 382483 904153 711111
14723 711111 473537 -651 720258 581702 614713 474972 549730 702436 566802 1069745
14713 1069745 628110 778943 984235 611875 673994 727009 849506 374883 656367 595719
14703 595719 680581 563322 644728 943628 779998 812793 535925 812383 832812 721423
$$ packed form
14774E99812k29888A49217L41154K50022A12849N05799B28687K02863k09820M57056
14764F78786R1527J14584B83177L92755B98464k2391J37059K34318j21673B10960
14753D36903K74922k33894r26J93148C05648L48261j57151j16573J61035j04682
14743D36538r2245L80140j03595k00952J3473j4462K91283k1404k85366M31118
14733H34528l40823L61497D14128N47031D72162M264P1770j65713N21670j93042
14723G11111k37574f51G20258j38556L3011j39741P4758J52706j35634N02943
14713A069745m41635J50833K05292l72360O2119N3015J22497C74883K81484o0648
14703E95719Q4862j17259Q1406K98900j63630L2795k76868K76458K0429j11389
$$ plain form
14693 721423 697021 671801 765857 902011 916703 750124 868645 584264 576573 469961 693476
14682 693476 839733 586846 385342 591297 774723 623120 623652 774068 859433 872927
14672 872927 918020 932821 1137244 1253439 928974 464928 540937 700867 575022 669296
14662 669296 982803 687240 766250 746681 801496 831347 953478 928823 801963 805377 1018246
14651 1018246 1026330 743566 1295521 964911 1036808 1149611 866907 931378 774728 705133
14641 705133 1129443 1124496 1187129 773117 910985 1176610 824247 1011135 914678 923526 747408
14630 747408 1141919 878302 976567 1258399 1252803 824342 1040310 1097348 1151177 699132
14620 699132 848725 1330506 1484493 1201879 826609 1058398 1044264 1298178 1299695 1053383
$$ packed form
14693G21423k4402k5220R4056J36154J4692j66579J18521k84381p691j06612K23515
14682F93476J46257k52887k01504K05955J83426j51603N32J50416Q5365J3494
14672H72927M5093J4801K04423J16195l24465m64046P6009J59930j25845R4274
14662F69296L13507k95563P9010j9569N4815K9851J22131k4655j26860L414K12869
14651A018246Q084k82764N51955l30610P1897J12803k82704O4471j56650o9595
14641G05133M24310m947O2633m14012J37868K65625l52363J86888r6457Q848j76118
14630G47408L94511k63617R8265K81832n596m28461K15968N7038N3829m52045
14620F99132J49593M81781J53987k82614l75270K31789j4134K53914J517k46312
$$ plain form
14610 1053383 1529339 1061418 1239563 879736 1088408 930629 1355273 1155768 1262104
14601 1262104 1014551 1251398 1270068 1507945 1411460 1178457 1109117 1206033 1208527 1746886
14591 1746886 1347531 1343329 1404841 1361030 1579142 1266945 1657043 1293725 1497383 1545661
14581 1545661 1358571 1345770 1349912 1146345 1118499 1656748 1412364 1437270 1600532 1756636
14571 1756636 1561385 1519612 1573453 1575219 1926785 1851161 1782713 1772580 1797847 1801064 1907526
14560 1907526 2064509 1597822 1848320 2019255 2148863 2213866 1881208 2005869 2027667 1968951
14550 1968951 2179185 2045093 2118818 2283209 2485191 2604921 2540482 2665729 2892733 2950440
14540 2950440 3328828 3610934 4393001 4609126 5594787 6671223 9003335 13239245 19227673
$$ packed form
14610A053383M75956m67921J78145l59827K08672j57779M24644j99505J06336
14601A262104k47553K36847J8670K37877r6485k33003o9340R6916K494N38359
14591A746886l99355m202O1512m3811K18112l12197L90098l63318K03658M8278
14581A545661j87090j2801M142k03567k7846N38249k44384K4906J63262J56104
14571A756636j95251m1773N3841J766L51566p5624o8448j0133K5267L217J06462
14560A907526J56983m66687K50498J70935J29608O5003l32658J24661K1798n8716
14550A968951K10234j34092P3725J64391K01982J19730o4439J25247K27004N7707
14540B950440L78388K82106P82067K16125R85661J076436K332112M235910N988428
$$ plain form
14531 19227673 29061212 31757213 19237196 10805599 6073496 4031966 3468569 3121027
14523 3121027 2423987 2417455 2346069 2071316 2238026 2065151 1868080 2222243 2037155 2301264
14513 2301264 2062553 2032886 1857330 2267811 1713431 2513778 2048848 1976050 2113665 2433635
14503 2433635 1975487 2351831 2693073 2492517 2247212 2346965 2132685 2390812 2653241 2445962
14493 2445962 2402388 2395304 2675717 2678999 2487218 2724357 2736527 2372115 2714422 2433766
14483 2433766 3015456 3023919 2716404 2846355 2487895 3004878 3239694 2876773 2856112 3039391
14473 3039391 2775949 3268124 3137260 3640281 3492443 3013430 3024188 3660929 3036507 3265592
14463 3265592 3403634 3105373 3362688 3899134 3631811 3631049 3687021 3815269 3831969 3949774
$$ packed form
14531A9227673R833539K696001j2520017q431597m732103k041530n63397l47542
14523C121027o97040o532p1386k74753J66710j72875j97071L54163j85088K64109
14513B301264k38711k9667j75556M10481n54380Q00347m64930p2798J37615L19970
14503B433635m58148L76344L41242k00556k45305R9753k14280K58127K62429k07279
14493B445962m3574p084K80413L282j91781K37139J2170l64412L42307k80656
14483B433766N81690Q463l07515J29951l58460N16983K34816l62921k0661J83279
14473C039391k63442M92175j30864N03021j47838m79013J0758O36741o24422K29085
14463C265592J38042k98261K57315N36446k67323p62N5972J28248J6700J17805
$$ plain form
14453 3949774 4045012 3666193 3872259 3781574 3876241 4022969 4317861 4095823 4576754 4773012
14443 4773012 4021455 4303996 4432086 4690958 4676278 4845918 4729736 4784430 4940987 4957604
14433 4957604 4871988 4760507 5116532 4694165 4972785 5123409 4865983 5330666 5244998 5595613
14423 5595613 5359010 5578251 6001499 5983661 6017570 5793306 5872421 6033832 6190954 6130652
14413 6130652 6532126 6426826 6265597 6671918 6580019 7066703 7008394 7102361 7379671 7093162
14403 7093162 7175752 7540338 7626531 7492997 7645343 7577577 7830740 8114944 8105771 7906937
14393 7906937 7833428 8246351 8431712 8624950 9085961 8921309 9100614 9336596 9280437 9495174
14383 9495174 10052499 10136360 10324067 10229970 10411886 10126812 10601054 10646006 11295341 11207731
$$ packed form
14453C949774R5238l78819K06066r0685R4667J46728K94892k22038M80931J96258
14443D773012p51557K82541J28090K58872j4680J69640j16182N4694J56557J6617
14433D957604q5616j11481L56025m22367K78620J50624k57426M64683q5668L50615
14423E595613k36603K19241M23248j7838L3909k24264P9115J61411J57122o0302
14413F130652M01474j05300j61229M06321r1899M86684n8309R3967K77310k86509
14403G093162Q2590L64586Q6193j33534J52346o7766K53163K84204r173j98834
14393G906937p3509M12923J85361J93238M61011j64652J79305K35982n6159K14737
14383I495174N57325Q3861J87707r4097J81916k85074M74242M4952O49335q7610
$$ plain form
14373 11207731 11441360 11683596 11791750 11776854 12188782 12689355 12732060 13030208 13164036 13314390
14363 13314390 13722772 13696494 13797842 14462784 14726835 14693777 14803702 15148613 16166118
14354 16166118 16252158 16102317 17033406 17205873 17705958 17970501 18285964 18778467 19027782
14345 19027782 19090029 19823636 20490473 20807410 21179843 22113480 22176637 22858528 23119051 23831735
14335 23831735 24625991 25101763 25593025 26302194 27282938 27859594 28768661 29447358 30028203
14326 30028203 30972643 31996037 32905179 33927465 35011911 35853594 36759104 37827396 38890333
14317 38890333 40168098 41337039 42478920 43928923 45394505 46798730 48397108 50104449
14309 50104449 51908163 53782003 55504246 57546434 59401666 61791905 64352255 66661360
$$ packed form
14373A1207731K33629K42236J08154j4896M11928N00573M2705K98148J33828J50354
14363A3314390M08382k6278J01348O64942K64051l3058J09925L44911J017505
14354A6166118Q6040j49841R31089J72467N00085K64543L15463M92503K49315
14345A9027782O2247P33607O66837L16937L72433R33637O3157O81891K60523P12684
14335B3831735P94256M75772M91262P09169R80744N76656R09067O78697N80845
14326C0028203R44440J023394R09142J022286J084446Q41683R05510J068292J062937
14317C8890333J277765J168941J141881J450003J465582J404225J598378J707341
14309E0104449J803714J873840J722243K042188J855232K390239K560350K309105
$$ plain form
14301 66661360 69159533 71940704 74936545 77835922 81303750 84591676 88005375 92044358
14293 92044358 96077038 100442265 105129060 109903326 115285215 120842828 127037530 133109670
14285 133109670 140000069 146998461 154811614 162829196 171446882 180671610 190292391 200536450
14277 200536450 211681022 223054082 235428270 248144704 261828870 275633979 290166252
14270 290166252 304861457 319209056 334377273 348986878 363600916 377731036 391397750
14263 391397750 404186721 415703690 426715163 436237992 444422946 448368853 450904318
14256 450904318 453842253 456830741 456515063 450976729 446201110 438470595 426879440 414780449
14248 414780449 403149850 389921835 375798603 361690266 347127322 332869510 318108752
$$ packed form
14301F6661360K498173K781171K995841K899377L467828L287926L413699M038983
14293I2044358M032680M365227M686795M774266N381889N557613O194702O072140
14285A33109670O890399O998392P813153Q017582Q617686R224728R620781J0244059
14277B00536450J1144572J1373060J2374188J2716434J3684166J3805109J4532273
14270B90166252J4695205J4347599J5168217J4609605J4614038J4130120J3666714
14263C91397750J2788971J1516969J1011473R522829Q184954L945907K535465
14256D50904318K937935K988488l15678n538334m775619p730515j1591155j2098991
14248D14780449j1630599j3228015j4123232j4108337j4562944j4257812j4760758
$$ plain form
14241 318108752 304069536 290365567 277046472 263690996 251076990 239066038 227468290
14234 227468290 215773453 204048476 193239689 183074895 173642068 165002602 156612043
14227 156612043 148610374 141213218 134541539 127869791 122265285 116821390 111254502 106380546
14219 106380546 101461611 96928934 93245843 89476699 85518146 82086963 78835657 75654924
14211 75654924 72993324 70101714 67265048 64887077 62923568 60387486 58329124 55915274
14203 55915274 54343886 52124048 50697598 49122617 47835247 46332499 44890055 43426950
14195 43426950 42134673 40612550 39558890 38829861 37625240 36390079 35591128 34379739
14187 34379739 33473865 32565707 31966262 31107798 30109778 29346091 28592560 28017069 27570182
$$ packed form
14241C18108752j4039216j3703969j3319095j3355476j2614006j2010952j1597748
14234B27468290j1694837j1724977j0808787j0164794r432827q639466q390559
14227A56612043q001669p397156o671679o671748n604506n443895n566888m873956
14219A06380546m918935m532677l683091l769144l958553l431183l251306l180733
14211G5654924k661600k891610k836666k377971j963509k536082k058362k413850
14203E5915274j571388k219838j426450j574981j287370j502748j442444j463105
14195D3426950j292277j522123j053660p29029j204621j235161p98951j211389
14187C4379739r05874r08158n99445q58464r98020p63687p53531n75491m46887
$$ plain form
14178 27570182 26716633 26071088 25243676 25061063 24488126 23620407 22994762 22498287 21600737
14169 21600737 21274408 21039276 20285564 20167877 19519503 19157929 18754532 18239074 17930532
14160 17930532 17708485 17224882 17011001 16545584 15786079 16236367 15799594 15179680 15118471
14151 15118471 14651405 14307770 14565381 14060060 13304326 13301673 13508248 13225220 12918976 12189545
14141 12189545 12324821 12158917 11899200 11397679 11208577 11087646 10884255 10785773 10545501
14132 10545501 10462286 10446137 10091767 10148460 9764265 9932657 9817554 9383516 9469202 8871534
14122 8871534 8914810 8684767 8605340 8672402 8447548 8198180 8553570 7864131 7939967 8132732
14112 8132732 7675245 7854819 7335398 7674425 7721947 6991805 6976685 6986837 7212379 6849662
$$ packed form
14178B7570182q53549o45545q27412j82613n72937q67719o25645m96475q97550
14169B1600737l26329k35132p53712j17687o48374l61574m03397n15458l08542
14160A7930532k22047m83603k13881m65417p59505M50288m36773o19914o1209
14151A5118471m67066l43635K57611n05321p55734k653K06575k83028l06244p29431
14141A2189545J35276j65904k59717n01521j89102j20931k03391r8482k40272
14132A0545501q3215j6149l54370N6693l84195J68392j15103m34038Q5686n97668
14122H871534M3276k30043p9427O7062k24854k49368L55390o89439P5836J92765
14112H132732m57487J79574n19421L39027M7522p30142j5120J0152K25542l62717
$$ plain form
14102 6849662 7049665 6667847 6905698 6714776 6586318 6346821 5938100 6057164 6632812
14093 6632812 6271537 5949496 5991616 6024609 5667381 5709368 5650506 5579045 5598584 5583096 5100370
14082 5100370 5944418 5260028 5064696 5012026 5324493 5197373 5023838 5094330 4854829 4665328
14072 4665328 5103123 4823300 4680326 4548670 4649398 4641360 4578620 4717924 4512905 4602507
14062 4602507 4010708 4147850 4283203 4182577 4062427 4050704 4228800 3847856 4146278 3792476
14052 3792476 3727321 4029625 3861660 3767419 3721529 3490177 3988258 3677177 3800880 3920514
14042 3920514 3691785 3733865 3419111 3600382 3635535 3255864 3418164 3222115 3397608 2876208
14032 2876208 3445716 3146036 3122688 3125057 2937300 3132978 2775197 2959151 3003339 2902947
$$ packed form
14102F849662K00003l81818K37851j90922j28458k39497m08721J19064N75648
14093F632812l61275l22041M2120L2993l57228M1987n8862p1461J9539j5488m82726
14082E100370Q44048o84390j95332n2670L12467j27120j73535P0492k39501j89501
14072D665328M37795k79823j42974j31656J00728q038o2740J39304k05019Q9602
14062D602507n91799J37142J35353j00626j20150j1723J78096l80944K98422l53802
14052C792476o5155L02304j67965r4241m5890k31352M98081l11081J23703J19634
14042C920514k28729M2080l14754J81271L5153l79671J62300j96049J75493n21400
14032B876208N69508k99680k3348K369j87757J95678l57781J83954M4188j00392
$$ plain form
14022 2902947 2768716 3174427 2776754 2850499 2751955 2975263 2814229 2869885 3026616 2831687
14012 2831687 2571763 2559382 2526760 2549283 2421997 2564837 2334995 2299674 2384056 2306841
14002 2306841 2393888 2335371 2485777 2235290 2392532 2298092 2441897 2181639 2270836 2146048
13992 2146048 2353333 1934929 2201173 1929239 2527513 2426531 2238005 2301282 2160225 2306531
13982 2306531 2285347 2340627 2304446 2809862 2763358 2887894 3427959 4703735 5952032 9474199
13972 9474199 14869899 25595779 32155690 21086139 13117061 8857210 6343736 5376585
13964 5376585 4336837 3911422 3502579 3520396 3321428 2906503 2875537 2409174 2591579 2461638
13954 2461638 2314694 2574000 2401375 2517817 2482966 2324125 2160875 2268313 2028953 1983542
$$ packed form
14022B902947j34231M05711l97673P3745r8544K23308j61034N5656J56731j94929
14012B831687k59924j2381l2622K2523j27286J42840k29842l5321Q4382p7215
14002B306841Q7047n8517J50406k50487J57242r4440J43805k60258Q9197j24788
13992B146048K07285m18404K66244k71934N98274j00982j88526O3277j41057J46306
13982B306531k1184N5280l6181N05416m6504J24536N40065J275776J248297L522167
13972I474199N395700J0725880O559911j1069551p969078m259851k513474r67151
13964E376585j039748m25415m08843J7817j98968m14925l0966m66363J82405j29941
13954B461638j46944K59306j72625J16442l4851j58841j63250J07438k39360m5411
$$ plain form
13944 1983542 1856092 1700643 2146759 1811249 1744616 1771912 1735486 2004423 1897862 1688130
13934 1688130 1613174 1777656 2103887 2092939 1651806 1677299 1744298 1474466 1651012 1853078
13924 1853078 1698957 1461857 1745199 1416878 1725918 1685360 1771240 1525844 1503085 1792726
13914 1792726 1463969 1711484 1669907 1453051 1776143 1509664 1382674 1416290 1372788 1537182
13904 1537182 1649471 1485182 1523838 1418308 1219932 1510352 1408599 1370684 1533984 1493407
13894 1493407 1380037 1029854 1492828 1281174 1564381 1343233 1163032 1277707 1399173
13885 1399173 1166963 1254287 1304850 1429458 1104920 1395073 1416413 1249495 880526 1727292
13875 1727292 1368249 1176623 1259603 1385150 953515 1297712 1435823 1377118 949065 1059055
$$ packed form
13944A983542j27450j55449M46116l35510o6633K7296l6426K68937j06561k09732
13934A688130p4956J64482L26231j0948m41133K5493O6999k69832J76546K02066
13924A853078j54121k37100K83342l28321L09040m0558Q5880k45396k2759K89641
13914A792726l28757K47515m1577k16856L23092k66479j26990L3616m3502J64394
13904A537182J12289j64289L8656j05530j98376K90420j01753l7915J63300m0577
13894A493407j13370l50183M62974k11654K83207k21148j80201J14675J21466
13885A399173k32210Q7324N0563J24608l24538K90153K1340j66918l68969Q46766
13875A727292l59043j91626Q2980J25547m31635L44197J38111n8705m28053J09990
$$ plain form
13865 1059055 1325107 925725 1192608 688231 1051776 1310503 1102001 958979 879411 1036019
13855 1036019 855647 953930 1019161 1343159 1018589 1138457 1126596 1102219 735982 929830
13845 929830 1090083 925115 852792 1075858 903320 903297 707555 1102018 940152 866554 916499
13834 916499 782527 761715 915567 892674 1212553 981456 1131085 890369 942382 985317
13824 985317 1016007 968110 813331 1042560 751722 615404 819570 756559 721271 693147
13814 693147 957821 794944 1189789 574026 756306 1265349 787810 691870 812633 678641
13804 678641 877696 804567 960299 763559 783722 594021 858685 522985 889564 1009821
13794 1009821 848193 466573 867291 688824 772576 686705 731788 782796 684104 989777
$$ packed form
13865A059055K66052l99382K66883n04377L63545K58727k08502j43022p9568J56608
13855A036019j80372R8283O5231L23998l24570J19868j1861k4377l66237J93848
13845I29830J60253j64968p2323K23066j72538k3j95742L94463j61866p3598M9945
13834I16499j33972k0812J53852k2893L19879k31097J49629k40716N2013M2935
13824I85317L0690m7897j54779K29229k90838j36318K04166o3011l5288k8124
13814F93147K64674j62877L94845E74026J82280N09043m77539r5940J20763j33992
13804F78641J99055p3129J55732j96740K0163j89701K64664l35700L66579J20257
13794A009821j61628l81620M00718j78467Q3752q5871M5083N1008r8692L05673
$$ plain form
13784 989777 699917 927910 606379 692739 693533 957196 745738 520041 761971 861165
13774 861165 734901 1112405 527555 800484 476502 735940 499427 284725 679249 647640
13764 647640 515633 704464 544919 970352 414348 633806 344529 740475 841734 842229
13754 842229 623343 967656 710985 401803 583198 723456 686359 761889 830196 823873
13744 823873 654442 560532 788133 437442 557496 627676 456340 332612 694342 940983
13734 940983 751449 367615 787124 481043 629744 589879 536600 787545 633507 656052
13724 656052 288662 315114 403893 435826 919848 591500 538448 575236 734509 414788
13714 414788 535842 651752 577647 261016 496914 466558 465231 318578 415498 837572
$$ packed form
13784I89777k89860K27993l21531Q6360P94K63663k11458k25697K41930R9194
13774H61165j26264L77504E27555K72929l23982K59438k36513k14702L94524l1609
13764F47640j32007J88831j59545M25433D14348K19458k89277L95946J01259M95
13754H42229k18886L44313k56671l09182J81395J40258l7097P5530O8307o323
13744H23873j69431r3910K27601l50691J20054P0180j71336j23728L61730K46641
13734I40983j89534C67615M19509l06081J48701l9865n3279K50945j54038K2545
13724F56052B88662K6452Q8779L1933M84022l28348n3052L6788J59273l19721
13714D14788J21054J15910p4105B61016K35898l0356j327j46653R6920M22074
$$ plain form
13704 837572 787003 484044 273369 670955 294398 175769 570249 548918 592994 288294
13693 268025 612024 464332 598499 624395 504553 600270 214691 619224 506067 786961
13683 786961 524339 -150169 407018 546249 336927 730590 403254 358487 360594 366008
13673 366008 632355 500525 426677 496156 611463 518901 676024 635804 63059 516420
13663 516420 468142 727103 420842 464721 467366 125537 503953 358093 402011 556849
13653 556849 440487 249632 579380 400956 568430 247271 508694 461761 246766 330108
13643 330108 575899 357922 292716 702134 325587 432623 38543 739242 577493 538331
13633 538331 389691 221023 503951 292597 539011 367947 380150 91105 396503 215683
$$ packed form
13704H37572n0569l02959k10675L97586B94398j18629L94480k1331M4076B88294
13693B68025L43999j47692J34167K5896j19842R5717B14691M04533j13157K80894
13683G86961k62622a50169D07018J39231k09322L93663l27336m4767K107N414
13673C66008K66347j31830p3848O9479J15307r2562J57123m0220F3059M53361
13663E16420m8278K58961l06261M3879K645A25537L78416j45860M3918J54838
13653E56849j16362j90855L29748j78424J67474B47271K61423m6933k14995Q3342
13643C30108K45791k17977o5206M09418C25587J07036C8543P00699j61749l9162
13633E38331j48640j68668K82928k11354K46414j71064J2203I1105L05398j80820
$$ plain form
13623 215683 625065 342636 252456 414300 311212 440120 563641 408454 287222 -13332
13612 186667 447735 618668 390567 220990 396382 276646 414939 362956 386455 325456
13602 325456 532031 413230 246142 377474 55921 327641 462877 27922 333048 452428
13592 452428 391134 265366 692153 336391 347775 527265 475232 -93979 528898 341266
13582 341266 327109 272148 398100 269956 395553 175478 549605 800709 303675 376754
13572 376754 393366 304863 273125 269571 385956 182097 693370 806806 457295 53448 259288
13561 259288 280054 226409 49701 216341 425378 332715 456732 20975 415179 69210 179906
13550 179906 392132 464134 286817 383933 269136 514876 36204 640015 488601 -59131
$$ packed form
13623B15683M09382k82429r0180J61844j03088J28908J23521j55187j21232a3332
13612A86667K61068J70933k28101j69577J75392j19736J38293n1983K3499o0999
13602C25456K06575j18801j67088J31332E5921K71720J35236B7922L05126J19380
13592D52428o1294j25768M26787C36391J1384J79490n2033i3979E28898j87632
13582C41266j4157n4961J25952j28144J25597A75478L74127K51104C03675P3079
13572C76754J6612q8503l1738l554J16385A82097N11273J13436l49511E3448K05840
13561B59288K0766n3645D9701J66640K09037r2663J24017B0975L94204F9210J10696
13550A79906K12226P2002j77317R7116j14797K45740C6204O03811j51414e9131
$$ plain form
13539 335481 479749 125373 114422 516252 201377 356592 312985 465032 183554 441998
13529 441998 619721 251292 57634 426600 186939 476800 266008 451862 33024 383718
13519 383718 261475 568672 428477 260510 213239 278250 469819 424950 203666 334231
13509 334231 432471 -12465 237486 480527 573812 -59002 322580 416518 354923 312814 445097
13498 445097 321580 271467 278701 146462 356999 175745 210948 262362 124419 293719
13488 293719 323506 365708 65435 247658 178248 158309 370150 62655 464465 142867 -156320
13476 52236 335727 184222 55688 272204 196998 213946 470006 215098 69212 513647
13466 513647 131092 413249 -11425 87699 396607 129915 289607 149657 404769 56901
$$ packed form
13539C35481J44268A25373j0951M01830B01377J55215m3607J52047A83554K58444
13529D41998J77723B51292E7634L68966A86939K89861k10792J85854C3024L50694
13519C83718j22243L07197j40195j67967m7271O5011J91569m4869B03666J30565
13509C34231R8240a2465B37486K43041R3285e9002C22580R3938o1595m2109J32283
13498D45097j23517n0113P234j32239K10537A75745L5203N1414A24419J69300
13488B93719K9787M2202F5435J82223o9410j9939K11841F2655M01810A42867a56320
13476E2236K83491j51505E5688K16516p5206J6948K56060B15098F9212M44435
13466E13647A31092K82157a1425H7699L08908A29915J59692j39950K55112E6901
$$ plain form
13455 255167 166474 250134 338657 162474 36526 138633 215535 369022 260157 -24333 -116440
13444 -116440 12858 285159 216085 224985 319185 149340 546699 420171 304965 235616 423280
13433 423280 276079 98602 360338 490666 185282 -98991 36374 -42948 22530 467910
13423 467910 515548 125353 287084 73037 289989 139360 366104 491039 380509 667883
13413 667883 282166 301033 337786 -133294 259777 231118 486755 209142 118898 -132849
13402 24470 290177 207487 -149839 174243 245920 94349 -71178 411992 77911 558085 186164
13390 135696 151576 481309 302757 278012 504122 431803 106671 105299 9691 306014 49894
13378 228968 178018 311140 163713 432649 72075 47560 304587 80216 298013 42908
$$ packed form
13455B55167q8693Q3660Q8523A62474C6526J02107P6902J53487j08865b4333r2107
13444a16440A2858K72301o9074Q900R4200A49340L97359j26528j15206o9349J87664
13433D23280j47201I8602K61736J30328A85282i8991C6374d2948B2530M45380
13423D67910M7638A25353J61731G3037K16952A39360K26744J24935j10530K87374
13413F67883B82166J8867L6753a33294B59777k8659K55637B09142r0244a32849
13402B4470K65707q2690a49839A74243P1677I4349g1178D11992G7911M80174A86164
13390A35696J5880L29733j78552k4745K26110p2319A06671j372I691K96323D9894
13378B28968n0950J33122j47427K68936G2075k4515K57027H0216K17797D2908
$$ plain form
13367 342617 33377 539755 -92425 46161 -70192 -36544 98754 243557 354996 329557 132969
13355 208953 73224 56373 236988 181201 102574 327281 258206 241378 532742 28062 76957
13344 76957 -104318 40626 182554 245000 333804 22663 48014 79463 203494 256947 293282
13333 293282 254296 345536 82062 550684 -41183 470016 498484 219603 286340 50401 187583
13322 187583 -264695 253120 -71488 207412 289707 115125 380412 81898 267455 96336
13311 328817 76527 61807 246734 34994 450064 74317 131982 250797 461777 406858 89439
13299 252660 125105 24086 174978 297855 -167849 -96820 -27776 -14644 -96336 -327375
13289 -327375 334713 345859 143808 -28578 256780 112918 -270769 291236 299044 -148489
$$ packed form
13367C42617C3377N06378i2425D6161g0192L3648I8754J44803J11439k5439A32969
13355B08953G3224j6851J80615n5787p8627K24707o9075j6828K91364B8062M8895
13344G6957a04318D0626J41928O2446Q8804B2663K5351L1449J24031N3453L6335
13333B93282l8986R1240H2062M68622d1183D70016K8468B19603O6737E0401J37182
13322A87583b64695B53120g1488B07412Q2295A15125K65287H1898J85557I6336
13311C28817G6527j4720J84927C4994M15070G4317N7665J18815K10980n4919H9439
13299B52660A25105B4086J50892J22877a67849P1029b7776J3132q1692k31039
13289c27375C34713J1146A43808b8578B56780A12918b70769B91236P808a48489
$$ plain form
13278 210649 52032 54285 42638 271231 101686 105987 33834 -41756 36547 404865 -56065
13266 489652 132594 205499 265573 182541 515153 432916 -12698 289934 303868 240645 106734
13254 78231 72184 242637 -203584 174467 204059 212337 -20002 212735 -19203 225994 66234
13242 312918 -86484 383763 -91968 216002 303946 77897 49710 -297616 -59660 488752 31257
13230 325450 156987 94140 -126257 22486 -136519 74437 35241 238054 117884 188112
13220 188112 139714 53801 -1215 -51627 376345 -93740 246332 232483 22758 50237 169198
13209 169198 -84387 213746 277159 48046 -65701 -82842 -163928 40079 -85757 221000 187372
13198 187372 -135437 305651 301573 120551 -72420 117537 268141 -8261 -21782 -114835 -64835
$$ packed form
13278B10649E2032K253j1647K28593A01686M301C3834d1756C6547L68318e6065
13266D89652A32594P2905O0074q3032L32612q2237a2698B89934J3934o3223A06734
13254G8231o047J70453b03584A74467K9592Q278b0002B12735a9203B25994F6234
13242C12918h6484C83763i1968B16002Q7944G7897k8187b97616e9660D88752C1257
13230C25450A56987o2847a26257B2486a36519G4437C5241K02813A17884P0228
13220A88112m8398E3801a215n0412C76345i3740B46332j3849B2758K7479J18961
13209A69198h4387B13746O3413D8046f5701j7141q1086D0079h5757B21000l3628
13198A87372a35437C05651m078A20551g2420A17537J50604h261j3521r3053N0000
$$ plain form
13187 -64835 -87767 -141611 89343 39 -149239 74962 112771 536813 181192 68932 -270223
13175 -104482 -80199 205777 82372 222380 152223 -60465 282099 -113278 -306952 218623
13164 74312 118512 231867 -219631 94798 -391864 385439 259930 170686 283128 66847
13153 -23582 349444 125777 105637 -110205 126465 -82257 114130 39889 315624 152251
13142 150480 244365 93627 39301 254677 58904 118060 12030 -10222 16075 20777 -24384
13130 31640 218043 109947 -85378 184798 47306 -23721 108174 336916 -380476 141812
13119 79128 186548 -44213 40789 74209 33903 80947 -137232 -35644 70795 -70309 -91765
13108 -91765 237032 30268 18302 144722 87149 -41623 -7017 -82978 107341 -79655 73017
$$ packed form
13187f4835k2932n3844H9343C9a49239G4962L7809M24042A81192F8932b70223
13175a04482K4283B05777H2372J40008p0157f0465B82099a13278j93674B18623
13164G4312M4200J13355b19631I4798c91864C85439j25509q9244J12442F6847
13153b3582C49444A25777k0140a10205A26465h2257A14130C9889K75735A52251
13142A50480R3885I3627C9301K15376E8904N9156A2030a0222A6075M702b4384
13130C1640J86403j08096h5378A84798D7306b3721A08174K28742c80476A41812
13119G9128J07420d4213D0789L3420C3903M7044a37232c5644G0795g0309k1456
13108i1765B37032C0268j1966J26420n7573d1623g017p5961A07341g9655G3017
$$ plain form
13096 350525 248795 72395 19813 -116430 -2528 533612 294900 124960 321692 -117203
13085 186248 122545 -73255 209752 198494 -38275 -184208 98459 271641 139122 48877 417773
13074 417773 103690 270612 -138904 103508 185543 196011 313318 122514 -155713 26557
13063 60346 138977 -99167 164664 268827 275467 64614 -290482 210984 20415 -111438 -56782
13052 -56782 79981 147728 340633 8893 23128 555066 -80300 -248314 -86972 159622 299132
13041 299132 360811 -78910 -97215 255407 205285 114153 76005 159806 413616 69526 -96495
13029 -32986 26034 -157340 -148454 215397 301781 69452 62556 -208523 77281 -2271 -130563
13018 -130563 314427 147206 282384 63510 206508 156621 133399 3965 304420 196318
$$ packed form
13096C50525j01730G2395A9813a16430b528E33612k38712A24960J96732a17203
13085A86248o3703g3255B09752j1258c8275j45933I8459J73182j32519D8877L68896
13074D17773A03690J66922a38904A03508Q2035J0468J17307A22514a55713B6557
13063F0346P8631i9167A64664J04163O640F4614b90482B10984B0415a11438N4656
13052e6782G9981O7747J92905H893J4235N31938h0300j68014h6972A59622J39510
13041B99132O1679g8910j8305B55407n0122r1132l8148Q3801K53810F9526i6495
13029c2986B6034a57340Q886B15397Q6384F9452o896b08523G7281b271j28292
13018a30563C14427A47206J35178F3510J42998m9887k3222C965L00455j08102
$$ plain form
13008 196318 94882 481666 164559 143205 -24545 58962 121749 36740 -98254 -44334 483373
12996 34492 -131262 301588 99194 9695 243283 69380 -65067 2285 -22694 -42512 470949
12984 155503 338770 243779 50928 96560 140789 -349065 27785 263291 116195 50555 128656
12973 128656 180771 182724 36163 183804 -37006 165474 -128320 79705 298315 204737 -22142
12961 -95280 89422 -6585 70403 -168990 46418 326902 163961 134534 -44050 -133369 142213
12949 -87829 30154 38875 -280674 -36446 169214 -150055 102656 -92452 50433 -62281 -80580
12938 -80580 126894 90694 36976 -14799 119850 14734 -98701 43412 166719 -132243 332137
12926 107654 24902 -164036 353300 128674 -86698 160856 -9077 399134 324854 190228
$$ packed form
13008A96318I4882L86784A64559k1354b4545E8962O2787C6740i8254d4334D83373
12996C4492a31262C01588I9194I695K33588F9380f5067B285b2694j9818D70949
12984A55503J83267r4991E0928M5632M4229c49065B7785K35506A16195E0555P8101
12973A28656N2115J953C6163J47641c7006A65474a28320G9705K18610r3578b2142
12961i5280H9422f585G0403a68990D6418K80484j62941k9427d4050q9319A42213
12949h7829C0154Q721b80674c6446A69214a50055A02656i2452E0433f2281j8299
12938h0580A26894l6200C6976a4799A19850A4734i8701D3412J23307a32243C32137
12926A07654B4902a64036C53300A28674h6698A60856i077C99134p4280j34626
$$ plain form
12916 190228 70047 -33173 -142287 -205791 224694 290628 263259 102778 82242 272812 393119
12905 393119 1093 -179336 179034 57410 -133475 232823 -247573 271582 163477 -97203
12894 48480 -194008 -53185 -10829 -36332 57814 67705 341679 109452 -99828 67002 -311170
12882 -7183 -372003 390591 83231 -47247 110475 331130 -113612 -248341 44100 304127
12872 304127 -164823 -325687 283696 300564 147761 -32392 -133318 171894 -11116 120992
12861 297325 -332310 -43496 -138638 248371 424960 169075 -46885 191431 -124179 5106
12850 -95023 214449 -128814 129146 -295213 128361 -32506 41424 -45371 105936 -132440
12839 -304458 233138 -6425 227572 -268140 99675 273178 -137780 33049 -46953 -58860 -13466
$$ packed form
12916A90228G0047c3173j09114o3504B24694O5934k7369A02778k0536J90570J20307
12905C93119A093a79336A79034E7410a33475B32823b47573B71582j08105i7203
12894D8480a94008e3185a0829k5503E7814R891K73974A09452i9828F7002c11170
12882g183l64820C90591H3231d7247A10475K20655a13612j34729D4100K60027
12872C04127a64823j60864B83696J6868A47761c2392j00926A71894a1116A20992
12861B97325c32310d3496r5142B48371J76589A69075d6885A91431a24179E106
12850i5023B14449a28814A29146b95213A28361c2506D1424d5371A05936a32440
12839c04458B33138f425B27572b68140I9675J73503a37780C3049d6953j1907a3466
$$ plain form
12827 117472 -58484 -91309 -81868 25360 329729 200456 118829 76970 497739 190479 -55903
12815 132070 155879 70219 281582 121187 98819 -136590 149525 -199306 -167510 -247123
12805 -247123 9830 -92316 212847 -49765 211549 115554 312028 87261 -111552 -103035 80109
12793 -87453 111760 41851 -70854 335835 -352130 58267 -207451 75632 196123 1395 -109361
12781 249779 -212567 3480 14674 -317573 88848 46254 -74865 -40379 -34007 -236289 143049
12769 250578 129102 169598 124121 117998 -292407 33868 -133503 144442 -35744 198890 -72034
12757 5054 -70484 -97604 105079 46160 223806 -104033 -137096 -177396 -12843 -109161 90278
12745 138003 72636 -171957 -163970 -32499 -419041 45347 -845 205126 -5812 -118020 -123180 -41428
$$ packed form
12827A17472e8484l2825R441B5360L04369j29273q1627m1859M20769A90479e5903
12815A32070K3809G0219K11363A21187k2368a36590A49525a99306L1796p9613
12805b47123I830i2316B12847d9765B11549r5995J96474H7261a11552Q517H0109
12793h7453A11760D1851g0854C35835c52130E8267b07451G5632J20491A395a09361
12781B49779b12567C480J1194c17573H8848m2594g4865L4486O372k02282A43049
12769B50578j21476M0496m5477o123b92407C3868a33503A44442c5744A98890g2034
12757E054g0484k7120A05079D6160J77646a04033l3063m0300a2843r6318I0278
12745A38003o5367a71957P987c2499l86542D5347h45B05126e812j12208n160d1428
$$ plain form
12732 34677 114900 155322 79588 -12552 394502 -389517 -48088 1965 -1033 224225 52934
12720 -95158 402422 163603 445420 824 289706 10658 197299 54212 -132824 145126 111080
12709 111080 353005 -74299 83194 220963 -7378 109761 63670 229400 -150669 -117652 247634
12697 219012 339664 -24428 146862 273898 107760 64204 241815 173947 -69009 443626
12686 273645 265068 -6185 327904 128204 406096 116273 -117511 -156345 237939 -126462
12675 173261 -12014 -58215 -88330 71838 271293 120469 218631 274007 100194 241801 162012
12664 162012 445386 257260 450034 -113954 -13649 -21157 43184 -267734 112896 -40457
12653 -86050 217766 135077 -21202 376405 -144396 -103035 257167 184017 41032 -33421 -50355
$$ packed form
12732C4677Q0223M0422p5734a2552C94502c89517d8088A965a033B24225E2934
12720i5158D02422A63603K81817H24K88882A0658J86641E4212a32824A45126l4046
12709A11080K41925g4299H3194J37769g378A09761m6091J65730a50669L3017B47634
12697B19012J20652b4428A46862J27036A07760m3556J77611o7868f9009D43626
12686B73645q577f185C27904A28204K77892A16273a17511l8834B37939a26462
12675A73261a2014m6201l0115G1838J99455A20469R8162N5376A00194J41607p9789
12664A62012K83374j88126J92774a13954a3649p508D3184b67734A12896d0457
12653h6050B17766q2689b1202C76405a44396M1361B57167p3150D1032c3421j6934
$$ plain form
12642 -50355 190733 260818 195673 126046 161849 33953 182729 282448 81495 -209697 -3036
12630 86233 -81260 -119639 60689 -76260 -108397 237337 330629 -202774 -245821 -24993 74421
12618 96691 203720 284297 -353 -28465 -52509 -198775 253780 -1619 281801 -113841 277702
12606 211779 222957 264419 501818 179745 143215 -116244 260389 125669 310013 47616
12595 -129268 401621 218892 125139 406146 -90767 97355 138682 -90435 144144 147097 -55507
12583 144171 390998 13748 191717 -355465 -67709 -265998 -19166 73035 -48324 -22318 -280774
12572 -280774 214725 -103652 15338 180103 277313 417706 -377539 35760 -61729 136473
12561 -27989 50532 20277 -236742 195123 111674 -102957 163778 174618 -129847 206748
$$ packed form
12642e0355A90733P0085o5145o9627L5803C3953J48776R9719H1495b09697c036
12630H6233h1260l8379F0689g6260l2137B37337R3292b02774m3047b4993G4421
12618I6691J07029Q0577c53k8112k4044j46266B53780a619B81801a13841B77702
12606B11779J1178M1462K37399A79745l6530a16244B60389A25669J84344D7616
12595a29268D01621j82729r3753K81007i0767I7355M1327i0435A44144K953e5507
12583A44171K46827A3748J77969c55465f7709j98289a9166G3035d8324b2318k58456
12572b80774B14725a03652A5338J64765R7210J40393c77539C5760f1729A36473
12561b7989E0532B0277b36742A95123q3449a02957A63778J0840a29847B06748
$$ plain form
12550 413544 76894 -148538 153344 132932 378684 216323 40601 54773 58662 -69633 111243
12538 -67660 151198 40468 87602 289035 113446 -5793 21804 32076 222597 -426421 -141470
12526 -245192 -70207 -24263 108562 234657 52349 -177918 203455 -249151 -36761 229249
12515 26623 -37684 -282205 -144873 -260914 30816 -31321 298680 114310 263370 151512
12505 151512 26771 -283071 570673 151931 -78061 30263 -297285 175855 175839 161273 140023
12494 140023 137409 -172039 35845 167366 141527 210448 -197641 9181 -191245 218983 26900
12482 2471 -60055 -56195 530817 -999 -237611 -280928 118956 -110128 160573 282583 81825
12470 180457 81030 -20618 276757 57688 -327489 -76249 505976 -277107 -138992 -133673 52417
$$ packed form
12550D13544G6894a48538A53344k0412K45752j62361D0601J4172L889f9633A11243
12538f7660A51198D0468M7134K01433A13446e793B1804J0272J90521d26421a41470
12526b45192g0207b4263A08562J26095E2349a77918B03455b49151c6761B29249
12515B6623c7684k44521J37332j16041C0816c1321B98680A14310J49060j11858
12505A51512B6771b83071E70673A51931g8061C0263b97285A75855j6j4566k1250
12494A40023k614a72039C5845J31521k5839O8921a97641I181a91245B18983B6900
12482B471f0055L860E30817i99k36612m3317A18956a10128A60573J22010H1825
12470A80457H1030b0618B76757E7688c27489g6249E05976b77107J38115N319E2417
$$ plain form
12458 117952 -176760 137211 67432 -84510 -68199 -437565 277284 50736 -82420 34286 150793
12447 150793 487874 -277112 146337 35904 37051 151517 8846 -246007 13469 16490 -10965
12435 -184364 -146152 65242 72055 119048 42695 65258 102162 101277 -210396 -244386 -304592 -35654
12422 -80863 -46853 19473 67318 167105 109984 -321269 -905 -30778 -159360 -138096 -61403 101769
12409 164775 130967 288753 -38061 -26176 129191 219607 -109728 -470236 -296868 -95006
12398 -241878 -24560 -138291 133709 -23944 53727 46692 185367 -102554 -52784 192678 122694
12387 122694 -302634 -249710 -89803 92893 -69559 206863 -2931 51906 -137338 79526 191040
12376 191040 -92959 2874 -290364 -181043 -82540 327466 -15345 -52591 84024 307127 259081
$$ packed form
12458A17952a76760A37211F7432h4510J6311l69366B77284E0736h2420C4286J16507
12447A50793L37081b77112A46337C5904J147J14466H846b46007A3469L021a0965
12435a84364L8212F5242O813M6993D2695K2563L6904q85b10396l3990o0206c5654
12422h0863L4010A9473M7845R9787n7121c21269i05k9873j28582K1264f1403A01769
12409A64775l3808J57786c8061J1885A29191R0416a09728l60508J73368i5006
12398b41878b4560j13731A33709b3944E3727p035J38675a02554M9770A92678o9984
12387A22694c02634N2924h9803I2893f9559B06863b931E1906a37338G9526J11514
12376A91040i2959B874b90364J09321h2540C27466a5345l7246H4024K23103m8046
$$ plain form
12365 259081 30469 -417886 -225324 -77663 110838 211187 -112375 15238 -43716 290942
12354 -17919 3341 76146 259823 116942 43154 188330 -162257 -68605 586 -73636 152435
12342 -64115 108971 -103706 -50644 73231 -110713 395364 -93993 237574 -4970 -126938 64185
12330 110721 -18846 102558 -180863 -297734 88445 -233438 83820 -148003 -55592 378315
12319 -140804 120468 -346066 21469 6398 271221 13400 81579 32551 -3342 -15619 11275
12307 -129787 -100984 11962 -83756 96033 172546 -180497 -116715 260866 102844 -50616 -137958
12296 -137958 262494 207074 -108200 -39480 -59973 -137107 109391 126770 -43395 -134106 120713
12284 203458 199890 -144862 123770 460463 246529 193003 -143859 -253714 -87459 34249
$$ packed form
12365B59081C0469d17886J92562g7663A10838J00349a12375A5238d3716B90942
12354a7919C341P2805J83677A16942D3154J45176a62257f8605E86g3636A52435
12342f4115A08971a03706e0644G3231a10713C95364i3993B37574d970j21968F4185
12330A10721a8846A02558a80863j16871H8445b33438H3820a48003e5592C78315
12319a40804A20468c46066B1469F398K64823A3400O8179C2551c342j2277A1275
12307a29787K8803A1962h3756I6033P6513a80497O3782B60866A02844e0616q7342
12296a37958B62494n5420a08200c9480k0493p7134A09391J7379d3395r0711A20713
12284B03458l568a44862A23770L36693k13934n3526a43859j09855h7459C4249
$$ plain form
12273 -6166 -134764 296469 -60390 166142 69014 22863 303072 -254029 84174 102 77127
12262 77127 356488 -52750 228132 309552 113511 -136637 88605 -107601 460445 52702
12251 -6413 -118624 221757 -437804 -29968 184582 -164838 161186 -163003 247017 -57303
12240 94303 36083 108629 -60272 78954 -67338 -25266 74294 -219078 -63287 -42041 14421
12228 244958 284377 56841 43596 128249 98396 183646 115504 13592 117029 -118277 326665
12216 136793 338805 193634 699736 150368 421234 249599 409127 132987 76374 145203
12206 145203 -156805 322493 318648 183743 16044 283011 371463 263031 79808 247860
12196 247860 264394 91214 99182 368286 -62341 -195952 298185 229505 359741 16617 602632
$$ packed form
12273f166j28598B96469f0390A66142F9014B2863K80209b54029H4174A02P7025
12262G7127K79361e2750B28132Q1420A13511a36637H8605a07601D60445E2702
12251f413j12211B21757d37804b9968A84582a64838A61186a63003B47017e7303
12240I4303C6083P2546f0272G8954f7338b5266G4294b19078f3287K1246A4421
12228B44958L9419E6841j3245Q4653k9853Q5250o8142A3592J03437a18277C26665
12216A36793K02012j45171N06102A50368K70866j71635J59528A32987n6613O8829
12206A45203a56805C22493l845j34905A6044K66967Q8452j08432G9808J68052
12196B47860J6534I1214P968K69104f2341j33611B98185o8680J30236A6617N86015
$$ plain form
12185 602632 -28493 16227 390506 243312 -32090 295384 125979 -12632 275690 22540
12174 477459 241736 -4337 148310 392778 243141 115648 193340 273008 265776 200807 277441
12163 277441 186695 286495 195945 -84761 -34634 -31980 197769 192699 328115 -70408 -56144
12152 -56144 150348 295076 -223529 -16311 -56476 -51081 110573 -93624 -4532 200732 -118963
12140 14011 143092 59064 -73856 195879 55537 134596 180823 318970 177356 299756 -151298
12128 72015 -93828 -188172 314992 286372 -36893 -235483 398665 57395 56428 154021 195897
12117 195897 -185466 127295 57704 -53504 -21626 -57244 159112 362002 50099 -8644 -56476
12106 -56476 -48281 -50498 -260710 15377 187532 143644 -86947 -128405 68505 31456 48432 155882
$$ packed form
12185F02632b8493A6227L74279j47194c2090B95384A25979a2632B75690B2540
12174D77459k35723d337A48310K44468j49637A15648P7692P9668p232o4969P6634
12163B77441r0746R9800r0550h4761c4634K654A97769n070J35416g0408J4264
12152e6144A50348J44728b23529a6311m0165N395A10573i3624d532B00732a18963
12140A4011J29081E9064g3856A95879E5537P9059M6227J38147j41614J22400a51298
12128G2015i3828r4344C14992k8620c6893j98590C98665E7395r67R7593M1876
12117A95897a85466A27295E7704e3504b1626l5618A59112K02890E0099h644m7832
12106e6476Q195k217k10212A5377J72155m3888h6947m1458F8505C1456J6976J07450
$$ plain form
12094 155882 23399 -126658 210083 89953 -4729 193330 24528 244950 114925 -242766
12083 333432 121364 82543 2131 -117924 -154970 102829 146060 -31770 -319976 5956 250597
12072 250597 -78401 -52173 211391 33284 346924 -190705 -38203 -215394 97368 -53275 53339
12060 187314 138853 609265 1252744 628658 143963 144894 -71427 -181438 305734 -392748
12049 -45538 107313 14507 46205 321616 7505 93003 -160671 271683 -157652 -103160 -118770
12038 -118770 -149017 153834 50670 -105030 -105866 -108912 90771 -130278 -252373 -11768 -95584
12027 -95584 196795 -84823 68356 114596 82635 78534 138862 63704 94694 -65901 -262011
12016 -262011 -69813 -18783 55867 23049 -64967 62535 -71285 104714 233516 -45 61503 211172
$$ packed form
12094A55882B3399a26658B10083H9953d729A93330B4528K20422A14925b42766
12083C33432A21364l8821B131a17924l7046A02829M3231c1770k88206E956K44641
12072B50597g8401K6228B11391C3284L13640a90705c8203j77191I7368e3275E3339
12060A87314m8461M70412O43479o24086A43963R31g1427j10011C05734c92748
12049d5538A07313A4507L1698K75411G505Q5498a60671B71683a57652N4492j5610
12038a18770l0247A53834E0670a05030q36l046I0771a30278j22095a1768q3816
12027i5584A96795h4823F8356M6240l1961m101O0328F3704L0990f5901j96110
12016b62011f9813a8783E5867B3049f4967F2535g1285A04714J28802d5F1503J49669
$$ plain form
12004 211172 16921 199251 -29004 -80773 506718 -16090 -216815 214901 -33936 4077 -198806
11992 38232 33361 -326788 15221 214822 -3463 -87465 -202432 -6264 -107168 -229784 -7561
11980 159321 142198 -96128 26251 80244 -423078 -356051 -165235 -409690 -38274 -37469 24125
11968 -296632 285340 -23465 -30085 -75503 -107284 100175 -238775 230695 189624 262261 24116
11956 188591 -66024 31800 -325189 198132 -120851 115635 115861 116857 75360 -48731 61838
11944 361751 -32117 -423889 361990 -164705 -137650 -100263 -401472 -101272 -240191 -18999
11933 53755 5447 17966 178693 47375 -159797 -72464 105371 116568 163245 -139772 103738
11921 -150255 174421 15118 -107692 6981 449185 124176 202039 -62198 136429 -184401
$$ packed form
12004B11172A6921J82330b9004n1769E06718a6090k00725B14901c3936D077a98806
11992C8232m871c26788A5221J99601c463q4002j14967f264j00904j22616g561
11980A59321j7123i6128B6251N3993d23078O7027a65235k44455c8274Q05B4125
11968b96632B85340b3465o620m5418l1781A00175b38775B30695m1071P2637B4116
11956A88591f6024C1800c25189A98132a20851A15635K26R96m1497d8731F1838
11944C61751c2117l91772C61990a64705K7055L7387l01209a01272j38919a8999
11933E3755E447J2519J60727D7375a59797g2464A05371J1197M6677a39772A03738
11921a50255A74421A5118a07692F981M42204A24176P7863f2198A36429a84401
$$ plain form
11910 -90775 283796 -74214 137789 -98125 187348 -155023 193557 -68897 36764 350678
11900 350678 -338579 109757 -2091 -22486 -157820 -37242 -4574 -178866 209296 381958 130724
11888 70407 -42726 -62199 -27640 -42635 10375 123371 8678 95324 2351 -154259 -138134 29359
11875 -79859 237503 169470 -407689 187683 -262186 -103643 83061 -480398 -72170 -320121
11865 -320121 -18857 -9229 -39385 432262 82820 -24421 -182633 -302917 386638 -75731 152545
11853 458556 260657 -14043 -166410 165134 58511 -297398 205151 77860 -183584 -96343
11843 -96343 178595 40690 -158306 -176439 225144 179286 -117749 -121665 -25255 264022 -187640
11831 233826 238526 -180254 -209102 175939 -216572 -21883 34597 79961 -61025 237304 -111305
$$ packed form
11910i0775B83796g4214A37789i8125A87348a55023A93557f8897C6764L13914
11900C50678c38579A09757b091k0395j35334c7242d574j74292B09296J72662A30724
11888G0407d2726j9473b7640j4995A0375J12996H678Q6646B351a54259J6125B9359
11875g9859B37503o8033d07689A87683b62186a03643H3061d80398g2170k47951
11865c20121a8857i229l0156D32262H2820b4421j58212j20284C86638g5731A52545
11853D58556j97899a4043j52367A65134E8511b97398B05151G7860a83584Q7241
11843i6343A78595D0690a58306j8133B25144m5858a17749l916b5255B64022a87640
11831B33826M700a80254k8848A75939b16572b1883C4597M5364f1025B37304a11305
$$ plain form
11819 -73106 127139 -175951 -53697 -108475 70575 -34996 2102 -38962 -218972 36455 -46620
11807 -149965 127707 -223422 -84001 -92018 -348946 -305079 110475 37128 -154037 14987 159064
11796 159064 149755 -24762 -117366 -110112 -161025 -67459 167670 -206913 239800 15366 -252012
11784 -172378 -12296 59527 -116231 183277 268071 -127264 -266377 243595 -49292 -34952
11774 -34952 -268883 313043 176782 -327496 -219647 -90844 220287 205793 257525 -114477
11763 141139 2067 123908 -85126 26724 -141384 -24363 13118 40683 -14451 -46196 -40632
11752 -40632 -296649 -97184 179017 227094 -80687 -2555 -105939 -55410 -244627 222529 56703
11740 42758 -104605 102129 -109608 189374 2161 46719 88271 -90427 -49626 251013 -161208
$$ packed form
11819g3106A27139a75951e3697n4778G0575c4996B102c8962j80010C6455d6620
11807a49965A27707b23422h4001q017k56928M3867A10475C7128a54037A4987J44077
11796A59064r309b4762r2604P254n0913f7459A67670b06913B39800A5366b52012
11784a72378a2296E9527a16231A83277Q4794a27264j39113B43595d9292J4340
11774c4952k33931C13043j36261c27496J07849i0844B20287j4494N1732a14477
11763A41139B067J21841h5126B6724a41384b4363A3118K7565a4451l1745N564
11752d0632k56017i7184A79017M8077h0687b555j03384N0529j89217B22529E6703
11740D2758a04605A02129a09608A89374B161M4558M1552i0427M0801B51013a61208
$$ plain form
11728 155082 -235700 27927 182024 317814 64960 30707 -32418 140020 458565 50052
11717 -204100 168006 88286 314395 -83882 38700 253897 -148767 352216 -28708 -202342
11707 -202342 -395628 104608 126936 -32256 20939 207513 154508 -355983 198252 144662
11697 144662 203908 10623 60420 91835 -314466 -35418 -172250 260026 113876 11036 -94796
11685 286370 202263 73261 -5705 263368 299681 -53680 1548 253327 -139218 421195 231911
11674 231911 -290865 -95996 106252 -8325 196754 51729 340691 22219 -10107 23725 90811
11663 90811 111214 245109 -214114 286087 124167 147473 -127779 278182 26703 196940
11653 196940 428210 120699 18246 -11396 223001 115306 -185635 -93480 -17432 -70699
$$ packed form
11728A55082b35700B7927J54097J35790F4960C0707c2418A40020L18545E0052
11717b04100A68006p9720K26109h3882C8700K15197a48767C52216b8708j73634
11707b02342j93286A04608K2328c2256B0939J86574n3005c55983A98252n3590
11697A44662N9246A0623M9797L1415c14466c5418j36832B60026A13876A1036i4796
11685B86370q4107G3261e705B63368L6313e3680A548K51779a39218D21195j89284
11674B31911b90865i5996A06252h325A96754E1729K88962B2219a0107B3725O7086
11663I0811K0403J33895b14114B86087A24167K3306a27779B78182B6703J70237
11653A96940K31270A20699A8246a1396B23001j07695a85635R2155a7432n3267
$$ plain form
11643 -70699 -198228 138691 -242860 452519 -170675 -270143 -202033 -249 17751 131010 57562
11631 -154590 -124519 -144054 135725 44031 149641 138373 -164566 308613 46445 -128739
11620 -247617 -61215 -68999 -83770 -10149 38760 66958 -817 27837 24544 316796 -102817 -288807
11608 -288807 -170045 46338 -183329 -42097 43893 -50187 338599 254931 146282 360515
11598 360515 -36888 228488 -246545 -195177 126096 -24665 274573 -175750 111530 107614
11588 107614 -198801 85140 234110 134306 -23112 415180 6654 84453 -131344 -89903 -190298
11577 -190298 -1447 385428 128974 196293 146782 274665 315385 -6111 364009 3099 100267
11566 100267 405981 166481 -70888 297363 172232 -204749 350651 229666 213289 80432
$$ packed form
11643g0699j27529A38691b42860D52519a70675r9468O8110b49A7751J13259E7562
11631a54590L0071j9535A35725D4031J05610j1268a64566C08613D6445a28739
11620b47617f1215p784j4771a0149C8760K8198h17B7837l293K92252a02817j85990
11608b88807J18762D6338a83329d2097D3893e0187C38599q3668j08649K14233
11598C60515c6888B28488b46545N1368A26096b4665B74573a75750A11530l916
11588A07614a98801H5140J48970r9804b3112D15180F654P7799a31344M1441j00395
11577a90298a447C85428A28974O7319m9511J27883M0720f111C64009C099R7168
11566A00267L05714A66481g0888B97363j25131b04749C50651j20985j6377H0432
$$ plain form
11555 46828 321147 319684 143333 -122054 11357 -40065 -104582 168981 138339 46768 180054
11544 180054 210501 127780 100064 164509 -94037 369225 101504 44939 242076 -31148 -264259
11533 -264259 361993 384257 143350 -54990 215855 106310 417630 61607 -34004 -107259
11523 -107259 -76862 164279 -28856 245839 109299 293714 120352 240672 235496 -108606
11512 -152934 166320 48647 72239 26972 23296 -305752 -55755 -107272 18122 7288 -71196
11500 49886 238657 -196886 127004 -126908 -167814 270842 -169867 85952 222339 -25927
11489 -89787 392507 98014 427432 116729 -59028 -38082 265014 140359 257805 12431
11478 -253318 16439 52287 324872 147428 184355 -157038 410793 12487 -101426 177319
$$ packed form
11555D6828K74319j463A43333a22054A1357d0065o4517A68981l0642D6768J33286
11544A80054L0447q2721k7716O4445i4037C69225A01504D4939J97137c1148k33111
11533b64259C61993K2264A43350e4990B15855A06310L11320F1607c4004p3255
11523a07259L0397A64279b8856B45839A09299J84415A20352J20320n176a08606
11512a52934A66320D8647K3592B6972l676c05752e5755n1517A8122G288g1196
11500D9886J88771a96886A27004a26908m0906B70842a69867H5952J36387b5927
11489h9787C92507I8014L29418A16729e9028K0946B65014j24655J17446A2431
11478b53318A6439L5848K72585A47428L6927a57038D10793A2487a01426A77319
$$ plain form
11467 91856 -164977 95933 -90267 289126 175864 -17304 97486 352772 -8570 135234 71383
11456 71383 407175 121042 381857 33484 63711 80407 -67222 173831 224037 -173429 120110
11444 419909 -32148 127394 233098 47596 257469 -337981 -994 -160200 299373 -18725 235090
11432 -148255 85619 92123 412440 279210 -166806 -118178 169627 65728 -62598 -21427 102689
11420 -24920 127553 130214 55750 203287 325690 -246811 23858 224049 -107238 -108120 -75601
11409 -75601 -168114 73974 73976 248969 804 -427546 2363 -17871 -130708 293056 47984 121812
11397 121812 481865 -97432 -60233 -191334 -212196 -166278 50607 -36196 72191 -302303 -137365
11385 -150862 75102 434576 -31662 -27212 142815 -348001 -78778 104984 -49408 19616 -52208
$$ packed form
11467I1856a64977I5933i0267B89126j13262a7304I7486K55286h570A35234o3851
11456G1383L35792A21042K60815C3484L0227J6696f7222A73831N0206a73429A20110
11444D19909c2148A27394J05704D7596K09873c37981i94j59206B99373a8725B35090
11432a48255H5619O504L20317j33230a66806M8628A69627F5728f2598b1427A02689
11420b4920A27553K661E5750J47537J22403b46811B3858K00191a07238q82L2519
11409g5601r2513G3974KJ74993H04d27546B363a7871j12837B93056D7984P3828
11397A21812L60053i7432L7199j31101k0862M5918E0607c6196G2191c02303a37365
11385a50862G5102L59474c1662M450A42815c48001g8778A04984d9408A9616e2208
$$ plain form
11373 34173 -68947 -18723 -91515 -145721 -50720 235643 293608 121028 -117720 -28623 312912
11361 58801 304560 -236494 -214602 -202783 -286124 -120981 285192 198977 197280 165509 165251
11350 165251 -42533 -180187 237609 100270 177668 -183346 182032 -110761 173296 -120533
11339 30160 -1343 33117 470803 247473 -15397 179426 -35914 -179344 -2707 -333320 -89344
11327 -137708 263684 -2701 270830 -7021 -43788 -3550 196312 71144 -138177 -179053 -30607
11315 -26909 -125664 -3130 -141627 210532 257941 71778 -8247 300662 21282 -123329 -109925
11304 -109925 226304 -214890 -173779 65463 88369 152909 110219 164393 135187 -248229 3940
11292 -368125 -97199 -44600 315008 -231846 82960 292947 -9315 -169509 -121668 78552 255498
$$ packed form
11373C4173f8947a8723p2792n4206e0720B35643N7965A21028a17720b8623C12912
11361E8801K45759b36494K1892J1819q3341a20981B85192q6215j697l1771k58
11350A65251d2533j37654B37609A00270P7398a83346A82032a10761A73296a20533
11339C0160a343C3117M37686k23330a5397A79426c5914j43430b707l30613h9344
11327a37708B63684b701B70830g021l6767c550A96312G1144a38177m0876c0607
11315b6909r8755c130j38497B10532M7409G1778h247C00662B1282a23329J3404
11304a09925B26304b14890M1111F5463K2906O4540m2690N4174k9206b48229C940
11292c68125i7199d4600C15008b31846H2960K09987i315j60194M7841G8552J76946
$$ plain form
11281 255498 -64977 327678 -153213 -226709 -133498 -109394 -71338 -209198 315616 96257 32806
11269 95770 25358 -311926 -181259 82297 -145277 -169853 -296 94797 82973 -11632 -114025
11258 -114025 113571 -142996 124657 -248858 1110 126811 -81530 105859 57612 -214520
11247 111972 -33139 -44522 -115057 -115137 -53210 -254101 -82997 208126 -110069 41687 -177201
11235 282380 -73 80034 96204 -102538 78153 -104086 191919 76456 -249863 -134282 17512
11223 -446527 189927 -249441 -259478 -31954 -139297 -187067 275707 58304 -70330 296933
11212 -70817 176894 -169598 68658 1211 205206 -228543 134283 27144 71634 -276701 -140741
11201 -140741 -50291 323955 -34 -254243 -251534 -290581 -222519 244696 -109013 270112 127832
$$ packed form
11281B55498f4977C27678a53213p3496R3211K4104L8056j37860C15616I6257C2806
11269I5770B5358c11926J30667H2297a45277k4576b96I4797j1824a1632j02393
11258a14025A13571a42996A24657b48858A110J25701h1530A05859m8247b14520
11247A11972c3139j1383p0535q0e3210k00891h2997B08126a10069D1687a77201
11235B82380g3H0034J6170a02538G8153a04086A91919G6456b49863J15581A7512
11223d46527A89927b49441j0037c1954j07343m7770B75707E8304g0330B96933
11212g0817A76894a69598F8658A211K03995b28543A34283B7144M4490b76701J35960
11201a40741e0291C23955c4k54209K709l9047O8062B44696a09013B70112A27832
$$ plain form
11189 100322 -155344 -27091 -404473 -319439 172560 206282 13543 -225179 225761 188057
11179 188057 155654 -5295 141904 31682 -175065 -117893 82099 -63803 -163402 -26648 36995
11167 -242457 -163940 -161509 17806 -51583 -298169 65038 120065 99906 -85386 345982 -46669
11155 -194932 222077 189574 -143020 -115978 -27095 72492 -56595 -63158 147448 -137061 -208728
11144 -208728 139724 316347 -23343 -310456 -195365 226160 -132433 -107337 -11277 -219261
11134 -219261 -32694 99570 96964 25173 35832 -148990 258294 23704 -16334 -260350 134882
11122 -259256 -237004 -83728 -108448 222746 69694 -61095 -386997 -105041 -111916 -18800 -195388
11111 -195388 176655 -18316 119957 190131 146918 -155675 212506 148001 254075 254235 -53930
$$ packed form
11189A00322a55344b7091l77382Q5034A72560L3722A3543b25179B25761l7704
11179A88057l2403e295A41904C1682a75065N7172H2099f3803r9599b6648C6995
11167b42457P8517K431A7806e1583k46586F5038N5027k0159h5386C45982d6669
11155a94932B22077l2503a43020K7042b7095G2492e6595o563A47448a37061p1667
11144b08728A39724J76623b3343k87113J15091B26160a32433K5096a1277k07984
11134b19261c2694I9570k606B5173J0659a48990B58294B3704a6334k44016A34882
11122b59256K2252h3728k4720B22746F9694f1095l25902a05041o875a8800j76588
11111a95388A76655a8316A19957P0174m3213a55675B12506o4505J06074J60e3930
$$ plain form
11099 48410 203489 55318 -4871 418727 135629 -223661 133818 193548 -73335 80041 -10890
11087 66970 269337 296579 638825 314648 82258 29337 -238104 19051 -2530 14848 -39204
11075 38431 172469 726771 22776 202396 197371 -30852 159398 -13495 140684 -23944 -234934
11064 -234934 368540 119585 412304 305482 221681 336985 174307 -29107 60286 241852
11054 241852 317778 332419 347586 462531 261697 237392 160633 611721 481874 202056
11043 555350 771779 475928 729256 808175 846170 553124 537767 601092 542949 852050
11033 852050 662118 808996 784721 623439 405967 928912 594266 778574 936180 580780
11023 580780 721106 567860 490455 914996 542240 577960 653250 519343 518671 578759 1060462
$$ packed form
11099D8410J55079E5318d871D18727A35629b23661A33818N9730g3335H0041a0890
11087F6970K02367K7242L42246C14648H2258B9337b38104A9051b530A4848c9204
11075C8431J34038N54302B2776J79620n025c0852A59398a3495A40684b3944k10990
11064b34934C68540A19585K92719j06822q3801J15304j62678b9107F0286J81566
11054B41852P5926J4641J5167J14945k00834k4305p6759M51088j29847B02056
11043E55350K16429k95851K53328P8919L7995k93046j5357O3325n8143L09101
11033H52050j89932J46878k4275j61282k17472N22945l34646J84308J57606l55400
11023E80780J40326j53246p7405M24541l72756L5720P5290j33907o72O0088M81703
$$ plain form
11012 1060462 434249 907785 760343 447255 590282 746903 497347 468634 478520 387462
11002 387462 671884 618374 734047 383007 760833 260330 665477 517238 530140 592903
10992 592903 467321 726195 770126 457110 683955 757092 371267 485754 686323 378614
10982 378614 424381 491504 852642 662492 606447 588665 998540 788401 443949 995977
10972 995977 701976 558694 1042964 1217285 814963 1246486 1446923 1141706 1087568 1377311
10962 1377311 1702727 1318022 1821257 2294551 2249233 2448616 2542008 2377808 2448252 2209182
10952 2209182 2056086 1693621 1950914 1724322 2069283 2076079 1784578 1897872 1826195 1858244
10942 1858244 2017592 2069225 1569778 1911549 1508739 1356762 1161166 893365 713905 551229
$$ packed form
11012A060462D34249M73536j47442l13088J43027J56621k49556k8713R886r1058
11002C87462K84422n3510J15673l51040L77826B60330M05147j48239J2902O2763
10992E92903j25582K58874M3931l13016K26845P3137C71267J14487K00569l07709
10982C78614M5767O7123L61138j90150n6045j7782M09875k10139l44452N52028
10972I95977k94001j43282M84270J74321m02322M31523K00437l05217n4138K89743
10962A377311L25416l84705N03235M73294m5318J99383R3392j64200P0444k39070
10952B209182j53096l62465K57293k26592L44961O796k91501J13294p1677L2049
10942A858244J59348N1633m99447L41771m02810j51977j95596k67801j79460j62676
$$ plain form
10932 551229 238194 494081 415173 359801 224456 499644 453279 338628 227416 164670
10922 164670 35331 155494 251095 133255 94302 -141985 103980 276907 62521 334503
10912 334503 348360 181329 -48782 -31608 -225863 -88820 61132 276233 161714 -143556
10901 -118287 89563 379168 136675 99151 328808 90776 328149 -225314 184801 16429
10890 -177370 162983 -43116 -190361 225841 307281 276156 -140851 -306044 239915 -80143
10879 -95597 14144 -99557 88520 -4079 -75759 -208591 148429 258175 87450 285429 48391
10867 73950 256531 349857 -127181 239380 -137651 65428 -218738 66885 -160255 -8589 -137412
10856 -137412 198325 1509 312761 -87152 76019 -193175 297361 -160411 -86164 71540 -159351
$$ packed form
10932E51229B38194K55887p8908n5372j35345K75188m6365j14651j11212o2746
10922A64670C5331J20163R5601j17840l8953a41985A03980J72927F2521K71982
10912C34503J3857j67031d8782J7174j94255h8820F1132K15101j14519a43556
10901a18287H9563K89605A36675l7524K29657I0776K37373b25314A84801A6429
10890a77370A62983d3116j47245B25841Q1440l1125a40851j65193B39915h0143
10879i5597A4144i9557H8520d079p1680j32832A48429J09746H7450J97979D8391
10867G3950J82581R3326a27181B39380a37651F5428b18738F6885a60255h589j28823
10856a37412A98325A509L11252h7152G6019a93175B97361a60411P4247G1540a59351
$$ plain form
10844 -352734 11421 235541 -23518 82395 -131820 211221 -59185 -34310 -147501 216812
10833 -136166 16173 -96070 -176357 44160 -49122 224973 -182543 117276 269363 108825
10822 158055 -348645 219131 114892 77654 -236243 -117918 -237020 -210926 137204 -223995
10811 -175723 64231 -31398 168761 -165706 -294561 183078 -91964 173584 -170327 -147700
10801 -147700 -85239 175771 -190681 -115450 7854 13137 233302 -88182 286874 10231 -134149
10789 52427 102367 -98685 195776 181712 -242721 77276 -83106 -109361 -294784 -65317 5544
10777 -152890 -255647 61037 -283198 -364871 5172 40464 -87203 219748 -211761 -206402 -178138
10766 -178138 199040 -368862 73688 -282082 -151889 -174457 27246 -45694 -188079 179662
$$ packed form
10844c52734A1421K24120b3518H2395a31820B11221e9185K4875j13191B16812
10833a36166A6173i6070q0287D4160d9122B24973a82543A17276J52087A08825
10822A58055c48645B19131j04239l7238b36243a17918j19102K6094A37204b23995
10811a75723F4231c1398A68761a65706j28855A83078i1964A73584a70327K2627
10801a47700O2461A75771a90681P5231G854N283K20165h8182B86874A0231a34149
10789E2427M9940i8685A95776j4064b42721G7276h3106k6255j85423f5317E544
10777a52890j02757F1037b83198q1673E172L5292h7203B19748b11761N359K8264
10766a78138A99040c68862G3688b82082J30193k2568B7246d5694j42385A79662
$$ plain form
10755 -98738 237051 237268 250541 -266888 135313 -101611 -186151 -361252 -8023 -122769 123509
10743 -285413 -85875 -179201 122641 11426 196564 -149548 73570 87906 67642 -322680 -66136
10731 36877 231 135108 60054 188209 -146133 -337263 224429 138743 198805 -80785 -236856
10720 -236856 -34108 -86176 -67695 120082 101563 26198 37639 -2470 -106177 97350 2237
10708 196976 135155 180151 128853 -117367 -123924 144161 -109036 -1818 -251593 -38654 -105656
10697 -105656 139893 19053 -104422 -257800 138150 2232 -27300 -189388 -99363 -159221 -33487
10685 37197 -85171 -232617 -1676 113159 158445 86073 55844 -116295 -7560 186751 45113
10673 -183386 -41172 45799 -44698 19527 -211828 -215 -32051 306718 -32255 99955 55616
$$ packed form
10755i8738B37051K17J3273b66888A35313a01611q4540j75101h023j14746A23509
10743b85413h5875r3326A22641A1426J85138a49548G3570J4336k0264c22680f6136
10731C6877B31J34877F0054J28155a46133j91130B24429q5686O0062h0785j56071
10720b36856c4108n2068J8481A20082j8519B6198J1441b470j03707I7350B237
10708A96976o1821M4996n1298a17367o557A44161a09036a818k49775c8654o7002
10697a05656A39893A9053a04422j53378A38150B232b7300j62088R0025n9858c3487
10685C7197h5171j47446a676A13159M5286p2372l0229a16295g560A86751D5113
10673a83386d1172D5799d4698A9527b11828b15l1836C06718c2255I9955m4339
$$ plain form
10662 55616 -3354 -122116 -148457 164498 -92006 84813 -49550 277295 94403 -394741 -76829
10650 -118221 13942 -51337 -33406 -4852 -240907 -166018 175658 118730 -110060 -70309 131899
10638 -329729 -196491 -59771 38336 236068 55561 283254 46084 201316 -161585 -85325
10628 -85325 -179830 -80272 445209 -50749 -132570 -11339 -13945 3471 -233118 178384 11888
10616 54069 -53247 -4930 -198340 -8084 -226128 -143758 -98923 176553 251843 -172354 -479686
10605 -479686 -348487 34289 -144444 154688 -93458 45562 238714 -70187 -15282 -31000 -266720
10594 -266720 -48635 2335 -162642 -75404 -486996 114699 -9482 39266 -141728 -3248 12789
10582 144913 118285 91800 -76178 240834 183400 -360687 314816 236169 -293905 200381
$$ packed form
10662E5616c354j18762k6341A64498i2006H4813d9550B77295I4403c94741g6829
10650a18221A3942e1337J7931d852k36055P4889A75658n6928a10060L9751A31899
10638c29729J33238e9771C8336J97732E5561K27693D6084J55232a61585P6260
10628h5325r4505h0272D45209e0749q1821a1339k606C471b33118A78384A1888
10616E4069e3247d930j93410h084k18044Q2370M4835A76553P5290a72354l07332
10605d79686J31199C4289a44444A54688i3458D5562J93152g0187a5282j5718k35720
10594b66720d8635B335a62642g5404m11592A14699i482C9266a41728c248A2789
10582A44913k6628k6485g6178B40834n7434c60687C14816p8647b93905B00381
$$ plain form
10571 -281279 248855 -70872 78992 -199984 -58713 -24904 -2479 -211641 189771 -290802 81259
10559 75749 -76209 -146167 -129411 -66776 30938 -40323 21874 -202223 -243939 -211439 -132036
10548 -132036 -118906 -232761 -82164 20963 156389 -1419 -42487 -117859 -327645 251011 31685
10536 -197385 136397 -326593 228512 -104174 36577 -206048 -234002 -134369 -117447 11665
10525 178661 392500 224397 43593 -105321 311304 -130003 -87701 -95112 210934 451387
10515 451387 -151707 -13812 -293432 -354271 -317943 120637 162769 -108199 213909 -13441
10504 -96186 -142513 132979 14714 28460 -365489 40645 -323229 -257516 -64120 222828 -256818
10492 209126 -6755 189755 -52637 -78250 -3406 -464689 192006 -191369 71328 -122657 -114699
$$ packed form
10571b81279B48855g0872G8992a99984e8713b4904b479k09162A89771b90802H1259
10559G5749g6209o9958J6756O2635C0938d0323B1874b02223m1716L2500P9403
10548a32036J3130j13855h2164B0963J35426a419m1068p5372k09786B51011C1685
10536a97385A36397c26593B28512a04174C6577b06048k7954R9633J6922A1665
10525A78661K13839j68103D3593a05321C11304a30003M2302p411B10934K40453
10515D51387a51707a3812k79620o0839L6328A20637M2132a08199B13909a3441
10504i6186m6327A32979A4714J3746c65489D0645c23229O5713f4120B22828b56818
10492B09126f755A89755e2637k5613c406m61283A92006a91369G1328a22657P958
$$ plain form
10481 -114699 116692 8718 -55581 166145 -121805 54720 17565 -121954 -370287 21699 39211
10470 39211 -112356 359631 8462 -59920 551139 637386 139583 231305 39402 259509 296742
10459 296742 -133291 206876 -226511 168342 40099 -94640 114134 211088 -297293 -290985
10449 -290985 157098 89609 33637 13848 56408 -26868 -101719 39763 -206351 46753 81369
10438 81369 25970 200488 -86624 153929 285879 -479333 171323 -304262 102306 -104623
10427 26510 -110113 71097 -263338 -76488 386823 -30177 46476 96703 311563 63953 18683
10415 -64281 90166 -155979 -10518 186137 -194555 -78029 -1301 31563 -327162 -12964 74372
10403 -75912 325573 -77903 -193472 -159754 -23164 -291813 30129 -91226 -123564 -14597 -286762
$$ packed form
10481a14699A16692H718e5581A66145a21805E4720A7565a21954k48333B1699J7512
10470C9211a12356C59631H462e9920E51139Q6247A39583R1722C9402K20107L7233
10459B96742a33291B06876b26511A68342D0099i4640A14134R6954b97293O308
10449b90985A57098o7489C3637A3848M2560b6868p4851C9763b06351D6753L4616
10438H1369B5970J74518h6624A53929J31950d79333A71323c04262A02306a04623
10427B6510a10113G1097b63338g6488C86823c0177D6476N0227K14860F3953A8683
10415f4281I0166a55979a0518A86137a94555g8029a301C1563c27162a2964G4372
10403g5912C25573g7903j15569L3718b3164k68649C0129i1226l2338a4597k72165
$$ plain form
10392 -286762 -39580 -192378 -326028 115077 -56153 38487 227468 -54176 35934 80975 -30482
10380 -44886 -227638 338215 -85095 -111354 6813 242400 -39333 94466 -105721 58055 361939
10369 361939 172884 265972 -146318 294312 306936 312839 -35550 327932 310202 330543 197732
10358 197732 21238 340708 104034 220931 384616 289754 297325 359698 384638 167849 189003
10347 189003 -22093 129090 -119519 -59241 99279 -48725 192131 353923 16017 99618 276378
10336 276378 467422 551947 325569 478406 506223 158256 440843 328833 491575 212669
10325 234011 323009 106010 135814 397186 10555 213979 294762 317998 -196254 -346572
10315 -346572 331106 203593 22823 25971 154761 52452 84406 447747 174300 270402 221125
$$ packed form
10392b86762c9580j52798j33650A15077e6153C8487J88981e4176C5934M5041c0482
10380d4886j82752C38215h5095k6259F813K35587c9333I4466a05721E8055L03884
10369C61939A72884R3088a46318B94312J2624N903c5550C27932j7730K0341j32811
10358A97732B1238L19470A04034J16897J63685r4862P571O2373K4940A67849K1154
10347A89003b2093A29090a19519e9241I9279d8725A92131J61792A6017Q3601J76760
10336B76378J91044Q4525k26378J52837K7817A58256K82587j12010J62742B12669
10325B34011Q8998A06010K9804K61372A0555K03424Q0783K3236a96254j50318
10315c46572C31106j27513B2823L148J28790E2452L1954L63341A74300R6102m9277
$$ plain form
10304 221125 168445 -102284 76509 69801 18113 295224 197118 -196339 115564 245942 92420
10292 -216066 -62840 -153839 471003 -54856 -92826 211609 199681 26542 -339926 289176 152429
10281 152429 -2767 -138778 -75471 219849 -34050 52777 -67714 -392183 -186317 -180229 -181013
10270 -181013 -172728 -87903 -43344 11523 238835 -116073 48759 90067 21933 -182252 -249793
10259 -249793 -51300 51301 123595 -138586 205015 -132955 115705 -7685 -130429 17551 113837
10248 113837 206593 242025 104546 335278 630006 664935 273568 184804 483252 377969
10238 377969 338414 65951 174429 76335 267366 129247 243717 -219101 157261 40874
10227 -165103 -29831 221410 240250 -336290 165861 165687 -12932 67788 -204628 -78997 165312
$$ packed form
10304B21125n2680a02284G6509o708A8113K77111r8106a96339A15564J30378I2420
10292b16066f2840r0999D71003e4856l7970B11609j1928B6542c39926B89176j36747
10281A52429b767j36011O3307B19849c4050E2777f7714l24469a86317O088p84
10270a81013Q285Q4825d3344A1523K27312a16073D8759M1308B1933a82252o7541
10259b49793e1300E1301P2294a38586B05015a32955A15705g685j22744A7551R6286
10248A13837R2756L5432A04546K30732K94728L4929B73568q8764K98448j05283
10238C77969l9555F5951J08478G6335J91031A29247J14470b19101A57261D0874
10227a65103b9831B21410J8840c36290A65861j74a2932F7788b04628g8997A65312
$$ plain form
10215 -421142 54902 106547 -172017 -22980 -78283 -117803 124387 -162293 -382167 -49241 43104
10203 -131484 114138 187307 149944 -11834 -246441 -6110 -99995 -101319 -150945 29246 -189983
10191 57111 57004 -60057 -129535 -316224 -19953 -137905 -163720 -454593 169586 35811 -45153
10179 28434 11676 13496 -88679 109061 49690 -227653 226446 -79935 -211701 117777 173812
10168 173812 -41169 -15052 -205244 -19752 77750 -144519 -307831 -20779 -53479 -7040 28793
10156 50745 -20077 32540 -218022 -396344 106852 65522 39578 -47521 -311395 -310379 104084
10144 -329477 -104995 77228 -101280 -127053 -105017 141529 -7389 161333 -212328 -123137 47729
10132 -146174 -169262 11876 -36729 286905 70080 -241046 73848 -112644 1898 143305 -176588
$$ packed form
10215d21142E4902N1645a72017b2980n5303l9520A24387a62293k19874d9241D3104
10203a31484A14138P3169l7363a1834k34607f110r3885j324m9626B9246a89983
10191E7111j07f0057o9478j86689a9953j17952k5815k90873A69586C5811d5153
10179B8434A1676J820h8679A09061D9690b27653B26446g9935j31766A17777N6035
10168A73812d1169a5052j90192a9752G7750a44519j63312b0779l2700g040B8793
10156E0745b0077C2540b18022j78322A06852m1330k5944d7521k63874J016A04084
10144c29477a04995G7228a01280k5773K2036A41529g389A61333b12328Q9191D7729
10132a46174k3088A1876c6729B86905G0080b41046G3848a12644A898J41407a76588
$$ plain form
10120 -176370 -110167 -52865 -292371 -150494 -210749 -30542 -287481 -150374 -73303 -295325
10110 -295325 -49751 -237825 -205011 -88694 -56689 -224675 -242523 -199277 72731 371788 467500
10099 467500 198763 63118 -85701 -321695 38044 -131865 -114472 -238446 -318148 -50347 30720
10087 -43364 102843 -217644 -35199 358102 -92616 25228 28458 -189394 -272995 -231924 6 -64549
10074 -95694 361543 -54328 55092 -3928 5390 -52287 -114996 -128874 -40179 -191281 -107920 -3987
10061 -326266 -330561 -133846 105579 1858 -146026 -131348 -116332 -130962 -368242 19072 -237890
10049 76821 -205151 92154 -155403 53488 332149 -86197 -244929 -3056 176872 110878 165040
10038 165040 226131 -420943 -63713 101262 -105677 -99037 -70570 -84363 267428 -255872 -51452
$$ packed form
10120a76370O6203e2865k39506J41877o0255c0542k56939J37107g3303k22022
10110b95325d9751j88074L2814h8694L2005j67986j7848M3246G2731K99057R5712
10099D67500A98763F3118h5701k35994C8044a31865J7393j23974p9702e0347C0720
10087d3364A02843b17644c5199C58102i2616B5228L230a89394q3601M1071Ff4549
10074i5694C61543e4328E5092c928E390e2287o2709j3878d0179j51102Q3361c987
10061c26266m295a33846A05579A858a46026J4678J5016j4630k37280A9072b37890
10049G6821b05151I2154a55403E3488K78661h6197j58732c056A76872o5994N4162
10038A65040O1091d20943f3713A01262a05677O640K8467j3793B67428b55872e1452
$$ plain form
10026 143510 -24702 -197016 -190152 -18802 145771 31560 -28523 -209615 -150700 146180 42082
10014 -52663 -308832 -242129 94865 -200879 -204484 -331665 -97325 -173307 -39469 192812 93030
10002 165641 -330702 -367907 303107 -326945 -195396 -162709 -92358 66453 270301 -345774
9991 308870 -159607 127548 109856 -178865 -77783 -236267 -550334 128977 6918 -229630
9980 -78450 -8517 -35605 69093 -31389 -32067 71394 -133284 -27280 60315 49108 -159190 -235412
9968 -235412 36133 23514 -220793 -125405 92235 -4829 -152551 -278683 33778 -188458 173980
9956 227872 243842 -17284 76910 -59064 9988 65756 -260243 23268 -165610 -55150 -145048
9945 -145048 95862 -52302 76 -198660 131729 -202232 281592 -317375 -106743 148436 -88121
$$ packed form
10026A43510b4702j72314O864a8802A45771C1560b8523j81092N8915A46180D2082
10014e2663k56169O6703I4865b00879l605j27181i7325p5982c9469A92812I3030
10002A65641c30702l7205C03107c26945J31549L2687P0351F6453K03848c45774
9991C08870a59607A27548j7692a78865g7783j58484l14067A28977F918b29630
9980g8450h517k7088F9093c1389o78G1394a33284b7280F0315j1207a59190p6222
9968b35412C6133j2619b20793R5388I2235d829j47722j26132C3778a88458A73980
9956B27872J5970a7284G6910e9064I988N5768b60243B3268a65610e5150q9898
9945a45048I5862e2302G6a98660A31729b02232B81592c17375a06743A48436h8121
$$ plain form
9933 308268 -479855 -213578 181636 -326645 -198680 -124349 -93724 -264577 -64244 211984
9922 -279405 -365963 -27187 68917 -10768 -84105 -171812 -273535 -193727 -88154 -224060 194306
9910 -89106 -402116 -34326 -104065 147924 91037 -287383 -139017 -230854 -74504 33221 -107467
9898 -223581 -57472 -55268 83348 -58540 -162772 37096 -254478 115696 123979 -240899 -289942
9887 -289942 -41718 -204618 -219305 -85313 3766 -85225 -227334 -68775 90557 202384 279082
9876 279082 211352 -146751 15713 -220698 -188708 28520 85502 -34781 -51745 6636 -347882
9864 -121001 -285339 -425115 -193524 194126 91039 44908 -30752 -348767 -49896 -189558
9854 -189558 -77707 -153630 -157956 -260240 -89944 -192440 -124083 984 -147906 53347 -8252 -87195
$$ packed form
9933C08268d79855b13578A81636c26645J27965P4331L0625j70853f4244B11984
9922b79405q6558b7187F8917a0768p3337q7707j01723P9808h8154j35906A94306
9910h9106l13010c4326o9739A47924n6887b87383a39017r1837g4504C3221a07467
9898b23581e7472K204H3348e8540j04232C7096b54478A15696Q283b40899m9043
9887b89942d1718j62900j4687h5313C766h5225j42109f8775I0557J11827P6698
9876B79082o7730a46751A5713b20698L1990B8520N6982c4781j6964F636c47882
9864a21001j64338j39776a93524A94126I1039D4908c0752l18015d9896j39662
9854a89558g7707p5923m326j02284h9944j02496O8357I84a47906E3347h252p8943
$$ plain form
9842 -87195 -103412 -132717 216810 -188578 125606 -221127 7728 -51266 -4195 -142276 11287
9830 -403269 -117572 115620 76947 -22814 -51033 -22793 133447 95335 69598 169038 271042
9819 271042 -79998 -363105 -56976 -110620 -213294 197135 69543 338119 -315494 -1853 -6861
9808 -6861 -166059 -240864 -118478 23966 -404948 -92230 -83954 -156441 171098 55971 71074
9797 71074 238190 333561 -69165 47879 35128 -35919 28246 -427513 -153194 -86437 140654
9785 -458925 22452 -11230 51179 -34440 25903 48855 228827 -148950 159375 -154350 -174081
9774 -174081 -303762 21319 21420 -62306 -165221 -61798 185095 -87002 -300914 126642 -29548
9762 -1227 -63394 -307325 23966 -309909 -285151 -210384 -103658 69037 -170573 -108838 77251
$$ packed form
9842h7195j6217k9305B16810a88578A25606b21127G728e1266d195j38081A1287
9830d03269a17572A15620l8673b2814k8219b2793A33447l8112k5737R9440J02004
9819B71042g9998k83107e6976n3644j02674A97135F9543K68576c15494a853n008
9808f861j59198p4805a18478B3966d04948i2230Q276p2487A71098E5971J5103
9797G1074J67116R5371f9165D7879j2751c5919B8246d27513a53194O6757A40654
9785d58925B2452a1230E1179c4440B5903K2952J79972a48950A59375a54350j9731
9774a74081j29681B1319J01f2306j02915f1798A85095h7002k13912A26642b9548
9762a227o2167k43931B3966c09909K4758P4767a03658F9037a70573O1735G7251
$$ plain form
9750 -53586 108860 -27391 -41645 131683 -164472 54790 -42497 -36645 -231127 -52323 -95811
9739 -95811 187306 -83797 -123864 -222745 27177 54348 17825 102304 -293922 -281165 -333822
9728 -333822 73141 -137586 -14895 -260929 -79965 -124424 -119506 -331945 14901 71544 29379
9716 -257625 -314798 78470 160400 -9366 -286875 -185915 -120868 208635 -158910 33256 -300107
9704 269743 -48058 -129504 111036 62938 31599 27337 101921 -125981 -39971 -117250 -82398
9693 -82398 -638079 55234 -158356 201686 -20076 105519 144389 240394 -121876 206927 127451
9682 127451 389541 -146474 -204 -164447 -59795 155253 -31983 50819 -150906 -198510 -194927
9671 -194927 101352 -89275 -5602 -153374 -361691 -428518 226923 10354 244805 -173758 194485
$$ packed form
9750e3586A08860b7391j4254A31683a64472E4790d2497N852j94482e2323m3488
9739i5811A87306h3797m0067r8881B7177K7171A7825Q4479b93922J2757n2657
9728c33822G3141a37586a4895k46034g9965m4459M918k12439A4901N6643B9379
9716b57625n7173G8470Q1930i366k77509J00960O5047B08635a58910C3256c00107
9704B69743d8058q1446A11036m8098l1339m262P4584a25981c9971p7279L4852
9693h2398n55681E5234a58356B01686b0076A05519L8870R6005a21876B06927p9476
9682A27451K62090a46474b04j64243e9795A55253c1983E0819a50906m7604L583
9671a94927A01352h9275e602j47772k08317o6827B26923A0354K34451a73758A94485
$$ plain form
9659 -68747 -149959 -316517 14826 86875 -134442 -390751 24687 17965 -323765 37112 -20317
9647 -149627 110947 -87728 212417 187659 -305684 -43167 12003 61038 -75760 -125638 -135093
9636 -135093 -31607 -597 -235538 199039 -203022 52281 -138278 -98746 -111574 -262724 -73894
9624 34784 111996 -62055 -189575 -510118 -325588 189191 -216775 230209 -58355 -5087 -287179
9613 -287179 13098 93551 -120629 -116727 -167508 292214 -250042 -11906 -113522 -184309 -61252
9601 460 34244 -192796 -65862 146882 -19808 -50236 28252 62376 25216 -125428 -235835
9590 -235835 -109109 97735 159386 112663 -161682 -10840 -52536 201746 249162 -305012 -230024
9579 -230024 70308 -236461 -193847 -159866 -228499 -91622 -16512 -106396 62533 57931 -108015
$$ packed form
9659f8747q1212j66558A4826P2049a34442k56309B4687o722c23765C7112b0317
9647a49627A10947h7728B12417k4758c05684d3167A2003M9035g5760m9878r455
9636a35093c1607e97k34941A99039b03022E2281a38278L9532j2828j51150g3894
9624C4784P7212f2055j27520l20543J84530A89191b16775B30209e8355e087k82092
9613b87179A3098Q0453a20629L902n0781B92214b50042a1906j01616p0787f1252
9601D60L3784a92796f5862A46882a9808l0428B8252L4124B5216a25428j10407
9590b35835a09109I7735O1651m6723a61682a0840m1696B01746M7416c05012P4988
9579b30024G0308b36461M2614L3981o8633i1622a6512q9884F2533m602a08015
$$ plain form
9567 -375830 11577 -96197 -406373 -363638 -62931 158762 283851 -130554 -181716 -127618 -85442
9556 -85442 -251658 -98614 -187886 21901 -150020 217717 -328407 -47528 20310 -274931 136628
9544 -74860 92361 -12545 -279560 -115614 -120579 132033 -185865 90673 -79372 -105548 87713
9532 -98587 -156602 -180363 424044 -175333 192871 -241227 -181621 267098 -126715 -388489
9522 -388489 -9292 -47098 -223601 61757 -220556 -34452 -39747 -135681 -74470 -225452 -9869 -26759
9510 -26759 253418 9262 -108740 -157032 -15332 -229194 244437 -99676 -185473 -13554 238819
9498 -65200 -406623 290297 -87045 -31322 76496 225236 -120989 224513 -175761 333058
9487 -30056 38248 -136765 -33190 -70400 -40158 -37679 -297985 -2254 42871 311425 -41250 -68452
$$ packed form
9567c75830A1577i6197l10176M2735f2931A58762J25089a30554n1162N4098M2176
9556h5442j66216i8614q9272B1901a50020B17717c28407d7528B0310b74931A36628
9544g4860I2361a2545k67015a15614m965A32033a85865I0673g9372k6176H7713
9532i8587n8015k3761D24044a75333A92871b41227N9606B67098a26715k61774
9522c88489i292l7806j76503F1757b20556c4452n295r5934O1211j50982i869j6890
9510b6759B53418I262a08740m8292a5332k13862B44437i9676q5797a3554B38819
9498f5200l41423B90297h7045c1322G6496J48740a20989B24513a75761C33058
9487c0056C8248a36765c3190l7210L0242K479k60306b254D2871K68554d1250k7202
$$ plain form
9475 -68452 91382 88512 -64586 -101100 102718 28036 -264500 205734 -72741 -190113 -70689
9463 387422 46471 -155884 -135285 -2018 96848 -303271 225420 -79485 -132001 27458 -71146
9451 159025 99024 117667 2248 -53808 -175534 144330 -122375 49300 -6173 47522 -84074
9439 -183233 87953 -29776 234935 24658 -41157 -228286 122653 157109 -206969 -219097 -87888
9427 -70624 -111370 -5422 -105834 -83884 -21722 -86510 -154138 -61554 43698 134816 79309 -75125
9414 -218354 -14222 -95207 133533 -347685 24376 -170063 179605 -254275 -240654 -130053
9404 -130053 -151467 -330791 112920 -136653 125948 -27073 -150687 41686 -292035 -183954
9394 -183954 8197 -84735 -416646 -117628 -233554 -431379 -359808 -2684 -91450 27931 -9030
$$ packed form
9475f8452I1382k870f4586l6514A02718B8036b64500B05734g2741j17372g0689
9463C87422D6471a55884K0599b018I6848c03271B25420g9485n2516B7458g1146
9451A59025o0001J8643B248e3808j21726A44330a22375D9300f173D7522h4074
9439a83233H7953b9776B34935B4658d1157j87129A22653L4456b06969j2128h7888
9427g0624m0746e422j00412K1950b1722o4788o7628f1554D3698R1118n5507g5125
9414b18354a4222q0985A33533c47685B4376a70063A79605b54275J3621J10601
9404a30053k1414j79324A12920a36653A25948b7073j23614D1686b92035J08081
9394a83954H197h4735l31911a17628j15926j97825P1571b684q8766B7931i030
$$ plain form
9382 242718 175975 -249634 274873 -283090 94893 -278584 133670 -84361 -43561 29 19525
9371 19525 -253323 78417 111239 -121993 -210043 -87692 72020 -118153 147131 -190686 134218
9359 380224 103865 -219838 54399 402509 99634 74814 -161235 -336491 -332179 -281126 82925
9347 -173731 388548 269292 52487 18412 -11608 -255581 64751 36612 -35522 113953 -328785
9335 34360 9399 1397 33266 163323 14145 76273 182864 29850 271138 -273420 91606
9323 -35686 -108058 -326443 86671 -54425 -48936 15178 20340 -202544 43005 -77662 -162914 -54773
9310 -67236 -14430 -85765 -361943 -348523 -188082 -16098 226407 -149766 -46947 -53274 -174984
9299 -174984 -248210 -181929 -187952 -291112 -201212 -380137 -117323 -433588 252831 -163242 -189893
$$ packed form
9382B42718o6743b49634B74873b83090I4893b78584A33670h4361M0800B9J9496
9371A9525b53323G8417L2822a21993q8050h7692G2020a18153A47131a90686A34218
9359C80224A03865b19838E4399L48110I9634k4820a61235j75256M312N1053H2925
9347a73731C88548j19256E2487A8412a1608k43973F4751k8139c5522A13953c28785
9335C4360I399A397L1869J30057A4145O2128J06591B9850K41288b73420I1606
9323c5686p2372k18385H6671e4425N489A5178N162b02544D3005g7662q5252e4773
9310f7236a4430p1335k76178J3420J60441a6098B26407a49766d6947o327j21710
9299a74984p3226O6281o023j03160Q9900j78925a17323l16265B52831a63242k6651
$$ plain form
9288 -189893 85162 183148 1702 -99958 67436 -107393 -90778 -204036 -206959 -122861 56315 -145141
9275 -98075 85792 138463 -73068 234342 -72615 -280629 -83649 104556 504096 112472 -142667
9263 -333809 56181 -13940 -393443 -365360 102680 -163253 -204034 67417 -123030 124822 -242051
9251 20635 -235619 15045 112039 -330377 -209071 -46126 67753 -95428 129609 -248031 -312502
9240 -312502 -131690 30235 59386 289497 95570 177488 73887 189474 148265 -68116 -224615
9229 -224615 -99286 -461339 183804 -167417 -10303 -358030 -67299 -39664 -60867 55101 169147
9218 169147 -31385 56876 -51385 156374 112081 -12890 -17070 45825 -59828 239000 207544
9207 207544 -11937 -81232 -144365 39257 -260820 -50300 -9404 -186564 153259 71897 28830
$$ packed form
9288a89893H5162R7986A702i9958F7436a07393J6615j13258k923Q4098E6315a45141
9275i8075H5792N2671g3068B34342g2615k08014h3649A04556L99540A12472a42667
9263c33809E6181a3940l79503K8083A02680a63253m0781F7417a23030A24822b42051
9251B0635b35619A5045R6994c30377J21306d6126F7753i5428A29609b48031o4471
9240c12502a31690C0235K9151K30111I5570Q1918G3887J15587m1209f8116j56499
9229b24615i9286l62053A83804a67417a0303l47727f7299K7635k1203E5101J14046
9218A69147c1385E6876e1385A56374m4293a2890m180D5825e9828B39000l1456
9207B07544a1937o9295o3133C9257b60820e0300i404j77160A53259G1897B8830
$$ plain form
9195 -261564 131073 119240 -71512 -118351 206657 -185421 -239726 110967 -116216 -209259 -38983
9183 205115 98367 -107493 -457435 -311459 -199072 -45176 -27783 -204713 21900 -146614
9172 -167889 173495 -56027 -300043 43927 -138829 85238 -364041 -205177 150996 -528651
9161 -118343 170987 -185125 -109978 -203129 -334045 -149775 -2893 70374 -25039 90542 47154
9150 47154 100396 130420 70595 -153709 -169429 78244 -139456 273202 69107 182805 -16098
9138 -57030 31634 -214304 204217 -345714 -98059 98716 187099 -174479 -102722 -134708 -270659
9127 -270659 214233 30579 70778 116029 -119982 42787 61987 -157998 -63657 32337 110934
9116 110934 58527 -10224 251008 103422 -23154 -319846 -2320 -72848 -3158 -406571 18615
$$ packed form
9195b61564A31073j1833g1512m6839B06657a85421n4305A10967a16216r3043c8983
9183B05115I8367a07493l49942J45976J12387d5176J7393j76930B1900a46614
9172a67889A73495e6027k44016D3927a38829H5238c64041J58864A50996e28651
9161a18343A70987a85125P5147r3151j30916a49775b893G0374b5039I0542m3388
9150D7154N3242L0024n9825a53709j5720G8244a39456B73202F9107J13698a6098
9138e7030C1634b14304B04217c45714i8059I8716Q8383a74479P1757l1986j35951
9127b70659B14233C0579M0199M5251a19982D2787J9200a57998f3657C2337P8597
9116A10934n2407a0224B51008A03422b3154k96692b320p0528c158m03413A8615
$$ plain form
9104 122270 -61960 -112078 -26334 -16236 -250041 -279738 76066 -4628 101383 -160677 241193
9092 -327281 -207273 143293 -194349 -1727 3117 -40524 -271942 -157479 52121 210705 3062
9080 -128566 15075 79742 -117710 23547 182509 -162968 -84711 -222076 -241304 -78609 -110837
9069 -110837 -114796 -197797 -47248 57749 -204398 -110729 11328 43025 -45839 -149680 -197391
9058 -197391 263957 -269522 245885 -143458 67278 -184385 76586 -14766 -15269 61468 108565
9047 108565 190143 -192690 86921 -158067 144511 -231378 190315 158474 -65099 -121361 -185846
9036 -185846 -171556 174742 -51683 85624 -128736 -7805 -188978 -127116 -38294 -52350 65410
9024 -202133 -85193 -412836 -390589 -196234 -33569 -155984 -182337 33579 163969 -113835 53381
$$ packed form
9104A22270f1960n0118b6334J0098k33805k9697G6066d628A01383a60677B41193
9092c27281J20008A43293a94349a727C117d0524k31418J14463E2121J58584C062
9080a28566A5075O4667a17710B3547J58962a62968P8257j37365j9228g8609l2228
9069a10837l959q3001d7248E7749b04398R3669A1328L1697d5839j03841m7711
9058a97391B63957b69522B45885a43458F7278a84385G6586a4766n03F1468M7097
9047A08565Q1578a92690H6921a58067A44511b31378A90315l1841f5099n6262o4485
9036a85846J4290A74742e1683H5624a28736g805j81173O1862c8294j4056F5410
9024b02133h5193l27643K2247J94355c3569j22415k6353C3579J30390a13835E3381
$$ plain form
9012 -21308 -135981 55384 -167792 43704 -239171 -152752 41599 -314657 -143527 372160 -175589
9000 -198007 -263244 164861 28277 -44783 128085 -3787 3417 -51203 194136 -5350 -109361
8989 -109361 -6764 47107 243381 11617 -403783 -23221 -275291 -30890 -73465 -183303 206328
8977 -118224 -323465 -324665 -137845 -76595 -107010 137947 117157 -161349 222845 -94925 -34532
8965 49215 8644 -59332 20313 143341 -31034 -80922 -208303 -108312 -107243 -358213 41153 346230
8953 346230 -369910 -12781 205649 -200158 -166962 -206015 -116173 65855 -128258 -387669 -190991
8941 -128725 41525 -475591 162039 -95955 -224931 -441586 -301765 -137255 -27633 13614
8930 -194280 -156608 21112 -142154 140297 -274933 -13251 255193 102824 -479 -9498 294235
$$ packed form
9012b1308j14673E5384a67792D3704b39171Q6419D1599c14657a43527C72160a75589
9000a98007o5237A64861B8277d4783A28085c787C417e1203A94136e350j04011
8989a09361f764D7107J96274A1617d03783b3221k52070c0890m2575j09838B06328
8977a18224k05241j200a37845O1250l0415A37947k0790a61349B22845i4925c4532
8965D9215H644e9332B0313J23028c1034m9888j27381R9991J069k50970D1153L05077
8953C46230c69910a2781B05649b00158L3196l9053Q9842F5855a28258k59411a90991
8941a28725D1525d75591A62039i5955j28976k16655J39821a37255b7633A3614
8930a94280L7672B1112a42154A40297b74933a3251B55193A02824d79r019B94235
$$ plain form
8918 446738 220206 -133785 29122 391466 -4321 292405 201929 562614 790334 1393465
8908 1393465 2517497 4808684 10089084 6476811 2864741 1152834 811779 635756 277932
8898 285679 -3634 43974 65138 85059 210143 35111 264121 334653 58822 50510 191023
8887 191023 -11327 -43150 187431 160483 -17009 113943 105688 -184121 -99363 -67911 -79705
8876 -79705 -197047 -48165 -158593 -153436 -100307 66813 -435706 -307048 71785 120831 260811
8865 260811 -281816 -241945 -329601 35911 -2756 -260067 -63932 -239566 -42135 -120412 -100551
$$ packed form
8918D46738B20206a33785B9122L62344d321B92405r0476L60685K27720O03131
8908A393465J124032K291187N280400l612273B864741A152834l41055j76023B77932
8898B85679c634D3974K1164J9921J25084C5111K29010P0532E8822q312J40513
8887A91023a1327l1823A87431k6948a7009A13943q255a84121Q4758L1452j1794
8876g9705j17342d8165j10428N157N3129F6813d35706J28658G1785M9046J39980
8865B60811b81816L9871q7656C5911b756k57311f3932j75634d2135p8277J9861
$$ [...]
##END NTUPLES=NMR SPECTRUM
##END=
