
##TITLE=AC1007_S-149_6114592_zZLpfeKMET
##JCAMPDX= 6.0         $$ Bruker NMR JCAMP-DX V2.0
##DATA TYPE= NMR SPECTRUM
##DATA CLASS= NTUPLES
##ORIGIN= BRUKER
##OWNER= Administrator
$$ 1.72 TOPSPIN		Version 2.1
$$ 2012-05-14 19:27:15.500 -0500  Administrator@TOPSPIN
$$ Compression mode = diff/dup
##.OBSERVE FREQUENCY= 400.13188235
##.OBSERVE NUCLEUS= ^1H
##.ACQUISITION MODE= SIMULTANEOUS (DQD)
##.ACQUISITION SCHEME= undefined
##.AVERAGES= 64
##.DIGITISER RES= 22
##SPECTROMETER/DATA SYSTEM= spect
##.PULSE SEQUENCE= noesygpps1d.comp
##.SOLVENT NAME= COFFEE_meoh
##.SHIFT REFERENCE= INTERNAL, COFFEE_meoh, 1, 14.96662
##AUDIT TRAIL= $$ (NUMBER, WHEN, WHO, WHERE, PROCESS, VERSION, WHAT)
$$ ##TITLE= Audit trail, TOPSPIN		Version 2.1
$$ ##JCAMPDX= 5.01
$$ ##ORIGIN= Bruker BioSpin GmbH
$$ ##OWNER= Administrator
$$ $$ C:\Bruker\TOPSPIN/data/COFFEE/nmr/AC1007_S-149_6114592_zZLpfeKMET/62/pdata/1/auditp.txt
$$ ##AUDIT TRAIL=  $$ (NUMBER, WHEN, WHO, WHERE, PROCESS, VERSION, WHAT)
(   1,<2012-05-14 19:27:10.375 -0500>,<Administrator>,<TOPSPIN>,<go>,<TOPSPIN 2.1>,
      <created by zg
	started at 2012-05-14 19:15:40.062 -0500,
	POWCHK enabled, PULCHK disabled,
       configuration hash MD5:
       AF F2 23 6B 01 CD 40 DD E5 A1 38 A0 06 EA F7 77
       data hash MD5: 64K
       F5 6A 2C BE 9F C1 F2 A2 02 91 8A 1E CC 4F 9D 58>)
(   2,<2012-05-14 19:27:13.265 -0500>,<Administrator>,<TOPSPIN>,<proc1d>,<TOPSPIN 2.1>,
      <Start of raw data processing
       efp LB = 0.3 FT_mod = 6 PKNL = 1 PHC0 = 0 PHC1 = 0 SI = 128K 
       data hash MD5: 128K
       FB DC FA 07 53 26 F2 43 A3 E1 CD 56 5A DB CE 4A>)
(   3,<2012-05-14 19:27:14.765 -0500>,<Administrator>,<TOPSPIN>,<proc1d>,<TOPSPIN 2.1>,
      <pk PHC0 = 38.38074 PHC1 = 0 
       data hash MD5: 128K
       23 77 E9 33 BB 60 75 5B 1B CA F6 EA 11 98 51 F1>)
(   4,<2012-05-14 19:27:15.000 -0500>,<Administrator>,<TOPSPIN>,<proc1d>,<TOPSPIN 2.1>,
      <abs ABSG = 1 
       data hash MD5: 128K
       45 85 A1 7E E0 3C 59 0D 90 ED 06 F4 61 2F F1 FD>)
(   5,<2012-05-14 19:27:15.109 -0500>,<Administrator>,<TOPSPIN>,<proc1d>,<TOPSPIN 2.1>,
      <abs ABSG = 2 
       data hash MD5: 128K
       A5 59 A6 0F 8D 92 7D 39 8D 8D 18 E5 32 21 83 1A>)
(   6,<2012-05-14 19:27:15.312 -0500>,<Administrator>,<TOPSPIN>,<proc1d>,<TOPSPIN 2.1>,
      <abs ABSG = 3 
       data hash MD5: 128K
       6C A0 5D 3E 12 81 82 4A 6D 37 5C 5C E7 40 C1 13>)
(   7,<2012-05-14 19:27:15.359 -0500>,<Administrator>,<TOPSPIN>,<proc1d>,<TOPSPIN 2.1>,
      <abs ABSG = 4 
       data hash MD5: 128K
       DB 1A 7B 80 DA 5F 76 E1 41 ED 14 FD F8 78 3A EB>)
(   8,<2012-05-14 19:27:15.421 -0500>,<Administrator>,<TOPSPIN>,<proc1d>,<TOPSPIN 2.1>,
      <abs ABSG = 5 
       data hash MD5: 128K
       47 30 23 28 56 A2 B2 35 6F 0A F2 3C 5A C5 3C C7>)
$$ ##END=
$$ 
$$ $$ hash MD5
$$ $$ 08 63 A9 CA B4 D6 8E 60 47 CC F7 7D 0E 4C CB 30
##$RELAX= 
##$RELAX= 
##$RELAX= 
##$RELAX= 
##$RELAX= 
##$RELAX= 
##$RELAX= 
##$RELAX= 
$$ Bruker specific parameters
$$ [...]
##$TP07= 0
##$TPNAME0= <>
##$TPNAME1= <>
##$TPNAME2= <>
##$TPNAME3= <>
##$TPNAME4= <>
##$TPNAME5= <>
##$TPNAME6= <>
##$TPNAME7= <>
##$TPOAL= (0..7)
0.5 0.5 0.5 0.5 0.5 0.5 0.5 0.5
##$TPOFFS= (0..7)
0 0 0 0 0 0 0 0
##$TUNHIN= 0
##$TUNHOUT= 0
##$TUNXOUT= 0
##$USERA1= <user>
##$USERA2= <user>
##$USERA3= <user>
##$USERA4= <user>
##$USERA5= <user>
##$V9= 5
##$VALIST= <valist>
##$VCLIST= <CCCCCCCCCCCCCCC>
##$VD= 0
##$VDLIST= <DDDDDDDDDDDDDDD>
##$VPLIST= <PPPPPPPPPPPPPPP>
##$VTLIST= <TTTTTTTTTTTTTTT>
##$WBST= 2048
##$WBSW= 25
##$XGAIN= (0..3)
0 0 0 0
##$XL= 0
##$YL= 0
##$YMAX_a= 11705514
##$YMIN_a= -6239486
##$ZGOPTNS= <>
##$ZL1= 120
##$ZL2= 120
##$ZL3= 120
##$ZL4= 120
##$ABSF1= 14.96662
##$ABSF2= -5.58591
##$ABSG= 5
##$ABSL= 3
##$ALPHA= 0
##$AQORDER= 0
##$ASSFAC= 0
##$ASSFACI= 0
##$ASSFACX= 0
##$ASSWID= 0
##$AUNMP= <proc_prof1d_extract.lims>
##$AXLEFT= 0
##$AXNAME= <>
##$AXNUC= <1H>
##$AXRIGHT= 0
##$AXTYPE= 0
##$AXUNIT= <>
##$AZFE= 0.1
##$AZFW= 0.1
##$BCFW= 0
##$BC_mod= 0
##$BYTORDP= 0
##$COROFFS= 0
##$CY= 15
##$DATMOD= 1
##$DC= 0
##$DFILT= <>
##$DTYPP= 0
##$F1P= 0
##$F2P= 0
##$FCOR= 0.5
##$FTSIZE= 131072
##$FT_mod= 6
##$GAMMA= 0
##$GB= 0
##$INTBC= 1
##$INTSCL= 1
##$ISEN= 128
##$LB= 0.3
##$LEV0= 0
##$LPBIN= 0
##$MAXI= 10000
##$MC2= 0
##$MEAN= 0
##$ME_mod= 0
##$MI= 0
##$NCOEF= 0
##$NC_proc= -3
##$NLEV= 6
##$NOISF1= 0
##$NOISF2= 0
##$NSP= 0
##$NTH_PI= 0
##$NZP= 0
##$OFFSET= 14.96662
##$PC= 1
##$PHC0= 38.38074
##$PHC1= 0
##$PH_mod= 1
##$PKNL= yes
##$PPARMOD= 0
##$PPDIAG= 0
##$PPIPTYP= 0
##$PPMPNUM= 2147483647
##$PPRESOL= 1
##$PSCAL= 4
##$PSIGN= 0
##$PYNMP= <proc.py>
##$REVERSE= no
##$SF= 400.13000559982
##$SI= 131072
##$SIGF1= 0
##$SIGF2= 0
##$SINO= 400
##$SIOLD= 131072
##$SPECTYP= <>
##$SREGLST= <1H.CDCl3>
##$SSB= 0
##$STSI= 131072
##$STSR= 0
##$SW_p= 8223.68421052632
##$SYMM= 0
##$S_DEV= 0
##$TDeff= 65536
##$TDoff= 0
##$TI= <>
##$TILT= no
##$TM1= 0
##$TM2= 0
##$TOPLEV= 0
##$USERP1= <user>
##$USERP2= <user>
##$USERP3= <user>
##$USERP4= <user>
##$USERP5= <user>
##$WDW= 1
##$XDIM= 131072
##$YMAX_p= 398442783
##$YMIN_p= -49277416
##$CURPLOT= <Network HP LaserJet P1505>
##$CURPRIN= <$Network HP LaserJet P1505>
##$DFORMAT= <normdp>
##$LAYOUT= <+/1D_H.xwp>
##$LFORMAT= <normlp>
##$PFORMAT= <normpl>
##$SURQMSG= 1
$$ End of Bruker specific parameters
$$ ---------------------------------
##NTUPLES= NMR SPECTRUM
##VAR_NAME=  FREQUENCY,     SPECTRUM/REAL,   SPECTRUM/IMAG
##SYMBOL=    X,             R,               I
##VAR_TYPE=  INDEPENDENT,   DEPENDENT,       DEPENDENT
##VAR_FORM=  AFFN,          ASDF,            ASDF
##VAR_DIM=   131072,        131072,          131072
##UNITS=     HZ,            ARBITRARY UNITS, ARBITRARY UNITS
##FACTOR=    0.0627417313425165, 1,          1
##FIRST=     8223.62146879498, 262,          -118312
##LAST=      0,             3939,            -119191
##MIN=       0,             -49277416,       0
##MAX=       8223.62146879498, 398442783,    0
$$ Real data points
##PAGE= N=1
##DATA TABLE= (X++(R..R)), XYDATA
$$ [...]
67319 92462 90225 88486 88122 89425 92032 95155 97958 99909 100913 101211 101129 100870 100515 100273 100597 101757
67303 101757 103259 104028 103387 101694 99826 98300 97149 96416 96323 96957 98144 99673 101429 103269 104997 106491
67287 106491 107725 108670 109280 109531 109361 108673 107499 106083 104733 103759 103483 103859 104009 102792 100362 98559
67271 98559 98972 100954 102475 102701 102659 103303 104211 104827 105899 108546 112269 115004 115329 113889 112410 111819 111639
67254 111639 110848 108819 105585 101765 98543 97323 98812 102256 105922 108538 110101 111277 112477 113752
67240 113752 115142 116599 117839 118704 119523 120640 121802 122451 122366 121511 119518 116107 111929 108228 105638 104031
67224 104031 103465 104345 106327 107963 107974 106390 104118 102060 100991 101534 103544 105938 107722 108830 109606 109996
67208 109996 109936 110015 110930 112462 113743 114424 114792 114720 113312 110033 105799 102492 101407 102314 103933 105078 105385
67191 105385 105172 104965 105122 105556 105597 104533 102698 101570 102202 103876 105149 105892 107174 109167 110628 110939
67175 110939 111292 112903 115071 116139 115639 114421 113212 112187 111550 111401 111267 110791 110670 111879 114210 116556
67159 116556 118339 119511 119527 117958 116080 116055 117993 119474 118825 117338 117113 118069 118684 118685 119071 119875 119883 118882
67141 118882 118485 119949 122418 124272 125337 126659 128569 130120 130481 129885 128927 127585 125551 123230 121804
67126 121804 122177 124046 126175 127541 128226 129139 130897 133088 134696 135133 134532 133148 130986 128255 125681
67111 125681 123854 122579 121458 120886 121711 123831 125951 127046 127430 127920 128541 128748 128604 128946 130352 132438
67095 132438 134325 135504 136145 136711 137296 137347 136290 134540 133509 134275 136486 138942 140977 142770 144477 145760
67079 145760 146283 146238 146104 146150 146336 146536 146715 146947 147333 147908 148581 149124 149114 148127 146358 145027 145599 148363 152136
67060 152136 155513 157931 159370 159823 159600 159554 160197 160937 160918 160329 160245 161361 163541 166371 169484 172478 175061
67043 175061 177124 178237 177601 175187 172403 170684 169941 169449 169659 171546 174421 176294 176710 177401 179540 182044
67027 182044 183604 184779 186715 189028 190581 191555 193098 195378 197504 199156 200862 202676 203965 204716 205791
67012 205791 207566 209447 211210 213814 218150 223686 229027 233278 236227 237679 237565 236677 236458 237647 239432
66997 239432 240333 239840 238930 238995 240507 242895 245397 247580 249103 249647 249503 249834 251722 255031 258697 262164
66981 262164 265922 270404 274830 277790 278959 279722 281801 285535 289808 293528 296643 299711 303077 306783
66967 306783 310804 314914 318769 322766 328336 336476 346126 355069 362476 369366 376208 381482 383696 383938
66953 383938 385056 388503 393107 397064 400241 404131 410097 418027 426485 433965 440005 445053 449447 453073
66939 453073 456193 459933 465289 471942 478691 484844 490634 496507 502681 509300 516283 522966 528531 533040
66925 533040 537702 543995 552689 563498 575235 586450 596495 605990 615831 625973 635753 645185 655084
66912 655084 665825 676851 687693 698805 710934 724160 737907 751482 764314 776090 787089
66901 787089 798171 810127 823183 837175 851903 867169 882771 898579 914391 929883 945187
66890 945187 961346 979271 998129 1015788 1031500 1047315 1066024 1088260 1112403 1136752 1160696
66879 1160696 1184022 1206461 1228319 1250708 1274558 1299762 1325563 1351351 1376862 1402154 1427905
66868 1427905 1455469 1486050 1519684 1555159 1590941 1626079 1660445 1694438 1728640 1763670 1800167
66857 1800167 1838707 1879565 1922549 1967142 2012763 2058897 2105132 2151334 2197793 2245009 2293321
66846 2293321 2342871 2393847 2446487 2500835 2556825 2614750 2675374 2739290 2806200 2874941 2944151
66835 2944151 3012992 3081611 3151129 3222838 3296965 3372227 3446903 3520287 3592847 3665059 3736703
66824 3736703 3807423 3877456 3947356 4017201 4086538 4155084 4222995 4290153 4355276 4416153 4471102
66813 4471102 4520325 4565548 4608072 4647316 4681603 4710064 4733041 4750657 4762048 4766626 4765254 4759164
66801 4759164 4748063 4730385 4705461 4674604 4639899 4602573 4562606 4519059 4470519 4415984 4355814
66790 4355814 4291404 4223852 4153565 4081317 4008648 3936552 3864457 3791233 3716715 3641659 3566791
66779 3566791 3492585 3419396 3346977 3274379 3201177 3128304 3056725 2985923 2915029 2844981 2777818
66768 2777818 2713665 2650193 2585785 2521763 2460485 2402466 2346633 2292502 2240509 2190490 2141356
66757 2141356 2092523 2044612 1998416 1953893 1910432 1867480 1824720 1782380 1741676 1704179 1670044
66746 1670044 1637267 1603461 1568193 1533022 1499333 1466907 1434766 1402736 1371640 1342303 1314909
66735 1314909 1289210 1264859 1241466 1218650 1196184 1173902 1151522 1128812 1105916 1083284 1061364
66724 1061364 1040564 1021243 1003160 985112 965981 946298 927920 911775 896642 880680 863411
66713 863411 845573 827790 810404 794134 779674 766627 753709 740106 725952 711585 697214
66702 697214 683310 670485 658789 647831 637618 628427 619775 610513 600334 590347 581645 574036 566668
66689 566668 559227 551867 544417 536350 527370 517602 507455 497557 488599 480944 474535 469118 464223 459161
66675 459161 453677 448500 444354 440413 434912 427581 420230 414347 409349 404008 398407 393236 388205 382663
66661 382663 377202 372994 369754 365885 360714 355272 350653 346830 343399 340362 337637 334675 331055 326838
66647 326838 322045 316570 310916 306126 302401 298551 293605 288445 284933 283515 282448 279579 274508 268723
66633 268723 263784 259711 255456 250892 247706 247739 250649 253895 255053 253667 250843 247850 245412 243716 242433
66618 242433 240847 238333 234703 230176 225303 220976 218050 216683 216214 215787 214869 213302 211318 209565 208546
66603 208546 207969 207153 206115 205437 204867 203075 199522 195731 193663 193366 193371 193179 193940 196315 198827 199254 197077
66586 197077 193771 190961 189150 188205 188110 188624 188690 187070 183739 180127 177610 176038 174228 171716 169483 168785
66570 168785 169773 171514 172954 173423 172469 169948 166495 163397 161518 160525 159574 158678 158816 160451 162456 163066
66554 163066 161713 159263 156583 153731 150826 148735 148049 147940 147095 145647 145141 146420 148439 149580 149372
66539 149372 148476 147624 147229 147512 148255 148578 147633 145477 142847 140217 137620 135300 133877 133649 134161 134738 135124
66522 135124 135450 135817 136138 136207 135767 134653 133012 131323 130094 129567 129659 129929 129614 128086 125597 123278 121999
66505 121999 121305 119982 117737 115846 115746 117308 119030 119896 120482 121911 124059 125311 124209 121007 117354
66490 117354 114576 112667 111014 109705 109552 110894 112957 114621 115423 115480 114982 114305 114225 115200 116537 117031 116421
66473 116421 115421 114280 112350 109432 106568 104859 104188 103811 103604 103952 104846 105757 106024 104941 102233 99107
66457 99107 97950 99815 102867 104538 104663 105067 106619 108505 110295 112641 115433 117120 116765 115261 113598
66442 113598 111395 108346 105781 105246 106316 107296 107555 107795 108375 108799 108853 109121 110151 111796 113287 113356 110751
66425 110751 105640 100284 97271 96992 97702 97916 97775 98034 98793 99633 100231 100537 100898 102126 104695 107695 109311
66408 109311 108652 106481 103952 101386 98685 96246 94813 94684 95483 96433 96629 95463 93232 91130 90340 91190
66392 91190 93189 95512 97330 98167 98332 98725 99920 101595 103079 104193 105242 106274 106710 105861 103849 101885
66376 101885 101378 102599 104469 105869 106818 107896 108893 108784 107021 104177 101232 98869 97587 97768 99201
66361 99201 101032 102526 103575 104288 104547 104182 103176 101442 98842 95662 92674 90501 89348 89439 91046 93731
66345 93731 96200 97421 97446 96794 95664 94378 93960 95330 98050 100522 101381 100319 97911 95314 93938 94630
66329 94630 96966 99604 101263 101211 99346 96497 94334 94182 95858 98158 100275 102114 103508 104136 104334 105002
66313 105002 106318 107265 106868 105382 103844 102898 102441 102041 101311 100104 98661 97459 96856 97126 98627 101269
66297 101269 103797 104511 103201 101644 101569 102680 103373 102965 102378 102805 104525 107035 109649 111727 112726 112314
66281 112314 110397 107209 103549 100563 98876 98141 97780 97753 98073 98082 97125 95695 94965 95243 95798 96079 96009 95061
66263 95061 92588 89554 88452 90477 93868 96205 97344 98712 100525 101487 101022 100139 99883 100320 101257 102627
66247 102627 103691 103248 101378 99939 100485 102497 104439 105846 107402 109471 111455 112468 112080 110627 109135
66232 109135 108511 108447 107689 105867 104304 104313 105421 106189 106242 106377 107025 107663 107647 106685 104693 102125 100290 100264 101539
66213 101539 102758 103717 105444 108175 110554 111291 110524 109035 107172 105146 103464 102361 101577 101390 103034
66198 103034 107120 112118 115354 115426 113239 111034 110783 112927 115949 117544 116779 114882 113542 113117 112961 112753
66182 112753 112513 111874 110491 108993 108462 108982 109585 109712 109952 111147 113392 116001 117931 118304 117132 115565
66166 115565 114819 114889 114921 114687 114759 115236 115399 115087 115398 117240 119817 121402 121292 120266 119247 118319 117151 115830
66148 115830 114906 114861 115818 117736 120601 124194 127660 129583 128931 126132 122982 121161 120736 120364 119136 117999
66132 117999 118804 121791 124669 124918 122719 120665 120534 121359 121167 119613 117986 117238 117116 117100 117302 118290 120451
66115 120451 123461 126016 126655 125427 124134 124000 123746 121351 117340 114585 114644 115973 116377 115675 114965 114629
66099 114629 114517 115241 117598 120845 122876 122414 120319 118533 118262 119221 120155 119995 118809 117676 117512 118248
66083 118248 119243 120073 120550 120407 119543 118405 117685 117810 118999 121476 125083 128958 132142 134430 136239 137823
66067 137823 139000 139503 139189 138056 136325 134330 132192 129961 128249 128012 129239 130617 131207 131746 133355
66052 133355 135576 136977 137319 137660 138293 138102 136431 134365 133370 133547 133932 133868 133362 132665 132223 132727 134543
66035 134543 137211 139861 141960 143417 144368 145211 146536 148566 150848 152673 153667 153826 153329 152462 151369 149760
66019 149760 147292 144344 141813 140057 138780 138208 139367 142486 145984 148081 148879 149788 151287 152427 152500
66004 152500 152010 151680 151416 150668 149239 147346 145427 144074 143675 143930 144256 144813 146374 148847 150731 150808 149818
65987 149818 149562 150573 151586 151391 150328 149490 149124 148644 148077 148605 151210 155276 159131 161807 163602 164959
65971 164959 165667 165621 165619 166502 167876 168569 168239 167666 167466 167504 167858 169290 172047 174890 176233 175989 175634 176615
65953 176615 179150 182299 184663 185276 184427 183547 183825 185166 186907 189147 192460 196507 199935 201898 202966
65938 202966 204345 206801 210465 214891 219111 222494 225920 231194 238723 246629 252871 257397 261196 264096
65924 264096 265055 264394 264075 265302 267149 268177 268370 268463 268127 265984 261376 255274 249240 244005 239241 234394
65908 234394 229470 225083 221829 219676 218006 216216 214147 211967 209880 207991 206237 204489 202900 202070
65894 202070 202422 203509 204535 205608 207747 211324 215335 218669 221337 223680 225228 225488 225358 226238 227823
65879 227823 228304 227226 226739 229114 233935 238703 241553 242469 242449 242633 244030 246920 250356 253111 255263 258110
65863 258110 262409 267531 272649 277908 283782 289886 295187 299250 302670 306373 310957 316594 322992 329358
65849 329358 334916 339733 344680 350184 355215 357996 357951 356659 356511 358356 360706 361394 359789 357178 355264
65834 355264 354718 355060 355241 354025 350515 345003 339109 334348 330526 326125 320368 314207 308931 304475 299777
65819 299777 294445 289194 284624 280374 275879 271408 267767 265155 262793 259666 255342 250157 245010 240960
65805 240960 238521 237001 234842 231052 226318 222424 220495 220033 219681 218709 217590 217334 218495 220789 223458
65790 223458 225882 227926 229786 231540 232872 233265 232448 230639 228444 226530 225317 224828 224895 225615 227559 231261
65774 231261 236417 241792 246166 249356 252128 255131 258151 260524 262128 263689 266168 270084 275573 282734
65760 282734 291418 300711 309170 315944 321409 326439 331330 335741 339282 341505 341634 339293 335633 332690
65746 332690 331078 329189 325459 320717 317147 315359 313813 311238 308253 306015 304373 302328 299730 297454
65732 297454 295978 294674 292800 290699 289636 290512 292895 295459 297450 299562 303037 308025 313372 318154
65718 318154 322794 328346 335260 343394 352731 363266 374323 384653 393274 399812 404143 406221 406218 404341
65704 404341 400550 394940 388210 381125 373558 364880 355452 346857 340267 335175 330349 325566 321890 320511
65690 320511 321823 325343 329971 334475 338328 342230 347521 354907 363895 373486 383266 393780 405807 419154
65676 419154 432250 443127 450913 456095 459360 460618 459334 455366 449054 440816 431082 420358 408871
65663 408871 396290 382307 367461 352954 339693 327890 317493 308351 299847 291071 281846 273154
65651 273154 265942 259754 253178 245738 238696 233594 230533 228539 227331 227685 229655 231376 230683 227685 224703
65636 224703 223539 223760 224016 224072 224732 226382 228586 230912 233254 235287 236415 236482 236095 236068 236911 238820 241666
65619 241666 244888 247935 250985 254821 259870 265879 272610 280178 288401 296635 304930 314781 327634 342717
65605 342717 357351 369858 381492 394951 411366 429428 447252 464229 480609 496002 509265
65594 509265 519883 528649 536531 543472 548934 553218 557371 561734 565342 567157 567376 567144 567267 567620 567564
65579 567564 566532 564133 559934 553354 543964 532041 518667 504903 490882 476085 460420 444460
65567 444460 428549 412462 396322 381164 367885 356000 344075 331203 317655 304520 293317
65556 293317 285405 280704 277113 272242 265792 259343 253780 248254 242107 236516 233158 232050 231904 232134 233200
65541 233200 235015 236216 235462 232735 229019 225327 222368 220607 220039 220111 220231 220238 220249 220359 220808 222236 225352
65524 225352 230267 236242 242108 246995 250842 254252 257776 261548 265915 272091 281261 292837 304440 314349
65510 314349 323437 333940 346713 360527 373912 386630 399137 411490 423307 434241 443943 451853
65498 451853 457456 460542 461031 458923 454692 449228 442830 434605 423586 410394 397160 385583 375499
65485 375499 365527 354745 343491 332794 323428 315541 308913 303349 298775 295119 292290 290247 288859
65472 288859 287581 285532 282226 278206 274736 272765 272125 271669 270236 267735 265302 264032 263386 261270 256156
65457 256156 248917 242134 237669 235304 233633 231742 229854 228683 228408 228298 227349 225315 222869 220620 218462
65442 218462 216324 215056 215692 218002 220683 223093 225765 228879 231237 231569 230226 228787 228408 229393 231941
65427 231941 236154 241185 245466 248372 251054 254984 259907 263883 265404 265026 264707 265742 267696 269340 270263
65412 270263 271153 272547 273753 273302 270382 265657 260671 256581 253453 250683 247980 245718 244243 243061 241117
65397 241117 237854 233690 229475 225920 223504 222276 221442 219725 216745 213773 212594 213779 216472 219638
65383 219638 222840 225736 227534 227493 225938 224475 224975 228139 233050 238199 242897 247339 251438 254337 255463
65368 255463 255473 255459 255612 255337 254491 253677 253333 253262 253223 253325 253570 253543 252864 251584 249915 247944 245916 244494 244435
65349 244435 246062 248993 252144 254106 254159 253100 252541 253068 253573 252859 251490 251377 253615 257310 260697 263014
65333 263014 264957 267536 270887 274338 277263 279483 280924 281511 281618 282029 282941 283467 282767 281330 280293 279720
65317 279720 278630 276745 275022 274007 272793 270507 268104 267662 270190 274930 280588 286419 292138 297473
65303 297473 302073 305634 308228 310739 314652 320861 328769 336883 344168 350587 356821 363952 372919 383422
65289 383422 393575 401461 406935 411116 414347 415825 415461 414714 414733 414532 412163 407323 401738 396808 391804
65274 391804 384825 375124 363989 353491 344770 337595 331153 324825 318286 311364 304233 297623 292513 289466
65260 289466 288163 287450 285883 282751 278862 275985 275127 275588 276030 275978 275722 275252 274279 273111 272463 272297 271916
65243 271916 271456 272159 274493 276938 277517 275982 273610 271334 269153 267220 266423 267518 270316 274112 278456
65228 278456 283062 287081 288994 287670 283788 279838 278095 278425 278657 277205 274643 272440 271106 270314 269967
65213 269967 269948 269348 267246 264124 261271 258897 256301 254012 253991 256780 259856 260179 257661 254897 254028 255126
65197 255126 257246 259556 261260 261697 261075 260346 259938 259263 257862 256339 255622 255743 255827 254924 252460 248249 242724
65180 242724 237069 232628 230084 229308 229719 230486 230720 230068 229112 228753 229145 229632 229705 229540 229455 229290 228676 227575
65162 227575 226280 225073 224247 224319 225770 228430 231323 233209 233285 231565 228957 226982 226970 229073 232086 234488
65146 234488 235643 235850 235421 234259 232526 231168 231196 232593 234548 236720 239472 242579 244595 244398 242959
65131 242959 242509 243944 246022 247400 248438 250272 252918 255414 257539 260185 263807 267498 270209 272260
65117 272260 274890 278523 282127 284396 285127 285296 286092 288087 291128 294649 298048 301043 303906 307212 311111
65102 311111 314946 317939 320329 323364 327952 333749 339964 346561 354044 362381 371060 380245 390974 403928
65088 403928 418761 434991 452721 471911 491736 511687 532773 556423 582230 607888 631562
65077 631562 653384 674340 694719 714379 733659 752845 770997 786345 798059 806881 813773 818528
65065 818528 820089 817820 811940 802942 791137 776831 760577 743044 724727 705867 686470 666308
65053 666308 645127 623075 600924 579613 559506 540173 520938 501568 482459 464304 447618
65042 447618 432370 417955 403654 389374 375924 364454 355580 349014 343816 338798 332973 326052 318693
65029 318693 312018 306814 303261 301430 301607 303822 307118 309655 309796 307295 303574 300795 300400 302296 305342
65014 305342 308514 311429 313877 315341 315329 313963 311871 309550 307146 304873 303229 302571 302683 302963 302964 302626
64998 302626 302088 301416 300405 298628 295857 292626 290127 289144 289118 288721 287416 285974 285151 284390 282479 279314
64982 279314 276258 274537 273962 273719 273894 275315 277799 279374 277908 273421 268338 265282 264788 265264 264936 263482
64966 263482 261742 260309 258941 257357 256062 255912 256973 258234 258627 258062 257250 256616 255647 253501 250279 247492
64950 247492 247020 249463 253614 257655 260709 263164 265758 268821 272305 275983 279314 281581 282728 283909
64936 283909 286529 290584 294422 296548 297262 297986 299236 300060 299670 298836 299088 301015 304084 307765 311875 315834
64920 315834 318718 320621 323043 327041 331433 333803 333170 330913 328982 327908 326763 324453 320697 316145
64906 316145 311869 308540 305926 303310 300319 297088 293730 290233 286926 284454 282994 281941 280684 279268
64892 279268 277952 276483 274342 271494 268466 265742 263396 261328 259702 259046 259877 261995 264320 265803 266468
64877 266468 267058 267679 267553 266280 264451 262580 260429 258213 257606 260210 265303 270259 273173 274168 274254 274058
64861 274058 273813 273534 272913 271879 271412 272728 275377 277320 277409 276763 276994 278208 279695 281525 284100 286822
64845 286822 288775 290476 293494 298243 303524 308504 313840 320324 327554 334713 341697 348531 354422 358545
64831 358545 361552 365301 371079 378809 387886 397750 407349 415065 419986 422885 425221 427418 428836 429254
64817 429254 429390 429623 429113 426998 423924 421374 419618 417363 413571 408577 403022 396846 390267 384767 381683
64802 381683 380166 378033 374682 371710 370202 368850 365709 360700 355151 349550 343177 335758 328218 321589
64788 321589 316262 312504 310648 310223 309686 307760 304631 301315 298300 295401 292613 290350 288853 287922 287333
64773 287333 287155 287532 288451 289764 291223 292501 293402 294054 294715 295449 296245 297346 299065 301261 303387 305269
64757 305269 307550 311074 316000 321742 327693 333688 339756 345689 351197 356438 362137 368912 376632 384731
64743 384731 393110 402330 412673 423281 432481 438825 441791 441923 440585 439135 437785 435517 431567 426616
64729 426616 421870 417317 411857 405096 397963 391364 385242 379384 374173 369918 366214 362732 360042 358968
64715 358968 359684 362041 366016 370959 375217 377821 380144 384542 391598 400003 408972 419040 430148 440783
64701 440783 450021 459116 469732 481360 491747 499442 504796 508715 511607 513641 515059 515971 516453 517029
64687 517029 518407 520445 521873 521477 519312 516448 513693 510947 507721 503919 499832 495576 490966 486044
64673 486044 481282 476821 471751 464761 455575 445368 435728 427599 421226 416568 413472 411799 411425 411782
64659 411782 411583 409769 406906 404877 404941 406764 409529 412918 416529 419525 421881 425024 430005 435629 439656
64644 439656 441448 442035 441939 440532 437687 434434 431353 427468 421486 413316 403869 394134 385044 377444 371452
64629 371452 366348 361645 357779 355260 353828 353062 353225 354689 356978 359266 361578 364694 368955 374008 379673
64614 379673 386160 393214 399871 405612 411284 418230 426749 435967 445236 454976 465676 476389 484921 489732
64600 489732 491298 491325 490943 490027 487957 484495 479943 474873 469714 464296 457972 450719 443894 439159 436564
64585 436564 434478 431675 428789 427393 428416 431953 437851 445636 454290 463014 472142 482613 494623 507418
64571 507418 520465 534172 549184 565341 581533 596338 608591 617610 623264 626027 626779 626147 623848
64558 623848 618994 611421 602414 593585 585257 576804 568426 561397 556131 551173 545036 538287 532737 529024
64544 529024 526038 522535 518325 513831 509333 504829 500035 494448 487823 480519 472929 464849 456125 447711
64530 447711 441185 437100 434484 432032 429074 425479 421509 418000 415865 415122 415133 415999 418749 423746 429862
64515 429862 435926 442141 449125 456223 461972 466038 469417 472585 474502 474060 471784 469344 467604 465842
64501 465842 462776 457726 450612 441552 431088 420488 411072 403166 396379 390914 387702 386714 386047 383760
64487 383760 380263 377743 377136 376742 374312 369777 365357 363344 364202 366626 369027 370855 372452 373744 373683
64472 373683 371557 368407 366214 365665 365593 364707 362947 360984 359401 358851 359961 362305 364162 364226 363100 362417
64456 362417 362936 364262 365975 368081 370493 372871 375057 377193 379534 382521 386677 391839 396868 400899
64442 400899 404657 409764 416835 425029 433417 441923 450903 460570 471064 482342 493682 503888 512276
64429 512276 519019 524342 527935 529401 528854 526816 523927 520895 518219 515793 513258 510947 509808 510074 510622
64414 510622 510118 508200 504900 499623 491909 483215 476712 474544 475687 477081 476704 474995 473505 472947 473135
64399 473135 474227 477071 482037 488158 493929 498663 502737 506897 511801 517872 524880 531807 537881 543734
64385 543734 550811 559521 568830 578017 588058 600741 616946 636288 657871 680683 703695 726546
64373 726546 750209 776401 806258 840042 878074 921281 970593 1026238 1088061 1156409 1232410
64362 1232410 1317366 1411891 1515575 1627273 1745478 1868252 1993034 2117019 2237916 2354165
64352 2354165 2464463 2567530 2662333 2747653 2820860 2877786 2914867 2931394 2929097 2909804 2874288
64341 2874288 2823178 2757716 2679201 2588576 2487219 2377519 2262129 2143232 2023019 1904276
64331 1904276 1789576 1680193 1576476 1478940 1388053 1303240 1223269 1147951 1078461 1015490 958029
64320 958029 904851 856632 815413 781839 753803 728218 703660 680836 660751 643031 626179
64309 626179 609189 592499 577301 564116 552327 541017 529856 518976 508392 498066 488466 480422
64297 480422 474161 468891 463827 459423 457056 457342 459216 460976 462015 463158 465431 468923 472970 476929
64283 476929 480432 483226 485342 487388 490039 493070 495356 496116 495728 494941 493713 491491 488417 485483 483427
64268 483427 482098 481151 480657 480597 480253 478769 476082 472753 469062 464981 461040 458417 457601 457394 455875 452306
64252 452306 447621 443035 438842 434891 431613 429657 428549 426659 423043 418801 415875 414764 414106 412421
64238 412421 409498 405954 402325 399085 396933 396261 396576 397110 397891 399607 402360 405158 407028 408319 410501
64223 410501 414565 419760 424095 426189 426625 427382 430060 434932 441528 449406 457980 466283 473657 480508 487734
64208 487734 495463 502883 509260 514572 519100 522971 526232 528916 530898 532128 533053 534234 535378 535371 533683
64193 533683 531146 528831 526530 522928 517041 509016 499758 490407 482076 475335 469646 463695 456630 448829
64179 448829 441389 435091 429993 425669 421542 417137 412459 408196 405239 403767 402966 401864 400284 398712
64165 398712 397358 395960 394639 394364 395888 398429 400039 399403 396857 393608 390492 387691 385202 383019 380972
64150 380972 378753 376267 373902 372428 372359 373182 373476 372439 371312 372535 377102 383273 388311 391061 392308
64135 392308 393263 394691 397311 401868 408289 415453 422459 429911 439452 451998 466697 481678 495680
64122 495680 508876 522131 535554 547930 557662 564049 567507 568673 567613 563872 557082 547515 536295
64109 536295 525007 514788 505584 496425 486488 475921 465734 457022 450083 444012 437371 429723 422444
64096 422444 417490 415206 413923 411976 409618 408422 409171 411035 412766 414022 415285 417029 419470 422786
64082 422786 426984 431448 435169 437822 440298 443737 448103 452228 455258 457405 458955 459290 457718 454921
64068 454921 452556 451352 450544 449502 448846 449391 450906 452973 456302 461773 468457 474209 478590 483736 491550
64053 491550 501292 511055 520662 531601 544591 558828 573606 589032 604666 618942 630886 641401
64041 641401 651841 662104 671216 679203 687127 695584 704383 713593 723519 733455 741804 748008 753224 758332
64027 758332 762228 763015 760050 753720 743908 730311 714307 698998 686644 676766 667264 656731 645229
64014 645229 633517 622434 612763 604813 597957 591068 583549 575674 568008 560996 555230 551512 550122 550271
64000 550271 550789 551366 552623 554889 557463 559582 561765 565473 571410 578857 587011 596338 607784 620917
63986 620917 633830 645189 655657 666828 679384 693068 707973 724645 742618 759883 774579
63975 774579 786734 797684 808261 818415 828254 838178 847619 854686 857787 857077 853702 848238 840673
63962 840673 831574 822307 813988 806845 800579 794752 788787 782249 775264 768230 761150 753777 746242 738787
63948 738787 730878 721587 711129 701124 692879 686300 680999 677448 676045 675752 674810 672587 669918 667970
63934 667970 667647 669798 674882 682262 690603 699033 707279 714955 721731 728324 736305 746651 759222 773786
63920 773786 790500 808992 828107 847429 868336 892625 920366 949883 979591 1009218 1039540
63909 1039540 1071730 1107051 1146364 1189567 1235718 1283936 1334245 1387714 1445968 1510403 1581616
63898 1581616 1659668 1745019 1838976 1942983 2057750 2183429 2320501 2470212 2634363 2815115
63888 2815115 3014839 3235422 3477325 3739450 4020126 4318168 4633032 4964100 5309697
63879 5309697 5666421 6029072 6391260 6746256 7087611 7409414 7706310 7973308 8205501
63870 8205501 8398054 8546661 8647980 8699684 8700436 8650246 8550810 8405150 8216731 7989154
63860 7989154 7726779 7435434 7122186 6794210 6457682 6117491 5777803 5442750 5116534
63851 5116534 4802876 4504536 4223409 3960908 3717904 3494267 3288773 3099848 2926465
63842 2926465 2768163 2624154 2492731 2371915 2260588 2158650 2066027 1982037 1905889 1837146
63832 1837146 1775050 1717856 1663813 1612783 1565885 1523236 1483133 1444203 1407543 1375576 1349095
63821 1349095 1326539 1306166 1287824 1272279 1259943 1250977 1245927 1245222 1248323 1254154 1262302 1273081 1286456
63808 1286456 1301759 1318644 1337412 1357878 1378585 1397868 1415277 1431249 1445795 1458445 1469287
63797 1469287 1478796 1486408 1490440 1490145 1486850 1482113 1475341 1464370 1448160 1427831 1405108 1380757 1354736
63784 1354736 1326913 1297270 1266037 1233952 1201765 1169226 1135261 1099520 1063122 1027431 992731
63773 992731 958670 925472 893969 864682 837444 811653 786495 761232 735862 711306 688519
63762 688519 667636 648401 631010 615860 602698 590636 578968 567384 555655 543787 532532
63751 532532 523169 516661 513182 512087 511797 510178 506087 500511 495368 491236 487180 482760 478886 476244
63737 476244 474017 471002 467177 463301 459553 455505 451080 446603 442012 436818 430898 424868 419612 415758
63723 415758 413456 412314 411719 411469 411738 412175 411758 410218 408869 408876 409219 407903 405157 403643 404832 406672
63707 406672 406057 402555 398277 394854 392179 389973 388823 389113 390083 390701 390790 390830 391316 392760 395560 399130
63691 399130 401754 402110 400732 399341 399065 400033 402239 405695 409580 412324 413142 413027 413771 416279 420069 424076
63675 424076 427645 430818 433919 436908 439376 441381 443980 448316 454253 460542 466337 471813 477228 482302
63661 482302 486913 491496 496054 499539 501161 501858 503478 506648 510269 512984 514331 514455 513599 512177 510755
63646 510755 509632 508847 508735 509928 512468 515248 516754 516343 514716 513254 512930 513790 515343 517252 519300
63631 519300 520943 521747 522638 525815 532537 541397 549606 555535 559217 561016 561371 561676 563643 567219 570413
63616 570413 571840 572234 572822 573540 573920 574526 575992 577367 577040 575060 573053 571823 570459 568158 565581 563659
63600 563659 561961 559211 555139 550987 548024 545942 543075 538388 533062 529472 528324 527505 524501 519453
63586 519453 514795 512177 511094 510693 511364 513647 516725 519363 521801 525380 530394 535596 540188 545226 552399
63571 552399 561987 572750 583432 593687 603717 613848 624676 637021 651290 667134 684001 701721
63559 701721 720270 739479 759598 781857 807518 836295 866581 897516 929975 965008 1002334
63548 1002334 1041310 1082570 1127196 1174391 1221394 1265981 1307780 1346589 1380717 1408132 1428556
63537 1428556 1443336 1453620 1459737 1462151 1461815 1459273 1454207 1446229 1435478 1422061 1405479 1385107 1360903
63524 1360903 1333298 1302745 1269954 1236311 1203411 1172020 1141908 1112844 1085358 1060273 1037844
63513 1037844 1017768 999852 984198 970765 959329 950119 943940 941192 941132 942797 946483 953453 964029
63500 964029 976729 989760 1002772 1016663 1032237 1049764 1069470 1091580 1115883 1141989 1170130
63489 1170130 1201190 1236002 1275147 1319184 1368082 1420185 1472597 1523003 1570443 1613913 1651130
63478 1651130 1679548 1698248 1708307 1711765 1710846 1707464 1702303 1694419 1682556 1666913 1648838 1628839
63466 1628839 1605774 1578192 1545739 1508923 1468249 1424150 1377371 1328945 1279967 1231596 1184919
63455 1184919 1140493 1098233 1057969 1019860 984021 950089 917541 886438 857654 832322 810930
63444 810930 792748 776161 759904 744048 729649 717478 707346 698514 690347 682684 675962 670839
63432 670839 667189 663717 659296 654494 650824 648584 646702 644965 644954 647861 652458 656290 658198 658739 658854
63417 658854 659260 660604 662926 665153 666142 666090 666032 666221 665965 664770 662533 658874 653655 648240 644822 644038
63401 644038 644236 643514 641621 639552 638334 638685 640898 644379 647992 651464 655800 661839 669137 676916 685423
63386 685423 695533 707412 720372 733795 747624 762149 777889 795597 815922 839048 864851
63375 864851 893266 924484 958942 997005 1038082 1080009 1120112 1157154 1191666 1224208 1254236
63364 1254236 1281217 1306036 1330521 1356120 1383751 1414356 1448647 1486504 1527364 1571068 1617679
63353 1617679 1666498 1715669 1762673 1805002 1840855 1869715 1891980 1907770 1916619 1918741 1915825 1909793
63341 1909793 1901248 1889923 1875927 1859390 1839191 1813409 1781242 1743629 1701956 1657120 1610037
63330 1610037 1562061 1514293 1467032 1420307 1374480 1330037 1287246 1246428 1208351 1174071 1144366
63319 1144366 1119262 1097897 1079060 1062326 1048691 1039687 1035805 1035991 1038670 1043052 1049542 1059134 1072371
63306 1072371 1088880 1108164 1130636 1156967 1186187 1215814 1245002 1276567 1314273 1358413 1405693
63295 1405693 1453387 1501890 1552694 1605431 1657812 1707379 1752228 1790731 1821594 1844160 1858353
63284 1858353 1864785 1865153 1861664 1855434 1845998 1832909 1817054 1799540 1779872 1756265 1727602 1694235
63272 1694235 1656953 1616100 1572005 1525643 1478410 1431476 1385583 1341356 1299450 1260348 1224159
63261 1224159 1190925 1161120 1135438 1113724 1094472 1075926 1057482 1039316 1020698 999696 975099
63250 975099 948132 921654 897825 876808 857410 838586 820339 803335 787720 772673 757523
63239 757523 743027 730716 720950 712486 704247 696621 690403 685227 679882 673861 667870 662879 659170 656226
63225 656226 653109 649018 643831 638254 633397 630174 628802 628473 627809 626355 625490 627008 630701 634403 636689
63210 636689 638331 640480 642708 643961 644527 645704 648040 651166 655031 659928 665382 670348 674745 679740
63196 679740 686203 693803 702021 711206 722073 734801 749097 764708 781336 798360 815227 832167
63184 832167 850287 870774 893930 919014 945245 972980 1003522 1037509 1073960 1111307 1148925
63173 1148925 1187101 1226002 1265541 1306059 1348229 1392101 1436776 1480914 1523009 1561611 1596508
63162 1596508 1629792 1664646 1702504 1742038 1781033 1818268 1853211 1885101 1913236 1937349 1956710
63151 1956710 1969453 1973885 1970192 1959935 1944132 1922885 1896752 1867247 1835625 1802213 1767542 1733344
63139 1733344 1701588 1672935 1646870 1623127 1602231 1584751 1570909 1561185 1556632 1557991 1564778 1575706
63127 1575706 1589850 1607105 1627697 1651676 1678798 1708490 1739958 1772621 1806382 1841092 1875951
63116 1875951 1909987 1943115 1976060 2009046 2041114 2070947 2097716 2120741 2138827 2150464 2154462
63105 2154462 2150158 2137465 2117043 2089980 2056816 2017345 1971796 1921663 1868767 1813954 1757436
63094 1757436 1700036 1643270 1588370 1535960 1486483 1440077 1396111 1353756 1313171 1275469 1241462
63083 1241462 1211018 1183624 1158743 1135513 1112929 1090735 1069594 1050191 1032787 1017816 1006064
63072 1006064 997674 991517 986182 981390 978061 977216 979125 983303 988963 995412 1002127 1008467 1013707 1017716
63058 1017716 1021431 1026057 1031779 1037787 1043455 1048862 1054088 1058818 1062891 1066589 1070102 1073310 1076416 1080040
63044 1080040 1084227 1088052 1090810 1093018 1095492 1097854 1098860 1098202 1097199 1097427 1099044 1100787 1101546 1101688 1102650
63029 1102650 1105254 1108837 1112257 1115278 1118434 1122047 1126389 1132538 1141706 1153382 1165459 1176890 1189107
63016 1189107 1203893 1220844 1238160 1255354 1273825 1294926 1318565 1343706 1369370 1395145 1421698
63005 1421698 1450950 1484837 1523512 1565256 1608472 1653354 1701530 1754593 1813246 1877410 1946645
62994 1946645 2020446 2098344 2179956 2265115 2353913 2446260 2541346 2637985 2735603 2834304 2933721
62983 2933721 3032621 3130230 3227202 3324344 3420995 3515754 3608328 3699287 3787976 3872068 3949478
62972 3949478 4019439 4081142 4132447 4170880 4195237 4205358 4200903 4181233 4146398 4097618 4036894
62961 4036894 3966556 3888992 3806352 3720562 3633805 3548700 3467650 3392260 3323636 3262844 3210605
62950 3210605 3166944 3131846 3106156 3091174 3087334 3093802 3109375 3133104 3163912 3200388 3241589 3287593
62938 3287593 3338609 3393747 3451389 3510751 3572207 3635634 3699040 3759587 3815752 3867723 3915623
62927 3915623 3958067 3992753 4017886 4032500 4035772 4026640 4004119 3967575 3916777 3852173 3775293 3688568
62915 3688568 3594354 3493978 3387735 3275967 3160285 3043652 2928972 2817633 2709768 2605861
62905 2605861 2507405 2415561 2329710 2247916 2168742 2092381 2020403 1954671 1895925 1842736 1792143
62894 1792143 1741957 1692271 1644420 1599087 1556254 1516351 1479995 1446544 1414095 1381412 1349160
62883 1349160 1319009 1292186 1268854 1247961 1227601 1206537 1185719 1167265 1151620 1136865 1121342
62872 1121342 1105715 1091606 1079408 1068603 1059243 1051622 1045062 1038548 1032300 1027354 1023719 1020239 1016300
62859 1016300 1012250 1007960 1002363 994968 986677 978434 970077 961330 953055 946465 941588 937429 933343 929316
62845 929316 924966 919289 911782 903365 895852 890673 888138 887567 887820 887822 886974 885365 883616 882278 881103 879106
62829 879106 875743 871986 869632 869329 869786 869440 868492 868609 870751 874043 876966 878976 880419 881360 881383 880589
62813 880589 879951 880072 880086 878654 876082 874551 875772 878936 881650 882487 881882 880802 879655 878749 878711 879609 880334
62796 880334 879825 878690 878702 880651 883542 886063 887993 889702 890963 891108 890121 888790 887711 886772 885837 885425
62780 885425 886298 888542 891343 893564 894371 893602 891923 890524 890221 890745 891213 891376 892034 894028 897166 900397
62764 900397 902832 904348 905502 907265 910686 916302 923778 932307 941247 950135 958405 965799 973017 981234
62750 981234 990746 1000773 1010929 1022181 1035714 1051377 1068051 1085298 1103841 1124454 1147104 1171304
62738 1171304 1196713 1223254 1251219 1281473 1315012 1351967 1391496 1433034 1477401 1526408 1581591
62727 1581591 1643476 1711751 1785853 1865683 1952018 2046019 2148062 2257326 2372698 2493689
62717 2493689 2620076 2751068 2885319 3021370 3157328 3290152 3415923 3530971 3632378
62708 3632378 3717598 3784417 3831623 3859259 3867884 3857900 3829730 3784111 3721809 3643403 3549972 3444072
62696 3444072 3329648 3210666 3089669 2967526 2844506 2721608 2600827 2484210 2372916
62687 2372916 2267236 2167084 2072113 1981848 1896437 1817075 1744972 1679900 1620467 1565674 1515317
62676 1515317 1469010 1426220 1387721 1355487 1330041 1308938 1289214 1270714 1255664 1245455 1239350
62665 1239350 1236089 1235040 1235491 1236481 1238194 1242396 1250627 1262644 1277400 1294768 1315504 1340098 1368501
62652 1368501 1400586 1436160 1474956 1517393 1565001 1619171 1679698 1745485 1816646 1894955 1981997
62641 1981997 2077640 2180641 2290001 2405237 2525938 2651669 2781977 2915693 3050221 3182075
62631 3182075 3308314 3427072 3536570 3634118 3716587 3781624 3827814 3853701 3857512 3838446 3797839
62620 3797839 3738394 3662411 3571371 3467139 3352675 3231184 3105110 2976301 2846606 2717826
62610 2717826 2591292 2467941 2348649 2234287 2125723 2023857 1929183 1840993 1757576 1677812
62600 1677812 1602335 1532762 1470122 1414336 1364650 1319900 1278835 1240868 1206257 1174927 1145684
62589 1145684 1117478 1090937 1067403 1046707 1027187 1007980 989914 973842 959448 946281 934785
62578 934785 925482 917994 911532 905586 899569 892835 885932 880866 878902 878752 877991 875769 872962 870213 867305
62563 867305 864401 862541 862596 864572 868016 872271 876380 879849 883712 889923 899370 911271 924663 939552
62549 939552 956260 974583 994174 1015101 1037441 1060856 1085137 1110878 1139319 1171767 1209127
62538 1209127 1251355 1297227 1345383 1395897 1450181 1509066 1571580 1635764 1699800 1762096 1821298
62527 1821298 1876799 1928292 1974049 2010717 2035920 2050440 2056715 2055648 2045986 2026456 1997321 1959892
62515 1959892 1915676 1866255 1813267 1758190 1702400 1647169 1593091 1539833 1487050 1435243 1385159
62504 1385159 1336948 1290802 1247833 1209018 1173521 1139471 1106550 1076537 1051010 1029742 1011808
62493 1011808 997055 985543 976261 967421 958071 949010 942061 938309 936957 936228 935595 936337 939230 942752
62479 942752 945073 947056 951214 957859 964575 969909 975221 981918 989227 996423 1005428 1018997 1037362 1058652
62465 1058652 1081811 1107162 1134747 1164391 1197334 1235736 1280146 1329018 1381128 1437162 1498397
62454 1498397 1564930 1635731 1709540 1785261 1862147 1939871 2017887 2094637 2167948 2235986 2297018
62443 2297018 2348619 2388490 2416339 2433880 2442677 2442949 2434725 2419098 2397850 2372667 2345155 2316899
62431 2316899 2289092 2262703 2239118 2219778 2205076 2194692 2189354 2191097 2201197 2218890 2242822 2272722
62419 2272722 2308706 2349862 2394778 2442970 2494377 2547326 2597816 2641191 2674392 2696813 2709414
62408 2709414 2712952 2706914 2690251 2662864 2625598 2578741 2521686 2454761 2380522 2302236 2221552 2138504
62396 2138504 2053444 1968075 1884805 1805808 1732555 1665431 1603699 1546406 1493377 1445064 1401756
62385 1401756 1363409 1330023 1301479 1277077 1255812 1237128 1221039 1207572 1196519 1187726 1181273 1177310
62373 1177310 1175714 1175588 1175053 1172161 1166455 1159178 1151467 1142913 1132428 1119837 1105711 1090168 1073071
62360 1073071 1055237 1038270 1022961 1008792 995230 982609 971245 960494 949429 938167 927870
62349 927870 919281 911517 902637 891676 880033 870363 863953 859835 856677 854534 853880 853942 853562 853312 854961
62334 854961 858615 862077 863817 865184 868542 874107 879898 884347 887755 891292 895679 901214 908374 917738
62320 917738 929355 942515 956364 970750 986193 1002874 1020118 1037384 1055472 1075828 1098625
62309 1098625 1122470 1146272 1170505 1196222 1223861 1253786 1287073 1324561 1365693 1409672 1457613
62298 1457613 1512077 1574158 1642208 1714023 1789161 1868062 1949532 2030372 2107496 2179442 2245614
62287 2245614 2304922 2355805 2397156 2428587 2450041 2461749 2464428 2458756 2444473 2420574 2386833 2344710
62275 2344710 2296412 2243568 2187473 2130221 2074483 2021813 1971732 1922802 1874177 1825950 1778723
62264 1778723 1733480 1691383 1652745 1616168 1579493 1541946 1504815 1469625 1436066 1402446 1368054
62253 1368054 1334312 1303265 1275427 1249570 1224289 1199233 1175056 1152855 1133623 1117486 1103226
62242 1103226 1089317 1075838 1064727 1057531 1053403 1049999 1045959 1041776 1038585 1037049 1037450 1039943 1044412
62229 1044412 1050540 1058111 1066733 1075341 1082806 1089218 1095919 1104062 1113836 1125255 1138666 1153890 1169755
62216 1169755 1185415 1201606 1219614 1239374 1259673 1280219 1302402 1327647 1355872 1386137 1418137
62205 1418137 1452255 1488495 1526448 1566572 1610603 1659769 1712946 1767648 1823183 1882000 1947090
62194 1947090 2018476 2093063 2167729 2241504 2314544 2386091 2454217 2516948 2572671 2619577 2655609
62183 2655609 2679324 2690594 2690350 2679874 2660258 2632130 2595630 2550642 2497140 2435359 2366028 2290805
62171 2290805 2212535 2134608 2059529 1987976 1919378 1853443 1790908 1732585 1678054 1626007 1576090
62160 1576090 1529759 1488708 1452825 1420394 1390146 1362247 1337153 1314504 1293769 1275307 1259766
62149 1259766 1246520 1233631 1219833 1206091 1194588 1186245 1179828 1173740 1168163 1164784 1164640 1167141 1171277
62136 1171277 1176693 1182932 1188631 1192776 1196370 1201516 1208855 1217133 1225484 1234834 1246404 1259864 1273869
62123 1273869 1287663 1301151 1313884 1325191 1335426 1346311 1359643 1375873 1394008 1412618 1430915
62112 1430915 1449126 1468151 1489005 1512530 1539331 1569718 1603960 1642772 1687070 1736672 1789676
62101 1789676 1843946 1898808 1954168 2008202 2057462 2099671 2135067 2164404 2187031 2201930 2209430
62090 2209430 2210507 2205086 2192372 2172441 2146221 2114133 2075943 2032045 1984063 1934201 1884584 1836955
62078 1836955 1792074 1749563 1709048 1671252 1637212 1606770 1578897 1553394 1531172 1512684 1497028
62067 1497028 1482883 1469570 1456934 1444957 1433821 1423867 1415267 1408131 1402914 1400092 1399280 1399190 1398615 1397033
62053 1397033 1394287 1390294 1385221 1379452 1373282 1366990 1361068 1355821 1350749 1344941 1338083 1330519 1322391 1313509
62039 1313509 1304161 1295323 1287737 1281252 1275282 1269506 1264051 1259354 1255967 1254249 1254488 1257585 1264916 1276618
62025 1276618 1290402 1303270 1314392 1325325 1337574 1351223 1366058 1382537 1401051 1421382 1443569
62014 1443569 1468286 1495599 1524300 1553403 1583557 1616065 1650924 1686741 1722240 1757176 1792164
62003 1792164 1828387 1867235 1909395 1954112 1999583 2043895 2085335 2122253 2153280 2177719 2195472
61992 2195472 2206597 2210961 2208092 2197356 2178561 2152277 2119160 2079178 2032293 1979765 1923764 1865462
61980 1865462 1804561 1741138 1676998 1614547 1555056 1498587 1444819 1393387 1344190 1298037 1256246
61969 1256246 1218875 1184106 1150094 1116834 1085606 1057551 1033488 1013918 997842 982468 965638
61958 965638 948100 932018 917808 904196 891109 880502 873784 869920 866775 863208 859190 854922 850780
61945 850780 847641 846502 847811 851203 855549 859366 861868 863821 866699 870816 874860 877441 878402 878321 877388
61930 877388 875316 871996 867806 863349 858993 854501 849085 842107 833792 824988 816389 808293 800902 794282
61916 794282 788024 781511 774582 767624 761091 755317 750532 746501 742310 737127 731097 725020 719424 714621
61902 714621 711280 709921 709892 709853 709422 709507 710975 713846 717784 722308 726402 729093 730876 733557 738189 744097
61886 744097 750453 757883 767833 781066 797405 816178 836259 856368 876067 896104 917331 939817
61874 939817 963312 987685 1012380 1036306 1058938 1080691 1101498 1120052 1135461 1148716 1161273
61863 1161273 1172833 1181925 1188168 1192499 1195417 1196556 1196095 1195143 1194390 1193554 1192617 1192582 1194486 1198465 1204395
61848 1204395 1212698 1223830 1237258 1251376 1264297 1274724 1282642 1289374 1296436 1303914 1310238 1313734 1313980
61835 1313980 1311442 1306293 1298230 1287406 1275108 1263029 1251671 1239682 1225358 1208995 1193118 1179839
61823 1179839 1168520 1156796 1143440 1129285 1115654 1103119 1091804 1081558 1071417 1060083 1047667
61812 1047667 1036040 1026723 1019231 1012389 1006529 1003189 1002931 1004596 1006827 1009448 1013117 1018346 1025260 1033913
61798 1033913 1044387 1056714 1071008 1087750 1107876 1132334 1161174 1192918 1225213 1256619 1287742
61787 1287742 1320384 1355553 1392416 1428972 1463453 1495112 1523926 1549666 1571246 1587203 1596985
61776 1596985 1601596 1602719 1601300 1597320 1590968 1583662 1577534 1573810 1571931 1570578 1569663 1570893 1575973 1584506
61762 1584506 1594243 1603243 1611030 1617581 1622146 1623651 1621574 1615715 1605596 1590869 1572036 1550020 1525218
61749 1525218 1497713 1468193 1437872 1407522 1377437 1348276 1320919 1295199 1269769 1243843 1218395
61738 1218395 1194967 1173809 1153903 1134464 1115661 1097955 1081400 1065701 1050495 1035501 1020764
61727 1020764 1006828 994331 983285 973013 962931 953177 944326 936678 930031 924105 918873 914295 909903
61714 909903 905075 899816 894866 890665 886551 881603 876142 871687 869280 868525 868535 869089 870327 871980 873748
61699 873748 876046 879423 883352 886526 888442 889846 891376 892702 893524 894597 896824 899603 901016 899758
61685 899758 896190 891378 885762 879364 872823 867343 863340 859769 855334 850151 845493 841905 838450 834403
61671 834403 830923 829864 830984 831592 829544 825794 823183 823207 824873 826500 827554 828371 828843 828141 825682 822020
61655 822020 818705 817182 817578 818436 817852 815030 810698 806135 802050 798413 794851 790850 785943 780163 774160
61640 774160 768430 762533 755674 748161 741630 737355 734648 731428 726235 719231 711406 703570 696294 690176
61626 690176 685401 681165 676209 670160 664130 659776 657878 657802 658046 657142 654350 649989 645300 641737 640098
61611 640098 640212 641475 643568 646460 649723 652308 653398 653312 653057 652982 652538 651539 650803 650839 650638 649061 647220
61594 647220 647935 652232 657603 660744 661142 660815 661301 662533 664515 668187 673835 679990 685047 689142 693321
61579 693321 697478 700405 701645 702002 702121 701756 700751 699666 698859 697854 696347 695070 694811 695154 695096 694485
61563 694485 693836 692980 691031 687675 683498 678929 673985 669326 666265 664965 663616 660442 655947 652139 649878
61548 649878 647973 644781 639803 633647 627206 621040 615098 608997 602912 597910 594816 592941 590605 586823
61534 586823 581851 576454 571591 568542 567905 568197 566804 563035 559220 558033 559574 561844 563198 563247 562047
61519 562047 559751 556963 554392 552069 549613 547151 545270 544109 543257 542644 542791 543967 545597 546731 546829
61504 546829 546068 545210 545184 546467 548855 551920 555394 558900 561824 564003 566044 568312 570057 570482 570358 571478
61488 571478 574493 578288 581585 584100 585857 586463 585686 584064 582394 581150 580662 581160 582169 582645 582349 582521
61472 582521 584512 588161 592087 595173 597242 598734 600357 602675 605285 606658 605508 602241 598456 595183
61458 595183 592303 589605 587582 586902 587523 588607 589057 588111 585853 583314 581757 581596 582150 582522 582558 582765 583465
61441 583465 584203 584111 582798 580872 579527 579610 581026 582920 584417 585424 586828 589511 592857 594672 593330
61426 593330 589841 586924 586062 586359 586414 586134 586141 586499 587039 588231 590649 594043 597912 602514 608071 613289 616131
61409 616131 616274 615627 616059 617673 619749 622192 625160 628029 629830 630453 630642 631024 631814 633234 635339 637338
61393 637338 637946 636839 635326 635022 636153 637624 638589 639307 640280 641256 641683 641824 642600 644303 646172 647455
61377 647455 648247 648914 649352 649360 649184 649027 648546 647706 647751 650170 654620 658893 661178 661600 661347 661278 661784 663111
61359 663111 665031 666789 668084 669620 672026 674668 676395 677165 678060 679656 681176 681541 680694 679527 678760
61344 678760 678182 677008 674919 672643 671187 670404 668817 665355 660949 657759 656932 657768 659062 660451 662142
61329 662142 664044 665757 667135 668361 669637 671148 673143 675692 678546 681526 684894 688925 693260 697113
61315 697113 700079 702418 704641 707323 711201 716716 723065 728296 730932 731474 731970 734185 738309 743105 746967
61300 746967 749057 749860 750731 752771 756315 761514 768793 778156 788454 798209 807112 815951 825101 834004
61286 834004 842398 851133 861072 871738 881755 890342 897775 904582 910834 916199 920290 923026 924972 927188
61272 927188 930447 934660 939183 943325 946215 946640 943792 938264 931883 926453 922832 921025 920669 921326 922614
61257 922614 924334 926606 930065 935760 944300 954891 965696 975533 984800 994597 1005700 1018809 1034819
61244 1034819 1053705 1073712 1092757 1110246 1126393 1140297 1150316 1156350 1159935 1161647 1160146 1154763
61232 1154763 1147480 1140844 1134781 1127094 1116796 1105508 1095472 1087293 1079977 1072306 1063740 1054532 1045546
61219 1045546 1037806 1031823 1027181 1022797 1017692 1011766 1006040 1002072 1001009 1002989 1007183 1012145 1016455 1019631
61205 1019631 1022522 1026375 1031470 1037022 1042395 1047737 1053467 1059784 1066855 1074711 1082636 1089462 1094960 1100245
61191 1100245 1106291 1112712 1118627 1124058 1129663 1135484 1140682 1144221 1145306 1143681 1140211 1136722 1134478 1133078
61177 1133078 1131424 1129231 1126801 1124072 1121120 1119171 1119652 1122198 1124829 1126353 1127576 1130057 1134701 1141689
61163 1141689 1150537 1159824 1168083 1175525 1183812 1193571 1203285 1211456 1218687 1226495 1235060 1243582 1252193 1261746
61149 1261746 1271811 1280569 1287133 1292589 1298133 1303390 1307581 1311454 1316849 1324725 1334655 1346006 1358421
61136 1358421 1371043 1382524 1392505 1402285 1413223 1424991 1436137 1445935 1454785 1462995 1470183 1475889 1479794
61123 1479794 1481216 1479513 1475497 1471442 1468854 1466876 1463738 1459193 1454523 1450499 1446454 1441443 1435428 1429004
61109 1429004 1422503 1415548 1407153 1396380 1383366 1369632 1356844 1345252 1333789 1321512 1308325 1294462
61097 1294462 1280102 1265671 1251813 1238801 1226392 1214362 1202680 1191210 1179954 1169738 1161951
61086 1161951 1157202 1154602 1152494 1149471 1144716 1138127 1130351 1122142 1113471 1103873 1093886 1085397 1080111 1078165
61072 1078165 1078554 1080302 1082858 1085970 1089796 1094898 1101804 1110868 1122614 1137561 1155424 1175145 1196062
61059 1196062 1218433 1242418 1267347 1292639 1318814 1346867 1377124 1409239 1442825 1477375 1512076
61048 1512076 1546408 1580561 1614642 1647924 1679548 1709340 1737131 1761931 1782902 1800714 1816626
61037 1816626 1830392 1840382 1845818 1847497 1846075 1841020 1832040 1820419 1807922 1794969 1780751 1764787
61025 1764787 1747514 1729573 1711343 1693247 1675888 1659592 1644222 1629679 1616396 1605087 1596144
61014 1596144 1589517 1585081 1582766 1582267 1583130 1585557 1590735 1599724 1612136 1626629 1642768 1661523 1683657
61001 1683657 1708553 1735232 1763807 1795168 1829744 1867357 1907871 1951190 1996894 2044636 2094682
60990 2094682 2147420 2202732 2260619 2321930 2387393 2456165 2526450 2597490 2669895 2744029 2819288
60979 2819288 2895150 2971756 3049068 3126573 3204391 3283678 3365189 3448145 3531349 3615017 3700804
60968 3700804 3790205 3883368 3979373 4077534 4178616 4284921 4399026 4522666 4657157 4804393
60958 4804393 4966570 5145114 5340925 5555800 5792973 6056672 6352457 6688084 7072887
60949 7072887 7516324 8028295 8620321 9304316 10090225 10987450 12009380 13174575 14504525
60940 14504525 16025354 17770771 19767973 21999495 24369475 26714220 28858284 30671653
60932 30671653 32090016 33108017 33777631 34211735 34558767 34935414 35359238 35738246 35924459
60923 35924459 35782431 35225611 34220836 32788345 31004644 28990189 26874838 24763036
60915 24763036 22722534 20793323 18997172 17340513 15818644 14424235 13152222 11997172
60907 11997172 10950226 10001328 9142574 8367572 7669418 7041575 6479635 5980251 5538879
60898 5538879 5149849 4807610 4506273 4238832 3998848 3782871 3589767 3417732 3263153
60889 3263153 3122247 2992444 2872104 2760132 2656171 2560206 2471597 2389051 2311593 2238888
60879 2238888 2170597 2106087 2044818 1986471 1930748 1877657 1827729 1781173 1736979 1693813 1651742
60868 1651742 1612051 1575255 1540377 1506481 1473880 1443262 1414503 1387090 1361092 1337003 1315061
60857 1315061 1295220 1277380 1260979 1244884 1228409 1212191 1197326 1183745 1170266 1156368 1143189
60846 1143189 1132331 1123977 1116596 1108496 1099388 1090334 1082317 1075186 1068227 1061397 1055303 1049884 1043924 1036477
60832 1036477 1028312 1021052 1014928 1008205 999124 987858 976142 965413 955885 947215 939373 932436 925764
60819 925764 917809 907041 893322 878477 865278 855437 848420 842368 836196 830519 826422 823896 822088
60806 822088 820801 820774 822212 823917 824648 824944 826773 831458 838569 846722 854586 861018 865276 867814 870280
60791 870280 873963 878487 882570 885739 888611 891779 895127 898198 900535 901698 901605 900822 899677 897149 891783
60776 891783 884018 876388 870612 865556 859146 851417 844178 838223 832614 826709 821073 815810 809620 801604
60762 801604 792913 785509 779989 775628 771770 767934 763150 756648 749209 742576 737446 733059 728786 724905
60748 724905 721467 717517 712045 705000 696981 688644 680861 674681 670539 668049 666953 667498 669368 671121
60734 671121 671583 671214 671185 671529 671182 669672 667912 667384 669173 673508 679419 685043 689194 692634 696981 702445
60718 702445 707597 711339 713912 715657 716056 714844 713171 712578 713241 714038 714089 713414 712307 710896 709327 707683
60702 707683 705679 703134 700798 699838 700054 699350 695790 689951 684499 681443 680434 679815 678634 677140 675848
60687 675848 674777 673566 671769 669063 665654 662571 661034 661200 661815 661354 659269 655961 651966 647617 643245
60672 643245 639209 635683 632659 630158 628238 626827 625753 624927 624383 624174 624274 624455 624319 623819 623779 625368
60656 625368 628735 632550 635268 636598 637440 638789 641138 644528 648503 652136 654664 656122 657157 658434
60642 658434 660451 663393 666610 668715 668884 667750 666402 664965 663055 661208 660672 661728 663196 663695 662687
60627 662687 660462 658014 656817 657552 658991 659264 658307 657808 658557 659321 658879 657736 657012 656889 657156 658182 660158
60610 660158 662125 662888 662351 661095 659269 656838 654265 651997 649853 647789 646569 646580 646638 645238 642516 639828
60594 639828 637896 636643 636372 637581 639825 642338 645657 651032 658058 664538 669079 672322 675051 676679
60580 676679 676583 675568 674719 673604 670937 666661 662280 659226 657643 656716 655502 653446 650640 647741 645438
60565 645438 643914 642873 641906 640876 640159 640454 641926 643566 644008 643150 642383 642863 644063 644501 643583 642285
60549 642285 642167 644106 647863 652509 657042 660679 662853 663392 662881 662411 662639 663394 664534 666624 670118 674350
60533 674350 678280 681845 685569 689029 691021 691357 691318 691989 693260 694775 696714 699122 701528 703820 706482
60518 706482 709354 711382 712438 714251 718395 724355 730852 738152 747488 758734 770396 781855 794070
60505 794070 807837 822662 837716 852675 866987 879277 888234 893560 895648 894863 891727 887333 882954
60492 882954 879302 876574 875094 875464 877908 881612 885085 887486 889645 893445 900124 909475 920743 933677
60478 933677 948341 964563 982321 1002305 1025230 1050585 1076730 1102233 1126580 1149547 1170521
60467 1170521 1188580 1202868 1212725 1217858 1218527 1215392 1209154 1200503 1190247 1179250 1168354 1158495 1150486
60454 1150486 1144349 1139251 1134565 1130721 1128573 1128384 1130050 1133842 1140100 1148514 1158704 1171381 1187991
60441 1187991 1209135 1234220 1262793 1295328 1332443 1374038 1419422 1467604 1517155 1566397 1613953
60430 1613953 1658782 1699712 1735616 1766074 1791210 1810911 1824962 1833876 1838648 1839504 1835681 1826332
60418 1826332 1810568 1786730 1753330 1711336 1664137 1614433 1562433 1507968 1452865 1399720 1349358
60407 1349358 1301137 1255184 1212609 1173696 1137347 1102426 1068529 1035525 1003575 973735 947405
60396 947405 924984 905982 890409 878878 871013 864825 858151 849983 840211 829125 817626 806991
60384 806991 797755 789470 781962 775926 771596 767721 762945 757753 754002 752621 752618 752314 750819 748285 745445
60369 745445 743170 741907 741221 740161 738283 736012 733864 731716 729270 727091 726620 728758 732545 735646 736459
60354 736459 735574 734891 735533 737118 739042 741650 745595 750518 755140 758686 761646 764962 768859 772712 775866
60339 775866 778409 781228 785246 790443 795607 799345 801415 802889 804973 807951 811323 814565 817517 820254
60325 820254 822939 825671 828288 830583 833021 836956 843358 851270 858177 862375 864616 866971 870441 874339
60311 874339 877940 881831 887033 893251 898817 902592 905299 908388 911825 913887 913558 912513 913814 918729
60297 918729 925630 932209 937925 943802 950767 959111 968971 980039 990913 1000013 1007476 1015066 1023756 1032317
60283 1032317 1038799 1042479 1043600 1042135 1037923 1031469 1023557 1014375 1004120 994076 985888 979782 974596
60270 974596 969550 964836 960373 955427 949946 944944 940845 936609 931483 926581 923567 922507 922331 922845 924898
60255 924898 928744 933654 939226 945981 954521 965117 978239 994234 1012264 1030870 1050111 1071829
60243 1071829 1096707 1122096 1143963 1160343 1171546 1177531 1176968 1169374 1156734 1141948 1126336 1109543
60231 1109543 1091422 1072862 1054674 1036717 1018761 1001609 986470 973399 961358 950148 941276
60220 941276 936091 933650 931496 928227 924175 919660 914099 907388 900860 895855 892188 888988 886236 884208
60206 884208 881970 877994 872318 866840 863237 861512 860699 859867 858129 854795 850208 845710 842243 839560 837161
60191 837161 835190 833847 832753 831733 831624 833349 836451 839474 841646 843521 845899 848730 851082 851768 850021
60176 850021 846085 841309 837463 835879 837119 840992 846492 852142 856888 860602 863547 865871 868062 871324
60162 871324 876627 883494 890363 896086 900595 904453 908512 913803 920867 929103 937479 945898 955071 965028
60148 965028 974798 983948 993560 1004988 1018048 1031060 1042455 1052082 1061201 1071346 1082831 1094202
60136 1094202 1103617 1110843 1117261 1123814 1129967 1135261 1140832 1148101 1156345 1162938 1166203 1166965 1166947 1166502 1164693
60121 1164693 1161028 1156169 1150891 1145068 1138071 1129900 1121500 1113903 1107268 1100842 1093863 1086429 1079579 1074460
60107 1074460 1071282 1068960 1065906 1061259 1055381 1049261 1043698 1039074 1035419 1032373 1029328 1026081 1023206 1021354
60093 1021354 1020321 1019262 1017772 1016282 1015382 1015280 1016050 1017865 1020652 1023851 1026878 1029684 1032726 1036495 1041210
60078 1041210 1046787 1052998 1059668 1066680 1073787 1080685 1087365 1094019 1100346 1105563 1109680 1114096 1119940 1126293
60064 1126293 1131366 1135292 1140124 1146767 1153572 1158856 1163320 1168598 1174485 1179379 1183076 1187365 1193535 1200567
60050 1200567 1206299 1209624 1211080 1211867 1212788 1213855 1214536 1214392 1213527 1212362 1211083 1209411 1206800 1202802 1197535
60035 1197535 1191851 1186660 1181954 1176972 1171519 1166440 1162412 1159042 1155748 1152757 1150321 1147605 1143497 1138247
60021 1138247 1133276 1129556 1127096 1125659 1124720 1122874 1118728 1112720 1106815 1101984 1097090 1090741 1083122 1075200
60007 1075200 1067114 1058283 1048557 1038345 1027976 1017656 1007763 998533 989653 980710 971850 963602 956393
59994 956393 950662 947056 945836 946215 946827 946730 945689 943852 941759 940461 940895 943066 946237 949881 953997
59979 953997 958622 963620 968972 974728 980523 985742 990387 995305 1001054 1006829 1010976 1012639 1012603 1012472 1013164
59964 1013164 1014180 1014035 1011253 1005153 996115 985278 973793 962095 949806 936425 922082 907616
59952 907616 894107 882450 873188 866310 861073 856347 851373 846186 841339 837408 834719 833195 832278 831233
59938 831233 829720 827874 825736 823002 819749 817113 816558 818297 820974 823290 825589 829342 835224 842293
59924 842293 849072 854780 859208 862173 863805 864939 866212 866877 865580 862523 859854 859325 860372 861134 860547
59909 860547 858561 855120 850325 845403 842138 841034 840940 840809 840967 842348 845228 849231 854004 859334 864801
59894 864801 869680 873167 874840 875239 875774 877463 879758 881225 881324 880797 880386 880145 880115 880484 880704 879552 876790
59877 876790 873841 871935 870484 868301 865760 864558 865596 868214 871366 874580 877783 881125 885199 890672
59863 890672 897397 904304 910302 914972 918427 921005 923150 925239 927473 930114 933526 937528 941042 943081
59849 943081 944139 945998 950118 956538 964175 971593 977574 981741 984975 988773 993906 999955 1006149 1012240
59835 1012240 1018455 1024939 1031403 1037134 1041444 1044527 1047779 1052782 1059929 1068427 1077514 1086980 1096424 1104845
59821 1104845 1111632 1117594 1124440 1133197 1143276 1153006 1160962 1166967 1171979 1176977 1181912 1185799 1187628 1187055
59807 1187055 1184408 1180387 1175641 1170334 1164276 1157813 1152185 1148295 1145339 1141565 1136488 1131462 1127862 1125658
59793 1125658 1124316 1124173 1126004 1129742 1134584 1140159 1146703 1154068 1161302 1167461 1172308 1176000 1178518 1179720
59779 1179720 1179783 1179372 1179390 1180493 1182532 1184375 1184607 1182688 1179423 1176092 1173059 1169329 1163559 1155539 1146650
59764 1146650 1138865 1133231 1129190 1125084 1119297 1111175 1101316 1091064 1081520 1072868 1064591 1056171 1047448 1038555
59750 1038555 1029873 1022090 1015877 1011290 1007609 1003866 999498 994624 990005 986680 985185 984901 984416 982712
59736 982712 979818 976314 972524 968452 964231 960384 957680 956769 957724 959732 961413 961680 960467 958809 958321
59721 958321 960185 964053 967998 970185 970708 971291 973128 975772 978304 980579 982717 984269 984877 985262 986472
59706 986472 988493 990679 993375 997806 1004155 1011004 1017324 1024020 1032554 1042659 1052507 1061004 1068990 1077923
59692 1077923 1088068 1098487 1108582 1119109 1131424 1145882 1161318 1176213 1190080 1203388 1216392
59681 1216392 1228585 1239377 1248782 1257177 1264671 1270901 1275244 1277296 1277591 1277823 1279561 1282329 1283731 1282097
59667 1282097 1278412 1274854 1272000 1268655 1264147 1259293 1254706 1249504 1242676 1234912 1227895 1222160 1216761 1211033
59653 1211033 1205576 1201058 1196990 1192497 1187901 1184606 1183345 1183245 1182981 1182199 1181248 1179948 1177632 1174521 1172099
59638 1172099 1171570 1172529 1173836 1175219 1177102 1179245 1180777 1181663 1182878 1184617 1185461 1184215 1181810 1180277 1180163
59623 1180163 1179942 1177885 1173727 1168459 1163287 1158993 1155661 1152616 1148822 1143548 1136662 1128618 1120363 1112864
59609 1112864 1106250 1099745 1092996 1087009 1082894 1079979 1076295 1071055 1065614 1061694 1059648 1058871 1058915 1059394 1059444
59594 1059444 1058254 1056052 1054083 1053678 1055498 1059229 1063632 1067222 1069235 1069827 1069333 1067851 1065631 1063132 1060405
59579 1060405 1057059 1053093 1048970 1044516 1038791 1031806 1025351 1020974 1017732 1013226 1006636 999616 994224 990914
59565 990914 988702 986509 984135 982269 981483 980938 978580 973184 965713 958017 950866 944251 938839 935556 933898
59550 933898 932210 929832 927637 926232 925016 923426 921836 920624 919509 918437 918094 918845 920135 921543 923320
59535 923320 925132 925506 923795 921769 921787 923819 925682 926056 925977 927163 929905 932953 934821 934898 933713 932297
59519 932297 930992 928989 925378 920508 915853 912630 910913 909942 908733 906502 903072 899041 895371 892842
59505 892842 892022 893241 895987 898586 899310 897996 896167 895462 896205 897396 897620 896063 893226 890885 890881 893627
59489 893627 897853 901875 904967 907647 910918 915354 920784 926787 933436 941318 950772 961546 973494 987112
59475 987112 1002711 1019259 1034691 1047435 1057077 1063563 1066511 1065828 1062632 1058930 1056140 1054040 1051337
59462 1051337 1047344 1042991 1040073 1039562 1040941 1043027 1044879 1045787 1045081 1042564 1038834 1034730 1030671 1026797 1023248
59447 1023248 1019755 1015404 1009580 1002957 996820 991538 986378 980711 974669 968602 962588 956570 950408 943862
59433 943862 937158 931460 927876 925970 924237 922289 921488 922869 925423 927382 928605 930702 935010 941190
59419 941190 947740 953237 957155 960116 963463 968201 974215 980631 986726 992117 996369 999137 1000890 1002933
59405 1002933 1006237 1010361 1013853 1015725 1016369 1017016 1018562 1021191 1024916 1029906 1036035 1042645 1049289 1056397
59391 1056397 1064552 1073314 1081594 1089211 1097097 1105676 1114044 1121406 1128323 1135394 1141330 1143910 1142897 1140587
59377 1140587 1138915 1137229 1133911 1129322 1125737 1124530 1124733 1124746 1124394 1124568 1125598 1127060 1129030 1132601 1138920
59362 1138920 1148291 1160334 1174413 1189774 1206044 1223990 1245102 1269853 1296945 1324924 1353909
59351 1353909 1384787 1417165 1449125 1478675 1504221 1523838 1535803 1540499 1540591 1538566 1535154 1530948 1528302
59338 1528302 1530002 1536326 1544574 1551305 1553948 1550517 1539372 1520182 1494644 1465787 1436655 1409379
59326 1409379 1384682 1361932 1340204 1319657 1301603 1287146 1276083 1267215 1259302 1251647 1244188 1237279
59314 1237279 1231111 1225394 1219952 1215527 1213327 1213649 1215568 1218068 1220691 1222909 1223984 1224240 1225589 1229572
59300 1229572 1235309 1240697 1245526 1252020 1261800 1273556 1284637 1294179 1303525 1313937 1325144 1336406 1347920
59287 1347920 1360508 1374441 1389342 1404963 1421252 1437523 1452223 1463967 1472642 1479338 1485445 1491899
59275 1491899 1498763 1504987 1508751 1508654 1504714 1497862 1488467 1475821 1459309 1439700 1418904 1398556 1379113
59262 1379113 1360218 1341554 1323144 1305082 1287384 1270307 1254531 1240679 1228634 1217692 1207461
59251 1207461 1198159 1189829 1181838 1173773 1166454 1161278 1158615 1157583 1157393 1158213 1160651 1165243 1172717 1183755
59237 1183755 1197752 1212299 1224519 1232634 1236039 1234689 1229167 1220757 1210539 1198767 1185874 1173633
59225 1173633 1164246 1158395 1155043 1153007 1151815 1151164 1150701 1150609 1151633 1154359 1159167 1166700 1177290 1189856
59211 1189856 1202698 1215754 1230819 1248918 1268697 1288153 1306757 1324714 1341236 1354977 1365691
59200 1365691 1374180 1380968 1386187 1390378 1394002 1396251 1395620 1391881 1386513 1381026 1375837 1370990 1366906 1363822
59186 1363822 1361124 1357788 1353269 1347875 1342580 1338293 1334827 1330807 1325322 1319432 1315117 1312806 1310939 1307998
59172 1307998 1303810 1298666 1292509 1285665 1279310 1274296 1270133 1265760 1260638 1254397 1246208 1235530 1223104
59159 1223104 1210365 1198098 1186404 1175665 1166659 1159674 1154080 1148832 1143073 1136499 1129624 1123591 1119264
59146 1119264 1116526 1114687 1113301 1112226 1111123 1109406 1106763 1103600 1101026 1100195 1101114 1102141 1101450 1099198 1097322
59131 1097322 1096801 1096301 1094361 1091803 1090544 1090743 1090784 1089885 1089058 1089196 1089694 1089607 1089038 1088614 1088435 1088341 1088567 1089254
59113 1089254 1089733 1089094 1087412 1085758 1085003 1085060 1085375 1085726 1086396 1087851 1090529 1094729 1100304 1106303 1111262 1114257
59097 1114257 1115575 1116025 1115677 1113859 1110336 1105770 1100721 1094944 1088186 1081027 1074219 1067689 1060926 1053902
59083 1053902 1046787 1039134 1030374 1020978 1012116 1004213 996811 989952 984584 981155 978680 975827 972381 969146
59069 969146 966839 965683 965840 967691 971549 977228 984056 991538 999974 1009996 1021323 1032606 1043078
59056 1043078 1053727 1065964 1079512 1092550 1103654 1112599 1119669 1125520 1131612 1139177 1147376 1153902 1157926
59043 1157926 1161186 1165529 1170673 1175237 1178711 1181310 1182859 1183104 1182482 1181525 1180067 1177978 1176007 1174771 1173535
59028 1173535 1171219 1168101 1165247 1162707 1159761 1156659 1154454 1152914 1150205 1145124 1138297 1130554 1121492 1110740
59014 1110740 1099641 1090313 1083326 1077252 1070472 1062702 1054831 1047904 1042371 1037867 1033654 1029478 1025859 1023244
59000 1023244 1021079 1018224 1014266 1009829 1005476 1000906 995719 990582 986928 985500 985716 986561 987454 987916 987054
58985 987054 984242 980139 976315 973726 972193 971402 971589 972839 974411 975479 976259 977826 980985 985733 991561
58970 991561 997638 1002794 1006024 1007402 1008376 1011079 1017287 1027604 1041227 1056595 1072667 1089480 1107257
58957 1107257 1125286 1142223 1157307 1170675 1182515 1192521 1200247 1205461 1208041 1208099 1206350 1203830 1201038
58944 1201038 1197895 1194691 1192345 1191345 1191169 1191294 1192006 1193429 1194578 1194618 1194591 1196399 1200138 1204110 1207824 1213193
58928 1213193 1221587 1231169 1238759 1243463 1246792 1249769 1251908 1252972 1253761 1254650 1255070 1255260 1257080 1262076 1269905
58913 1269905 1279565 1290905 1303822 1317273 1330652 1345197 1362273 1380873 1398560 1414478 1429625
58902 1429625 1444334 1457475 1468356 1477576 1485570 1491911 1496587 1500231 1502287 1500664 1494362 1485131 1475171
58889 1475171 1464252 1450462 1433087 1413379 1392975 1372883 1353810 1336302 1320426 1305938 1292664
58878 1292664 1280306 1268336 1256762 1246490 1238181 1231157 1224388 1218165 1213781 1211634 1210674 1209823 1209122 1209149
58864 1209149 1209890 1210614 1210598 1209796 1208825 1208320 1208292 1208209 1207563 1206037 1203399 1199972 1197151 1196445 1197807 1199914 1202403
58847 1202403 1206506 1212811 1219897 1226513 1233856 1244011 1256872 1270515 1284273 1299493 1317117 1336217
58835 1336217 1355395 1374247 1392903 1411421 1430348 1450839 1473355 1496871 1519950 1542096 1563616
58824 1563616 1584794 1605695 1626171 1645534 1662705 1677224 1689779 1701206 1711226 1718540 1721940 1721041
58812 1721041 1716211 1708300 1698433 1687783 1677271 1667276 1657368 1646500 1633861 1619644 1604777 1589826
58800 1589826 1574492 1558233 1541153 1524123 1508147 1493598 1479910 1466004 1451097 1435128 1418520
58789 1418520 1401735 1385075 1368605 1352272 1336399 1321891 1309319 1297884 1286211 1274283 1263413
58778 1263413 1253811 1243513 1230761 1216321 1202135 1188566 1174642 1160503 1147834 1137766 1129852 1123284
58766 1123284 1117800 1113203 1109334 1106829 1106678 1108574 1110864 1112644 1114934 1119241 1125826 1133748 1141638 1147888
58752 1147888 1151293 1152378 1153343 1155742 1158771 1160600 1160761 1160236 1159575 1158078 1155052 1151058 1147380 1144382 1140781
58737 1140781 1134825 1126234 1116634 1107738 1099433 1090241 1079450 1068048 1057587 1048966 1042477 1038190 1035682
58724 1035682 1033917 1031930 1029598 1027609 1026876 1027993 1030842 1034638 1038520 1042039 1044869 1046482 1046652 1045831 1044253
58709 1044253 1041085 1035491 1028443 1022240 1018113 1015237 1012209 1008386 1003597 997857 992015 987622 985360 984258
58695 984258 983167 982314 982779 984984 988368 992160 995904 999516 1003189 1006931 1010056 1011679 1011955 1012333 1014354
58680 1014354 1018683 1025296 1033645 1042358 1049783 1055535 1060920 1067302 1074703 1082401 1090038 1097353 1103629 1108477
58666 1108477 1112880 1118461 1125643 1133211 1139865 1145780 1152379 1160624 1169652 1177323 1182298 1185364 1188484 1192868
58652 1192868 1198447 1204633 1210636 1215209 1217260 1216970 1215500 1213388 1209949 1204271 1196019 1185263 1172455 1158543
58638 1158543 1144047 1128002 1109107 1088117 1067726 1049613 1032908 1016079 999011 982528 967211
58627 967211 953586 942265 932826 923560 913483 903761 895958 889509 882251 873281 864263 857703 854408
58614 854408 852747 850355 846688 843540 842669 843617 844952 846897 850932 857064 863707 870428 878383 887303 894616
58599 894616 898990 902535 907696 913748 918285 920566 921235 920011 915993 909595 902238 894756 887736 882527
58585 882527 879996 878899 877333 875221 873606 872215 869766 866287 863131 860911 859291 858624 859887 862933
58571 862933 866401 869264 871064 871113 869357 867707 868404 870985 872864 873154 873873 876911 881687 886583 891024
58556 891024 895247 899219 902731 905803 908439 910584 912414 913906 914247 912682 909922 907657 906815 907286 909000
58541 909000 911860 914842 916771 917959 919503 920912 920132 916210 910350 904007 897485 890788 884293 878096
58527 878096 872202 867933 867702 872705 881967 894070 908530 924997 942572 960595 978988 997315 1014720
58514 1014720 1031276 1048043 1065306 1082121 1098165 1114555 1132194 1150875 1170847 1193591 1219807
58503 1219807 1247999 1276445 1305415 1335963 1367458 1397917 1426436 1453873 1481112 1507528 1531215
58492 1531215 1550311 1564339 1574477 1582062 1586852 1587694 1585001 1581083 1577312 1572282 1563967 1552678 1540536
58479 1540536 1528610 1515914 1500942 1483028 1462220 1438859 1413566 1387179 1360606 1334915 1311232
58468 1311232 1290082 1270971 1252931 1235439 1218714 1203330 1189613 1177225 1165466 1154277 1144573
58457 1144573 1136996 1130717 1124286 1117294 1110190 1102839 1094739 1086519 1079697 1074707 1070678 1067410 1065835 1065945
58443 1065945 1066031 1064928 1063428 1062388 1061002 1058453 1055985 1055573 1057224 1059208 1060436 1061184 1061869 1062693 1064423
58428 1064423 1068119 1073805 1080410 1087183 1094310 1102058 1110260 1119055 1129348 1141856 1156039 1170630 1185243
58415 1185243 1200838 1218198 1236280 1252857 1266823 1278933 1289819 1298351 1302991 1303986 1302893 1300359
58403 1300359 1295940 1289935 1283798 1278512 1274093 1271040 1270701 1273468 1277816 1282005 1285991 1291114 1298675 1309119
58389 1309119 1321634 1334209 1344987 1353817 1361472 1367337 1369361 1366675 1360691 1352938 1343409 1332007 1320164
58376 1320164 1309629 1300557 1291975 1283482 1275510 1268483 1262674 1258446 1256000 1255187 1255863 1257922 1260885 1264254
58362 1264254 1268251 1273186 1278174 1281906 1284661 1287863 1291298 1292662 1290478 1285662 1279482 1271974 1263411 1255190
58348 1255190 1247768 1239563 1229690 1220190 1213594 1209452 1205228 1199787 1194176 1189690 1186818 1185536 1185097 1184076
58334 1184076 1181977 1180252 1180535 1182606 1185341 1188728 1193363 1198547 1202599 1204811 1205883 1206755 1208165 1210896
58320 1210896 1215246 1220559 1226157 1232202 1238828 1245301 1251153 1257313 1264793 1272943 1280392 1287193 1294700 1303650
58306 1303650 1313582 1323932 1334654 1345926 1358055 1371445 1386122 1401697 1418114 1435652 1453876
58295 1453876 1471645 1488594 1505276 1521245 1534611 1544506 1552521 1560613 1569089 1577720 1587053 1597078
58283 1597078 1606261 1613745 1621124 1630194 1640348 1650243 1660777 1673978 1689741 1705958 1721389 1736386
58271 1736386 1751240 1765984 1781667 1799844 1820586 1842397 1864074 1885449 1906422 1926390 1944566
58260 1944566 1960222 1973117 1984382 1996141 2009495 2023685 2037796 2051970 2066204 2079572 2091811
58249 2091811 2104338 2118559 2134573 2152427 2172758 2195038 2217309 2239189 2263095 2290705 2320270
58238 2320270 2349225 2377428 2405837 2434221 2462447 2491965 2523647 2556131 2588632 2623170 2661541
58227 2661541 2702391 2744018 2787616 2834734 2884081 2934302 2987488 3046070 3108526 3172343 3239099
58216 3239099 3311924 3389491 3467434 3544709 3623840 3705688 3788790 3873422 3961559 4052733 4144455
58205 4144455 4237025 4333914 4437228 4546652 4662911 4788157 4922592 5064519 5214130 5373742
58195 5373742 5543869 5722220 5906801 6097278 6293773 6497257 6710346 6934568 7167989
58186 7167989 7408870 7660143 7926509 8208880 8506040 8819887 9153917 9507889 9879301
58177 9879301 10269080 10680522 11113787 11567106 12042546 12544898 13075917 13635714 14228981
58168 14228981 14863523 15543213 16268752 17044742 17879378 18777460 19740194 20771419 21877600
58159 21877600 23062843 24331185 25693110 27162742 28750010 30463022 32316083 34326818
58151 34326818 36507860 38871462 41440554 44245230 47311531 50666986 54357004 58445095
58143 58445095 63001110 68104747 73858173 80377645 87773000 96154142 105662217 116485596
58135 116485596 128853527 143024673 159249467 177694348 198413519 221437415 246822140
58128 246822140 274401450 303308698 331748199 357364704 377951205 391932691 398442783
58121 398442783 397283455 388980970 374766164 356273738 335104078 312562927 289659499
58114 289659499 267182264 245708231 225576635 206901001 189625511 173601305 158668077
58107 158668077 144714052 131685822 119563843 108346589 98050081 88696044 80286725
58100 80286725 72793131 66162338 60323429 55188166 50661416 46657947 43105954 39939117
58092 39939117 37097174 34534764 32219830 30122161 28211191 26463965 24865393 23399427
58084 23399427 22048037 20799374 19648401 18587862 17605812 16693050 15845494 15057590 14320142
58075 14320142 13626509 12975005 12363542 11787436 11243773 10732564 10252342 9799442 9372266
58066 9372266 8971086 8593014 8232611 7888297 7562837 7256409 6964566 6684345 6417053
58057 6417053 6163199 5919673 5684086 5457526 5240757 5031581 4828147 4631569 4443292
58048 4443292 4262768 4089229 3922952 3763477 3609361 3460790 3319894 3187701 3063427
58039 3063427 2947115 2839857 2740886 2647628 2559460 2478393 2405354 2338848 2277808 2222499 2171814
58028 2171814 2122979 2075104 2030040 1988699 1949423 1910966 1874085 1839047 1804423 1769574 1735722
58017 1735722 1703428 1671592 1639930 1609701 1580921 1551628 1521180 1491647 1464521 1438581 1412505
58006 1412505 1387247 1364237 1343322 1323978 1306536 1290700 1274587 1256751 1237682 1218260 1198404
57995 1198404 1178279 1159087 1141438 1124439 1107415 1091117 1076355 1062943 1050810 1040575 1032105
57984 1032105 1023920 1014839 1005007 994893 984719 975184 967081 959786 951844 943245 935151 927159 917296
57971 917296 905371 893870 884417 875657 865947 856030 847496 840298 833287 825804 817599 808725 800592 795426
57957 795426 793292 791142 786228 779181 772379 766649 761114 755278 749580 744310 739272 734368 729956 726830
57943 726830 725918 727134 728552 727819 724625 720584 716662 712223 706832 701295 696360 691891 687896 684811 682311
57928 682311 679353 675925 673156 671203 668734 665065 660956 656696 651391 645112 639733 636447 634197 631765
57914 631765 629672 628696 628156 627187 626322 626344 626742 626663 626295 626135 625974 625626 625466 625195 623459 619865 616016 613340
57896 613340 611316 609091 607323 606825 606754 605937 604787 604099 603036 600307 596627 593974 592931 592695 593356 596060
57880 596060 600659 605056 607579 608916 610987 614612 618910 622835 626747 632008 638782 644877 647733 647319
57866 647319 645779 644259 641706 637265 632166 628147 625274 622424 618892 614516 609153 603104 597283 592103
57852 592103 586988 581724 577327 574682 573238 571907 570445 569188 568370 568365 569569 571279 571852 570824 569684
57837 569684 569723 570362 570582 570552 570623 570090 568452 566879 567048 569378 573494 579200 585676 591017 594203 596514 599463
57820 599463 602366 603709 603936 604983 607629 611012 614177 616483 617098 615730 613399 611015 607877 603105 597752
57805 597752 593590 590403 586429 581196 576081 572341 570440 571018 574572 580069 585603 590460 595068 599177
57791 599177 601980 604021 606914 610882 614328 616294 617631 619218 620657 621497 622339 623851 625620 626695 626598
57776 626598 625508 624159 623694 624749 626626 628272 629887 632374 635292 636929 636779 636571 638120 641132 643658
57761 643658 643911 641356 637003 633050 631320 631470 631354 629311 625393 620430 615074 610007 605747 601571 595697
57746 595697 587414 578256 570240 563573 556997 549956 543374 538188 533892 529119 523544 518760 516900 518541
57732 518541 522421 527096 532074 537121 541637 545634 550563 557956 567429 576929 584663 590019 593067 594242
57718 594242 594342 593869 592484 589940 587167 585429 584635 583584 581659 579266 576817 574467 572739 572225 572624
57703 572624 572995 572851 572076 570305 567719 565976 566574 568333 568332 565604 562100 559645 557978 556646 556829 559701
57687 559701 564211 568081 570260 571128 570965 569752 568215 567571 567824 567243 564177 559157 554766 553336 554899
57672 554899 557519 559373 559866 558801 555780 551407 548128 548280 551440 554957 556996 557776 557980 557599 556829 556668
57656 556668 557867 560170 563041 566239 569266 571299 572136 572326 572021 570751 568799 567614 568140 569645 570828
57641 570828 571202 570776 569409 567394 565872 565714 566556 567629 568820 570107 570726 569942 568251 566810 565894 564732
57625 564732 562651 559720 556514 553998 553532 556130 561545 568606 576668 586448 599287 615791 635367 657188
57611 657188 681543 710027 744165 783922 827491 871912 913357 947317 969669 978132 972787 955621
57599 955621 929904 899283 866423 832538 798685 766868 738859 714394 691674 669297 646704
57588 646704 623556 600464 579882 564057 551889 539942 527066 515921 509105 505841 503726 501855
57576 501855 500498 499168 496929 493934 491034 488330 485413 482525 480248 478332 475929 472802 469540 466752
57562 466752 464563 462521 459699 455534 450862 447207 444717 442014 438572 435747 434546 433915 432551 430977
57548 430977 430198 429434 427066 423081 418818 414893 411083 407708 405330 403363 400843 398346 397295 397313 396151
57533 396151 392501 387260 381696 376056 370698 367002 365980 366779 367436 366640 364262 360718 356415 351590 346473
57518 346473 341660 338068 336028 334759 333399 332165 331648 331367 330203 328124 326257 325113 323879 321671 318396
57503 318396 314138 308933 303689 300265 299824 301615 303846 305152 304879 302783 299295 295832 294220 295606 299662
57488 299662 304545 308015 309459 310773 314366 320195 325661 328583 329281 329435 329991 330838 331619 332035 331912 331705
57472 331705 332415 334402 336846 338992 341339 344749 348962 353047 357064 362131 368677 375639 381787 387142
57458 387142 392492 397981 402879 406750 410309 414785 420522 426450 431140 434384 437435 441427 445698 448145
57444 448145 447408 444350 440934 437981 434686 430316 425443 420920 416339 410501 403234 395677 388707 382094
57430 382094 375688 370420 367295 365905 364877 363600 362675 362650 363025 362813 361737 360559 360203 360637 360724 359361
57414 359361 356718 354073 352496 352085 352291 352299 351029 347788 343440 340178 339378 340077 340092 338187 334666 330498
57398 330498 326646 323736 321579 319184 315878 312182 309208 307670 307873 309826 312565 314181 313767 312823 313548
57383 313548 316090 318694 320245 321219 322259 323369 324738 326873 329313 330510 329808 328631 328844 330509 332026
57368 332026 332125 331074 330174 330496 332007 333601 334062 333138 331576 330156 328943 327513 325766 324473 324938 327638
57352 327638 331205 333511 334101 334749 336982 340047 342286 343567 344896 346273 346675 346017 345396 345260 344857 343887
57336 343887 343258 343691 344850 346385 348680 351972 355747 359621 363950 369073 374758 380672 386441 391011 393188
57321 393188 393298 393105 393577 393884 393195 392121 391593 391608 392063 393623 396583 399935 402718 405375 408544 411557
57305 411557 413619 415658 419203 423737 426795 426814 424649 422284 421219 422111 424727 427791 429742 430116 429803
57290 429803 429937 430969 432647 434326 435385 435883 436597 437882 438854 438463 437120 436337 436836 437774 437833 436366 433555
57273 433555 430234 427585 426222 425414 423863 421406 419362 419029 420285 421795 422188 421040 419137 417768 417364
57258 417364 416935 415288 412643 410488 409973 411088 413232 415833 418346 420402 422228 424403 427058 429781 432299
57243 432299 434697 436965 439029 441334 444629 448916 453240 456827 459794 462408 464460 465943 467669 470323
57229 470323 473336 475667 477602 480687 485580 490931 495178 498825 503804 510580 517114 521475 524799 530525
57215 530525 540642 553664 566641 578392 590063 603025 617124 631034 643608 654603 664529 674274
57203 674274 684767 696629 709776 723358 736336 748372 760037 771952 783917 795294 806179
57192 806179 817566 830195 843704 857247 870449 883353 895811 907566 918945 931098 945316
57181 945316 962164 981198 1001393 1021838 1042056 1061840 1081242 1100928 1121932 1144357 1166703
57170 1166703 1187402 1207001 1227937 1252128 1279704 1310111 1343115 1378147 1413891 1449469 1485284
57159 1485284 1521786 1558232 1593670 1628598 1664478 1701871 1740115 1778795 1818584 1860449 1904691
57148 1904691 1950940 1998804 2048398 2100297 2154610 2210126 2265038 2319001 2373872 2431867 2493448
57137 2493448 2557389 2622173 2686593 2749645 2810871 2870644 2929573 2987908 3045884 3103949 3161952
57126 3161952 3218806 3273752 3327457 3381148 3435245 3489491 3543582 3596842 3648161 3697349 3745724
57115 3745724 3794287 3842320 3889168 3936323 3985793 4037069 4087819 4137388 4187627 4240220 4295209
57104 4295209 4352382 4412110 4474156 4537290 4600965 4666205 4734302 4805666 4880243 4957901 5038032
57093 5038032 5119775 5202725 5286269 5368209 5445483 5516459 5581226 5639701 5691267 5736440 5776839
57082 5776839 5812703 5842155 5863705 5877795 5884962 5884161 5874185 5855402 5828734 5793760 5748960 5693208
57070 5693208 5626290 5548592 5460758 5362932 5254102 5133071 4999995 4855724 4699696 4530012
57060 4530012 4345504 4145817 3929342 3693044 3434383 3151100 2838953 2492520 2108862
57051 2108862 1687780 1228177 727352 184428 -399483 -1025510 -1696657 -2410886 -3157980
57042 -3157980 -3924339 -4694941 -5447189 -6148840 -6768220 -7285877 -7699309 -8030648 -8338707
57033 -8338707 -8709233 -9210652 -9857285 -10632001 -11548243 -12669579 -14047586 -15637454 -17283849
57024 -17283849 -18809359 -20158632 -21509168 -23258409 -25849716 -29511550 -34075102 -38995130
57016 -38995130 -43545784 -47051091 -49035937 -49277416 -47786205 -44746927 -40448549 -35239631
57008 -35239631 -29513827 -23692107 -18175829 -13289318 -9245739 -6139489 -3946209 -2529166
57000 -2529166 -1670594 -1131060 -710607 -282778 204732 750546 1326420 1899973 2446936
56991 2446936 2953019 3410790 3816773 4170298 4473645 4732427 4954553 5147406 5315678
56982 5315678 5462182 5590022 5702959 5804079 5895394 5978881 6056869 6131070 6201946 6269500
56972 6269500 6334461 6398618 6464212 6533070 6606347 6685306 6772133 6868881 6974419 7082082 7180309
56961 7180309 7255727 7296676 7296204 7253795 7174714 7067174 6939563 6799207 6651575 6499066 6341023
56950 6341023 6176074 6004417 5827181 5643968 5452047 5248070 5030157 4798769 4556639
56941 4556639 4308270 4059158 3815122 3581708 3363012 3160294 2972409 2798246 2638189
56932 2638189 2492517 2359356 2235688 2120119 2013354 1915893 1826444 1742908 1664048 1589855
56922 1589855 1520848 1457102 1397446 1339615 1281825 1224157 1167939 1114170 1063334 1016276 973813
56911 973813 935311 898782 862810 827649 794324 763608 736035 711881 690813 672494 657807
56900 657807 648327 644072 642779 641981 640780 638831 634767 626789 614233 597510 577048 553381 527978
56887 527978 502869 479333 457637 437929 420595 405682 392751 381629 372984 367849 366568 368241
56875 368241 371267 374664 378769 384364 391211 397979 403458 406930 407312 403112 393926 381064 365935 348658
56861 348658 329110 308499 288624 269974 251731 233424 215518 198570 182965 169398 158368
56850 158368 148913 138974 127583 116036 106437 99619 94778 90488 85645 79979 74281 69971 67910 67559
56836 67559 67483 66750 65833 66143 68737 73570 80067 88059 97586 107898 117529 125669 132701 138907 143439
56821 143439 145146 143666 139061 131448 122180 114526 111473 113013 116975 122110 128818 137050 145677 154550
56807 154550 165377 179613 196867 216394 238827 265152 294851 326291 358197 389431 417803
56796 417803 440492 455708 463187 463374 457194 446619 434410 422742 412304 402725 393634 385508 379881
56783 379881 378628 382665 391556 404663 422385 445898 476031 512775 555320 601726 648639 692079
56771 692079 728755 756492 773799 779772 774501 759164 735759 706995 676118 645941 617776 591581
56759 591581 567319 545905 528774 516729 509318 505340 504201 506925 515557 531291 553299 579395
56747 579395 607211 634248 657394 673445 680384 677749 665965 645990 619697 589923 559522 530374
56735 530374 503260 478385 455866 435930 418870 404804 393550 384804 378359 374069 371795 371599 373797
56722 373797 378534 385256 392712 399263 403135 402773 397485 387744 374644 359173 342150 324596 307665
56709 307665 292162 278247 265527 253317 240962 228076 214422 199776 184412 169670 157177
56698 157177 147028 137488 127129 116766 108460 102951 98833 94069 87647 80046 72929 68269 66832
56685 66832 67351 67763 67231 66397 65949 65855 65900 65910 65361 63854 62282 62398 64674 67450 68823 68602 67867 67512
56667 67512 67970 69479 71476 72310 70813 67955 65932 65700 66470 67482 68897 70568 71258 70129 68370 68248
56651 68248 70585 73823 75755 75740 75095 75522 77268 78897 78971 77777 76960 77384 78045 77556 76105 75113 75338
56634 75338 76330 77763 80118 83503 86755 88661 89686 91605 95429 100270 104247 106124 106175 105817 106297 107463
56618 107463 108098 107734 107529 108722 110928 113095 115690 120364 127280 134231 139112 142119 144764 147737 150795
56603 150795 153972 157761 162302 167250 172262 176911 180490 182710 184472 187246 191652 197032 202256 206514
56589 206514 209649 212151 214590 216641 217043 215027 211347 207424 203920 200715 197615 194208 189509 182758
56575 182758 174366 165408 156623 148662 142562 138662 135573 131713 127612 125086 124209 122933 120090 117046
56561 117046 115636 115982 117227 119015 121049 122400 122650 122927 124396 126308 126983 126445 126548 128303 130375 130874
56545 130874 129809 129078 130315 133294 136325 137824 137398 135702 133721 132328 132085 132891 133904 134397 134742 136058
56529 136058 138871 142660 146640 150206 152487 152640 151288 150884 153648 159325 165586 170340 173138 174736 176145
56514 176145 178085 180694 183582 186459 189640 193601 198183 202669 206579 210069 213646 217865 223242 230087
56500 230087 238335 247706 257892 268387 278290 286622 292856 297068 299723 301406 302437 302531 301167 298649
56486 298649 296425 295743 296108 295636 293043 288814 284377 280623 277519 274693 271757 268131 263218 257217 251553
56471 251553 247924 246734 246761 246436 245148 243173 240921 238826 237541 237437 237894 237761 236756 235892 236244 237679
56455 237679 239063 239436 238716 237387 235773 233763 231300 228988 227757 227776 228141 228043 227693 227635 227660 227182 226214 225086
56437 225086 223477 220784 217403 214787 214222 216124 220015 224148 225815 223734 220083 218417 219352 220098 218667
56422 218667 216482 215793 216394 216501 215595 214751 214952 216491 219319 222566 224325 223377 220879 219242 219559 221018
56406 221018 222392 223129 223404 224044 225985 228900 230922 230672 228969 227581 227061 227069 227951 230288 233258 235198
56390 235198 235752 235970 236362 236458 236394 237270 239432 241737 243075 243482 243366 242664 241384 240101 239456 239763 241250
56373 241250 243765 246147 246972 246285 245643 246083 247049 247693 248303 249767 252421 255934 259670 262766 264538 265328
56357 265328 266320 268115 270142 271774 273294 275307 277906 280906 284208 287418 289771 291096 292340 294452
56343 294452 297091 298959 299180 297967 296302 295342 295812 297531 299672 301670 303655 305917 308487 311429 315036
56328 315036 319335 323710 327376 329986 331591 332280 332009 330631 328134 325142 322938 322388 322952 323349 323061 322489
56312 322489 321796 320648 319179 318085 317430 316370 314541 312799 312038 312131 312670 313861 315899 318112 319474 319460
56296 319460 317823 314245 309052 303582 298839 294123 288010 280492 273232 267705 263991 261544 260475 261723
56282 261723 266180 273712 282897 291947 300161 308299 317285 326962 336467 345413 354062 362659 371198 379699
56268 379699 388028 395471 401176 405206 408763 413198 418986 425523 431534 435768 437846 438610 439327 440478 441651
56253 441651 442642 444152 447062 451308 455907 460098 464207 469267 475972 484092 492842 501647 510450 519339
56239 519339 527987 535710 542306 548813 556914 567175 578118 587647 595374 602932 611858 621934 632028
56226 632028 641865 652296 664249 678099 693756 710741 728343 746259 764799 784069 803560 823329
56214 823329 844991 870386 899394 930126 961223 992886 1025652 1059469 1094522 1132000 1173345
56203 1173345 1219174 1269246 1323020 1380127 1440860 1506360 1577822 1655570 1739637 1831125 1931924
56192 1931924 2042842 2163114 2292260 2431457 2582387 2745315 2918969 3101827 3292857
56183 3292857 3491118 3694926 3901279 4106113 4305439 4496068 4674782 4837297 4979126
56174 4979126 5097408 5190771 5257355 5294459 5300766 5277906 5229041 5156588 5061771 4945648 4810054
56163 4810054 4658322 4495510 4327032 4156361 3984610 3812530 3641845 3474080 3309338
56154 3309338 3147483 2989906 2839055 2696422 2561722 2433785 2311818 2196220 2088605
56145 2088605 1990572 1901969 1820774 1745007 1674126 1608289 1547146 1490118 1437265 1389128 1345950
56134 1345950 1307360 1272331 1239254 1206908 1175938 1148589 1126293 1107952 1091085 1074102 1057006
56123 1057006 1040577 1025547 1012138 999863 988094 977057 967711 960558 955308 951830 950332 950191 949678
56110 949678 947694 945091 943707 944699 948158 953583 960198 967498 975866 986020 997784 1010289 1023426
56097 1023426 1037956 1054158 1071726 1091198 1113778 1139343 1166423 1194853 1226669 1263390 1304147
56086 1304147 1347698 1394820 1447468 1506811 1573159 1646378 1725333 1808288 1894762 1985251 2078021
56075 2078021 2168211 2251780 2328513 2399488 2463723 2519884 2569671 2616594 2661870 2703719 2740087
56064 2740087 2770059 2793264 2809888 2820828 2826124 2823877 2812248 2791523 2762429 2723485 2672293 2608797
56052 2608797 2535404 2454811 2369783 2284194 2201775 2124016 2051077 1983966 1923780 1869684 1820057
56041 1820057 1774960 1735183 1699560 1665967 1634550 1607311 1584705 1565374 1549186 1537746 1531451
56030 1531451 1528384 1526598 1525486 1524812 1524555 1525904 1530231 1536864 1543894 1551276 1560970 1573775 1588187 1602698
56016 1602698 1617184 1631773 1646417 1661893 1679299 1698144 1716738 1734616 1752885 1772137 1791927
56005 1791927 1812410 1834616 1859009 1885416 1914089 1945051 1976842 2008122 2040005 2074482 2110910
55994 2110910 2146648 2180919 2215353 2250790 2286275 2321383 2356956 2393408 2430645 2469600 2511393
55983 2511393 2555328 2600404 2648234 2701250 2758465 2816670 2875777 2939076 3007801 3079342 3151677
55972 3151677 3225686 3301887 3378546 3454615 3531474 3610418 3691291 3774757 3862986 3956958 4055871
55961 4055871 4160105 4271800 4391692 4518490 4652224 4794880 4946813 5106053 5272391
55952 5272391 5448707 5636791 5834951 6041098 6255422 6479077 6713247 6960235 7222324
55943 7222324 7498972 7788302 8091401 8411338 8748206 9099843 9467667 9856540 10268199
55934 10268199 10700283 11152876 11630288 12135165 12667004 13228455 13826994 14468002 15152245
55925 15152245 15882774 16668208 17516030 18428158 19405986 20454108 21576513 22775283 24056422
55916 24056422 25431634 26912300 28508029 30232975 32106050 34142605 36354102 38758649
55908 38758649 41383437 44255102 47399359 50855400 54681638 58945240 63719829 69099287
55900 69099287 75200966 82150273 90078408 99145179 109552075 121528008 135317388 151179248
55892 151179248 169359722 190035590 213274652 238978335 266681513 295236753 322691029
55885 322691029 346626210 364803750 375664909 378479799 373339225 361171394 343649065
55878 343649065 322804832 300498035 278076943 256366182 235810479 216594630 198727686
55871 198727686 182132430 166716234 152393301 139086196 126736213 115306413 104765435
55864 104765435 95078780 86221769 78185982 70960546 64513111 58792770 53739441 49282910
55856 49282910 45343866 41847495 38733339 35949370 33445621 31180232 29124757 27257006
55848 27257006 25553614 23993891 22564234 21252791 20044420 18925337 17887733 16925185
55840 16925185 16028097 15187870 14401036 13665127 12974685 12325312 11717363 11151253 10622566
55831 10622566 10125614 9658482 9220905 8810409 8424130 8061569 7722127 7402410 7098855
55822 7098855 6810481 6536502 6274035 6020733 5776876 5542279 5313997 5089774 4871237
55813 4871237 4660992 4458779 4262689 4071804 3885630 3703391 3525853 3355408 3192805
55804 3192805 3036679 2887731 2749660 2623715 2506062 2393505 2288358 2194293 2110426 2033254
55794 2033254 1961951 1897825 1840244 1786857 1736776 1690450 1647297 1605979 1565997 1526823 1486920
55783 1486920 1445948 1406372 1370373 1336576 1302292 1267537 1234155 1202305 1170759 1139896 1111616
55772 1111616 1086615 1063861 1042330 1021439 1000523 979768 960869 944945 930642 916043 901436
55761 901436 888160 875695 862099 846761 830668 814418 797953 782016 768062 756733 747638 740207
55749 740207 733625 726669 718955 711743 706230 701798 697251 692919 690036 688757 688386 689011 691403 695612 700753
55734 700753 705758 709520 711171 711234 711525 712835 713753 712934 711250 710321 710106 709496 708135 705927 701818 694970
55718 694970 686278 676980 666622 654245 640731 627896 615981 604149 593016 584437 578872 574902
55706 574902 571332 567986 564525 560327 555608 550882 545199 536758 525694 514721 506428 501051 497119 492972
55692 492972 487240 479114 469021 458477 448808 440226 432071 423601 414715 406370 399818 394952 389999 383574
55678 383574 376333 369843 364618 360260 356623 353519 350028 345591 341282 338458 336483 333332 328255 322426
55664 322426 317067 312360 308127 304225 300168 295688 291711 289529 288939 288417 287278 286514 287363 290109 294491
55649 294491 300143 306294 311856 316106 318843 319985 319680 318522 316859 314262 310494 306509 303314 300347
55635 300347 296355 291596 287628 284933 282243 278422 273674 268678 263857 259944 258020 258429 260441 263363
55621 263363 267166 271886 277212 282866 288509 293306 296531 298700 301087 304035 306752 308704 309956 310061
55607 310061 308174 304712 301574 299982 299296 298629 298492 299799 302111 303992 304709 304788 305128 306135 307518 308584
55591 308584 308985 309271 310255 311751 312683 312647 312535 313129 313850 313499 311578 308221 303464 297572 291782 287622 285077
55574 285077 282016 276022 266834 256753 248552 243103 239193 235396 231458 227638 223455 218042 211645 206003
55560 206003 202843 202149 201971 199973 195523 190474 187538 187567 188747 188664 186494 182842 178410 173801 169956 167504
55544 167504 165833 163846 161508 159702 158632 157386 155208 152447 150085 148970 149432 151119 153295 155670
55530 155670 158470 161192 162271 161109 159579 159943 161832 163036 162911 162928 163818 164585 165056 167244 172760 180396
55514 180396 187689 193848 199853 206570 214025 221907 229666 236608 242768 249101 255939 262022 266048 268503
55500 268503 270690 272452 272234 269326 264786 260011 255446 251092 247426 245306 245245 247020 249673 251938 253194
55485 253194 254172 256352 260365 265068 268235 267992 263657 255727 245537 234948 225897 219638 216105 214068
55471 214068 212101 209451 206101 202379 198760 195731 193417 191382 189024 186014 182132 177047 170693 163622
55457 163622 156508 149481 142415 135590 129453 123968 118887 114526 111598 110329 110278 110846 111334 110852 109132
55442 109132 107363 107142 108456 109611 109291 107767 105905 104060 102413 101456 101441 101789 101501 99845 96654 92589
55426 92589 89158 87659 87827 88207 87998 87764 88245 89496 91401 93894 96217 97059 96159 94904 94714 95601 96815
55409 96815 97912 98495 97959 96554 95883 97222 99890 102296 104056 106010 108531 110959 112546 112975 112098 110197
55393 110197 108493 108394 109861 111212 110873 108904 106556 104763 103454 102186 101001 100320 100145 99872 99239 98929
55377 98929 99558 100515 100823 100854 101822 103526 104155 102993 101848 102806 105711 108916 111406 112884 112781 110936 108747
55360 108747 108071 109069 110452 111592 112945 114500 115502 115962 116942 118766 120278 120622 120554 120987 121182 119703
55344 119703 116812 114667 114852 116518 117338 115957 113093 110433 108977 108668 109280 110997 113901 117298 119920
55329 119920 120634 118953 115376 111519 109290 109130 109254 107428 103541 99813 98334 99038 100387 101460 102653
55314 102653 104408 105951 105905 104062 101882 100941 101368 102385 103831 106076 108560 109809 109480 109293 110950 113831
55298 113831 115697 115337 113689 112528 112735 113678 113792 112012 109055 106950 106892 108143 109499 110990 113199 115693
55282 115693 117340 117865 117886 117664 116916 115733 114560 113422 112263 111812 112760 114185 114326 113096 112249 112668 113097
55265 113097 112304 110996 110474 110585 110240 109173 108055 107495 107942 109828 112735 115009 115386 114584 114082 113815 112454
55248 112454 109672 106560 103723 100601 97266 95424 96509 99606 102374 103633 104172 105186 106821 108430
55234 108430 109722 111259 113783 117051 119473 119421 117066 114533 113826 114817 115676 115073 113467 112306 112417 113304
55218 113304 113840 113540 113248 114426 117595 121710 125268 127691 129195 129742 128950 127001 124785 122954 121525
55203 121525 120619 120700 121593 122089 121353 120174 119913 120506 120491 119002 116813 115150 114195 113177 111612 109995 109262
55186 109262 109647 110185 109653 108204 107560 108995 111475 112556 111094 108365 106488 106476 107980 110143 112270 114110
55170 114110 115906 117984 120133 121734 122503 122790 123019 123210 123120 122477 121133 119389 118167 118230 119142 119458 118066
55153 118066 115086 111655 109346 109424 111794 114754 116641 117733 119588 122612 125423 126746 126737 126087 125061 123911
55137 123911 123077 122431 121373 120173 119962 120756 120840 119104 116732 115529 115809 117092 119558 123173 126447 127964
55121 127964 128576 130301 133453 136526 138557 139825 140350 139542 137523 135286 133310 131470 130340 130879 132447
55106 132447 132866 131201 129139 128727 129827 130626 129863 127846 125987 125825 127736 130175 130969 129755 128347 128387
55090 128387 129646 130977 131670 131229 129153 126131 124423 125583 128299 129811 129218 128237 128790 130972 133543
55075 133543 135452 136490 137102 137909 139039 139734 138989 136803 134489 133492 134002 134844 134629 132927 130468 128443
55059 128443 127688 128366 130068 132072 133785 135318 137535 141083 145290 148353 148902 147332 145495 145076 146139
55044 146139 147130 146371 143723 140843 139788 141391 144715 147645 148179 145908 142480 139983 138725 137514 136268
55029 136268 136798 139965 143494 144419 142828 141219 140673 139999 138743 138527 140533 143697 146579 149312 152250
55014 152250 154289 154404 153864 154916 157690 160121 160808 160258 159289 157913 156330 155564 156096 156714 155857 153860
54998 153860 152892 154430 157274 158525 156514 152498 149295 148463 149281 150415 151731 153840 156389 157946 157817
54983 157817 157118 157319 158125 157738 155397 152745 151952 152944 153569 152514 150911 150487 151133 151267 150013 147917 145774
54966 145774 143920 142677 142406 142839 143222 143406 144033 145371 146774 147683 148495 149906 151848 153469 153854 152582
54950 152582 150009 147172 145061 143866 143253 143122 143481 143806 143495 142872 142700 142682 141732 140030 139452 141258 144500
54933 144500 147454 149588 151210 152232 152486 152592 153295 154218 154266 153090 151503 150660 151338 153536 156238 158030
54917 158030 158509 158537 158661 158239 156917 155924 156633 158483 159768 160051 160418 161591 163263 165342 168318 171981
54901 171981 174927 176028 175647 174968 174740 175079 175873 176835 177484 177447 176698 175431 173875 172190 170376 168436 166788
54884 166788 166112 166426 166818 166706 166862 168272 170307 171094 169760 167400 165670 165271 165999 167398 168902 170006
54868 170006 170899 172497 175436 179154 182271 183781 183883 183934 185688 190288 197670 206736 215892 223596 229207
54853 229207 233755 239323 246911 255273 262441 267867 272186 275364 276379 274697 270908 265781 259853 254091
54839 254091 249616 246150 241963 236249 230576 226848 224518 221139 215526 209177 204381 201817 200458 199261
54825 199261 198316 198397 199743 201530 202676 203151 204219 207112 211619 216303 220159 223678 228098 233835 240080
54810 240080 245945 251529 257467 263703 269291 273446 276189 277696 277630 275684 272360 268445 263837 257751 250333
54795 250333 243364 238681 236066 233233 228165 221246 214788 210373 207035 202441 195760 188785 183998 182029
54781 182029 181429 180593 179361 178809 179885 182310 184564 184936 182773 178784 174316 170619 168602 168524 169554 170239
54765 170239 169950 169555 170267 172254 174760 177065 178687 179172 178522 177530 176944 176423 175120 173071 171227 170179
54749 170179 169679 169498 169941 171297 173369 175657 177532 178269 177629 176511 176339 177475 178682 178463 176594 174208
54733 174208 172759 172987 174509 176257 177524 178631 180421 183189 186363 189067 190749 191542 192252 193633 195335
54718 195335 196141 195690 195196 195779 196910 197635 198518 200774 203902 206030 206750 207865 210969 215892 222095 229779
54702 229779 238607 246887 253522 259810 267824 277610 287309 295578 302510 308234 311899 312424 309587 304131
54688 304131 297175 289562 281520 273041 264763 258006 253532 250665 248035 244770 240535 235072 228647 222599
54674 222599 218462 216448 215562 215122 215348 216266 216895 216227 214711 214220 216443 221450 227819 234041 239615 244759
54658 244759 249394 252924 255122 256681 258527 260915 263585 266478 269726 273024 275589 276872 276985 276180 274120
54643 274120 269985 263459 255542 248084 242331 238021 234222 230766 228333 227087 226029 224121 221476 218811
54629 218811 216092 212584 208270 204377 202001 200751 199371 197516 196141 196006 196547 196747 196476 196139 195432 193677
54613 193677 191437 190343 190747 190778 188776 185706 183905 184179 185485 186883 188085 188348 186801 184225 182747
54598 182747 183056 183423 182383 181010 181296 183178 184614 184191 182557 181337 181410 182237 182483 181422 179899 179447
54582 179447 180347 181272 181151 180416 179859 179292 178378 177978 179311 182031 184301 184842 184008 182833 181933 181610 182307
54565 182307 184305 187009 188880 188449 185761 182652 181057 181097 181462 181671 182817 185628 188875 190650 190524 189494
54549 189494 188413 187501 187020 187253 187801 187753 186667 184915 183241 182470 183289 185553 188035 189564 190290 191187 192529
54532 192529 193551 193568 192781 191955 191714 192105 192599 192743 192874 193579 194320 193683 191581 190048 190760 192671 193454 192537
54514 192537 191154 189982 188511 186621 185069 184284 184187 185302 188366 192421 194899 194366 192074 190249 189967
54499 189967 191114 193008 194290 193534 190982 188734 188380 189408 190770 192751 195959 199425 201383 201540 201158
54484 201158 201015 200713 200081 200004 201304 203623 205880 207430 208447 209526 211006 212319 212044 209146 204392 200115
54468 200115 198192 198408 199037 198924 198685 199754 202484 205607 207654 208403 208428 207688 205490 201992 198802 197493
54452 197493 198066 199348 200458 201420 202730 204857 207801 210637 211856 210785 208421 206295 204805 203328 201662
54437 201662 200415 199981 200073 200490 201579 203459 205420 206626 207088 207450 208094 208817 209258 209260 208960 208743 208988 209599
54419 209599 209994 209756 209074 208267 207267 206016 205103 205275 206459 207955 209653 212131 215263 217728 218634 218834
54403 218834 219622 220660 220455 218784 217340 217688 219695 222389 225198 227581 228477 227298 225016 223205 222301
54388 222301 221762 221636 222755 225236 227820 229094 228673 226914 224244 221264 218909 217857 217998 218800 219974
54373 219974 221447 222955 224033 224309 223635 222131 220267 218702 217760 217186 216604 216064 215941 216490 217744 219810
54357 219810 222890 226812 230675 233260 233967 233313 232490 232465 233552 235474 237512 238807 239109 239212 240007 241093
54341 241093 241125 239753 238246 237686 237657 237593 238299 240674 243640 245145 245102 245519 247502 249825 251077 251607 252433
54324 252433 253621 254946 256950 259786 261774 260781 257040 253268 251830 252663 254133 255077 255714 257084 259861
54309 259861 263469 266469 268102 269122 270645 272664 274484 276244 278937 282858 287063 290548 293031 294286
54295 294286 293703 291219 287952 285138 282821 280270 277358 274758 272941 271637 270350 268841 267027 264887
54281 264887 262645 260702 259221 257937 256467 254705 252992 252117 252903 255316 257972 259093 258183 256382 255021
54266 255021 254311 253761 253358 253643 254763 255990 256288 255108 252745 250258 248872 249023 249952 250506 250178 249114
54250 249114 247520 245715 244476 244370 244693 243977 241774 239176 237323 236268 235701 235860 236987 238600 240043
54235 240043 241156 241759 241174 239183 236840 235294 234273 232898 231612 231937 234345 237639 240647 243323 245817
54220 245817 247702 248723 249392 250084 250315 249671 248857 249031 250369 252025 253222 253834 254057 254130 254374 254982 255590
54203 255590 255353 253698 251005 248460 247180 247378 248440 249760 251262 253073 255124 257347 259790 262153 263729
54188 263729 264467 265533 267875 270617 272027 271896 271656 271968 271704 269903 267438 265761 264869 263584 261389 259008
54172 259008 257409 256905 257140 257451 257438 257426 258037 259073 259430 258504 257069 256247 256145 256094 255703 255013 254060 252968
54154 252968 252207 252142 252644 253586 255208 257416 259229 259733 259182 258353 257185 254969 251688 248242 245403 243281
54138 243281 241734 240551 239285 237761 236773 237443 239706 242064 243078 242637 241749 241642 243049 245807 249070
54123 249070 252338 256054 260564 264852 267350 268061 268732 270557 272666 273364 271972 268879 264664 260112 256513
54108 256513 254888 254948 255536 255970 256304 256345 255305 252837 249967 248434 249085 251112 252954 253866 254465 255734 257789
54091 257789 259859 261235 261660 260855 258425 254728 251280 249563 249511 249723 249167 248229 247984 248870 250352 251772
54075 251772 253272 255764 259784 264350 267393 267763 266621 266294 267812 270177 271951 272641 272223 270431 267476
54060 267476 264808 263982 264962 266534 268169 270235 272408 273504 273533 274470 277824 282389 285727 287156 287884 288730
54044 288730 289419 290133 292039 295667 299953 303637 306704 309793 313010 316019 318719 321060 322627 323051 322516
54029 322516 321417 319874 317993 316143 314502 312780 310936 309737 309946 311198 312302 312496 311967 311416 311582
54014 311582 312858 314650 315397 314025 311458 309960 310729 312741 314259 315094 316826 320870 326743 332477 336598
53999 336598 339353 341962 345083 348451 351712 354827 357603 359488 360267 360600 361501 363504 366350 369186 371134
53984 371134 372288 374226 378730 385626 392615 397719 401290 405110 410292 416844 424681 433945 444375 455161
53970 455161 465518 475023 483572 491440 499141 506711 513364 518369 522070 525505 529165 532633 535249 536598
53956 536598 536511 535155 533200 531462 530281 529329 527756 524395 518320 509718 500058 491056 483636 477859 473162
53941 473162 468344 462104 454326 446370 439493 433478 427402 421144 415222 409643 403904 398031 392773 388822
53927 388822 386361 385063 384017 382124 379291 376806 375778 375788 375889 376256 377588 379430 380506 380551 380329 379778
53911 379778 377713 373841 369858 367806 368092 369612 371247 372855 375220 379228 384769 390648 396132 402231
53897 402231 410556 421149 432476 443301 453351 462119 468521 472199 474041 474884 474653 473258 471386 469843
53883 469843 468873 468582 469273 470872 472761 474670 477129 480672 485162 490167 495370 500454 505306 510426 516235
53868 516235 521924 526122 529057 532817 538920 546714 554815 562932 571420 580182 589212 599429 611696 625453
53854 625453 639341 652822 666223 679581 692401 704311 715035 723983 730825 736338 741719 746992
53842 746992 750977 752987 753691 753904 753285 750882 746691 741927 737658 733606 728581 721766 713133 702816 690841
53827 690841 677714 664518 651880 639365 626505 613811 601998 590761 579343 567960 557499
53816 557499 547990 538569 528975 519876 511617 503808 496340 489680 483985 478970 474721 471367 467841 462460
53802 462460 455050 447081 439406 431595 424024 418571 416072 414715 412358 409032 405841 402778 399252 395652
53788 395652 392661 389947 387119 385107 384791 384969 383631 380857 378598 377819 377624 377178 376699 376329 375637 374709
53772 374709 374363 374781 375019 374405 373564 373629 375085 377625 380525 383059 385104 387287 389924 392126 392674 391607
53756 391607 390082 389002 388710 389699 392290 395673 398566 401111 404905 410799 417734 424213 429952 435522 441229
53741 441229 447093 453436 460733 468954 477393 485211 492228 499262 507381 516467 524921 531378 536352 541552
53727 541552 547851 554621 560727 565294 567787 568405 568306 568383 567821 564889 559353 553165 548482 545751 543849 541207
53711 541207 536536 529287 519971 509757 499705 490643 483302 477603 472039 464967 456686 449209 443745 439372
53697 439372 434496 428641 422377 416323 410865 406315 402890 400706 399761 399490 398534 395791 391690 387730 384943
53682 384943 383625 384119 386393 388865 389361 387773 386407 387079 389217 391467 393651 396049 398056 398972 399294
53667 399294 399884 400497 400500 400521 402013 405291 409185 412508 414775 415669 415233 414897 416931 421946 427729 431542 433243
53650 433243 435249 439481 445334 451039 456076 461184 466344 470210 472044 473120 475286 478815 482672 486317
53636 486317 490056 493978 497854 501941 506621 511294 515029 518285 522407 527150 530543 531918 533203 535965
53622 535965 538753 539133 537289 535651 535395 535188 533541 530873 528743 528008 528204 528219 527296 525746 524694 524844
53606 524844 525622 525846 524930 523041 520568 518050 516278 515790 516376 517561 519256 521413 523484 524958 526102
53591 526102 527344 528280 528177 527249 526425 525877 524885 523391 522708 524250 528182 533715 539999 546180 551247 554673
53575 554673 557204 560325 564750 569668 573626 575940 577047 577730 578502 579862 582555 586986 592645 598794 605569
53560 605569 613550 622225 629950 635846 640789 645944 651240 656068 660590 665282 669803 673581 677182 681922
53546 681922 688218 695366 702776 710279 717231 722660 726607 730209 734049 737378 739476 740777 742007 743044
53532 743044 743447 743486 743769 744220 744191 743444 742421 741596 740948 739919 737725 734005 729499 725637 723109 721248 719244
53515 719244 717336 716061 714812 712209 707844 702729 697970 694006 691287 690587 691913 693859 694934 695097 695246
53500 695246 695541 695206 693850 692054 690485 689302 688771 689660 692384 696297 700504 704944 709933 714996 719221
53485 719221 722912 727860 735227 743815 751274 756942 762683 770749 781497 793560 805691 817693 829801
53472 829801 842105 854838 868434 882802 897227 911749 928079 948000 971001 994664 1017615
53461 1017615 1040928 1066131 1092964 1120045 1146978 1174713 1204237 1235890 1269761 1305909 1344199
53450 1344199 1384509 1426781 1470278 1513244 1554242 1593581 1632480 1671065 1708317 1743982 1779320
53439 1779320 1815635 1852828 1889730 1925289 1959338 1992767 2026831 2061575 2095310 2126664 2156892
53428 2156892 2188741 2222948 2257275 2289190 2318061 2344411 2368853 2392670 2417773 2444528 2470528
53417 2470528 2492804 2510612 2525082 2537053 2546559 2553723 2558674 2560746 2558917 2553009 2543687 2531616 2517395
53404 2517395 2501894 2485634 2468134 2448797 2428216 2407653 2387416 2366601 2344332 2320416 2294867
53393 2294867 2267638 2238892 2209114 2179046 2149812 2122503 2097081 2072286 2047453 2023756 2002732
53382 2002732 1984181 1966760 1950198 1935573 1923532 1913574 1905152 1898298 1893007 1889079 1886865 1887307 1890992
53369 1890992 1897726 1906845 1917242 1927420 1936764 1946737 1959714 1976551 1996361 2018581 2043899 2072883
53357 2072883 2105056 2139880 2177497 2217986 2260818 2305606 2352525 2401538 2452121 2504226 2558699
53346 2558699 2616338 2677432 2742504 2812195 2885651 2960187 3033698 3106834 3181974 3260608 3342420
53335 3342420 3426169 3510504 3594384 3677599 3760734 3844074 3927053 4009244 4091081 4172673 4252478
53324 4252478 4328253 4399108 4465700 4528587 4587237 4640475 4687166 4726582 4758971 4785675 4807823
53313 4807823 4824713 4834171 4834648 4826470 4811019 4789332 4761540 4726988 4684697 4634295 4576801 4514193
53301 4514193 4448097 4379300 4308425 4236288 4163294 4089247 4014449 3940550 3869549 3801971 3736545
53290 3736545 3671642 3606533 3541323 3476440 3412560 3350338 3289466 3228372 3165798 3102832 3042616
53279 3042616 2987643 2937844 2891517 2847337 2804752 2763193 2722164 2682148 2644436 2609701 2577266
53268 2577266 2545896 2514712 2483334 2451907 2421324 2392653 2365867 2339743 2313565 2288429 2266187
53257 2266187 2247386 2230890 2215372 2200526 2186702 2174024 2162390 2152296 2145234 2142835 2145429 2151643
53245 2151643 2159651 2168765 2179541 2192561 2207672 2224470 2243066 2264110 2288237 2315469 2345023 2375869
53233 2375869 2407803 2441624 2477734 2514887 2551184 2586030 2619972 2652713 2682743 2709408 2733864
53222 2733864 2757014 2777704 2794193 2806485 2815659 2821396 2821826 2815943 2804831 2790219 2772957 2753307
53210 2753307 2731693 2708428 2683223 2655497 2624843 2590974 2553818 2514082 2473254 2432523 2391992
53199 2391992 2351321 2310747 2270830 2231382 2191381 2150139 2108121 2066349 2025318 1984880 1944961
53188 1944961 1905808 1867354 1828761 1789036 1748070 1706868 1666824 1628935 1593398 1559488 1525946
53177 1525946 1492167 1459165 1428790 1401648 1376359 1351249 1326310 1302883 1281783 1262500 1244091
53166 1244091 1225949 1207430 1187520 1165580 1142222 1118868 1096288 1073869 1050494 1025981 1001389
53155 1001389 977932 955957 935252 915962 898544 882649 866668 848985 829677 810620 793871
53144 793871 780024 768017 756244 743759 730600 717182 703571 689406 674490 659361 645304
53133 645304 633659 624764 617348 609307 599546 588944 579228 571148 564231 557923 551986 545769 538249 529357
53119 529357 520626 513848 509478 506773 504906 503340 501483 498790 495207 491155 487171 483732 481064 478793
53105 478793 476169 472954 469650 466572 463361 460025 457718 457477 458620 459453 459361 459082 459033 458655 457744 457226 457879
53088 457879 459083 459541 458745 457080 455007 452873 451249 450681 451096 451991 453154 454742 456549 457700 457375 455692
53072 455692 453751 452811 453258 454148 453825 451322 447277 443352 440742 439487 439208 439943 441870 444573 447295 449964
53056 449964 453272 457437 461418 463922 464893 465442 466441 467712 468624 468887 468605 467943 467030 465970 464873 463988
53040 463988 463579 463255 461683 457770 452268 447482 444988 444156 443238 441310 438677 436001 433771 432372 431963
53025 431963 432221 432598 432781 432689 432271 431591 430856 430048 428814 427051 425294 424110 423367 422415 420776 418446 416041
53008 416041 415026 417054 422137 427656 430111 428068 423092 418018 414828 413910 414491 415413 415799 415180 413218
52993 413218 410019 406970 406296 408759 412340 414396 414804 415770 418623 422205 424776 426154 427299 428727 430180
52978 430180 431294 431913 432084 432107 432226 432104 431276 430308 430529 432095 433310 432737 431156 430244 429931 428571 425669
52961 425669 422964 422292 423458 424958 426007 426950 428174 429651 431554 434384 438104 441688 443994 444830 444898
52946 444898 445079 446171 448779 452569 455735 456279 454174 451471 449811 448715 447020 444997 443828 443515 442959
52931 442959 442146 442655 445265 448371 449797 449537 449568 451385 454786 459035 464034 469741 475033 478062 478070 476497
52915 476497 475783 476929 478666 479305 478868 478622 478943 478873 478142 478317 480981 485456 489510 492019 493829 496014
52899 496014 498429 500363 501571 501912 500691 497462 493379 490744 490812 492606 494255 494924 494828 493850 491196 486617
52883 486617 481148 476153 472135 468884 466145 463554 460454 456737 453598 452443 452989 453412 452575 451166 450328
52868 450328 450161 450336 451307 453744 456981 459124 458967 457196 455448 454567 454047 452866 450592 447737 445175 443347
52852 443347 442158 441607 442140 444055 446757 449055 450246 450605 450668 450378 449288 447523 446045 445671 446034 446047 445396
52835 445396 444955 445327 445617 444468 442087 440294 440436 442134 444443 447313 451109 455265 458439 459941 460256
52820 460256 460063 459374 457940 456164 455177 455933 458150 460218 460517 459165 458211 459700 463631 468194 471758 474090
52804 474090 475726 476958 477767 478094 477705 476159 473530 470853 469198 468318 466818 463825 459928 456200 452812
52789 452812 449171 445138 441477 439055 438010 437737 437239 435517 432134 427717 423540 420407 418206 416574 415395
52774 415395 414372 412881 410848 409239 408838 408923 408165 406721 406345 408113 410996 413192 414207 414904 415951 416974
52758 416974 417189 416377 415010 413666 412456 411142 409794 409088 409575 410805 411614 411378 410610 410291 411022 412780
52742 412780 414959 416524 416754 416072 415625 415818 415861 415156 414417 414751 416064 417049 416575 414558 411672 408842 406954
52725 406954 406495 407221 408320 408870 408194 406248 404000 402949 403759 405585 407235 408626 410476 412799 414490
52710 414490 414475 412672 409871 407234 405924 406390 407813 408872 409324 410141 411797 413212 413191 412292 412249 413737 415698
52693 415698 417059 418145 419836 422066 423945 425061 425860 426848 428128 429796 432046 434646 436920 438657 440485
52678 440485 442993 446002 449153 452578 456256 459251 460512 460148 459039 457477 455291 453245 452996 455224 458768
52663 458768 461986 463992 464226 462098 458008 453808 451169 449924 448907 447875 447591 448418 449924 451738 453779
52648 453779 455663 456788 457115 457073 456616 455187 452887 451011 451022 453297 456885 460121 461636 461380 460682 460599 460277
52631 460277 457834 453154 448810 447522 449340 452020 453668 454079 453801 453062 451984 451001 450346 449575 448240 446792
52615 446792 446031 445662 444300 441376 438315 437056 437851 439342 440483 441237 441452 440484 438630 437830 439863 444207
52599 444207 448513 450890 451165 450346 449697 450159 451866 454178 456605 459518 463509 468353 473142 477190 480280
52584 480280 482351 483641 484790 486020 486500 485348 483009 480721 478820 476618 473862 471177 468941 466964
52570 466964 465642 466258 469362 473609 476854 477966 477202 475504 474011 473672 474599 475916 476568 476061 474395 471919
52554 471919 469535 468370 468778 470092 471617 473296 475089 476429 476866 476671 476231 475422 474201 473251 473238 473830
52538 473830 474256 474611 475787 478192 481203 483883 485647 486303 486091 485826 486428 488077 490077 491616 492379 492468
52522 492468 492090 491497 491084 491385 492820 495196 497540 498891 499425 500219 501620 502529 501966 500809 500955 502838
52506 502838 504715 504733 503035 501415 501290 502405 503373 503085 501489 499206 496762 494535 493189 493387 494725 495533
52490 495533 494346 491334 487859 484975 482968 482018 482426 484115 486498 488937 490840 491412 490081 487420 485016
52475 485016 484075 484416 485043 485313 485351 485603 486190 486630 486214 484874 483480 482918 483072 483277 483563 484690 486811 488893
52457 488893 489756 489182 487801 486532 486345 487858 490688 493775 496661 499845 503490 506687 508741 510487 513317
52442 513317 517272 521088 523844 525555 526235 525498 523386 520755 518450 516560 514728 512724 510576 508602 507347
52427 507347 506899 506245 504077 500525 497287 495659 495060 494094 492385 490685 489678 489524 490444 492845 496628 500899
52411 500899 504599 507272 509239 511204 513649 516335 518495 519677 520272 520998 522064 523095 523708 523846 523727
52396 523727 523687 523850 523768 522742 520864 519351 519263 520156 520548 519460 516937 513455 509737 507076 506723 508448 510267
52379 510267 509996 506921 502088 497585 495427 496336 499212 502199 504327 505610 505902 504780 502718 501195 501063
52364 501063 501687 502182 502596 503344 504470 506216 509268 513456 517155 519139 520265 522129 524805 527412 530328
52349 530328 534966 541412 548046 553888 559800 566888 575129 584264 594681 606278 617276 625253 629088
52336 629088 629342 627282 624053 620249 615577 609415 602199 595741 591423 588560 585405 581483 578080 576458
52322 576458 576423 576879 577186 577569 578464 579812 581175 582509 584605 588425 594011 600468 607131 614198 621908 629603
52306 629603 636206 641449 646076 650907 656041 660933 664899 667523 668866 669382 669565 669775 670526 672642 676763
52291 676763 682573 688725 693699 696894 699033 701570 705597 711345 718606 727177 736557 745758 754276 763147
52277 763147 774146 787770 802837 818371 834966 853669 874325 895905 918036 941288 966134
52266 966134 992458 1020121 1049361 1080475 1113547 1148585 1185562 1224189 1263832 1303800 1343720
52255 1343720 1383721 1424059 1464230 1502627 1537792 1570031 1600957 1631198 1659696 1685938 1711590
52244 1711590 1738601 1766408 1792596 1815992 1837465 1857706 1876044 1892087 1906999 1921948 1936114
52233 1936114 1947325 1954251 1957228 1957337 1955518 1952355 1947971 1942017 1934156 1924558 1913796 1902593 1892032
52220 1892032 1883570 1878243 1875935 1875900 1877889 1882323 1889518 1899293 1911345 1925512 1941511 1958898 1977481
52207 1977481 1997438 2018764 2040882 2063058 2085052 2107057 2129169 2151275 2173455 2196017 2218840
52196 2218840 2240915 2261039 2279049 2295949 2312526 2328162 2341529 2352437 2362321 2372340 2381205 2385608
52184 2385608 2383196 2374947 2364254 2353776 2343499 2331908 2318337 2303620 2288740 2273713 2257989 2241365
52172 2241365 2224120 2206744 2190032 2175126 2162828 2152920 2144583 2137327 2131010 2125112 2118774 2111835 2105299
52159 2105299 2100389 2097592 2096924 2098564 2102507 2107750 2112732 2116884 2121288 2127400 2135310 2143650 2151122 2157766
52145 2157766 2164744 2173264 2183857 2196224 2209266 2221394 2231393 2239315 2246337 2253517 2260894 2267939 2274591
52132 2274591 2281312 2288101 2293907 2297582 2299434 2301395 2305261 2310789 2315828 2318395 2318308 2316786 2315007 2313428
52118 2313428 2311865 2309413 2304550 2296324 2285647 2274768 2265268 2257151 2249859 2243162 2236699 2229722 2222065
52105 2222065 2214654 2208363 2202999 2198070 2193769 2190268 2186869 2183175 2180531 2180813 2183956 2188135 2192291 2196842
52091 2196842 2201621 2204872 2205262 2203653 2201952 2201123 2201316 2202952 2206355 2210683 2214429 2216984 2219020 2221567 2225341
52076 2225341 2230678 2237295 2244253 2250892 2257862 2266750 2278835 2294627 2314237 2337399 2363336 2391414
52064 2391414 2421942 2455590 2492091 2530425 2570399 2613095 2659302 2708156 2757851 2807114 2855479
52053 2855479 2902606 2948041 2991534 3033032 3072201 3108209 3140045 3167003 3189012 3206643 3220640
52042 3220640 3231337 3238546 3242098 3242326 3239958 3235730 3230132 3223308 3215069 3205158 3193516 3180204 3165330
52029 3165330 3149516 3134377 3121627 3111198 3100687 3087334 3070511 3051987 3034122 3018362 3005224
52018 3005224 2994967 2987843 2984005 2983363 2985501 2989882 2996384 3005513 3017786 3033000 3050366 3069101 3088440
52005 3088440 3107380 3125298 3142924 3161899 3182884 3204549 3224729 3242073 3256260 3267352 3275750
51994 3275750 3282443 3288323 3292944 3294456 3291079 3282689 3270932 3257815 3243909 3227816 3207616 3182981
51982 3182981 3155563 3127150 3097940 3066889 3033045 2995957 2955542 2912712 2869959 2830045 2793741
51971 2793741 2759559 2725903 2692693 2660675 2630141 2601036 2573657 2548375 2524811 2501898 2478736
51960 2478736 2455124 2431465 2408540 2387143 2367409 2348385 2328598 2307260 2284881 2262512 2240251
51949 2240251 2216638 2189887 2159888 2128461 2097296 2066152 2033722 1999714 1964935 1929530 1892546
51938 1892546 1853670 1814363 1776579 1741020 1707079 1673828 1640677 1607792 1576344 1547621 1521500
51927 1521500 1496550 1472040 1448748 1427190 1406357 1385336 1365089 1347105 1330971 1314800 1297656
51916 1297656 1279983 1261856 1242531 1221946 1201359 1182057 1164459 1148694 1134949 1122889 1111664
51905 1111664 1100891 1090861 1081663 1073035 1065307 1059566 1056482 1055781 1057125 1060573 1065758 1071544 1077123 1082759
51891 1082759 1088856 1094807 1099233 1100977 1099738 1096392 1092889 1091005 1090830 1091123 1091426 1092945 1097092 1104193 1114148
51876 1114148 1127246 1143488 1161952 1181732 1202767 1224885 1246792 1267100 1285831 1303782 1320664
51865 1320664 1334818 1344423 1348013 1344162 1331951 1312042 1286516 1257473 1226295 1194032 1161561 1129251
51853 1129251 1097239 1066196 1037139 1010287 984806 959999 936239 914466 895270 878800 865084
51842 865084 854030 845327 838787 834689 833496 835196 839059 844044 849361 854642 859720 864400 868420 871389
51828 871389 872498 870592 865048 856731 847692 839677 833024 826955 820535 813355 805814 798965 793773 790477
51814 790477 789045 790027 794106 800618 807532 813335 818176 822731 827001 830958 835229 839885 843300 843754 841891
51799 841891 840144 839705 839321 837345 833739 829652 826027 823240 821485 820909 821659 823897 827302 830581 832354
51784 832354 832818 833812 836722 840854 844224 845373 843935 839974 833635 825521 816943 809490 804149 800625 797505
51769 797505 793334 787644 781014 774518 769435 766853 766676 767137 766205 763516 760215 757091 754103 751736 751163
51754 751163 752201 752458 749880 745336 741412 739206 737714 736009 734417 733392 732671 732126 732352 733774 735854
51739 735854 737797 739396 740706 741563 742039 742662 743440 743257 741225 738181 735719 733868 731000 726350 721454
51724 721454 718386 717365 716919 715855 714206 712525 711152 710254 709993 710528 712159 715250 719531 723752 726749
51709 726749 728864 731568 735616 740316 744759 749070 754035 760144 767379 775387 783460 790949 798200 806429
51695 806429 815976 825127 831366 833525 832087 827811 820995 811948 801275 789585 777598 766570 757803
51682 757803 751411 746179 740983 735905 731675 728574 726396 725255 725945 729478 736356 746174 757760 769693
51668 769693 780789 790158 797207 802026 805713 809735 814627 819518 823160 825273 826555 827413 827069 824306
51654 824306 819095 813049 807850 803535 798926 793587 788463 784297 780401 775794 770850 766777 763827 761144
51640 761144 758375 756354 755921 756922 758766 761195 763964 766239 766980 765846 763497 761144 759784 759543 759628
51625 759628 759263 758620 758366 758311 757282 754700 751642 749657 748834 747663 744761 740357 736104 733777 734181 737063
51609 737063 741909 748759 758091 769881 783026 795867 807258 817056 825817 834167 842289 849642 855037
51596 855037 857168 855418 850429 843851 837350 831795 827516 825058 824984 826801 828846 829837 829994 829905 828747 824763
51580 824763 817590 809162 801801 795921 789994 782452 773285 763989 756227 750564 746476 743409 741353 740141
51566 740141 738797 736364 733116 730189 728106 726378 724482 722290 719483 715426 710094 704478 699737 696329
51552 696329 694057 692380 690526 687950 684892 682016 679510 677151 675229 674391 674312 673470 670824 667166 664440
51537 664440 664246 667071 672231 678365 684860 692932 704235 718203 732071 743958 754311 763481 769679
51524 769679 771062 768685 765431 762678 759909 757241 756236 757887 761541 766428 773021 782261 794420 809254
51510 809254 826380 845031 864231 883809 904669 927647 952588 978924 1006591 1035940 1067022
51499 1067022 1099177 1131154 1161851 1191620 1222730 1257493 1295498 1333444 1368088 1398570 1425303
51488 1425303 1447621 1463702 1472418 1473997 1468622 1455446 1433704 1404362 1369989 1333011 1294585 1255359
51476 1255359 1216835 1181349 1150473 1123780 1099512 1076383 1054588 1035119 1018310 1003125 987863
51465 987863 971726 955689 941561 930068 920021 909414 897066 883270 869403 857153 847439 839433
51453 839433 830989 820588 808671 796688 785254 773786 761660 749090 737120 727251 720577 716493
51441 716493 712633 707130 700757 695812 693007 690723 687510 683922 681239 679583 678344 677729 678695 681510 685281
51426 685281 688882 691715 693469 693754 692344 689754 687310 686301 686721 686985 685399 681952 678191 675303 672935
51411 672935 670087 666409 662155 657415 652091 646381 640772 635714 631586 628679 626814 625279 623564 621864
51397 621864 620396 618610 615794 612261 609237 607550 607094 607729 610028 614673 621448 629174 636508 642740 648165
51382 648165 654053 662020 672900 686071 700085 714036 728051 742317 755939 767234 775211 780408
51370 780408 784076 786948 789163 791085 793427 796350 798880 799551 797415 792356 784889 776105 767570 760613
51356 760613 755401 750926 746146 741134 736994 734537 733135 731138 727593 723419 720587 720197 721640 723609
51342 723609 725447 727352 729653 732363 735302 738305 741301 744474 748408 753797 760844 769001 777441 785847
51328 785847 794712 804968 817429 832626 850889 872232 896262 922726 952406 986957 1027338 1072608
51316 1072608 1120880 1171384 1224986 1282491 1342843 1403182 1460273 1511697 1556110 1592780 1620840
51305 1620840 1638800 1644958 1638556 1620599 1593520 1560033 1522047 1480224 1434496 1385194 1333703 1281787
51293 1281787 1230434 1179874 1130661 1084066 1041089 1001619 965016 931103 900152 872229 847098
51282 847098 824561 804370 785886 768393 751897 737213 725024 714983 705954 697188 689256 683700
51270 683700 681561 682143 683355 683334 681655 679048 676285 673510 670401 666810 663304 660889 659889 659189 657210
51255 657210 653722 650106 647622 646069 644552 642854 641365 640274 639590 639591 640343 641008 640573 639186 637889 637027
51239 637027 635899 634208 632824 632548 632877 632710 631762 630596 629610 628672 627617 626534 625623 625232 625927 627999
51223 627999 630898 633664 636023 638649 642164 646324 650614 655302 661269 668516 675336 679632 681214 682259
51209 682259 685020 689351 693138 695132 696471 699005 702932 706948 710302 713543 717080 720084 721394 720976
51195 720976 719784 718523 717062 714902 711654 707120 701373 694851 688105 681547 675707 671424 669177 668204
51181 668204 666864 664069 660072 655811 651958 648689 645820 642904 639613 636255 633529 631669 630402 629939
51167 629939 631082 633705 635919 635816 633729 631799 631437 632143 632763 632825 632421 631725 631170 631394 632502 633808 634673
51150 634673 635180 635738 636602 638084 640706 644584 649113 653599 657786 661350 663585 664333 664758 666272 668933
51135 668933 671743 674443 677939 682663 687358 690150 690442 689325 688361 688411 689478 691113 692717 693669 693506 692216
51119 692216 690353 688639 687218 685419 682530 678867 675876 675032 676693 679952 683418 686028 687363 687519 686867
51104 686867 685878 685057 684846 685523 687120 689434 692073 694480 695998 696084 694712 692661 691156 690819 690906 689963 687432
51087 687432 684305 681937 680581 679526 678299 677038 675822 674391 672655 670864 669102 667239 665598 664994
51073 664994 665676 666794 667446 667810 668765 670794 673846 677895 682836 687912 692010 694736 696751 698808 700768
51058 700768 701803 701423 700150 699254 699789 701825 704599 707417 710261 713500 717176 720735 723391 724796 725527
51043 725527 726751 729129 732134 734912 737663 741459 746633 752189 757050 761097 764492 766909 768174 768995
51029 768995 770147 771373 771999 772201 772750 773806 775001 776548 779234 783232 787821 792327 796506 800017 802534
51014 802534 804660 807797 812640 818446 824180 829747 835734 842465 849719 857046 864082 870961 878585 888213
51000 888213 900715 916512 935940 958795 983611 1008401 1032425 1056334 1080339 1103258 1124007
50989 1124007 1143030 1161401 1179239 1195962 1211550 1226478 1240530 1252475 1260821 1264345 1262264 1254952
50977 1254952 1244532 1233870 1224626 1216665 1209268 1202126 1194781 1185889 1173907 1158511 1140830 1122099
50965 1122099 1102518 1081868 1061075 1042469 1027990 1017437 1008967 1001179 994216 989084 986621 987247 990858
50952 990858 996668 1003756 1012153 1022727 1035643 1049612 1063344 1077197 1092650 1110412 1129626 1148598
50940 1148598 1165718 1180055 1191861 1202504 1213212 1223827 1233176 1240586 1246558 1252086 1257828 1264002
50928 1264002 1270705 1278191 1286821 1296455 1305973 1314195 1321879 1332035 1347381 1367878 1391671 1418027 1448093
50915 1448093 1482781 1521131 1561236 1601924 1643165 1685646 1730543 1779171 1832253 1889749 1951674
50904 1951674 2018818 2092378 2173018 2260355 2353127 2449906 2550003 2653663 2761073 2871378
50894 2871378 2983121 3095206 3206602 3315392 3419292 3517277 3609567 3695717 3773963 3843129
50884 3843129 3904127 3958629 4007082 4049002 4084571 4114844 4140696 4162565 4181021 4196596 4209058
50873 4209058 4217563 4221450 4220171 4212716 4198196 4177094 4150929 4120240 4083578 4038819 3984896 3921900
50861 3921900 3850241 3770474 3683689 3591410 3494976 3395251 3292883 3188736 3084269 2981662
50851 2981662 2883207 2789994 2701173 2614971 2530818 2450359 2376175 2309588 2249845 2195306 2144901
50840 2144901 2098267 2054970 2014210 1975279 1937938 1902390 1869287 1839671 1814275 1792703 1773826
50829 1773826 1757160 1743344 1733057 1726105 1721930 1720195 1720249 1720748 1720827 1721322 1723894 1729109 1736274 1745082 1756343
50814 1756343 1770868 1788408 1807998 1828751 1850235 1872754 1897486 1925630 1957168 1991158 2027468
50803 2027468 2067365 2111900 2160616 2212552 2267933 2327981 2393497 2464535 2541381 2625070 2716827
50792 2716827 2817475 2927451 3047055 3176820 3317902 3471844 3639412 3819902 4012093
50783 4012093 4215682 4431110 4658019 4894570 5138364 5387344 5639433 5891728 6140379
50774 6140379 6381113 6609851 6823098 7017938 7191593 7341519 7466750 7569089 7651872 7716949
50764 7716949 7763741 7792139 7805775 7811223 7814038 7816494 7819088 7822638 7827858 7833674 7837355 7836097 7827329
50751 7827329 7807378 7771285 7714953 7636888 7537068 7414803 7268936 7100037 6911119 6705765
50741 6705765 6486496 6255598 6016699 5774537 5533289 5295833 5064610 4842472 4632251
50732 4632251 4435633 4252682 4082610 3925101 3780752 3650055 3532234 3425763 3330041 3245718
50722 3245718 3173007 3110383 3055577 3007120 2964134 2925159 2888463 2853471 2820938 2791518 2764887
50711 2764887 2740238 2716687 2693004 2667906 2641159 2613700 2586211 2558175 2528817 2498385 2467848
50700 2467848 2437811 2408477 2380446 2354768 2331977 2311455 2291934 2272549 2253544 2236164 2221807
50689 2221807 2211203 2204426 2201584 2203075 2209093 2219411 2234037 2253746 2279561 2311854 2350212 2394054
50677 2394054 2443177 2497994 2559465 2628529 2705329 2789253 2879911 2977625 3082482 3193249 3307856
50666 3307856 3424955 3544529 3666933 3791634 3917009 4041290 4163755 4284855 4404743
50657 4404743 4521506 4631278 4730255 4816036 4886850 4940757 4976902 4997088 5004726 5002152 4990135
50646 4990135 4970120 4945648 4920871 4898549 4880076 4866452 4858075 4853915 4851928 4850312 4847761 4842578
50634 4842578 4832300 4814327 4786474 4746824 4693606 4625604 4542626 4445734 4337374 4221204 4101074
50623 4101074 3979647 3858125 3737400 3619141 3505542 3398477 3299409 3209912 3131559 3065097
50613 3065097 3010114 2965723 2931258 2906104 2889305 2879859 2877365 2881894 2893014 2909166 2928267 2949005
50601 2949005 2971519 2996707 3024734 3054273 3083442 3111520 3139333 3167838 3196895 3226051 3256025
50590 3256025 3288419 3323807 3360949 3398295 3435721 3474352 3515265 3558949 3605732 3656012 3710017
50579 3710017 3767639 3828558 3892435 3959152 4028885 4101454 4175368 4248191 4318464 4386766 4454073
50568 4454073 4519441 4580434 4635923 4687275 4736128 4781597 4820287 4848480 4863583 4863996 4849082 4820168
50556 4820168 4781173 4737404 4693252 4650881 4610880 4573755 4540667 4512820 4490385 4472123 4456121
50545 4456121 4440887 4425517 4408550 4386995 4357195 4316988 4266544 4206789 4137800 4059490 3973283
50534 3973283 3881797 3786825 3688694 3587804 3485672 3383996 3283595 3184849 3088349 2994497
50524 2994497 2903342 2815642 2733367 2658181 2589844 2526961 2468877 2416015 2368829 2327352 2291456
50513 2291456 2260618 2233838 2210767 2192586 2180682 2174707 2173083 2175192 2181730 2192888 2207667 2225296
50501 2225296 2246029 2270102 2297020 2326511 2359174 2395533 2435252 2477829 2523282 2571581 2622191
50490 2622191 2674707 2729175 2785169 2841344 2896671 2951615 3007368 3064322 3121853 3179242 3236494
50479 3236494 3294849 3356847 3425131 3500490 3581653 3667519 3758974 3858006 3965888 4083046 4209964
50468 4209964 4347032 4493784 4649175 4812445 4983014 5159880 5341887 5528207 5717721
50459 5717721 5908200 6096920 6281755 6460719 6630666 6787520 6927873 7049482 7150257
50450 7150257 7227854 7280748 7308957 7313209 7293796 7250643 7184347 7097116 6992911 6876629 6752869
50439 6752869 6625578 6498978 6378199 6268156 6171875 6090547 6025028 5976362 5944565 5927560
50429 5927560 5921719 5923100 5927850 5931613 5928935 5913641 5880404 5826432 5751578 5656806 5543107 5412123
50417 5412123 5266942 5111282 4948184 4780130 4609883 4440073 4272186 4107143 3946920
50408 3946920 3794452 3651628 3518172 3392765 3274457 3162858 3058019 2960660 2871803 2791652
50398 2791652 2719392 2654377 2596846 2547019 2504245 2467635 2437018 2412633 2394157 2380588 2371009
50387 2371009 2365232 2363865 2367664 2376491 2388976 2403832 2421346 2442656 2467346 2492895 2517011 2539554
50375 2539554 2561494 2582947 2603281 2622334 2640119 2655638 2667368 2675183 2680878 2686547 2693153 2700843
50363 2700843 2709774 2720177 2732199 2746368 2763922 2786123 2813176 2844234 2878724 2917528 2962538
50352 2962538 3014951 3074230 3138998 3208685 3283865 3365079 3451860 3542912 3636608 3731175 3824993
50341 3824993 3917038 4006388 4091174 4168892 4238306 4300099 4354605 4399482 4430697 4445431 4442995
50330 4442995 4423469 4387223 4336076 4273338 4201738 4122198 4035551 3944761 3854474 3768618 3689198
50319 3689198 3617117 3553254 3498576 3453843 3419333 3394505 3377824 3367345 3361508 3358992 3357695 3354357
50307 3354357 3345552 3328845 3302848 3266661 3220059 3164354 3102408 3037045 2969340 2898734 2824859
50296 2824859 2749016 2673739 2601182 2532158 2466532 2404181 2345562 2291609 2243186 2200493 2162799
50285 2162799 2128653 2096240 2063667 2029428 1993209 1956275 1920627 1887652 1857827 1831610 1809884
50274 1809884 1793003 1779858 1768661 1758753 1751180 1747373 1747598 1750821 1755748 1761779 1769201 1778654 1790254
50261 1790254 1803045 1815478 1826653 1836955 1847365 1858281 1869229 1879477 1888613 1896525 1903146 1908274
50249 1908274 1911575 1912979 1913301 1914270 1917405 1922798 1929375 1936419 1944484 1954707 1967707 1983473 2001973
50236 2001973 2023479 2048343 2076674 2108278 2142971 2181109 2223443 2269654 2316786 2359902 2394823
50225 2394823 2419937 2435161 2440190 2434893 2421016 2402183 2381814 2361662 2342362 2324414 2308121 2293231
50213 2293231 2279205 2265624 2252132 2238458 2224847 2212081 2200695 2190522 2181386 2173852 2168666 2165629
50201 2165629 2163594 2161774 2160788 2162304 2167778 2177487 2190599 2206068 2223508 2243151 2265102 2288911 2313934
50188 2313934 2339783 2366229 2392875 2419267 2445134 2470256 2494206 2516484 2536772 2554701 2569366
50177 2569366 2579442 2583933 2582637 2575725 2563201 2545150 2522574 2497628 2472686 2449076 2426706 2404631
50165 2404631 2381583 2356063 2326539 2292070 2252637 2208775 2161287 2111582 2061636 2012744 1964510
50154 1964510 1915986 1867858 1822487 1781407 1743665 1707466 1672872 1641976 1616516 1596062 1578574
50143 1578574 1562167 1546131 1530705 1516189 1502345 1488735 1475684 1464501 1456273 1450572 1445841 1440940
50131 1440940 1435792 1430536 1424772 1418034 1410462 1402486 1394067 1384799 1374737 1364610 1354996 1345574 1335417
50118 1335417 1323939 1311481 1299097 1287930 1278634 1271156 1265037 1259999 1256167 1253583 1251677 1249661 1247537
50105 1247537 1246332 1247051 1249731 1253886 1259574 1267419 1277475 1288680 1299728 1310199 1320579 1331416 1342957
50092 1342957 1355622 1370434 1388610 1410645 1435851 1462897 1490835 1519672 1550075 1582727 1617960
50081 1617960 1655731 1695648 1737043 1779269 1822108 1865987 1911784 1960288 2011545 2064675 2118490
50070 2118490 2172315 2226121 2280072 2334362 2389246 2444308 2497420 2545254 2585356 2617077 2640008
50059 2640008 2652485 2652858 2641693 2621433 2594047 2560196 2520663 2477158 2431213 2383401 2334272 2285359
50047 2285359 2238649 2195454 2156000 2119496 2084437 2049617 2015196 1982236 1951165 1921474 1893000
50036 1893000 1866335 1841730 1818836 1798079 1780972 1768255 1758914 1752029 1748341 1748679 1751849 1755732 1759952
50023 1759952 1765916 1774491 1784974 1796112 1806876 1816451 1824853 1833390 1843147 1853071 1860981 1866401 1870789
50010 1870789 1874797 1877099 1876593 1874009 1870346 1865102 1857458 1848313 1839633 1832130 1824720 1816140 1806207 1795542
49996 1795542 1784902 1774911 1765937 1758019 1751081 1745200 1740707 1738285 1738932 1743221 1750515 1759486 1769579 1781208
49982 1781208 1794306 1807754 1820900 1834766 1850771 1868880 1887948 1907244 1926483 1944850 1961419
49971 1961419 1976518 1991369 2006225 2020090 2032521 2044408 2056482 2068354 2079853 2092166 2106378
49960 2106378 2121738 2136779 2151757 2168431 2187368 2206844 2224889 2241279 2256852 2271778 2285444
49949 2285444 2297507 2308129 2317356 2325041 2331260 2336087 2338759 2337540 2330581 2316709 2295532 2267326 2233074
49936 2233074 2194370 2153096 2111083 2069701 2029427 1990143 1952346 1917660 1887275 1860001 1832884
49925 1832884 1804093 1774461 1745921 1719317 1694300 1670540 1648042 1626538 1605355 1583880 1561758
49914 1561758 1538830 1515219 1491209 1466687 1441239 1415343 1390981 1370144 1352775 1336868 1320579
49903 1320579 1303773 1287601 1273261 1261213 1251107 1242312 1234731 1228863 1224722 1221087 1216614 1211550 1207611
49890 1207611 1206157 1207145 1209863 1213866 1219033 1225480 1233730 1244317 1256732 1269238 1280229 1289504 1297866
49877 1297866 1305709 1312474 1317550 1321356 1325070 1328948 1331180 1329188 1322288 1312319 1301152 1288532 1273453
49864 1273453 1256823 1241075 1227191 1213790 1199626 1185536 1173170 1162919 1154108 1146416 1140088 1135121
49852 1135121 1131090 1127636 1124707 1122594 1121977 1123325 1126056 1128996 1132102 1136799 1143966 1152487 1160658 1168220
49838 1168220 1175986 1184231 1192907 1202950 1215757 1231135 1246977 1261239 1273283 1283145 1290678 1295990
49826 1295990 1299843 1302878 1304906 1305336 1303843 1300275 1294415 1286216 1275926 1263846 1250542 1237387 1225902
49813 1225902 1215894 1205057 1191404 1175719 1160690 1147937 1136971 1127054 1118737 1112918 1109238 1106310
49801 1106310 1103305 1100614 1099088 1099210 1101074 1104655 1109826 1116274 1123569 1131330 1139450 1148299 1158581 1170738
49787 1170738 1184532 1199286 1214314 1228764 1241471 1251678 1259966 1267748 1275556 1282376 1286988 1289343
49775 1289343 1290166 1289710 1287578 1283450 1277311 1269199 1259475 1249304 1240136 1232498 1225745 1219113 1212621 1206850
49761 1206850 1202279 1199074 1197212 1196519 1196692 1197407 1198506 1200339 1203968 1210611 1220429 1232123 1244089 1255600
49747 1255600 1266464 1276144 1284164 1291157 1298380 1306094 1313338 1319480 1325083 1330739 1335712 1338228 1336843 1331442
49733 1331442 1323354 1314524 1305934 1296698 1285297 1271640 1257189 1243152 1229684 1217001 1205947 1196730
49721 1196730 1188136 1178928 1169367 1160574 1152939 1145810 1138289 1129861 1120907 1113067 1108184 1106150 1104694 1102204
49707 1102204 1099886 1100129 1103597 1109271 1116589 1125792 1136397 1147028 1157071 1167170 1177691 1187795 1196439
49694 1196439 1203414 1209071 1213778 1217912 1221578 1224101 1224547 1222962 1220330 1217093 1212530 1205918 1197455 1187705
49680 1187705 1177099 1166629 1158186 1153169 1150993 1149701 1147890 1145580 1143454 1141905 1140868 1140097 1139519 1139503
49666 1139503 1140796 1144000 1149139 1155732 1163121 1170601 1177435 1183066 1187491 1191465 1196314 1203330 1213069 1225164
49652 1225164 1238791 1253076 1267006 1279385 1289387 1296935 1302192 1305054 1305685 1305148 1304565 1303735 1301569 1298023
49638 1298023 1294638 1292702 1291748 1290486 1288418 1285700 1281950 1276296 1268670 1260355 1253051 1247792 1244693 1243318
49624 1243318 1243194 1244357 1247389 1252559 1258972 1265158 1270768 1277210 1286238 1298170 1311930 1326624 1342455
49611 1342455 1359942 1378748 1397647 1415348 1430995 1443997 1453890 1460503 1464028 1464979 1464416 1464179 1466251
49598 1466251 1471500 1479223 1488131 1497380 1506273 1513301 1516240 1513488 1505114 1492450 1476818 1458816 1438815
49585 1438815 1417808 1397363 1378535 1361340 1345653 1332139 1321378 1312272 1302598 1291588 1281012 1273029
49573 1273029 1267796 1263965 1260682 1257855 1254982 1251082 1245977 1240549 1235425 1230150 1223979 1216912 1209650 1202895
49559 1202895 1196802 1190811 1184119 1176737 1169869 1164704 1161019 1157617 1153920 1150286 1146904 1143540 1140627 1139499
49545 1139499 1140774 1143236 1145027 1145516 1145409 1145446 1145736 1146190 1146841 1147536 1147872 1147851 1148401 1150712 1154819 1159139 1161919
49528 1161919 1163030 1163864 1165481 1167666 1170012 1172845 1176275 1179258 1180805 1181708 1183778 1187605 1192269 1197149
49514 1197149 1202595 1208568 1213949 1217886 1221012 1224885 1230925 1240085 1252432 1266406 1279390 1289877 1298691
49501 1298691 1307620 1317433 1327584 1337027 1344620 1349331 1350915 1350272 1348720 1347041 1345330 1343265 1340414 1336856
49487 1336856 1333710 1332387 1333134 1335069 1337724 1341452 1345976 1349863 1352396 1354893 1359148 1365302 1372229 1379216
49473 1379216 1386196 1393067 1400170 1408967 1420831 1435246 1450416 1465666 1482178 1501372 1523625 1548582
49461 1548582 1575613 1603585 1631099 1657332 1682040 1704554 1723558 1738361 1749958 1760440 1771405
49450 1771405 1782889 1793632 1802536 1810240 1819008 1830612 1844515 1858554 1870859 1880300 1885509 1884876 1877817
49437 1877817 1865124 1847738 1826051 1800834 1773977 1747532 1722322 1698005 1674364 1652196 1632978
49426 1632978 1617675 1605573 1594337 1581750 1567633 1553783 1541999 1532623 1524955 1518434 1513121 1509544
49414 1509544 1508379 1509780 1512663 1515101 1515868 1515419 1515036 1515436 1516656 1518826 1522251 1526661 1531059 1534715 1538015
49399 1538015 1541950 1546838 1551873 1556024 1559083 1561647 1564234 1566740 1568706 1569718 1569539 1568232 1566378 1564791
49385 1564791 1563712 1562524 1560470 1557350 1553380 1548878 1544444 1540877 1538408 1536533 1535156 1535277 1537651 1541353
49371 1541353 1544917 1548622 1554235 1562422 1572019 1582380 1594843 1610803 1629595 1649798 1671798 1697316
49359 1697316 1726649 1758045 1790140 1823340 1857881 1891586 1920677 1942406 1956043 1961871 1960686 1954584
49347 1954584 1947151 1941889 1940516 1943032 1948976 1958045 1969750 1983322 1998310 2014797 2032724 2051297
49335 2051297 2069539 2087298 2105166 2123170 2139948 2153674 2163761 2171242 2177361 2182237 2185219 2185946
49323 2185946 2184244 2179234 2169858 2156775 2142551 2129006 2115277 2099822 2083740 2070268 2060856 2053477
49311 2053477 2045524 2036981 2029740 2024956 2022341 2021275 2021187 2021117 2020143 2018288 2016122 2013586 2009972 2005035 1999235
49296 1999235 1992940 1986132 1978924 1971602 1964167 1956483 1948898 1941884 1935053 1927431 1918908 1910622 1903590 1897771
49282 1897771 1892840 1889047 1886693 1885357 1884346 1883529 1882984 1882101 1879782 1875563 1869892 1863155 1855071 1845505 1835592
49267 1835592 1827367 1822172 1819871 1819833 1822152 1827310 1835022 1844370 1855126 1867987 1883128 1899429 1915665
49254 1915665 1931611 1947079 1960615 1970341 1975673 1977074 1974404 1966902 1954886 1940176 1924383 1907857
49242 1907857 1890806 1874327 1859420 1845670 1831960 1818288 1806011 1796256 1788730 1782401 1776989 1773321
49230 1773321 1772106 1772811 1774230 1776090 1779331 1784467 1790378 1795389 1798983 1801747 1804087 1806042 1807987 1810369
49216 1810369 1812812 1814565 1815871 1817773 1820419 1822758 1824212 1825518 1827375 1829301 1830448 1830663 1830100 1828585
49202 1828585 1826110 1823284 1820718 1818659 1817767 1819343 1823897 1830095 1836071 1841494 1847761 1856762 1870109 1888951
49188 1888951 1913435 1942403 1974117 2006997 2039395 2069517 2096351 2119841 2139060 2151058 2153154
49177 2153154 2146258 2134453 2121147 2106817 2090746 2073572 2057285 2043504 2032541 2023815 2016725 2011371
49165 2011371 2008655 2009241 2012314 2015854 2018446 2020409 2022992 2027005 2032590 2039790 2048712 2059287 2071310 2084737
49151 2084737 2099734 2116576 2135613 2157080 2180690 2205573 2230879 2256328 2282090 2308452 2335869
49140 2335869 2364910 2395528 2426481 2456214 2484512 2512651 2541601 2570745 2599001 2626573 2654530
49129 2654530 2682819 2709969 2735119 2759246 2783674 2808275 2832052 2854813 2877297 2900189 2924211
49118 2924211 2950798 2981264 3015233 3051099 3088253 3127752 3170577 3216515 3265275 3317652 3374925
49107 3374925 3437910 3506894 3581121 3657374 3730060 3793959 3846636 3887765 3917265 3935460 3944454
49096 3944454 3947860 3948964 3949778 3951590 3955411 3961850 3971141 3983255 3997620 4013135 4028896 4044510 4059355
49083 4059355 4072550 4084545 4097940 4115453 4137403 4162169 4188510 4216260 4245376 4275930 4308826
49072 4308826 4344873 4383091 4421473 4459667 4499356 4541537 4584918 4627715 4669746 4711879 4754472
49061 4754472 4797292 4840321 4883872 4928438 4974898 5024244 5076685 5131790 5189858 5252211 5319651
49050 5319651 5391819 5468963 5553367 5648038 5754970 5875988 6014387 6173430 6352418 6545163
49040 6545163 6743074 6939917 7134135 7327121 7518652 7702734 7867609 8000629 8093633 8144041
$$ [...]
##END NTUPLES=NMR SPECTRUM
##END=
