
##TITLE=AC1007_S-149_6114592_zZLpfeKMET
##JCAMPDX= 6.0         $$ Bruker NMR JCAMP-DX V2.0
##DATA TYPE= NMR SPECTRUM
##DATA CLASS= NTUPLES
##ORIGIN= BRUKER
##OWNER= Administrator
$$ 1.72 TOPSPIN		Version 2.1
$$ 2012-05-14 19:33:23.531 -0500  Administrator@TOPSPIN
$$ Compression mode = diff/dup
##.OBSERVE FREQUENCY= 400.13188235
##.OBSERVE NUCLEUS= ^1H
##.ACQUISITION MODE= SIMULTANEOUS (DQD)
##.ACQUISITION SCHEME= undefined
##.AVERAGES= 8
##.DIGITISER RES= 22
##SPECTROMETER/DATA SYSTEM= spect
##.PULSE SEQUENCE= zg30
##.SOLVENT NAME= COFFEE_meoh
##.SHIFT REFERENCE= INTERNAL, COFFEE_meoh, 1, 14.98061
##AUDIT TRAIL= $$ (NUMBER, WHEN, WHO, WHERE, PROCESS, VERSION, WHAT)
$$ ##TITLE= Audit trail, TOPSPIN		Version 2.1
$$ ##JCAMPDX= 5.01
$$ ##ORIGIN= Bruker BioSpin GmbH
$$ ##OWNER= Administrator
$$ $$ C:\Bruker\TOPSPIN/data/COFFEE/nmr/AC1007_S-149_6114592_zZLpfeKMET/50/pdata/1/auditp.txt
$$ ##AUDIT TRAIL=  $$ (NUMBER, WHEN, WHO, WHERE, PROCESS, VERSION, WHAT)
(   1,<2012-05-14 19:33:16.750 -0500>,<Administrator>,<TOPSPIN>,<go>,<TOPSPIN 2.1>,
      <created by zg
	started at 2012-05-14 19:32:09.812 -0500,
	POWCHK enabled, PULCHK disabled,
       configuration hash MD5:
       AF F2 23 6B 01 CD 40 DD E5 A1 38 A0 06 EA F7 77
       data hash MD5: 64K
       B7 0D 48 C4 59 A2 E1 BA 17 50 8C 4C C8 9E F1 80>)
(   2,<2012-05-14 19:33:19.328 -0500>,<Administrator>,<TOPSPIN>,<proc1d>,<TOPSPIN 2.1>,
      <Start of raw data processing
       efp LB = 0 FT_mod = 6 PKNL = 1 PHC0 = 0 PHC1 = 0 SI = 32K 
       data hash MD5: 32K
       46 A2 5C 5B FE C9 73 50 D9 55 11 DE 9E DA 6A 93>)
(   3,<2012-05-14 19:33:19.734 -0500>,<Administrator>,<TOPSPIN>,<proc1d>,<TOPSPIN 2.1>,
      <pk PHC0 = 214.4202 PHC1 = 0 
       data hash MD5: 32K
       64 1E 12 43 C4 E8 C4 4F A0 81 04 CC 6F F9 F6 B9>)
(   4,<2012-05-14 19:33:19.843 -0500>,<Administrator>,<TOPSPIN>,<proc1d>,<TOPSPIN 2.1>,
      <abs ABSG = 1 
       data hash MD5: 32K
       16 1C BF 4A 20 29 D7 79 FC 53 83 2C 17 4C 2D 36>)
(   5,<2012-05-14 19:33:19.875 -0500>,<Administrator>,<TOPSPIN>,<proc1d>,<TOPSPIN 2.1>,
      <abs ABSG = 2 
       data hash MD5: 32K
       CA E0 44 AE F3 15 D0 F1 79 FB 1A 25 0E DE 2F 24>)
(   6,<2012-05-14 19:33:19.906 -0500>,<Administrator>,<TOPSPIN>,<proc1d>,<TOPSPIN 2.1>,
      <abs ABSG = 3 
       data hash MD5: 32K
       86 28 FA CF D4 50 09 A9 52 88 AC 5F 98 D2 79 09>)
(   7,<2012-05-14 19:33:19.937 -0500>,<Administrator>,<TOPSPIN>,<proc1d>,<TOPSPIN 2.1>,
      <abs ABSG = 4 
       data hash MD5: 32K
       0C B4 B4 C9 61 D8 F9 9F 27 69 81 7B A1 8B C2 9F>)
(   8,<2012-05-14 19:33:19.968 -0500>,<Administrator>,<TOPSPIN>,<proc1d>,<TOPSPIN 2.1>,
      <abs ABSG = 5 
       data hash MD5: 32K
       7F BF EE 93 74 49 F0 66 A5 23 03 BB 66 F9 69 A9>)
$$ ##END=
$$ 
$$ $$ hash MD5
$$ $$ 85 C1 A2 59 3A D5 EC 28 E5 D8 BD C5 CB 48 15 1A
##$RELAX= 
##$RELAX= 
##$RELAX= 
##$RELAX= 
##$RELAX= 
##$RELAX= 
##$RELAX= 
$$ Bruker specific parameters
$$ --------------------------
$$ [...]
150 150 150 150 150 150 150 150
##$TP07= 0
##$TPNAME0= <>
##$TPNAME1= <>
##$TPNAME2= <>
##$TPNAME3= <>
##$TPNAME4= <>
##$TPNAME5= <>
##$TPNAME6= <>
##$TPNAME7= <>
##$TPOAL= (0..7)
0.5 0.5 0.5 0.5 0.5 0.5 0.5 0.5
##$TPOFFS= (0..7)
0 0 0 0 0 0 0 0
##$TUNHIN= 0
##$TUNHOUT= 0
##$TUNXOUT= 0
##$USERA1= <user>
##$USERA2= <user>
##$USERA3= <user>
##$USERA4= <user>
##$USERA5= <user>
##$V9= 5
##$VALIST= <valist>
##$VCLIST= <CCCCCCCCCCCCCCC>
##$VD= 0
##$VDLIST= <DDDDDDDDDDDDDDD>
##$VPLIST= <PPPPPPPPPPPPPPP>
##$VTLIST= <TTTTTTTTTTTTTTT>
##$WBST= 2048
##$WBSW= 25
##$XGAIN= (0..3)
0 0 0 0
##$XL= 0
##$YL= 0
##$YMAX_a= 511492
##$YMIN_a= -599504
##$ZGOPTNS= <>
##$ZL1= 120
##$ZL2= 120
##$ZL3= 120
##$ZL4= 120
##$ABSF1= 14.98061
##$ABSF2= -5.57192
##$ABSG= 5
##$ABSL= 3
##$ALPHA= 0
##$AQORDER= 0
##$ASSFAC= 0
##$ASSFACI= 0
##$ASSFACX= 0
##$ASSWID= 0
##$AUNMP= <proc_prof1d_extract_pilot.lims>
##$AXLEFT= 0
##$AXNAME= <>
##$AXNUC= <1H>
##$AXRIGHT= 0
##$AXTYPE= 0
##$AXUNIT= <>
##$AZFE= 0.1
##$AZFW= 0.1
##$BCFW= 0
##$BC_mod= 0
##$BYTORDP= 0
##$COROFFS= 0
##$CY= 15
##$DATMOD= 1
##$DC= 0
##$DFILT= <>
##$DTYPP= 0
##$F1P= 0
##$F2P= 0
##$FCOR= 0.5
##$FTSIZE= 32768
##$FT_mod= 6
##$GAMMA= 0
##$GB= 0
##$INTBC= 1
##$INTSCL= 1
##$ISEN= 128
##$LB= 0
##$LEV0= 0
##$LPBIN= 0
##$MAXI= 10000
##$MC2= 0
##$MEAN= 0
##$ME_mod= 0
##$MI= 0
##$NCOEF= 0
##$NC_proc= -8
##$NLEV= 6
##$NOISF1= 0
##$NOISF2= 0
##$NSP= 0
##$NTH_PI= 0
##$NZP= 0
##$OFFSET= 14.98061
##$PC= 1
##$PHC0= 214.4202
##$PHC1= 0
##$PH_mod= 1
##$PKNL= yes
##$PPARMOD= 0
##$PPDIAG= 0
##$PPIPTYP= 0
##$PPMPNUM= 2147483647
##$PPRESOL= 1
##$PSCAL= 4
##$PSIGN= 0
##$PYNMP= <proc.py>
##$REVERSE= no
##$SF= 400.13
##$SI= 32768
##$SIGF1= 0
##$SIGF2= 0
##$SINO= 400
##$SIOLD= 32768
##$SPECTYP= <>
##$SREGLST= <1H.CDCl3>
##$SSB= 0
##$STSI= 32768
##$STSR= 0
##$SW_p= 8223.68421052632
##$SYMM= 0
##$S_DEV= 0
##$TDeff= 65536
##$TDoff= 0
##$TI= <>
##$TILT= no
##$TM1= 0
##$TM2= 0
##$TOPLEV= 0
##$USERP1= <user>
##$USERP2= <user>
##$USERP3= <user>
##$USERP4= <user>
##$USERP5= <user>
##$WDW= 1
##$XDIM= 32768
##$YMAX_p= 457469836
##$YMIN_p= -700368
##$CURPLOT= <Network HP LaserJet P1505>
##$CURPRIN= <$Network HP LaserJet P1505>
##$DFORMAT= <normdp>
##$LAYOUT= <+/1D_H.xwp>
##$LFORMAT= <normlp>
##$PFORMAT= <normpl>
##$SURQMSG= 1
$$ End of Bruker specific parameters
$$ ---------------------------------
##NTUPLES= NMR SPECTRUM
##VAR_NAME=  FREQUENCY,     SPECTRUM/REAL,   SPECTRUM/IMAG
##SYMBOL=    X,             R,               I
##VAR_TYPE=  INDEPENDENT,   DEPENDENT,       DEPENDENT
##VAR_FORM=  AFFN,          ASDF,            ASDF
##VAR_DIM=   32768,         32768,           32768
##UNITS=     HZ,            ARBITRARY UNITS, ARBITRARY UNITS
##FACTOR=    0.250966925370066, 1,           1
##FIRST=     8223.43324360095, 83826,        -257311
##LAST=      0,             98423,           -68672
##MIN=       0,             -700368,         0
##MAX=       8223.43324360095, 457469836,    0
$$ Real data points
##PAGE= N=1
##DATA TABLE= (X++(R..R)), XYDATA
$$ [...]
19542b11049k5768p8239k9300G9132h0633r3269n1511d5117r7263A13289E3617
$$ -211049 -236817 -315056 -344356 79132 -80633 -173902 -225413 -45117 -142380 113289 53617
19530A87012F3044d37727F4066b20095g0209b7435A53412b63663A98302K5016
$$ 187012 63044 -437727 64066 -220095 -70209 -27435 153412 -263663 198302 223318
19520B23318d7196A53296M1866a16651C1610r474e0426j02791f210l4975n8025
$$ 223318 -47196 153296 195162 -116651 31610 22136 -50426 -153217 -6210 -41185 -99210
19509i9210k69440D3738i5743C86423e7078k64567D256M1190a77926F9898a87339
$$ -99210 -368650 43738 -95743 386423 -57078 -321645 4256 45446 -177926 69898 -187339
19497E5688O642P7381a38486A25078d9652H8122I751c07086C89027j93778I1265
$$ 55688 62330 139711 -138486 125078 -49652 88122 9751 -307086 389027 195249 91265
19485d60073b3385E0082d6773B4094a65329B19263G3681J23881d74961c9708A5043
$$ -460073 -23385 50082 -46773 24094 -165329 219263 73681 197562 -474961 -39708 15043
19473i6706c7401g796k47518R2187A28930b48220J13977K8670B3468b78377I6114
$$ -96706 -37401 -7796 -255314 -163127 128930 -248220 -134243 -105573 23468 -278377 96114
19461c6393k0098o4812A9736M3556e2704k51778F4985b62464O7447n6574n3587
$$ -36393 -56491 -121303 19736 63292 -52704 -304482 64985 -262464 -195017 -251591 -305178
19450c05178b2631l7477B48975j07456b4577j39701A28565C8896c59874b4916
$$ -305178 -22631 -60108 248975 141519 -24577 -164278 128565 38896 -359874 -24916
19439b67471L3040K5326E6821O7570J73610a81828c1247D4186K78724c3923A7556
$$ -267471 -234431 -209105 56821 124391 298001 -181828 -31247 44186 322910 -33923 17556
19427C24684a31964F4325i2312A34329a49619D4280a63576k6277D8005f2150a7042
$$ 324684 -131964 64325 -92312 134329 -149619 44280 -163576 -189853 48005 -62150 -17042
19415C7538K88693a60236M7158j99675e4383d878r2466l068E4399b16325G5438
$$ 37538 326231 -160236 -113078 -312753 -54383 -4878 -97344 -100412 54399 -216325 75438
19403b5329B860a25318L6362n7733j49408c0376B7152b07454e9537j21625F7383
$$ -25329 2860 -125318 -88956 -146689 -296097 -30376 27152 -207454 -59537 -181162 67383
19391a66610Q296L4551h230A06465J08411i4242k21289B50568l9895a36518r1726
$$ -166610 -158314 -123763 -8230 106465 214876 -94242 -315531 250568 210673 -136518 -228244
19380b28244a5630A36510k2946b18947J2277L3296A0891J70476i5428J7624j53330
$$ -228244 -15630 136510 113564 -218947 -206670 -173374 10891 181367 -95428 -77804 -231134
19369b31134a8816n9130A11982b32277b6421B37267a4277l65756c1590A2672L4707
$$ -231134 -18816 -77946 111982 -232277 -26421 237267 -14277 -380033 -31590 12672 47379
19358D7379k673a07953A88182N9058a98021B34746g5580q8990A14091a29445e3674
$$ 47379 44706 -107953 188182 247240 -198021 234746 -75580 -164570 114091 -129445 -53674
19346C5816M3231b12520B11453m1520a39884A6468b60537k7803J4352R754A06227
$$ 35816 79047 -212520 211453 169933 -139884 16468 -260537 -288340 -273988 -264234 106227
19334E9642g1174B68703b32446J02787D80200a67756e9390B38962j02460a17491
$$ 59642 -71174 268703 -232446 -129659 480200 -167756 -59390 238962 136502 -117491
19323a33629E4966Q2984b66124E4576b2650I0096a92353a0305l13167A9957a54701
$$ -133629 54966 137950 -266124 54576 -22650 90096 -192353 -10305 -323472 19957 -154701
19311D6279c40673J48359N8293E515g7063A97504q4048b6078j7144k73949J33247
$$ 46279 -340673 -192314 -134021 5515 -77063 197504 113456 -26078 -43222 -317171 -183924
19300a83924H3471f4635E7962k1048J2126b16817C3737a45166A5507i4246q0111
$$ -183924 83471 -64635 57962 36914 49040 -216817 33737 -145166 15507 -94246 -174357
19289a74357j71741D08388A1333L7900J88526G5274d71067B5574J49861b2117
$$ -174357 -346098 408388 11333 49233 237759 75274 -471067 25574 175435 -22117
19278A43061a12057N5547n1680k46348A91300K4047h069A20477c35494J37810
$$ 143061 -112057 -56510 -108190 -354538 191300 215347 -8069 120477 -335494 -197684
19268a97684L3163M6038b0675j03147m2955k91101g6841c4748A28309b66466a14261
$$ -197684 -164521 -118483 -20675 -123822 -166777 -457878 -76841 -34748 128309 -266466 -114261
19256D60851a1124j92890A19004D6852c12079H2605a66635C6739a39239f5049
$$ 460851 -11124 -204014 119004 46852 -312079 82605 -166635 36739 -139239 -65049
19245b47963H9355b56112g036B04797a44897j74715J10959c5093B11739h1825
$$ -247963 89355 -256112 -7036 204797 -144897 -319612 -208653 -35093 211739 -81825
19234b30081d0749k15592B142e1486B05324r4783a70772G6185b29460a8962q9329
$$ -230081 -40749 -256341 2142 -51486 205324 110541 -170772 76185 -229460 -18962 -108291
19223a08291b9458q2408A48979a70222d2090c607C9238a072B12173a83868j30229
$$ -108291 -29458 -111866 148979 -170222 -42090 -3607 39238 -1072 212173 -183868 -314097
19212c14097j08523a52873j56354c3413F1525J58997G4956b6751G902Q0887c79565
$$ -314097 -422620 -152873 -309227 -33413 61525 220522 74956 -26751 7902 88789 -379565
19200F322L44635q3516a17567A6919b27921P5300P4036F2739a80127A1792b68934
$$ 6322 350957 267441 -117567 16919 -227921 -152621 -78585 62739 -180127 11792 -268934
19188h9084A4951b70608d002j5551k0403l1012l33299a43433L8772A33595R2804
$$ -89084 14951 -270608 -4002 -19553 -39956 -70968 -404267 -143433 -104661 133595 226399
19177B26399n1305b1248j40542g028p1189a2765k30157N4155a7461F6320J09178
$$ 226399 175094 -21248 -161790 -7028 -78217 -12765 -242922 -188767 -17461 66320 175498
19166A75498a13486a0548G922a37006A8520M30365a59101F8374b75280h4425j56051
$$ 175498 -113486 -10548 7922 -137006 18520 448885 -159101 68374 -275280 -84425 -240476
19155b40476Q1261C73913a59876A11830d9609j50295R3027J9305B50866e8073
$$ -240476 -159215 373913 -159876 111830 -49609 -199904 -106877 -87572 250866 -58073
19144B58834a114A13721J73899i0824G368g8334q1359k13183D6029b95543L2182
$$ 258834 -1114 113721 287620 -90824 7368 -78334 -159693 -372876 46029 -295543 -263361
19133b63361J02960A08256i6472J8790A43937g5346K5456j71645c8119A6774e6807
$$ -263361 -160401 108256 -96472 -77682 143937 -75346 -49890 -221535 -38119 16774 -56807
19121b06153B40998E147f32759h0232c1308j86147j46561a56317j69814A89514
$$ -206153 240998 5147 -632759 -80232 -31308 -217455 -364016 -156317 -326131 189514
19110b02592D6168b69648O7951D7684a09112n4603a8300A8330c99118c819p0079
$$ -202592 46168 -269648 -201697 47684 -109112 -163715 -18300 18330 -399118 -3819 -73898
19099g3898A95580a99118R2332B42126H0221J14813L9519A06747L0213A0858J34658
$$ -73898 195580 -199118 -106786 242126 80221 195034 234553 106747 136960 10858 145516
19088A45516a61218d0649j46702c8359m8903j48241B39980b67449b1435k8286
$$ 145516 -161218 -40649 -187351 -38359 -87262 -235503 239980 -267449 -21435 -49721
19078d9721l5470A27992b78202J24763n2835i9353A5508J52208i7433c6279j86625
$$ -49721 -85191 127992 -278202 -153439 -206274 -99353 15508 167716 -97433 -36279 -222904
19067b22904M5040n6561E6496J76083b12715A75240a04310N129L7941A73340G7071
$$ -222904 -177864 -234425 56496 232579 -212715 175240 -104310 -99181 -61240 173340 77071
19055B33854b38720E2749a23403G8573B5035R4067c41827G6944c87874J59099
$$ 233854 -238720 52749 -123403 78573 25035 119102 -341827 76944 -387874 -228775
19045b28775B0568f8134o8707l90B55474i024k78961J6821C02367a29384j32660
$$ -228775 20568 -68134 -136841 -137231 255474 -9024 -287985 -271164 302367 -129384 -262044
19034b62044B96820j43775O3630g3611c3135N430l80034B53496a0794H1718b87121
$$ -262044 296820 153045 216675 -73611 -33135 -27705 -407739 253496 -10794 81718 -287121
19022B39197g4365A324J09104I397K01556i4725j77832C23836I4562J68340B5687
$$ 239197 -74365 1324 110428 9397 210953 -94725 -272557 323836 94562 262902 25687
19010E0591A2845g8299B09929f3045C06088b22678j39596J69409Q7990j05332
$$ 50591 12845 -78299 209929 -63045 306088 -222678 -362274 -192865 -104875 -210207
19000b10207Q8876k57012g6598k26436b0059A40242a68412A89681C7799j7283
$$ -210207 -121331 -378343 -76598 -303034 -20059 140242 -168412 189681 37799 20516
18990B0516b78929B8727J25607b13396B11971M0032h4268r7525e5567o713A62416
$$ 20516 -278929 28727 154334 -213396 211971 252003 -84268 -181793 -55567 -62280 162416
18978a31253f5584B12329h4949J6906E9918a09319A91430M7219M8662a90941d3466
$$ -131253 -65584 212329 -84949 -68043 59918 -109319 191430 238649 287311 -190941 -43466
18966A98830m5246D5878b23700m1554j01003J16759j3294K5311A04148D6882d9730
$$ 198830 153584 45878 -223700 -265254 -366257 -249498 -262792 -237481 104148 46882 -49730
18954b1616l22771A81450b00201j84546a35239A53233J3239b98855E9662f604
$$ -21616 -344387 181450 -200201 -384747 -135239 153233 166472 -298855 59662 -6604
18943F978J48371a33336l0584k35220a42046l65991e5271J4334k51335e1512E7455
$$ 6978 155349 -133336 -163920 -399140 -142046 -508037 -55271 -40937 -292272 -51512 57455
18931c9130j20457A23436Q995f1473m456B13691a30744H6542b83038a7962E3761
$$ -39130 -159587 123436 132431 -61473 -65929 213691 -130744 86542 -283038 -17962 53761
18919B44806b9811B59396A18312P2363a15558M5634j8786A10297K897f0171k28891
$$ 244806 -29811 259396 118312 190675 -115558 -69924 -88710 110297 113194 -60171 -289062
18908b89062J20639A85461c7498j39346q4838A44723b90337c2540D337J0972K5900
$$ -289062 -168423 185461 -37498 -176844 -261682 144723 -290337 -32540 4337 15309 41209
18897D1209a66468o754D03580a92571q6473A7829d4752k54658e3411j77149G5822
$$ 41209 -166468 -173222 403580 -192571 -279044 17829 -44752 -299410 -53411 -230560 75822
18885B40795E4219i7156o2375m0071h1961j20286L9745A42306a75168A21042C7930
$$ 240795 54219 -97156 -159531 -199602 -81961 -202247 -162502 142306 -175168 121042 37930
18873G1383K4391e4315j29592a8423j13165k03064A22470J09867b8603B02296
$$ 71383 95774 -54315 -183907 -18423 -131588 -334652 122470 232337 -28603 202296
18862b68988A6629b44340g5624A59695h3178F4968b6962m24838a82758p6629B9531
$$ -268988 16629 -244340 -75624 159695 -83178 64968 -26962 -451800 -182758 -259387 29531
18850b02613A25817J34328A11367b4267I0421K47743A19959e29832A20852J62647
$$ -202613 125817 260145 111367 -24267 90421 338164 119959 -529832 120852 283499
18840B83499j1056a79930j4269A26917b8873o0826o3893a6145k10965a02914k7511
$$ 283499 272443 -179930 -194199 126917 -28873 -89699 -153592 -16145 -227110 -102914 -130425
18829a30425j46421A03247i8496D6754J92747D2461P3069a03680B4553b12628
$$ -130425 -276846 103247 -98496 46754 239501 42461 115530 -103680 24553 -212628
18818a8223j16419A04336m6767a47169B55460b39577C3176J73172h8564B35880
$$ -18223 -134642 104336 57569 -147169 255460 -239577 33176 206348 -88564 235880
18807c35674K1099d5612k173D6191J6742a14629A44238j5097J7856e5263p3416
$$ -335674 -314575 -45612 -47785 46191 62933 -114629 144238 129141 146997 -55263 -128679
18796a28679c4385A67653L88301B58316c73053E1061M0605b4982A97907g7922
$$ -128679 -34385 167653 555954 258316 -373053 51061 91666 -24982 197907 -77922
18785a51067A67528a11916r5509L1396P5489j60440A1093g0988r011j2184j27424
$$ -151067 167528 -111916 -207425 -176029 -100540 -260980 11093 -70988 -79999 -92183 -219607
18774b19607i1516H4782l6341b18507A52019e0118o4033j32355J9046J08896p2355
$$ -219607 -91516 84782 48441 -218507 152019 -50118 -114151 -246506 -227460 -118564 -190919
18763a90919F0256b69401A64333m1337n8558b16772A47899O6547h2957a7796j00010
$$ -190919 60256 -269401 164333 122996 64438 -216772 147899 214446 -82957 -17796 -117806
18752a17806L1296C5968b82533O287b2409A50P4758c23645M1725B19216A03005
$$ -117806 -86510 35968 -282533 -276246 -22409 150 74908 -323645 -281920 219216 103005
18740h6996k17429i0917n2421B58352a46722K1913b7507f763A4958c2913o8610
$$ -86996 -304425 -90917 -143338 258352 -146722 -124809 -27507 -6763 14958 -32913 -101523
18729a01523j3824b0157F1548O9086b9313j46713D4173b29580o7835J46590L6068
$$ -101523 -115347 -20157 61548 130634 -29313 -176026 44173 -229580 -297415 -150825 -114757
18718a14757H3262C3834b22557a3615A33389a42710C9879J82863a4538E9066b2995
$$ -114757 83262 33834 -222557 -13615 133389 -142710 39879 222742 -14538 59066 -22995
18706a66461K7948O4429G1071A7471f2511J8393H4657c59127a49929C10824b1814
$$ -166461 -138513 -74084 71071 17471 -62511 -44118 84657 -359127 -149929 310824 -21814
18694a38441j37479a03301B4404a33502j41886j00124C46935A72487A524L7592
$$ -138441 -275920 -103301 24404 -133502 -275388 -375512 346935 172487 1524 39116
18684C9116O1426c63979H9427C1409L85898A31016a38071b3926K12j87159Q9118
$$ 39116 100542 -363979 89427 31409 417307 131016 -138071 -23926 -23714 -210873 -121755
18673a21755G5911a52727H6105M2512b48199e6383Q192n6698p7708H9362b6506
$$ -121755 75911 -152727 86105 128617 -248199 -56383 -48191 -104889 -182597 89362 -26506
18661B4160a47043K5723A6225J25395A4615d0174l19o5956b8659H5666l831E446
$$ 24160 -147043 -121320 16225 141620 14615 -40174 -40493 -106449 -28659 85666 81835 5446
18648H8155L07980A94508i4393G1686b93236g664H507b06847E8930j4657a05972
$$ 88155 396135 194508 -94393 71686 -293236 -7664 8507 -206847 58930 44273 -105972
18636d3854k05300A85192f5953g417p2237F9645J94378b02386P3882A52484a59182
$$ -43854 -249154 185192 -65953 -7417 -79654 69645 264023 -202386 -128504 152484 -159182
18624b33449A3642d9332j66793J9641K3483E4615O2397e0195A57016J10966F0365
$$ -233449 13642 -49332 -216125 -196484 -173001 54615 117012 -50195 157016 267982 60365
18612b52055g3549I0614c04938b7354B6304J39863k0516C1291M2219O14a64063
$$ -252055 -73549 90614 -304938 -27354 26304 166167 145651 31291 73510 74124 -164063
18600d7140C4770J01319a23744A64135d43731G532b8305k50284a18116k01276
$$ -47140 34770 136089 -123744 164135 -443731 7532 -28305 -278589 -118116 -319392
18590c19392Q1634E8095b67446C9605a4333f312o9470j26653C10119A16903a42066
$$ -319392 -237758 58095 -267446 39605 -14333 -6312 -75782 -202435 310119 116903 -142066
18578b29709B3714a39091m3661E6966a11224j38427H8547A7061O3954K9541P6135
$$ -229709 23714 -139091 -182752 56966 -111224 -249651 88547 17061 81015 110556 186691
18567A86691c68739J83005O9637A5487K89249G3757a10854b4803k8451F3978b79151
$$ 186691 -368739 -185734 -116097 15487 304736 73757 -110854 -24803 -53254 63978 -279151
18555b3099m57363k9157i2688P148A14139b28800a3811m131D6587Q4378b6956
$$ -23099 -480462 -509619 -92688 -85540 114139 -228800 -13811 -17942 46587 130965 -26956
18543f6640D2950c09499h1002D8060a14971B4347a36535K1069r1706j30621a17824
$$ -66640 42950 -309499 -81002 48060 -114971 24347 -136535 -115466 -207172 -337793 -117824
18531B98993b07714f866G1483c44754A29972Q462e4754A00682a75197P7317L0933
$$ 298993 -207714 -6866 71483 -344754 129972 138434 -54754 100682 -175197 -97880 -66947
18520f6947F9036h0377c4663j24137K3454A17190A1106O0808a7985E0444a73817
$$ -66947 69036 -80377 -34663 -158800 -135346 117190 11106 71914 -17985 50444 -173817
18508A88745N2599A4872N056K8054h348G236i9307l03590J85647C5790K9673a15509
$$ 188745 241344 14872 19928 47982 -8348 7236 -99307 -402897 -217250 35790 65463 -115509
18495a41562A79634G9080a06661A33598c7767J3367B805e3229E8232c36184C3031
$$ -141562 179634 79080 -106661 133598 -37767 -24400 2805 -53229 58232 -336184 33031
18483i6652B37421i0028k2263G6020J03630a21372d0084e597j23230E6751i3770
$$ -96652 237421 -90028 -112291 76020 179650 -121372 -40084 -5597 -128827 56751 -93770
18471i2493m8097p6516B05320j8315e958A79315i3031q9697D1533a32245j21441
$$ -92493 -140590 -217106 205320 187005 -5958 179315 -93031 -182728 41533 -132245 -253686
18460b53686J09538C12815r7173c22202f9787l8156n9614r364b2414D0984a07412
$$ -253686 -144148 312815 215642 -322202 -69787 -107943 -167557 -176921 -22414 40984 -107412
18448i1975j15969A7182e4757k1528n7119C5420J93367f3601k27873B5040b13965
$$ -91975 -207944 17182 -54757 -76285 -133404 35420 228787 -63601 -291474 25040 -213965
18436B5140J38647e01065h6331C44207E2547b00510e838l5660k04864j79236J1735
$$ 25140 163787 -501065 -86331 344207 52547 -200510 -5838 -41498 -246362 -425598 -413863
18425d13863H6690b08150B05688A2126C698M7092g5933l0615A04967a4512A3647
$$ -413863 86690 -208150 205688 12126 3698 50790 -75933 -106548 104967 -14512 13647
18413c3960r719l3624B8791r353a06585k49934a16803I0576f8051r0218C32782
$$ -33960 -43679 -77303 28791 19438 -106585 -356519 -116803 90576 -68051 -158269 332782
18401A9758a63973q2396h3435A4575i0304j04269A42435A2287J68417d689k0205
$$ 19758 -163973 -246369 -83435 14575 -90304 -194573 142435 12287 180704 -4689 -24894
18390b4894B97462a69895n2385B2623J86848a18724F579c20087f5631j22693A18463
$$ -24894 297462 -169895 -222280 22623 209471 -118724 6579 -320087 -65631 -188324 118463
18378A60690a75638e8529j88059J21728H1632a98194R2819j59429A18009a62600
$$ 160690 -175638 -58529 -246588 -124860 81632 -198194 -105375 -264804 118009 -162600
18367B12580C8781a85430O6835k12990a46117C31410G4656d89577f837k59649
$$ 212580 38781 -185430 -118595 -331585 -146117 331410 74656 -489577 -6837 -266486
18357b66486D6211J36571A8362J37196a54244B22790K8781c9740k50267J14640
$$ -266486 46211 182782 18362 155558 -154244 222790 251571 -39740 -290007 -175367
18347a75367m5808B01816f3512j9157j79921J22303A55696m6159Q774J96736a00784
$$ -175367 -221175 201816 -63512 -82669 -262590 -140287 155696 109537 118311 315047 -100784
18335d9889a9809A82940b39672R4395b8034A72962a6124r082l85846a55258J7420
$$ -49889 -19809 182940 -239672 -145277 -28034 172962 -16124 -25206 -411052 -155258 -137838
18324a37838A67603b78199J33947l2000B3863K36437r7537J53727b1976l6040
$$ -137838 167603 -278199 -144252 -176252 23863 260300 162763 316490 -21976 -58016
18314e8016j11474H8416i7883p4345l00626a71053N4469C35433a26254C55439
$$ -58016 -169490 88416 -97883 -172228 -472854 -171053 -116584 335433 -126254 355439
18303C26589F0885K60a40455B98682H4453d1053j07676A89387a01434c242E4317
$$ 326589 60885 61145 -140455 298682 84453 -41053 -148729 189387 -101434 -3242 54317
18291a72687j6491A60678e52863E0249b20290E7407b05884A29503J96042a77A53835
$$ -172687 -189178 160678 -552863 50249 -220290 57407 -205884 129503 325545 -177 153835
18279b83026a30420B58969c3156j03846F4248j6989a21361p3367j18881I6230
$$ -283026 -130420 258969 -33156 -137002 64248 47259 -121361 -194728 -313609 96230
18268b54236c857k39058H357a53849f0386K5806o3347c0579j56820M3531L9513
$$ -254236 -3857 -242915 8357 -153849 -60386 -34580 -97927 -30579 -187399 -143868 -104355
18257a04355A36796a88447j68138a41951N726D5992M6688m5566F93b8977e202
$$ -104355 136796 -188447 -356585 -141951 -136225 45992 92680 47114 693 -28977 -5202
18245i6763B75957b47449A00947a75363G6884R7156k1482f9681j6040l0792j81359
$$ -96763 275957 -247449 100947 -175363 76884 174040 152558 -69681 -85721 -116513 -297872
18234b97872A72304a72740d3020A55677b23700n118A35415B2351b26288l3269
$$ -297872 172304 -172740 -43020 155677 -223700 -228818 135415 22351 -226288 -259557
18224b59557A03125P5020b37961f3929j14771D344h7224A00943a35526G9343C7859
$$ -259557 103125 178145 -237961 -63929 -178700 4344 -87224 100943 -135526 79343 37859
18212b1709j00356A91579c18888J13783m1768d8844B56726E024c28809A47995
$$ -21709 -122065 191579 -318888 -205105 -246873 -48844 256726 5024 -328809 147995
18201A13180a40054n8322b0327O231l1481B13770b59576E9353F966a15497j57676
$$ 113180 -140054 -198376 -20327 -14096 -45577 213770 -259576 59353 6966 -115497 -273173
18190b73173J34742c2423E0004J09366j4095b33900J03058j09140i3129L262q8349
$$ -273173 -138431 -32423 50004 159370 145275 -233900 -130842 -239982 -93129 -89867 -178216
18179a78216j82286H5058b15350A87159K945d5626B10221f8570l1094j48446b7736
$$ -178216 -360502 85058 -215350 187159 190104 -45626 210221 -68570 -99664 -248110 -27736
18167a12292k24476C887f9455K3606A9722a0431A09685c3886n9299r6285L7838
$$ -112292 -336768 3887 -69455 -45849 19722 -10431 109685 -33886 -93185 -189470 -151632
18156a51632q2167C5096e38224g1880n912j77506J11126c6081A0908J21480J8236
$$ -151632 -233799 35096 -538224 -71880 -77792 -255298 -144172 -36081 10908 132388 150624
18145A50624N8843c87464A79222n3914a2627I558f7423j43260N7662A0646P382
$$ 150624 209467 -387464 179222 125308 -12627 9558 -67423 -210683 -153021 10646 18028
18134A8028K9967L7139a81588L3311c9859m6741k22668J51768e1985k47718l8041
$$ 18028 47995 85134 -181588 -148277 -39859 -86600 -309268 -157500 -51985 -299703 -337744
18123c37744A75832q2368M4046a01135a4576B55557b70342a23531J3768j08359
$$ -337744 175832 93464 137510 -101135 -14576 255557 -270342 -123531 -109763 -218122
18113b18122D2098g1175I2109a14979l7753f9686k18582M8778L0383a0622A07226
$$ -218122 42098 -71175 92109 -114979 -152732 -69686 -288268 -239490 -209107 -10622 107226
18101a76087A35676b18742N84I8471a33208c1152A13234a59338j71200i8835j1186
$$ -176087 135676 -218742 -218158 98471 -133208 -31152 113234 -159338 -330538 -98835 -110021
18090a10021A17125J76396A11887g8179A83978a97919A1661a80799G3912J308
$$ -110021 117125 293521 111887 -78179 183978 -197919 11661 -180799 73912 75220
18080G5220b1669A73608M6965k919a53810A16501h6868I3202k8752b57913B71465
$$ 75220 -21669 173608 220573 217654 -153810 116501 -86868 93202 64450 -257913 271465
18068b40644l1946e9786j71895L2701E7257J0978J80031k9428I5023P4225d8265
$$ -240644 -272590 -59786 -231681 -198980 57257 68235 248266 218838 95023 169248 -48265
18056c14975I2182C9922f9040A45507b7432B45146f678j34542A45616O7781j7648
$$ -314975 92182 39922 -69040 145507 -27432 245146 -6678 -141220 145616 213397 195749
18045A95749d6447E7799J5173b32513L7149A16597b4852e483o1964A37031e2394
$$ 195749 -46447 57799 72972 -232513 -195364 116597 -24852 -5483 -67447 137031 -52394
18033a44412C1729g5781F2479a6715B6696A1103J94416c62549A993J5213K71093
$$ -144412 31729 -75781 62479 -16715 26696 11103 205519 -362549 1993 17206 288299
18022B88299h0074H2191d1723q247E1844c71101A81829c39718A49046p0134N5931
$$ 288299 -80074 82191 -41723 -49970 51844 -371101 181829 -339718 149046 78912 134843
18011A34843j7846k2656N3916o0594h7826j24224D6292K29210j10435D381J46233
$$ 134843 116997 94341 148257 87663 -87826 -212050 46292 275502 165067 4381 150614
18000A50614b8935j09502I4453f6755j09170g8131A95377c8277A65689c40287
$$ 150614 -28935 -138437 94453 -66755 -175925 -78131 195377 -38277 165689 -340287
17989g00368H0401M7069h5065l77238g7506k7520A79430b0681B43409d6320J3191
$$ -700368 80401 127470 -85065 -462303 -77506 -105026 179430 -20681 243409 -46320 -33129
17978c3129p6210A40809J71186e595F2719O7321a922j00828a5055A45981a715
$$ -33129 -109339 140809 311995 -5595 62719 130040 -1922 -102750 -15055 145981 -1715
17966b61189A0870a45893B23574A3695K23268b23708B39436h0223E6643a08453
$$ -261189 10870 -145893 223574 13695 236963 -223708 239436 -80223 56643 -108453
17955c33011a18796A19669R2036A01347j3831a56784O6017k1399B770a8555B24339
$$ -333011 -118796 119669 211705 101347 87516 -156784 -90767 -112166 2770 -18555 224339
17943A01362b4138n8631l42078B07626c00982a6905B31976b22628a9149f056E6310
$$ 101362 -24138 -82769 -424847 207626 -300982 -16905 231976 -222628 -19149 -6056 56310
17931c443j08714A46596b55465m3323c1726B07693c57150A39410a26495B9142
$$ -3443 -112157 146596 -255465 -298788 -31726 207693 -357150 139410 -126495 29142
17920D78921E5452b92454E29609k18483d3863q1064A7932b59678K0674I6576b20543
$$ 478921 55452 -292454 529609 311126 -43863 -124927 17932 -259678 -239004 96576 -220543
17908A40221J68988D1337R1497O3825g1108B66789c54047a47871d6924l620o7073
$$ 140221 309209 41337 132834 196659 -71108 266789 -354047 -147871 -46924 -50544 -117617
17897a17617B4281g8939C50118B285e002l1595B7749a02436j55217C7782M648
$$ -117617 24281 -78939 350118 2285 -5002 -36597 27749 -102436 -257653 37782 42430
17886D2430b7773k0734A26382j423a78086F991c67256i7291K9770G4449c315B17274
$$ 42430 -27773 -48507 126382 124959 -178086 6991 -367256 -97291 -67521 74449 -3315 217274
17873e3498J7308n0781M0301c359m7166A67653a2526k92215h3473E55342a07381
$$ -53498 -36190 -86971 -46670 -3359 -50525 167653 -12526 -304741 -83473 555342 -107381
17861a04453A9970h220m3318E9786g3699c6504B46575a26737r5141A9697i6246
$$ -104453 19970 -8220 -51538 59786 -73699 -36504 246575 -126737 -221878 19697 -96246
17849a61939a2738k63083A6531b59413C7968L08662q2714C6372M9031D956b16454
$$ -161939 -12738 -275821 16531 -259413 37968 346630 263916 36372 85403 4956 -216454
17837B07461D6160j1538h4028A22244J24397a36764a6738j7664k82138G5636d4412
$$ 207461 46160 34622 -84028 122244 246641 -136764 -16738 -34402 -316540 75636 -44412
17825D1467A968b3429A19679a0317A3178c7201A85709D8295e5925j13387r702
$$ 41467 1968 -23429 119679 -10317 13178 -37201 185709 48295 -55925 -169312 -179014
17814a79014O9488r0886A2192L84763a6536A64369b12559g8211A40599a90378
$$ -179014 -109526 -200412 12192 396955 -16536 164369 -212559 -78211 140599 -190378
17803B34564J95688b38381J10207A32467a4638l7267k32964R318A9850d6068j69697
$$ 234564 430252 -238381 -128174 132467 -14638 -51905 -284869 -275551 19850 -46068 -215765
17792b15765J03563j002q2655h7943A43569b796D1142J89351j14799a68363B33507
$$ -215765 -112202 -113204 -195859 -87943 143569 -2796 41142 230493 115694 -168363 233507
17780b9784A94990H2811D1104b39332B25022A9063M3209h6741M1987B5496a90384
$$ -29784 194990 82811 41104 -239332 225022 19063 62272 -86741 -44754 25496 -190384
17768a09852L3940k60202d5537N919l425B23473i694A97414a9025D12041A6441
$$ -109852 -75912 -336114 -45537 -39618 -43043 223473 -9694 197414 -19025 412041 16441
17756A49239b27534C11389a95849R1255j78627B44954h6327I745f7356a7085A90651
$$ 149239 -227534 311389 -195849 -104594 -283221 244954 -86327 9745 -67356 -17085 190651
17744f6350G8503a24639c1713F3606h4994a7939A33173c4346n6970B96684a68471
$$ -66350 78503 -124639 -31713 63606 -84994 -17939 133173 -34346 -91316 296684 -168471
17732E03121A43739b80028e460j25295f0113B14016c2782j74141q9773H4958M5894
$$ 503121 143739 -280028 -5460 -130755 -60113 214016 -32782 -206923 -296696 84958 130852
17721A30852P2121a3818C00890p5724j09360Q1578D7893B1153K9288a72881A71684
$$ 130852 202973 -13818 300890 225166 115806 197384 47893 21153 50441 -172881 171684
17709D1498O0965j9467A5899a09665C40797j59791j0466A7143K03438B6695O2356
$$ 41498 102463 82996 15899 -109665 340797 181006 170540 17143 220581 26695 89051
17698H9051K32086j02854k7415a05951B6976L8866a26422k26189b7632C37586
$$ 89051 321137 218283 190868 -105951 26976 65842 -126422 -352611 -27632 337586
17687E3820i9053G491b0171l1051A50481p229c30407D3374N47J46171J23960J5019
$$ 53820 -99053 7491 -20171 -51222 150481 143252 -330407 43374 43921 190092 314052 329071
17675C29071B4229b78444J18893H2948J20928a28027D6259J5620A153J14807D1826
$$ 329071 24229 -278444 -159551 82948 203876 -128027 46259 61879 1153 115960 41826
17663B9745J35431b47810F0140b28129B3502L32636b7598m5856l79861B20571
$$ 29745 165176 -247810 60140 -228129 23502 356138 -27598 -73454 -453315 220571
17652G9187a09589A31873D1920Q4610j3393D0849m882N5461a30756A36785O4606
$$ 79187 -109589 131873 41920 126530 113137 40849 35967 91428 -130756 136785 201391
17641B01391a68713A29173O2883g8374j15126B41984g7239J1892j74400I0061
$$ 201391 -168713 129173 192056 -78374 -193500 241984 -77239 -65347 -239747 90061
17630c12637B40670e314m13303A2698b17195n1122a20551A40697R8065a08086
$$ -312637 240670 -5314 -418617 12698 -217195 -268317 -120551 140697 238762 -108086
17619a61338p2927A85680G2365b5130B94266J10078F1002b84298j7456C0010R4130
$$ -161338 -234265 185680 72365 -25130 294266 404344 61002 -284298 -301754 30010 124140
17608A24140J70159D0466k644K74551I2532M6123a5348B01909b21860E6876b81749
$$ 124140 294299 40466 37822 312373 92532 138655 -15348 201909 -221860 56876 -281749
17596C7757N5478J72499a35976R639B10009a25934B37013L0099a64925C38178
$$ 37757 93235 265734 -135976 -126337 210009 -125934 237013 267112 -164925 338178
17585h1217A36582n3166L2618a42339A55938J5844l1288a35547A21113b3204n1180
$$ -81217 136582 83416 116034 -142339 155938 171782 140494 -135547 121113 -23204 -74384
17574g4384I5296L8029J05343a68001B23300D726K20832D1702J24275i735B30086
$$ -74384 95296 133325 238668 -168001 223300 4726 225558 41702 165977 -9735 230086
17562A00028a69856B16692Q6479A32411L5060J175c2825C04517a2737B83864B6183
$$ 100028 -169856 216692 303171 132411 167471 168646 -32825 304517 -12737 283864 26183
17550b38450e1120l60884A26515C4758J66322o7854a52140G0917a17894E3038
$$ -238450 -51120 -412004 126515 34758 201080 133226 -152140 70917 -117894 53038
17539D6192M8851j3956K73570B1494a42963M3551A19989J10296a98474P8171A69243
$$ 46192 95043 81087 354657 21494 -142963 -99412 119989 230285 -198474 -120303 169243
17527A05549h1521D97888b67564h0704C56144b72643C67608B7501M544J1859J33090
$$ 105549 -81521 497888 -267564 -80704 356144 -272643 367608 27501 32045 43904 176994
17516A76994P8241D0217g0683B41443p7491a36599N3460j1980B59738e1657B81548
$$ 176994 255235 40217 -70683 241443 163952 -136599 -83139 -95119 259738 -51657 281548
17504A54637b15666A52375a52869n763a9370j4531D7258a9507C41201j32986d00038
$$ 154637 -215666 152375 -152869 -158632 -19370 -33901 47258 -19507 341201 208215 -400038
17492a85257A36829a38402N9495c2045C9818J69747m5825B8859a96727A44096
$$ -185257 136829 -138402 -78907 -32045 39818 209565 163740 28859 -196727 144096
17481A28597M5452a10581B34778n3424o8656a14387j29796E47297B27864f8462
$$ 128597 174049 -110581 234778 181354 112698 -114387 -244183 547297 227864 -68462
17470A42799c1024k48451d5483D2918A0849N5877c5151l6697r1457A53220E7883
$$ 142799 -31024 -279475 -45483 42918 10849 66726 -35151 -71848 -163305 153220 57883
17458D4296J02109n6108J22701F2718a87945C87180b2562o937D0229K21449a23914
$$ 44296 146405 90297 212998 62718 -187945 387180 -22562 -29499 40229 261678 -123914
17446b4653B04905J20424K8767o9510A787a60015C90843j68599C7841K19690N454
$$ -24653 204905 325329 354096 284586 1787 -160015 390843 222244 37841 257531 262985
17435B62985q3913J76376j42626J54830J25427A75743J20464A35802a49522A60993
$$ 262985 179072 355448 212822 367652 493079 175743 296207 135802 -149522 160993
17424B11870J75738A92348a05305H0878h2601D01025j93105H9320b33276F3475
$$ 211870 387608 192348 -105305 80878 -82601 401025 207920 89320 -233276 63475
17413C60907b04142A64660K39685j6687b19375C14165k8951K74306H8938K46289
$$ 360907 -204142 164660 404345 387658 -219375 314165 285214 559520 88938 335227
17403C35227A3744b2789A68549k7372n4926K78865l4177M0598m5455A08143P8714
$$ 335227 13744 -22789 168549 141177 86251 365116 330939 371537 326082 108143 186857
17392A86857b41856A03547e7899B45404K60935A70245c2121F939L60779j57943
$$ 186857 -241856 103547 -57899 245404 506339 170245 -32121 6939 367718 209775
17382B09775b73000A16257L3329L34729A83000o7886b443E0873a01933A30958
$$ 209775 -273000 116257 149586 484315 183000 115114 -2443 50873 -101933 130958
17371A19523a56448B33072b16740B68435A0104g8310F5170B6073J57669q1139
$$ 119523 -156448 233072 -216740 268435 10104 -78310 65170 26073 183742 102603
17361A02603D1376J79980F5710J9052k3094J64693J05224F3024J84202N5994j41514
$$ 102603 41376 221356 65710 84762 61668 226361 331585 63024 247226 303220 161706
17350A61706J41214B7456a93892A61379a21635j05486B54274J97574F8521h4888
$$ 161706 302920 27456 -193892 161379 -121635 -227121 254274 451848 68521 -84888
17339D20305I572M28004H1216J27217o2608K24131r5872P7486d8361j73224H9730
$$ 420305 9572 437576 81216 208433 145825 369956 274084 351570 -48361 -221585 89730
17327A09289m6057O4063K03546j55932R1442D0322c0330j26652A35681J02163
$$ 109289 63232 127295 330841 174909 266351 40322 -30330 -156982 135681 237844
17317B37844q2677l1269k9410J80570G2700L48772E3121M5193a56068C4180M2131
$$ 237844 155167 123898 94488 275058 72700 421472 53121 98314 -156068 34180 76311
17306G6311l0636J27552a60579A11006E588L1814L74844K8629A67209B5266h5426
$$ 76311 45675 173227 -160579 111006 5588 37402 412246 440875 167209 25266 -85426
17294F5600b3062p6686F7335O0996c2865l2443D56358A58782A6417L9290a2050
$$ 65600 -23062 -99748 67335 128331 -32865 -65308 456358 158782 16417 55707 -12050
17282A89675E3010J35127o9902J95047i2999B02848o1130A1850K35420k4753p0461
$$ 189675 53010 188137 118235 313282 -92999 202848 141718 11850 247270 222517 152056
17271A52056K28226A21245K01760A0838L38699j31290A2808P007K00004J65182
$$ 152056 380282 121245 323005 10838 349537 218247 12808 19815 219819 385001
17261C85001A77691J70312m8092H6624p240O3446Q5339a6603A5917i1955A70600
$$ 385001 177691 348003 299911 86624 79384 142830 228169 -16603 15917 -91955 170600
17249A44135b38263B20964H9277L78797a43919I8597K16963d4634E0615b9631
$$ 144135 -238263 220964 89277 468074 -143919 98597 315560 -44634 50615 -29631
17238a00912B87955j14936L3021l5976E9377K54552E0104M03255A79916K6196
$$ -100912 287955 173019 206040 170064 59377 313929 50104 453359 179916 206112
17228B06112D2486J42936R2102j08790J19450d0032B93322J48623a26846D6760
$$ 206112 42486 185422 277524 168734 288184 -40032 293322 441945 -126846 46760
17217B22185f2188B60584J13670j20158E1536L70188j56970q3589L04223j56586
$$ 222185 -62188 260584 374254 254096 51536 421724 264754 181165 485388 328802
17207C28802j46106j8150a38405A33753m9215J16295a31392a2076C83841g656
$$ 328802 182696 164546 -138405 133753 84538 200833 -131392 -12076 383841 -7656
17196C31733E0249J43925M69004A4123c4114g535B5657N9962J89674r5410K66602
$$ 331733 50249 194174 663178 14123 -34114 -7535 25657 85619 275293 179883 446485
17185D46485C2791K79598A69K59239J10907A42134K11729a81263i637C59425A01915
$$ 446485 32791 312389 169 259408 370315 142134 353863 -181263 -9637 359425 101915
17173C67292o3878L11512k48838k0795N4733g8013B88218A11992J91546J9221
$$ 367292 303414 614926 366088 345293 400026 -78013 288218 111992 303538 322759
17163C22759J86379B03069D3438K01346F0793a20190B66316L6319b3383g037B97178
$$ 322759 509138 203069 43438 244784 60793 -120190 266316 302635 -23383 -7037 297178
17151D16953A89333N2571j17832j4179J1904h6791D07009A54148K25111k0738
$$ 416953 189333 241904 124072 109893 121797 -86791 407009 154148 379259 358521
17141C58521H5270M3177Q9584Q9256I6444J28089L4567M848J3146o9185m0906
$$ 358521 85270 128447 218031 307287 96444 224533 259100 263948 277094 207909 167003
17130A67003K95118H5336K83501L784Q9270G8761L92611J36946k84037A15355
$$ 167003 462121 85336 368837 372621 461891 78761 471372 608318 324281 115355
17119E18489J82402l09316G2103L66528j29665O0112j44976D8430N1419O62960
$$ 518489 700891 391575 72103 438631 308966 369078 224102 48430 99849 762809
17109G62809d297E39525A34740K30763d4786C65682k9970M1879F4643L68681r3993
$$ 762809 -4297 539525 134740 365503 -44786 365682 335712 377591 64643 433324 339331
17098C39331j02376K45607k03362q8982J35840O7325K599R4349j60376j47219
$$ 339331 236955 482562 279200 190218 326058 393383 395982 490331 329955 182736
17088A82736J59630j52510J66399J49944N2313B50245J96289k8843q3893j7803
$$ 182736 342366 189856 356255 506199 558512 250245 446534 417691 333798 315995
17078C15995L7964L22386A51153K04197C5829J26999L4122O6597Q5493J33699
$$ 315995 353959 676345 151153 355350 35829 162828 196950 263547 349040 482739
17068D82739q2199J03164j65218K35076M777j32231P6524j50488J57393k1513
$$ 482739 400540 503704 338486 573562 578339 446108 522632 372144 529537 508024
17058E08024B4528Q8474L86356k31581L9856L0687J94690m5547N5862j15257O4824
$$ 508024 24528 113002 499358 267777 307633 338320 533010 487463 543325 428068 492892
17047D92892k4702j02507o519Q6103M1438J92899C09924j29496M13564B58291
$$ 492892 468190 365683 359164 445267 486705 679604 309924 180428 593992 258291
17036E44375A99976K27092R8650J2732J12367r1129A87459K65519K00789p2999
$$ 544375 199976 427068 525718 538450 650817 559688 187459 452978 653767 580768
17026E80768k2125k46610J17596J17599o9968K83263D3367P19982k57433n6250
$$ 580768 558643 312033 429629 547228 477260 760523 43367 763349 505916 449666
17016D49666K14982k49902j0002j2550J55242K28j26778P7182p8652L0346J92937
$$ 449666 664648 414746 404744 392194 547436 547664 420886 498068 419416 449762 642699
17005F42699j97303o8938K89891j78703M18226l60262P7860p7390N006J91721
$$ 642699 445396 376458 666349 487646 905872 545610 623470 546080 551086 742807
16995G42807j92214l2408P953n9986J30501K51382l96415o6867N13771l68972
$$ 742807 550593 518185 526138 466152 596653 848035 451620 384753 898524 529552
16985E29552j01006j1126J42280j02110j54420L86749l09724L09825l13836M99413
$$ 529552 428546 417420 559700 457590 303170 689919 380195 690020 376184 875597
16975H75597m0724o10o3847j60641J14186k36035P2464K02085O6257R3214j94618
$$ 875597 834873 834263 770416 609775 723961 487926 560390 762475 828732 921946 727328
16964G27328J72304j02225n20j07414N3617R7451k15003p1505L80211k8696j67210
$$ 727328 899632 797407 796887 689473 743090 840541 625538 554033 934244 905548 738338
16953G38338P998J51516j44138J68847l78603K49395M25016n24005L33372k18868
$$ 738338 746336 897852 753714 922561 543958 793353 1218369 694364 1027736 808868
16943H08868j58384L42715J1925J56578m5843L5324l12885J18724k470j63667
$$ 808868 650484 993199 1005124 1161702 1115859 1151183 838298 957022 954552 790885
16933G90885L39585j06605J07051k35632J27985J97065k94089J75648k09614M37439
$$ 790885 1130470 1023865 1130916 895284 1023269 1220334 926245 1101893 892279 1329718
16923A329718n15832K13307l17503n5656K25488N70493n17246K25696k98998K93347
$$ 1329718 813886 1027193 709690 654034 879522 1450015 932769 1158465 859467 1152814
16913A152814J08754k27473k41125L13328R0407P8756j07734r8880J03544k15221
$$ 1152814 1261568 1034095 792970 1106298 1196705 1275461 1167727 1068847 1172391 957170
16903I57170L31554m72980j09248Q25587l54169M7203K97625r7369j35979j00376
$$ 957170 1288724 815744 706496 1532083 1177914 1225117 1522742 1425373 1289394 1189018
16893A189018L82897j21477j50683K06860k64688P8917N20506j55128m6240J25446
$$ 1189018 1571915 1450438 1299755 1506615 1241927 1320844 1841350 1686222 1639982 1765428
16883A765428j85707k22331M30215k67552j19982K24681L04083m85383k22882
$$ 1765428 1579721 1357390 1787605 1520053 1400071 1624752 1928835 1443452 1220570
16874A220570N20220k09136k8097Q6392n9490K62673q681M7840p4835k05594M47462
$$ 1220570 1740790 1531654 1503557 1589949 1530459 1793132 1784451 1832291 1757456 1551862 1999324
16863A999324l32389K44806o7238j62625K10823p3176L41583l7744k36123J86714
$$ 1999324 1666935 1911741 1844503 1681878 1892701 1819525 2161108 2123364 1887241 2073955
16853B073955K9415L72618j85851k16808K30971j06265O1478J33697Q6140k45209
$$ 2073955 2103370 2475988 2290137 2073329 2304300 2198035 2259513 2393210 2479350 2234141
16843B234141M44343m88334Q2862J98456j05953K31904k21714M46735J30911l49311
$$ 2234141 2678484 2190150 2273012 2471468 2365515 2597419 2375705 2822440 2953351 2604040
16833B604040K65300l38529J01706L90382q7262N4298K30563l6954j11308J4190
$$ 2604040 2869340 2530811 2632517 3022899 2935637 2989935 3220498 3183544 3072236 3086426
16823C086426J19271J296j82122L94078o4800J12866M36418k46807o3772R7548
$$ 3086426 3205697 3206993 3024871 3418949 3354149 3467015 3903433 3656626 3592854 3690402
16813C690402K23147j01689K17816k12573J54457K02773K10484K06124m02397
$$ 3690402 3913549 3811860 4029676 3817103 3971560 4174333 4384817 4590941 4188544
16804D188544K58190J89153K43243L0827O2o1315J23708L3103M16365m638j10882
$$ 4188544 4446734 4635887 4879130 4909957 4910019 4848704 4972412 5005515 5421880 5417242 5306360
16793E306360K38706L0676M87759L7005j47861K99424K21178L8764J02268M30712
$$ 5306360 5545066 5575742 6063501 6100506 5952645 6252069 6473247 6512011 6614279 7044991
16783G044991q6750J49940M08984k6463M6378L93219K32279J93832L0312L16769
$$ 7044991 6958241 7108181 7517165 7490702 7537080 7930299 8162578 8356410 8386722 8703491
16773H703491K81686J77454j97621N76278M41691J95243M50612K05870N62582
$$ 8703491 8985177 9162631 8965010 9541288 9982979 10178222 10628834 10834704 11397286
16764A1397286J25200M04747K71867O03278J85629M47149N47219J93981Q11854
$$ 11397286 11522486 11927233 12199100 12802378 12988007 13435156 13982375 14176356 14988210
16755A4988210M15606N51134O58224M94690O28017P13726P83570R02241M91070
$$ 14988210 15403816 15954950 16613174 17107864 17735881 18449607 19233177 20135418 20626488
16746B0626488P24789J192688J201701Q59337R60553J227803J747622J221576
$$ 20626488 21351277 22543965 23745666 24605003 25565556 26793359 28540981 29762557
16738B9762557J257301J317327K199096J592964J997592K183430J977974K561328
$$ 29762557 31019858 32337185 34536281 36129245 38126837 40310267 42288241 44849569
16730D4849569K993483K623083L055631L498625L325732M248776L979613M548898
$$ 44849569 47843052 50466135 53521766 57020391 60346123 64594899 68574512 73123410
16722G3123410N119953N085858O146483O068937P116499P034480P975941Q575844
$$ 73123410 78243363 83329221 89475704 95544641 102661140 109695620 117671561 126247405
16714A26247405Q006893R228045R060934R330520R723425R255772Q615970Q230237
$$ 126247405 134254298 143482343 152543277 161873797 171597222 180852994 189468964 197699201
16706A97699201O624672O003351L946198K704412Q70536j214288l235710m868016
$$ 197699201 204323873 210327224 214273422 216977834 217848370 216634082 213398372 208530356
16698B08530356n965747p746514q271035r026018r514126r593008r831822r314398
$$ 208530356 202564609 194818095 186547060 177521042 168006916 158413908 148582086 139267688
16690A39267688r134230q336679q156719p854215p148799o607025o424272n362315
$$ 139267688 130133458 121796779 113640060 105785845 98637046 92030021 85605749 80243434
16682H0243434n729046m863738m412062m384757l969705l560210l396683k859530
$$ 80243434 74514388 69650650 65238588 60853831 56884126 53323916 49927233 47067703
16674D7067703k962729k531234k168729k020090k442711j611945j941699j543224
$$ 47067703 44104974 41573740 39405011 37384921 34942210 33330265 31388566 29845342
16666B9845342j474054j535710j180431j314867j158799r87782j055346r42161
$$ 29845342 28371288 26835578 25655147 24340280 23181481 22193699 21138353 20196192
16658B0196192p67772r72122q53174k69700q35277q30874p48518k20545n91859
$$ 20196192 19428420 18456298 17603124 17333424 16498147 15667273 14918755 14698210 14106351
16649A4106351o24323l27551l59130p33070m06555l84848J21159r61294j4208
$$ 14106351 13482028 13154477 12795347 12062277 11655722 11270874 11392033 10430739 10416531
16640A0416531p28277K7934p61428j10920o9990j34778p61880L4807k99326k00782
$$ 10416531 9688254 9716188 8954760 8843840 8773850 8639072 7877192 7911999 7612673 7411891
16630G411891j4632l48966l71281l3677l09681k14768j09698P8556k72212k03144
$$ 7411891 7397259 7048293 6677012 6643335 6333654 6118886 6009188 6087744 5815532 5612388
16620E612388J6521j79833k34586j0708j71427k99869o6563l30769K57653r9089
$$ 5612388 5628909 5449076 5214490 5203782 5032355 4732486 4665923 4335154 4592807 4493718
16610D493718l96026O7502j7905J0824k34607k329k81905k31992J36470l5731
$$ 4493718 4097692 4165194 4147289 4158113 3923506 3921177 3639272 3407280 3543750 3508019
16600C508019K5609l98777K32923l08317p7294K59442j68995k33368J92662l51208
$$ 3508019 3533628 3134851 3367774 3059457 2982163 3241605 3072610 2839242 3031904 2680696
16590B680696K34318l39025K48287k93933P3032m2645L28409m09111k81044J00239
$$ 2680696 2915014 2575989 2824276 2530343 2603375 2560730 2889139 2480028 2198984 2299223
16580B299223O2942r5634J03383j14651m04640K16479J97223j74954J02739l5387
$$ 2299223 2362165 2266531 2369914 2255263 1850623 2067102 2264325 2089371 2192110 2156723
16570B156723k52876Q075j16793K16602j52848j68063P2714k04138l5901K29990
$$ 2156723 1903847 1911922 1795129 2011731 1858883 1690820 1763534 1559396 1523495 1753485
16560A753485j92136L57549m59865M7282k87645L94323j89794k712K37640l51380
$$ 1753485 1561349 1918898 1459033 1506315 1218670 1612993 1423199 1420487 1658127 1306747
16550A306747K04384K7393P2086k42781l05459J75323l8200K22446l29299K85407
$$ 1306747 1511131 1538524 1610610 1367829 1062370 1237693 1199493 1421939 1092640 1378047
16540A378047l05038J05741J98033m99295M46104l61803R4459p3964j72257l199
$$ 1378047 1073009 1178750 1376783 877488 1323592 961789 1056248 982284 810027 806828
16530H06828K12707m9659O9379o4986j37137M42599k00809j95766J64103q8325
$$ 806828 1019535 969876 1039255 974269 837132 1279731 1078922 883156 1047259 958934
16520I58934j02937J64229l78831J51609J91847B82794M56445L17375k61365l5763
$$ 958934 855997 1020226 641395 793004 984851 282794 739239 1056614 795249 759486
16510G59486J2660J85606j80587J35454k69871J46891q7997k94510N70359j61426
$$ 759486 772146 957752 777165 912619 642748 789639 701642 407132 977491 816065
16500H16065l45132K11930j26682R3195Q0248j1241k37207j13869O40998C54633
$$ 816065 470933 682863 556181 649376 729624 718383 481176 367307 1008305 354633
16489H13465k12802K05974k54703K39737j98089R5686J06228r3871k71165J16471
$$ 813465 600663 806637 551934 791671 593582 689268 795496 701625 430460 546931
16479E46931J19039B45172M83885j38379B91171J32303M62493C70613K45748B82081
$$ 546931 665970 245172 729057 590678 291171 423474 885967 370613 616361 282081
16468F34546N7068C20112K2978L6400K25136N1242k06648p6404O1426J7983j82143
$$ 634546 691614 320112 343090 379490 604626 655868 449220 372816 434242 452225 270082
16457B70082J02704Q5406J02706k24482j54601R5184K02392B33774L7084K35486
$$ 270082 372786 458192 560898 336416 181815 276999 479391 233774 270858 506344
16447E06344k16958l0745D8337L72428j41659j32635L74415k32669A41402J19270
$$ 506344 289386 258641 48337 420765 279106 146471 520886 288217 141402 260672
16437B60672J43803L87715C70847q9199M0185A21883M75079Q2204k23598k02981
$$ 260672 404475 792190 370847 281648 321833 121883 596962 679166 455568 252587
16427B52587K72677N763F9695J68268k3668L02460k54710r2138Q395Q7538c238
$$ 252587 525264 531027 69695 237963 214295 516755 262045 169907 178302 265840 -3238
16415H9248M08401n3338O4294l6693k17060A24591d2178C57632I9045K38827J11231
$$ 89248 497649 444311 508605 471912 254852 124591 -42178 357632 99045 337872 449103
16404D49103M1687k11591P2755M56a15646A41444m2489a16627C29298J43250j29494
$$ 449103 490790 279199 351954 352410 -115646 141444 98955 -116627 329298 472548 343054
16393C43054j22861d1084A85771M63672A58437l3021O8512B8251L31242H2704
$$ 343054 220193 -41084 185771 649443 158437 125416 193928 28251 359493 82704
16382B80495A34888L7658D8299K81334F5731N5742L9489O48717B44039J69876
$$ 280495 134888 172546 48299 329633 65731 121473 160962 809679 244039 413915
16372D13915a80197D37546q3774q5223a1172j03617A8458J99936q7033L3874l1341
$$ 413915 -180197 437546 353772 268549 -11172 -114789 18458 218394 131361 165235 133894
16361A33894b2819l0262I6992R6231A3866K52510n8245Q7909j02991D7502L30772
$$ 133894 -22819 -53081 96992 193223 13866 266376 208131 296040 193049 47502 378274
16350C78274A28496n5439K79474j29117J4170c6523A29525a5640l19065B49845
$$ 378274 128496 73057 352531 223414 237584 -36523 129525 -15640 -334705 249845
16339A07949b2911A99765a62750F2662J74605c3430j59101R4923D92981A53210
$$ 107949 -22911 199765 -162750 62662 237267 -33430 -192531 -97608 492981 153210
16328a40499l2040B1642J00513a236m21846b9430j56393A4770M7419R0326k0607
$$ -140499 -172539 21642 122155 -1236 -423082 -29430 -185823 14770 62189 152515 131908
16317A31908o2132J06758n8778K45411c8358n7204l8215A87312K80740A46431
$$ 131908 69776 176534 117756 363167 -38358 -95562 -133777 187312 468052 146431
16306B00988b9962A72514J83875R4344A41877a69036A37840P9410j00636p963
$$ 200988 -29962 172514 356389 450733 141877 -169036 137840 217250 116614 108651
16296A08651a11172A01508P1900J84454k4117n1153d6257e236p642p7895F1650
$$ 108651 -111172 101508 173408 357862 333745 282592 -46257 -5236 -12878 -90773 61650
16284A84429d967A11624Q3924E7970c53554i6498k63454c3188B08126P7180d01366
$$ 184429 -4967 111624 195548 57970 -353554 -96498 -359952 -33188 208126 285306 -401366
16272F1617a65878p74A86884F1717J20647P1573j17537J37081J05372A66677b00372
$$ 61617 -165878 -166652 186884 61717 182364 253937 136400 273481 378853 166677 -200372
16260B4277c10437B84322f9522C999J91910o9295a67949f0960A45611B6552c1344
$$ 24277 -310437 284322 -69522 3999 195909 126614 -167949 -60960 145611 26552 -31344
16248A54261c39454B95354k2784j6130G5421a71700g239B17302c03469j3014A31018
$$ 154261 -339454 295354 272570 256440 75421 -171700 -7239 217302 -303469 -316483 131018
16236A49537f6928b0638A43357N3914b61921C9389m618i9637r2684A42803h839
$$ 149537 -66928 -20638 143357 197271 -261921 39389 34771 -99637 -192321 142803 -8839
16224B47589o4616O8910d91959h2335j24283i3060H1864R829a05192l48487H467
$$ 247589 182973 251883 -491959 -82335 -206618 -93060 81864 91693 -105192 -453679 8467
16212a03220B05531a19922b9200j53416Q8451C8711a2374C06803a49818l7963
$$ -103220 205531 -119922 -29200 -182616 -94165 38711 -12374 306803 -149818 -187781
16202a87781O5720A95441k1981B4446a26048j4120H6066k6561c39549D80762j45111
$$ -187781 -122061 195441 173460 24446 -126048 -140168 86066 59505 -339549 480762 335651
16191C35651F8577b31835J8089D625h0149D74945b3147k3863b254B36819d66400
$$ 335651 68577 -231835 -213746 4625 -80149 474945 -23147 -47010 -2254 236819 -466400
16179B21342L672L2315G6043a80008A88967j5028F6889a21378N2607c4018q1467
$$ 221342 225014 257329 76043 -180008 188967 173939 66889 -121378 -68771 -34018 -115485
16168a15485A43320g7621b4333j54452b2452j07654M2199q4631A2520K52607b30652
$$ -115485 143320 -77621 -24333 -178785 -22452 -130106 -87907 -172538 12520 265127 -230652
16156B04258e1204A27654c20874B11546B6408a40118n8510B002e429B12048a37014
$$ 204258 -51204 127654 -320874 211546 26408 -140118 -198628 2002 -5429 212048 -137014
16144A7451K78263H7732L0596n5471a65531E0451k1622b86912b9810A42754a30465
$$ 17451 295714 87732 118328 62857 -165531 50451 28829 -286912 -29810 142754 -130465
16132b74895D5399L6843a13865A93208L4382a20737E2590K3264f1257m0545F279
$$ -274895 45399 82242 -113865 193208 227590 -120737 52590 75854 -61257 -101802 6279
16120a16924A2643P1543i3601K267C2168c7411a1851j97509e2235l84076K7998
$$ -116924 12643 84186 -93601 -91334 32168 -37411 -11851 -209360 -52235 -436311 -408313
16109d08313e9976o2507a7597k55227R3920F8989a09821r7600A61588P6321a53905
$$ -408313 -59976 -122483 -17597 -272824 -178904 68989 -109821 -207421 161588 237909 -153905
16097c31724b7261k40309J16492D7506J45170i6277k29319A66893H892J23098
$$ -331724 -27261 -267570 -151078 47506 192676 -96277 -325596 166893 8892 131990
16087A31990b75712L5748B26141i3892I6285a68096B69663D1805b8835o3913E3586
$$ 131990 -275712 -239964 226141 -93892 96285 -168096 269663 41805 -28835 -92748 53586
16075g3275A64846b87634E8812a19422F0332k2730J15507c8674k35203b4169n9029
$$ -73275 164846 -287634 58812 -119422 60332 37602 153109 -38674 -273877 -24169 -83198
16064h3198A13883b41490B0169b31815a05075G2721b68200i1081j38293a01839
$$ -83198 113883 -241490 20169 -231815 -105075 72721 -268200 -91081 -229374 -101839
16053B68793d29430d6181j60470A70806H790a6757A57128j7076a1038j40263A77113
$$ 268793 -429430 -46181 -206651 170806 8790 -16757 157128 140052 -11038 -151301 177113
16041A31982b17687R5471C79127g5101A82996J36263j43378f7673m2699L8038
$$ 131982 -217687 -122216 379127 -75101 182996 319259 175881 -67673 -110372 -72334
16031g2334j61496A99624b38582G3961d4243B9197a43362j52959L5257j62032
$$ -72334 -233830 199624 -238582 73961 -44243 29197 -143362 -296321 -261064 -423096
16021d23096a10519A11107a18815K8262C7357a01293H95K629a71982n9033d1765
$$ -423096 -110519 111107 -118815 -90553 37357 -101293 895 3524 -171982 -231015 -41765
16009B85194E0609g4247j43048b8865B07365g9634l44a2241k75407a10821j84821
$$ 285194 50609 -74247 -217295 -28865 207365 -79634 -79978 -12241 -287648 -110821 -295642
15998b95642g1644F459J80972a32200j1361m5886D6598K70676i0931l52174a13145
$$ -295642 -71644 6459 187431 -132200 -143561 -189447 46598 317274 -90931 -443105 -113145
15986G0502a9243j78810N4312B30442n5852l6526b81637J24720e2481A13995b0946
$$ 70502 -19243 -198053 -143741 230442 174590 138064 -281637 -156917 -52481 113995 -20946
15974b01483K4713M4089c3269A83756F9352K19903I2368K58966j19444k1717L96220
$$ -201483 -176770 -132681 -33269 183756 69352 289255 92368 351334 231890 210173 606393
15963F06393C1493K0235b80874g1876j04915B06465b02413Q2577A72064d9921
$$ 606393 31493 51728 -280874 -71876 -176791 206465 -202413 -119836 172064 -49921
15952A6383O6068J3196b55195H0213k8243f8323I0742O3757d1552m2514I2546
$$ 16383 82451 95647 -255195 80213 51970 -68323 90742 154499 -41552 -84066 92546
15940B5567b38752A06502c00522A22423l6613A3424K9807N1121a00166K5269A96959
$$ 25567 -238752 106502 -300522 122423 85810 13424 43231 94352 -100166 -74897 196959
15928b8855k93379i2767K5521F4326q812a60205B8353b18315j73939a76352n6256
$$ -28855 -322234 -92767 -67246 64326 55514 -160205 28353 -218315 -392254 -176352 -232608
15917b32608e8000J3921n9987E6062b83827a00671l0935j71287A79625g3156k132
$$ -232608 -58000 -44079 -104066 56062 -283827 -100671 -131606 -302893 179625 -73156 -75288
15906g5288i84A30552i917A65946f8767A11336L5591c3507A62772d0062j96574
$$ -75288 -984 130552 -9917 165946 -68767 111336 146927 -33507 162772 -40062 -236636
15895b36636J00582E9341a29520A39464l3348m4207a86703A19067h1115K7520
$$ -236636 -136054 59341 -129520 139464 106116 61909 -186703 119067 -81115 -53595
15885e3595q0725m8922c8201k81610A89173a03958j05604G4027b74845J07510
$$ -53595 -134320 -183242 -38201 -319811 189173 -103958 -209562 74027 -274845 -167335
15875a67335A72747p2124a61490j0519c3167A34834e1343k78416L0441g7812F5254
$$ -167335 172747 100623 -161490 -172009 -33167 134834 -51343 -329759 -299318 -77812 65254
15863i6676k1789I0954c42102A86485C5463a43059B7306d90687G7152c13776a24813
$$ -96676 -118465 90954 -342102 186485 35463 -143059 27306 -490687 77152 -313776 -124813
15851A75955C337L9024A7930c3589j73439O1309j05798j05759A01812D8666c61879
$$ 175955 3337 42361 17930 -33589 -207028 -145719 -251517 -357276 101812 48666 -361879
15839d20455C1066b91459D7430R6014l7786N6322o5278R9260c5726m8002I496
$$ -420455 31066 -291459 47430 143444 105658 161980 96702 195962 -35726 -83728 9496
15827a50981p6079R0748k8490J105A23471Q8478B2004a02536C43092a60415L8162
$$ -150981 -227060 -136312 -164802 -163697 123471 211949 22004 -102536 343092 -160415 -122253
15816a22253M8789D1907J19828l5405a54583G8889A1918J04642c47138p172b2288
$$ -122253 -73464 41907 161735 126330 -154583 78889 11918 116560 -347138 -354310 -22288
15804A42987a897j3105k66143n1882C20866d0386n9080c5591D7616J95591a55355
$$ 142987 -1897 -15002 -281145 -333027 320866 -40386 -99466 -35591 47616 243207 -155355
15792a07804M2334A11912J4151a06178a0632j36953C498J56888F0389J97075b03090
$$ -107804 -65470 111912 126063 -106178 -10632 -147585 3498 160386 60389 257464 -203090
15780i1280j9821n4704J4020F4280e1082B32908b3919A38255F4862a6086j29763
$$ -91280 -111101 -165805 -151785 64280 -51082 232908 -23919 138255 64862 -16086 -145849
15769a45849q8173B24724i0960k24849g1480A22388a06955K4488H7310i5085p224
$$ -145849 -234022 224724 -90960 -315809 -71480 122388 -106955 -82467 87310 -95085 -102309
15758a02309d2169q8038o2179J6012c4352n3088j70483Q1114g3671a5615A13567
$$ -102309 -42169 -130207 -192386 -176374 -34352 -87440 -257923 -176809 -73671 -15615 113567
15746c2355l2745A9035a00998g045B22480l5288J4400a7925G732d9118A60565
$$ -32355 -65100 19035 -100998 -7045 222480 187192 201592 -17925 7732 -49118 160565
15734c67622a19482b4198K287A61599d18683e9911B01550a55454k5310K7271B335
$$ -367622 -119482 -24198 -21911 161599 -418683 -59911 201550 -155454 -180764 -153493 2335
15722b07676h3361j985B51750A7546J82824a9676A65671R8889d49k96937J34385
$$ -207676 -83361 -85346 251750 17546 200370 -19676 165671 264560 -449 -297386 -163001
15711a63001J2961e0238A10821b74655A7684i7860B13047P0676H8831b54990A86063
$$ -163001 -150040 -50238 110821 -274655 17684 -97860 213047 283723 88831 -254990 186063
15699f6104J3156j17441F3531d0914l29099f5043c2154E0386b72317P3914C8252
$$ -66104 -52948 -170389 63531 -40914 -370013 -65043 -32154 50386 -272317 -198403 38252
15687h6743o3907H512R3526i4974A39140B8281J59718a6567m43046a00711G1806
$$ -86743 -150650 8512 102038 -94974 139140 28281 187999 -16567 -459613 -100711 71806
15675E5993L15579m5162b43926D0744J49819d74029b16857f8739j66189B00576
$$ 55993 371572 326410 -243926 40744 190563 -474029 -216857 -68739 -234928 200576
15664D15014a99617i2544B06371N3142c65184c4391I45P016M3570J24459m7824
$$ 415014 -199617 -92544 206371 259513 -365184 -34391 945 7961 51531 175990 128166
15653A28166A3376K27832j05059m2928c57437O8920A0459a92114L2769B7661i6429
$$ 128166 13376 241208 136149 93221 -357437 -288517 10459 -192114 -159345 27661 -96429
15641g1134G1696J2684i0183A7318N1464k244a34663J0658A16723A3055d7100
$$ -71134 71696 84380 -90183 17318 68782 66538 -134663 -124005 116723 13055 -47100
15629a9507o8335j65771M3792F7755J3819c8115k53404A01085J90901A5275O8291
$$ -19507 -87842 -253613 -209821 67755 81574 -38115 -291519 101085 291986 15275 83566
15618H3566J87836l9676b7994n1138C81956G8081g6742k7816B12393H0152e4076
$$ 83566 271402 231726 -27994 -79132 381956 78081 -76742 -104558 212393 80152 -54076
15606B7286J27335h1067G6915h2648j6611k13969I5364d2598A74972E4727a67926
$$ 27286 154621 -81067 76915 -82648 -99259 -313228 95364 -42598 174972 54727 -167926
15594C111e4651A6610e49578a38912F1559K04136b1292k11827f720k80214J29359
$$ 3111 -54651 16610 -549578 -138912 61559 265695 -21292 -233119 -6720 -286934 -157575
15583a57575A29245b47677A47600i7222p7102c9582j06484D4152e2586k30964
$$ -157575 129245 -247677 147600 -97222 -174324 -39582 -146066 44152 -52586 -283550
15573b83550c2588E1902M65256i6223a4418B20833c46103R9371M8379m0013a09076
$$ -283550 -32588 51902 517158 -96223 -14418 220833 -346103 -246732 -198353 -238366 -109076
15561b2436o4180l35206G2961a72773K2789A50667C5292K0168P262g2749A21051
$$ -22436 -86616 -421822 72961 -172773 -149984 150667 35292 55460 62722 -72749 121051
15549a86693G7886M9840a10493I7121J53152b88A27508f4999A9015J73470n2955
$$ -186693 77886 127726 -110493 97121 250273 -288 127508 -64999 19015 192485 139530
15538A39530a5613q6060I1292L9115m0625B574J86305h9712n8965B49849F7159
$$ 139530 -15613 -101673 91292 130407 89782 2574 188879 -89712 -148677 249849 67159
15526A09175f3901j8379A96378c5095A32531a8315B10919a7074j13398A82190
$$ 109175 -63901 -82280 196378 -35095 132531 -18315 210919 -17074 -130472 182190
15515a73465C0137k217J29685F4458i5569F2632a56309r2728q8972b1227A48881
$$ -173465 30137 27920 157605 64458 -95569 62632 -156309 -249037 -338009 -21227 148881
15503C1307f8247r2763A35907E2243f0730C39115b84605h858A16130b31270k3451
$$ 31307 -68247 -161010 135907 52243 -60730 339115 -284605 -8858 116130 -231270 -254721
15492b54721C89945A89648J5914q8144a10394j86128A97815g0914b9307B36917
$$ -254721 389945 189648 205562 117418 -110394 -296522 197815 -70914 -29307 236917
15481a308l8322k7979H8306B6455b45048J3398G9116l0636a08410K3243j33818
$$ -1308 -39630 -67609 88306 26455 -245048 -231650 79116 48480 -108410 -85167 -218985
15470b18985N5902A20920m9926a4644l9793j84085C7117c5925D9061M8657O2076
$$ -218985 -163083 120920 70994 -14644 -54437 -238522 37117 -35925 49061 97718 159794
15459A59794A0298K15272a24726j87021C8925K24073l8892E7457c4408B35691
$$ 159794 10298 225570 -124726 -311747 38925 262998 224106 57457 -34408 235691
15448h8747k29092d5555I992d3133J74l1769l05426F606L6756K73610o7578a15549
$$ -88747 -317839 -45555 9992 -43133 -42959 -74728 -380154 6606 43362 316972 249394 -115549
15435a9651A84428b17855D2317c62382A22931a20813D6161J9999a79371A89254
$$ -19651 184428 -217855 42317 -362382 122931 -120813 46161 66160 -179371 189254
15424a2630A9634P2351l1685J9956I17J31772R5718a55116F7577a13359E0621
$$ -12630 19634 91985 60300 80256 917 132689 228407 -155116 67577 -113359 50621
15412H5728J30907a47803P0208H9655j9775h5736r3362k51383a83326k4707N8001
$$ 85728 216635 -147803 -77595 89655 69880 -85736 -179098 -430481 -183326 -208033 -150032
15401a50032A89330I045Q2483H687R668a35575B10052a37360A30283m8162M08849
$$ -150032 189330 9045 91528 8687 18355 -135575 210052 -137360 130283 82121 490970
15390D90970A60063l4876O8327C0463Q324N8980a90654O8847A07436b7993B06005
$$ 490970 160063 125187 193514 30463 38787 97767 -190654 -121807 107436 -27993 206005
15378A50904m1977C1463a25242A25559B5533L1126J28545a44787e8155j48580
$$ 150904 108927 31463 -125242 125559 25533 56659 185204 -144787 -58155 -206735
15368b06735A96537b18502a06671j09493l9771L3005d739I1451b2379k0633A74233
$$ -206735 196537 -218502 -106671 -216164 -255935 -222930 -4739 91451 -22379 -43012 174233
15356b80617Q4764j22020R3447h4831b8585r4366J0553E5634o041a94736J6357
$$ -280617 -195853 -317873 -224426 -84831 -28585 -122951 -112398 55634 49593 -194736 -178379
15345a78379n6521A31830D4184K18659b34042D105a18431D8057c0660F0494J16215
$$ -178379 -234900 131830 44184 262843 -234042 4105 -118431 48057 -30660 60494 176709
15334A76709l1229J11066a38623A32835a19717n0383B6135a52968B20416q7238
$$ 176709 145480 256546 -138623 132835 -119717 -170100 26135 -152968 220416 133178
15324A33178f2224d889B26326a14381C9748A4671c4204l3987o0637A04066f0753
$$ 133178 -62224 -4889 226326 -114381 39748 14671 -34204 -68191 -128828 104066 -60753
15312a2522A015R6344a09462j83719b9947A88922i2707A74525p5531a19522R483
$$ -12522 1015 97359 -109462 -293181 -29947 188922 -92707 174525 98994 -119522 -110039
15301a10039C84402r3364b02650C58084e4634C00050K0643f6626A61801k6720
$$ -110039 384402 291038 -202650 358084 -54634 300050 320693 -66626 161801 135081
15291A35081k5984e8994A06713M63996B6361K8364o050a72383b8163k97904C85084
$$ 135081 109097 -58994 106713 570709 26361 54725 48675 -172383 -28163 -326067 385084
15279e0544B97055o7255e154A22029e8481B84956c6152a4175C500J55146K3754
$$ -50544 297055 229800 -5154 122029 -58481 284956 -36152 -14175 3500 158646 182400
15268A82400b47772A57799b30402q7415H6396m463a17741A06863J78256h732j10375
$$ 182400 -247772 157799 -230402 -317817 86396 81933 -117741 106863 285119 -8732 -119107
15257a19107e8104A16752g6675E8953a8121B30513d305A48791a8131o0688A14630
$$ -119107 -58104 116752 -76675 58953 -18121 230513 -4305 148791 -18131 -78819 114630
15245G2500M3879J39707A023c64116A14533e3036A60994P0485r7540K27418n5169
$$ 72500 116379 256086 1023 -364116 114533 -53036 160994 231479 133939 361357 306188
15234C06188M05956O75899q8250m7109O1613n68551C47894r7513F9172g8224C0917
$$ 306188 712144 1388043 1299793 1252684 1314297 745746 347894 250381 69172 -78224 30917
15222A53189b88991E1275J20434C4918b23971o100C14789N9596a74247D18200
$$ 153189 -288991 51275 171709 34918 -223971 -230071 314789 374385 -174247 418200
15211d2622A19718b21720B88499b5455A4455J48613E276J64592i2217A8527O2351
$$ -42622 119718 -221720 288499 -25455 14455 163068 5276 169868 -92217 18527 80878
15200H0878K16362j00360l6734g1211a8689B22233j03720L3648K0695a3917A22075
$$ 80878 297240 196880 160146 -71211 -18689 222233 118513 152161 172856 -13917 122075
15188b03228A27592I064a10482i195j92615A22621A4594J03559L4454l2306J079
$$ -203228 127592 9064 -110482 -9195 -201810 122621 14594 118153 152607 120301 121380
15177A21380R0282a00758D41888j78166A07368J25542b95826B27053J0889H697
$$ 121380 211662 -100758 441888 263722 107368 232910 -295826 227053 237942 8697
15166I7153n621L9939C9611M6187f5086A46640J35875c02758E1295a20493b9376
$$ 97153 91532 131471 39611 85798 -65086 146640 282515 -302758 51295 -120493 -29376
15154B7087J60912m7215G338L71871a28619B28475c50187C65714A52183G640O9340
$$ 27087 187999 140784 7338 379209 -128619 228475 -350187 365714 152183 7640 76980
15143G6980e1027A54933J93928H1002K2251e5896H5281b4629B54880N4226a92202
$$ 76980 -51027 154933 348861 81002 103253 -55896 85281 -24629 254880 309106 -192202
15131H1780j8048b48247A98379j9170a08506B48863C9225L13199j04090a34636
$$ 81780 63732 -248247 198379 179209 -108506 248863 39225 352424 248334 -134636
15120A50896M2026e6949C51692r9352A10911m6566J26059J26391f4778c1752k1572
$$ 150896 192922 -56949 351692 252340 110911 64345 190404 316795 -64778 -31752 -53324
15109e3324B45912R4255D6213J43370j5240a69195I1685a77653A21530b11687
$$ -53324 245912 340167 46213 189583 174343 -169195 91685 -177653 121530 -211687
15098C03585q8546L6090J4840r2124c73568A19170N0308h8592L5978m077o4864
$$ 303585 215039 251129 265969 173845 -373568 119170 169478 -88592 -52614 -56691 -121555
15087a21555d6936A93884J8996c4566j2341j7472j04268A09860K91148j92244
$$ -121555 -46936 193884 212880 -34566 -46907 -64379 -168647 109860 401008 208764
15077B08764L4926o4116L00242j37550g4634r3331B75030F6162b35506B05104
$$ 208764 243690 179574 479816 342266 -74634 -167965 275030 66162 -235506 205104
15066b36739f1096B75935E1834K59668K0246n7639b5600H8251B0982b003A349
$$ -236739 -61096 275935 51834 311502 331748 274109 -25600 88251 20982 -2003 1349
15054h5792B42500B9470J22402R6555j07042j9754N1766a95686A14816C3150a58796
$$ -85792 242500 29470 151872 248427 141385 121631 173397 -195686 114816 33150 -158796
15042B94243a15068M1415a515B42844C4553K22625a81340B14998d5019q9344A34502
$$ 294243 -115068 -73653 -1515 242844 34553 257178 -181340 214998 -45019 -134363 134502
15030A81795M021B1102a08111N06n9314B12388r8851c2164A48831J10579J4268
$$ 181795 185816 21102 -108111 -107605 -166919 212388 113537 -32164 148831 259410 273678
15019B73678M671m0502b34426A85184b8714q1460A05753D5658M82651B46361P1231
$$ 273678 278349 237847 -234426 185184 -28714 -110174 105753 45658 528309 246361 317592
15008C17592A21428M12619k36925A15825J68221A4976O3636K85687r1489j29304
$$ 317592 121428 534047 297122 115825 284046 14976 78612 364299 272810 143506
14998A43506J5469J5738K36528A36914A6841R752D298L97820N9798A95075k8022
$$ 143506 158975 174713 411241 136914 16841 26593 4298 402118 461916 195075 167053
14987A67053N2801N2847b2822B64972N8599l3688k830I7408n32J33264K165A7454
$$ 167053 219854 272701 -22822 264972 323571 289883 287053 97408 96876 230140 232305 17454
14974D04423j97789J99101A05031m7241M39565A87904O1868p1980J22096O8997
$$ 404423 206634 405735 105031 57790 497355 187904 249772 177792 299888 368885
14964C68885j29946J7144q7773Q0060K27878A04644K19315o1211k6167Q0295r2290
$$ 368885 238939 256083 168310 248370 476248 104644 323959 262748 236581 316876 224586
14953B24586n5415J45472j38450m1184K1060N3440E4517K12133A15323H637M45983
$$ 224586 169171 314643 176193 135009 156069 209509 54517 266650 115323 8637 454620
14942D54620b2140C64098L43200k53541n3988j62961G3888K95418B8514M22424
$$ 454620 -22140 364098 707298 453757 399769 236808 73888 369306 28514 450938
14932D50938j84448K2869j20592J10087B302K19434r0252K38664l4818j1306J05816
$$ 450938 266490 289359 168767 278854 2302 221736 131484 370148 335330 324024 429840
14921D29840B07729G7904a6826A01553P4697j4869D784J66945R2913K55285I5035
$$ 429840 207729 77904 -16826 101553 176250 161381 4784 171729 264642 519927 95035
14909E51635o7206j93070a57331d0656D93290J52669H4652J60196J8587J86259
$$ 551635 484429 291359 -157331 -40656 493290 645959 84652 244848 263435 449694
14899D49694j1435D8294J28140P6816J47991q3824n3153L5221o5812o7114L88007
$$ 449694 438259 48294 176434 253250 401241 317417 264264 299485 233673 166559 554566
14888E54566k52453n5854Q4248A63875J34681o6116O7323r5850J39621r2546k2965
$$ 554566 302113 246259 330507 163875 298556 232440 299763 203913 343534 250988 228023
14877B28023J36297b5427j4984a8308A75187L45477A89421J19272N9327j0251
$$ 228023 364320 -25427 -40411 -18308 175187 520664 189421 308693 368020 357769
14867C57769j09040M5799k5023l0063l9123L4138K39697m4182K51485l27122j5550
$$ 357769 248729 294528 269505 239442 200319 234457 474154 429972 681457 354335 338785
14856C38785J20656j56367O6419A47509M61055A37255J33586K80193o7019K57688
$$ 338785 459441 303074 369493 147509 608564 137255 270841 551034 484015 741703
14846G41703l67111J6537J73839B47512J06307J20838L4305J09145B28036L7954
$$ 741703 374592 391129 564968 247512 353819 474657 508962 618107 228036 265990
14836B65990J15289A87726N67802k65308B00568L87447k64787R5496p0984F4188
$$ 265990 381279 187726 755528 490220 200568 588015 323228 418724 347740 64188
14825D26661j88055L70926A72864M49255J00494B83410K3865j9353k8756Q6181
$$ 426661 238606 609532 172864 622119 722613 283410 307275 287922 259166 345347
14815C45347P0927F4417L89354j38235K51214L2315B25444L79153N9768d057E80668
$$ 345347 416274 64417 453771 315536 566750 599065 225444 604597 664365 -4057 580668
14803F43480k28153L08512l0000k53029j40763K7288J47824L2932n3378q6154
$$ 643480 415327 723839 693839 440810 300047 327335 475159 508091 454713 368559
14793C68559J0380J66638K39420j17219J2438l0100k08122j0758P4805n6183O7733
$$ 368559 378939 545577 784997 667778 680216 650116 441994 431236 506041 449858 517591
14782E17591B52108K75908J5113k51654K73866j0309o2818Q5786B07443J58473
$$ 517591 252108 528016 543129 291475 565341 555032 492214 578000 207443 365916
14772C65916L3502J73238K8197J822k10395K19897P1179k11784L87813k09423
$$ 365916 399418 572656 600853 602675 392280 612177 683356 471572 859385 649962
14762F49962q2851j87716M6445M5107J95579O2114r434R512l09426L22425j88955
$$ 649962 567111 379395 425840 470947 666526 728640 719206 728718 419292 741717 552762
14751E52762L576J61844j47328j19957R0992Q1787K10825C58490L65694r4453
$$ 552762 556338 718182 570854 450897 541889 623676 834501 358490 724184 629731
14741F29731k3000Q2341j91145J31008M938l01Q6202K5599k35188J66288M58202
$$ 629731 606731 689072 497927 628935 633873 633572 719774 745373 510185 676473 1134675
14730A134675D51361J18449J70045l10087M023R8275J1735K31105j96712m0156
$$ 1134675 451361 569810 739855 429768 433791 532066 543801 774906 578194 538038
14720E38038J70158m6490M26107m05993j82789J07146m3734J36838l9985q0411
$$ 538038 708196 661706 1087813 681820 499031 606177 562443 699281 659296 578885
14710E78885M11913m39761K12842J49209p121l59286J06259L2590N2831j81935
$$ 578885 990798 551037 763879 913088 905967 546681 652940 685530 738361 556426
14700E56426L18111l12396J16116J90520j39584k35063L14718K65098k95760J47464
$$ 556426 874537 562141 678257 868777 729193 494130 808848 1073946 778186 925650
14690I25650j12203l92R2757k39705M90180m26179K2712m0325M72799m93770L18816
$$ 925650 813447 813055 905812 666107 1156287 730108 752820 712495 1185294 691524 1010340
14679A010340j64562p2655J40413j34107K43129j33792R2054j86781j06007J38465
$$ 1010340 845778 773123 913536 779429 1022558 888766 980820 794039 688032 826497
14669H26497l039O9495m0864J72835m4312j6103o2109o6634J66358O5800q9221
$$ 826497 823458 892953 852089 1024924 980612 964509 902400 835766 1002124 1067924 978703
14658I78703o5826N6607P1920k69072J36384K54353k87980O1167K05508j08796
$$ 978703 912877 969484 1041404 772332 908716 1163069 875089 936256 1141764 1032968
14648A032968j29587q8593J86829k13349M07057l54429K23673K85867m53304K95892
$$ 1032968 903381 814788 1001617 788268 1195325 840896 1064569 1350436 897132 1193024
14638A193024O2918k47917k36960K11183J79106R354j60959j88556M98766J73930
$$ 1193024 1255942 1008025 771065 982248 1161354 1170708 1009749 821193 1319959 1493889
14628A493889n67270r0143K25034j3434J22261k0377m0667p5794k74272J10167
$$ 1493889 926619 836476 1061510 1048076 1170337 1149960 1109293 1033499 759227 869394
14618H69394N63736l61051K56717j1598n3404n4849L90405l95115L25871r7023
$$ 869394 1433130 1072079 1328796 1317198 1263794 1208945 1599350 1204235 1530106 1433083
14608A433083J13083j10868K01031j91924l20690L58745k05756k19532J18270
$$ 1433083 1546166 1435298 1636329 1444405 1123715 1482460 1276704 1057172 1175442
14599A175442J10937j53399L10588k79553N02427m17035K9747J22638O5894K67753
$$ 1175442 1286379 1132980 1443568 1164015 1666442 1249407 1279154 1401792 1467686 1735439
14589A735439m00533j39943N27863k63107J15432j24084L1160j10208j26679L63768
$$ 1735439 1334906 1194963 1722826 1459719 1575151 1451067 1482227 1372019 1245340 1609108
14579A609108Q810k20426K23331O8137K67215k2977l60368K4117J94779J21298
$$ 1609108 1617918 1397492 1620823 1688960 1956175 1933198 1572830 1596947 1791726 1913024
14569A913024j48012J20320N2407l915l34673K16802J35216p1283k97564M94360
$$ 1913024 1765012 1885332 1937739 1933824 1599151 1815953 1951169 1879886 1582322 2076682
14559B076682N2737j9882m2450p1072K84636k00828j06516m9979K8341M31875
$$ 2076682 2129419 2109537 2067087 1996015 2280651 2079823 1973307 1923328 1951669 2383544
14549B383544O8639k5443k22245O10427j19625K40086k72529L0935M30392L21292
$$ 2383544 2452183 2426740 2204495 2814922 2695297 2935383 2662854 2693789 3124181 3445473
14539C445473K44630Q06301N65405Q11235J390038K488195L698922O368864J0762756
$$ 3445473 3690103 4496404 5061809 5873044 7263082 9751277 13450199 19819063 30581819
14530C0581819L33569j2238199o994303m467555k316275j315007m56060j79990
$$ 30581819 30915388 18677189 11682886 7215331 4899056 3584049 3127989 2947999
14522B947999m63371k22028O4502J1635k07247J90371l50952J98064J39561j52066
$$ 2947999 2484628 2262600 2327102 2338737 2131490 2321861 1970909 2168973 2308534 2156468
14512B156468K81210l25442J91278j79493n8392J59552o1524K61247L21243l93233
$$ 2156468 2437678 2112236 2303514 2124021 2065629 2225181 2163657 2424904 2746147 2352914
14502B352914j40793M66415l03415L29895l8838k18103M6502J85151J36173j96974
$$ 2352914 2212121 2678536 2375121 2705016 2666178 2448075 2494577 2679728 2815901 2618927
14492B618927n5114J25995L11936l7094p6943M36881l79457j16276j10825L65956
$$ 2618927 2563813 2689808 3001744 2964650 2887707 3324588 2945131 2828855 2718030 3083986
14482C083986J38844k64485q010K53979K22209l09968J97266j92103K82492q9169
$$ 3083986 3222830 2958345 2950335 3204314 3426523 3116555 3313821 3121718 3404210 3315041
14472C315041j69760L46367p4934q7172o3835K90790j08477K93127j20196J65313
$$ 3315041 3145281 3491648 3416714 3329542 3265707 3556497 3448020 3741147 3620951 3786264
14462C786264J3154j08597K4674K35652J71831J06963l13115q5512J04427j49865
$$ 3786264 3799418 3690821 3715495 3951147 4122978 4229941 3916826 3831314 3935741 3785876
14452C785876P01637n56036K41366j64336M20795J07354k52801N01956k27561
$$ 3785876 4487513 3931477 4172843 4008507 4429302 4536656 4283855 4785811 4558250
14443D558250K7435J62114K91251j96194j52546L19739K77259j5256q7475l62828
$$ 4558250 4585685 4747799 5039050 4842856 4690310 5010049 5287308 5272052 5184577 4821749
14433D821749M23447m6065K79158k89406L46949k84276J89925J25167L00850k15668
$$ 4821749 5245196 5199131 5478289 5188883 5535832 5251556 5441481 5566648 5867498 5651830
14423E651830J47430Q6142R7832r8048J53117J21092M91171k32319J09180J0848
$$ 5651830 5799260 5885402 5983234 5885186 6038303 6159395 6650566 6418247 6527427 6538275
14413F538275J50385L92255j63818j71675K31950j03118o8276O32432J57904j08481
$$ 6538275 6688660 7080915 6917097 6745422 6977372 6874254 6805978 7438410 7596314 7487833
14403G487833j04947M64966Q31O8669K94374m64846M56383J85643O3837J76082
$$ 7487833 7382886 7847852 7848683 7917352 8211726 7746880 8203263 8388906 8452743 8628825
14393H628825O9645J19733J87627r9911M19742M31230l13396J6302N51568N7448
$$ 8628825 8698470 8818203 9005830 8905919 9325661 9756891 9443495 9459797 10011365 10068813
14383A0068813J71149K92092j63936L45247J03688K14681J98118L00402J78894
$$ 10068813 10239962 10532054 10368118 10713365 10817053 11031734 11229852 11530254 11709148
14374A1709148k61237Q91908k501N6466R6432L90855M34934J08216M8501N74303
$$ 11709148 11447911 12339819 12337318 12393784 12490216 12881071 13316005 13424221 13472722 14047025
14364A4047025j52344O6135M89870K61724M79072K81682J71070L37585N10643
$$ 14047025 13894681 13960816 14450686 14712410 15191482 15473164 15644234 15981819 16492462
14355A6492462N01169J43004j42791R05643K3994K89931O49591K87225M48251
$$ 16492462 16993631 17136635 16993844 17899487 17923481 18213412 18863003 19150228 19598479
14346A9598479O90146M20718K93776O40435L92495M06757M66264L94413P76146
$$ 19598479 20288625 20709343 21003119 21643554 22036049 22442806 22909070 23303483 24079629
14337B4079629Q04477J79091Q87301J056471L41999O47183M49584N22748J258295
$$ 24079629 24884106 25063197 25950498 27006969 27348968 27996151 28445735 28968483 30226778
14328C0226778P22123O41025Q73947J060609R89812J173915Q81058M34608J468176
$$ 30226778 30948901 31589926 32463873 33524482 34514294 35688209 36569267 37003875 38472051
14319C8472051R69744J325927J161608J217576J628793J331826J185966J722770
$$ 38472051 39441795 40767722 41929330 43146906 44775699 46107525 47293491 49016261
14311D9016261J980588J189033J877997K171295J920823J864889K245631K530805
$$ 49016261 50996849 52185882 54063879 56235174 58155997 60020886 62266517 64797322
14303F4797322K476353K551074K626606K767999L015976L232246L313800L844865
$$ 64797322 67273675 69824749 72451355 75219354 78235330 81467576 84781376 88626241
14295H8626241L303378M148089M233475M433681M719068M988579N325734N878567
$$ 88626241 91929619 96077708 100311183 104744864 109463932 114452511 119778245 125656812
14287A25656812O086569O269906P043861P382429P961448P938535Q792593R524708
$$ 125656812 131743381 138013287 145057148 152439577 160401025 168339560 177132153 186656861
14279A86656861R780121J0719680J0968027J1473405J2487720J2908584J3616848
$$ 186656861 196436982 207156662 218124689 229598094 242085814 254994398 268611246
14272B68611246J3899116J4579892J4191787J5092202J4813961J5181344J4048792
$$ 268611246 282510362 297090254 311282041 326374243 341188204 356369548 370418340
14265C70418340J3543167J2653943J1671055J0970705J0415962R746877O469982
$$ 370418340 383961507 396615450 408286505 419257210 429673172 439420049 445890031
14258D45890031L070124K645359L063099K801223r47914p771311m767745n101981
$$ 445890031 448960155 451605514 454668613 457469836 456521922 448750611 443982866 438880885
14250D38880885j0515982j1539143j2385239j3425542j3494255j4465244j3992106
$$ 438880885 428364903 416825760 404440521 391014979 377520724 363055480 349063374
14243C49063374j4615833j4053712j4221973j4185029j2438497j3151566j2395791
$$ 349063374 334447541 320393829 306171856 291986827 279548330 266396764 254000973
14236B54000973j2261332j1658568j2175710j1554046j0910644j0282262r310154
$$ 254000973 241739641 230081073 217905363 206351317 195440673 185158411 175848257
14229A75848257q889822q413875p974703o892774p250389o385081n481918n785815
$$ 175848257 166958435 158544560 150569857 143677083 136426694 130041613 124559695 118773880
14221A18773880n664042m821372m792080m404488m036569l969802l509808l881935
$$ 118773880 113109838 108288466 103496386 99091898 95055329 91085527 87575719 83693784
14213H3693784l227145l132711l032479k693917k801653k363721k541989j961226
$$ 83693784 80466639 77333928 74301449 71607532 68805879 66442158 63900169 61938943
14205F1938943k263983k179697j850478k033936k051003j184228j670623j231332
$$ 61938943 59674960 57495263 55644785 53610849 51559846 50375618 48704995 47473663
14197D7473663j697456j573515j448040j036497j157291q40627j198308j218652
$$ 47473663 45776207 44202692 42754652 41718155 40560864 39720237 38521929 37303277
14189C7303277j078766j202341j136359o67125l60575j233815p60571o96140r59242
$$ 37303277 36224511 35022170 33885811 33218686 32858111 31624296 30863725 30167585 29208343
14180B9208343j080937l12020q47914n49853r82326m70786m77054o99927k27603
$$ 29208343 28127406 27815386 26967472 26417619 25435293 24964507 24487453 23787526 23559923
14171B3559923o47603p32275l24695m52358o31793m47595k89702o22233k83622
$$ 23559923 22912320 22180045 21855350 21402992 20771199 20323604 20033902 19411669 19128047
14162A9128047l58918m24213p7777o71964q07655J64100p538l15277n79247n79498
$$ 19128047 18769129 18344916 18267139 17595175 16787520 16951620 16944082 16628805 16049558 15470060
14152A5470060j90470R0875n42034j48721m62979J0212j55406p50540j3971l88187
$$ 15470060 15279590 15370465 14828431 14679710 14216731 14226943 14071537 13320997 13307026 12918839
14142A2918839k79519K3117m24107k91918j9279k12230k44463j53037j70388O7285
$$ 12918839 12639320 12662437 12238330 11946412 11927133 11714903 11470440 11317403 11147015 11214300
14132A1214300p08503M10860o26755l32613J32701l45361J73913j77363k28061
$$ 11214300 10505797 10916657 10289902 9957289 10089990 9744629 9918542 9741179 9513118
14123I513118o1938J16993k66166k01925m25826J43022j52509k62873J99714m68175
$$ 9513118 9451180 9568173 9302007 9100082 8674256 8817278 8664769 8401896 8601610 8133435
14113H133435j88654K80560L11l1107n30176M0675m25183J93495k20175o8506
$$ 8133435 7944781 8225341 8225652 8194545 7664369 7705044 7279861 7473356 7253181 7184675
14103G184675j82309o5224Q5452l56828p8513M4045k09038j28330P648k1444j50887
$$ 7184675 7002366 6937142 7022594 6665766 6587253 6631298 6422260 6293930 6301578 6280134 6129247
14092F129247K43495l14278p8459j19915K233k75873N7120N4917l40018K82075
$$ 6129247 6372742 6058464 5980005 5860090 5862323 5586450 5643570 5698487 5358469 5640544
14082E640544k55682p7049P0583q8695n1649k83506j954K59113n33293K82354
$$ 5640544 5384862 5307813 5378396 5289701 5238052 4954546 4952592 5211705 4678412 4960766
14072D960766R2145j30979j38011n35915K99712P796Q8718J45574j42590k31125
$$ 4960766 5052911 4921932 4783921 4248006 4547718 4555514 4644232 4789806 4647216 4416091
14062D416091k90988J31509J25496o7871k4525l17092J14690J20991j26380J18169
$$ 4416091 4125103 4256612 4382108 4314237 4289712 3972620 4087310 4208301 4081921 4200090
14052D200090l23514K44560m15030J38442J54097k37877J71530n3853m9896J54196
$$ 4200090 3876576 4121136 3706106 3844548 3998645 3760768 3932298 3878445 3828549 3982745
14042C982745o00791K35725J8852j28633k8010L6698j47699p560o9200L9764k21909
$$ 3982745 3381954 3617679 3636531 3507898 3479888 3516586 3368887 3361327 3292127 3331891 3109982
14031C109982k17953j77498O35961L907j47086k37883P7332j83901J76373r2920
$$ 3109982 2892029 2714531 3350492 3354399 3207313 2969430 3046762 2862861 3039234 2946314
14021B946314l7374k80830K50494O3526q8250k30j13796q4830o249J87446l00467
$$ 2946314 2908940 2628110 2878604 2942130 2853880 2853650 2739854 2655024 2648775 2836221 2535754
14010B535754p2403J40275m52503N84254l63017J1047p8316J58773m12772M14271
$$ 2535754 2463351 2603626 2151123 2735377 2372360 2383407 2305091 2463864 2051092 2465363
14000B465363J68469k61526m9653J4564r8153P1816p4247K83802l31397k53234
$$ 2465363 2633832 2372306 2322653 2337217 2239064 2310880 2236633 2520435 2189038 1935804
13990A935804j50368M35322m5700k51986L22967l03123J54956j11660R5887J80198
$$ 1935804 1785436 2220758 2175058 1923072 2246039 1942916 2097872 1986212 2082099 2262297
13980B262297j32752M10296m9713N00172O29676N49298K543411K789313N470087
$$ 2262297 2129545 2539841 2490128 2990300 3619976 4169274 6712685 9501998 14972085
13971A4972085J1419283M873099j0344211p535673m466046j775878j680562j008290
$$ 14972085 26391368 31264467 20920256 13384583 8918537 7142659 5462097 4453807
13963D453807o44862K1917n96414m56901M45015m13754J6140q6371k0084j24543
$$ 4453807 3808945 3830862 3234448 2777547 3222562 2808808 2824948 2738577 2718493 2593950
13953B593950j87495k76808J64606k52929m5155j7589j9251N3407n4162m4930
$$ 2593950 2406455 2129647 2294253 2041324 1996169 1978580 1959329 2012736 1958574 1913644
13943A913644k3130K33782m06278L45875l38558K36051k46064K531K45206k95370
$$ 1913644 1890514 2124296 1718018 2063893 1725335 1961386 1715322 1717853 1963059 1667689
13933A667689J16876L4524l26177M31509m37073j94347O24155l83216J97991j13429
$$ 1667689 1784565 1819089 1492912 1924421 1487348 1293001 1917156 1533940 1731931 1618502
13923A618502J83201m62956M13052j65507J84285j51452J6614O5766P0629o89850
$$ 1618502 1801703 1338747 1751799 1586292 1770577 1619125 1635739 1701505 1772134 1082284
13913A082284N04191J26245k45391M30339m58240k74761J24633J38779k21423
$$ 1082284 1586475 1712720 1467329 1897668 1439428 1164667 1289300 1428079 1206656
13904A206656R5291j63749M70626l02851M075O3465K38284q7968M8715m64281
$$ 1206656 1301947 1138198 1608824 1305973 1310048 1373513 1611797 1523829 1572544 1108263
13894A108263N24650n62116J95380K73309k34350j17335r0856j34813N47363k76282
$$ 1108263 1632913 1070797 1266177 1539486 1305136 1187801 1096945 962132 1509495 1233213
13884A233213M3894R9474l07442O080J51041k56084L93726k6567k25166j26947
$$ 1233213 1277107 1376581 1069139 1075219 1226260 970176 1363902 1337335 1112169 985222
13874I85222K18296q4332K42117n01587J20128L07183q4287m0559k7162o2400
$$ 985222 1203518 1119186 1361303 859716 979844 1287027 1202740 1162181 1135019 1072619
13864A072619K01711o7314L648j47236l84596L75120P3406l65232O03278J4427
$$ 1072619 1274330 1207016 1210664 1063428 678832 1053952 1127358 762126 1365404 1379831
13854A379831m40392k01570O9648L72157l7650Q7998l35928m3523N0558K85535
$$ 1379831 939439 737869 807517 1179674 1142024 1230022 894094 850571 901129 1186664
13844A186664Q8310q9702j11399j59953Q3208n0503L03256k54281j44709q5256
$$ 1186664 1274974 1185272 1073873 913920 997128 946625 1249881 995600 850891 765635
13834G65635K84546k26343q8875r3962J84562D02613N08730l83494q901O0288
$$ 765635 1050181 823838 734963 641001 825563 402613 911343 527849 518948 579236
13824E79236M4809J85197j00700K32563R8751p9365k46076K96344r0502j0101
$$ 579236 624045 809242 708542 941105 1039856 960491 714415 1010759 920257 910156
13814I10156p42j05415J85731L14014k25092p3945k00440o3617l940L09560m83486
$$ 910156 909414 803999 989730 1303744 1078652 1004707 804267 740650 736710 1046270 562784
13803E62784L24366j41341M765m5980r009K06536j00819p4595j15803M73561m54474
$$ 562784 887150 745809 750574 704594 695585 902121 801302 726707 610904 1084465 629991
13792F29991m1825P2309K19236j43118P2212o4758J01986l54153j77273N48125
$$ 629991 588166 660475 879711 736593 808805 744047 846033 491880 314607 862732
13782H62732K37469n18073Q9266B62997M11818j84703J30377K14814J04528l50936
$$ 862732 1100201 582128 671394 262997 674815 490112 620489 835303 939831 588895
13772E88895m846J92228K1060k43153M9659n5168M22460m72280J20609N9389R8824
$$ 588895 584049 776277 797337 554184 603843 548675 971135 498855 619464 678853 777677
13761G77677k38447M17757l68953L07620k70044L14175m68675K13246j54222K07572
$$ 777677 539230 956987 588034 895654 625610 939785 471110 684356 530134 737706
13751G37706j55310Q1300L94567m34325B77442M32953k55342L49856l51948J73642
$$ 737706 582396 663696 1058263 623938 277442 710395 455053 804909 452961 626603
13741F26603K5992m9475B55018L50010q3705J51177L1749P8856C64416K15825
$$ 626603 652595 603120 255018 605028 521323 672500 704249 783105 364416 580241
13731E80241J03733J26307B36826P15093m05385J95161R8167A26663M41977j24596
$$ 580241 683974 810281 236826 951919 546534 741695 839862 126663 568640 444044
13721D44044R3880k21467J98872j39871K75166K9445o7402K9802O4171k46266
$$ 444044 537924 316457 515329 375458 650624 680069 612667 642469 706640 460374
13711D60374K54524k88700J80832B73232J50979J2811K48341j4506B82897K98567
$$ 460374 714898 426198 607030 273232 424211 437022 685363 670857 282897 581464
13701E81464K02652k06805k16763L46011k00371J5902A71138k6601M67648o2887
$$ 581464 784116 577311 360548 706559 506188 522090 171138 144537 612185 549298
13691E49298k62240K61681J33037B08802L63194B49479N81836C23768M9719o439
$$ 549298 287058 548739 681776 208802 571996 249479 831315 323768 373487 367048
13681C67048j12233K48764N1176J05381l25585R2544A98644J27144K94823k70594
$$ 367048 254815 503579 554755 660136 334551 427095 198644 325788 620611 350017
13671C50017J86369k50694j09069J76829J87432m4480K3002B55812j09202m824
$$ 350017 536386 285692 176623 353452 540884 496404 519406 255812 146610 141786
13661A41786K18964j2164N5039j66937L45123r0818K12807k99291L80861k60166
$$ 141786 360750 348586 403625 236688 581811 490993 703800 404509 785370 525204
13651E25204B16274a5664B64091K40002A01306J04675J66194J26168o0139j889
$$ 525204 216274 -15664 264091 504093 101306 205981 372175 498343 438204 436315
13641D36315P0844A62077L90622N8649J26314l42372A07303L72384m1578n5891
$$ 436315 507159 162077 552699 611348 737662 395290 107303 479687 438109 382218
13631C82218J03859p1611J16454k04697K82075j96277L8946q7222J28691j77561
$$ 382218 486077 414466 530920 326223 608298 412021 450967 363745 492436 314875
13621C14875M3519J49877j8860j1558j86194m3626K31160A25885K37013Q4994
$$ 314875 358394 508271 489411 477853 291659 248033 479193 125885 362898 447892
13611D47892P5753B32969n031M3730o7169J97609L86204A40875M51333k38478
$$ 447892 523645 232969 227938 271668 204499 402108 788312 140875 592208 353730
13601C53730A60191Q696L51042j49723k1323q7507L22K09452l5055q7558A6403
$$ 353730 160191 168887 519929 370206 348883 261376 261698 471150 436095 348537 16403
13589B63435K21481k1722A15246J03692L12824k48604O7452E0056M01931j61147
$$ 263435 484916 463194 115246 218938 531762 283158 350610 50056 451987 290840
13579B90840j22008J95009M172J33951k34692l9711J17842j6964j4355A18342
$$ 290840 168832 363841 368013 501964 267272 227561 345403 328439 314084 118342
13568A15504j059J90059j3012A13012J36025P6783H3389N2318J85615k4400m7333
$$ 115504 114445 304504 291492 113012 249037 325820 83389 135707 321322 296922 249589
13557B49589O6244K48972j84211K64607j87381A12677N8054L44921B30173J58325
$$ 249589 315833 564805 380594 645201 457820 112677 170731 515652 230173 388498
13547C88498K7004A96444L30432l846I5640L87260K09769l08027J44006A97624
$$ 388498 415502 196444 526876 523030 95640 482900 692669 384642 528648 197624
13536D19968C744L92777K5788A02974o636M91429A99909O5427Q1743o0008E5938
$$ 419968 3744 396521 422309 102974 96338 587767 199909 265336 347079 287071 55938
13524E79902B44395l2674J83579K0830j72178L24834B46589Q9356A26190K84506
$$ 579902 244395 211721 395300 416130 243952 568786 246589 335945 126190 410696
13514D10696K5829j60117j04683O7801j1886E9354k3722J00766K48774A72045
$$ 410696 436525 276408 171725 239526 227640 59354 35632 136398 385172 172045
13503B01971K29495n1855n3326G1828K6161P6015H5510K6573J99859j16698M5953
$$ 201971 431466 379611 326285 71828 97989 174004 85510 112083 311942 195244 241197
13492B41197A20458J02830J70094J55105A65268b39343D61346o2895A27041g5589
$$ 241197 120458 223288 393382 548487 165268 -239343 461346 398451 127041 -75589
13481E34419k39460Q958e6108E7147K62919A56362R1154M7546d285A56150G6208
$$ 534419 294959 303917 -56108 57147 320066 156362 247516 295062 -4285 156150 76208
13469G0368K3107N2595L93558k29455R1465A75204J00987C7201L6230O0267P2063
$$ 70368 93475 146070 539628 310173 401638 175204 276191 37201 73431 133698 205761
13458B05761I8414J97961I7250J96551J3956H7694K28087j06452J06537j10377
$$ 205761 98414 296375 97250 293801 307757 87694 315781 209329 315866 205489
13448B05489J36989K62392F5635N6630r347b6774A18906p804P6449O3063J53495
$$ 205489 342478 604870 65635 122265 112918 -26774 118906 111102 187551 250614 404109
13437D04109g680A83579E8900P8969A4974J62281K57858j29778m5459J2270a36321
$$ 404109 -7680 183579 58900 137869 14974 177255 435113 305335 259876 272146 -136321
13425A33476n3882L79794e6729C92132j8738j00821J00258A24324L22011B19385
$$ 133476 79594 459388 -56729 392132 373394 272573 372831 124324 446335 219385
13414B64910m0090q1920P428K4192Q8159O8485d3626B43286A08602J33805o3385
$$ 264910 224820 142900 150328 174520 262679 331164 -43626 243286 108602 242407 179022
13403A79022J41779b19309C27359K04016B46371P5414B8295K42022L15515B72416
$$ 179022 320801 -219309 327359 531375 246371 321785 28295 270317 585832 272416
13392B83454B1438R4142J50119D0345Q1647G949M61838R3895a92487C09384j16153
$$ 283454 21438 115580 265699 40345 121992 7949 469787 563682 -192487 309384 193231
13381A93231J26058j01861l5231m943K20859J15695e7004A82319J38238i8182
$$ 193231 319289 217428 182197 177254 398113 513808 -57004 182319 320557 -98182
13370B31021A9740c6358A22726O8456E4897Q0769A2988J88458l6714J5269O6457
$$ 231021 19740 -36358 122726 191182 54897 135666 12988 201446 164732 180001 246458
13359B46458a08217I77M27456B2321K24619a12080H5976J07212h5220H3158a2909
$$ 246458 -108217 977 428433 22321 246940 -112080 85976 193188 -85220 83158 -12909
13347A22351J60665j9341a07216M0550E2624K53485J9369j48524d6386B94994
$$ 122351 283016 263675 -107216 -66666 52624 306109 325478 176954 -46386 294994
13336I6659M6641K14568p7096H0319M42361M6746A95316J06209o1573q9454b8442
$$ 96659 143300 357868 280772 80319 522680 569426 195316 301525 239952 150498 -28442
13324I640K34960H5815a83785C36152j39738L0773K59195A562J57540c987C33211
$$ 9640 244600 85815 -183785 336152 196414 227187 486382 1562 159102 -3987 333211
13312f4688A05445d49B25633G4467Q4896b0526j10829D66160A7786L13177I3373
$$ -64688 105445 -449 225633 74467 159363 -20526 -131355 466160 17786 330963 93373
13300E8304j0188J46552Q4622o112M7041j24317B1239J47599p1123a29909A20505
$$ 58304 48116 194668 279290 273178 320219 195902 21239 168838 97715 -129909 120505
13288B74515d9165B02844J49457j56587N6817d7278I1338J70413P5211a86880
$$ 274515 -49165 202844 352301 195714 252531 -47278 91338 261751 336962 -186880
13277i4189b5776H265K38714K09993k26801A13419l1776J46124D065K07362p0983
$$ -94189 -25776 8265 246979 456972 230171 113419 81643 227767 4065 211427 140444
13266A40444N36532H6853M6910a23274b10D2431Q5253J96973j42059L9056j572
$$ 140444 676976 86853 133763 -123274 -210 42431 127684 324657 182598 221654 220082
13255B20082K4206q6151B7461L87084B7867b53598A53673e712A82502F6893f5235
$$ 220082 244288 158137 27461 414545 27867 -253598 153673 -5712 182502 66893 -65235
13243H0268i7B7503M00006R0534I8384a14854A59886b7317o474F9472a04442j24195
$$ 80268 -97 27503 427509 518043 98384 -114854 159886 -27317 -33791 69472 -104442 -228637
13231b28637g4710I2791d5304G7956J47773n6013K6217m0977o8445j8478a50243
$$ -228637 -74710 92791 -45304 77956 225729 169716 195933 154956 86511 68033 -150243
13219a185I8266J92430d993C0588K03594m7269k5412f3897A34782a341H9737J64466
$$ -1185 98266 290696 -4993 30588 234182 186913 161501 -63897 134782 -1341 89737 254203
13207B54203n3860A1907K09044b105A93831r5857J98048A46298b8284m7445B5716
$$ 254203 200343 11907 220951 -2105 193831 97974 296022 146298 -28284 -75729 25716
13195H6357L16905h4054I8117J82849K11771A0496J45891N6256l2046P9831E4213
$$ 86357 403262 -84054 98117 280966 492737 10496 156387 212643 180597 260428 54213
13183B96995F6741c9011J0150D8936L64220A15660b37808C81038j74981l807q7080
$$ 296995 66741 -39011 -28861 48936 413156 115660 -237808 381038 206057 202250 115170
13172A15170f1814o3957B62922b36715A49298o2884l539l3210a34405M6638G3003
$$ 115170 -61814 -125771 262922 -236715 149298 86414 82875 49665 -134405 -87767 73003
13160c8360A05040J23900j10334k2795C8958J45655q4557e8144B10031N865B2904
$$ -38360 105040 228940 118606 95811 38958 184613 100056 -58144 210031 215896 22904
13148A54291C2120b7225m7148A74201a38728j93958C03172h1473a1816A68216
$$ 154291 32120 -27225 -74373 174201 -138728 -332686 303172 -81473 -11816 168216
13137B45979i9980L7579F0007K13196f8321A82337q3088b32838B77728a58257
$$ 245979 -99980 -62401 60007 273203 -68321 182337 99249 -232838 277728 -158257
13126A12695n4304N6117a12341C29683a70647E36884j57345c17703C7074h5831
$$ 112695 58391 114508 -112341 329683 -170647 536884 379539 -317703 37074 -85831
13115A48061b47509g5272A56460P6b0933C09623A08427J09986K05080c2555A66487
$$ 148061 -247509 -75272 156460 156536 -20933 309623 108427 218413 423493 -32555 166487
13103a56215D4405a95035B13425E5890J09547a08273j7614B45698b8645I5282
$$ -156215 44405 -195035 213425 55890 165437 -108273 -125887 245698 -28645 95282
13092B29170F8412J1493d2827q9180l5371A5358M97408A31674k452B5741K64429
$$ 229170 68412 79905 -42827 -132007 -167378 15358 512766 131674 129222 25741 290170
13081B90170q5228r1351g4976A13183O57a48425G6430a56745A77343N3685F1867
$$ 290170 204942 113591 -74976 113183 113840 -148425 76430 -156745 177343 231028 61867
13069A13339b27415A48743m2789L2537C6939L27254G4628C4467Q6387K42143j63239
$$ 113339 -227415 148743 105954 138491 36939 364193 74628 34467 120854 362997 199758
13058A99758b11367B8186K78927I7842C0430f2507A34338J15919P0286r5675e4755
$$ 199758 -211367 28186 307113 97842 30430 -62507 134338 250257 320543 224868 -54755
13046D9670B3175l425K3372a43416A05830L0383b81023C6946J86556J98839a75343
$$ 49670 23175 19750 43122 -143416 105830 136213 -281023 36946 223502 422341 -175343
13034A398J23023d8022D6523J89957C8988a68930d3582B92415b91939a21717F4957
$$ 1398 124421 -48022 46523 236480 38988 -168930 -43582 292415 -291939 -121717 64957
13022A806L27341A53086c90810A15143a06872K8446D73743a83906B03051P0409
$$ 1806 329147 153086 -390810 115143 -106872 -78426 473743 -183906 203051 273460
13012B73460J4497l6216n3327e9099A09298P1103E3226a9251B77507q5872m34
$$ 273460 287957 251741 198414 -59099 109298 180401 53226 -19251 277507 191635 191201
13001A91201O382p4580k1029J89850G9275L19336A92079C1009a36974E85890A47411
$$ 191201 197583 123003 101974 291824 79275 398611 192079 31009 -136974 585890 147411
12989B63427G2948J93464a38783n627C48175A23540g1499G4825c85576A61766
$$ 263427 72948 266412 -138783 -144410 348175 123540 -71499 74825 -385576 161766
12978A27176R5728a9290A44425h318C19050a11277j70046b9767A87630K85162
$$ 127176 222904 -19290 144425 -8318 319050 -111277 -281323 -29767 187630 472792
12968D72792b2136l6366K4300B22861g4069A60396f5390K4457A5841d9730A42314
$$ 472792 -22136 -58502 -34202 222861 -74069 160396 -65390 -40933 15841 -49730 142314
12956c23861J01743A6892d1740r439B80978A4590c28207g3376q028l13058f857
$$ -323861 -222118 16892 -41740 -51179 280978 14590 -328207 -73376 -81404 -394462 -6857
12944A50221b8119B92143C9824c53475I3370C9467a84982A66352i6636C7264J4571
$$ 150221 -28119 292143 39824 -353475 93370 39467 -184982 166352 -96636 37264 51835
12933E1835G30L95590a56038A67802J28374e6036i852j55000B10178c12939G8113
$$ 51835 730 396320 -156038 167802 296176 -56036 -9852 -164852 210178 -312939 78113
12921b91522J15036d9843H4213J51951E2494J19268i6966I2561a20288A07926
$$ -291522 -176486 -49843 84213 236164 52494 171762 -96966 92561 -120288 107926
12910a41425A03412n053F059a9471k91147e2938B04780c9244C55845c0970j68073
$$ -141425 103412 98359 6059 -19471 -310618 -52938 204780 -39244 355845 -30970 -199043
12899a99043C71024i5688A30372f8781D4718L101a80305c4327q6931B46788a03669
$$ -199043 371024 -95688 130372 -68781 44718 47819 -180305 -34327 -121258 246788 -103669
12887G4139J42781b42301j9554r7962a31141K284L5409j43303d5452k30976g9789
$$ 74139 216920 -242301 -261855 -359817 -131141 -128857 -93448 -236751 -45452 -276428 -79789
12875b18757a03138B80366A13321c18412b4417B72878l9294G2500a42278d4385
$$ -218757 -103138 280366 113321 -318412 -24417 272878 233584 72500 -142278 -44385
12864a13761B43474O6479A37181d192n4584J6670q258j01684A41694M0640m2389
$$ -113761 243474 309953 137181 -4192 -58776 -42106 -50364 -152048 141694 182334 139945
12853A39945f3515j19491K1525O8640o5251b4905j680j67745g1060B14440Q7681
$$ 139945 -63515 -183006 -161481 -92841 -158092 -24905 -26585 -194330 -71060 214440 302121
12842C02121j49186j2541b24100i7949D2942J00393B1200a6831j74387B2825b1484
$$ 302121 152935 140394 -224100 -97949 42942 143335 21200 -16831 -191218 22825 -21484
12830D1976J75228k7806a01320A03508a74356A02309g2042n9541b4993C00019
$$ 41976 217204 189398 -101320 103508 -174356 102309 -72042 -131583 -24993 300019
12819B10761F5759c3724r6643k18180N0005a16857k40088C7566K20552a68008
$$ 210761 65759 -33724 -130367 -348547 -298542 -116857 -356945 37566 258118 -168008
12808I4905g5040F9919L2159O6629K5011i9750B07249A4573b06998H761J47826
$$ 94905 -75040 69919 102078 168707 193718 -99750 207249 14573 -206998 8761 156587
12797A56587g1176m6749C0147d4452C17956I2191B0461c15526A55343m5089h4238
$$ 156587 -71176 -117925 30147 -44452 317956 92191 20461 -315526 155343 110254 -84238
12785A95274P7612c3478o11143a25851G4848a157j77822A41051C2519a34759I9954
$$ 195274 272886 -33478 -644621 -125851 74848 -1157 -178979 141051 32519 -134759 99954
12773g0937B00621a56637M1468A0476a98847A33148n4239J01177b80899G5785
$$ -70937 200621 -156637 -115169 10476 -198847 133148 78909 180086 -280899 75785
12762a84862b704B3778f9254L1474B68615a06103B38019j06161a60988l5938E6929
$$ -184862 -2704 23778 -69254 -37780 268615 -106103 238019 131858 -160988 -196926 56929
12750D12765A73324c62652A93419J16782K7788n050c2449D38202a64780j7313
$$ 412765 173324 -362652 193419 310201 337989 332939 -32449 438202 -164780 -182093
12740a82093F6598J01502e50493E73923A78452a02618K6012l4664H9762b5798
$$ -182093 66598 168100 -550493 573923 178452 -102618 -76606 -111270 89762 -25798
12729A99565E5941J0172a87083F8296a24772j31225F8607h0307a1631l0983C73931
$$ 199565 55941 66113 -187083 68296 -124772 -255997 68607 -80307 -11631 -42614 373931
12717A35868J13359A01133K16235i0723j98556A60020G3598A6923e4446D1808
$$ 135868 249227 101133 317368 -90723 -289279 160020 73598 16923 -54446 41808
12706b62677A1577J29176J21580a97633Q5639d0476H313c39750I0302M8888d3010
$$ -262677 11577 140753 262333 -197633 -111994 -40476 8313 -339750 90302 139190 -43010
12694a08254i976C43868p7435M8105C4926M48423p6516A81785q2752P6148l2990
$$ -108254 -9976 343868 266433 314538 34926 483349 406833 181785 99033 175181 142191
12683A42191E4620L0973L5228J90642o5306e179A91892P2132J46793H223L83555
$$ 142191 54620 85593 120821 311463 246157 -5179 191892 264024 410817 8223 391778
12672C91778E3870b371l698H5693h7545b5196p760D19683A2835Q5210P8551O4333
$$ 391778 53870 -2371 -6069 85693 -87545 -25196 -32956 419683 12835 98045 176596 240929
12660B40929n4225g721H9583J83479r1462q705i9827n5031B72902c1496A87487
$$ 240929 186704 -7721 89583 273062 181600 172895 -99827 -154858 272902 -31496 187487
12648g4143H9710a7209D9085E706R031M5773c02597B7376N0128L549A260h5423
$$ -74143 89710 -17209 49085 5706 14737 60510 -302597 27376 77504 81053 1260 -85423
12635I3616K0813K9646b97596B17741D428b45558i8024c6378p8999C8333K87f3976
$$ 93616 114429 144075 -297596 217741 4428 -245558 -98024 -36378 -115377 38333 38620 -63976
12622h751G4204K11327f4100A24707j7431b51101B661Q4198a504j26502A90257
$$ -8751 74204 285531 -64100 124707 107276 -251101 2661 86859 -1504 -128006 190257
12610D6402b09000D9185f947A34055b34925B12069c8083E12944F6608R276a461
$$ 46402 -209000 49185 -6947 134055 -234925 212069 -38083 512944 66608 75884 -1461
12598C73347I2948a05180A4873J77333c7442A15712C965J6674d213j80204B87137
$$ 373347 92948 -105180 14873 192206 -37442 115712 3965 20639 -4213 -184417 287137
12586A42955J33221R4464j13653E7095O833L15189A66425K19335f3924E15388
$$ 142955 276176 370640 256987 57095 63928 379117 166425 385760 -63924 515388
12575D00328a27568A34376J80150G0969a47024o5099F3088b28520J09723A90241
$$ 400328 -127568 134376 314526 70969 -147024 -212123 63088 -228520 -118797 190241
12564b13643F9328R6696i579k3730B21229f362j76461N7905K8003A54561d4416
$$ -213643 69328 166024 -9579 -33309 221229 -6362 -182823 -124918 -96915 154561 -44416
12552A45241d41512a23356A06678B5447K67396b7254j33246I4517a91044g3945
$$ 145241 -441512 -123356 106678 25447 292843 -27254 -160500 94517 -191044 -73945
12541a88148Q5070j09633E5757A2405g8983j63328R7592A72524C4976b588j7518
$$ -188148 -103078 -212711 55757 12405 -78983 -242311 -144719 172524 34976 -2588 -20106
12530b0106l7787l21B28426p4210m7260h6700B97439F9363b91088J39873k13408
$$ -20106 -57893 -58214 228426 154216 106956 -86700 297439 69363 -291088 -151215 -364623
12519c64623A3030a19934n9388j1634j2536M1890B88502g4841o185G3328J39547
$$ -364623 13030 -119934 -179322 -190956 -203492 -161602 288502 -74841 -81026 73328 212875
12508B12875b24425A20047N5437g1221A55458E2582J55568H182a22604B01069
$$ 212875 -224425 120047 175484 -71221 155458 52582 208150 8182 -122604 201069
12497E0452J30350J41356a11141C1474L6373g7587B27715m6664a4414j86186I0027
$$ 50452 180802 322158 -111141 31474 67847 -77587 227715 181051 -14414 -200600 90027
12485I7293R1266p07D0351d5312a8088B60037g2579J3682j13663B13553G7708
$$ 97293 188559 187852 40351 -45312 -18088 260037 -72579 -58897 -172560 213553 77708
12473A43047b26689A27141b27802B20396d7319B15776J9326a15444A0415a05768
$$ 143047 -226689 127141 -227802 220396 -47319 215776 235102 -115444 10415 -105768
12462G8960J85546a9389l20204a39823M8018b5823C25325B7286R3578a73527c6233
$$ 78960 264506 -19389 -339593 -139823 -91805 -25823 325325 27286 120864 -173527 -36233
12450E2384O5809C1344a5993B40045m9322k0009E5702i8400K8517L4296A12444
$$ 52384 118193 31344 -15993 240045 190723 170714 55702 -98400 -69883 -35587 112444
12438c5186F9458j7194b43642G1244g2315B1587J04688D5239C028J05462J73598
$$ -35186 69458 52264 -243642 71244 -72315 21587 126275 45239 3028 108490 282088
12427B82088b61626B69848C9435P4466e03388a39066A7144K6213b4754A44334
$$ 282088 -261626 269848 39435 113901 -503388 -139066 17144 43357 -24754 144334
12416d57908a94027h2751l2179d3298C7618K20473O9582j52390m3325a73705P3725
$$ -457908 -194027 -82751 -114930 -43298 37618 258091 327673 175283 131958 -173705 -99980
12405i9980M5753B0696d4168j28117d3390j73899A81014H756N1980a76445E226
$$ -99980 -54227 20696 -44168 -172285 -43390 -217289 181014 8756 60736 -176445 5226
12393H1619a87242q4745C1758g1555k79058A69573i4717c6448j09360a1572D9698
$$ 81619 -187242 -271987 31758 -71555 -350613 169573 -94717 -36448 -145808 -11572 49698
12381a56914B6529a1792I268N3781k9480K10344c19971B51016O9008H7708f03
$$ -156914 26529 -11792 9268 63049 33569 243913 -319971 251016 320024 87708 -603
12369F6105J4092C6938b72695a404A27289d7630C02271B3541K43688A8618J53191
$$ 66105 80197 36938 -272695 -1404 127289 -47630 302271 23541 267229 18618 171809
12358A71809J17289f4125a6565E9811a41190C6334R0918d7079H5626a52554E1502
$$ 171809 289098 -64125 -16565 59811 -141190 36334 127252 -47079 85626 -152554 51502
12346a30993G4581b78984p4249b7037m19221g2306q4206k7935k21331E6513h9499
$$ -130993 74581 -278984 -353233 -27037 -446258 -72306 -156512 -184447 -405778 56513 -89499
12334A9946b82735C31221b98878c637A12475J06573J34033A37247D8757B0574
$$ 19946 -282735 331221 -298878 -3637 112475 219048 353081 137247 48757 20574
12323a96293h3700L7446j8966K0313C0932L23969A9497J53988n3472n2550L32506
$$ -196293 -83700 -46254 -65220 -44907 30932 354901 19497 173485 120013 67463 399969
12312C99969b11947C424a648A8086K66966a14901k5001C3717N3060O1294G1467
$$ 399969 -211947 3424 -1648 18086 285052 -114901 -139902 33717 86777 148071 71467
12300a25326N4217F7482P3779N9171K11155b97526g6273p0467K0025F75J97922
$$ -125326 -71109 67482 141261 200432 411587 -297526 -76273 -146740 -126715 675 198597
12289A98597I1442L52514d1115J9369D0238b0345o6107B84796c32589d1649a0135
$$ 198597 91442 443956 -41115 -21746 40238 -20345 -86452 284796 -332589 -41649 -10135
12277A09780b67111J13913B68404p7849n9949a26644A14120b0561C5709h9528
$$ 109780 -267111 -153198 268404 190555 130606 -126644 114120 -20561 35709 -89528
12266b03433A81573E4875M2646b0688A14017M04255D9511e1793C71626a69661
$$ -203433 181573 54875 97521 -20688 114017 518272 49511 -51793 371626 -169661
12255A12074b24679B81707k1686A05232i2128B78081a67608A20638J00585j2896
$$ 112074 -224679 281707 260021 105232 -92128 278081 -167608 120638 221223 208327
12245B08327a36179A92107p8621Q6591C2164J54771a37519B44082j01543M3354
$$ 208327 -136179 192107 113486 200077 32164 186935 -137519 244082 142539 185893
12235A85893L932H2092K01666j7858a32034B36340A2448B339e6653F6816K51100
$$ 185893 189825 82092 283758 265900 -132034 236340 12448 2339 -56653 66816 317916
12224C17916D0735O4953a69805A12636L66791a55628C861J62537q3163M044b00411
$$ 317916 40735 105688 -169805 112636 479427 -155628 3861 166398 83235 87279 -200411
12212F4965K61357j9865l4330j07499L79892k49224m7790b5287G4712J09141a38963
$$ 64965 326322 306457 272127 164628 544520 295296 247506 -25287 74712 183853 -138963
12200G5486I427a21647L5478c366r2503B47712P4742B0545b6617B03815E3618
$$ 75486 9427 -121647 -86169 -3366 -95869 247712 322454 20545 -26617 203815 53618
12188B96126F7769M6297a94892a1100k10647A20155K50898k1197C5130a54854
$$ 296126 67769 114066 -194892 -11100 -221747 120155 371053 349856 35130 -154854
12177C16862N0712d5530B57921r3473a17145O377A28293P1147c5623j0144C86690
$$ 316862 367574 -45530 257921 164448 -117145 -110768 128293 199440 -35623 -45767 386690
12165A50182J58756j54220K07665e6358B36211r4191L04407A51303G1400J06117
$$ 150182 308938 154718 362383 -56358 236211 142020 446427 151303 71400 177517
12155A77517C8872J52606C1882b56475B29596M7195j14015d39055A65004J48393
$$ 177517 38872 191478 31882 -256475 229596 276791 162776 -439055 165004 313397
12145C13397b18737f1402A77738H5143m993R7928O7880k9205a40013F6422c24774
$$ 313397 -218737 -61402 177738 85143 80150 178078 245958 216753 -140013 66422 -324774
12133A4608O9110K04538a50744A23464c0218C709b18050c1735A71949J29443B4692
$$ 14608 83718 288256 -150744 123464 -30218 3709 -218050 -31735 171949 301392 24692
12121A17038P5199f7915F7891B1978J42330J39956a87766B14166A01140m4974
$$ 117038 192237 -67915 67891 21978 164308 304264 -187766 214166 101140 56166
12111E6166q035a44423A01055k4461a50988r1605A61156f4387j81313g5250n4716
$$ 56166 48131 -144423 101055 76594 -150988 -242593 161156 -64387 -245700 -75250 -129966
12100a29966A03245a30043O3650j15903A20069g1393e424A09543b7668D1466c00759
$$ -129966 103245 -130043 -66393 -182296 120069 -71393 -5424 109543 -27668 41466 -300759
12088A39907i6998j71717Q0007D6242K30K57822A39791a83398B58356J17580H730
$$ 139907 -96998 -268715 -188708 46242 46472 304294 139791 -183398 258356 375936 8730
12076A30316K7434b92941F8464c5573j20003B8278h9657I9274k7905b38184i4015
$$ 130316 157750 -292941 68464 -35573 -155576 28278 -89657 99274 71369 -238184 -94015
12064D4500a50376C3151M0843b3278F12890j16149N43235k56403l71008j20675
$$ 44500 -150376 33151 73994 -23278 612890 496741 1039976 783573 412565 291890
12054B91890N7022j52057i3510A69167e4395j17251g7320G7666c27977B80549
$$ 291890 348912 196855 -93510 169167 -54395 -171646 -77320 77666 -327977 280549
12043H3455K7269h7718A07111a77618A3604b26793C62275a43615k24155B8984
$$ 83455 110724 -87718 107111 -177618 13604 -226793 362275 -143615 -367770 28984
12032a69758k20479a48400D2387c04405a5747r7741A9411L363M839a45755J6373
$$ -169758 -390237 -148400 42387 -304405 -15747 -113488 19411 22774 27613 -145755 -129382
12021a29382D1917j4373a6301G020a11337A18734I286a444H5356b28925O2983
$$ -129382 41917 27544 -16301 7020 -111337 118734 9286 -1444 85356 -228925 -165942
12010a65942h0390a0408j67408e086j24064m3527A31542A1862a3905G4007a2388
$$ -165942 -80390 -10408 -177816 -5086 -129150 -172677 131542 11862 -13905 74007 -12388
11998B63268n2113b37637A10909B5828J5365p231J4054b17947B1139a65158N3450
$$ 263268 211155 -237637 110909 25828 41193 33962 48016 -217947 21139 -165158 -111708
11987a11708H8948r583c56886H3810K14539I8186a58164A49278g7659l68373K18583
$$ -111708 88948 79365 -356886 83810 298349 98186 -158164 149278 -77659 -446032 -227449
11976b27449H8201b4162L817n3948K6216A72318a59272b5572m2474A7496e59079
$$ -227449 88201 -24162 -20345 -74293 -48077 172318 -159272 -25572 -68046 17496 -559079
11964B01533a34469m8312J1067k7694R5994j23667I733K09627I9123N0806i7680
$$ 201533 -134469 -182781 -171714 -199408 -103414 -227081 9733 219360 99123 149929 -97680
11952B54643a6147F0713N0787a63366I5788a26881F0909E8g3859Q170B43777D3283
$$ 254643 -16147 60713 111500 -163366 95788 -126881 60909 58 -73859 -65689 243777 43283
11939A77176O031K184f1716A02149b2824k44627e5728k41659i835j93834A73651
$$ 177176 183207 185391 -61716 102149 -22824 -267451 -55728 -297387 -9835 -203669 173651
11927A64272H741L67790a83085N1191k1452C45899i4829G7778J52810A08120R4116
$$ 164272 8741 376531 -183085 -131894 -153346 345899 -94829 77778 230588 108120 202236
11916B02236b4787r8851N2520l5803j65024Q2455B5671i8837B16634f1316j08497
$$ 202236 -24787 -123638 -71118 -106921 -271945 -189490 25671 -98837 216634 -61316 -169813
11905a69813M0985A05956N347e30857a5253j70054B60186j19922J53596p673p3380
$$ -169813 -128828 105956 111303 -530857 -15253 -185307 260186 140264 293860 286187 212807
11894B12807h3173j03723q8513G7754M1348a06385a8480j9105o9055A47001b11294
$$ 212807 -83173 -186896 -275409 77754 119102 -106385 -18480 -37585 -106640 147001 -211294
11882c5485G6939a17923j04425E2902a51746N9158D1157J46982a65896A40221
$$ -35485 76939 -117923 -222348 52902 -151746 -92588 41157 188139 -165896 140221
11871A35764a27618j40698e0936B20257a5065j54738m6008k22898a45964D5484
$$ 135764 -127618 -268316 -50936 220257 -15065 -169803 -215811 -438709 -145964 45484
11860C42173B0601c7420q3583C3344a12652l78136A86071b39223f1276r588B8889
$$ 342173 20601 -37420 -121003 33344 -112652 -490788 186071 -239223 -61276 -70864 28889
11848C3853b28983A37236L5510o5044a75833d4703l06290A57181h6006A588i183
$$ 33853 -228983 137236 172746 107702 -175833 -44703 -350993 157181 -86006 1588 -9183
11836a51999m5526M4682A11603a51879g1861o7089F8748a38628A94032b0881A51203
$$ -151999 -197525 -152843 111603 -151879 -71861 -138950 68748 -138628 194032 -20881 151203
11824a31859j3836I600K22680c1352B02691a55647C15949g624j35665k17516D4440
$$ -131859 -145695 9600 232280 -31352 202691 -155647 315949 -7624 -143289 -360805 44440
11812g2172G1430a02909j99556B03061n1406d236C2435a63775C46188a5950I1763
$$ -72172 71430 -102909 -302465 203061 151655 -4236 32435 -163775 346188 -15950 91763
11800b22310B77991b36108A94413G7243Q4044B4874a09311k13090G4498a02966
$$ -222310 277991 -236108 194413 77243 161287 24874 -109311 -322401 74498 -102966
11789a17705o3199j34084l884J40928N6115A56673a4319j44811A04346e5514J929
$$ -117705 -180904 -314988 -318872 -177944 -121829 156673 -14319 -159130 104346 -55514 -53585
11778e3585j41476e9853j24147c6138A16584k2775a84519A04945a95287e8791
$$ -53585 -195061 -59853 -184000 -36138 116584 93809 -184519 104945 -195287 -58791
11767E0236b37992A34585b04703C3920a36455j01706I6224J33466m5904F0022
$$ 50236 -237992 134585 -204703 33920 -136455 -238161 96224 229690 183786 60022
11756a6637I9828K7424k2540b43299e2624A08228b38062c2534k03372A10767R3479
$$ -16637 99828 127252 104712 -243299 -52624 108228 -238062 -32534 -235906 110767 204246
11745B04246N8591A6962c6719B59566o5650I5649a57453B80632a9868A73861B179
$$ 204246 262837 16962 -36719 259566 193916 95649 -157453 280632 -19868 173861 2179
11733H7591K0460C2459i0308a256A77336a60572A47757D6949a24557B47982j18027
$$ 87591 108051 32459 -90308 -1256 177336 -160572 147757 46949 -124557 247982 129955
11722A29955a95292j8272M9006C5010a17941r7825O3140e9209l2384L7488G5673
$$ 129955 -195292 -213564 -164558 35010 -117941 -215766 -152626 -59209 -91593 -54105 75673
11710f9884l4326r8441D1614h5320E478M9953J36588a52590C466R05K65221E5688
$$ -69884 -104210 -202651 41614 -85320 5478 55431 192019 -152590 3466 4371 269592 55688
11697b09153J5595h6269j10348d9674A74763e043A2763a74981A27548C9911g5293
$$ -209153 -193558 -86269 -196617 -49674 174763 -5043 12763 -174981 127548 39911 -75293
11685D3697K7475J26274o1860a56560I1535J0390J82661I8765M1005Q9093a41687
$$ 43697 71172 197446 135586 -156560 91535 101925 284586 98765 139770 228863 -141687
11673D29538B10266k8401Q5251d4398j00227B66554b2273k37287B5926e1107B44961
$$ 429538 210266 181865 267116 -44398 -144625 266554 -22273 -259560 25926 -51107 244961
11661a68459A2965n347J9039b27433C01763A40333a36399A12022a35006B58333
$$ -168459 12965 7618 26657 -227433 301763 140333 -136399 112022 -135006 258333
11650i966A41712C2660L09545j64554L9726C1459d0922l7666a2627r884C23864
$$ -9966 141712 32660 342205 177651 217377 31459 -40922 -78588 -12627 -22511 323864
11638c71102a38062D2082J93858F4982c267k8727k25775J18585e4805l04632C6403
$$ -371102 -138062 42082 235940 64982 -3267 -31994 -257769 -139184 -54805 -359437 36403
11626b3462j23561k2998C5546d3375A31330a11898A75815a05234E6933a49321
$$ -23462 -147023 -170021 35546 -43375 131330 -111898 175815 -105234 56933 -149321
11615b68541A12644a23125q8860C27545I2519M2645f2616a5335A19166m161Q2860
$$ -268541 112644 -123125 -211985 327545 92519 135164 -62616 -15335 119166 115005 197865
11604A97865M8550a43839B3811J67052B3509L22001G2559a20972A14018C9553
$$ 197865 246415 -143839 23811 190863 23509 345510 72559 -120972 114018 39553
11593a8735j62212Q9763E3081K19858F9484J97612a98979b8923m0415A01197J45658
$$ -18735 -180947 -91184 53081 272939 69484 267096 -198979 -28923 -69338 101197 246855
11582B46855J31012j77297K4138e5298D9383K83530j24195j7981n9834B5081j167
$$ 246855 377867 200570 224708 -55298 49383 332913 208718 190737 130903 25081 23914
11571B3914N5176j5529K47139A10649K60054j1263E9995K27816b99857i8175c9292
$$ 23914 79090 63561 310700 110649 370703 359440 59995 287811 -299857 -98175 -39292
11559B89006A35075J82476A48983b13644A28158K46200g1134B99741a37720F2092
$$ 289006 135075 317551 148983 -213644 128158 374358 -71134 299741 -137720 62092
11548a57058A24909E9815K80624o0567B8323b17093A51429E7179i623n3063B36856
$$ -157058 124909 59815 340439 279872 28323 -217093 151429 57179 -9623 -62686 236856
11536A23901B4248J09937H713P6885L2878J22861a01983K8028c0302B0233c3605
$$ 123901 24248 134185 8713 85598 118476 241337 -101983 -73955 -30302 20233 -33605
11524B4941i4897i960C05200a57343M2045C08902I0788J67259D1353Q4911J09334
$$ 24941 -94897 -9960 305200 -157343 -115298 308902 90788 258047 41353 126264 235598
11513B35598n7682l2012k3933a53899H5753Q5439L9443b63943H1727N5388K03577
$$ 235598 177916 145904 121971 -153899 85753 171192 210635 -263943 81727 137115 340692
11502C40692I067K17771j06677f5000A84035B3341a73017e2399A10696N5605g1757
$$ 340692 9067 226838 120161 -65000 184035 23341 -173017 -52399 110696 166301 -71757
11490h1193B09536L4442a26212C9216M87809j83099A5096K9638J44210a36989
$$ -81193 209536 243978 -126212 39216 527025 343926 15096 44734 188944 -136989
11479A16958A8497a39411B18393a38317I0461d854B20181a8081B8683A0668J99926
$$ 116958 18497 -139411 218393 -138317 90461 -4854 220181 -18081 28683 10668 210594
11468B10594Q3981a8056B31450H1583L25540c312j26314A10886k9423L12174A62810
$$ 210594 294575 -18056 231450 81583 407123 -3312 -129626 110886 81463 393637 162810
11456b999A60674K05515a4571I8232a00152C4015g9546F88358B710J8636e5909
$$ -2999 160674 366189 -14571 98232 -100152 34015 -79546 688358 2710 21346 -55909
11444C16206a1723A42859q885F3612M5703A6148a16725G9667a14768B57449a8622
$$ 316206 -11723 142859 133974 63612 109315 16148 -116725 79667 -114768 257449 -18622
11432i9002k45695A14703C0694J44551J16442A17089I892K76391b1383A48098
$$ -99002 -344697 114703 30694 175245 291687 117089 9892 286283 -21383 148098
11421A09273l7794b08240J92B17292E2488e0742J6955k03538B58097o4250J17668
$$ 109273 71479 -208240 -208048 217292 52488 -50742 -33787 -237325 258097 193847 311515
11410C11515A47836a10680E5492f3413C31816c9514C8524d926k81272E7819L81267
$$ 311515 147836 -110680 55492 -63413 331816 -39514 38524 -4926 -286198 57819 439086
11399D39086h4494b7461o9961k74029A7541a24770k5812j52182d0952B6855J1155
$$ 439086 -84494 -27461 -97422 -371451 17541 -124770 -150582 -302764 -40952 26855 38010
11388C8010D592K42468a47969b8108j00685B09048J03324j31754K2809a78251
$$ 38010 4592 247060 -147969 -28108 -128793 209048 312372 180618 203427 -178251
11377a03154l790j4590L0520A08219a01810A63731a37112e4781r0223A3254J01802
$$ -103154 -106944 -121534 -91014 108219 -101810 163731 -137112 -54781 -145004 13254 115056
11366A15056a38678G2759J18172a36080j1811A33858j9697b3929H8347a77745
$$ 115056 -138678 72759 190931 -136080 -147891 133858 114161 -23929 88347 -177745
11355a86410B3277b89970R7943C66303a60250m3405J8671k2378C70596m9198H8102
$$ -186410 23277 -289970 -192027 366303 -160250 -203655 -184984 -207362 370596 321398 88102
11343f7413B32281r1765a6193N146J913C9001g2014K8143F7172K0544a31028A65681
$$ -67413 232281 140516 -16193 -11047 -9134 39001 -72014 -43871 67172 87716 -131028 165681
11330a19754D8732M6013b02790Q9792B44793b8325m7249A72721k2957C8522K12354
$$ -119754 48732 94745 -202790 -112998 244793 -28325 -75574 172721 149764 38522 250876
11319B50876r5725f2913k46530P277A11147i6757k62608C17521j27199b61255
$$ 250876 155151 -62913 -309443 -302166 111147 -96757 -359365 317521 190322 -261255
11308A85699b08186B7306a21384N2809L49K2254j1328B69355F0497g5414l36638
$$ 185699 -208186 27306 -121384 -68575 -68226 -45972 -57300 269355 60497 -75414 -412052
11297d12052C0146N6848K23096c3057I9445d0061B88727q0581a68381G012c990
$$ -412052 30146 86994 310090 -33057 99445 -40061 288727 208146 -168381 7012 -3990
11285a73157o4312I1130D156J2226c8143A7054e1179A24030b35910G3482a67745
$$ -173157 -237469 91130 4156 16382 -38143 17054 -51179 124030 -235910 73482 -167745
11273a67231L6647b031B48230e0436A77576a43986L2744R444r2924H3138b06877
$$ -167231 -130584 -2031 248230 -50436 177576 -143986 -111242 -101798 -194722 83138 -206877
11261b31547A79239q7195K3938c78854C5439b74865A2480a15776b4640A0990b55282
$$ -231547 179239 92044 115982 -378854 35439 -274865 12480 -115776 -24640 10990 -255282
11249B42997h3545A25475k8771i7688A35077b38775D9560a06981F4050h6195B5168
$$ 242997 -83545 125475 96704 -97688 135077 -238775 49560 -106981 64050 -86195 25168
11237h3948j3430k30284F4938a44828A37703a38618A97189F244d4691a9282A63902
$$ -83948 -97378 -327662 64938 -144828 137703 -138618 197189 6244 -44691 -19282 163902
11225h6339E0334a62341B22079n677e5935J458p7232j51456g4805j33233K851
$$ -86339 50334 -162341 222079 216402 -55935 -54477 -131709 -283165 -74805 -208038 -205187
11214b05187r7346C93898A49543I808a9129B81265D736P2616b61181B2916b309
$$ -205187 -302533 393898 149543 9808 -19129 281265 4736 77352 -261181 22916 -2309
11202g228o617k7699A52389j0048l9191C9938i2607r2648B59372K3497a40623
$$ -7228 -13845 -41544 152389 142341 103150 39938 -92607 -185255 259372 282869 -140623
11190c6311j10352L3887o8930F0586J96593e9650k01806I597K31107b53431f759
$$ -36311 -146663 -112776 -181706 60586 257179 -59650 -261456 9597 240704 -253431 -6759
11178C4366f6091I2893g4766B34859f4222A00378k1508e2761j58843H0017b10164
$$ 34366 -66091 92893 -74766 234859 -64222 100378 78870 -52761 -211604 80017 -210164
11166D4633b2672q438j24187C14716b56259h5949j16820d5546o8893j05544B743
$$ 44633 -22672 -31110 -155297 314716 -256259 -85949 -202769 -45546 -114439 -219983 2743
11154a3828C6860d64028a08862d692k89509B03223a75991C1194J87807q1294b98906
$$ -13828 36860 -464028 -108862 -4692 -294201 203223 -175991 31194 219001 137707 -298906
11142a74873L0485A05208b73771E8881a57748A53351a54970E425a99278B6804
$$ -174873 -144388 105208 -273771 58881 -157748 153351 -154970 5425 -199278 26804
11131b71193j2681h8497G5214a12446B43757j10555c74504D1920a39095I2436
$$ -271193 -283874 -88497 75214 -112446 243757 133202 -374504 41920 -139095 92436
11120b80808B5795K4981B227L81892A54023b94596B58694B6515L86335H0671a031
$$ -280808 25795 50776 2227 384119 154023 -294596 258694 26515 412850 80671 -1031
11108F9249L27315b13608B83452h3748C3100a30609E137l56a90370E6388M0829
$$ 69249 396564 -213608 283452 -83748 33100 -130609 5137 4781 -190370 56388 97217
11097I7217C3375J00001a20979M4629A51437F6026J80140E6704a34425E7295K03235
$$ 97217 33375 133376 -120979 -76350 151437 66026 246166 56704 -134425 57295 260530
11086B60530p7465J20014q2729A8544J85417H5019J7696O4183M2910l1110E010
$$ 260530 183065 303079 220350 18544 203961 85019 102715 166898 209808 178698 5010
11074D8935L7677J66484E7423M77985I2278R4716J13829q3966B0902O8182J31669
$$ 48935 86612 253096 57423 535408 92278 186994 300823 216857 20902 89084 220753
11063B20753O7481n6876O1745J66571j55529J81152n0441L3599p1911A03821Q0034
$$ 220753 288234 231358 293103 459674 304145 485297 434856 468455 396544 103821 183855
11052A83855J32036J24455E3343K18768J5588J05263j68851J38811N0731L92437
$$ 183855 315891 440346 53343 272111 287699 392962 224111 362922 413653 806090
11042H06090j34935r6449j6615P0148K2303l18278M8646N45089k69428J16943
$$ 806090 671155 574706 558091 628239 650542 332264 380910 925999 656571 773514
11032G73514o2747k76053L16380C60054K82841j44595M87143k34638L1131B40675
$$ 773514 710767 434714 751094 360054 642895 498300 985443 750805 781936 240675
11021F76116Q9920J77935q0362m00473J74501r456p7779P9972Q5058B93004Q4542
$$ 676116 766036 943971 863609 463136 637637 628181 550402 630374 715432 293004 377546
11010C77546N43311l4674k58622J38688j41534J62575j77412O21246F04483j85815
$$ 377546 920857 886183 627561 766249 624715 787290 609878 1231124 604483 418668
11000D18668L86055B98555n710J49762k4806R8940A43154P17229k32844j8595
$$ 418668 804723 298555 292845 442607 417801 516741 143154 860383 627539 608944
10990F08944j76946K38405k5009k13734K43451B76447J45030j07642L30422j14969
$$ 608944 431998 670403 645394 431660 675111 276447 421477 313835 644257 529288
10980E29288K62292l81082M20566P794J79316k32588j60662K14590l22000M28024
$$ 529288 791580 410498 831064 838858 1018174 785586 624924 839514 517514 945538
10970I45538j85469N1945J85042J05294J90325k07541L05683K80315K36646k47445
$$ 945538 760069 812014 997056 1102350 1292675 1085134 1390817 1671132 1907778 1660333
10960A660333L52433j05873O27532r2353j40085K59081J65818j4756m46077m30768
$$ 1660333 2012766 1906893 2534425 2442072 2301987 2561068 2726886 2712130 2266053 1835285
10950A835285R7860O2005k86589M38834j36458l34752K79364p9802Q7839j06772
$$ 1835285 1933145 1995150 1708561 2147395 2010937 1676185 1955549 1875747 1963586 1856814
10940A856814j43657p7916m8423j65379l27771J68142m22433C10090M38829j82345
$$ 1856814 1713157 1635241 1586818 1421439 1093668 1261810 839377 310090 748919 566574
10930E66574A5665O10051A53548K50022G5823A0766b3728C87116j48328i2656
$$ 566574 15665 625716 153548 403570 75823 10766 -23728 387116 238788 -92656
10919A13564P2100J58675J8887b7695C66578b14500A30256J7807e3679k9526H4296
$$ 113564 185664 344339 363226 -27695 366578 -214500 130256 148063 -53679 -83205 84296
10907A09121r655d7609A80005p2685m7058d5001A10906b28694A65588A9631J94181
$$ 109121 99466 -47609 180005 107320 60262 -45001 110906 -228694 165588 19631 213812
10896B13812a7045k41821a08913G0335b66377B41249I5872b79219J06768E2026
$$ 213812 -17045 -258866 -108913 70335 -266377 241249 95872 -279219 -172451 52026
10885b82165A01858C8228K60191j41277a48157A53235R3876d3448B22711b37552
$$ -282165 101858 38228 298419 157142 -148157 153235 247111 -43448 222711 -237552
10874f334k6957B69327a37448o0633f4496j20257d0088J1204A33413r316K1726
$$ -6334 -33291 269327 -137448 -198081 -64496 -184753 -40088 -28884 133413 124097 145823
10863A45823a08051A84539a42836A18884B4974K50333q7767b29782j55130b5715
$$ 145823 -108051 184539 -142836 118884 24974 275307 187540 -229782 -384912 -25715
10852A46333a22688B56758E4874q381K7283J81489j23193M715a8437H4239O3918
$$ 146333 -122688 256758 54874 46493 73776 255265 132072 136787 -18437 84239 148157
10841A48157o1615b2187b802B47209C9858J22951f1236b0923k27381J14711C37735
$$ 148157 86542 -22187 -2802 247209 39858 162809 -61236 -20923 -248304 -133593 337735
10829h8199O201C04637a79788l8102E0874J79662a06420l0967b8866A80960h6242
$$ -88199 -81998 304637 -179788 -217890 50874 230536 -106420 -137387 -28866 180960 -86242
10817b3912G0989O0516A2885c16102B4161a66421A59650E2673J66642a35387K0416
$$ -23912 70989 131505 12885 -316102 24161 -166421 159650 52673 219315 -135387 -114971
10806a14971a218l55080B75797r5311k2128N2600b29492N1201A51659a50620E3468
$$ -114971 -1218 -356298 275797 180486 158358 210958 -229492 -178291 151659 -150620 53468
10794b70035H5914a97112K3249E8807i1340l2482e9396k81632J18316B593g6926
$$ -270035 85914 -197112 -173863 58807 -91340 -123822 -59396 -341028 -222712 2593 -76926
10782a50142H9221a34381N3662C5722e7963B05546a40833r3459B79922A15814
$$ -150142 89221 -134381 -80719 35722 -57963 205546 -140833 -234292 279922 115814
10771a0994A86341J7178b56387e1533A39609l4273b15595d4426J0096k8804B5240
$$ -10994 186341 203519 -256387 -51533 139609 105336 -215595 -44426 -34330 -63134 25240
10759b17949b407B61912a09073D6324i3553B6578e3999k20419R9326j99970B90658
$$ -217949 -2407 261912 -109073 46324 -93553 26578 -53999 -274418 -175092 -375062 290658
10747C09783e5324E2509i1819c5879k07320A861c25900A45837D5405b60505C26980
$$ 309783 -55324 52509 -91819 -35879 -243199 1861 -325900 145837 45405 -260505 326980
10735C77358A28721b35068B4699b69375P4076I018K23506I144J13826a62176D0971
$$ 377358 128721 -235068 24699 -269375 -195299 9018 232524 9144 122970 -162176 40971
10723a8115n5251J1808B05014A6250c07108D3638f2094a2373n7280G7561a29356
$$ -18115 -73366 -61558 205014 16250 -307108 43638 -62094 -12373 -69653 77561 -129356
10711H8125B3304b9050a1390B13277I5970a87110i1751F5097L2541j5818b42769
$$ 88125 23304 -29050 -11390 213277 95970 -187110 -91751 65097 97638 81820 -242769
10699h3056B72922c8186q4943K5363B12876a20219R170p8756Q1122A36849F1222
$$ -83056 272922 -38186 -123129 -97766 212876 -120219 -111049 -189805 -108683 136849 61222
10687e545j38209B49304l1921c22218J11445A91656c44004h353q6052d2291j82249
$$ -5545 -143754 249304 217383 -322218 -210773 191656 -344004 -8353 -94405 -42291 -224540
10676b24540j2091a10653A04585A7973K55094h0170j99997g8333K0797A16512
$$ -224540 -236631 -110653 104585 17973 273067 -80170 -280167 -78333 -57536 116512
10665E215b04204a0405A4631f0842l3006A11967b15679N7881A65618b98912a16425
$$ 5215 -204204 -10405 14631 -60842 -93848 111967 -215679 -157798 165618 -298912 -116425
10653d2101j16218p1025C6175a91952j11926j02326a313m2637k48682A13137J66781
$$ -42101 -158319 -229344 36175 -191952 -303878 -406204 -1313 -43950 -292632 113137 279918
10642B79918g6054B84587c8741l24686Q2331I351a32399K6837A03673a75603j49435
$$ 279918 -76054 284587 -38741 -363427 -281096 9351 -132399 -105562 103673 -175603 -325038
10631c25038c7169o9644A03711a35138B709M25499g8284Q370j1342j11587A67714
$$ -325038 -37169 -106813 103711 -135138 2709 428208 -78284 -69914 -81256 -192843 167714
10619H3562K3392b22463H6816M2848q212l1007d5629k0645l4145A2822N1105q468
$$ 83562 106954 -222463 86816 129664 121452 90445 -45629 -66274 -100419 12822 63927 55459
10607E5459b6223A57197B9892Q8751c32183C845a07416I4533c26198a55436q8595
$$ 55459 -26223 157197 29892 118643 -332183 3845 -107416 94533 -326198 -155436 -244031
10596b44031h1460b7038j72993e2994a6731k14560g656o4159r9528B8720i5657
$$ -244031 -81460 -27038 -200031 -52994 -16731 -231291 -7656 -71815 -171343 28720 -95657
10584I9355b14341m546b6623F0322J34930b22003j29613J59741C8639K25489a9895
$$ 99355 -214341 -218887 -26623 60322 195252 -222003 -351616 -191875 38639 264128 -19895
10572a37827H9526J1066a01830q2583p9259a2531j65255f7357K5893E8325b26180
$$ -137827 89526 100592 -101830 -184413 -263672 -12531 -177786 -67357 -41464 58325 -226180
10560b57208j7041a06905l73064h4157j877E9635J695c92943a88537c405A86300
$$ -257208 -274249 -106905 -479969 -84157 -86034 59635 61330 -392943 -188537 -3405 186300
10548a930H7341M592J08718d1513q1590A0013L27658G0338f7066A12003n483A2140
$$ -1930 87341 91933 200651 -41513 -123103 10013 337671 70338 -67066 112003 106520 12140
10535b53042b9107j19488P1303k52695A05220K0150K3277J9436E5755J084g6592
$$ -253042 -29107 -148595 -77292 -329987 105220 125370 148647 168083 55755 56839 -76592
10523b93384d7305j13577I5011c8640J4720A22439d24147b01932N4842a3176q736
$$ -293384 -47305 -160882 95011 -38640 -23920 122439 -424147 -201932 -147090 -13176 -21912
10512b1912B1939l185g0524B66438j05785J90384a01197j35186A5535a37424M0651
$$ -21912 21939 18754 -70524 266438 160653 351037 -101197 -236383 15535 -137424 -96773
10501i6773k9187A10300c1423o4647l8324j1257B53585b643o7287o3368K8504
$$ -96773 -125960 110300 -31423 -96070 -134394 -145651 253585 -2643 -69930 -133298 -104794
10490a04794E8390c40815B14277g7805H49K14836G3854a82502b3644j50999A49819
$$ -104794 58390 -340815 214277 -77805 849 215685 73854 -182502 -23644 -174643 149819
10478G7434B709K8301a71039A27574m0212Q3954M9750J4668d1689I3253b154B15761
$$ 77434 2709 31010 -171039 127574 87362 171316 221066 235734 -41689 93253 -2154 215761
10465B74591J89889l9007A57071j49K29691N7456A98829c12990J56407I9128D0664
$$ 274591 464480 425473 157071 156922 386613 444069 198829 -312990 -156583 99128 40664
10453A97821E1701M9145a57298H0083M39563C8657b97371o7886A39275m9916g3059
$$ 197821 51701 100846 -157298 80083 519646 38657 -297371 -365257 139275 89359 -73059
10441d012l01554B68979O1167a39318C6093a635l3056k16154e7388A25080k8221
$$ -4012 -305566 268979 330146 -139318 36093 -1635 -34691 -250845 -57388 125080 96859
10430I6859J56194J79662H1432a71896A11933b6454A80016i6154j30141H4341
$$ 96859 253053 432715 81432 -171896 111933 -26454 180016 -96154 -226295 84341
10419D0591J1427b69321C9374a2382k60391B4922J40111a41290e4521a9924j4588
$$ 40591 52018 -269321 39374 -12382 -272773 24922 165033 -141290 -54521 -19924 -34512
10408c4512m5691m8865A61930i7161c8845H553a08231j90878a21439A90548i3768
$$ -34512 -80203 -129068 161930 -97161 -38845 8553 -108231 -299109 -121439 190548 -93768
10396a85711F7728i6349B7864c73217f8693D5407b27328n113R3145o3564j70973
$$ -185711 67728 -96349 27864 -373217 -68693 45407 -227328 -232441 -139296 -202860 -373833
10385c73833A68375b12188D4148B0388i4042A64602d07110m8413B70107D9791
$$ -373833 168375 -212188 44148 20388 -94042 164602 -407110 -455523 270107 49791
10374a53278H2819J140b0056R255k56033L5444J02019D8082a50384C04705j18328
$$ -153278 82819 83959 -20056 -10801 -266834 -231390 -129371 48082 -150384 304705 186377
10363A86377m91p5676a03969A46081J48113K30503I1008K56268P6258o4216A42524
$$ 186377 185886 110210 -103969 146081 294194 524697 91008 347276 423534 359318 142524
10351D33433j79899K91660B25636Q1965C605J99013q699K7722J90343j59956b60330
$$ 433433 253534 545194 225636 307601 3605 202618 193919 221641 411984 252028 -260330
10339B6124L50840j88387l640J73216A28687J57728K87492k1440A15404P24034
$$ 26124 376964 188577 184937 358153 128687 286415 573907 552467 115404 839438
10329H39438l72481n8905J35184k53955l7005J04563E5155R0231a82163G8792
$$ 839438 466957 408052 543236 289281 252276 356839 55155 145386 -182163 78792
10318B33674O0488c5099k1635I8275d8618j51835A29989a89150C03746J90764
$$ 233674 294162 -35099 -56734 98275 -48618 -200453 129989 -189150 303746 494510
10308D94510D3623J75433J71992A08828K17608h9120B18516c1923l4989B71058
$$ 494510 43623 219056 391048 108828 326436 -89120 218516 -31923 -66912 271058
10297a91049d0654A79984o5560J36102b09964I3703b70870h3211D0226a05019
$$ -191049 -40654 179984 114424 250526 -209964 93703 -270870 -83211 40226 -105019
10286G3692c44958M2996N8445L1851L9817g0457A5062a27492M8028A66206F4067
$$ 73692 -344958 -301962 -243517 -211666 -171849 -70457 15062 -127492 -79464 166206 64067
10274B7440A940h3971q0256L9041A597a55036A44431G738R9250a7074A1338a19982
$$ 27440 1940 -83971 -164227 -125186 1597 -155036 144431 7738 106988 -17074 11338 -119982
10261A84383k9891b24912B34332G3911c506l98784B14317R8543c6320j60787C18255
$$ 184383 154492 -224912 234332 73911 -3506 -402290 214317 312860 -36320 -197107 318255
10249a39602A80708R3581o5446Q903K00282A49149K43306A10767P3592G8676N9388
$$ -139602 180708 274289 208843 217746 418028 149149 392455 110767 184359 78676 138064
10238A38064Q1188b36736B41322j10289c81102B05146C4818l104a36958p1426
$$ 138064 219252 -236736 241322 131033 -381102 205146 34818 31714 -136958 -208384
10228b08384O6547f0125j09788m5539P5738m755I7178l0252b9553k3719D21465
$$ -208384 -141837 -60125 -169913 -215452 -139714 -144469 97178 66926 -29553 -53272 421465
10216c26402A67689J87003I3680R6029l8861c5517k87951h5011C12560j19168
$$ -326402 167689 354692 93680 189709 150848 -35517 -323468 -85011 312560 193392
10206A93392F1557b29110r9126G1324A6003c59734k0550a32730n0895f413H5814
$$ 193392 61557 -229110 -328236 71324 16003 -359734 -380284 -132730 -183625 -6413 85814
10194A39522a63453B16275B6690K72666A44333E2285h8228j7679j00547C096e9789
$$ 139522 -163453 216275 26690 299356 144333 52285 -88228 -105907 -206454 3096 -59789
10182b9330k43248C8503a89882p4598k37983b00297c9331j02512A34909p061A6062
$$ -29330 -272578 38503 -189882 -264480 -502463 -200297 -39331 -141843 134909 127848 16062
10170a33023l9978Q4109r7153p7014H9060a07261I305K98063j02635i3343l71557
$$ -133023 -173001 -88892 -186045 -263059 89060 -107261 9305 307368 204733 -93343 -464900
10159d64900c646o6461I2669F861e05017h2999a9673k74956C5881g597D8072J42336
$$ -464900 -3646 -70107 92669 6861 -505017 -82999 -19673 -294629 35881 -7597 48072 190408
10147A90408F1704K42716j22709j4995a38125B46001e8490p4963r9828L5214e4114
$$ 190408 61704 304420 181711 166716 -138125 246001 -58490 -133453 -233281 -198067 -54114
10135E3638g7249a1543I239a44666j59705a47746O7626i25m4250C0779M9251c23098
$$ 53638 -77249 -11543 9239 -144666 -304371 -147746 -80120 -925 -45175 30779 80030 -323098
10122A13575k9421i9010Q726A36639q359f9610k98114B69307B7344a78931D2294
$$ 113575 84154 -99010 -90284 136639 128280 -69610 -367724 269307 27344 -178931 42294
10110b44068A4575b13081A19247O4614i4549E3706a57476L975O2521k07065a5820
$$ -244068 14575 -213081 119247 183861 -94549 53706 -157476 -153501 -90980 -298045 -15820
10098B30369b27139b3505m0361j45354O0748k1213m8648P6911c7932k04258E6375
$$ 230369 -227139 -23505 -63866 -209220 -148472 -169685 -218333 -141422 -37932 -242190 56375
10086A35808b62219j07281g3990q9092J6386j80106J30923e3271k24216g1704
$$ 135808 -262219 -369500 -73990 -163082 -146696 -326802 -195879 -53271 -277487 -71704
10075b53767K7459G2836a88590H09a24510A26931b83458e7984B83970c2359r3717
$$ -253767 -226308 72836 -188590 809 -124510 126931 -283458 -57984 283970 -32359 -126076
10064a26076B6328L3380O318a42482a8529I2485K36676A8397P4560a15175F6286
$$ -126076 26328 59708 66026 -142482 -18529 92485 329161 18397 92957 -115175 66286
10052a5717I8227b2848k05654J09677j36651A20638a19186d4362n8251p265j98118
$$ -15717 98227 -22848 -228502 -118825 -255476 120638 -119186 -44362 -102613 -109878 -307996
10041c07996M0919G4007c9367B02794J26286j30530a68055j0180b9008k3247n1100
$$ -307996 -267077 74007 -39367 202794 329080 198550 -168055 -178235 -29008 -52255 -103355
10030a03355A02352c69719B8065P8758h3738J4471q7207j3576A70885a12535A30199
$$ -103355 102352 -369719 28065 106823 -83738 -69267 -156474 -170050 170885 -112535 130199
10018b5794n5295H0506b03447D841b27389K2839L2651A10606r483a79021A18000
$$ -25794 -81089 80506 -203447 4841 -227389 -204550 -171899 110606 101123 -179021 118000
10006A82062D4325b40249e8882j64328n5758K5548j05715a62674o9805a03179
$$ 182062 44325 -240249 -58882 -223210 -278968 -253420 -359135 -162674 -232479 -103179
9995i4368k48002B44039K7079f1015j10437B67988A23637a24657o270M4664k00056
$$ -94368 -342370 244039 271118 -61015 -171452 267988 123637 -124657 -130927 -86263 -286319
9984b86319a09109j29714c8164G1488a13206j95276C09244A33859o3281K2446
$$ -286319 -109109 -238823 -38164 71488 -113206 -308482 309244 133859 70578 93024
9974I3024b05902L7560c3604j46268k1378Q771d1973r4776b4912A5643Q4181K5155
$$ 93024 -205902 -168342 -33604 -179872 -201250 -192479 -41973 -136749 -24912 15643 99824 124979
9962A24979a10152H453a69562a4297k77293Q5442G7918h9444A8179a83894n6333
$$ 124979 -110152 8453 -169562 -14297 -291590 -206148 77918 -89444 18179 -183894 -240227
9951b40227B7435a81338D25921g2882r7029A85481e6094A6546K70445d43559a45316
$$ -240227 27435 -181338 425921 -72882 -169911 185481 -56094 16546 286991 -443559 -145316
9939a11833j15152a941k04181G8725i3129j5173A2944a97935A05331a92924j62588
$$ -111833 -226985 -1941 -206122 78725 -93129 -108302 12944 -197935 105331 -192924 -355512
9928c55512A0800g3937j02393f9525l445B5426f8288b8261E7136K92729i0127
$$ -355512 10800 -73937 -176330 -69525 -72970 25426 -68288 -28261 57136 349865 -90127
9916a05790C03250E6764b10516C7266c45138c7024A49127b49865k06887b02637
$$ -105790 303250 56764 -210516 37266 -345138 -37024 149127 -249865 -456752 -202637
9905a04567m4882k12101F8715L0066J3215C8237a76817j0653j59076h3065E5717
$$ -104567 -149449 -361550 68715 98781 111996 38237 -176817 -187470 -346546 -83065 55717
9893G71f52113G0163a46883O0402D6475b81025a14655A80291d357A02459O1897
$$ 771 -652113 70163 -146883 -86481 46475 -281025 -114655 180291 -4357 102459 164356
9882A64356b33547e5715B13900g6113j84623C95381a58940D9937f765k20964h8856
$$ 164356 -233547 -55715 213900 -76113 -260736 395381 -158940 49937 -6765 -227729 -88856
9870B0827b3863n1639A08501b18927M5115N2263c0773j52109L625J348E3831b83263
$$ 20827 -23863 -75502 108501 -218927 -173812 -121549 -30773 -182882 -179257 -177909 53831 -283263
9857b35218d8929B6240a9872r9219c6248A87062l3437a4221E9218a54065A0053
$$ -235218 -48929 26240 -19872 -119091 -36248 187062 153625 -14221 59218 -154065 10053
9845c2024j07222A2647O605J05388h7914A08085a95338f6081k30664A3499a02882
$$ -32024 -139246 12647 19252 124640 -87914 108085 -195338 -66081 -296745 13499 -102882
9833F7513a47002E6509b57383j35331l4337A86949b25165B40602a29108A7038
$$ 67513 -147002 56509 -257383 -392714 -427051 186949 -225165 240602 -129108 17038
9822B35291f3390j32538L601c597j42484m8044A44975a83355B1725d43105A06996
$$ 235291 -63390 -195928 -192327 -3597 -146081 -194125 144975 -183355 21725 -443105 106996
9810g0409E2939H868a01269m21461a07090J4352n641p072l09986B23465b23317
$$ -70409 52939 8868 -101269 -522730 -107090 -92738 -98379 -105451 -415437 223465 -223317
9798b66638d8976A21467a32372r3442C69222b2333A03036K15756a18130A26610
$$ -266638 -48976 121467 -132372 -225814 369222 -22333 103036 318792 -118130 126610
9787f1413k4795a6563A26475A2187a06421j48556q9569A84115a31131H8200a07091
$$ -61413 -86208 -16563 126475 12187 -106421 -254977 -344546 184115 -131131 88200 -107091
9775A60149h7303n4602L786l43239R4458A14527J4305h7114d1276E9182a26658
$$ 160149 -87303 -141905 -138119 -481358 -386900 114527 128832 -87114 -41276 59182 -126658
9763a77364j87136a32429A5225b81083J09112E302J0467a2039A49515n2129b4639
$$ -177364 -364500 -132429 15225 -281083 -171971 5302 15769 -12039 149515 97386 -24639
9751h3394A10885b08787j23914i3755C7801J051e4467A29316a38403B32909a12269
$$ -83394 110885 -208787 -332701 -93755 37801 38852 -54467 129316 -138403 232909 -112269
9739A31043N4630F6455a08817H3926a92794L6974A28279c92792J82559j17555
$$ 131043 185673 66455 -108817 83926 -192794 -155820 128279 -392792 -210233 -327788
9729c27788J35573p2761a23070j28277A01955K87120I16g1298B78154c92969A7656
$$ -327788 -192215 -264976 -123070 -251347 101955 389075 916 -71298 278154 -392969 17656
9717a4043A58858a18646a4179j63523A02264a75338G7096a75972L7160A060M8341
$$ -14043 158858 -118646 -14179 -177702 102264 -175338 77096 -175972 -138812 1060 49401
9706D9401H583J74407D0574a92352H9490K01330d2414B2585J44941D4558N2893
$$ 49401 8583 182990 40574 -192352 89490 290820 -42414 22585 167526 44558 97451
9695I7451i7775I437d08886J14131A10462a4456m30901a52376k54833A91449G7976
$$ 97451 -97775 9437 -408886 -294755 110462 -14456 -445357 -152376 -407209 191449 77976
9683A07355i8185B41878a74661O7764p322D2343a55031C29687d22741i8473D2738
$$ 107355 -98185 241878 -174661 -106897 -114219 42343 -155031 329687 -422741 -98473 42738
9671a66232Q0059p3076A18717e1099B7403o868b54703o4574A36271C2293a11017
$$ -166232 -86173 -159249 118717 -51099 27403 20535 -254703 -319277 136271 32293 -111017
9659b26781A36543r245c20402A4794K30947b35081G4176a75903L2048C58351h5671
$$ -226781 136543 127298 -320402 14794 245741 -235081 74176 -175903 -143855 358351 -85671
9647c35197B4783b9064j16554r1974P0502a0480k40075k0040a04881Q85d4067
$$ -335197 24783 -29064 -145618 -237592 -167090 -10480 -250555 -270595 -104881 -103996 -44067
9635a39361A66745a25791C5821J52517e4126j56242R7460B5052K4574H640a40453
$$ -139361 166745 -125791 35821 188338 -54126 -210368 -112908 25052 49626 8640 -140453
9623e16892A42752L1150b6468A28576a00920b234E6351b56179M8142c0355j68417
$$ -516892 142752 173902 -26468 128576 -100920 -2234 56351 -256179 -208037 -30355 -198772
9612a98772I0900c15944A5911F322c7393A4720b83603B070a52803A85213F668
$$ -198772 90900 -315944 15911 6322 -37393 14720 -283603 2070 -152803 185213 6668
9600c87836A26197b4456A64727J2916c7715A0025J7894J44243b98m75575g0718
$$ -387836 126197 -24456 164727 177643 -37715 10025 27919 172162 -298 -475873 -70718
9588i1245b2929B89542a19618L624m2098k94189B01752q3491N9176b09796k85147
$$ -91245 -22929 289542 -119618 -115994 -158092 -452281 201752 118261 177437 -209796 -494943
9577d94943A29963b03718b93k4148B2104N0364a86202C9165b4207H964d22011
$$ -494943 129963 -203718 -293 -24441 22104 72468 -186202 39165 -24207 8964 -422011
9565B72460c126j20617q8366P4749l90822H8412J41595C7580A6411a69148j07968
$$ 272460 -3126 -123743 -212109 -137360 -528182 88412 230007 37580 16411 -169148 -277116
9554b77116J20092p0545a3368l03138a28868l4076A49930d24401J90717m3927
$$ -277116 -157024 -227569 -13368 -316506 -128868 -162944 149930 -424401 -233684 -277611
9544b77611M3541Q5685n9388c5045j47147O407p0855Q515a11511k13004i41j55036
$$ -277611 -234070 -148385 -207773 -35045 -182192 -175785 -246640 -238125 -111511 -324515 -941 -155977
9532a55977A82969c7889j65581a00426C44290J8456g6834B193b4109k6698j00526
$$ -155977 182969 -37889 -203470 -100426 344290 362746 -76834 2193 -24109 -50807 -151333
9521a51333C4176h9379A92637D7320f1304q8335r1506O7635B5802d4474p9067
$$ -151333 34176 -89379 192637 47320 -61304 -149639 -241145 -173510 25802 -44474 -123541
9510a23541N0041c4552k7769A94502I3433a42978j52012k61435b76637J13857
$$ -123541 -73500 -34552 -62321 194502 93433 -142978 -294990 -556425 -276637 -162780
9500a62780H6590H255L36615a3762G0682a46239B0371J08561i1865G434b17018
$$ -162780 86590 8255 344870 -13762 70682 -146239 20371 128932 -91865 7434 -217018
9488d7766C61776f5790D2437i4004m3428k9206A84216e710B05575a53991I6522
$$ -47766 361776 -65790 42437 -94004 -137432 -166638 184216 -5710 205575 -153991 96522
9476A45244a99131H5539a2275o8184A07225a93126o4281A5627b77026A15802b30949
$$ 145244 -199131 85539 -12275 -80459 107225 -193126 -257407 15627 -277026 115802 -230949
9464A32766m0336A8750K32721B9421b12249i9815F3649f9562j8909j05172M096
$$ 132766 92430 18750 251471 29421 -212249 -99815 63649 -69562 -88471 -193643 -189547
9453a89547R0991j28416a03076I6248I374d93897g2887L0908A08492J7726a00100
$$ -189547 -98556 -226972 -103076 96248 9374 -493897 -72887 -41979 108492 126218 -100100
9441A55767b82945q7138a22017L1447b4317Q812l5962A4502b86282H528b38312
$$ 155767 -282945 -370083 -122017 -90570 -24317 -15505 -51467 14502 -286282 8528 -238312
9429d4832k24986a06794C4560a21053B8860J47940F1609b51053J1508n0612F0067
$$ -44832 -269818 -106794 34560 -121053 28860 176800 61609 -251053 -239545 -290157 60067
9417A69802B1135a01460p6264L4728A03999a19034k21860B38479b50850A28493
$$ 169802 21135 -101460 -177724 -142996 103999 -119034 -340894 238479 -250850 128493
9406a576r5422K7045k93271r3878a83294I0142i8968K2138B41557b99294i4732
$$ -1576 -96998 -69953 -363224 -457102 -183294 90142 -98968 -76830 241557 -299294 -94732
9394f9420j46045h0803I4500h4838j53099a02979A12012b19517P7745f5064j87488
$$ -69420 -215465 -80803 94500 -84838 -237937 -102979 112012 -219517 -141772 -65064 -252552
9383b52552A3496K6501J94819l7002b15078O9999K8895b7856C7700a12959j4290
$$ -252552 13496 39997 234816 197814 -215078 -145079 -116184 -27856 37700 -112959 -127249
9372a27249G8152a28135N8304H0919a84810A11504j8074k1139d3487h161k657
$$ -127249 78152 -128135 -69831 80919 -184810 111504 93430 72291 -43487 -8161 -10818
9361a0818D6189L8966f0350A32697a55210B75722c70208E7587g1635A06088K6273
$$ -10818 46189 85155 -60350 132697 -155210 275722 -370208 57587 -71635 106088 132361
9350A32361B124R05b42788N7041j87470B44625h999A22602i0864c8785B9809a05592
$$ 132361 2124 3029 -242788 -185747 -373217 244625 -8999 122602 -90864 -38785 29809 -105592
9337c41581C44760c31670J09098j11422E4905a36439a8322k8551j3078B06128
$$ -341581 344760 -331670 -222572 -333994 54905 -136439 -18322 -46873 -59951 206128
9326c58863g753I7728c29167d7166o5718M7334m8524n0106A72070H833a95147
$$ -358863 -7753 97728 -329167 -47166 -112884 -65550 -114074 -164180 172070 8833 -195147
9314g5900K0474A52140J01686m2836a74532N9782A30663i8273b518n5651l68142
$$ -75900 -55426 152140 253826 210990 -174532 -114750 130663 -98273 -2518 -58169 -426311
9303d26311c1569A95209d4970B46281a68038A33517b32087a5718C9031l275J12398
$$ -426311 -31569 195209 -44970 246281 -168038 133517 -232087 -15718 39031 35756 148154
9292A48154e7971n4725b7850o0961k003l1458C8455J1354a54182E0178a59532
$$ 148154 -57971 -112696 -27850 -88811 -90814 -122272 38455 49809 -154182 50178 -159532
9280g708C4184D80a07746B3494c97364a95192m431A5196b47998e4972A09687R1752
$$ -7708 34184 480 -107746 23494 -397364 -195192 -199623 15196 -247998 -54972 109687 201439
9268B01439a57115j05499k1661H3354a04915H4339J12413P1721f6066l12131B04427
$$ 201439 -157115 -262614 -284275 83354 -104915 84339 196752 268473 -66066 -378197 204427
9256a79787N9425B56007a0583j51714N5016n8764P3946G9051g4046A5154a54414
$$ -179787 -120362 256007 -10583 -162297 -107281 -166045 -92099 79051 -74046 15154 -154414
9244I837K89715a56929j24569M6088j7427N772A26944a00082j67792h9516G014
$$ 9837 299552 -156929 -281498 -235410 -252837 -247065 126944 -100082 -267874 -89516 7014
9232F3480a93045O9855B95978a47293K733B3049a9183B8899R2534Q7067n9691
$$ 63480 -193045 -123190 295978 -147293 -144560 23049 -19183 28899 121433 208500 148809
9221A48809a66554e2110k57343G8287a27088A07695d8471O07C1748d4001a0465
$$ 148809 -166554 -52110 -309453 78287 -127088 107695 -48471 -47864 31748 -44001 -10465
9209A28556a06480l0129B4458a4220k20368O2338j26929a0825H1562c29136h7953
$$ 128556 -106480 -136609 24458 -14220 -234588 -172250 -299179 -10825 81562 -329136 -87953
9197B01783c63710a64692f6230G7157H099J74269K8430e73521C06142B4479b77174
$$ 201783 -363710 -164692 -66230 77157 8099 182368 210798 -573521 306142 24479 -277174
9185B0080G238b4066j23342M2048B7310i0172n0422H4611a60049G5418a89662
$$ 20080 7238 -24066 -147408 -105360 27310 -90172 -140594 84611 -160049 75418 -189662
9173I4663J71791e7102j92900h9467a6424j10498j99643J47216O7888A71553B4522
$$ 94663 266454 -57102 -250002 -89467 -16424 -126922 -326565 -179349 -111461 171553 24522
9161b71993c1440B66542H1995k4867a84521M5839k19798a56615J6603J3488j81510
$$ -271993 -31440 266542 81995 57128 -184521 -138682 -358480 -156615 -140012 -126524 -308034
9150c08034h6494A94297A7873a08798k4822B24395a6340A36094b13237j45826
$$ -308034 -86494 194297 17873 -108798 -133620 224395 -16340 136094 -213237 -359063
9140c59063C7006i7090B53263A8426d6510k28192A8018a127k24538a07768n73099
$$ -359063 37006 -97090 253263 18426 -46510 -274702 18018 -1127 -225665 -107768 -680867
9129f80867A36823a62986k2275A59790b7340m39108C38751a58994E8037c2626
$$ -680867 136823 -162986 -185261 159790 -27340 -466448 338751 -158994 58037 -32626
9118A89641c05405A16417a25429p526n9455p3771E5570a08577k32279o8726h194
$$ 189641 -305405 116417 -125429 -132955 -192410 -266181 55570 -108577 -340856 -409582 -8194
9106h398H4805c24444J17151j247o4258J08604E4268a04804d8716I3477b24017
$$ -8398 84805 -324444 -207293 -208540 -272798 -164194 54268 -104804 -48716 93477 -224017
9094i4266a3810j61052k17472J66789l4867H6246J55101p3379J26188a10804b146
$$ -94266 -13810 -174862 -392334 -225545 -260412 86246 241347 167968 294156 -110804 -2146
9082b50506I9347a4348E1851a92177p3903B46372a01036p0785B08251a52504J6047
$$ -250506 99347 -14348 51851 -192177 -266080 246372 -101036 -171821 208251 -152504 -136457
9071a36457k7137E4190A5844c9380k8683D3729J45750a42449P0514A47833J23039
$$ -136457 -163594 54190 15844 -39380 -68063 43729 189479 -142449 -71935 147833 270872
9060B70872a84769L3679A6544a41864D4059g4566J9250j03645D8155b15638A33612
$$ 270872 -184769 -151090 16544 -141864 44059 -74566 -55316 -158961 48155 -215638 133612
9048B03516i1726c2589I9281J93422d4446B16558a67363k02066a22756c9596j83140
$$ 203516 -91726 -32589 99281 292703 -44446 216558 -167363 -369429 -122756 -39596 -222736
9037b22736c5695k40501J38053d0994o2868j4686A5033K05505a38272B05633J4383
$$ -222736 -35695 -276196 -138143 -40994 -103862 -118548 15033 220538 -138272 205633 220016
9026B20016D5414O9349M2538d58688a4272j5512C3022K1446a21968A30867b70289
$$ 220016 45414 114763 157301 -458688 -14272 -29784 33022 54468 -121968 130867 -270289
9014G4584c4743C11831j46307a7084j35668R4c8095I1346K08577f1477I4545a39372
$$ 74584 -34743 311831 165524 -17084 -152752 -152658 -38095 91346 299923 -61477 94545 -139372
9001h3876J4715b8337j00442C16K79027g5894j67805p07j71452a23560o7831a7006
$$ -83876 -69161 -28337 -128779 316 279343 -75894 -243699 -244406 -415858 -123560 -191391 -17006
8988b8443n7287r9334j87256C46988A73056a20787o3345f9855j32951H7809c424
$$ -28443 -85730 -185064 -372320 346988 173056 -120787 -184132 -69855 -202806 87809 -3424
8976a96219P9281A81588B4903L9714b70727B48550I2296i8147j1213A29729a68164
$$ -196219 -116938 181588 24903 64617 -270727 248550 92296 -98147 -109360 129729 -168164
8964G291K47432c74552G4675k38b47956A18678M5102a82416P7762o1310H9935
$$ 7291 254723 -374552 74675 74437 -247956 118678 163780 -182416 -104654 -165964 89935
8952D5589A6194M8938c9612j1724l9155C9960J37161P7614A12831C4107K019a00370
$$ 45589 16194 65132 -39612 -51336 -90491 39960 177121 254735 112831 34107 36126 -100370
8939B46090g4178A37864c3887j9526b4992q3753c5309A26496e9588r2862B57163
$$ 246090 -74178 137864 -33887 -53413 -24992 -108745 -35309 126496 -59588 -152450 257163
8927F8337a59581l7614A23116g5251o9205A21502c4528k233C16113j0136C5370
$$ 68337 -159581 -197195 123116 -75251 -144456 121502 -34528 -36761 316113 305977 35370
8915B21004E9044a86564C83026j23802K96594L67047N07286J126540J988919N710149
$$ 221004 59044 -186564 383026 259224 555818 922865 1430151 2556691 4545610 10255759
8905A0255759k649522C617599j448030A077263n08544B70100L09490k69818J53013
$$ 10255759 7606237 3617599 2169569 1077263 568719 270100 579590 309772 462785
8896D62785A02545B0322J33935K84761r1655a48803B92521k9552c18147H7990
$$ 462785 102545 20322 154257 439018 347363 -148803 292521 262969 -318147 87990
8885e3549A63853A2692b45028a06100A97850a77315O8312j8638M4109p2669g1971
$$ -53549 163853 12692 -245028 -106100 197850 -177315 -109003 -127641 -83532 -156201 -71971
8873b83283g1766I3507a20928j77898J18269G2125K86786i7736p0420N9402F6361
$$ -283283 -71766 93507 -120928 -298826 -180557 72125 358911 -97736 -168156 -108754 66361
8861A89177c2279n9053M4044I8272k1632c57373a40340j9067a8896A13468B1194
$$ 189177 -32279 -91332 -47288 98272 76640 -357373 -140340 -159407 -18896 113468 21194
8849c0712k26117F6661d31603g8421j02015J2886r7358L724J02687C0459d3827
$$ -30712 -256829 66661 -431603 -78421 -180436 -167550 -264908 -261184 -158497 30459 -43827
8837a55324j0778N067k28613F2805a85574a0970k87455a9152I6435a69398L8655
$$ -155324 -166102 -161035 -389648 62805 -185574 -10970 -298425 -19152 96435 -169398 -130743
8826a30743D2740b62514A63874a33941j08631B2515a03075F9568A4764a86996
$$ -130743 42740 -262514 163874 -133941 -242572 22515 -103075 69568 14764 -186996
8815H4389a44272C52291H3659a21o4524A8921c70997a80336L7584m0635j54694
$$ 84389 -144272 352291 83659 -121 -64645 18921 -370997 -180336 -142752 -183387 -338081
$$ [...]
##END NTUPLES=NMR SPECTRUM
##END=
