
##TITLE=AC1007_S-149_6114592_zZLpfeKMET
##JCAMPDX= 6.0         $$ Bruker NMR JCAMP-DX V2.0
##DATA TYPE= NMR SPECTRUM
##DATA CLASS= NTUPLES
##ORIGIN= BRUKER
##OWNER= Administrator
$$ 1.72 TOPSPIN		Version 2.1
$$ 2012-05-14 19:46:27.703 -0500  Administrator@TOPSPIN
$$ Compression mode = diff/dup
##.OBSERVE FREQUENCY= 400.13188235
##.OBSERVE NUCLEUS= ^1H
##.ACQUISITION MODE= SIMULTANEOUS (DQD)
##.ACQUISITION SCHEME= undefined
##.AVERAGES= 64
##.DIGITISER RES= 22
##SPECTROMETER/DATA SYSTEM= spect
##.PULSE SEQUENCE= noesygpps1d.comp
##.SOLVENT NAME= COFFEE_meoh
##.SHIFT REFERENCE= INTERNAL, COFFEE_meoh, 1, 14.96669
##AUDIT TRAIL= $$ (NUMBER, WHEN, WHO, WHERE, PROCESS, VERSION, WHAT)
$$ ##TITLE= Audit trail, TOPSPIN		Version 2.1
$$ ##JCAMPDX= 5.01
$$ ##ORIGIN= Bruker BioSpin GmbH
$$ ##OWNER= Administrator
$$ $$ C:\Bruker\TOPSPIN/data/COFFEE/nmr/AC1007_S-149_6114592_zZLpfeKMET/52/pdata/1/auditp.txt
$$ ##AUDIT TRAIL=  $$ (NUMBER, WHEN, WHO, WHERE, PROCESS, VERSION, WHAT)
(   1,<2012-05-14 19:46:23.000 -0500>,<Administrator>,<TOPSPIN>,<go>,<TOPSPIN 2.1>,
      <created by zg
	started at 2012-05-14 19:34:52.734 -0500,
	POWCHK enabled, PULCHK disabled,
       configuration hash MD5:
       AF F2 23 6B 01 CD 40 DD E5 A1 38 A0 06 EA F7 77
       data hash MD5: 64K
       72 B9 5D 4D F8 9E C5 68 8E 0C 65 8E B8 F7 CF 52>)
(   2,<2012-05-14 19:46:25.765 -0500>,<Administrator>,<TOPSPIN>,<proc1d>,<TOPSPIN 2.1>,
      <Start of raw data processing
       efp LB = 0.3 FT_mod = 6 PKNL = 1 PHC0 = 0 PHC1 = 0 SI = 128K 
       data hash MD5: 128K
       50 0D 0B 90 7A 1E DC 10 14 EA 0C 5F 3C 28 25 CE>)
(   3,<2012-05-14 19:46:26.984 -0500>,<Administrator>,<TOPSPIN>,<proc1d>,<TOPSPIN 2.1>,
      <pk PHC0 = 36.17798 PHC1 = 0 
       data hash MD5: 128K
       1E CA 17 BD D1 A2 85 2C 00 A6 C1 D0 5B BF FC 7F>)
(   4,<2012-05-14 19:46:27.203 -0500>,<Administrator>,<TOPSPIN>,<proc1d>,<TOPSPIN 2.1>,
      <abs ABSG = 1 
       data hash MD5: 128K
       94 E5 3D 73 73 94 39 ED 57 A1 BB C9 ED 73 E3 94>)
(   5,<2012-05-14 19:46:27.281 -0500>,<Administrator>,<TOPSPIN>,<proc1d>,<TOPSPIN 2.1>,
      <abs ABSG = 2 
       data hash MD5: 128K
       AC F0 37 37 39 ED B0 BD 6F 5C 9A 5F 3C 9A F3 12>)
(   6,<2012-05-14 19:46:27.359 -0500>,<Administrator>,<TOPSPIN>,<proc1d>,<TOPSPIN 2.1>,
      <abs ABSG = 3 
       data hash MD5: 128K
       7E A3 4D DB EB A2 C1 5B FF 1D 8D 0D 3B EE 66 51>)
(   7,<2012-05-14 19:46:27.562 -0500>,<Administrator>,<TOPSPIN>,<proc1d>,<TOPSPIN 2.1>,
      <abs ABSG = 4 
       data hash MD5: 128K
       F5 47 34 DA 8F 45 F8 8E 8F 05 84 EF 29 C7 9D BF>)
(   8,<2012-05-14 19:46:27.625 -0500>,<Administrator>,<TOPSPIN>,<proc1d>,<TOPSPIN 2.1>,
      <abs ABSG = 5 
       data hash MD5: 128K
       21 20 49 97 10 AA C5 F2 91 A4 93 DC 17 93 84 80>)
$$ ##END=
$$ 
$$ $$ hash MD5
$$ $$ 70 FD 41 2B 73 88 23 3F D3 82 E5 E8 52 AE EB 44
##$RELAX= 
##$RELAX= 
##$RELAX= 
##$RELAX= 
##$RELAX= 
##$RELAX= 
##$RELAX= 
##$RELAX= 
$$ Bruker specific parameters
$$ [...]
##$TP07= 0
##$TPNAME0= <>
##$TPNAME1= <>
##$TPNAME2= <>
##$TPNAME3= <>
##$TPNAME4= <>
##$TPNAME5= <>
##$TPNAME6= <>
##$TPNAME7= <>
##$TPOAL= (0..7)
0.5 0.5 0.5 0.5 0.5 0.5 0.5 0.5
##$TPOFFS= (0..7)
0 0 0 0 0 0 0 0
##$TUNHIN= 0
##$TUNHOUT= 0
##$TUNXOUT= 0
##$USERA1= <user>
##$USERA2= <user>
##$USERA3= <user>
##$USERA4= <user>
##$USERA5= <user>
##$V9= 5
##$VALIST= <valist>
##$VCLIST= <CCCCCCCCCCCCCCC>
##$VD= 0
##$VDLIST= <DDDDDDDDDDDDDDD>
##$VPLIST= <PPPPPPPPPPPPPPP>
##$VTLIST= <TTTTTTTTTTTTTTT>
##$WBST= 2048
##$WBSW= 25
##$XGAIN= (0..3)
0 0 0 0
##$XL= 0
##$YL= 0
##$YMAX_a= 11562454
##$YMIN_a= -6371515
##$ZGOPTNS= <>
##$ZL1= 120
##$ZL2= 120
##$ZL3= 120
##$ZL4= 120
##$ABSF1= 14.96669
##$ABSF2= -5.58584
##$ABSG= 5
##$ABSL= 3
##$ALPHA= 0
##$AQORDER= 0
##$ASSFAC= 0
##$ASSFACI= 0
##$ASSFACX= 0
##$ASSWID= 0
##$AUNMP= <proc_prof1d_extract.lims>
##$AXLEFT= 0
##$AXNAME= <>
##$AXNUC= <1H>
##$AXRIGHT= 0
##$AXTYPE= 0
##$AXUNIT= <>
##$AZFE= 0.1
##$AZFW= 0.1
##$BCFW= 0
##$BC_mod= 0
##$BYTORDP= 0
##$COROFFS= 0
##$CY= 15
##$DATMOD= 1
##$DC= 0
##$DFILT= <>
##$DTYPP= 0
##$F1P= 0
##$F2P= 0
##$FCOR= 0.5
##$FTSIZE= 131072
##$FT_mod= 6
##$GAMMA= 0
##$GB= 0
##$INTBC= 1
##$INTSCL= 1
##$ISEN= 128
##$LB= 0.3
##$LEV0= 0
##$LPBIN= 0
##$MAXI= 10000
##$MC2= 0
##$MEAN= 0
##$ME_mod= 0
##$MI= 0
##$NCOEF= 0
##$NC_proc= -3
##$NLEV= 6
##$NOISF1= 0
##$NOISF2= 0
##$NSP= 0
##$NTH_PI= 0
##$NZP= 0
##$OFFSET= 14.96669
##$PC= 1
##$PHC0= 36.17798
##$PHC1= 0
##$PH_mod= 1
##$PKNL= yes
##$PPARMOD= 0
##$PPDIAG= 0
##$PPIPTYP= 0
##$PPMPNUM= 2147483647
##$PPRESOL= 1
##$PSCAL= 4
##$PSIGN= 0
##$PYNMP= <proc.py>
##$REVERSE= no
##$SF= 400.130005568449
##$SI= 131072
##$SIGF1= 0
##$SIGF2= 0
##$SINO= 400
##$SIOLD= 131072
##$SPECTYP= <>
##$SREGLST= <1H.CDCl3>
##$SSB= 0
##$STSI= 131072
##$STSR= 0
##$SW_p= 8223.68421052632
##$SYMM= 0
##$S_DEV= 0
##$TDeff= 65536
##$TDoff= 0
##$TI= <>
##$TILT= no
##$TM1= 0
##$TM2= 0
##$TOPLEV= 0
##$USERP1= <user>
##$USERP2= <user>
##$USERP3= <user>
##$USERP4= <user>
##$USERP5= <user>
##$WDW= 1
##$XDIM= 131072
##$YMAX_p= 449819265
##$YMIN_p= -92708057
##$CURPLOT= <Network HP LaserJet P1505>
##$CURPRIN= <$Network HP LaserJet P1505>
##$DFORMAT= <normdp>
##$LAYOUT= <+/1D_H.xwp>
##$LFORMAT= <normlp>
##$PFORMAT= <normpl>
##$SURQMSG= 1
$$ End of Bruker specific parameters
$$ ---------------------------------
##NTUPLES= NMR SPECTRUM
##VAR_NAME=  FREQUENCY,     SPECTRUM/REAL,   SPECTRUM/IMAG
##SYMBOL=    X,             R,               I
##VAR_TYPE=  INDEPENDENT,   DEPENDENT,       DEPENDENT
##VAR_FORM=  AFFN,          ASDF,            ASDF
##VAR_DIM=   131072,        131072,          131072
##UNITS=     HZ,            ARBITRARY UNITS, ARBITRARY UNITS
##FACTOR=    0.0627417313425165, 1,          1
##FIRST=     8223.62146879498, -5618,        -116576
##LAST=      0,             -2329,           -118786
##MIN=       0,             -92708057,       0
##MAX=       8223.62146879498, 449819265,    0
$$ Real data points
##PAGE= N=1
##DATA TABLE= (X++(R..R)), XYDATA
$$ [...]
61347F74865Q07o06k156l286l370k261n62Q95J528J043m57k223l184k830j515
61332F56688J41J690K674K725K110J542J198N75l02l97Q58K369K651J835J369
61317F77726J962K919L446L447K918J716L91K28J821M116N430M939K990P14l98
61302G14365N47K681M037L956L932N226O741O649N257M508N045N780O445Q360
61288G83529J1781J4425J4174J2009J0626J0811J0955R764P803O107M846L919
61276I00749L723M497N589O164O107N714M922L646K457K098K314K043P87p60j725
61261I48325k003j873j207K33K107L730M946O048O845O598N283M279N091P642
61247I96044J0447J2335J3373J4110J4694J5057J5337J5499J4817J2435Q469M108
$$ y = [674865, 675672, 675066, 672910, 669624, 666254, 663993, 663431, 664326, 665854, 666897, 666440, 664217, 661033, 658203, 656688, 656829, 658519, 661193, 663918, 666028, 667570, 668768, 669343, 669041, 668644, 669502, 671871, 674522, 676357, 677726, 679688, 682607, 686053, 689500, 692418, 694134, 694525, 694753, 696574, 700690, 706120, 711059, 714049, 714763, 714365, 714912, 717593, 721630, 725586, 729518, 734744, 741485, 748134, 753391, 757899, 762944, 768724, 775169, 783529, 795310, 809735, 823909, 835918, 846544, 857355, 868310, 878074, 885877, 891984, 896830, 900749, 904472, 908969, 914558, 920722, 926829, 932543, 937465, 941111, 943568, 945666, 947980, 950023, 950810, 950050, 948325, 946322, 944449, 943242, 943475, 945582, 949312, 954258, 960306, 967151, 973749, 979032, 983311, 988402, 996044, 1006491, 1018826, 1032199, 1046309, 1061003, 1076060, 1091397, 1106896, 1121713, 1134148, 1142617, 1146725]
61235A146725M76k283m705p109r256j0757j1533j1840j1981j2019j1814j1276
61223A042628j0620j0087r463q118n921l862l186l689l626j738J060K861L256
61210I89495L636M915O194O292N513M877M393L440K510K912M606N913O081O698
61196A057475R283J2411J3008J0323O978N614N846N525M012K780K911L452K900
61183A142518J449N99Q69J002j67j943k621j691l91j52j206k775l949m098k957
61168A124487q00J697L911N484O173O085O146P517R948J1481J0568Q103O424O538
61154A213762P362P744P980Q822R913J0154R170P567N915M333L042K510K867L795
61140A304936N256P564J0347J2174J2078J0954J0530J1172J1701J1371J0861J0848
$$ y = [1146725, 1147201, 1144918, 1140213, 1133104, 1123848, 1113091, 1101558, 1089718, 1077737, 1065718, 1053904, 1042628, 1032008, 1021921, 1012458, 1004340, 998419, 994557, 991371, 987682, 984056, 982318, 983378, 986239, 989495, 993131, 998046, 1004240, 1010532, 1016045, 1020922, 1025315, 1028755, 1031265, 1034177, 1038783, 1044696, 1050777, 1057475, 1066758, 1079169, 1092177, 1102500, 1109478, 1115092, 1120938, 1126463, 1130475, 1133255, 1136166, 1139618, 1142518, 1143967, 1144566, 1145435, 1146437, 1146270, 1144327, 1141706, 1140015, 1139624, 1139472, 1138266, 1135491, 1131542, 1127444, 1124487, 1123687, 1125384, 1129295, 1134779, 1140952, 1147037, 1153183, 1160700, 1170648, 1182129, 1192697, 1200800, 1207224, 1213762, 1221124, 1228868, 1236848, 1245670, 1255583, 1265737, 1274907, 1282474, 1288389, 1292722, 1295764, 1298274, 1301141, 1304936, 1310192, 1317756, 1328103, 1340277, 1352355, 1363309, 1373839, 1385011, 1396712, 1408083, 1418944, 1429792]
61128A429792J0766R719P888O083M435K530M15j437k889l980m229l232j865j740
61114A452256l288n357o817p478p345o362n378n924q224j0526j1372j1423j1966
61101A350796j2825j3259j3911j5887j8228j8461j6000j3186j2241j2710j2943
61090A191145j2691j2710j2552j0589o483k359p70k165m925p536r835j2110j3764
61077A082656j3575j1132p439l997j624j92R20K292M004N415N748N138M861O208
61063A079283R273J3037J6412J9021K1171K3242K5090K6222K6753K7675K9552
61052A316731L1358L1731L1177L1553L3118L3780L2077K9380K7836K7448K6726
61041A652915K5252K3714K1898J8487J2938O177n58o357j0375j2355j3456j5282
$$ y = [1429792, 1440558, 1450277, 1458165, 1464248, 1468683, 1471213, 1471628, 1470191, 1467302, 1463322, 1459093, 1455861, 1453996, 1452256, 1448968, 1443611, 1436794, 1429316, 1421971, 1415609, 1410231, 1404307, 1396083, 1385557, 1374185, 1362762, 1350796, 1337971, 1324712, 1310801, 1294914, 1276686, 1258225, 1242225, 1229039, 1216798, 1204088, 1191145, 1178454, 1165744, 1153192, 1142603, 1136120, 1133761, 1132991, 1130826, 1125901, 1118365, 1108530, 1096420, 1082656, 1069081, 1057949, 1050510, 1046513, 1044889, 1044697, 1045617, 1047909, 1051913, 1057328, 1063076, 1068214, 1073075, 1079283, 1088556, 1101593, 1118005, 1137026, 1158197, 1181439, 1206529, 1232751, 1259504, 1287179, 1316731, 1348089, 1379820, 1410997, 1442550, 1475668, 1509448, 1541525, 1570905, 1598741, 1626189, 1652915, 1678167, 1701881, 1723779, 1742266, 1755204, 1761381, 1760823, 1754466, 1744091, 1731736, 1718280, 1702998]
61029A702998j8065k0789k2910k4590k5579k5483k5135k5848k7112k6819k4382
61018A436286k1752k0644k0369j9443j7730j5822j3551j0536p375n031l604k537
61006A277892j414K28K959O431R104J0053J0356J1667J4042J6227J7643J8960
60994A394148K0959K3755K6975L0018L2369L4293L6878M0709M4894M8073N0131
60983A783202N2192N5152N8838O2614O6261P0175P4804P9985Q5034Q9731R4683
60972B572671J00153J05251J09432J14235J21775J31527J40610J47555J53799
60963C697008J60916J68538J76171J85065J96896K12202K31466K55966K86010
60954E570238L19890L56261L95920M39657M86471N36191N92026O57755P33840
$$ y = [1702998, 1684933, 1664144, 1641234, 1616644, 1591065, 1565582, 1540447, 1514599, 1487487, 1460668, 1436286, 1414534, 1393890, 1373521, 1354078, 1336348, 1320526, 1306975, 1296439, 1289064, 1284033, 1280429, 1277892, 1276478, 1276706, 1279665, 1286096, 1295200, 1305253, 1315609, 1327276, 1341318, 1357545, 1375188, 1394148, 1415107, 1438862, 1465837, 1495855, 1528224, 1562517, 1599395, 1640104, 1684998, 1733071, 1783202, 1835394, 1890546, 1949384, 2011998, 2078259, 2148434, 2223238, 2303223, 2388257, 2477988, 2572671, 2672824, 2778075, 2887507, 3001742, 3123517, 3255044, 3395654, 3543209, 3697008, 3857924, 4026462, 4202633, 4387698, 4584594, 4796796, 5028262, 5284228, 5570238, 5890128, 6246389, 6642309, 7081966, 7568437, 8104628, 8696654, 9354409, 10088249]
60945A0088249Q19033R14451J023089J147125J289660J458070J660887J899970
60937B0300534K165079K427291K625112K660659K437390J933875J251655N78422
60929C6380017Q6167j50163j55645q580J89706L13854K30259j39220p50837j444975
60919C4550583k035322k407439k550251k518234k379302k188772j985337j791262
60911A6694664j613835j451422j299995j155659j016237q84104p65441o64445
60903G843526n80015n09449m52153m07034l69284l33748l00120k71308k47601
60894D372814k25940k04534j84752j67973j53511j40566j29961j22620j17682
60885B925275j13157j07684j01157r4328q8181q3170p8941p5071p1685o8763o5459
$$ y = [10088249, 10907282, 11821733, 12844822, 13991947, 15281607, 16739677, 18400564, 20300534, 22465613, 24892904, 27518016, 30178675, 32616065, 34549940, 35801595, 36380017, 36466184, 36316021, 36160376, 36151796, 36341502, 36655356, 36885615, 36746395, 35995558, 34550583, 32515261, 30107822, 27557571, 25039337, 22660035, 20471263, 18485926, 16694664, 15080829, 13629407, 12329412, 11173753, 10157516, 9273412, 8507971, 7843526, 7263511, 6754062, 6301909, 5894875, 5525591, 5191843, 4891723, 4620415, 4372814, 4146874, 3942340, 3757588, 3589615, 3436104, 3295538, 3165577, 3042957, 2925275, 2812118, 2704434, 2603277, 2508949, 2420768, 2337598, 2258657, 2183586, 2111901, 2043138, 1977679]
60874A977679o1044n6222n2498n0367m8898m7036m4616m2263m0730m0014l8921
60863A455070l6090l1846k8134k6207k5368k4538k3670k2750k0874j7751j4873
60852A182969j3504j2631j0677q322p503q198q477p519o465o054n447l888j993
60839A082291p89o01j218k110k484k185k398m140o264o681n497n132o920r366
60825A026506j0598j0864j1538j2935j4199j4618j4159j3182j2327j2110j2247
60814H87729j1872j0739r503q590p745o970o999q140r382r332p621m947k232o3
60800G83594J438K556L532M067L678K517J357P23O17R95J856K823L258K872J841
60785H17724N74j53O35K856M699M362K231K01q18j427k072k392k276k099j756
$$ y = [1977679, 1916635, 1860413, 1807915, 1757548, 1708650, 1661614, 1616998, 1574735, 1534005, 1493991, 1455070, 1418980, 1387134, 1359000, 1332793, 1307425, 1282887, 1259217, 1236467, 1215593, 1197842, 1182969, 1169465, 1156834, 1146157, 1137835, 1130332, 1122134, 1113657, 1106138, 1099673, 1093619, 1088172, 1084284, 1082291, 1081502, 1080901, 1079683, 1077573, 1075089, 1072904, 1070506, 1066366, 1060102, 1053421, 1047924, 1042792, 1035872, 1026506, 1015908, 1005044, 993506, 980571, 966372, 951754, 937595, 924413, 912086, 899976, 887729, 875857, 865118, 855615, 847025, 839280, 832310, 825311, 817171, 807789, 798457, 790836, 785889, 783657, 783594, 785032, 787588, 791120, 795187, 798865, 801382, 802739, 803462, 804079, 805074, 806930, 809753, 813011, 815883, 817724, 818298, 818145, 818780, 821636, 826335, 830697, 832928, 833129, 832311, 830884, 828812, 826420, 824144, 822045, 820289]
60770H20289j025q08k249m457n148m036l356m209m720l323j653k098m042m968
60756G74197m262l562l776m106m048m369n628p199q230q417p570n617l469k782
60742G01162m177o397p724p727p122o510n849n014m306m183m637n014m552l079
60728F24871j060R57K651L729L867K946J194q65k296j984K47K803L554K204N92
60713F43410L63J252K179L027M368O049P062O771N599M486M048M179M243L780
60699G00816L078K681K355J177j141l629n134n426m966m199l462l004k772k576
60685F73798k565k855k791j663k57l99k489m826n998o441o777o209m139k049j959
60670F22381l698n383o149o591o881o244m592l081k582k717k741k453j887r39
$$ y = [820289, 819264, 818456, 816207, 811750, 806602, 802566, 799210, 795001, 790281, 786958, 785305, 783207, 779165, 774197, 769935, 766373, 762597, 758491, 754443, 750074, 744446, 737247, 729017, 720600, 713030, 707413, 703944, 701162, 696985, 690588, 682864, 675137, 668015, 661505, 655656, 650642, 646336, 642153, 637516, 632502, 627950, 624871, 623811, 624768, 627419, 631148, 635015, 637961, 639155, 638290, 635994, 634010, 634257, 637060, 640614, 642818, 643410, 643773, 645025, 647204, 650231, 654599, 660648, 667710, 674481, 680080, 684566, 688614, 692793, 697036, 700816, 703894, 706575, 708930, 710107, 708966, 705337, 700203, 694777, 689811, 685612, 682150, 679146, 676374, 673798, 671233, 668378, 665587, 663924, 663667, 663268, 660779, 655953, 649955, 643514, 636737, 630528, 626389, 624340, 622381, 618683, 613300, 607151, 600560, 593679, 587435, 582843, 579762, 577180, 574463, 571722, 569269, 567382, 566443]
60656E66443K54J113J136L48o95j153m90Q18J656J809K420M169N887O030M839
60641E94584L803L486L391L559M595O068O579N667M343L427K754K357K883M188
60627F51684M898M217L039K406J929R06k1L29J593K072J107L0K95J445J776O69
60611F78374n74n36L89N50o17j877k044j633j946l217m665n906p101p843p131
60596F34223m797k053k15N92J067J567J780J360N97K96Q40J547J512J069J485
60581F40870K852L353J598j331l362m136m683n141m688l602l296l893l612j434
60567F09495J084J816P53l61m87j83l23p63o26L88J298Q35q18k062k001j515j324
60550F05206k81K669N765O011L282N19m08n98j277j567m23J267K087K117K013
$$ y = [566443, 566697, 567810, 568946, 569294, 568599, 567446, 566956, 567774, 569430, 571239, 573659, 577828, 583715, 589745, 594584, 598387, 601873, 605264, 608823, 613418, 619486, 626065, 631732, 636075, 639502, 642256, 644613, 647496, 651684, 656582, 660799, 663838, 666244, 668173, 669079, 669058, 669387, 670980, 673052, 674159, 674189, 674484, 675929, 677705, 678374, 677800, 677264, 677653, 678203, 677586, 675709, 673665, 672032, 670086, 666869, 662204, 656298, 649197, 641354, 634223, 629426, 627373, 627158, 627750, 628817, 630384, 632164, 633524, 634121, 634417, 635257, 636804, 638316, 639385, 640870, 643722, 647075, 648673, 647342, 643980, 639844, 635161, 630020, 625332, 621730, 618434, 614541, 610929, 609495, 610579, 612395, 613148, 612787, 612300, 612117, 611794, 611031, 610405, 610793, 612091, 612926, 612108, 610046, 608045, 606530, 605206, 604925, 607594, 613359, 619370, 622652, 623171, 622763, 622165, 620888, 619321, 618898, 620165, 622252, 624369, 626382]
60535F26382J645J043J365L053M326L426J460R89K379L585L273K246J702J776
60521F58650K076K365K434K301K585L787N323O199O482P003P905Q639R349J0844
60507G35942J3033J4649J4876J4340J4048J4096J3769J2302R470N907K859R35
60495H66226o26k726m738n113l512j221O81K332M122N863P388Q981J0691J2093
60481I00441J3179J4624J6715J8785K0292K1658K3407K5100K5742K4761K2050
60470A126754J7666J2077O309J260k787n619o789o506o172p029q599r331q600
60457A102634p221o083n222m309l111j274J491M533O429O693O753Q375J1617J5115
60443A136420J8202K1635K6198L1603L7169M2669M7880N2095N4941N7130N9391
$$ y = [626382, 628027, 629070, 630435, 633488, 637814, 641240, 642700, 643689, 646068, 649653, 652926, 655172, 656874, 658650, 660726, 663091, 665525, 667826, 670411, 674198, 679521, 685720, 692202, 699205, 707110, 715749, 725098, 735942, 748975, 763624, 778500, 792840, 806888, 820984, 834753, 847055, 856525, 862432, 865291, 866226, 865600, 862874, 858136, 853023, 849511, 848290, 848971, 851303, 855425, 861288, 868676, 877657, 888348, 900441, 913620, 928244, 944959, 963744, 984036, 1005694, 1029101, 1054201, 1079943, 1104704, 1126754, 1144420, 1156497, 1162806, 1164066, 1161279, 1155660, 1148871, 1142365, 1136193, 1129164, 1120565, 1111234, 1102634, 1095413, 1089330, 1084108, 1079799, 1076688, 1075414, 1076905, 1081438, 1087867, 1094560, 1101313, 1109688, 1121305, 1136420, 1154622, 1176257, 1202455, 1234058, 1271227, 1313896, 1361776, 1413871, 1468812, 1525942, 1585333]
60432A585333O0997O0414N7212N2282M6181L8493K9050J8511P213n308j8778l1253
60420A900347m0928m8236n4941o1492o6433o8331o7177o3925n9697n5631n2505
60409A261051n0041m7133m3168l8695l4616l1233k8351k5806k3490k1102j8271
60398H99145j5026j2103j0587j0857j1805j1632r892q207q270r569j0094r089
60386G72014p883p761q164p715o268m939m444m231l349j665M4Q79M90q61k468
60371G13679l335k595m44J468J326q28k983l405k390j313p67n25o22j157j403
60356F94706m44J293K416K517K432K372J417m56j442j75K152L341L098K936L619
60341G19782M229L883L040K706L236M239N033M900L614J980J284J836K680L001
$$ y = [1585333, 1646330, 1706744, 1763956, 1816238, 1862419, 1900912, 1929962, 1948473, 1955686, 1950378, 1931600, 1900347, 1859419, 1811183, 1756242, 1694750, 1628317, 1559986, 1492809, 1428884, 1369187, 1313556, 1261051, 1211010, 1163877, 1120709, 1082014, 1047398, 1016165, 987814, 962008, 938518, 917416, 899145, 884119, 872016, 861429, 850572, 838767, 827135, 817243, 809036, 800766, 791197, 781103, 772014, 764131, 756370, 748206, 740491, 734223, 729284, 724840, 720609, 717260, 715595, 715639, 716518, 717008, 716147, 713679, 710344, 707749, 707305, 708773, 710099, 709271, 706288, 702883, 700493, 699180, 698413, 697888, 697266, 696109, 694706, 694262, 695555, 697971, 700488, 702920, 705292, 706709, 706253, 704811, 704636, 706788, 710129, 713227, 716163, 719782, 724011, 727894, 730934, 733640, 736876, 741115, 746148, 751048, 754662, 756642, 757926, 759762, 762442, 765443]
60327G65443L173L808M526M527M095M377N591O448N863M397L320K914K750L089
60313H24321M702P138Q598Q110O690N557M269J958m37r31O14K096K014J284J492
60298H77475K685L859M729N789P131Q329R216R893J0123R569Q557P734P058N993
60284I78140M628L725L316K236m05l882o533p474p135o501o274o605p069o945
60270I33222n934m606l823l801m036m190m559n460o440o473n001k662q13k02p6
60255H75146J124L941P063Q696Q671Q628J0015J2643J5449J7927K0116K1839K2801
60242A034059K3178K3110K1834J8349J2904O776M20o793j4582k0875k3992k4623
60230A049765k4467k3769k1643j8212j4733j1773q923o514n816o836p505o182
$$ y = [765443, 768616, 772424, 776950, 781477, 785572, 789949, 795540, 801988, 807851, 812248, 815568, 818482, 821232, 824321, 829023, 836161, 844759, 852869, 859559, 865116, 869385, 871343, 870906, 869975, 870589, 872685, 874699, 875983, 877475, 880160, 884019, 888748, 894537, 901668, 909997, 919213, 929106, 939229, 948798, 957355, 965089, 972147, 978140, 982768, 986493, 989809, 992045, 991640, 987758, 981225, 973751, 966616, 960115, 953841, 947236, 940167, 933222, 927288, 922682, 918859, 915058, 911022, 906832, 902273, 896813, 890373, 883900, 878899, 876237, 875424, 875222, 875146, 876270, 880211, 887274, 895970, 904641, 913269, 923284, 935927, 951376, 969303, 989419, 1011258, 1034059, 1057237, 1080347, 1102181, 1120530, 1133434, 1140210, 1140630, 1133837, 1119255, 1098380, 1074388, 1049765, 1025298, 1001529, 979886, 961674, 946941, 935168, 926245, 919731, 913915, 907079, 899574, 893392]
60218H93392l999l397m871o496o423m837l194k464k480k612k604k754l369m250
60204H39642m896n095m908m242l128k492l556n913p182n631k497n25n68j036n92
60189G87381K76P70J278K268K959K376J092M81P05Q58R29J883L519L966K300L32
60173H13373M11K256L483K862J535R83J300J939K889M252N350N288M180L260L751
60158H57112N727P929Q644P256N095M281N620Q019J0007J1076J1423J1311J1233
60145I64733J1741J2488J2116J0023P607O875Q224J0285J1654J1792J0732Q858
60133A087128O997N848N389N227N240N207M413K579P01k06p77k430m982o623o434
60118A107277n686o121p940r890j0594r506p342n639n261n419m951m199m341n130
$$ y = [893392, 889393, 885996, 881125, 874629, 868206, 863369, 860175, 857711, 855231, 852619, 850015, 847261, 843892, 839642, 834746, 829651, 824743, 820501, 817373, 814881, 811325, 805412, 798230, 792599, 790102, 789577, 789009, 787973, 787381, 787657, 788427, 789705, 791973, 794932, 797308, 798400, 798881, 799586, 800444, 801373, 803256, 806775, 810741, 813041, 813373, 813784, 816040, 819523, 822385, 823920, 824903, 826203, 828142, 831031, 835283, 840633, 845921, 850101, 853361, 857112, 862839, 870768, 879412, 886668, 891763, 896044, 901664, 909683, 919690, 930766, 942189, 953500, 964733, 976474, 988962, 1001078, 1011101, 1018708, 1025583, 1033807, 1044092, 1055746, 1067538, 1078270, 1087128, 1094125, 1099973, 1105362, 1110589, 1115829, 1121036, 1125449, 1128028, 1128729, 1128523, 1127746, 1125316, 1120334, 1113711, 1107277, 1101591, 1095470, 1087530, 1077640, 1067046, 1057540, 1050198, 1044559, 1039298, 1033879, 1028928, 1024729, 1020388, 1015258]
60104A015258n098m037l466m039m355l273j748j160j309j350j422j788j528J72
60090I80857K151K471J019m99q86l27O81J834K514K244J666J888K890L741M373
60075A006617N681P726R224R365Q922Q928R199Q954Q133P304O696O088N473N248
60061A113558N571N889N356L846K356J913K149J704M26J28K231N396O890N938
60047A163351M258L289K546J195k19p85q54j523k901m041m434m662n371o240o300
60032A137309n037l073j686j655k514l122k994k821l503n004o357o702o017m904
60018A081920l868k934j941j048p86j544l237n368p282q363q491q463r417j1490
60004A007688j3510j4369j4144j3374j1908r444o783n408n730o618o825o057m665
$$ y = [1015258, 1010160, 1006123, 1002657, 998618, 994263, 990990, 989242, 988082, 986773, 985423, 984001, 982213, 980685, 980857, 983008, 985479, 986498, 985999, 985113, 984786, 985467, 987301, 989815, 992059, 993725, 995613, 998503, 1002244, 1006617, 1012298, 1020024, 1029248, 1038613, 1047535, 1056463, 1065662, 1074616, 1082749, 1090053, 1096749, 1102837, 1108310, 1113558, 1119129, 1125018, 1130374, 1134220, 1136576, 1138489, 1140638, 1142342, 1142768, 1142896, 1145127, 1150523, 1157413, 1163351, 1167609, 1170898, 1173444, 1174639, 1174420, 1173635, 1172781, 1171258, 1168357, 1164316, 1159882, 1155220, 1149849, 1143609, 1137309, 1132272, 1129199, 1127513, 1125858, 1123344, 1120222, 1117228, 1114407, 1110904, 1105900, 1099543, 1092841, 1086824, 1081920, 1078052, 1075118, 1073177, 1072129, 1071343, 1069799, 1066562, 1061194, 1053912, 1045549, 1037058, 1028595, 1019178, 1007688, 994178, 979809, 965665, 952291, 940383, 930939, 924156, 918748, 913018, 906400, 899575, 893518, 888853]
59991H88853l147k175k166k459j757K34K330L430L744L952M032L745L629M479
59977I06724O104P518Q168Q256P974P357O803O830P015O125L740J092l57p34j443
59962I81172l290n658p551q750r676j0700j1911j3217j4253j4468j3692j2462
59950H55544j1489j0988j0760j0570r943q073m827j643n09j824m017n314n057
59937G70530l383p79J586K382J752J384K231L212L212L084M212N966O556N907
59923H07852N636O187N957L885J165m28o25j57O48J664K164J309q42l335n055
59908H26025n236l891k148j395j658j552k23J580K894L934N238O267O020M454
59894H40309K337J68j807k900k511j195k22j63o62j378k139k382j480K43J668
$$ y = [888853, 885706, 883531, 881365, 878906, 877149, 877383, 879713, 883143, 886887, 890839, 894871, 898616, 902245, 906724, 912828, 920346, 928514, 936770, 944744, 952101, 958904, 965734, 972749, 978874, 982614, 983706, 983349, 982615, 981172, 977882, 972224, 964673, 955923, 946247, 935547, 923636, 910419, 896166, 881698, 868006, 855544, 844055, 833067, 822307, 811737, 801794, 793721, 788894, 787251, 786742, 784918, 780901, 775587, 770530, 767147, 766368, 767954, 770336, 772088, 773472, 775703, 778915, 782127, 785211, 789423, 795389, 801945, 807852, 813488, 819675, 825632, 829517, 830682, 830254, 829629, 829472, 830120, 831784, 833948, 835257, 834415, 831080, 826025, 820789, 816898, 814750, 813355, 811697, 810145, 809922, 811502, 814396, 818330, 823568, 829835, 835855, 840309, 842646, 842814, 841007, 838107, 835596, 834401, 834179, 834016, 833354, 831976, 829837, 827455, 825975, 826218, 827886]
59879H27886K111J699O96n12r78l2J269R47j139k632j706N30J736J617J996M067
59863H37555O978R214J0189J0238R892R484Q885P461M957K398J316J859K602K507
59849I25535K166K527L342L727L618L617L837L918L970M521N530O310O417N857
59835I84892M571K737J479K026L920N268N266N229O386P899Q151P130O222O173
59821A057349O470O510O335O208O404P190Q313Q660P429N346L786K826J324j065
59807A133085l161l988m120m680n737o376n982m834l693l127l136l204k699j356
59793A076992O14K630L930M167M141N252P687R869J0459J0120J0045R533O792
59780A162231K091j860l094k420j646j347j280j727l061m834o362p700r096j0037
$$ y = [827886, 829997, 831696, 832392, 831880, 830902, 830870, 832139, 833086, 831947, 829315, 827609, 828139, 829875, 831492, 833488, 837555, 844533, 853747, 863936, 874174, 884066, 893550, 902435, 909896, 914853, 917251, 918567, 920426, 923028, 925535, 927701, 930228, 933570, 937297, 940915, 944532, 948369, 952287, 956257, 960778, 966308, 972618, 979035, 984892, 989463, 992200, 993679, 995705, 999625, 1004893, 1010159, 1015388, 1021774, 1029673, 1037824, 1044954, 1051176, 1057349, 1063819, 1070329, 1076664, 1082872, 1089276, 1096466, 1104779, 1113439, 1120868, 1126214, 1130000, 1132826, 1134150, 1133085, 1129924, 1125936, 1121816, 1117136, 1111399, 1105023, 1099041, 1094207, 1090514, 1087387, 1084251, 1081047, 1078348, 1076992, 1077606, 1080236, 1084166, 1088333, 1092474, 1097726, 1105413, 1115282, 1125741, 1135861, 1145906, 1155439, 1162231, 1164322, 1162462, 1159368, 1156948, 1155302, 1153955, 1152675, 1150948, 1147887, 1143053, 1136691, 1128991, 1119895, 1109858]
59766A109858r861r001q697r495j0680j1113j0272q555o891n923n534n408n822
59753A002606p154q697q970p461n195l352k263j968k549l404l379k339j533j672
59739I42670j901j525j415k525m073m617m033l017j530P20K843L482K591J175
59725I28845k30j422j529l5J517Q97j636l396k861j367n90j40J191L062L862K858
59709I29026J108L44J315L077L879L148K322L185N649Q019R113R076Q415P573
59695I95249P384Q466J0031J0718J0712J1419J2892J3565J3215J3928J6732J9212
59683A143523J8383J4733J1378J0045R923R947J0062J0047Q951O359L043N2j968
59670A254478k504j462J3Q3j783m228n830o711p742q850q959p451n091l470l635
$$ y = [1109858, 1099997, 1090996, 1082299, 1072804, 1062124, 1051011, 1040739, 1032184, 1025293, 1019370, 1013836, 1008428, 1002606, 995452, 986755, 977785, 970324, 965129, 961777, 959514, 957546, 954997, 951593, 948214, 945875, 944342, 942670, 940769, 939244, 937829, 935304, 931231, 926614, 922581, 919564, 918034, 918754, 921597, 925079, 927670, 928845, 928615, 927193, 925664, 925629, 927146, 928043, 926407, 923011, 920150, 918783, 918193, 918053, 919244, 922306, 926168, 929026, 930134, 930478, 931793, 934870, 938749, 941897, 944219, 947404, 953053, 961072, 970185, 979261, 987676, 995249, 1002633, 1011099, 1021130, 1031848, 1042560, 1053979, 1066871, 1080436, 1093651, 1107579, 1124311, 1143523, 1161906, 1176639, 1188017, 1198062, 1207985, 1217932, 1227994, 1238041, 1246992, 1253351, 1256394, 1256446, 1254478, 1251974, 1250512, 1250525, 1250608, 1248825, 1244597, 1238767, 1232056, 1224314, 1215464, 1206505, 1199054, 1193963, 1190493, 1186858]
59655A186858n236o876p442o962o167n490m948m585m347l728k387j094j062k154
59641A124380k737j798k61M46K21j49m17o56j69J874M683O108N070K662M27j366
59625A138318l048m317m690m568m661m798m401l837m031m826n085m652m842o369
59611A074193q020q334p641p208p151o543n310m430m216l778k747k254l235m628
59597I98698m458k408k43M29p4l05M90J989L763N697P330P573N706K432n80k268
59581A023771k932l499m509n846p036p487o869n557m430l982l958m069m518n364
59567I53715n818n026l390k329k586l480m122m641n687p062p583o406m100k184
59553H89301j745k624l773m199l592k331j159o49o74m89L42J205J080p6j134j171
$$ y = [1186858, 1181622, 1174746, 1167304, 1160342, 1154175, 1148685, 1143737, 1139152, 1134805, 1131077, 1128690, 1127596, 1126534, 1124380, 1121643, 1119845, 1119584, 1120030, 1120251, 1120102, 1119685, 1119029, 1118860, 1120734, 1125417, 1131525, 1136595, 1139257, 1139684, 1138318, 1135270, 1130953, 1126263, 1121695, 1117034, 1112236, 1107835, 1103998, 1099967, 1095141, 1090056, 1085404, 1080562, 1074193, 1066173, 1057839, 1050198, 1042990, 1035839, 1029296, 1023986, 1019556, 1015340, 1011562, 1008815, 1006561, 1003326, 998698, 994240, 991832, 991589, 992018, 991944, 991639, 992129, 994118, 997881, 1003578, 1010908, 1018481, 1024187, 1026619, 1026039, 1023771, 1020839, 1017340, 1012831, 1006985, 999949, 992462, 985593, 980036, 975606, 971624, 967666, 963597, 959079, 953715, 947897, 942871, 939481, 937152, 934566, 931086, 926964, 922323, 916636, 909574, 901991, 895585, 891485, 889301, 887556, 884932, 881159, 876960, 873368, 871037, 869878, 869229, 868555, 868066, 868408, 869613, 870693, 870617, 869483, 868312]
59537H68312m84R3L40N91J004J446J966K674L246L075J982M34r91k056k809l279
59521H75544l295k523q72J001J907J133q81k983m242m367l682k970k807k890k440
59506H45633j532j222k003k938l067k794k937l138k444r40N25J836L397M589M048
59491H37013J797k94o78L49J744L049M050M314M094M732P045R908J1532J1808
59477I00463J2330J4186J6717J8585J9136J8211J5324J0037L296k446n211n377
59465A015251m928m909m614l445k132j273l8K149L632K341q12k604j859r16k013
59450I93830m357o064p139q605j0025j0040q914q449r300j0007r146p189n652
59437H88943n244n456n461m920l980k830j476j01N55r9j346j526j19J419J748
$$ y = [868312, 867828, 867921, 868261, 868852, 869856, 871302, 873268, 875942, 879188, 882263, 884245, 884679, 883688, 881632, 878823, 875544, 872249, 869726, 868854, 869855, 871762, 872895, 872014, 869031, 864789, 860422, 856740, 853770, 850963, 848073, 845633, 844101, 842879, 840876, 837938, 834871, 832077, 829140, 826002, 823558, 822618, 823143, 824979, 828376, 832965, 837013, 838810, 838516, 837838, 838187, 839931, 842980, 847030, 851344, 855438, 860170, 867215, 877123, 888655, 900463, 912793, 926979, 943696, 962281, 981417, 999628, 1014952, 1024989, 1028285, 1025839, 1020628, 1015251, 1010323, 1005414, 1000800, 997355, 995223, 993950, 993912, 996061, 999693, 1002034, 1001222, 998618, 996759, 995843, 993830, 989473, 983409, 976270, 967665, 957640, 947600, 938686, 930237, 920937, 910930, 901784, 894595, 888943, 883699, 878243, 872782, 867862, 863882, 861052, 859576, 859475, 860030, 859931, 858585, 857059, 856940, 858359, 860107]
59422H60107J759L292O157P957P170N067L934M305M828M358L260K660L106M174
59408I22134N087N359M928L887K417R35N0N4N52Q30P28R54K364M807O905P269
59392I69260O054M900N188O739Q482R844J0799J0985R898P956O341N426M161J502
59378A067535k172n521p576q249p942p113n988m520k849j673j469j412m7K725
59364A013729N286O345O375O501P052Q021R966J3196J6705J9119K0401K1658K3640
59351A177994K6423L0159L4600L7714L6144K7973J4879J245q763j3546j4223j2836
59339A337763j0322o258m71N744J0189J1000P053j701j3196k3190k7797k6583
59327A262231k2502j8844j6833j5929j5178j3768j1116p372l755j738j555j697
$$ y = [860107, 861866, 865158, 871315, 879272, 886442, 891509, 895443, 899748, 904576, 908934, 912194, 914854, 917960, 922134, 927221, 932580, 937508, 941395, 943812, 944747, 944797, 944851, 945403, 946233, 946961, 947915, 950279, 955086, 961991, 969260, 975314, 980214, 985402, 992141, 1000623, 1010467, 1021266, 1032251, 1042149, 1050105, 1056446, 1061872, 1066033, 1067535, 1065363, 1059842, 1052266, 1044017, 1036075, 1028962, 1022974, 1018454, 1015605, 1013932, 1012463, 1011051, 1011004, 1013729, 1019015, 1025360, 1031735, 1038236, 1045288, 1053309, 1063275, 1076471, 1093176, 1112295, 1132696, 1154354, 1177994, 1204417, 1234576, 1269176, 1306890, 1343034, 1371007, 1385886, 1387131, 1378368, 1364822, 1350599, 1337763, 1327441, 1321183, 1320712, 1326456, 1336645, 1347645, 1354698, 1352997, 1339801, 1316611, 1288814, 1262231, 1239729, 1220885, 1204052, 1188123, 1172945, 1159177, 1148061, 1140689, 1136934, 1135196, 1133641, 1131944]
59315A131944l75K367M436M239K948L163N413P444P386O120N490N660N622N329
59301A197186N579O300O631O430O217N848M813L762M089N881P791R152J0652J2539
59287A292870J3834J3963J3778J4101J4509J4514J4734J5768J6797J6515J4881
59276A456264J2873J0935Q639N639K168j274m090n810o703p854r969j2451j4262
59263A434105j5278j5979j6200j5308j3540j2066j1361j0478q583o609o417q433
59251A293853j0781j1189r325o879n538n407n548n387m998m216k450L16K912M104
59237A229467M265N114P427R271P342L53r211j7115k0983k1574k0950k0264j9433
59224A133709j7958j5504j2217r035p077o182m690j438K582N383O427O892P844
$$ y = [1131944, 1131569, 1133936, 1138372, 1142611, 1145559, 1148722, 1154135, 1161579, 1168965, 1175085, 1180575, 1186235, 1191857, 1197186, 1202765, 1209065, 1215696, 1222126, 1228343, 1234191, 1239004, 1242766, 1246855, 1252736, 1260527, 1269679, 1280331, 1292870, 1306704, 1320667, 1334445, 1348546, 1363055, 1377569, 1392303, 1408071, 1424868, 1441383, 1456264, 1469137, 1480072, 1488711, 1494350, 1496518, 1495244, 1491154, 1485344, 1478641, 1470787, 1460818, 1448367, 1434105, 1418827, 1402848, 1386648, 1371340, 1357800, 1345734, 1334373, 1323895, 1315312, 1308703, 1302286, 1293853, 1283072, 1271883, 1262558, 1255679, 1250141, 1244734, 1239186, 1233799, 1228801, 1224585, 1222135, 1222451, 1225363, 1229467, 1233732, 1238846, 1246273, 1255544, 1262886, 1263239, 1254028, 1236913, 1215930, 1194356, 1173406, 1153142, 1133709, 1115751, 1100247, 1088030, 1078995, 1071918, 1065736, 1061046, 1059608, 1062190, 1067573, 1074000, 1080892, 1088736]
59211A088736R240J0710J2107J3163J3598J3899J5018J6837J7717J6249J2909
59200A240183R444O979N130K749q14n081q804j1040j1765j1459j0395q818p398
59187A188911o784o726o378n433m320l286k108p83K49Q99J693K964M330N203N428
59172A173859N242N082N363N877N544L569Q37p63o29n4l76j584l140n023p123
59157A186681q510q349p128o129o002o453p049p661q279q834r109q745p690o660
59143A080083o498o903o604n200l928l904m385l777j942m73o77k023k747j686
59129A029336N70K294K523K138K686M336N902O824P761Q856Q922P438O112O859
59115A102557Q977R955Q860P365P227Q137Q564P775O434N700O127P200P943Q036
$$ y = [1088736, 1097976, 1108686, 1120793, 1133956, 1147554, 1161453, 1176471, 1193308, 1211025, 1227274, 1240183, 1249627, 1256606, 1261736, 1264485, 1263671, 1258590, 1249786, 1238746, 1226981, 1215522, 1205127, 1196309, 1188911, 1182127, 1175401, 1169023, 1163590, 1159270, 1155984, 1153876, 1153093, 1153342, 1154241, 1155934, 1158898, 1163228, 1168431, 1173859, 1179101, 1184183, 1189546, 1195423, 1200967, 1204536, 1205373, 1204610, 1203981, 1203927, 1203551, 1201967, 1198827, 1193804, 1186681, 1178171, 1169822, 1162694, 1156565, 1150563, 1144110, 1137061, 1129400, 1121121, 1112287, 1103178, 1094433, 1086743, 1080083, 1073585, 1066682, 1060078, 1054878, 1050950, 1047046, 1042661, 1038884, 1036942, 1036469, 1035792, 1033769, 1031022, 1029336, 1029906, 1032200, 1034723, 1036861, 1039547, 1043883, 1049785, 1056609, 1064370, 1073226, 1082148, 1089586, 1095698, 1102557, 1111534, 1121489, 1130349, 1137714, 1144941, 1153078, 1161642, 1169417, 1175851, 1181551, 1187678, 1194878, 1202821, 1210857]
59101A210857P975P649N676J238l932o934p123o664p332q421q640q547r575j1495
59087A154732j2622j2342j1963j2648j3804j4117j3395j2603j2449j2699j2747
59076A013343j2332j1547j0487r072p205n082l249k173j744j444j032n84J07J580
59062I49079L687N358O072O896Q899J1065J1364R906R192J0576J2232J1875J0010
59049A066211Q810Q834Q763P930P108O760O308N422M506L579K051P5j293j721
59035A133343k065k723k938k476k491l635m629l965k131p74m70o87j234k334l563
59020A097228m260m871o486q923j0506j0170q759p755p455p023n830m280l399
59007A007511l890n424o854p329p075o831o611n671l800k057j699k571l179k568
$$ y = [1210857, 1218832, 1226481, 1232157, 1233395, 1229463, 1222529, 1215406, 1208742, 1201410, 1192989, 1184349, 1175802, 1166227, 1154732, 1142110, 1129768, 1117805, 1105157, 1091353, 1077236, 1063841, 1051238, 1038789, 1026090, 1013343, 1001011, 989464, 978977, 969905, 962700, 957618, 954369, 952196, 950452, 949008, 947976, 947392, 947499, 949079, 952766, 958124, 964196, 971092, 979991, 991056, 1002420, 1012326, 1021518, 1032094, 1044326, 1056201, 1066211, 1075021, 1083855, 1092618, 1100548, 1107656, 1114416, 1120724, 1126146, 1130652, 1134231, 1136282, 1136357, 1135064, 1133343, 1131278, 1128555, 1125617, 1123141, 1120650, 1117015, 1112386, 1108421, 1106290, 1105516, 1105046, 1104359, 1103125, 1100791, 1097228, 1092968, 1088097, 1081611, 1072688, 1062182, 1052012, 1043253, 1035498, 1028043, 1021020, 1015190, 1010910, 1007511, 1003621, 998197, 991343, 984014, 976939, 970108, 963497, 957826, 954026, 951969, 950270, 947699, 944520, 941952]
58993I41952j619j903l457m580m124l090l189m447n316m810l312j374Q82K859
58979I04472L317J948K44p0J052K269K547J965J264J181K075L798N945Q130R737
58964I49874R972R026Q759J0822J4192J6157J5939J5464J6027J6338J5037J3054
58952A110661J1723J0221P120L234O31m42j332k268k278j607j686k403j948M2
58938A129668J427Q07j53Q27L385N274N383M389L136J989J421J789K365J891M40
58923A164038k82J003L449N007M609K975J634J768L767P003R876J0951J0634J1072
58909A237504J3650J7067J8813J8173J6603J5383J4297J2895J1665J1165J1059
58898A398274J0720R994Q745O522L329j72l805q187j3131j6999j8698j9286k0294
$$ y = [941952, 940333, 938430, 934973, 930393, 926269, 923179, 919990, 915543, 910227, 905417, 902105, 900731, 901613, 904472, 907789, 909737, 909981, 909911, 910963, 913232, 915779, 917744, 919008, 920189, 922264, 926062, 932007, 940137, 949874, 959846, 968872, 977631, 988453, 1002645, 1018802, 1034741, 1050205, 1066232, 1082570, 1097607, 1110661, 1122384, 1132605, 1139725, 1142959, 1143590, 1143148, 1141816, 1139548, 1137270, 1135663, 1133977, 1131574, 1129626, 1129668, 1131095, 1131902, 1131749, 1132576, 1135961, 1141235, 1146618, 1151007, 1154143, 1156132, 1157553, 1159342, 1161707, 1163598, 1164038, 1163756, 1164759, 1168208, 1173215, 1177824, 1180799, 1182433, 1184201, 1187968, 1194971, 1204847, 1215798, 1226432, 1237504, 1251154, 1268221, 1287034, 1305207, 1321810, 1337193, 1351490, 1364385, 1376050, 1387215, 1398274, 1408994, 1418988, 1427733, 1434255, 1437584, 1437412, 1433607, 1425420, 1412289, 1395290, 1376592, 1357306, 1337012]
58885A337012k1436k1394k0109j8673j7534j6355j5224j4450j3512j1725r661
58874A156939q354p405n497k766q89o75j195j512j639j480n42P47R78j14q78n6
58858A125662J318J438K57p28o45j50k41j046j837j861j020J97J424K849M706
58843A130323O691Q439J0298J2981J6472J9788K1831K2096K0851J9143J8229J8421
58831A325563J8883J9008J9400K0693K2256K3054K3164K3251K3204K2510K1393
58820A562379K0193J8207J4770J0845P870N542K629n12k507l698n803q836j0937
58807A610142j1795j3453j6734j9429j9388j7307j5064j3310j2175j2408j3993
58796A445086j5198j4832j4117j4659j5879j6235j5834j5774j5886j5145j3738
$$ y = [1337012, 1315576, 1294182, 1274073, 1255400, 1237866, 1221511, 1206287, 1191837, 1178325, 1166600, 1156939, 1148585, 1141180, 1135683, 1132917, 1132028, 1131353, 1130158, 1128646, 1127007, 1125527, 1124985, 1125732, 1126710, 1126596, 1125718, 1125662, 1126980, 1128418, 1128675, 1127947, 1127302, 1127152, 1126911, 1125865, 1124028, 1122167, 1121147, 1121344, 1122768, 1125617, 1130323, 1137014, 1145453, 1155751, 1168732, 1185204, 1204992, 1226823, 1248919, 1269770, 1288913, 1307142, 1325563, 1344446, 1363454, 1382854, 1403547, 1425803, 1448857, 1472021, 1495272, 1518476, 1540986, 1562379, 1582572, 1600779, 1615549, 1626394, 1634264, 1639806, 1642435, 1641923, 1639416, 1635718, 1629915, 1621079, 1610142, 1598347, 1584894, 1568160, 1548731, 1529343, 1512036, 1496972, 1483662, 1471487, 1459079, 1445086, 1429888, 1415056, 1400939, 1386280, 1370401, 1354166, 1338332, 1322558, 1306672, 1291527, 1277789]
58785A277789j2810j2458j1709j0332r239r220j0411j2603j5015j6200j5487j3940
58773A128365j2752j1412q967o434n910p434q686q065o382m937l564j483J017
58760A043356K857L590L680L635L491L175K985L424M396M865L837J766K98K11
58746A085566M18m51k166l410l607l278l020l099l890n685q040j0005j1064j1277
58732A016992j0714r446q041p273p261p400p165o551n736m747l515j940J1J992
58718I39206L292L559L309L381M000M638M534L088K61k985n061n130m007l364
58704I48721m137n824p028o527m401k282j924l179m128l453j901r19p01l61P23
58689I02679K552M795O556O490M225J336n1N44J897K856L379M015N182O864Q491
$$ y = [1277789, 1264979, 1252521, 1240812, 1230480, 1221241, 1212021, 1201610, 1189007, 1173992, 1157792, 1142305, 1128365, 1115613, 1104201, 1095234, 1088800, 1082890, 1075456, 1066770, 1058705, 1052323, 1047386, 1043822, 1042339, 1043356, 1046213, 1049803, 1053483, 1057118, 1060609, 1063784, 1066769, 1070193, 1074589, 1079454, 1083291, 1085057, 1085355, 1085566, 1085984, 1085533, 1083367, 1079957, 1076350, 1073072, 1070052, 1066953, 1063063, 1057378, 1049338, 1039333, 1028269, 1016992, 1006278, 996832, 988791, 981518, 974257, 966857, 959692, 953141, 947405, 942658, 939143, 937203, 937214, 939206, 942498, 946057, 949366, 952747, 956747, 961385, 965919, 969007, 969268, 966283, 961222, 956092, 952085, 948721, 944584, 938760, 931732, 925205, 920804, 918522, 916598, 913419, 909291, 905838, 903937, 903018, 902317, 901956, 902679, 905231, 910026, 916582, 923072, 927297, 928633, 928582, 929126, 931023, 933879, 937258, 941273, 946455, 953319, 961810]
58674I61810R203Q738P752O912O166N328M720M540M348L965M179N464O739O691
58660A046555N869O003P355Q342Q043P544Q054Q870Q396O614N317N734O695N849
58646A145240K521j436l896m929o190q403j0657j2224j3696j5762j8004j9646
58634A032918k0606k1092k1056k0716k0612k0384j8538j4582j0361q015p447p200
58622H42309o956p438q360q419p421o694p066p733p468n971l732j531j81K53R47
58607G64539L047N732O846N737M255M396N970P343P648P272O671N683M026J777
58593H40942p69l276n106n341l668j277k32j437l684n302o199p240q170p726n929
58578G75586m551m704n403n284m309k931j021J240K759L106L378M239M460L172
$$ y = [961810, 971013, 979751, 987503, 994415, 1000581, 1005909, 1010629, 1015169, 1019517, 1023482, 1027661, 1033125, 1039864, 1046555, 1052424, 1058427, 1065782, 1074124, 1082167, 1089711, 1097765, 1106635, 1115031, 1121645, 1126962, 1132696, 1139391, 1145240, 1147761, 1146325, 1142429, 1137500, 1131310, 1122907, 1112250, 1100026, 1086330, 1070568, 1052564, 1032918, 1012312, 991220, 970164, 949448, 928836, 908452, 889914, 875332, 864971, 856956, 849509, 842309, 835353, 827915, 819555, 811136, 803715, 797021, 789955, 782222, 774754, 768783, 765051, 763520, 763339, 763592, 764539, 767586, 773318, 780164, 785901, 790156, 794552, 800522, 807865, 815513, 822785, 829456, 835139, 839165, 840942, 840173, 836897, 831791, 826450, 822782, 821505, 821273, 819836, 816152, 810850, 804651, 797411, 789241, 781515, 775586, 771035, 766331, 760928, 755644, 751335, 748404, 747383, 748623, 751382, 754488, 757866, 762105, 766565, 769737]
58564G69737K060L126N337N915M330K505J495N22o43r77k91K70M39J415L511N271
58548H04022N813O030O411N616K770l52j180M88K695L899L965L245K172J582K116
58533H49292L186L427K359R85O35J644L284M694N705O840Q519J0434J1900J2696
58519I25600J3129J3324J3023J2276J1805J2292J3494J4482J4724J4696J5155
58508A074000J6047J6665J6977J8066K0528K3162K4386K4606K5602K7741K9565
58497A317345L0439L1433L2703L2134K8175K2199J6336J0631M464q44l513m435
58485A517067n989q256r220q579q429r889j1743j3088j4746j7095j8957j9901
58473A371175k1540k4923k8365k9576k8609k6946k4778k1204j6701j3388j2494
$$ y = [769737, 771797, 774923, 780260, 786175, 790505, 793010, 794505, 795027, 794384, 793407, 793116, 793386, 793825, 795240, 798751, 804022, 809835, 815865, 822276, 827892, 830662, 830310, 829130, 829618, 832313, 836212, 840177, 843422, 845594, 847176, 849292, 852478, 855905, 858264, 859249, 859884, 861528, 864812, 869506, 875211, 882051, 890570, 901004, 912904, 925600, 938729, 952053, 965076, 977352, 989157, 1001449, 1014943, 1029425, 1044149, 1058845, 1074000, 1090047, 1106712, 1123689, 1141755, 1162283, 1185445, 1209831, 1234437, 1260039, 1287780, 1317345, 1347784, 1379217, 1411920, 1444054, 1472229, 1494428, 1510764, 1521395, 1525859, 1525015, 1521502, 1517067, 1511078, 1502822, 1493602, 1485023, 1476594, 1466705, 1454962, 1441874, 1427128, 1410033, 1391076, 1371175, 1349635, 1324712, 1296347, 1266771, 1238162, 1211216, 1186438, 1165234, 1148533, 1135145, 1122651]
58462A122651j2821j2385j0829r484r319r605r011p557o575o780p359p360o955
58449A006611o694o477o053n650n216m101k447j679k352k797j624k71q90k747
58435I57613l193j654K1R60K260M347N979O543P017P825P827O447N062N172O610
58420A018836Q478J0487J2616J4557J6230J7895J9325J9886J9586J8992J8037
58409A194925J6035J2827Q688L438k838q469j1429j1732j0920r523p122m540l310
58396A166030k901j133K165M631N197N724P790J0289J1568J1616J0731Q166L736
58383A243609q44l798n297o537q059r863j1716j2656j1546q863o491n294m459
58370A148186l422k392p03K845P341R975R905R403J0108J0774J0090R027Q563
$$ y = [1122651, 1109830, 1097445, 1086616, 1077132, 1067813, 1058208, 1049197, 1041640, 1035065, 1028285, 1020926, 1013566, 1006611, 999917, 993440, 987387, 981737, 976521, 972420, 969973, 968294, 965942, 963145, 961521, 961250, 960360, 957613, 954420, 952766, 952787, 953747, 956007, 960354, 966333, 972876, 979893, 987718, 995545, 1001992, 1007054, 1012226, 1018836, 1027314, 1037801, 1050417, 1064974, 1081204, 1099099, 1118424, 1138310, 1157896, 1176888, 1194925, 1210960, 1223787, 1232475, 1235913, 1233075, 1224606, 1213177, 1201445, 1190525, 1181002, 1173880, 1169340, 1166030, 1163129, 1161996, 1164161, 1168792, 1173989, 1179713, 1187503, 1197792, 1209360, 1220976, 1231707, 1239873, 1243609, 1242765, 1238967, 1233670, 1227133, 1219074, 1209211, 1197495, 1184839, 1173293, 1164430, 1157939, 1152645, 1148186, 1144764, 1142372, 1141669, 1144514, 1151855, 1161830, 1171735, 1181138, 1191246, 1202020, 1212110, 1221137, 1229700]
58357A229700P505M613R81j700l556n409o972p830q662r822j0278r481q742r184
58343A161163r948r800q900p688n873l917l416m460m691k689k04Q44J315K632
58329A104368L866L589K869L683N702P144P761Q529R306Q977P321N032K693J096
58315A181936J295K907L913L655M183O812R406R399P832P622R200J0555J0764
58302A269479J0864J1627J2651J3463J3912J3830J3549J3990J5239J6034J5592
58291A420230J4582J3448J1606R322Q275Q790Q787P103N534N782O740O923P308
58278A534430R309J2036J3939J5331J6884J7646J6939J6287J7041J8078J8181
58267A706101J8503K0115K1408K0766J9650K0024K0801J9851J7654J5812J3972
$$ y = [1229700, 1237205, 1241818, 1242799, 1241099, 1237543, 1232134, 1225162, 1217332, 1208670, 1198848, 1188570, 1179089, 1170347, 1161163, 1151215, 1141415, 1132515, 1124827, 1118954, 1115037, 1111621, 1107161, 1102470, 1099781, 1099577, 1100421, 1101736, 1104368, 1108234, 1111823, 1114692, 1118375, 1124077, 1131221, 1138982, 1147511, 1156817, 1165794, 1173115, 1178147, 1180840, 1181936, 1183231, 1186138, 1190051, 1193706, 1197889, 1204701, 1214107, 1223506, 1231338, 1238960, 1248160, 1258715, 1269479, 1280343, 1291970, 1304621, 1318084, 1331996, 1345826, 1359375, 1373365, 1388604, 1404638, 1420230, 1434812, 1448260, 1459866, 1469188, 1477463, 1486253, 1495040, 1502143, 1507677, 1513459, 1520199, 1527122, 1534430, 1543739, 1555775, 1569714, 1585045, 1601929, 1619575, 1636514, 1652801, 1669842, 1687920, 1706101, 1724604, 1744719, 1766127, 1786893, 1806543, 1826567, 1847368, 1867219, 1884873, 1900685, 1914657]
58256A914657J1364R491R944J1314J1459J1134J2103J3542J3699J3438J4654J6651
58244B063450J7503J7526J8185J9121J9375J9855K1559K3300K4270K6364L0562
58233B301070L3651L2703L0246L0651L3616L6006L7894M1587M6184M8490M8513
58222B720611M9246N1587N3753N5114N6560N8045N9404O2241O7280P1653P2747
58211C378241P2657P4647P7599P8869Q0071Q4573R1197R6039R8896J02617J07663
58200D343069J12712J18849J27729J37392J45272J53129J63386J73395J79645
58191E654578J84851J93716K04162K10656K14282K21328K33167K45598K57402
58182G619740K71436K87856L04070L21173L42968L69112L96287M25093M58595
$$ y = [1914657, 1926021, 1935512, 1945456, 1956770, 1968229, 1979363, 1991466, 2005008, 2018707, 2032145, 2046799, 2063450, 2080953, 2098479, 2116664, 2135785, 2155160, 2175015, 2196574, 2219874, 2244144, 2270508, 2301070, 2334721, 2367424, 2397670, 2428321, 2461937, 2497943, 2535837, 2577424, 2623608, 2672098, 2720611, 2769857, 2821444, 2875197, 2930311, 2986871, 3044916, 3104320, 3166561, 3233841, 3305494, 3378241, 3450898, 3525545, 3603144, 3682013, 3762084, 3846657, 3937854, 4033893, 4132789, 4235406, 4343069, 4455781, 4574630, 4702359, 4839751, 4985023, 5138152, 5301538, 5474933, 5654578, 5839429, 6033145, 6237307, 6447963, 6662245, 6883573, 7116740, 7362338, 7619740, 7891176, 8179032, 8483102, 8804275, 9147243, 9516355, 9912642, 10337735, 10796330]
58173A0796330M95806N34175N76091O24460O74445P19193P61387Q09079Q62514
58164A6853480R16050R70830J033529J103929J176181J251603J337679J434973
58156B6078254J537716J646763J769131J905759K053426K217725K410003K633825
58148D2252602K890767L197650L579334M043530M578444N172182N816022O495729
58140G8026260P208381P989369Q897180R968998J1210537J2615351J4155899J5771289
58132A65843264J7435044J9264372K1518915K4447024K8082550L2025711L5190354
58125C43807234L5772167L1892227K2847557J0007604l637425j5084501k2770521
58118D02834342k6819154k8267341k8194821k7337098k6098189k4671483k3137912
$$ y = [10796330, 11292136, 11826311, 12402402, 13026862, 13701307, 14420500, 15181887, 15990966, 16853480, 17769530, 18740360, 19773889, 20877818, 22053999, 23305602, 24643281, 26078254, 27615970, 29262733, 31031864, 32937623, 34991049, 37208774, 39618777, 42252602, 45143369, 48341019, 51920353, 55963883, 60542327, 65714509, 71530531, 78026260, 85234641, 93224010, 102121190, 112090188, 123300725, 135916076, 150071975, 165843264, 183278308, 202542680, 224061595, 248508619, 276591169, 308616880, 343807234, 379579401, 411471628, 434319185, 444326789, 440689364, 425604863, 402834342, 376015188, 347747847, 319553026, 292215928, 266117739, 241446256, 218308344]
58111B18308344k1528549j9849910j8096687j6284936j4479906j2770947j1218282
58104A04079127r838330q629501p585810o688323n909800n233570m653085m154836
58096E1385872l719184l337365l010832k733688k491186k275672k088955j927997
58088B9800993j782080j645471j520602j407715j302722j205747j120610j045215
58080A8770831r72691r02232q39087p84151p33559o87837o51066o20995n90300
58071A1988913n57982n29566n05661m80454m52561m27399m07009l86814l64550
58062G876917l43817l26370l08747k89198k70937k56214k43312k31118k20677
58053E386527k11014j99448j87134j78312j73310j68241j62226j58376j56871
$$ y = [218308344, 196779795, 176929885, 158833198, 142548262, 128068356, 115297409, 104079127, 94240797, 85611296, 78025486, 71337163, 65427363, 60193793, 55540708, 51385872, 47666688, 44329323, 41318491, 38584803, 36093617, 33817945, 31728990, 29800993, 28018913, 26373442, 24852840, 23445125, 22142403, 20936656, 19816046, 18770831, 17798140, 16895908, 16056821, 15272670, 14539111, 13851274, 13200208, 12579213, 11988913, 11430931, 10901365, 10395704, 9915250, 9462689, 9035290, 8628281, 8241467, 7876917, 7533100, 7206730, 6897983, 6608785, 6337848, 6081634, 5838322, 5607204, 5386527, 5175513, 4976065, 4788931, 4610619, 4437309, 4269068, 4106842, 3948466, 3791595]
58044C791595j53662j47506j41977j38903j35674j30568j25099j19596j11905
58035B586705j02105r3416q7018q0917p4837p1000o8956o5058n8429n2375m8590
58024A784004m5107m1201l9054l8930l7894l4992l2839l2328l0821k7460k5466
58013A397912k6907k9587l1159l2110l2762l1606k8782k7163k7795k8013k6008
58002A076020k3586k2492k1750k0521j9980k0364j9725j7524j6041j6402j6584
57991H61051j5212j3773j3161j1579q139n299n252o664p226o879o570o204n791
57978G49302o304p790q747q617q597r073q832p779p626q845r865j0280j1677j4129
57964F21141j5137j3539j1394j0532j0206r538r144q954p573n331m657n950o481
$$ y = [3791595, 3637933, 3490427, 3348450, 3209547, 3073873, 2943305, 2818206, 2698610, 2586705, 2484600, 2391184, 2304166, 2223249, 2148412, 2077412, 2008456, 1943398, 1884969, 1832594, 1784004, 1738897, 1697696, 1658642, 1619712, 1581818, 1546826, 1513987, 1481659, 1450838, 1423378, 1397912, 1371005, 1341418, 1310259, 1278149, 1245387, 1213781, 1184999, 1157836, 1130041, 1102028, 1076020, 1052434, 1029942, 1008192, 987671, 967691, 947327, 927602, 910078, 894037, 877635, 861051, 845839, 832066, 818905, 807326, 799187, 793888, 788636, 781972, 774746, 767867, 761297, 755093, 749302, 742998, 735208, 726461, 717844, 709247, 700174, 691342, 683563, 675937, 667092, 657227, 646947, 635270, 621141, 606004, 592465, 581071, 570539, 560333, 550795, 541651, 532697, 525124, 519793, 515136, 509186, 502705]
57951E02705n044m104n272o361n373m033m522n776n870n314n182m497k433p51
57937D38173j165k324k109r05%J155L309M938M305K420J246N13j058k776k974
57922D42748j886j132j145j265j425j881k336k915m648p297q393o415l363k046
57908C96601k307k142j246r34j532k105k237k186j913j371r76o80K40J399J036
57893C79647j150k877k608k002k933m112l255r33N37P80J169J868J865J373J727
57878C69096L199M920O426P462P102N224L975N375Q085Q896O931M148K074N23
57864D43436n92p19k71o92k396m274n598o881q483r741r916r028p560o088n238
57849C65959n138n050m264l040k070j521j253j303j360o15J048K537L103L344
$$ y = [502705, 497661, 493557, 488285, 481924, 476551, 472518, 467996, 462220, 456350, 451036, 445854, 441357, 438924, 438173, 437008, 434684, 432575, 431670, 431670, 432825, 436134, 441072, 445377, 447797, 449043, 449556, 448498, 445722, 442748, 440862, 439730, 438585, 437320, 435895, 434014, 431678, 428763, 424115, 416818, 408425, 402010, 398647, 396601, 394294, 392152, 390906, 389972, 388440, 386335, 384098, 381912, 379999, 378628, 377652, 376972, 377212, 378611, 379647, 378497, 375620, 373012, 371010, 368077, 363965, 360710, 359777, 360314, 361094, 362263, 364131, 365996, 367369, 369096, 372295, 377215, 383641, 391103, 398205, 403429, 407404, 412779, 420864, 429760, 436691, 440839, 442913, 443436, 442844, 442125, 441854, 441162, 438766, 434492, 428894, 422013, 413530, 403789, 393873, 384845, 377285, 371197, 365959, 360821, 355771, 351507, 348467, 346397, 344876, 343623, 342320, 340960, 340345, 341393, 343930, 347033, 350377]
57835C50377L850M000L359K891L386L903L387K679L109M089M089L120K308J643
57821C96190K67j437k170j885j733j980j809j217j332k600m149n108n332m822
57807C60883l665k588k407k897l112k674j854p71M84J405J777K314L509M559M606
57792C59569M284M628N195M868L880L346L277K897K502L110M367M665L489J943
57778D12020Q55j08j228k127k641l081l481l670l989m778n349m835l809l524l741
57763C66514l058j449o63j562k758k662j671j461k774m620n326m186k364j945
57749C30015l695o274q149r349j0363j0471q897o779o085o832p297o693n742m769
57735B28620l365k075k143l115k763k68K460L509L300L151L243L248L550M455
$$ y = [350377, 354227, 358227, 361586, 364477, 367863, 371766, 375153, 377832, 380941, 385030, 389119, 392239, 394547, 396190, 396457, 395020, 392850, 390965, 389232, 387252, 385443, 384226, 382894, 380294, 376145, 371037, 365705, 360883, 357218, 354630, 352223, 349326, 346214, 343540, 341686, 340915, 341399, 342804, 344581, 346895, 350404, 354963, 359569, 363853, 368481, 373676, 378544, 382424, 385770, 389047, 391944, 394446, 397556, 401923, 406588, 410077, 412020, 412875, 412767, 411539, 409412, 406771, 403690, 400209, 396539, 392550, 387772, 382423, 377588, 373779, 370255, 366514, 363456, 362007, 361344, 359782, 357024, 354362, 352691, 351230, 348456, 343836, 338510, 334324, 331960, 330015, 326320, 320046, 311897, 302548, 292185, 281714, 272817, 266038, 259953, 253121, 245824, 239131, 233389, 228620, 225255, 223180, 221037, 217922, 215159, 214891, 217351, 220860, 224160, 227311, 230554, 233802, 237352, 241807]
57721B41807N194N043M534M388M189L429L057M344O529P296N805L928L782M993
57707C08318N316L625J323M45J096J603R67M3q7J07n91k207l535l805l372k814
57691C06432k307k020k208k645k536j338O44K504L352K913J900J552K204K739
57677C11186J831m59k907m490m913m251k810j187J56J110J431O54r72k261k449
57662B89669j955j220Q0J782K472J411Ok60j43r95j891q51J684L207K724J537
57646B97257L83j513m060n585n379m800m774m326k758j314j258j869j776j026
57632B57202m54j79r2p62k384l700l434k136j375j516j507m76J482L885O283Q275
57616B59112R803J1351J3372J5783J8411K1561K5757L1110L7139M2765M6383M6547
$$ y = [241807, 247001, 252044, 256578, 260966, 265155, 268584, 271641, 275985, 282514, 289810, 295615, 299543, 303325, 308318, 313634, 317259, 318582, 319027, 320123, 321726, 322693, 322736, 322649, 322756, 322165, 319958, 316423, 312618, 309246, 306432, 304125, 302105, 299897, 297252, 294716, 293378, 294022, 296526, 299878, 302791, 304691, 306243, 308447, 311186, 313017, 312558, 309651, 305161, 300248, 295997, 293187, 292000, 292156, 293266, 294697, 295351, 294379, 292118, 289669, 287714, 286494, 286574, 288356, 290828, 292239, 292245, 291985, 291842, 290847, 288956, 288105, 289789, 292996, 295720, 297257, 297640, 296127, 292067, 286482, 281103, 276303, 271529, 267203, 264445, 263131, 261873, 260004, 258228, 257202, 256748, 256569, 256477, 255715, 253331, 249631, 246197, 244061, 242686, 241170, 239663, 239187, 240669, 244554, 250837, 259112, 268915, 280266, 293638, 309421, 327832, 349393, 375150, 406260, 443399, 486164, 532547, 579094]
57604E79094M2679L4791K2748P006r939k4239l3590l8594m0944m1383m0040l7504
57592D20085l4475l1045k7217k3587k0663j8056j5115j2007r575q391q368q899
57580B02687r036q096o424n010m175l316k108r88j34Q35J609Q56j815m640n580
57565A54665m738l709l148k390j225o54j486l115m241m367m125m256m616m576
57551A08019m193m332n113n080l076m94j55k735n779o725n544l843k764k673l626
57536E1887m862m874l163j234p79j550k231k591l324m315m634m137l679l726B859
57520a200m285m328l609k501k390l889n882o816o322n050l597k344j914k863m754
57505f1744o159n992m651l551l596m377m861m533l742l095k719j975O7L389O289
$$ y = [579094, 621773, 656564, 679312, 686318, 676379, 652140, 618550, 579956, 539012, 497629, 457589, 420085, 385610, 354565, 327348, 303761, 283098, 265042, 249927, 237920, 228345, 219954, 211586, 202687, 193651, 185555, 179131, 174121, 169946, 166630, 164522, 163534, 163400, 164235, 165844, 166700, 164885, 160245, 154665, 149927, 146218, 143070, 140680, 139455, 138801, 137315, 134200, 129959, 125592, 121467, 117211, 112595, 108019, 103826, 99494, 94381, 89301, 86225, 85731, 85576, 82841, 77062, 70337, 64793, 60950, 58186, 55513, 51887, 47025, 42151, 38988, 37754, 36975, 35425, 33194, 30603, 27279, 22964, 18330, 14193, 10514, 6788, 2859, -1200, -5485, -9813, -13422, -15923, -18313, -22202, -28084, -34900, -41222, -46272, -49869, -52213, -54127, -56990, -61744, -67903, -73895, -78546, -82097, -85693, -90070, -94931, -99464, -103206, -106301, -109020, -110995, -110928, -107539, -101250]
57490a01250O635M457K403K794M770N570M264K758L011M685O071O246N547M641
57476c7398L900L337K787K201J743J246L0j933l178k248Q8J566J288M04j02n65
57460b6834j173j236p12o82j271q15J418L235K037j653m918o050n816n699o481
57445e6650q284j0535j1875j1316r464p752o706n870n016m442m158l773l072k135
57431a51048j137n43q73j662j523j07R41J32j648k434j852r89l81J03j08j671
57415a64800l498l637k240j691l193n126n603m965m526m309l458k167j626k166
57401b13005k596j642N05K372K700J620K30p53j494k122k110j210l35n60j628
57386b20028k454k818l322l812l200j263O20J091L37n77j095j268j104n77pJ51
$$ y = [-101250, -94615, -90158, -87755, -84961, -80191, -74621, -70357, -67599, -64588, -59903, -53832, -47586, -42039, -37398, -33498, -30161, -27374, -25173, -23430, -22184, -22154, -24087, -27265, -29513, -29425, -27859, -26571, -26167, -26269, -26834, -28007, -29243, -29955, -30637, -31908, -32723, -31305, -28070, -26033, -27686, -32604, -38654, -44470, -50169, -56650, -64934, -75469, -87344, -98660, -108124, -115876, -122582, -128452, -133468, -137910, -142068, -145841, -148913, -151048, -152185, -152728, -153601, -155263, -156786, -156893, -155952, -155820, -157468, -159902, -161754, -162743, -163124, -163021, -163129, -164800, -168298, -171935, -174175, -175866, -179059, -184185, -189788, -194753, -199279, -203588, -207046, -209213, -210839, -213005, -215601, -217243, -216738, -214366, -211666, -210046, -209816, -210569, -212063, -214185, -216295, -217505, -217840, -218400, -220028, -222482, -225300, -228622, -232434, -235634, -236897, -236277, -235186, -234849, -235426, -236521, -237789, -238893, -239470, -239477, -239326]
57370b39326o3o0O26J624J816N49j199j519L9J530R20j259k693k320j141j46R20
57353b41702K241K853J832k14j768k025j316m33J2j41m93n75o47j468l102m462
57337b51408m450l127j490n30o04j277j604j074k94k47q66j290j471k292l679
57322b75703l941k028N33J253l08k400l635m321n036n288m409l018k547l407m427
57307c18682m426l675l270l415l165k030r47j078k209l069k887j931p98L6J48
57292c51398m35q60l99K47k81j856k673j719k73j88j538k865l103k335j126j8
57276c70820M72K69K7M77J462K165K187J858J508R51j28j586k792l229l040k844
57260c73063k848k458j185L26R14M28k48o93j400k310k262o91J124J653J172J064
$$ y = [-239326, -239389, -239449, -238823, -237199, -235383, -234834, -236033, -237552, -237513, -235983, -235063, -236322, -239015, -241335, -242476, -242622, -241702, -239461, -236608, -234776, -234990, -236758, -238783, -240099, -240532, -240520, -240661, -241154, -241729, -242376, -243844, -246946, -251408, -255858, -258985, -260475, -261005, -261609, -262886, -264490, -265564, -265858, -266105, -266971, -268261, -269732, -272024, -275703, -279644, -281672, -281139, -279886, -280194, -282594, -286229, -290550, -295586, -300874, -305283, -308301, -310848, -314255, -318682, -323108, -326783, -330053, -333468, -336633, -338663, -339610, -340688, -342897, -345966, -348853, -350784, -351582, -351546, -351398, -351833, -352693, -353092, -352845, -353126, -354982, -357655, -359374, -359647, -359835, -361373, -364238, -367341, -369676, -370802, -370820, -370348, -370079, -370052, -369575, -368113, -365948, -363761, -361903, -360395, -359444, -359572, -361158, -363950, -367179, -370219, -373063, -375911, -378369, -379554, -379228, -378314, -377886, -378134, -378827, -380227, -382537, -384799, -385490, -384366, -382713, -381541, -380477]
57244c80477J622K064K270L023M228M463K958J001M90J638K994L381L143L313
57230c43889M188N162N874O946R092J1873J4093J5500J6937J8406J8148J4845
57218b02825R850N772L272Q21k506n818q323j0587j2942j4129j2891j0069p730
57205b68105o696o094n056l684k413j456j047j382k012j925n42J531K990L018
57191b92873K152J987L592O099P412O684N288M778M811M168L105L070M265N168
57177b30294M890M414M787N358N008M207M430N789O658N859M260L592M226M784
57163a62032L980K236J099J208J476O08j107k135j606j74J155K223L462M936O179
57148a38492O792P030P867J0367J4578J9111K2344K4142c78B8330L2294L5527
$$ y = [-380477, -378855, -376791, -374521, -371498, -367270, -362807, -359849, -358848, -358358, -356720, -353726, -350345, -347202, -343889, -339701, -334539, -328665, -321719, -312627, -300754, -286661, -271161, -254224, -235818, -217670, -202825, -192975, -187203, -183931, -183110, -185616, -191434, -199757, -210344, -223286, -237415, -250306, -260375, -268105, -274801, -280895, -285951, -289635, -292048, -293504, -294551, -295933, -297945, -299870, -300412, -298881, -295891, -292873, -290721, -288734, -285142, -279043, -271631, -264947, -259659, -254881, -250070, -245902, -242797, -239727, -235462, -230294, -225404, -220990, -216203, -210845, -205837, -201630, -197200, -191411, -184753, -178894, -174634, -171042, -166816, -162032, -158052, -155816, -154717, -153509, -152033, -151425, -152532, -154667, -156273, -156447, -155292, -153069, -149607, -144671, -138492, -131700, -124670, -116803, -106436, -91858, -72747, -50403, -26261, -378, 28330, 60624, 96151]
57136I6151L7689L8753L9083L9211L9475L9596L9108L8290L8103L8898L9834L9975
57124E64166L9396L8766L8309L7632L6301L4241L1841K9778K8555K8144K8321
57113I35450K8999K9794K9768K8625K7649K8219K9577K9530K7373K4575K2385
57102A241944K0434J8064J5305J2040Q017M364L229M843O746P034O718P473Q799
57089A365010R017P739N696L328J001m78j056k078m600q168j2207j7083k2739
57076A323382k8200l3790m1698n2637o4094p3914q3487r5134j08403j21546j34903
57065D85576j50144j67659a9531k10229k37525k68613l02955l41593l84906m31277
57055b196629m80313n34605n95741o61572p30378q04189q84433r67639j049144
$$ y = [96151, 133840, 172593, 211676, 250887, 290362, 329958, 369066, 407356, 445459, 484357, 524191, 564166, 603562, 642328, 680637, 718269, 754570, 788811, 820652, 850430, 878985, 907129, 935450, 964449, 994243, 1024011, 1052636, 1080285, 1108504, 1138081, 1167611, 1194984, 1219559, 1241944, 1262378, 1280442, 1295747, 1307787, 1315804, 1320168, 1323397, 1328240, 1334986, 1342020, 1348738, 1356211, 1365010, 1374027, 1381766, 1387462, 1390790, 1391791, 1391313, 1390257, 1388179, 1383579, 1375411, 1363204, 1346121, 1323382, 1295182, 1261392, 1219694, 1167057, 1102963, 1029049, 945562, 850428, 742025, 620479, 485576, 335432, 167773, -19531, -229760, -467285, -735898, -1038853, -1380446, -1765352, -2196629, -2676942, -3211547, -3807288, -4468860, -5199238, -6003427, -6887860, -7855499, -8904643]
57046h904643j127429j200958j264405j311807j339638j345425j332609j323424
57038a9150338j358009j469416j659827j901836k153770k374930k547285k688743
57030c5304154k817251k896981k886822k904147l277122m278927n738157o998685
57022f7102246p378792o686649n268893l620869k039212o11396O24293J618198
57014i0465566K357764K879109L213005L357250L312430L127547K911997K812870
57006f6493594K958269L380911L981464M580467N019726N225404N201995M997498
56998c1147860M675433M292959L885386L470059L063469K686639K354122K067229
56990d652564J820145a226424A90231J245083J090558R56670Q43230P45435O60516
$$ y = [-8904643, -10032072, -11233030, -12497435, -13809242, -15148880, -16494305, -17826914, -19150338, -20508347, -21977763, -23637590, -25539426, -27693196, -30068126, -32615411, -35304154, -38121405, -41018386, -43905208, -46809355, -50086477, -54365404, -60103561, -67102246, -74481038, -81167687, -86436580, -90057449, -92096661, -92708057, -92083764, -90465566, -88107802, -85228693, -82015688, -78658438, -75346008, -72218461, -69306464, -66493594, -63535325, -60154414, -56172950, -51592483, -46572757, -41347353, -36145358, -31147860, -26472427, -22179468, -18294082, -14824023, -11760554, -9073915, -6719793, -4652564, -2832419, -1226424, 190231, 1435314, 2525872, 3482542, 4325772, 5071207, 5731723]
56981E731723N88838N27962M72037M18395L69399L26750K88987K55392K27051
56972I206534K02848J79344J56249J37763J26916J22016J19797J18495J16568
56963A0486530J11054R7957P2579L1117k3977q0977j26033j54143j69885j78279
56953A0065943j80075j76271j71253j68788j68592j68892j69242j69243j67779
56944H525808j65398j64776j67238j71234j75591j81620j90615k01583k12799
56935F894954k23314k31605k34996k32020k23849k12368j98454j82980j67658
56926D987710j53808j41588j30939j21922j13963j06555j00842r8548r9032r9369
56916C821144r7718r4769r1639q8476q5342q2458p9131p4384o8966o4658o1443
$$ y = [5731723, 6320561, 6848523, 7320560, 7738955, 8108354, 8435104, 8724091, 8979483, 9206534, 9409382, 9588726, 9744975, 9882738, 10009654, 10131670, 10251467, 10369962, 10486530, 10597584, 10695541, 10768120, 10799237, 10775260, 10694283, 10568250, 10414107, 10244222, 10065943, 9885868, 9709597, 9538344, 9369556, 9200964, 9032072, 8862830, 8693587, 8525808, 8360410, 8195634, 8028396, 7857162, 7681571, 7499951, 7309336, 7107753, 6894954, 6671640, 6440035, 6205039, 5973019, 5749170, 5536802, 5338348, 5155368, 4987710, 4833902, 4692314, 4561375, 4439453, 4325490, 4218935, 4118093, 4019545, 3920513, 3821144, 3723426, 3628657, 3537018, 3448542, 3363200, 3280742, 3201611, 3127227, 3058261, 2993603, 2932160]
56905B932160n7499n2219m6981m2708l9022l6092l4677l3772l1015k6488k3620
56894B508067k5121k9997l5679m0949m5577m8940n0460n0210m8354m5196m1955
56883B045629l9709l7450l3308k7956k4266k2905k1110j6881j1819q212n604k269
56871A794140J676M489M750J573n743j6501k7911l6960m2430m4515m3747m1137
56859A547684l8176l5603l3112l0752k9375k9065k8588k7130k5282k3641k1922
56848A225038k0166j9285j9513j9700j8957j7704j6347j4442j1965r844q435o887
56836A041793m876l402k967k463p85J821M810Q153J1388J3562J5006J7177J9724
56823A118941J9717J5265Q206J571l840q645j2310j3632j2890j1530j0208q644
$$ y = [2932160, 2874661, 2822442, 2775461, 2732753, 2693731, 2657639, 2622962, 2589190, 2558175, 2531687, 2508067, 2482946, 2452949, 2417270, 2376321, 2330744, 2281804, 2231344, 2181134, 2132780, 2087584, 2045629, 2005920, 1968470, 1935162, 1907206, 1882940, 1860035, 1838925, 1822044, 1810225, 1802013, 1796409, 1794140, 1795816, 1800305, 1805055, 1806628, 1800885, 1784384, 1756473, 1719513, 1677083, 1632568, 1588821, 1547684, 1509508, 1473905, 1440793, 1410041, 1380666, 1351601, 1323013, 1295883, 1270601, 1246960, 1225038, 1204872, 1185587, 1166074, 1146374, 1127417, 1109713, 1093366, 1078924, 1066959, 1057115, 1048680, 1041793, 1036917, 1033515, 1030548, 1028085, 1027300, 1029121, 1033931, 1042084, 1053472, 1067034, 1082040, 1099217, 1118941, 1138658, 1153923, 1162129, 1163700, 1159860, 1151215, 1138905, 1125273, 1112383, 1100853, 1090645, 1082001]
56811A082001o756m629j922J415M427O349P965J0651J4649J9110K3251K6602K8649
56798A211762K8878K6632K0836J1011r77j1605j8787k3118k5654k6197k4567k1673
56786A146541j8027j2957o672j373J481L652P936J4441K0867K5697K9366L2821
56774A243773L6426L9883M1902M0265L3375K1623O779r115k3698l4531m0701m3385
56762A312596m3905m2163l7812l1817k5707k0232j5634j1987q409l328L197Q967
56750A083766J2707J6132K1397K7786L2500L3372K9239J9337M674j0952k3511
56739A246447l1786l6495l7825l6032l3182l1509l0446k7681k3012j8788j6482
56728I23209j4911j2168p735k412K458N829Q056J0775J4377J6353J3864P291m63
$$ y = [1082001, 1075245, 1070616, 1068694, 1070109, 1074536, 1080885, 1088850, 1099501, 1114150, 1133260, 1156511, 1183113, 1211762, 1240640, 1267272, 1288108, 1299119, 1298142, 1286537, 1267750, 1244632, 1218978, 1192781, 1168214, 1146541, 1128514, 1115557, 1108885, 1107512, 1108993, 1112645, 1120581, 1135022, 1155889, 1181586, 1210952, 1243773, 1280199, 1320082, 1361984, 1402249, 1435624, 1457247, 1464026, 1454911, 1431213, 1396682, 1355981, 1312596, 1268691, 1226528, 1188716, 1156899, 1131192, 1110960, 1095326, 1083339, 1074930, 1071602, 1074799, 1083766, 1096473, 1112605, 1134002, 1161788, 1194288, 1227660, 1256899, 1276236, 1280910, 1269958, 1246447, 1214661, 1178166, 1140341, 1104309, 1071127, 1039618, 1009172, 981491, 958479, 939691, 923209, 908298, 896130, 888395, 885983, 888441, 894270, 902326, 913101, 927478, 943831, 957695, 964986, 964523]
56715I64523p583j4095j9619k2953k4076k4494k5012k4922k3678k1766j9639j7409
56703G19277j5701j5224j5218j3937j1115q428p221p102p163p106o823o176n558
56690E92505n501n587m938l840l401l630l430k706k643l498l918l202k452k621
56676E41138k997k756k488k830k829j361O20R91n65k034j666J9J288J389R78O96
56660E27593K80n99j227n18J108J651l3k385k747n81J919K417Q66q33r53N32K074
56643E28564K120N57j398k721l441l834l550k262o14L03K39q8P8Q58J751J966
56627E18528J129p4m52L90J879L483M782M688K368o56j361P87K762K317J127J522
56611E43219K234M79l008m549k961j063j374l080m231m550m754m924m800m539
$$ y = [964523, 956940, 942845, 923226, 900273, 876197, 851703, 826691, 801769, 778091, 756325, 736686, 719277, 703576, 688352, 673134, 659197, 648082, 639654, 632433, 625331, 618168, 611062, 604239, 598063, 592505, 587004, 581417, 576479, 572639, 569238, 565608, 562178, 559472, 556829, 553331, 549413, 546211, 543759, 541138, 538141, 535385, 532897, 530067, 527238, 525877, 526497, 527488, 526923, 524889, 523223, 523242, 524530, 525919, 526897, 527593, 527873, 527274, 526047, 525529, 526637, 528288, 528255, 525870, 523123, 522542, 524461, 526878, 527744, 526911, 525958, 526490, 528564, 530684, 531241, 529843, 527122, 523681, 519847, 516297, 514035, 513421, 513724, 513963, 513875, 513953, 514811, 516562, 518528, 519657, 519583, 519131, 519521, 521400, 524883, 529665, 534353, 536721, 536065, 534704, 535491, 538253, 540570, 541697, 543219, 545453, 545932, 542924, 538375, 535414, 534351, 532977, 529897, 525666, 521116, 516362, 511438, 506638, 502099]
56597E02099m201l415k186j196q39q22r04r74l24J935N329Q028Q725P744O200
56582E25199N090N117O149O631M887J336j610k231j103J19M49j58j148j681j315
56567E45731o45n46r77j278j230q09N79L121N275N282L855L520N016O263N408
56552E78565L123J188K97J15J90q2j311l115m216m032l370l084l063k934k812
56537E55459k829k811k772k924k964k255r54MJ08m49j615l262m225l047p5K562
56521E27951L436K995K077Q77j62j24R19J538Q68j95m01L88J738L424M905N224
56505E55458M356L763M728O738Q198Q105O773N537N873P902R652Q783N183Q85
56491F41934k480m699n645m806k685r25l47k65k12o90j613j809j070r72k463m162
$$ y = [502099, 497898, 494483, 492297, 491101, 490262, 489440, 488536, 487562, 487238, 489173, 494502, 502530, 511255, 518999, 525199, 530289, 535406, 541555, 548186, 553073, 554409, 552799, 550568, 549465, 549584, 550033, 549875, 548727, 547046, 545731, 545086, 544540, 543563, 542285, 541055, 540246, 540825, 543946, 549221, 554503, 558358, 561878, 566894, 573157, 578565, 581688, 582876, 583173, 583288, 583478, 583396, 582085, 578970, 574754, 570722, 567352, 564268, 561205, 558271, 555459, 552630, 549819, 547047, 544123, 541159, 538904, 537950, 537954, 538062, 537613, 535998, 532736, 528511, 525464, 525389, 527951, 531387, 534382, 536459, 537336, 537174, 537050, 537969, 539507, 540375, 540180, 539779, 540167, 541905, 545329, 550234, 555458, 559814, 563577, 568305, 575043, 583241, 591346, 598119, 603656, 609529, 617431, 627083, 635866, 641049, 641934, 639454, 634755, 629110, 624304, 621619, 620694, 620347, 620082, 619870, 619180, 617567, 615758, 614688, 613716, 611253, 607091]
56475F07091m374l516l092l359l463l210l285l995m734m585l109r87J88m11j509
56460E63650j222J95Q04J87n2N31L8k485m941n169m079l739l893k842o48R50J370
56443E38655J560J758J035o74j986k089j865k351l159l259k657k393l037l878
56429E15660l843k827j558l21J249K816L032J517JLM71l40j474l56K849M854L756
56412E25489J387J51l4m03j063j512j683j174P56L260L907J952l09r05p62j127
56396E27930q03J406L428K208j629m347l969j991l68P34J836K735K885K102O71
56381E32828n59n39O60J437N75j119k032j873j344n77O48J851K381K507K704K459
56365E40007J172l71q55k34N97J344K081K133Q42q41j130L28K285L747M583M478
$$ y = [607091, 602717, 599201, 596109, 592750, 589287, 586077, 582792, 578797, 574063, 569478, 566369, 565382, 565570, 565159, 563650, 562428, 562623, 563427, 563614, 563562, 564093, 564131, 561646, 556705, 551536, 547457, 543718, 539825, 536983, 536335, 537285, 538655, 540215, 541973, 543008, 542334, 540348, 538259, 536394, 534043, 530884, 527625, 524968, 522575, 519538, 515660, 511817, 508990, 507432, 507111, 508360, 511176, 514208, 515725, 515726, 515729, 516200, 515860, 514386, 514030, 516879, 521733, 525489, 526876, 527027, 526993, 526590, 525527, 524015, 522332, 521158, 521914, 525174, 529081, 531033, 530724, 529819, 529057, 527930, 527127, 528533, 531961, 534169, 532540, 528193, 524224, 522233, 521865, 522599, 524435, 527170, 530055, 532157, 532828, 532269, 531730, 532390, 533827, 534402, 533283, 531251, 529378, 528034, 527457, 528105, 529956, 532337, 534844, 537548, 540007, 541179, 540808, 539953, 539719, 540316, 541660, 543741, 545874, 546716, 545875, 544745, 545073, 547358, 551105, 555688, 560166]
56349E60166K782j41k561k878j109J151J979O94j477k718k695k661l302l770l192
56334E40268j913n03J017K232K048M56q40o56J79O19J162K431L528L478K911K702
56318E59119K295J153M54J377K892L289K790K511J986J13k175k706j223M66J304
56303E73645J959L052M211M897M786L570J672N87J202K404K610J852J065M63J46
56288F08121R61K899L983K840J145J213K396K503J618J542K225J924P21P53K677
56273F37521M717N546N696N687N129M188L958M797N917O748P181O650M779K648
56259G11162J642J300K71r97p90J012K802L823M590M946M086K591K168L107L999
56244G45712M035L716L467L400M117N732O708N885M935O238R023J0532J0407J0649
$$ y = [560166, 562948, 562807, 560246, 557368, 556259, 557410, 559389, 560083, 558606, 555888, 553193, 550532, 547230, 543460, 540268, 538355, 537852, 538869, 541101, 543149, 543605, 542765, 542109, 542288, 542907, 544069, 546500, 550028, 553506, 556417, 559119, 561414, 562567, 563021, 564398, 567290, 570579, 573369, 575880, 577866, 577979, 575804, 573098, 571875, 572341, 573645, 575604, 578656, 582867, 587764, 592550, 596120, 597792, 598379, 599581, 601985, 604595, 606447, 607512, 607975, 608121, 609082, 611981, 615964, 618804, 619949, 621162, 623558, 626061, 627679, 629221, 631446, 633370, 634091, 634844, 637521, 642238, 647784, 653480, 659167, 664296, 668484, 672442, 677239, 683156, 689904, 697085, 703735, 708514, 711162, 712804, 714104, 714375, 713378, 712588, 713600, 716402, 720225, 724815, 729761, 733847, 736438, 738606, 741713, 745712, 749747, 753463, 756930, 760330, 764447, 770179, 776887, 782772, 787707, 793945, 802968, 813500, 823907, 834556]
56230H34556J1583J1437J0111R746J0977J1990J2010J2466J3795J4418J3950J4345
56218I81384J6564J8978K0333K1555K3323K4721K5735K8280L2920L7028L8105
56207A268926L7047L6516L7797M0675M4603M8759N2361N5936O0804O6930P3103
56196A823457P9305Q6616R4607J01738J08766J18519J31266J43604J53306J62067
56186C003251J71822J81510J89574J96666K03395K07906K08212K04881J99072
56177D766289J89719J75028J55128J31200J03546P2587M0225Q244k3333n4602
56167E564031q3972j09691j31641j50017j63875j72825j78665j83336j86441j86507
56157D017061j83481j78378j71645j63595j55424j48192j41542j34579j27162
$$ y = [834556, 846139, 857576, 867687, 877433, 888410, 900400, 912410, 924876, 938671, 953089, 967039, 981384, 997948, 1016926, 1037259, 1058814, 1082137, 1106858, 1132593, 1160873, 1193793, 1230821, 1268926, 1305973, 1342489, 1380286, 1420961, 1465564, 1514323, 1566684, 1622620, 1683424, 1750354, 1823457, 1902762, 1989378, 2083985, 2185723, 2294489, 2413008, 2544274, 2687878, 2841184, 3003251, 3175073, 3356583, 3546157, 3742823, 3946218, 4154124, 4362336, 4567217, 4766289, 4956008, 5131036, 5286164, 5417364, 5520910, 5593497, 5633722, 5641966, 5618633, 5564031, 5480059, 5370368, 5238727, 5088710, 4924835, 4752010, 4573345, 4390009, 4203568, 4017061, 3833580, 3655202, 3483557, 3319962, 3164538, 3016346, 2874804, 2740225, 2613063]
56148B613063j19459j11366j03213r5820q9114q2123p4915o8865o4394o0226n5565
56137A688003n1058m6892m2210l7160l3180l0375k7039k2889j9975j9145j8377
56126A339703j6204j4038j3284j2824j1404j0009r680r272p584n694m964m733
56114A220013l966l227l018k168O9K288L189L607M426M767M118M062N750P871
56100A247781R105J0233J1862J2737J2630J4138J8694K3422K5104K5103K7080
56089A437889L1629L6468M0411M3994M7411N0728N5217O2080P0770Q0342R0792
56078B047731J01264J09058J12600J13234J11914J06653R6001Q2680P0808O1621
56068C013564N4447M9379M5868M1156L3439K4649J7064R575O38p826j3394j7843
$$ y = [2613063, 2493604, 2382238, 2279025, 2183205, 2094091, 2011968, 1937053, 1868188, 1803794, 1743568, 1688003, 1636945, 1590053, 1547843, 1510683, 1477503, 1447128, 1420089, 1397200, 1377225, 1358080, 1339703, 1323499, 1309461, 1296177, 1283353, 1271949, 1261940, 1252260, 1242988, 1235404, 1229710, 1224746, 1220013, 1216047, 1212820, 1209802, 1207634, 1207703, 1209991, 1213180, 1216787, 1221213, 1225980, 1230098, 1234160, 1239910, 1247781, 1256886, 1267119, 1278981, 1291718, 1304348, 1318486, 1337180, 1360602, 1385706, 1410809, 1437889, 1469518, 1505986, 1546397, 1590391, 1637802, 1688530, 1743747, 1805827, 1876597, 1956939, 2047731, 2148995, 2258053, 2370653, 2483887, 2595801, 2702454, 2798455, 2881135, 2951943, 3013564, 3068011, 3117390, 3163258, 3204414, 3237853, 3262502, 3279566, 3289141, 3289779, 3281953, 3268559, 3250716]
56056C250716k4859l4938m6296n8759p2553q5054r3206r7642j00406j00268r4846
56045B441889q5903p7679p0860o2926n3925m6995m3049l9273l3500k6694k0800
56034A880285j6889j5193j4388j1710o448j917j095j939n35L081O083Q094J0745
56021A838174J3344J3671J2369J2218J3606J4751J5578J7278J8882J8572J7596
56010B006039J8570K0719K1124J9954J9911K1190K1619K1296K2339K4374K4961
55999B242096K4263K4761K6493K7185K6915K8086L0750L2636L3757L6365M0071
55988B573378M1731M0730M0041M1416M3444M4943M6498M8248M9489N0734N3066
55977C073718N5734N7283N8285O0075O2232O4329O8020P3822P8387P9336P9948
$$ y = [3250716, 3225857, 3190919, 3144623, 3085864, 3013311, 2928257, 2835051, 2737409, 2637003, 2536735, 2441889, 2355986, 2278307, 2207447, 2144521, 2090596, 2043601, 2000552, 1961279, 1927779, 1901085, 1880285, 1863396, 1848203, 1833815, 1822105, 1815657, 1813740, 1812645, 1810706, 1810171, 1813252, 1819335, 1827429, 1838174, 1851518, 1865189, 1877558, 1889776, 1903382, 1918133, 1933711, 1950989, 1969871, 1988443, 2006039, 2024609, 2045328, 2066452, 2086406, 2106317, 2127507, 2149126, 2170422, 2192761, 2217135, 2242096, 2266359, 2291120, 2317613, 2344798, 2371713, 2399799, 2430549, 2463185, 2496942, 2533307, 2573378, 2615109, 2655839, 2695880, 2737296, 2780740, 2825683, 2872181, 2920429, 2969918, 3020652, 3073718, 3129452, 3186735, 3245020, 3305095, 3367327, 3431656, 3499676, 3573498, 3651885, 3731221, 3811169]
55966C811169Q4234R0283R4007R6510J01441J07705J11729J14789J20924J29429
55956D862220J36688J43688J54056J66173J75146J81612J90603K02506K13087
55947F425779K21795K32007K43669K53708K63211K76247K92235L07488L23274
55938H839413L44115L69366L95133M22911M57075M95573N33087N71487O16387
55929A3044547O65168P10008P51396P96612Q46258Q95301R46284J007536J078618
55920B0741728J151732J227431J314301J413247J517503J628166J753623J893757
55912C2641488K042271K205177K398910K630322K898847L218953L617487M105018
55904E5758473M670140N303028O001878O758040P564776Q443696R432747J0545976
$$ y = [3811169, 3895403, 3985686, 4079693, 4176203, 4277644, 4385349, 4497078, 4611867, 4732791, 4862220, 4998908, 5142596, 5296652, 5462825, 5637971, 5819583, 6010186, 6212692, 6425779, 6647574, 6879581, 7123250, 7376958, 7640169, 7916416, 8208651, 8516139, 8839413, 9183528, 9552894, 9948027, 10370938, 10828013, 11323586, 11856673, 12428160, 13044547, 13709715, 14419723, 15171119, 15967731, 16813989, 17709290, 18655574, 19663110, 20741728, 21893460, 23120891, 24435192, 25848439, 27365942, 28994108, 30747731, 32641488, 34683759, 36888936, 39287846, 41918168, 44817015, 48035968, 51653455, 55758473, 60428613, 65731641, 71733519, 78491559, 86056335, 94500031, 103932778, 114478754]
55896A14478754J1777805J3146782J4695884J6452075J8436882K0715821K3364510
55889B33068513K6355902K9507433L2456179L4465797L4200778L0043754K1167780
55882D41266136Q553129n169564j7099044k5484613l0109665l1722446l1321730
55875C08912203k9783163k7742600k5565114k3394059k1264837j9183832j7145090
55868A44833508j5152233j3253645j1526183j0014869q713909p604412o675441
55861G1892816n903997n249660m682820m196019l780827l416518l088929k799529
55853C8774517k547969k323384k119024j938445j781162j637631j503660j385190
55845B3538052j284038j192590j106885j031524r67487r07904q49938p98606p55049
$$ y = [114478754, 126256559, 139403341, 154099225, 170551300, 188988182, 209704003, 233068513, 259424415, 288931848, 321388027, 355853824, 390054602, 420098356, 441266136, 449819265, 444649701, 427550657, 402066044, 371956379, 340233933, 308912203, 279129040, 251386440, 225821326, 202427267, 181162430, 161978598, 144833508, 129681275, 116427630, 104901447, 94886578, 86172669, 78568257, 71892816, 65988819, 60739159, 56056339, 51860320, 48079493, 44662975, 41574046, 38774517, 36226548, 33903164, 31784140, 29845695, 28064533, 26426902, 24923242, 23538052, 22254014, 21061424, 19954539, 18923015, 17955528, 17047624, 16197686, 15399080, 14644031]
55836A4644031p12763o69092o29046n94286n59617n23845m93006m69010m45618
55827I547748m19507l95186l75124l54927l32226l11044k93516k76296k58793
55818F531129k46027k39426k33350k24521k16615k11797k06030j96777j87596
55809D568990j81155j75111j68534j64832j64403j61860j54582j46979j42356
55800C109178j37453j29231j20226j12940j05368r6389q9336q5817q1909p4883
55790B075626o8007o4389o1651n7083n2733n0866m9295m5652m1649l9120l6423
55779A508758l2780l1268l3199l4238l0759k5894k4589k6396k7719k7758k7705
55768A186453k6989k4579k1675j9675j7945j6335j6891k0137k2901k2694k1104
$$ y = [14644031, 13931268, 13262176, 12633130, 12038844, 11479227, 10955382, 10462376, 9993366, 9547748, 9128241, 8733055, 8357931, 8003004, 7670778, 7359734, 7066218, 6789922, 6531129, 6285102, 6045676, 5812326, 5587805, 5371190, 5159393, 4953363, 4756586, 4568990, 4387835, 4212724, 4044190, 3879358, 3714955, 3553095, 3398513, 3251534, 3109178, 2971725, 2842494, 2722268, 2609328, 2503960, 2407571, 2318235, 2232418, 2150509, 2075626, 2007619, 1943230, 1881579, 1824496, 1771763, 1720897, 1671602, 1625950, 1584301, 1545181, 1508758, 1475978, 1444710, 1411511, 1377273, 1346514, 1320620, 1296031, 1269635, 1241916, 1214158, 1186453, 1159464, 1134885, 1113210, 1093535, 1075590, 1059255, 1042364, 1022227, 999326, 976632, 955528]
55757I55528k0035j8260j4823j2063j1838j2046j0427q532q453q826p625n877
55745H16723n053l795q15J820J971J222J894L064L093L216M779N582L189m37j664
55730H34789o02J31J18O75J261L14j534k574l209m927p259q795r874j1444j2735
55715G74335j2915j3371j5274j6593j4761j0832p759o027m242k616k425l149l508
55702F60863m351p177j0718j2261j1663j0902j0404r052p355p286r084j0944j1798
55689E37868j1916j1108q897o167m394l510k608k157l267n354o774p115o896n769
55675D51936l451j555j983l973n096m646l861l436l203l647n187o446n530k890
55661C97032q20m69j263k559l900m376l763l491m359m475j939J666L270K826K758
$$ y = [955528, 935493, 917233, 902410, 890347, 878509, 866463, 856036, 847504, 839051, 830225, 822600, 816723, 811670, 807875, 807060, 808880, 810851, 812073, 813967, 817031, 820124, 823340, 828119, 833701, 836890, 836453, 834789, 834187, 834318, 834436, 835111, 836372, 836686, 835152, 832578, 829369, 824442, 817183, 808388, 798514, 787070, 774335, 761420, 748049, 732775, 716182, 701421, 690589, 682830, 676803, 672561, 669945, 667520, 664371, 660863, 656512, 649335, 638617, 626356, 614693, 603791, 593387, 584335, 576980, 569694, 560610, 549666, 537868, 525952, 514844, 505947, 499780, 495386, 491876, 489268, 487111, 483844, 478490, 471716, 464601, 457705, 451936, 448485, 446930, 444947, 440974, 435878, 431232, 427371, 423935, 420732, 417085, 411898, 405452, 399922, 397032, 396212, 395743, 394480, 391921, 388021, 383645, 379882, 376391, 372032, 367557, 365618, 367284, 370554, 373380, 376138]
55646C76138L686M105L820M111M466K698j117m025m365l605l260k797j719r81
55632C77155j022o43P00J478M25j404k226j869j270o90L43J979L805N158N464
55617C87383M806M037L676L047J460k90j009j073j738k773k692j218L16J111J697
55602C96740K310K294J467O27K94J41j06l59o66r43n00Q00J534N12j022r71L04
55585D02456O01n49j406j221j129j467j019K67L51j840m650o224o740o961o596
55570C63873n614n237n975o283m901l141l043m376n272m988m239l475k489j476
55556C03364j001r81q65p84j490l194n081o042n474l636j660q17j330k141k140
55541B66728j236rJ125J891J836O39j201k426j916J46K038J942Oj678j683r64
$$ y = [376138, 379824, 383929, 387749, 391860, 396326, 399024, 397907, 393882, 389517, 385912, 382652, 379855, 378136, 377155, 376133, 375490, 376190, 377668, 378093, 376689, 374463, 372594, 371324, 370634, 370977, 372956, 376761, 381919, 387383, 392189, 396226, 399902, 402949, 404409, 404119, 403110, 402037, 400299, 397526, 394834, 393616, 393932, 395043, 396740, 399050, 401344, 402811, 403438, 403732, 403873, 403767, 403408, 402742, 401799, 401299, 402099, 403633, 404145, 403123, 402152, 402456, 403057, 402508, 401102, 399881, 398752, 397285, 396266, 396533, 396884, 395044, 390394, 384170, 377430, 370469, 363873, 358259, 353022, 347047, 340764, 335863, 332722, 329679, 325303, 320031, 315043, 310804, 307329, 304840, 303364, 302363, 301382, 300517, 299733, 298243, 295049, 289968, 283926, 278452, 274816, 273156, 272339, 271009, 268868, 266728, 265492, 265483, 266608, 268499, 270335, 270974, 269773, 267347, 265431, 265577, 267615, 269557, 269563, 267885, 266202, 265238]
55525B65238j015j391p18N84P72j52m3K176M881O076N740M956M263L878M252N367
55509C04864O476P259Q204R121Q709O558M278L459L562K981J300p40k681m481
55495C58869n796o385o742p342p782p625p433p815p954o460l525j059n06j359
55481B81086j957j258K95J298Q89j02J9J629L147L096J946J152R92N35o29j754
55465B90384k024j541j054j311k554m208n148m848m056l964m784n692n987n709
55451B37504n079l985k377r37q76k674n058n721l627k83J782J667M23q25j981
55436B07953l044l377k579j246k66L3k81r57j302p04J46l18k212l491k501k10
55420A85644J178Q64l63j604k152j229R25K381J655N9P8J737K648J716N30M28
$$ y = [265238, 264223, 262832, 262114, 262698, 263470, 263318, 263275, 265451, 270332, 276408, 282148, 287104, 291367, 295245, 299497, 304864, 311340, 318599, 326803, 335924, 344633, 351191, 355469, 358928, 362490, 365471, 366771, 366031, 363350, 358869, 353073, 346688, 339946, 332604, 324822, 317197, 309764, 301949, 293995, 287535, 284010, 282951, 282445, 281086, 279129, 277871, 278166, 279464, 280353, 280251, 280270, 281899, 285046, 288142, 290088, 291240, 292232, 292767, 292138, 290384, 288360, 286819, 285765, 284454, 281900, 277692, 272544, 267696, 263640, 259676, 254892, 249200, 243213, 237504, 232425, 228440, 226063, 225126, 224250, 221576, 216518, 210797, 207170, 206887, 208669, 210336, 210759, 209934, 207953, 204909, 201532, 198953, 197707, 197441, 197474, 197193, 196236, 194934, 194230, 194376, 194058, 191846, 188355, 185854, 185644, 186822, 187686, 187323, 185719, 183567, 182338, 183263, 185644, 187299, 187358, 187436, 189173, 191821, 193537, 194067, 194495]
55404A94495M47n80j698j409l28l29j528k058r15N57N86p00j641j089N49K073
55388A86432K659K330J692J346J392J377P87k96j076p82M26J460J403N06k11k11
55372A99234N0q9n79q35n02K14Q69J110Q34L96N82J861L529M024K564J73j306
55355B12129j175l75j15n75j161j457j402q82K67J755K823K894K061R45J90Pk4
55338B15905n87j736k548k111q26j46q62k161k680k059r24J57J039J468J104L84
55322B03417N02J874L085K352l9j777j420k11k15j316j403N41K870L285J513p36
55306B12322j856j638q82m55p01j279j579j398j118j063j098j039j040j203j216
55291A94757p42J03R65J620J932J801J367Q86L10m28o95K60J768J961K38j684
$$ y = [194495, 194942, 194362, 192664, 191255, 190927, 190598, 189070, 187012, 186097, 186654, 187240, 186540, 184899, 183810, 184359, 186432, 189091, 191421, 193113, 194459, 195851, 197228, 198015, 197719, 196643, 195861, 196287, 197747, 199150, 199656, 199445, 199234, 199284, 199195, 198616, 197781, 197279, 197493, 198362, 199472, 200306, 200702, 201284, 203145, 206674, 210698, 213262, 213435, 212129, 210954, 210579, 210464, 209889, 208728, 207271, 205869, 204987, 205254, 207009, 209832, 212726, 214787, 215732, 215922, 215929, 215905, 215318, 213582, 211034, 208923, 208097, 207951, 207089, 204928, 202248, 200189, 199265, 199422, 200461, 201929, 203033, 203417, 203919, 205793, 208878, 211230, 211191, 209414, 207994, 207783, 207568, 206252, 204849, 205390, 208260, 211545, 213058, 212322, 210466, 208828, 207946, 207491, 206790, 205511, 203932, 202534, 201416, 200353, 199255, 198216, 197176, 195973, 194757, 194015, 194118, 195083, 196703, 198635, 200436, 201803, 202689, 202999, 202571, 201876, 202136, 203904, 205865, 206103, 204419]
55275B04419j917n53J199K657L200J632k013n072m991k917k216l572m138j931
55261A83787J386L081K726J720J074R65J315J688J389N25O6K63J45p55j468j237
55245A96670p50p12m62O97J845J720P98N85J315J845J541Q46J19p65j568j570
55229B02154n73O73J273R22O6l31M96K039K623J314p44j727j355p87p10p04m28
55212B04201k84n76r70j038q27o46o42o80m09L84J199J099j3r24o78L2o3q02q97
55193A97466N3J130J714K140K471J976M87q67j110q07j022j578j340j0J322J472
55177B03497L68j140k201k550k505k479k349j452N11K674L563K591O41q90j284
55162A96995o71N01J661K125J583O21J85M66Q16R38J322K075K142O05j607k400
$$ y = [204419, 202502, 201949, 203148, 205805, 209005, 210637, 208624, 203552, 198561, 195644, 193428, 189856, 185718, 183787, 185173, 188254, 190980, 192700, 193774, 194739, 196054, 197742, 199131, 199656, 199722, 199985, 200130, 199375, 197907, 196670, 195920, 195208, 194746, 195443, 197288, 199008, 199806, 200391, 201706, 203551, 205092, 205938, 206057, 205292, 203724, 202154, 201581, 202254, 203527, 204449, 204515, 204184, 204680, 206719, 209342, 210656, 209912, 208185, 206830, 206043, 205333, 204629, 204201, 203917, 203341, 202371, 201333, 200506, 199860, 199218, 198538, 198129, 198513, 199712, 200811, 200798, 199874, 199196, 199228, 199165, 198363, 197466, 197519, 198649, 200363, 202503, 204974, 206950, 207437, 206570, 205460, 204653, 203631, 202053, 200713, 200703, 202025, 203497, 203865, 202725, 200524, 197974, 195469, 192990, 190641, 189189, 189700, 192374, 195937, 198528, 199169, 198279, 196995, 196324, 196825, 198486, 200611, 202194, 202815, 203000, 203466, 204282, 205220, 206542, 208617, 210759, 211364, 209757, 207357]
55146B07357r75J194K004P76j417k871k601j104J39K72kL61J094J213R81J690
55130B08111L172L245N88k998m512l209q92O55J227J312R16k18j861l138k977
55115A99421q98K341M978N591M121J549j109l087l679k485o4K131K782J825N52
55100B13969L91J355K020J289j77r91r87j091j507j398l97Q00J646K278K532J870
55084B21602P33M17R42P07p80j644n55Q42K77j694k813k657k630k979k379o16
55068B06773O50L54n53p78k52N25J302J718J324N29L39Q13R28K93k44j88j57m40
55050B12936j50J208K507K481J543R65R47P55L55N77J561K210J625M02l9P82J765
55033B32430J550J62r74p96J48N85K07j80n5R1l78j305j853j302L88K400L424
$$ y = [207357, 206382, 207576, 209580, 210356, 208939, 206068, 203467, 202363, 202502, 202774, 202772, 203133, 204227, 205440, 206421, 208111, 211283, 214528, 215116, 212118, 207606, 204397, 203505, 204160, 205387, 206699, 207615, 207397, 205536, 202398, 199421, 198523, 200864, 205842, 211433, 215554, 217103, 215994, 212907, 209228, 206743, 206679, 208810, 211592, 213417, 213969, 214360, 215715, 217735, 219024, 218847, 217856, 216869, 215778, 214271, 212873, 212476, 213276, 214922, 217200, 219732, 221602, 222335, 222752, 223694, 224401, 223621, 221977, 221422, 222264, 222541, 220847, 218034, 215377, 212747, 209768, 207389, 206773, 207423, 207777, 207224, 206446, 206194, 206719, 208021, 209739, 211063, 211592, 211931, 212744, 213672, 213965, 213721, 213533, 213376, 212936, 212786, 213994, 216501, 218982, 220525, 221490, 222437, 223192, 223547, 224124, 225685, 227895, 229520, 229922, 229883, 230665, 232430, 233980, 234142, 233168, 232372, 232520, 233105, 233312, 233132, 233077, 233168, 232790, 231485, 229632, 228330, 228718, 231118, 234542]
55016B34542K742J071l3K48J251J705J035j59p56k54O48Q47J48o37r80j172j241
54999B39005m88J136K197J492j65j140j271j489j809j466p39o96j071l86J415
54984B34525K422J528K2m73j00K94P76J556J747N15j241j852j193p20j281k003
54968B34522j535K92K337L249K603J091l51j402k183k671k938l513m491m593k540
54953B17877N76K023J004j49O72K477L060K332J850J945J340m06j958k144j457
54938B29042j077j298j430p34R16K871M055L789K458J155P35J343K499L348L161
54923B50833K081J075P31N04l37j383j560o77K67L99n3k65J45P52P90kj008j440
54905B50852j405j727k512k677j474K85J426K123L274M509M277K101m79j680j341
$$ y = [234542, 237284, 238355, 238322, 238570, 239821, 241526, 242561, 242402, 241646, 241392, 242040, 242887, 243035, 242398, 241418, 240246, 239005, 238517, 239653, 241850, 243342, 243177, 242037, 240766, 239277, 237468, 236002, 235263, 234567, 233496, 233110, 234525, 236947, 238475, 238497, 238024, 237924, 238218, 238994, 240550, 242297, 242812, 241571, 239719, 238526, 237806, 236525, 234522, 232987, 233279, 235616, 238865, 241468, 242559, 242208, 240806, 238623, 235952, 233014, 229501, 225010, 220417, 217877, 218453, 220476, 221480, 221331, 222003, 224480, 227540, 229872, 231722, 233667, 235007, 234601, 232643, 230499, 229042, 227965, 226667, 225237, 224503, 225419, 228290, 232345, 236134, 238592, 239747, 240482, 241825, 244324, 247672, 250833, 252914, 253989, 254720, 255224, 254887, 253504, 251944, 251267, 251534, 251933, 251880, 251615, 251760, 252512, 253302, 253300, 252292, 250852, 249447, 247720, 245208, 242531, 241057, 241342, 242768, 244891, 248165, 252674, 256951, 259052, 258573, 256893, 255552]
54890B55552m56K76P86J011P39%p96j110o18M16J077N77o18j030K3J386J463L01
54872B58979o27n38j88l94o91k36P32J296J394J864K980L980M268M224M366M495
54856B85904M291M180M866O263P475P716O949N858N338N606N527L551k74l935
54842C49315n682n886n976o374o522o252n858n152l705j883n80j64n00j505k646
54827B90630k645j211l16j839m392m745k338J89J223K181M252N863N235L461K852
54812B98400L655M469M947N977P668R025R432R004P642N113J998n82k219l395
54798C61134m549n669o557o998o980p054p716q208p163m939l808m692n366l592
54784B77843o13N56o53k100k382k101j819j119j41q8j426l079m045m458m523l772
$$ y = [255552, 255096, 255372, 256158, 257169, 257908, 257908, 257112, 256002, 255384, 255800, 256877, 257454, 256836, 255806, 255829, 257215, 258678, 258979, 258352, 257814, 257626, 257232, 256541, 256305, 257037, 258333, 259727, 261591, 264571, 268551, 272819, 277043, 281409, 285904, 290195, 294375, 299241, 305504, 312979, 320695, 327644, 333502, 338840, 344446, 349973, 353524, 353250, 349315, 343633, 337747, 331771, 325397, 318875, 312623, 306765, 301613, 297908, 296025, 295445, 295281, 294781, 293276, 290630, 287985, 286774, 286458, 284619, 280227, 275482, 273144, 273333, 274556, 276737, 280989, 286852, 292087, 295548, 298400, 302055, 306524, 311471, 317448, 325116, 334141, 343573, 352577, 360219, 365332, 367330, 366748, 364529, 361134, 356585, 350916, 344359, 337361, 330381, 323327, 315611, 307403, 300240, 295301, 291493, 286801, 281435, 277843, 277230, 277786, 277133, 275033, 272651, 270550, 268731, 267612, 267471, 267383, 265957, 262878, 258833, 254375, 249852, 246080]
54768B46080k003O5J703K814L284K779J570N67M2p29k045l008k739j432K77K146
54752B49371L915M884M590L291J353j066l231l730k129J8P52r8j128j392j110
54737B54290n51N45K033K805K053O27J81R77J495O79k58N78K787L707J806j203
54721B72551k486j429K25R60R12Q59R35P42R8n81m44J051L260M591M153K880K530
54704B90807L929O622R598J1661J1736R937P954P337P679P446O140M461K632K2
54690C87961l385o419p883p606o257m961m802n729o175m919l059k729m031m842
54676C15164l876k169j124p54o70j208k449l307k753j205K42J183J695J605J027
54661C01401Q98K008L862N325N997O186O046N664N591O299P088O404L511m71l429
$$ y = [246080, 244077, 244142, 245845, 248659, 251943, 254722, 256292, 256859, 256901, 256172, 254127, 251119, 248380, 246948, 247225, 249371, 253286, 258170, 262760, 266051, 267404, 266338, 263107, 259377, 257248, 257266, 258018, 257920, 256792, 255400, 254290, 253739, 254284, 256317, 259122, 261175, 261802, 261983, 262960, 264455, 265134, 264876, 265454, 268241, 271948, 273754, 272551, 270065, 268636, 268861, 269821, 270733, 271592, 272527, 273269, 273367, 272786, 272342, 273393, 276653, 281244, 285397, 288277, 290807, 294736, 301358, 310956, 322617, 334353, 344290, 352244, 359581, 367260, 374706, 380846, 385307, 387939, 387961, 384576, 378157, 370274, 362668, 356411, 351450, 346648, 340919, 334744, 329825, 326766, 324037, 320006, 315164, 311288, 309119, 307995, 307241, 306571, 305363, 302914, 299607, 296854, 295649, 295891, 297074, 298769, 300374, 301401, 302299, 304307, 308169, 313494, 319491, 325677, 331723, 337387, 342978, 349277, 356365, 362769, 366280, 365809, 362380]
54646C62380m119l253k741l718n482o584o628o373o338o151n389m211l082k445
54632B95866k670l541l989l296k346k457l114k480m19Q60rj470j395r5M90m08
54616B69527j918l137l621k742k57K516L437J856p20k392k604j938r96R5J313
54601B58419K196J938L27j479j874p00M62K89o96j120o70k22m58j103j418r77
54585B52914o8N58N95P51J734K821K544R92JM06O32q92l273m473m039k798q08
54568B47597K255N008M951J760j712k565q81J076J690J100J77n00o92l48J89J83
54552B59288p79j924j690L90K590K680P21j043j259j068j846k782k169k27J029
54537B51911N03q52j581j220j48J003J592J453J262J810K855L330K651J268K0
$$ y = [362380, 358261, 355008, 352267, 348549, 343067, 336483, 329855, 323482, 317144, 310993, 305604, 301393, 298311, 295866, 293196, 289655, 285666, 282370, 280024, 277567, 274453, 271973, 271554, 272414, 272405, 270935, 269540, 269445, 269935, 269527, 267609, 264472, 260851, 258109, 257852, 260368, 263805, 265661, 264941, 262549, 259945, 258007, 257011, 257106, 258419, 260615, 262553, 262880, 261401, 259527, 258827, 259289, 259578, 258882, 257762, 257092, 256870, 256412, 255309, 253891, 252914, 252846, 253404, 253999, 254750, 256484, 259305, 261849, 262841, 262842, 263248, 263880, 262988, 259715, 255242, 251203, 248405, 247597, 249852, 254860, 259811, 261571, 259859, 257294, 256413, 257489, 259179, 260279, 260456, 259956, 259264, 258916, 259105, 259288, 258509, 256585, 254895, 255285, 257875, 260555, 261276, 260233, 258974, 257906, 256060, 253278, 251109, 250882, 251911, 252414, 251562, 249981, 248761, 248613, 249616, 251208, 252661, 253923, 255733, 258588, 261918, 264569, 265837, 265857]
54522B65857n54n02n18j291k364k319q04N40K58p41o74K55M72O7Q47K979L910
54505B65418J799j701l463k642j030l94p37r75l25J072K380K858K503J793R75
54490B67531J50r6R44K831L966L273J332m86j327j025K64J949L101L228K721K215
54474B90571J858J411O24o96k418l721l544j774L97J626J474L28j156k315k784
54459B79881k736k462j817p19J5m50j228l17K460M454L197n20l678m459l574k577
54443B65470k021j295L43K622L981K806n47l641m285k489K56K634L752K821J34
54428B70541k212j990O50L301L849K097o96k765k618j99K595L637K883J900J359
54413B82332N03p24q94O10K026J349q55k146j235Q88K569L074K597J760J291J531
$$ y = [265857, 265303, 264801, 264283, 262992, 260628, 258309, 257505, 258045, 258303, 257562, 256888, 257143, 257615, 257682, 258529, 261508, 265418, 267217, 265516, 262053, 259411, 258381, 257987, 257250, 256275, 255950, 257022, 259402, 262260, 264763, 266556, 267531, 267681, 267585, 268529, 271360, 275326, 278599, 279931, 279445, 278118, 277093, 277357, 279306, 282407, 285635, 288356, 290571, 292429, 293840, 294464, 293768, 291350, 287629, 284085, 282311, 282708, 284334, 285808, 286136, 284980, 282665, 279881, 277145, 274683, 272866, 272147, 272162, 271712, 270484, 270167, 272627, 277081, 280278, 279758, 276080, 271621, 268047, 265470, 263449, 262154, 262497, 265119, 269100, 271906, 271359, 267718, 263433, 260944, 261200, 263834, 267586, 270407, 270541, 268329, 266339, 266989, 270290, 274139, 276236, 275540, 272775, 270157, 269958, 272553, 276190, 279073, 280973, 282332, 282835, 282111, 281217, 281827, 283853, 285202, 284347, 282201, 280966, 281854, 284423, 287497, 290094, 291854, 293145, 294676]
54397B94676J998J851Q77l46j181j397j045l93R2J34o8l19r11j963k599j799n5
54380B87552Q88K87n87k84Q72J492J149P05Q74J318J270M46p37j484j264m74j81
54363B91842q04j431j028N0O00L44J88P60J635K255K554K419J521J89m16K60J325
54346C02263J655J312R92P61L31kK78P61N79n0J02J422K625K385J037K5P0N71
54328C17117O90M70O30J487K381K362J376M66M65Q77N27p85j874j611k64R40J273
54311C26527J108J126J380J390R55N18O26J291K127K906L597L969L685K864K076
54296C56145J631J347J143J217J312M87j694m186n395m988m152m106m836n318
54282C28607m602k725p99p2o95j652k023j848j515r34M5R74J272J030O06j14j244
$$ y = [294676, 296674, 298525, 299402, 299056, 297875, 296478, 295433, 295040, 295132, 295266, 295198, 294879, 293968, 292005, 289406, 287607, 287552, 288440, 288727, 288140, 287856, 288728, 290220, 291369, 292074, 292948, 294266, 295536, 295982, 295245, 293761, 292497, 292023, 291842, 291038, 289607, 288579, 288629, 289229, 289573, 289761, 290521, 292156, 294411, 296965, 299384, 300905, 301094, 300678, 300938, 302263, 303918, 305230, 306222, 306983, 307314, 307312, 307590, 308351, 308930, 308880, 308982, 310404, 313029, 315414, 316451, 316476, 316546, 317117, 317807, 318277, 318907, 320394, 322775, 325137, 326513, 326979, 327444, 328321, 328848, 328063, 326189, 324578, 324314, 325254, 326527, 327635, 328761, 330141, 331531, 332486, 333004, 333630, 334921, 337048, 339954, 343551, 347520, 351205, 354069, 356145, 357776, 359123, 360266, 361483, 362795, 363282, 361588, 357402, 352007, 347019, 342867, 338761, 333925, 328607, 324005, 321280, 320481, 320409, 319714, 318062, 316039, 314191, 312676, 311742, 311787, 312761, 314033, 315063, 315669, 315555, 314311]
54265C14311k097j831p79q3o8L7O87J343J475J361J483J745J620O73j038k701
54249C16138l042j675J8K60r82k121k182j570p19M67J383O57j630l081j765J036
54233C01192K353J207o76j498j169l97N17J410J765J301M94J21M51J239K101K615
54217C13026K335J191j55p03j24P24N23j047k724k890j363L55Q85N63Q30K260
54201C13686L780M033L050K067J855J803R94l49j144r93o54p53q58k85P90J685
54185C28707K077J925J084q1l46R45K367J736j023l527l762k113k64P74R76O23
54169C30098J04k50n84j191j530n48J510K638J309j566l716m014l115k179j835
54154C15131k027k106j324Q5P05m66k530l476k365j62J442J561P02J61P13J683
$$ y = [314311, 312214, 310383, 309604, 309521, 309453, 309490, 310177, 311520, 312995, 314356, 315839, 317584, 319204, 319877, 318839, 316138, 313096, 311421, 311439, 311699, 310717, 308596, 306414, 304844, 304125, 304592, 305975, 306632, 305002, 301921, 300156, 301192, 303545, 304752, 304076, 302578, 301409, 301012, 301529, 302939, 304704, 306005, 306499, 306620, 307071, 308310, 310411, 313026, 315361, 316552, 316397, 315694, 315570, 316294, 316817, 315770, 313046, 310156, 308793, 309148, 310033, 310596, 311426, 313686, 317466, 321499, 324549, 326616, 328471, 330274, 331268, 330919, 329775, 328782, 328128, 327375, 326517, 326232, 327022, 328707, 330784, 332709, 333793, 333712, 333366, 334311, 336678, 338414, 337391, 333864, 330102, 327989, 327725, 328499, 329475, 330098, 330202, 329952, 329368, 328177, 326647, 326099, 327609, 330247, 331556, 329990, 326274, 322260, 319145, 316966, 315131, 313104, 310998, 309674, 309759, 310464, 309998, 307468, 303992, 301627, 301465, 302907, 304468, 305170, 305331, 306044, 307727]
54138C07727J743P57N8N71J462J313j2j395j814j029M82J630J390P5q14o31n46
54121C10967j532k445j565P39K555L184L621M355M497L422J839P23K98M34R88
54106C32080J451J161J46j035k288l723m550l655j566k07k87m15M47J243O08q69
54090C18541j578j139m20P1M95P88O67K93M0j70n17p51p95j284k376k640o61K461
54072C11025L807K197l10r76N81K574L343K634J250K13J03O58J097R89O10M04
54056C30199N52J122K036K700K358J200N11J091K157K402J675Q87O47Q35J244
54041C51616J738J912J441Q08Q19J356J507J088J083K204L811M844N025M663M002
54026C87917L365L267L544L009Q90j838l501l776l642l548k936j676p62j017j954
$$ y = [307727, 309470, 310227, 310285, 310856, 312318, 313631, 313619, 312224, 310410, 309381, 309863, 311493, 312883, 312958, 312144, 311513, 310967, 309435, 306990, 305425, 306164, 308719, 311903, 315524, 319879, 324376, 327798, 329637, 330360, 330658, 331092, 332080, 333531, 334692, 334838, 333803, 331515, 327792, 323242, 319587, 318021, 317814, 317527, 317112, 317559, 318802, 319410, 318541, 316963, 315824, 315404, 315475, 315970, 316758, 317425, 317718, 317758, 317588, 317071, 316320, 315525, 314241, 311865, 309225, 308564, 311025, 314832, 317029, 316719, 315743, 316324, 318898, 322241, 324875, 326125, 326338, 326441, 327099, 328196, 329185, 329795, 330199, 330751, 331873, 333909, 336609, 338967, 340167, 340678, 341769, 343926, 346328, 348003, 348890, 349537, 350372, 351616, 353354, 355266, 356707, 357515, 358334, 359690, 361197, 362285, 363368, 365572, 369383, 374227, 379252, 383915, 387917, 391282, 394549, 398093, 401102, 401992, 400154, 396653, 392877, 389235, 385687, 382751, 381075, 380313, 379296, 377342]
54011C77342k459k030r41L04J211J514J515J867K673L264L091K424J879J596J247
53996C94497N89j81l96O88L001N203N866N242N008O001P068O712N058L522L177
53981D51055M166O057P926Q582P648O235N762O303O818O779O727P290Q382R419
53967E49149R714Q739O654M674M261N646P357P441N088J283j885k907k123j209
53953F01882j206j628j734j887k901m690o480p932r022r254q282p124p317q706
53939E23719r374q137n925m211l275k782k876l667m411m334l746l367l066k464
53925D62084k287l622n814o649n206l183k504k698j953j15J023L98q25r65N2J068
53909D28804J342R49J28q66j519j506j089m16J125L823O329O802N380M233M797
$$ y = [377342, 374883, 372853, 371912, 372216, 373427, 374941, 376456, 378323, 380996, 384260, 387351, 389775, 391654, 393250, 394497, 395086, 394905, 394509, 395197, 398198, 403401, 409267, 414509, 419517, 425518, 432586, 439298, 444356, 447878, 451055, 455221, 461278, 469204, 477786, 485434, 491669, 497431, 503734, 510552, 517331, 524058, 531348, 539730, 549149, 558863, 567602, 574256, 578930, 583191, 588837, 596194, 603635, 608723, 610006, 608121, 605214, 603091, 601882, 600676, 599048, 597314, 595427, 592526, 587836, 581356, 573424, 564402, 555148, 546866, 539742, 532425, 523719, 514345, 506208, 500283, 496072, 492797, 490015, 487139, 483472, 479061, 474727, 470981, 467614, 464548, 462084, 459797, 456175, 450361, 443712, 438506, 435323, 432819, 430121, 428168, 428053, 429076, 429474, 428649, 427684, 427736, 428804, 430146, 431095, 431223, 430357, 428838, 427332, 426243, 425827, 426952, 430775, 437104, 443906, 449286, 453519, 458316]
53894D58316O145O622N928M901M280M526O055Q701J1412J3183J3834J3440J1723
53881E69066Q701N248K258j07j770k131r86P72K146L093L619K925P13j439j527
53866E90581M83L033N270P473R586J0925J1301J1055J0174Q717P878Q867J0857
53853F96200J1826J1531J1711J2957J3599J2490J0782R702Q365N579K408R36J193
53840H09279J232R0j120j297j095j951m183o720q332q757q736r181j0355j1795
53826G37079j2928j3522j3638j3467j3220j2930j2414j1672j1145j1091j0965
53815F00087r989q309o933o499o701o846o447n379m192m027n424p309q132p825
53801E06075p478p215n911l348j187r78k345l798m452m252l485k781k809l303
$$ y = [458316, 464461, 471083, 477011, 481912, 486192, 490718, 496773, 505474, 516886, 530069, 543903, 557343, 569066, 577767, 583015, 585273, 585166, 583396, 581265, 580279, 581051, 583197, 586290, 589909, 592834, 593547, 592108, 590581, 591064, 594097, 599367, 606840, 616426, 627351, 638652, 649707, 659881, 668598, 676476, 685343, 696200, 708026, 719557, 731268, 744225, 757824, 770314, 781096, 790798, 799163, 804742, 807150, 808086, 809279, 810511, 810601, 809481, 808184, 807089, 805138, 800955, 794235, 785903, 777146, 768410, 759229, 748874, 737079, 724151, 710629, 696991, 683524, 670304, 657374, 644960, 633288, 622143, 611052, 600087, 590098, 581789, 574856, 568357, 561656, 554810, 548363, 542984, 538792, 534765, 529341, 522032, 513900, 506075, 498597, 491382, 485471, 482123, 480936, 479958, 477613, 473815, 469363, 465111, 461626, 458845, 456036, 452733]
53787D52733l184k205j461j601j704r05p5n95k176l275l188k501j702o26P62K045
53771D30342K957L555L784L484K761J849P36m80j109m91R62J982J803Q87L18P94
53755D54134K141L488L876L012J505M03N24J999M061N474N712N548N919O517O462
53740E10775O137O903Q848J0329J0327R732R507R072P733O326N974O106N334L705
53726F16808K490K182K185K185K371K323J119j180l357m576n236o022o934p559
53712E96799p747p704p716p859p844p391o914p230q279q800p889o218n030m611
53698D95567m508m597m979n307n168m683m032k895j252M1L43J54L7m53j523j925
53682D54820o86Q68O26j204k541k476j809q53Q26K407K067M2r08P56L038L210
$$ y = [452733, 449549, 447344, 445883, 444282, 442578, 441673, 441598, 441003, 438827, 435552, 432364, 429863, 428161, 427535, 428297, 430342, 433299, 436854, 440638, 444122, 446883, 448732, 449468, 448988, 447879, 447388, 448350, 450332, 452135, 453022, 453340, 454134, 456275, 459763, 463639, 466651, 468156, 468559, 469083, 471082, 475143, 480617, 486329, 491877, 497796, 504313, 510775, 516912, 523815, 532663, 542992, 553319, 563051, 572558, 581630, 589363, 595689, 601663, 607769, 613103, 616808, 619298, 621480, 623665, 625850, 628221, 630544, 631663, 630483, 627126, 622550, 617314, 611292, 604358, 596799, 589052, 581348, 573632, 565773, 557929, 550538, 543624, 536394, 528115, 519315, 511426, 505208, 500178, 495567, 491059, 486462, 481483, 476176, 471008, 466325, 462293, 459398, 458146, 458187, 458530, 458684, 458721, 458268, 456745, 454820, 454134, 455002, 455628, 454424, 451883, 449407, 447598, 446745, 447571, 449978, 452045, 452087, 451179, 451935, 454973, 458183]
53666D58183J345l81o91o3N78P47N07O35K149M886P166P587O534N293M378L544
53650E02397K768K421K726L567M436M344K702N15k28R91K464K616K029K157L082
53635E38987L790L878L707L402L044L389N032P029P601O227L968J824Lj111p87
53620E89983O70J472K23k328m150m104k639p01J083K132J791P6j875k745k365
53605E76523j627j087l36R24J900J581K48p52p12k92l45p99j046q46l94J30O55
53588E73725J072J320J433J397J179R63J042J397J766K145K749L408L595L359
53574F00550L521M577N797O036N141M020L554L819M382M863N142N303N595O375
53560F68675P790R345J0001R230P907P483Q023Q003O652N390N805O974O637M644
$$ y = [458183, 459528, 459147, 458456, 458393, 458971, 459718, 460225, 460860, 463009, 467895, 475061, 482648, 489182, 494475, 498853, 502397, 505165, 507586, 510312, 513879, 518315, 522659, 525361, 525876, 525648, 526639, 529103, 531719, 533748, 535905, 538987, 542777, 546655, 550362, 553764, 556808, 560197, 565229, 572258, 579859, 586086, 590054, 591878, 591881, 590770, 589983, 590653, 592125, 592348, 590020, 585870, 581766, 579127, 578426, 579509, 581641, 583432, 583508, 581633, 578888, 576523, 574896, 573809, 573473, 574397, 576297, 577878, 578126, 577374, 576662, 576370, 576025, 575226, 574180, 573334, 572940, 573070, 573725, 574797, 576117, 577550, 578947, 580126, 581089, 582131, 583528, 585294, 587439, 590188, 593596, 597191, 600550, 604071, 608648, 614445, 620481, 625622, 629642, 633196, 637015, 641397, 646260, 651402, 656705, 662300, 668675, 676465, 685810, 695811, 705041, 712948, 720431, 728454, 736457, 743109, 748499, 754304, 761278, 767915, 772559]
53546G72559L268L784M756M591L947M220M967M648L155J861J362P84m63j643j916
53531H09880j598j540j785j555m45Q05R18o40l009m583m264k154O25K528K367
53516G95550K08k429l823l674l078l024l467l925m166m069l488k602j886j479
53502G54648j098p19o00n70m2R70J695J775J773K197K805L189L232K763J819J412
53486G75249K640M664N255M145L880O082Q774R296Q266Q203R367R908R647J0654
53472H76030J3606J6311J6934J6529J7032J8380J9186J9175J9473K0972K3370
53461A076998K5637K6854K6965K7004K8062K9915L1433L2329L3416L4943L6004
53450A409560L6221L6588L7843L9129L9469L9410L9936M0539L9905L8116L6693
$$ y = [772559, 775827, 779611, 784367, 788958, 792905, 797125, 802092, 806740, 809895, 811756, 813118, 813902, 813439, 811796, 809880, 808282, 806742, 804957, 803402, 802957, 803762, 804680, 804040, 801031, 796448, 792184, 790030, 790655, 793183, 795550, 795758, 793329, 789506, 785832, 782754, 779730, 776263, 772338, 768172, 764103, 760615, 758013, 756127, 754648, 753550, 752831, 752231, 751661, 751619, 752589, 754284, 756059, 757832, 760029, 762834, 766023, 769255, 772018, 773837, 775249, 777889, 782553, 787808, 791953, 795833, 801915, 810689, 819985, 828251, 836454, 845821, 855729, 865376, 876030, 889636, 905947, 922881, 939410, 956442, 974822, 994008, 1013183, 1032656, 1053628, 1076998, 1102635, 1129489, 1156454, 1183458, 1211520, 1241435, 1272868, 1305197, 1338613, 1373556, 1409560, 1445781, 1482369, 1520212, 1559341, 1598810, 1638220, 1678156, 1718695, 1758600, 1796716, 1833409]
53439A833409L6566L7257L7904L7929L6721L4054L1055K9490K9620K9825K8953
53428B202783K7931K8180K9313K9553K8130K6149K4973K4573K3866K2208K0112
53417B487771J8523J7521J5972J2714Q194M422K868K601J196k539p381j1399j4174
53404B536289j6732j9650k2015k2474k0924j8889j8284j9911k2986k6026k7997
53393B300401k8671k8170k6799k5279k4598k5136k6249k7024k7094k6340k4376
53382B010665k1121j7579j5057j3515j1572q394m770k048o79j85J60J111L190
53369A920206N984Q150Q873R073J0429J3427J6955J9777K1777K3630K5743K7752
53357B111776K9035K9696L0887L3768L8049M2161M5124M7632N0753N4241N6961
$$ y = [1833409, 1869975, 1907232, 1945136, 1983065, 2019786, 2053840, 2084895, 2114385, 2144005, 2173830, 2202783, 2230714, 2258894, 2288207, 2317760, 2345890, 2372039, 2397012, 2421585, 2445451, 2467659, 2487771, 2506294, 2523815, 2539787, 2552501, 2560695, 2565117, 2567985, 2570586, 2571782, 2569243, 2561862, 2550463, 2536289, 2519557, 2499907, 2477892, 2455418, 2434494, 2415605, 2397321, 2377410, 2354424, 2328398, 2300401, 2271730, 2243560, 2216761, 2191482, 2166884, 2141748, 2115499, 2088475, 2061381, 2035041, 2010665, 1989544, 1971965, 1956908, 1943393, 1931821, 1923427, 1918657, 1916609, 1915930, 1915745, 1915905, 1917016, 1920206, 1926190, 1934340, 1943213, 1952286, 1962715, 1976142, 1993097, 2012874, 2034651, 2058281, 2084024, 2111776, 2140811, 2170507, 2201394, 2235162, 2273211, 2315372, 2360496, 2408128, 2458881, 2513122, 2570083]
53346B570083N8590N9930O1652O3762O6334O9778P4009P8049Q0952Q2744Q4075
53335C349958Q5330Q6360Q6802Q6342Q4972Q3208Q1804Q0832P9326P6269P1975
53324D253178O8062O5799O4642O2642N8243N1557M3965L6883L1008K6234K1721
53313D783934J6286R345J416o772j5420k4952l4354m1578m6277n0832n7418o4818
53301D468560o9652p0520o9498o9380p0734p2169p2432p1385o9482o7178o4829
53290C701301o2703o1040o0121o0131o0827o1629o2062o1981o1235n9473n6419
53279C033680n2310m7983m4517m2594m1892m1212l9458l6554l3248l0293k8104
53268B595515k6979k7074k8071k9188k9700k9305k8121k6600k5248k4099k2576
$$ y = [2570083, 2628673, 2688603, 2750255, 2814017, 2880351, 2950129, 3024138, 3102187, 3183139, 3265883, 3349958, 3435288, 3521648, 3608450, 3694792, 3779764, 3862972, 3944776, 4025608, 4104934, 4181203, 4253178, 4321240, 4387039, 4451681, 4514323, 4572566, 4624123, 4668088, 4704971, 4735979, 4762213, 4783934, 4800220, 4809565, 4810981, 4804209, 4788789, 4763837, 4729483, 4687905, 4641628, 4590796, 4533378, 4468560, 4398908, 4328388, 4258890, 4189510, 4118776, 4046607, 3974175, 3902790, 3833308, 3766130, 3701301, 3638598, 3577558, 3517437, 3457306, 3396479, 3334850, 3272788, 3210807, 3149572, 3090099, 3033680, 2981370, 2933387, 2888870, 2846276, 2804384, 2763172, 2723714, 2687160, 2653912, 2623619, 2595515, 2568536, 2541462, 2513391, 2484203, 2454503, 2425198, 2397077, 2370477, 2345229, 2321130, 2298554]
53257B298554k0286j7820j6211j5625j5034j3340j0458p232m557k603p00J960
53245B176648N258Q078R691J0897J3118J6641K0360K3246K5221K6617K7682K8777
53233B392234L0326L2175L3640L4450L4943L5026L3842L1112K8004K5778K4092
53222B735622K1639J8145J4636J1714Q683M748J84m316q705j3187j7205j9852
53210B752106k1411k3467k6977l0909l3511l4539l5356l6928l8730l9861m0350
53199B390067m0750m1056m0858m0234l9789l9783l9867l9683l9243l8651l7837
53188A952316l6731l5541l4754l4884l5947l7078l7194l6393l6115l7187l8257
53177A552235l7190l3853l0392k8505k7496k5626k2547j9582j7988j7746j8021
$$ y = [2298554, 2278268, 2260448, 2244237, 2228612, 2213578, 2200238, 2189780, 2182548, 2177991, 2175388, 2174688, 2176648, 2181906, 2189984, 2199675, 2210572, 2223690, 2240331, 2260691, 2283937, 2309158, 2335775, 2363457, 2392234, 2422560, 2454735, 2488375, 2522825, 2557768, 2592794, 2626636, 2657748, 2685752, 2711530, 2735622, 2757261, 2775406, 2790042, 2801756, 2810439, 2815187, 2815371, 2811055, 2802350, 2789163, 2771958, 2752106, 2730695, 2707228, 2680251, 2649342, 2615831, 2581292, 2545936, 2509008, 2470278, 2430417, 2390067, 2349317, 2308261, 2267403, 2227169, 2187380, 2147597, 2107730, 2068047, 2028804, 1990153, 1952316, 1915585, 1880044, 1845290, 1810406, 1774459, 1737381, 1700187, 1663794, 1627679, 1590492, 1552235, 1515045, 1481192, 1450800, 1422295, 1394799, 1369173, 1346626, 1327044, 1309056, 1291310, 1273289]
53166A273289j8223j8464j9228k0729k2592k4157k5081k5538k5848k6087k6074
53155A021268k5596k4591k3220k1772k0445j9235j8088j6940j5709j4550j4162
53144H06960j5144j6738j6886j4434j0864q986r905j2090j3403j3158j2011j0728
53132F52613r676r060q989r308r566r243q067o406n115m790n156n515n550n336
53118E50836m841m036l391l507m208m626m333l800l541l390k919k167j580j471
53104E03026j731j979j943j719j589j447q07L38J120Q08j07n13j0Q95J650J892
53088D97884J246k61j697k060j532j006p32l96k92j041k104k019m51J225J789
53073D88553J418P05k08r47o75N53J306O08n80o66N64K037K807K546J383P3l35
$$ y = [1273289, 1255066, 1236602, 1217374, 1196645, 1174053, 1149896, 1124815, 1099277, 1073429, 1047342, 1021268, 995672, 971081, 947861, 926089, 905644, 886409, 868321, 851381, 835672, 821122, 806960, 791816, 775078, 758192, 743758, 732894, 723908, 714003, 701913, 688510, 675352, 663341, 652613, 642937, 633877, 624888, 615580, 606014, 596771, 588704, 582298, 577183, 572393, 567237, 561722, 556172, 550836, 545995, 541959, 538568, 535061, 530853, 526227, 521894, 518094, 514553, 511163, 508244, 506077, 504497, 503026, 501295, 499316, 497373, 495654, 494065, 492618, 491811, 492149, 493269, 494077, 493970, 493457, 493447, 494342, 495992, 497884, 499130, 498869, 497172, 495112, 493580, 492574, 491842, 491446, 491154, 490113, 488009, 485990, 485539, 486764, 488553, 489971, 490676, 490468, 489521, 488846, 489399, 490705, 491313, 490733, 490067, 490631, 492668, 495475, 498021, 499404, 499477, 499142]
53056D99142K62P43N09N15J667L039L039J731N69J27l70j259j645q99J51K56n91
53039E06986j282j137q51j531l037l735k463l25L80r08k236j738M2J127N71r62
53023D88901k410l019k365p41O13N84n11j340j119k58M06L86k31q89j021p93r45
53006D75248j615j930j277k95J01M2K67Q65J327J318O85o57j993j770N26L025
52990D73867L370J529m43j061m02J008K622L308K123j05j384j123o37q32j022
52975D80818n58n0n2M5P32J166M82n43n29M34J028Q07N95Q02N33r47k712k947
52957D79104j148J135K023J394O87Q42J245J044O15Q56J589J846J471J265J449
52942D95417J233K29p76j015p62o02n36m24n58r96r96nJ273J686J238R96J537
$$ y = [499142, 499404, 500147, 500656, 501171, 502838, 505877, 508916, 510647, 511216, 511343, 510973, 509714, 508069, 507170, 507321, 507577, 506986, 505704, 504567, 503716, 502185, 499148, 495413, 492950, 492625, 493005, 492097, 489861, 488123, 488165, 489292, 489863, 488901, 486491, 483472, 481107, 480366, 480979, 481563, 481052, 479712, 478593, 478335, 478741, 479127, 478896, 478007, 476986, 476193, 475248, 473633, 471703, 470426, 470131, 470232, 470274, 470541, 471406, 472733, 474051, 474736, 474079, 472086, 470316, 470842, 473867, 477237, 478766, 478323, 477262, 476860, 477868, 480490, 483798, 485921, 485816, 484432, 483309, 482672, 481840, 480818, 480260, 480210, 480158, 480203, 480935, 482101, 482583, 482040, 481511, 481945, 482973, 483780, 484375, 485177, 485710, 484763, 482051, 479104, 477956, 479091, 481114, 482508, 483195, 484037, 485282, 486326, 486941, 487797, 489386, 491232, 492703, 493968, 495417, 496650, 496879, 496103, 495088, 494326, 493724, 493188, 492764, 492206, 491210, 490214, 490209, 491482, 493168, 494406, 495402, 496939]
52925D96939K371K984L593M473N148M757L115J053k90l70N31J743K707L063K573
52910E34390J209o49k283k962k265l69J779K903K540J626J478K233K799K391J528
52895E46348J197J487J511M87j358k960l320k368j094p35j698l213m027l440j843
52880E24974l95k8o45j381j658j719j991k287k000r25M21J218R09l55j686k219
52864E10233k043j953k169j984j109m50q15j561j451k98J159K430L191K699P35
52849E06614j206j278J16P39k85j391j179m60o71j614j998j374l74L65N90K41
52833D96835k43%J079J776J082j84l19R11K000J823R64O77J147J428P52m72j069
52816E08187m01Q47J354O22n28r41k81R05J834K034J537R38R38J602K183J877
$$ y = [496939, 499310, 502294, 505887, 510360, 515508, 520265, 523380, 524433, 524143, 523773, 524304, 526047, 528754, 531817, 534390, 535599, 534950, 532667, 529705, 527440, 527071, 528850, 531753, 534293, 535919, 537397, 539630, 542429, 544820, 546348, 547545, 549032, 550543, 551030, 549672, 546712, 543392, 541024, 539930, 539195, 537497, 534284, 530257, 526817, 524974, 524579, 524551, 523906, 522525, 520867, 519148, 517157, 514870, 512870, 511945, 512366, 513584, 514493, 514138, 512452, 510233, 508190, 506237, 504068, 502084, 500975, 500525, 499710, 498149, 496698, 496400, 497559, 499989, 503180, 505879, 506614, 505408, 504130, 504246, 504985, 504700, 503309, 502130, 501670, 500999, 499385, 497387, 496013, 495639, 496004, 496594, 496835, 496592, 496592, 497671, 499447, 500529, 500345, 500026, 500937, 502937, 504760, 505724, 506401, 507548, 508976, 509728, 509256, 508187, 507786, 508633, 509987, 510609, 510081, 509140, 508859, 509764, 511598, 513632, 515169, 516107, 517045, 518647, 520830, 522707]
52800E22707O56p30j444j233o66o09j325k235k831l394m246m803m358l488l434
52785D88567m053l773k084o31j031k633l643l596l449l630l406k250p72R8K89
52770D54003M43R10J227P32m14j197r61l03j87n11m20J28K31l09m54M11J393J404
52752D56126O66O2j65j88J68R55J385O83o26j221n47Q09J985K302J310p05k512
52735D60487l055k582j996j485o87J71L86n6m46m46l75l61j13M09Q82J324K031
52718D54088K702K429R64o04r02K02J410J320j02j358j078J73M67q75k221j940
52702D54675q08p23j753k121j131k53p11j564j084Q15K653L378L348L429L782
52687D61932L798K976J695Q99R73J290J224J188K014L581M804M987M390L546K742
$$ y = [522707, 523363, 522633, 521189, 519956, 519290, 518681, 517356, 515121, 512290, 508896, 504650, 499847, 495489, 492001, 488567, 484514, 480741, 478657, 478026, 476995, 474362, 470719, 467123, 463674, 460044, 456638, 454388, 453616, 453714, 454003, 454446, 455356, 456583, 457315, 456901, 455704, 454743, 454440, 454253, 453742, 453322, 453450, 453681, 453372, 452918, 453329, 454722, 456126, 456792, 456854, 456689, 456501, 456669, 457624, 459009, 459692, 459066, 457845, 457298, 458107, 460092, 462394, 463704, 462999, 460487, 457432, 454850, 452854, 451369, 450682, 450853, 451239, 451183, 450737, 450291, 449916, 449555, 449442, 449851, 450733, 452057, 454088, 456790, 459219, 460183, 459579, 458677, 458879, 460289, 461609, 461507, 460149, 459071, 459244, 459711, 458836, 456615, 454675, 453867, 453144, 451391, 449270, 448139, 447886, 447175, 445611, 444527, 445342, 447995, 451373, 454721, 458150, 461932, 465730, 468706, 470401, 471300, 472273, 473563, 474787, 475975, 477989, 481570, 486374, 491361, 495751, 499297, 502039]
52672E02039K257K293K486K146J203K94j52k34N9R07J880J958Q37n96j518k230
52656E13629l308m346m331k987j094M11J152J157N05o47j803k108j037P25J544
52641D97462N85r91j267J89K011K873K651J768N13o49j126j012j050j361j151
52626D99445k10L35m19j640j841q08M01Q93M89o42j878k141j055K81O42L88O56
52609D92896J211O46j150k365j652O8J074J037Q16Q35P92N67M35M66N06O93J289
52592D98164K039K365K310K609L660M894N468N093L997K473P86p32j868k546k550
52577E26162j583J4J065O16r36k226k339j414j20Q25P18p25k727l813l195j396
52561E08926N85K208L191L197K284J193N95L33l6l64k52K3l15j447k575k696j400
$$ y = [502039, 504296, 506589, 509075, 511221, 512424, 512718, 512566, 512332, 512391, 513298, 515178, 517136, 517973, 517377, 515859, 513629, 510321, 505975, 501644, 498657, 497563, 497974, 499126, 500283, 500788, 500141, 498338, 496230, 495193, 495918, 497462, 498047, 497056, 495789, 495978, 497989, 500862, 503513, 505281, 505794, 505145, 504019, 503007, 501957, 500596, 499445, 499235, 499570, 499151, 497511, 495670, 494862, 495263, 496156, 496645, 496003, 494125, 491984, 490929, 491210, 491852, 492240, 492896, 494107, 494753, 493603, 491238, 489586, 489654, 490728, 491765, 492581, 493416, 494208, 494775, 495210, 495676, 496182, 496875, 498164, 500203, 502568, 504878, 507487, 511147, 516041, 521509, 526602, 530599, 533072, 533858, 533126, 531258, 528712, 526162, 524579, 524593, 525658, 526274, 525338, 523112, 520773, 519359, 519239, 520064, 520782, 520057, 517330, 513517, 510322, 508926, 509511, 511719, 514910, 518107, 520391, 521584, 522179, 522512, 522476, 522112, 521860, 521883, 521568, 520121, 517546, 514850, 513450]
52544E13450Q74K942L536K437Q21n9j73j67k4O99J577J411j64k070l078k856j675
52527E17481P5J794K883L355L516L003J208j080j882n64R80P76o18j163k91O91
52511E30164Q58Q27J441K445K934K426J157k21r93r60q01j353k467l053k464j273
52495E28667l83Q4N63J019Q01m06j953k807k602j809r74j97M69P29N54N98J339
52478E23692K112J817O21p3L97J034P73R0J39J073K154K970L514L414K220L69
52462E46316j041j548j627j717j717j409o66P03K552L936L940K944K214K224K441
52447E57545K673L291L859L084R02o74pJ792K206M29k030l496l655l104k523k401
52431E57891k756k952k451j698j511j800j706j035m94m39l91j05m4l39k27O68
$$ y = [513450, 514324, 517266, 520802, 523239, 524060, 524001, 523828, 523661, 523637, 524336, 525913, 527324, 527160, 525090, 522012, 519156, 517481, 517556, 519350, 522233, 525588, 529104, 532107, 533315, 532235, 530353, 529789, 530769, 531545, 530927, 529764, 529473, 530164, 531022, 531849, 533290, 535735, 538669, 541095, 542252, 542031, 541038, 540078, 539277, 537924, 535457, 532404, 529940, 528667, 528284, 528368, 528931, 529950, 530751, 530345, 528392, 525585, 522983, 521174, 520200, 520003, 520472, 521201, 521755, 522353, 523692, 525804, 527621, 528242, 528169, 528566, 529600, 530373, 530463, 530602, 531675, 533829, 536799, 540313, 543727, 545947, 546316, 545275, 543727, 542100, 540383, 538666, 537257, 536591, 537294, 539846, 543782, 547722, 550666, 552880, 555104, 557545, 560218, 563509, 567368, 570452, 571354, 570680, 570673, 572465, 574671, 575100, 573070, 569574, 565919, 562815, 560292, 557891, 555135, 552183, 549732, 548034, 546523, 544723, 543017, 541982, 541488, 541049, 540658, 540553, 540509, 540170, 539943, 540611]
52415E40611J429J101K75K76J238K041K079J903K012K070J831J800K324K710K126
52400E65826J014P09J720L200M113M194L514K000j6j460j707j709k898m988o022
52385E67490m999l310k634k513j348P20J648M46j340j802j098p35j287j987k081
52370E45170j490l60J054K095K168J583J207J285J272Q35L65M49J305K659L615
52355E63212L103J263n3P55K790L797L399L500N186P206Q291R177J0891J2583
52341F35100J2852J2082J1478J0458P321K317k014m051m851n988p195p152n583
52328F54774l533k133j929k962m729o120n976l934p57K005L080K675K345L156
52314F35962M264M188L185L136M994P596R423J0360J1025J1333J0632Q769O311
$$ y = [540611, 542040, 543141, 543416, 543692, 544930, 546971, 549050, 550953, 552965, 555035, 556866, 558666, 560990, 563700, 565826, 566840, 567549, 569269, 572469, 576582, 580776, 584290, 586290, 586274, 584814, 583107, 581398, 578500, 573512, 567490, 562491, 559181, 556547, 554034, 552686, 553406, 555054, 555500, 554160, 552358, 551260, 550525, 549238, 547251, 545170, 543680, 543320, 544374, 546469, 548637, 550220, 551427, 552712, 553984, 554819, 555184, 555633, 556938, 559597, 563212, 566315, 567578, 567525, 568280, 571070, 574867, 578266, 581766, 586952, 594158, 602449, 611626, 622517, 635100, 647952, 660034, 671512, 681970, 689291, 691608, 689594, 685543, 680692, 674704, 667509, 660357, 654774, 651241, 649108, 647179, 644217, 639488, 633368, 627392, 623458, 622701, 624706, 627786, 630461, 632806, 635962, 640226, 644414, 647599, 650735, 655729, 663325, 672748, 683108, 694133, 705466, 716098, 724867, 731178]
52301G31178M074K814K759L022K201J55j507j340J40J319J497J248J250J661K365
52286G52836L113L667M319N789Q024R750J0071R892J0664J2231J3219J3265J3521
52273H70361J4887J7025J9299K1560K3725K5643K7691L0397L3103L4220L3415
52262A151326L2408L2800L4185L5343L6384L8256M0623M1744M0566L7923L5435
52251A556993L3971L3338L2730L1310K8919K6404K4785K4074K3438K2498K1687
52240A860147K1177K0278J8319J5531J2534R541O583L994K058M98j072k468l393
52227A963727m310o043q501j0519j1100j0253q576o526m312j960O09L261N485
52214A900982P079Q885J1961J5970J9369K1392K2756K4009K4519K3915K3357K4030
$$ y = [731178, 735252, 738066, 740825, 743847, 746048, 746203, 744696, 743356, 743496, 744815, 746312, 747560, 748810, 750471, 752836, 755949, 759616, 763935, 769724, 777748, 787498, 797569, 807461, 818125, 830356, 843575, 856840, 870361, 885248, 902273, 921572, 943132, 966857, 992500, 1020191, 1050588, 1083691, 1117911, 1151326, 1183734, 1216534, 1250719, 1286062, 1322446, 1360702, 1401325, 1443069, 1483635, 1521558, 1556993, 1590964, 1624302, 1657032, 1688342, 1717261, 1743665, 1768450, 1792524, 1815962, 1838460, 1860147, 1881324, 1901602, 1919921, 1935452, 1947986, 1957527, 1964110, 1968104, 1970162, 1970660, 1969588, 1967120, 1963727, 1959417, 1953374, 1944873, 1934354, 1923254, 1913001, 1904425, 1897899, 1893587, 1891627, 1892236, 1895497, 1900982, 1908061, 1916946, 1928907, 1944877, 1964246, 1985638, 2008394, 2032403, 2056922, 2080837, 2104194, 2128224]
52202B128224K5199K5220K3920K2564K1705K0693J9309J8347J8202J8041J6910
52191B358334J4670J1652Q410O025N323N352L938M49l248n376o620q792j2184
52178B377933j5446j7396j7704j6457j4507j3790j5708j9088k1004j9862j6702
52167B190269j3402j0772q738p267o297n369l997k281p24L74J184K065L152M165
52153B142362M752N109N932P445Q883R433R301R207R245R106R168J0084J1153
52140B251180J0471P432M125L193M755O471O510N486N223O375P802Q049O841N063
52126B338976L593K480J263k01j376j558o73M27N47p63k827m710o440q746j1595
52111B308397j3625j3637j2190j1010j0962j1230j0566q713o371m249k490q96
$$ y = [2128224, 2153423, 2178643, 2202563, 2225127, 2246832, 2267525, 2286834, 2305181, 2323383, 2341424, 2358334, 2373004, 2384656, 2393066, 2399091, 2404414, 2409766, 2413704, 2414153, 2410905, 2405529, 2398909, 2390117, 2377933, 2362487, 2345091, 2327387, 2310930, 2296423, 2282633, 2266925, 2247837, 2226833, 2206971, 2190269, 2176867, 2166095, 2157357, 2150090, 2143793, 2138424, 2134427, 2132146, 2131422, 2131796, 2132980, 2135045, 2138197, 2142362, 2147114, 2152223, 2158155, 2165600, 2174483, 2183916, 2193217, 2202424, 2211669, 2220775, 2229943, 2240027, 2251180, 2261651, 2269083, 2273208, 2276401, 2281156, 2287627, 2294137, 2299623, 2304846, 2311221, 2319023, 2327072, 2333913, 2338976, 2342569, 2345049, 2346312, 2346111, 2344735, 2343177, 2342504, 2342931, 2343478, 2342715, 2339888, 2335178, 2328738, 2319992, 2308397, 2294772, 2281135, 2268945, 2257935, 2246973, 2235743, 2225177, 2216464, 2210093, 2205844, 2203354, 2202458]
52099B202458O10J787K342K300K008J838K041K912M582O436P207O134L785J417
52085B247857j85q48n42N37J683K291K740L941N975P849Q746Q883Q943R214R658
52070B316742J0404J1817J4171J7452K1286K5131K8714L2249L5980L9700M2987
52059B596633M5685M7712M8804M9111M9655N1095N2162N0591M6039M0949L7760
52048C116196L6151L3806K9251K2939J6129R855M881J540o55k581m492n979p052
52035C249989q481j0657j2758j3675j3493j3327j3787j4250j3963j3282j3201
52024C109115j3833j4136j3382j2269j1952j2317j1962j0022p157m396j602J972
52012B998059N997R068J0803J2961J7321K2816K6106K5402K2647K1032K1127K0722
$$ y = [2202458, 2203068, 2204855, 2207197, 2209497, 2211505, 2213343, 2215384, 2218296, 2222878, 2229314, 2236521, 2242655, 2246440, 2247857, 2247672, 2246824, 2246282, 2246819, 2248502, 2250793, 2253533, 2257474, 2263449, 2271298, 2280044, 2288927, 2297870, 2307084, 2316742, 2327146, 2338963, 2353134, 2370586, 2391872, 2417003, 2445717, 2477966, 2513946, 2553646, 2596633, 2642318, 2690030, 2738834, 2787945, 2837600, 2888695, 2940857, 2991448, 3037487, 3078436, 3116196, 3152347, 3186153, 3215404, 3238343, 3254472, 3264327, 3269208, 3270748, 3270093, 3267512, 3263020, 3257041, 3249989, 3241508, 3230851, 3218093, 3204418, 3190925, 3177598, 3163811, 3149561, 3135598, 3122316, 3109115, 3095282, 3081146, 3067764, 3055495, 3043543, 3031226, 3019264, 3009242, 3002085, 2997689, 2996087, 2998059, 3004056, 3013124, 3023927, 3036888, 3054209, 3077025, 3103131, 3128533, 3151180, 3172212, 3193339, 3214061]
52000C214061J8321J5217J3570J3542J3283J1254P596L402n14l972p090r898j2256
51987C276516j4153j6036j8506k1508k4274k6274k7921l0023l2892l6211l9354
51976B989364m1503m1994m1027l9660l8625l7622l6138l4389l2732l0841k8294
51965B586539k5586k3517k1909j9928j7556j5753j5133j5411j6319j8182k1184
51954B376061k4582k6971k7306k5870k4371k4572k6396k8002k8222k8098k9224
51943B082447l1539l3924l5978l7713l8275l6939l4954l4283l4719l4306l2641
51932A697176l1413l1349l1041k9524k7722k6341k4613k2339k0847k0436j9114
51921A412437j5941j3422j4105j6458j7121j6055j6175j8314j9847j8847j6801
$$ y = [3214061, 3232382, 3247599, 3261169, 3274711, 3287994, 3299248, 3306844, 3310246, 3309732, 3305760, 3298670, 3288772, 3276516, 3262363, 3246327, 3227821, 3206313, 3182039, 3155765, 3127844, 3097821, 3064929, 3028718, 2989364, 2947861, 2905867, 2864840, 2825180, 2786555, 2748933, 2712795, 2678406, 2645674, 2614833, 2586539, 2560953, 2537436, 2515527, 2495599, 2478043, 2462290, 2447157, 2431746, 2415427, 2397245, 2376061, 2351479, 2324508, 2297202, 2271332, 2246961, 2222389, 2195993, 2167991, 2139769, 2111671, 2082447, 2050908, 2016984, 1981006, 1943293, 1905018, 1868079, 1833125, 1798842, 1764123, 1729817, 1697176, 1665763, 1634414, 1603373, 1573849, 1546127, 1519786, 1495173, 1472834, 1451987, 1431551, 1412437, 1396496, 1383074, 1368969, 1352511, 1335390, 1319335, 1303160, 1284846, 1264999, 1246152, 1229351]
51910A229351j6065j6698j7147j6541j5098j3245j1381r899q679o967m257q85
51898A092489K405M963O319O407N951N988O780P543P250N435K492l25j754j934
51884A150009k432l972m929l272M86L770N100N378O152Q088J1121J4539J6769
51871A206807J6769J5898J6672J9181K0407J8001J3122Q595N670L748K000k57
51859A346613m001r788j6767k3273k8168l1191l2747l3761l4865l5142l2874k8313
51847A035723k4329k2997k2754k0636j6413j2533j0439r080p162m929k976p81
51835H80694K491O423R293R440O678K791L11J50N58p84l965p045q722r387r500
51820H79426q476n911k878j145j520l326m908m558j735K254N342O672O878O618
$$ y = [1229351, 1213286, 1196588, 1179441, 1162900, 1147802, 1134557, 1123176, 1113277, 1104598, 1097631, 1093374, 1092489, 1094894, 1099857, 1106176, 1112583, 1118534, 1124522, 1131302, 1138845, 1146095, 1151530, 1154022, 1153697, 1151943, 1150009, 1147577, 1143605, 1138676, 1135404, 1135890, 1139660, 1144760, 1150138, 1156290, 1164378, 1175499, 1190038, 1206807, 1223576, 1239474, 1256146, 1275327, 1295734, 1313735, 1326857, 1335452, 1341122, 1344870, 1346870, 1346613, 1342612, 1332824, 1316057, 1292784, 1264616, 1233425, 1200678, 1166917, 1132052, 1096910, 1064036, 1035723, 1011394, 988397, 965643, 945007, 928594, 916061, 905622, 896542, 889380, 884451, 881475, 880694, 883185, 889608, 898901, 908341, 915019, 917810, 918121, 918271, 918829, 918045, 914080, 907035, 898313, 888926, 879426, 870950, 865039, 862161, 861016, 859496, 856170, 851262, 846704, 844969, 847223, 852565, 859237, 866115, 872733]
51806H72733O025N556N871O397N574L269J337P23l27l470p106q196o512m648m020
51791H73206l168o15K659M595M640L911L661M189M612L421J29l459m799l796l049
51776H86137m395o798q486r527j0697j1225r831p331n990o230n960l648l92J725
51762G97352K060J343J66j373k984l970l728k317o80j88j352l033l611k956k394
51747G72335k592k543j138J261L457M865N459M942L014K93k030l360l873l661
51733G76429k575j029j73q09k448l807m052l385k627k443k867l362l199j997k6
51718G41630J851K798K689K197K013K156K232K202K512L441M639N367N095L998
51704G84820L090L555N599Q179J0266J1922J3449J4079J2660R552O501M430K501
$$ y = [872733, 878758, 884314, 890185, 896582, 902156, 905425, 906762, 907485, 907158, 903688, 896582, 888386, 881874, 877226, 873206, 870038, 869423, 872082, 876677, 881317, 885228, 888889, 893078, 897690, 901111, 901240, 897781, 892982, 889186, 886137, 881742, 874944, 866458, 856931, 846234, 835009, 825178, 817847, 811857, 805627, 799667, 796019, 795627, 797352, 799412, 800755, 800921, 799548, 796564, 792594, 788866, 786549, 785869, 785681, 784329, 781296, 777685, 774729, 772335, 769743, 767200, 766062, 767323, 770780, 775645, 781104, 786046, 789060, 789353, 787323, 783963, 780090, 776429, 773854, 772825, 772652, 771843, 769395, 765588, 761536, 758151, 755524, 753081, 750214, 746852, 743653, 741656, 741630, 743481, 746279, 748968, 751165, 753178, 755334, 757566, 759768, 762280, 765721, 770360, 775727, 780822, 784820, 787910, 791465, 797064, 805243, 815509, 827431, 840880, 854959, 867619, 877171, 883672, 888102, 890603]
51691H90603k33l369o009q020r709j1033j1890j2488j2698j1779r471o611m033
51678G83260j602Q44K531K854K711L527N374P237Q605R641J0205R978R224Q292
51664H62681O761M345K212J800K485K209M25j337k278l753o962j0684j2505j1434
51650H33965q388m978k635k130k990l851m031m157m733m946l771j541O30K388
51636G88832M041N256N177L778K099Q69j81j282j741q69O98J364M26j159k085
51621H05223k337k857l912m608m145k747j083M06J189P40k57J48K750N588O288
51606H00386N402N669Q246J1638J4330J6234J7073J5587J1539O716K708r06m959
51593I09663q795j1258j2308j2147j0049n765j045K030L498M533M969L753J227
$$ y = [890603, 890370, 887001, 880992, 872972, 863263, 852230, 840340, 827852, 815154, 803375, 793904, 787293, 783260, 781658, 782502, 785033, 787887, 790598, 794125, 799499, 806736, 815341, 824982, 835187, 845165, 854389, 862681, 869442, 873787, 875999, 877799, 880284, 882493, 882918, 881581, 879303, 875550, 868588, 857904, 845399, 833965, 825577, 820599, 817964, 815834, 812844, 808993, 804962, 800805, 796072, 791126, 787355, 785814, 786444, 788832, 792873, 798129, 803306, 807084, 809183, 810052, 809871, 808589, 806848, 805979, 806677, 808041, 808467, 807308, 805223, 802886, 800029, 796117, 791509, 787364, 784617, 783534, 783940, 785129, 785869, 785612, 785760, 788510, 794098, 800386, 805788, 811457, 819703, 831341, 845671, 861905, 878978, 894565, 906104, 912820, 915528, 914622, 909663, 900868, 889610, 877302, 865155, 855106, 849341, 848296, 850326, 853824, 858357, 863326, 867079, 868306]
51580H68306j226l504o530r791j1475j1334j1129j1639j1409r472p258o426o382
51567G60731n531l771k129q11P44K360L106K733J868R14k93j719k904l576l890
51552G47832l961l754l366l010k767k741l144l804l860k662q08M13O42Q42J966
51537G17818L749N117N400M939M778N905Q456J1469J3501J3660J2036R268N972
51524H22068K716J64j110j155p39o76r00n03J084L194M683N528O990R970J3820
51509H65134J7217J9699K1767K3806K5782K7777L0028L2193L3302L2833L1501
51498A161039L0511L0327L0506L0623L0984L2236L4390L6323L6374L3512K7874
51487A514699K0173J0882K79j0802k0870k8674l4060l7774m0628m2933m4501m4935
$$ y = [868306, 867080, 863576, 857046, 847255, 835780, 824446, 813317, 801678, 790269, 780797, 773539, 767113, 760731, 755200, 751429, 749300, 748489, 749233, 751593, 754699, 757432, 759300, 760214, 759921, 758202, 755298, 751722, 747832, 743871, 740117, 736751, 733741, 730974, 728233, 725089, 721285, 717425, 714763, 713955, 714368, 715010, 715852, 717818, 721567, 726684, 732084, 737023, 741801, 747706, 756162, 767631, 781132, 794792, 806828, 816096, 822068, 824784, 824948, 823838, 822683, 821944, 821268, 820368, 819865, 820949, 824143, 828826, 834354, 841344, 851314, 865134, 882351, 902050, 923817, 947623, 973405, 1001182, 1031210, 1063403, 1096705, 1129538, 1161039, 1191550, 1221877, 1252383, 1283006, 1313990, 1346226, 1380616, 1416939, 1453313, 1486825, 1514699, 1534872, 1545754, 1546033, 1535231, 1514361, 1485687, 1451627, 1413853, 1373225, 1330292, 1285791, 1240856]
51475A240856m3868m1109l6720l1196k5575k1011j7970j5976j4530j3843j4059
51464I64999j4016j1898p532l149j139j635k993m109n245o861q704j0303j1446
51451H75969j1931j1522j0525r775r675r664r085q146p593p666p868p659p056
51438G57804o510o310o090n110l283j728j628k651l190k375r81L4R41K392L934
51423G25249M465L829K917K284J514J12j695l165l665l103k190k066l137m565
51409G16784n460o061o811o863n043k230r75k166l604k953q86P8r75k529k956
51394F67350k121o56J049K602L273K660J343M60P13K043L988O093Q025R606J0808
51379G17236J1703J2346J2744J2909J2861J2455J1219Q721N237J875k60q35r3
$$ y = [1240856, 1196988, 1155879, 1119159, 1087963, 1062388, 1041377, 1023407, 1007431, 992901, 979058, 964999, 950983, 939085, 931553, 928404, 927265, 925630, 922637, 918528, 913283, 906422, 897718, 887415, 875969, 864038, 852516, 841991, 832216, 822541, 812877, 803792, 795646, 788053, 780387, 772519, 764860, 757804, 751294, 744984, 738894, 733784, 730501, 728773, 727145, 724494, 721304, 718929, 717948, 717982, 718923, 721315, 725249, 729714, 733543, 736460, 738744, 740258, 740370, 738675, 735510, 731845, 728742, 726552, 724486, 721349, 716784, 711324, 705263, 698452, 691589, 686546, 684316, 683341, 681175, 677571, 674618, 673732, 673810, 672835, 670306, 667350, 665229, 664573, 665622, 668224, 671497, 674157, 675500, 675960, 676673, 678716, 682704, 688797, 696822, 706428, 717236, 728939, 741285, 754029, 766938, 779799, 792254, 803473, 812194, 817431, 819306, 819046, 818211, 818118]
51366H18118J635L669M672L574Q43j943l881n318o555p049o431n401m909m933
51352G86091m757m051l107k376k229k702l015j971N67L112M135L759L178L063
51338G79697L326L932M824N313M718L597L397M666O535Q125R708J2097J5388J8624
51324H83947K0546K0892K1111K3433K8534L4614L9504M3195M7231N2009N6198
51313A271214N8896O0808O2679O3748O2445N7664M8798L5697J9632L445j0473
51302A734553k2055l2479m1764m8564n2335n4500n6947n9893o1695o0682n6940
51291A186699n2232m8155m4534m0088l4568k9511k6404k4811k3085k0541j7931
51280H24839j5886j3976j1741r802r065r140q472o278l819l074m352n855n794
$$ y = [818118, 819753, 823422, 828094, 831668, 832511, 830568, 826687, 821369, 814814, 807765, 801334, 795933, 791024, 786091, 781334, 777283, 774176, 771800, 769571, 766869, 763854, 761883, 762450, 765562, 769697, 773456, 776634, 779697, 783023, 786955, 791779, 797092, 801810, 805407, 808804, 813470, 820005, 828130, 837838, 849935, 865323, 883947, 904493, 925385, 946496, 969929, 998463, 1033077, 1072581, 1115776, 1163007, 1215016, 1271214, 1330110, 1390918, 1453597, 1517345, 1579790, 1637454, 1686252, 1721949, 1741581, 1745026, 1734553, 1712498, 1680019, 1638255, 1589691, 1537356, 1482856, 1425909, 1366016, 1304321, 1243639, 1186699, 1134467, 1086312, 1041778, 1001690, 967122, 937611, 911207, 886396, 863311, 842770, 824839, 808953, 794977, 783236, 773434, 764369, 755229, 746757, 740479, 736660, 733586, 729234, 723379, 717585]
51267G17585m361l126k911l041k653j872j322j150j082j036j091r67k49P75J042
51252F94541j46k015k837j720K46J010j39j683j662q6J132O08r61k027k263k596
51236F79402l484m144l700k385j079k6J241K628K881R99k016l754k935o95J150
51221F64083K295L624N354O818P906R274J0749J0838Q673N499L239K302J764J194
51207G43612J046J411J574J091M59M02J093K256L501M281M132L265K480K076J334
51192G74013n06l076n200o225o552o862p268p465p278o804o120n235m344l813
51178F97265l817m096m159l674k627j395o40q18j483j565o52L53N10K99R48K496
51162F76945L638L632L139K716J735j60j611j036R46K042J276K3j69M39O63J66
$$ y = [717585, 713224, 710098, 707187, 704146, 701493, 699621, 698299, 697149, 696067, 695031, 693940, 692973, 692724, 693499, 694541, 694395, 692380, 689543, 687823, 688069, 689079, 688940, 687257, 685595, 685509, 686641, 687249, 686288, 684261, 681998, 679402, 675918, 671774, 668074, 665689, 664610, 664584, 665825, 668453, 671334, 672333, 670317, 666563, 663628, 662933, 664083, 666378, 670002, 675356, 682174, 690080, 699354, 710103, 720941, 729614, 735113, 738352, 740654, 742418, 743612, 744658, 746069, 747643, 748734, 749193, 749595, 750688, 752944, 756445, 760726, 764858, 768123, 770603, 772679, 774013, 773507, 770431, 765231, 759006, 752454, 745592, 738324, 730859, 723581, 716777, 710657, 705422, 701078, 697265, 693448, 689352, 685193, 681519, 678892, 677497, 676857, 676039, 674556, 672991, 672339, 672692, 673202, 673501, 674449, 676945, 680583, 684215, 687354, 690070, 691805, 691645, 690034, 688998, 689944, 691986, 693262, 693285, 693116, 693555, 694218, 694384]
51146F94384m47p25o50p4J244L057M629N462N724N818N770N164L660J585q8n24
51130G33989J78J120J538J377R09J98p66j651j853j072L07J392J314j52k235l563
51114G31030l213j567j01q6j409k579k135j93J588J821R60O75J796L400M091L690
51098G37768L252L782N205O464O394M721K399P00k13j386l521n771o686n945m495
51083G42668l142j897p61k89r68k527m204n316n287l805j435L32L77p06j120K98
51067G12218K890M781M522K422N52R70L515N744N700M290L926N131N912M775K852
51052G70200K067K376K236J223N21Q73J651K321L433N250O467N512K694j8j080
51037H05726m04J462L949O061O589N392L884L355L245J973o45k746k569n15J524
$$ y = [694384, 693937, 693212, 692562, 692488, 693732, 696789, 701418, 706880, 712604, 718422, 724192, 729356, 733016, 734601, 734513, 733989, 734167, 735287, 736825, 738202, 739111, 739309, 738543, 736892, 735039, 733967, 734274, 735666, 736980, 736828, 734593, 731030, 727817, 726250, 726149, 726063, 724654, 722075, 719940, 719747, 721335, 723156, 724116, 724791, 726587, 729987, 734078, 737768, 741020, 744802, 750007, 756471, 762865, 767586, 769985, 770685, 770472, 769086, 765565, 759794, 753108, 747163, 742668, 739526, 737629, 736868, 736579, 735611, 733084, 728880, 723564, 718277, 714472, 713037, 713369, 713746, 713040, 711920, 712218, 715108, 719889, 724411, 726833, 727385, 728355, 731870, 737614, 743314, 747604, 751530, 756661, 762573, 767348, 770200, 772267, 774643, 776879, 778102, 778623, 779496, 781147, 783468, 786901, 792151, 798618, 804130, 806824, 806806, 805726, 805322, 806784, 810733, 816794, 823383, 828775, 832659, 836014, 839259, 841232, 840587, 837841, 835272, 834757, 836281]
51022H36281K489K925L428L379J977Oo09P89K622L075K372K119K904L846M453
51007H72056N535P620R606J0127R676J0088J2119J4688J6695J8570K1450K5452
50995A033682K9183L0827K9488K5890K1813J8614J6266J4278J3166J3986J6255
50984A263448J7535J5782J1445O630K819l4k912o819j1800j6146j7439j5242j1902
50971A235365r798q908q431r358j3031j7804k0023j8724j6739j6355j6438j5133
50959A064623j2992j1264r050m775N08L982M918N303O579P993Q689R428J1230
50946A085172J3623J5403J6323J7109J8170J9010J8781J7258J5306J4247J4407
50935A264809J4590J3522J1480R742Q757P815O398M868L893M021N591Q071R818
$$ y = [836281, 838770, 841695, 845123, 848502, 850479, 850485, 849876, 850665, 853287, 856362, 858734, 860853, 863757, 867603, 872056, 877591, 885211, 894817, 904944, 914620, 924708, 936827, 951515, 968210, 986780, 1008230, 1033682, 1062865, 1093692, 1123180, 1149070, 1170883, 1189497, 1205763, 1220041, 1233207, 1247193, 1263448, 1280983, 1296765, 1308210, 1314840, 1317659, 1317625, 1314713, 1307894, 1296094, 1279948, 1262509, 1247267, 1235365, 1225567, 1216659, 1208228, 1198870, 1185839, 1168035, 1148012, 1129288, 1112549, 1096194, 1079756, 1064623, 1051631, 1040367, 1031317, 1026542, 1027050, 1031032, 1035950, 1041253, 1047832, 1055825, 1064514, 1073942, 1085172, 1098795, 1114198, 1130521, 1147630, 1165800, 1184810, 1203591, 1220849, 1236155, 1250402, 1264809, 1279399, 1292921, 1304401, 1314143, 1322900, 1330715, 1337113, 1341981, 1345874, 1349895, 1355486, 1363557, 1373375]
50922A373375R916J0081J2962J8360K3030K4917K5760K8363L2872L7336M0636
50911A637608M3117M5099M6643M8516N1769N6342O1281O6278P1786P7683Q3147
50900B289269Q8059R3206R8756J03634J06994J09382J11579J13052J12474J09494
50890C335899J05151J00374R4824Q7603P8833O9855O1710N3974M5618L6825K9098
50879D099764K3490J9588J6517J4127J2336J0135O381J402l325p206j1266j6637
50867D165306k3150k9923l6715m4076n2401o1303o9935p7636q4223q9794r4455
50856C501695r8377j01937j05256j07472j07082j03530r8041r2316q6893q1458
50846B519333p6128p1236o6142n9870n3161m8318m6150m4388m0417l4655k9784
$$ y = [1373375, 1383291, 1393372, 1406334, 1424694, 1447724, 1472641, 1498401, 1526764, 1559636, 1596972, 1637608, 1680725, 1725824, 1772467, 1820983, 1872752, 1929094, 1990375, 2056653, 2128439, 2206122, 2289269, 2377328, 2470534, 2569290, 2672924, 2779918, 2889300, 3000879, 3113931, 3226405, 3335899, 3441050, 3541424, 3636248, 3723851, 3802684, 3872539, 3934249, 3988223, 4033841, 4070666, 4099764, 4123254, 4142842, 4159359, 4173486, 4185822, 4195957, 4202338, 4203740, 4200415, 4193209, 4181943, 4165306, 4142156, 4112233, 4075518, 4031442, 3979041, 3917738, 3847803, 3770167, 3685944, 3596150, 3501695, 3403318, 3301381, 3196125, 3088653, 2981571, 2878041, 2780000, 2687684, 2600791, 2519333, 2443205, 2371969, 2305827, 2245957, 2192796, 2144478, 2098328, 2053940, 2013523, 1978868, 1949084]
50835A949084k7152k5540k3494k1165j9343j7940j6413j4767j3154j1012p716
50824A751388l904j053L72J544L642O307Q189Q694Q664R411J1401J3925J5977
50811A834557J7514J9643K3255K7585L0811L2260L3341L5847L9876M4144M7897
50800B186730N1693N6360O1942O7859P3620P9242Q5214R2145J00196J08984J18237
50789C082222J28205J39112J50636J62404J74603J87338J99905K11490K22169
50780D658084K32132K40351K45489K47978K49516K50067K46963K37713K22398
50771F830691K02623J79654J54784J30048J06754Q4055O0646L7583J7898L432
50761G808168o534j3597j8333k0389j9407j5560r893m466j647l131r854k2419
$$ y = [1949084, 1921932, 1896392, 1872898, 1851733, 1832390, 1814450, 1798037, 1783270, 1770116, 1759104, 1751388, 1747484, 1746431, 1746803, 1748347, 1751989, 1758296, 1766485, 1775179, 1783843, 1793254, 1804655, 1818580, 1834557, 1852071, 1871714, 1894969, 1922554, 1953365, 1985625, 2018966, 2054813, 2094689, 2138833, 2186730, 2238423, 2294783, 2356725, 2424584, 2498204, 2577446, 2662660, 2754805, 2855001, 2963985, 3082222, 3210427, 3349539, 3500175, 3662579, 3837182, 4024520, 4224425, 4435915, 4658084, 4890216, 5130567, 5376056, 5624034, 5873550, 6123617, 6370580, 6608293, 6830691, 7033314, 7212968, 7367752, 7497800, 7604554, 7688609, 7749255, 7786838, 7804736, 7808168, 7801634, 7788037, 7769704, 7749315, 7729908, 7714348, 7704455, 7699989, 7698342, 7695211, 7685357, 7662938]
50749G662938m0669o2945q6692j10142j33064j55924j78871k01264k21464k37202
50739F234701k46835k50453k49320k44542k36800k26856k15352k02246j87498
50730D174799j72005j56853j41830j26002j09853r5375q3634p3568o3899n4997
50720C096783m7980m2877l8790l5172l2040k9326k6965k5430k5281k6240k7305
50709B739377k7682k7175k5949k4570k4123k5463k8106l0313l0660k9280k7467
50698B438589k6318k5976k5982k5920k5421k3788k0252j4965r441n449l379j933
50686B229765M86M383R111J3937J8929K4758L1653L8846M5395N1482N8187O5777
50674B592709P3136P9351Q5078R1416R8112J03985J08624J12478J15587J17583
$$ y = [7662938, 7622269, 7559324, 7472632, 7362490, 7229426, 7073502, 6894631, 6693367, 6471903, 6234701, 5987866, 5737413, 5488093, 5243551, 5006751, 4779895, 4564543, 4362297, 4174799, 4002794, 3845941, 3704111, 3578109, 3468256, 3372881, 3289247, 3215679, 3151780, 3096783, 3048803, 3005926, 2967136, 2931964, 2899924, 2870598, 2843633, 2818203, 2792922, 2766682, 2739377, 2711695, 2684520, 2658571, 2634001, 2609878, 2584415, 2556309, 2525996, 2495336, 2466056, 2438589, 2412271, 2386295, 2360313, 2334393, 2308972, 2285184, 2264932, 2249967, 2240526, 2235077, 2231698, 2229765, 2230251, 2234634, 2243745, 2257682, 2276611, 2301369, 2333022, 2371868, 2417263, 2468745, 2526932, 2592709, 2665845, 2745196, 2830274, 2921690, 3019802, 3123787, 3232411, 3344889, 3460476, 3578059]
50664C578059J18899J20558J22512J23479J22791J21111J18865J15143J08906
50655D650323J00140Q9263P6312O1556M5863K9564J2002o501k2998l3778l7898
50644D963848l7776l6278l4141l0297k3955j5890q081k326P95J483m85n869j4723
50631D756305k6005l8989n4250p2185r1084j07787j20270j28633j33660j35338
50621C848104j33143j27161j18426j08403r8203q8123p7821o7022n5887m4653
50611B929262l3322k2023j1276j611O839J4000J9643K3822K6953K9017K9341K7979
50599C038624K6537K6525K7263K6806K4839K3391K4267K6947K9506L0839L1236
50588C336780L1480L2096L3262L4910L6896L9342M2589M6741N1407N6036O0221
$$ y = [3578059, 3696958, 3817516, 3940028, 4063507, 4186298, 4307409, 4426274, 4541417, 4650323, 4750463, 4839726, 4916038, 4977594, 5023457, 5053021, 5065023, 5058522, 5035524, 5001746, 4963848, 4926072, 4889794, 4855653, 4825356, 4801401, 4785511, 4777430, 4775104, 4775899, 4777382, 4776897, 4771028, 4756305, 4730300, 4691311, 4637061, 4564876, 4473792, 4366005, 4245735, 4117102, 3983442, 3848104, 3714961, 3587800, 3469374, 3360971, 3262768, 3174645, 3096824, 3029802, 2973915, 2929262, 2895940, 2873917, 2862641, 2861030, 2867869, 2881869, 2901512, 2925334, 2952287, 2981304, 3010645, 3038624, 3065161, 3091686, 3118949, 3145755, 3170594, 3193985, 3218252, 3245199, 3274705, 3305544, 3336780, 3368260, 3400356, 3433618, 3468528, 3505424, 3544766, 3587355, 3634096, 3685503, 3741539, 3801760]
50577C801760O3695O6358O8381O9918P0666P0152O8383O5818O2643N8797N4734
50566D521305N1352M8775M6100M2894L9947L7325L2276K0768J720k1078m1605
50555D779779n5544o1638o0780n5249m8177m1965l6535l0066k2070j4943j1692
50544D341120j2676j5638j8811k2808k9216l8349m9261o1187p3759q5810r5227
50533C838378j00777j03562j05742j07888j08404j05846j01008r5930r1318q6040
50523B831863p9329p2376o6965o3252n9643n4725m8468m1763l5579l0602k6928
50512B252233k3785k0030j5156r576l967J271N943J0050J3874J7596K0837K3076
50500B272366K4599K6388K9017L2203L5447L8472M1051M3227M5661M8954N2400
$$ y = [3801760, 3865455, 3931813, 4000194, 4070112, 4140778, 4210930, 4279313, 4345131, 4407774, 4466571, 4521305, 4572657, 4621432, 4667532, 4710426, 4750373, 4787698, 4819974, 4840742, 4842462, 4821384, 4779779, 4724235, 4662597, 4601817, 4546568, 4498391, 4456426, 4419891, 4389825, 4367755, 4352812, 4341120, 4328444, 4312806, 4293995, 4271187, 4241971, 4203622, 4154361, 4093174, 4019415, 3933605, 3838378, 3737601, 3634039, 3528297, 3420409, 3312005, 3206159, 3105151, 3009221, 2917903, 2831863, 2752534, 2680158, 2613193, 2549941, 2490298, 2435573, 2387105, 2345342, 2309763, 2279161, 2252233, 2228448, 2208418, 2193262, 2183686, 2179719, 2180990, 2186933, 2196983, 2210857, 2228453, 2249290, 2272366, 2296965, 2323353, 2352370, 2384573, 2420020, 2458492, 2499543, 2542770, 2588431, 2637385, 2689785]
50489B689785N4473N4817N4688N5022N5311N5031N4912N5694N6703N7061N7562
50478C301059N9881O4300O9667P5368Q1889Q9363R7108J04982J13891J24101J34047
50467D315656J41860J47610J53161J59815J66887J72766J76846J79841J82210
50458E796652J82870J80026J73177J63628J52774J40382J24971J05621Q2967N8523
50448G161591L3336P471j9090m5149o8525q8127j05060j20500j32897j39066j38138
50437F345846j32517j24249j12521r6164p6811n7509l9368k1727m984Q896J8346
50426E707238K2698K0867J1562m977k6965n2793q0997j08647j32105j50051j63954
50415E041876j74924j81845j83488j80784j75732j69339j61586j52329j41353
$$ y = [2689785, 2744258, 2799075, 2853763, 2908785, 2964096, 3019127, 3074039, 3129733, 3186436, 3243497, 3301059, 3360940, 3425240, 3494907, 3570275, 3652164, 3741527, 3838635, 3943617, 4057508, 4181609, 4315656, 4457516, 4605126, 4758287, 4918102, 5084989, 5257755, 5434601, 5614442, 5796652, 5979522, 6159548, 6332725, 6496353, 6649127, 6789509, 6914480, 7020101, 7103068, 7161591, 7194927, 7202398, 7183308, 7138159, 7069634, 6981507, 6876447, 6755947, 6623050, 6483984, 6345846, 6213329, 6089080, 5976559, 5880395, 5803584, 5746075, 5706707, 5684980, 5679996, 5688892, 5707238, 5729936, 5750803, 5762365, 5757388, 5730423, 5677630, 5596633, 5487986, 5355881, 5205830, 5041876, 4866952, 4685107, 4501619, 4320835, 4145103, 3975764, 3814178, 3661849, 3520496]
50406C520496j28689j15771j05026r7340r1077q4494p7777p1624o5411n8388n1479
50395B573420m5896m0851l4602k7296k0812j5906j1376o185q32L723P146R508
50383B390041J1142J3015J6096K0075K3670K6331K8486K9918K9274K5829K0692
50372B634569J5634J1603Q913P781P837P986P764Q239J0550J3986J6561J7317
50360B768740J7172J7486J8748K0974K4492K9691L6178M2737M8327N3047N7977
50349C135569O3996P0808P7298Q2639Q6667Q9241Q9980Q8974Q7092Q4890Q1580
50338D038734P5942O8118N9578N1156M2038L0970J7670K533j4197l1986m9244
50327D291312o4141p6060q5374r1964r5086r4917r2902q9787q4301p4850o2041
$$ y = [3520496, 3391807, 3276036, 3171010, 3073670, 2982593, 2898099, 2820322, 2748698, 2683287, 2624899, 2573420, 2527524, 2486673, 2452071, 2424775, 2403963, 2388057, 2376681, 2370496, 2369664, 2373387, 2380533, 2390041, 2401183, 2414198, 2430294, 2450369, 2474039, 2500370, 2528856, 2558774, 2588048, 2613877, 2634569, 2650203, 2661806, 2670719, 2678500, 2686337, 2694323, 2702087, 2710326, 2720876, 2734862, 2751423, 2768740, 2785912, 2803398, 2822146, 2843120, 2867612, 2897303, 2933481, 2976218, 3024545, 3077592, 3135569, 3199565, 3270373, 3347671, 3430310, 3516977, 3606218, 3696198, 3785172, 3872264, 3957154, 4038734, 4114676, 4182794, 4242372, 4293528, 4335566, 4366536, 4384206, 4386739, 4372542, 4340556, 4291312, 4227171, 4151111, 4065737, 3973773, 3878687, 3783770, 3690868, 3601081, 3516780, 3441930, 3379889]
50316C379889m8500l6331k5622j5383n245L826R908J1286P848J277o567j5318
50304C261068k5520l6836m7961n8138o7528p5748q1345q3411q2755q0720p7644
50293B543462p3422o8721o4483o0552n5930n0248m4033l7613l0777k3785j7806
50282B016092j3905j2160j2114j3514j6145j9263k1766k2884k2453k0616j7536
50271A823736j3489r036m927j748L83J727K624L400M469O091P906R050R140Q900
50257A848226R391J0697J1715J1403R819P826O021M298K441P79n8L1M82Q77J522
50242A925470K784M284N436O685R159J2798J5767J6479J5696J5792J8156K1952
50230B070458K5279K6985K7521K8554L1728L7294M3937N0055N4541N5803N1034
$$ y = [3379889, 3331389, 3295058, 3269436, 3254053, 3248808, 3252634, 3262542, 3273828, 3281676, 3282953, 3276386, 3261068, 3235548, 3198712, 3150751, 3092613, 3025085, 2949337, 2867992, 2784581, 2701826, 2621106, 2543462, 2470040, 2401319, 2336836, 2276284, 2220354, 2170106, 2126073, 2088460, 2057683, 2033898, 2016092, 2002187, 1990027, 1977913, 1964399, 1948254, 1928991, 1907225, 1884341, 1861888, 1841272, 1823736, 1810247, 1801211, 1796284, 1794536, 1794919, 1796646, 1799270, 1802670, 1807139, 1813230, 1821136, 1830186, 1839326, 1848226, 1857617, 1868314, 1880029, 1891432, 1901251, 1909077, 1915098, 1919396, 1921837, 1922616, 1922558, 1922589, 1923071, 1923948, 1925470, 1928254, 1932538, 1937974, 1944659, 1953818, 1966616, 1982383, 1998862, 2014558, 2030350, 2048506, 2070458, 2095737, 2122722, 2150243, 2178797, 2210525, 2247819, 2291756, 2341811, 2396352, 2452155, 2503189]
50219B503189L8236J9236o40j6468k6632l1936l3435l2274l0280k8974k8032k5999
50207B305991k2660j9657j8427j8428j7926j5940j2876r631o686m007j422J151
50195B159482L744O516R765J3605J7701K1458K4428K6368K7083K6588K5512K4855
50183B387105K5142K5970K6562K6540K6066K5354K4234K2032J7856J1249K675
50172B620785o647j5372k2479k7528l0916l3644l6027l6936l5181l1747k9358
50161B314950k9479l1014l2697l5249l9754m5127m9034n0798n1468n1333m9453
50150A849544m5768m1582l7575l3166k8500k5016k3133k1317j8664j6470j5701
50139A542652j4788j2100q980p913q667q957q328q525j0074j1238j0881r951r334
$$ y = [2503189, 2541425, 2560661, 2560021, 2543553, 2516921, 2484985, 2451550, 2419276, 2388996, 2360022, 2331990, 2305991, 2283331, 2263674, 2245247, 2226819, 2208893, 2192953, 2180077, 2170446, 2163760, 2159753, 2158331, 2159482, 2163226, 2169742, 2179507, 2193112, 2210813, 2232271, 2256699, 2283067, 2310150, 2336738, 2362250, 2387105, 2412247, 2438217, 2464779, 2491319, 2517385, 2542739, 2566973, 2589005, 2606861, 2618110, 2620785, 2614138, 2598766, 2576287, 2548759, 2517843, 2484199, 2448172, 2411236, 2376055, 2344308, 2314950, 2285471, 2254457, 2221760, 2186511, 2146757, 2101630, 2052596, 2001798, 1950330, 1898997, 1849544, 1803776, 1762194, 1724619, 1691453, 1662953, 1637937, 1614804, 1593487, 1574823, 1558353, 1542652, 1527864, 1515764, 1506784, 1498871, 1490204, 1481247, 1472919, 1464394, 1454320, 1443082, 1432201, 1422250, 1412916]
50126A412916q504p227o609p289q283q800r445j0450j0484q837p185p345q509
50113A303949q735q083p982q122o624l419j050j192k269j611J307M814P282Q330
50099A276595Q467Q526R189J0405J1468J2052J2710J3842J4857J5177J5600J7506
50087A426394K0747K3551K4858K5673K7332K9338L0233L0028L0426L2424L5111
50076A736115L7308L9234M1767M5011M8540N2204N5602N7497N7083N5478N4631
$$ y = [1412916, 1404412, 1397185, 1390576, 1383287, 1375004, 1366204, 1356759, 1346309, 1335825, 1326988, 1319803, 1312458, 1303949, 1295214, 1287131, 1279149, 1271027, 1264403, 1260984, 1259934, 1258742, 1256473, 1254862, 1256169, 1260983, 1268265, 1276595, 1285062, 1293588, 1302777, 1313182, 1324650, 1336702, 1349412, 1363254, 1378111, 1393288, 1408888, 1426394, 1447141, 1470692, 1495550, 1521223, 1548555, 1577893, 1608126, 1638154, 1668580, 1701004, 1736115, 1773423, 1812657, 1854424, 1899435, 1947975, 2000179, 2055781, 2113278, 2170361, 2225839, 2280470]
$$ [...]
##END NTUPLES=NMR SPECTRUM
##END=
