
##TITLE=AC1010_S-036_6278901_wlBVcdretO
##JCAMPDX= 6.0         $$ Bruker NMR JCAMP-DX V2.0
##DATA TYPE= NMR SPECTRUM
##DATA CLASS= NTUPLES
##ORIGIN= BRUKER
##OWNER= Administrator
$$ 1.72 TOPSPIN		Version 2.1
$$ 2012-06-03 11:46:02.546 -0500  Administrator@TOPSPIN
$$ Compression mode = diff/dup
##.OBSERVE FREQUENCY= 400.13188235
##.OBSERVE NUCLEUS= ^1H
##.ACQUISITION MODE= SIMULTANEOUS (DQD)
##.ACQUISITION SCHEME= undefined
##.AVERAGES= 8
##.DIGITISER RES= 22
##SPECTROMETER/DATA SYSTEM= spect
##.PULSE SEQUENCE= zg30
##.SOLVENT NAME= COFFEE_meoh
##.SHIFT REFERENCE= INTERNAL, COFFEE_meoh, 1, 14.98061
##AUDIT TRAIL= $$ (NUMBER, WHEN, WHO, WHERE, PROCESS, VERSION, WHAT)
$$ ##TITLE= Audit trail, TOPSPIN		Version 2.1
$$ ##JCAMPDX= 5.01
$$ ##ORIGIN= Bruker BioSpin GmbH
$$ ##OWNER= Administrator
$$ $$ C:\Bruker\TOPSPIN/data/COFFEE/nmr/AC1010_S-036_6278901_wlBVcdretO/10/pdata/1/auditp.txt
$$ ##AUDIT TRAIL=  $$ (NUMBER, WHEN, WHO, WHERE, PROCESS, VERSION, WHAT)
(   1,<2012-06-03 11:45:54.515 -0500>,<Administrator>,<TOPSPIN>,<go>,<TOPSPIN 2.1>,
      <created by zg
	started at 2012-06-03 11:44:47.531 -0500,
	POWCHK enabled, PULCHK disabled,
       configuration hash MD5:
       D5 CA 7A 23 FE 6B EE E2 50 67 74 61 24 F7 5E 3B
       data hash MD5: 64K
       9E BA 50 A6 8F F1 F7 C9 06 92 F1 06 ED 75 8E C9>)
(   2,<2012-06-03 11:45:57.875 -0500>,<Administrator>,<TOPSPIN>,<proc1d>,<TOPSPIN 2.1>,
      <Start of raw data processing
       efp LB = 0 FT_mod = 6 PKNL = 1 PHC0 = 0 PHC1 = 0 SI = 32K 
       data hash MD5: 32K
       38 0C 2F C3 35 6B F8 D3 E0 DD 57 64 B7 E9 36 19>)
(   3,<2012-06-03 11:45:58.203 -0500>,<Administrator>,<TOPSPIN>,<proc1d>,<TOPSPIN 2.1>,
      <pk PHC0 = 207.8943 PHC1 = 0 
       data hash MD5: 32K
       E2 DE 34 F1 7F 59 73 83 6B 39 E1 83 C9 79 95 87>)
(   4,<2012-06-03 11:45:58.265 -0500>,<Administrator>,<TOPSPIN>,<proc1d>,<TOPSPIN 2.1>,
      <abs ABSG = 1 
       data hash MD5: 32K
       69 AD 7B FC D0 EB 96 E0 91 5C BC D0 A8 CE 88 58>)
(   5,<2012-06-03 11:45:58.296 -0500>,<Administrator>,<TOPSPIN>,<proc1d>,<TOPSPIN 2.1>,
      <abs ABSG = 2 
       data hash MD5: 32K
       37 FB B0 EB FE 09 55 0C 4D 2F DB 85 E3 77 FD D8>)
(   6,<2012-06-03 11:45:58.328 -0500>,<Administrator>,<TOPSPIN>,<proc1d>,<TOPSPIN 2.1>,
      <abs ABSG = 3 
       data hash MD5: 32K
       0B C1 D8 3F 93 65 AE A8 DD 6F A6 5D 0B CA 41 8D>)
(   7,<2012-06-03 11:45:58.375 -0500>,<Administrator>,<TOPSPIN>,<proc1d>,<TOPSPIN 2.1>,
      <abs ABSG = 4 
       data hash MD5: 32K
       DF EF E2 99 7F 07 C8 89 D5 58 50 E4 6C 67 2F 67>)
(   8,<2012-06-03 11:45:58.406 -0500>,<Administrator>,<TOPSPIN>,<proc1d>,<TOPSPIN 2.1>,
      <abs ABSG = 5 
       data hash MD5: 32K
       85 63 D6 35 E9 FF 94 83 58 4D 83 CC 42 A0 C3 AF>)
$$ ##END=
$$ 
$$ $$ hash MD5
$$ $$ 6F 70 29 98 7F 98 88 9F 10 DB 8D 98 E3 FE 4D 24
##$RELAX= 
##$RELAX= 
##$RELAX= 
##$RELAX= 
##$RELAX= 
##$RELAX= 
##$RELAX= 
$$ Bruker specific parameters
$$ --------------------------
$$ [...]
##$TP= (0..7)
150 150 150 150 150 150 150 150
##$TP07= 0
##$TPNAME0= <>
##$TPNAME1= <>
##$TPNAME2= <>
##$TPNAME3= <>
##$TPNAME4= <>
##$TPNAME5= <>
##$TPNAME6= <>
##$TPNAME7= <>
##$TPOAL= (0..7)
0.5 0.5 0.5 0.5 0.5 0.5 0.5 0.5
##$TPOFFS= (0..7)
0 0 0 0 0 0 0 0
##$TUNHIN= 0
##$TUNHOUT= 0
##$TUNXOUT= 0
##$USERA1= <user>
##$USERA2= <user>
##$USERA3= <user>
##$USERA4= <user>
##$USERA5= <user>
##$V9= 5
##$VALIST= <valist>
##$VCLIST= <CCCCCCCCCCCCCCC>
##$VD= 0
##$VDLIST= <DDDDDDDDDDDDDDD>
##$VPLIST= <PPPPPPPPPPPPPPP>
##$VTLIST= <TTTTTTTTTTTTTTT>
##$WBST= 2048
##$WBSW= 25
##$XGAIN= (0..3)
0 0 0 0
##$XL= 0
##$YL= 0
##$YMAX_a= 533158
##$YMIN_a= -653865
##$ZGOPTNS= <>
##$ZL1= 120
##$ZL2= 120
##$ZL3= 120
##$ZL4= 120
##$ABSF1= 14.98061
##$ABSF2= -5.57192
##$ABSG= 5
##$ABSL= 3
##$ALPHA= 0
##$AQORDER= 0
##$ASSFAC= 0
##$ASSFACI= 0
##$ASSFACX= 0
##$ASSWID= 0
##$AUNMP= <proc_prof1d_extract_pilot.lims>
##$AXLEFT= 0
##$AXNAME= <>
##$AXNUC= <1H>
##$AXRIGHT= 0
##$AXTYPE= 0
##$AXUNIT= <>
##$AZFE= 0.1
##$AZFW= 0.1
##$BCFW= 0
##$BC_mod= 0
##$BYTORDP= 0
##$COROFFS= 0
##$CY= 15
##$DATMOD= 1
##$DC= 0
##$DFILT= <>
##$DTYPP= 0
##$F1P= 0
##$F2P= 0
##$FCOR= 0.5
##$FTSIZE= 32768
##$FT_mod= 6
##$GAMMA= 0
##$GB= 0
##$INTBC= 1
##$INTSCL= 1
##$ISEN= 128
##$LB= 0
##$LEV0= 0
##$LPBIN= 0
##$MAXI= 10000
##$MC2= 0
##$MEAN= 0
##$ME_mod= 0
##$MI= 0
##$NCOEF= 0
##$NC_proc= -8
##$NLEV= 6
##$NOISF1= 0
##$NOISF2= 0
##$NSP= 0
##$NTH_PI= 0
##$NZP= 0
##$OFFSET= 14.98061
##$PC= 1
##$PHC0= 207.8943
##$PHC1= 0
##$PH_mod= 1
##$PKNL= yes
##$PPARMOD= 0
##$PPDIAG= 0
##$PPIPTYP= 0
##$PPMPNUM= 2147483647
##$PPRESOL= 1
##$PSCAL= 4
##$PSIGN= 0
##$PYNMP= <proc.py>
##$REVERSE= no
##$SF= 400.13
##$SI= 32768
##$SIGF1= 0
##$SIGF2= 0
##$SINO= 400
##$SIOLD= 32768
##$SPECTYP= <>
##$SREGLST= <1H.CDCl3>
##$SSB= 0
##$STSI= 32768
##$STSR= 0
##$SW_p= 8223.68421052632
##$SYMM= 0
##$S_DEV= 0
##$TDeff= 65536
##$TDoff= 0
##$TI= <>
##$TILT= no
##$TM1= 0
##$TM2= 0
##$TOPLEV= 0
##$USERP1= <user>
##$USERP2= <user>
##$USERP3= <user>
##$USERP4= <user>
##$USERP5= <user>
##$WDW= 1
##$XDIM= 32768
##$YMAX_p= 463080022
##$YMIN_p= -681075
##$CURPLOT= <Network HP LaserJet P1505>
##$CURPRIN= <$Network HP LaserJet P1505>
##$DFORMAT= <normdp>
##$LAYOUT= <+/1D_H.xwp>
##$LFORMAT= <normlp>
##$PFORMAT= <normpl>
##$SURQMSG= 1
$$ End of Bruker specific parameters
$$ ---------------------------------
##NTUPLES= NMR SPECTRUM
##VAR_NAME=  FREQUENCY,     SPECTRUM/REAL,   SPECTRUM/IMAG
##SYMBOL=    X,             R,               I
##VAR_TYPE=  INDEPENDENT,   DEPENDENT,       DEPENDENT
##VAR_FORM=  AFFN,          ASDF,            ASDF
##VAR_DIM=   32768,         32768,           32768
##UNITS=     HZ,            ARBITRARY UNITS, ARBITRARY UNITS
##FACTOR=    0.250966925370066, 1,           1
##FIRST=     8223.43324360095, 172988,       -89814
##LAST=      0,             94857,           -34652
##MIN=       0,             -681075,         0
##MAX=       8223.43324360095, 463080022,    0
$$ Real data points
##PAGE= N=1
##DATA TABLE= (X++(R..R)), XYDATA
$$ [...]
19548a711n9324l9908d9673k43429l2764D2770d5970K1396o7896D8946d50259
19536E1870J20802R7896F6679b10454k66667a12644j12637o3522c5978B08660
19525D4759a75449O4j55487b1514D5582a78012O5104G4045j5214f0428E1939c26833
19512a82134b2692A38938B0096M13471A77804D3752J41545a06916a7556C48971
19501a26429A0133J38856A6367a02432p7578k84041a88843e0825F6522a93457
19490c9555C48974h6129B4169J725a01244j57198a22365I3630O9441c49874a20224
19478c6132o3111A14290l7637a9580k0986j57209J5293j9462K2461c9664p3616
19467a13280A79783a74310f7836J2125A27435a65278O7330K999m3060k42624A26873
$$ plain form
19548 -1711 -61035 -100943 -49673 -293102 -325866 42770 -45970 -24574 -92470 48946 -450259
19536 51870 172672 270568 66679 -210454 -477121 -112644 -225281 -288803 -35978 208660
19525 44759 -175449 -175385 -330872 -21514 45582 -178012 -112908 74045 58831 -60428 51939 -326833
19512 -182134 -22692 138938 20096 433567 177804 43752 185297 -106916 -17556 348971
19501 -126429 10133 148989 16367 -102432 -180010 -464051 -188843 -50825 66522 -193457
19490 -39555 348974 -86129 24169 25894 -101244 -258442 -122365 93630 163071 -349874 -120224
19478 -36132 -99243 114290 76653 -19580 -40566 -197775 -182482 -201944 -179483 -39664 -113280
19467 -113280 179783 -174310 -67836 -55711 127435 -165278 -97948 -94949 -138009 -380633 126873
19455D0861f3164a4951D05716j44044C0853c17153J50433d9485j21643f637k83069
19444b89706I7285c10737a33262r1574N752h6319o9320B7520O9698C4969R413
19433D4382e2124P548l1381m06924A30471a2354B4310h1956D6977d14453R7206
19422c17247d7455B3594K22686a68874A55223b00451o3299f9223A53443g6020
19411a16133l22553a25783A8240L1566a91465d1781A18062b2608A67759a60189
19400C46008a42582j30172E3368b02904h4670a6151A98606a45296J6504J855I9587
19388b83758A34996c49100O9502b4278B4457d7552j23964e876C91963d99658a49267
19376C18181a07081k6680H0993c5981D0750J15242a25341B7806c07782Q662d2872
$$ plain form
19455 40861 -63164 -14951 405716 261672 30853 -317153 -166720 -49485 -171128 -6637 -289706
19444 -289706 97285 -310737 -133262 -224836 -219084 -86319 -155639 27520 97218 34969 44382
19433 44382 -52124 -44576 -75957 -482881 130471 -12354 24310 -81956 46977 -414453 -317247
19422 -317247 -47455 23594 246280 -168874 155223 -200451 -263750 -69223 153443 -76020
19411 -116133 -438686 -125783 18240 49806 -191465 -41781 118062 -22608 167759 -160189
19400 346008 -142582 -272754 53368 -202904 -84670 -16151 198606 -145296 -128792 -126937 99587
19388 -283758 134996 -349100 -279598 -24278 24457 -47552 -171516 -5876 391963 -499658 -149267
19376 318181 -107081 -133761 80993 -35981 40750 155992 -125341 27806 -307782 -299120 -42872
19364b4051E2266c2002N499B21874C8997a02465D915J4464c7391l5232r080b3578
19351a21962H3205C7800c90040h5341B8611a75729A55886r970m7759K01061c28457
19339a19435P881A79461b22142C7417P2353l3124c8527C5369P0582b08592k45766
19328d54358D5694a95317i4267O833D0194B369J52962g2141j76832f6410A57696
19316d8164j02840J1013a8638E8488h9947J3191k75934J75115B2452L51600g1823
19304a75999f3280F5489J647L06368a15341N2458j90397d6804C6314a66718l83649
19293e50367a02433j72531J30064l2122A03881b28227R6889I3389d5054k62579
19283c07633c4797j86676F2695B5450c0641A1923d98667a93082j54072m5620j08538
$$ plain form
19364 -24051 52266 -32002 -26503 221874 38997 -102465 4915 19379 -37391 -72623 -81703 -23578
19351 -121962 83205 37800 -390040 -85341 28611 -175729 155886 145916 98157 299218 -328457
19339 -119435 -111554 179461 -222142 37417 109770 76646 -38527 35369 105951 -208592 -454358
19328 -454358 45694 -195317 -94267 -87434 40194 2369 155331 -72141 -248973 -66410 157696
19316 -48164 -151004 -139991 -18638 58488 -89947 -76756 -352690 -177575 22452 374052 -71823
19304 -175999 -63280 65489 67136 373504 -115341 -62883 -253280 -46804 36314 -166718 -550367
19293 -550367 -102433 -274964 -144900 -177022 103881 -228227 -131338 93389 -45054 -307633
19283 -307633 -34797 -221473 62695 25450 -30641 11923 -498667 -193082 -347154 -392774 -501312
19272e01312a38289A80674k565a31628N3362D9786O514j6534b8796q9597o203
19261a24596m2584d0005p8107B2065q970b03813A81205c65346D5565b89444J05230
19250a84214A252J3977c65j35302p2220O5744D4531K2642a3514j80712N4770j0285
19238a49741j15349A44310a42129p4100F5421Q537c25926A73988A0262b08510
19227B18259h6346K5104j02174d4492C8598a54610K9517c2965A60764n0215f3493
19215a68769A42948A072a90694B58290a11368b2563F1536A082J82017o7380j3572
19204A02147a38796e8297k29476M6468F803O1503a26431B78393j04175b70316
19193a66897b4088j60109L7112D25282A8334c8776D6835J49778g5010j74504a14817
$$ plain form
19272 -501312 -138289 180674 178109 -131628 -78266 49786 56300 39766 -28796 -118393 -124596
19261 -124596 -167180 -40005 -118112 22065 13095 -203813 181205 -365346 45565 -289444 -184214
19250 -184214 1252 15229 -365 -135667 -207887 -142143 44531 67173 -13514 -194226 -139456 -149741
19238 -149741 -265090 144310 -142129 -216229 65421 73958 -325926 173988 10262 -208510
19227 218259 -86346 -61242 -163416 -44492 38598 -154610 -125093 -32965 160764 110549 -63493
19215 -168769 142948 1072 -190694 258290 -111368 -22563 61536 1082 183099 115719 102147
19204 102147 -138796 -58297 -287773 -241305 6803 68306 -126431 278393 174218 -270316
19193 -166897 -24088 -184197 -147085 425282 18334 -38776 46835 196613 -75010 -249514 -114817
19181a06022r1266M2088G1927b50989M9415A4458J4203K91655f53552a30022c1578
19169a05896H1839a77917k3745A9239a84209c0831j34503b9318k23100A60412
19158A34167E9634b01141k24437A27919h3572A21865b3187p7032A12156a76052
19147A9946d63933a04978I5934a52006e3395o08a4604B0605c50746o249H96a8559
19134b68560e1419G8637J3408a95208O0326A56034L497C042b99972c5711l41263
19123c76974C4996P2418N5247a69903C6680J88280i4454B37497a06861k36119
19113c42980C1436a1193j04626j06218i0591d2200j59858a7192C18153a37965
19102B94012e7180l0988p274B70886i621E6934d004E1001a85454F1903b5892m86131
$$ plain form
19181 -106022 -197288 -155200 71927 -250989 -201574 14458 28661 320316 -653552 -130022 -31578
19169 -105896 81839 -177917 -201662 19239 -184209 -30831 -165334 -29318 -252418 160412
19158 134167 59634 -201141 -425578 127919 -83572 121865 -23187 -100219 112156 -176052
19147 19946 -463933 -104978 95934 -152006 -53395 -54003 -14604 20605 -350746 -356995 896 -18559
19134 -268560 -51419 78637 92045 -195208 -134882 156034 159531 3042 -299972 -35711 -376974
19123 -376974 34996 107414 162661 -169903 36680 224960 -94454 237497 -106861 -342980
19113 -342980 31436 -11193 -115819 -222037 -90591 -42200 -202058 -17192 318153 -137965
19102 294012 -57180 -88168 -95442 270886 -9621 56934 -4004 51001 -185454 61903 -25892 -512023
19090e12023A86052a90954q7022A08658a60042n3498A37208b9486C5815L3620
19080F9435J8669P7901k0549b58166J02970a003l9298j3987m2305B5192f9201
19068a12607c7274A00991a9298I9199a99321a2202I3648R9904R3755r6719c2337
19056a05064N1463A13737b97995c5274k65996b4747E9012d9027D60810a62508
19045C71965A34050h9947k36863A76064a98806i5374E4485k0637J64930a69035
19034E4079j0391a2513k99398a46344B01767b52171B15223a41801d1148o3840
19024a04988a0158A02660R7706n3010e45015e2953k08710a16698d9617j51632
19014b01249A4421i7953d5273F8776j0515a10454m712D9253c22991a44416K907
$$ plain form
19090 -512023 186052 -190954 -277976 108658 -160042 -213540 137208 -29486 35815 69435
19080 69435 88104 166005 145456 -258166 -155196 -1003 -40301 -54288 -96593 25192 -69201
19068 -112607 -37274 100991 -19298 99199 -199321 -12202 93648 193552 287307 190588 -32337
19056 -105064 -53601 113737 -297995 -35274 -301270 -24747 59012 -49027 460810 -162508
19045 371965 134050 -89947 -326810 176064 -198806 -95374 54485 33848 198778 -169035
19034 54079 43688 -12513 -311911 -146344 201767 -252171 215223 -141801 -41148 -104988
19024 -104988 -10158 102660 200366 147356 -545015 -52953 -261663 -116698 -49617 -201249
19014 -201249 14421 -97953 -45273 68776 58261 -110454 -115166 49253 -322991 -144416 -141509
19003a41509N8615D5250a81165A56370J96416f0411K315l5482G6125e5570k87479
18992c43049i7398E408f7349B70808e2323A1540J41668b1136A15754J62880G6498
18980e5299k94845J36700K9737a0040j24181B1053K3279f4601B7314g8432K8685
18969d9747B16634A9886a19815b6843a1297k4832k33706R7901p5789d0711B19341
18957b9941m05951i4607k95196g3780j47323N934F651L8817b5803A45122K11121
18946C56243h9644j0759c7468j4947A18397J21290b92365D5767O8651a15326q5238
18935b00564a0831l8440r0808A64006h6746B9938R0780c85602B31896b6266A8903
18923A92060b38785R5167D5888b26638k3756F6809K73928A20500k8366E831Q01
$$ plain form
19003 -141509 -82894 45250 -181165 156370 352786 -60411 -58096 -93578 76125 -55570 -343049
18992 -343049 -97398 5408 -67349 270808 -52323 11540 153208 -21136 115754 278634 76498
18980 -55299 -350144 -213444 -183707 -10040 -134221 21053 44332 -64601 27314 -78432 -49747
18969 -49747 216634 19886 -119815 -26843 -11297 -36129 -269835 -171934 -247723 -40711 219341
18957 -29941 -435892 -94607 -389803 -73780 -221103 -215169 6651 45468 -25803 145122 356243
18946 356243 -89644 -100403 -37468 -52415 118397 239687 -292365 45767 114418 -115326 -200564
18935 -200564 -10831 -49271 -140079 164006 -86746 29938 120718 -385602 231896 -26266 18903
18923 192060 -238785 -143618 45888 -226638 -250394 66809 340737 120500 92134 5831 6632
18912F632O1136L6231i9339q7592E33092B6538a23735n3329B6132d5622A22398
18900A98723C9049b75995E4147a63622A9422d09938a65708H124b28483O6761A88140
18888a18975j83802J47323A36028h3599A33763d04493I4936c15190A55903E1800
18877e0787l6772j03382d6073J626K1487D56631d40172a50305E8960a27417J0319
18866a17098j7934A0786a15328K7839j95636M7620A53130P112f7342j92978G7744
18854b70002e1176p8163K0425l41828a56841n24234A26336a43070A84938b5107
18843B20518h5816K0466m9601L4200A72362c30617J37051Q1847B63588n6695a19283
18831b39521c4835H2185f8837A01257a72253e6872B1326c47122B64819p3399a35984
$$ plain form
18912 6632 67768 103999 -99339 -186931 533092 26538 -123735 -177064 26132 -45622 122398
18900 198723 39049 -275995 54147 -163622 19422 -409938 -165708 8124 -228483 -161722 188140
18888 -118975 -302777 -155454 136028 -83599 133763 -404493 94936 -315190 155903 51800
18877 -50787 -87559 -190941 -46073 -44447 -22960 456631 -440172 -150305 58960 -127417 -117098
18866 -117098 -135032 10786 -115328 -87489 -283125 -235505 153130 160242 -67342 -260320 77744
18854 -270002 -51176 -129339 -108914 -450742 -156841 -681075 126336 -143070 184938 -25107
18843 220518 -85816 -65350 -114951 -80751 172362 -330617 -193566 -111719 263588 206893 -119283
18831 -239521 -34835 82185 -68837 101257 -172253 -56872 21326 -347122 264819 191420 -135984
18819b5205D58789g7972B62487a08246A63289b95335A53974c92532a37530C78325
18808a39630K5264C18493A6636P1958e1914c894j42416A97442o6599B6154J53481
18797A79635O684J51518e1566B40667h2733b2017d432k91594C33855a17510l67604
18786d85114C8122b28787P6353M6133d184E9387i6780j28701A22080a05138J6847
18775h8291D4248K80411a72683A09995k389b29358D26593a12077c7598B51649
18764b22427J11125k40979g5437k23268n1263B89779a19659n890G2364d4276G0687
18752i159j75856D538d3834G5766e9656H7325l9537i790H3933c14427a1038p8902
18740h9940K3112B3867J9121b5672j22961o1236c1591r3475N7338A49951a79182
$$ plain form
18819 -25205 458789 -77972 262487 -108246 163289 -295335 153974 -392532 -137530 378325
18808 -139630 -114366 318493 16636 88594 -51914 -3894 -146310 197442 130843 26154 179635
18797 179635 186319 337837 -51566 240667 -82733 -22017 -4432 -296026 333855 -117510 -485114
18786 -485114 38122 -228787 -152434 -106301 -4184 59387 -96780 -225481 122080 -105138 -88291
18775 -88291 44248 324659 -172683 109995 107606 -229358 426593 -112077 -37598 251649
18764 -222427 -111302 -352281 -75437 -298705 -349968 289779 -119659 -125549 72364 -44276 70687
18752 -9159 -185015 4538 -43834 75766 -59656 87325 47788 -9790 83933 -314427 -11038 -89940
18740 -89940 -66828 23867 42988 -25672 -148633 -209869 -31591 -125066 -67728 149951 -179182
18728b37552N6060A18304b91660A40253b8034k56516i3105r5847L9328B04424
18717a06126b2578o8429H2124C6487K42661j1149F179g9720A21868b05508R7275
18706a08233j10978J05608Q492j18895c0925l6654F7870f732k35538B1328K08642
18695B29970e2355G1387b1363m1431H9806e2130H1143h7468J6454j37090c0485
18683H0972f2671q8102j61544f0685o4870m18598a9714A0697c6840G0567l057
18672F7510b59610E2518a93765e3655l00553A1824J3510n554q453K9014R9216
18661A39557D2384g0347n3185j89577a50320b9472j85368k64638J63865f269o32092
18650f38361A75245i9361M756K1341A41439h076o5142j0189c1964A40122p599
$$ plain form
18728 -237552 -181492 118304 -291660 140253 -28034 -284550 -93105 -188952 -149624 204424
18717 -106126 -22578 -91007 82124 36487 279148 267999 6179 -79720 121868 -205508 -108233
18706 -108233 -219211 -113603 -105111 -224006 -30925 -67579 67870 -6732 -242270 21328 229970
18695 229970 -52355 71387 -21363 -62794 89806 -52130 81143 -87468 -71014 -208104 -30485
18683 80972 -62671 -150773 -312317 -60685 -125555 -544153 -19714 10697 -36840 70567 67510
18672 67510 -259610 52518 -193765 -53655 -354208 11824 25334 19780 11327 40341 139557
18661 139557 42384 -70347 -123532 -313109 -150320 -29472 -214840 -479478 -315613 -6269 -638361
18650 -638361 175245 -99361 -94605 -73264 141439 -8076 -73218 -83407 -31964 140122 132523
18639A32523a85966A21572a91939D4375c48276A45249e5974d609A06646h6342
18628a78157h4496A16247g752D8461J02283l9918c40740A90343a01298p3970n0898
18617b26166J10311E4090a35836B65210a92017B84077c77992a62376J4953a6658
18606a00334C39121a02721A24642D1929a62901A74418K7253B190P9108d23990
18595b37313g4527r5388e8341k21836i0303A05457g3091l3364B53220A05266J32038
18584B37304c23573Q286E1533b40876R7773l1684O7261B56d5438B97685b16995
18572d2084j69836j9269K9134a9219j29413M0568A69646J5372o6819R6056g5804
18560d30168J3382a07688B18074a70856H8607c03139B84096G2253a84486q5195
$$ plain form
18639 132523 -185966 121572 -191939 44375 -348276 145249 -55974 -4609 106646 -86342
18628 -178157 -84496 116247 -7752 48461 150744 110826 -340740 190343 -101298 -175268 -226166
18617 -226166 -115855 54090 -135836 265210 -192017 284077 -377992 -162376 -147423 -16658
18606 -100334 339121 -102721 124642 41929 -162901 174418 201671 2190 81298 -423990
18595 -237313 -74527 -169915 -58341 -280177 -90303 105457 -73091 -106455 253220 105266 237304
18584 237304 -323573 -315287 51533 -240876 -143103 -174787 -107526 256 -45438 297685 -216995
18572 -42084 -211920 -231189 -202055 -19219 -148632 -108064 169646 185018 118199 214255 -75804
18560 -430168 -416786 -107688 218074 -170856 88607 -303139 284096 72253 -184486 -269681
18550b69681f4996k106A72571H0269a1482l12476A68567d4960j41773E2808P723
18539F0531c7395j66725B74798A4815J3035c46678B14130b05268i5977C21725
18528a27014A8512K37325a18448m5514A17750m971f8593l2159k9655M5679K0383
18517f4345m13420j4754B4479R803a68083g1675A18596d7906j24975f0463n4869
18506a15332I0684C0871b0171j78522B36578I317b42814a0826A56247c64849A86428
18494d263k44459A76858c92588a48449B0373K58755k7617B7477d4943F2256J47671
18483B09927a7461j24318C8810a544I089b60863B32077D2809f4346l07326J71573
18472b00099A8421b12181a01605j35675A48325O3101m1230b67387A26035d6311
$$ plain form
18550 -269681 -64996 -67102 172571 80269 -11482 -323958 168567 -44960 -186733 52808 60531
18539 60531 -37395 -204120 274798 14815 27850 -346678 214130 -205268 -95977 321725
18528 -127014 18512 255837 -118448 -163962 117750 112779 -68593 -100752 -130407 -84728 -64345
18517 -64345 -477765 -492519 24479 34282 -168083 -71675 118596 -47906 -172881 -60463 -115332
18506 -115332 90684 30871 -20171 -198693 236578 9317 -242814 -10826 156247 -364849 186428
18494 -4263 -248722 176858 -392588 -148449 20373 279128 251511 27477 -44943 62256 209927
18483 209927 -17461 -141779 38810 -1544 9089 -260863 232077 42809 -64346 -371672 -200099
18472 -200099 18421 -212181 -101605 -237280 148325 211426 170196 -267387 126035 -46311
18461A44335b2624A35281b34739J01147C5051a33777j10446I7229J06920r2486
18451A11663K8065f0825P617j20196f343j02616k4958l4738j34497C33303A18500
18439D0152o798a23497A51109G382N1672a40686L6384r9003m5009K3734O4431
18428a60149I7998O8125e7337B82785P1818a17344q5362b8593j26843K876e1132
18416I0306b85566K0980A73874a87336n9585B78626b93145h5121m04678A06319
18405b21532f5611F8641M2626a39228b0999I4164d41j60149I5285b51712A88514
18393A26815l4037L06904a66499C4545Q4487j7690c0334A27146k6771Q8540a56116
18381a3791j12177e64H4617P8410E4991b58788O1301B9578K33097a21341H9166
$$ plain form
18461 144335 -22624 135281 -234739 -133592 35051 -133777 -244223 97229 204149 111663
18451 111663 139728 -60825 -53208 -173404 -6343 -108959 -133917 -168655 -303152 333303 118500
18439 40152 33354 -123497 151109 7382 59054 -140686 -104302 -203305 -248314 -224580 -160149
18428 -160149 97998 166123 -57337 282785 354603 -117344 -202706 -28593 -155436 -152560 -51132
18416 90306 -285566 -264586 173874 -187336 -246921 278626 -293145 -85121 -489799 106319
18405 -221532 -65611 68641 111267 -139228 -20999 94164 -441 -160590 95285 -251712 188514
18393 126815 92778 399682 -166499 34545 119032 101342 -30334 127146 100375 188915 -156116
18381 -13791 -125968 -564 84617 163027 54991 -258788 -197487 29578 262675 -121341 89166
18369A4691a25061n9741j10031C2880h8152M3294k1969A66974a58747k4989C0914
18357f3095o6962A34760A5834c47116J64193A20967f2195j26558A37434a08572
18346a71515n8208G4434c2244k95429A4235b79360a6765j32572K8258K7470m6054
18335a39663F9133J78359i4148j97854a09335D6776b64946L4312k82616i0829
18324A86038b35011r180f354k7324E8378e8164l2185p3062A19822m7942N0302
18313A22182a51299p396F1131b26647A9223b5519j42979A03612e2548k52006a39782
18301f9260k47855a04601k42626B07193c40109a58196c701j2923o8538B79541
18290e8101A82724R5295j24663b14024A68994D4512b52803F5611a12322P398j1145
$$ plain form
18369 14691 -125061 -184802 -294833 32880 -88152 -44858 -66827 166974 -158747 -183736 30914
18357 -63095 -130057 134760 15834 -347116 -182923 120967 -62195 -188753 137434 -108572
18346 -171515 -229723 74434 -32244 -327673 14235 -279360 -16765 -149337 -121079 -93609 -139663
18335 -139663 69133 247492 -94148 -292002 -109335 46776 -264946 -230634 -513250 -90829
18324 186038 -235011 -244191 -6354 -33678 58378 -58164 -90349 -163411 119822 71880 122182
18313 122182 -151299 -158695 61131 -226647 19223 -25519 -168498 103612 -52548 -304554 -139782
18301 -69260 -317115 -104601 -347227 207193 -340109 -158196 -3701 -16624 -85162 279541
18290 -58101 182724 278019 153356 -214024 168994 44512 -252803 65611 -112322 -104924 -116069
18279a16069j9526F5371P0837a03573f987P55j64115m6658b0753r0897B4072b73152
18266a47184M9782a7690k6144I4649k3246e4673A88614G4104n393a8756j70693
18255a89449R89A6401K03375m2740h6475E3854a77799G0385a01369j01481c9045
18243b24806A44032C3588K72142a75632M3864A52167b23353A80049a39078B91632
18232a18987j61039B41662q7039G5557d6514D4367l618Q9790c4840m08F3041g8396
18219b7373m1780G3341k6636a49992f363k16805e6924k37266M6871q8933G6197
18207b17169j6456C21764F7645a47149B82787f1025m8439G1243e4091F0807g5373
18195H2919A4129e7609j54878n914P4313f7496D2544a80058C2088b20176p7997
$$ plain form
18279 -116069 -135595 65371 136208 -103573 -6987 -6232 -170347 -217005 -20753 -111650 24072 -273152
18266 -147184 -97402 -17690 -43834 94649 71403 -54673 188614 74104 68711 -18756 -189449
18255 -189449 -188460 16401 219776 177036 -86475 53854 -177799 70385 -101369 -202850 -39045
18243 -224806 144032 33588 305730 -175632 -131768 152167 -223353 180049 -139078 291632
18232 -118987 -280026 241662 154623 75557 -46514 44367 40749 130539 -34840 -35248 63041 -78396
18219 -27373 -69153 73341 46705 -149992 -6363 -223168 -56924 -294190 -247319 -336252 76197
18207 -217169 -233625 321764 67645 -147149 282787 -61025 -109464 71243 -54091 60807 -75373
18195 82919 14129 -57609 -212487 -218401 -144088 -67496 42544 -180058 32088 -220176 -298173
18184b98173G0696b01194A40290B4197J12943D7892c6335F1613e0911D5863b29912
18172a37434j81389E3432b2540C6798L61385a33183f3008H3532l7957J67521k526
18161B10570B9853d9493D2257L67902c639G6390e0067I5710b34931A19417C651
18149B02294L1201f448I5510R4074c00790D833e23216B50047f5265A60248K4345
18138A84593E765a79480c7987l02023A99663c49704f383C9909b17714B05622b06129
18126B3997b51604h0843A75445g2505j16622D4041J89438f5115E100a26015B0639
18114B62334c772j59669L7107C89064a8077k54263D4803b5350A64887J02979b08481
18102F5128a57362H0909o495R0613k628i3610B73150j22837i2951n6783K9411
$$ plain form
18184 -298173 70696 -201194 140290 24197 137140 47892 -36335 61613 -50911 45863 -229912
18172 -137434 -318823 53432 -22540 36798 398183 -133183 -63008 83532 45575 213096 210570
18161 210570 29853 -49493 42257 410159 -3639 76390 -50067 95710 -234931 119417 3651
18149 202294 233495 -6448 95510 189584 -300790 4833 -523216 250047 -65265 160248 184593
18138 184593 5765 -179480 -37987 -340010 199663 -349704 -6383 39909 -217714 205622 -206129
18126 23997 -251604 -80843 175445 -72505 -189127 44041 233479 -65115 5100 -126015 20639
18114 262334 -3772 -163441 -126334 389064 -18077 -272340 44803 -25350 164887 267866 -208481
18102 65128 -157362 80909 74414 165027 162399 -93610 273150 150313 -92951 -149734 -120323
18091a20323M022B56932c6643n7076C54517b19700C288b63246f7736p4002C43146
18079A38313a42872B5854b46418a16529q8171f6313D66583B4516o231J04139K6952
18068A49376E1013K26502d224j26357A83541a87010g8313K3648l3286j64072J02586
18057a49437H0067J03439a68869c7158j61938N0189I8124a14839C35784a37343
18046i437A94295a9187j4854B32984i4917A15609g3784F6d1192m2983J2559C09540
18033A46025c0390n5740E4471J70431a67394E379a07587B04478n2807b71199j49524
18022d20723A49051Q4109a5700j89689g5479j75423I9638d0799l4000L880k17517
18011b88436J16498A4402e0979A70148f8906D6171j9226a39978A93747a37259
$$ plain form
18091 -120323 -116301 256932 -36643 -93719 354517 -219700 3288 -263246 -67736 -141738 343146
18079 138313 -142872 25854 -246418 -116529 -204700 -66313 466583 24516 18285 122424 149376
18068 149376 51013 277515 -4224 -130581 183541 -187010 -78313 -54665 -87951 -252023 -149437
18057 -149437 80067 183506 -168869 -37158 -199096 -148907 98124 -114839 335784 -137343
18046 -9437 194295 -19187 -34041 232984 -94917 115609 -73784 66 -41192 -84175 -71616 309540
18033 146025 -30390 -86130 54471 224902 -167394 5379 -107587 204478 151671 -271199 -420723
18022 -420723 149051 233160 -15700 -205389 -75479 -250902 99638 -40799 -74799 -70919 -288436
18011 -288436 -171938 14402 -50979 170148 -68906 46171 26945 -139978 193747 -137259
18000F6279O7339h4417G0705i0740d4831F9246M7876B0565L0737b8806l43708
17989c72514a14609k5473A10474g6612C48702a76822h3493L5119q3086k6619D4845
17977F2527K05466q9587a28308E96056b932r4457J4144k04678J00852l0690k38282
17966d56043B0390N6524L5750b10024g2992l37547a9944j70950H3211a18q0231
17955h0349B40705a88887A60747n754C8099L01467a05311E5090P3082i3542B11280
17943A31289J32846m0155H281a43678C78715b11867i1425L1614B39894F4280N8320
17932A22600d3903A54445e5651q8276B6740c34409e9844G3069L1603b74220a32937
17920d6334j53018D4222K8920Q1184C3174a7795j337o0859J7476k39947A9539
$$ plain form
18000 66279 133618 -84417 70705 -90740 -44831 69246 117122 20565 51302 -28806 -372514
17989 -372514 -114609 -140082 110474 -76612 348702 -176822 -83493 -48374 -131460 -158079 44845
17977 62527 267993 178406 -128308 596056 -2932 -97389 -83245 -287923 -187071 -217761 -456043
17966 -456043 20390 76914 112664 -210024 -72992 -410539 -19944 -190894 83211 -118 -80349
17955 -80349 240705 -188887 160747 154993 38099 339566 -105311 55090 128172 -93542 211280
17943 131289 264135 223980 8281 -143678 378715 -211867 -91425 -59811 239894 64280 122600
17932 122600 -43903 154445 -55651 -143927 26740 -334409 -59844 73069 104672 -274220 -132937
17920 -46334 -199352 44222 73142 154326 33174 -17795 -19132 -79991 -62515 -302462 19539
17908C12771F6228b35064A76416b176j18370C8374J40167a20169A02797L4834
17898A37631a43542a293l77210I4002J59277a6947k19846A22926c9287A36613
17887A70778a65869f1739b3176p6891B41509q8791b94033a41127e8026B5022a03385
17875b4160j3068A78587c82697R8615a38022F8126J63203j3300N610E1437a87847
17863d53542C2551c4579k15104O2500j3619j42176B11998f5511L2498C01904a22558
17851d3679q2341A10421D0026e1271j45359H8630a16205A19870a5372j7103A48724
17839a2862k52465A57956C1874a8571I7761b76813B12009A01393b75191J33969
17829a41222B62339A8506a43509D27064i098A77707b26117A38179A9059O5739
$$ plain form
17908 312771 66228 -235064 176416 -2176 -120546 38374 178541 -120169 102797 137631
17898 137631 -143542 -1293 -378503 94002 253279 -16947 -236793 122926 -39287 136613
17887 170778 -165869 -61739 -23176 -100067 241509 152718 -294033 -141127 -58026 25022 -103385
17875 -24160 -37228 178587 -382697 -284082 -138022 68126 231329 218029 223639 51437 -187847
17863 -453542 32551 -34579 -249683 -187183 -200802 -342978 211998 -65511 -33013 301904 -122558
17851 -43679 -126020 110421 40026 -51271 -196630 88630 -116205 119870 -15372 -32475 148724
17839 -12862 -265327 157956 31874 -18571 97761 -276813 212009 101393 -275191 -141222
17829 -141222 262339 18506 -143509 427064 -9098 177707 -226117 138179 19059 84798
17819H4798a9469A18500a6175k7061D85736I0578C0443J28306b19628N8567A74936
17807h514j23264L4629A22186n487b37675i4062k09188A94513D974J68929E8437
17795B449J3930D623J20342m4202d3403B73599a45419I2928J45278R9375j24170
17784B13411F9669E227R5244a96333p2864H5789K74238H7743P2095c59558A09713
17772A37557M678k0348K88420a86063b3168n7185A5726J60956b6726o8797A57000
17760A87531d3082h031A41569m3270M3682a7678j02887k35821H5890e767B73133
17748b35982j20231g5069F9054g7769l19937a32885a6318p6991K4157g192B91387
17736a74604H3903d1218k7424m82314K17706M9036g2035B27712d482l8126D3906
$$ plain form
17819 84798 -19469 118500 -16175 -43236 485736 90578 30443 158749 -219628 -161061 174936
17807 -8514 -131778 -97149 122186 116699 -237675 -94062 -303250 194513 4974 173903 58437
17795 2449 16379 4623 124965 80763 -43403 273599 -145419 92928 238206 337581 213411
17784 213411 69669 5227 100471 -196333 -269197 85789 360027 87743 159838 -359558 109713
17772 137557 142235 121887 410307 -186063 -23168 -80353 15726 176682 -26726 -95523 157000
17760 187531 -43082 -8031 141569 98299 141981 -17678 -120565 -356386 85890 -5767 273133
17748 -235982 -356213 -75069 69054 -77769 -397706 -132885 -16318 -93309 -69152 -7192 291387
17736 -174604 83903 -41218 -68642 -550956 -333250 -284214 -72035 227712 -4482 -42608 43906
17724c1382R873D2711c7973B949d1321B50803h8135A55556a59029A35974j6758
17713A19216a09039n7716H9032M0707d680I4154m0611a82000j00878Q0713A42972
17701A56131F443L0352c0640C47803a92069A3346a77171k55595B2140a16140I9069
17689A15520A739c5043j58183J9150J2750A36462a80615j651d3342J9639H3534
17677H3704N4313j449f6101j44542c1049A37873b22992D69618h3691A08138a81199
17665b46267B7755J43400o5090c06679h9200F1733k9115L78482j48869B2055b313
17653B62372e6866G0078J2910c65992a07079j68132A78117E5674d03349F2671
17642B99761A3072a71792A76263J5160J28207A51401A615N5211A2160c2306E3852
$$ plain form
17724 -31382 -21509 42711 -37973 2949 -41321 250803 -88135 155556 -159029 135974 119216
17713 119216 -109039 -166755 89032 129739 -4680 94154 53543 -182000 -282878 -202165 142972
17701 156131 6443 36795 -30640 347803 -192069 13346 -177171 -432766 22140 -116140 99069
17689 115520 1739 -35043 -193226 -174076 -161326 136462 -180615 -182266 -43342 -23703 83534
17677 83704 138017 136568 -66101 -210643 -31049 137873 -222992 469618 -83691 108138 -181199
17665 -246267 27755 171155 106065 -306679 -89200 61733 32618 411100 262231 22055 -2313
17653 262372 -56866 70078 82988 -365992 -107079 -275211 178117 55674 -403349 62671
17642 299761 13072 -171792 176263 191423 319630 151401 1615 56826 12160 -32306 53852
17630C56080p8406C8495J08871D6910b24271C49313E2975a10410A25469b98307
17619C6460i035A23275F493f4094A20876D2703d8115B26140j00270D9872a64829
17607a96104I3479C6022a85438f909A30345b73549C4446a81795A31526E6892b67735
17595d921l19695b7264j80173D7130J21848e1217o5301A14774A582K10334d4733
17583F3283f0485r8215A89812c14516g223B39685r5585J46979I603J72327C5271
17571b2614A53335K8295a47827H4428R7745J15830j23096b49519B81823j34016
17561A47807K1125a35686c9395k28041B71058I8217a07009c6384R205C5580b4850
17549a11153A63734B163K85152n0786a36450c5691n5829A01682J75224I0389K2770
$$ plain form
17630 356080 277674 38495 147366 46910 -224271 349313 52975 -110410 125469 -298307
17619 36460 -9035 123275 6493 -64094 120876 42703 -48115 226140 125870 49872 -164829
17607 -196104 93479 36022 -185438 -6909 130345 -273549 34446 -181795 131526 56892 -267735
17595 -4921 -324616 -27264 -207437 47130 168978 -51217 -116518 114774 1582 211916 -44733
17583 63283 -60485 -158700 189812 -314516 -7223 239685 144100 291079 9603 181930 35271
17571 -22614 153335 181630 -147827 84428 182173 298003 174907 -249519 281823 147807
17561 147807 168932 -135686 -39395 -267436 271058 98217 -107009 -36384 -27179 35580 -24850
17549 -111153 163734 2163 287315 236529 -136450 -35691 -91520 101682 276906 90389 113159
17538A13159M0117g9570E8004b7833j19105H2058B0598J53629e025b058B72276
17526f3604F9305B5900J62674a24018p4803G8073b4877B81783a14722I2396K34403
17515C26799Q2158h8964H4174a02782A76110J59756A63699J08977b76620A63690
17504a31800A24031N3364a81010C6149c6913m6259a564F6644a40527C44766L5894
17493C80660A61807L15325j62642J07634H2682J01405A5726J58872a97989i996
17482A46424J49982j36552G5704d3435B79543A02260a72995D24632I4551L87614
17472D82165c83942D7109O436b3014C6599P1227m4839k0451N2045K20138b7431
17460A08197a42131E2495R0799m1633K46351k6721d000B63007D5197J96099p075
$$ plain form
17538 113159 153276 -79570 58004 -27833 -146938 82058 20598 174227 -5025 -2058 272276
17526 -63604 69305 25900 188574 -124018 -198821 78073 -24877 281783 -114722 92396 326799
17515 326799 408957 -88964 84174 -102782 176110 335866 163699 272676 -276620 163690
17504 -131800 124031 177395 -181010 36149 -36913 -83172 -1564 66644 -140527 344766 380660
17493 380660 161807 477132 314490 422124 82682 184087 15726 174598 -197989 -9996
17482 146424 296406 159854 75704 -43435 279543 102260 -172995 424632 94551 482165
17472 482165 -383942 47109 53545 -23014 36599 107826 62987 42536 94581 314719 -27431
17460 108197 -142131 52495 143294 101661 348012 321291 -4000 263007 45197 241296 234221
17449B34221c25980N8595D4387J40455M90319I7692k4481d0792B45085n7322a46775
17437D53109g6764A5630K45198h0920C90959C0786M87274A20931K54157j18246
17427B56842q9289g5816C26531j14201J30328P7492q7951j32392n0745L03714
17417D52776j29252r5210k845r9829K72690j54868j15017F3008J61485N5483b652
17405D06271j60247K85566j58914o694l4356J09663j25970A44209K91412j70641
17395B64980r7065F7209M13438a46158C5802J46707A1580J94046M1533G8004B2852
17383A92274J79289j34080H6154J85118H7821K73473B1372K89713b9353q55m80
17372c0688I4881K01790C1380J49530D630J31277a57210A10512D1070K76532q2830
$$ plain form
17449 234221 -325980 -267385 44387 184842 675161 97692 73211 -40792 245085 187763 -146775
17437 453109 -76764 15630 260828 -80920 390959 30786 518060 120931 375088 256842
17427 256842 167553 -75816 326531 212330 342658 420150 332199 199807 149062 452776
17417 452776 323524 228314 225469 125640 398330 243462 128445 63008 224493 279976 -2652
17405 406271 246024 531590 372676 365982 331626 441289 315319 144209 435621 264980
17395 264980 167915 67209 480647 -146158 35802 182509 11580 205626 247159 78004 22852
17383 192274 371563 237483 86154 271272 87821 361294 21372 311085 -29353 -30208 -30688
17372 -30688 94881 296671 31380 180910 4630 135907 -157210 110512 41070 317602 234772
17361B34772J05166L0809j73979O4526j21415B5232a80945D378L44800j32602
17351B16576a39338C83389i7444B57583L0268a07274A17820n4936L4099i9588
17340C12228n4597q5528A7031J96160G1869a96694h5860B23799C214O361R9081
17329A08656a21950A31450n7122J8106J41410a26708C14878M311B3065b80230
17318C1964L28195q6749p6076g2940j04621A45255i5358C89401A19683i7520D65791
17306C30164I6731j9687m094K95441D0257M4732K61959j67685O7661K5174J16159
17295C88257i1477A51916K42245j44761J45940D9996L11779F9206L91640k04558
17285B56288a78899A07870Q2074J12032b5727D7872J3878M14610k18106D0086
$$ plain form
17361 234772 339938 370747 196768 261294 139879 25232 -180945 4378 349178 216576
17351 216576 -139338 383389 -97444 257583 287851 -107274 117820 62884 96983 -99588
17340 312228 257631 172103 17031 213191 71869 -196694 -85860 223799 3214 9575 108656
17329 108656 -121950 131450 74328 92434 233844 -126708 314878 319189 23065 -280230
17318 31964 360159 273410 197334 -72940 -177561 145255 -95358 389401 119683 -97520 465791
17306 330164 96731 77044 72950 368391 40257 84989 346948 179263 246924 272098 388257
17295 388257 -91477 151916 394161 249400 395340 49996 361775 69206 460846 256288
17285 256288 -178899 107870 189944 301976 -25727 47872 61750 476360 258254 40086
17274E0708k3027b67925N6706a5191D80744j50200j02119K57128G7926J5135h5478
17262C12148r6446b83230H2464I25L69082f890D90322A82772P2752c2887B72781
17250B18277J59483l6881B9067J50889n0447j8699P2753K24976A12721J46160
17240B58881j11351J42534l7896j18594J80063A50993k7091M9005K29287f6418
17229E32852A52797J14927J25574b74955C43689A42936N6152M2595a88751k503
17219a91254B00842N5941R865o5360q0365K96515A40376C5420J55434R582n3298
17208A47138K3859m8399M15652B6803r918J15548J95479K03731A04783L3267J81676
17197C19726I8069l5620K15903l7445J0441J50741k6863J58377A59429Q889D5040
$$ plain form
17274 50708 27681 -267925 -211219 -15191 480744 330544 228425 485553 77926 93061 -85478
17262 312148 215702 -283230 82464 925 370007 -6890 490322 182772 255524 -32887 272781
17250 218277 377760 340879 29067 179956 129509 110810 183563 408539 112721 258881
17240 258881 147530 290064 252168 133574 313637 150993 123902 172907 402194 -66418
17229 532852 152797 267724 393298 -274955 343689 142936 199088 241683 -188751 -191254
17219 -191254 200842 256783 266648 201288 120923 417438 140376 35420 190854 200436 147138
17208 147138 170997 122598 538250 26803 16885 132433 327912 531643 104783 138050 319726
17197 319726 98069 62449 278352 240907 251348 402089 375226 533603 159429 168318 45040
17185a4076D4940M1460M27581A94038L11753B01598J7326J23390G25K30131I2047
17173D14673k00621J82092A53729a24477C06419j06368C8770L18632A23140L5836
17163A58976J7743K72576E2848R7674Q9976k0283Q3130j0015k0575J04265A22129
17151A36030J81841n3494j440j875n5578K71070B02667o8338L30753i497D00517
17139C89981r2743G8731L14945K07119j01587a637C90486P8798B23403g1939C09501
17127C14408j9567M5486P1998J84397B19318K66847k20259a3562B29983j11157
17117A18826L6915P7293J51859J16503k31625L58078k39855K2884J99099C01093
17106C75548A23822J63953K18129J64633G540L59610A4308J77983K23201B05653
$$ plain form
17185 -14076 44940 86400 513981 194038 505791 201598 218924 342314 725 230856 92047
17173 414673 214052 396144 153729 -124477 306419 200051 38770 357402 123140 158976
17163 158976 176719 449295 52848 150522 240498 220215 303345 293330 272755 377020 122129
17151 136030 317871 264377 262937 261062 205484 476554 202667 134329 465082 -9497 400517
17139 389981 297238 78731 393676 600795 499208 -1637 390486 469284 223403 -71939 309501
17127 314408 294841 340327 412325 596722 219318 486165 265906 -13562 229983 118826
17117 118826 155741 233034 384893 501396 269771 627849 387994 410878 609977 301093
17106 375548 123822 287775 505904 670537 7540 367150 14308 192291 415492 205653
17095E93707M9558B64864R1542j25996L41082H9540N73486j71496K19612B67939
17084C83411J07334A03386J37160J34946k5007k1025r3729l253L17227B40028
17073D19238D1585M21001n097o2528Q1549j15964p3214J60419J43027J78165B68599
17061C40478J28397J55384k70890J05206p8642J55074j05380l9639L25281B12754
17050A21234K10469L05945j11173j33569A27591N91906A76301M64394L6305j60879
17040E16121j14026L076l8851j8086K10125k44418K26591r5115J16778A78667
17029E23575r113m2512K8181j95289K40211K63550K3121B94098M59013j53675
17019E99436j70338R9151M7429j89133Q9617q20K70859J49341B87649N01120k75578
$$ plain form
17095 593707 643265 264864 356406 230410 571492 89540 663026 491530 711142 267939
17084 383411 490745 103386 240546 375492 350485 329460 235731 232478 549705 240028
17073 419238 41585 462586 457489 394961 476510 360546 287332 447751 590778 768943 268599
17061 340478 468875 624259 353369 458575 379933 535007 429627 389988 715269 212754
17050 121234 331703 637648 526475 392906 127591 719497 176301 640695 677000 516121
17040 516121 402095 405171 366320 348234 558359 313941 540532 445417 562195 178667
17029 523575 514462 471950 500131 304842 545053 808603 831724 294098 753111 599436
17019 599436 429098 528249 575678 386545 476162 475342 746201 895542 287649 788769 513191
17008E13191J02699k98418K52668K57438C90210L38428k74310J02625K42851j36246
16998F63558R5273P0918l39806L97926K0560l14602m7847K04521k51784l055L19442
16987H15104l04958J56666r7828M61432m35910L8618J3643K12018k00964J02272
16977G60093K27231j85645J99626k83503K85374k47227j54543L77259J11258k64623
16967H25300l0477p4997J14114J15116n8701O4391j07698m2932l21076P53352
16957A236392l66092n5764J03778J14834p8141Q267J66856l08669j32171M79950
16947A169240p3753L0988k9370K57881m55573M48501n75725K22474J80545j89689
16937I85519J09542j19260J21723J23411j94110j39272K32009j39140K94161l17217
$$ plain form
17008 513191 615890 317472 570140 827578 390210 728638 454328 556953 799804 663558
16998 663558 758831 829749 489943 887869 908429 593827 545980 750501 498717 495662 815104
16987 815104 510146 666812 568984 1030416 594506 633124 646767 858785 657821 760093
16977 760093 987324 801679 1001305 717802 1003176 755949 601406 978665 1089923 825300
16967 825300 794823 719826 833940 949056 890355 954746 847048 804116 483040 1236392
16957 1236392 870300 814536 918314 1033148 955007 963274 1130130 821461 689290 1169240
16947 1169240 1095487 1126475 1097105 1354986 899413 1347914 772189 994663 1175208 985519
16937 985519 1095061 975801 1097524 1220935 1026825 887553 1119562 980422 1274583 957366
16927I57366L73554k83822j17097J90919M3846K8663J0616j28906j10290N74951
16917A539800k35427j90861L73570m15065K80706j03012j67832K48205J37561
16908A467645n15271P28912k10163j51851N72736n40732J21362k84968R4437r479
16898A272628j0428M13536m81168M75506M7837O8939l33775P1701K51087M56199
16888B232062l10070l62130J70437J81196j95567K4849J90044j00473J09976q3034
16878A857290P0190k4538O6228l54753J50838k0955L30513J12155k63559K13405
16868B136814N177o6202m9732K53332k39102J96132m23411L91144j75789L13150
16858B341513j26424R8389o4097L43436k30915j73673L29111R4816j97104K21819
$$ plain form
16927 957366 1330920 1047098 930001 1120920 1164766 1193429 1204045 1075139 964849 1539800
16917 1539800 1304373 1113512 1487082 1072017 1352723 1249711 1081879 1330084 1467645
16908 1467645 952374 1681286 1471123 1319272 1892008 1351276 1472638 1187670 1282107 1272628
16898 1272628 1262200 1675736 1194568 1670074 1717911 1786850 1453075 1524776 1775863 2232062
16888 2232062 1921992 1559862 1730299 1911495 1715928 1740777 1930821 1830348 1940324 1857290
16878 1857290 1927480 1902942 1969170 1614417 1765255 1744300 2074813 2186968 1923409 2136814
16868 2136814 2141991 2075789 2026057 2279389 2040287 2236419 1813008 2204152 2028363 2341513
16858 2341513 2215089 2313478 2249381 2592817 2361902 2188229 2517340 2612156 2415052 2636871
16848B636871r8641K1522j74397L35670L23205n84767O37220m98910M34487m77514
16838B554746K81425J29165L06652j29816j92525L10841k55248N20221O1576M
16828C587041J46822L39094m39028j18548J35819L62431r8483m4204R3332K55117
16818D219393l54260K71679J90158J14460N5638L01534l16947L55377o4752K37040
16808E009320l3003Q8326P1807L02009k14739O4072L59461l79607M50312L04597
16798F022555M8850K16884m6126L3269R4639J81388N09785j53876k9847M12599
16788G290120R1763k3272L08553N40259M7091L2497J30327J46998Q6207M13389
16778I063932K20845N45519p3793M91674r5888J012379M8395K29564K94928L74551
$$ plain form
16848 2636871 2538230 2559752 2385355 2721025 3044230 2459463 3096683 2597773 3032260 2554746
16838 2554746 2836171 2965336 3271988 3142172 2949647 3260488 3005240 3525461 3587037 3587041
16828 3587041 3733863 4072957 3633929 3515381 3651200 4013631 3915148 3870944 3964276 4219393
16818 4219393 3865133 4136812 4326970 4441430 4497068 4798602 4481655 4837032 4772280 5009320
16808 5009320 4976317 5064643 5136450 5438459 5223720 5287792 5647253 5267646 5717958 6022555
16798 6022555 6071405 6288289 6242163 6275432 6370071 6551459 7061244 6907368 6877521 7290120
16788 7290120 7381883 7358611 7667164 8207423 8254514 8287011 8417338 8564336 8650543 9063932
16778 9063932 9284777 9830296 9756503 10248177 10152289 11164668 11213063 11442627 11737555 12112106
16768A2112106N52492M88186O7512K06496O86243N85989J89076N19521L77093
16759A5784714M24708O86781O20980R34188L73534P87987M51230J076762M90254
16750B1631138J337273O02941Q80344R37041R40477J439638J396734J031796J418383
16741C1615765J401299J491365J609008K177448J641916K036865K440951K544697
16733D6959314J986468K958034K929012L255015L458843L284312M112110M262660
16725G3205768M376097N203987N456877O097022O394297O223896P139991P711898
16717A21809833P922602Q793270Q080731R541373Q787555R580873Q452021Q398913
16709A91367171P816737O603477N795033M317809K559371P05637r52851k120379
$$ plain form
16768 12112106 12664598 13152784 13220296 13426792 14113035 14699024 14888100 15407621 15784714
16759 15784714 16209422 16896203 17517183 18451371 18824905 19612892 20064122 21140884 21631138
16750 21631138 22968411 23571352 24451696 25388737 26329214 27768852 29165586 30197382 31615765
16741 31615765 33017064 34508429 36117437 38294885 39936801 41973666 44414617 46959314
16733 46959314 48945782 51903816 54832828 58087843 61546686 64830998 68943108 73205768
16725 73205768 77581865 82785852 88242729 94339751 100734048 106957944 114097935 121809833
16717 121809833 129732435 138525705 146606436 156147809 164935364 174516237 182968258 191367171
16709 191367171 199183908 205787385 211582418 215900227 218459598 219165235 218212384 216092005
16701B16092005m292888n841298o545107p964039q553589q987528r276808r212508
16693A55418240r130708q671469q446565q358969p698667p284292p094705n934720
16685I2798145o600366n331202n104681n470512m260877l685032l849567l673508
16677E4822400l110232l117064k717156k610382k534421k281464j896283k074996
16669C4480402j772550j869876r82143j671938j372892j289753o59642j215104
16661B3646504j102249j166151o46447r49048p84735j088652l70827q60637o82783
16652A5994975n32753l44259o76170n99677m47240o38457k17365m68378j92232
16643A1878444m90661m06548j56751n50859o01187j27834n91291L11482n88394
$$ plain form
16701 216092005 211799117 205957819 199412712 191448673 182895084 173907556 164630748 155418240
16693 155418240 146287532 137616063 129169498 120810529 113111862 105827570 98732865 92798145
16685 92798145 86197779 80866577 75761896 70291384 66030507 62345475 58495908 54822400
16677 54822400 51712168 48595104 45877948 43267566 40733145 38451681 36555398 34480402
16669 34480402 32707852 30837976 29855833 28183895 26811003 25521250 24861608 23646504
16661 23646504 22544255 21378104 20731657 19782609 18997874 17909222 17538395 16677758 15994975
16652 15994975 15462222 15117963 14441793 13842116 13394876 12756419 12539054 12070676 11878444
16643 11878444 11387783 10981235 10824484 10273625 9672438 9544604 8953313 9264795 8676401
16634H676401l95219n3683K22694r00415o6889K4291n42144K89070m23211n6058
16624F774837j43138n12687n1908p6588J00475j10913k91324j10580q9493l34428
16614E154253k17700j70525j72570M31132l68671k34540k26555L09428k68023
16605D236229k84032P3473k3845j11677J43882l27588j36701o9855N730k41289
16595C264327J58305O0083l94366L374J18595J36870m83209K20274n4842j37142
16585B892269j83757j14473M08476j22836O235l04000j68405m2410L25301m31304
16575B265096M1848K09946m17705K26559q4375j6940N1966l21961J91281m70441
16565A675274K19478K5656P4155J3308k90617l50200O17944k57602j38188N4375
$$ plain form
16634 8676401 8281182 8227499 8450193 7549778 7482889 7507180 6965036 7254106 6830895 6774837
16624 6774837 6631699 6119012 6067104 5990516 6090991 5980078 5688754 5578174 5488681 5154253
16614 5154253 4936553 4766028 4593458 5024590 4655919 4421379 4194824 4504252 4236229
16605 4236229 3952197 4025670 4001825 3890148 4034030 3706442 3569741 3499886 3505616 3264327
16595 3264327 3422632 3482715 3088349 3091723 3210318 3347188 2863979 3084253 3029411 2892269
16585 2892269 2708512 2594039 3002515 2879679 2885914 2581914 2413509 2371099 2696400 2265096
16575 2265096 2306944 2516890 2099185 2325744 2241369 2224429 2276395 1954434 2145715 1675274
16565 1675274 1894752 1920408 1994563 2007871 1717254 1367054 1984998 1727396 1589208 1643583
16555A643583m0994J66251K6633j06634l01299o9631M08048l81394Q5447m283
16545A425727l60029J0027N0620L76050j69388J08133J5805k72369K24355p9587
16535A329344J87280m81690K58118p1730k67385K3066J84526O2025L2712P107
16525A263373j12370O7414j62827k44025L11063j63738K842J48408m17340M00635
16515A093435J81788o3101l35264K31946l95668J35690k555O9097K87389k57167
16505I45590J33014j17879k08879K4399j56021K25984R1117k55008K39485k33142
16495F88660N6901j02578J16529P1669j14896J82442j13409C88761M16265j73912
16485F31114j66273N2788L1024j42452K15642k3359j59206j11373N43658C43168
$$ plain form
16555 1643583 1602589 1768840 1795473 1688839 1387540 1317909 1725957 1344563 1430010 1425727
16545 1425727 1065698 1075725 1126345 1502395 1333007 1441140 1456945 1184576 1408931 1329344
16535 1329344 1516624 1034934 1293052 1221322 953937 977003 1161529 1223554 1256266 1263373
16525 1263373 1151003 1218417 1055590 811565 1122628 958890 961732 1110140 692800 1093435
16515 1093435 1275223 1212122 876858 1108804 713136 848826 846271 915368 1202757 945590
16505 945590 1078604 960725 751846 776245 620224 846208 937325 682317 921802 688660
16495 688660 745561 642983 759512 831181 716285 898727 785318 388761 805026 631114
16485 631114 464841 517629 548653 406201 621843 598484 439278 327905 871563 343168
16474H36809C11937K96932J93581p5201B93956J83947J42154j88874K43422k72438
16464D02167M9644L70273D07784M1527Q5622j76283J61182Q0228B32006L79298
16454F11304J20998A56955L55968L9413j37552A35737M74532j68948J44395N0278
16444F35994A30894L80391j78492N8110J76546B58301K66633k28139G6690M93358
16434E70048L3897k76835o5792j11959J7439M26231k83382p3405L63613j78067
16424D21788A76792j4819n5176O3648K59044P2645I9856K23788J34070j24041
16414C33673J65537k5725k35443L9832j26536r566P8610c4567A09152J44117K79311
16403E32580p1922K27992B72731a1014E41996A20927L8788E1832M07908A09735
$$ plain form
16474 836809 311937 608869 802450 727249 293956 477903 620057 431183 674605 402167
16464 402167 451811 822084 407784 449311 534933 358650 519832 600060 232006 611304
16454 611304 732302 156955 512923 552336 414784 135737 610269 441321 585716 635994
16444 635994 130894 511285 332793 390903 567449 258301 524934 296795 76690 570048
16434 570048 603945 327110 261318 149359 166798 593029 309647 236242 599855 421788
16424 421788 176792 161973 106797 170445 429489 502134 99856 323644 457714 333673
16414 333673 499210 473485 238042 277874 151338 141772 220382 -34567 109152 253269 532580
16403 532580 460658 688650 272731 -11014 541996 120927 159715 51832 459740 109735
16392A25688J64348p2552J22839A0748Q8547J0644J18062H9326J74288c44576
16381E84375B71446O1015G8989P2591L7808a11428M1433A64476J64485I3896k8032
16370F5864N31500B06096F4300J76174j02606F6493Q8780J33565A26934M85164
16360F12098A96477M0099A09981K78929a6246C42841j23997F8471J98185B8876
16349A86249G0326d4713C31402K1329G4499P4148J11044q158b3147A69557E9685
16337B82241b09304C13152l9760A2867K88757a5340k4134j69243A0493d9590F2627
16325a1585j5005f928A90367p0856L3299J31166o3760H3929h2A77550J1498K3085
16313B12133c0847G6174P7132J04992a16205A89584A8566f27623B71361G3638
$$ plain form
16392 125688 290036 217484 340323 10748 99295 109939 228001 89326 263614 -344576
16381 584375 271446 332461 78989 151580 189388 -111428 -69995 164476 328961 93896 65864
16370 65864 597364 206096 64300 240474 137868 66493 155273 288838 126934 612098
16360 612098 196477 236576 109981 388910 -16246 342841 218844 68471 266656 28876
16349 186249 70326 -44713 331402 352731 74499 148647 259691 251533 -23147 169557 59685
16337 282241 -209304 313152 273392 12867 301624 -15340 -39474 -208717 10493 -49590 62627
16325 -11585 -26590 -6928 190367 119511 152810 283976 220216 83929 -82 177550 189048 212133
16313 212133 -30847 76174 153306 258298 -116205 189584 18566 -627623 271361 73638
16302b2637k76939D4222L03995j05305c3802b294C23839h4470C57055d5426B29224
16290a19250H9273b42295D6080f9246j14460C57485k7820L6872F4508q102K13142
16279B69548a09016r5516i4828r6454A34495R8986j13087K0780O9676h129B10461
16267B11908g3006j553B56937a9874A46856k0774K7092a74318a9698B04605i1466
16255a82784f1088A77123g1156o3951I9611N6729a07021B37745A02559b66246
16244g3833C7205a16205C9901j7372J26608E4455a01369A69762b18382e8710R875
16233d8835B6311a02041F7480e248A88344G590M4803J9297a29471f2096b0618
16221A75910k917b935A19253e9427F9174L97053G8372O6314a5793B1770N7446
$$ plain form
16302 -22637 -299576 44222 348217 242912 -33802 -2294 323839 -84470 357055 -45426 229224
16290 -119250 89273 -242295 46080 -69246 -183706 357485 329665 366537 64508 56406 269548
16279 269548 -109016 -204532 -94828 -191282 134495 233481 120394 141174 210850 -8129 210461
16267 211908 -73006 -74559 256937 -19874 146856 126082 153174 -174318 -19698 204605 -91466
16255 -182784 -61088 177123 -71156 -135107 99611 156340 -107021 237745 102559 -266246
16244 -73833 37205 -116205 39901 22529 149137 54455 -101369 169762 -218382 -58710 -48835
16233 -48835 26311 -102041 67480 -5248 188344 7590 52393 71690 -129471 -62096 -20618
16221 175910 172993 -2935 119253 -59427 69174 466227 78372 144686 -15793 21770 79216
16210G9216a45387H5824i8650A7139J35189A9107e040r9370B6420J06818g7484
16198G7022K76216j14615c1721A55805k4669b53987a5341j97428N1856H990a62118
16186a83169B67902b80298A25546b4489B1784J70769A9176L65952i3424A93362
16175a88153L3376B72454D3833L59540A27502a05964F1808P6521n2018a13918
16164B18703H3863K0323c3943H710b29904L0072a7421A28087F101J960f894j65083
16152a71977p5472A02348a74280A79941k0111q569l9527J5971A3262j154a29017
16140h4046O566F9842K2830D1421f3580G0030R634A9261B817b65204f9872B0030
16127B85046A21355c1336P737m5794j11193A25251L0456a94038A76364J11293
$$ plain form
16210 79216 -145387 85824 -98650 17139 152328 19107 -5040 -104410 26420 133238 -77484
16198 77022 353238 238623 -31721 155805 131136 -253987 -15341 -212769 -160913 8990 -162118
16186 -183169 267902 -280298 125546 -24489 21784 192553 19176 385128 -93424 193362
16175 -188153 -154777 272454 43833 403373 127502 -105964 61808 138329 86311 -113918
16164 218703 83863 104186 -33943 8710 -229904 -199832 -17421 128087 6101 8061 -6894 -171977
16152 -171977 -247449 102348 -174280 179941 159830 151261 111734 127705 13262 12108 -129017
16140 -84046 -77480 69842 92672 41421 -63580 70030 79664 19261 2817 -265204 -69872 20030
16127 285046 121355 -31336 -23599 -69393 -180586 125251 155707 -194038 176364 287657
16117B87657B3931O9073h2960m8603E090b76731I9933M3899a2180B45366a09923
16105D2629a18849l2034N2911j12136N2749a0175o2183A02193a06972A25567E9791
16093A3966g0047n807j07789C20329j48551a98578A4219O7698b00831o6546J24449
16082a42928L8676b2530D07813d9508p9719m9093d4261l19444C5545a21671j78817
16071c00488a25672A81833a75080D5617c1971A71590e1349A02977J72432a70516
16060B8806J24086m7640g2589B0131a83337B59523a49455B1162a89829A28386
16049A93811g2210A99282M6004G2170a41827J0333K295l38715J84875J3018A66452
16037a55193r4507D5719K7769a20288l88810d1873r0279A5488c7860j47927M2891
$$ plain form
16117 287657 23931 93004 -82960 -131563 5090 -276731 99933 143832 -12180 245366 -109923
16105 42629 -118849 -150883 -97972 -210108 -157359 -10175 -72358 102193 -106972 125567 59791
16093 13966 -70047 -75854 -183643 320329 171778 -198578 14219 81917 -200831 -267377 -142928
16082 -142928 -104252 -22530 407813 -49508 -129227 -178320 -44261 -363705 35545 -121671 -300488
16071 -300488 -125672 181833 -175080 45617 -31971 171590 -51349 102977 275409 -170516
16060 28806 152892 105252 -72589 20131 -183337 259523 -149455 21162 -189829 128386
16049 193811 -72210 199282 245286 72170 -141827 -131494 -129199 -467914 -283039 -270021 166452
16037 -155193 -249700 45719 73488 -120288 -509098 -41873 -132152 15488 -37860 -185787 -142896
16026a42896a4105j26268B22864A09176e3873A86907c54751I4693g5118j18935
16016a94053e6290C1711b6D108M8693C782a34637k31487c8656l7531K29A16401
16003A47375B2483b41268Q1765a2158l196n5620C5387j3714a51102a8906B90551
15991B50613j12205E1991k4386g9590j12378j06223B6854N4847e7569A68511L2804
15980B01315G252b50541C4370a75475E566N6088C0019L66480B4674b5315A46341
15968A29976J8546A3124J80315I1234J55643f8515J0184f922k42420A8492a06650
15956A59051C4499c2579k01873B96541j46069b4055k33323A53307b0012k38165
15946b58177i6571j63239i4116o3705q521j25662M7852j79047h9351D2427J31887
$$ plain form
16026 -142896 -14105 -140373 222864 109176 -53873 186907 -354751 94693 -75118 -194053
16016 -194053 -56290 31711 -26 4108 52801 3782 -134637 -366124 -38656 -76187 -75958 116401
16003 147375 22483 -241268 -159503 -12158 -15354 -70974 35387 21673 -151102 -18906 290551
15991 250613 138408 51991 27605 -79590 -191968 -298191 26854 81701 -57569 168511 201315
15980 201315 7252 -250541 34370 -175475 5566 61654 30019 396499 24674 -25315 146341
15968 129976 148522 13124 193439 91234 246877 -68515 -58331 -6922 -249342 18492 -106650
15956 159051 34499 -32579 -234452 296541 150472 -24055 -257378 153307 -20012 -258177
15946 -258177 -96571 -259810 -94116 -157821 -166342 -292004 -244152 -423199 -89351 42427 174314
15935A74314b16899e3476E4630a36433M4061A6075a75569b4537j33152f8600k5381
15924i3981K1698k064j74249c5610l82509F4888C2048a0375j44620A42829B0382
15912a88713C8196g850B90524a75989o6625n5781C18255b37858f0684k09440g8623
15900a36368r423b2561j62007F4938i1278o4847H92f8998j15709C23197b69194
15888b86730a35903A60948p8912E433a63629f919l14234a15136B67435h1582l9919
15877a21501A21213g8934B06213d23439G9617R5870j17K8505G9034b61291A17302
15865a3999B00340c5009j7691j42538F1505c19495Q087C44862A15369N1514l5574
15854A31309h6597b2867A78442c14882J01202o486k63482H1473d7197k107k0900
$$ plain form
15935 174314 -216899 -53476 54630 -136433 -92372 16075 -175569 -24537 -157689 -68600 -93981
15924 -93981 -72283 -74347 -248596 -35610 -418119 64888 32048 -10375 -154995 142829 20382
15912 -188713 38196 -7850 290524 -175989 -242614 -298395 318255 -237858 -60684 -270124 -78623
15900 -136368 -145791 -22561 -184568 64938 -91278 -156125 892 -68998 -184707 323197 -269194
15888 -286730 -135903 160948 82036 5433 -163629 -6919 -321153 -115136 267435 -81582 -121501
15877 -121501 121213 -78934 206213 -423439 79617 175487 175370 203875 79034 -261291 117302
15865 -13999 200340 -35009 -52700 -195238 61505 -319495 -311408 344862 115369 166883 131309
15854 131309 -86597 -22867 178442 -314882 -213680 -220166 -483648 81473 -47197 -49304 -70204
15843g0204p4525O4090F404a83666q2929A42684b86182J13480A20952l0062k6051
15832F4839a43409E0319M7628b70416B63968f7380a7681A0947K11929e2160j28007
15821a80167A01587c192j0843A10136J3157d5735A37059c9261C4838b46198B37644
15809b21346n8142B30402i9590D5804M0032d5547p0753A15869N3804J7747a7069
15797A89992B4900d67953a44821A37671k244f8417n9225A14441I392b68527A59282
15785b36881C3343c9131A99264m0221c1288A37630K2461o4198I155J1118e9628
15773a94514b9460G2443B4605d0114F4461b62266F161c00977H418d4j65690B59384
15760A1561a64513F8801L782f4118r841G0626A5847b8151j04753e077q2193c6352
$$ plain form
15843 -70204 -144729 -80639 6404 -183666 -266595 142684 -286182 -172702 120952 90890 64839
15832 64839 -143409 50319 97947 -270416 263968 -67380 -17681 10947 222876 -52160 -180167
15821 -180167 101587 -3192 -14035 110136 123293 -45735 137059 -39261 34838 -246198 237644
15809 -221346 -279488 230402 -99590 45804 85836 -45547 -116300 115869 169673 187420 -17069
15797 189992 24900 -467953 -144821 137671 135427 -68417 -127642 114441 9392 -268527 159282
15785 -236881 33343 -39131 199264 159043 -31288 137630 160091 95893 9155 20273 -59628
15773 -194514 -29460 72443 24605 -40114 64461 -262266 6161 -300977 8418 -44 -165734 259384
15760 11561 -164513 68801 72583 -64118 -73959 70626 15847 -28151 -132904 -5077 -87270 -36352
15747b30211a2848k09579g2295B9237a21408A90066J88026i7922J695I5252R4761
15736A90013h9713b9630C27805j63304a64067G8069a70773B45702A14869l819
15726A11050M2215L2682a75409j83971J56636j34613g7374A26800J96897c6956
15715D3708c92742e3321q0278l3286C52860c9177E3332d529k01781B97540a74050
15703D23377B199M2825i3495H4269J1431M3222C0032b71803d242A47007g3340
15691c56684b0594k29078A85645b94288h9572j27046R9108I124b19395I6922K16121
15680C13043C2781n955a20307F1060e4367a5555C49407A11945a69597j09940h4594
15668E0308i045k08680m146B07524p5169a03858M624B20582e323E8152N0061j8272
$$ plain form
15747 -230211 -12848 -222427 -72295 29237 -121408 190066 378092 -97922 -96227 95252 190013
15736 190013 -89713 -29630 327805 164501 -164067 78069 -170773 245702 114869 111050
15726 111050 153265 185947 -175409 -359380 -202744 -337357 -77374 126800 323697 -36956
15715 43708 -392742 -53321 -133599 -166885 352860 -39177 53332 -4529 -206310 297540 -174050
15703 423377 2199 45024 -93495 84269 95700 138922 30032 -271803 -4242 147007 -73340
15691 -356684 -20594 -249672 185645 -294288 -89572 -216618 -117510 9124 -219395 96922 313043
15680 313043 32781 26826 -120307 61060 -54367 -15555 349407 111945 -169597 -279537 -84594
15668 50308 -9045 -217725 -221871 207524 132355 -103858 -99234 220582 -5323 58152 108213 89941
15656H9941k7026J26637j5211a27215a5540o6426B1112J44830C9428J26251A5843
15644d0460F1389a6817A26828B6430R0244B5717a26178M6857j04754d3157l5960
15633g9117K9581k77499A24438j5868J72836C2151a64430P917D7422a34907a534
15621a54108j09819j4605a36910M087n2578D8940a76992B64748a32264C4078d00015
15609G6277b79978a25133A61687K43763g2898A1539J21929C9332J45026a0667
15598B09547j01971a79070O840H7229J42510a23306A23996b7422j33415L4383
15588a26454A1380a44820o7047m3106j23382C490K13076H562M533K9598H3g1591
15575e8801q1377B54172e7357A96650N6240E8294B8531f9751G0395m82M0172J26094
$$ plain form
15656 89941 62915 189552 174341 -127215 -15540 -81966 21112 165942 39428 165679 15843
15644 -40460 61389 -16817 126828 26430 116674 25717 -126178 -79321 -184075 -43157 -79117
15633 -79117 -49536 -327035 124438 108570 281406 32151 -164430 -156513 47422 -134907 -1534
15621 -154108 -263927 -278532 -136910 -132823 -185401 48940 -176992 264748 -132264 34078 -400015
15609 76277 -279978 -125133 161687 405450 -72898 11539 133468 39332 184358 -10667
15598 209547 107576 -179070 -172230 87229 229739 -123306 123996 -27422 -160837 -126454
15588 -126454 11380 -144820 -211867 -254973 -378355 3490 216566 8562 13095 42693 83 -71591
15575 -58801 -140178 254172 -57357 196650 252890 58294 28531 -69751 70395 69913 110085 236179
15563B36179a1463k30659f0832m20019a2112F4749L16538A5133b23889a02915
15552a80132A15088D8174E638M812f3305o6686B32044a4172A52145n0401j8772
15541H2972d3125r6939f9223j24894E6717j7362K9715a03399C09645I6770O7319
15530A64089A7771a59756A7702K86561o284a41818B15209a77234m6252B38869
15519h6724A19864C6234n83J03627e6813A85787q1593f4288k75739A29255m1440
15508H7815b60359c4590j45977b0905k82716i7728j35040p614F8833j1108a20270
15496A83523p2816k758a8855r0175j67107C35484b49796R2155E28d9774b0284
15484d11851C975N7809b18363b4837D306Q9302K0808j082j7093a75276A78933
$$ plain form
15563 236179 -11463 -242122 -60832 -480851 -12112 64749 381287 15133 -223889 -102915
15552 -180132 115088 48174 5638 10450 -63305 -129991 232044 -14172 152145 101744 82972
15541 82972 -43125 -140064 -69223 -194117 56717 39355 69070 -103399 309645 96770 164089
15530 164089 17771 -159756 17702 304263 297979 -141818 215209 -177234 -223486 238869
15519 -86724 119864 36234 35651 139278 -56813 185787 104194 -64288 -340027 129255 87815
15508 87815 -260359 -34590 -180567 -20905 -303621 -97728 -232768 -240382 68833 57725 -120270
15496 183523 110707 107949 -18855 -109030 -276137 335484 -249796 -157641 528 -49774 -20284
15484 -411851 3975 61784 -218363 -24837 4306 93608 114416 113334 96241 -175276 178933
15472a79157D9539J16696e0374k7506k0227j22492C18544d2241D967J85814A0354
15460A94363d2877E158N3021h2700K3145J7438A9574b7391A7049J3023c16441
15448H6282b55119A92281k1180a7661j68527C08308b64836f5071l6707K8170B286
15436E2788B2801p943Q6725l4628l375a17647A4079a37401B13275D3682J27583
15425A71265q5469J13922D9491J20723n9243a49022j70315B68406o6480a55882
15414a46942b7409l9443r4739A14903P5016b2882B20907i3781C53940c5436C84020
15402D8075N8323K5494b71410C46596a6871k12495A70411a46307d3341B23614
15391a12256n5062k6259A37025a85659B42801E4226f0425C34103c88820b3004
$$ plain form
15472 -179157 49539 166235 -50374 -77880 -98107 -220599 318544 -42241 4967 190781 10354
15460 194363 -42877 5158 58179 -82700 -59555 -42117 19574 -27391 17049 30072 -316441
15448 86282 -255119 192281 171101 -17661 -186188 308308 -264836 -65071 -101778 -73608 2286
15436 52788 22801 14858 101583 66955 63580 -117647 14079 -137401 213275 43682 171265
15425 171265 85796 199718 49491 170214 110971 -149022 -319337 268406 201926 -155882
15414 -146942 -27409 -66852 -161591 114903 189919 -22882 220907 -93781 353940 -35436 384020
15402 48075 106398 131892 -271410 346596 -16871 -229366 170411 -146307 -43341 223614
15391 -112256 -167318 -193577 137025 -185659 242801 54226 -60425 334103 -388820 -23004
15380C15837f6613A55935Q3518D7613J40308F5103a79878C5648K20480a8677j27450
15369a46127n1381I6373J63645A24807i1742p8011j98073A50272a47290B78304
15358b44505g67q4150A45906b69570G8067g104k55670A67842G7391A5492J8813
15347C4305d0511J6670j38469d0700A60739D4035K0680A7061a3374B36932a04936
15335G6648N2870c8125E18615e102A93816J25303o8405a23761B26842J65052j44835
15324B47059H8274b8943C85879r7997j27063c888n1088k26268P7036C71391o804
15313C64587J9411H8056K03543h8500D3346N8740R195C8327N888H348Q5489h1088
15300A18615K9260a49614E0430a93796A16021D5588b89946J32342O6588I4322
$$ plain form
15380 315837 -66613 155935 239453 47613 187921 65103 -179878 35648 256128 -18677 -146127
15369 -146127 -197508 96373 260018 124807 -91742 -169753 -367826 150272 -147290 278304
15358 -244505 -767 -84917 145906 -269570 78067 -7104 -262774 167842 77391 15492 34305
15347 34305 -40511 -23841 -162310 -40700 160739 44035 64715 17061 -13374 236932 -104936
15335 76648 129518 -38125 518615 -5102 193816 319119 250714 -123761 226842 391894 247059
15324 247059 88274 -28943 385879 287882 160819 -3888 -54976 -281244 -204208 371391 364587
15313 364587 383998 88056 291599 -88500 43346 102086 111281 38327 44215 8348 93837 -81088
15300 118615 147875 -149614 50430 -193796 116021 45588 -289946 -157604 -91016 94322
15289B45711n1356D7606K22851A34731L00216g9004I2202C162L64467n1355d6646
15277a19659r5682M0993g5849B84274b7853m6563A32195h5047E9293J51917F6062
15265B15533K67685H4532C7582P6946K5439P6290e5168A42418n483J3697M2805
15254A93437q7725b81843L1259o014F9259M2003b82541B28074D6370M4313L04784
15243C95467a02903q9521A57085N5668m1501K29262A3683M44065B03609K95309
15233D98918O75677l58320K69166m61578j29412k07658J45636B11968K35361j6280
15223D31049A43978b31762b9836F4317N5444e5888h357k08131d5535Q676B45306
15211C2584e3718p0484B42763l0885a88442A78863J61495b09180A47065E7444
$$ plain form
15289 245711 194355 47606 270457 134731 434947 -79004 92202 3162 367629 316274 -46646
15277 -119659 -215341 -174348 -75849 284274 -27853 -74416 132195 -85047 59293 211210 66062
15265 215533 483218 84532 37582 114528 139967 216257 -55168 142418 136935 150632 193437
15254 193437 105712 -281843 -250584 -256598 69259 111262 -282541 228074 46370 90683 395467
15243 395467 -102903 -192424 157085 212753 171252 400514 13683 457748 203609 498918
15233 498918 1174595 816275 1085441 623863 494451 286793 432429 211968 447329 431049
15223 431049 143978 -231762 -29836 64317 119761 -55888 -8357 -216488 -45535 -36859 245306
15211 32584 -53718 -124202 242763 211878 -188442 178863 340358 -209180 147065 57444
15200e2450J8214I3564m0984a9219M581B74210b55819J03441c1747D4918Q2935
15189A27853f8076A93868J42672G6806J43241E1322a42330O932B43044J0083F1156
15177B66902J50468g4418B79363g1017a947A21627a02086A2166b2470q6743j43786
15166b52999A22894B9199a69219B72K44652A13773P8562K61976A28358a41154
15155A78725q8692b35595r9239a30807B14020G6800K96546j60896j00380P9613
15145A91683r2945a07278h144A34902a31935D47930e7475D7108a49476j6791B46559
15133E6353K10226K49524f4336n0970k31928A0444N3335M0773N3019R1940Q9897
15122C39408D3916J27897K9358L01814a29989A49199K10976j69145C0749a83440
$$ plain form
15200 -52450 -34236 93564 52580 -19219 -14638 274210 -255819 -152378 -31747 44918 127853
15189 127853 -68076 193868 336540 76806 220047 51322 -142330 -135398 243044 253127 61156
15177 266902 417370 -74418 279363 -71017 -1947 121627 -102086 12166 -22470 -109213 -252999
15166 -252999 122894 29199 -169219 272 244924 113773 192335 454311 128358 -141154
15155 178725 90033 -235595 -334834 -130807 214020 76800 373346 212450 112070 191683
15145 191683 98738 -107278 -8144 134902 -131935 447930 -57475 47108 -149476 -166267 246559
15133 56353 266579 516103 -64336 -115306 -347234 10444 63779 104552 157571 249511 339408
15122 339408 43916 171813 201171 502985 -129989 149199 360175 191030 30749 -183440
15111B08002q2949J48290f4047C47163j31472h6916D20101E5414e1358M445B19166
15099A42826m158a5340D6278K12939F7256I967D180L71804a08940B26560r4786
15088A31774d6015B0764L22669j48188B197J33455a297r7215E5333K31311C0511
15076B04320Q5477l3989q8387A4026K69429p2580l2955p3271l0390L17641E008
15064A85077l8771J00315a17189L6679D64772q9155j17080k3483N7515i4110B1267
15052B64849K4784A06939g9344c0299A07107C0861K10554b47683B36979q3158
15042A53821P3676K75418A55311J4503a80436C79037b6413B1081d3948B25959
15031C16037l9937r1877L17739j14479A52891D8025J66389g473C18770A13159
$$ plain form
15111 208002 125053 273343 -64047 347163 215691 -86916 420101 55414 -51358 -46913 219166
15099 142826 138668 -15340 46278 259217 67256 9967 4180 375984 -108940 226560 131774
15088 131774 -46015 20764 343433 195245 2197 135652 -1297 -98512 55333 286644 30511
15076 204320 289797 255808 167421 14026 283455 210875 177920 104649 74259 391900 5008
15064 185077 146306 246621 -117189 -80510 464772 375617 258537 235054 292569 -94110 21267
15052 264849 289633 106939 -79344 -30299 107107 30861 241415 -247683 236979 153821
15042 153821 227497 502915 155311 169814 -180436 379037 -26413 21081 -43948 225959
15031 316037 276100 184223 501962 387483 152891 48025 214414 -7473 318770 113159
15020B00964K83956j02188R2087j41994P4907L9530I7893J66107O0845A57996
15009A66958J33862m8597f0562H4688M40095A77131E4859L11748j5357H0524L57306
14998D37830p2243j7339c9353D31715B04881J35109D2827L32485j01246K28185
14988E02251A18626J3468P9859J01828A02086H003K49053R7101a5474B8064L93030
14977D21094C3468K85226J58245A38095K12296k1003C9007L37672J4346A77514
14966G8619L01961A45542J74976n3290J59114j5947G2053K34229A26741N252K96833
14955D28826b06103B03580L24536C3529L09472D3151L39307J09115j27382p9206
14945B84985m224n4446R0935A52639K61228A70258L62848k24170H3774J81516
$$ plain form
15020 200964 484920 382732 474819 332825 407732 447262 97893 264000 324845 157996
15009 166958 300820 252223 -60562 84688 524783 177131 54859 366607 351250 80524 437830
14998 437830 365587 348248 -39353 431715 204881 339990 42827 375312 274066 502251
14988 502251 118626 132094 211953 313781 102086 8003 257056 354157 -15474 28064 421094
14977 421094 33468 318694 476939 138095 350391 329388 39007 376679 391025 177514
14966 78619 380580 145542 320518 267228 426342 410395 72053 306282 126741 131993 428826
14955 428826 -206103 203580 528116 33529 343001 43151 382458 491573 364191 284985
14945 284985 280761 226315 317250 152639 413867 170258 533106 308936 83774 265290
14935B65290j25314M04415k57587G7964J92413K5430J29583j8249j31525M7616
14925C23232A58817R741o6778R6537K1641n9538J24637n6787p6631J48320E8338
14913A04993N5383N7091K17756j49678l971A09147L12302m3329A88296J60560
14903C48856A52098J77200G2141O6503h0784D90936H0640J43450H2123R996a51478
14891B85773M5622A45385K11643n9712P664O1865K9109j10121L17000k44198M2434
14880D01069j26374Q7572R031R4737q6969A05650L25035j58892Q7230L0254M62043
14869H51320B25142K00720j1437n5760L22281k12818r1155p8916m964R794k6071
14858B76816p6540K30130q652N9804A04569L15290J49080n6618M1696m3707J20716
$$ plain form
14935 265290 139976 544391 286804 77964 270377 295807 425390 407141 275616 323232
14925 323232 158817 168558 101780 198317 219958 160420 285057 228270 151639 299959 58338
14913 104993 160376 217467 435223 285545 281574 109147 421449 378120 188296 348856
14903 348856 152098 329298 72141 138644 -80784 490936 80640 224090 82123 92119 -151478
14891 285773 331395 145385 357028 297316 304980 366845 395954 285833 602833 358635 401069
14880 401069 274695 362267 371298 466035 379066 105650 430685 271793 359023 389277 851320
14869 851320 225142 425862 414425 358665 680946 468128 376973 298057 293093 302887 276816
14858 276816 200276 430406 421754 481558 104569 419859 568939 512321 554017 510310 631026
14847F31026k95152J19728j06880J95638j80322P4724A24288M53905B35768M4373
14837B80141J67830R8805p2630K16781B74211j970L83269k95048P9554j00290
14827C39726j08579L76623q3155k01846K94958g153C57800m5620M46291k42335
14817E16136n2671J98895r1835q6991k03542L76455k83957J67721j03581L56982
14807G93612j93964A63569K49794j27773N10045j37616k97014p9884J11720k3180
14797C69661m0457M40771l36500j17067J73264L91780P2167k29819k55587J15947
14787E84160J14325K87657D84596J21069R7437j61754J30876m4435J12856l42804
14777C97841j95781P38759m10734k03616K67075J62566j68551j31265k8250L73410
$$ plain form
14847 631026 335874 455602 348722 544360 364038 438762 124288 578193 235768 280141
14837 280141 447971 546776 474146 690927 274211 272241 655510 360462 440016 339726
14827 339726 231147 607770 524615 322769 617727 -7153 357800 312180 758471 516136
14817 516136 463465 662360 570525 483534 279992 656447 372490 540211 436630 793612
14807 793612 599648 163569 413363 285590 795635 658019 361005 281121 392841 369661
14797 369661 329204 769975 433475 316408 489672 881452 953619 723800 468213 584160
14787 584160 698485 986142 484596 605665 703102 541348 672224 627789 740645 397841
14777 397841 202060 940819 530085 326469 593544 756110 587559 456294 428044 801454
14767H01454j14368q9001k10113J11312A88378O99725C18000J98126J82363j28914
14757E69575j60901K74073P4663k61260J17620K81041j45036K71559m96427L14817
14747H39724k43494K36498j75301C27452O15708j46822j15672N3889k61054J71320
14737F44821k2639J04614j54554J78963j1219R6599k73988P519j78171L12736
14727G04681q2884N8524K17000l16713N4538R6977J1301j89060P1671M05633l44579
14716F87089J80090k57264K56836R1054j77756J47325k32187P0694k46403M29273
14706I48751m51367N88479k47789p5022j5714O1516L77794l26515k1590K15310
14696A053853j74830Q1274l04278K93670j77037J35189k80732K27188k35686J87049
$$ plain form
14767 801454 687086 598085 387972 499284 188378 888103 318000 516126 698489 569575
14757 569575 408674 682747 757410 496150 613770 894811 749775 1021334 524907 839724
14747 839724 596230 832728 657427 327452 943160 796338 680666 734555 473501 644821
14737 644821 622182 726796 572242 751205 739986 836585 562597 570116 391945 704681
14727 704681 621797 680321 897321 580608 635146 732123 743424 554364 626035 1031668 687089
14716 687089 867179 609915 866751 957805 780049 927374 695187 765881 519478 948751
14706 948751 497384 1085863 838074 763052 747338 808854 1186648 860133 838543 1053853
14696 1053853 879023 960297 656019 949689 772652 907841 627109 854297 618611 805660
14686H05660o2550J20213J20253Q5416o1815o5868o8345l5222J04200N9228j63312
14675H37858K16329l0189o4941j43797J3703l09149N58045o6151r7513L8662Q3874
14664A036731K41244k86687O6523J98063q063o6803O5660k91726L59113m8134
14654A265921n06670L95679J75617P650j23284K7392j49240N6769m2964j1967
14644A094903L1603j46832j44403p6576L04739j11504L19934O0352l3937Q4078
14634A382357P4343j25770R7434l02617R2301R9661j92753J82804p2135R8767
14624A334392n9006J60222j88803R8067R7013k9805r0991J17152J02548j20020
14614A420769O4106n2850J04786q5196k27494L06451k48168P9615L967J29043
$$ plain form
14686 805660 743110 863323 983576 1068992 1007177 941309 872964 837742 941942 1001170 837858
14675 837858 1054187 1023998 959057 815260 828963 519814 1077859 1011708 914195 952857 1036731
14664 1036731 1277975 991288 1057811 1255874 1247811 1181008 1246668 954942 1314055 1265921
14654 1265921 759251 1154930 1330547 1338197 1214913 1242305 1093065 1149834 1106870 1094903
14644 1094903 1126506 979674 835271 758695 1063434 951930 1271864 1332216 1298279 1382357
14634 1382357 1456700 1330930 1428364 1125747 1218048 1317709 1124956 1307760 1235625 1334392
14624 1334392 1275386 1435608 1246805 1344872 1441885 1412080 1321089 1438241 1540789 1420769
14614 1420769 1484875 1432025 1536811 1451615 1224121 1530572 1282404 1362019 1365986 1495029
14604A495029j64019N4746J82297J92365j33634k73136N15056j60324k84198J98611
14594A622793j2518m16920Q54890j77665j10934K53758k60501k75971J4243M49881
14584A941056j57108l8109l4486j30006N73322o77996J35390n2607K52925L22816
14574B135197L9751k72166J53157j31540k05104K27128o6092M3663R1502Q1442
14564B096938K69188l37085R9408K02577l880l12451K20901K52388l10930o3964
14554B113090L86379l84149O13819o8881k9267N8294M0618n0027K95086K42748
14544C217710k7663J31647J59445K06181J94500L15833M72054M38852J492179
14535F600738R10303L124436M290235O249414J1240343n66350j3143433p723532
$$ plain form
14604 1495029 1331010 1385756 1568053 1760418 1626784 1353648 1868704 1708380 1424182 1622793
14594 1622793 1610275 1193355 2048245 1870580 1759646 2013404 1752903 1476932 1491175 1941056
14584 1941056 1783948 1745839 1711353 1581347 2154669 1476673 1612063 1559456 1812381 2135197
14574 2135197 2174948 1902782 2055939 1924399 1719295 1946423 1880331 1923994 2015496 2096938
14564 2096938 2366126 2029041 2128449 2331026 2327146 2014695 2235596 2487984 2177054 2113090
14554 2113090 2499469 2115320 2729139 2660258 2630991 2689285 2729903 2679876 2974962 3217710
14544 3217710 3190047 3321694 3481139 3687320 3881820 4197653 4669707 5108559 6600738
14535 6600738 7511041 10635477 14925712 21175126 32415469 31849119 18705686 10982154
14527A0982154m034541j596427j266520n23779j4601m04106k00839j63748k06790
14518B570803J44709l34696J08664K4157Q3778k03555L24544j99700j06185M23467
14508B835986R8432j51453k23039j41219M43881j24340k12932J12027M65467l70662
14498B732148K75923k63744J94382q4467J45305q8551J91089o5708j34346M13485
14488C315516K00133n86738J28457M04160k12681K64133N5758k39986O175R6988
14478C431915L3634J8699J48101J50966j97701K52575k72644J97244K59552j03111
14468C919230J66697j24549K0703J68279J19372M7617J48126M0928j91263J46263
14458D461403l0651K02012j60675R1716j93175M18282K954j34093J90178j99692
$$ plain form
14527 10982154 6947613 5351186 4084666 3560887 3546286 3142180 2941341 2777593 2570803
14518 2570803 2715512 2380816 2489480 2513637 2597415 2393860 2718404 2518704 2412519 2835986
14508 2835986 2934418 2782965 2559926 2418707 2862588 2738248 2525316 2637343 3102810 2732148
14498 2732148 3008071 2744327 2938709 2854242 2999547 2910996 3102085 3036377 2902031 3315516
14488 3315516 3515649 2928911 3057368 3461528 3248847 3512980 3568738 3328752 3334927 3431915
14478 3431915 3465549 3484248 3632349 3783315 3585614 3838189 3565545 3762789 4022341 3919230
14468 3919230 4085927 3961378 3982081 4150360 4269732 4317349 4465475 4506403 4315140 4461403
14458 4461403 4430752 4632764 4472089 4563805 4370630 4788912 4791866 4657773 4847951 4648259
14448D648259K97877R2396M8167j5550O7754K19125O3231o1586J90530K88665
14438E838868R535j79176K9049M2426q448K99210k4224j7323O5446O7874M4400
14427F167637J12822Q29446m23494k56911M91703n32446N99083m3945L90534k45592
14417G088837j0673R3151L94274J03531l18683K22115L73763J92304l96932L87439
14407H129126J44345j8305l7426L59134J10534M853M75686L26697k02011j86545
14397I106088K43170N89480m16419K52133J05407K59764K95482k04031M80304
14388A0711378M20241m31696M77080o3920M37282K8384N14424m6784K92573n840
14378A2333122M33106Q4270N00871K49129j55593P39792k35633M46070j46894
$$ plain form
14448 4648259 4946136 5038532 5086699 5071149 5138903 5358028 5421259 5359673 5550203 5838868
14438 5838868 5848403 5669227 5698276 5740702 5732254 6031464 6007240 5989917 6055363 6123237 6167637
14427 6167637 6280459 7109905 6686411 6429500 6921203 6388757 6987840 6943895 7334429 7088837
14417 7088837 7078164 7171315 7565589 7669120 7350437 7572552 7946315 8138619 7741687 8129126
14407 8129126 8273471 8255166 8217740 8576874 8687408 8692261 9167947 9494644 9292633 9106088
14397 9106088 9349258 9938738 9522319 9774452 9879859 10139623 10435105 10231074 10711378
14388 10711378 11131619 10699923 11177003 11113083 11550365 11578749 12093173 12046389 12338962 12333122
14378 12333122 12766228 12850498 13351369 13600498 13444905 14184697 13949064 14395134 14248240
14369A4248240L52770L87092K60816M51194j97028Q28260J70957M93934J17204
14360A7113439M53604O3403L09348R08766l20772P36231L61227O39015J49277
14351B0413538R16778k47790R27239P04229J28999L57533N38667N41818N05913
14342B4786924M72888P01694O97810N90962O23178Q12568N99427O56057Q53558
14333C0795066O19478R44494N10095R08155J676138L18464Q55298J112066J313967
14324C9053221L48172J807480J034035J301239J366748J298521J175263J539272
14316D8923951J572445J416403J823370J825512J712836J905900J578998K621125
14308F3380540K077415K770649K338793K210908K521669L110634K750457L034412
$$ plain form
14369 14248240 14601010 14988102 15248918 15700112 15503084 16331344 16502301 16996235 17113439
14360 17113439 17567043 17630446 17939794 18848560 18527788 19264019 19625246 20264261 20413538
14351 20413538 21330316 21082526 22009765 22713994 22842993 23200526 23739193 24281011 24786924
14342 24786924 25259812 25961506 26659316 27250278 27873456 28686024 29285451 29941508 30795066
14333 30795066 31414544 32359038 32869133 33777288 35453426 35771890 36627188 37739254 39053221
14324 39053221 39401393 41208873 42242908 43544147 44910895 46209416 47384679 48923951
14316 48923951 50496396 51912799 53736169 55561681 57274517 59180417 60759415 63380540
14308 63380540 65457955 68228604 70567397 72778305 75299974 78410608 81161065 84195477
14300H4195477L419745L341518L942887L562247M294324L885663M520738M951194
14292A16113793M809151N391850N704819O158259O257525O832170O682227P688057
14284A65637851P852188Q512641Q814213R268305J0236390J0237189J1576788
14277B32135565J1601555J2179533J3013397J3239994J3892137J4658930J4781959
14270C25503070J4765294J5072144J4904464J4027758J3883486J2596630J1851078
14263D22603924J0482694R449205Q170334O686121M984438O90401o29232O9680
14255D62507565N72457m447232q737127q205224j0194450j1687999j3471747j1937516
14247C94398727j2506182j3051224j3288764j3614666j3659342j3319727j3895189
$$ plain form
14300 84195477 87615222 90956740 94899627 98461874 102756198 106641861 111162599 116113793
14292 116113793 120922944 126314794 132019613 138177872 144435397 151267567 157949794 165637851
14284 165637851 173490039 182002680 190816893 200085198 210321588 220558777 232135565
14277 232135565 243737120 255916653 268930050 282170044 296062181 310721111 325503070
14270 325503070 340268364 355340508 370244972 384272730 398156216 410752846 422603924
14263 422603924 433086618 442535823 450706157 457392278 462376716 463067117 462437885 462507565
14255 462507565 463080022 458632790 449895663 441690439 431495989 419807990 406336243 394398727
14247 394398727 381892545 368841321 355552557 341937891 328278549 314958822 301063633
14240C01063633j3042149j3387014j2783439j2472362j1643638j1255679j0845672
14233B15633680j0693332j0200351r837691r170638r113295q053270p752612p321358
14225A43491133o854021o219206n841359n360894m867080n053294m818250m273477
14217A00203552l591641l985711l748942l407518l476768k916120l376739k416560
14209G3283553k847624k547376j996997k216954k276019k145068j772648k046510
14201E5434357j509708j856799j436188j626597j450497j365176j593322j117382
14193D3478688j129842o90048j378016j325777j233117q19501r92737r03809o53192
14184C4352649j050550o60963j290829q57151o65103n40628p96970p35214l58081
$$ plain form
14240 301063633 288021484 274634470 261851031 249378669 237735031 226479352 215633680
14233 215633680 204940348 194739997 184902306 175731668 166618373 158565103 150812491 143491133
14225 143491133 136637112 130417906 124576547 119215653 114348573 109295279 104477029 100203552
14217 100203552 96611911 92626200 88877258 85469740 81992972 79076852 75700113 73283553
14209 73283553 70435929 67888553 65891556 63674602 61398583 59253515 57480867 55434357
14201 55434357 53924649 52067850 50631662 49005065 47554568 46189392 44596070 43478688
14193 43478688 42348846 41658798 40280782 38955005 37721888 36902387 35909650 35005841 34352649
14184 34352649 33302099 32641136 31350307 30493156 29828053 29287425 28490455 27755241 27397160
14175B7397160r19157o72213r67143j48381j32187q78143m90070n48459l14135
14166B2327272p20496m98111l01584m73123n81681l34805k43488m88253k50358
14157A8435373k69225o48589p2261o65352l48003q2054k22244m96481k74650N6768
14147A5413282m85340k60317k61935l89237j67167l85473k16718j60362k26398
14138A2860335k69800k21747K67372m16758K0031n78662p5632r0905N9128j89826
14128A1363536n53265O9917j16879k32167n54546K97736l29746k50420N0372j18863
14118I625675l57292l4862j39904Q6418k13756m10683P8845j71510m56325L26552
14108H333158l02302o6170Q5616r7449j22876k63979j07335J89546q8285k37016
$$ plain form
14175 27397160 26478003 25805790 24838647 24690266 24558079 23679936 23189866 22641407 22327272
14166 22327272 21606776 21108665 20807081 20333958 19752277 19417472 19173984 18685731 18435373
14157 18435373 18166148 17517559 17445298 16779946 16431943 16349889 16127645 15631164 15356514 15413282
14147 15413282 14927942 14667625 14405690 14016453 13849286 13463813 13247095 13086733 12860335
14138 12860335 12590535 12368788 12636160 12219402 12239433 11660771 11585139 11494234 11553362 11363536
14128 11363536 10810271 10880188 10763309 10531142 9976596 10274332 9944586 9694166 9744538 9625675
14118 9625675 9268383 9233521 9093617 9180035 8966279 8555596 8634441 8462931 8006606 8333158
14108 8333158 8030856 7964686 8050302 7952853 7829977 7565998 7458663 7648209 7559924 7322908
14098G322908l66026M78270n30490j81491l24878M84729k69792n3626J20905k32944
14088F447565j29962j40653M12949n98690L37582k84604k39439k93766L52211
14079E863193l91490K93063l99459K29382l92685K74975j24642n2385r1116J32370
14069E341206j32218J56171k89790l48042L28778o85396O76887m42517K45855
14060D850934k30447j30792l8594p1402R4311j30676N6215j69049J41716o1835
14050D310381j10114m451p7027j202q9237J18781j14201J54334M3086n3677R4966
14039D271639m84648q9589p4037J31831K1822l64886K00986k7536J21117l27971
14029C378728J38277m39144J52372o5204L61518m68654N6047K21939M0677j126
$$ plain form
14098 7322908 6956882 7435152 6904662 6723171 6398293 6883022 6613230 6559604 6680509 6447565
14088 6447565 6317603 6176950 6589899 5991209 6328791 6044187 5804748 5510982 5863193
14079 5863193 5471703 5764766 5365307 5594689 5202004 5476979 5352337 5299952 5208836 5341206
14069 5341206 5208988 5365159 5075369 4727327 5056105 4370709 5047596 4605079 4850934
14060 4850934 4620487 4489695 4451101 4379699 4474010 4343334 4399549 4230500 4372216 4310381
14050 4310381 4200267 4195816 4118789 4117587 4028350 4147131 4032930 4187264 4230350 4176673 4271639
14039 4271639 3786991 3697402 3623365 3755196 3777018 3412132 3613118 3585582 3706699 3378728
14029 3378728 3517005 3077861 3230233 3165029 3526547 3057893 3113940 3335879 3376556 3375430
14019C375430l48432J20585l30278J13995Q4039n608K20951k06044j5357l16182
14009B693099P5216J52159j05763k18239J77650K5867P364j87m4214m00605K13037
13998B575384j0891j71893L0883k51546J44000J99225k38988K84422j14081k10001
13988B236514L02663m83094L70489J55556l98524L10718j59483n5363L74495J05137
13978B759108L66845J02342M76616Q09855K159489L506192N955232J1547433M618555
13969C2301667j1273582p306906l937986k431250j132084p34583q77846n77444
13961D029986m84612l58453O1921j09464j09965j56619k66864J15552m37950R7897
13951B381429j45092L55986j62567k5872O1184n71144L81956P6850J7561l14673
$$ plain form
14019 3375430 3026998 3147583 2817305 2931300 3015339 3009731 3230682 3024638 3009281 2693099
14009 2693099 2768315 2920474 2814711 2596472 2774122 2799989 2807353 2807166 2762952 2362347 2575384
13998 2575384 2564493 2392600 2423483 2171937 2315937 2515162 2276174 2560596 2446515 2236514
13988 2236514 2539177 2056083 2426572 2582128 2183604 2494322 2334839 2279476 2653971 2759108
13978 2759108 3125953 3228295 3704911 4514766 6674255 10180447 16135679 27683112 32301667
13969 32301667 21028085 13721179 9783193 7351943 6219859 5485276 4607430 4029986
13961 4029986 3545374 3186921 3248842 3139378 3029413 2872794 2605930 2721482 2283532 2381429
13951 2381429 2236337 2592323 2429756 2403884 2465068 1893924 2275880 2352730 2370291 2055618
13941B055618M55J0627O2907j48988j00997m2963j45018M70636J77402n07808
13931A831871K22244l69857m2861J11231J48842O1089l27116L83612o5478J35668
13921B089245l17601K87113l89282O9696m45457L37803K18889m39366M62361j37993
13911A735408j9165m21649M55966j93197J73149l46621K59653L3035R5675m43510
13901A328744J32785K04893R767O8305k56598K25592K5940k78987j39265Q6766
13891A407942J11701j65242k67763N12185j73149L06196m87959K79375j22413
13882A400873L44229k28748p4880J55075n21726L81393l48603P8731M11198l94868
13872A202674L65607j79148l19305J08495J38537j78796R0105k3261J50612m9345
$$ plain form
13941 2055618 2056073 2066700 2129607 1980619 1879622 1836659 1691641 2162277 2339679 1831871
13931 1831871 2054115 1684258 1641397 1752628 1901470 1962559 1635443 2019055 1953577 2089245
13921 2089245 1771644 2058757 1669475 1739171 1293714 1631517 1850406 1411040 1873401 1735408
13911 1735408 1716243 1294594 1750560 1557363 1730512 1383891 1643544 1676579 1772254 1328744
13901 1328744 1461529 1666422 1676189 1744494 1487896 1713488 1739428 1460441 1321176 1407942
13891 1407942 1519643 1354401 1086638 1598823 1425674 1731870 1243911 1523286 1400873
13882 1400873 1745102 1516354 1441474 1596549 1074823 1456216 1107613 1186344 1597542 1202674
13872 1202674 1568281 1389133 1069828 1178323 1316860 1138064 1228169 1204908 1355520 1306175
13862A306175N7417l10671K41694j31750J3841k39750K64337k54036j5580N36968
13852A468645n67985K85771M21778m79194m6260K26914k61562J89007n0447k27625
13842I59042Q212K01256j51131K13848k63119K14341J41642l29485J4798r8473
13832I10931j38014L06081L8022k22043Q7893K03933J05644m40339j15550K59036
13822I95594R5176k47561J24867l7304o734N3769k14164J58745J13788k12523
13812H23653j8181J6091r9807J71315q5927J24629M6112n1270J24772m11264R1239
13801G31362q5816J16342J17268R7778M939r4952K64751l36408L66050k41226
13791I40088k49517J88756k8349j94660p1384J90091p7826o9472L5180M9533J19193
$$ plain form
13862 1306175 1363592 1052921 1294615 1162865 1176706 936956 1201293 947257 931677 1468645
13852 1468645 900660 1186431 1608209 1129015 1082755 1309669 1048107 1237114 1186667 959042
13842 959042 967254 1168510 1017379 1231227 968108 1182449 1324091 994606 1009404 910931
13832 910931 772917 1078998 1117020 894977 982870 1186803 1292447 852108 736558 995594
13822 995594 1090770 843209 968076 930772 924038 977807 763643 922388 1036176 823653
13812 823653 805472 821563 721756 893071 807144 931773 977885 926615 1051387 640123 731362
13801 731362 645546 761888 879156 976934 981873 886921 1151672 815264 1181314 940088
13791 940088 690571 879327 850978 656318 584934 775025 697199 627727 662907 712440 831633
13780H31633P5467L0560k69388j56975L85206k83536R8985j35634L09364j11023
13770G74659k5263J56443K0541k24227k22671M81882k2242k49273R5770R6549
13760H82168O1707j35025l25640O60041m31336O887l09887M60696r1012k44577
13750E34022J01159n0659L89650j77983L6202J80626m94749L7331J18988J15796
13740G90383k23646J24216k00294J14253R9253k2834P966J4791j32128J54710
13730G26670l08110J58372K97850k04650C28541K45754J9330j17000J49345j41802
13720D84168n430L60853k49061k471Q6841J68560n787l50172J27509J24680n5918
13709F83772B70413M14303l15182N20713j18231j92887l1862K0181O0783J32570
$$ plain form
13780 831633 907100 937660 668272 511297 896503 612967 711952 576318 885682 774659
13770 774659 749396 905839 926380 702153 479482 961364 939122 689849 785619 882168
13760 882168 943875 808850 483210 1143251 711915 718802 408915 869611 778599 534022
13750 534022 635181 584522 974172 796189 832391 1013017 518268 555599 674587 790383
13740 790383 566737 690953 490659 604912 704165 681331 689297 704088 571960 726670
13730 726670 418560 576932 874782 670132 328541 574295 593625 476625 625970 484168
13720 484168 478738 839591 590530 588059 674900 843460 837673 487501 615010 739690 683772
13709 683772 270413 684716 369534 890247 772016 579129 547267 567448 628231 760801
13699G60801C70910L67134j95715j56019M37347j59793C31910K84725j7563l1579
13689E67493o031j21674J87988J5176J79922j90931j86400P8399j3481B46389
13678E69263j35261n1688L66965k01714r4838J72081q2014J33103m5899k11280
13668D18718J96589B96771J34730J30555J27197k42308j10116J08258j79320N9831
13658C25598K37538k949j39028M1752K55671C27650J47061M7011p499N5586j16352
13647D53457J02745J42368m2993k07438L60234j37233J3821k81277L36958j59270
13637E81372j18515J4777A77517K66725A34798L26344J23853B32834J17194P3956
13627D23984J74464j60531J53630k3114p8489l8798J73101k28041Q3954L36258
$$ plain form
13699 760801 370910 738044 542329 386310 823657 663864 331910 616635 599072 567493
13689 567493 561462 439788 627776 642952 822874 631943 445543 523942 510461 246389
13678 569263 434002 382314 749279 547565 452727 624808 542794 675897 629998 418718
13668 418718 615307 296771 431501 562056 689253 446945 336829 445087 265767 325598
13658 325598 563136 560187 421159 462911 718582 327650 474711 521722 514223 569809 453457
13647 453457 556202 698570 655577 448139 808373 671140 684961 403684 740642 581372
13637 581372 462857 477634 177517 444242 134798 461142 584995 232834 350028 423984
13627 423984 598448 437917 591547 568433 489944 451146 624247 396206 480160 816418
13617H16418C85895O0738k03115P41344B03557J32510o3159j33589k7456K87697
13607C99560k0144o5784L0922N4914n3534J43085O3693j25913j46014j26824N76456
13596G30417l24595j0147K03221j58399J52062j66690p8977A36974K07230L22829
13586F67033A10975J74693N7095J35970J7504j71244l8392E2888K59271J54256
13576D66415o2559j49769L49116A17885R9053N7930J5653q4250J35362J41195
13566D82828f0856A06470J00159J02001M9112q8997J36276K20103B56741N11621
13556G68362k89229H6772J61638J01653l129I7256K67821J08307A42727J89810
13546C32537j7405J67916B28942K6181Q8673E6075N12649B46213D0141d011A46968
$$ plain form
13617 816418 385895 446633 243518 984862 203557 336067 272908 139319 111863 399560
13607 399560 379416 313632 344554 399468 345934 489019 552712 426799 280785 153961 730417
13596 730417 405822 395675 598896 440497 592559 425869 346892 136974 344204 667033
13586 667033 110975 285668 342763 478733 496237 324993 286601 52888 312159 466415
13576 466415 403856 254087 603203 117885 216938 274868 290521 206271 341633 482828
13566 482828 -60856 106470 206629 308630 357742 268745 405021 625124 256741 768362
13556 768362 479133 86772 248410 350063 346934 97256 365077 473384 142727 332537
13546 332537 315132 483048 228942 255123 343796 56075 568724 246213 40141 -4011 146968
13534B83438J76709j93194E8030N24870I9915L30730j21596A36302J48939G4382
13523I5017K18694Q2684L9271H5489L12357j46748J2251j07087K67820A60175
13512B98914A04649K13676J33911o3519J67358j46237k7385J47288j96074j32131
13502B01536J85435k1405a49576E02339j55933l574j60952G7521J74974K48284
13492E00779l1483a5835A86600p9383M35303k19059r3065Q520J69864j79985J12463
13481C41258L66697B98907H9701M87900j54587n2325J17758k07462o5268I8170
13470B08840J03892L3593K9482J87269k07308J49165B00047d7205A05830K07322
13460C13152q6977N0920A12870c5907C98187a91817C26174j887p3942J56094b8839
$$ plain form
13534 283438 460147 266953 58030 582900 99915 430645 309049 136302 285241 74382
13523 95017 313711 396395 435666 85489 397846 251098 263349 156262 424082 160175
13512 298914 104649 318325 452236 388717 556075 409838 382453 529741 333667 201536
13502 201536 386971 365566 -149576 502339 346406 342832 181880 77521 252495 500779
13492 500779 469296 -15835 186600 107217 542520 323461 230396 238916 408780 228795 341258
13481 341258 707955 298907 89701 577601 423014 370689 488447 280985 215717 98170
13470 208840 312732 346325 375807 563076 355768 504933 200047 -47205 105830 313152
13460 313152 226175 277095 112870 -35907 398187 -191817 326174 324287 250345 406439 -28839
13448d1818E01274G7387j4357M7523J56327P045G3660O8686A3735J07076D3064
13436C24585A11300L21062j67939A15295P2442a18750D2859L44124m2937P21j70790
13425A73977m0030D1896M69434A72473N5438l9701K5644J48666j6548j01390J48024
13414C92606j34380A23639J59052J00623A62597l7740M19771H0639M02488A36913
13403B10973l6451a0128j84378I0551J82698K0410A43311J0590R5119j07811M7131
13392A88340A3284J96060n6298L31325j25630q9886E7814L23764j02514o2556
13382B16508p1616Q26g1242A85541C6223e0845C40369R4725j20485A51589J20552
13371B72141H6309A9037J21660O8645k9397A027e6432A72520c02133J13782A81857
$$ plain form
13448 -41818 501274 77387 63030 110553 266880 273925 73660 142346 13735 120811 43064
13436 324585 111300 432362 264423 115295 187737 -118750 42859 386983 344046 344767 173977
13425 173977 133947 41896 511330 172473 227911 188210 213854 362520 345972 244582 392606
13414 392606 258226 123639 282691 383314 162597 124857 544628 80639 483127 136913
13403 210973 174522 -10128 -194506 90551 273249 293659 143311 153901 249020 141209 188340
13392 188340 13284 209344 153046 484371 358741 268855 57814 381578 279064 216508
13382 216508 144892 145718 -71242 185541 36223 -50845 340369 435094 314609 151589 272141
13371 272141 86309 19037 140697 209342 179945 1027 -56432 172520 -302133 -188351 181857
13359B44926d4894H6778O34505B97743Q7306j52941p0581k2576J61158F3425L21726
13348C85151d2042C69292F2284d0077I9432D052K29222b5605B0253J44919a71363
13336H4534L42191F6811K95308A58198K78917k17193M53227M126j17058B17029
13325B95182I9177O15703A32627J96806f8731D54905A24012a7056A53140J37684
13315B90824B9025L9787J89399g5928C42325B8579O6717B6770M02495k8158j57666
13304B43441J32844j00623L79219A54110c5600D93069k3418B15895J4563j13736
13294A16722b3608D12171L4361F8777L12426j12990b6598B93848I8436g5689A39604
13282C92944A1422K64389H6574g5129B45757I3759K54N7638b84288B45677O7137
$$ plain form
13359 244926 -44894 86778 721283 297743 385049 232108 161527 138951 300109 63425 385151
13348 385151 -42042 369292 62284 -40077 99432 4052 233274 -25605 20253 165172 -171363
13336 84534 426725 66811 362119 158198 437115 219922 673149 677275 560217 217029
13325 295182 99177 714880 132627 329433 -68731 454905 124012 -17056 153140 290824
13315 290824 29025 68812 258211 -75928 342325 28579 95296 26770 429265 401107 243441
13304 243441 376285 275662 654881 154110 -35600 493069 469651 215895 230458 116722
13294 116722 -23608 412171 446532 68777 381203 268213 -26598 293848 98436 -75689 139604
13282 392944 11422 275811 86574 -75129 245757 93759 94013 151651 -284288 245677 312814
13271C12814a50205E04464b2467A71513a72091B51195A10144g7460A71444F2853
13260B00860J45854k2965f5679B22791a19082C12441P7180A47608J1544k5521
13250A33631O0665K32966j95581a2376E9592K39881C4468b3015I7071M1920E7121
13238D8845J80787I1141C8212L31250A30757n6998L22514j72901I9049P53R5672
13227A95474a83768B47538K93831G9027L5985j4611F589L6954K71717B5313K45248
13216B70561h6237A97922r3676l2485J43240q5321E446R7114D168J90399B1492
13204H8185P2079b24261A54786L2221c08504C93450A86699k7426a33898B95375
13193d0314J4970A97403N7832D3742K55581I0550b6034j68809D34194h3077B15490
$$ plain form
13271 312814 -150205 504464 -22467 171513 -172091 251195 110144 -77460 171444 62853
13260 200860 346714 323749 -65679 222791 -119082 312441 389621 147608 159152 133631
13250 133631 194296 427262 231681 -12376 59592 299473 34468 -23015 97071 138991 57121
13238 48845 229632 91141 38212 369462 130757 73759 396273 223372 99049 99802 195474
13227 195474 -183768 247538 541369 79027 115012 100401 6589 43543 315260 25313 270561
13216 270561 -86237 197922 104246 71761 215001 129680 5446 102560 4168 194567 21492
13204 88185 160264 -224261 154786 187007 -308504 393450 186699 159273 -133898 295375
13193 -40314 -25344 197403 255235 43742 299323 90550 -26034 -194843 434194 -83077 215490
13181A01627P4522n7002D6606K7262e9081l972A62658D3364c42180H0912K32532
13170C13444a14638A8125J61782F9155L7008l6129J82971h2880B62225q1265m0708
13159A40252K22490a2377A45915K4392a04294A50904L41866A12392J03789B8212
13148H1927J76350a40209j2297A64016k4282f3029H2400k1240K07571K64887B38748
13136A68751a4460B02210a1726A95777i3657B91754q8854h8938j84340B5320J93915
13125B19235f1530k1114C77782p5711B1605J53372O2605g8678r6325O5117l6954
13114a46840b9369A5421K88766G9230J0854d2208E6068J35259H9469a06812A95941
13102B14273G4943J56586G9562K17684j13950J17571F4693H264J39931L3249N3899
$$ plain form
13181 101627 176149 119147 46606 73868 -59081 -63053 162658 43364 -342180 80912 313444
13170 313444 -114638 18125 179907 69155 106163 70034 253005 -82880 262225 180960 140252
13159 140252 362742 -12377 145915 170307 -104294 150904 492770 112392 216181 28212
13148 81927 258277 -140209 -152506 164016 139734 -63029 82400 61160 268731 533618 238748
13136 168751 -14460 202210 -11726 195777 -93657 291754 202900 -88938 -273278 25320 219235
13125 219235 -61530 -82644 377782 302071 21605 174977 237582 -78678 -175003 -109886 -146840
13114 -146840 -29369 15421 304187 79230 90084 -42208 56068 191327 89469 -106812 195941
13102 214273 74943 231529 79562 297246 183296 300867 64693 8264 148195 181444 235343
13091B35343a3160A42790c28301C00874l2967A02348b37104c0866A39805n8117
13081H1688a86713r6196B49916l2479H715M8671J59810A3586b57193B216M6914
13070D9130J78061a13323A44242c3834B90026a03510A12419M7365g029k69095
13060b76124J37303B22514h2975A54344a12245B10399J71299G5786L2380e9037
13049a9436E7572K55779A12539K1581c2120j7679B4623J06910b42952C5199J71868
13038B07067a31186C9674a21195E07700B3173K17865c2416D1939J62356a21731
13027a06413B77430e4096C9600c0102C07606e3239A13554i138D3807b072A77081
13015a08570A20039K40749a51347B81634J66188b26893J12092L5860j30829c7711
$$ plain form
13091 235343 -13160 142790 -328301 300874 267907 102348 -237104 -30866 139805 81688
13081 81688 -186713 -282909 249916 217437 8715 57386 217196 13586 -257193 2216 49130
13070 49130 227191 -113323 144242 -33834 290026 -103510 112419 159784 -7029 -276124
13060 -276124 -138821 222514 -82975 154344 -112245 210399 381698 75786 108166 -59037
13049 -19436 57572 313351 112539 134120 -32120 -49799 24623 131533 -242952 35199 207067
13038 207067 -131186 39674 -121195 507700 23173 241038 -32416 41939 204295 -121731
13027 -106413 277430 -54096 39600 -30102 307606 -53239 113554 -9138 43807 -2072 177081
13015 -108570 120039 360788 -151347 281634 447822 -226893 -114801 -78941 -209770 -37711
13004i715B28841N5458F2492L55209o3821d4710n314A41104J5589d8001J6121
12993c1880A33490D9292M6556a08016n2676H4617Q4583O0966c4375D9439j3894
12982C5545K81779f9515H9805j7958f7708C01102a8397A52423A1820J34551M1303
12971A87674d21880A14663L0952K6788L18420A57685a28960c8915A93159i1530
12960C17916j06014M8983m0252f0180b1003a227B9542J74230j6402c3584H9113
12948C32502f149G1162O2130J25693d1297A03061h1110o8947A61225h5438c2158
12936B1694b61339D88826g2425D9102a2452C4178J7244a4363A97667L3201f326
12924A14943a52014q6035A90397b07040c0042F0237a79110I3645a47292C16321
$$ plain form
13004 -9715 228841 284299 62492 417701 353880 -44710 -50024 141104 156693 -48001 -31880
12993 -31880 133490 49292 95848 -108016 -160692 84617 169200 230166 -34375 49439 35545
12982 35545 317324 -69515 89805 71847 -67708 301102 -18397 152423 11820 146371 187674
12971 187674 -421880 114663 145615 172403 490823 157685 -128960 -38915 193159 -91530
12960 317916 211902 260885 220633 -60180 -21003 -1227 29542 203772 187370 -33584 89113
12948 332502 -6149 71162 133292 258985 -41297 103061 -81110 -150057 161225 -85438 -32158
12936 21694 -261339 488826 -72425 49102 -12452 34178 51422 -14363 197667 230868 -6326
12924 114943 -152014 -238049 190397 -207040 -30042 60237 -179110 93645 -147292 316321
12913A05671K35876A45108A6803K06423a31154L0215I0838L0961K55312A87469
12902b24842E7353a27488A42389a93510e3214j5483A38900e1867m2989H1677J63063
12891B44740q5661R7223a71663A45717a3794j19368N199A68306D5651b37548h6227
12879A49386K4266b28385A8273K20394J56405f1697A63629a26311F8683O1763
12869A30446k5195M9698E2212J9961a68759g9438j25416N9021l7630d2318C87927
12857B51567G1789a05285D1210a10932G1042Q2032K23946A36287c3573j26684
12847a60257b1790j17422A54094a04828F5705k406L67146q7231E894J61569M1408
12836B08871b24664i652A01789M1403m1083J47707n1418c0968E7632G247b1871
$$ plain form
12913 105671 341547 145108 16803 223226 -131154 -100939 90838 121799 377111 187469
12902 -224842 57353 -127488 142389 -193510 -53214 -68697 138900 -51867 -94856 81677 244740
12891 244740 159079 256302 -171663 145717 -13794 -133162 -127963 168306 45651 -237548 -86227
12879 149386 173652 -228385 18273 238667 395072 -61697 163629 -126311 68683 130446
12869 130446 105251 154949 52212 72173 -168759 -79438 -204854 -145833 -183463 -42318 387927
12857 251567 71789 -105285 41210 -110932 71042 153074 377020 136287 -33573 -160257
12847 -160257 -21790 -139212 154094 -104828 65705 63299 430445 343214 5894 167463 208871
12836 208871 -224664 -9652 101789 143192 102109 249816 198398 -30968 57632 7247 -21871
12824a61536H9395h4312A03399d5866G9979a17804l8411n6760h6957C2344a72998
12812F3477b74470A75842F3211N5633J22858K8818a82261g5718C4108a15862J7226
12801i8636G5170J28463l1216J29332L0127a14585l7784B26910a20979K3925A92541
12789B5529K14418F4053b02270R3421q5911m6265C583N2756c6313A3218n377d6773
12776A17847A6958a80562A27770J63643F2404j5529A339J14896n3368b12307e6780
12764D581c98484i304j42087f6084I0541a1704B65205A26960J9002b12200E7172
12752A26431a98104A04680Q9221o2237D7520M5525a20187k2777B09806a68709
12741A91108b17939e8364k12348D7933M95851a85713Q520j12827B16595d9888
$$ plain form
12824 -161536 89395 -84312 103399 -45866 79979 -117804 -156215 -212975 -86957 32344 -172998
12812 63477 -274470 175842 63211 118844 241702 270520 -182261 -75718 34108 -115862 -98636
12801 -98636 75170 203633 172417 301749 331876 -114585 -152369 226910 -120979 -97054 192541
12789 25529 239947 64053 -202270 -108849 -194760 -241025 3583 56339 -36313 13218 7841 -46773
12776 117847 16958 -180562 127770 291413 62404 46875 1339 116235 62867 -212307 -56780
12764 4581 -398484 -9304 -151391 -66084 90541 -11704 265205 126960 145962 -212200 57172
12752 126431 -198104 104680 193901 131664 47520 93045 -120187 -142964 209806 -168709
12741 191108 -217939 -58364 -270712 47933 543784 -185713 -177193 -290020 216595 -49888
12730a21502M7360j06845h4161A63969E329a09853C0306c04145B58816n178p8867
12719A74771e090B10442C0442h2266C30003a87933D1724g0750A96892C4450Q8532
12708A22982L2587n1598K03193b1827G5480J85298a12268F7733a62042C10036
12697A54388a4016A08609J79806C0745b3833A09334J26082J37373j30701R8806
12687C40894B6646M14584A22348K8844J37140b7128l7292m283B43815a07517k1370
12676a28887a2818A80788r947F3242a41376C29108d3897j80239g9058A4993Q1117
12665I6110B399K48349d780B21357g3379B53544K82746c4147A21285K51717I5678
12653a37132G301J19408J55006h8251B71049j05459G7498M25690d1863I7499J35545
$$ plain form
12730 -121502 -74142 -180987 -84161 163969 5329 -109853 30306 -304145 258816 253638 174771
12719 174771 -5090 210442 30442 -82266 330003 -187933 41724 -70750 196892 34450 122982
12708 122982 155569 103971 307164 -21827 75480 260778 -112268 67733 -162042 310036
12697 154388 -14016 108609 288415 30745 -23833 109334 235416 372789 242088 340894
12687 340894 26646 441230 122348 151192 288332 -27128 -64420 -68703 243815 -107517 -128887
12676 -128887 -12818 180788 170841 63242 -141376 329108 -43897 -224136 -79058 14993 96110
12665 96110 2399 250748 -4780 221357 -73379 253544 536290 -34147 121285 373002 95678
12653 -137132 7301 126709 281715 -88251 271049 165590 77498 503188 -41863 97499 233044
12642B33044a014A16177e6512A35999O7012a95951B16933f4781B21643b5022A55662
12630c10609d1123B93445a20756A71068b27735b6050M452B07905f9070B39903
12619a03664N0493Q710A42399G0386L38456C8748J49397K61438A51971K70338
12609D22309j47646A33889N9936R7764L4561a37885A74967f2872A27895R169a78515
12597h748A25164a28667m3850I3509b8632B0875h5990B28816a75315B61662e632
12585H3278L57728A51647n3601J43960F4389L077J42657a17398H6K99676j19078
12574A80684o3791m6033b1709C9778K56061q8973a52772a0424k33361f8124F6428
12562a58839f2184A01101g6755A5936J02503F132R7119B9308d0955G5695K50583
$$ plain form
12642 233044 -1014 116177 -56512 135999 203011 -195951 216933 -64781 221643 -25022 155662
12630 -310609 -41123 293445 -120756 171068 -227735 -26050 -21598 207905 -69070 239903
12619 -103664 -53171 -44461 142399 70386 408842 38748 188145 449583 151971 422309
12609 422309 274663 133889 193825 291589 326150 -137885 174967 -62872 127895 137064 -178515
12597 -8748 125164 -128667 -172517 93509 -28632 20875 -85990 228816 -175315 261662 -5632
12585 83278 441006 151647 98046 242006 64389 67466 210123 -117398 86 299762 180684
12574 180684 116893 70860 -21709 39778 295839 206866 -152772 -10424 -243785 -68124 66428
12562 -158839 -62184 101101 -76755 15936 118439 6132 103251 29308 -40955 75695 326278
12551C26278a56979M620o5145A44737D843a70597A62124P1492K5345p1065c81538
12539A16517b7666p6559b5300A68990f7066n3673N0871n867C0279K9529d1200
12527A21616a37741B91651a04498l1833B80146A31413J12100I1567D523e2559
12516B55075A09034K2868K16085j52871c18035g5159A428Q6088b33464D2487d70525
12504D7868c9985j59572A88133a77582p1102A4438a0850I378b73477a05794C97213
12492C53407e9621C1434a28004A64429H952h7057D20562A43919B8272L06553g4932
12480a24800M6128D28189E0280b91502A87807c9063E6247M1092C8116a03542B73206
12468C02790j37051f0627A52801B5438d1084A08691a59943A61169q639A4482L1612
$$ plain form
12551 326278 -156979 -152359 -217504 144737 4843 -170597 162124 233616 258961 187896 -381538
12539 116517 -27666 -104225 -25300 168990 -67066 -120739 -69868 -75735 30279 59808 -41200
12527 121616 -137741 291651 -104498 -136331 280146 131413 243513 91567 4523 -52559
12516 255075 109034 131902 347987 195116 -318035 -75159 1428 87516 -233464 42487 -470525
12504 47868 -39985 -199557 188133 -177582 -248684 14438 -10850 9378 -273477 -105794 397213
12492 353407 -59621 31434 -128004 164429 8952 -87057 420562 143919 28272 334825 -74932
12480 -124800 -78672 428189 50280 -291502 187807 -39063 56247 97339 38116 -103542 273206
12468 302790 165739 -60627 152801 25438 -41084 108691 -159943 161169 152530 14482 46094
12457D6094r009h1071p1403c8050j89979b4793n2818J043A91966b7147C63344
12445B4761K2801j0764d0355h237j34836C25319n5983d5129l5599q4817A5358
12433B39615o9619a0315n302k8852A44497l4069h4694j56626d0581F5319b73038
12421A50080b59398A87229r0072q483L31007c06677J39149P6777B05813b93334
12410G1733k6366J83577F7885c9723d844r0692A16538e5656E0695b67140A47989
12398a40102A25093J24247E1192a58278J2298j25458q267G1621a19871I3071c9784
12386G4361a19499m2161A16297a08582C00674a85236A23687K59032e7751A70104
12375C5976a34697d8876k1429J0292B08425o2354h7965j94914e5776k34166a36408
$$ plain form
12457 46094 37085 -81071 -152474 -38050 -228029 -24793 -77611 -76568 191966 -27147 363344
12445 24761 47562 36798 -40355 -8237 -143073 325319 269336 -45129 -80728 -165545 15358
12433 239615 169996 -10315 -15617 -44469 144497 110428 -84694 -241320 -40581 65319 -273038
12421 150080 -259398 187229 97157 88674 419681 -306677 -167528 -90751 205813 -293334
12410 71733 45367 228944 67885 -39723 -4844 -95536 116538 -55656 50695 -267140 147989
12398 -140102 125093 249340 51192 -158278 -145980 -271438 -279705 71621 -119871 93071 -39784
12386 74361 -119499 -161660 116297 -108582 300674 -185236 123687 382719 -57751 170104
12375 35976 -134697 -48876 -70305 -60013 208425 146071 -87965 -282879 -55776 -289942 -136408
12363a30440k15598J12175g4506B84599d7615p2923D40901a1050A28221a48954
12352f8948j29673c3553o4619B4399J44563K1214g1119k62599L7519D4114N012
12341D9126L7008a36183k1238b5734H243M8649r186L47805I1676R486a16990d2898
12328a1441A69532G0036J4261K09903a03767C22591b07258C79347D8080b87593
12317F2958L15973a54147I1044e5429j21615E5040J56897p0572b00795O7098A18386
12305b591A43472d5214A89405c76117A4547h7057b9106O169j47575G8159J22884
12294B01043C3555A2041A468M6542A52b04997f3481I9098a2020j72486l9640H8786
12281D7660J38837b33775R7270B53425A21619J57120b42897P7107b8912H6128
$$ plain form
12363 -130440 -346038 -233863 -74506 284599 -47615 -120538 440901 -11050 128221 -148954
12352 -68948 -198621 -33553 -98172 24399 168962 190176 -71119 -333718 -296199 44114 49126
12341 49126 86134 -136183 -157421 -25734 8243 56892 47706 395511 91676 101162 -116990 -42898
12328 -11441 169532 70036 84297 294200 -103767 322591 -207258 379347 48080 -287593
12317 62958 378931 -154147 91044 -55429 -177044 55040 211937 141365 -200795 -133697 118386
12305 -2591 143472 -45214 189405 -376117 14547 -87057 -29106 -22937 -170512 78159 201043
12294 201043 33555 12041 1468 48010 152 -204997 -63481 99098 -12020 -184506 -224146 88786
12281 47660 186497 -233775 -136505 253425 121619 278739 -242897 -165790 -28912 86128
12270a84587B3134N073K19610c3990B25528b6790I9782a34319A95618a64979A10185
12258A09028k7702f9548C81480l0165A45646n739c6300A3188P6236R6504Q5271
12247B71199n1080q682B6585K2989a73896A49397M0313H5076J61349E2378a60626
12235a78055A64074d3828C72760i7273I3321j7650B2449g8677L7860j85950A79990
12223A24937m2582K17259f7128F8302R8113J02916K30499b5374C47779c0238C87659
12211B90619A44808E7896J53557J20222a19969D85945d7113D72736I2471J36369
12201B28840A04296K95466F7405J05671A8876K19796C8929c5850B12833N0754
12191B63587m0740E9866i2899I5539K11109k3271l5376B6736J72489G599b6634
$$ plain form
12270 -184587 23134 28207 247817 -33990 225528 -26790 99782 -134319 195618 -164979 110185
12258 109028 81326 -69548 381480 351315 145646 139907 -36300 13188 89424 185928 271199
12247 271199 220119 211437 26585 49574 -173896 149397 189710 85076 246425 52378 -160626
12235 -178055 164074 -43828 372760 -97273 93321 75671 22449 -78677 -40817 -226767 179990
12223 124937 82355 299614 -67128 68302 166415 269331 499830 -25374 347779 -30238 387659
12211 290619 144808 57896 211453 331675 -119969 485945 -47113 472736 92471 228840
12201 228840 104296 399762 67405 173076 18876 238672 38929 -35850 212833 263587
12191 263587 222847 59866 -92899 95539 306648 283377 248001 26736 199225 7599 -26634
12179C7746D167f9065E72409a87504C39187J0544a77395A68097m0176A3577a23509
12167B99742D5915f8804A44633g9765B58074L2417N7154c10252I5731l8593J27242
12156A84380l5330j4894b34610A95158a10311d7185r1691A86670n8098F4221L01633
12145C65854j18904a9813A20624c65078E70375A14747b91208C2696e5719A96004
12134B22129a13856A14687C8538c3308C42425A22548m1914a05348A4070J29914
12124A43984n6470O9743g1447E6960k0268J62067a62394k6050i1704A48765f8151
12112a2356H5696a30767A4091N6173N4284l5168c34821A67563n3260K1932b19644
12100c0428B23386a63052D20166g1180H466b04345i5379D80891G174i6646j51114
$$ plain form
12179 37746 4167 -69065 572409 -187504 339187 349731 -177395 168097 127921 13577 -123509
12167 299742 45915 -68804 144633 -79765 258074 290491 347645 -310252 95731 57138 184380
12156 184380 149050 134156 -234610 195158 -110311 -47185 -138876 186670 128572 64221 365854
12145 365854 246950 -19813 120624 -365078 570375 114747 -291208 32696 -55719 196004
12134 222129 -113856 114687 38538 -33308 342425 122548 80634 -105348 14070 143984
12124 143984 87514 157257 -71447 56960 36692 198759 -162394 -188444 -91704 148765 -68151
12112 -12356 85696 -130767 14091 70264 124548 89380 -334821 167563 114303 136235 -219644
12100 -30428 223386 -163052 420166 -71180 8466 -204345 -95379 480891 7174 -96646 -247760
12089b47760b6531A35494J21631A08236g8991k56686D6696h7561l2647l9540D26020
12077A22294g0686A44626c9626k4106j3931I7130b15167b9582r5029l4179B15095
12065C49540A07298L0341N02946O90362n31484I5409K13508E7204J87134H8204
12054f9594A26942K28282F7479b8512A66194h8230A8836K58201f0527K2893H2134
12042F7427a28124J1860M0755L4236C2920M4788i5523i286A67210H897c1992A23460
12029a80572Q3090G9332B3903g7116c5148D8146a72040j29117K877D27592b53787
12017H3572K41953F7638a1948k32062n4345B24644b17100O2740A23270e3982J109
12006e2873G0184C1802c90372I5465J6854D7673A9634J00770K25739k6300b2103
$$ plain form
12089 -247760 -26531 135494 257125 108236 -78991 -335677 46696 -87561 -120208 -159748 426020
12077 122294 -70686 144626 -39626 -63732 -77663 97130 -215167 -29582 -124611 -158790 215095
12065 349540 107298 137639 640585 1330947 799463 95409 308917 57204 244338 88204
12054 -69594 126942 355224 67479 -28512 166194 -88230 18836 277037 -60527 -37634 82134
12042 67427 -128124 -116264 -75509 -41273 32920 77708 -95523 -9286 167210 8897 -31992 123460
12029 -180572 -97482 79332 23903 -77116 -35148 48146 -172040 -301157 -298280 427592 -253787
12017 83572 325525 67638 -11948 -244010 -298355 224644 -217100 -154360 123270 -53982 -52873
12006 -52873 70184 31802 -390372 95465 112319 47673 19634 120404 346143 319843 -22103
11994F3918K3567A2495J18742a09585j80423i3917A66515a20102k661A33474Q1697
11983B15171b54481e2646a063j33230e790k9256B28849c36532e9940B40163a82334
11971G6323d4616J9798j92227A5467a80921d0401l83852a56233C50391e27983
11960c6147E1666b13503i4654H161b2716j63242l0271P1569K8070A41636b90235
11948H5051g9819r4067N4328n735b1510a0177o8613j92650R377P4769q4158A46232
11935A47382l9169f7348m5441C42702G4081M0941M9773C2806K69248E2637A9559
11923d33248a44130L9531B85236A42226A0187b46747D12719a24970J1527e824
11912A50148D2238A4915b1389k3837j11410I8054n796P7144J06988d0864j48567
$$ plain form
11994 63918 87485 12495 131237 -109585 -290008 -93917 166515 -120102 -122763 133474 215171
11983 215171 -254481 -52646 -1063 -134293 -5790 -35046 228849 -336532 -59940 240163 -182334
11971 76323 -44616 -24818 -217045 15467 -180921 -40401 -424253 -156233 350391 -527983
11960 -36147 51666 -213503 -94654 8161 -22716 -185958 -216229 -144660 -116590 141636 -290235
11948 85051 -79819 -173886 -119558 -125293 -21510 -10177 -78790 -271440 -262063 -187294 -271452 146232
11935 147382 108213 -67348 -112789 342702 74081 115022 164795 32806 302054 52637 19559
11923 -433248 -144130 -104599 285236 142226 10187 -246747 412719 -124970 -113443 -5824
11912 150148 42238 14915 -21389 -45226 -156636 98054 92258 169402 276390 -40864 -189431
11901a89431B75989f3045L989I9406h7639a6305b919D0653a1716A62406P4903
11890B37309c00112A29102l2674I573J30736b64713J09389k5330A59951e5790
11879d27800D0594b30562E4369a77465b2482r8029l7739C04296A28718I989a29782
11867E7591g2995A30880L13926a61959j55791A43780b4776j47331A57377A609
11856A35818D8045a9738B6633C011K998i6529L7233J0090B2984a2522k30028h5928
11843c00581c7648B63615j14245h6801F7264F10a95609e6553n182j47118d4378
11831A57797a38179o5983A6523J35928f7361D9833a30690b6157j990A18694a89492
11819a11837H9786c00876J04100c2610D7520K13515D6595a44443b9114A19732
$$ plain form
11901 -189431 275989 -63045 -59056 99406 -87639 -16305 -2919 40653 -11716 162406 237309
11890 237309 -300112 129102 96428 9573 140309 -264713 -155324 -180654 159951 -55790
11879 -427800 40594 -230562 54369 -177465 -22482 -120511 -158250 304296 128718 9989 -129782
11867 57591 -72995 130880 444806 -161959 -317750 143780 -24776 -172107 157377 1609
11856 135818 48045 -19738 26633 3011 6009 -96529 -59296 -49206 22984 -12522 -242550 -85928
11843 -300581 -37648 263615 149370 -86801 67264 610 -195609 -56553 -61735 -208853 -44378
11831 157797 -138179 -204162 16523 152451 -67361 49833 -130690 -26157 -28147 118694 -189492
11819 -111837 89786 -300876 -196776 -32610 47520 261035 46595 -144443 -29114 119732
11808E1618e7624o6179j34500C64565G6810q330h1852m9904A6330a77201C3201
11796b00361P2157G3648a697j66426a3809j31301H8102J9344b637A0817K76372
11785B87189m6332e3139C6381d04116a84827Q984M4136D4001a02958A6903K86744
11774C03647j50560a67711A95184Q7493b53202r2004B085K24482b83542L6698
11764b46844C10887h3894j05086P9030F1922J47879a20137C8584P2871O538i1181
11752A63407D2531a54655J1600o899B9914b95358a08170C14987a72081D4692N6921
11741A01613L18184h1374J7721E036i6609n1352M2667I0621K1665c36917g3944
11729f12126b96970a01260o2030P3709j77908B3496b30635h2576K4801n0209e0927
$$ plain form
11808 51618 -57624 -123803 -258303 364565 76810 68480 -81852 -131756 16330 -177201 33201
11796 -200361 -128204 73648 -1697 -168123 -13809 -145110 88102 107446 -2637 10817 287189
11785 287189 240857 -53139 36381 -404116 -184827 -175843 -131707 44001 -102958 16903 303647
11774 303647 153087 -167711 195184 282677 -253202 -345206 2085 226567 -283542 -246844
11764 -246844 310887 -83894 -188980 -109950 61922 209801 -120137 38584 111455 117993 -91181
11752 163407 42531 -154655 -143055 -149954 29914 -295358 -108170 314987 -172081 44692 101613
11741 101613 419797 -81374 -63653 5036 -96609 -147961 -105294 90621 112286 -336917 -73944
11729 -612126 -296970 -101260 -163290 -89581 -267489 23496 -230635 -82576 -57775 -107984 -50927
11717a42787C77861B2202O5209A7575J29637a11375n0214c573j8512B49405O4183
11706C13588b36233i7948A09960R1379a30311B38422B9872M18269a25875J9755
11696a06120B62436b4177k90804A74495p4394a84008G0431K5072a92859A94712
11685A1757M0719a75320b0346C7307P2070M9191n5600b12514I1747a72554O9059
11674a03495B80562J37948j38866A2865a89362j22651I522g7811B48380j18183
11664A30197a05119A84828d10684a71883C36630g250D7165J84190n920J18971
11654C44406j39271G7548a931l640k8048k29979B62768d7818B53164a5531B67950
11642h6173b4485D7398J23044B6379J33825b58086I5867c39367B7075K02448F2786
$$ plain form
11717 -142787 377861 22202 87411 17575 147212 -111375 -161589 -3573 -22085 249405 313588
11706 313588 -236233 -97948 109960 201339 -130311 238422 29872 448141 -125875 -106120
11696 -106120 262436 -24177 -314981 174495 100101 -184008 70431 95503 -192859 194712
11685 11757 52476 -175320 -20346 37307 109377 158568 102968 -212514 91747 -172554 -103495
11674 -103495 280562 418510 279644 12865 -189362 -312013 9522 -77811 248380 130197
11664 130197 -105119 184828 -410684 -171883 336630 -7250 47165 231355 225435 344406
11654 344406 205135 77548 -1931 -5571 -33619 -263598 262768 -47818 253164 -15531 267950
11642 -86173 -24485 47398 170442 26379 160204 -258086 95867 -339367 27075 229523 62786
11630a76133H2570e5875E8030a80204L3354P0135A49163q854D0493L5012a90324
11618C42425D0802p090a43252B41730b21314o4259e283B03916N0226a38503B15535
11606D1728J25079D7762Q8964a08282G7337a6153N686j56335A89707d4392J0651
11595c3741m94105h4142G0724D017a40713l02525A49172a34826F8262q038a25921
11583C87384B4217L52323A00801a7525A85882a73530A24755M4627j9416e5156
11572E8293a88975A43304B2666b0154A09220b73825E9402J50303d35266h3876
11561b01223B9267J18461f3194A41361o2887g5905I8816J96549b40393f8068D9402
11549c4393B38646C4808J26437a79025B63565K34120b897A14974b1293B3236d8309
$$ plain form
11630 -176133 82570 -55875 58030 -180204 -146850 -76715 149163 140309 40493 75505 -190324
11618 342425 40802 33712 -143252 241730 -221314 -285573 -5283 203916 254142 -138503 215535
11606 41728 166807 47762 136726 -108282 77337 -16153 -10467 -166802 189707 -44392 -33741
11595 -33741 -527846 -84142 70724 4017 -140713 -443238 149172 -134826 68262 60224 -125921
11583 387384 24217 376540 100801 -17525 185882 -173530 124755 169382 149966 -55156
11572 58293 -188975 143304 22666 -20154 109220 -273825 59402 209705 -435266 -83876
11561 -201223 29267 147728 -63194 141361 78474 -75905 98816 295365 -240393 -68068 49402
11549 -34393 238646 34808 161245 -179025 263565 497685 -2897 114974 -21293 23236 -48309
11537A14992a09801A66741B2552J59644b0083B92340G9877b1398j52783B08378
11526C67528j27931m286d7562C81993d0338I2159b6974A5296O1261a489B3418
11514B0899J17281d1356A50917o6381k4129a98139a6630A15499B6241M3469N4300
11503A24010K2376o5930c17735d0950C62788c2402j1140A17826J32870d1083B37296
11491a29573F231K52500j05503C3640L6271a42065G1487K72314A3527b4038H3369
11479C12574A01116m1957Q2228j2602K77167d048A52703D3144J32691G8599A6337
11467B61403a4989B49324c2896n100H2014J95870h4249H6211K15971a46354C67559
11455g30o6765B22711K58186G9515M13533e2316O456G3185J09176f2246j06347
$$ plain form
11537 114992 -109801 166741 22552 182196 -20083 292340 79877 -21398 -174181 208378
11526 367528 239597 235311 -47562 381993 -40338 92159 -26974 15296 76557 -1489 23418
11514 20899 138180 -41356 150917 84536 60407 -198139 -16630 115499 26241 69710 124010
11503 124010 146386 80456 -317735 -40950 362788 -32402 -43542 117826 250696 -41083 237296
11491 -129573 6231 258731 153228 33640 69911 -142065 71487 343801 13527 -24038 83369
11479 312574 101116 59159 141387 128785 405952 -4048 152703 43144 175835 78599 16337
11467 261403 -14989 249324 -32896 -37996 82014 277884 -84249 86211 302182 -146354 367559
11455 -730 -67495 222711 480897 79515 493048 -52316 -45860 73185 182361 -62246 -168593
11444a68593D2172a28169C54902j49652D4509P297J99815j3115a13440c5219A10067
11432a39470C61731D1339a48435F8101m146R409a71067E4101J21014l0292c44041
11420G9060l9492K16611H6190J63069e4600k03525c6098F3229J15747m1038a8732
11408a96108p0012A40529C5816j6511e2572k57267A11020d4858k4089D7711a06998
11396F0802A2372K6618L29621A77691b6347D3725a02630n6008A34675b31025G4467
11384B91188A45178H946a22694B55774j22258o4330J91884a89684a6120C23075
11373b08848A18438E7866a05582b0540A54328O1764F7816R0872D3405g6506B1469
11361c08032H4490i0369d2540A78664B7424b29631a08614j80807A55437i4209
$$ plain form
11444 -168593 42172 -128169 354902 205250 44509 51806 251621 238506 -113440 -35219 110067
11432 -139470 361731 41339 -148435 68101 63955 73364 -171067 54101 175115 144823 -344041
11420 79060 39568 256179 86190 249259 -54600 -258125 -36098 63229 178976 137938 -18732
11408 -196108 -266120 140529 35816 19305 -52572 -309839 111020 -44858 -68947 47711 -106998
11396 60802 12372 38990 368611 177691 -26347 43725 -102630 -158638 134675 -231025 74467
11384 291188 145178 8946 -122694 255774 133516 69186 261070 -189684 -16120 323075
11373 -208848 118438 57866 -105582 -20540 154328 216092 67816 158688 43405 -76506 21469
11361 -308032 84490 -90369 -42540 178664 27424 -229631 -108614 -289421 155437 -94209
11350C6851L7861C4510c08262A84588E825R3303C2814b13748C28817b20871h4443
11338E9043a99835D3365j4759J6124c3752k56207A24486B3268b01205A55923b17005
11326a94495f7298n4589K8088C49045A15574c37940A78963a11365C96439i6186
11315A61973l6598N6301a14046A95112c26161G1431a03539d1796l6746b0493A38358
11303A37944b49298B1477a29090B39342n8670c66221a02883n8351I9376e1624
11292g139r7282K5760K9566A33160c7235e436m09584J66219f5046q7253A94258
11280B33072C042a81499h5591A71627c76786C9662b83790g5197c1977A36715L98628
11269E35343c3248O206p5349B69400k2270h5916A02658L1419h6633k59165b1851
$$ plain form
11350 36851 74712 34510 -308262 184588 5825 99128 32814 -213748 328817 -220871 -84443
11338 59043 -199835 43365 28606 44730 -33752 -289959 124486 23268 -201205 155923 -217005
11326 -194495 -67298 -121887 -93799 349045 115574 -337940 178963 -111365 396439 -96186
11315 161973 125375 181676 -114046 195112 -326161 71431 -103539 -41796 -78542 -20493 138358
11303 137944 -249298 21477 -129090 239342 180672 -366221 -102883 -161234 99376 -51624
11292 -7139 -104421 -78661 -49095 133160 -37235 -5436 -415020 -248801 -65046 -152299 194258
11280 233072 3042 -181499 -85591 171627 -376786 39662 -283790 -75197 -31977 136715 535343
11269 535343 -33248 -27042 -102391 269400 247130 -85916 102658 134077 -86633 -345798 -21851
11257I0757g7551j58272A42414b9114A0092b14525O8887A25970h3597q8178J6613
11246a55162k5483P8041k16894A08149K0381G072Q8174c06588a30311D3992a35190
11234C47827c20674g2113B4113a65058O9579N287B31126c8776n5354H2511Q034
11223I0545c33272D762a77681A37624C037a29129j29601I2714N9692a21402c3344
11211a07891G0698B1457K1354d6838B75934B6713o320g7775D68838a22769C72024
11199D4321e1201D1827e6273I9930Q4177b56681H3234a82989C07878p9622a51822
11187A21151e1208j71631C3138a8044A0783J49191c81213h1568G0396f5611H7457
11175A08222b01147A78583A326g3570B20476C202g6018a5910j25033j14232Q4163
$$ plain form
11257 90757 -77551 -235823 142414 -29114 10092 -214525 -145638 125970 -83597 -171775 -155162
11246 -155162 -180645 -102604 -319498 108149 128530 7072 95246 -306588 -130311 43992 -135190
11234 347827 -320674 -72113 24113 -165058 -95479 -90192 231126 -38776 -94130 82511 90545
11223 90545 -333272 4762 -177681 137624 3037 -129129 -258730 92714 152406 -121402 -33344
11211 -107891 70698 21457 42811 -46838 275934 26713 20393 -77775 468838 -122769 372024
11199 44321 -51201 41827 -56273 99930 184107 -256681 83234 -182989 307878 228256 -151822
11187 121151 -51208 -222839 33138 -18044 10783 159974 -381213 -81568 70396 -65611 87457
11175 108222 -201147 178583 1326 -73570 220476 3202 -76018 -15910 -140943 -255175 -171012
11164a71012M6282n5503i909j46168j79548F5441a11215j90039a09215A56681
11153B31254a83020f1852n4123L2009B49368a21945p5648e2745N035m9718A4297
11141A25072L1866c85632D1194Q6507D7387c0021b268r4376A47507g5545E88a10315
11128C8791b70373D4819J29026a66708J9466H3176f702A51456a41225B10821q1784
11117A29037b40523l7708C6068J61750a45685E192L2508a16128C29366A39956
11106a35690I1965L06272a56947A7579n850Q7262C4548P876N7017a6519r7318
11095a13837A10974C5720J17184L8117h9721j45709F6788e0426E04514A4135J81346
11084A95481J09904A32346a57105k584C37462a19376D95870I1066e0955B38673
$$ plain form
11164 -171012 -124730 -180233 -9909 -156077 -335625 65441 -111215 -301254 -109215 156681
11153 231254 -183020 -61852 -115975 -83966 249368 -121945 -197593 -52745 -47710 -97428 14297
11141 125072 156938 -385632 41194 127701 47387 -30021 -2268 -96644 147507 -75545 588 -110315
11128 38791 -270373 44819 173845 -166708 -147242 83176 -6702 151456 -141225 210821 129037
11117 129037 -240523 -278231 36068 197818 -145685 5192 37700 -116128 329366 139956
11106 -135690 91965 398237 -156947 17579 11729 98991 34548 42424 99441 -16519 -113837
11095 -113837 110974 35720 152904 191021 -89721 -235430 66788 -50426 504514 14135 195481
11084 195481 305385 132346 -157105 -159689 337462 -119376 495870 91066 -50955 238673
11073B11164M7115p1855K21310A57604k6354J04744H9861J56658n4689o404L8632
11062B24058J0646e9362A12727D498L04797j48638D3506a04840C83653A34637
11051A75550m5624K09529J07015Q585j55316L34185q6136r536A6655O44292R5369
11040G56316B24091K44625p0068K54113K97883l43111L09308k5440j00345k65172
11030E25884l9474J37959m7057K52331l41095L84010k28911K48700j07083m288
11020G80976j847j84523q2773j3173o8329K39280O2777j76624k45512N60606j06584
11009G64274j44901A64761J98342L63661j25707o3843j40566O48556D67819q0211
10999C87608L59545j42368L13099m32984J74030P0993p9357J08157j69127j5219
$$ plain form
11073 211164 258279 186424 407734 157604 131250 235994 89861 246519 191830 185426 224058
11062 224058 234704 -59362 112727 4498 309295 160657 43506 -104840 383653 134637
11051 175550 129926 339455 446470 455055 299739 633924 547788 538252 16655 660947 756316
11040 756316 224091 468716 398648 652761 950644 607533 916841 891401 791056 525884
11030 525884 486410 624369 577312 829643 488548 872558 643647 892347 785264 780976
11020 780976 779129 594606 511833 498660 430331 669611 732388 555764 310252 870858 764274
11009 764274 619373 164761 363103 726764 601057 537214 396648 1045204 467819 387608
10999 387608 747153 604785 917884 484900 658930 729923 650566 758723 589596 574377
10989E74377j94902N05276l16382o1856J09496k3451o6478K92176n3315k56915
10979E08026k2167J49304k281J89121J87190k06461J72543n0604L02918k88400
10969I39189N2233O4815q3310P2685K45358L0105J30512K69796J14445M39585
10959B275413L06035q5924q7982k08575O02783m06912j24572l06165p8114o70
10949A885317l97041L24920l59869J98135p1067j0380k61453L01499k2694J30294
10939A717661n67478M1088j13747l70683P0341j59763L30202D62186F2752P8812
10929A41564K40545O8674A69770K74753j31162j35850N4227L9341J02947D5783
10918h9662q3092b248A99592J94577j69904k0863Q7753b42629A71489l4899h890
$$ plain form
10989 574377 379475 884751 568369 506513 616009 592558 526080 818256 764941 508026
10979 508026 485859 635163 632882 822003 1009193 802732 975275 924671 1227589 939189
10969 939189 991422 1056237 972927 1045612 1290970 1321075 1451587 1721383 1835828 2275413
10959 2275413 2581448 2495524 2407542 2198967 2801750 2394838 2270266 1964101 1885987 1885317
10949 1885317 1488276 1813196 1453327 1651462 1580395 1570015 1308562 1610061 1587367 1717661
10939 1717661 1150183 1191271 1077524 706841 777182 617419 947621 462186 62752 141564
10929 141564 382109 450783 169770 444523 313361 177511 231738 271079 374026 45783
10918 -89662 -172754 -2248 199592 394169 224265 203402 291155 -242629 171489 136590 -8890
10906H093a60069B68515A8828L05851a793n5941H5767O1102E5428f1519A08568
10894d8016o5966C12873a46945E4351J57213j05151b42582d6105o456F8901M4944
10883A13845f1691A69373b7654C04546d7380A11739k1134C7622h9601j91267j07094
10872c87962i0806A14388l4260g7402B37230a39636b6927a2266B3486b56084N6032
10861b00052A01390a16385C06609j40357b17147G4540B31J433J94621F6553b2425
10849a98522A36102h4394j05239C00417q1239b22519f7731B24961p5801J10108
10839B59268i1939O653B31491J2472Q9727a88153d4987m2920B45739h2766A785
10827e9135a9825A69244e7306C2914O5046N7563C3002D553a73913G7179f6711
$$ plain form
10906 8093 -160069 268515 18828 324679 -1793 -57734 85767 146869 55428 -61519 108568
10894 -48016 -113982 312873 -146945 54351 211564 106413 -242582 -46105 -52561 68901 113845
10883 113845 -61691 169373 -27654 304546 -47380 111739 90605 37622 -89601 -280868 -387962
10872 -387962 -90806 114388 80128 -77402 237230 -139636 -26927 -12266 23486 -256084 -200052
10861 -200052 101390 -116385 306609 166252 -217147 74540 231 1664 196285 66553 -22425
10849 -198522 136102 -84394 -189633 300417 219178 -222519 -67731 224961 149160 259268
10839 259268 -91939 -85286 231491 243963 333690 -188153 -44987 -87907 245739 -82766 1785
10827 -59135 -19825 169244 -57306 32914 97960 155523 33002 4553 -173913 77179 -66711
10815c7319k61891A74669J6386a13133A82851f9428j53690h3623j30067N4231
10805a59459d5202k3190k68660d0117j41241A42585l8598l8166b91966C29855
10794A85426a29114c8915B01896a11150C95152c3601D2067A4293b80536B62047
10783g617C17761H5639a83282A48121f8002a5092k3048p7604A774L6486J96954
10772B35214h3221O057k48600A04321d68047a5331j30080J8658b1225l77987a38990
10760d35706J52553I0845C7544a28605O2808k05585G7928k9124L33700B3544c36493
10748E6556Q982K63287a51470d6546C8303b70109J5597C8819d04174C4582a72207
10736a37747j57572D4349a28944b0621r5508A15198c18601A98449B4932a15293
$$ plain form
10815 -37319 -299210 174669 191055 -113133 182851 -69428 -223118 -83623 -213690 -159459
10805 -159459 -45202 -68392 -337052 -40117 -181358 142585 103987 65821 -291966 329855
10794 185426 -129114 -38915 201896 -111150 395152 -33601 42067 14293 -280536 262047
10783 -7617 317761 85639 -183282 148121 -68002 -15092 -38140 -115744 1774 38260 235214
10772 235214 -83221 -77164 -325764 104321 -468047 -15331 -145411 -126753 -21225 -399212 -138990
10760 -435706 -283153 90845 37544 -128605 -65797 -271382 77928 48804 382504 23544 -336493
10748 56556 65538 328825 -151470 -46546 38303 -270109 -254512 38819 -404174 34582 -172207
10736 -137747 -295319 44349 -128944 -20621 -116129 115198 -318601 198449 24932 -115293
10725b24527B70008d5043A06262b19407k5413C2890b49773B3626K05358F757g8124
10713a23075l9444j21850C47451A33680j222d6838B84110I1009h6691A5642d98253
10701a75188j30497A70289n2035b06685C22907j36832m2706o1995h2122b1907
10690d0014A55524B9303Q8423C3140b50117g5696j02489C32500a35422A47573
10679b86884R6278f7297B18974A0476c92784a20130e0931J4717q5381j88622o5862
10668c76079L6735d3326A56722F9746b22686m080A17298C6236a17134A56949l6381
10657A20568a39335f7424a3323D2030b31588Q2877B7129c837A02413b27708B6234
10645B29484C7241N8422a17048A85631b86314R7195d112A34816a05898G2337b06515
$$ plain form
10725 -224527 270008 -45043 106262 -219407 -244820 32890 -249773 23626 228984 6757 -78124
10713 -123075 -162519 -284369 347451 133680 132458 -46838 284110 91009 -86691 15642 -498253
10701 -175188 -305685 170289 118254 -206685 322907 186075 143369 81374 -82122 -21907
10690 -40014 155524 29303 117726 33140 -250117 -75696 -178185 332500 -135422 147573
10679 -286884 -190606 -67297 218974 10476 -392784 -120130 -50931 -36214 -121595 -310217 -376079
10668 -376079 -339344 -43326 156722 69746 -222686 -226766 117298 36236 -117134 156949 120568
10657 120568 -139335 -67424 -13323 42030 -231588 -148711 27129 -3837 102413 -227708 26234
10645 229484 37241 95663 -117048 185631 -286314 -189119 -4112 134816 -105898 72337 -206515
10633b86885B49871b98330A20295a01332A59480D3986a18375j05343m8037R0441
10623a81314l8681B57379a8270k3214n084A15501l6560c1539C3211r154a23265
10611c28535e337o5273A99427b07905d7509j18875B9514h7167j00822I2787C5499
10599f7158l1298A83008A9656a34036M8360c7214k42124n8830C0139J16640A18
10587A90390a11057C4561a4629k1486j89334D4418a86359A60713d2384F9566a24929
10575c94983A05185b57921B24217A0448k123b91312a0915j7035A7711M6867B2182
10563d12289c3067r5281M8794p3423j38733D7328a93256C42968a40214k2944B87084
10551a62365O8531b084B62912C746a00444A34466k1711B6548i7003d3938I5998
$$ plain form
10633 -286885 249871 -298330 120295 -101332 159480 43986 -118375 -223718 -271755 -181314
10623 -181314 -219995 257379 -18270 -41484 -46568 115501 78941 -31539 33211 24057 -123265
10611 -328535 -5337 -70610 199427 -207905 -47509 -166384 29514 -87167 -187989 92787 35499
10599 -67158 -98456 183008 19656 -134036 -85676 -37214 -279338 -338168 30139 146779 118
10587 190390 -111057 34561 -14629 -36115 -225449 44418 -186359 160713 -42384 69566 -124929
10575 -394983 105185 -257921 224217 10448 8325 -291312 -10915 -27950 17711 64578 22182
10563 -412289 -33067 -128348 -79554 -152977 -291710 47328 -193256 342968 -140214 -163158 287084
10551 -162365 -93834 -2084 262912 3746 -100444 134466 112755 26548 -97003 -43938 95998
10539F3260j4088J11091K89796D0240Q7834g1789j50110k6707H7874a40265A10837
10527B69739I848c6164G9126b64287A9007J93760i751j57968P2688q8251M3774
10516a39508k7540A41105c2693k99588B33470q1819c7665k00420e856o0199j13581
10505a79636B63653a04200A06995R5037a78263A11556g3633p2283j2135c4822
10494A6297b74861K9795A09857J6093a12644b8092J757k35650A08207D1441J4380
10483E5821J40765R6995C0022J04526f7278C60814A3570a44647D0907c04487f6261
10471A27300b46583B94745K26099D7990K60032P3766J3671k665r8435a27084A12828
10459B23676g112B02585H881a89530I1315C9671a88407n6491D4758b8537j27577
$$ plain form
10539 63260 49172 160263 450059 40240 128074 -71789 -221899 -248606 87874 -140265 110837
10527 269739 9848 -36164 79126 -264287 19007 212767 -9751 -167719 -95031 -183282 -139508
10516 -139508 -167048 141105 -32693 -332281 233470 151651 -37665 -238085 -5856 -66055 -179636
10505 -179636 263653 -104200 106995 202032 -178263 111556 -73633 -145916 -158051 -34822
10494 16297 -274861 -245066 109857 125950 -112644 -28092 -26335 -261985 108207 41441 55821
10483 55821 196586 293581 30022 134548 -67278 360814 13570 -144647 40907 -304487 -66261
10471 127300 -246583 294745 520844 47990 308022 381788 395459 392794 294359 -127084 112828
10459 223676 -7112 202585 8881 -189530 91315 39671 -188407 -244898 44758 -28537 -156114
10448a56114m25759K33614i490A28792c14107I653c509j02458a8199l57570a47671
10436C7789J21313A0069J79531H9547b55728J18440n8969R129A5281O4754a36568
10424b02257a4925k28504A03438d32389b2193k83430L9923C8945F773c40579j15421
10413d56000f1406j79564h1617q8241j19946a30712D9233c0017G8131J50281i5928
10401b93058c0294B19394b05694i2997k2911G386P1092a95067j71449a56075B69533
10389B4502J63556C042R2121a29294D0201K13584e2270q1944A21891J99221D8401
10377I6362J17698c615D053K13653p4599B8428b09580A14864j7128L12235j02862
10366C07109H0781a66292E05625k04687J24563A30115l8936R2628M589Q4801I4309
$$ plain form
10448 -156114 -581873 -348259 -9490 128792 -314107 9653 -3509 -105967 -18199 -375769 -147671
10436 37789 159102 10069 189600 89547 -255728 -137288 -196257 -187128 15281 80035 -136568
10424 -202257 -14925 -243429 103438 -432389 -22193 -305623 -265700 38945 6773 -340579 -456000
10413 -456000 -61406 -240970 -81617 -169858 -289804 -130712 49233 -30017 78131 228412 -95928
10401 -293058 -30294 219394 -205694 -92997 -115908 7386 78478 -195067 -366516 -156075 269533
10389 24502 188058 3042 95163 -129294 40201 253785 -52270 -134214 121891 321112 48401
10377 96362 214060 -3615 4053 217706 143107 28428 -209580 114864 97736 409971 307109
10366 307109 80781 -166292 505625 300938 425501 130115 91179 183807 188396 273197 94309
10354C26170J29187p0737J69520B69136j14740F3308K33500o6007m5949J01303
10344B86155J34231A51593b255B94609J73750D5174K42929A18806M31289B64124
10333B39930K35868j74062j32902J28849J31796o7538j51750L8166e8899C5059
10322A57546c8255B84453n2761l9380B0208J80396C5060e0675C658L1499a33397
10310B78506B3123H250M34871j18683g8238D0750C716J34788P9935H3391L89777
10299D73168A74106J88694F2930R2922a43571H4608a05764C4508P3746a12392
10288f3042C7501J85939a66653F3873A682J18580b34387A51242O2856L2806j03876
10277A43028b166p9872D5774a43446K2548l31402a04667K2845b6248l93j19066
$$ plain form
10354 326170 455357 384620 554140 269136 154396 63308 296808 230801 184852 286155
10344 286155 420386 151593 -2255 294609 468359 45174 288103 118806 550095 264124
10333 239930 475798 301736 168834 297683 429479 361941 210191 248357 -58899 35059
10322 157546 -38255 284453 231692 192312 20208 200604 35060 -50675 3658 35157 -133397
10310 278506 23123 8250 443121 324438 -78238 40750 3716 138504 218439 83391 473168
10299 473168 174106 362800 62930 155852 -143571 84608 -105764 34508 108254 -112392
10288 -63042 37501 223440 -166653 63873 1682 120262 -234387 151242 214098 246904 143028
10277 143028 -2166 -82038 45774 -143446 -120898 -452300 -104667 -81822 -26248 -26641 -145707
10266a45707j6022e97A0221J40476a49116K5106l13861A7123b3767j4912B63580
10254c8872k30904A44305p375D7171r828N7595N0534a11754D21044B5053J64740
10243A89793N1136N3864j00639a98135P6605A60419a48354e380k7857A86262E3009
10231A90106a1297k83066d139c97l1805A16057b8175R180A40634b50400e0012
10219C2124M4117P2530k4653b18904I6042f0987b2029B14064k5923K4512a60952
10207B7551i9114j92061o0510A17036a38281R320C9522i5294D6408f1933l32830
10196c94763i1180l2773A44816d29499I328M3989c8488l13606c452k76334A99320
10184B8152a55735b5229j97323B8645N287Q4430a33305p9000K0475L7675A51583
$$ plain form
10266 -145707 -161729 -597 10221 150697 -149116 -124010 -437871 17123 -23767 -38679 263580
10254 -38872 -269776 144305 136930 47171 37343 94938 145472 -111754 421044 25053 189793
10243 189793 240929 294793 194154 -198135 -121530 160419 -148354 -5380 -33237 186262 53009
10231 190106 -11297 -294363 -4139 -397 -32202 116057 -28175 -18995 140634 -250400 -50012
10219 32124 76241 148771 124118 -218904 96042 -60987 -22029 214064 188141 212653 -160952
10207 27551 -99114 -291175 -351685 117036 -138281 -128961 39522 -95294 46408 -61933 -394763
10196 -394763 -91180 -123953 144816 -429499 9328 53317 -38488 -352094 -3452 -279786 199320
10184 28152 -155735 -25229 -222552 28645 33932 118362 -133305 -212305 -191830 -154155 151583
10172I4670g7669L0432A49043d5578r2213A08394C4038c24485D0173b11656i4179
10160b77210A68174b8701D8097b38299N4551j83955L6903e3165l92642A07530
10149i5942k57486a28042B700h1916j83760F6042e6436A05293A7017b66850j37992
10138d04842B05592B1923a55813K4509j63926a3390j21203N265B47884a0563F3195
10126a05009b3520G3078f0259r5491A52908h7682L8538m60527a50539H4311d02542
10114i5461L5179A02666J3483a43669E1121e7403j4294k17111c0693A92618n7924
10103A34694h669j14892b5776j62835A84085b16256F713N1075a55430m2969A58778
10091e00393i4105a533j91637m7892J04709q3789A6749a50188C25377E9067K10180
$$ plain form
10172 94670 -77669 -47237 149043 -45578 -137791 108394 34038 -324485 40173 -211656 -94179
10160 -277210 168174 -28701 48097 -238299 -183748 -367703 -330800 -53165 -445807 107530
10149 -95942 -353428 -128042 2700 -81916 -265676 66042 -56436 105293 17017 -266850 -404842
10138 -404842 205592 21923 -155813 -131304 -295230 -13390 -134593 -129328 247884 -10563 63195
10126 -105009 -23520 73078 -60259 -155750 152908 -87682 -49144 -509671 -150539 84311 -402542
10114 -95461 -60282 102666 116149 -143669 51121 -57403 -71697 -288808 -30693 192618 134694
10103 134694 -8669 -123561 -25776 -188611 184085 -216256 6713 57788 -155430 -198399 158778
10091 -500393 -94105 -1533 -193170 -241062 -136353 -220142 16749 -150188 325377 59067 269247
10080B69247c92964a77679f5363F9818K2271j4719c01720C82778a52317O1642
10070i0675D779c32706a01391r0978A559b21416O3591K6968d1374k52134J18114
10059a75394A23530G156a60703L9672M1167G0980a11734h453B88351j06716H8047
10047a15814q3978m2440d7382A27082h6433A43931c25431a1473A35070N4104a66334
10035A43022e1152A11740J53390a44422k34069h95B63422j13768m7853a08140
10024i0633o5704j11202J07167J0332f6591B25766b53303I5213g9315n038p518
10013i1871C7402a7744A47659K57714c04910B7782P8007a21088j09214b7749k22192
10002b49941A94117c6510k11399B68888c08446I7768d3343n8968A1176M7082a34470
$$ plain form
10080 269247 -392964 -177679 -65363 69818 92089 77370 -301720 382778 -152317 -90675
10070 -90675 4779 -332706 -101391 -192369 1559 -221416 -157825 -130857 -41374 -293508 -175394
10059 -175394 123530 7156 -160703 -121031 -79864 70980 -111734 -8453 288351 181635 88047
10047 -115814 -199792 -242232 -47382 127082 -86433 143931 -325431 -11473 135070 189174 -166334
10035 143022 -51152 111740 265130 -144422 -378491 -895 263422 149654 101801 -108140
10024 -90633 -156337 -267539 -160372 -150040 -66591 225766 -253303 95213 -79315 -84353 -91871
10013 -91871 37402 -17744 147659 405373 -304910 27782 105789 -121088 -230302 -27749 -249941
10002 -249941 194117 -36510 -247909 268888 -308446 97768 -43343 -102311 11176 58258 -134470
9990a35339A03327b24611A24197a32428F7549c4910L40p8372A42306D094b38922
9978C20934A07242B821a24180k71644a39311C83631b31789j6585j6643H260K99320
9967C07580i0920B9474R4007A368b42474B6373b8835J3972r899A25156B9051L7836
9955F6887K07472I7149L4930b64309L8076b0778B03163C3185g9192B37293e8167
9943a28919m17374e8133I7527a52681N4344c9909j34238H2925C2256J2641J29852
9932A74749A592a73432A68357N1184c49761G354J48273C3445d10428E8694c5465
9920a54467J4098m287H382b3907E4506M434k9255b82586D808J03135J47569E6961
9907i2724A40861b14086J0264K7825l7888M2630K195e1221B30237H9372c15448
$$ plain form
9990 -135339 103327 -224611 124197 -132428 67549 -34910 -34570 -112942 142306 4094 -238922
9978 320934 107242 2821 -124180 -395824 -139311 383631 -231789 -248374 -265017 8260 307580
9967 307580 -90920 29474 123481 1368 -242474 26373 -28835 -14863 -24762 125156 29051 66887
9955 66887 274359 97149 132079 -264309 -226233 -20778 203163 33185 -79192 237293 -58167
9943 -128919 -546293 -58133 97527 -152681 -98337 -39909 -174147 82925 32256 44897 174749
9932 174749 1592 -173432 168357 219541 -349761 7354 155627 33445 -410428 58694 -35465
9920 -154467 -140369 -144656 8382 -23907 54506 58940 29685 -282586 4808 107943 255512 56961
9907 -92724 140861 -214086 -203822 -175997 -213885 -171255 -169060 -51221 230237 89372 -315448
9895a00513k88214b2358d075B14223c07437a25787k01871A8351a16403a5018o7981
9884h2999k63213L4974K6061D2705K8437e7962a8597B05871n9214a08353k8556
9873a36909F7447a64441B22757d8329m801A1868Q8702a47146B01720a03434j06465
9862b09899p1784E1660M0281A3371L568a1863I0816c2661j1602C1738K39094e43867
9849A42700b97055D1423J3382J11048b87668d6881j39950i906j24499C1148J95128
9838B26276a26927M57J5947r2232K7132A97326a52336j55897J23030l3918Q7268
9827a31853E6468J61535a27427k49141J39733B64883d43887d7649k13937C1416
9816B00817a86080j06481A0355b23281e001A82518a18999c6090D8642a18634I302
$$ plain form
9895 -100513 -388727 -22358 -4075 214223 -307437 -125787 -327658 18351 -116403 -15018 -82999
9884 -82999 -346212 -311238 -285177 42705 71142 -57962 -18597 205871 146657 -108353 -136909
9873 -136909 67447 -164441 222757 -48329 -53130 11868 100570 -147146 201720 -103434 -209899
9862 -209899 -281683 51660 91941 13371 16939 -11863 90816 -32661 -44263 31738 270832 -543867
9849 142700 -297055 41423 54805 165853 -287668 -46881 -186831 -9906 -134405 31148 226276
9838 226276 -126927 -126470 -110523 -202755 -175623 197326 -152336 -308233 -185203 -219121 -131853
9827 -131853 56468 218003 -127427 -376568 -236835 264883 -443887 -47649 -261586 31416
9816 200817 -186080 -292561 10355 -223281 -5001 182518 -118999 -36090 48642 -118634 9302
9804a77067O1026p1180A74753f9106k88629g2984K5295l31043a48504p0419I056
9792a06474k3541r657J5935b1623K718n0521A34670n8062h2770j70122A1351d52
9779h9274F219a26386N3317q8884P5310m9943O6274k1270B4985Q7750h4657l0201
9767a14858A2238g918m521j91947l8668J15080e9647a6608J349k30213G3082J68839
9755B41921b06298B4973i9666A73518a30894E1710b08047B37876J24071A23112
9744C7501O3730b1665A18187b73728A42351a61424F663b7832j5820j72307N6424
9733a59535H0398b42047l28927H5116c63890a73448c2015H6473b28317a13676
9722A24478g4969n6766q8530R102H2976M1563a31398E5586b85890Q5455j27596
$$ plain form
9804 -177067 -116041 -187221 174753 -69106 -357735 -72984 -47689 -378732 -148504 -218923 9056
9792 -106474 -130015 -139672 -123737 -21623 -18905 -69426 134670 76608 -82770 -252892 11351 -452
9779 -89274 6219 -126386 -73069 -161953 -86643 -136586 -70312 -91582 24985 112735 -84657 -114858
9767 -114858 12238 -7918 -12439 -204386 -243054 -127974 -59647 -16608 -15259 -245472 73082 241921
9755 241921 -206298 24973 -99666 173518 -130894 51710 -208047 237876 361947 123112
9744 37501 101231 -21665 118187 -273728 142351 -161424 6663 -27832 -43652 -215959 -159535
9733 -159535 80398 -242047 -570974 85116 -363890 -173448 -32015 86473 -228317 -113676
9722 124478 -74969 -131735 -220265 -211163 82976 124539 -131398 55586 -285890 -200435 -328031
9711c28031O7636C0673a88305A19722J06419E1864a56057A9748J29152a47089
9700a87793h2530h747j33799C2667c7940j41711O5066k01549a40244j8496M5246
9689a13494F688L37384D8783M2147d9728l1623B56345a94501h903k16393O8985
9678a56311L7195G82d74278A6348L7295a35345m684M2213J5932k50888D15355
9666a04470b0991k22169d0023o2278j19457O3247g0760A25067k4010J53247d48529
9654c52468a53779f4572E1472a40250k35A93362b93425G0402b97555A16576C7037
9642G8762g5442J8129m618l63335C42787i0638q0775j32301A10209b00282B93255
9630f356j09571e5226r4728C563b21324A95361L0283a64139I2417a16240C5997
$$ plain form
9711 -328031 -260395 30673 -188305 119722 226141 51864 -156057 19748 148900 -147089
9700 -187793 -82530 -8747 -142546 32667 -37940 -179651 -114585 -316134 -140244 -158740 -113494
9689 -113494 6688 344072 48783 90930 -49728 -81351 256345 -194501 -8903 -225296 -156311
9678 -156311 -119116 782 -474278 16348 53643 -135345 -140029 -97816 -81884 -332772 415355
9666 -104470 -20991 -243160 -40023 -102301 -221758 -158511 -70760 125067 101057 254304 -448529
9654 -352468 -153779 -64572 51472 -140250 -140485 193362 -293425 70402 -297555 116576 37037
9642 78762 -75442 -57313 -61931 -425266 342787 -90638 -171413 -303714 110209 -200282 293255
9630 -6356 -115927 -55226 -149954 3563 -221324 195361 225644 -164139 92417 -116240 35997
9618i0218j113H6465c5412j14901C8259J15007J3516g5265r5476l22488K24622
9607b68607P0205P4032n8082j20494A24729a10618p3699B76541r5037a79127l55940
9596e35067A17049a31828e0978B25489b33740o3671g7999A63339a35752o7059
9586b02811N7604G2952l2703M6072b1428m43149A43578h7974a0858j74053B8333
9574A23729b20325B54b8892A61515K5095b20546b0824k41559Q137A79307A4717
9562A59017a59993E8291A6127e1939p3511R087o2793N3962j20317F0968Q1781
9551A42749N2655n8038J8992a5949j59809j69534B0827a33145B27644b81483a0261
9539G670a01712A56322f4023J9287p4746b0242r2819l5755l6210A62351B2778
$$ plain form
9618 -90218 -91331 86465 -35412 -150313 38259 153266 166782 -75265 -170741 -493229 -268607
9607 -268607 -198402 -124370 -182452 -302946 124729 -110618 -184317 276541 181504 -179127 -535067
9596 -535067 117049 -131828 -50978 225489 -233740 -297411 -77999 163339 -135752 -202811
9586 -202811 -145207 72952 40249 86321 -21428 -464577 143578 -87974 -10858 -184911 28333
9574 123729 -220325 254 -28892 161515 186610 -220546 -20824 -262383 -254246 179307 14717
9562 159017 -159993 58291 16127 -51939 -125450 -116363 -179156 -125194 -245511 60968 142749
9551 142749 195404 137366 156358 -15949 -175758 -345292 20827 -133145 227644 -281483 -10261
9539 7670 -101712 156322 -64023 -44736 -119482 -20242 -113061 -148816 -185026 162351 22778
9527c9637Q407m1864F3752c8849j29010k5327D1331J484a15585E3744a99372O4165
9515a35207k1929O3162I6679a87702A19021i9395j03761B44287a33711H8671O2600
9504A51271F0330g5207j9093a4835A42578a24442G5189b543p0056m0174A58504
9492a88965L8002l19420F6332b11058d7738m4689j17828k8571A17319a5736H8219
9480a76819L3379r5766O4117E4987A6153L16411a48443b0199j86464C1333a65942
9468A6462a45306K4611A05481a44962j14362c7721H7159a93456g8609L119B02183
9456A03794a55324n3272A22269c31617a36331B6329a89036C55851d44367J69777
9446b74590C8644a61364A23102c19760A39611b29882C284J4088N1749g894j55381
$$ plain form
9527 -39637 -31230 -73094 63752 -38849 -167859 -193186 41331 42815 -115585 53744 -199372 -135207
9515 -135207 -157136 -93974 96679 -187702 119021 -99395 -203156 244287 -133711 88671 151271
9504 151271 60330 -75207 -94300 -14835 142578 -124442 75189 -2543 -72599 -112773 158504
9492 -188965 -150963 -470383 66332 -211058 -47738 -92427 -210255 -238826 117319 -15736 88219
9480 -176819 -143440 -239206 -175089 54987 16153 332564 -148443 -20199 -206663 31333 -165942
9468 16462 -145306 -120695 105481 -144962 -259324 -37721 87159 -193456 -78609 -75490 202183
9456 103794 -155324 -208596 122269 -331617 -136331 26329 -189036 355851 -444367 -274590
9446 -274590 38644 -161364 123102 -319760 139611 -229882 3284 17372 69121 -7894 -163275
9435a63275c9765l92367J52344a30168a5056l48459J17692J6587G0425e5563k76033
9424c31596B12927h9243o6809I5301a28524q4733J8866R3996G3017b14623r2931
9413c07554g4287j60474G3475a4707j49954j52550B0973h3896a575A13456h410
9401d89483A90462o3970a11835l4929p5365A00178M0537L6040b45686g1695A63169
9389g2423C14556j10588a2860E3511A6348O3770J66153p9818L3778h075k15262
9378b23337g8174k1512H2101a31609m8170b5246j56521l3835A61345a93567A54057
9366D3774d3929D45628g3110A29435l2635a49534k34332H4903e5281m0910H3032
9354a90317b1537J222C844b48235F0613O7498a08073E3455d1877G6753c8378k98796
$$ plain form
9435 -163275 -39765 -432132 -279788 -130168 -15056 -363515 -245823 -229236 70425 -55563 -331596
9424 -331596 212927 -89243 -156052 95301 -128524 -213257 -194391 -100395 73017 -214623 -307554
9413 -307554 -74287 -234761 73475 -14707 -164661 -317211 20973 -83896 -1575 113456 -8410
9401 -489483 190462 126492 -111835 -146764 -222129 100178 140715 176755 -245686 -71695 163169
9389 -72423 314556 203968 -12860 53511 16348 80118 246271 166453 200231 -8075 -223337
9378 -223337 -78174 -99686 82101 -131609 -179779 -25246 -181767 -215602 161345 -193567 154057
9366 43774 -43929 445628 -73110 129435 96800 -149534 -383866 84903 -55281 -96191 83032
9354 -190317 -21537 -20315 3844 -248235 60613 128111 -108073 53455 -41877 76753 -38378 -337174
9342c37174H0769b98089D71723c16576a21248k22000B1082o038c85507G330g6345
9330a95614j01562F5556f115A6003i1994B63546b05605k733C63464A55336b10018
9318A05577e6785o2901A64611a68581F320J00187N5669k5994g6404B28061K5571
9307B53632k0774k3222i7669I8941l8116b26115B19582d4694i734B7199d53243
9295B2415P5869a16715A70299b5178A40683a26781N8083E431a88857e2979q7825
9284a40804b9879A27813b35245a1527j78454M4984n5290r7810a28845M9039K8438
9273e1368j09857A9532M2931b56068D2669a87271k04830a71581A208K9261D259
9261A62974a9113A96700a78880d5386k11817a05079l767C62908f3155A09221d4382
$$ plain form
9342 -337174 80769 -298089 471723 -316576 -121248 -343248 21082 15044 -385507 7330 -76345
9330 -195614 -297176 65556 -6115 16003 -91994 263546 -205605 -208338 363464 155336 -210018
9318 105577 -56785 -119686 164611 -168581 6320 106507 162176 136182 -76404 228061 253632
9307 253632 232858 209636 -97669 98941 60825 -226115 219582 -44694 -9734 27199 -453243
9295 22415 98284 -116715 170299 -25178 140683 -126781 -68698 5431 -188857 -52979 -140804
9284 -140804 -29879 127813 -235245 -11527 -189981 -144997 -200287 -298097 -128845 -79806 -51368
9273 -51368 -161225 19532 62463 -256068 42669 -187271 -392101 -171581 1208 30469 4259
9261 162974 -19113 196700 -178880 -45386 -257203 -105079 -108846 362908 -63155 109221 -44382
9249i538A03869a52261A57704C7876g5433r9416k5291e7781H9245j8450O6927
9238A37722b88788A77769b4678c601j13552A88920a07791k4424q4881K8441B72752
9226b81462J39068B18514d5496k60597f0866H576i1173j78757B22862e811F4171
9214e6908D7665P1073a57515G3280a63294D3718c22896d0887j19145e124A50460
9202e3874l11012i6514B78750j01411f8094j2339k46406A24345A80c38097a5131
9190c29563a14583j86231r0340J90994C7897e1324G5979a25638b2185j1518J170
9179c2533A6398b27070B15608A2638J03308b43148a11689p7934q5527p933K5095
9168b57988i6664j20636B99439b39325A95902b06253H9564e3067p1574A77680
$$ plain form
9249 -9538 103869 -152261 157704 37876 -75433 -174849 -200140 -57781 89245 70795 137722
9238 137722 -288788 177769 -24678 -3601 -117153 188920 -107791 -132215 -217096 -188655 272752
9226 -281462 -142394 218514 -45496 -306093 -60866 8576 -91173 -269930 222862 -5811 64171
9214 -56908 47665 118738 -157515 73280 -163294 43718 -322896 -40887 -160032 -5124 150460
9202 -53874 -364886 -96514 278750 177339 -68094 -80433 -326839 124345 180 -338097 -15131
9190 -329563 -114583 -300814 -391154 -200160 37897 -51324 75979 -125638 -22185 -33703 -32533
9179 -32533 16398 -227070 215608 12638 115946 -243148 -111689 -189623 -275150 -283083 -257988
9168 -257988 -96664 -217300 299439 -239325 195902 -206253 89564 -53067 -124641 177680
9157G9635a33009l7366Q4327A88836a36968F9577b4256G186d38480a9305c332
9145c8424k11455r8596F2121I998a53854r0950A61224b00559G888b90265A28029
9133f1211l63376K04067A17444K28541r8703K72715c0865j65925d0516r6653j18157
9122b55326M7809C04271b87066g4440b0928k18590P1700A46983c28418f3229A5105
9110D6435i6502H653K58893D1387b65936i9011j62423i9436k48583J69685k5296
9099b03630O7706K1012J6429A09790C7660j8016g5045o2533A28454P3477a48621
9087A68948a65215D1831a70051j23713A39867J64001b75639a14790j76931h1229
9076A13009e3960n64050b53641a3938H2459c1196B48528A8126O2224a14446A72441
$$ plain form
9157 79635 -133009 -170375 -86048 188836 -136968 69577 -24256 7186 -438480 -19305 -3332
9145 -38424 -249879 -348475 62121 9998 -153854 -244804 161224 -200559 7888 -290265 128029
9133 -61211 -424587 -220520 117444 345985 247282 519997 -30865 -196790 -40516 -137169 -255326
9122 -255326 -207517 304271 -287066 -74440 -20928 -239518 -167818 146983 -328418 -63229 15105
9110 46435 -96502 8653 267546 41387 -265936 -99011 -261434 -99436 -348019 -178334 -203630
9099 -203630 -135924 -114912 -98483 109790 37660 19644 -75045 -137578 128454 201931 -148621
9087 168948 -165215 41831 -170051 -293764 139867 303868 -275639 -114790 -291721 -81229
9076 113009 -53960 -618010 -253641 -13938 82459 -31196 248528 18126 80350 -114446 172441
9064A93661H3455J0550m2529b95667e9689k6313K6953n7387A16383c3231j69563
9053b02794K4567D8508j8590i7215j21432d136r9499J8336A64918a01697C72298
9041A08308g3190j26891B47421A9700a8751p7488m0118l07315D5100d01436a01441
9029a07992N2659k87151d2628a2504j42842f5155C0604R7200D908a2871G0042
9017b45984B45458b4622p3927E694M3443h6356d2865k11669J08684j54352H634
9005a87982K9361C45521c5669j98428L9708m0684q136e0595d142A05157n2075
8994E3082c59637a46200B50969a34519j60846H8957N4164j6901b11150A7351J15548
8983A32899a75899c9182B06602e6941q2863b4661k49949e3719l79656A10230b09112
$$ plain form
9064 193661 83455 94005 51476 -295667 -59689 -86002 -59049 -116436 116383 -33231 -202794
9053 -202794 -178227 48508 29918 -97215 -218647 -4136 -103635 -85299 164918 -101697 372298
9041 108308 -73190 -200081 247421 19700 -18751 -96239 -136357 -443672 45100 -401436 -101441
9029 -107992 -55333 -342484 -42628 -12504 -155346 -65155 30604 127804 4908 -12871 70042
9017 -245984 245458 -24622 -98549 5694 49137 -86356 -42865 -254534 -145850 -300202 8634
9005 -187982 -158621 345521 -35669 -234097 -194389 -235073 -243209 -50595 -4142 105157 53082
8994 53082 -359637 -146200 250969 -134519 -295365 88957 143121 126220 -211150 17351 132899
8983 132899 -175899 -39182 206602 -56941 -139804 -24661 -274610 -53719 -433375 110230 -209112
8971a38444c9118a9487l04879A8708h5269K6648b4310B98845e40009a67440c5401
8959H7230a8362A2790K36754E639h6790j87253B3452a00818j9269j18516Q5049
8948a53554B47530b71040k7371B28608A10456a43581e6139r0154c0082B8495e6056
8936b94180h4958E7297M6692L8093b84025B5737a23683D3805d6087b644E2828
8924d5779C2069C868C96a25783D07248j06565o2389J78496a17767A93763d5564
8912A59984L15231R0284J69390O50954J081852J862659N265769l133069l064248
8903C398806A679901o87364j51470o9941k80813H7739K5367J60650j1383a12890
8892D18394j72906n5863r1328a58176C62790j22266E3659a14028I3534J57839
$$ plain form
8971 -138444 -39118 -19487 -324366 18708 -85269 -58621 -24310 298845 -540009 -167440 -35401
8959 87230 -18362 12790 249544 5639 -86790 -274043 23452 -100818 -120087 -238603 -153554
8948 -153554 247530 -271040 -298411 228608 110456 -143581 -56139 -146293 -30082 28495 -56056
8936 -294180 -84958 57297 103989 142082 -284025 25737 -123683 43805 -46087 -2644 52828
8924 -45779 32069 3868 396 -125783 407248 300683 238294 416790 -117767 193763 -45564
8912 159984 475215 565499 734889 1385843 2467695 4330354 9596123 6463054 3398806
8903 3398806 1679901 992537 841067 771126 490313 87739 113106 273756 262373 -112890
8892 418394 245488 189625 98297 -158176 362790 240524 53659 -114028 93534 251373
8882B51373a0911q260l77400b6951k56624C647J8232g1005B44520a03278F0841
8870f54392A017O9824a00393j02873c8357C26633j62258b4204q307a3845k5711
8859c9556j8746a2156B22449a09998p4960c7568o7560A12117c12606B4384a4436
8847I719N3126L93183a41838k9051L1177B88343L4581a09063d1351A5586J12786
8836A28372a57321j21436b992j15174d5524l4216o5518j8742A6393a51625f3976
$$ plain form
8882 251373 -10911 -19171 -396571 -26951 -283575 3647 21879 -71005 244520 -103278 60841
8870 -654392 1017 70841 -100393 -203266 -38357 326633 164375 -24204 -32511 -13845 -39556
8859 -39556 -58302 -12156 222449 -109998 -184958 -37568 -105128 112117 -312606 24384 -14436
8847 9719 62845 456028 -141838 -170889 -139712 288343 322924 -109063 -41351 15586 128372
8836 128372 -157321 -278757 -2992 -118166 -45524 -79740 -145258 -164000 16393 -151625 -63976
$$ [...]
##END NTUPLES=NMR SPECTRUM
##END=
