
##TITLE=AC1010_S-036_6278901_wlBVcdretO
##JCAMPDX= 6.0         $$ Bruker NMR JCAMP-DX V2.0
##DATA TYPE= NMR SPECTRUM
##DATA CLASS= NTUPLES
##ORIGIN= BRUKER
##OWNER= Administrator
$$ 1.72 TOPSPIN		Version 2.1
$$ 2012-06-03 11:59:06.046 -0500  Administrator@TOPSPIN
$$ Compression mode = diff/dup
##.OBSERVE FREQUENCY= 400.13188235
##.OBSERVE NUCLEUS= ^1H
##.ACQUISITION MODE= SIMULTANEOUS (DQD)
##.ACQUISITION SCHEME= undefined
##.AVERAGES= 64
##.DIGITISER RES= 22
##SPECTROMETER/DATA SYSTEM= spect
##.PULSE SEQUENCE= noesygpps1d.comp
##.SOLVENT NAME= COFFEE_meoh
##.SHIFT REFERENCE= INTERNAL, COFFEE_meoh, 1, 14.96669
##AUDIT TRAIL= $$ (NUMBER, WHEN, WHO, WHERE, PROCESS, VERSION, WHAT)
$$ ##TITLE= Audit trail, TOPSPIN		Version 2.1
$$ ##JCAMPDX= 5.01
$$ ##ORIGIN= Bruker BioSpin GmbH
$$ ##OWNER= Administrator
$$ $$ C:\Bruker\TOPSPIN/data/COFFEE/nmr/AC1010_S-036_6278901_wlBVcdretO/12/pdata/1/auditp.txt
$$ ##AUDIT TRAIL=  $$ (NUMBER, WHEN, WHO, WHERE, PROCESS, VERSION, WHAT)
(   1,<2012-06-03 11:59:00.968 -0500>,<Administrator>,<TOPSPIN>,<go>,<TOPSPIN 2.1>,
      <created by zg
	started at 2012-06-03 11:47:30.390 -0500,
	POWCHK enabled, PULCHK disabled,
       configuration hash MD5:
       D5 CA 7A 23 FE 6B EE E2 50 67 74 61 24 F7 5E 3B
       data hash MD5: 64K
       12 6A 6C 18 08 84 7C E6 AD 6F 7A 9D C1 9D 30 DB>)
(   2,<2012-06-03 11:59:03.734 -0500>,<Administrator>,<TOPSPIN>,<proc1d>,<TOPSPIN 2.1>,
      <Start of raw data processing
       efp LB = 0.3 FT_mod = 6 PKNL = 1 PHC0 = 0 PHC1 = 0 SI = 128K 
       data hash MD5: 128K
       D5 62 22 A2 99 3A 56 42 DE A6 8A 51 CC C3 03 EE>)
(   3,<2012-06-03 11:59:05.015 -0500>,<Administrator>,<TOPSPIN>,<proc1d>,<TOPSPIN 2.1>,
      <pk PHC0 = 29.70154 PHC1 = 0 
       data hash MD5: 128K
       34 8E 28 8D 1A 81 C3 C6 B1 65 9E BB F7 FF 17 24>)
(   4,<2012-06-03 11:59:05.703 -0500>,<Administrator>,<TOPSPIN>,<proc1d>,<TOPSPIN 2.1>,
      <abs ABSG = 1 
       data hash MD5: 128K
       62 99 44 75 EF 80 B2 D3 63 50 B0 E2 83 49 B0 51>)
(   5,<2012-06-03 11:59:05.781 -0500>,<Administrator>,<TOPSPIN>,<proc1d>,<TOPSPIN 2.1>,
      <abs ABSG = 2 
       data hash MD5: 128K
       3C 96 D2 0D D1 2E B6 36 B9 1E 41 EE B1 1E 03 8E>)
(   6,<2012-06-03 11:59:05.843 -0500>,<Administrator>,<TOPSPIN>,<proc1d>,<TOPSPIN 2.1>,
      <abs ABSG = 3 
       data hash MD5: 128K
       19 B2 2F 36 B9 AF AC AD 42 5D F1 87 61 DA 92 D8>)
(   7,<2012-06-03 11:59:05.890 -0500>,<Administrator>,<TOPSPIN>,<proc1d>,<TOPSPIN 2.1>,
      <abs ABSG = 4 
       data hash MD5: 128K
       8E F9 DA AF DF C6 0A 28 AA FA B2 54 BC 30 EE F2>)
(   8,<2012-06-03 11:59:05.953 -0500>,<Administrator>,<TOPSPIN>,<proc1d>,<TOPSPIN 2.1>,
      <abs ABSG = 5 
       data hash MD5: 128K
       73 C0 34 09 03 1B 84 ED 97 07 61 81 43 3D 40 EE>)
$$ ##END=
$$ 
$$ $$ hash MD5
$$ $$ FD DB BA CF 85 3D D7 23 96 B9 41 51 D3 11 E4 CF
##$RELAX= 
##$RELAX= 
##$RELAX= 
##$RELAX= 
##$RELAX= 
##$RELAX= 
##$RELAX= 
##$RELAX= 
$$ Bruker specific parameters
$$ [...]
##$TP07= 0
##$TPNAME0= <>
##$TPNAME1= <>
##$TPNAME2= <>
##$TPNAME3= <>
##$TPNAME4= <>
##$TPNAME5= <>
##$TPNAME6= <>
##$TPNAME7= <>
##$TPOAL= (0..7)
0.5 0.5 0.5 0.5 0.5 0.5 0.5 0.5
##$TPOFFS= (0..7)
0 0 0 0 0 0 0 0
##$TUNHIN= 0
##$TUNHOUT= 0
##$TUNXOUT= 0
##$USERA1= <user>
##$USERA2= <user>
##$USERA3= <user>
##$USERA4= <user>
##$USERA5= <user>
##$V9= 5
##$VALIST= <valist>
##$VCLIST= <CCCCCCCCCCCCCCC>
##$VD= 0
##$VDLIST= <DDDDDDDDDDDDDDD>
##$VPLIST= <PPPPPPPPPPPPPPP>
##$VTLIST= <TTTTTTTTTTTTTTT>
##$WBST= 2048
##$WBSW= 25
##$XGAIN= (0..3)
0 0 0 0
##$XL= 0
##$YL= 0
##$YMAX_a= 10462548
##$YMIN_a= -6563969
##$ZGOPTNS= <>
##$ZL1= 120
##$ZL2= 120
##$ZL3= 120
##$ZL4= 120
##$ABSF1= 14.96669
##$ABSF2= -5.58584
##$ABSG= 5
##$ABSL= 3
##$ALPHA= 0
##$AQORDER= 0
##$ASSFAC= 0
##$ASSFACI= 0
##$ASSFACX= 0
##$ASSWID= 0
##$AUNMP= <proc_prof1d_extract.lims>
##$AXLEFT= 0
##$AXNAME= <>
##$AXNUC= <1H>
##$AXRIGHT= 0
##$AXTYPE= 0
##$AXUNIT= <>
##$AZFE= 0.1
##$AZFW= 0.1
##$BCFW= 0
##$BC_mod= 0
##$BYTORDP= 0
##$COROFFS= 0
##$CY= 15
##$DATMOD= 1
##$DC= 0
##$DFILT= <>
##$DTYPP= 0
##$F1P= 0
##$F2P= 0
##$FCOR= 0.5
##$FTSIZE= 131072
##$FT_mod= 6
##$GAMMA= 0
##$GB= 0
##$INTBC= 1
##$INTSCL= 1
##$ISEN= 128
##$LB= 0.3
##$LEV0= 0
##$LPBIN= 0
##$MAXI= 10000
##$MC2= 0
##$MEAN= 0
##$ME_mod= 0
##$MI= 0
##$NCOEF= 0
##$NC_proc= -3
##$NLEV= 6
##$NOISF1= 0
##$NOISF2= 0
##$NSP= 0
##$NTH_PI= 0
##$NZP= 0
##$OFFSET= 14.96669
##$PC= 1
##$PHC0= 29.70154
##$PHC1= 0
##$PH_mod= 1
##$PKNL= yes
##$PPARMOD= 0
##$PPDIAG= 0
##$PPIPTYP= 0
##$PPMPNUM= 2147483647
##$PPRESOL= 1
##$PSCAL= 4
##$PSIGN= 0
##$PYNMP= <proc.py>
##$REVERSE= no
##$SF= 400.13000557188
##$SI= 131072
##$SIGF1= 0
##$SIGF2= 0
##$SINO= 400
##$SIOLD= 131072
##$SPECTYP= <>
##$SREGLST= <1H.CDCl3>
##$SSB= 0
##$STSI= 131072
##$STSR= 0
##$SW_p= 8223.68421052632
##$SYMM= 0
##$S_DEV= 0
##$TDeff= 65536
##$TDoff= 0
##$TI= <>
##$TILT= no
##$TM1= 0
##$TM2= 0
##$TOPLEV= 0
##$USERP1= <user>
##$USERP2= <user>
##$USERP3= <user>
##$USERP4= <user>
##$USERP5= <user>
##$WDW= 1
##$XDIM= 131072
##$YMAX_p= 484949205
##$YMIN_p= -462871572
##$CURPLOT= <Network HP LaserJet P1505>
##$CURPRIN= <$Network HP LaserJet P1505>
##$DFORMAT= <normdp>
##$LAYOUT= <+/1D_H.xwp>
##$LFORMAT= <normlp>
##$PFORMAT= <normpl>
##$SURQMSG= 1
$$ End of Bruker specific parameters
$$ ---------------------------------
##NTUPLES= NMR SPECTRUM
##VAR_NAME=  FREQUENCY,     SPECTRUM/REAL,   SPECTRUM/IMAG
##SYMBOL=    X,             R,               I
##VAR_TYPE=  INDEPENDENT,   DEPENDENT,       DEPENDENT
##VAR_FORM=  AFFN,          ASDF,            ASDF
##VAR_DIM=   131072,        131072,          131072
##UNITS=     HZ,            ARBITRARY UNITS, ARBITRARY UNITS
##FACTOR=    0.0627417313425165, 1,          1
##FIRST=     8223.62146879498, 4206,         -98471
##LAST=      0,             4556,            -99690
##MIN=       0,             -462871572,      0
##MAX=       8223.62146879498, 484949205,    0
$$ Real data points
##PAGE= N=1
##DATA TABLE= (X++(R..R)), XYDATA
$$ [...]
64602 538428 542566 543663 541580 537033 531283 525043 518243 510980 503913 497536 491908 487407 484823 484127
64588 484127 484047 483529 483005 483462 484982 487096 490136 495155 502654 512301 523941 537990 554525 572683
64574 572683 591475 610859 631550 653806 676844 699511 721086 740929 757550 769010 774691 776013
64562 776013 774618 770438 762582 751743 740213 729214 717447 702910 685261 665890 646603 628909
64550 628909 613688 600580 588196 575673 563477 552082 540604 527765 513715 499808 486858
64539 486858 474572 462640 451444 441599 433506 427361 422996 419683 416685 413960 411838 410151 408348
64526 408348 406384 404889 404463 405367 407869 412206 418035 424385 430315 435481 440174 445091 450780 456933 462489
64511 462489 466835 470508 474241 477819 480562 482301 482891 481271 476423 469119 461374 454031 446273 437845
64497 437845 430182 424461 419696 414026 407218 400844 396322 393737 392358 391408 390280 388714 386954 385463
64483 385463 384447 383878 383888 384893 387397 391618 396873 401216 402394 399821 395313 391390 389054 387608 386155
64468 386155 384509 382790 380953 379052 377479 376640 376500 376613 376596 376667 377799 381020 386294 392337 397848 402677
64452 402677 407399 412093 416270 419921 423935 429218 435851 443225 450557 457161 462858 468510 475715 485472
64438 485472 497320 510017 522640 534632 545257 553856 560668 566655 572176 576215 577263 574813 569825
64425 569825 563938 558362 553353 548479 543372 538230 533519 529331 525359 521509 518076 515066 511791 507631
64411 507631 502994 498981 496156 494155 492530 491447 491263 491834 492614 493230 493658 494031 494616 495947 498638 502973
64395 502973 508764 515493 522361 528295 532397 534751 536659 539797 545074 552413 561497 572288 584611 597669
64381 597669 610577 623416 637208 652705 669732 688081 708501 732094 758941 788145 819341
64370 819341 853597 892609 937466 988328 1044821 1106488 1173389 1246663 1328178 1419266 1519968
64359 1519968 1629617 1747525 1872514 2001986 2132025 2258456 2377766 2487605 2587085 2676294
64349 2676294 2754665 2819538 2866788 2893060 2897289 2880482 2844880 2793418 2728956 2653068 2565626
64338 2565626 2466101 2355399 2236254 2112014 1985453 1858909 1735180 1617659 1509114 1410254
64328 1410254 1319717 1235772 1158039 1087502 1025027 970225 921903 879275 842340 810993 784035
64317 784035 759394 735501 712441 691634 674379 660660 649157 638106 626186 613073 599566
64306 599566 587032 576326 567101 558240 548976 539467 530341 521998 514566 508424 504295 502466 502007 501331
64292 501331 499929 499275 501505 507231 515050 523128 530699 537964 545230 552517 559450 565116 568501 569604
64278 569604 569795 570492 571707 572417 572092 571186 570238 569258 568025 566382 564111 561176 558333 556819 556950 557422
64262 557422 556543 553960 550696 547672 544741 541264 537101 532653 528160 523413 518221 512808 507471 502052
64248 502052 496108 489631 483329 478007 473841 470275 466531 462154 457261 452402 448074 444451 441676 440209
64234 440209 440387 441634 442682 442787 442372 442310 443113 445035 448317 452766 457601 462403 467963 475637 485969
64219 485969 498299 511295 523358 533036 540052 545928 552802 561475 571136 580800 590168 598957 606263
64206 606263 611155 613506 613916 613000 610952 607648 603186 598541 595369 594670 595791 597294 598554 599693 600047
64191 600047 597799 591590 581814 569956 557251 544399 531955 520379 509868 500419 491883 484084 477372
64178 477372 472872 471154 470646 468705 464859 461755 461853 464165 465611 464849 463192 461997 460914 459121 456904
64163 456904 455158 454061 452905 450769 446923 441162 434360 428337 424455 422377 420594 418225 415971 415205
64149 415205 416287 417980 418756 418632 419262 421921 425895 429554 432654 436423 441277 445757 448467 450056 452244
64134 452244 455640 459759 464718 471295 479295 487500 495938 506831 522150 541057 560851 579789 597715
64121 597715 614322 628310 638574 645102 648222 647806 643692 636282 626222 613996 600180 585552 570595
64108 570595 555436 540631 527408 516468 507033 497750 488233 479203 471469 465468 461518 459698 459451
64095 459451 459902 460587 461489 462550 463665 465000 466705 468464 470000 471868 474996 479450 484377 489107 493449
64080 493449 496866 498494 498438 498111 498626 499591 500166 500519 501209 501606 500244 496945 493589 492306 493496 496074
64064 496074 499137 502745 507268 512784 519323 527103 535997 545098 553498 561540 570699 582003 595115 609190
64050 609190 624056 639959 656667 673487 689908 705464 719145 729812 737416 743263 748908 755287
64038 755287 762931 772364 783833 796948 810873 824714 837754 849529 859640 867301 871402 871427 868025
64025 868025 862015 853211 841064 826235 810342 794053 776602 757628 738387 720476 704256 689267
64013 689267 675502 663406 653075 644252 636850 630939 626448 623335 621727 621499 622080 623013 624219 625363
63999 625363 625638 624765 623655 623492 624675 627198 631324 637013 643372 649771 657060 666407 677166 687360
63985 687360 696498 706605 719760 735445 751077 764667 776326 787415 798905 810623 821696 831321
63973 831321 839084 844756 848189 849533 849266 847894 845780 843226 840245 836341 831278 826358 823903 824757 827042
63958 827042 828188 827521 825806 823019 818060 810590 801712 792656 784019 776546 771328 768505 766653 764201
63944 764201 761026 758274 757189 758406 761692 765860 769483 772135 774538 777309 780216 782949 785829 789218
63930 789218 792925 796771 801157 806476 812584 819530 828246 839629 853338 868349 884412 902092 921628
63917 921628 942711 965328 989870 1016210 1043532 1071372 1100190 1130617 1162784 1196820 1233520
63906 1233520 1274099 1319470 1370065 1426031 1487268 1553412 1624035 1698900 1778163 1862717 1954350
63895 1954350 2055151 2166549 2289244 2424170 2573152 2738497 2922379 3126592 3352166
63886 3352166 3598801 3865378 4151546 4458131 4785039 5129086 5484746 5846709 6210733
63877 6210733 6572183 6925102 7263124 7580235 7870001 8124950 8337861 8503676 8619849
63868 8619849 8685307 8699535 8662284 8573587 8434269 8246900 8016112 7747771 7448227 7124503
63858 7124503 6784229 6434282 6079706 5724654 5374108 5033836 4708783 4402190 4115990
63849 4115990 3851135 3607518 3384570 3182108 3000003 2837091 2691303 2560888 2444576
63840 2444576 2340500 2246235 2160340 2082713 2012697 1947894 1885866 1826371 1770782 1719553 1671171
63829 1671171 1623627 1576209 1529688 1485141 1442815 1402190 1363175 1326843 1294460 1266080 1241015
63818 1241015 1219615 1203279 1192306 1185031 1179899 1177293 1178314 1182794 1189832 1199428 1211916 1226118 1239749
63805 1239749 1251811 1263341 1275619 1288858 1302794 1317162 1331059 1342973 1352204 1359423 1365186 1368749
63793 1368749 1369155 1366814 1362999 1358020 1350807 1340206 1325975 1308498 1288331 1266214 1242896 1218405
63781 1218405 1191865 1162588 1131187 1098982 1066389 1032652 997516 962390 929143 898235 868907
63770 868907 840803 814266 789142 764662 740950 719413 700896 684336 667954 651084 634207
63759 634207 618051 603366 590681 579446 568295 557063 547504 540844 535689 529925 523803 519214 516411
63746 516411 513587 509724 505808 502865 500586 498483 496782 495502 494043 492348 491106 490110 487815 483317
63732 483317 477548 471730 466057 460862 457542 456725 456557 454482 450198 445458 441428 437718 433693 429281 424466
63717 424466 419245 414331 410912 409448 409401 410142 411305 412200 411777 409533 405991 402163 399028 397526 398313 401164
63701 401164 405004 408790 412120 414945 417128 418493 419092 419267 419498 420141 421165 422243 423205 424180 425130 425532
63685 425532 424962 423916 423731 425628 429852 435521 441200 446007 450390 455553 461902 468424 473810 477632 480117
63670 480117 481509 482310 483497 485505 487462 488561 489912 493656 500020 506604 511287 514760 519216 525227
63656 525227 531050 534773 536135 536142 535792 535572 535667 536075 536572 536758 536179 534512 531948 529452 528270 528894 530653
63639 530653 532488 533936 535243 536860 539197 542548 546749 551091 555124 559321 564236 569154 572631 574626
63625 574626 576937 580875 585522 589207 591769 594059 595871 596066 594691 593384 593246 593595 593386 592740 592354 592306
63609 592306 592307 592588 593737 595857 598284 599839 599234 595891 590730 585494 580925 576294 571007 565681 560921
63594 560921 556060 550338 544783 541532 541331 542727 543851 544077 543766 543315 543054 543598 545637 549311 553984 558880
63578 558880 564012 570335 578552 587833 596287 602995 609061 616334 625621 636593 648772 661826 675290
63565 675290 688930 703452 720220 740141 763073 788095 813923 839403 864406 890343 919242
63554 919242 952037 987980 1025704 1064578 1105018 1147765 1192948 1239725 1286941 1334058 1381043
63543 1381043 1427041 1469501 1505022 1531106 1547190 1554538 1555480 1552191 1545709 1536229 1524376 1511470
63531 1511470 1498050 1482835 1463971 1441038 1415170 1387478 1358004 1326148 1291717 1255685 1220104
63520 1220104 1186860 1156228 1127330 1100297 1076897 1058211 1042741 1028184 1014453 1003527 996693
63509 996693 993448 992992 995239 1000150 1007395 1017050 1029514 1044447 1060858 1078475 1097867 1118909 1140449
63496 1140449 1162041 1184800 1209881 1237292 1267050 1300257 1337704 1378207 1419855 1462683 1508822
63485 1508822 1559869 1614905 1670959 1724327 1771154 1807801 1831831 1842943 1842891 1834390 1819985 1801589
63473 1801589 1780622 1758135 1734659 1710259 1685099 1659682 1633852 1605709 1572422 1532621 1487533
63462 1487533 1439470 1389814 1338977 1287651 1237009 1187707 1139644 1093161 1049942 1012017 979898
63451 979898 952203 927293 904865 885493 868910 853616 838410 823528 809679 796590 783434
63440 783434 770458 759160 750607 744284 738818 733299 727754 722991 720166 719869 721207 722269 721848 720391
63426 720391 719029 718251 717916 717998 718636 719696 720950 722702 725646 729756 733611 735348 734494 732584 731503 731310
63410 731310 730273 727135 722549 717842 713278 708529 704116 701048 699243 697749 696495 696385 697424 698412 699269
63395 699269 702137 708918 718646 728554 737132 744982 753303 762896 774440 788348 804101 820581 837311
63382 837311 854778 873638 894296 917211 942741 970523 999806 1030715 1064573 1102619 1144713
63371 1144713 1189358 1234336 1277150 1315661 1349134 1378632 1406078 1433057 1460676 1490025 1522033
63360 1522033 1556820 1593846 1633044 1675488 1722486 1773992 1828117 1882084 1933198 1978847 2016267
63349 2016267 2043229 2059167 2065323 2063637 2055751 2042958 2026549 2007734 1987239 1965054 1940295 1911293
63337 1911293 1876363 1835178 1789469 1741940 1694183 1645694 1595135 1542521 1489916 1439899 1393714
63326 1393714 1351357 1312997 1279179 1249300 1221159 1193286 1167328 1146890 1133922 1127157 1124073 1123374
63314 1123374 1125233 1130209 1138697 1150934 1166853 1186092 1208287 1233112 1260046 1288707 1319417 1352692
63302 1352692 1388125 1424805 1463118 1504944 1551397 1601341 1653016 1706121 1760997 1816315 1869023
63291 1869023 1916541 1957843 1992234 2018152 2033789 2038569 2033713 2021556 2004268 1983022 1958487 1931974
63279 1931974 1905334 1879114 1851481 1819873 1783440 1743100 1699678 1653224 1604273 1554593 1506143
63268 1506143 1459914 1416074 1374641 1335704 1299554 1266973 1238862 1215202 1194831 1176635 1160457
63257 1160457 1146199 1132275 1115837 1094944 1070194 1043939 1018065 992965 968557 945518 924844
63246 924844 906502 889400 872891 857642 844712 834343 825988 818951 812498 805889 798924 792098 785715
63233 785715 779287 772410 765671 759816 754400 748199 740842 733118 725714 718570 711556 704912 698818 693204
63219 693204 688141 683741 679640 675395 671569 669477 669501 670468 671157 671688 672816 674527 676120 677338 678740
63204 678740 681089 684768 689591 694798 699525 703733 708463 714680 722027 729259 735920 743120 752399 763993
63190 763993 776459 788128 798867 810248 823852 839670 856519 873826 892387 913312 936790
63179 936790 962135 988585 1015701 1043395 1071986 1101983 1133463 1165765 1197941 1229372 1259906
63168 1259906 1289840 1320011 1351444 1384405 1417981 1450936 1482824 1514047 1545164 1576605 1608731
63157 1608731 1641444 1673516 1702713 1726877 1744948 1757119 1764206 1766767 1764508 1756512 1742233 1722284
63145 1722284 1698151 1671311 1642839 1613675 1584864 1557433 1532244 1509970 1490983 1475231 1462429
63134 1462429 1452485 1445609 1441931 1441069 1442141 1444261 1447169 1451415 1457837 1466830 1478351 1492581 1510040
63121 1510040 1530628 1552977 1575416 1597420 1619486 1641735 1663529 1684647 1705779 1727129 1747196
63110 1747196 1763902 1776656 1786385 1793576 1797173 1795528 1787611 1773018 1751656 1724095 1691734 1656017
63098 1656017 1617755 1577604 1536689 1496132 1456321 1417338 1379749 1344177 1310281 1277117 1244561
63087 1244561 1213578 1185063 1159371 1137081 1119018 1104862 1092638 1080453 1068244 1057210 1048092
63076 1048092 1040768 1035043 1030935 1028378 1027297 1027692 1029055 1030250 1030869 1032354 1036639 1043744 1051799 1059552
63062 1059552 1067705 1077402 1088325 1098920 1107842 1114670 1119767 1123997 1128180 1132337 1135691 1137626 1138341 1138445
63048 1138445 1138515 1139289 1141569 1145304 1149222 1151869 1152750 1152186 1150779 1149604 1150137 1152892 1156373 1158471 1158893 1159271
63032 1159271 1160852 1163096 1164897 1166172 1167521 1169055 1170490 1172129 1174940 1179545 1185697 1192882 1201077 1210744
63018 1210744 1222285 1235592 1250009 1264765 1279619 1295065 1311818 1330231 1350422 1372644 1397060
63007 1397060 1423252 1450631 1479446 1510668 1544569 1580121 1616580 1655146 1698072 1746171 1798070
62996 1798070 1852164 1908508 1968390 2032693 2101306 2173743 2249625 2328502 2409566 2491598 2573140
62985 2573140 2652995 2730936 2807865 2884962 2962563 3039783 3115125 3187526 3257218 3325605 3393851
62974 3393851 3461282 3525472 3583927 3635125 3677668 3709264 3727433 3731011 3720334 3696245 3659641
62963 3659641 3611788 3554168 3487869 3413806 3333832 3251060 3168735 3089025 3013083 2941939 2877007
62952 2877007 2819765 2771060 2730801 2698565 2674585 2659755 2654374 2657235 2666467 2681106 2701364 2727429
62940 2727429 2758440 2792562 2827805 2863028 2898478 2935020 2972467 3009274 3044438 3078914 3113998
62929 3113998 3148720 3180120 3205938 3225688 3239057 3244812 3241716 3229327 3207303 3174964 3132135 3079429
62917 3079429 3017327 2946255 2868240 2787107 2705848 2624737 2543064 2461731 2382806 2307417 2235560
62906 2235560 2167379 2103098 2042163 1984089 1929877 1880830 1836042 1792887 1750338 1709969 1673020
62895 1673020 1638254 1603888 1570106 1538101 1507699 1477753 1448375 1420843 1395140 1369279 1341820
62884 1341820 1313898 1287859 1264621 1243303 1222946 1203576 1185683 1169594 1155499 1143268 1131899
62873 1131899 1119940 1107182 1095428 1086776 1081228 1076660 1071078 1064245 1057177 1050991 1046516 1044060 1042783
62860 1042783 1040893 1037259 1032572 1028242 1024428 1019921 1013841 1006670 999486 992914 987121 982246 978346 975054
62846 975054 971577 967101 961367 955058 949431 945184 941786 938312 934742 931827 929833 928255 926901 926303
62832 926303 926576 926729 925852 924353 923148 922158 920738 919345 919491 921671 924426 926002 926133 925559 924575 923002
62816 923002 921099 919450 918033 916328 914405 913060 912726 912966 913186 913043 911947 909256 905644 903371 904106
62801 904106 906853 909054 909630 910029 912292 916881 922514 927312 929815 929657 927850 926164 925781 926503 927240 927112
62785 927112 926157 925284 925500 926911 928628 929912 931065 932655 934222 934527 932988 930145 926892 924146 923060
62770 923060 924209 926346 927305 926788 927094 930297 935698 941022 945231 948968 952885 956937 961183 966053 971732
62755 971732 978084 985299 993827 1003554 1013637 1023350 1032819 1042971 1054986 1069400 1085384 1101403 1117095
62742 1117095 1133917 1153114 1173701 1193664 1212872 1233474 1257302 1284065 1312470 1342042 1373276
62731 1373276 1406867 1443546 1484276 1530070 1581756 1640011 1705179 1776828 1854009 1936255 2024054
62720 2024054 2118123 2218444 2324011 2433191 2544303 2656192 2768165 2878946 2985856 3085568
62710 3085568 3175450 3253461 3316979 3362993 3389846 3397952 3388422 3361847 3318802 3260601 3188825 3104867
62698 3104867 3010811 2910090 2806296 2701407 2595866 2490131 2385410 2283012 2183743 2088230
62688 2088230 1997472 1912851 1835489 1765341 1700904 1640290 1582828 1529180 1479801 1434149 1391940
62677 1391940 1354302 1322501 1295846 1272018 1249601 1229406 1213031 1200829 1191650 1184003 1176960 1170246
62665 1170246 1164020 1158759 1155214 1154236 1156309 1161182 1168152 1176892 1187638 1200452 1214832 1230606 1248841
62652 1248841 1271066 1297661 1327665 1360239 1395758 1435405 1480212 1530652 1586567 1647235 1711979
62641 1711979 1781019 1855304 1935183 2019478 2106164 2193800 2282119 2371495 2462060 2553077 2642632
62630 2642632 2727702 2804604 2869725 2920393 2955513 2975248 2979797 2968615 2941260 2898745 2843331
62619 2843331 2777004 2700885 2616378 2525999 2432488 2337624 2242493 2148483 2057290 1970147 1887503
62608 1887503 1809220 1734542 1662373 1592485 1526367 1466055 1411987 1362754 1317057 1275100 1237624
62597 1237624 1204275 1173677 1144991 1118915 1096982 1079835 1065983 1052342 1036534 1018784 1001184
62586 1001184 985076 969870 954667 940091 927558 917233 907802 898306 889324 882087 877143 874261
62574 874261 873069 873257 874357 875745 876858 877253 876673 875327 873999 873554 874226 875494 876722 877821 879233
62559 879233 881343 884093 887345 891509 897465 905708 915765 926685 937955 949750 962511 976683 992820
62546 992820 1011492 1032835 1056349 1081307 1107399 1135020 1164991 1197845 1233273 1270493 1309429
62535 1309429 1351211 1397093 1446940 1499223 1552356 1605455 1657670 1707477 1753056 1793057 1826608
62524 1826608 1852801 1870517 1878767 1877136 1866094 1846991 1821466 1790583 1754601 1713685 1668719 1621304
62512 1621304 1573038 1524832 1476825 1429023 1382168 1337797 1297043 1259509 1223876 1189759 1158380
62501 1158380 1131062 1107528 1086171 1065842 1046908 1030588 1017608 1007679 1000031 994042 989051 983906
62489 983906 977591 970714 965662 964320 965879 967735 968427 968741 969979 972325 975339 979011 983622 989180 995464
62474 995464 1002032 1007879 1011962 1014725 1018379 1025036 1035076 1047785 1062724 1079764 1098696 1119842 1144512
62461 1144512 1173871 1207715 1245062 1285352 1328226 1372982 1419451 1468828 1522242 1578880 1636776
62450 1636776 1695076 1754021 1812979 1870187 1924642 1976650 2026030 2071138 2110203 2142520 2167846
62439 2167846 2185815 2196634 2201464 2201549 2197932 2192551 2188518 2188342 2192457 2200294 2212288 2230230 2256093
62426 2256093 2291061 2335168 2387357 2446256 2511263 2582423 2659151 2739881 2823321 2908979 2995577
62415 2995577 3079491 3155469 3218638 3265762 3295711 3309574 3309462 3295910 3266587 3218355 3150455 3065316
62403 3065316 2966868 2858979 2745070 2628028 2510152 2393444 2279812 2170777 2067530 1971687
62393 1971687 1885220 1808812 1740874 1679221 1623361 1574204 1531918 1495332 1463348 1435694 1412123
62382 1412123 1392008 1375234 1362540 1354314 1349556 1346593 1344490 1343353 1343540 1344848 1346324 1346655 1344868 1340706
62368 1340706 1334330 1325848 1315431 1303503 1290243 1274969 1256673 1235415 1212836 1191115 1171637 1154521
62356 1154521 1138891 1123517 1107688 1091781 1076861 1063672 1052228 1042181 1033094 1024373 1015523 1006670
62344 1006670 998405 990956 983926 977096 971083 966827 964610 963881 963824 963843 963722 963811 965183 969205 976481 986082
62328 986082 996011 1004619 1011573 1017444 1022694 1027463 1032159 1037635 1044653 1053626 1064932 1078767 1094445
62315 1094445 1110729 1127523 1146576 1169561 1195796 1222819 1249076 1275168 1302551 1332016 1363756
62304 1363756 1398115 1435786 1477668 1524783 1577953 1637359 1702637 1773326 1848745 1927561 2008226
62293 2008226 2089998 2172938 2256672 2339467 2418439 2490035 2550440 2596696 2628053 2645805 2651533
62282 2651533 2646100 2630302 2605448 2572617 2532127 2484340 2430305 2371211 2308252 2243883 2182075
62271 2182075 2125811 2074773 2026814 1981300 1939593 1902558 1869413 1839297 1812145 1787236 1762466
62260 1762466 1736314 1709405 1682847 1655909 1626890 1595727 1563977 1532168 1498830 1462799 1425345
62249 1425345 1389194 1356216 1326751 1300437 1276688 1254618 1233449 1213216 1194660 1178420 1164671
62238 1164671 1153429 1144682 1138123 1133103 1128957 1125252 1121890 1119342 1118546 1120001 1122851 1125481 1127260 1129234
62224 1129234 1132717 1137635 1142885 1148225 1155163 1165572 1179610 1195304 1210349 1224300 1238883 1256186
62212 1256186 1276672 1299120 1322222 1345906 1371170 1399070 1430018 1463718 1499670 1537963 1579573
62201 1579573 1625458 1675331 1728020 1783476 1843788 1911375 1986374 2066524 2149602 2235158 2323587
62190 2323587 2413979 2503153 2586310 2658478 2716092 2758173 2786128 2801919 2806214 2798339 2777814 2745492
62178 2745492 2703146 2652319 2593757 2527674 2454494 2375634 2293767 2211937 2132042 2054388 1978998
62167 1978998 1906922 1839762 1778403 1723084 1674339 1632457 1595777 1561084 1526750 1494422 1466508
62156 1466508 1442910 1421714 1402366 1386140 1373468 1362778 1352590 1343113 1334876 1327317 1319954 1313779
62144 1313779 1310054 1308424 1307676 1307827 1310028 1314652 1320894 1328258 1337023 1346958 1356904 1366228 1375675 1386136
62130 1386136 1397397 1408825 1420657 1433643 1447679 1461654 1474757 1487471 1501205 1517260 1536105
62119 1536105 1557194 1579267 1601039 1621841 1641707 1660947 1679901 1699182 1719931 1743506 1770882
62108 1770882 1802479 1838423 1878528 1922032 1968122 2017277 2071388 2131449 2195134 2257667 2315212
62097 2315212 2366318 2409883 2443340 2464323 2473362 2473365 2466455 2452531 2430956 2402310 2367824 2328002
62085 2328002 2282739 2232594 2179329 2125182 2071908 2020479 1971465 1925481 1883344 1845917 1813820
62074 1813820 1786942 1764005 1743013 1722907 1704693 1690009 1678449 1667398 1655019 1642259 1630933
62063 1630933 1620851 1610353 1599094 1588615 1580090 1572961 1566191 1559549 1552973 1545523 1535773 1523036 1508026
62050 1508026 1492707 1479407 1469318 1461502 1453750 1444344 1432497 1417567 1399228 1378714 1358782 1341849
62038 1341849 1328734 1319278 1313014 1308767 1304796 1300335 1296414 1294526 1295091 1297759 1302268 1308211 1314808 1321985
62024 1321985 1331039 1343124 1357497 1372492 1387993 1405680 1426713 1450302 1474990 1500524 1527966
62013 1527966 1558454 1592174 1628199 1665026 1701527 1737651 1774257 1812384 1852753 1895642 1940795
62002 1940795 1987554 2035404 2084142 2133001 2179743 2221217 2254939 2279871 2295882 2303130 2302091 2293530
61990 2293530 2277944 2255170 2224768 2186675 2141484 2090336 2034646 1975680 1914209 1850625 1785439
61979 1785439 1719639 1654624 1591879 1532544 1477028 1425142 1376789 1332345 1292049 1255213 1220638
61968 1220638 1187915 1157827 1131230 1107900 1086819 1067210 1048813 1031296 1013998 996569 979557
61957 979557 963985 950296 937882 925755 913614 902105 891972 883101 874640 866196 858724 853829
61945 853829 852115 852476 853193 853465 853685 854654 857036 861271 867101 873007 877008 878556 879137 880483 882722 884888
61929 884888 886717 888953 891859 894098 893322 887718 877348 864423 851927 841322 831811 822222 812958
61916 812958 805190 798832 792741 786718 781756 778127 774813 771257 768196 766019 763710 760503 757414 755865
61902 755865 755668 755598 755257 755016 754658 753622 752409 752356 753881 756097 758293 760744 763800 767269 771171 776284
61886 776284 783361 792359 802929 815197 829507 845567 862367 879021 895575 912904 931794 952077
61874 952077 972726 992725 1011596 1029190 1045532 1061088 1076519 1091667 1105255 1116120 1124337 1130615
61862 1130615 1135130 1137713 1138714 1138711 1137575 1134751 1130346 1125074 1119307 1113204 1107816 1104989 1105891 1110478 1118563
61847 1118563 1130381 1145622 1162737 1179763 1195372 1208948 1220394 1230170 1238621 1244795 1246799 1243999
61835 1243999 1238085 1231207 1223746 1214739 1203878 1191967 1179812 1167793 1156397 1146040 1136174 1125557
61823 1125557 1113783 1101755 1090286 1078952 1066957 1054513 1042595 1031540 1020694 1009609 998968
61812 998968 989998 983310 978707 975838 974400 973692 972752 971532 971503 974391 980386 988268 997197 1007481 1019443
61797 1019443 1032691 1047270 1064575 1085861 1110227 1135438 1160849 1188229 1219168 1252765 1286660
61786 1286660 1319575 1351757 1383357 1413484 1440893 1464769 1484726 1500736 1513194 1522331 1527390 1527205
61774 1527205 1522005 1514013 1505707 1498018 1490783 1484366 1480013 1478878 1481480 1487871 1497521 1509128 1521342
61761 1521342 1533692 1546034 1557091 1564551 1566954 1564603 1558211 1547588 1532418 1513572 1492684 1470694
61749 1470694 1447685 1423951 1400357 1377532 1355402 1333882 1313617 1295581 1279940 1265393 1249930
61738 1249930 1232495 1213951 1196145 1180005 1164882 1149634 1133727 1117247 1100746 1085498 1073034
61727 1073034 1063729 1056429 1050069 1044842 1040887 1036747 1030599 1022675 1014991 1008718 1003162 997547 992316 988113
61713 988113 984629 981192 977603 973756 969252 964199 959746 957067 956273 956979 959354 963764 969673 975773 981177
61698 981177 985998 990883 996452 1002884 1009484 1014829 1017929 1019150 1019462 1018905 1016503 1011733 1005579 999892 995973
61683 995973 993742 991906 988856 983772 977117 970037 963399 957534 952588 948702 945844 943763 942094 940386
61669 940386 938317 936237 935195 935924 937966 940269 942350 944183 945277 945024 944091 944242 946142 948300 949005
61654 949005 948547 948411 948748 947927 944645 939388 933498 927643 921668 915281 908381 901109 894053 888123 883798
61639 883798 880567 877280 872888 866938 859840 852846 847193 842887 838682 833585 827918 822539 817526 812265
61625 812265 806441 800262 793946 787702 782077 777685 774622 772651 771743 771811 772118 771762 770704 769593 768630 767463
61609 767463 766145 765201 764576 763587 762300 761872 762943 764640 765951 767221 769298 771889 773958 775555 778108
61594 778108 782753 789105 795904 802337 808426 814370 819815 823989 826714 829010 832038 835525 838029 838934
61580 838934 839249 839998 840855 841155 841290 841992 842910 843114 842610 842095 841511 840166 838286 837150 837335 837791 836992 834190
61562 834190 829324 822648 814928 807350 800662 794663 788670 782104 774641 766463 758548 752071 747165 742629
61548 742629 737047 729953 722005 714515 708690 704639 701058 696501 690997 685857 681907 678680 675413 671966
61534 671966 668387 664341 659526 654273 649332 645212 641803 638392 634221 629406 625071 621983 619465 616587
61520 616587 614079 613689 615524 617448 617665 616646 615745 615056 613754 611851 610512 610870 613193 616890 620772
61505 620772 623668 625325 626439 627514 628240 628360 628399 628902 629601 629993 630259 630853 631800 633065 634974 637302 638506
61488 638506 637101 633664 630444 628945 628824 629183 629930 631539 634225 637806 641856 645660 648434 649940 650674
61473 650674 651218 651592 651416 650516 649203 647991 647149 646589 646171 645941 645873 645617 644933 644291 644433 645264 645872 645846 645838
61454 645838 646430 647221 647657 648061 649022 650281 651174 651887 653318 655762 658509 660708 661949 662114 661450 660822 661119
61437 661119 662346 663961 666073 669427 673997 678429 681350 682572 682641 681910 680725 679956 680402 681671 682379 681751
61421 681751 680676 680909 683441 687859 693175 698881 705017 711485 717816 723646 728952 733503 736512 737311 736269
61406 736269 734517 732742 730652 727690 723883 719765 715762 711972 708459 705526 703575 702686 702410 702080 701397
61391 701397 700637 700204 700145 700255 700509 701105 702121 703433 705119 707701 711614 716475 721271 725554 730181 736301
61375 736301 743584 750085 754269 756709 759279 763020 767423 771532 774898 777410 779011 779940 780717 781634 782663
61360 782663 784000 786173 789368 793114 796866 800461 803885 807110 810344 813889 817507 820454 822313 823177
61346 823177 822828 820634 816699 812292 808476 805010 801328 797974 796116 796025 796904 798030 799220 800233 800446
61331 800446 799284 796630 792823 788600 784897 782437 781496 782026 783499 784585 783819 781130 778121 776381 776115
61316 776115 776886 778774 781877 785282 787678 788729 789040 789112 789144 789583 790896 792867 794823 796427 797745 798876
61300 798876 800140 802217 805333 808751 811813 814964 818936 823582 828578 834617 842488 851487 860218 868683
61286 868683 877908 887600 896014 902453 908319 915182 923237 932158 941939 952108 961395 969064 975661 981799
61272 981799 987245 991781 995778 999113 1000726 1000355 999619 1000115 1001206 1001075 999530 998434 999466 1002561 1006692
61257 1006692 1011305 1016721 1023558 1031977 1041405 1051157 1061277 1072353 1084543 1097510 1111361 1126640
61245 1126640 1143080 1159580 1176085 1194072 1214003 1233447 1249317 1261213 1270735 1277969 1280828 1278210
61233 1278210 1271852 1264097 1255297 1244626 1232429 1220160 1208211 1195201 1179936 1163351 1147849 1134902
61221 1134902 1123790 1112816 1101311 1090090 1080210 1072003 1065372 1060259 1056367 1053089 1050362 1049092 1049947
61208 1049947 1052092 1053947 1054982 1055862 1057016 1058244 1059913 1063342 1069406 1077610 1087165 1098145 1110692 1123687
61194 1123687 1135306 1144784 1152837 1160448 1168034 1175794 1183912 1191965 1198797 1203558 1206589 1208830 1210534 1210977
61180 1210977 1209424 1206161 1202526 1200043 1199419 1200250 1201731 1203590 1206177 1209765 1214273 1219858 1227150 1236300
61166 1236300 1246190 1255463 1264422 1275129 1289192 1305880 1322802 1338064 1351339 1363158 1374026 1384459
61154 1384459 1395285 1407244 1420201 1433094 1444871 1455329 1464927 1473987 1482469 1490387 1497925 1505055
61142 1505055 1511693 1518539 1527108 1538143 1550303 1561241 1570042 1578139 1587866 1600557 1615810 1631893
61130 1631893 1646904 1660083 1671930 1682606 1690708 1694573 1694450 1692160 1688893 1684703 1680031 1675887 1672145
61117 1672145 1667534 1662057 1657518 1654554 1651058 1645187 1638243 1632497 1627453 1620740 1611929 1602904 1594680 1586432
61103 1586432 1577943 1570537 1564750 1559079 1552117 1544354 1536771 1529132 1520962 1513220 1507542 1504355 1502869 1502726
61089 1502726 1504635 1509323 1516424 1524724 1533411 1542857 1553739 1565328 1575580 1583768 1592159 1603642 1618112
61076 1618112 1632853 1646513 1660890 1678363 1699254 1722554 1747707 1774560 1802678 1831945 1863155
61065 1863155 1897204 1934353 1974899 2019447 2067514 2116873 2165509 2213642 2262789 2313635 2366079
61054 2366079 2420619 2477875 2536719 2594346 2648648 2699480 2747330 2791824 2832179 2868386 2901049
61043 2901049 2930230 2955047 2974499 2988258 2996377 2998411 2993327 2980550 2960782 2935377 2905121 2870048
61031 2870048 2830277 2786332 2738722 2687969 2635267 2582392 2530609 2480034 2430266 2381156 2332880
61020 2332880 2285805 2240471 2197134 2155254 2114070 2073935 2036476 2003193 1974320 1949023 1926000
61009 1926000 1903786 1881420 1859228 1838533 1820449 1805484 1794051 1786300 1781291 1777422 1774044 1771933
60997 1771933 1772110 1775071 1781100 1790026 1800489 1810918 1821754 1835430 1853691 1876179 1901941 1930680
60985 1930680 1961765 1993903 2027166 2064034 2107061 2156415 2210739 2269284 2332019 2398793 2469825
60974 2469825 2546218 2628854 2717619 2812666 2915238 3025901 3143046 3264559 3390134 3520855
60964 3520855 3657817 3802710 3958613 4128402 4313213 4513944 4733047 4973000 5234226
60955 5234226 5516973 5824983 6165888 6549035 6984586 7482946 8052019 8695625 9417062
60946 9417062 10223640 11126206 12137309 13274414 14563296 16033068 17708153 19606351
60938 19606351 21729779 24026092 26338681 28412210 29991117 30951765 31358209 31400733 31288159
60929 31288159 31185590 31205005 31388483 31661789 31817857 31591711 30796066 29413877 27581356
60920 27581356 25495909 23332690 21213823 19213996 17372164 15701206 14199174 12858865
60912 12858865 11670266 10619515 9691127 8872317 8153570 7525185 6974944 6489410 6056769
60903 6056769 5668646 5319939 5006804 4724512 4467688 4232691 4018606 3825198 3650680
60894 3650680 3492225 3347730 3215999 3095624 2984620 2881106 2783763 2691798 2604917 2523257
60884 2523257 2447162 2376997 2312771 2253370 2196513 2140383 2085212 2032408 1982327 1933939 1886371
60873 1886371 1839425 1792868 1747005 1703847 1665510 1630910 1596254 1559767 1523874 1491538 1462554
60862 1462554 1435109 1408900 1384441 1360811 1336758 1313268 1292551 1274787 1257998 1240928 1223923
60851 1223923 1207003 1189352 1171255 1154663 1141020 1129873 1120215 1111908 1105049 1099057 1093297 1087872
60839 1087872 1083139 1079037 1075422 1072403 1069759 1066457 1061381 1054409 1046457 1038587 1031179 1023746 1015516 1006358
60825 1006358 997054 988447 980537 972816 965184 957960 951100 944103 936734 929321 922260 915686 909697 904479
60811 904479 900218 897216 895899 896185 896967 896903 895824 894872 895242 897372 901285 906890 913507 919760 924551 927936
60795 927936 930651 933003 934627 935174 934667 933082 930152 926107 922325 920329 919746 918027 913102 905956 899516
60780 899516 894980 890489 883810 875150 866441 858713 851342 843488 835196 827054 819471 812312 804798 796087
60766 796087 786411 777233 769685 763388 757529 752459 749025 746762 744170 740750 737381 734455 731048 726467
60752 726467 721417 716833 712528 707920 703400 700042 698412 698420 699921 702622 705661 708052 709493 710220 710358
60737 710358 710090 710153 711187 712640 713253 712875 712894 714376 716590 718112 718846 719972 722012 723886 724222 722971
60721 722971 721273 720115 719525 718952 717969 716637 715410 714668 714116 712774 709911 706065 702777 701077 700346 698956
60705 698956 696098 692842 691172 691858 693509 693935 692322 689687 687327 685512 683977 682981 683083 684139 685187
60690 685187 685423 684895 684416 685134 687880 692182 696071 697739 697592 697975 700564 704555 707629 708133 705963 702010
60674 702010 697391 693129 689988 688361 688150 688611 688568 687262 685151 683528 683359 684765 687337 690347 692717
60659 692717 693637 693438 693268 693658 693981 693430 691925 689899 687950 686954 687627 689447 690673 690033 687967 685820
60643 685820 684318 683220 681878 679631 676252 672531 669909 669048 669182 669310 669312 669334 668844 667224 664865 662730
60627 662730 661112 659611 658166 657348 657636 659004 661100 663336 665019 666018 667205 669640 673363 677419 680987
60612 680987 683974 686611 688929 690753 691969 692774 693634 694720 695411 694822 692884 690261 687163 683282 679334
60597 679334 677480 679082 682748 685777 687173 688166 690052 692748 695546 698259 701234 704780 708776 712521
60583 712521 715081 716115 716117 715439 713572 710049 705664 701907 699417 697729 696326 695108 693900 692394 690647
60568 690647 689022 687688 686711 686435 687024 687870 688292 688714 690213 692826 695098 695453 693423 689671 685723 683683
60552 683683 685020 689033 693079 694860 694222 692683 691736 691870 692736 693870 695280 697366 700191 703213 705989
60537 705989 708693 711421 713522 714433 714798 715820 717690 719592 721067 722321 723279 723553 723577 724652 727403 730954
60521 730954 733993 735899 736625 736432 736192 737124 739724 743585 748649 755777 765476 776782 788201 799422
60507 799422 811418 825099 840326 856038 870843 883639 894046 902260 908290 911559 911462 908338 903809
60494 903809 900130 898940 900279 902858 905537 908389 912144 916982 922448 928394 935452 944659 956952 972676
60480 972676 990969 1010018 1028757 1048114 1069824 1094257 1120247 1146483 1171712 1193768 1210227
60469 1210227 1220582 1226517 1229417 1228869 1224346 1217127 1209316 1201613 1193173 1183332 1172639 1162314 1153368
60456 1153368 1146148 1140384 1135728 1132430 1131173 1132284 1135667 1141589 1150727 1163137 1177934 1194400 1212774
60443 1212774 1233616 1257274 1284497 1316787 1355284 1399648 1448483 1500281 1553472 1606269 1657188
60432 1657188 1705390 1750094 1790302 1825508 1855734 1879986 1895559 1899980 1893179 1876666 1851085 1815900
60420 1815900 1771349 1719364 1662314 1601826 1539199 1476101 1414378 1355643 1301265 1252169 1208324
60409 1208324 1168837 1132799 1099850 1069902 1042843 1018705 997666 979502 963180 947274 930837
60398 930837 913919 897424 882450 869610 858893 850113 843150 837482 831837 824984 817033 809499 803805
60385 803805 799897 796457 792125 786289 779065 771195 764091 759323 757441 757336 757183 756082 754527 753291 752390
60370 752390 751302 749716 747667 745239 742603 740281 739063 739634 742170 745818 748559 748451 745586 742296 740822
60355 740822 741324 742720 744617 747345 750712 754087 757469 761165 764533 766513 767466 769114 772357 776442 780625
60340 780625 785154 790033 794284 797447 800629 804935 809797 813961 817340 820698 824083 826878 829092 831345
60326 831345 833588 834903 834898 834594 835651 839004 844287 850277 855802 860406 864235 867530 870546 873762 877503
60311 877503 881413 885009 888748 893563 899203 904094 907231 909102 910288 910532 910191 911310 915713 922646 929792
60296 929792 936295 943351 951854 960872 968884 975615 982055 989007 995939 1001215 1003509 1003098 1001426 999385
60282 999385 996645 993001 989499 987424 986665 985929 984340 982143 979946 977889 975517 972257 968244 964625 962373
60267 962373 960825 958472 955424 953577 953583 953269 950466 946105 942871 941961 943079 946624 953281 961751 969515
60252 969515 976329 984720 996186 1008897 1020260 1030241 1040936 1054062 1069887 1087387 1104091 1116678
60240 1116678 1123328 1125356 1125471 1124486 1120569 1111610 1097623 1080699 1063226 1046408 1030363 1015314 1002184
60227 1002184 991667 983165 975549 968946 964822 963914 964907 965689 965252 963883 962070 959912 957272 953876 949476
60212 949476 944329 939179 934351 929175 922995 916522 911472 908618 906691 903555 898382 892353 887245 883635
60198 883635 880744 877855 875282 873781 873583 874451 876131 878040 878980 878187 876672 876548 878786 882455 886385
60183 886385 890642 895789 901397 906031 908443 908353 906543 904704 904790 907677 912371 916920 920123 922160 923856
60168 923856 925823 928240 930990 933849 936732 939880 943674 948319 953781 959916 966444 972839 978551 983555
60154 983555 988703 995359 1004421 1015598 1027727 1039919 1052210 1065017 1078292 1091684 1105288 1119553
60142 1119553 1134273 1148317 1160845 1172419 1184278 1196586 1208006 1217231 1224471 1231031 1237660 1243869
60130 1243869 1248773 1251871 1252756 1250865 1246322 1240549 1234978 1229175 1221228 1210263 1197654 1185357 1174043
60117 1174043 1163416 1153451 1144324 1135835 1127950 1121412 1116606 1112124 1105753 1097003 1087623 1079539 1073311 1068718
60103 1068718 1065548 1063210 1060535 1056835 1052648 1048910 1046013 1044174 1043951 1045447 1047358 1047784 1046076 1043359
60089 1043359 1041380 1041336 1043600 1047662 1052216 1056015 1059057 1062444 1066681 1070698 1073218 1074841 1077930 1084280
60075 1084280 1093537 1104238 1115799 1128806 1143517 1158784 1172635 1183715 1192156 1199324 1206648 1214378
60063 1214378 1221479 1226959 1231071 1234940 1239374 1244625 1250953 1258432 1266252 1273240 1279348 1285712 1292994 1300604
60049 1300604 1307908 1315028 1321775 1326873 1329229 1329292 1328228 1326451 1323889 1320921 1317888 1314201 1309193 1303518
60035 1303518 1298440 1293952 1288770 1282095 1274258 1265780 1257117 1249338 1243586 1239360 1234543 1227792 1220024 1212942
60021 1212942 1206898 1200949 1194479 1188047 1182832 1179641 1178304 1177702 1176448 1173585 1168600 1161171 1151444 1140332
60007 1140332 1128818 1116962 1104272 1091008 1078301 1066779 1055921 1045203 1035204 1026957 1020476 1014555
59995 1014555 1008085 1001339 995820 992846 992378 993392 995142 997515 1000232 1002724 1005269 1009258 1015435 1022615
59981 1022615 1029228 1035455 1042591 1050764 1058825 1066407 1074501 1083592 1092609 1100322 1106784 1112662 1117780 1120922
59967 1120922 1120802 1117018 1110424 1102545 1094209 1084939 1074195 1062689 1051519 1040407 1028101 1014317 999848
59954 999848 984685 967792 949489 932611 920227 912863 908636 905380 901971 898320 894856 891880 889083
59941 889083 886069 883187 881081 879386 876949 873645 870924 870111 871014 872655 874424 876047 877467 879437 883307
59926 883307 889334 895868 900968 904396 907418 911118 915539 919978 923573 925835 926938 927322 927078 926215 925293
59911 925293 924775 923837 921057 916690 913035 911985 913150 914932 916401 917535 918563 919872 921839 924233 926446
59896 926446 928529 931018 933564 935134 935994 937740 940474 941671 939412 935449 933318 934250 936617 938810 940952
59881 940952 943887 947904 952584 956987 960103 961775 962864 963961 964508 964094 963870 965578 969648 975211 981494
59866 981494 988006 993772 997637 999289 999106 997179 993346 988004 982067 976311 971438 968382 967744 969122 971684
59851 971684 975067 979151 983506 987788 992140 996573 1000692 1004683 1009563 1015409 1020355 1022681 1023070 1023368 1023969
59836 1023969 1024165 1024409 1026126 1029381 1032666 1035252 1038055 1041915 1046626 1052081 1058848 1066946 1075296 1083006
59822 1083006 1090194 1097032 1103060 1108113 1113066 1118978 1125993 1133454 1140557 1146567 1150926 1153432 1154082 1152926
59808 1152926 1150565 1148312 1146962 1145734 1143564 1141124 1140096 1140470 1140209 1138116 1135549 1134543 1135480 1137631 1140953
59793 1140953 1146098 1153076 1161037 1169438 1178770 1189949 1203020 1216369 1227435 1234719 1239032 1242195 1244796
59780 1244796 1246187 1246573 1247594 1250195 1253113 1254404 1253631 1251576 1248526 1244089 1238407 1232275 1225964 1219009
59766 1219009 1211618 1205347 1201544 1199465 1196761 1191963 1185760 1179493 1173044 1165134 1155542 1146028 1138631 1133721
59752 1133721 1130201 1127033 1123879 1120641 1117225 1113761 1110654 1108374 1107333 1107545 1108222 1108200 1107223 1106208 1105767
59737 1105767 1105091 1103068 1099913 1096847 1094563 1092958 1092011 1091929 1092593 1093683 1095053 1096134 1095423 1091776 1086154
59722 1086154 1080920 1077356 1074816 1072243 1069439 1066692 1064206 1062188 1060669 1059115 1056968 1054612 1052981 1052242
59708 1052242 1051826 1051743 1052749 1055069 1058062 1061445 1065746 1071087 1076481 1080836 1084046 1086818 1090265 1095850 1104721
59693 1104721 1116532 1129605 1142594 1155397 1168358 1181563 1195192 1209547 1224249 1238292 1251378
59682 1251378 1264234 1277145 1289184 1299625 1309098 1318360 1326597 1332114 1334481 1335080 1335551 1336268 1336278 1334395
59668 1334395 1330472 1325875 1322443 1320707 1319443 1317151 1313545 1309411 1305613 1302766 1301345 1301293 1301493 1300212 1296461
59653 1296461 1290950 1285563 1281687 1279041 1276465 1273798 1272229 1272392 1273054 1272726 1271911 1272483 1275140 1278868 1282812
59638 1282812 1287089 1291585 1295623 1299521 1305014 1313090 1322473 1331233 1338918 1345926 1351650 1354774 1355268 1354847
59624 1354847 1355238 1356723 1358555 1360057 1360947 1360967 1359715 1356938 1352830 1347753 1341592 1333720 1323932 1313113 1302554
59609 1302554 1292801 1283626 1274817 1266398 1258344 1250839 1244632 1240376 1237665 1235395 1232852 1229825 1226192 1222521
59595 1222521 1220598 1221873 1225436 1229043 1232123 1236073 1241418 1246620 1250384 1253248 1255738 1256702 1255025 1251683
59581 1251683 1248313 1244591 1238852 1230902 1222468 1214691 1206694 1197175 1186534 1176627 1168715 1162077 1154816 1145986
59567 1145986 1136661 1128610 1122247 1116490 1110442 1104267 1098289 1092103 1084893 1075982 1065033 1052619 1040725
59554 1040725 1031610 1025782 1021946 1019088 1017488 1017327 1017708 1017720 1017389 1016915 1016175 1015649 1016556 1019089 1021635 1022770
59538 1022770 1023021 1023715 1025121 1026866 1029135 1032148 1035246 1037726 1039886 1042149 1043974 1044867 1045595 1046954 1048021
59523 1048021 1047203 1044624 1041922 1039904 1037740 1034378 1029695 1024407 1019784 1017002 1015746 1014045 1010628 1006773
59509 1006773 1004355 1002769 999733 994907 990686 989080 989569 990570 991496 992574 993903 995587 998023 1001411
59495 1001411 1005452 1009800 1014166 1017867 1020119 1021008 1021385 1021712 1021974 1022836 1025662 1030855 1037243 1043878 1051557
59480 1051557 1061671 1074174 1087822 1102281 1118912 1138877 1160708 1180235 1193201 1198113 1196613 1191382
59468 1191382 1184191 1175980 1167913 1161496 1157780 1156970 1158552 1161383 1164055 1165931 1167627 1169828 1171873 1172241
59454 1172241 1170286 1166723 1162536 1158201 1153895 1149458 1143980 1136333 1126545 1116028 1106055 1096544 1086739 1076695
59440 1076695 1067587 1060625 1055876 1052263 1048750 1045532 1043767 1044011 1045429 1046890 1048335 1050431 1053237 1056028
59426 1056028 1058369 1060566 1063042 1065866 1069027 1072631 1076719 1081293 1086523 1092479 1098675 1104366 1109369 1114183
59412 1114183 1119222 1124295 1128855 1132442 1134887 1136455 1137871 1139839 1142365 1144630 1145653 1145180 1144090 1143826
59398 1143826 1145113 1147282 1149253 1151033 1153550 1157075 1160888 1164820 1170084 1177776 1187349 1197325 1206901 1216062
59384 1216062 1224666 1232192 1237931 1240850 1240006 1235967 1231149 1227778 1225900 1224155 1221809 1219076 1216172 1213346
59370 1213346 1211482 1211428 1212937 1215191 1218003 1221538 1225453 1229603 1235244 1244281 1257520 1274621 1295106 1318108
59356 1318108 1341866 1365286 1389775 1417873 1450454 1486990 1527788 1572818 1617730 1653961 1674777
59345 1674777 1680124 1674874 1664280 1652370 1642550 1637089 1636282 1639566 1646875 1657464 1667918 1672952 1668499
59332 1668499 1653620 1630194 1601907 1573016 1546355 1522033 1498650 1475836 1454915 1437281 1423019
59321 1423019 1411228 1400822 1390775 1380412 1370142 1361489 1355781 1352797 1351125 1349786 1349061 1349494 1350589
59308 1350589 1351174 1350985 1351132 1352664 1355329 1358279 1361454 1365466 1370464 1375997 1381956 1388750 1396454 1404533 1412712
59293 1412712 1421440 1431233 1442050 1453616 1465929 1479189 1493519 1508981 1525543 1542814 1559976 1576123
59281 1576123 1590663 1603633 1615791 1628013 1640096 1650368 1656938 1659170 1657577 1652744 1645048 1635070
59269 1635070 1623320 1609631 1593717 1576285 1558643 1541003 1522079 1500761 1477661 1454688 1433687
59258 1433687 1415595 1400257 1386611 1373363 1359820 1346000 1332127 1318554 1306161 1296207 1289526 1286063
59246 1286063 1285068 1285448 1286114 1286567 1287281 1289351 1293905 1301746 1312556 1323692 1330590 1329661 1320821 1306615 1289491
59231 1289491 1270918 1252408 1235530 1220700 1207211 1194731 1183710 1174353 1166522 1160866 1158655 1160002
59219 1160002 1163414 1167592 1172566 1178605 1185333 1192760 1202056 1214104 1227917 1241649 1254969 1269512 1286842
59206 1286842 1306533 1326474 1344871 1361758 1378324 1394855 1409952 1422064 1431011 1437268 1440597 1440709
59194 1440709 1438877 1437254 1436445 1435098 1432173 1428343 1424744 1421600 1418704 1416130 1413705 1410607 1406282 1401267
59180 1401267 1396540 1392464 1388699 1384669 1379851 1374074 1367760 1361495 1355427 1349568 1344372 1340172 1336329 1331956
59166 1331956 1327219 1322618 1317158 1308828 1297179 1283986 1270981 1258411 1246349 1235768 1227260 1219829
59154 1219829 1212008 1203399 1194399 1185337 1176708 1169457 1164167 1160511 1158038 1156775 1156551 1156567 1156299 1156121 1156554
59139 1156554 1157639 1159511 1162624 1166709 1170380 1172547 1173596 1174492 1175328 1175400 1174245 1172109 1169833 1168543 1168883
59124 1168883 1170316 1171775 1172947 1174108 1174890 1174502 1173254 1172431 1172347 1172029 1171244 1171249 1172769 1174722 1175758 1175617 1174082
59107 1174082 1170235 1164099 1157830 1153843 1152556 1152919 1154074 1155342 1155712 1154826 1153809 1153834 1154467 1154412 1153180 1150925
59091 1150925 1147320 1141754 1134133 1124643 1113397 1101138 1089471 1079441 1070619 1062417 1055353 1049992 1045558
59078 1045558 1040781 1035323 1029374 1022766 1015737 1009687 1005752 1003141 1000109 996101 991908 988395 986144 985706
59064 985706 987124 989837 993960 1000684 1010278 1020774 1030171 1038974 1048896 1059793 1069889 1078698 1087797
59051 1087797 1098551 1110547 1122492 1133515 1143392 1152370 1160803 1168432 1174386 1178501 1181870 1185308 1188190
59038 1188190 1189866 1191140 1192875 1194068 1193088 1190232 1187266 1184860 1182317 1179626 1177893 1177549 1177719 1177551 1176808
59023 1176808 1175107 1171940 1167616 1162865 1157437 1150413 1142038 1133943 1127180 1121187 1114980 1108355 1101617 1094962
59009 1094962 1088368 1081563 1074248 1067038 1061744 1059585 1059314 1058302 1055435 1051957 1049589 1048870 1049253 1049644 1048698
58994 1048698 1045610 1040872 1035705 1030985 1027357 1025741 1026475 1028213 1029005 1028520 1028248 1029639 1032906 1037305 1041508
58979 1041508 1043987 1044194 1043202 1042244 1041207 1039739 1039104 1041125 1045496 1050027 1053648 1057509 1062926 1069921 1078197
58964 1078197 1087969 1099192 1111240 1123954 1137928 1153280 1169249 1185487 1202625 1220773 1238196
58953 1238196 1252210 1261156 1265395 1266898 1267861 1269133 1269824 1268740 1265828 1261801 1257113 1252293 1248589 1246939
58939 1246939 1246661 1246573 1247119 1249852 1254894 1260487 1265297 1269611 1273926 1277777 1280702 1283315 1286706 1291300 1296660
58924 1296660 1301937 1306425 1310129 1313701 1317477 1321106 1324692 1329481 1336477 1345223 1355172 1367338 1382915
58911 1382915 1400919 1419104 1436946 1455819 1476326 1497294 1517338 1535662 1551304 1563608 1573793
58900 1573793 1584173 1595347 1605666 1613687 1619375 1622526 1621911 1616773 1607738 1595652 1580906 1564208 1546441
58887 1546441 1527278 1505664 1482223 1459477 1438863 1419218 1399171 1379550 1362309 1348305 1337160
58876 1337160 1328221 1320669 1313630 1307137 1302298 1299834 1299108 1299004 1298953 1298801 1298662 1299165 1300885 1303377 1305824 1308576
58860 1308576 1312541 1317004 1319841 1320344 1320010 1319934 1319344 1317713 1316524 1317489 1320266 1323354 1326273 1329746 1334487
58845 1334487 1340876 1349128 1359015 1369966 1381965 1395627 1411087 1427822 1445769 1465355 1486012 1506129
58833 1506129 1525093 1544011 1563762 1583843 1603966 1625252 1648629 1673233 1697562 1721202 1744447
58822 1744447 1767176 1789064 1809961 1829178 1845377 1858069 1868292 1876956 1883395 1886228 1884689 1878624
58810 1878624 1868493 1856089 1843793 1832147 1819521 1805170 1791094 1779518 1769924 1760169 1749350 1737834
58798 1737834 1725361 1711038 1694915 1678008 1660877 1643356 1625439 1607418 1589432 1571797 1555409
58787 1555409 1540848 1527356 1513562 1499019 1484365 1470234 1456565 1442707 1427806 1411512 1394622
58776 1394622 1378430 1363220 1348174 1332994 1318580 1305698 1294126 1283737 1275226 1268916 1263841 1258945
58764 1258945 1254458 1251281 1249739 1249636 1250802 1252918 1255427 1258137 1261225 1264442 1267334 1270511 1275286 1281560
58750 1281560 1287449 1291587 1294351 1296076 1295850 1293296 1289894 1286881 1283030 1276286 1266923 1257510 1250112 1244669
58736 1244669 1239694 1233507 1225159 1215103 1204800 1195215 1186140 1177209 1168605 1160446 1152572 1145506 1140445
58723 1140445 1137731 1136443 1136014 1136870 1138882 1140795 1142088 1143776 1146339 1148488 1149179 1149245 1149552 1148975 1145843 1140233
58707 1140233 1133296 1125468 1116917 1108700 1101825 1095871 1089892 1083846 1077890 1071355 1063913 1056843 1051717 1048621
58693 1048621 1046947 1046922 1048921 1052216 1055730 1059145 1062026 1063100 1061952 1060293 1059891 1060364 1060687 1061659 1064755
58678 1064755 1069464 1073992 1078097 1083125 1089588 1096640 1103765 1111171 1118532 1124963 1130295 1135161 1140004 1145182
58664 1145182 1151672 1160289 1170346 1180247 1189281 1197988 1207163 1217275 1228264 1239172 1248863 1257942 1268807
58651 1268807 1282646 1297570 1310919 1322118 1331682 1338831 1342208 1342160 1340177 1336408 1329479 1318491 1303754
58638 1303754 1285926 1265755 1244184 1221503 1197036 1170804 1144564 1119964 1096717 1074045 1052691
58627 1052691 1033808 1017033 1001589 988247 978040 969838 961351 951995 942824 934233 925793 917928 911763
58614 911763 907552 904925 904146 905331 906997 907321 906558 906519 908183 911479 916766 924541 934043 943837 953331
58599 953331 962159 968856 972090 972615 972188 971173 968951 965780 962238 957699 951489 944815 939331 934561 928993
58584 928993 922885 917559 912787 907675 903453 902383 904065 905755 906297 906884 907831 907614 905744 903969 903820
58569 903820 905054 907152 910340 914468 918554 921818 923829 923809 921594 918967 918107 918954 920005 921183 923547
58554 923547 926674 929091 931160 934750 939877 944392 947332 949834 952245 953180 952443 952461 955567 961580 968790
58539 968790 975728 981436 985640 989040 992109 993822 993258 991876 991956 993309 994282 995674 1000366 1008715 1017579
58524 1017579 1024744 1031379 1039112 1047702 1057077 1068927 1084289 1101439 1117932 1133342 1148721 1164768
58512 1164768 1181762 1200065 1219506 1239128 1258314 1277563 1298003 1320941 1347598 1377985 1410271
58501 1410271 1442635 1475396 1509860 1545803 1581915 1617896 1653786 1687799 1717297 1741493 1760722
58490 1760722 1773721 1778686 1776847 1771794 1765142 1755869 1744123 1732405 1722328 1713080 1703558 1693125 1679827
58477 1679827 1661046 1636882 1610150 1582304 1552148 1519189 1485426 1452922 1422312 1394376 1370232
58466 1370232 1349191 1329073 1309236 1290670 1273016 1254797 1236967 1222427 1211240 1200090 1187649
58455 1187649 1176677 1169326 1164083 1159085 1154852 1151790 1148442 1144346 1141435 1140419 1138850 1134974 1130575 1127807
58441 1127807 1126168 1124902 1125374 1128346 1131535 1132671 1132821 1134175 1136704 1139446 1143043 1148386 1154530 1160301
58427 1160301 1166462 1174231 1183210 1192619 1202961 1214817 1227696 1241540 1257420 1275323 1293415 1311056
58415 1311056 1330293 1352654 1376616 1399925 1422091 1442733 1459736 1471220 1477580 1479850 1477941 1472019
58403 1472019 1463707 1454455 1444653 1435395 1428615 1424261 1420103 1415821 1414347 1417571 1423873 1431795 1442851 1458171
58389 1458171 1475341 1491323 1505899 1519421 1529476 1532676 1528116 1516957 1500739 1482168 1465112 1451208
58377 1451208 1438270 1424071 1409563 1396672 1385605 1376509 1370988 1369380 1369022 1367844 1367405 1369992 1375146
58364 1375146 1381564 1389816 1400266 1410588 1418330 1424063 1429395 1433724 1435504 1434880 1432641 1428369 1421833 1414402
58350 1414402 1407061 1398921 1389486 1380164 1371810 1363155 1353470 1344354 1337320 1332180 1329035 1328514 1328731 1325996
58336 1325996 1320454 1316941 1318134 1321351 1324560 1330385 1340497 1350925 1357491 1361947 1368138 1375636 1381842
58323 1381842 1387110 1393150 1399307 1404962 1412727 1424602 1437496 1447108 1453929 1461264 1469918 1478988 1489249
58310 1489249 1501361 1513264 1523599 1535078 1550231 1566585 1580514 1592941 1606663 1620975 1634062
58299 1634062 1648074 1666438 1688149 1709632 1730255 1751234 1771282 1788304 1803473 1818894 1833229
58288 1833229 1844277 1853816 1865189 1878124 1890436 1902563 1915945 1929467 1942157 1956615 1974773
58277 1974773 1993091 2007395 2019807 2035470 2055026 2075927 2098463 2124344 2151594 2177011 2201872
58266 2201872 2229376 2258333 2285082 2309650 2334250 2357840 2378133 2396925 2417347 2437817 2454794
58255 2454794 2469586 2486352 2505395 2524536 2544906 2568932 2594607 2618419 2642109 2669911 2700885
58244 2700885 2730749 2759525 2790596 2823611 2855037 2884414 2913791 2942608 2969577 2997744 3031105
58233 3031105 3068002 3104300 3141019 3182226 3227640 3274140 3322265 3374331 3428537 3481868 3536199
58222 3536199 3594587 3654671 3713138 3773229 3839817 3910625 3980783 4052432 4130863 4214818 4300210
58211 4300210 4389855 4489160 4595174 4700408 4804899 4914072 5027505 5140816 5256138 5379378
58201 5379378 5509235 5640165 5774035 5917577 6070604 6228422 6393385 6571796 6761496
58192 6761496 6954910 7152321 7359839 7576920 7799214 8031286 8282605 8552849 8834930
58183 8834930 9130207 9446383 9782959 10134012 10503183 10900414 11326161 11774759 12250749
58174 12250749 12765169 13318565 13905429 14532424 15213190 15947695 16726564 17553221 18440866
58165 18440866 19390182 20392706 21454620 22594106 23816728 25117584 26505896 28001387
58157 28001387 29607454 31315299 33134235 35090403 37197900 39462816 41914863 44600619
58149 44600619 47543956 50747518 54234158 58051436 62238613 66835206 71927715 77645706
58141 77645706 84109824 91429633 99750089 109241643 120039650 132252335 146026195 161528123
58133 161528123 178863238 198112142 219489627 243417929 270479899 301367720 336583423
58126 336583423 375439650 414763818 448802502 471263996 478290560 469978849 449478379
58119 449478379 420956225 388169260 354043085 320643752 289189199 260224872 233938705
58112 233938705 210348039 189310182 170566137 153872335 139056358 125953953 114374630
58105 114374630 104148449 95143475 87218426 80209412 73978366 68430375 63473445 59004926
58097 59004926 54948950 51267427 47921532 44855634 42027155 39418199 37008199 34766007
58089 34766007 32677408 30750231 28982026 27348331 25829944 24425276 23127692 21916048
58081 21916048 20776978 19713986 18725943 17797491 16918374 16092132 15318226 14584743 13885840
58072 13885840 13228204 12613377 12030869 11474928 10951188 10460766 9994205 9547126 9125979
58063 9125979 8732557 8358195 7998800 7660528 7345117 7044459 6755262 6484594 6235227
58054 6235227 5999377 5772344 5558535 5358495 5163890 4971343 4787999 4617110 4450857
58045 4450857 4283936 4122115 3970753 3826190 3684992 3550970 3426773 3308599 3194844
58036 3194844 3089987 2994594 2901626 2808031 2719978 2641170 2565916 2489340 2414836 2345673 2278713
58025 2278713 2212369 2151790 2100023 2052198 2004048 1958213 1916943 1876773 1835668 1797463 1764012
58014 1764012 1730714 1694788 1660082 1628748 1596244 1559970 1524901 1495017 1466664 1436076 1406194
58003 1406194 1380298 1355919 1330821 1308266 1290558 1273778 1254587 1236028 1221076 1206673 1189779
57992 1189779 1173261 1160015 1147100 1131515 1116221 1104573 1094039 1081371 1069097 1060932 1055079 1047675
57980 1047675 1038870 1030446 1021400 1010837 1001224 994022 986035 974656 962813 954150 947167 938533 928461
57967 928461 918651 908702 898560 890664 885742 880386 872513 865023 860233 855261 847124 838027 831116 825157
57953 825157 817927 810764 805192 799001 790440 782486 778115 774874 768995 761538 755543 750162 742674 733856
57939 733856 726703 721836 718147 715672 714111 710974 704858 698169 693382 689430 685003 682027 682114 682837 681456
57924 681456 679366 678877 678676 676662 674443 674667 676385 677254 677939 680179 682659 682948 681689 681174 681597 682206
57908 682206 684086 688268 692967 696034 698261 701194 703859 704738 704785 705447 705974 705553 705449 705989 704250 698184
57892 698184 690414 684552 680339 675729 670895 666536 661095 653711 647462 645730 647581 650340 654103 659662
57878 659662 664770 667094 668720 673068 678998 682574 683357 684563 687926 692341 696618 699978 700836 698571 695517
57863 695517 694094 693270 690804 687247 684317 681026 675023 666462 657187 647586 637528 628754 622876 618509
57849 618509 613705 609547 607882 607387 605758 604112 605135 608116 609804 609179 607643 605513 602025 597897 594348
57834 594348 590525 585278 580379 578401 578517 577985 576713 576668 577785 578220 577923 578307 579012 578520 577363 577367 578316
57817 578316 578591 578389 579108 580399 581006 581667 584090 588003 592264 597494 604274 610191 612460 612325 613172 615574
57801 615574 618171 621991 629222 638457 645881 651013 656997 665301 674454 683957 695072 707204 717516
57788 717516 724835 730499 734874 736409 734532 730422 724816 718176 712752 710950 711561 710962 707973 704159 699811
57773 699811 693594 686236 680514 677163 674471 672134 671497 671691 669804 665777 663007 662973 663213 662051 661569 664128
57757 664128 669204 675339 682139 688551 692027 691332 688171 684612 680942 676937 672958 668825 663848 658787
57743 658787 655387 653248 649750 644005 638409 635260 634220 634071 634552 635295 635161 633776 631868 629436 625733
57728 625733 621674 619853 621192 623703 625390 626222 626548 625913 624509 623648 623772 623885 623766 624824 627943 632290
57712 632290 636902 641552 645519 647624 648173 648917 650445 651509 651453 651263 651649 652103 652358 652732 652546 650406 646664
57695 646664 643411 641396 639104 635645 632418 631041 631537 633368 636460 640470 644658 649018 654056 659328
57681 659328 663921 668251 673323 678406 681833 684028 687114 691465 695511 699134 704125 710646 716461 720761
57667 720761 725735 733000 741133 748184 754116 759327 763068 764926 765929 766787 766824 765735 764528 763695 762349
57652 762349 760164 758221 757014 755589 753570 752024 751332 750086 747053 742494 736933 730687 725191 722468
57638 722468 722394 722651 722211 722703 725589 730239 735536 740970 745401 747395 747802 749450 753235 757042 759517 762083
57622 762083 765929 769936 773300 777602 784508 793788 805186 819694 837075 854611 870530 886761 906447
57609 906447 930654 959161 992090 1028462 1064819 1097304 1123575 1141270 1146839 1138289 1117818 1090034
57597 1090034 1058907 1027507 998393 972139 947036 922044 898602 878225 860326 844077 830384
57586 830384 820092 812103 805180 799874 796787 794726 792498 790784 790297 789870 788397 786969 786989 787840 788450
57571 788450 789485 791804 794377 795959 797276 799289 800841 800395 798710 797415 796327 794612 793287 793860 795389
57556 795389 795557 794070 792676 792252 791928 790682 788054 783949 779382 776662 777188 779804 782671 785412 787885
57541 787885 788576 786519 783508 781944 781509 780343 778409 776946 775396 771917 766975 763581 763397 764827 765712
57526 765712 766170 767789 771068 774641 776821 777580 778703 781495 784732 786038 785149 784143 784352 785230 786759
57511 786759 790302 795813 800672 803062 804328 806288 808474 810098 812419 816600 821141 824121 826431 830201
57497 830201 835441 840777 845958 851065 854720 856028 857101 860787 866935 873490 880016 887135 893680 897767
57483 897767 900073 903021 907338 912298 918419 926490 934594 939868 943219 948643 957482 966764 973940 980042
57469 980042 987136 995483 1004432 1013690 1022480 1029409 1034254 1038384 1042855 1047670 1053058 1059492 1066140 1071365
57455 1071365 1075323 1080071 1086619 1093754 1100305 1106544 1112691 1117951 1121996 1125790 1130082 1134419 1138334 1142196
57441 1142196 1146233 1149966 1153228 1156709 1161027 1166155 1171922 1178024 1183557 1187802 1191556 1196374 1202340 1207863
57427 1207863 1211866 1215042 1218788 1223926 1230499 1237709 1244062 1248681 1252463 1257072 1263079 1270025 1277690 1285973
57413 1285973 1293936 1300397 1305293 1309319 1312756 1315793 1319298 1323818 1328540 1332677 1336958 1342112 1347118 1351226
57399 1351226 1356714 1366786 1381036 1395654 1408149 1419270 1430172 1440401 1449483 1458314 1468016 1478899
57387 1478899 1490890 1503419 1514833 1523759 1531252 1539787 1549996 1560382 1570258 1580666 1591994 1603040
57375 1603040 1613358 1624446 1637415 1651024 1663200 1673536 1683520 1695105 1709320 1725371 1740973
57364 1740973 1754462 1766444 1778451 1790709 1802705 1815120 1829047 1843590 1856445 1866871 1876176
57353 1876176 1885481 1895129 1906018 1919049 1933148 1946352 1959073 1973730 1990741 2007530 2022275 2036046
57341 2036046 2050280 2064568 2078223 2091969 2106729 2122341 2138367 2154468 2169315 2181236 2190964
57330 2190964 2201773 2215748 2231753 2248040 2264700 2282101 2298919 2313710 2327206 2341294 2356534
57319 2356534 2372045 2387087 2401689 2416354 2432007 2449452 2468225 2486719 2503935 2520237 2536141
57308 2536141 2551564 2566713 2582494 2599473 2617319 2635594 2654095 2672360 2690018 2707612 2725801
57297 2725801 2743999 2761419 2779110 2798842 2820049 2840243 2858647 2876895 2895707 2913725 2930644
57286 2930644 2948683 2969310 2990755 3010508 3028413 3045680 3062639 3079334 3096787 3115797 3135580
57275 3135580 3155217 3175386 3197104 3219624 3241009 3260129 3277053 3292394 3307447 3324173 3343808
57264 3343808 3365837 3388853 3411651 3433133 3452505 3470481 3489243 3510280 3533001 3556083 3579204
57253 3579204 3602860 3627415 3652860 3678695 3703785 3727469 3751032 3776794 3805417 3835400 3865470
57242 3865470 3896026 3927950 3961460 3996402 4032133 4067082 4100229 4133066 4167940 4204201 4238411
57231 4238411 4268841 4297179 4324956 4351132 4374686 4397063 4419956 4442527 4462678 4479692 4494125
57220 4494125 4506513 4517716 4529207 4541673 4554477 4567546 4582293 4599572 4618276 4637256 4657280
57209 4657280 4679790 4704907 4731575 4758402 4783677 4806251 4827215 4849027 4872144 4894470 4915020
57198 4915020 4935846 4959086 4984232 5009817 5035753 5062348 5088892 5114819 5140602 5165939 5188865
57187 5188865 5208155 5224760 5239344 5250416 5256827 5260403 5264065 5268712 5273606 5278327 5282793 5286850 5291370
57174 5291370 5298265 5308129 5319689 5332818 5349800 5372058 5398100 5426774 5459989 5499676 5544158 5590257
57162 5590257 5637240 5686035 5736368 5787611 5840962 5897747 5956447 6013951 6068739 6120505 6167931
57151 6167931 6209594 6246204 6279454 6309575 6336349 6361481 6387291 6413731 6439112 6463072 6486487
57140 6486487 6509111 6529651 6547751 6563915 6578001 6589569 6598874 6605689 6608178 6604892 6596935 6586282
57128 6586282 6573132 6556879 6538390 6519021 6498451 6475685 6450992 6424467 6393724 6355517 6308958
57117 6308958 6255063 6194212 6126221 6051850 5971966 5886207 5794638 5699583 5603751 5507879 5412390
57106 5412390 5319562 5231275 5146117 5061659 4978127 4896646 4815033 4728706 4634953 4533202 4421975
57095 4421975 4299170 4165296 4023656 3877639 3730233 3585047 3444332 3306091 3165908
57086 3165908 3021455 2872969 2720325 2562641 2400277 2234256 2063892 1887255 1703158
57077 1703158 1510185 1304850 1083601 845943 592908 323382 34666 -274642 -605423 -960424
57067 -960424 -1342792 -1753260 -2192244 -2663876 -3174920 -3730965 -4336964 -5000127 -5728485 -6527623
57057 -6527623 -7402440 -8361131 -9414004 -10569932 -11838114 -13232460 -14770785 -16471633
57049 -16471633 -18356357 -20453215 -22795364 -25416585 -28353613 -31651359 -35362060 -39542898
57041 -39542898 -44262368 -49610898 -55703958 -62679624 -70698978 -79942923 -90594882 -102819555
57033 -102819555 -116758457 -132541496 -150292440 -170111162 -192034047 -215996110 -241841245
57026 -241841245 -269398798 -298531115 -328984711 -360033842 -390203421 -417416655 -439554118
57019 -439554118 -455008936 -462871572 -462811701 -454989131 -440130327 -419579022 -395105809 -368519214
57011 -368519214 -341307749 -314482870 -288622128 -264007472 -240752376 -218869096 -198296150
57004 -198296150 -178933764 -160698957 -143565056 -127558308 -112728440 -99123477 -86774167
56997 -86774167 -75680424 -65804349 -57077205 -49412252 -42711837 -36871601 -31789074 -27371897
56989 -27371897 -23537711 -20210090 -17319098 -14804398 -12614075 -10701070 -9023370 -7546577
56981 -7546577 -6243398 -5090744 -4068647 -3160607 -2352519 -1631269 -985254 -405316 116098
56971 586195 1011589 1397880 1749984 2071975 2366365 2634893 2879957 3103252 3302561 3472347
56961 3472347 3609055 3714623 3794144 3851818 3890109 3910940 3916053 3907006 3885988 3856015 3819909
56950 3819909 3779959 3738631 3698015 3657812 3615110 3566802 3511310 3447787 3375190 3292801 3200539
56939 3200539 3098405 2986903 2868245 2745517 2619975 2490354 2355327 2215331 2071652
56930 2071652 1925336 1777850 1631489 1488325 1349709 1217383 1093904 981162 879288
56921 879288 787399 704548 629693 561849 500757 446437 397932 353658 313336 278451 250433
56910 250433 229299 214182 203938 197062 192409 190382 192203 197760 205629 215532 229015 246789 266758
56897 266758 285728 302069 315732 326503 333240 334463 329249 318235 304037 289887 277354 266135
56885 266135 256223 249120 246309 247555 251506 257290 264776 273863 284256 295739 308392 322832 340321
56872 340321 361892 387000 413395 438335 459369 474041 479974 475948 462634 442165 417380 391322
56860 391322 366483 344020 323920 305964 290162 276561 265343 257085 252209 250111 249351 248686 247545
56847 247545 245920 244515 244603 246848 250498 254515 259110 265228 272790 280531 287414 293225 298043 302212 306675
56832 306675 312229 318622 325478 333810 345222 359691 375474 391153 406223 419575 429239 434441 436577
56819 436577 437274 436523 433629 429228 425392 423991 425492 429157 434161 440678 449874 462621 478573 497110
56805 497110 518788 544982 576221 611826 651068 693576 738255 782427 822271 853788 873752
56794 873752 880787 875939 862015 842522 821339 802250 787455 776686 768657 763120 760902 762751 769417
56781 769417 782314 802663 830084 863162 901143 944004 991444 1043166 1099479 1159470 1218180
56770 1218180 1267100 1298181 1307166 1294255 1263571 1221913 1175914 1129509 1084664 1043680 1008750
56759 1008750 979543 953807 931139 914247 905627 904760 909612 919421 934810 956360 984359 1019248
56747 1019248 1060944 1107458 1154060 1193454 1217528 1220955 1204229 1172823 1133277 1090467 1047693
56736 1047693 1007116 969337 933856 900705 870890 845118 823327 805736 792965 784708 779631 777274
56724 777274 778991 786330 799398 817191 838242 860067 878680 889534 889100 876156 852706 823531
56712 823531 793399 764191 735335 706618 679100 653483 629435 606910 586538 568211 550789
56701 550789 533752 517851 503646 490820 479271 469355 460621 451991 443783 437758 434386 431807 428456
56688 428456 424919 421996 418674 413609 407338 401393 396304 392033 389411 389340 391009 392398 392406 391366 389850
56673 389850 388141 386724 386166 386288 386145 385071 383472 382569 383353 385564 387812 389064 389749 390820 392176 393033
56657 393033 393511 394448 395730 396354 396272 396570 397423 397548 396350 395098 395123 396189 397462 398785 400141 401119 401893
56640 401893 403485 406007 407727 407093 404852 403186 403517 406007 410286 415581 420686 424710 427490 428906 428654
56625 428654 427191 425898 425546 425505 425105 424714 424707 424440 423293 421883 421177 420994 420341 418809 416853 414980 413201
56608 413201 411047 408054 404666 402440 402415 403517 403776 402919 402118 401346 399184 395735 393467 394080 396503 399253
56592 399253 402853 408326 414853 420701 425326 429080 431998 434402 437614 442341 447255 450679 452899 455327
56578 455327 458204 460798 463168 466016 469128 471519 472890 473607 473453 471788 468980 466570 465863 466907 468676
56563 468676 469613 468347 464664 459687 454726 450233 446052 442040 438149 434551 431908 430705 430177 428951 426986
56548 426986 425620 425415 425429 425095 425175 426095 426997 427418 428398 430738 433565 435750 437297 438215 437591 435309 433234
56531 433234 433033 433935 434260 434039 434388 435164 435076 433639 431610 429989 429633 431099 433800 436177 437751 439914
56515 439914 443533 447066 448584 448681 449785 453351 458968 465432 471481 476429 481213 487763 496309 504744 511859
56500 511859 519507 529945 542776 556409 570610 585035 596865 603040 604203 603583 602479 599612 594660
56487 594660 589468 585328 581509 577182 572869 569416 567053 565803 565399 564569 561786 557027 551768 547257 543799
56472 543799 541313 539343 536954 533898 531467 530857 531246 530976 530009 529466 529161 527552 524112 520144 517143 515694
56456 515694 515775 516703 516875 514949 511324 507439 504025 501122 499177 498631 498820 498697 498332 498503 499336 500497 501997
56439 501997 503508 503847 502631 501436 501645 502194 501319 499464 498212 497247 494993 491752 489653 489529 490167 490582
56423 490582 490826 490649 489523 488072 487449 487284 486254 484621 484111 485251 486830 488020 488912 488997 487366 484714
56407 484714 483051 483075 483639 483969 484451 484979 484492 482586 479989 477304 474877 473705 474577 476341 476982 476395 476166
56390 476166 476788 477270 477444 478310 479968 481466 482895 485356 488678 491457 493450 495457 496701 495213 491427
56375 491427 488546 488350 489215 489322 489190 489671 489883 488892 487571 487135 487299 487322 487535 488537 489996 491292 492304
56358 492304 492853 492593 492026 492312 493555 494655 495307 496488 498475 500185 501266 502949 505837 508388 508825 507345
56342 507345 505591 505012 506422 509907 514348 518034 520347 522092 524095 526560 529680 533344 536132 536226 533663
56327 533663 530334 527766 526245 525775 526037 525650 523661 521665 522127 524614 526227 525881 525403 525906 526044 524833
56311 524833 523476 523180 523544 524311 526384 529749 532539 533502 533609 534130 535077 536512 539236 543017 546232 548419
56295 548419 551122 555059 558731 561134 563564 567141 570729 573035 574802 577138 579523 581240 583117 585943
56281 585943 588731 590478 592325 596017 601192 605959 609541 612967 617662 624268 632190 639754 645629 650331
56267 650331 655264 660454 664972 669435 675589 683000 688789 691464 692590 693806 694945 696203 699225 704294
56253 704294 709034 711788 713999 717394 721220 724344 727830 733102 739428 745510 751894 759514 767432 774313
56239 774313 780900 788872 798298 808122 818061 828288 838306 847829 857801 869212 881942 895830 911332
56226 911332 927964 943918 958722 974530 993193 1013793 1034722 1056350 1079789 1104692 1130329
56215 1130329 1157409 1186841 1217852 1249167 1281077 1314907 1351575 1391799 1436286 1484517 1534965
56204 1534965 1587699 1644982 1708099 1775685 1846526 1921834 2003158 2090440 2183994 2286174 2398946
56193 2398946 2521815 2654144 2797540 2953939 3123366 3305550 3501554 3711619 3933467
56184 3933467 4164818 4405259 4653386 4904648 5154604 5401697 5643707 5873876 6084061
56175 6084061 6269817 6428876 6556540 6646803 6697158 6708710 6682113 6616902 6514709 6380216
56165 6380216 6218910 6036037 5837105 5626882 5408152 5183231 4955959 4730487 4509272
56156 4509272 4294154 4087884 3892318 3706509 3528954 3360465 3202520 3054345 2914171
56147 2914171 2782023 2658728 2543620 2435773 2336049 2245198 2161366 2082309 2008597 1941708
56137 1941708 1880400 1822097 1766719 1715944 1669782 1627029 1588150 1554337 1524392 1495707 1467942
56126 1467942 1442875 1421166 1401971 1385031 1370298 1356106 1340720 1325403 1313237 1305061 1298805 1292472
56114 1292472 1285739 1279262 1274407 1272797 1274181 1275885 1276322 1277577 1282314 1289789 1297505 1305231 1314661 1326458
56100 1326458 1340346 1356652 1375008 1393003 1408943 1424634 1442799 1463359 1484904 1507866 1533226
56089 1533226 1560128 1588089 1619645 1657275 1699515 1743688 1790716 1843554 1902830 1968142 2041717
56078 2041717 2125928 2218180 2312606 2406069 2498310 2587094 2667792 2737831 2798101 2850460 2897162
56067 2897162 2941672 2986137 3028446 3064867 3094575 3118526 3135662 3144090 3144579 3139011 3126786 3106524
56055 3106524 3079462 3046797 3005353 2950591 2882827 2806374 2724287 2638675 2554306 2476373 2405528
56044 2405528 2339929 2280889 2231299 2189751 2151858 2116809 2087315 2063756 2043786 2027211 2015858
56033 2015858 2008842 2003039 1998051 1995929 1996491 1997815 2000628 2007269 2017118 2027929 2040425 2056277 2072931
56020 2072931 2086302 2097600 2111651 2129577 2149093 2170674 2196635 2224939 2250800 2274115 2298810
56009 2298810 2325400 2351016 2376263 2404802 2436192 2466245 2494619 2525041 2557936 2589962 2621018
55998 2621018 2654509 2690381 2725134 2759061 2796133 2836311 2875459 2913403 2954603 3000187 3046752
55987 3046752 3093572 3143343 3195261 3245151 3293195 3343863 3397711 3451190 3504907 3563729 3628164
55976 3628164 3694253 3762544 3838265 3921794 4008055 4096202 4190479 4290459 4390207 4488670 4591209
55965 4591209 4699216 4807950 4916299 5028863 5146750 5266371 5389071 5521569 5665011
55956 5665011 5813981 5967922 6132598 6308689 6490498 6677951 6878067 7092493 7315838
55947 7315838 7548532 7798514 8067597 8349255 8642602 8954954 9287770 9634563 9996368
55938 9996368 10384530 10804142 11249513 11719957 12224526 12766992 13342527 13953993 14614485
55929 14614485 15328291 16086610 16887627 17742826 18657800 19626326 20650349 21746116 22923355
55920 22923355 24178876 25518173 26961075 28517308 30179513 31950426 33853981 35910775
55912 35910775 38129073 40531655 43163935 46061487 49236122 52707238 56519582 60720951
55904 60720951 65360673 70530414 76373834 83038107 90648302 99336868 109244811 120471603
55896 120471603 133082090 147200306 163054513 180918795 201090792 223954914 249955352
55889 249955352 279421296 312448929 348816272 387474268 425570427 458075337 479178643
55882 479178643 484949205 475174137 452933644 422630630 388267532 352827517 318325654
55875 318325654 285952213 256252052 229400218 205410389 184169378 165440986 148954829
55868 148954829 134482418 121813396 110718967 100982094 92428333 84898447 78226130
55861 78226130 72269826 66935993 62147952 57819830 53880257 50291687 47023345 44027846
55853 44027846 41261898 38706009 36345827 34155893 32118536 30237130 28512485 26923524
55845 26923524 25446095 24072670 22798615 21606735 20481439 19423335 18435263 17507478
55837 17507478 16629643 15803739 15032152 14305653 13615481 12965210 12358893 11789069 11247769
55828 11247769 10738088 10263676 9817591 9392454 8991368 8618028 8265651 7926111 7600983
55819 7600983 7293834 7000548 6716890 6446956 6194686 5955238 5723751 5504205 5300420
55810 5300420 5106253 4913952 4724881 4543323 4367242 4194127 4028730 3875675 3730678
55801 3730678 3587864 3449836 3322066 3203054 3088313 2978637 2876351 2778489 2681464 2587719
55791 2587719 2500582 2417541 2335524 2257534 2186814 2119727 2051827 1985965 1926818 1872160 1817356
55780 1817356 1764192 1717331 1675672 1634807 1594809 1558246 1523419 1486699 1449181 1414447 1382097
55769 1382097 1349623 1318297 1291094 1266974 1242945 1219599 1199150 1180189 1159744 1138460 1118696
55758 1118696 1099633 1079284 1059270 1042680 1029070 1016086 1004039 994567 986744 978677 970892 964356
55746 964356 957558 949354 942117 938186 935966 933368 932045 933913 936566 936767 935831 936868 939193 940188 940459
55731 940459 942358 945160 946142 944891 942620 939020 933673 928646 925796 923309 918525 912023 905207 896215
55717 896215 882469 865500 849153 834502 820134 805819 792483 780187 769283 761590 757330 753195
55705 753195 746618 739425 733865 727952 718690 707299 696942 687548 677190 666571 657779 650279 642187
55692 642187 633971 627019 620277 612121 603869 597649 592551 586579 580536 576118 572112 566433 560065 555010
55678 555010 550328 544398 539066 536969 536376 533293 527432 521739 517271 512958 509212 507116 504799 499034
55664 499034 490104 481308 474376 468923 465238 463686 462387 459440 456436 455840 456232 454425 451250 450691 453922
55649 453922 458501 462821 467053 470223 470777 469862 469964 470626 469354 466047 462370 457597 449748 440389 433395
55634 433395 429014 423991 417719 413208 411280 408800 403956 398820 395256 392392 389631 388264 388406 387877 385896
55619 385896 384819 386583 390141 393713 396911 399451 400421 399967 399334 398424 395789 391656 388290 386703 385696
55604 385696 384784 385166 386961 388409 388824 389579 391100 391658 390457 389418 390431 392899 395180 396518 396623 395312
55588 395312 393495 392708 392933 392756 392150 392889 395453 397754 397967 396761 395780 395514 395392 394501 391683 386409 379939
55571 379939 374236 369746 365645 361802 358518 354859 349735 344352 341012 339582 337938 335839 335149 335862 335299
55556 335299 332290 329148 328064 328131 327341 325208 321991 317459 311963 307039 303709 301628 300552 300815 301608
55541 301608 300935 298332 295684 294242 292819 290258 287821 287467 289054 290732 291178 290287 288512 286552 285136
55526 285136 284382 283705 282540 280678 278209 275914 275211 276593 278738 280500 282896 287356 292954 297677 301780
55511 301780 307197 313915 319702 323586 326984 331156 335994 341405 347107 350741 349289 343227 336561 331760
55497 331760 327179 320556 312449 304927 299088 295136 292838 290733 286805 281077 275771 272058 268612 264179
55483 264179 259411 255222 251555 248836 248415 250284 252361 253255 253752 254466 254231 252374 250535 250572 252241 254353
55467 254353 256627 259004 260623 260914 260442 259588 257834 255185 252629 250275 246938 242652 239577 238951 238985 237293
55451 237293 233757 229534 224902 219786 215006 211360 208540 206233 205007 204929 204753 203743 202854 202838 202716 201583
55435 201583 200429 200576 201645 202563 203335 204271 204693 204127 203745 205024 207778 210848 213854 216875 219294 220434
55419 220434 220715 220953 221011 220082 217790 214352 210431 207235 205608 204569 202127 198185 195101 194563 195549 196246
55403 196246 196261 195848 194740 193210 192707 193919 195470 195862 195364 194767 193874 192690 192464 193751 194842 194024 192228
55386 192228 191538 192059 192209 191387 190532 190473 191245 192559 193685 193500 191904 190582 191231 193702 196837 200177 203636
55369 203636 206410 207548 207029 205344 202809 200057 198156 197333 196674 195923 196199 197941 199723 200335 200506 201145
55353 201145 201460 200520 199246 199033 199583 199920 200463 202179 204644 206734 208382 209918 210574 209480 207386 205647
55337 205647 204160 201976 199321 197430 196902 197552 199086 200670 200847 199337 197849 197633 197549 196284 195027 195698
55321 195698 197581 198146 196536 194050 191789 189962 188916 188628 187571 184252 179540 175628 173293 172276 173444
55306 173444 177761 183374 186624 186395 185135 185191 186373 187585 188567 189211 189040 188228 187643 187271 186049 183845
55290 183845 182141 182171 183578 185427 187305 188976 190231 191547 193776 196676 198763 199060 198027 196405 194174
55275 194174 191178 187953 185348 183766 183106 183085 183443 184058 184806 185243 184935 184321 184453 185427 185996 185463 184934 185720
55257 185720 187452 188919 189817 190412 190355 189272 187816 186824 186212 185930 186966 189698 192190 192054 189488 186733
55241 186733 185157 184617 185042 186567 188403 189489 190005 190533 190283 188075 184656 182013 180734 180160 180639 183186
55225 183186 186936 189424 189692 189071 188750 188760 189449 191540 194198 195358 194650 193941 194388 195102 195456 196505 198930
55208 198930 201316 201664 199371 195023 189791 185729 185030 187852 191898 194848 196147 196283 195871 195975 197697
55193 197697 200659 203146 204201 204317 203859 202599 201239 201446 203549 205892 207150 207545 207107 204836 200831
55178 200831 197392 196460 197317 198114 198348 198534 198708 198782 199348 200761 202195 202791 202982 203602 204453 204759 204378 203785
55160 203785 203583 204692 207907 212427 215728 215882 213277 209525 205734 202519 200457 199459 198645 197759 197745 199131
55144 199131 200939 202142 202969 203704 203474 201666 199550 198839 199265 199090 197650 196047 195476 196012 196991 197781 198271
55127 198271 199083 200879 203093 204076 203105 201347 200139 199269 198051 197159 197942 200274 202417 202959 201990 200460
55111 200460 199207 198540 198123 197377 196378 196025 196856 198191 199065 199524 200260 201321 202054 202262 202778 204639 207864
55094 207864 211149 212914 212874 212207 211760 210714 207999 204521 202462 202467 203202 203825 205013 206912 208104 207742 207000
55077 207000 207046 207071 205875 204124 203262 203180 202818 202345 202793 203882 204137 203237 202620 203476 205373 207201 208476 209434
55059 209434 210618 212562 215225 217682 218872 218625 217486 215881 214090 212708 212300 212655 213086 213435 214167 215525
55043 215525 217068 218078 218164 217594 217241 217910 219522 221270 222639 223616 223839 222540 219865 217340 216301 216601
55027 216601 217436 218523 219625 219934 219224 219066 221521 226667 232456 236958 239920 242070 243752 244613 244373 243729
55011 243729 244200 246591 249625 250996 250014 248336 247732 248140 248491 248386 248018 247365 246436 245668 245175 244282 242646
54994 242646 241145 240698 240842 240364 238704 235927 232196 228328 226015 226237 228089 230306 233089 237024 240875
54979 240875 242198 240007 235484 230319 225681 222475 221017 220428 219676 219156 219974 221715 222463 221233 218974
54964 218974 216879 215082 213559 212984 213727 214893 215317 215128 215504 216983 218548 218609 216676 213848 211610 210487
54948 210487 210233 210811 212178 213273 212678 210775 209941 211854 215700 219682 222933 225002 225186 223880 223200 224448
54932 224448 226098 226204 225533 225980 226954 226272 224252 223767 225895 228433 229611 230622 233096 236216 237985 237860
54916 237860 236644 234908 232869 231077 230136 230324 231882 234715 237440 238176 236971 236116 237185 239131 240310
54901 240310 240906 242020 243513 244361 244395 244151 243551 242157 240426 239335 238932 238373 237286 236092 235172 234675 234969
54884 234969 236239 237757 238618 239200 240734 243235 244976 244557 242560 240464 238675 236623 234420 233277 234025
54869 234025 236111 238601 241537 245447 249832 253151 254558 254792 254954 255200 255390 256352 259423 264798 271075
54854 271075 276546 280565 283868 287968 293876 300849 306718 309976 311003 310670 308719 304861 300632 298158
54840 298158 297075 294602 289166 282292 276248 271439 267138 263399 260862 259394 258149 256635 255031 253993
54826 253993 254607 257546 261487 263446 262012 259542 259752 263475 268146 271246 272802 274198 275900 277145 277289
54811 277289 276792 277045 279428 284286 290651 297065 302663 307235 310516 311952 311312 309088 306063 302643 298801
54796 298801 294593 290539 287341 285261 283941 282952 282162 281263 279316 275572 270725 266451 263337 260024 255040
54781 255040 248912 243659 240440 238531 236686 234802 233880 234672 236723 238715 239526 238851 237029 234672 232609
54766 232609 231792 232738 235086 237958 240571 242241 242330 241089 240337 242158 246580 251372 254526 256177 257564
54751 257564 258920 259229 257612 254194 249834 245655 242690 241374 241380 242197 243630 245334 246293 245592 243689 242239
54735 242239 242379 243612 244643 244985 245401 246850 249354 252052 254130 255338 255757 255633 255695 256909 259238 261144
54719 261144 261311 260673 261533 264565 267891 269677 270443 271870 274198 276120 276917 277464 279018 281879 285458 289023
54703 289023 292138 294942 298267 303053 309289 315747 320983 324482 326819 328947 331469 334248 336294 336088
54689 336088 332512 325943 318365 311950 307360 303588 299447 294775 290138 286056 283063 281851 282433 283394 282902
54674 282902 280508 277342 274645 272934 272409 273032 274009 274274 273874 273939 274953 276056 276554 276988 278010 279299
54658 279299 280566 282660 286442 291226 295578 299145 302446 305241 306589 306507 306186 306248 305937 304455 302151 299809
54642 299809 297493 294718 291359 287917 285112 283469 282994 283014 282544 280937 278098 274299 270179 266697 264346
54627 264346 262318 259183 254706 250458 248275 248557 250400 252804 255200 257102 258039 257960 257311 256538 255655 254333
54611 254333 252280 249538 246566 244119 242943 243406 245260 247725 249900 251255 251766 251570 250691 249280 248015
54596 248015 247840 249109 251190 253072 254261 254927 255374 255740 256184 256918 257715 257640 255814 252557 249352 247464
54580 247464 246902 246974 247463 248675 250549 252369 253531 254093 254382 254425 254036 253222 252340 251937 252449 253757 255015
54563 255015 255298 254493 253269 252126 250966 249669 248491 247525 246301 244467 242571 241622 241997 243194 244564
54548 244564 245871 247140 248343 249395 250356 251516 253212 255436 257660 259247 259976 259910 258880 256719 254083
54533 254083 252391 252553 254127 256055 257801 259393 260855 262229 263832 265865 267797 268572 267497 264812 261681
54518 261681 259720 259980 261875 263535 263812 263523 264084 265409 266150 265828 265512 266095 266887 266547 264790 262512 260586
54501 260586 259160 257979 256875 255868 255136 254960 255513 256601 257697 258321 258416 258366 258558 258913 259007 258698 258437 258667
54483 258667 259117 259094 258516 258217 259004 260651 262206 263225 264373 266626 270031 273496 275767 276439 275992 275213
54467 275213 274780 275067 275842 276227 275451 273678 271789 270404 269592 269346 269581 269639 268798 267674 268081 270604 273060
54450 273060 272586 268968 264799 262486 262258 263183 264754 266737 268462 269343 269755 270547 271794 272627 272267 270741
54434 270741 268664 266780 265633 265179 264676 263437 261751 260531 259980 259311 258185 257723 259241 262305 264989
54419 264989 266085 266236 266689 267824 269374 271313 273743 276225 278013 278935 279672 281279 284541 289270 293837
54404 293837 296116 295720 294801 295685 298146 300039 300223 299489 298727 297800 296658 296047 296215 296086 294720 292857 292020
54387 292020 292581 293492 293456 291721 288291 284215 281266 280502 281344 282513 283424 284176 284779 285174 285585 286059 286086 285387
54369 285387 284704 285013 286320 287969 289638 291199 292100 291972 291462 291343 291157 290041 288751 289191 291618 293744
54353 293744 293314 290579 287509 285497 284632 284510 284796 285297 286157 287780 290049 291948 292620 292663 293748 296797
54337 296797 300962 304569 306836 308324 309871 311531 312826 313657 314323 314695 314259 313293 313152 314609 316530 317231
54321 317231 316788 316926 318615 320908 322458 323246 324300 326347 329283 332561 335657 338385 341070 344262 348122
54306 348122 352285 356220 359367 360986 360500 358140 354830 351249 347420 343318 339352 335986 333292 331135
54292 331135 329451 328094 326677 324737 321961 318368 314667 312317 312490 314736 317169 318214 317753 316420 314426
54277 314426 311472 307457 302916 298981 296995 297592 299808 301578 301609 300515 299817 300185 301074 301795 302399 303543
54261 303543 305736 308641 311036 311763 310981 310180 310690 312431 314344 315723 316661 317355 317499 316409 313601 309333
54245 309333 304708 301062 299009 298231 298307 299257 300932 302323 302313 301108 300271 301097 303339 305643 306728 305937
54229 305937 303303 299775 297147 296986 299344 302773 305725 307670 308854 309443 309252 308160 306518 305116 304677
54214 304677 305119 305356 304373 302641 301840 302815 304510 305533 306025 306931 308061 308326 307797 307917 309346 311048 312204
54197 312204 313683 316602 320480 323851 325913 326622 326059 324913 324754 326359 328182 327907 325319 322342 320471
54182 320471 319565 319144 319268 319747 319818 319262 318885 319270 319789 319379 317764 315576 313779 313199 314005 315473 316796
54165 316796 318110 319962 321720 321608 318822 314834 311915 310831 310391 308993 306266 303380 301803 301558 301060
54150 301060 299210 297174 297084 299217 301720 303169 304000 305023 305931 306109 305900 306137 307118 308732 310816 312750
54134 312750 313516 313077 312959 314522 317134 318974 319224 318568 317900 317534 317544 317957 318455 318488 317797 316531 315047 313976
54116 313976 314096 315512 317196 318082 318553 320100 323341 327015 329275 329606 329069 328819 328794 327992 325799 322709
54100 322709 319773 317736 316879 317187 318166 318803 318345 316955 315208 313238 311088 309448 309021 309279 309025 308299
54084 308299 308474 310150 312147 313194 313570 314252 315262 315675 314761 312518 309823 308585 310854 316794 324017
54069 324017 329751 333262 335505 337094 337755 337515 337383 338587 341621 345990 350599 354517 357686 360644 363510
54054 363510 365822 367671 370201 374431 380102 386219 392051 396982 400001 400306 398130 394317 389332 383287
54040 383287 376631 370179 364608 360297 357281 355036 352842 350820 350020 351023 353033 354828 355899 356155 355447
54025 355447 354195 353607 354221 354940 354603 353847 354138 355437 356250 355880 355314 355746 357255 359174 361007 362784 364955
54008 364955 367869 371082 373594 375155 376677 378757 380725 382060 383744 386779 389999 391095 389635 387618
53994 387618 387008 388073 390102 392344 394044 394826 395432 397110 400149 403995 408726 415100 422935 430708 437222
53979 437222 442716 448042 453761 460339 468212 477237 486837 496852 507408 517956 527529 536039 544182
53966 544182 551896 558183 562717 566333 569586 572188 574293 576725 579137 579584 577154 573763 571827 571061 569169
53951 569169 565123 560102 555297 550370 544538 538070 531941 526410 520587 513519 505520 498145 492707 489091
53937 489091 486355 484086 482369 480709 478183 474974 472626 472128 472577 472499 471806 471657 472928 475698 479827 485094
53921 485094 490735 495647 499401 502822 507447 514341 523095 531714 537631 539090 535789 528661 519428 509959
53907 509959 501179 492617 483728 475455 469412 465553 462044 458029 455167 455411 458225 461187 462800 463535 464335
53892 464335 465295 466051 466715 468054 470927 475516 480852 485295 487822 488830 489611 491332 494618 499593 505866
53877 505866 512623 519092 524944 530329 535793 542004 549002 555741 561056 565203 569794 575980 583366 590942
53863 590942 598449 606525 616060 627515 640163 652006 661480 669513 678843 690886 704371 717483 730011
53850 730011 742502 754545 765083 773603 779950 783801 785493 786627 788501 790427 790694 788738 785243 780712
53836 780712 775305 769666 764479 759178 752292 743035 731700 718793 704943 691323 678884 667258 655596
53823 655596 644305 634638 626773 619725 613054 607012 600930 593377 584431 576047 569317 563007 555916 549102
53809 549102 544151 540222 534643 526302 517108 510007 506329 505003 503567 499995 494252 488186 483593 480474
53795 480474 477438 473402 468452 463476 459564 457470 456931 456550 454867 451574 447352 442847 438420 434680 432389
53780 432389 431575 431313 430743 429956 429570 429677 429633 428972 428325 429136 432206 436590 440184 441580 441196 440574 440809 441836
53762 441836 442898 443319 442975 442424 442526 443720 445621 447543 449380 451731 455211 459866 465313 471237 477690
53747 477690 484968 493193 501956 510516 518536 526446 534786 543249 550833 557014 562392 567894 573615 578810
53733 578810 582976 586565 590504 595179 599987 603873 606396 608405 611578 616934 623537 628815 630432 628041
53719 628041 623326 618514 614743 611425 606765 599124 588523 577078 567555 561103 556419 551283 544801 537947
53705 537947 532066 527208 522141 515868 508932 503008 499158 496619 493529 488835 483195 477973 473802 470479
53691 470479 467918 466447 466037 465788 464660 462477 459812 457057 454229 451729 450664 451798 454475 457159 459006
53676 459006 460367 461689 462682 462986 463109 464020 465976 468311 470241 471387 471611 471030 470355 470699 472722 476263
53660 476263 480830 485983 491043 495007 497271 498280 499187 500997 504190 508807 514473 520358 525471 529158
53646 529158 531465 533216 535689 539727 544897 549761 553268 555844 558917 563508 569303 574890 578866 581149
53632 581149 583370 587622 594464 602332 609090 613823 616904 618861 619832 619977 619755 619639 619806 620075 619913 618624
53616 618624 615955 612465 609014 605911 602949 600184 598189 597419 597741 598749 600144 601490 601977 600957 598693
53601 598693 596217 594394 593414 593147 593527 594376 595249 595863 596463 597418 598683 600095 601923 604372 606646 607614
53585 607614 607754 609379 614028 620428 626054 630204 634249 639091 643795 647122 649259 651346 653977 656746
53571 656746 658899 660090 660885 662668 666510 671949 677463 682305 687108 692337 697018 699788 700761 701711 704545
53556 704545 709953 717290 725325 733179 740675 747731 753796 758489 762631 767594 773464 778843 782803 786012
53542 786012 789314 792269 794027 794832 795661 796940 798590 800792 803616 806168 807197 806502 805017 803572 802177
53527 802177 800300 797186 792165 785507 778901 774362 772546 772484 772645 771774 769141 764915 760256 756438 753848
53512 753848 752139 750981 750079 748914 747271 745816 745410 746044 746997 747722 747960 747458 746482 746209 747622 750177
53496 750177 752493 754178 755962 758269 760771 763436 766908 771507 776685 781770 786696 791911 798074 805660
53482 805660 814209 822207 828546 833940 840161 848277 858665 872163 889394 908833 927371 943674 959721
53469 959721 978221 999480 1021692 1043429 1064792 1086632 1109533 1133570 1158532 1184372 1211520
53458 1211520 1240563 1271621 1304419 1338792 1374512 1410847 1447169 1484020 1522607 1563135 1604543
53447 1604543 1646034 1687734 1729555 1770570 1810086 1848484 1886412 1923989 1961278 1998598 2035695
53436 2035695 2071465 2105229 2137621 2169464 2200481 2229917 2257892 2285343 2312983 2340978 2369230
53425 2369230 2397370 2424768 2451011 2475949 2498905 2518600 2534547 2547973 2560556 2572524 2582605
53414 2582605 2589479 2592675 2592420 2589300 2583850 2575900 2564536 2549256 2530971 2511432 2491835 2472291 2452227
53401 2452227 2430838 2407536 2382580 2357095 2331923 2306536 2279507 2249998 2218552 2186546 2155116
53390 2155116 2124529 2094457 2064916 2036818 2011279 1988656 1968726 1951525 1937074 1924475 1912434
53379 1912434 1901025 1891878 1886207 1883594 1883100 1884539 1888069 1893536 1900965 1910832 1923134 1937081 1952371
53366 1952371 1969797 1989730 2011117 2033068 2056482 2082850 2112207 2143634 2177151 2213652 2253266
53355 2253266 2295129 2338743 2384515 2433097 2485016 2540647 2599630 2660746 2723283 2787990 2855713
53344 2855713 2925901 2997862 3072718 3152177 3235580 3320053 3403715 3487040 3570890 3655085 3739454
53333 3739454 3824515 3910139 3994852 4077434 4158077 4237134 4313814 4387132 4457205 4524447 4588087
53322 4588087 4646546 4698990 4745737 4787392 4824102 4855195 4878953 4893240 4897213 4892235 4880577 4863261
53310 4863261 4839464 4807592 4766493 4716103 4657668 4593193 4524182 4451019 4373921 4294180 4213762
53299 4213762 4133748 4053756 3973041 3891739 3810825 3731197 3653298 3577551 3504643 3434819 3366985
53288 3366985 3299157 3230180 3160652 3091988 3025198 2961122 2901013 2845578 2793584 2742774 2692481
53277 2692481 2644362 2600196 2560033 2523083 2489227 2458621 2430447 2403292 2376522 2350348 2324659
53266 2324659 2298824 2272879 2248178 2226426 2208282 2192991 2179073 2165350 2151681 2138890 2127859
53255 2127859 2118818 2111818 2107609 2107218 2110319 2114811 2118853 2123174 2130539 2142713 2158707 2176417 2195305
53242 2195305 2216481 2240440 2265995 2291911 2318678 2347897 2380364 2415384 2451569 2487602 2522644
53231 2522644 2556954 2591987 2628842 2666393 2701759 2732901 2760076 2784414 2805877 2823257 2835642
53220 2835642 2843146 2846394 2845970 2842398 2836058 2826908 2814410 2797871 2776850 2751422 2722256 2690370 2656501
53207 2656501 2620581 2582011 2540644 2497380 2453536 2409574 2364830 2318726 2271832 2225156 2178706
53196 2178706 2131611 2083774 2036438 1990740 1946539 1903178 1860500 1818347 1775993 1733282 1691641
53185 1691641 1652550 1615352 1578036 1540123 1503214 1468457 1435103 1402272 1370747 1341940 1315909
53174 1315909 1291438 1267542 1244161 1221757 1200901 1181840 1163953 1146044 1127568 1109029 1090795
53163 1090795 1072294 1053003 1033490 1014620 996282 977798 959080 940479 921857 902826 883744
53152 883744 865601 849005 833996 820553 808422 796623 784271 771841 760590 750535 740142
53141 740142 728350 715938 704280 693611 683222 672693 662117 651518 640884 630626 621353 613206
53129 613206 605901 599388 593876 589124 584130 577773 569658 560387 551320 544095 539858 538428 538153 536925
53115 536925 533718 529244 525140 522439 520797 519095 516623 513628 510898 508997 507858 506902 505449 503170
53101 503170 500282 497420 495398 494961 496337 498642 499992 498911 495943 493508 493635 495936 498063 498058 495874
53086 495874 492661 489193 485477 481630 478441 476680 476123 475826 475475 475975 478197 481389 483594 483879 483504 484346
53070 484346 486655 489110 490802 492210 494173 496803 499718 502511 504497 504866 503864 503274 504834 508586 513517
53055 513517 519289 526114 533153 538558 541529 543211 544958 546612 547111 546045 543834 540985 537969 535419
53041 535419 533586 531682 528382 523130 516706 510684 506452 504371 503547 502655 501163 499419 497514 494865 491333
53026 491333 488036 486381 486745 488551 491000 493104 493741 492649 490932 489746 488882 487429 485322 483229 481382
53011 481382 479647 478473 478405 478672 477541 474393 470434 467098 464621 462459 460182 457626 454895 452515 451038
52996 451038 450445 450565 451871 454859 458661 461503 462754 463414 464308 465019 465058 464764 464293 462937 460441 458070
52980 458070 457271 457874 458623 458904 458945 458773 458062 456929 456027 455816 456264 457060 457586 456957 454774 451862 449821 449912
52962 449912 452471 456910 461766 465219 466309 465648 464598 463911 463549 463393 463577 464240 465337 466675 467942 468892
52946 468892 469579 470113 470169 469359 468205 467949 469013 470412 471159 471465 471907 472301 472288 472315 472923 473491 472907 471332
52928 471332 470337 471288 474342 478875 484001 488723 492367 494987 496842 497757 497687 497559 498485 500254 501622 502106
52912 502106 502403 502891 502896 501983 500950 500812 501474 502196 502889 504149 506139 508148 509402 510003 510878 512824 515615
52895 515615 518106 519329 519334 518770 517917 516601 514877 513097 511174 508429 504589 500449 497084 494690 492697
52880 492697 490868 489711 489638 490154 490222 489288 487683 486117 485170 485250 486506 488360 489540 489184 487792 486499 485528
52863 485528 484086 481831 479560 478180 477768 478077 479198 481032 482788 483698 483880 483874 483784 483500 483281 483288 482999 481897
52845 481897 480459 479611 479519 479754 480357 481625 483007 483392 482732 482304 482967 484094 484769 485275 486685 489352 492361
52828 492361 494353 494539 493062 490656 488068 485926 485080 486414 489790 493570 496051 497253 498520 500411 502039
52813 502039 502721 503271 504988 507966 511111 513540 515351 517136 519197 521339 523213 524723 526032 527158 527870
52798 527870 528164 528477 528935 528667 526532 522484 517609 512785 507943 502720 497239 491995 487435 483779 480803
52783 480803 477735 473835 469215 464740 461188 458984 458458 459478 460798 460823 459304 457458 456091 454639 452542
52768 452542 450525 449623 449739 450112 450625 451487 452116 451696 450833 451299 453610 455870 455833 453535 451055 449962 449920
52751 449920 449855 449599 449777 450581 451534 452480 454049 456695 459785 462153 463360 463975 464697 465507 465675 464361 461372
52734 461372 457522 454030 451393 449158 446981 445309 444512 444017 443145 442289 442248 442629 442131 440403 438438 436883
52718 436883 435186 432950 431116 430990 432688 435180 437413 438800 439067 438270 436809 435149 433666 432868 433207
52703 433207 434415 435601 436343 437224 439011 441824 445410 449499 453445 456080 456628 455404 453228 450694 448504
52688 448504 447815 449307 452190 454972 457131 459296 461842 464139 465495 466333 467920 470984 474844 478043 479807
52673 479807 480641 481405 482227 482860 483732 485643 488366 490571 491569 492256 493704 495442 495956 494514 491873 489407
52657 489407 488065 487914 488194 487986 487108 486118 485349 484486 483386 482604 482589 482943 482975 482479 481534 480256 479309 479742
52639 479742 481434 482479 481237 478409 475955 474508 473208 471693 470716 470718 471258 472161 474055 477322 481422 485463
52623 485463 488526 489421 487534 484375 482892 484269 486409 486617 484941 483723 484355 485768 486017 484204 480723
52608 480723 476648 473443 472676 475196 480403 486548 491835 495401 497419 498483 499006 499160 499159 499339 500053 501691
52592 501691 504680 509173 514702 520310 524955 527615 527461 524563 520372 516750 514349 512495 510775 509848 510267
52577 510267 511274 511620 511150 510689 510541 510063 508889 507757 507660 508659 510030 511365 513071 515766 519397 523023
52561 523023 525394 525835 524720 523111 521917 521313 520878 520165 519191 518484 518587 519408 520284 521044 522736 526429 531127
52544 531127 533838 532574 528705 525339 523825 523198 522904 524108 527392 530781 531752 530540 529770 531048 533431
52529 533431 535348 536463 537176 537548 537498 537268 537069 536923 537168 538256 539692 540253 539910 540384 542801 545808 547230
52512 547230 546816 545914 545076 543694 541801 540427 539774 538597 536151 533549 532343 532658 533547 534369 534859 534469
52496 534469 532863 530925 530209 531199 532841 533951 534285 533927 532414 529347 525612 523036 522536 523184 523487 523107
52480 523107 522767 522828 522831 522538 522634 523930 526380 529323 532298 535073 537215 538322 538706 539246 540376 541485 541507
52463 541507 540024 537746 535971 535515 536134 537012 537783 538794 540487 542957 546236 550444 555375 560411 565172
52448 565172 569879 574754 579532 583881 587751 590860 592551 592838 592900 593542 593626 591265 586442 581285 577594 575127
52432 575127 572653 569695 566633 563804 561239 559014 557328 556273 555721 555411 555108 554812 554751 555079 555829 557273
52416 557273 559741 562556 563808 562199 558919 556719 557148 559556 562653 565837 568790 571105 572982 575399
52402 575399 578860 582618 585800 588700 592229 596481 600464 603068 603841 603075 601495 599664 597509 594648 591164
52387 591164 587492 583539 578734 573216 568116 564209 561189 558794 557654 558104 558905 558363 556257 553636 551119
52372 551119 548608 546583 546277 548202 551365 554313 556262 556957 556220 554245 551865 550065 549434 550322 553150
52357 553150 558163 564963 572527 579670 585599 590350 594794 599916 606007 612834 620609 630292 642608 657037
52343 657037 672014 685873 697270 704992 708055 706382 701225 694564 687889 681457 674761 667670 660997
52330 660997 655818 652279 649285 645553 640946 636634 633859 632658 632034 631321 630961 631672 633248 634826 636219
52315 636219 638108 640646 642736 643610 644677 648690 656877 667637 678354 687775 696134 703701 710158 715217
52301 715217 718987 721517 722643 722592 722208 722170 722342 722334 722394 723167 724807 726997 729790 733677 738618 743787 748761
52284 748761 754376 761704 770619 780148 790035 800980 813302 826314 839447 853199 868264 884232
52272 884232 899993 915269 931037 948447 967996 989836 1014095 1040430 1067954 1096253 1126060
52261 1126060 1158205 1192200 1226740 1261358 1296339 1330785 1362264 1389376 1413674 1437817 1462566
52250 1462566 1486964 1510802 1534949 1559192 1581678 1601187 1618426 1634330 1648582 1660859 1672077
52239 1672077 1683075 1693177 1701554 1708937 1716210 1722129 1724582 1723862 1722583 1722087 1720805 1716670 1709522 1700453
52225 1700453 1690352 1680085 1670996 1664084 1659294 1656316 1655439 1657046 1660948 1666943 1675472 1687078 1701581
52212 1701581 1718190 1736031 1754343 1772711 1791384 1810804 1830678 1850120 1868743 1886647 1903320
52201 1903320 1917833 1930562 1943373 1957374 1971609 1984740 1996775 2008132 2018242 2026488 2033654 2040921
52189 2040921 2047926 2053153 2055794 2055864 2052915 2046223 2036237 2024475 2011756 1997574 1981371 1963402 1944207
52176 1944207 1924209 1904092 1884820 1867048 1851001 1836771 1824081 1812079 1800383 1790153 1782937
52165 1782937 1778386 1774263 1768913 1762632 1756411 1750676 1745892 1743189 1743271 1745295 1747685 1749636 1751216 1752656
52151 1752656 1754499 1758068 1764596 1773612 1782920 1790550 1796410 1801773 1807538 1813474 1819031 1824323 1829929 1835981
52137 1835981 1841974 1847523 1852864 1858459 1864461 1870699 1876677 1881497 1884454 1886164 1888395 1892121 1896340 1899568
52123 1899568 1901853 1904299 1907091 1909263 1910144 1909672 1907321 1902274 1895046 1887500 1880457 1872555 1862460 1851271
52109 1851271 1841540 1834518 1829485 1825444 1822246 1820061 1818837 1818668 1819979 1822888 1826821 1831141 1835954 1841880
52095 1841880 1848977 1856150 1861891 1865617 1868071 1870239 1872133 1873001 1872588 1871680 1871358 1872169 1874202 1877477 1881956
52080 1881956 1887391 1893442 1899861 1906558 1913756 1922029 1931890 1943367 1956459 1971834 1990281 2011352 2033541
52067 2033541 2056320 2081134 2109550 2141064 2173744 2206667 2240677 2276825 2315138 2355110 2396383
52056 2396383 2438475 2480561 2522080 2562960 2602628 2639258 2670794 2696603 2717472 2734059 2746004
52045 2746004 2752760 2754700 2752984 2748640 2742086 2733401 2722785 2710753 2697934 2684614 2670653 2656323
52033 2656323 2643094 2632691 2624782 2616367 2604445 2589008 2572469 2556466 2540583 2524409 2509262 2496696
52021 2496696 2486179 2475649 2464367 2454255 2448110 2446882 2448894 2451608 2454233 2458660 2467527 2481330 2497963
52008 2497963 2515111 2532216 2549626 2566922 2583240 2598591 2613531 2627698 2639951 2650069 2659175
51997 2659175 2668139 2676326 2682180 2684324 2681985 2675334 2665882 2655747 2645819 2635038 2621891 2606219 2589110
51984 2589110 2571355 2552516 2531419 2507248 2480246 2451550 2422341 2393129 2363812 2334126 2303867
51973 2303867 2273112 2242726 2214381 2189357 2167446 2147625 2129575 2113753 2100062 2087472 2075210
51962 2075210 2063443 2052419 2041596 2030132 2017666 2004231 1989808 1974374 1958114 1941271 1924052
51951 1924052 1906710 1889410 1871980 1854138 1835865 1816991 1796606 1773625 1748055 1721031 1693595
51940 1693595 1666094 1638733 1611813 1585267 1558749 1532261 1505892 1479062 1451210 1423379 1397877
51929 1397877 1376032 1357433 1341609 1328852 1318722 1309314 1299211 1289001 1279708 1270820 1261066 1250109
51917 1250109 1238053 1224107 1207341 1188406 1169206 1151207 1134973 1120701 1107910 1095336 1082649
51906 1082649 1071812 1065138 1062240 1060614 1059163 1059425 1062990 1069304 1076673 1084319 1092921 1103940 1118614
51893 1118614 1136555 1155071 1170909 1183052 1192928 1201888 1209804 1216574 1223506 1232245 1243291 1256479
51881 1256479 1271953 1289419 1306815 1320988 1330039 1334576 1336565 1337236 1336151 1332251 1325606 1317732 1309911
51868 1309911 1301810 1292365 1281459 1269596 1256306 1240344 1221648 1201538 1180491 1157185 1130778 1103022
51856 1103022 1076807 1053129 1030620 1007795 984808 963022 943586 926652 911850 899366 890158
51845 890158 884469 880504 875845 870427 866797 866898 869962 874466 880611 889286 899565 909200 917284 924707
51831 924707 931973 937977 941165 940629 935847 926697 914210 900415 887005 874846 864737 857430 852564
51818 852564 848713 845092 842371 841358 841906 843731 847310 853083 860499 868624 877051 885378 892634 898293
51804 898293 903257 908508 913097 914750 912433 907246 900816 894020 887356 881249 875488 869603 864472 862521
51790 862521 865307 871529 878296 883817 888072 891522 894396 896882 898670 898214 893710 885228 874940 864771
51776 864771 854743 844263 834069 825742 819601 814216 808248 802053 797163 794601 794009 794198 794263 794170 794347
51761 794347 794771 794616 792910 789385 784586 779369 774622 771149 769231 768200 766922 765002 763250 762820 764130
51746 764130 766800 770271 774088 777731 780765 783310 785963 788950 791564 792810 792530 791474 790192 788277
51732 788277 785058 780711 776246 772467 769375 766559 763729 760848 758229 756568 756311 756769 756472 754824 752835
51717 752835 751589 750576 748514 745595 743807 744692 747565 750453 752276 753658 756079 760811 768377 778361
51703 778361 789669 801382 813435 826184 839372 851966 863116 872843 881419 888293 892103 891844 887632
51690 887632 880223 870205 858098 845022 832530 821437 811187 800775 790212 780706 773509 768971
51678 768971 766848 767146 770245 776150 784023 792785 802102 812332 823329 833730 841968 847795 852268 856332
51664 856332 860173 864039 868833 875215 882539 889074 892935 892588 887299 877960 867081 857097 848771 841739
51650 841739 836045 832064 829149 825556 820075 813037 805675 799370 795530 795055 797407 800950 804570 808185
51636 808185 811475 813346 813368 812622 812082 811082 808726 806176 805893 808543 811996 813729 813209 811562 809882 808527
51620 808527 807510 806837 806626 807199 808881 811605 814926 818445 821812 824493 826249 828003 831479 837587 845830
51605 845830 855666 867533 881694 896764 910572 922210 932022 939532 942738 940091 932319 921658 909995
51592 909995 898517 888484 881212 877328 876700 878858 882682 885935 886390 883915 880591 878219 876319 873148
51578 873148 867981 861519 854368 846048 835657 822949 808680 794342 781655 771679 764087 757489 750724
51565 750724 743773 737454 732428 728609 725297 721703 717376 712244 706451 700412 694998 691231 689467 689100
51551 689100 689323 689913 690963 692160 692958 693398 694217 695994 698513 701045 702995 704376 705961 708943 714067
51536 714067 721129 729609 739636 751869 766443 782488 798663 813643 826116 834851 839084 838774 834716
51523 834716 828703 823103 819458 817604 816782 817286 820047 824864 830531 836965 845764 858006 872799 888905
51509 888905 906567 926457 947765 968844 989392 1010618 1033457 1057796 1083247 1109372 1135143
51498 1135143 1159648 1183880 1210722 1242429 1278762 1317971 1358700 1400039 1440235 1476381 1505590
51487 1505590 1526147 1537579 1540182 1534807 1522891 1506188 1485919 1462064 1433789 1400823 1364218 1325574
51475 1325574 1285942 1245907 1206387 1168539 1132850 1098924 1066243 1034737 1004588 976047 949648
51464 949648 926194 906306 890133 877400 867228 858007 848218 837700 827685 819301 812406 806031
51452 806031 799422 792413 785317 778942 774227 771261 768883 765789 761901 758218 755454 753366 751431 749618
51438 749618 748272 747548 747275 747292 747724 748928 751199 754439 758091 761504 764416 766967 769180 770547 770413 768804
51422 768804 766563 764431 762103 758559 753360 747235 741169 735238 728603 720560 711366 702174 694300 688325
51408 688325 683648 679061 673981 668989 664993 662183 660149 658664 657815 657564 657773 658594 660217 662283 664142
51393 664142 665771 667883 671072 675489 681478 689662 699874 710587 720212 728835 738180 749801 763647
51380 763647 778450 793218 808043 823261 838001 850028 857410 859950 858627 854173 847121 839039 832380
51367 832380 828446 826042 822526 815854 805721 793693 782637 775072 771275 769330 767306 764715 761674
51354 761674 757909 753537 749874 748235 748413 749332 750745 753238 757050 762034 768331 775737 782735 787727 791244
51339 791244 795414 801074 806921 811997 817435 824805 833953 843522 852735 861742 870942 881110 893622 909525
51325 909525 928532 949595 972115 995982 1021132 1048131 1078881 1115534 1158464 1206017 1256395
51314 1256395 1309258 1365392 1425226 1487508 1548763 1603887 1647970 1678214 1694592 1699012 1693757 1680089
51302 1680089 1657852 1626711 1587840 1543613 1495316 1442323 1384518 1324591 1266489 1212138 1161294
51291 1161294 1114218 1072462 1036602 1005079 976321 950674 929129 911183 895215 880333 866631
51280 866631 853980 841658 829084 816179 803143 790497 779028 768973 759527 749908 740730 733440
51268 733440 728479 724804 721322 718000 715328 713347 711572 709537 707148 704699 702664 701286 700387 699692 699118
51253 699118 698522 697512 696046 694949 695227 696981 699598 702776 706527 710189 712355 712110 709818 706613 703787
51238 703787 702602 703519 705136 704942 702011 698327 696623 697474 699288 700514 700685 699642 697271 694489 693462
51223 693462 695986 701844 709061 715466 719969 722954 726037 731161 739227 749258 758885 765775 768895 768940
51209 768940 767699 766709 766187 765354 763885 762810 763774 767545 773488 780244 786595 791744 795191 796573 795548
51194 795548 791861 785813 778642 772082 767195 763689 760432 756448 751380 745411 739175 733576 729192 725782
51180 725782 722691 719666 716865 714097 710711 706529 702309 698839 695963 693099 690398 688716 688481 689145 689803
51165 689803 689889 689281 688295 687726 688419 690533 693514 696789 700076 702985 705019 706248 707423 709040 710810 712490
51149 712490 714639 717859 721647 724915 727594 730876 735604 740971 745228 747441 748272 749179 750979 753103 754294
51134 754294 754112 753595 754175 756101 758382 760166 761555 762890 763900 764007 763066 761272 758646 755255 751893
51119 751893 749818 749592 750607 751956 753253 754266 754282 752617 749723 747084 745766 745390 744790 743441 741975
51104 741975 741423 742146 743485 744446 744832 745630 748003 752008 756680 761243 765514 768980 770441 769306 766711
51089 766711 764551 763730 764013 765030 766354 766853 765327 762096 758939 757098 756159 755229 754238 753552 753172 752995
51073 752995 753202 753692 753802 753291 753029 753983 755968 758152 760207 762126 763501 764088 764769 766790 770081 773438
51057 773438 776332 779355 782620 784931 785190 783898 782590 782287 783009 784396 786189 788212 790274 792174 793867
51042 793867 795775 798747 803298 808980 814966 821050 827315 832913 836237 836794 836146 836436 838547 842153 846831
51027 846831 852231 857522 861627 864151 865605 866725 867947 869471 871362 873526 875877 878562 881924 886315
51013 886315 891998 898928 906470 913724 920397 927032 934111 941538 949540 959551 973172 990415 1009870
51000 1009870 1030692 1053584 1079583 1108749 1140274 1172888 1204367 1231484 1251846 1265968 1276898
50989 1276898 1287641 1299270 1311138 1321834 1329679 1333315 1332813 1329859 1326098 1321305 1313741 1302203 1287218
50976 1287218 1270350 1253260 1237778 1225795 1217806 1211546 1203053 1189696 1172050 1152745 1133911 1116064
50964 1116064 1098987 1082911 1068634 1057007 1048732 1044445 1044472 1048394 1055189 1064013 1074569 1086545 1099136
50951 1099136 1111558 1123793 1136170 1148195 1158505 1166228 1171899 1176682 1181136 1185097 1188246 1190369 1191443
50938 1191443 1192051 1193233 1195196 1196568 1195987 1194427 1194882 1199419 1207394 1217008 1227571 1239418 1252347 1265515
50924 1265515 1278949 1294176 1312856 1335215 1360188 1386726 1414668 1444436 1476174 1509132 1541806
50913 1541806 1572901 1602447 1631982 1663510 1698332 1737022 1780213 1828716 1882588 1940774 2002404
50902 2002404 2068235 2139983 2218033 2300565 2385316 2471603 2560041 2650750 2742539 2833529 2921770
50891 2921770 3005342 3082702 3153202 3216783 3273068 3321268 3361015 3392706 3416951 3434517 3447114
50880 3447114 3457305 3466751 3474897 3480055 3481475 3479623 3474649 3465672 3451976 3434352 3414693 3394319 3372791
50867 3372791 3348143 3318082 3281241 3237658 3188322 3134322 3076443 3015276 2951233 2884343 2814419
50856 2814419 2741742 2667390 2592631 2518253 2444969 2374303 2308285 2247832 2191948 2139106 2089242
50845 2089242 2043864 2004218 1969805 1938710 1908987 1879804 1851751 1826136 1803605 1783413 1764378
50834 1764378 1746373 1730208 1716177 1703676 1692417 1682926 1675422 1669296 1664432 1661849 1661919 1662972 1663249
50821 1663249 1663647 1666776 1673463 1681960 1690750 1700343 1711585 1723930 1736617 1750526 1767522 1788444 1812747
50808 1812747 1839711 1869094 1900812 1934836 1971318 2010269 2051334 2094473 2140654 2191125 2246041
50797 2246041 2304587 2366678 2433962 2508735 2592079 2683435 2781988 2888101 3003126 3128014 3262709
50786 3262709 3407087 3561821 3727581 3903687 4088359 4280099 4477857 4679762 4882756
50777 4882756 5083886 5281018 5471740 5652368 5818781 5967695 6096639 6203603 6287808 6350386
50767 6350386 6393286 6417632 6424043 6414379 6392207 6361409 6325214 6286861 6250201 6218682 6193643 6173955
50755 6173955 6157320 6141579 6124472 6102337 6069858 6022010 5956487 5873915 5775794 5662817 5535163
50744 5535163 5393408 5238624 5072291 4896845 4715802 4532751 4350663 4172802 4003458
50735 4003458 3846364 3702246 3568975 3444562 3329405 3225461 3133981 3054515 2985643 2926017
50725 2926017 2874765 2831302 2794829 2763869 2736367 2710583 2686227 2664531 2646710 2632081 2618043
50714 2618043 2602242 2584331 2565203 2545211 2524237 2503130 2483431 2465205 2446447 2425422 2402605
50703 2402605 2379487 2356444 2332842 2308536 2283986 2259312 2234482 2210377 2188655 2170475 2156037
50692 2156037 2145291 2138371 2135288 2135845 2139943 2147628 2159103 2175093 2196796 2224799 2258310 2295918
50680 2295918 2336780 2380656 2427570 2478292 2534403 2596755 2664327 2735746 2811458 2893014 2980529
50669 2980529 3072324 3167013 3264343 3363835 3464171 3564434 3664592 3764175 3861664 3955749 4045933
50658 4045933 4131175 4209152 4277742 4336211 4383869 4418350 4436479 4436727 4420319 4390588 4351863 4308255
50646 4308255 4262450 4215825 4170263 4129097 4095305 4069175 4048848 4032906 4021307 4013628 4007568 3999781
50634 3999781 3987554 3969117 3942792 3906664 3859305 3800477 3731039 3652500 3567013 3477632 3387869
50623 3387869 3300473 3216767 3137413 3063542 2996666 2937729 2886892 2844290 2810436 2785726 2769990
50612 2769990 2762659 2763011 2770215 2783635 2803255 2829354 2861434 2897705 2935687 2973200 3008888 3042301
50600 3042301 3073726 3103887 3133869 3165220 3199455 3236834 3276110 3316160 3357422 3400876 3446106
50589 3446106 3491745 3537849 3586455 3639333 3696134 3755160 3815162 3876138 3939277 4006356 4078199
50578 4078199 4153389 4229527 4306051 4384613 4466059 4548315 4628038 4703223 4773367 4838375 4898631
50567 4898631 4955262 5008752 5057681 5099885 5134227 5159773 5173728 5172069 5152902 5118475 5073703
50556 5073703 5023522 4971708 4921246 4875009 4835848 4805705 4784414 4769805 4759415 4751646 4745010 4737276
50544 4737276 4726396 4711437 4691163 4662148 4619911 4562167 4489805 4404724 4308263 4202110 4089108
50533 4089108 3972022 3852287 3730908 3609932 3492049 3379063 3271578 3170003 3075105 2987562
50523 2987562 2907505 2834625 2768413 2708377 2654418 2607025 2566753 2533376 2505748 2482589 2463285
50512 2463285 2447990 2437384 2432601 2434852 2444209 2458547 2474561 2490643 2508445 2530896 2558906 2590902
50500 2590902 2625433 2662895 2704232 2749077 2796145 2844777 2895082 2946982 3000058 3054101 3109018
50489 3109018 3164448 3220325 3277619 3337534 3399910 3463248 3526425 3589651 3653803 3719929 3789724
50478 3789724 3865413 3948278 4037861 4133325 4235189 4345075 4464127 4592604 4730879 4879698
50468 4879698 5039023 5207351 5382960 5565453 5755233 5951476 6151396 6351777 6550496
50459 6550496 6746098 6936555 7119239 7291638 7451127 7594121 7716518 7815154 7888114 7933531
50449 7933531 7949193 7933861 7888365 7815073 7717058 7598216 7463306 7317254 7164991 7012314
50439 7012314 6865767 6730648 6609729 6504694 6417978 6352006 6307193 6281951 6274272 6281892 6300912
50428 6300912 6325486 6349154 6365563 6367909 6349065 6303263 6227684 6122661 5991082 5837514 5666990
50417 5666990 5484077 5293127 5098724 4904722 4712873 4523581 4338435 4161078 3995097
50408 3995097 3841692 3699883 3568450 3447161 3336452 3236434 3146270 3064610 2990795 2925393
50398 2925393 2869157 2821790 2782350 2750487 2726272 2708928 2696896 2689499 2687650 2692453 2703839 2720885
50386 2720885 2742717 2768643 2798030 2830563 2866160 2904300 2943946 2984225 3024368 3062428 3094854
50375 3094854 3118206 3131221 3135105 3132507 3126603 3120242 3114837 3110127 3105710 3102688 3103198 3108384 3117450 3128929
50361 3128929 3142504 3159348 3180845 3207302 3238069 3272844 3312578 3359014 3413650 3477213 3549411
50350 3549411 3628528 3711796 3797267 3885243 3976996 4072090 4167972 4262167 4353651 4441786 4525278
50339 4525278 4602797 4673385 4735263 4785242 4820422 4839702 4842668 4827977 4794454 4743209 4676859
50328 4676859 4596693 4502505 4395929 4282521 4169375 4061248 3959754 3865613 3780572 3707186
50318 3707186 3647621 3602815 3572181 3553774 3545003 3543529 3547583 3555484 3564985 3572990 3575710 3569300 3551085
50305 3551085 3520702 3479833 3430365 3372936 3307729 3236467 3162755 3090176 3020562 2954186 2890402
50294 2890402 2827294 2761595 2690466 2613516 2532557 2449893 2367861 2289467 2217657 2153376 2095359
50283 2095359 2042326 1994561 1953139 1918734 1891634 1871764 1857919 1847937 1840527 1836179 1835509 1837622
50271 1837622 1841101 1845830 1852544 1861056 1870238 1879560 1889480 1900279 1911538 1922785 1933758 1944061 1953581
50258 1953581 1963315 1974650 1987516 2000143 2010977 2019872 2027023 2031878 2033999 2034217 2033818 2032988 2031298 2029734
50244 2029734 2031116 2037897 2050089 2065842 2083684 2103615 2126251 2151674 2179576 2210194 2244549 2283565
50232 2283565 2327253 2375221 2427992 2486944 2551556 2615940 2668858 2698923 2701190 2679246 2641341
50221 2641341 2595083 2545303 2494958 2446138 2400188 2357926 2320021 2286636 2256989 2230210 2206671
50210 2206671 2187630 2173489 2163253 2155896 2151309 2149679 2150838 2154661 2161172 2169679 2178594 2186749 2194238
50197 2194238 2201514 2208559 2215692 2224236 2235300 2248334 2261798 2274759 2286878 2297322 2304825 2308611
50185 2308611 2308289 2303209 2293229 2280085 2266761 2255210 2245598 2237802 2232258 2228609 2224620 2217430 2205460
50172 2205460 2188336 2165410 2135461 2098176 2055428 2010550 1966201 1923026 1880527 1839060 1800307
50161 1800307 1765392 1733205 1701570 1669987 1640243 1614093 1591234 1570055 1549655 1530437 1513206
50150 1513206 1498520 1486683 1477570 1470307 1463767 1457599 1452299 1448076 1444192 1439946 1435905 1433345 1432404 1431491
50136 1431491 1428855 1424211 1418399 1412057 1405439 1399140 1393905 1389532 1384835 1379031 1372494 1365789 1358699 1350746
50122 1350746 1342149 1333760 1326507 1321269 1318623 1318020 1317738 1316341 1313837 1310938 1307855 1304706 1302483 1302400 1304472
50107 1304472 1307841 1312370 1318798 1327277 1336938 1347093 1357784 1368829 1379609 1390411 1402896 1418325
50095 1418325 1436198 1455624 1477239 1502521 1531622 1563396 1597691 1636143 1679894 1727466 1775889
50084 1775889 1823427 1870056 1915438 1957954 1996506 2032223 2067115 2101350 2133205 2161647 2187446
50073 2187446 2211074 2230808 2244142 2250299 2250025 2243402 2229512 2208382 2181861 2151982 2119506 2084710
50061 2084710 2048709 2013135 1979019 1946754 1916858 1889962 1866036 1844173 1823282 1802749 1782513
50050 1782513 1762736 1743458 1724452 1705515 1687022 1670085 1655881 1644735 1635835 1627836 1619874 1612240
50038 1612240 1606056 1602196 1600570 1600593 1601981 1604530 1607229 1608443 1607510 1605733 1605329 1607579 1612369 1619189 1627797
50023 1627797 1637699 1647642 1656247 1663165 1669232 1675450 1682055 1688612 1694525 1699065 1701262 1700429 1696914 1691941
50009 1691941 1686617 1681402 1676398 1671526 1666353 1660437 1654112 1648180 1642530 1635880 1627539 1618711 1611250 1605825
49995 1605825 1602214 1600775 1602260 1606344 1611657 1617483 1624423 1633158 1643521 1655083 1667740 1681253 1694952
49982 1694952 1708335 1721464 1734560 1747955 1762650 1779968 1799903 1820457 1839368 1856258 1872525
49971 1872525 1889536 1907569 1926390 1946174 1967555 1990871 2015453 2039777 2062493 2083288 2102536
49960 2102536 2120295 2136061 2149415 2160365 2169045 2175497 2179720 2181357 2179389 2172697 2160768 2143106
49948 2143106 2118237 2084670 2043214 1997231 1950025 1903034 1857028 1813536 1773781 1737211 1702719
49937 1702719 1670913 1643748 1622027 1604682 1590608 1579934 1573067 1569529 1568280 1568403 1568863 1568214 1565231
49924 1565231 1559690 1552172 1543384 1533873 1523956 1513361 1501078 1486022 1467923 1447425 1425465 1402899
49912 1402899 1380712 1360121 1342076 1326616 1312921 1300133 1288086 1277207 1267836 1259827 1252677 1245826
49900 1245826 1238817 1231415 1223734 1216220 1209517 1204413 1201752 1202069 1205217 1210371 1216483 1222783 1229172 1236373
49886 1236373 1245459 1256851 1269940 1283930 1298581 1313485 1327086 1337653 1345308 1351990 1358973 1365464
49874 1365464 1370268 1373784 1377178 1380127 1380578 1376696 1368127 1355445 1339466 1321555 1303778 1287927 1274367
49861 1274367 1262090 1249864 1237264 1224828 1213535 1204240 1197580 1194098 1194027 1196710 1200573 1204083 1206802
49848 1206802 1209371 1212529 1216259 1219883 1222863 1225547 1229071 1234434 1241666 1250061 1259025 1268443 1278450 1289520
49834 1289520 1302660 1318594 1336269 1352848 1365880 1375171 1382053 1387366 1390896 1392458 1392481 1391314 1388689
49821 1388689 1384225 1377989 1370121 1360311 1348143 1334034 1319412 1305669 1293019 1280670 1268212 1256481
49809 1256481 1246751 1239254 1232899 1226525 1220129 1214827 1211813 1211302 1212267 1213389 1214552 1217144 1222469 1230195
49795 1230195 1239028 1248468 1258866 1269942 1280655 1290742 1301112 1312294 1323809 1335677 1349015 1363953
49783 1363953 1378217 1389284 1397116 1403287 1408162 1410783 1411168 1410695 1409854 1407280 1401674 1393374 1383368 1371902
49769 1371902 1359000 1345614 1333294 1322968 1314510 1307281 1300794 1295155 1291047 1288922 1288125 1287395 1286403 1286179
49755 1286179 1287766 1291188 1296121 1302838 1311638 1321775 1331813 1341111 1350244 1359758 1369004 1376650 1382198
49742 1382198 1386531 1390765 1394874 1397947 1399568 1400132 1399487 1396238 1389356 1379969 1370274 1360736 1349596 1335489
49728 1335489 1319315 1302811 1286298 1269031 1251298 1234813 1220988 1209806 1200754 1193950 1189612 1186919
49716 1186919 1184285 1180836 1176974 1173303 1169696 1165980 1163029 1162258 1164017 1167407 1171960 1178594 1188192 1199929
49702 1199929 1211994 1223698 1235794 1248605 1260833 1270773 1278174 1284368 1290796 1297807 1304723 1310557 1314407
49689 1314407 1315380 1312683 1306283 1297387 1287714 1278142 1268613 1259470 1252018 1247100 1243836 1240707 1237465 1234975
49675 1234975 1233520 1232527 1231932 1232434 1233922 1234877 1234253 1233251 1234322 1238677 1245414 1252852 1260088 1267177 1274273
49660 1274273 1281000 1286890 1292408 1299053 1307979 1318828 1330620 1343518 1358595 1375650 1392249 1405499
49648 1405499 1414118 1418354 1418858 1416495 1412637 1408563 1404606 1400524 1396366 1392297 1387859 1382470 1376910 1373512
49634 1373512 1374236 1378590 1383556 1385446 1382040 1373634 1362641 1352310 1345369 1343205 1345708 1351647 1359441 1367874
49620 1367874 1376331 1384730 1393586 1403933 1416579 1431279 1447138 1463941 1482598 1503914 1527363 1551270
49608 1551270 1573609 1592175 1604786 1610542 1611038 1609515 1608464 1608390 1608952 1610683 1615047 1623055 1634259 1646941
49594 1646941 1658792 1667221 1669526 1663558 1648746 1626596 1600138 1572809 1547455 1525562 1506842 1489694
49582 1489694 1472666 1455653 1439703 1425964 1415111 1407396 1402456 1399187 1396547 1394650 1394347 1395519 1396548
49569 1396548 1395846 1393275 1389557 1384975 1379325 1372631 1365025 1356260 1346242 1336022 1327319 1320787 1315357 1309651
49555 1309651 1303580 1298102 1293777 1290118 1286430 1282810 1280014 1278514 1278024 1278062 1278615 1279914 1281781 1283659 1285252
49540 1285252 1286744 1288337 1289989 1291685 1293407 1294635 1294452 1292658 1290411 1289286 1289884 1291764 1294401 1297605
49526 1297605 1301128 1304514 1307499 1310080 1312061 1313014 1313034 1313186 1314641 1317315 1319646 1320022 1318453 1316701 1316785 1319518
49510 1319518 1324489 1331028 1338757 1347406 1356751 1366935 1378454 1391473 1405420 1419445 1433099 1446317
49498 1446317 1458886 1470153 1479125 1484771 1486428 1484285 1479507 1473744 1468265 1463289 1458022 1451593 1444244
49485 1444244 1437474 1432791 1430540 1430373 1432482 1437514 1445199 1453883 1461814 1468444 1474311 1480172 1486489 1493265
49471 1493265 1500186 1507440 1516430 1528911 1545200 1564096 1584896 1608324 1634894 1663564 1693194 1724378
49459 1724378 1758143 1793091 1825360 1851678 1871481 1886020 1896580 1904029 1909109 1912513 1915056 1918050
49447 1918050 1922979 1930554 1940550 1952611 1966506 1981197 1994179 2002221 2002702 1994324 1977234 1952906 1923628
49434 1923628 1891808 1859773 1829853 1803774 1781579 1761796 1743140 1725785 1710704 1698291 1688195
49423 1688195 1680139 1674224 1670393 1668083 1666604 1665670 1665445 1666105 1667341 1668382 1668628 1668347 1668474 1669680 1671765
49408 1671765 1674117 1676546 1679445 1683192 1687591 1691995 1695945 1699625 1703548 1707897 1712438 1717137 1722367 1728202
49394 1728202 1733957 1739003 1743707 1748765 1753669 1756650 1756414 1753433 1749346 1745674 1743181 1741709 1740187 1737451
49380 1737451 1733620 1730166 1728176 1727038 1725522 1723729 1723257 1725686 1731579 1740698 1752317 1765335 1778884
49367 1778884 1793169 1809129 1826992 1845539 1863093 1879101 1894851 1912878 1935309 1962183 1991485
49356 1991485 2021441 2052291 2084398 2114523 2135931 2143670 2139043 2127744 2114556 2101512 2090538 2085056
49344 2085056 2087685 2097729 2112250 2128885 2146689 2165140 2183878 2203322 2224274 2246558 2268810
49333 2268810 2289782 2309243 2327470 2344494 2360045 2373619 2384325 2391244 2394393 2394949 2394039 2391532 2386381
49320 2386381 2378033 2367168 2355123 2342890 2330703 2318359 2305756 2293134 2280922 2269466 2258931
49309 2258931 2249324 2240584 2232831 2226564 2222360 2220190 2219180 2218163 2216166 2212352 2206186 2198093 2189388 2180838
49295 2180838 2171707 2160900 2148515 2135247 2120737 2103973 2085433 2067442 2051854 2038447 2026093
49284 2026093 2014466 2003972 1994970 1987907 1983317 1980823 1978861 1976347 1974114 1973770 1975699 1979108 1983558 1989331
49270 1989331 1996537 2005023 2015192 2027973 2043725 2061523 2079188 2093480 2100969 2100100 2092481 2081257
49258 2081257 2068210 2053246 2036359 2018609 2000872 1982951 1964653 1946822 1930533 1915933 1902531
49247 1902531 1890082 1878560 1867782 1857747 1848981 1841882 1835996 1830649 1826117 1823410 1822747 1822853 1822094 1820056
49233 1820056 1817769 1816560 1817006 1818955 1822191 1826773 1832708 1839564 1846582 1853156 1859214 1865189 1871594 1878474
49219 1878474 1885303 1891502 1896797 1900804 1902775 1902647 1902170 1903706 1907380 1910627 1911361 1910641 1910974 1912825 1914402
49204 1914402 1914677 1914857 1916404 1918935 1920934 1921846 1922732 1925155 1929782 1935891 1942188 1948422 1956168 1967698 1984306
49189 1984306 2006153 2033195 2065113 2100408 2136691 2172005 2204732 2232107 2250396 2257573 2254954 2245403
49177 2245403 2230687 2211463 2189019 2165627 2143200 2122516 2103847 2087720 2074941 2066292 2062136 2061949
49165 2061949 2064363 2068063 2072643 2078340 2085078 2092140 2098848 2105407 2112965 2122673 2134416 2146640 2157869
49152 2157869 2168368 2179773 2193113 2207950 2223607 2240297 2258417 2277495 2296670 2315807 2335327
49141 2335327 2355183 2374826 2394238 2414341 2436213 2460201 2485727 2511546 2536217 2558810 2579463
49130 2579463 2599127 2618705 2638482 2658293 2678030 2697825 2717773 2737565 2756692 2775227 2794253
49119 2794253 2815241 2839040 2865645 2894702 2925827 2958764 2993815 3032070 3074589 3121446 3172268
49108 3172268 3227570 3288706 3356169 3428394 3501891 3571439 3630251 3671764 3692824 3695249 3684303
49097 3684303 3666237 3646780 3629946 3616982 3607199 3600550 3598537 3602113 3609978 3620041 3631491 3644244
49085 3644244 3657455 3670120 3682500 3695566 3709556 3724421 3741004 3760154 3781174 3802903 3826021
49074 3826021 3852482 3882699 3915134 3948735 3983800 4020116 4056370 4092349 4129956 4170680 4213395
49063 4213395 4256018 4298411 4342269 4388743 4437455 4487579 4538960 4592328 4649133 4710933 4778378
49052 4778378 4851018 4928641 5012527 5105227 5209608 5328455 5464238 5618658 5793261 5991353
49042 5991353 6218263 6476956 6761197 7052963 7329234 7575938 7798499 8016824 8243645
49033 8243645 8463079 8631830 8706732 8675496 8562963 8409134 8241015 8061374 7858054 7621005
49023 7621005 7353084 7069359 6788554 6524683 6284806 6071877 5887184 5729631 5594856
49014 5594856 5477152 5372646 5280173 5199642 5130426 5071007 5019032 4971591 4926364 4883084 4843443
49003 4843443 4809046 4779623 4753470 4729324 4707328 4688191 4672054 4658469 4647061 4637665 4629985 4623800
48991 4623800 4619649 4618604 4620964 4625674 4631564 4638762 4648121 4659504 4671418 4682213 4690759 4695901 4696470
48978 4696470 4692499 4685766 4678403 4671460 4665317 4660772 4658633 4658580 4659545 4661366 4665115 4671446 4679272 4686558 4692035
48963 4692035 4695886 4699094 4702388 4705499 4707178 4706240 4702873 4698774 4695886 4695224 4696808 4700122 4704345 4708800
48949 4708800 4713758 4720359 4729193 4739192 4748581 4756686 4764123 4771365 4778024 4783771 4789137 4794813 4800508 4804951
48935 4804951 4806847 4805559 4801175 4794379 4786217 4777632 4769128 4760826 4752561 4743809 4733941 4722998 4712081
48922 4712081 4702487 4694486 4687303 4680304 4673813 4668828 4666482 4667793 4673178 4681684 4691212 4700200 4708856 4718255
48908 4718255 4728606 4739320 4750553 4763365 4777884 4792383 4805068 4816064 4826735 4837713 4848792
48897 4848792 4860452 4874001 4889971 4907611 4926407 4947061 4970395 4996299 5024632 5056337 5092721
48886 5092721 5134017 5179542 5228870 5281997 5338585 5397918 5459528 5523226 5588680 5655683 5724653
48875 5724653 5796142 5869976 5945589 6023024 6102800 6184956 6269123 6355413 6444157 6534736 6625841
48864 6625841 6717242 6810172 6905401 7001931 7098264 7194000 7289325 7383749 7476552 7568060 7659259
48853 7659259 7750007 7838602 7923314 8003761 8080478 8153674 8222870 8287503 8347574 8403587 8456013
48842 8456013 8504912 8550139 8591830 8630411 8666086 8698496 8726995 8751034 8770127 8783592 8790699
48831 8790699 8791241 8785975 8776303 8763252 8746665 8725506 8699027 8667427 8631453 8591831 8549200 8503930
48819 8503930 8455562 8403047 8346103 8285780 8223103 8157894 8089867 8020032 7949441 7876868 7799486
48808 7799486 7716179 7628895 7540444 7452324 7365062 7279193 7195013 7112444 7031987 6954976 6882325
48797 6882325 6813926 6749811 6690804 6637356 6588816 6544608 6504982 6469832 6438095 6409463 6385422
48786 6385422 6367120 6353220 6341537 6332008 6326312 6325053 6327132 6331704 6339111 6349879 6364311 6383088
48774 6383088 6406749 6434249 6463258 6492219 6521168 6550606 6580868 6612678 6646823 6682719 6718501
48763 6718501 6753036 6786805 6820361 6853158 6884744 6916101 6948794 6983263 7018756 7054412 7089653
48752 7089653 7123872 7156683 7188453 7220014 7251769 7283490 7315065 7347077 7380320 7414892 7450026
48741 7450026 7484912 7519395 7553613 7587346 7620369 7653263 7686928 7721145 7754639 7786925 7818954
48730 7818954 7851159 7881970 7909291 7932531 7952003 7967272 7977604 7983373 7985251 7982390 7973231 7957999
48718 7957999 7938433 7914715 7884565 7846097 7800023 7748073 7690526 7626367 7555013 7476895 7392968
48707 7392968 7304589 7213641 7122056 7031080 6940928 6850961 6760593 6670647 6583419 6500524 6421273
48696 6421273 6344413 6270894 6202955 6140563 6081030 6022827 5967632 5917567 5872406 5831141 5794722
48685 5794722 5765169 5742777 5725885 5712844 5702683 5694341 5686995 5681131 5677971 5677693 5679234 5681819 5685743
48672 5685743 5691654 5699849 5710177 5721777 5732987 5742458 5750457 5758303 5766401 5773490 5778036 5779765 5779720 5779231
48658 5779231 5779021 5779047 5779117 5779665 5781626 5785353 5790064 5794750 5799279 5804251 5810155 5817194 5825514 5834916 5844586
48643 5844586 5853744 5862301 5870307 5877003 5881343 5883609 5885859 5890473 5898509 5909440 5921993 5935030 5948011
48630 5948011 5961044 5974596 5989132 6004926 6022026 6040296 6059517 6079286 6098585 6115763 6129588
48619 6129588 6140524 6150418 6160706 6171357 6181777 6192078 6202917 6214556 6226721 6239293 6252597
48608 6252597 6266887 6281810 6296458 6309913 6321545 6330379 6334006 6328653 6311068 6280188 6236547 6180567
48596 6180567 6112494 6033742 5946917 5854286 5757438 5658725 5561646 5468897 5380989 5297437 5218380
48585 5218380 5144246 5074867 5009989 4949973 4894971 4844002 4795851 4750424 4708217 4668810 4630835
48574 4630835 4593186 4555416 4517291 4478951 4441462 4406324 4374282 4344992 4317641 4291397 4265598
48563 4265598 4240233 4216069 4193689 4172512 4151288 4129307 4106615 4083372 4059864 4037165 4017101
48552 4017101 4001074 3988907 3978852 3968902 3958469 3948847 3941702 3937308 3934855 3934170 3935877 3939586 3943332
48539 3943332 3945504 3946208 3945871 3943757 3939230 3933738 3930010 3929344 3930635 3931910 3931962 3930559 3927783 3923118 3914961
48524 3914961 3901499 3882431 3859186 3833054 3804054 3772232 3738862 3705249 3671355 3636999 3603656
48513 3603656 3573468 3546803 3522281 3499104 3477990 3459746 3444096 3430230 3417660 3406293 3396159
48502 3396159 3387056 3378268 3369106 3360023 3352283 3345827 3338472 3328248 3315610 3302097 3287722 3271259 3252540
48489 3252540 3232809 3213146 3194059 3176333 3160694 3146718 3133413 3120641 3108533 3095872 3080923
48478 3080923 3063958 3047110 3031383 3015396 2997660 2978646 2959921 2942431 2926409 2912197 2900554
48467 2900554 2892497 2888929 2889846 2894160 2901023 2910841 2923793 2937493 2947454 2949995 2943878 2929717 2909336
48454 2909336 2885676 2861587 2838191 2815389 2793934 2775633 2761422 2750601 2742272 2736436 2733630 2734792
48442 2734792 2741440 2754532 2773000 2794703 2818637 2844467 2869811 2890008 2901278 2902671 2894693 2878194
48430 2878194 2855441 2830242 2805271 2780291 2754131 2727487 2702678 2681370 2663417 2647439 2631883
48419 2631883 2616004 2600126 2584574 2568669 2551703 2534563 2518873 2504624 2490317 2475626 2462018
48408 2462018 2450264 2439170 2427553 2415829 2404820 2394501 2384792 2376091 2368195 2360148 2352050 2345519
48396 2345519 2341446 2338756 2336394 2335005 2335602 2337895 2341031 2344523 2347346 2347633 2344596 2339394 2332846 2323825
48382 2323825 2311415 2297225 2283772 2271755 2260714 2251188 2243970 2237751 2229652 2218177 2204212 2189216
48370 2189216 2173765 2157877 2141614 2125282 2109672 2095796 2083706 2072148 2060133 2048186 2037134
48359 2037134 2026358 2014372 2000738 1986425 1972656 1960292 1949990 1941988 1935756 1930330 1924878 1918809
48347 1918809 1911924 1904787 1898350 1892991 1888562 1885342 1883885 1883877 1884425 1885623 1888336 1892134 1895102 1896246 1896494
48332 1896494 1896723 1896560 1895815 1895136 1894356 1892312 1889625 1889561 1894295 1901913 1909011 1914989 1921881 1930918 1941132
48317 1941132 1951002 1960171 1969746 1981459 1995940 2011736 2027220 2043251 2062056 2083708 2106468 2130920
48305 2130920 2160364 2195843 2234148 2272583 2312421 2355222 2398654 2438869 2474782 2507571 2538401
48294 2538401 2569326 2603965 2644251 2688412 2734880 2786117 2845891 2914996 2992336 3077875 3171542
48283 3171542 3271722 3378052 3493552 3621104 3760393 3911305 4077434 4262868 4468557
48274 4468557 4695229 4946676 5226700 5536871 5881659 6272106 6720481 7235814 7828351
48265 7828351 8511453 9292976 10171998 11151993 12250770 13490466 14888383 16469086 18274171
48256 18274171 20344844 22705681 25375281 28347332 31480879 34386827 36495739 37335438
48248 37335438 36793215 35128352 32762513 30070909 27312944 24653562 22185321 19941677
48240 19941677 17923871 16125973 14536693 13134460 11896818 10810921 9867147 9048700
48232 9048700 8335857 7715559 7179013 6713657 6304677 5942011 5620227 5333918 5078059
48223 5078059 4850403 4648789 4468099 4303697 4155460 4024429 3907762 3800942 3702847 3614496
48213 3614496 3534477 3459836 3390590 3329501 3277557 3232544 3191874 3154480 3120163 3088978 3061109
48202 3061109 3036240 3013828 2994699 2980863 2972564 2967150 2961821 2955326 2945726 2929297 2904054 2872392
48190 2872392 2837917 2801584 2763314 2725435 2691453 2662479 2637376 2615223 2595121 2574780 2552243
48179 2552243 2528445 2505693 2484356 2463512 2443854 2426963 2412002 2396093 2378069 2359207 2340092
48168 2340092 2319539 2297256 2274963 2253646 2231751 2207547 2181842 2156976 2134068 2112303 2090175
48157 2090175 2066373 2040022 2011115 1980779 1950503 1920875 1891221 1860624 1829398 1799255 1771483
48146 1771483 1745094 1717706 1688501 1659248 1631868 1606247 1581420 1557744 1536276 1516602 1496962
48135 1496962 1476446 1455779 1435908 1417062 1399275 1382709 1367124 1351899 1336896 1322726 1310106
48124 1310106 1299468 1291053 1284627 1279067 1272927 1265518 1257077 1248130 1239301 1231478 1225288 1220421 1216027 1211695
48110 1211695 1207487 1203297 1198927 1194691 1191182 1188431 1185927 1183424 1181141 1179232 1177635 1176303 1175059 1173435
48096 1173435 1171271 1169281 1168414 1168790 1169847 1171156 1172360 1172773 1172112 1171509 1172694 1175967 1179861 1182947 1185210
48081 1185210 1187497 1190437 1194112 1198079 1201505 1203961 1206242 1209675 1214386 1219020 1222464 1225078 1227829 1230988
48067 1230988 1234395 1238498 1244235 1251797 1260003 1267111 1272286 1276339 1281068 1287783 1296522 1306730 1318210
48054 1318210 1330886 1343945 1356108 1366943 1377312 1388266 1400060 1412619 1426424 1442355 1460738
48043 1460738 1480931 1501851 1522694 1543140 1563114 1582672 1602250 1622747 1644888 1668338 1691843
48032 1691843 1714507 1736669 1759317 1782975 1807332 1831423 1853886 1873720 1891431 1908832 1926968
48021 1926968 1944797 1960873 1975698 1991131 2007731 2024226 2039748 2055009 2070553 2085039 2096306
48010 2096306 2103581 2108115 2112243 2118273 2127324 2138302 2148583 2156602 2163484 2171410 2180793 2189881 2196840
47997 2196840 2201253 2203587 2204052 2202321 2197924 2190737 2181345 2170843 2159916 2148206 2134963 2120072 2103841
47984 2103841 2085873 2065064 2041127 2015564 1990438 1966354 1942027 1915881 1887750 1859039 1831461
47973 1831461 1805712 1781169 1756655 1731468 1705870 1680700 1656576 1633485 1611149 1589597 1569086
47962 1569086 1549470 1530070 1510404 1490648 1471016 1451144 1430834 1411193 1393992 1379580 1366284
47951 1366284 1352403 1338214 1325311 1314425 1304667 1294716 1283995 1272667 1261169 1250030 1239796 1230869
47939 1230869 1223449 1217527 1212791 1208770 1205389 1203091 1201996 1201127 1199133 1195759 1192072 1189189 1187224 1185484
47925 1185484 1183073 1179288 1174083 1168401 1163411 1159164 1154565 1148932 1142945 1137645 1133262 1129629 1127030 1125609
47911 1125609 1124363 1121851 1117954 1114045 1111257 1109407 1107872 1106685 1106317 1106956 1108616 1111525 1115853 1121259
47897 1121259 1127226 1133731 1141047 1148855 1156049 1161795 1166652 1172276 1179856 1189030 1198519 1207661 1216866 1226609
47883 1226609 1236724 1247124 1258517 1271525 1285386 1298551 1310528 1322139 1333858 1345029 1355238
47872 1355238 1365332 1376092 1386534 1394521 1398822 1399822 1398624 1396392 1394323 1393074 1391919 1389179 1383846
47859 1383846 1376337 1367601 1358054 1347600 1336164 1323957 1311689 1300719 1292455 1287059 1282973 1278247 1272408
47846 1272408 1266817 1263092 1261372 1260269 1258545 1256572 1255806 1256887 1258763 1259918 1260108 1260558 1262767 1267397 1273959
47831 1273959 1281161 1287917 1294425 1301972 1311285 1321552 1331619 1341542 1352026 1362734 1372345 1380228 1386954
47818 1386954 1393025 1398158 1402178 1405643 1409032 1412046 1414188 1415397 1415606 1414139 1410050 1402904 1393225 1382546
47804 1382546 1372743 1364405 1355809 1344490 1330039 1314402 1299327 1284848 1270723 1257734 1246506 1236382
47792 1236382 1226883 1219232 1214685 1211982 1208379 1203150 1198389 1196053 1195774 1196132 1196748 1198145 1200460 1203402 1207116
47777 1207116 1212078 1218071 1223906 1228510 1231999 1235376 1239260 1243332 1247242 1251619 1257438 1264454 1271085 1276190
47763 1276190 1280254 1284339 1288687 1293072 1297902 1303842 1310616 1317201 1323210 1329306 1336225 1344266 1353805 1365481
47749 1365481 1379583 1395921 1414618 1436382 1461476 1488771 1516442 1543691 1571607 1602150 1636131
47738 1636131 1672048 1707000 1738656 1766234 1789805 1809474 1825511 1838428 1848191 1853813 1854443 1850462
47726 1850462 1842896 1832231 1818644 1802924 1786038 1767966 1748086 1726871 1706251 1688000 1672378
47715 1672378 1658432 1644982 1631352 1617849 1605590 1595169 1585542 1574929 1562768 1549948 1537268
47704 1537268 1524694 1512167 1499897 1487590 1474559 1461115 1448856 1438913 1430814 1423740 1418075 1414908
47692 1414908 1414511 1416137 1418928 1422398 1426301 1430681 1436069 1443215 1452518 1463604 1475345 1486653 1497832
47679 1497832 1510789 1527051 1545716 1564336 1581667 1598344 1614965 1631274 1647675 1665761 1686056
47668 1686056 1706534 1724615 1739672 1752377 1762574 1769395 1772824 1773545 1771501 1766034 1757470 1747361 1737008
47655 1737008 1726605 1715796 1704176 1691223 1676500 1660013 1641898 1622162 1601504 1581929 1565484
47644 1565484 1552385 1541242 1530873 1521041 1511766 1503213 1496255 1491886 1489864 1489016 1489157 1491586 1497258 1505431
47630 1505431 1514709 1524629 1535614 1548013 1561848 1577126 1593910 1612243 1632124 1653226 1674595 1695115
47618 1695115 1714305 1732139 1748093 1761227 1771409 1779676 1787039 1793510 1798452 1801126 1800637 1796345 1788940
47605 1788940 1780343 1771815 1762803 1752213 1740081 1727039 1712817 1696586 1678605 1660372 1642920 1625964
47593 1625964 1609068 1592824 1578196 1565220 1553153 1541817 1532110 1524876 1519682 1515248 1511016 1507663
47581 1507663 1505682 1504061 1501236 1497373 1494792 1495687 1500008 1506044 1512445 1518889 1525151 1530703 1535531 1540579
47567 1540579 1546816 1554281 1562487 1571461 1581886 1594344 1608962 1625758 1644717 1665331 1686684 1708554
47555 1708554 1731970 1757853 1785078 1810683 1832194 1849018 1861159 1867505 1866508 1858352 1845274 1829310
47543 1829310 1810333 1786665 1757190 1722496 1684383 1644840 1605316 1566285 1527235 1487412 1446978
47532 1446978 1407477 1370917 1338312 1309329 1283354 1260320 1240010 1221095 1201950 1182608 1164903
47521 1164903 1150204 1137830 1126363 1115661 1106589 1099366 1093329 1088037 1083386 1078709 1073070 1066759 1061353
47508 1061353 1057780 1055158 1052086 1048334 1044658 1041465 1038253 1034135 1028612 1022189 1016267 1011938 1008742 1005337
47494 1005337 1001459 998292 996546 995338 993792 992772 993825 996762 999450 999917 997867 994230 990083 986092
47480 986092 982284 978233 973886 970125 967993 967422 967395 967431 968204 970474 973922 977343 979616 980218 979194 977122
47464 977122 975008 973796 973779 974532 975519 976686 978249 979918 980686 979762 977504 974981 972750 970684 968964 968399
47448 968399 969337 970881 971723 971395 970313 969075 968231 968345 969626 971655 973872 976018 977751 978326 977346 975541
47432 975541 974197 974016 974997 976963 979534 982008 984187 987033 991579 997342 1002842 1007607 1012509 1018013 1023288
47417 1023288 1027500 1030910 1034155 1037313 1040343 1043642 1047359 1050779 1053213 1055146 1057771 1061675 1066580 1072048
47403 1072048 1077723 1083163 1088176 1093132 1098196 1102413 1104512 1104670 1104591 1105519 1107034 1108305 1109734 1112475 1116774
47388 1116774 1121836 1127349 1134208 1143353 1154503 1166569 1178944 1191914 1206059 1221818 1239567 1259549
47376 1259549 1281539 1304857 1328815 1353028 1377423 1402303 1428291 1455688 1483753 1511088 1536909
47365 1536909 1561485 1585079 1606839 1625140 1638710 1647161 1650660 1649528 1644118 1634861 1622361 1607293
47353 1607293 1589933 1569976 1547378 1523267 1499217 1475491 1450978 1425352 1400350 1378145 1359230
47342 1359230 1342771 1328358 1316247 1306230 1297412 1289107 1281212 1273870 1267518 1262999 1260674 1259692 1258980
47329 1258980 1258658 1259558 1261720 1264631 1268616 1274458 1281590 1288309 1294225 1301024 1310181 1321204 1332660 1343491
47315 1343491 1352387 1357305 1357247 1353879 1350161 1347500 1344995 1341005 1334615 1325929 1315682 1304389 1291584 1276450
47301 1276450 1259547 1242875 1227475 1211984 1194673 1176123 1158533 1142836 1127920 1112498 1096493
47290 1096493 1080575 1065568 1052462 1041888 1033258 1025193 1016959 1008752 1000681 992558 984933 979134 975626
47277 975626 973089 969905 966089 963112 962107 962839 964284 965647 966769 967950 969709 972575 976754 981758
47263 981758 986540 990293 993090 995433 997392 998839 1000410 1003171 1006906 1009721 1010176 1009054 1008117 1007757 1007092
47248 1007092 1005971 1005480 1006255 1007382 1007420 1005965 1004021 1003279 1005006 1009100 1014260 1019390 1024585 1030349 1036653
47233 1036653 1043694 1052802 1065082 1079470 1093832 1108102 1124692 1145269 1168608 1192309 1215276 1237723
47221 1237723 1260011 1282702 1306872 1333087 1360298 1386392 1409333 1427244 1438388 1442234 1440228 1434607
47209 1434607 1426713 1417072 1406581 1396577 1387801 1379943 1372177 1363700 1354115 1343826 1333788 1324316 1314536
47196 1314536 1303531 1291637 1280009 1269282 1259299 1249766 1240502 1231420 1222987 1216303 1211932 1208996 1206199
47183 1206199 1203460 1201660 1201142 1201438 1202342 1204182 1207087 1210944 1216043 1222779 1230622 1238434 1245984 1254220 1263825
47168 1263825 1274568 1286372 1299892 1315353 1331639 1347313 1361946 1375923 1389515 1402707 1415337
47157 1415337 1426752 1435823 1442023 1446167 1449473 1452195 1453745 1453785 1452480 1449846 1445594 1439677 1432507 1424575
47143 1424575 1416188 1407476 1398335 1388576 1378483 1369044 1361207 1355181 1350917 1348948 1350017 1354022 1360079 1367630
47129 1367630 1376707 1386992 1397505 1407726 1418483 1431231 1446891 1465675 1487404 1511303 1535934
47118 1535934 1560184 1584279 1609136 1634742 1659875 1683609 1706326 1728835 1750955 1771595 1790000
47107 1790000 1806375 1821226 1834488 1845499 1853619 1858699 1861003 1860826 1858323 1853662 1847138 1838980 1829256
47094 1829256 1818269 1806869 1795865 1785133 1773921 1762162 1750733 1739999 1728974 1716895 1705105
47083 1705105 1696130 1690855 1687716 1684931 1682333 1680496 1679147 1677503 1675645 1674532 1674812 1676367 1678888 1682188
47069 1682188 1686000 1689994 1693854 1696723 1696851 1692666 1684379 1673817 1662514 1650560 1637435 1623209 1608510
47056 1608510 1593871 1579445 1564907 1549378 1532046 1513335 1494902 1477938 1461946 1445828 1429709
47045 1429709 1414787 1401591 1389372 1377405 1366044 1356070 1347489 1339445 1331026 1321856 1312169 1302695 1294389
47032 1294389 1287954 1283553 1280975 1279895 1279918 1280650 1281986 1284249 1287884 1293102 1299793 1307533 1315567 1323178 1330319
47017 1330319 1337568 1345136 1352283 1358253 1363482 1369112 1375291 1380716 1384152 1385859 1387173 1389122 1391793 1394644
47003 1394644 1397103 1399223 1402051 1406821 1413281 1419376 1423349 1425849 1429071 1434056 1439840 1445395 1451277 1458776
46989 1458776 1468149 1478322 1488050 1496920 1505582 1515326 1526968 1539741 1551641 1561342 1569472 1577585 1586276
46976 1586276 1594962 1603265 1611817 1621565 1632764 1644945 1657600 1670747 1684817 1699868 1714853 1727972
46964 1727972 1738067 1745445 1751195 1756098 1760519 1764678 1768187 1769712 1768185 1764550 1761303 1759862 1759014 1756343
46950 1756343 1750680 1742826 1734576 1727673 1723249 1721235 1720208 1718455 1715589 1712903 1711940 1712953 1715004 1717429
46936 1717429 1720712 1725713 1732320 1739407 1746192 1753103 1760960 1769783 1779031 1788782 1799863 1812661 1826538
46923 1826538 1840765 1855565 1871706 1889407 1908084 1926973 1945607 1963779 1981453 1998700 2015465
46912 2015465 2031457 2046591 2061490 2077136 2093779 2110379 2125398 2138195 2149543 2160706 2172068
46901 2172068 2182744 2191529 2198063 2202928 2206772 2209709 2211766 2213674 2216854 2222329 2229705 2237399 2244072 2249769
46887 2249769 2255452 2261606 2267839 2274026 2281149 2290398 2301750 2314117 2326638 2339091 2351191 2362563
46875 2362563 2373697 2385949 2399965 2414731 2428792 2441785 2454013 2465061 2473940 2480434 2485196 2488257
46863 2488257 2488340 2484097 2475469 2463439 2449028 2433097 2416663 2400437 2383954 2365803 2345150 2322805
46851 2322805 2300519 2279480 2259859 2241800 2226199 2214133 2205716 2200088 2196638 2195829 2198567 2205139 2215156
46838 2215156 2228334 2244669 2263812 2284868 2307310 2331856 2359889 2391891 2426652 2462198 2497361
46827 2497361 2532261 2567339 2602211 2635630 2666440 2694265 2719210 2741232 2760171 2776372 2790909
46816 2790909 2804957 2818949 2832430 2844672 2855390 2865034 2874533 2884670 2895558 2906857 2918776 2932659
46804 2932659 2950071 2971051 2993712 3015929 3037243 3058762 3081483 3105227 3129028 3151858 3172829
$$ [...]
##END NTUPLES=NMR SPECTRUM
##END=
