
##TITLE=AC1028_Robusta_6301217_5MUGvdUJwz
##JCAMPDX= 6.0         $$ Bruker NMR JCAMP-DX V2.0
##DATA TYPE= NMR SPECTRUM
##DATA CLASS= NTUPLES
##ORIGIN= BRUKER
##OWNER= Administrator
$$ 1.72 TOPSPIN		Version 2.1
$$ 2012-06-05 21:21:30.953 -0500  Administrator@TOPSPIN
$$ Compression mode = diff/dup
##.OBSERVE FREQUENCY= 400.13188235
##.OBSERVE NUCLEUS= ^1H
##.ACQUISITION MODE= SIMULTANEOUS (DQD)
##.ACQUISITION SCHEME= undefined
##.AVERAGES= 8
##.DIGITISER RES= 22
##SPECTROMETER/DATA SYSTEM= spect
##.PULSE SEQUENCE= zg30
##.SOLVENT NAME= COFFEE_meoh
##.SHIFT REFERENCE= INTERNAL, COFFEE_meoh, 1, 14.98061
##AUDIT TRAIL= $$ (NUMBER, WHEN, WHO, WHERE, PROCESS, VERSION, WHAT)
$$ ##TITLE= Audit trail, TOPSPIN		Version 2.1
$$ ##JCAMPDX= 5.01
$$ ##ORIGIN= Bruker BioSpin GmbH
$$ ##OWNER= Administrator
$$ $$ C:\Bruker\TOPSPIN/data/COFFEE/nmr/AC1028_Robusta_6301217_5MUGvdUJwz/10/pdata/1/auditp.txt
$$ ##AUDIT TRAIL=  $$ (NUMBER, WHEN, WHO, WHERE, PROCESS, VERSION, WHAT)
(   1,<2012-06-05 21:21:21.546 -0500>,<Administrator>,<TOPSPIN>,<go>,<TOPSPIN 2.1>,
      <created by zg
	started at 2012-06-05 21:20:00.250 -0500,
	POWCHK enabled, PULCHK disabled,
       configuration hash MD5:
       D5 CA 7A 23 FE 6B EE E2 50 67 74 61 24 F7 5E 3B
       data hash MD5: 64K
       90 22 2F 42 3F C7 C5 57 B4 52 BD 05 E5 F6 49 0E>)
(   2,<2012-06-05 21:21:25.859 -0500>,<Administrator>,<TOPSPIN>,<proc1d>,<TOPSPIN 2.1>,
      <Start of raw data processing
       efp LB = 0 FT_mod = 6 PKNL = 1 PHC0 = 0 PHC1 = 0 SI = 32K 
       data hash MD5: 32K
       7B 13 5F 7C 8A 71 66 CE 9F 9E 7C 0F 37 54 C2 78>)
(   3,<2012-06-05 21:21:26.187 -0500>,<Administrator>,<TOPSPIN>,<proc1d>,<TOPSPIN 2.1>,
      <pk PHC0 = 211.8164 PHC1 = 0 
       data hash MD5: 32K
       06 2D 36 C2 6F BE 8E E3 6F F3 79 11 AB D4 21 DB>)
(   4,<2012-06-05 21:21:26.390 -0500>,<Administrator>,<TOPSPIN>,<proc1d>,<TOPSPIN 2.1>,
      <abs ABSG = 1 
       data hash MD5: 32K
       36 E4 11 C0 C6 F7 55 3B 2D 44 F7 49 12 FC 26 89>)
(   5,<2012-06-05 21:21:26.468 -0500>,<Administrator>,<TOPSPIN>,<proc1d>,<TOPSPIN 2.1>,
      <abs ABSG = 2 
       data hash MD5: 32K
       37 22 67 81 26 42 7E 92 0A 84 24 C2 D5 83 20 6E>)
(   6,<2012-06-05 21:21:26.500 -0500>,<Administrator>,<TOPSPIN>,<proc1d>,<TOPSPIN 2.1>,
      <abs ABSG = 3 
       data hash MD5: 32K
       02 00 1A 4F 1F 45 DF 6A A8 B1 F4 F8 7E 71 BA E9>)
(   7,<2012-06-05 21:21:26.531 -0500>,<Administrator>,<TOPSPIN>,<proc1d>,<TOPSPIN 2.1>,
      <abs ABSG = 4 
       data hash MD5: 32K
       9A 2C 7C 9C 51 9B C1 B5 84 BA 35 78 E0 9D 67 B1>)
(   8,<2012-06-05 21:21:26.562 -0500>,<Administrator>,<TOPSPIN>,<proc1d>,<TOPSPIN 2.1>,
      <abs ABSG = 5 
       data hash MD5: 32K
       34 9C 8B E3 6B 44 A6 C5 34 0C 90 E9 9A 13 52 81>)
$$ ##END=
$$ 
$$ $$ hash MD5
$$ $$ DF F3 C7 1C BD 13 1A 86 AC D9 CD 94 F7 D8 15 17
##$RELAX= 
##$RELAX= 
##$RELAX= 
##$RELAX= 
##$RELAX= 
##$RELAX= 
##$RELAX= 
$$ Bruker specific parameters
$$ --------------------------
$$ [...]
150 150 150 150 150 150 150 150
##$TP07= 0
##$TPNAME0= <>
##$TPNAME1= <>
##$TPNAME2= <>
##$TPNAME3= <>
##$TPNAME4= <>
##$TPNAME5= <>
##$TPNAME6= <>
##$TPNAME7= <>
##$TPOAL= (0..7)
0.5 0.5 0.5 0.5 0.5 0.5 0.5 0.5
##$TPOFFS= (0..7)
0 0 0 0 0 0 0 0
##$TUNHIN= 0
##$TUNHOUT= 0
##$TUNXOUT= 0
##$USERA1= <user>
##$USERA2= <user>
##$USERA3= <user>
##$USERA4= <user>
##$USERA5= <user>
##$V9= 5
##$VALIST= <valist>
##$VCLIST= <CCCCCCCCCCCCCCC>
##$VD= 0
##$VDLIST= <DDDDDDDDDDDDDDD>
##$VPLIST= <PPPPPPPPPPPPPPP>
##$VTLIST= <TTTTTTTTTTTTTTT>
##$WBST= 2048
##$WBSW= 25
##$XGAIN= (0..3)
0 0 0 0
##$XL= 0
##$YL= 0
##$YMAX_a= 537539
##$YMIN_a= -647239
##$ZGOPTNS= <>
##$ZL1= 120
##$ZL2= 120
##$ZL3= 120
##$ZL4= 120
##$ABSF1= 14.98061
##$ABSF2= -5.57192
##$ABSG= 5
##$ABSL= 3
##$ALPHA= 0
##$AQORDER= 0
##$ASSFAC= 0
##$ASSFACI= 0
##$ASSFACX= 0
##$ASSWID= 0
##$AUNMP= <proc_prof1d_extract_pilot.lims>
##$AXLEFT= 0
##$AXNAME= <>
##$AXNUC= <1H>
##$AXRIGHT= 0
##$AXTYPE= 0
##$AXUNIT= <>
##$AZFE= 0.1
##$AZFW= 0.1
##$BCFW= 0
##$BC_mod= 0
##$BYTORDP= 0
##$COROFFS= 0
##$CY= 15
##$DATMOD= 1
##$DC= 0
##$DFILT= <>
##$DTYPP= 0
##$F1P= 0
##$F2P= 0
##$FCOR= 0.5
##$FTSIZE= 32768
##$FT_mod= 6
##$GAMMA= 0
##$GB= 0
##$INTBC= 1
##$INTSCL= 1
##$ISEN= 128
##$LB= 0
##$LEV0= 0
##$LPBIN= 0
##$MAXI= 10000
##$MC2= 0
##$MEAN= 0
##$ME_mod= 0
##$MI= 0
##$NCOEF= 0
##$NC_proc= -8
##$NLEV= 6
##$NOISF1= 0
##$NOISF2= 0
##$NSP= 0
##$NTH_PI= 0
##$NZP= 0
##$OFFSET= 14.98061
##$PC= 1
##$PHC0= 211.8164
##$PHC1= 0
##$PH_mod= 1
##$PKNL= yes
##$PPARMOD= 0
##$PPDIAG= 0
##$PPIPTYP= 0
##$PPMPNUM= 2147483647
##$PPRESOL= 1
##$PSCAL= 4
##$PSIGN= 0
##$PYNMP= <proc.py>
##$REVERSE= no
##$SF= 400.13
##$SI= 32768
##$SIGF1= 0
##$SIGF2= 0
##$SINO= 400
##$SIOLD= 32768
##$SPECTYP= <>
##$SREGLST= <1H.CDCl3>
##$SSB= 0
##$STSI= 32768
##$STSR= 0
##$SW_p= 8223.68421052632
##$SYMM= 0
##$S_DEV= 0
##$TDeff= 65536
##$TDoff= 0
##$TI= <>
##$TILT= no
##$TM1= 0
##$TM2= 0
##$TOPLEV= 0
##$USERP1= <user>
##$USERP2= <user>
##$USERP3= <user>
##$USERP4= <user>
##$USERP5= <user>
##$WDW= 1
##$XDIM= 32768
##$YMAX_p= 455924746
##$YMIN_p= -733519
##$CURPLOT= <Network HP LaserJet P1505>
##$CURPRIN= <$Network HP LaserJet P1505>
##$DFORMAT= <normdp>
##$LAYOUT= <+/1D_H.xwp>
##$LFORMAT= <normlp>
##$PFORMAT= <normpl>
##$SURQMSG= 1
$$ End of Bruker specific parameters
$$ ---------------------------------
##NTUPLES= NMR SPECTRUM
##VAR_NAME=  FREQUENCY,     SPECTRUM/REAL,   SPECTRUM/IMAG
##SYMBOL=    X,             R,               I
##VAR_TYPE=  INDEPENDENT,   DEPENDENT,       DEPENDENT
##VAR_FORM=  AFFN,          ASDF,            ASDF
##VAR_DIM=   32768,         32768,           32768
##UNITS=     HZ,            ARBITRARY UNITS, ARBITRARY UNITS
##FACTOR=    0.250966925370066, 1,           1
##FIRST=     8223.43324360095, -142524,      -38039
##LAST=      0,             -44422,          -148513
##MIN=       0,             -733519,         0
##MAX=       8223.43324360095, 455924746,    0
$$ Real data points
##PAGE= N=1
##DATA TABLE= (X++(R..R)), XYDATA
$$ [...]
$$ plain form
19526 -218925 -567 4539 58340 -189729 1495 113868 -41343 -197690 -451454 117467 -132978
19514 -77337 -80282 -223290 299580 18541 -324762 -72037 184167 -89178 -202766 -360451 -256214
19503 -256214 180408 84688 -365253 105337 -192524 60003 -74569 -134801 -132590 -322461 97182
19491 -107579 -252236 137950 -131954 -107644 -77956 -206803 98210 -146855 -190267 -56868
19480 -98232 -132089 -40878 30666 123803 -230824 -159344 -35873 -128264 9893 6636 -117634 169731
19467 124952 -57564 245765 -189377 -113352 20018 -292741 -120283 3520 7665 -314031 110631
19455 -325714 141172 -267746 -193615 177997 84807 -48831 36504 -253486 57490 29451 -208282
19443 99736 224752 -258543 -151797 91733 102756 21159 -122027 -119693 -106731 -24934 -57774
$$ packed form
19526b18925e67D539N3801a89729A495J12373d1343j56347k53764A17467a32978
19514g7337k945j43008B99580A8541c24762g2037A84167h9178j13588j57685J04237
19503b56214A80408H4688c65253A05337a92524F0003g4569o0232K211j89871I7182
19491a07579j44657A37950a31954K4310K9688j28847I8210a46855m3412e6868
19480i8232l3857d0878C0666R3137b30824P1480c5873r2391I893l257a17634A69731
19467A24952e7564B45765a89377P6025B0018b92741a20283C520M145c14031A10631
19455c25714A41172b67746P4131A77997H4807d8831C6504b53486E7490k8039b08282
19443I9736J25016b58543J06746I1733J1023B1159a22027K334J2962b4934l2840
$$ plain form
19432 -57774 -125151 -25444 1149 8612 -108226 -288038 -17554 170234 -10595 -29729 315505
19420 206016 166986 -115234 -277433 -25078 -43370 215771 6463 -268340 -116089 -169904 70432
19408 -75213 -135966 -122078 21903 49128 101441 161696 59257 -208726 -71103 -56447 179344
19396 6991 -81682 -92116 175061 -122690 -85114 1417 97050 6995 -130952 -76787 9458 -271763
19383 -295519 90389 4507 -155066 125957 114281 152271 8381 -60618 -91421 -100656 -111456 85328
19370 259504 -309554 -215805 -299953 -97972 -46984 -42962 -179484 -38914 -41120 -197307 -11089
19358 -10744 -90107 24446 -414591 -407220 -131931 -212262 -10095 -318638 -114361 38763 -125357
19346 -160542 530463 -141653 -76854 -46766 -288908 -141741 81645 -32653 19907 -82118 -77626
$$ packed form
19432e7774o7377b5444A149P463a08226j79812a7554A70234a0595j9134C15505
19420B06016l9030a15234j62199b5078j8292B15771F463b68340a16089n3815G0432
19408g5213o0753J3888B1903K7225N2313O0255E9257b08726g1103J4656A79344
19396F991h1682j0434A75061a22690L7576A417R5633F995a30952N4165I458b71763
19383b95519I0389D507a55066A25957j1676L7990H381f0618l0803r235j0800H5328
19370B59504c09554R3749q4148i7972d6984M022j36522c8914k206j56187a1089
19358a0744p9363B4446d14591P371a31931q0331a0095l08543a14361C8763a25357
19346a60542E30463a41653O4799L0088k42142a41741H1645c2653A9907h2118M492
$$ plain form
19335 -77626 125220 23659 -43327 -96460 390600 -70353 -8303 -65695 -57011 -142545 -119308 206122
19322 211545 1982 -267858 -99917 -108903 283000 -108117 15847 -191091 -210845 67862 -165165
19310 -178539 138772 -166905 -130722 -55112 38809 53027 308434 143391 112190 43947 37141
19299 37141 -307854 -404561 -398508 -94022 -32325 246097 -104710 91864 -13408 -87521 -184183
19288 -184183 -111393 66386 -80709 206698 -19930 -282954 -78556 -6515 -69403 142352 94042
19277 94042 10958 69287 -192004 15799 -288398 -174904 -433902 -184298 118588 -270370
19266 -96804 -87329 4180 -300500 235853 108746 -245551 284973 83770 55333 -176956 102776
19254 -113357 -192793 -194603 -141351 134643 208275 -311801 297511 9691 -307905 -46135 -181877
$$ packed form
19335g7626A25220B3659d3327n3133C90600g0353h303n7392Q684q5534K3237B06122
19322B11545A982b67858i9917q986B83000a08117A5847a91091j9754F7862a65165
19310a78539A38772a66905L6183e5112C8809J4218K55407A43391l1201D3947o806
19299C7141c07854r6707O053i4022c2325B46097a04710I1864a3408p4113r6662
19288a84183P2790F6386h0709B06698a9930k63024g8556f515o2888A42352m8310
19277I4042A0958N8329a92004A5799b88398J13494k58998a84298A18588b70370
19266i6804R475D180c00500B35853A08746b45551B84973H3770k8437a76956A02776
19254a13357p9436j810N3252A34643P3632c11801B97511I691c07905d6135j35742
$$ plain form
19243 -181877 129879 -10532 46697 110411 -180232 -135292 -48944 -20706 -177199 57651 -122605
19231 18675 116880 -70254 -157665 -24659 235843 205672 -79394 316552 158866 59674 -151082
19219 -100540 23630 -240022 184850 7680 177817 -66625 -176632 -125029 -180191 226323 -179828
19207 4610 -320182 33888 -292168 -25940 -119993 144996 -82907 -120973 -319661 -121445 -258305
19196 -258305 -219775 -96169 59330 103587 12465 -377156 -250126 68403 -253291 -285594 17666
19184 -445292 62116 -309846 -41389 -14379 -219877 -41315 29883 -37818 -172236 118730 194441
19173 194441 -21791 -121060 -82210 57171 58796 253165 -51790 -281114 338161 -16979 334695
19161 -115463 -226071 -210992 15530 -192715 -11090 -127506 -59240 115448 -267390 -80793
$$ packed form
19243a81877A29879a0532D6697O3714a80232M4940d8944b0706j56493E7651a22605
19231A8675R8205g0254q7411b4659B35843l0171g9394C16552j57686E9674a51082
19219a00540B3630b40022A84850G680J70137f6625j10007N1603n5162B26323a79828
19207D610c20182C3888b92168b5940r4053A44996h2907l8066j98688a21445j36860
19196b58305L8530i6169E9330M4257A2465c77156J27030F8403b53291l2303A7666
19184d45292F2116c09846d1389a4379k05498d1315B9883c7818j34418A18730P5711
19173A94441b1791r9269L8850E7171J625J94369e1790k29324C38161a6979C34695
19161a15463j10608J5079A5530a92715a1090j16416e9240A15448b67390h0793
$$ plain form
19150 -1400 135148 135854 -33492 -194839 77081 76658 -153441 -160747 -246411 -192864 98757 -42321
19137 77653 -101299 182003 240077 -322282 -51539 -134282 -258609 -10556 85947 -417969 180966
19125 236961 39565 -226524 -175484 -133850 -51588 -121987 219821 125340 -59654 -81704 -121975
19114 -121975 289126 29509 211502 -96084 10358 -101433 24613 -47023 -102523 51436 143931
19103 143931 -122330 -86277 -381660 170063 -196472 -247970 -183589 196935 -247110 -347241
19093 -347241 -11866 125751 179817 183896 206291 183985 -152490 156374 203075 -8068 -290871
19082 -290871 155869 -12775 -312861 40947 -76541 -229 175134 902 -33275 58598 -292769
19070 -236100 -213021 8454 185527 -381716 285540 -286454 53354 -130470 -60970 -130665 -131690
$$ packed form
19150a400A35148P06c3492j61347G7081m23a53441p306q5664N3547I8757d2321
19137G7653a01299A82003N8074c22282e1539q2743j24327a0556H5947d17969A80966
19125B36961C9565b26524N1040M1634e1588p0399B19821r4481e9654k2050m0271
19114a21975B89126B9509J81993i6084A0358a01433B4613d7023n5500E1436R2495
19103A43931a22330L6053k95383A70063a96472n1498O4381A96935b47110j00131
19093c47241a1866A25751N4066M079K2395k2306a52490A56374M6701h068k82803
19082b90871A55869a2775l00086D0947g6541b29A75134I02c3275E8598b92769
19070b36100K3079H454J77073c81716B85540b86454E3354a30470f0970o9695j025
$$ plain form
19059 -131690 132940 221334 -107671 -157118 84016 -203962 -154525 116673 -129944 -46466
19048 -290722 119212 -130501 -123019 -69594 460 297255 68278 33407 -85316 -78540 -164021 159477
19035 -170105 -108336 84293 -287857 9540 -152990 1048 115168 -144194 -61957 24520 -48316
19023 227391 51832 -144450 -209683 300788 37439 -373693 1179 -63083 18100 -202209 -140698
19012 -140698 -197786 149241 -67631 -62806 4937 -233149 251056 -86831 -34588 322844 43183
19000 -21931 -172376 119569 79570 107315 78983 135589 -155486 -86199 332738 -106871 -150442
18989 -150442 -198887 -75013 -176181 -184086 -74740 22587 -85208 -122283 -225817 -373663 103701
18977 233038 45560 -199771 -250303 -261115 103382 -146491 -4410 -23848 -91361 -171069 -172688
$$ packed form
19059a31690A32940Q8394a07671m9447H4016b03962M9437A16673a29944d6466
19048b90722A19212a30501P482N3425D60K96795F8278C3407h5316O776q5481A59477
19035a70105O1769H4293b87857I540a52990A048J14120a44194f1957B4520d8316
19023B27391E1832a44450o5233C00788C7439c73693A179f3083A8100b02209O1511
19012a40698n7088A49241f7631M825D937b33149B51056h6831c4588C22844D3183
19000b1931j50445A19569l9999K7745k8332N6606a55486O9287C32738a06871m3571
18989a50442m8445g5013j01168p905g4740B2587h5208l7075j03534j47846A03701
18977B33038D5560a99771n0532j0812A03382a46491d410j9438o7513p9708j619
$$ plain form
18966 -172688 -88183 -197200 217783 -416678 -200408 146698 185963 -71539 -286606 -100415
18955 114502 -64689 -85946 80113 252982 282877 -187576 30763 -83703 -47847 -226345 165555
18943 -268129 265188 -79770 150333 256941 8764 -392101 -283900 20877 11677 -115464 -116494
18932 -116494 -147161 122001 78209 3001 -144589 253326 -219981 -113960 -126083 -25917 17385
18920 34929 -67991 -31325 102113 -145118 -24508 -321666 -121543 -17545 -46548 -124035 -79391
18909 -79391 -231173 -105916 -59634 31976 -164054 16648 -64773 -286939 12908 -331238 -296826
18898 -296826 -375390 -151186 287633 -217610 -289913 -78909 -291634 43277 80287 368298
18888 368298 -286925 -7753 -173646 -369632 -122617 -175764 -8039 327009 -57300 -93331 27084
$$ packed form
18966a72688Q4505j09017B17783d16678b00408A46698L9265g1539k15067a00415
18955A14502f4689k1257H0113J72869K9895a87576C0763h3703L5856j78498A65555
18943b68129B65188g9770A50333J06608H764c92101J08201B0877r200a15464j030
18932a16494l0667A22001m3792C001a44589B53326b19981J06021j2123b5917A7385
18920C4929f7991c1325A02113a45118b4508k97158a21543a7545k9003p7487M4644
18909g9391j51782a05916M6282C1976a64054A6648f4773k22166A2908c31238L4412
18898b96826p8564a51186B87633b17610p2303g8909k12725D3277L7010K88011
18888C68298b86925g753j65893j95986a22617n3147h039C27009e7300l6031B7084
$$ plain form
18876 48285 25848 156222 -55489 -135287 -39799 -127833 67363 134385 -31317 403501 -158166
18864 -84467 93238 -332960 40494 -68003 -233301 -136317 27334 -1389 -218379 83709 131234
18853 131234 158338 45231 -17720 -258470 -56621 125721 -254616 -248624 -257330 -162141 -99099
18842 -99099 -114599 104483 -456818 -202087 -169089 47582 -14089 -20896 140057 390154 -359215
18830 -129358 -6561 122364 50182 51541 -79662 114598 -58918 -324340 167309 -19586 -66981
18819 -66981 247327 -69619 -133494 -51937 39895 17470 75833 -83622 178915 199236 113934
18808 113934 -185636 -144674 -2513 -198344 -44043 -200610 126847 -28766 -152854 120251
18797 225480 424182 -80837 207405 -6090 -112545 -6574 -149962 -6184 -243755 127088 4963
$$ packed form
18876D8285k2437J30374e5489p9798c9799q8034F7363O7022c1317D03501a58166
18864h4467I3238c32960D0494f8003j65298R6984B7334a389k16990H3709M7525
18853A31234K7104D5231a7720k40750e6621A25721b54616N992q706R5189O3042
18842i9099j5500A04483d56818b02087L2998D7582a4089o807A40057K50097c59215
18830a29358f561A22364E0182J359g9662A14598e8918k65422A67309a9586m7395
18819f6981B47327f9619o3875e1937C9895A7470N8363h3622A78915K0321q5302
18808A13934a85636M0962b513j95831d4043j56567A26847b8766j24088A20251
18797B25480J98702h0837B07405f090j06455f574j43388f184k37571A27088D963
$$ plain form
18785 -278948 -252557 -325941 23625 -167061 -40168 -35514 181329 36706 -201569 -299830 64522
18773 195499 -200679 -94478 -56619 53568 -98069 -2297 -115999 65502 65891 -42672 158608
18761 -115978 279428 66494 -80031 51984 -147396 66764 -93091 29905 -77828 251467 201536
18750 201536 -371347 161142 257791 182431 -390978 176073 -5096 -63777 -377333 330748
18739 31634 -476926 72667 -114705 104612 120855 254289 -19996 -68786 37640 22428 297116
18728 297116 -62987 -185239 -104475 16768 -178516 147314 -107408 -39523 -34046 59449 234708
18717 234708 -103125 -63747 -233850 75228 -208905 -31815 -52547 140134 -90191 115494
18706 -279326 -143384 -73988 27828 -145535 234662 -815 -425009 -60868 -131058 146120 -62591
$$ packed form
18785b78948K6391p3384B3625a67061d0168M654A81329C6706b01569r8261F4522
18773A95499b00679i4478L7859E3568i8069b297j13702F5502L89d2672A58608
18761a15978B79428F6494h0031E1984a47396F6764i3091B9905g7828B51467m9931
18750B01536c71347A61142R6649p5360c90978A76073e096n8681l13556C30748
18739C1634d76926G2667a14705A04612J6243J33434a9996m8790C7640j5212K74688
18728B97116f2987j22252Q0764A6768a78516A47314a07408c9523N477E9449J75259
18717B34708a03125L9378j70103G5228b08905c1815k0732A40134i0191A15494
18706b79326J35942O9396B7828a45535B34662h15m24194f0868p0190A46120f2591
$$ plain form
18694 -188487 -98159 -35015 -17212 -314400 -181276 224541 72015 297558 63830 88669 139001
18683 139001 -323895 -121395 9438 -104827 -73768 -10503 91892 161058 107404 112205 -182834
18671 -14358 -177274 100381 217632 237711 -54641 137982 -225018 -184509 -50317 25447 -106510
18659 -168750 64677 -12893 -10297 33424 -187798 139338 -154684 393969 148609 33227 -128660
18647 47182 93672 -205896 96959 217758 -19188 -49593 45218 240311 -75258 -193723 -18995
18635 -98911 -53024 -35251 147050 -6173 248503 -24268 -235516 -1845 182279 -344699 40586
18623 -131662 -286406 36689 -99212 -116330 225545 -40610 -406690 -206097 63250 -100501
18612 -8369 -64932 -174888 -56065 268296 -236135 -245946 -18379 -230656 -327970 218540 -87811
$$ packed form
18694a88487R0328c5015a7212k97188J33124B24541G2015K25543F3830K4839N0332
18683A39001c23895a21395I438a04827L1059a0503I1892O9166n3654M801a82834
18671a4358j62916A00381J17251K0079e4641A37982b25018M0509e0317B5447a06510
18659a68750F4677a2893K596C3424a87798A39338a54684C93969A48609C3227a28660
18647D7182M6490b05896I6959J20799a9188l0405D5218J95093g5258j18465a8995
18635i8911M5887J7773A47050f173B48503b4268k11248a845A82279c44699D0586
18623a31662j54744C6689i9212j7118B25545d0610l66080K00593F3250a00501
18612h369n6563j09956e6065B68296b36135r811a8379k12277r7314B18540h7811
$$ plain form
18600 54703 -288269 -310272 -529543 175066 -215889 -30333 -141873 -49631 58467 71707 159257
18589 159257 54105 198356 -82269 77230 -144339 72321 40138 331577 61528 -210754 -83608
18577 -28770 131458 -92479 222574 -282383 -5366 -509255 -75201 147031 101801 52425 -143062
18565 -14362 12199 103989 -173600 113850 -112560 133166 -267419 -39004 60054 -210979
18554 13512 -190415 -73304 -40990 16364 -331428 -88614 -119781 286235 -14232 -20134 -24069
18543 -24069 304640 26757 200706 -388083 140441 104499 -165647 114900 -3688 99487 -80422
18531 99272 -429919 148651 153302 -265576 52420 -206205 -232805 23215 101210 8249 -395760
18519 -131152 -184538 91102 -99736 -103061 -26125 -76256 -233534 -47697 62615 11739 197283
$$ packed form
18600E4703b88269k2003k19271A75066b15889c0333j11540d9631E8467J3240Q7550
18589A59257E4105J44251h2269G7230a44339G2321l2183K91439F1528b10754h3608
18577b8770A31458i2479B22574b82383e366n03889g5201A47031m5230m9376a43062
18565a4362A2199R1790a73600A13850a12560A33166b67419c9004F0054b10979
18554A3512a90415g3304L2314A6364c31428h8614l1167B86235a4232n902l935
18543b4069C04640B6757J73949c88083A40441l5942a65647A14900c688I9487h0422
18531I9272d29919A48651M651b65576E2420b06205k6600B3215P7995H249c95760
18519a31152n3386I1102i9736l325b6125n0131j57278d7697F2615A1739J85544
$$ plain form
18508 197283 -41228 69666 45542 157335 140720 -248605 112618 109054 -146864 38817 75971
18497 75971 -349468 -73354 -6443 -208958 65967 53727 -170747 -84523 80327 61630 -331283
18485 -20893 -26145 36828 -189793 235219 -259035 157376 -220103 -175825 -156285 -166187 -239611
18474 -239611 -186277 104558 -78619 28943 -41063 -81863 -141332 -38467 -175747 -306437 114799
18462 -193659 -112568 144281 70428 38741 -231675 -207650 -125172 -94409 16014 235654 -99586
18450 -25066 286828 163156 32384 -224888 -37413 -236652 97235 -131305 104760 86483
18440 86483 49581 -238347 -6124 -195578 44806 -90563 175850 -163668 270249 -96604 -49827
18429 -49827 -123931 -289729 -59020 -161907 -205448 -292318 42506 -255303 -192619 -177100 -126757
$$ packed form
18508A97283d1228F9666k4124J11793j6615b48605A12618l564a46864C8817L7154
18497G5971c49468g3354f443k02515F5967j2240a70747h4523H0327j8697c31283
18485b0893n252C6828a89793B35219b59035A57376b20103M4278J9540r902p3424
18474b39611N3334A04558g8619B8943d1063m0800n9469c8467j37280j30690A14799
18462a93659Q1091A44281G0428l1687b31675K4025Q2478L0763A6014K19640i9586
18450b5066B86828j23672C2384b24888c7413j99239I7235a31305A04760j8277
18440H6483l6902b38347f124j89454D4806i0563A75850a63668B70249i6604M6777
18429d9827p4104j65798e9020j02887m3541q6870D2506b55303O2684J5519N0343
$$ plain form
18418 -126757 124254 -78407 -190697 6429 431352 65609 -45611 -181692 20583 265904 -125251
18406 94118 -119304 -138286 61484 197156 210622 -31984 -382634 -64334 19172 -124491 146185
18394 -176932 -300422 61873 -91128 -154719 148038 -233103 211626 458403 -34445 -50854
18384 -50854 -58815 279229 -58006 -74529 88863 -67823 154290 -48535 10836 195175 -145220
18372 -91171 -16141 -120272 33057 -77498 -55489 351137 -83242 -46600 409233 126148 -167945
18360 -369579 -480231 -34022 -7731 -71669 152674 163384 112054 -332843 -183481 -195221 -62463
18348 13158 -55738 -56701 98299 26176 -198262 -70417 -63941 62457 -247458 -133835 73554 90859
18336 90859 -128831 -271764 -88662 33086 -17843 251351 -227795 360221 -24270 -97825 -24724
$$ packed form
18418a26757A24254g8407j12290F429M24923F5609d5611j36081B0583K45321a25251
18406I4118a19304j8982F1484J35672J3466c1984l50650f4334A9172a24491A46185
18394a76932j23490F1873i1128o3591A48038b33103B11626K46777c4445j6409
18384e0854p961B79229e8006j6523H8863f7823A54290d8535A0836J84339a45220
18372i1171a6141j04131C3057g7498K2009C51137h3242L6642D09233A26148a67945
18360c69579j10652c4022g731o3938A52674J0710n1330c32843J49362j1740f2463
18348A3158e5738r63I8299B6176a98262g0417O476F2457b47458J13623G3554J7305
18336I0859a28831j42933h8662C3086a7843B51351b27795C60221b4270p3555b4724
$$ plain form
18324 -58100 16682 -336481 -84538 103683 -71487 158157 139567 -341881 -210578 81882 -247817
18312 -240360 -439585 -189818 -136780 111293 16882 -226963 277162 1651 -323555 -115656
18301 -25430 -209531 -290797 62816 153930 94296 -191030 266059 -168751 347451 -149027
18290 1327 118095 -29009 -164267 175841 180087 -113369 162184 -86506 76559 -366364 8368
18278 81116 -58873 118334 102704 51032 -188036 -273615 86964 90527 -169056 -4612 283209
18266 -410722 -261555 -305353 -439 -55863 -245915 121107 -155410 -308261 111876 -279508
18255 15614 -74267 -36284 37750 -84220 -359183 -57072 9134 99336 -137245 242015 -2996
18243 -68238 61450 92099 199883 141457 -76850 217446 256543 15967 188296 -202427 103661
$$ packed form
18324e8100A6682c36481h4538A03683g1487A58157j8590c41881J31303H1882b47817
18312b40360j99225a89818N3038A11293A6882b26963B77162A651c23555a15656
18301b5430j84101q1266F2816R1114n9634a91030B66059a68751C47451a49027
18290A327J16768b9009j35258A75841M246a13369A62184h6506G6559c66364H368
18278H1116e8873A18334j5630E1032a88036q5579H6964L563a69056d612B83209
18266d10722J49167m3798d39n5424j90052A21107a55410j52851A11876b79508
18255A5614g4267c6284C7750h4220k74963e7072I134R0202a37245B42015b996
18243f8238F1450L0649J07784n8426g6850B17446L9097A5967J72329b02427A03661
$$ plain form
18231 -326999 -72884 -162447 -2831 -14589 -210313 -28705 -68524 -162431 247366 286789 -108542
18219 215156 50591 -202209 -71267 58710 349268 224152 269694 -179047 100883 -179374
18208 11224 111989 -111742 -160908 96051 -90671 325892 -141241 -139588 33470 -3453 -272773
18197 -272773 -162222 80089 -103802 -215190 60195 109454 -272347 -35103 232429 133448
18187 133448 -176687 -198298 200215 -107150 -135473 -130160 -145993 -24917 16576 572488 -43063
18175 75757 50699 98392 -5875 143329 -166784 -219918 -234740 -53986 -166894 -67773 38942
18163 -274482 161167 144361 257918 128960 59182 100633 168416 344268 131962 -96177
18152 -169387 -240925 268760 14666 132992 -276367 -102442 236974 -223247 -75702 31565
$$ packed form
18231c26999g2884q9563b831j1758j95724b8705l9819r3907B47366L9423a08542
18219B15156E0591b02209g1267E8710K90558j25116M5542a79047A00883a79374
18208A1224J00765a11742m9166I6051i0671C25892a41241J653C3470c453k69320
18197b72773J10551H0089a03802j11388F0195M9259b72347c5103B32429r8981
18187A33448a76687k1611B00215a07150k8323N313j5833b4917A6576N55912d3063
18175G5757k5058M7693e875A43329a66784n3134j4822e3986j12908f7773C8942
18163b74482A61167j6806J13557j28958E9182M1451O7783J75852A31962i6177
18152a69387p1538B68760A4666J18326b76367a02442B36974b23247g5702C1565
$$ plain form
18141 -71550 8098 -19061 -1708 -219324 -6015 188946 -321001 310478 -221158 75381 -54384
18129 -180802 37193 147859 -45833 -87196 -352083 -236340 28800 -283217 -32238 242926
18118 -203893 -190736 -210085 333433 -26587 -78439 -88255 232136 -112766 16343 26429 168141
18107 168141 272973 -405458 -178566 -110703 44996 205159 59428 -83775 -98660 -4340 215107
18095 125811 -188054 99928 -246071 8676 205687 18893 93648 -31223 -72962 167312 44284
18083 3348 -255475 69215 -78979 -230940 -131674 -139097 -235009 2052 -191605 330707 214432
18072 214432 -128502 256037 18661 -344075 -77558 229997 -421601 -265996 -24495 -41106
18062 -41106 -221957 -19724 -142302 -80399 129195 115177 114624 -71981 349827 1995 -93924
$$ packed form
18141g1550H098a9061a708k17616f015A88946c21001C10478b21158G5381e4384
18129a80802C7193J10666d5833m1363k64887J15743B8800b83217c2238B42926
18118b03893J3157j9349C33433b6587n1852r816B32136a12766A6343J0086J41712
18107A68141J04832d05458a78566O7863D4996J60163E9428h3775j4885d340B15107
18095A25811a88054I9928b46071H676J97011A8893P4755c1223m1739A67312D4284
18083C348b55475F9215g8979j51961R9266p423r5912B052a91605C30707j16275
18072B14432a28502B56037A8661c44075g7558B29997d21601J55605b4495j6611
18062d1106j80851a9724j22578O1903A29195j4018n53g1981C49827A995i3924
$$ plain form
18050 -134475 228706 -79393 -63526 -110171 42267 171370 -222104 32308 14881 -59150 -183818
18039 -183818 -1358 -32541 181325 13297 -123427 250453 -48191 -98469 -25105 -47418 107580
18027 -152019 -140524 119803 -253436 24409 -105185 -193060 240893 -245802 -4974 -197749
18017 -197749 -76142 -2329 16380 -81423 219920 24998 -81259 -434008 84731 -71420 10072
18005 -85971 -68761 135466 -163123 -498 1309 -104153 208149 -138985 33992 56633 377199
17994 377199 -89102 -14166 -16880 -130686 -17502 214693 -62725 267403 265914 164311 -117040
17982 117736 26569 128760 -129372 -85651 -115127 163543 18628 -103839 361775 -294099
17971 249471 306602 -125327 103181 -31576 182138 -5481 -20277 -28771 9944 35285 66618
$$ packed form
18050a34475B28706g9393J5867m6645D2267J29103b22104C2308A4881e9150j24668
18039a83818a358l1183A81325A3297a23427B50453d8191n0278b5105k2313A07580
18027a52019J1495A19803b53436B4409a05185q7875B40893b45802d974j92775
18017a97749g6142b329A6380h1423B19920B4998h1259l52749H4731g1420A0072
18005h5971J7210A35466a63123d98A309a04153B08149a38985C3992K2641L20566
17994C77199h9102a4166k714j13806a7502B14693f2725B67403j489j01603a17040
17982A17736B6569J02191a29372M3721k9476A63543A8628a03839C61775b94099
17971B49471N7131a25327A03181c1576A82138e481j4796q494I944K5341L1333
$$ plain form
17960 66618 -196156 211844 77874 -19732 218229 159006 39532 263985 -159801 -201401 -285726
17949 -285726 -160220 -145685 274262 256519 -43744 173567 -74308 2972 23612 -312691 -323626
17938 -323626 118732 -26847 41895 263000 -112451 -125608 5833 -153419 201681 -143720
17927 184534 -37380 -77271 -82298 357688 53134 153823 230271 -263371 733 57662 -62605
17915 -50169 -308992 9328 -78161 -192857 -162298 -113764 -272457 -18021 217628 56780 48377
17904 48377 20492 163465 -185994 261094 39973 -33632 -105682 9448 -224841 -179328 -40504
17892 116419 -354161 226934 -26432 -156814 -88862 -149656 -358361 32650 66202 -37681 -407049
17881 -407049 -71496 243249 101796 -38602 -180195 -99211 -72238 -127491 -246828 33297 -193557
$$ packed form
17960F6618a96156B11844G7874a9732B18229n9223C9532K24453a59801m1600q4325
17949b85726J25506J4535B74262j7743d3744A73567g4308B972K0640c12691j0935
17938c23626A18732b6847D1895K21105a12451j3157E833a53419B01681a43720
17927A84534c7380l9891n027C57688E3134J00689P6448b63371G33N6929f2605
17915e0169k58823I328g8161j14696L0559M8534j58693a8021B17628E6780q403
17904D8377B0492J42973a85994B61094C9973c3632p2050I448b24841M5513d0504
17892A16419c54161B26934b6432j30382O7952o0794k08705C2650L3552c7681l69368
17881d07049g1496B43249A01796c8602j41593Q0984K6973n5253j19337C3297a93557
$$ plain form
17869 28067 -19457 1802 -53022 -43293 39797 21569 -187447 -139709 90618 56213 -22256 -24367
17857 -24367 -281037 62972 250828 -239587 87955 -24929 -157601 -21685 -178157 -112021 253436
17845 -93175 99128 -59183 61649 -27627 138683 -197694 113297 3922 -87834 239238 -137947
17833 -90372 202063 112576 30998 12623 -49755 26262 -12902 105500 226181 88043 140399
17822 140399 386346 -189309 54249 88518 55747 -17079 21234 89259 -75466 -325414 350027
17810 -93141 -299372 169248 255127 -54896 -4684 -132917 -234009 -339050 14400 -4425 -114347
17799 -114347 243983 -76548 271896 -101366 -152178 57121 106215 41626 -160073 103157
17788 97623 -214075 5888 -55365 -9797 185689 -208461 -140989 -29793 -274960 201041 124131
$$ packed form
17869B8067a9457A802e3022R729C9797j8228a87447M7738I0618l4405b2256k111
17857b4367k56670F2972J87856b39587H7955b4929j32672b1685j56472O6136B53436
17845i3175I9128e9183F1649b7627A38683a97694A13297C922h7834B39238a37947
17833i0372B02063q9487C0998A2623d9755B6262a2902A05500J20681H8043N2356
17822A40399K45947a89309E4249L4269l2771a7079B1234O8025g5466k49948C50027
17810i3141k06231A69248Q5879e4896d684j28233j01092j05041A4400d425j09922
17799a14347B43983g6548B71896a01366n0812E7121M9094D1626a60073A03157
17788I7623b14075E888e5365i797A85689b08461O7472b9793k45167B01041p6910
$$ plain form
17777 124131 61642 127875 -167851 144979 -135474 30876 9235 -260981 101429 -84812 -65723
17766 -65723 -142607 -73339 -126610 367915 47813 -263259 297881 -9017 -85494 -292287 47310
17754 107282 -106305 250066 -12267 89539 87603 -174651 3423 -325568 25349 -207814 -323069
17743 -323069 -118658 133453 -164365 -88521 -65690 144762 256790 223101 -223 -148160 359393
17731 345761 -14006 287191 -96243 69697 -164740 -71024 -24225 191192 -64891 87220 -70393
17719 272018 27814 113416 -110980 311670 281527 59834 177922 -254376 -132549 -5304 -66413
17708 -66413 179053 -68892 18496 -333829 429634 65871 2557 -85473 29170 407501 -134049
17696 -43140 -246010 125167 -12796 165058 -14059 -19741 65204 -40590 -54904 165079 -138698
$$ packed form
17777A24131F1642O6233a67851A44979a35474C0876I235b60981A01429h4812J9089
17766f5723p6884O9268n3271C67915D7813b63259B97881i017p6477k06793D7310
17754A07282a06305B50066a2267H9539j936a74651C423c25568B5349b07814j15255
17743c23069a18658A33453a64365P5844K2831A44762J12028l3689b23j47937C59393
17731C45761a4006B87191i6243F9697a64740g1024b4225A91192f4891H7220g0393
17719B72018B7814Q5602a10980C11670l0143E9834J18088b54376J21827e304o1109
17708f6413A79053f8892A8496c33829D29634F5871B557h5473B9170L78331a34049
17696d3140k02870A25167a2796A65058a4059n682F5204d0590j4314A65079a38698
$$ plain form
17684 437787 -224212 -104086 -308 -522668 -149952 4302 -96678 201187 -22514 -3942 -327914
17673 -327914 34321 275760 -32217 72583 41568 22202 -123718 -146560 118829 235631 190751
17662 190751 71169 180675 -183587 82773 262111 178717 127087 -80258 -49960 14914 -220561
17650 -128613 -213024 -1320 -254763 256925 122019 -89960 -151566 -74570 -53511 -212920 245315
17638 101904 79945 -58835 -165546 201139 87448 191247 -84901 157591 -6016 -27840 569524
17626 150855 136457 -55080 -309730 -120400 80650 223225 109486 -31765 153810 78828
17616 78828 -12146 262110 225709 65206 -377151 42210 -381626 36419 274280 247306 20000
17604 -34348 228190 93667 108290 259182 139940 -30375 -134653 410622 65455 -58734 10048
$$ packed form
17684D37787b24212a04086c08n22360a49952D302i6678B01187b2514c942l23972
17673c27914C4321K41439c2217G2583l1015j9366a23718k2842A18829J16802m4880
17662A90751G1169J09506a83587H2773J79338q3394n1630h0258L0298A4914b20561
17650a28613q4411a320k53443B56925A22019h9960o1606g4570K1059j59409B45315
17638A01904k1959e8835j06711B01139H7448J03799h4901A57591f016k1824E69524
17626A50855j4398e5080k54650a20400H0650J42575A09486c1765A53810p4982
17616G8828a2146B62110l6401F5206c77151D2210c81626C6419K37861k6974B0000
17604c4348B28190I3667J4623J50892j19242c0375j04278D10622F5455e8734A0048
$$ plain form
17592 335178 -489658 102564 108595 57340 -134444 -179624 130563 368100 -414104 -75327
17581 -61786 223161 70817 21647 306401 -75245 249897 141340 -9084 18837 34746 245893
17570 245893 41385 -152567 295513 54267 204642 -108661 194314 -142206 69060 -2020
17559 105370 315558 165772 143634 311863 31361 98276 -308684 170421 -108382 100743
17548 29673 53933 113448 174543 88359 36273 153421 -90383 114807 -53028 -109258 205852
17536 28240 191817 230995 32345 -8571 -267765 96905 331688 33169 304803 150992 163707
17525 163707 -163912 233122 253546 81686 -67818 130777 234455 -47919 -267547 302997
17514 -309904 -192181 -72069 283207 -57332 -6207 98898 -98422 -46087 59586 245504 -41382
$$ packed form
17592C35178d89658A02564O031n1255a34444m5180A30563K37537d14104g5327
17581f1786B23161G0817B1647K84754g5245B49897j08557i084A8837J5909K11147
17570B45893D1385a52567B95513E4267J50375a08661A94314a42206F9060b020
17559A05370K10188j49786k2138J68229C1361O6915c08684A70421a08382A00743
17548B9673K4260N9515O1095q6184C6273J17148i0383A14807e3028n6230B05852
17536B8240J63577L9178C2345h571k59194I6905K34783C3169K71634A50992J2715
17525A63707a63912B33122K0424H1686f7818A30777J03678d7919k19628C02997
17514c09904J17723g2069B83207e7332f207I8898i8422d6087E9586J85918d1382
$$ plain form
17502 -47260 10204 226008 -263861 -163702 -54625 148645 -98392 -180110 38301 450688 -158005
17490 8612 -18494 2205 186798 -66942 149427 80105 70771 593735 96852 -269706 92998
17478 -75958 8967 59684 -61472 329410 252576 264032 283884 318670 110004 -46318 -42683 -4164
17465 133839 138849 4344 -114449 89171 272466 183473 93476 31440 44427 27152 53759
17454 53759 41869 -12374 201782 284337 148949 222225 137404 -78496 336612 332737 -157333
17442 287785 314084 174649 -37684 201048 202833 149596 119437 316030 287466 258446 237973
17431 237973 338859 314469 100683 -128962 205164 482376 511924 218809 152127 198427
17421 198427 242664 -44703 322721 369036 148967 143021 473240 527980 75309 473740 296909
$$ packed form
17502d7260A0204K15804b63861J00159e4625A48645i8392q1718C8301M12387a58005
17490H612a8494B205J84593f6942A49427o9322r334N22964I6852b69706I2998
17478g5958H967N0717f1472C29410p6834J1456J9852L4786A10004d6318L635d164
17465A33839N010D344a14449H9171J83295q8993q9997C1440J2987j7275K6607
17454E3759j1890a2374B01782Q2555j35388P3276q4821g8496C36612l875a57333
17442B87785K6299j39435c7684B01048J785n3237l0159J96593k8564k9020k0473
17431B37973J00886k4390A00683a28962B05164K77212K9548B18809o6682M6300
17421A98427M4237d4703C22721M6315A48967n946L30219N4740G5309L98431j76831
$$ plain form
17410 296909 156409 -30021 251898 -26529 146556 298323 451844 186840 141967 86291
17400 86291 239661 181543 359199 18030 21639 102043 137403 116599 -41553 -19917 18086
17388 127729 312451 86382 -114942 56262 119536 299556 480193 171022 273812 194394
17378 194394 151590 4070 382538 -161890 19986 240266 383820 179811 -1947 248874 -146321
17366 167132 269508 113451 46795 359001 -41532 276203 369588 -86229 251336 290036
17356 290036 67606 6776 88698 225423 14020 122884 52005 68392 -82436 51214 75972
17345 75972 185850 338438 160369 218436 456616 38754 -108447 144942 -106642 194740
17334 338948 -168403 272141 -96883 39911 168090 -329 73624 -54839 167572 325370 89734
$$ packed form
17410B96909j40500c0021B51898b6529A46556J51767J53521A86840m4873n5676
17400H6291J53370n8118J77656A8030L609Q0404L5360k0804d1553a9917A8086
17388A27729J84722H6382a14942E6262O3274J80020J80637A71022J02790p9418
17378A94394m2804D070L78468a61890A9986K20280J43554A79811a947B48874a46321
17366A67132J02376A13451D6795L12206d1532B76203R3385h6229B51336L8700
17356B90036F7606F776Q1922J36725A4020J08864E2005J6387h2436E1214K4758
17345G5972J09878J52588A60369N8067K38180C8754a08447A44942a06642A94740
17334C38948a68403B72141i6883C9911J28179c29G3624e4839A67572J57798H9734
$$ plain form
17322 558111 151880 108313 199459 165868 100476 162740 223096 110865 140663 189023 370696
17311 370696 362198 114825 5138 17586 251651 142418 -78581 54094 244840 378440 163857
17299 94152 277769 415070 267059 55541 251240 159501 276588 133264 232613 -11254
17288 73215 244541 495585 280858 242211 -1534 -215373 -43885 432147 370981 368507 366547
17277 366547 294599 463642 298498 119072 -10423 340754 256865 206100 122610 126694 333879
17266 333879 6713 -231587 389785 5305 203310 116861 243961 133743 -156575 144813
17255 113383 168076 27899 257099 91711 83215 -37712 257813 -1267 94878 198209 374190
17244 374190 28617 167122 274219 467659 205090 148323 92990 -197756 374956 400352
$$ packed form
17322E58111A51880m3567R1146l3591o5392O2264O0356A10865K9798M8360J81673
17311C70696q498A14825E138J2448K34065j09233g8581E4094J90746J33600A63857
17299I4152J83617J37301j48011E5541J95699r1739J17087A33264R9349a1254
17288G3215J71326K51044k14727l8647a534k13839d3885D32147o1166k474j960
17277C66547p1948J69043j65144A19072a0423C40754q3889n0765q3490M084K07185
17266C33879F713b31587C89785E305J98005q6449J27100j10218a56575A44813
17255A13383N4693B7899K29200I1711q496c7712B57813a267I4878J03331J75981
17244C74190B8617J38505J07097J93440B05090n6767n5333a97756C74956K5396
$$ plain form
17234 400352 375120 563176 40896 150702 285692 200570 306194 446820 -28767 48939
17223 154196 -113687 -89950 432425 201388 85774 416417 145977 28021 85023 386896
17213 386896 290338 592676 354674 318076 -86604 174755 40388 202165 295468 99067 109499
17202 109499 419756 362902 5311 179740 152047 356466 230559 326992 163639 151782 243661
17191 243661 107068 308727 54632 163774 234151 324000 99596 -112056 204965 124197
17181 124197 369649 421482 420042 -31299 554206 317510 167599 188066 122211 375312 295910
17170 295910 143446 -170811 450639 389006 514033 210399 -32814 -40666 238153 400367
17160 400367 -50955 37519 148423 -38081 -9209 141292 476985 -30799 391013 233840 578104
$$ packed form
17234D00352k5232J88056D0896J09806J34990q5122J05624J40626b8767D8939
17223A54196a13687K3737D32425B01388H5774L30643A45977B8021N7002L01873
17213C86896r6558L02338k38002l6598h6604A74755D0388J61777R3303I9067J0432
17202A09499L10257n6854E311J74429k7693K04419j25907R6433j63353j1857R1879
17191B43661A07068K01659E4632J09142P0377Q9849I9596a12056B04965q0768
17181A24197K45452N1833j440c1299E54206k36696j49911K0467o5855K53101p9402
17170B95910A43446a70811D50639o1633J25027B10399c2814p852B38153J62214
17160D00367e0955C7519J10904c8081i209A41292L35693c0799C91013j57173L44264
$$ plain form
17149 578104 306290 523293 287570 37713 414052 124433 305766 195544 307045 124629
17138 297755 416881 490722 375248 267501 217433 -9932 515541 526257 371308 459058 600934
17127 600934 306269 -60169 176649 652100 388099 130998 140722 510646 441300 313249
17117 313249 342506 384518 432965 459700 357166 258110 560166 319444 435783 416168 110250
17105 427893 145219 89942 436798 426291 400459 344605 436742 305971 44497 111748 293048
17094 293048 548156 246758 342441 616624 629911 349866 257922 422556 413685 410803 595166
17083 595166 154311 438053 832766 476571 468140 524226 215527 473030 172851 695737
17073 695737 271651 624711 138232 244898 494459 256868 513045 213092 371045 463723
$$ packed form
17149E78104k71814K17003k35723C7713L76339A24433J81333j10222J11501A24629
17138B97755J19126P3841j15474j07747n0068i932E15541J0716j54949Q7750J41876
17127F00934k94665f0169A76649M75451k64001A30998R724L69924o9346j28051
17117C13249K9257M2012M8447K6735j02534r9056L02056k40722J16339j9615A10250
17105D27893A45219n5277L46856j0507k5832n5854R2137j30771D4497O7251J81300
17094B93048K55108B46758R5683K74183J3287k80045r1944J64634q871k882J84363
17083E95166A54311K83742L94713l56195q431N6086B15527K57503A72851N22886
17073F95737B71651L53060A38232J06666K49561k37591K56177B13092J57953R2678
$$ plain form
17063 463723 117825 647431 460943 406836 304832 497307 299257 324371 661217 578570
17053 578570 341570 6737 669430 427480 396787 774448 509226 352529 626033 355504
17043 355504 564599 655775 645913 788736 640263 357839 432938 563463 746690 503081
17033 503081 635048 420070 581479 639797 781669 539194 393817 455971 523745 593450
17023 593450 774737 553020 719876 742601 436891 755644 606507 369401 280829 793977
17013 793977 657185 759276 249386 663320 780965 598569 545264 442964 784598 660454
17003 660454 368887 514294 531863 563144 764650 546340 762331 587681 697311 827959
16993 827959 1025702 562070 629471 283401 565854 659346 710657 704081 800963 433749 630710
$$ packed form
17063D63723A17825N29606j86488n4107j02004J92475j98050K5114L36846q2647
17053E78570k37000F737O62693k41950l0693L77661k65222j56697K73504k70529
17043C55504K09095R1176r862J42823j48473k82424P5099J30525J83227k43609
17033E03081J31967k14978J61409N8318J41872k42475j45377O2154O7774O9705
17023E93450J81287k21717J66856K2725l05710L18753j49137k37106q8572N13148
17013G93977j36792J02091B49386M13934J17645j82396n3305j02300L41634j24144
17003F60454k91567J45407J7569L1281K01506k18310K15991j74650J09630J30648
16993H27959J97743m63632O7401B83401K82453R3492N1311o576R6882l67214J96961
$$ plain form
16982 630710 852451 680264 581717 798355 978230 756463 693083 840810 668622 779482
16972 779482 755877 805453 434649 472914 930688 1010027 773245 1093657 823145 893827
16962 893827 513062 1199669 961223 787010 918911 840361 1025621 1254572 1091187 1136236
16952 1136236 758257 1017458 878057 1232106 939896 1064301 1022508 909195 1098361 1121785
16942 1121785 1133551 1019966 1154626 895492 820694 969040 934932 1334159 1206085 906809
16932 906809 1001381 1074806 835328 997255 1437707 1087755 1334664 1066935 1545688 1249961
16922 1249961 1542951 1321047 1131867 988173 1268679 1195937 1300536 1271200 1238644 1106936
16912 1106936 1349352 1552143 1155676 1139797 1752767 1265294 1403125 1615362 1465855 1366531
$$ packed form
16982F30710K21741j72187r8547K16638J79875k21767o3380J47727j72188J10860
16972G79482k3605M9576l70804L8265M57774P9339k36782L20412k70512P0682
16962H93827l80765O86607k38446j74213J31901p8550J85260K28951j63385M5049
16952A136236l77979K59201j39401L54049k92210J24405m1793j13313J89166K3424
16942A121785J1766j13585J34660k59134p4798J48346l4108L99227j28074k99276
16932I06809R4572P3425k39478J61927M40452l49952K46909k67729M78753k95727
16922A249961K92990k21904j89180j43694K80506p2742J04599k9336l2556j31708
16912A106936K42416K02791l96467j5879O12970m87473J37831K12237j49507r9324
$$ plain form
16902 1366531 1484696 1495897 1276712 1547039 1824401 1432806 1696323 1637980 1306797 1540991
16892 1540991 1655803 1687964 1368747 1434616 1590087 1505492 2134856 1995532 1596063 1882403
16882 1882403 1725197 1824754 2189764 1885211 1863521 1886105 2243708 1744609 1892621 1935294
16872 1935294 2348158 2112548 2271113 2386485 2111512 2117545 2429889 2036948 2196562 2159977
16862 2159977 2374647 2356137 2246885 2516936 2791275 2549131 2861628 2426227 2567820 2758614
16852 2758614 2631752 2366357 3201580 2608186 2815785 2572981 2662482 2899686 3054978 3240046
16842 3240046 3149446 3011189 3237469 3026421 3315058 2891531 3175498 3281223 3518788 3736640
16832 3736640 3292402 3845084 3715603 3763936 4046486 3458697 3862355 3712257 4187610 4037470
$$ packed form
16902A366531J18165J1201k19185K70327K77362l91595K63517n8343l31183K34194
16892A540991J14812L2161l19217O5869J55471q4595O29364j39324l99469K86340
16882A882403j57206R9557L65010l04553k1690K2584L57603m99099J48012M2673
16872A935294M12864k35610J58565J15372k74973O033L12344l92941J59614l6585
16862B159977K14670j8510j09252K70051K74339k42144L12497m35401J41593J90794
16852B758614j26862k65395Q35223n93394K07599k42804Q9501K37204J55292J85068
16842C240046r0600j38257K26280k11048K88637m23527K83967J05725K37565K17852
16832C736640m44238N52682j29481M8333K82550n87789M03658j50098M75353j50140
$$ plain form
16822 4037470 4215926 4293478 4536808 4257901 4538011 4571322 5105245 4686826 4703543 5074435
16812 5074435 5239464 5205030 4964090 5048897 5265309 5513093 5604975 5737995 5625338 6233421
16802 6233421 6191610 6373886 6336988 6817271 6967212 7122011 6801855 6964916 7309279 7738212
16792 7738212 7498417 7738502 7941121 8293663 8325157 8368127 8655323 9214880 8695565 9329003
16782 9329003 9355393 9779832 9703357 10347673 10537254 10751579 11452535 11393173 11696442 12112683
16772 12112683 12269407 12966359 13060740 13276653 14177633 14310629 14895230 15217715 15709215
16763 15709215 16555167 16953013 17527365 18338787 18414214 19343906 19947724 20405764 21440109
16754 21440109 22125835 22894243 23952026 24640125 25620303 26775465 27761843 28838517 30186154
$$ packed form
16822D037470J78456P7552K43330k78907K80110L3311N33923m18419J6717L70892
16812E074435J65029l4434k40940Q4807K16412K47784R1882J33020j12657O08083
16802F233421m1811J82276l6898M80283J49941J54799l20156J63061L44363M28933
16792G738212k39795K40085K02619L52542L1494M2970K87196N59557n19315O33438
16782I329003K6390M24439p6475O44316J89581K14325P00956n9362L03269M16241
16772A2112683J56724O96952R4381K15913R00980J32996N84601L22485M91500
16763A5709215Q45952L97846N74352Q11422P5427R29692O03818M58040J034345
16754B1440109O85726P68408J057783O88099R80178J155162R86378J076674J347637
$$ plain form
16745 30186154 32001807 32863823 34593211 35705324 36830208 38978047 41075228 42923828
16737 42923828 45318254 47195106 49426871 52375329 54573624 57678513 61065613 64411705
16729 64411705 67878569 71656348 75675938 80094280 84425416 89842543 94801640 100161052
16721 100161052 106161015 112090612 118656207 125148866 132042675 139064591 145894248 152753262
16713 152753262 159332951 166034496 171679993 177464312 182107503 185888203 188925752 190436849
16705 190436849 191553056 191180954 189760563 187028886 183597629 179202160 173984914 168009786
16697 168009786 161866403 155211214 148197911 141381510 134760672 127834685 121379128 114822451
16689 114822451 108530053 102718983 97420618 91976866 86787244 81897299 77185500 73223836
$$ packed form
16745C0186154J815653Q62016J729388J112113J124884K147839K097181J848600
16737D2923828K394426J876852K231765K948458K198295L104889L387100L346092
16729F4411705L466864L777779M019590M418342M331136N417127M959097N359412
16721A00161052N999963N929597O565595O492659O893809P021916O829657O859014
16713A52753262O579689O701545N645497N784319M643191L780700L037549J511097
16705A90436849J116207l72102j420391k731677l431257m395469n217246n975128
16697A68009786o143383o655189p013303o816401o620838o925987o455557o556677
16689A14822451o292398n811070n298365n443752n189622m889945m711799l961664
$$ plain form
16681 73223836 68709242 65549580 61912003 58697657 55363344 52367363 49738188 47212051
16673 47212051 44944745 42688762 40729164 38700995 37146218 35431779 33677091 32120979
16665 32120979 30803812 29445616 27803054 26982886 25975768 24809184 23532528 22606037
16657 22606037 21821008 21165941 20149389 19807642 18922774 18109640 17462583 17068686 16555867
16648 16555867 16060480 15663184 14725877 14608606 14079192 13354754 12980994 12437667 12170819
16639 12170819 11854941 11697089 11519667 11080625 10730169 10197433 9953397 10030093 9710381
16630 9710381 8985793 9251209 8870965 8661099 8261191 8507860 8104453 8129668 7385321 7465374
16620 7465374 6947577 6908496 6935353 6750014 6247057 6249237 6159385 6155597 6138720 5545634 5779425
$$ packed form
16681G3223836m514594l159662l637577l214346l334313k995981k629175k526137
16673D7212051k267306k255983j959598k028169j554777j714439j754688j556112
16665C2120979j317167j358196j642562q20168j007118j166584j276656r26491
16657B2606037p85029o55067j016552l41747q84868q13134o47057l93897n12819
16648A6555867m95387l97296r37307j17271n29414p24438l73760n43327k66848
16639A2170819l15878j57852j77422m39042l50456n32736k44036P6696l19712
16630I710381p24588K65416l80244k09866l99908K46669m03407K5215p44347Q0053
16620G465374n17797l9081K6857j85339n02957K180q9852l788j6877n93086K33791
$$ plain form
16609 5779425 5452207 5785634 5584091 5275778 5329876 5171403 5291580 4924775 5066854 4700145
16599 4700145 4591006 4592441 4443162 4363012 4402615 4170373 4285541 4307542 4261555 4022897
16589 4022897 3754640 3995425 4115077 3515444 3936558 3483063 3214809 3715426 3347444
16580 3347444 3769519 3293549 3213257 3160191 2993804 3062578 3078486 3162439 2719936 2889966
16570 2889966 2604633 2751266 2865459 2689658 2560835 2498045 2562401 2476318 2507675 2619822
16560 2619822 2313510 2220707 2546773 2173926 2254317 2386894 2441985 2168543 2216645 2135638
16550 2135638 1853316 1910480 2340840 2274648 1647215 1627828 1993866 1958513 1877484 1728019
16540 1728019 1879595 1678850 1895003 1632237 1789988 1839728 1726427 1812257 1790943 1593362
$$ packed form
16609E779425l27218L33427k01543l08313N4098j58473J20177l66805J42079l66709
16599D700145j09139J435j49279q0150L9603k32242J15168K2001m5987k38658
16589D022897k68257K40785J19652n99633M21114m53495k68254N00617l67982
16580C347444M22075m75970q0292n3066j66387O8774J5908Q3953m42503J70030
16570B889966k85333J46633J14193j75801j28823o2790O4356q6083L1357J12147
16560B619822l06312r2803L26066l72847Q0391J32577N5091k73442M8102q1007
16550B135638k82322N7164M30360o6192o27433j9387L66038l5353q1029j49465
16540A728019J51576k00745K16153k62766J57751M9740j13301Q5830k1314j97581
$$ plain form
16530 1593362 1837265 1759414 1499195 1777598 1786120 1687165 1583114 1324518 1587478 1398748
16520 1398748 1438899 1589072 1086519 1146925 1430278 1485991 1575049 1284016 1314582 1072392
16510 1072392 1416384 825476 1312398 1074947 1303340 1162819 1178339 1205150 1439738 1387032
16500 1387032 863843 1128716 1180912 1141481 1194809 1312199 1106941 1234645 1236298 1035065
16490 1035065 1366611 1053719 1043220 1258432 1307870 977544 1139844 1077582 1173082 763926
16480 763926 1190876 1024867 758764 825926 1350492 908547 764692 827631 849932 770285
16470 770285 1054569 815838 527374 1175449 881699 701115 954858 918725 878423 659686
16460 659686 667114 1261655 909443 940903 929571 960251 570252 790864 777666 638939 327435
$$ packed form
16530A593362K43903p7851k60219K78403Q522r8955j04051k58596K62960j88730
16520A398748M0151J50173n02553O0406K83353N5713Q9058k91033L0566k42190
16510A072392L43992n90908M86922k37451K28393j40521J5520K6811K34588n2706
16500A387032n23189K64873N2196l9431N3328J17390k05258J27704J653k01233
16490A035065L31546l12892j0499K15212M9438l30326J62300o2262R5500m09156
16480G63926M26950j66009k66103O7162N24566m41945j43855O2939K2301p9647
16470G70285K84284k38731k88464O48075k93750j80584K53743l6133m0302k18737
16460F59686P428N94541l52212L1460j1332L0680l89999K20612j3198j38727l11504
$$ plain form
16449 327435 828075 590249 652292 1011184 637146 627512 446815 599514 634826 864583
16439 864583 839329 572719 487482 679537 547888 812648 705657 625022 337564 873386
16429 873386 842184 587253 567543 690582 684977 669153 856690 746316 517554 602694 447583
16418 447583 794475 677308 662905 456992 787448 342402 424270 713315 351151 659283
16408 659283 511295 566242 707849 417574 578748 479659 405888 391850 548970 593779
16398 593779 420336 463678 157603 534179 349182 340297 635986 448195 313728 308226
16388 308226 733570 937006 781950 417590 649128 578772 584703 471683 405121 511191
16378 511191 347549 320903 502923 32709 481383 595695 741420 494650 590805 306529
$$ packed form
16449C27435N00640k37826O2043L58892l74038r634j80697J52699L5312K29757
16439H64583k5254k66610q5237J92055j31649K64760j06991q0635k87458N35822
16429H73386l1202k54931j9710J23039n605j5824J87537j10374k28762Q5140j55111
16418D47583L46892j17167j4403k05913L30456C42402Q1868K89045C51151L08132
16408F59283j47988N4947J41607k90275J61174r9089p3771j4038J57120M4809
16398E93779j73443M3342A57603L76576j84997q885K95689j87791j34467n502
16388C08226M25344K03436j55056l64360K31538p0356N931j13020o6562J06070
16378E11191j63642k6646J82020C2709M48674J14312J45725k46770R6155k84276
$$ plain form
16368 306529 481228 334603 302248 543463 425895 300797 451565 71259 298383 510718
16358 510718 88496 694925 405766 289769 397591 685438 340561 300814 543440 352843
16348 352843 411487 810239 298900 437837 270180 200272 566943 237024 59037 -139201
16337 357600 445170 -33968 284134 405612 245917 362226 500072 555449 277159 117890
16326 287848 407294 261989 170170 643364 86458 219686 548904 447668 438539 -102210
16315 196986 -105524 364722 601330 220084 101031 447726 380721 238497 372002 180540
16304 314838 335170 215741 378677 266285 277806 177977 440260 190505 591205 227627
16293 121288 47160 323578 -15579 399005 -72788 108049 152521 55512 182849 405115
$$ packed form
16368C06529J74699j46625l2355K41215j17568j25098J50768G1259K27124K12335
16358E10718H8496O06429k89159j15997J07822K87847C40561l9747K42626j90597
16348C52843N8644L98752B98900J38937j67657o9908L66671B37024E9037a39201
16337C57600Q7570c3968B84134J21478j59695J16309J37846N5377B77159A17890
16326B87848J19446j45305r1819M73194H6458J33228L29218j01236r129a02210
16315A96986a05524C64722K36608B20084A01031L46695o7005j42224J33505A80540
16304C14838K0332j19429J62936j12392J1521r9829K62283A90505M00700B27627
16293A21288D7160K76418a5579C99005g2788A08049M4472E5512J27337K22266
$$ plain form
16283 405115 189551 19485 107029 -2966 273894 281381 389607 415999 388073 231806 389932
16272 389932 100931 603988 231362 518292 98650 144438 571498 674137 304448 249762
16262 249762 265661 546087 218680 431653 -24234 4992 462439 253872 282444 499056
16252 499056 128865 188062 140043 467915 20661 216934 280429 30962 -67485 393415 381306
16241 381306 -40908 312621 367167 425710 423442 52980 345890 74131 278916 -31642 400707
16229 177395 225344 414324 -109067 -116751 -37110 238012 246853 569843 -97528 25867 214377
16218 214377 510226 60842 283041 268066 127353 108905 140213 -23198 65691 -48078 230460
16206 214926 353103 331954 191946 -152743 -97523 1949 148056 -79696 -117828 71127 285924
$$ packed form
16283D05115A89551A9485Q7544b966B73894P487J08226K6392k7926j56267J58126
16272C89932A00931N03057B31362K86930I8650M5788M27060J02639C04448n4686
16262B49762J5899K80426B18680K12973b4234D992M57447k08567K8572K16612
16252D99056A28865N9197m8019L27872B0661J96273O3495C0962f7485C93415j2109
16241C81306d0908C12621N4546N8543k268E2980K92910G4131K04785c1642D00707
16229A77395M7949J88980a09067p684c7110B38012Q841L22990i7528B5867J88510
16218B14377K95849F0842K22199j4975A27353j8448L1308b3198F5691d8078B30460
16206B14926J38177k1149j40008a52743N5220A949J46107g9696l8132G1127K14797
$$ plain form
16195 285924 154280 125025 -152916 79048 -35274 -165920 421631 62472 65878 -5655 89479
16183 -91878 173018 -38488 3413 -47303 345827 329281 -87796 228948 267266 352854 150081
16171 151680 82548 181088 127909 354862 347378 177910 -64209 -80741 59254 77601 143756
16160 143756 88295 -213200 95788 91191 10385 46378 193701 -280706 94601 51375 -104932
16148 -2441 -110054 30785 -97481 46162 230657 159165 -134921 -163157 -99683 234506 224392
16137 224392 73908 -363797 -125445 60397 449478 -109467 9258 -123310 -67596 182994
16126 377858 287054 -44615 -213173 -37524 231949 -93869 -68473 169955 77455 -152407 -194030
16115 -194030 -192568 -83175 -99952 -133727 79232 -346982 9993 120359 135775 -179029 110525
$$ packed form
16195B85924j31644k9255a52916G9048c5274j30646D21631F2472L406e655H9479
16183i1878A73018c8488C413d7303C45827j6546h7796B28948L8318Q5588A50081
16171A51680o9132R8540n3179K26953p484j69468f4209j6532E9254J8347O6155
16160A43756n5461b13200I5788m597A0385L5993J47323b80706I4601m3226a04932
16148b441j07613C0785i7481D6162J84495p1492a34921k8236O3474B34506j0114
16137B24392G3908c63797a25445F0397L89081a09467I258a23310N5714A82994
16126C77858r0804d4615j68558c7524B31949i3869K5396A69955G7455a52407m1623
16115a94030J462h3175j6777l3775G9232c46982I993J10366J5416a79029A10525
$$ plain form
16103 260567 -156714 -56249 262831 -102514 -123263 91164 -87627 222974 99988 -99708 115815
16091 -58523 173949 112992 396022 128532 327537 127885 -43528 -33160 -19272 -8529 26212
16079 -154694 -20416 -270309 -190495 94876 70342 -136176 -38126 -129520 -137130 157194 18283
16067 89672 -38699 263548 129972 41611 -197043 -98232 -940 63341 180626 -3676 -101401
16056 -101401 298172 106599 57550 110256 -61545 -138773 54690 -182529 53490 137855 245094
16045 245094 5720 171240 -194265 646 77842 -52230 -242993 346199 117782 149614 343223
16034 343223 419057 -30078 70824 20109 347310 238865 336043 -50901 44485 -140794 -40122
16022 -81914 -176069 268267 -239699 -64750 111927 237512 -14959 -221059 -86053 -160204 -122748
$$ packed form
16103B60567a56714e6249B62831a02514k0749I1164h7627B22974I9988i9708A15815
16091e8523A73949o0957K83030A28532J99005A27885d3528J0368J3888h529B6212
16079a54694b0416k49893P9814I4876k4534a36176c8126r1394p610A57194A8283
16067H9672c8699B63548A29972D1611a97043i8232i40F3341J17285c676r7725
16056a01401B98172A06599m9049N2706f1545p7228E4690a82529E3490Q4365J07239
16045B45094E720J65520a94265F46P7196e2230j90763C46199A17782L1832J93609
16034C43223P5834c0078G0824B0109L27201j08445R7178e0901D4485a40794d0122
16022h1914r4155B68267b39699f4750A11927J25585a4959k06100h6053p4151L7456
$$ plain form
16011 -122748 -80813 -37964 -209376 43191 -29215 -173882 -63983 -179442 -289429 -18419 -85490
16000 -85490 288294 257687 237216 -102183 -147393 -60452 -51637 20069 -231980 62457 -317299
15988 -96595 90464 188357 25362 114449 246738 45310 -268195 -175173 -86803 138335 120423
15977 120423 -99618 -44792 -152189 42505 -167324 118776 -144383 58742 78049 266936
15967 266936 92747 -28525 -71017 64316 217039 107350 -113813 -218164 -103259 124492
15956 -88458 -178381 -57715 188184 -147030 42066 -444129 -272877 -70644 -34904 219893 74586
15944 163933 35153 -88546 164983 -222484 -448472 -427982 -230802 -53330 89019 24255 66337
15933 66337 -167487 140656 -94704 -46405 -128894 -168400 72617 17970 -175171 -104701 -1901
$$ packed form
16011a22748M1935c7964j71412D3191b9215j44667f3983j15459j09987a8419o7071
16000h5490B88294l0607k0471a02183m5210f0452Q815B0069b31980F2457c17299
15988i6595I0464R7893B5362Q9087J32289D5310b68195R3022h6803A38335j7912
15977A20423i9618d4792j07397D2505a67324A18776a44383E8742J9307J88887
15967B66936I2747b8525m2492F4316J52723A07350a13813j04351a03259A24492
15956h8458q9923e7715A88184a47030D2066d44129J71252g0644c4904B19893G4586
15944A63933C5153h8546A64983b22484k25988K0490J97180e3330H9019B4255M2082
15933F6337a67487A40656i4704d6405q2489l9506G2617A7970a75171P0470a901
$$ plain form
15921 -200806 -30034 -355370 -123287 85234 -135570 232264 -217752 -202100 -157522 -74589
15910 -145263 -187094 -168516 -64468 -157359 -72239 24060 181903 -59360 234890 4955 262492
15899 262492 57933 -33057 352037 -183349 -178981 -4957 -43424 -42584 256180 -306857 -31908
15887 -24918 58371 -101896 -61715 -94178 -281027 226706 -189188 69182 -344946 -36949 -174748
15876 -174748 -98778 -86327 -27603 -268222 163088 -297655 -42064 199964 172779 -245314
15865 32258 -94771 -94342 -31108 -188801 73241 157883 16715 83977 69050 -238505 -250385 -357667
15853 -357667 207228 -302877 -13880 50468 193848 -347034 526 184434 349605 -27619 -311083
15842 -311083 -335740 176439 170162 93551 -169916 -36163 -41180 86102 -97906 107931 -118857
$$ packed form
15921b00806c0034l25336a23287H5234a35570B32264b17752J5652M4578g4589
15910a45263m1831J8578f4468r2891g2239B4060J57843e9360B34890D955K57537
15899B62492E7933c3057C52037a83349M368d957l8467Q40B56180c06857c1908
15887b4918E8371a01896M0181l2463j86849B26706a89188F9182c44946c6949j37799
15876a74748P5970J2451b7603k40619A63088b97655d2064A99964k7185b45314
15865C2258i4771M29c1108j57693G3241Q4642A6715O7262j4927b38505j1880j07282
15853c57667B07228c02877a3880E0468J43380c47034E26J83908J65171b7619k83464
15842c11083k4657A76439o277p6611a69916c6163n017H6102i7906A07931a18857
$$ plain form
15830 17040 85326 18523 296874 68969 21504 -314572 -246814 -157621 213008 54828 31995
15819 31995 -301520 -26313 -243767 40534 1899 -238483 -126461 18959 243192 277818 -68700
15807 -344769 -329450 -240087 -204260 -240429 -209286 214771 153349 237245 -55225 -165558 -305237
15796 -305237 -122613 322167 -246224 -112221 -58898 -426978 26442 -306336 143688 133319
15786 133319 297698 -136045 39144 -75524 -148658 65886 -148529 -66373 326269 -244704
15775 -44842 3099 150541 85284 -82808 164887 -64093 -295766 154993 -208667 -296112 65848
15763 98385 -42884 -40483 -5293 -110327 -376013 183565 -408598 79850 -293964 299263 -149014
15751 -23607 -34310 -15911 80730 117801 155563 -89514 -79938 59013 150461 -137582 92902 -252161
$$ packed form
15830A7040O8286A8523K78351F8969B1504c14572O7758Q9193B13008E4828k2833
15819C1995c01520b6313k17454D0534A899b38483J12022A8959K24233L4626f8700
15807c44769J5319Q9363L5827l6169L1143B14771o1422Q3896e5225j10333j39679
15796c05237a22613C22167b46224a12221N3323l68080B6442c06336A43688j0369
15786A33319J64379a36045C9144g5524p3134F5886a48529f6373C26269b44704
15775d4842C099J47442o5257h2808A64887f4093k31673A54993b08667q7445F5848
15763I8385d2884K401e293j05034k65686A83565d08598G9850b93964B99263a49014
15751b3607j0703a5911H0730L7071L7762h9514R576E9013R1448a37582I2902b52161
$$ plain form
15738 -259719 -62307 -364341 167206 -5614 -79705 202903 -144389 -399119 221123 8440 -133040
15726 225242 -157948 -169710 -35309 -371005 88311 -136561 -219186 -372978 258001 -109995
15715 -72096 381405 35410 -85868 -198080 -167338 -166153 125725 -121636 -110789 296196 108447
15703 -40217 4146 430884 -249963 -71656 126761 -109704 123040 138852 238433 -150409 -318608
15692 -318608 93578 72896 9591 59532 -138912 59724 -282168 -43131 34141 54248 -27719
15680 -98004 23670 -88822 -133218 150735 -477231 -233215 -1240 -36696 121725 16744 344931
15669 344931 -9424 -95672 -40077 76928 -81185 106704 140775 82597 -158035 217588 -41665
15657 -187629 -29314 7848 -29121 -182306 293635 -65675 51994 -46127 -1608 -274184 68247
$$ packed form
15738b59719f2307l02034A67206e614p4091B02903a44389k54730B21123H440a33040
15726B25242a57948j1762c5309l35696H8311a36561q2625j53792B58001a09995
15715g2096C81405C5410h5868j12212L0742J185A25725a21636J0847B96196A08447
15703d0217D146M26738b49963g1656A26761a09704A23040J5812R9581a50409j68199
15692c18608I3578k0682I591M9941a38912E9724b82168d3131C4141K0107b7719
15680i8004B3670h8822m4396A50735d77231b33215a240l5456A21725A6744L28187
15669C44931i424q6248d0077G6928h1185A06704L4071n8178a58035B17588d1665
15657a87629b9314G848b9121j53185B93635f5675E1994d6127a608k72576F8247
$$ plain form
15645 37034 -105494 -156182 -15178 91676 -40409 -307823 -48292 34008 -53212 108350 -46643
15633 -44874 69289 -380119 189142 52697 172155 2866 55480 -72655 -100184 -410698 92172
15621 75320 189681 -377085 130558 -133249 -104375 54521 -154156 -345577 81428 -7641 4720
15609 -121069 -136399 -387816 -131792 162018 -84057 36659 -183750 16315 -157066 -73720
15598 -472777 56806 -119900 173247 -104019 60116 119310 -247864 -61171 -93412 113505
15587 229702 -308774 -22369 -117215 216899 168502 109747 15539 402418 -252370 89095 -79412
15575 232729 -22125 206012 434413 -88697 66397 502325 -315093 87606 35929 -55657 -5380
15563 -120609 24730 102260 -198831 -107133 -179625 27546 113915 205926 97821 42769 -25817
$$ packed form
15645C7034a05494n0688a5178I1676d0409k67414d8292C4008e3212A08350d6643
15633d4874F9289c80119A89142E2697J19458B866N2614g2655k7529l10514I2172
15621G5320J14361c77085A30558a33249K8874E4521a54156j91421H1428g641D720
15609a21069j5330k51417a31792A62018h4057C6659a83750A6315a57066g3720
15598d72777E6806a19900A73247a04019F0116N9194b47864f1171l2241A13505
15587B29702c08774b2369r4846B16899m8397n8755A5539L86879b52370H9095g9412
15575B32729b2125B06012K28401h8697F6397M35928c15093H7606C5929e5657e380
15563a20609B4730P7530a98831R1698p2492B7546Q6369R2011I7821D2769b5817
$$ plain form
15551 -3400 -43104 115860 144004 95387 -53103 276759 -171395 73357 244941 182825 -245207
15539 28617 -293803 -427506 -9537 -238880 -104031 -135233 298506 379418 55477 100348 37528
15527 -281501 -96140 25725 -34004 57843 134005 -36581 -107197 -13426 280015 249699 -216610
15515 84598 -9535 48443 216435 -102997 324935 145379 -171301 -141512 -182472 157740 46614
15503 68786 11557 -252942 181945 -25968 277333 58842 98718 29577 -21891 148361 139883
15492 139883 25925 62922 224230 -284652 -65177 264099 -155814 34534 398773 -57105
15481 -193428 153938 49367 -51994 43323 -164865 -228574 -150513 -70816 -38502 -107367 -2485
15469 -53683 -39069 -28836 296494 -25356 -227916 -279867 95460 -111094 -293068 -82292 -224681
$$ packed form
15551c400l9704A15860K8144m8617e3103B76759a71395G3357J71584o2116b45207
15539B8617b93803j33703i537k29343a04031l1202B98506Q0912E5477M4871C7528
15527b81501i6140B5725c4004E7843P6162c6581p0616a3426B80015l0316b16610
15515H4598i535D8443J67992a02997C24935A45379a71301K9789m0960A57740D6614
15503F8786A1557b52942A81945b5968B77333E8842L9876B9577b1891A48361q478
15492A39883B5925L6997J61308b84652f5177B64099a55814C4534L64239e7105
15481a93428A53938D9367e1994D3323a64865o3709P8061g0816L2314o8865b485
15469e3683J4614J0233B96494b5356k02560n1951I5460a11094j81974h2292j42389
$$ plain form
15458 -224681 169287 -73867 -69111 282749 53503 -133424 -126325 2874 74522 -1178 11910 -307948
15445 -104306 -134238 53707 40373 -29407 1464 -38942 -1267 36624 58361 228298 -260381
15433 315316 -74040 -206744 -340364 252681 58903 294334 -128965 -40953 58541 -97480
15422 545005 114735 9661 -35292 92827 40351 20478 225160 -95660 -260489 198824 128494
15411 128494 -245710 172587 -282190 -44097 -125478 194607 194725 74483 195094 168989 -297592
15399 -22404 -15666 -107427 213075 -87259 -106361 66609 -209628 -401854 -86533 -136645 -124965
15388 -124965 -27786 293955 -309772 -155872 43933 101296 180396 270580 -205115 9261 38945
15377 38945 -187455 -3128 -22084 51871 16504 -168462 -411171 282495 220806 63721 -94665
$$ packed form
15458b24681A69287g3867M756B82749E3503a33424P099B874P1648a178A1910c07948
15445a04306k9932E3707j3334b9407A464c8942a267C6624K1737J69937b60381
15433C15316g4040j32704j33620B52681E8903K35431a28965d0953E8541i7480
15422E45005A14735I661c5292I2827D0351j9873K04682i5660j64829A98824p0330
15411A28494b45710A72587b82190d4097q1381A94607J18G4483J20611k6105b97592
15399b2404O738r1761B13075h7259j9102F6609b09628j92226h6533n0112J1680
15388a24965b7786B93955c09772J53900D3933N7363P9100R0184b05115I261K9684
15377C8945a87455c128j8956E1871A6504a68462k42709B82495o1689F3721i4665
$$ plain form
15365 298108 -316728 85071 -6241 163157 154239 92759 -129209 280903 87578 64900 180721
15354 180721 -169365 177047 182048 -152926 183623 363772 -82600 -172394 150531 -152996
15343 103808 17768 -21720 -43011 59712 136044 22517 -7398 204927 30762 93399 -156784
15331 -258304 122310 -192186 152410 -59506 83987 39414 317797 -136018 -323007 1227
15320 35192 -144169 -249076 -100447 50240 117087 112605 -44607 225469 421184 -219702 105994
15308 198330 -336468 -313736 37677 -129225 173914 27993 -202886 101243 198938 156049
15298 156049 -28920 232206 -259087 -16708 49783 12170 350098 233539 10204 99042 301064
15287 301064 118781 20050 203143 -326672 -269646 -77659 -168912 26485 268352 320746 212656
$$ packed form
15365B98108c16728H5071f241A63157q918o1480a29209B80903H7578k2678J15821
15354A80721a69365A77047N001a52926A83623J80149h2600q9794A50531a52996
15343A03808A7768b1720k1291E9712P6332B2517g398B04927C0762O2637a56784
15331b58304A22310a92186A52410e9506H3987C9414K78383a36018j86989A227
15320C5192a44169j04907a00447E0240O6847m482d4607B25469J95715b19702A05994
15308A98330c36468K2732C7677a29225A73914B7993b02886A01243R7695m2889
15298A56049b8920B32206b59087a6708D9783A2170L37928j16559A0204Q8838K02022
15287C01064A18781B0050J83093c26672N7026g7659r1253B6485K41867N2394j08090
$$ plain form
15276 212656 26277 -120345 73505 374475 241936 186470 -5231 75193 -1111 455367 35410
15264 213861 472203 82917 -226484 -51734 205454 -159551 145740 239060 51804 163991
15254 163991 -337628 -14186 -46322 -85173 -11316 -407595 108885 -77723 289465 234824 101353
15242 293233 -21853 97096 93740 250325 67986 147155 161818 752520 744520 1299370 1902951
15231 1902951 1502244 1842021 1548323 957438 421531 225745 273674 -138131 -97754 197270
15220 68341 51204 62389 87331 171385 139326 104103 -182571 -141149 293002 60106 38977
15209 38977 76332 -326221 100582 -110703 -265980 200981 1120 -176860 113197 14537
15198 274543 140991 231735 340237 40930 171593 -33850 -40494 -45486 -162229 -29130 -22286
$$ packed form
15276B12656B6277a20345G3505L00970j32539n5466e231G5193a111D55367C5410
15264B13861K58342H2917b26484e1734B05454a59551A45740R3320E1804J12187
15254A63991c37628a4186l2136l8851a1316l96279A08885g7723B89465n4641A01353
15242B93233b1853I7096l356J56585F7986P9169J4663N90702q000N54850O03581
15231A902951m00707L39777k93698n90885D21531j95786M7929a38131M0377A97270
15220F8341j7137J1185K4942Q4054l2059l5223a82571M1422B93002F0106k1129
15209C8977L7355c26221A00582a10703j55277B00981A120a76860A13197A4537
15198B74543j33552R0744J08502D0930J30663c3850o644m992j16743b9130O844
$$ plain form
15187 -22286 -85312 -31280 216735 -165596 305854 -273129 29894 247975 -35792 187553
15176 289687 368077 -180999 404446 239217 265169 177926 376156 335170 106993 -159860
15165 -435417 50572 214557 88018 -20999 -63634 73 113119 8212 136111 174385 133542 -270216
15152 400653 306348 24957 -180478 90626 -47190 121585 341562 126228 -215037 63153
15141 130900 298525 363715 168329 408340 39548 109470 51107 -252385 -109727 144396
15130 -124901 201146 110789 5839 147907 164080 97613 -3108 111597 -53819 180352 95725
15119 95725 196862 37405 1520 -158350 238336 37850 614591 -291707 88800 62775 -21364
15107 582414 140483 240712 229362 484568 -51924 455253 -123651 -4326 67087 -118368
$$ packed form
15187b2286o3026c1280B16735a65596C05854b73129B9894K18081c5792A87553
15176B89687P8390a80999D04446j65229K5952q7243J98230m0986A06993a59860
15165d35417E0572J63985H8018b0999m2635G3J13046H212J27899L8274m0843b70216
15152D00653r4305B4957a80478I0626d7190A21585K19977A26228b15037F3153
15141A30900J67625O5190A68329K40011C9548O9922E1107b52385a09727A44396
15130a24901B01146r0357E839J42068J6173o6467c108A11597e3819A80352q4627
15119I5725J01137C7405A520a58350B38336C7850N76741b91707H8800k6025b1364
15107E82414A40483J00229j1350K55206e1924D55253a23651d326F7087a18368
$$ plain form
15096 251492 18402 14381 293414 401037 -50434 89656 -7299 498266 267525 184705 -123211
15084 101904 102375 344119 -218337 43404 -62951 -233946 383740 236005 123714 52977 276447
15073 276447 474955 287571 250440 163107 -100012 265425 255543 266733 413068 214749
15063 214749 389 19499 268743 286300 68934 -104594 147976 328049 230762 298869 -108412
15051 -56921 -70234 573683 62034 -127383 341982 419945 8914 267797 -137131 351174 235134
15040 235134 365411 118543 242394 165833 -118057 133876 256522 -57034 14121 87634
15030 87634 -79045 338133 -13841 -123073 278800 53121 359154 191908 195236 437183 142361
15018 368152 333059 47531 336398 228025 274420 223173 505807 210984 141103 -67639 291974
$$ packed form
15096B51492A8402m021K79033J07623e0434H9656g299D98266k30741q2820a23211
15084A01904M71K41744b18337D3404f2951j70995C83740j47735j12291E2977K23470
15073B76447J98508j87384l7131q7333a00012B65425r882J1190J46335j98319
15063B14749C89J9110K49244J7557F8934a04594A47976J80073r7287O8107a08412
15051e6921j3313E73683F2034a27383C41982P7963H914K58883a37131C51174j16040
15040B35134J30277A18543J23851p6561a18057A33876J22646e7034A4121P3513
15030H7634g9045C38133a3841j09232B78800E3121L06033j67246L328K41947A42361
15018C68152l5093D7531K88867j08373M6395n1247K82634B10984o9881f7639B91974
$$ plain form
15006 396811 77820 97277 169169 424859 411269 448665 260291 59220 276983 305970 110186
14994 9881 297824 230626 514047 10961 154562 281951 119466 259674 -2102 250181 484174
14983 484174 298657 -134420 90956 64055 567248 184202 198405 437271 305538 287645
14973 287645 198000 411150 481280 338768 399733 201981 99995 316398 338308 369201 346452
14962 346452 175082 248383 104965 367643 535886 211213 297666 104646 237368 208508
14952 208508 394276 -122951 185683 324229 675310 309753 174900 318205 125857 688868
14942 688868 202322 345828 199866 452395 485499 252038 352367 -281514 478987 278395
14932 278395 276170 240111 325859 335210 140684 -110607 501914 359539 423366 374276 466108
$$ packed form
15006C96811G7820J9457P1892K55690j3590L7396j88374E9220K17763K8987A10186
14994I881K87943o7198K83421A0961J43601J27389A19466J40208b102B50181K33993
14983D84174j85517a34420I0956k6901N03193A84202J4203K38866j31733j7893
14973B87645q9645K13150P0130j42512O0965j97752I9995K16403K1910L0893k2749
14962C46452j71370P3301A04965K62678J68243B11213Q6453A04646J32722k8860
14952B08508J85768a22951A85683J38546L51081C09753j34853J43305A25857N63011
14942F88868B02322J43506j45962K52529L3104k33461J00329b81514D78987k00592
14932B78395k225l6059Q5748R351A40684a10607E01914j42375O3827m9090R1832
$$ plain form
14921 466108 167986 188156 380417 -33921 110154 421883 610288 492871 432040 376739
14911 376739 595251 596960 161063 181404 401935 -12128 270534 278555 423506 378005 180126
14899 403605 90663 511699 696636 161917 330078 518122 727068 375749 134678 226498
14889 226498 184275 462755 202740 357041 750286 297424 102792 462775 393806 399043
14879 399043 329695 514184 510342 206387 195948 -99107 516269 730853 270187 30944 333684
14868 333684 302070 495125 511058 254499 95707 314061 384792 276006 267228 587711 316980
14857 316980 47518 565448 329949 217105 204190 380810 566779 92159 400182 235697
14847 235697 549490 604050 494146 301786 400411 264550 480821 421394 356994 517182
$$ packed form
14921D66108A67986K0170J92261c3921A10154L11729J88405j17417o0831n5301
14911C76739K18512J709A61063K0341K20531a2128B70534Q021J44951m5501A80126
14899D03605I0663M21036J84937A61917J68161J88044K08946l51319A34678R1820
14889B26498m2223K78480B02740J54301L93245B97424A02792L59983o8969N237
14879C99043o9348J84489l842B06387j0439i9107E16269K14584B70187C0944L02740
14868C33684l1614J93055J5933B54499I5707K18354P0731j08786q778L20483k70731
14857C16980D7518N17930k35499j12844j2915J76620J85969I2159L08023j64485
14847B35697L13793N4560j09904j92360R8625j35861K16271n9427o4400J60188
$$ plain form
14837 517182 145261 299117 780695 524353 582285 298822 774799 641421 300767 522462
14827 522462 475581 327353 605698 470754 283322 618189 440696 386508 478660 593342
14817 593342 471849 602937 615090 381639 759527 369550 550842 165605 473847 318539
14807 318539 525993 470783 441011 570333 328960 606499 259185 669459 657219 624021
14797 624021 510866 807598 746924 462688 880170 498850 979013 411613 551696 334782
14787 334782 645736 246091 652874 428266 337552 652556 490004 571051 529709 611363
14777 611363 651063 510241 494022 447880 794020 406651 734112 352979 893244 589882
14767 589882 588434 656283 998837 684631 368256 840579 798495 458266 498877 657433
$$ packed form
14837E17182A45261J53856M81578k56342N7932k83463M75977j33378C00767K21695
14827E22462m6881j48228K78345j34944j87432L34867j77493n4188R2152J14682
14817E93342j21493J31088J2153k33451L77888C69550J81292A65605L08242j55308
14807C18539K07454n5210k9772J29322k41373K77539B59185M10274j2240l3198
14797F24021j13155K96732o0674k84236M17482l81320M80163D11613J40083k16914
14787C34782L10954B46091M06783k24608r0714L15004j62552Q1047m1342Q1654
14777F11363L9700j40822j6219m6142L46140l87369L27461C52979N40265l03362
14767E89882j448O7849L42554l14206l16375M72323m2084l40229M0611J58556
$$ plain form
14757 657433 676097 837007 930456 740683 596278 567385 677574 685129 645417 589781 783093
14746 783093 790155 411578 793688 532331 540241 664263 575278 652802 693184 473631 697404
14735 697404 664644 765267 960311 643277 444791 683074 659997 1242229 876062 529937
14725 529937 883300 775910 735181 652079 918958 733601 837044 1014478 930209 929215 681459
14714 681459 1003341 740647 486953 942022 881404 874599 598428 458463 770342 807941
14704 807941 623594 845631 751691 1145109 1147914 925178 378057 916768 792595 865825
14694 865825 927088 960724 935017 615297 741017 702884 895172 569934 968443 807957
14684 807957 726945 961070 653420 1118653 757130 900586 737868 805894 821639 626387
$$ packed form
14757F57433J8664J60910R3449j89773j44405k8893J10189P555l9712n5636J93312
14746G83093P062l78577L82110k61357P910J24022q8985P7524M0382k19553K23773
14735F97404l2760J00623J95044l17034j98486K38283k3077N82232l66167l46125
14725E29937L53363j07390m0729q3102K66879j85357J03443J77434q4269r94k47756
14714F81459L21882k62694k53694M55069o0618o805k76171j39965L11879L7599
14704H07941j84347K22037r3940L93418K805k22736C78057N38711j24173P3230
14694H65825O1263L3636k5707l19720J25720l8133J92288l25238L98509j60486
14684H07957q1012K34125l07650M65233l61523J43456j62718O8026J5745j95252
$$ plain form
14674 626387 1135480 831850 700070 841032 910677 1173742 1157813 919070 1237373 1088534
14664 1088534 1124223 822206 1199659 905180 1133689 1055770 1230666 1002062 1114993 884609
14654 884609 1026582 886963 1248860 1132150 951444 1103087 876695 1285771 1135933 987868
14644 987868 1236308 1311092 986202 1453775 773326 1087133 1319526 1398625 1131756 1228553
14634 1228553 1124945 1049879 1265025 1417781 989128 1286848 1440941 1177849 1236238 1510393
14624 1510393 1202561 1383926 1400857 1353896 1531079 1218186 1468383 1384755 1280082 1241036
14614 1241036 1605728 1462902 1655310 1074547 1390950 1175706 1393274 1503856 1771834
14605 1771834 1710562 1695229 1509328 1718139 2023518 1495093 1867064 1713214 1682480 1788201
$$ packed form
14674F26387N09093l03630j31780J40962O9645K63065j5929k38743L18303j48839
14664A088534L5689l02017L77453k94479K28509p7919J74896k28604J12931k30384
14654H84609J41973j39619L61897j16710j80706J51643k26392M09076j49838j48065
14644I87868K48440P4784l24890M67573o80449L13807K32393P9099k66869R6797
14634A228553j03608p5066K15146J52756m28653K97720J54093k63092N8389K74155
14624A510393l07832J81365J6931m6961J77183l12893K50197q3628j04673l9046
14614A241036L64692j42826J92408n80763L16403k15244K17568J10582K67978
14605A771834o1272j5333j85901K08811L05379n28425L71971j53850l0734J05721
$$ plain form
14595 1788201 1706668 1897773 1594842 1499489 1504557 1797330 1581533 2035213 1596107 1696307
14585 1696307 1603785 1830867 2034085 1960294 1859197 1894307 1848103 2041588 1865887 2123604
14575 2123604 2018134 1736565 2131573 2268611 1948636 1989117 2252463 2013033 2143492 1913525
14565 1913525 2182725 2174069 2068460 1898890 2149346 2385718 2658250 2257687 2608159 2466369
14555 2466369 2112471 2486296 2447694 2454850 2517395 2717009 2892947 2484085 2924478 3017473
14545 3017473 3035159 3129119 3367793 3366318 3796723 4076016 4352889 4929326 5706319 6814169
14535 6814169 8236422 10885643 14952278 21427224 30592684 28698881 18984190 13361376
14527 13361376 8594374 6167629 4513722 3725199 3586537 3067651 2783362 2810884 2801014
$$ packed form
14595A788201q1533J91105l02931r5353N068K92773k15797M53680m39106J00200
14585A696307r2522K27082K03218p3791j01097L5110m6204J93485j75701K57717
14575B123604j05470k81569L95008J37038l19975M0481K63346k39430J30459k29967
14565A913525K69200q656j05609j69570K50456K36372K72532m00563L50472j41790
14555B466369l53898L73825l8602P156O2545J99614J75938m08862M40393R2995
14545C017473J7686R3960K38674j475M30405K79293K76873N76437P76993J107850
14535F814169J422253K649221M066635O474946R165460j893803r714691n622814
14527A3361376m767002k426745j653907p88523j38662n18886k84289K7522r870
$$ plain form
14518 2801014 2596748 2512496 2378254 2388128 2581806 2584377 2876157 2661938 2110188 2592989
14508 2592989 2563089 2291338 2435154 2990707 3033513 2521298 2694177 2743999 2771894 2830051
14498 2830051 2674737 2636296 3014735 3158532 3372830 3111933 3167158 2979791 3528608 3111401
14488 3111401 3411409 3416991 3330678 3509727 3371612 3806935 3516704 3501537 3905994 3530017
14478 3530017 3315316 3938167 3543853 3973750 3295455 3725365 3932838 3561866 4421210
14469 4421210 3660620 3721256 3643384 4187151 4143837 4213413 4318068 4508652 4522127 4426974
14459 4426974 4459420 4307215 4787703 4656301 4808609 4401011 4581823 4507717 4799135 5004796
14449 5004796 4996709 5250901 5150254 5375437 5007910 5450555 5074822 5410539 5472174 5438229
$$ packed form
14518B801014k04266q4252j34242R874J93678K571K91780k14219n51750M82801
14508B592989k9900k71751J43816N55553M2806n12215J72879M9822K7895N8157
14498B830051j55314l8441L78439J43797K14298k60897N5225j87367N48817m17207
14488C111401L00008N582q6313J79049j38115M35323k90231j5167M04457l75977
14478C530017k14701O22851l94314M29897o78295M29910K07473l70972Q59344
14469D421210p60590O0636p7872N43767m3314O9576J04655J90584J3475r5153
14459D426974L2446j52205M80488j31402J52308m07598J80812p4106K91418K05661
14449E004796q087K54192j00647K25183l67527M42645l75733L35717O1635l3945
$$ plain form
14439 5438229 5834615 5742346 5997095 5679096 5626729 6089737 5822071 5934699 6288033 6186305
14429 6186305 6064769 6325171 6359474 6372687 6558874 6633836 6600883 6714514 6948902 6669380
14419 6669380 7048218 7373530 7296804 7012602 7749058 7237316 7469912 7722194 7694193 8209945
14409 8209945 8337261 8142671 8547089 8484067 8306726 8611674 8714185 9103694 8981793 8983071
14399 8983071 9265631 9433109 9673995 9974990 9853204 9809517 10184263 10384947 10420597 10855462
14389 10855462 10985181 10739831 10876247 10913840 11109413 11668117 11599934 11730165 12058306 12459401
14379 12459401 12499032 12803507 12649304 12864739 13367670 13550775 13615949 14461657 14398462 14489020
14369 14489020 14771271 15020263 15392558 15687919 16163079 16174955 16629531 16808874 17347884
$$ packed form
14439E438229L96386r2269K54749l17999n2367M63008k67666J12628L53334j01728
14429F186305j21536K60402L4303J3213J86187P4962l2953J13631K34388k79522
14419F669380L78838L25312p6726k84202P36456n11742K32596K52282k8001N15752
14409H209945J27316j94590M04418o3022j77341L04948J02511L89509j21901J278
14399H983071K82560J67478K40886L00995j21786m3687L74746K00684L5650M34865
14389A0855462J29719k45350J36416L7593J95573N58704o8183J30231L28141M01095
14379A2459401L9631L04475j54203K15435N02931J83105O5174Q45708o3195R0558
14369A4489020K82251K48992L72295K95361M75160J1876M54576J79343N39010
$$ plain form
14360 17347884 17570146 18042827 18080734 18556093 19038892 19361871 19594390 20135461 20677213
14351 20677213 21122969 21406012 22382430 22153366 23153289 23393187 23957463 24381963 24729522
14342 24729522 25589548 26021053 27063863 27264356 27784347 28724067 29414882 29985733 30987023
14333 30987023 31732491 32458887 33154085 34074593 35249588 35901449 36708853 37760467 39182583
14324 39182583 40005685 40935184 42587909 43708720 44821981 46103485 47739288 49096209
14316 49096209 50422588 52168619 53843661 55662646 57389059 59094856 61105011 63282343
14308 63282343 65148211 67326388 69900530 72440800 74970650 78026971 80451144 83529354
14300 83529354 86974797 90152472 93646499 96811635 101425439 105296703 109924296 113946648
$$ packed form
14360A7347884K22262M72681L7907M75359M82799L22979K32519N41071N41752
14351B0677213M45756K83043R76418k29064R99923K39898N64276M24500L47559
14342B4729522Q60026M31505J042810K00493N19991R39720O90815N70851J001290
14333C0987023P45468P26396O95198R20508J174995O51861Q07404J051614J422116
14324C9182583Q23102R29499J652725J120811J113261J281504J635803J356921
14316D9096209J326379J746031J675042J818985J726413J705797K010155K177332
14308F3282343J865868K178177K574142K540270K529850L056321K424173L078210
14300H3529354L445443L177675L494027L165136M613804L871264M627593M022352
$$ plain form
14292 113946648 119281541 124333129 129883760 135829875 141388500 148111162 154667290 162063377
14284 162063377 169767239 177628814 186348335 195220958 204507186 214733570 225404289 236571399
14276 236571399 248299989 260258623 272855927 286174137 300124813 314441437 329192894
14269 329192894 343781750 358627126 373130222 386228789 398313801 409386695 419718049
14262 419718049 428611452 436430463 443306392 448643062 452078509 453776822 454931181 455924746
14254 455924746 453004957 446557649 440409746 431830368 421693910 411775581 399912950 387901172
14246 387901172 375833934 363014960 350398951 337254966 323812444 311003035 297870680
14239 297870680 285323672 274249558 262301807 250674567 239193169 228079300 217357792
$$ packed form
14292A13946648N334893N051588N550631N946115N558625O722662O556128P396087
14284A62063377P703862P861575Q719521Q872623R286228J0226384J0670719J1167110
14276B36571399J1728590J1958634J2597304J3318210J3950676J4316624J4751457
14269C29192894J4588856J4845376J4503096J3098567J2085012J1072894J0331354
14262D19718049Q893403P819011O875929N336670L435447J698313J154359R93565
14254D55924746k919789o447308o147903q579378j0136458r918329j1862631j2011778
14246C87901172j2067238j2818974j2616009j3143985j3442522j2809409j3132355
14239B97870680j2547008j1074114j1947751j1627240j1481398j1113869j0721508
$$ plain form
14232 217357792 207526882 197634180 188211163 179215901 170434185 161779326 154140382 146609175
14224 146609175 139739972 133705609 127752089 122142577 116903869 111746165 107111365 103118321
14216 103118321 98999281 94793419 91249243 87486846 84150505 80923571 77971629 75419800
14208 75419800 72527230 69821647 67670756 65221740 63152098 61271679 58697580 57072194
14200 57072194 55373924 53481569 52075276 50665067 48762073 47249377 45913606 45004658
14192 45004658 43603057 42598262 41262006 40476096 38823469 38117724 37050894 36111757
14184 36111757 34990765 34499023 33131133 32419340 31730170 30960505 30258212 29623246 28712467
14175 28712467 27863183 27350762 26819997 26109511 25529813 24758614 24618368 23800644 23616803
$$ packed form
14232B17357792r830910r892702r423017q995262q781716q654859p638944p531207
14224A46609175o869203o034363n953520n609512n238708n157704m634800l993044
14216A03118321m119040m205862l544176l762397l336341l226934k951942k551829
14208G5419800k892570k705583k150891k449016k069642j880419k574099j625386
14200E7072194j698270j892355j406293j410209j902994j512696j335771r08948
14192D5004658j401601j004795j336256p85910j652627p05745j066830r39137
14184C6111757j120992m91742j367890p11793o89170p69665p02293o34966r10779
14175B8712467q49284n12421n30765p10486n79698p71199j40246q17724j83841
$$ plain form
14166 23616803 22756879 22136217 21914348 21640236 21101664 20172476 20210088 19827859 19527096
14157 19527096 18987982 18586593 18380548 17773662 17525415 17303245 17222721 16711700 16550477
14148 16550477 16326560 16032493 15531530 15085910 15120989 15039300 14735538 14161229 13902414 13695529
14138 13695529 13812809 13292512 12963129 13014217 12603354 12225182 12090340 12031837 11777128 11882282
14128 11882282 11634023 11463389 11175283 11051517 10885839 10944429 10374568 10615488 10111487
14119 10111487 10069107 10013646 9714044 9470927 9712018 9568628 9359352 9005901 8991540 8854665
14109 8854665 8701526 8460469 9082397 8385851 8286895 8303891 7841021 8107460 7759721 7392817
14099 7392817 7713403 7392216 7517770 7414918 7340589 7016472 7042709 7138665 6735328 7011538
$$ packed form
14166B3616803q59924o20662k21869k74112n38572r29188L7612l82229l00763
14157A9527096n39114m01389k06045o06886k48247k22170q0524n11021j61223
14148A6550477k23917k94067n00963m45620L5079q1689l03762n74309k58815k06885
14138A3695529J17280n20297l29383N1088m10863l78172j34842n8503k54709J05154
14128A1882282k48259j70634k88106j23766j65678N8590n69861K40920n04001
14119A0111487m2380n5461k99602k43117K41091j43390k09276l53451j4361j36875
14109H854665j53139k41057O21928o96546r8956J6996m62870K66439l47739l66904
14099G392817L20586l21187J25554j02852p4329l24117K6237R5956m03337K76210
$$ plain form
14089 7011538 6746740 6373819 6125279 6849075 6291101 6421486 6704000 5973552 6235728
14080 6235728 6417993 5833523 6085992 5853818 5470146 5620958 5824303 5698722 5480914
14071 5480914 5503758 5517994 5332377 5210786 5256078 5383791 5257553 4912306 4977201 4836712
14061 4836712 4864536 4606115 4746634 4854000 4677660 4494403 4621046 4451322 4608544 4381226
14051 4381226 4218086 4114886 4583267 4114712 4099699 4181870 4191209 3741725 3972556 4381521
14041 4381521 4187952 4103929 3893309 3907388 3873752 3953101 3978610 3563032 3841221 3681325
14031 3681325 3641792 3620564 3606048 3346590 3161279 3372747 3212763 3443056 3360735 3483137
14021 3483137 3371468 3061043 3463296 3349081 3253632 2957207 3181973 3325224 3009175 3229520
$$ packed form
14089G011538k64798l72921k48540P23796n57974J30385K82514p30448K62176
14080F235728J82265n84470K52469k32174l83672J50812K03345j25581k17808
14071E480914K2844J4236j85617j21591M5292J27713j26238l45247O4895j40489
14061D836712K7824k58421J40519J07366j76340j83257J26643j69724J57222k27318
14051D381226j63140j03200M68381m68555j5013Q2171R339m49484K30831M08965
14041D381521j93569q4023k10620J4079l3636P9349K5509m15578K78189j59896
14031C681325l9533k1228j4516k59458j85311K11468j59984K30293q2321J22402
14021C483137j11669l10425M02253j14215r5449k96425K24766J43251l16049K20345
$$ plain form
14011 3229520 3001805 3273230 2855419 2779696 2713410 3010874 2872304 3076686 2958663 3046164
14001 3046164 2588095 2814906 2497565 2558851 2750890 2702109 2769675 2488863 2417638 2359424
13991 2359424 2289319 2357444 2384385 2340166 2709706 2511892 2604939 2580629 2270248 2486942
13981 2486942 2803965 2577752 2716231 3170067 3880348 4403574 5163292 7396795 10808195
13972 10808195 16177854 26502690 29526456 20928725 14368035 10023536 7414722 6462229
13964 6462229 5303388 4621075 4474836 4067464 3571043 3552413 3406340 2987696 3136363
13955 3136363 2849960 2804664 2960071 2749668 2707580 2670323 2526696 2899427 2409420 2651891
13945 2651891 2049975 1962065 2225905 2340940 2232782 2113646 2070879 1871520 1931641 1929766
$$ packed form
14011C229520k27715K71425m17811p5723o6286K97464j38570K04382j18023Q7501
14001C046164m58069K26811l17341O1286J92039m8781O7566k80812p1225n8214
13991B359424p0105O8125K6941m4219L69540j97814R3047k4310l10381K16694
13981B486942L17023k26213J38479M53836P10281N23226P59718K233503L411400
13972A0808195N369659J0324836L023766q597731o560690m344499k608814r52493
13964F462229j158841o82313j46239m07372m96421j8630j46073m18644J48667
13955C136363k86403m5296J55407k10403m2088l7257j43627L72731m90007K42471
13945B651891o01916q7910K63840J15035j08158j19136m2767j99359O0121j875
$$ plain form
13935 1929766 1996803 2070903 1518410 1677168 1949069 2170132 1869239 2119444 2009542 1776057
13925 1776057 1509741 1965057 1738888 1877762 1817276 1562417 1773803 1928304 1787633 1684949
13915 1684949 1798079 1737208 1923114 1592443 1619856 1504364 1724378 1673318 1808572 1578720
13905 1578720 1804225 1805022 1678007 1551632 1479192 1313042 1674864 1563733 1500926 1744889
13895 1744889 1632312 1275337 1423122 1133233 1567332 1200775 1363756 1680219 1572531
13886 1572531 1705032 1305627 1451165 1784819 1568536 1287724 1623588 1430553 1441815 1589093
13876 1589093 1311785 1057696 1479560 1210682 1111135 1081770 1165530 1386364 1468307 1147100
13866 1147100 1277679 1560045 1043319 1277804 1189967 1086394 1492591 1162708 1391288 1020275
$$ packed form
13935A929766O7037P4100n52493J58758K71901K21063l00893K50205j09902k33485
13925A776057k66316M55316k26169J38874o0486k54859K11386J54501j40671j02684
13915A684949J13130o0871J85906l30671K7413j15492K20014n1060J35254k29852
13905A578720K25505P97j27015j26375p2440j66150L61822j11131o2807K43963
13895A744889j12577l56975J47785k89889M34099l66557J62981L16463j07688
13886A572531J32501l99405J45538L33654k16283k80812L35864j93035J1262J47278
13876A589093k77308k54089M21864k68878r9547k9365Q3760K20834Q1943l21207
13866A147100J30579K82366n16726K34485q7837j03573M06197l29883K28580l71013
$$ plain form
13856 1020275 1031972 1168268 1152096 979414 1237555 1197708 1138942 1212695 1355441 926232
13846 926232 1443731 1197174 912754 1231561 1258930 1257337 907952 1074450 1015003 955288
13836 955288 1314474 862834 1215886 1258818 1350623 822209 1070827 1017295 1042695 959651
13826 959651 773775 1123284 969506 1190423 1083626 879008 1195173 947268 1148527 723397
13816 723397 1002121 962371 925898 1112956 1024579 827755 1020001 1001010 686962 750195
13806 750195 869922 1186426 991775 916875 774235 863219 1212282 838487 1116672 946349
13796 946349 1115756 709367 760243 755096 991495 522114 834592 1003255 798762 837993
13786 837993 891535 679882 820985 691231 1069375 680916 757904 856293 859894 938074 738634
$$ packed form
13856A020275J1697J36296j6172j72682K58141l9847n8766P3753J42746m29209
13846I26232N17499k46557k84420L18807K7369j593l49385J66498n9447n9715
13836I55288L59186m51640L53052M2932R1805n28414K48618n3532K5400q3044
13826I59651j85876L49509j53778K20917j06797k04618L16165k47905K01259m25130
13816G23397K78724l9750l6473J87058q8377j96824J92246j8991l14048O3233
13806G50195J19727L16504j94651p4900j42640Q8984L49063l73795K78185j70323
13796I46349J69407m06389N0876n147K36399m69381L12478J68663k04493L9231
13786H37993N3542k11653J41103j29754L78144l88459P6988R8389L601P8180j99440
$$ plain form
13775 738634 741376 1116549 491357 956731 651817 806221 794416 500004 729727 792257
13765 792257 500160 843351 959801 1023573 875190 941858 740162 617091 1108845 404866
13754 1075335 803262 685338 773165 712505 837356 748200 588438 776987 814122 739270
13744 739270 637995 806897 538442 766670 664823 513103 773212 699037 396030 702505
13734 702505 689074 420032 730629 869036 856546 354350 1052664 855937 787056 340652
13723 313455 646669 940117 730449 374523 529467 632160 469539 928812 651325 1017602
13713 1017602 696558 725922 495612 198008 521150 691229 1031126 349634 101372 722314
13703 722314 522905 224797 747864 417028 262173 889137 466330 506008 485459 438355
$$ packed form
13775G38634K742L75173D91357M65374l04914J54404j1805k94412K29723O2530
13765G92257k92097L43191J16450O3772j48383O6668k01696j23071M91754D04866
13754A075335k72073j17924Q7827o0660J24851q9156j59762J88549L7135p4852
13744G39270j01275J68902k68455K28228j01847j51720K60109p4175l03007L06475
13734G02505j3431k69042L10597J38407j2490C54350O98314j96727o8881C40652
13723C13455L33214K93448k09668l55926J54944J02693j62621M59273k77487L66277
13713A017602l21044K9364k30310A98008L23142J70079L39897C49634A01372O20942
13703G22314j99409B24797N23067l30836j54855O26964m22807L9678k0549m7104
$$ plain form
13693 438355 598029 777480 359809 570965 662717 442508 786223 744932 494823 580610
13683 580610 546430 437488 340539 367138 568484 557824 588981 340358 473058 305880
13673 305880 444743 413659 374582 487028 366298 352236 546344 480937 1036508 762805
13663 762805 382173 643353 518800 508377 348907 444605 439584 271022 357976 412203 452979
13652 452979 563730 594429 673690 353180 316581 298451 379074 474532 502572 250969 659322
13641 659322 500134 339494 429788 671499 630630 204443 478753 622694 587806 376145
13631 376145 371074 623240 399658 432587 456619 511690 103104 528007 506409 459698 449750
13620 449750 542343 337834 540881 585003 356559 273885 547724 42950 458725 167346
$$ packed form
13693D38355J59674J79451C59809K11156R1752k20209L43715m1291k50109Q5787
13683E80610l4180j08942r6949K6599K01346j0660L1157k48623J32700j67178
13673C05880J38863l1084l9077J12446j20730j4062J94108o5407N55571k73703
13663G62805l80632K61180j24553j0423j59470R5698n021j68562Q6954N4227M0776
13652D52979J10751L0699P9261l20510l6599j8130Q0623R5458K8040B50969M08353
13641F59322j59188j60640R0294K41711m0869B04443K74310J43941l4888k11661
13631C76145n071K52166k23582L2929K4032N5071A03104M24903k1598m6711r948
13620D49750R2593k04509K03047M4122k28444q2674K73839D2950M15775A67346
$$ plain form
13609 394340 342620 629023 353578 178813 543584 764375 931883 131333 383473 415080
13599 415080 315421 399587 713084 466297 277375 400420 500982 78865 251389 282172
13589 282172 733590 700306 676761 370859 -1297 268380 802905 185582 579161 291594
13579 291594 213102 342335 398539 147544 505870 327922 532144 415528 633686 207869
13568 513601 203296 380105 244627 96700 178960 321749 519224 430485 244073 162058
13558 162058 147012 95119 404177 377424 440916 329949 459340 150717 515713 121247
13547 399584 438273 259 477761 439822 227390 644820 436012 491500 459180 522223 40180
13535 627865 313649 159516 280517 -19649 54166 135061 346543 326513 426273 438123 340444
$$ packed form
13609C94340n1720K86403k75445j74765L64771K20791J67508A31333K52140L1607
13599D15080r9659Q4166L13497k46787j88922J23045J00562G8865J72524L0783
13589B82172M51418l3284k3545l05902a297B68380N34525A85582L93579k87567
13579B91594p8492J29233N6204A47544L58326j77948K04222j16616K18158B07869
13568E13601B03296J76809j35478I6700Q2260J42789J97475q8739j86412q2015
13558A62058j5046n1893L09058k6753O3492j10967J29391A50717L64996A21247
13547C99584L8689B59M77502l7939k12432M17430k08808N5488l2320O3043D0180
13535F27865C13649j54133J21001a9649E4166Q0895K11482k0030R9760J1850r7679
$$ plain form
13524 340444 -13123 -69791 501303 593109 -66450 208969 52147 394477 441625 453664 580856
13513 580856 400740 268451 272044 287657 430371 -63441 70185 325041 328246 155697 131771
13502 131771 245703 258628 423683 144936 197385 102393 198386 399820 254462 568998
13492 568998 188568 401933 554560 191591 282131 355621 3926 101681 246684 -203529
13481 310578 191333 22981 40701 625068 437528 256430 152250 79995 340867 563492
13471 563492 259177 388865 228807 270717 624463 158580 72145 311876 303605 619293
13461 619293 209905 258935 162328 406069 307399 126165 469280 210443 298285 339619
13451 339619 394257 213714 219668 -172754 388973 314273 121364 330923 138150 338696
$$ packed form
13524C40444a3123n6668E01303R1806f6450B08969E2147L42330M7148J2039J27192
13513E80856j80116j32289L593J5613J42714f3441G0185K54856L205A55697k3926
13502A31771J13932J2925J65055A44936N2449r4992R5993K01434j45358L14536
13492E68998A88568K13365J52627A91591R0540P3490C926R7755J45003b03529
13481C10578j19245B2981J7720N84367j87540j81098j04180p2255K60872K22625
13471E63492B59177J29688j60058M1910L53746A58580G2145K39731q271L15688
13461F19293B09905M9030r6607K43741r8670A26165L43115B10443Q7842M1334
13451C39619N4638j80543N954a72754C88973p4700A21364K09559A38150K00546
$$ plain form
13441 338696 106382 108497 289654 232733 135123 319506 363923 52103 294311 301960 183872
13430 183872 326014 517199 190695 537716 156545 131200 483969 241501 24587 288294
13420 288294 240844 485157 328325 -16659 385760 363341 295341 164714 226865 243065 243656
13409 243656 410184 129902 62093 -4054 -77288 186444 107285 44798 277014 60948 157842
13398 157842 -50781 91344 103279 402308 164140 166812 5306 67642 233911 284736 -3068
13386 160162 99069 11688 116361 -20584 209106 467204 188958 321787 31119 269199
13376 269199 240872 72315 112485 -6416 228062 213246 100350 215777 424424 87212 308194
13365 308194 289620 147797 267043 124635 67323 128026 197250 453253 2839 447258 177168
$$ packed form
13441C38696A06382K115J81157n6921r7610J84383M4417E2103K42208P649j18088
13430A83872J42142J91185A90695L47021A56545k5345L52769B41501B4587K63707
13420B88294m7450K44313j56832a6659C85760k2419o8000j30627O2151J6200N91
13409B43656J66528A29902F2093d054p3234A86444p9159D4798K32216F0948R6894
13398A57842e0781I1344J1935K99029A64140K672E306O2336J66269N0825c068
13386A60162o1093A1688J04673b0584B09106K58098A88958J32829C1119K38080
13376B69199k8327G2315M0170f416B28062j4816A00350J15427K08647H7212K20982
13365C08194j8574j41823J19246A24635n7312O0703O9224K56003B839M44419A77168
$$ plain form
13353 277976 102024 46797 297241 182620 370792 285366 229358 352650 253447 347693
13343 347693 193809 321015 298162 176288 261830 94956 173306 3898 358630 19047 387662
13332 387662 68503 78783 177008 128763 149838 460256 445938 -96389 145587 245803 87997
13320 188644 118199 399118 70501 329140 203083 448700 425224 168929 114058 481358
13310 481358 59279 550356 309674 367232 306158 100352 -185983 212864 65357 13130
13299 62959 258734 172231 118696 294335 210708 185798 328357 -72044 311439 86243 271765
13288 271765 295217 375207 146035 -1734 225878 131779 107813 60272 472103 20054 158207
13277 158207 232896 314671 77041 -66997 497637 597037 -67686 144796 95231 212461 144911
$$ packed form
13353B77976A02024D6797K50444j14621J88172q5426n6008J23292r9203R4246
13343C47693j53884J27206k2853j21874Q5542I4956P8350C898L54732A9047L68615
13332C87662F8503J0280R8225m8245K1075L10418j4318i6389A45587J00216H7997
13320A88644p0445K80919G0501K58639j26057K45617k3476A68929n4871L67300
13310D81358E9279M91077k40682N7558o1074A00352a85983B12864F5357A3130
13299F2959J95775q6503n3535J75639q3627k4910J42559g2044C11439H6243J85522
13288B71765K3452P9990A46035a734B25878r4099k3966m7541M11831B0054J38153
13277A58207P4689Q1775G7041f6997D97637R9400f7686A44796m9565J17230o7550
$$ plain form
13266 144911 253748 78326 -6973 138356 120724 284183 264795 165517 202593 131478 -164251
13254 64069 87643 140893 192587 42976 35691 83062 242955 71636 131421 -8514 190934 249270
13242 249270 20399 66523 165591 -222570 -182075 -106404 301251 6279 -141985 352851 94723
13230 75355 53103 115002 65265 -129528 125573 314015 -38851 14386 127385 249031 -73723
13218 133376 4083 180646 80860 51108 -75224 217487 123134 -73860 375237 115689 168788
13207 168788 301061 -17385 162367 158144 83439 130885 40097 339512 368136 429314 146923
13195 -416 222317 -13857 90101 -96424 391635 14908 84648 -91720 45142 164201 73662
13183 128630 429628 -101987 259678 -45660 -161891 -54973 32847 127713 96200 -167141
$$ packed form
13266A44911J08837G8326f973A38356j7632J63459j9388r9278L7076p1115a64251
13254F4069K3574N3250N1694D2976p285M7371J59893G1636N9785h514A90934N8336
13242B49270B0399M6124R9068b22570M0495P5671C01251F279a41985C52851I4723
13230G5355k2252O1899m9737a29528A25573J88442c8851A4386J12999J21646g3723
13218A33376D083J76563H0860k9752g5224B17487r4353g3860C75237A15689N3099
13207A68788J32273a7385A62367m223p4705M7446D0097K99415K8624O1178A46923
13195d16B22317a3857I0101i6424C91635A4908O9740i1720D5142J19059G3662
13183A28630L00998a01987B59678d5660j16231e4973C2847R4866l1513a67141
$$ plain form
13172 319917 135214 301407 -89268 166371 73969 117761 18938 14034 -15374 -104994 126288
13160 321271 -448860 162070 -78960 116758 131680 -45703 331182 99120 -29294 -64308 -171585
13149 -171585 264720 158706 25492 120261 12161 402108 278816 144333 -187617 60615
13138 20112 -187827 212596 34237 -3055 135961 -64682 -15703 271526 278641 1949 97683
13127 97683 186858 121457 20866 189843 -10839 -10858 -15159 -189495 76123 128931 147537 -64727
13114 67868 94736 277799 273399 181116 189521 113898 -158635 10314 144861 -119486 -7103
13102 -75275 -143608 417468 97189 146255 -45882 -91780 310199 -23236 456416 157767 -13473
13090 196117 501465 -140103 92774 -72753 -85890 166918 -128623 114440 135668 148174
$$ packed form
13172C19917A35214J66193h9268A66371G3969M3792A8938m904a5374q9620A26288
13160C21271d48860A62070g8960A16758J4922d5703C31182I9120b9294l5014j07277
13149a71585B64720j06014B5492R4769A2161L89947j23292j34483a87617F0615
13138B0112a87827B12596C4237c055A35961f4682a5703B71526P115A949R5734
13127I7683Q9175o5401B0866J68977a0839j9m301j74336G6123N2808J8606f4727
13114F7868K6868J83063m400r2283Q405p5623a58635A0314J34547a19486g103
13102g5275o8333D17468I7189M9066d5882m5898C10199b3236D56416A57767a3473
13090A96117L05348a40103I2774g2753j3137A66918a28623A14440K1228J2506
$$ plain form
13080 148174 -169340 224576 381880 86022 -125633 -5036 -386835 54544 -83351 133685
13069 497129 -81528 221271 -80612 429735 187174 -41810 69668 263525 284460 31502 82311
13058 82311 145562 194850 112782 168084 149208 -203554 -109039 -163544 163371 -113937 203483
13046 222447 174559 39047 186073 -53606 39837 -104936 271242 150102 54559 239678
13036 239678 163215 81610 144961 -281546 187397 72570 -28132 -31878 170116 -215102 56732
13024 102629 33905 6103 -80612 -235421 154719 77758 -33857 -16143 26459 89511 99669
13013 99669 -212549 -54748 -12847 144734 -11578 -247378 95028 59043 -272908 -82828 422327
13001 60699 109174 66957 34817 277824 66723 234127 137786 208701 110339 -221602 57239
$$ packed form
13080A48174a69340B24576J57304H6022a25633e036l81799E4544h3351A33685
13069D97129h1528B21271h0612D29735A87174d1810F9668J93857K0935C1502N0809
13058H2311O3251M9288q2068N5302j8876b03554R4515n4505A63371a13937B03483
13046B22447m7888C9047J47026e3606C9837a04936B71242j21140E4559J85119
13036B39678p6463q1605O3351b81546A87397G2570b8132l746A70116b15102E6732
13024A02629C3905F103h0612j54809A54719p6961c3857a6143B6459O3052J0158
13013I9669b12549e4748a2847A44734a1578k35800I5028l5985b72908h2828D22327
13001F0699M8475m2217l2140K43007F6723J67404r6341P0915r8362b21602E7239
$$ plain form
12989 235912 -84609 -10233 -115223 286814 549281 -309582 80725 58271 -110906 13885
12978 295677 9622 -294701 184681 -31681 94726 45014 -249325 -93603 -107250 95651 222362
12967 222362 -215181 37106 -47442 158221 -87556 141267 99959 186069 -24233 150880 -261021
12955 -21750 244665 96196 -27360 381705 -108823 -92215 -253828 -97081 22261 -242428 -19960
12943 7668 -15170 36613 123774 -190182 286776 -27396 364570 -26460 193388 56684 -63564
12931 -232353 76917 -22080 238441 -19200 -189143 -86197 -112887 75892 50097 74911 -137825
12919 -37180 -8049 -135234 -59311 -252742 43161 145510 -66290 115684 274084 -159264 159460
12907 -59798 282421 -283472 -76267 287522 -15745 -128230 -35622 -38803 54011 169809 -134493
$$ packed form
12989B35912h4609a0233j04990B86814K62467c09582H0725k2454a10906A3885
12978B95677I622b94701A84681c1681I4726D5014b49325i3603j3647I5651J26711
12967B22362b15181C7106d7442A58221h7556A41267m1308Q6110b4233A50880b61021
12955b1750B44665I6196b7360C81705a08823J6608j61613i7081B2261b42428a9960
12943G668a5170C6613Q7161a90182B86776b7396C64570b6460A93388E6684f3564
12931b32353G6917b2080B38441a9200j69943h6197k6690G5892k5795K4814a37825
12919c7180h049j27185e9311j93431D3161J02349f6290A15684J58400a59264A59460
12907e9798B82421b83472g6267B87522a5745j12485c5622l181E4011J15798a34493
$$ plain form
12895 169917 -118084 100005 -141314 -155331 322402 -761 131939 306945 -12316 -33904 31366
12883 82715 140460 189123 509844 80470 174434 138786 286048 -209781 149560 249781 -67155
12871 3862 165169 -152757 -86308 -34917 52322 113400 -85853 -162807 249632 161061 66829
12859 -127295 -8973 -50102 10275 -298513 77338 106751 -11399 105234 -83452 125056 -135756
12847 252433 -50554 126970 -91180 389443 -29456 -21958 30747 -298563 125885 -21397 -4283
12835 -77344 -78867 -52572 347289 -22480 154642 66754 144729 279442 146829 231875 353117
12824 353117 473375 70085 127634 -74394 74678 5955 -236192 -3350 -54096 50913 -40068
12812 -69855 22860 57354 -284170 185931 -40513 -75125 10317 125899 -73088 152343 111366
$$ packed form
12895A69917a18084A00005a41314j4017C22402g61A31939J75006a2316k1588C1366
12883H2715N7745M8663L20721H0470R3964l5648J47262b09781A49560J00221f7155
12871C862J61307a52757O6449c4917E2322O1078h5853p6954B49632q8571F6829
12859a27295h973m1129A0275b98513G7338K9413a1399A05234h3452A25056a35756
12847B52433e0554A26970i1180C89443b9456P498C0747b98563A25885b1397d283
12835g7344j523K6295C47289b2480A54642F6754P7975J34713j32613Q5046J21242
12824C53117J20258G0085N7549g4394G4678E955b36192c350n0746E0913d0068
12812f9855B2860L4494b84170A85931d0513l4612A0317J15582g3088A52343m0977
$$ plain form
12801 111366 -88038 -325266 -88201 242068 79940 96971 -156999 -120942 -81464 60091 68381
12790 68381 12978 -19694 332680 -136237 -163434 -46619 -229646 -136745 -225130 273335 212352
12779 212352 141332 -240313 313666 -205566 -150638 -164651 63469 2942 8924 -28514 76996
12767 123118 -127002 143075 16515 78837 44269 -213331 -314492 -8349 -5894 210218 1884
12755 -10372 22290 95349 -144115 10092 68061 -79265 44653 -81907 224373 111970 33933
12743 -250842 177994 152936 162024 -96704 -30992 131501 88162 215402 224364 46215 215934
12732 215934 288422 -70636 -6253 -162896 123914 -173690 207737 -307563 -210831 -171477 22035
12720 200519 -8632 71187 128814 -100991 218464 68341 -258343 203004 103865 155489 57525
$$ packed form
12801A11366h8038k37228h8201B42068G9940J7031a56999L6057L9478F0091Q290
12790F8381A2978a9694C32680a36237k7197d6619j83027R2901q8385B73335o0983
12779B12352p1020b40313C13666b05566N4928j4013F3469B942N982b8514G6996
12767A23118a27002A43075A6515O2322l4568b13331j01161h349K455B10218A884
12755a0372B2290P3059a44115A0092N7969g9265D4653h1907B24373A11970C3933
12743b50842A77994k5058R088i6704c0992A31501m3339J27240Q962D6215J69719
12732B15934P2488g0636f253j56643A23914a73690B07737c07563R6732L9354B2035
12720B00519h632G1187N7627a00991B18464F8341b58343B03004r9139N1624E7525
$$ plain form
12708 -157362 -497310 -56612 -107366 427108 -259044 -210072 -340210 111818 51607 211899
12698 211899 125211 -140506 194588 221712 -28298 63076 106550 -144520 57789 -56180 125500
12686 22136 158449 -205686 -11031 -45377 266785 -73444 235635 36487 108001 79645 61530
12675 61530 -268989 -239632 -60036 224767 9157 231554 93980 -50688 76612 -24449 -8053
12663 -118534 -102951 19890 -136215 263841 -38875 -489662 144856 72407 -212714 381379
12652 -5950 -154467 174133 -80271 -159913 -7710 103586 -16685 212223 128200 504155 253842
12641 253842 177888 -208203 120394 -107656 -78056 170606 66429 80370 46906 120028 -137341
12629 -206387 224532 32200 157435 -198254 84236 126295 142689 77599 -144623 -42934 195712
$$ packed form
12708a57362l39948e6612n0754D27108b59044M8972j30138A11818E1607J60292
12698B11899q6688a40506A94588K7124b8298F3076M3474a44520E7789e6180A25500
12686B2136J36313b05686a1031l4346B66785g3444B35635C6487P1514k8356j8115
12675F1530b68989K9357f0036B24767I157K22397I3980e0688G6612b4449h053
12663a18534J5583A9890a36215B63841c8875m50787A44856G2407b12714C81379
12652e950j48517A74133h0271p9642g710A03586a6685B12223q4023L75955k50313
12641B53842p5954b08203A20394a07656K9600A70606F6429J3941l3464P3122a37341
12629b06387B24532C2200J25235a98254H4236M2059J6394o5090a44623d2934A95712
$$ plain form
12617 -2846 -151817 101130 458585 13149 331404 192772 347072 296275 4550 244440 103101
12605 -135187 324783 282053 -8378 92303 216003 34717 309628 204587 12326 -25586 -45379
12594 -45379 41974 -68458 -27662 167175 -125061 49189 -13046 38292 201677 -167492 44919
12582 246874 39524 -29005 -66383 -117480 -20112 239087 42100 -213416 -76317 221052 -77926
12570 115940 -144730 223407 -277306 241719 -37255 83404 110631 25211 84571 -103034
12559 -234098 -95689 295599 -259250 176052 -128654 345637 -348061 98722 -42712 435725
12548 -90678 -84082 -90780 47753 87736 -118009 -41438 62522 -51245 60510 123412 -3237 82682
12535 173029 75201 178376 -82757 -41290 -162678 140117 183199 31882 139212 -356552
$$ packed form
12617b846j48971A01130L57455A3149L18255j38632J54300n0797D550K39890A03101
12605a35187C24783m2730h378I2303J23700C4717K74911j05041A2326b5586j9793
12594d5379D1974f8458b7662A67175a25061D9189a3046C8292J63385a67492D4919
12582B46874C9524b9005l7378n1097b0112B39087D2100b13416g6317B21052g7926
12570A15940a44730B23407b77306B41719c7255H3404K7227B5211N9360a03034
12559b34098i5689B95599b59250A76052a28654C45637c48061I8722d2712D35725
12548i0678O596o698D7753L9983a18009d1438F2522e1245F0510O2902c237H2682
12535A73029G5201J03175h2757d1290j21388A40117M3082C1882J07330c56552
$$ plain form
12524 589209 -75750 87432 -95871 345747 -55607 52742 -77881 64624 16286 15408 30423 29970
12512 29970 -153640 -258142 -218657 124760 -29651 208671 191920 108322 193399 38229 -190237
12500 40209 120801 42297 12725 76543 -287016 -64650 70142 -306873 83523 437449 255558
12489 255558 63488 -174209 208220 -329043 61411 -7946 -21722 -90483 351593 -83582 75011
12477 32175 -146383 -124428 44215 205411 -224935 71007 216916 -543954 -88890 -260212
12467 -260212 41448 8616 80644 56603 102377 57441 21347 30378 272092 396585 -153599
12455 -95383 -82434 -45242 -402107 170243 74074 -78650 80673 166909 -146639 14598 -5929
12443 227071 -68626 9653 132839 135813 237804 130673 263412 -48979 212726 -69949 -108956
$$ packed form
12524E89209g5750H7432i5871C45747e5607E2742g7881F4624A6286q78J5015m53
12512B9970a53640j04502L9485A24760b9651B08671j6751q3598Q5077C8229a90237
12500D0209Q0592D2297A2725O3818b87016f4650G0142c06873H3523L53926j81891
12489B55558F3488a74209B08220c29043F1411g946j3776o8761C51593h3582G5011
12477C2175a46383K1955D4215J61196b24935G1007J45909e43954h8890j71322
12467b60212D1448H616P2028k4041M5774m4936B1347R031K41714J24493a53599
12455i5383J2949L7192l56865A70243G4074g8650H0673Q6236a46639A4598e929
12443B27071f8626I653J23186K974J01991j07131J32739d8979B12726f9949l9007
$$ plain form
12432 -108956 -44911 -233145 -144170 -70068 -22733 39555 15900 36238 231369 -387264 -8540
12420 124498 220348 -80846 -150284 176533 52251 414027 71219 -37379 56030 110692 -231781
12408 8810 198068 75141 -175406 -81140 158827 -126702 125254 -241964 -75364 129082
12397 -112186 -295571 102032 -23627 -55559 -440779 326290 77117 135779 37110 168110
12387 168110 -155716 35732 76597 53538 -75768 -291346 -177222 137556 91412 87633 43472
12375 -109639 241429 173513 -79488 -14480 191335 281042 -518442 -56305 92777 -137786 -198472
12364 -198472 79803 -10271 8258 126601 -86045 60830 -150861 -361873 10869 175039 140119
12353 140119 123364 160750 1732 -151908 -27444 35963 -104152 188096 -47664 744 -9002 -52834
$$ packed form
12432a08956d4911j88234Q8975g0068b2733C9555A5900K0338J95131c87264h540
12420A24498R5850h0846o9438A76533E2251L61776G1219c7379E6030N4662b31781
12408H810J89258G5141a75406h1140A58827a26702A25254b41964g5364A29082
12397a12186j83385A02032b3627l1932l85220C26290G7117N8662C7110J31000
12387A68110a55716C5732M0865k3059g5768k15578J14124A37556m6144l779D3472
12375a09639B41429o7916g9488a4480A91335Q9707e18442e6305I2777a37786o0686
12364a98472G9803a0271H258J18343h6045F0830a50861k11012A0869J64170l4920
12353A40119j6755L7386A732a51908b7444C5963a04152A88096d7664G44i002m3832
$$ plain form
12341 -52834 -25155 137870 -54645 338319 -151357 -116463 167855 -101796 27482 24130 281048
12330 281048 -185410 5346 202552 -67723 38251 91780 -85570 -25944 49556 -172913 -9244
12318 -125571 38908 517279 47043 -284246 335468 -295165 -21466 -146973 -236001 -134927
12308 -134927 -348602 -148323 -115343 35948 11392 -206709 119734 -182745 -174656 107544
12297 13465 159803 336377 179246 338002 -101300 60411 -65994 148227 -11019 -109462
12287 -109462 -76042 -159552 -35492 -123418 142606 47792 6404 -12179 106824 78674 325717
12276 325717 -18341 -87891 120234 -40154 -255172 -58935 15299 99577 190429 -64078 -212114
12265 -212114 -19749 21925 23031 257590 -25270 -249614 161117 -7002 -210617 96265 409512
$$ packed form
12341e2834b5155A37870e4645C38319a51357L4894A67855a01796B7482l352K56918
12330B81048a85410E346J97206f7723C8251N3529h5570b5944D9556a72913i244
12318a25571C8908M78371D7043b84246C35468b95165b1466j25507q9028J01074
12308a34927k13675a48323L2980C5948A1392b06709A19734a82745Q089A07544
12297A3465J46338J76574j57131J58756a01300F0411f5994A48227a1019r8443
12287a09462L3420q3510c5492q7926A42606D7792F404a2179A06824k8150K47043
12276C25717a8341o9550A20234d0154k15018e8935A5299Q4278R0852f4078j48036
12265b12114a9749B1925J106K34559b5270k24344A61117g002k03615I6265L13247
$$ plain form
12254 409512 7537 39093 179008 149642 148176 332609 -112740 209572 67729 -387597 109611
12242 479093 100747 172798 -125623 -112897 242935 293140 -29271 -143263 9966 -7240 15651
12230 323160 271905 117901 -48182 -146098 318883 193391 318039 12968 -134977 -26333
12219 29494 -155415 90020 121915 -66667 189265 96406 40834 203614 -26951 312225 -73060
12207 241121 431569 346941 333584 -15955 64744 -23357 -100112 217722 -77033 197560 -9032
12195 151494 -81252 -28909 405708 -185742 -47225 -118669 190275 297588 -165167 157535
12184 6686 195386 180330 157361 176576 -179351 369638 -214091 23362 139592 115969 3518
12172 104366 97343 -42467 191322 205970 -57795 315437 183521 255415 -195254 -64224 313401
$$ packed form
12254D09512G537L1556J39915k9366j466J84433a12740B09572F7729c87597A09611
12242D79093A00747P2051a25623J2726B42935N0205b9271j13992I966g240A5651
12230C23160n1255A17901d8182r7916C18883j25492J24648A2968a34977b6333
12219B9494a55415I0020L1895f6667A89265r2859D0834J62780b6951C12225g3060
12207B41121J90448q4628j3357a5955F4744b3357p6755B17722g7033A97560i032
12195A51494h1252b8909D05708a85742d7225p1444A90275J07313a65167A57535
12184F686J88700j5056k2969J9215a79351C69638b14091B3362J16230k3623C518
12172A04366p023d2467A91322J4648e7795C15437j31916P1894a95254f4224C13401
$$ plain form
12160 -201822 333475 234985 271836 148736 -151535 55001 58530 229877 -46366 245277 -22571
12148 13114 338413 60175 -220705 -147051 207086 -358068 115831 201918 -99632 -269250
12138 -269250 -88290 -155780 -495332 136037 275720 180201 -272774 -42820 264819 212218
12128 212218 -7391 254926 -87789 -457193 -188936 110523 91134 -213654 184910 271269
12118 271269 172534 130243 -101987 239069 90800 105263 426805 183296 -264146 104474
12107 241069 -108688 -30594 -190430 -125901 163013 26233 -7732 143867 -111389 -6425 -293990
12096 -293990 26082 -138873 7903 64108 -109424 -258693 -34231 -146811 -183542 40031 22941
12085 22941 -47955 116227 -70648 -28307 190568 -95349 -165950 164983 173533 193864 31470
$$ packed form
12160b01822C33475r8490L6851j23100a51535E5001L529J71347d6366B45277b2571
12148A3114L25299F0175b20705P3654B07086c58068A15831Q6087i9632j69618
12138b69250h8290o7490l39552A36037J39683r5519b72774d2820B64819n2601
12128B12218g391B54926h7789l69404a88936A10523j9389b13654A84910Q6359
12118B71269r8735m2291a01987B39069I0800J4463L21542A83296b64146A04474
12107B41069a08688c0594j59836O4529A63013B6233g732A43867a11389f425k87565
12096b93990B6082a38873G903N6205a09424j49269c4231j12580l6731D0031j7090
12085B2941d7955A16227g0648b8307A90568i5349p0601A64983Q550K0331C1470
$$ plain form
12073 313886 196431 365770 58200 -229651 31115 -135987 -1545 275544 -320270 110091
12062 438828 17316 209875 -117801 62646 -222430 -163999 149444 43933 157404 243885
12052 243885 66054 536006 324212 1000170 63895 354643 96982 192570 118547 164538 116919
12041 116919 -66028 -192893 230791 19407 -235889 144962 -27337 197582 171505 -246349
12030 31304 -135219 -26610 -242587 15058 -2145 365005 156836 137582 -161126 -251012 76003
12018 -97755 -12624 44898 -82754 -365574 -24473 -69259 -129965 38134 -164225 44562 165370
12007 165370 157985 96208 -280123 -92505 -235563 -266039 -150678 -194106 13457 -14833 7705
11995 -273794 2103 -374515 -29067 21923 42052 -132335 14317 16030 8993 124570 -66740
$$ packed form
12073C13886j17455J69339E8200b29651C1115a35987a545B75544c20270A10091
12062D38828A7316J92559a17801F2646b22430N8431A49444D3933J13471Q6481
12052B43885F6054M69952k11794O75958F3895K90748I6982R5588p4023M5991m7619
12041A16919f6028j26865B30791A9407b35889A44962b7337A97582k6077b46349
12030C1304a35219b6610k15977A5058b145C65005A56836j9254a61126q9886G6003
12018i7755a2624D4898h2754k82820b4473m4786o0706C8134a64225D4562J20808
12007A65370p385o1777b80123i2505j43058l0476J15361m3428A3457a4833G705
11995b73794B103c74515b9067B1923K0129a32335A4317J713p037J15577f6740
$$ plain form
11983 -161131 -187667 -118391 -238123 -17841 -285153 -358430 143344 101694 -271689 271410
11972 -268749 -297696 17688 157759 77581 23420 392167 -120477 -5588 62479 -167954 -8844
11960 109532 -292920 126461 116880 -226737 137440 -109563 209902 -179251 15912 -253065
11949 -246194 -56090 96127 -201632 209898 -48661 -64628 -34057 126041 -17331 3851 90338
11938 90338 205849 -122400 -142071 -41076 94002 -73737 40860 -138691 92661 -58475 -109604
11927 -109604 170175 59120 -104771 37952 47306 -171480 154344 -20498 -319546 -130042
11916 44154 146129 -163392 -9282 99805 -19059 -36184 -77427 317050 -127227 34844 -164811
11904 -169929 271078 -90432 -37191 34011 -86741 -142559 220282 -24865 -146656 179097 92732
$$ packed form
11983a61131k6536O9276j19732a7841k67312p3277A43344m1650b71689B71410
11972b68749k8947A7688J40071G7581B3420L68747a20477e588F2479a67954h844
11960A09532b92920A26461r581b26737A37440a09563B09902a79251A5912b53065
11949b46194e6090I6127b01632B09898d8661j5967L0571A26041a7331C851Q6487
11938I0338J15511a22400j9671d1076I4002g3737D0860a38691I2661e8475n1129
11927a09604A70175E9120a04771C7952R354a71480A54344b0498k99048a30042
11916D4154J01975a63392i282I9805a9059j7125m1243C17050a27227C4844a64811
11904a69929B71078i0432c7191C4011h6741n5818B20282b4865j21791A79097q6365
$$ plain form
11893 92732 141229 -20303 -31725 -150081 140714 34205 -98717 -96120 262035 251784 -143113
11881 -215955 376719 -252575 167982 -330197 408414 -8707 -67240 -135861 -208452 -39332 68269
11869 232618 189815 67897 -237137 -24546 95220 -3906 112222 -243920 154959 24665 -55415
11857 130650 102542 347173 -198098 -143868 154555 78971 23525 196025 -269886 -162303
11847 -162303 -11549 -132650 -384702 -127590 -263425 182064 -223615 -198677 -277001 83018
11836 73119 108526 -342855 271234 -204104 28934 -155215 148845 183632 -118669 139619
11825 63078 -79174 91246 -131345 211279 325530 -191959 33870 21714 113003 -297082 -43442
11813 96298 -55965 -37077 -31021 210745 8546 -2562 -131262 295605 205073 -82916 40741 137500
$$ packed form
11893I2732M8497b0303j1422j18356A40714C4205i8717K597B62035j0251a43113
11881b15955C76719b52575A67982c30197D08414h707n8533o8621p2591c9332F8269
11869B32618m2803F7897b37137b4546I5220c906A12222b43920A54959B4665e5415
11857A30650k8108K44631a98098N4230A54555p5584B3525J72500b69886J07583
11847a62303a1549j21101k52052a27590j35835A82064b23615K4938p8324H3018
11836G3119L5407c42855B71234b04104B8934a55215A48845L4787a18669A39619
11825F3078g9174I1246a31345B11279J14251a91959C3870j2156R1289b97082d3442
11813I6298e5965J8888O056B10745H546b562j28700B95605r0532h2916D0741R6759
$$ plain form
11801 137500 105550 128727 -146305 170334 -187152 -117621 -95286 -71640 76670 -80068 124083
11789 -91192 -105212 110900 191491 -173547 21338 -246657 120562 47727 182455 18217 -21537
11777 -204956 138957 148488 65870 -182524 -75807 75306 -182973 -84826 -236987 -433967 -177533
11765 -1556 -231589 -258868 63486 71193 15508 -195241 26252 211881 10564 217380 -172068
11753 -117128 -148582 -296117 122269 44004 18104 130641 -467768 64734 -31250 9077 -109377
11741 -174447 -19517 -15513 84380 -234931 -99274 -45559 208341 15853 -164294 301296 107448
11729 -154236 395838 -307586 133694 -260165 -173447 -25513 -88811 -216404 -189336 101881
11718 -58460 -66361 -170147 -194873 -2208 -140882 -26348 69662 19677 288685 384484 193212
$$ packed form
11801A37500l1950K3177a46305A70334a87152O9531K2335K3646G6670h0068A24083
11789i1192j4020A10900Q0591a73547B1338b46657A20562D7727J34728A8217b1537
11777b04956A38957R531F5870a82524g5807G5306a82973h4826j52161j96980a77533
11765a556k30033k7279F3486P707A5508a95241B6252J85629A0564K06816a72068
11753a17128l1454j47535A22269D4004A8104J12537d67768F4734c1250I077a09377
11741a74447a9517M004H4380b34931i9274d5559B08341A5853a64294C01296A07448
11729a54236C95838c07586A33694b60165Q6718b5513o3298j27593K7068A01881
11718e8460p901j03786k4726b208j38674b6348F9662A9677K69008R5799j91272
$$ plain form
11707 193212 111809 -434907 122303 91023 151933 51849 -34967 197770 -374522 -53243 213699
11695 -125346 -203528 -71110 24632 -131168 -200774 -112354 177466 -43083 23876 -231686 -303014
11684 -303014 -35568 -116534 -28060 241034 21244 -293043 37678 -170116 34592 -163500 -312831
11673 -312831 -88503 37210 57896 -105830 -17091 119045 -44945 92566 -25627 227851 -81573
11661 210148 -303365 160157 -181617 73603 87654 -128021 10026 -170940 37269 -100456
11650 -20197 176319 -143582 -44596 -624618 -174127 -144639 185783 76808 35771 -100786
11639 96048 -118 267259 111642 -77070 66780 50432 -78355 75377 81057 128098 166898 -296451
11626 223113 -65082 -304745 19097 92094 340124 -117710 -188839 129472 -25166 -337903
$$ packed form
11707A93212q1403d34907A22303l1280O0910E1849c4967A97770c74522e3243B13699
11695a25346p8182g1110B4632a31168o9606Q8420A77466d3083B3876b31686p1328
11684c03014c5568q0966b8060B41034B1244b93043C7678a70116C4592a63500j49331
11673c12831h8503C7210K0686a05830a7091A19045d4945I2566b5627B27851h1573
11661B10148c03365A60157a81617G3603J4051a28021A0026a70940C7269a00456
11650b0197A76319a43582d4596n80022a74127K9488A85783G6808C5771a00786
11639I6048a18B67259A11642g7070F6780j6348g8355G5377N680M7041L8800b96451
11626B23113f5082k39663A9097P2997K48030a17710p1129A29472b5166l12737
$$ plain form
11616 -337903 151329 -273591 -175198 -243346 18703 11566 -135395 -106237 21238 27336 -69857
11604 -21060 95730 -123415 53222 -134145 -12698 118975 3168 -5398 -33814 -91191 -80375
11593 -80375 250201 44749 -233581 113960 190469 -155047 13320 292767 -61194 -25436 -307918
11582 -307918 -354199 3693 -151945 16413 -43740 -187269 279724 -139458 123640 -77768 208492
11570 52813 161171 37887 104882 32099 15728 233089 -44794 359723 143610 -324935 -440146
11559 -440146 30126 84486 129236 87663 -95047 179634 173557 -171526 -84288 -51278 -53490
11548 -53490 -57585 211871 79933 335047 -355849 -91572 403681 -59824 -108699 253904 214143
11537 214143 -30697 -107524 106271 41671 104771 240453 -127120 128646 207346 146795 -56734
$$ packed form
11616c37903A51329b73591R8393o8148A8703p137a35395K9158B1238O098f9857
11604b1060I5730a23415E3222a34145a2698A18975C168e398k8416n7377J0816
11593h0375B50201D4749b33581A13960P6509a55047A3320K79447f1194b5436k82482
11582c07918m6281C693a51945A6413d3740j43529B79724a39458A23640g7768B08492
11570E2813J08358C7887O6995C2099A5728K17361d4794C59723A43610c24935j15211
11559d40146C0126N4360M4750m1573i5047A79634o077a71526h4288L3010k212
11548e3490m095B11871G9933K55114c55849i1572D03681e9824m8875B53904l9761
11537B14143c0697p6827A06271D1671O3100J35682a27120A28646P8700o0551e6734
$$ plain form
11525 -35657 -22394 81914 -26573 -165735 132172 -34224 -151704 -91080 163740 -298633 -380322
11514 -380322 307433 -161928 -227822 29016 27105 95123 221702 277499 216596 -2200 -29330
11503 -29330 12635 -282467 -112634 132782 295562 -210629 -120874 -63368 -138222 128378
11492 -381670 -49666 347526 159244 134517 7855 219943 45179 124388 212823 447927 28103
11480 148400 -92197 162291 235610 289760 -19949 165371 -101362 90322 -19208 -12092 256552
11468 299499 110194 -47573 -93894 106474 146860 -22581 -206631 53635 -188360 126210
11457 -18796 200104 165414 -84505 -336459 -105064 117257 -16884 248996 334110 -30405 128049
11445 194835 140988 -1956 50166 244201 -218725 38376 45564 -119911 35186 194163 453441
$$ packed form
11525c5657J3263H1914b6573j39162A32172c4224j17480O0624A63740b98633q1689
11514c80322C07433a61928o5894B9016j911O8018J26579N5797o0903b200k7130
11503b9330A2635b82467a12634A32782J62780b10629Q9755N7506p4854A28378
11492c81670d9666C47526A59244k4727G855K12088D5179P9209Q8435K35104B8103
11480A48400i2197A62291P3319N4150a9949A65371a01362I0322a9208P116B56552
11468B99499A10194d7573m6321A06474M0386b2581j84050E3635a88360A26210
11457a8796B00104l4690h4505k51954a05064A17257a6884B48996Q5114c0405A28049
11445A94835n3847a956E0166J94035b18725C8376P188a19911C5186J58977K59278
$$ plain form
11434 453441 13353 -475971 219593 -90585 240753 91289 -95446 329165 242648 172651 75673
11422 64675 93308 -117650 -278214 116634 -299581 -86689 27502 10756 -152129 120184
11411 81302 -9462 94598 -321187 -84948 -39245 300891 16078 69292 -137571 59392 46691
11400 46691 244426 186278 44879 208936 43918 97897 -42984 -177780 75304 99801 -62814
11388 -111333 142765 -246985 138068 7504 51521 -113578 460107 -62536 388427 -100075
11377 -82719 -128354 88569 -56723 12436 75534 -14512 47308 -38350 98875 -16475 -121841
11366 -121841 -249341 -85015 -52685 -86323 -227834 127536 -297365 119127 -82309 225174
11355 -104201 -98775 94384 154600 187941 -251917 -81598 91320 -387855 56742 -7118 -69003
$$ packed form
11434D53441A3353d75971B19593i0585B40753I1289i5446C29165q6517o9997G5673
11422F4675K8633a17650j60564A16634b99581h6689B7502A0756a52129A20184
11411H1302i462I4598c21187h4948c9245C00891A6078N3214a37571E9392j2701
11400D6691J97735n8148D4879J64057D3918N3979d2984j34796G5304K4497f2814
11388a11333A42765b46985A38068G504M4017a13578D60107f2536C88427a00075
11377h2719m5635H8569e6723A2436O3098a4512D7308c8350I8875a6475j05366
11366a21841j27500h5015L2330l3638j41511A27536b97365A19127h2309B25174
11355a04201N426I4384O0216L3341b51917h1598I1320c87855E6742g118o1885
$$ plain form
11344 -69003 -219497 -209819 -20619 -70400 -100271 -35366 -109632 -123201 303035 -155038 57829
11332 -212603 -177506 -162826 -144130 26107 -51866 -113455 129095 144512 73579 132617 150115
11321 150115 -166758 -202129 76233 -180336 184874 -50655 454887 -157515 -146491 -14650
11310 101621 35024 -6825 48298 -125889 -104130 88728 -191318 20119 -169227 207787 -202656
11298 -175701 -251367 -46281 163149 121432 -189983 -33910 107284 379096 -203865 241013
11287 -112558 -261980 -101053 -369248 -50421 -40932 -164561 -157874 82329 49727 162440 170110
11276 170110 -105444 -148341 -135978 216073 224862 -104664 24254 56937 -51200 -16183 -420862
11265 -420862 110288 -280522 -405102 -233591 96790 -173590 -122217 100165 -3272 -140287
$$ packed form
11344f9003j50494R678b0619m9781k9871c5366p4266j3569C03035a55038E7829
11332b12603L5097J4680J8696B6107e1866o1589A29095J5417p0933N9038J7498
11321A50115a66758l5371G6233a80336A84874e0655D54887a57515J1024a4650
11310A01621C5024f825D8298a25889K1759H8728a91318B0119a69227B07787b02656
11298a75701p5666d6281A63149m1717a89983c3910A07284K71812b03865B41013
11287a12558j49422a01053k68195e0421R489j23629O687H2329l2602J12713P670
11276A70110a05444m2897J2363B16073Q789a04664B4254L2683e1200a6183m04679
11265d20862A10288b80522j24580J71511I6790a73590N1373A00165c272j37015
$$ plain form
11255 -140287 -78811 33009 -92610 -254206 -13703 -55506 -63681 127521 -263593 -17039 -166755
11244 -166755 -54097 27823 -134613 267238 -178878 106531 154182 124269 248377 -75017
11233 41644 73839 50512 -94561 345500 91374 -73076 -41372 -341831 -119236 -136883 -132726
11222 -132726 -202064 142465 9820 -197870 50237 -211310 -307232 64843 -91164 -135174 70693
11210 -321413 -346262 -165920 -208785 331529 314800 -42097 -173022 58818 -49670 170625 151390
11199 151390 114488 -100824 3829 55511 -28334 -304880 -375907 1230 -27321 15480 15638 -291975
11186 -113440 -160479 76330 117049 -191291 -91763 -181758 -123523 -55175 353561 -151521 81495
11174 159638 -199228 87998 34043 41179 -207962 -177745 171330 -55053 -202 -203993 -413449
$$ packed form
11255a40287O1476C3009i2610j61596a3703m1803q175A27521b63593a7039j49716
11244a66755e4097B7823a34613B67238a78878A06531M7651k9913J24108g5017
11233D1644L2195k3327i4561C45500I1374g3076L1704l00459a19236j7647M157
11222a32726o9338A42465I820a97870E0237b11310r5922F4843i1164m4010G0693
11210c21413k4849a65920m2865C31529j6729d2097j30925E8818d9670A70625j9235
11199A51390l6902a00824C829N1682b8334k76546p1027A230b7321A5480J58b91975
11186a13440m7039G6330M0719a91291i1763q9995N8235e5175C53561a51521H1495
11174A59638a99228H7998C4043P136b07962L0217A71330e5053b02k03791k09456
$$ plain form
11163 -413449 91215 -155737 -175610 -56257 254136 -101476 215951 63456 79919 -264198
11152 -245596 118562 -99092 273166 274720 -48021 -212663 -140825 20743 183807 -62432 283983
11140 -99694 -15858 -54791 -144759 -152159 -142094 -146379 -371978 -91779 -182983 -136664 209533 40180
11127 -444948 -205988 208650 -284250 344691 -177770 -255426 -109413 353507 -87772 -239291
11117 -239291 168700 261779 77176 126591 -59924 132403 400625 43510 295572 72991 -44820
11105 293253 -219371 408579 167850 -20115 34173 290034 -57057 -81705 -204804 -106211
11095 -106211 338507 -42533 66594 -149073 -234716 350427 204709 297498 84751 64785 79519
11084 79519 132779 -64440 261195 -36366 -37374 187470 113814 272788 -244111 -88946 -69891
$$ packed form
11163d13449I1215a55737j9873e6257B54136a01476B15951F3456J6463b64198
11152b45596A18562i9092B73166J554d8021j64642P1838B0743J63064f2432B83983
11140i9694a5858l8933q9968p400J0065m285k25599i1779r1204M6319B09533D0180
11127d44948b05988B08650b84250C44691a77770p7656a09413C53507h7772j51519
11117b39291A68700R3079G7176M9415e9924A32403K68222D3510K52062G2991d4820
11105B93253b19371D08579A67850b0115C4173K55861e7057k4648j23099R8593
11095a06211C38507d2533F6594a49073q5643C50427j45718R2789H4751j9966J4734
11084G9519N3260f4440B61195c6366j008A87470p3656J58974b44111h8946J9055
$$ plain form
11073 -69891 6164 60297 212457 168455 109721 243271 296686 -185465 102895 198005 308507
11062 308507 104782 131860 315053 359686 49346 152393 566252 108003 428282 219084
11052 219084 552572 85174 224480 190982 328337 548497 377668 60585 405604 543435
11042 543435 413098 318993 801218 505961 244318 449098 407473 331233 294286 653917
11032 653917 626526 544197 488928 604310 747379 637785 804658 782080 621563 711489
11022 711489 724186 731182 536463 717130 379510 798321 859614 615842 343451 721085
11012 721085 427347 673841 553321 309383 422738 322973 631479 310585 510946 834514
11002 834514 362287 525604 -58035 377683 621624 515417 581375 271139 587945 698960
$$ packed form
11073f9891F164N4133J52160m4002n8734J33550N3415a85465A02895R5110J10502
11062C08507A04782K7078J83193M4633D9346J03047M13859A08003L20279k09198
11052B19084L33488H5174J39306l3498J37355K20160j70829F0585L45019J37831
11042E43435j30337r4105M82225k95257B44318K04780m1625p6240l6947L59631
11032F53917k7391q2329n5269J15382J43069j09594J66873k2578j60517Q9926
11022G11489J2697O996j94719J80667l37620M18811O1293k43772k72391L77634
11012G21085k93738K46494j20520k43938J13355r9765L08506C10585K00361L23568
11002H34514C62287J63317e8035C77683K43941j06207O5958B71139L16806J11015
$$ plain form
10992 698960 325060 127548 446269 381820 502925 919137 777561 671460 539437 699129
10982 699129 734255 391942 418270 542624 620594 591457 506535 512864 575083 583760 654503
10971 654503 779163 1166755 829701 806307 1205223 1264112 1147921 1223565 1497087 1746361
10961 1746361 1673774 1777545 2019672 2006836 2316878 2679983 2640606 2449167 2407807 2268186
10951 2268186 1904608 1674432 1563888 1364211 1317212 1100513 1081604 1361642 1251522 1143111
10941 1143111 1025043 918971 1131785 278779 704681 809911 553260 200438 431678
10932 431678 745355 319780 180337 35026 3319 281211 192272 56333 15736 154805 243296
10921 243296 -385393 -1712 122902 180258 -174242 276155 10746 234101 446167 374332
$$ packed form
10992F98960C25060A27548L18721o4449J21105M16212j41576j06101j32023J59692
10982F99129L5126l42313K6328J24354P7970k9137q4922O329O2219Q677P0743
10971F54503J24660L87592l37054k3394L98916N8889j16191P5644K73522K49274
10961A746361p2587J03771K42127j2836L10042L63105l9377j91439m1360j39621
10951B268186l63578k30176j10544j99677m6999k16699j8909K80038j10120j08411
10941A143111j18068j06072K12814B78779M25902J05230k56651B00438K31240
10932D31678L13677C19780j39443C5026C319K77892q8939E6333A5736J39069Q8491
10921B43296c85393a712A22902N7356a74242B76155A0746K23355K12066p1835
$$ plain form
10911 374332 58864 15053 -67028 173639 404190 -233702 125101 166731 -190173 58772
10900 -9417 220458 140964 -137993 69471 315987 -170322 -218520 69811 40018 -14858 -86634
10889 -86634 63003 -36183 -153292 100379 418991 -54366 -54078 -161583 -59227 -47878 -296454
10878 -296454 -97208 -152997 -245704 -59992 -157211 -127611 -153662 -479 35630 -112913 352692
10866 28593 -98184 -305974 -173567 -83668 -365925 -73875 10670 253002 90339 182330 -42301
10854 160550 67682 -287759 -210777 -3313 362431 273367 -66915 -50855 34932 55588 -231161
10842 -61225 -106203 -108210 6215 -241582 -213334 198543 -252368 -148986 -140657 79111 -161599
10830 -290525 -129387 4539 -204244 63962 218647 -263494 -34948 -151035 -201721 27743 10001
$$ packed form
10911C74332E8864A5053f7028A73639K30551b33702A25101M1630a90173E8772
10900i417B20458p9494a37993F9471K46516a70322m8198F9811k9793a4858p1776
10889h6634F3003c6183j17109A00379L18612e4366K88j07505e9227J1349k48576
10878b96454i7208n5789r2707e9992r7219K9600k6051d79C5630a12913C52692
10866B8593i8184k07790J32407h3668k82257g3875A0670K42332I0339R1991d2301
10854A60550F7682b87759P6982c313C62431q9064f6915J6060C4932K0656b31161
10842f1225m4978k007F215b41582K8248A98543b52368J03382Q329G9111a61599
10830b90525a29387D539b04244F3962J54685b63494c4948j16087n0686B7743A0001
$$ plain form
10818 60468 -180829 43587 -163187 -364048 29455 26905 -204913 -1974 -162861 -108206 -218649
10807 -218649 60723 -61215 -247405 -213611 120677 -556867 43980 -171799 109224 136996
10797 136996 -67838 -214116 184870 -89292 66503 -183204 -27039 65012 -85648 -103203 -69328
10786 -69328 7485 27634 -26963 23540 -142426 -170512 -109957 -219959 -75438 77519 -138071
10774 122734 -69882 34530 -174513 38520 -17938 34197 60050 76020 -182084 24769 52635
10763 52635 -55960 -104539 7841 20706 -173817 -11959 -170164 69527 46598 -44280 58133
10751 410924 -113228 91425 -40956 218323 942 -38736 23591 -260726 -129390 114023 -304134
10739 -44009 299927 -17388 167712 -126770 154838 69110 -192178 -191458 -68030 234106 -276218
$$ packed form
10818F0468a80829D3587a63187k00861B9455k550b04913a974j60887N4655j10443
10807b18649F0723f1215j86190L3794A20677e56867D3980a71799A09224K7772
10797A36996f7838j46278A84870h9292F6503a83204b7039F5012h5648j7555L3875
10786f9328G485K0149b6963B3540a42426k8086O0555j10002g5438G7519a38071
10774A22734f9882C4530a74513C8520a7938C4197K5853J5970a82084B4769K7866
10763E2635e5960m8579G841J2865a73817a1959j58205F9527k2929d4280E8133
10751D10924a13228I1425d0956B18323I42c8736B3591b60726a29390A14023c04134
10739d4009B99927a7388A67712a26770A54838F9110a92178P20f8030B34106b76218
$$ plain form
10727 93233 246697 -149795 48499 212012 -154345 -168309 -213063 85522 48934 -261421 -46728
10715 -372703 -38831 -127560 17823 -63236 89817 -96245 127950 -63126 -142941 34738 -226319
10703 36428 17746 134289 109365 -161154 -236437 294274 -277161 -33739 -3595 117127 81698
10692 81698 22957 -168948 -71605 -318626 -99357 -356958 114819 -105967 46730 -46513 -471327
10681 -471327 -503038 -122367 -128327 -96293 111505 16975 140054 -148330 -254118 -337320 46494
10669 -96451 -9353 136543 131339 669 -59955 173165 -406407 -92019 6107 -92334 18964 -180846
10656 -89606 -30596 3407 83077 106565 -1938 22321 123660 -57808 -71704 -301276 -254662 73640
10643 -6494 76073 -148849 -30673 1181 126778 -16550 -51396 -179008 -110967 -38895 -41153 -274785
$$ packed form
10727I3233J53464a49795D8499J63513a54345j3964m4754H5522l6588b61421d6728
10715c72703c8831q8729A7823f3236H9817i6245A27950f3126p9815C4738b26319
10703C6428A7746J16543k4924a61154p5283B94274b77161c3739c595A17127l5429
10692H1698B2957a68948g1605k47021i9357k57601A14819a05967D6730d6513m24814
10681d71327l1711a22367n960L2034A11505A6975J23079a48330j05788q3202D6494
10669i6451i353A36543n204F69e9955A73165d06407i2019F107i2334A8964a80846
10656h9606c0596C407P9670K3488a938B2321J01339e7808j3896k29572M6614G3640
10643f494G6073a48849c0673A181J25597a6550l4846j27612O8041c8895k258k33632
$$ plain form
10631 -274785 53570 -172091 -12812 -297999 169240 124750 -106486 -88718 -51515 -20725 -486272
10620 -486272 -33504 336604 -154927 -8731 -192840 -139497 -18838 -159880 -131992 15485 -296286
10608 -38546 183560 -93934 -51028 -51386 -313207 -283612 -174517 -136177 77090 -109489 -279706
10597 -279706 83828 -191420 -76519 -364922 397000 44439 184602 -70745 -117874 -108747 267407
10585 -201486 -172783 -113899 160640 -194787 118196 89231 136233 -120814 137298 -233838
10574 -86367 215916 -50319 -18622 -207810 3168 -463235 -113906 51388 -207283 -36325 -286668
10563 -286668 -41072 -204397 -310589 -74028 -393128 -119828 135608 103121 -234239 -88429
10552 -180470 -230045 -22122 -74769 28091 27612 66759 23982 -239083 101241 -93192 -318865
$$ packed form
10631b74785E3570a72091a2812k85187A69240m4490a06486J7768L7203b0725m65547
10620d86272c3504C36604a54927h731j84109N3343a8838j41042K7888A5485b96286
10608c8546A83560i3934M2906l58k61821K9595J09095L8340G7090a09489j70217
10597b79706H3828a91420g6519k88403C97000D4439J40163g0745m7129R127B67407
10585b01486K8703N8884A60640a94787A18196k8965M7002a20814A37298b33838
10574h6367B15916e0319a8622j89188C168d63235a13906E1388b07283c6325k50343
10563b86668d1072j63325j06192g4028l19100a19828A35608l2487b34239h8429
10552a80470m9575b2122n2647B8091m79L9147B3982b39083A01241i3192k25673
$$ plain form
10541 -318865 81265 -101934 -211961 -67890 -56654 -67197 168286 -320336 7755 247555 -109363
10529 9380 -52955 28238 -32963 75054 -46024 -98603 16269 -16249 81963 72116 -159815 -33350
10516 -426809 324223 88825 -271180 -148318 14363 -113217 74671 -2183 -280552 73340 -37378
10504 31213 35453 -183613 -130000 -13284 139334 -378530 272445 6681 38298 37188 294308
10493 294308 -226184 380834 -84355 168689 -42697 -18494 -289338 -255296 -69537 -225450
10483 -225450 -136617 -70298 20233 173031 -89146 -62602 -96553 169569 96675 -56689 -97654
10472 -97654 30781 -69328 12146 191125 13864 -67493 -247991 -116715 320702 -51879 -230573
10461 -230573 205843 71556 -96760 152392 42869 97485 156349 118129 -111732 -213996 -129684
$$ packed form
10541c18865H1265a01934j10027f7890J1236j0543A68286c20336G755K39800a09363
10529I380e2955B8238c2963G5054d6024n2579A6269a6249H1963r847a59815c3350
10516d26809C24223H8825b71180J22862A4363a13217G4671b183k78369G3340c7378
10504C1213M240a83613N3613a3284A39334c78530B72445F681L1617j110K57120
10493B94308b26184C80834h4355A68689d2697a8494k70844L4042f9537j55913
10483b25450Q8833O6319B0233J52798h9146K6544l3951A69569p2894e6689m0965
10472i7654C0781f9328A2146J78979A3864f7493j80498a16715C20702e1879j78694
10461b30573B05843G1556i6760A52392D2869N4616N8864l8220a11732j02264Q4312
$$ plain form
10450 -129684 63250 32052 24963 -117766 -403538 -13753 79759 -111699 4207 102125 -9461
10438 -107349 -360444 -48576 26016 40826 20785 247738 207911 -103004 -7313 -211283 -115518
10427 -115518 -662 11979 107344 -68121 515497 -190472 20685 72614 220629 -11450 -103223
10416 -103223 164360 34838 -47497 18360 112881 -144044 -67586 -130888 100814 144864 -213437
10404 -95137 -203948 39349 320418 -49633 -45894 -127759 124606 -48219 -104002 -103110 -419468
10393 -419468 118137 165825 11259 -15705 6573 -571908 284834 -13004 -5256 -26100 -91866
10382 -91866 -53809 -65707 150748 99845 277262 -36692 163510 -263148 255147 108831
10371 -46439 93650 112824 -31933 5476 88942 215462 76331 -24066 77007 193686 192789 323475
$$ packed form
10450a29684F3250l1198p089a17766k85772a3753G9759a11699D207R7918i461
10438a07349k53095d8576B6016J4810k0041K26953l9827a03004g313k03970R5765
10427a15518f62A1979R5365f8121E15497a90472B0685N1929J48015a1450r1773
10416a03223A64360C4838d7497A8360R4521a44044f7586o3302A00814M4050b13437
10404i5137j08811C9349K81069d9633L739q1865A24606d8219n5783Q92l16358
10393d19468A18137M7688A1259a5705F573e71908B84834a3004e256k0844o5766
10382i1866L8057j1898A50748n0903J77417c6692A63510b63148B55147A08831
10371d6439I3650J9174c1933E476Q3466J26520G6331b4066G7007J16679q97J30686
$$ plain form
10359 323475 38226 348699 180531 -262265 168203 316595 245625 332984 339869 333539 32137
10347 172427 368962 307602 64667 133536 94391 -84409 395816 58204 102693 305789 -13435
10335 332761 788117 636604 496911 281576 164497 412136 61891 220286 133903 310161
10325 310161 281949 -235456 293219 135193 184247 248031 229498 80553 146555 -78313 -30890
10313 -9909 117231 -72618 173472 -22835 187427 404946 107769 63287 161554 -132078 59098
10301 -396630 208274 106537 -274168 111082 173988 183340 -133968 57836 319944 -310742
10290 252611 55340 22398 120653 54809 -130645 14173 61302 -178322 120520 276756 -60244
10278 116849 -338294 -93471 -161515 -13723 41607 -102062 -22097 -252206 257725 -225187
$$ packed form
10359C23475C8226L10473j68168b62265A68203J48392p0970Q7359O885o330C2137
10347A72427J96535o1360F4667O8869l9145h4409C95816E8204M4489K03096a3435
10335C32761M55356j51513j39693k15335j17079K47639F1891J58395q6383J76258
10325C10161k8212b35456B93219A35193M9054O3784j8533H0553O6002g8313c0890
10313i909A17231g2618A73472b2835A87427K17519A07769m4482R8267a32078E9098
10301c96630B08274j01737b74168A11082O2906R352a33968E7836K62108c10742
10290B52611E5340B2398R8255E4809a30645A4173M7129a78322A20520J56236f0244
10278A16849c38294i3471o8044a3723D1607a02062b2097k30109B57725b25187
$$ plain form
10267 -251231 -67477 32016 -7742 -220774 -58835 -99961 259563 63099 -86343 -100876 12526
10255 -153616 -264892 29021 293532 59568 53854 256482 70707 238431 387273 -6281 -182474
10244 -182474 -201257 151056 175376 3368 -111814 337774 -30660 -23450 -377908 -171417 -62202
10232 -93917 -27621 -185724 126202 77737 334367 216762 23251 56504 65574 -32280 -401322
10221 -401322 256238 129041 9315 -169073 265437 -70071 -233322 72036 75241 299670 165434
10210 165434 -119447 -425938 8454 -121637 -251087 -121227 88222 -27566 -368788 -203242
10200 -203242 130142 61541 -17961 67961 22724 98415 101281 -122815 -25837 -171772 354922
10188 8505 -212494 29192 -38874 -167670 15273 -480555 -244441 -233877 -9343 17586 -278551
$$ packed form
10267b51231f7477C2016g742k13032e8835m1126B59563F3099h6343j4533A2526
10255a53616j11276B9021K64511E9568n714K02628G0707J67724J48842f281j76193
10244a82474j8783A51056K4320C368a11814C37774c0660P210l54458a71417f2202
10232i3917b7621j58103A26202m8465K56630j17605B3251L3253R070c2280l69042
10221d01322B56238j27197I315a69073B65437g0071j63251G2036L205K24429j34236
10210A65434a19447l06491H454a21637j29450a21227H8222b7566l41222J65546
10200b03242A30142F1541a7961F7961B2724P5691K866a22815b5837j45935C54922
10188H505b12494B9192c8874j28796A5273d80555K36114J0564i343A7586b78551
$$ plain form
10176 7328 -267642 198192 262978 145601 -89437 -201387 20263 -103367 -134022 7686 -23894
10164 -297736 3533 1427 -53592 -201947 -52965 -43700 -39285 -252511 60909 98923 -84502 89905
10151 -404987 -105458 -382510 30532 -102499 -34702 -380417 10216 -114687 -142940 -25156
10140 -433576 -277493 44872 -110167 -106583 -124287 5285 -562754 -103237 58096 -105589 86995
10128 -34498 12220 -245262 98951 114704 -79583 -168590 -243612 -211266 -69553 -249569 -132827
10117 -132827 -329925 63922 31221 203103 -246004 -30026 -357486 -58867 -205325 -79999
10106 137814 -95364 22283 -20678 -150357 -81525 -64168 -170157 346363 -86664 -224312 -19056
10094 -131973 136698 449580 -424943 85489 13150 -1065 -120711 -161473 21826 208221 -241457
$$ packed form
10176G328b67642A98192O4786j17377h9437j11950B0263a03367l0655G686b3894
10164b97736C533A427e3592j48355e2965R265M415k13226F0909L8014h4502H9905
10151d04987a05458k77052C0532a02499c4702l45715A0216a14687k8253b5156
10140d33576J56083D4872a10167L584j7704E285e62754a03237E8096a05589H6995
10128c4498A2220b45262I8951J5753g9583q9007p5022L2346f9553j80016J16742
10117a32827j97098F3922C1221J71882b46004c0026l27460e8867j46458g9999
10106A37814i5364B2283b0678j29679O8832J7357j05989C46363h6664j37648a9056
10094a31973A36698L12882d24943H5489A3150a065j19646m0762B1826J86395b41457
$$ plain form
10082 -102023 -13955 -47042 -366139 -292499 -306877 -68569 2197 231702 146473 -79985 -34706
10070 53336 147753 -286573 -10851 -83942 -179534 -162670 -188173 147968 89046 -75519 -181424
10059 -181424 148659 187198 -128766 -54847 -163644 131989 -38198 -56163 228860 -145827
10048 -280618 -75333 27840 32883 -60256 -135445 15444 -113617 -338296 -235195 261776 64744
10036 -50297 -121650 66868 -137103 -89670 -15063 -88257 -165219 -97639 -115417 -129199 115829
10024 -56173 -136707 -63910 201185 -325867 -162676 -26208 -237450 -154724 -64086 -196147 -87531
10012 -159284 -209670 -243041 -186726 -68667 -285140 228607 -53543 -219399 -380673 -215473
10002 -215473 -9390 44322 -101809 17848 -11206 -66857 -103253 -53638 25787 -466848 -248646
$$ packed form
10082a02023a3955l3087l19097P3640j4378f8569B197K29505q5229g9985c4706
10070E3336R4417b86573a0851p3091r5592J6864k5503A47968n8922g5519j05905
10059a81424A48659L8539a28766e4847j08797A31989c8198j7965B28860a45827
10048b80618g5333B7840N043f0256p5189A5444a13617k24679J03101B61776F4744
10036e0297p1353F6868a37103M7433a5063p3194p6962O7580j7778j3782A15829
10024e6173q0534f3910B01185c25867a62676b6208k11242Q2726f4086j32061h7531
10012a59284n0386l3371N6315f8667k16473B28607e3543j65856j61274J65200
10002b15473i390D4322a01809A7848a1206n5651l6396M9615B5787d66848K18202
$$ plain form
9991 -248646 -179619 165763 -479560 48328 -240309 325735 -62697 69790 -264698 140897
9980 -251432 -79078 -193333 174149 -20763 -196289 -193484 -110797 -34188 -132341 -62830 -36358
9969 -36358 173274 -45632 209627 -173652 -210805 -116139 -116384 -120141 -228221 -134573 36762 -189976
9956 -142490 -174063 -239212 212115 -65687 127496 -67241 242401 -263213 133477 9263 -209425
9944 -11546 -140526 210181 102205 -211805 -149601 -35898 -155510 -141741 -299683 70950 -181235
9932 -121308 -302496 -380702 -144074 -141568 343382 -265330 -147215 119038 125498 -269281 -255589
9921 -255589 151431 -46051 133033 315833 -145576 -65644 -28117 -229803 18177 -105273
9910 268782 -409262 -159289 -306353 4624 -151768 -141521 -112129 29519 -12055 -45140 -330458
$$ packed form
9991b48646O9027A65763d79560D8328b40309C25735f2697F9790b64698A40897
9980b51432g9078j14255A74149b0763j75526K805Q2687c4188r8153f2830K6472
9969c6358A73274d5632B09627a73652l7153R4666k45l757j08080R3648C6762a89976
9956a42490l1573o5149B12115f5687A27496f7241B42401b63213A33477I263b09425
9944a1546j28980B10181A02205b11805O2204c5898j19612J3769j57942G0950a81235
9932a21308j81188p8206a44074K506C43382b65330J18115A19038O460b69281J3692
9921b55589A51431d6051A33033J82800a45576f5644b8117k01686A8177a05273
9910B68782d09262a59289j47064D624a51768J0247K9392B9519a2055l3085k85318
$$ plain form
9899 -330458 23800 91991 -158346 18196 243 76813 435762 31871 96710 303272 -180656
9887 75376 -118259 -117189 5810 19194 -365216 -80549 -129126 -137580 264293 -107137 -261498
9876 -261498 -2791 9989 -157130 65484 374242 -10304 -24567 -48138 59676 -201735 23574
9864 193410 51020 -175263 -101009 -29293 -220137 139515 -10747 -13079 -225810 -77806 13901
9852 219111 53920 247080 13477 -91094 29704 -320885 130178 70925 8970 245500 -255743
9840 154085 4230 -35926 -223555 -33246 -132551 124080 -73134 -219784 -158510 31561 118178
9829 118178 -267399 120286 -235983 183936 -295956 -15049 273275 17779 -81163 -17524
9818 -396010 72451 -132707 -156748 -41030 243224 36076 -43440 -99317 -79075 -145240 -348770
$$ packed form
9899c30458B3800O8191a58346A8196B43P6570L58949C1871O4839K06562a80656
9887G5376a18259J070E810J3384c65216h0549m8577q454B64293a07137j54361
9876b61498b791I989a57130F5484L08758a0304j4263k3571E9676b01735B3574
9864A93410E1020a75263P4254b9293j90844A39515a0747k332k12731g7806A3901
9852B19111E3920J93160A3477i1094B9704c20885A30178n9253H970K36530b55743
9840A54085D230c5926j87629c3246r9305A24080g3134j46650O1274C1561Q6617
9829A18178b67399A20286b35983A83936b95956a5049B73275A7779h1163a7524
9818c96010G2451a32707k4041d1030B43224C6076d3440n5877K0242o6165k03530
$$ plain form
9807 -348770 -207382 321224 43900 -160573 141547 -236350 -320560 -8951 -631390 -8747 35333
9795 21335 -48118 -70586 -118302 201410 -26559 -120907 -141519 -373565 -120299 5104 170448
9784 170448 22553 -180540 -72063 -139807 -320945 4386 20838 -238157 48821 -60662 5755
9772 -83894 -80043 -66948 43254 -407235 -249419 48173 8296 -139042 -297644 -18647 -45074
9761 -45074 -116019 71026 -474333 -276861 -73468 -97225 -207124 -263072 -42435 267264 -35129
9749 98117 -217966 -190089 27145 132087 122676 -175468 76626 32180 -291035 -76671 231942
9737 116613 -214014 -1344 -284321 -223774 -165140 -228866 92475 71637 89780 21813 -155489
9725 -187300 -95 -358750 -216146 -115738 97709 29869 -135686 -344182 -224809 244766 161275
$$ packed form
9807c48770J41388C21224D3900a60573A41547b36350q4210h951o22439h747C5333
9795B1335d8118k2468m7716B01410b6559r4348k0612k32046a20299E104J65344
9784A70448B2553a80540g2063o7744j81138D386J6452b38157D8821f0662E755
9772h3894L851J3095D3254d07235J57816D8173H296a39042j58602a8647k6427
9761d5074p0945G1026d74333J97472g3468k3757j09899n5948d2435B67264c5129
9749I8117b17966K7877B7145J04942r411a75468G6626C2180b91035g6671B31942
9737A16613b14014a344k82977O0547N8634o3726I2475k0838J8143B1813a55489
9725a87300i5l58655J42604J00408I7709B9869a35686k08496J19373B44766q3491
$$ plain form
9714 161275 -54269 -5248 -253297 -89688 -292156 231646 223069 -200457 272602 203380 -209492
9702 1722 -37535 208915 8609 192739 122513 -95167 -234452 -15500 -135819 68473 359584
9691 359584 170050 70968 106604 -141257 30642 220436 72143 -26709 -41326 -101388 39038
9679 16715 -46182 -140435 -149449 -30835 16256 -129847 -124071 -65360 -171631 8354 -297110 -237823
9667 -237823 128772 45980 -280045 -314826 -174558 45406 -137770 -256763 -13489 15461 47022
9656 47022 340527 7334 143976 -215952 -66230 -255856 -228675 8386 -170893 -55405 -199414
9645 -199414 47484 195901 3015 -62001 84318 -158901 -248295 96525 -115136 -27449 9906
9633 -301209 44606 18618 -166190 -184647 -21300 320328 208638 265622 16812 -32849 1726
$$ packed form
9714A61275e4269e248k48049h9688k02468B31646q577b00457B72602o9222b09492
9702A722c7535B08915H609J84130p0226i5167j39285a5500j20319F8473K91111
9691C59584A70050G0968L5636a41257C0642J89794G2143b6709j4617o0062C9038
9679A6715d6182r4253r014c0835A6256a29847N776N8711j06271H354b97110N9287
9667b37823A28772D5980b80045l4781J40268D5406a37770j18993a3489A5461L1561
9656D7022K93505G334J36642b15952f6230j89626K7181H386a70893e5405j44009
9645a99414D7484J48417C015f2001H4318a58901q9394I6525a15136b7449I906
9633c01209D4606A8618a66190j8457b1300C20328j11690N6984A6812c2849A726
$$ plain form
9621 163544 168774 41616 -26051 109515 -210700 -69756 -241426 -273510 98450 -374599 106477
9609 -455276 -65268 54405 -115290 12990 124647 -225969 22788 -31220 246508 -106939 159624
9597 -208693 -458428 -225922 130114 6662 51831 30566 6014 -35085 -170847 -128264 -394226
9586 -394226 -160822 167450 80815 -53088 -253147 -33142 -117632 -55302 -466 40926 -414366
9574 -207221 -340376 -160085 -348805 286282 -481345 -44600 -219975 -97433 -300450 -198638
9564 -198638 -47563 -193163 -21513 -209731 31837 22932 25740 155855 125869 -35892 140640
9552 84181 -505292 146457 -119725 -24505 -28390 168446 11197 -7867 -52182 -186925 -91932
9540 56247 -424544 13010 69534 326559 -263849 -231102 230167 -67914 104418 263525 -36493
$$ packed form
9621A63544N230D1616b6051A09515b10700f9756j71670l2084I8450c74599A06477
9609d55276f5268E4405a15290A2990J11657b25969B2788c1220B46508a06939A59624
9597b08693k49735b25922A30114F662M5169k1265F014c5085j35762M2583k65962
9586c94226a60822A67450H0815e3088k00059c3142q4490e5302d66D0926d14366
9574b07221j33155a60085j88720B86282d81345d4600j75375i7433k03017J01812
9564a98638d7563j45600b1513j88218C1837q905K808J30115k9986c5892A40640
9552H4181e05292A46457a19725b4505l885A68446A1197g867m4315j34743i1932
9540E6247d24544A3010N6524K57025b63849L2747B30167f7914A04418J59107c6493
$$ plain form
9528 152511 -134108 9046 98546 -240574 83920 -135376 402609 27174 24299 -177881 99390
9516 253284 -37679 -26750 -64815 23999 239427 -144187 -37338 -145040 -48634 2368 67493
9505 67493 -25485 -76469 -106873 -106944 -198775 43062 -340643 233941 -319382 -96887 220910 -244470
9492 -239562 -121215 14734 -30600 -336668 24471 -272966 21159 -52318 -253515 -256037 -233972
9481 -233972 122749 169707 -139650 -205694 -45015 -147777 266473 -149551 -288996 -177662
9471 -177662 -34774 -248749 62154 -44590 120997 97162 251521 -35515 -304689 -145603 32857
9459 -210843 -145315 -180551 -17393 -390605 -256591 -355029 16821 -262880 -73488 128253 53445
9447 136687 -42643 6418 -373578 -414260 174247 290790 -146704 157373 -71121 -79935 -205998
$$ packed form
9528A52511a34108I046Q9500b40574H3920a35376D02609B7174k875a77881I9390
9516B53284c7679J0929l8065B3999K15428a44187c7338j07702d8634B368O5125
9505F7493b5485n0984l0404p1r1831D3062c40643B33941c19382i6887B20910b44470
9492b39562J18347A4734c0600l06068B4471b72966B1159e2318k01197k522K2065
9481b33972A22749M6958a39650o6044d5015j02762B66473a49551j39445J11334
9471a77662c4774k13975F2154d4590A20997k3835J54359c5515k69174a45603C2857
9459b10843O5528l5236a7393l73212J34014r8438A6821b62880g3488A28253E3445
9447A36687d2643F418c73578m0682A74247J16543a46704A57373g1121q814j26063
$$ plain form
9436 -205998 -61194 -52089 -81010 -45488 236464 146485 41611 6595 22035 -244527 -11247 -321294
9424 -321294 -286742 92870 -52594 -41391 -11377 120970 -178304 -115212 67485 -16274 -212420
9413 -212420 -130354 239018 -390080 -283534 -90415 298427 37932 -50231 -99605 181819 -93935
9401 -10583 -381959 128048 107873 -467305 -2626 -117008 -122467 104008 -386607 40597 -127351
9389 -320810 -283314 -315696 164199 121570 360800 -167547 99694 -218111 232660 246445 46647
9377 -113122 -239324 78717 144230 -186459 -104453 87080 32427 -216430 -449052 -15174 -79162
9366 -79162 2553 256788 206239 -251418 70875 348648 -11553 -118115 -18955 -4833 -196344
9355 -196344 975 49314 82107 -194458 93644 114100 -192201 240120 -168069 -182714 -207596
$$ packed form
9436b05998f1194R105k8921L5522B36464q9979D1611F595J5440b44527a1247l10047
9424c21294L4552I2870e2594J1203a1377A20970a78304O3092F7485a6274j96146
9413b12420Q2066B39018c90080J06546i0415B98427C7932e0231m9374A81819i3935
9401a0583l71376A28048k0175d67305b626j14382n459A04008c86607D0597a27351
9389c20810L7496l2382A64199m2629K39230a67547I9694b18111B32660J3785D6647
9377a13122j26202G8717O5513a86459Q2006H7080C2427b16430k32622a5174o3988
9366g9162B553K54235n0549b51418G0875K77773a1553j06562a8955d833j91511
9355a96344I75M8339L2793a94458I3644K0456a92201B40120a68069j4645k4882
$$ plain form
9344 -207596 -64504 -148779 -337105 320395 -278828 -1215 -134606 -197675 203965 20808 -65117
9332 115406 -81685 -56739 -28655 11680 -145886 100653 70452 -77820 62081 -97985 129554
9320 -95898 92562 -193432 6673 94334 58174 -104344 -181105 -321894 199983 18463 -98719
9308 -50026 -111851 -112826 -29789 -74642 120786 242757 -75031 -215743 1217 -390497 -211636
9297 -211636 -41731 10127 -419161 93906 218891 -161090 -190022 139575 96565 6645 262811
9286 262811 126734 -319621 -142603 331713 -49072 -365989 142173 -14083 218635 -241249
9275 215275 83660 -31155 -93465 -117448 -379648 63243 -23511 -88167 -106331 -3484 -157750
9264 -157750 97205 208029 -58608 -119140 -136573 -151845 173083 30674 161686 -264750 -15706
$$ packed form
9344b07596f4504q4275j88326C20395b78828a215j33391o3069B03965B0808f5117
9332A15406h1685K4946K8084A1680a45886A00653l0201g7820F2081i7985A29554
9320i5898I2562a93432F673Q7661l6160a04344p6761j40789A99983A8463i8719
9308e0026o1825r75b9789m4853A20786J21971g5031j40712A217c90497J78861
9297b11636d1731A0127d19161I3906J24985a61090k8932A39575m3010F645K56166
9286B62811A26734c19621a42603C31713d9072l16917A42173a4083B18635b41249
9275B15275H3660c1155o2310k3983k62200F3243b3511o4656j8164c484j54266
9264a57750I7205J10824e8608o0532j7433j5272A73083C0674J31012b64750a5706
$$ plain form
9252 -136308 -118774 -322641 146124 -296179 110598 -238495 -189242 -150369 90452 -5307 294315
9240 -86556 172677 37180 -295703 117955 237789 73538 281576 -13209 -77590 375316 -30241
9228 98178 -270689 -17351 -361236 202828 172355 -93313 -73000 -263928 -151862 -53906 138610
9216 -182105 -472664 62388 -58651 47356 -142592 -257772 -107906 52110 73771 152305 87760
9205 87760 458908 86630 -55283 -176751 74425 42652 -180795 116534 -45777 -52679 -149983
9194 -149983 295433 205817 -248765 -264237 410460 -117535 -172885 149262 -62657 -23699 -67650
9183 -67650 -74259 9852 -196340 -36586 -398463 -160555 225606 -303269 -92532 -365019 -195943
9172 -195943 -81160 -113148 -47857 -197097 -128601 281654 -137852 -59604 -194490 39610 -50568
$$ packed form
9252a36308J7534k03867A46124b96179A10598b38495M9253L8873I0452e307B94315
9240h6556A72677C7180b95703A17955J19834G3538K08038a3209o4381C75316c0241
9228I8178b70689a7351l43885B02828l0473i3313K0313j90928J12066e3906A38610
9216a82105k90559F2388e8651D7356a42592j15180a07906E2110K1661P8534o4545
9205H7760L71148H6630e5283j21468G4425l1773a80795A16534d5777o902r7304
9194a49983B95433q9616b48765j5472D10460a17535n5350A49262f2657b3699m3951
9183f7650o609I852a96340c6586l61877a60555B25606c03269i2532k72487J69076
9172a95943h1160l1988d7857j49240O8496B81654a37852e9604j34886C9610e0568
$$ plain form
9160 -308444 -62450 -172875 -285645 -331111 259428 -127688 -45191 52998 210949 142448 -201077
9148 153141 -66013 12793 59597 -277101 78049 217637 -214387 -373342 -96357 77050 456032
9137 456032 24609 -34573 -188859 -150570 20881 -161588 228327 47291 -138902 11176 112808
9126 112808 285931 -28390 -134431 -589049 -115500 107530 18669 -66806 -141885 63832 -193208
9114 -105012 114645 -106791 42534 -58078 -387963 51646 18440 90994 -195294 -184608 -223437
9103 -223437 168448 -78171 -196052 -190605 -228880 9964 -271042 78118 -146931 -180371 -156568
9092 -156568 33740 -34972 -130031 -47520 50233 -537918 -89914 -137652 -139285 -185661 324350
9080 -125375 -344730 -128879 63056 -42945 -3825 221191 35470 -100302 155556 43923 -116406
$$ packed form
9160c08444f2450j10425j12770m5466B59428a27688d5191E2998J57951o8501b01077
9148A53141f6013A2793M6804b77101G8049J39588b14387j58955i6357G7050L78982
9137D56032B4609c4573j54286L8289B0881a61588B28327D7291a38902A1176J01632
9126A12808J73123b8390j06041m54618a15500A07530A8669f6806p5079F3832a93208
9114a05012A14645a06791D2534e8078l29885E1646A8440P2554a95294J0686l8829
9103b23437A68448g8171j17881N447l8275I964b71042G8118a46931l3440K3803
9092a56568C3740c4972r5059d7520E0233e37918h9914m7738j633m6376C24350
9080a25375k19355a28879F3056d2945c825B21191C5470a00302A55556D3923a16406
$$ plain form
9068 378127 16607 -377263 -67702 -54768 -38649 157413 -110261 179362 143453 -184916 58142
9056 68852 110144 353121 142781 -35710 -116191 -240735 293886 76383 -86969 -102479 100415
9044 89445 -330923 -50668 -16181 -278874 26618 446812 241715 -67901 21442 -79292 227989
9032 -65456 43490 -121875 -217301 22965 -35690 -159465 33760 -297201 -291413 366910 -34711
9020 27574 90525 83263 42925 55201 -146393 -422959 -157244 -119552 -55235 -314489 206043
9008 -257788 -210793 -45579 -222107 -211209 61860 -11001 -88238 -47924 -263989 -24577 270000
8996 -306593 207416 63277 -545922 -109672 -115643 -425066 53038 152656 26023 110198 -36993
8984 -43793 216639 137510 19867 -377403 35830 174702 -10183 102319 122995 52798 -95143
$$ packed form
9068C78127A6607c77263f7702J2934J6119A57413a10261A79362l5909a84916E8142
9056F8852M1292K42977A42781c5710q0481j24544B93886G6383h6969j5510A00415
9044H9445c30923e0668a6181k62693B6618M20194k05097f7901B1442g9292B27989
9032f5456D3490a21875r5426B2965c5690j23775C3760b97201N788C66910c4711
9020B7574O2951p262m0338J2276a46393k76566a57244L7692e5235k59254B06043
9008b57788M6995d5579j76528J0898F1860a1001p7237M0314k16065b4577B70000
8996c06593B07416F3277e45922a09672n971l09423E3038R9618B6023Q4175c6993
8984d3793B16639p9129A9867c77403C5830J38872a0183A02319K0676E2798i5143
$$ plain form
8972 -33918 -138513 -172098 -137107 -14702 -145788 -66956 -118286 75700 -280206 -329931 -337392
8961 -337392 63745 -48179 -151534 226982 -113861 70327 313187 50988 -287140 309813
8950 -196751 60603 -314813 342048 -62761 100949 -81858 63645 -173724 -114494 -338955 -284889
8939 -284889 -280499 41889 -33104 -105867 -286444 -172920 -446197 -179485 260170 19674 -42475
8927 -248278 -83145 -344262 -140516 -28508 159587 -286390 117043 -137956 225340 208018
8917 208018 -37879 20767 381519 281086 105810 390075 59936 592688 926273 1812390
8907 1812390 2623421 6120163 9346319 4377917 2470850 1448505 921400 569818 398709
8898 398709 156533 56975 259767 -57322 163475 -60956 69666 227887 379856 123648
$$ packed form
8972c3918j04595l3585L4991a4702j31086f6956n1330G5700b80206m9725p461
8961c37392F3745d8179j03355B26982a13861G0327K42860E0988b87140C09813
8950a96751F0603c14813C42048f2761A00949h1858F3645a73724N9230k24461N4066
8939b84889M390D1889c3104p2763j80577J13524k73277a79485B60170A9674d2475
8927b48278h3145k61117a40516b8508A59587b86390A17043a37956B25340j7322
8917B08018c7879B0767L60752j00433A05810K84265E9936N32752L33585Q86117
8907A812390Q11031L496742L226156D377917j907067j022345n27105l51582j71109
8898C98709A56533E6975K02792e7322A63475f0956F9666J58221J51969A23648
$$ plain form
8887 49993 -175899 -51068 -126011 -54573 -256977 67484 -290524 -126694 -351059 155472 1822
8875 346118 -30343 -176054 108583 83072 -52655 131137 178961 -396606 -33193 14143 -136689
8863 -222639 35758 -58668 36020 138453 -267248 -13125 269694 71875 1449 -6007 -345764
8852 -345764 -105349 15874 -61514 -219199 -26049 301867 -150833 226593 -213120 -88715
$$ packed form
8887D9993a75899e1068p4943e4573k02404F7484b90524a26694k24365A55472A822
8875C46118c0343j45711A08583k5511e2655A31137M7824c96606c3193A4143a36689
8863b22639C5758e8668C6020J02433b67248a3125B69694G1875A449f007l39757
8852c45764a05349A5874f1514j57685b6049C01867a50833B26593b13120h8715
$$ [...]
##END NTUPLES=NMR SPECTRUM
##END=
