
##TITLE=AC1028_Robusta_6301217_5MUGvdUJwz
##JCAMPDX= 6.0         $$ Bruker NMR JCAMP-DX V2.0
##DATA TYPE= NMR SPECTRUM
##DATA CLASS= NTUPLES
##ORIGIN= BRUKER
##OWNER= Administrator
$$ 1.72 TOPSPIN		Version 2.1
$$ 2012-06-06 10:26:57.359 -0500  Administrator@TOPSPIN
$$ Compression mode = diff/dup
##.OBSERVE FREQUENCY= 400.13188235
##.OBSERVE NUCLEUS= ^1H
##.ACQUISITION MODE= SIMULTANEOUS (DQD)
##.ACQUISITION SCHEME= undefined
##.AVERAGES= 64
##.DIGITISER RES= 22
##SPECTROMETER/DATA SYSTEM= spect
##.PULSE SEQUENCE= noesygpps1d.comp
##.SOLVENT NAME= COFFEE_meoh
##.SHIFT REFERENCE= INTERNAL, COFFEE_meoh, 1, 14.96696
##AUDIT TRAIL= $$ (NUMBER, WHEN, WHO, WHERE, PROCESS, VERSION, WHAT)
$$ ##TITLE= Audit trail, TOPSPIN		Version 2.1
$$ ##JCAMPDX= 5.01
$$ ##ORIGIN= Bruker BioSpin GmbH
$$ ##OWNER= Administrator
$$ $$ C:\Bruker\TOPSPIN/data/COFFEE/nmr/AC1028_Robusta_6301217_5MUGvdUJwz/12/pdata/1/auditp.txt
$$ ##AUDIT TRAIL=  $$ (NUMBER, WHEN, WHO, WHERE, PROCESS, VERSION, WHAT)
(   1,<2012-06-05 21:35:11.421 -0500>,<Administrator>,<TOPSPIN>,<go>,<TOPSPIN 2.1>,
      <created by zg
	started at 2012-06-05 21:23:28.453 -0500,
	POWCHK enabled, PULCHK disabled,
       configuration hash MD5:
       D5 CA 7A 23 FE 6B EE E2 50 67 74 61 24 F7 5E 3B
       data hash MD5: 64K
       63 A6 F9 48 73 E8 93 B0 F3 23 DF B7 08 7A 44 C4>)
(   2,<2012-06-05 21:35:21.140 -0500>,<Administrator>,<TOPSPIN>,<proc1d>,<TOPSPIN 2.1>,
      <Start of raw data processing
       efp LB = 0.3 FT_mod = 6 PKNL = 1 PHC0 = 0 PHC1 = 0 SI = 128K 
       data hash MD5: 128K
       04 DE F2 A0 81 28 C1 CC 0B 22 ED 87 5A E3 13 C3>)
(   3,<2012-06-05 21:35:24.078 -0500>,<Administrator>,<TOPSPIN>,<proc1d>,<TOPSPIN 2.1>,
      <pk PHC0 = 33.57971 PHC1 = 0 
       data hash MD5: 128K
       5F CE FE E4 F5 7B 2F 3A 05 35 56 7F 7E 04 98 C3>)
(   4,<2012-06-05 21:35:29.078 -0500>,<Administrator>,<TOPSPIN>,<proc1d>,<TOPSPIN 2.1>,
      <abs ABSG = 1 
       data hash MD5: 128K
       AC 5B BA 14 85 1D F6 C3 EC 11 E0 F1 C5 07 79 5A>)
(   5,<2012-06-05 21:35:29.640 -0500>,<Administrator>,<TOPSPIN>,<proc1d>,<TOPSPIN 2.1>,
      <abs ABSG = 2 
       data hash MD5: 128K
       81 C0 A6 B1 74 78 4B 9E 07 B0 C9 FF E3 65 85 8B>)
(   6,<2012-06-05 21:35:30.437 -0500>,<Administrator>,<TOPSPIN>,<proc1d>,<TOPSPIN 2.1>,
      <abs ABSG = 3 
       data hash MD5: 128K
       48 9B 61 12 FD 32 C6 62 F7 49 C6 4D 51 0F 5D 8B>)
(   7,<2012-06-05 21:35:30.890 -0500>,<Administrator>,<TOPSPIN>,<proc1d>,<TOPSPIN 2.1>,
      <abs ABSG = 4 
       data hash MD5: 128K
       2A 53 ED D5 7D 2B 47 F0 80 E8 8B 33 21 4C CB A4>)
(   8,<2012-06-05 21:35:31.390 -0500>,<Administrator>,<TOPSPIN>,<proc1d>,<TOPSPIN 2.1>,
      <abs ABSG = 5 
       data hash MD5: 128K
       34 56 04 04 F8 A1 6E 10 02 CA 87 00 D0 CB B6 7F>)
(   9,<2012-06-05 21:36:09.125 -0500>,<Administrator>,<TOPSPIN>,<audit>,<TOPSPIN 2.1>,
      <user comment:
       ICON-NMR User ID: COFFEE
       data hash MD5: 128K
$$ [...]
##$TP07= 0
##$TPNAME0= <>
##$TPNAME1= <>
##$TPNAME2= <>
##$TPNAME3= <>
##$TPNAME4= <>
##$TPNAME5= <>
##$TPNAME6= <>
##$TPNAME7= <>
##$TPOAL= (0..7)
0.5 0.5 0.5 0.5 0.5 0.5 0.5 0.5
##$TPOFFS= (0..7)
0 0 0 0 0 0 0 0
##$TUNHIN= 0
##$TUNHOUT= 0
##$TUNXOUT= 0
##$USERA1= <user>
##$USERA2= <user>
##$USERA3= <user>
##$USERA4= <user>
##$USERA5= <user>
##$V9= 5
##$VALIST= <valist>
##$VCLIST= <CCCCCCCCCCCCCCC>
##$VD= 0
##$VDLIST= <DDDDDDDDDDDDDDD>
##$VPLIST= <PPPPPPPPPPPPPPP>
##$VTLIST= <TTTTTTTTTTTTTTT>
##$WBST= 2048
##$WBSW= 25
##$XGAIN= (0..3)
0 0 0 0
##$XL= 0
##$YL= 0
##$YMAX_a= 9936678
##$YMIN_a= -5667080
##$ZGOPTNS= <>
##$ZL1= 120
##$ZL2= 120
##$ZL3= 120
##$ZL4= 120
##$ABSF1= 14.96696
##$ABSF2= -5.58557
##$ABSG= 5
##$ABSL= 3
##$ALPHA= 0
##$AQORDER= 0
##$ASSFAC= 0
##$ASSFACI= 0
##$ASSFACX= 0
##$ASSWID= 0
##$AUNMP= <proc_prof1d_extract.lims>
##$AXLEFT= 0
##$AXNAME= <>
##$AXNUC= <1H>
##$AXRIGHT= 0
##$AXTYPE= 0
##$AXUNIT= <>
##$AZFE= 0.1
##$AZFW= 0.1
##$BCFW= 0
##$BC_mod= 0
##$BYTORDP= 0
##$COROFFS= 0
##$CY= 15
##$DATMOD= 1
##$DC= 0
##$DFILT= <>
##$DTYPP= 0
##$F1P= 0
##$F2P= 0
##$FCOR= 0.5
##$FTSIZE= 131072
##$FT_mod= 6
##$GAMMA= 0
##$GB= 0
##$INTBC= 1
##$INTSCL= 1
##$ISEN= 128
##$LB= 0.3
##$LEV0= 0
##$LPBIN= 0
##$MAXI= 10000
##$MC2= 0
##$MEAN= 0
##$ME_mod= 0
##$MI= 0
##$NCOEF= 0
##$NC_proc= -3
##$NLEV= 6
##$NOISF1= 0
##$NOISF2= 0
##$NSP= 0
##$NTH_PI= 0
##$NZP= 0
##$OFFSET= 14.96696
##$PC= 1
##$PHC0= 33.57971
##$PHC1= 0
##$PH_mod= 1
##$PKNL= yes
##$PPARMOD= 0
##$PPDIAG= 0
##$PPIPTYP= 0
##$PPMPNUM= 2147483647
##$PPRESOL= 1
##$PSCAL= 4
##$PSIGN= 0
##$PYNMP= <proc.py>
##$REVERSE= no
##$SF= 400.130005461592
##$SI= 131072
##$SIGF1= 0
##$SIGF2= 0
##$SINO= 400
##$SIOLD= 131072
##$SPECTYP= <>
##$SREGLST= <1H.CDCl3>
##$SSB= 0
##$STSI= 131072
##$STSR= 0
##$SW_p= 8223.68421052632
##$SYMM= 0
##$S_DEV= 0
##$TDeff= 65536
##$TDoff= 0
##$TI= <>
##$TILT= no
##$TM1= 0
##$TM2= 0
##$TOPLEV= 0
##$USERP1= <user>
##$USERP2= <user>
##$USERP3= <user>
##$USERP4= <user>
##$USERP5= <user>
##$WDW= 1
##$XDIM= 131072
##$YMAX_p= 452539850
##$YMIN_p= -203285822
##$CURPLOT= <Network HP LaserJet P1505>
##$CURPRIN= <$Network HP LaserJet P1505>
##$DFORMAT= <normdp>
##$LAYOUT= <+/1D_H.xwp>
##$LFORMAT= <normlp>
##$PFORMAT= <normpl>
##$SURQMSG= 1
$$ End of Bruker specific parameters
$$ ---------------------------------
##NTUPLES= NMR SPECTRUM
##VAR_NAME=  FREQUENCY,     SPECTRUM/REAL,   SPECTRUM/IMAG
##SYMBOL=    X,             R,               I
##VAR_TYPE=  INDEPENDENT,   DEPENDENT,       DEPENDENT
##VAR_FORM=  AFFN,          ASDF,            ASDF
##VAR_DIM=   131072,        131072,          131072
##UNITS=     HZ,            ARBITRARY UNITS, ARBITRARY UNITS
##FACTOR=    0.0627417313425165, 1,          1
##FIRST=     8223.62146879498, 6786,         -89970
##LAST=      0,             5242,            -90320
##MIN=       0,             -203285822,      0
##MAX=       8223.62146879498, 452539850,    0
$$ Real data points
##PAGE= N=1
##DATA TABLE= (X++(R..R)), XYDATA
$$ [...]
63677C57513R18O85J877L526M479N161O395P516P377O471O112O135N486M660N181
63662D29492O677O884N085L359L580N076O155O216N284L133J88j970k385k121
63648D74653k709m038m840m464l118j130Q82J779J023l88j103j128j330j683j177
63633D51229O32K840M232M472M230M392N097N456M618L156K623L537M688M912
63619E06114M496M176L758K812J872J717K021K007J970K750L935M081K839J656
63605E46204J818K834L225K306O72o94j463k274m030o631q705r035p997o953o383
63590E02894n421l369r29L78k49k166l762l625j538J488M166N765O173N605M675
63575E10085M247M826O257Q183J0331J2067J2579J2084J2074J3461J5204J5852
$$ y = [357513, 358431, 359116, 360993, 364519, 368998, 374159, 380554, 388070, 395447, 401918, 408030, 414165, 419651, 424311, 429492, 436169, 443053, 448138, 451497, 455077, 460153, 466308, 472524, 477808, 480941, 481129, 479159, 476774, 474653, 471944, 467906, 463066, 458602, 455484, 454354, 455236, 457015, 458038, 457650, 456547, 455419, 454089, 452406, 451229, 451861, 454701, 458933, 463405, 467635, 472027, 477124, 482580, 487198, 490354, 492977, 496514, 501202, 506114, 510610, 514786, 518544, 521356, 523228, 524945, 526966, 528973, 530943, 533693, 537628, 541709, 544548, 546204, 548022, 550856, 554081, 556387, 557059, 556365, 554902, 552628, 548598, 541967, 533262, 524227, 516230, 509277, 502894, 497473, 494104, 493175, 493553, 493304, 491138, 487376, 483751, 482213, 483701, 487867, 493632, 499805, 505410, 510085, 514332, 519158, 525415, 533598, 543929, 555996, 568575, 580659, 592733, 606194, 621398, 637250]
63563F37250J5814J6739J9052K1635K3824K6122K8657L0561L1521L2608L4746
63552I18529L7325L9242M0480M1831M3554M5043M5417M3986M0545L5708L0410
63541A362070K4809J8322J1123M687K13k718n160p272q698r798j1356j3502j5991
63528A346729j9164k3358k7576l0012l0036k8647k6884k4842k2427j9854j7099
63517A076830j3870j0551q156o770n180k590L36K881N431Q157R838R692R507J1802
63503A087357J6081J9059J8970J7620J7361J8007J8162J8064J9164K1551K3745
63492A295141K5021K6350K8784L2161L5880L9891M4153M7675M8768M6163L9728
63481A709715L0407J9759R401N86n971j0226j2914j5071j6999j8071j7970j7679
$$ y = [637250, 653064, 669803, 688855, 710490, 734314, 760436, 789093, 819654, 851175, 883783, 918529, 955854, 995096, 1035576, 1077407, 1120961, 1166004, 1211421, 1255407, 1295952, 1331660, 1362070, 1386879, 1405201, 1416324, 1421011, 1421224, 1418506, 1413346, 1406074, 1397376, 1387578, 1376222, 1362720, 1346729, 1327565, 1304207, 1276631, 1246619, 1216583, 1187936, 1161052, 1136210, 1113783, 1093929, 1076830, 1062960, 1052409, 1044253, 1037483, 1032303, 1029713, 1030049, 1032930, 1038361, 1046518, 1056356, 1066048, 1075555, 1087357, 1103438, 1122497, 1141467, 1159087, 1176448, 1194455, 1212617, 1230681, 1249845, 1271396, 1295141, 1320162, 1346512, 1375296, 1407457, 1443337, 1483228, 1527381, 1575056, 1623824, 1669987, 1709715, 1740122, 1759881, 1769282, 1769868, 1763897, 1753671, 1740757, 1725686, 1708687, 1690616, 1672646, 1654967]
63469A654967j8521k0571k2833k4810k7027l0044l3748l7658m1084m3071m3085
63458A312515m1821m0508l9321l7430l4589l1549k8781k6049k3513k1860k0725
63447I66369j8525j4816j1522j0627j1544j2096j1338j0103r290q968q929q961
63435H29650q661p880p131o888o870o734o755o929o230m113k046j863k915k729
63421G51906m88J962K878K710K749L246L766M212M438L685J388j940n247p857
63407G67408r360r391q261p186p117p687p929p593p060o345n062l351k055j613
63393F77398j152P64M397Q068R684R043Q097Q583J0089J1251J2178J4301J8015
63380G90716K1819K4238K5485K6729K8671L1341L4458L7246L8504L7513L4613
$$ y = [1654967, 1636446, 1615875, 1593042, 1568232, 1541205, 1511161, 1477413, 1439755, 1398671, 1355600, 1312515, 1270694, 1230186, 1190865, 1153435, 1118846, 1087297, 1058516, 1032467, 1008954, 987094, 966369, 947844, 933028, 921506, 910879, 899335, 887239, 875901, 865798, 856508, 847540, 838611, 829650, 820989, 813109, 805978, 799090, 792220, 785486, 778731, 771802, 765572, 761459, 759413, 757550, 754635, 751906, 751418, 753380, 756258, 758968, 761717, 764963, 768729, 772941, 777379, 781064, 782452, 780512, 775265, 767408, 758048, 748657, 740396, 733210, 726093, 718406, 710477, 702884, 695824, 689479, 684417, 681066, 679011, 677398, 676246, 677010, 681407, 689475, 699159, 708202, 716299, 724882, 734971, 746222, 758400, 772701, 790716, 812535, 836773, 862258, 888987, 917658, 948999, 983457, 1020703, 1059207, 1096720, 1131333]
63369A131333L0778K7072K4575K3917K4608K5703K7264L0131L3989L7179L9116
63358A455665M1403M5317M9388N0917M9122M5273M0392L4365K7117J9167J1048
63347A869174L340k871o802r158j1473j4325j7341k0639k4735k9056l2189l4021
63335A669904l6004l8668m0397l9767l7808l6619l6468l5662l2939k8772k4320
63324A282480k0095j6000j2052q698o447n195l990j910Q07L097M748O941J0507
63311A234193J4416J6912J7737J8256J9618K1827K4511K7476L0295L2361L3789
63300A491391L5403L7386L8874L9487M0322M2343M4435M4300M1101L5971K9878
63289A920891K2443J3414M152l387q621j2436j5740j8755k1398k3530k4987k6052
$$ y = [1131333, 1162111, 1189183, 1213758, 1237675, 1262283, 1287986, 1315250, 1345381, 1379370, 1416549, 1455665, 1497068, 1542385, 1591773, 1642690, 1691812, 1737085, 1777477, 1811842, 1838959, 1858126, 1869174, 1872514, 1869643, 1862841, 1853683, 1842210, 1827885, 1810544, 1789905, 1765170, 1736114, 1703925, 1669904, 1633900, 1595232, 1554835, 1515068, 1477260, 1440641, 1404173, 1368511, 1335572, 1306800, 1282480, 1262385, 1246385, 1234333, 1225635, 1219188, 1213993, 1210003, 1208093, 1208900, 1211997, 1216745, 1223686, 1234193, 1248609, 1265521, 1283258, 1301514, 1321132, 1342959, 1367470, 1394946, 1425241, 1457602, 1491391, 1526794, 1564180, 1603054, 1642541, 1682863, 1725206, 1769641, 1813941, 1855042, 1891013, 1920891, 1943334, 1956748, 1960900, 1957513, 1948892, 1936456, 1920716, 1901961, 1880563, 1857033, 1832046, 1805994]
63277A805994k7774l0968l4981l8305m0374m1816m2877m2796m1263l9383l8293
63266A387164l7485l5470l1667k6878k2194j8286j5601j4406j4515j5470j6982
63255A138210j8795k0365k1210k1439k1360k0824j9554j7951j6786j6117j5335
63244I28474j4352j3969j4723j5981j6553j5795j3922j1787j0465j0564j1602
63233G78761j2432j2456j2005j1505j0856r909q927q220p752p467p493p670p351
63220F54718o141m519l333l070l804n320o810p061n652l599k298k176k880m131
63206E93924n491n860m517k544j954l117m214l732k464k189l143l852l275k098
63192E45474j666k229k691k146j226j551l546n370m737j809Q25J329P90J363L109
$$ y = [1805994, 1778220, 1747252, 1712271, 1673966, 1633592, 1591776, 1548899, 1506103, 1464840, 1425457, 1387164, 1349679, 1314209, 1282542, 1255664, 1233470, 1215184, 1199583, 1185177, 1170662, 1155192, 1138210, 1119415, 1099050, 1077840, 1056401, 1035041, 1014217, 994663, 976712, 959926, 943809, 928474, 914122, 900153, 885430, 869449, 852896, 837101, 823179, 811392, 800927, 790363, 778761, 766329, 753873, 741868, 730363, 719507, 709598, 700671, 692451, 684699, 677232, 669739, 662069, 654718, 648577, 644058, 640725, 637655, 633851, 628531, 621721, 614660, 609008, 605409, 603111, 600935, 598055, 593924, 588433, 582573, 578056, 575512, 573558, 570441, 566227, 562495, 560031, 557842, 554699, 550847, 547572, 545474, 543808, 541579, 538888, 536742, 535516, 533965, 530419, 525049, 520312, 518503, 519328, 520657, 521447, 522810, 525919]
63177E25919M109L547L021M152O039O310M280J890J330K676M299N010M932M596
63163E82110M053L230K452K117K242K842M257O342P638O583L732J705K165L713
63149F35181L784J931R5p6J191K932M759O306O544M798K152P28J489L409N024
63134F80247O211P970J0629J2943J3371J2055J0852J1229J2653J3677J3990J4502
63122H20329J5573J6394J6405J6232J6562J7031J7037J6947J7455J8174J7944
63111A006083J6456J4566J2943J1180Q545N082J652q50k306l577n686q619j1302
63098A044167j3122j4810j7166j9582k0894k1098k1001k0458j8612j5888j4016
63087H47520j3639j3415j2264j0936j0365r897q584p049o480o491n660l754j813
$$ y = [525919, 530028, 533575, 536596, 540748, 546787, 553097, 557377, 559267, 560597, 563273, 567572, 572582, 577514, 582110, 586163, 589393, 591845, 593962, 596204, 599046, 603303, 609645, 617283, 623866, 627598, 629303, 631468, 635181, 638965, 640896, 640991, 640915, 642106, 645038, 649797, 656103, 662647, 667445, 669597, 670325, 671814, 675223, 680247, 686458, 694428, 705057, 718000, 731371, 743426, 754278, 765507, 778160, 791837, 805827, 820329, 835902, 852296, 868701, 884933, 901495, 918526, 935563, 952510, 969965, 988139, 1006083, 1022539, 1037105, 1050048, 1061228, 1069773, 1074855, 1076507, 1075657, 1073351, 1069774, 1064088, 1055469, 1044167, 1031045, 1016235, 999069, 979487, 958593, 937495, 916494, 896036, 877424, 861536, 847520, 833881, 820466, 808202, 797266, 786901, 777004, 768420, 761371, 754891, 748400, 742740, 738986, 737173]
63074G37173l11J164K396K477J585J275K350L761M358M607N592P170Q248Q399
63060G90244Q162P995P828P642P700Q079Q399Q303P955P981Q905J0558J2063J2618
63046I14432J2381J2239J2597J2804J2011J0298Q544P477P216P580Q462R851J1637
63033A047529J3368J4127J3029J0046O213K783L71j050j755k268l367n404p705
63020A085917r174r519r516r971j0912j1870j2562j2927j2838j2198j1257j0442
63008I52731r792q858p417n985n194m695l308n98K243L665L665L667M633O120
62994I30877P276P872Q040P798P490P883R222J0780J2078J3740J6157J8090J8074
62981A075377J6805J6328J6844J6224J3386J0402R940J1799J3414J3090J1283
$$ y = [737173, 736862, 738026, 740422, 742899, 744484, 745759, 748109, 751870, 756228, 760835, 766427, 773597, 781845, 790244, 798406, 806401, 814229, 821871, 829571, 837650, 846049, 854352, 862307, 870288, 879193, 889751, 901814, 914432, 926813, 939052, 951649, 964453, 976464, 986762, 995306, 1002783, 1009999, 1017579, 1026041, 1035892, 1047529, 1060897, 1075024, 1088053, 1098099, 1104312, 1107095, 1107466, 1106416, 1104661, 1102393, 1099026, 1093622, 1085917, 1076743, 1067224, 1057708, 1047737, 1036825, 1024955, 1012393, 999466, 986628, 974430, 963173, 952731, 942939, 934081, 926664, 920679, 915485, 910790, 907482, 906884, 909127, 912792, 916457, 920124, 924757, 930877, 938153, 946025, 954065, 961863, 969353, 977236, 986458, 997238, 1009316, 1023056, 1039213, 1057303, 1075377, 1092182, 1108510, 1125354, 1141578, 1154964, 1165366, 1175306, 1187105, 1200519, 1213609, 1224892]
62970A224892R175P422O276N610M699K889N29j630l779o543r203r918q258o177
62956A215984n602o101n936m494k573q46P50K341M018O243R391J2828J5354J6667
62942A258024J7635J9037K0828K2686K4421K5577K5521K4343K3126K2830K3405
62931A507433K4192K4653K4398K3147K1160J9194J7513J5336J1765O898J517l774
62919A693432q644j2667j5803j8982k3379k8909l4055l7421l8990l9644l9853
62908A395085l9278l7514l5034l3035l2149l1521k9634k6250k2872k1033k0608
62897A066157k0457k0104j9974k0198k0203j9600j8764j8231j8010j7661j6800
62886H56155j5512j4532j4717j5907j6581j5388j2848j0784j0242j0735j1317
$$ y = [1224892, 1234067, 1241489, 1247765, 1253375, 1258074, 1260963, 1261492, 1259862, 1256083, 1249540, 1240337, 1230419, 1222161, 1215984, 1210382, 1204281, 1198345, 1193851, 1191278, 1190432, 1191182, 1193523, 1197541, 1203784, 1213175, 1226003, 1241357, 1258024, 1275659, 1294696, 1315524, 1338210, 1362631, 1388208, 1413729, 1438072, 1461198, 1484028, 1507433, 1531625, 1556278, 1580676, 1603823, 1624983, 1644177, 1661690, 1677026, 1688791, 1695689, 1697206, 1693432, 1684788, 1672121, 1656318, 1637336, 1613957, 1585048, 1550993, 1513572, 1474582, 1434938, 1395085, 1355807, 1318293, 1283259, 1250224, 1218075, 1186554, 1156920, 1130670, 1107798, 1086765, 1066157, 1045700, 1025596, 1005622, 985424, 965221, 945621, 926857, 908626, 890616, 872955, 856155, 840643, 826111, 811394, 795487, 778906, 763518, 750670, 739886, 729644, 718909, 707592]
62875G07592j1320j0093p486m830l978m797n057l720k703l910n904n689l118j147
62861F33840j594k874k721j331n71j275k630l577l599k536p66O39Q66N35J135
62846F13541L115N217N945N312M780N593P460Q923R027Q460Q704J0164J1661J2001
62832G19903J1369J0552R435P342M696K991K604J791j073m849o570n104k718k496
62818G47873n022q291j0286j0716j0544j0689j1393j2051j1563r528p231o659
62806F33900q102r549r107p230n672m887l895k485j962l165m983n748n301m726
62792E57088m474l837k248l27O98K65j048k198k700k902l180l163k278r49m01
62777E28346r91j550r56L82J287J418J187O90k02j029j233j296k059k929k313
$$ y = [707592, 696272, 686179, 678693, 673863, 669885, 665088, 660031, 656311, 653608, 649698, 643794, 638105, 634987, 633840, 632246, 629372, 626651, 625320, 624749, 623474, 620844, 617267, 613668, 611132, 610366, 611005, 611871, 612406, 613541, 616656, 621873, 627818, 633130, 637910, 643503, 650963, 659886, 668913, 677373, 686077, 696241, 707902, 719903, 731272, 741824, 751259, 758601, 763297, 766288, 768892, 770683, 769610, 764761, 758191, 753087, 750369, 747873, 742851, 734560, 724274, 713558, 703014, 692325, 680932, 668881, 657318, 647790, 640559, 633900, 625798, 616249, 607142, 599912, 594240, 589353, 585458, 582973, 581011, 577846, 572863, 567115, 561814, 557088, 552614, 548777, 546529, 546202, 546900, 547165, 546117, 543919, 541219, 538317, 535137, 531974, 529696, 528747, 528346, 527355, 525805, 524849, 525231, 526518, 527936, 529123, 529813, 529611, 528582, 527349, 526053, 523994, 521065, 518752]
62762E18752j50J551J535J098J822K738J593j557m006l826k020o73l31j88J41
62747E16479L61O37J685L476M784M592L428K785L420M759N751N748M570K456J96
62732E65127j270j775j914j718k27K861N838O726N974N915P349Q557Q254P790
62718F17487R058J1532J3128J3234J3115J3588J3969J3396J1816R453O596M169
62706G50541L208L287K708P84j196j982k267l567n946q082r152r525r660r390
62692F99761q674q351r402j1552j3035j2219r500p106o679p478p562o360n086
62679E86757m743m886m693m191l763l235k286j181m31n5K57O66J301K381L739
62664E65637M733N134N554O478P451P898Q173R017J0415J1746J2735J3463J3904
$$ y = [518752, 518602, 520153, 521688, 522786, 524608, 527346, 528939, 527382, 523376, 519550, 517530, 516857, 516526, 516338, 516479, 516840, 517477, 519162, 522638, 527422, 532014, 535442, 538227, 541647, 546406, 552157, 557905, 562475, 564931, 565127, 563857, 562082, 560168, 558450, 558223, 561084, 566922, 573648, 579622, 585537, 592886, 601443, 609697, 617487, 626545, 638077, 651205, 664439, 677554, 691142, 705111, 718507, 730323, 739776, 746372, 750541, 753749, 757036, 759744, 760528, 759332, 757350, 755083, 751516, 745570, 737488, 728336, 718811, 709151, 699761, 691087, 682736, 673334, 661782, 648747, 636528, 627028, 619922, 613243, 605765, 598203, 591843, 586757, 582014, 577128, 572435, 568244, 564481, 561246, 558960, 557779, 557348, 557293, 557550, 558216, 559517, 561898, 565637, 570370, 575504, 581058, 587536, 594987, 602885, 611058, 620075, 630490, 642236, 654971, 668434, 682338]
62651F82338J4188J4944J6585J8584K0242K1786K3774K5904K7453K8624L0355
62640I24777L2908L5648L8174M0598M2830M4589M6014M7248M7564M6113M3454
62629A389917M0919L8495L4784K9295K3138J6985J0050J884o396j3790k0946k8650
62617A515685l5868m0889m3677m5635m7377m8230m7746m6431m4858m3150m1411
62606A030413l9837l8223l6089l3361l0336k7137k3899k1289j9923j9261j7948
62595G23110j5520j2989j1502j1080j1031j1016j1113j1206j0817r678q155o956
62583E92047o397o082n504m819m530m419l510j517L48P50p6q70j222j820k862
62568E49517l396k749j726j603k458l203l081k510k362k879l491l563l033k306
$$ y = [682338, 696526, 711470, 728055, 746639, 766881, 788667, 812441, 838345, 865798, 894422, 924777, 957685, 993333, 1031507, 1072105, 1114935, 1159524, 1205538, 1252786, 1300350, 1346463, 1389917, 1430836, 1469331, 1504115, 1533410, 1556548, 1573533, 1583583, 1585467, 1579071, 1565281, 1544335, 1515685, 1479817, 1438928, 1395251, 1349616, 1302239, 1254009, 1206263, 1159832, 1114974, 1071824, 1030413, 990576, 952353, 916264, 882903, 852567, 825430, 801531, 780242, 760319, 741058, 723110, 707590, 694601, 683099, 672019, 660988, 649972, 638859, 627653, 616836, 607158, 599003, 592047, 585650, 579568, 574064, 569245, 564715, 560296, 556786, 555269, 555617, 556367, 556291, 555421, 554199, 552379, 549517, 546121, 543372, 541646, 540043, 537585, 534382, 531301, 528791, 526429, 523550, 520059, 516496, 513463, 511157]
62554E11157j591o31P96K296L154L167K832K503J745Nk124k993j741L58J213N54
62538E20700K63J685L732M560M249M276M883M882M100L947M841N029L264R86K26
62523E71623N93L20n89n36O92J261o7k382m171m940m867m320m188n294o865o777
62507E29493m198q70R34P88k32j202j794j937j922k136k062n15K246L761K117
62492E22471j295l262k499m94J193K669M370N536N019K990R36J45O69J666K391
62477E42505K796L240L850M413M830N225N428M991M126M052N687Q362J0574J1682
62463F21761J2225J2810J3553J4455J5454J6229J6781J8125K1231K5164K7503
62452H15291K7243K6212K6858K9344L1667L2104L0561K7926K5026K2283J9635
$$ y = [511157, 509566, 508935, 509731, 512027, 515181, 518348, 521180, 523683, 525428, 525433, 523309, 520316, 518575, 518933, 520146, 520700, 520963, 522648, 526380, 530940, 535189, 539465, 544348, 549230, 553330, 557277, 562118, 567147, 570411, 571397, 571623, 572216, 572536, 571947, 571411, 572103, 573364, 573297, 570915, 566744, 561804, 556937, 552617, 548429, 543135, 536270, 529493, 525295, 524425, 525359, 526147, 525915, 524713, 522919, 520982, 519060, 516924, 514862, 514347, 516593, 520354, 522471, 521176, 517914, 515415, 514921, 516114, 518783, 523153, 528689, 533708, 536698, 537634, 537779, 538448, 540114, 542505, 545301, 548541, 552391, 556804, 561634, 566859, 572287, 577278, 581404, 585456, 591143, 599505, 610079, 621761, 633986, 646796, 660349, 674804, 690258, 706487, 723268, 741393, 762624, 787788, 815291, 842534, 868746, 895604, 924948, 956615, 988719, 1019280, 1047206, 1072232, 1094515, 1114150]
62441A114150J6686J3359J0213P556M597M33m116o784o487m800m021m460m554
62428A131772l301j347M93K672O224J1143J6087J9386K0050J8330J5920J5129
62416A252558J6788J8856J7901J2426M312l181q340j1696j4610j7902k1695k5723
62404A219694k9564l2880l5574l7546l8320l7278l4554l1442k9489k8955k8393
62393H55699k6133k2239j8576j6637j5766j4053j0869p670o132o186o432o011
62381F98995n345n113n210n054m593m466m974n285m307k370j274k085l576l825
62367F41518k903k692l932m951l996j681j25l78j751l148m085m499m469m064l124
62352E95720j419O52K029K210J872J640J034m42j873j855l63J514L294N077O183
$$ y = [1114150, 1130836, 1144195, 1154408, 1161964, 1166561, 1166994, 1162878, 1156094, 1149607, 1144807, 1140786, 1136326, 1131772, 1128471, 1127124, 1127617, 1130289, 1136513, 1147656, 1163743, 1183129, 1203179, 1221509, 1237429, 1252558, 1269346, 1288202, 1306103, 1318529, 1322841, 1319660, 1311320, 1299624, 1285014, 1267112, 1245417, 1219694, 1190130, 1157250, 1121676, 1084130, 1045810, 1008532, 973978, 942536, 913047, 884092, 855699, 829566, 807327, 788751, 772114, 756348, 742295, 731426, 723756, 717624, 711438, 705006, 698995, 693650, 688537, 683327, 678273, 673680, 669214, 664240, 658955, 654648, 652278, 651004, 648919, 645343, 641518, 638615, 635923, 631991, 627040, 623044, 621363, 621238, 620860, 619109, 615961, 611876, 607377, 602908, 598844, 595720, 594301, 594953, 596982, 599192, 601064, 602704, 603738, 603296, 601423, 599568, 599205, 600719, 604013, 609090, 615273]
62337F15273N576L870L189M517O520P663Q066Q519R048R568J0858J3471J6325
62324G22463J7596J6829J5336J4737J5851J8560K1921K4546K5637K5621K5522
62313I44619K6000K7348K9691L2558L4804L5883L6756L8785M2009M5392M8456
62302A342301N1719N5635N9995O4488O8979P3127P6425P8816Q0643Q1837Q1721
62291B115686P9736P5802O9802O1363N0547L8354K5999J3886J679j0669k2369
62280B499816l2530m1133m8815n5669o0893o4035o5903o7388o7915o6315o3075
62269A866145o0087n7886n4853n0114m5528m3327m2983m2194m0124l7780l5809
62258A355460l4025l2936l3497l4985l5017l2548k9246k7161k6291k5299k3363
$$ y = [615273, 620849, 624719, 627908, 632425, 638945, 646608, 654674, 663193, 672241, 681809, 692667, 706138, 722463, 740059, 756888, 772224, 786961, 802812, 821372, 843293, 867839, 893476, 919097, 944619, 970619, 997967, 1027658, 1060216, 1095020, 1130903, 1167659, 1206444, 1248453, 1293845, 1342301, 1394020, 1449655, 1509650, 1574138, 1643117, 1716244, 1792669, 1871485, 1952128, 2033965, 2115686, 2195422, 2271224, 2341026, 2402389, 2452936, 2491290, 2517289, 2531175, 2532854, 2522185, 2499816, 2467286, 2426153, 2377338, 2321669, 2260776, 2196741, 2130838, 2063450, 1995535, 1929220, 1866145, 1806058, 1748172, 1693319, 1643205, 1597677, 1554350, 1511367, 1469173, 1429049, 1391269, 1355460, 1321435, 1288499, 1255002, 1220017, 1185000, 1152452, 1123206, 1096045, 1069754, 1044455, 1021092]
62247A021092k0431j6767j3275j1323j1181j1318j0140p933o131n313m834m037
62235H98409k847j443l1J186K358L992O111P877Q596Q686R056R882J0659J1094
62221I73585J1354J1718J2476J3815J5276J5836J5183J4476J5201J7538K0471
62210A136929K3032K4848K6008K7267K9919L4556M0169M5324M9792N4137N8257
62199A550238O1603O4726O9074P4892Q0514Q4226Q5864Q6078Q4884Q1585P5527
62188B399211O6334N4032L9529K4627J0857j596j3477k5209l6403m6484n5314
62177B416107o3062o9662p4675p7752p9119p9323p8547p6614p3717p0576o7480
62166A605580o3797n8955n3518m8592m4566m1104l8008l5220l2231k8545k4652
$$ y = [1021092, 1000661, 983894, 970619, 959296, 948115, 936797, 926657, 918724, 912593, 907280, 902446, 898409, 895562, 894119, 894088, 895274, 897632, 901624, 907735, 915612, 924208, 932894, 941950, 951832, 962491, 973585, 984939, 996657, 1009133, 1022948, 1038224, 1054060, 1069243, 1083719, 1098920, 1116458, 1136929, 1159961, 1184809, 1210817, 1238084, 1268003, 1302559, 1342728, 1388052, 1437844, 1491981, 1550238, 1611841, 1676567, 1745641, 1820533, 1901047, 1985273, 2071137, 2157215, 2242099, 2323684, 2399211, 2465545, 2519577, 2559106, 2583733, 2594590, 2592994, 2579517, 2554308, 2517905, 2471421, 2416107, 2353045, 2283383, 2208708, 2130956, 2051837, 1972514, 1893967, 1817353, 1743636, 1673060, 1605580, 1541783, 1482828, 1429310, 1380718, 1336152, 1295048, 1257040, 1221820, 1189589, 1161044, 1136392]
62155A136392k1676j9928j8763j7855j7560j7722j7149j4895j1430q041n598m242
62143I61533l693l356k577j174M84K088L641N101O343P629R566J2311J5288J7713
62129A030897J9022J9025J8399J8801K1292K4594K6176K5394K4277K4727K6328
62118A278932K7715K8718K9909L1072L1634L1992L3124L5203L7846M1217M5710
62107A653072N0692N4941N8397O2237O6906P0939P2228O9855O4463N7259M8940
62096B329929L9338K8076J5571L112q243j8320k7148l4414m0248m5726n1590n6992
62084B133345o0585o2350o3174o3044o1144n7707n4267n1675m9107m5547m1138
62073A523607l6544l1868k6982k2308j8582j6070j4412j3002j1426r826q767q274
$$ y = [1136392, 1114716, 1094788, 1076025, 1058170, 1040610, 1022888, 1005739, 990844, 979414, 971373, 965775, 961533, 957840, 954484, 951907, 950733, 951217, 953305, 956946, 962047, 968390, 976019, 985585, 997896, 1013184, 1030897, 1049919, 1068944, 1087343, 1106144, 1127436, 1152030, 1178206, 1203600, 1227877, 1252604, 1278932, 1306647, 1335365, 1365274, 1396346, 1427980, 1459972, 1493096, 1528299, 1566145, 1607362, 1653072, 1703764, 1758705, 1817102, 1879339, 1946245, 2017184, 2089412, 2159267, 2223730, 2280989, 2329929, 2369267, 2397343, 2412914, 2416026, 2407783, 2389463, 2362315, 2327901, 2287653, 2241927, 2190337, 2133345, 2072760, 2010410, 1947236, 1884192, 1823048, 1765341, 1711074, 1659399, 1610292, 1564745, 1523607, 1487063, 1455195, 1428213, 1405905, 1387323, 1371253, 1356841, 1343839, 1332413, 1322587, 1313820, 1305546]
62061A305546p172m198L78M969Q552J1358J3793J5679J6777J6932J5468J1695
62049A409777O485K188K03l02n74l45J118K973L229R09l230p824j1729j3972j4061
62034A374845j2491j0323q142n854l194jL803P937J1763J5023J8120K1244K3819
62021A436549K5508K7061K9213L1399L2818L4204L7040M1152M4636M6398M7227
62010A833205M8011M8452M8319M8520M9704N0876N0774M9911M9767N0197M9101
61999B376837M4994L8589L1407K3781J5202O045k299r214j5863k3580l1845l8902
61987B415152m4403m9938n6147o0653o0703n7429n5302n6758n9207n8632n4649
61976A801331n0326m7864m6503m4482m1158l6791l1942k7886k6282k7155k8044
$$ y = [1305546, 1298374, 1294176, 1294554, 1299523, 1308075, 1319433, 1333226, 1348905, 1365682, 1382614, 1398082, 1409777, 1416262, 1418450, 1418653, 1418351, 1417777, 1417432, 1418550, 1421523, 1424752, 1425661, 1422431, 1414607, 1402878, 1388906, 1374845, 1362354, 1352031, 1343889, 1338035, 1334841, 1334840, 1338643, 1346580, 1358343, 1373366, 1391486, 1412730, 1436549, 1462057, 1489118, 1518331, 1549730, 1582548, 1616752, 1653792, 1694944, 1739580, 1785978, 1833205, 1881216, 1929668, 1977987, 2026507, 2076211, 2127087, 2177861, 2227772, 2277539, 2327736, 2376837, 2421831, 2460420, 2491827, 2515608, 2530810, 2536855, 2534556, 2525342, 2509479, 2485899, 2454054, 2415152, 2370749, 2320811, 2264664, 2204011, 2143308, 2085879, 2030577, 1973819, 1914612, 1855980, 1801331, 1751005, 1703141, 1656638, 1612156, 1570998, 1534207, 1502265, 1474379, 1448097, 1420942, 1392898]
61965A392898k6372k2352j8552j6788j6535j6460j6314j6680j7512j7942j7492
61954A189899j6601j5642j4031j1178q056o736p786r012p801m312j212l66r09
61941A086257r10K84J946L184L308J838q11l066l720l469m027n918q117r696j0740
61926A046343j1666j2678j3990j5550j6427j5615j3756j2835j3537j4103j2718
61915H93468j0154q769r400j0488j0236q538o444m541k549m27P88o9k435l921
61901H16285k834k68J410J697K043K961L192K454K884O165J0780J4033J5618J7148
61887H93568J9110K0581K1574K3209K5511K7234K8264L0070L3200L6224L8010
61876A196555L9195M0552M1570M1749M1667M1572M0457L7806L4843L2579L0017
$$ y = [1392898, 1366526, 1344174, 1325622, 1308834, 1292299, 1275839, 1259525, 1242845, 1225333, 1207391, 1189899, 1173298, 1157656, 1143625, 1132447, 1124391, 1117655, 1109869, 1100857, 1093056, 1088744, 1087532, 1087166, 1086257, 1085347, 1085631, 1087577, 1090761, 1094069, 1095907, 1095096, 1092030, 1088310, 1084841, 1080814, 1074896, 1066779, 1057083, 1046343, 1034677, 1021999, 1008009, 992459, 976032, 960417, 946661, 933826, 920289, 906186, 893468, 883314, 874545, 865145, 854657, 844421, 835883, 829439, 824898, 822349, 821922, 822710, 822641, 820206, 816285, 813451, 813183, 814593, 816290, 818333, 821294, 824486, 826940, 829824, 835989, 846769, 860802, 876420, 893568, 912678, 933259, 954833, 978042, 1003553, 1030787, 1059051, 1089121, 1122321, 1158545, 1196555, 1235750, 1276302, 1317872, 1359621, 1401288, 1442860, 1483317, 1521123, 1555966, 1588545, 1618562]
61865A618562K6011K1590J8251J4999R541K155m151p484q928j0056j0664r884
61853A659942p879n216j843K169N857Q518J0917J4165J7893K0615K1532K0907
61841A767577J8850J4869Q900J925m721j0290j4703j8273k1517k4803k7976l0637
61829A659201l2791l4712l5985l5543l3153l0272k8458k7324k5202k1835j9104
61818A334822j8572j9481k0056j9798j9201j7963j5184j1342q349p058o086l788
61806A167944l69K969O080R847J4457J8767K1482K2422K2652K3725K6599L0892
61794A367467L5436L9742M4391M9708N4745N8337O0596O2474O4185O4875O3687
61783A965643O0399N5198M8571M1281L3746K5548J6271O661j812q444j3552j7384
$$ y = [1618562, 1644573, 1666163, 1684414, 1699413, 1708954, 1711109, 1706958, 1699474, 1690546, 1680490, 1669826, 1659942, 1652063, 1646847, 1645004, 1647173, 1653030, 1661548, 1672465, 1686630, 1704523, 1725138, 1746670, 1767577, 1786427, 1801296, 1810196, 1812121, 1807400, 1797110, 1782407, 1764134, 1742617, 1717814, 1689838, 1659201, 1626410, 1591698, 1555713, 1520170, 1487017, 1456745, 1428287, 1400963, 1375761, 1353926, 1334822, 1316250, 1296769, 1276713, 1256915, 1237714, 1219751, 1204567, 1193225, 1184876, 1177818, 1171732, 1167944, 1167575, 1170544, 1176624, 1186471, 1200928, 1219695, 1241177, 1263599, 1286251, 1309976, 1336575, 1367467, 1402903, 1442645, 1487036, 1536744, 1591489, 1649826, 1710422, 1772896, 1837081, 1901956, 1965643, 2026042, 2081240, 2129811, 2171092, 2204838, 2230386, 2246657, 2253318, 2251506, 2243062, 2229510, 2212126]
61771B212126j9553j9695j7899j4438r708m511L16M616Q574J1723J3080J2361
61759B176992J0187O806J503o272j5833k5772l5003m3018m9700n5322o0250o4236
61747A840082o6368o6096o3930o0876n7514n3967n0347m6828m3443m0115l6852
61736A253746l3806l1146k8750k6008k2341j8292j5470j4743j4927j4271j2778
61725A021214j1813j1547j0522q135n946n566o460o904o292n356m658l982k915
61712I31118j385J64P66j72j567j311J004L067K840J383J191K457L157K548K350
61697I47610L886O023P056P111P245P216N800L022O12p9L68L66p40k259l344l959
61681I85934m377m283l137j482j021k691n176o196n056l032j419l23M19L63o09
$$ y = [2212126, 2192573, 2172878, 2154979, 2140541, 2130833, 2126322, 2126638, 2131254, 2139828, 2151551, 2164631, 2176992, 2187179, 2193985, 2195488, 2189216, 2173383, 2147611, 2112608, 2069590, 2019890, 1964568, 1904318, 1840082, 1773714, 1707618, 1643688, 1582812, 1525298, 1471331, 1420984, 1374156, 1330713, 1290598, 1253746, 1219940, 1188794, 1160044, 1134036, 1111695, 1093403, 1077933, 1063190, 1048263, 1033992, 1021214, 1009401, 997854, 987332, 979197, 973251, 967685, 961225, 954321, 948029, 942673, 938015, 934033, 931118, 929733, 929897, 930663, 930491, 928924, 927613, 928617, 931684, 934524, 935907, 937098, 939555, 942712, 945260, 947610, 951496, 957519, 964575, 971686, 978931, 986147, 991947, 994969, 995581, 995502, 995870, 996236, 995496, 993237, 989893, 985934, 981557, 977274, 974137, 972655, 971634, 968943, 963767, 957571, 952515, 949483, 948064, 947741, 948160, 948523, 947914]
61666I47914j402q01R00K298K690K596K504K142J295M96K51J47n14j462j710j144
61650I56200j001k241m023m712m130l861n026o672p147o461o251p365q557q124
61636H80629o210m664m822o094o988o867o323o034n849n231m168l251k856k618
61622H08654j911o66M56P11l5j173j850j630o82O74K310L937M611L330L84k367
61606H14753l128j868o6R35Q48L1j040j681j080R17L269M474L942K519J612J941
61590H26378L178M605N802O608O807O368N879O188P312Q221Q028O977N832M767
61576I12950L478K107J159N00p07k757m809n931o319o935q178r355r432q069o010
61561H51692m528m342m958n297m947m425m109l577k463j463j689l221n054o544
$$ y = [947914, 946512, 945711, 946611, 948909, 951599, 954195, 956699, 958841, 960136, 960632, 960883, 961030, 960516, 959054, 957344, 956200, 955199, 952958, 948935, 944223, 940093, 936232, 931206, 924534, 917387, 910926, 904675, 897310, 888753, 880629, 874419, 869755, 864933, 858839, 851851, 844984, 838661, 832627, 826778, 821547, 817379, 814128, 811272, 808654, 806743, 806077, 806533, 807244, 807209, 806036, 804186, 802556, 801874, 802548, 804858, 808795, 813406, 816736, 817120, 814753, 811625, 809757, 809691, 810626, 811474, 811505, 810465, 808784, 807704, 808621, 811890, 816364, 820306, 822825, 824437, 826378, 829556, 834161, 839963, 846571, 853378, 859746, 865625, 871813, 879125, 887346, 895374, 902351, 908183, 912950, 916428, 918535, 919694, 920194, 919487, 916730, 911921, 905990, 899671, 892736, 884558, 875203, 865771, 857702, 851692, 847164, 842822, 837864, 832567, 827620, 823195, 819086, 815509, 813046, 811583, 809894, 806673, 801619, 795075]
61547G95075q116j0201j2137j2752j1809j0272r276r226r849j0565j0654r591
61535F70627p688o079n637o002o162n881n980o975q077q098p017n968n661n499
61521E79903m548k897j594j457k401l805n054n626n154l779k283j483j481j729
61507E36612j802j849k167k599k609j872n97O44J190N81j084k903l633k682n83
61492E14647J560K968L428L006J928O88j56m17k76K11J233K614L471L063J854
61477E39822J177J665K579K933K727K560K433J781N67n07r35r22p65n36n94j465
61461E52520k722k901j374M32P03n08j844k789l792m584m094k321o64K1K40L13
61445E26636l51j582j836n44M86l52j667j009J265K356J081o56p83N22J911K676
$$ y = [795075, 786959, 776758, 764621, 751869, 740060, 729788, 720512, 711286, 701437, 690872, 680218, 670627, 662939, 656860, 651223, 645221, 639059, 633178, 627198, 620223, 612146, 604048, 597031, 591063, 585402, 579903, 575355, 572458, 570864, 569407, 567006, 563201, 558147, 552521, 547367, 543588, 541305, 539822, 538341, 536612, 534810, 532961, 530794, 528195, 525586, 523714, 523117, 523761, 524951, 525532, 524448, 521545, 517912, 515230, 514647, 516207, 519175, 522603, 525609, 527537, 528225, 528069, 527652, 527376, 527587, 528820, 531434, 534905, 537968, 539822, 540999, 542664, 545243, 548176, 550903, 553463, 555896, 557677, 558244, 557737, 556802, 555880, 555115, 554579, 553985, 552520, 549798, 546897, 545523, 545955, 546658, 546150, 544306, 541517, 537725, 533141, 529047, 526726, 526062, 526083, 526323, 526636, 526285, 524703, 522867, 522323, 522809, 522457, 520790, 519781, 521046, 523402, 524483, 523827, 523044, 523566, 525477, 528153]
61429E28153K581J459m0n09K86O49p73k849l416k174p05J9O10J650K529K465J717
61412E31652J093P70K76o35j647k388k828l030k749j599K85J956K338J261l60
61397E24395j466j711j397p84J52J425K757L652L762L257K842L168M141M924M761
61382E53878L705K526J982K290L154M126M890N261N151M826N093O552Q417Q747
61368F20598O617L497J663J542J754J623K127L917N730N875M441K993K486K504
61354F67367K310J755J083N82M52O02O01J47n25j074j495j767j525p19k12q15
61338F66767j917k103j122k63n16j289j414o83K47R38J418J623J344P15K41J61
61322F64147J20l10r58j095j32J869M285O317P253O713N045L316K496K600L041
$$ y = [528153, 530734, 532193, 532153, 531644, 531930, 532579, 531806, 528957, 525541, 523367, 522662, 522681, 523291, 524941, 527470, 529935, 531652, 532745, 533515, 533791, 533156, 531509, 529121, 526293, 523263, 520514, 518915, 519200, 521156, 523494, 524755, 524395, 522929, 521218, 519821, 519037, 519189, 520614, 523371, 527023, 530785, 534042, 536884, 540052, 544193, 549117, 553878, 557583, 560109, 562091, 564381, 567535, 571661, 576551, 581812, 586963, 591789, 596882, 603434, 611851, 620598, 627215, 630712, 632375, 633917, 635671, 637294, 639421, 643338, 649068, 654943, 659384, 662377, 664863, 667367, 669677, 671432, 672515, 673097, 673549, 674151, 674752, 674899, 674374, 673300, 671805, 670038, 668513, 667794, 667582, 666767, 664850, 662747, 661625, 661362, 660846, 659557, 658143, 657460, 657707, 658645, 660063, 661686, 663030, 663745, 663986, 664147, 664267, 663957, 662999, 661904, 661772, 663641, 667926, 674243, 681496, 688209, 693254, 696570, 699066, 701666, 704707]
61307G04707L657M747O024O501N809M849M528M565M307M093M769O289P851R154
61293G81850J0341J0937J0194Q632P937Q856J0428J1764J3358J5722J7710J7435
61281I25164J4458J0239O691M962N060N870N799M309K664K385L163L139J261j540
61267I93624l690m719n275n906o502o741o644o536o578o540o179n624n172m635
61253I12883l375j158J327L127L962M248M528N169O345P913R430J0638J1667J2527
61239I89231J2768J1981J0262P771M341J43l669n849o433o407o243n666m818m426
61225I92986m498l989k394p48j12K13J786M566O630O661N792O169Q220J0287J0996
61210A042565J0999J1775J3405J4541J4482J4017J3901J3602J2400J0902J0330
$$ y = [704707, 708364, 713111, 719135, 725636, 731445, 736294, 740822, 745387, 749694, 753787, 758556, 764845, 772696, 781850, 792191, 803128, 813322, 821954, 829891, 838747, 849175, 860939, 874297, 890019, 907729, 925164, 939622, 949861, 956552, 961514, 966574, 972444, 978243, 982552, 985216, 987601, 990764, 993903, 995164, 993624, 989934, 985215, 979940, 974034, 967532, 960791, 954147, 947611, 941033, 934493, 928314, 922690, 917518, 912883, 909508, 908350, 909677, 912804, 916766, 921014, 925542, 930711, 937056, 944969, 954399, 965037, 976704, 989231, 1001999, 1013980, 1024242, 1032013, 1036354, 1036497, 1032828, 1026979, 1020546, 1014139, 1007896, 1002230, 997412, 992986, 988488, 984499, 982105, 981357, 981245, 981458, 983244, 987810, 994440, 1001101, 1006893, 1013062, 1021282, 1031569, 1042565, 1053564, 1065339, 1078744, 1093285, 1107767, 1121784, 1135685, 1149287, 1161687, 1172589, 1182919]
61199A182919J0869J1813J3046J4976J7105J8083J7448J6027J4223J1275O977
61188A334761K833M02p81k454n373q738j1431j2897j3142j2751j2659j3116j3269
61175A231385j2465j1456j1285j1484j0812r488r074r852r884p517l716r06k01
61162A123245o75r42n72p8j53r12j591j251J2J010R52N29Q72J919K639K706K945
61145A130655L924N001N326N193N655P006Q393Q977Q848Q590Q558R127J1051J4672
61131A240976J8867K1746K2643K2607K2488K1511J8648J4738J1864J0684R650
61120A436422P352M537K941K784K558J284r2j76O69N42j493m093n505n977p227
61105A434526r684j1780j2360j2340j3020j4108j4849j6003j8654k1500k1671
$$ y = [1182919, 1193788, 1205601, 1218647, 1233623, 1250728, 1268811, 1286259, 1302286, 1316509, 1327784, 1334761, 1337594, 1337996, 1337215, 1334761, 1329388, 1320650, 1309219, 1296322, 1283180, 1270429, 1257770, 1244654, 1231385, 1218920, 1207464, 1196179, 1184695, 1173883, 1164395, 1155321, 1145469, 1135585, 1128068, 1124352, 1123446, 1123245, 1122570, 1121628, 1121056, 1120978, 1120825, 1119913, 1118322, 1117071, 1117083, 1118093, 1119045, 1119574, 1120446, 1122365, 1125004, 1127710, 1130655, 1134579, 1139580, 1144906, 1150099, 1155754, 1162760, 1171153, 1180130, 1188978, 1197568, 1206126, 1215253, 1226304, 1240976, 1259843, 1281589, 1304232, 1326839, 1349327, 1370838, 1389486, 1404224, 1416088, 1426772, 1436422, 1443774, 1448311, 1451252, 1454036, 1456594, 1457878, 1457786, 1457610, 1458279, 1458821, 1457328, 1453235, 1447730, 1441753, 1434526, 1424842, 1413062, 1400702, 1388362, 1375342, 1361234, 1346385, 1330382, 1311728, 1290228, 1268557]
61094A268557j8611j5116j3631j3334j2050r466o875m794k755r49l42j139k496
61081A166999l951n904q343j0214j0655j0101r577r345q855p844o822o313n967
61068A063108m820k492K90K728N098Q083J1168J2859J2901J3073J4907J7571J9198
61055A173672J9690K0680K2960K5500K7193K8102K8398K7464K5129K2892K2491
61044A444171K3614K4173K2981K0969J9415J7905J5015J0517N893K501J1k922
61032A604243o898j1186j4554j6285j6669j6903j8160k0305k1815k1572k0215
61021A419681j9016j7971j6234j3988j2433j1796j1029r726q662p881o099l095
61009A281751r16j101k104j339J259L667N018O264P982R637J1160J3274J5958
$$ y = [1268557, 1249946, 1234830, 1221199, 1207865, 1195815, 1186349, 1179474, 1174680, 1171925, 1170976, 1170634, 1169495, 1166999, 1163048, 1157144, 1148801, 1138587, 1127932, 1117831, 1108254, 1098909, 1090054, 1082210, 1075388, 1069075, 1063108, 1058288, 1055796, 1056086, 1058814, 1063912, 1071995, 1083163, 1096022, 1108923, 1121996, 1136903, 1154474, 1173672, 1193362, 1214042, 1237002, 1262502, 1289695, 1317797, 1346195, 1373659, 1398788, 1421680, 1444171, 1467785, 1491958, 1514939, 1535908, 1555323, 1573228, 1588243, 1598760, 1604653, 1607154, 1607165, 1604243, 1597345, 1586159, 1571605, 1555320, 1538651, 1521748, 1503588, 1483283, 1461468, 1439896, 1419681, 1400665, 1382694, 1366460, 1352472, 1340039, 1328243, 1317214, 1307488, 1298826, 1290945, 1284846, 1281751, 1280835, 1279734, 1277630, 1276291, 1277550, 1281217, 1286235, 1292499, 1300481, 1310118, 1321278, 1334552, 1350510]
60996A350510J8119J9245J9921K0534K0974K1945K4910L0008L5388L9391M2315
60985A643260M5274M8476N1567N4777N8752O3623O8869P3833P8188Q2332Q7335
60974B356286R3888J01463J09295J17865J28068J39121J48983J57201J65722J76298
60964C694190J88565K01304K14073K26860K39548K52818K68363K87327L09599
60955E882647L35201L64865L98392M34268M72058N13911N62808O21154O91915
60946A0277219P78449Q81377R98073J127389J272460J436780J621563J831125
60938B0224435K076510K367007K700552L067622L452333L802441L990775L842882
60930D5524557L258070K328431J321450N18522N7939q1158J2357K37648M50219
$$ y = [1350510, 1368629, 1387874, 1407795, 1428329, 1449303, 1471248, 1496158, 1526166, 1561554, 1600945, 1643260, 1688534, 1737010, 1788577, 1843354, 1902106, 1965729, 2034598, 2108431, 2186619, 2268951, 2356286, 2450174, 2551637, 2660932, 2778797, 2906865, 3045986, 3194969, 3352170, 3517892, 3694190, 3882755, 4084059, 4298132, 4524992, 4764540, 5017358, 5285721, 5573048, 5882647, 6217848, 6582713, 6981105, 7415373, 7887431, 8401342, 8964150, 9585304, 10277219, 11055668, 11937045, 12935118, 14062507, 15334967, 16771747, 18393310, 20224435, 22300945, 24667952, 27368504, 30436126, 33888459, 37690900, 41681675, 45524557, 48782627, 51111058, 52432508, 52951030, 53008969, 52927811, 52940168, 53177816, 53628035]
60921E3628035M43403M0933p60908j758611k667957l294293l600400l652988l539497
60912C4837717l328871l070574k797591k526044k261164k006657j767387j546876
60904A5532553j347626j173284j026753r06284q06148p21089o48074n84561n27990
60895G790744m77327m32986l94512l59798l27004k96058k67910k43319k22764
60886D769066k06473j93962j83981j75312j67376j59940j52660j45046j36841
60877C247475j28451j20917j14938j09809j04114r7714r2140q8294q4761p9634
60867B226703p3399o8367o5338o2541n8368n3656n0179m7996m5659m2626l9877
60856A618697l7935l5730l2281k8524k6283k5826k5679k4886k4016k3615k2954
$$ y = [53628035, 54071438, 54112371, 53351463, 51592852, 48924895, 45630602, 42030202, 38377214, 34837717, 31508846, 28438272, 25640681, 23114637, 20853473, 18846816, 17079429, 15532553, 14184927, 13011643, 11984890, 11078606, 10272458, 9551369, 8903295, 8318734, 7790744, 7313417, 6880431, 6485919, 6126121, 5799117, 5503059, 5235149, 4991830, 4769066, 4562593, 4368631, 4184650, 4009338, 3841962, 3682022, 3529362, 3384316, 3247475, 3119024, 2998107, 2883169, 2773360, 2669246, 2571532, 2479392, 2391098, 2306337, 2226703, 2153304, 2084937, 2019599, 1957058, 1898690, 1845034, 1794855, 1746859, 1701200, 1658574, 1618697, 1580762, 1545032, 1512751, 1484227, 1457944, 1432118, 1406439, 1381553, 1357537, 1333922, 1310968]
60845A310968k1269j9279j8232j8069j7705j6731j5635j4621j3496j2610j2638
60834A130683j3285j3426j2688j1754j1033j0318r946j0805j2686j3896j3271
60823I97575j1484r923r391j0153j1809j2646j0866p290m963n092n318l528j138
60810H93974m75q16J78K325L481L483M361O478P642O706N325N182N816O295O789
60795I56744P303O805N133L879M021M336L703L235M245N542M984K736P50k28j002
60780A012186j681j473p32j048k810m460m744m156l564k824j633m52L16J167K667
60765I86759M509O172P826R818J1821J3290J4333J5443J6670J7616J7997J7823
60753A140077J7361J7131J7391J7280J5310J1356P407N339M545K855m96m057o275
$$ y = [1310968, 1289699, 1270420, 1252188, 1234119, 1216414, 1199683, 1184048, 1169427, 1155931, 1143321, 1130683, 1117398, 1103972, 1091284, 1079530, 1068497, 1058179, 1048233, 1037428, 1024742, 1010846, 997575, 986091, 976168, 966777, 956624, 944815, 932169, 921303, 914013, 909050, 903958, 898640, 895112, 893974, 893499, 892683, 892861, 895186, 898667, 902150, 906511, 912989, 920631, 927337, 932662, 937844, 943660, 949955, 956744, 964047, 970852, 975985, 979864, 983885, 988221, 991924, 995159, 999404, 1004946, 1009930, 1012666, 1013416, 1013188, 1012186, 1010505, 1009032, 1008300, 1007252, 1004442, 999982, 995238, 991082, 987518, 984694, 983061, 982609, 982925, 984092, 986759, 991268, 997440, 1005266, 1015084, 1026905, 1040195, 1054528, 1069971, 1086641, 1104257, 1122254, 1140077, 1157438, 1174569, 1191960, 1209240, 1224550, 1235906, 1243313, 1248652, 1253197, 1256052, 1255556, 1251499, 1245224]
60740A245224p235p936q938j0248j1761j3196j4059j4233j4169j4126j3666j2490
60728A103167j1278j1075j1914j2723j2606j1842j1417j1877j2717j2912j2045
60717I70761j0830j0318j0625j0848j0356r533r018q724q233p705p646q026q336
60704H50563q514r053j0087j1030j1278j0767r743q643q252r066j0121r467o558
60691G27984l437k395l014k860r77Q21O33j038k431l051l570l843k870r07P7j083
60675F98039k967l548k989l087m308n001l821j505L23J093J248J107N85l18j460
60660F73391k610l183k496q50K49l04j917l275m021m543m785m576m649n792p094
60645F23545o720m648l040l286m217m153l317k970l138k710j268M66J769K393
$$ y = [1245224, 1237989, 1230053, 1221115, 1210867, 1199106, 1185910, 1171851, 1157618, 1143449, 1129323, 1115657, 1103167, 1091889, 1080814, 1068900, 1056177, 1043571, 1031729, 1020312, 1008435, 995718, 982806, 970761, 959931, 949613, 938988, 928140, 917784, 908251, 899233, 890509, 882276, 874571, 866925, 858899, 850563, 842049, 832996, 822909, 811879, 800601, 789834, 780091, 771448, 763196, 754130, 744009, 734542, 727984, 724547, 722152, 719138, 716278, 715301, 716122, 716755, 715717, 713286, 710235, 706665, 702822, 699952, 699045, 699122, 698039, 695072, 691524, 688535, 685448, 681140, 676139, 672318, 670813, 671136, 672229, 673477, 674584, 675169, 674851, 673391, 670781, 667598, 665102, 664252, 664501, 664197, 662280, 659005, 654984, 650441, 645656, 641080, 636431, 630639, 623545, 616825, 612177, 609137, 605851, 601634, 597481, 594164, 591194, 588056, 585346, 584078, 584544, 586313, 588706]
60631E88706K121R47l58p84k48M57Q90J283J660J523O55l51o69J09J889M101N720
60614F07651N933N065M424M941O215P048O563M786K537Q67K65K63J0o98j210p61
60598F53899Q62L244N518O681O388N486N276O061O903O954O432O003N722N123
60584G30552M096L096K460J847N13j880m751p002q038q229q236q095p344n954
60570F83035m570l806l731m045m378m333l829l466l967m987n154l694j561l86
60556F31128n79r93l41J443L241L885L300K580K671L131K712J213n3n2O17R08
60540F54811J112K209L837M368L209J793J684K568K890J905M13k58N09K175L359
60525F86584K997J567R23K371N222P740R191J0146J1111J1804J2078J2556J3797
$$ y = [588706, 590827, 591774, 591416, 590632, 590384, 590841, 591731, 593014, 594674, 596197, 596852, 596501, 595832, 595941, 597830, 601931, 607651, 613584, 618649, 623073, 628014, 634229, 641277, 647840, 652626, 655163, 656030, 656295, 656558, 656568, 655870, 654660, 653899, 654761, 658005, 663523, 670204, 676592, 682078, 687354, 693415, 700318, 707272, 713704, 719707, 725429, 730552, 734648, 737744, 740204, 742051, 742564, 740684, 735933, 728931, 720893, 712664, 704428, 696333, 688989, 683035, 678465, 674659, 670928, 666883, 662505, 658172, 654343, 650877, 646910, 641923, 636769, 633075, 631514, 631128, 630549, 629556, 629215, 630658, 633899, 637784, 641084, 643664, 646335, 649466, 652178, 653391, 653338, 653286, 653903, 654811, 655923, 658132, 661969, 666337, 669546, 671339, 673023, 675591, 678481, 680386, 680799, 680541, 681050, 683225, 686584, 689581, 691148, 692071, 694442, 699664, 707404, 716595, 726741, 737852, 749656, 761734, 774290, 788087]
60512G88087J5400J6607J7473J8862K1416K4893K8395L0889L1778L1400L0838
60501A056038L0712L0205K7848K3246J7421J1396N214j188o755r736r321o260
60489A168820k005K445O793J1087J5427J9815K4146K8327L2456L6905M2131M8271
60477A434618N4667N9894O2633O2586O0137N5016M6117L3311J8788N595m977j3491
60465A874894k0095k3692k4045k3211k3568k5007k5452k3791k0956j8118j5257
60454A631702j2004q583n116r14M560J0581J6008K0850K6042L1864L7688M3322
60442A796000M9651N7559O7000P7435Q8503R9721J10130J18843J25576J30107
60432B720525J31588J29108J22789J13776J03137R1221P7986O3353M7108K8915
$$ y = [788087, 803487, 820094, 837567, 856429, 877845, 902738, 931133, 962022, 993800, 1025200, 1056038, 1086750, 1116955, 1144803, 1168049, 1185470, 1196866, 1202080, 1200892, 1194137, 1184401, 1175080, 1168820, 1166815, 1169260, 1176053, 1187140, 1202567, 1222382, 1246528, 1274855, 1307311, 1344216, 1386347, 1434618, 1489285, 1549179, 1611812, 1674398, 1734535, 1789551, 1835668, 1868979, 1887767, 1893362, 1888385, 1874894, 1854799, 1831107, 1807062, 1783851, 1760283, 1735276, 1709824, 1686033, 1665077, 1646959, 1631702, 1619698, 1611115, 1605999, 1605085, 1609645, 1620226, 1636234, 1657084, 1683126, 1714990, 1752678, 1796000, 1845651, 1903210, 1970210, 2047645, 2136148, 2235869, 2345999, 2464842, 2590418, 2720525, 2852113, 2981221, 3104010, 3217786, 3320923, 3412144, 3490130, 3553483, 3600591, 3629506]
60422C629506Q658j3361l6561o0250q3618j05781j25614j41531j51806j55784
60412B763858j54642j50373j44103j35929j26187j16010j06450r7775q9938q2910
60402A559541p6207o8904o0907n3539m8051m3951l9777l5209l1348k8877k7039
60391A045732k4861k2531k0844j9877j8961j7703j6314j4958j3387j1524r898
60380H54874r134r148r182q570p240n581m126l460l979n426o824p319p031o774
60366G61080o887o795n933m785m486n457o766p028n802l941k738k780l687m572
60352F89423m632l535j687j51J95m37j054j225j472k018k009p84P02R54J85L7
60336F72492R71J446L70j040r85K03N79o47k153k453j636p62l14K27J456L029
$$ y = [3629506, 3638164, 3624803, 3588242, 3527992, 3444374, 3338593, 3212979, 3071448, 2919642, 2763858, 2609216, 2458843, 2314740, 2178811, 2052624, 1936614, 1830164, 1732389, 1642451, 1559541, 1483334, 1414430, 1353523, 1299984, 1251933, 1207982, 1168205, 1132996, 1101648, 1072771, 1045732, 1020871, 998340, 977496, 957619, 938658, 920955, 904641, 889683, 876296, 864772, 854874, 845740, 836592, 827410, 818840, 811600, 806019, 801893, 798433, 794454, 789028, 782204, 774885, 767854, 761080, 754193, 747398, 741465, 736680, 732194, 726737, 719971, 712943, 707141, 703200, 700462, 697682, 693995, 689423, 684791, 681256, 679569, 679418, 679613, 679176, 678122, 676897, 675425, 673407, 671398, 670614, 671316, 672270, 672455, 672492, 673463, 674909, 675279, 674239, 673254, 673457, 674036, 673389, 671236, 668783, 667147, 666385, 666071, 666298, 667754, 670783]
60320F70783L673K442j1j771j631k02J184J941K023J197k56p29J096L892M602
60305F88233K265o46j428k40J056J804K613L324K962J710J199K234L552L578K391
60290G14607J211O60M84M10M31M83O43J340K628L488K835J116o8kM83N82N84R12
60272G32827J190J089J148J804K429K459K731M268O273O916O097N595O263O730
60258G87819N595L607K638L421N212O987Q277R392J1400J5065J9402K2277K3181
60245I24273K4223K7458L2273L6604L9470M0779L9571L4609K6423J6845O529n106
60233A243951j7183k6678l1480l2780l3349l4375l4960l3860l0700k5971k0844
60222I21771j6774j4531j3670j3289j3016j2858j2521j1505r743p704n854m399
$$ y = [670783, 674456, 676898, 676887, 675116, 673485, 673283, 674467, 676408, 678431, 679628, 679372, 678643, 679739, 683631, 688233, 690498, 689852, 688424, 688184, 689240, 691044, 693657, 696981, 699943, 701653, 702852, 705086, 708638, 712216, 714607, 715818, 716478, 716962, 717372, 717803, 718286, 718929, 720269, 722897, 726385, 729220, 730336, 730268, 730266, 730749, 731331, 731915, 732827, 734017, 735106, 736254, 738058, 740487, 742946, 745677, 749945, 756218, 763134, 769231, 774826, 781089, 787819, 793414, 797021, 799659, 803080, 808292, 815279, 823556, 832948, 844348, 859413, 878815, 901092, 924273, 948496, 975954, 1008227, 1044831, 1084301, 1125080, 1164651, 1199260, 1225683, 1242528, 1249057, 1243951, 1226768, 1200090, 1168610, 1135830, 1102481, 1068106, 1033146, 999286, 968586, 942615, 921771, 904997, 890466, 876796, 863507, 850491, 837633, 825112, 813607, 803864, 796160, 790306, 785907]
60210G85907l400k833k479k070j621j506k033k913l316k748j811j712k720l643
60196G51102l208j670m39l84j121j878k359k725l082l187k476o63J490K459J544
60181G33403j60r22k28J118K227K720K515J961J891K640L297K943K232K588L972
60166G62197M859M501L797L672L862L824L562L088K104Q65L74J124K374L179L405
60151H06787L388L404L727M325M372L164J683J848L759N294N070M183M000L918
60137H58922K815J345R12J290J156M34L21J169K021K229K045J479N9j956l258
60122H70983k977j604q9J282K604L534L260J329j653m173m934m043k807k210k014
60107H56488j579q84k88J35N12Q42J202J748K134J719Q44R48K657M631N337N141
$$ y = [785907, 782507, 779674, 777195, 775125, 773504, 771998, 769965, 767052, 763736, 760988, 759177, 757465, 754745, 751102, 747894, 746224, 745785, 745401, 744280, 742402, 740043, 737318, 734236, 731049, 728573, 727910, 729400, 731859, 733403, 733243, 732321, 732093, 733211, 735438, 738158, 740673, 742634, 744525, 747165, 750462, 753405, 755637, 758225, 762197, 767056, 771557, 775354, 779026, 782888, 786712, 790274, 793362, 795466, 796331, 796705, 797829, 800203, 803382, 806787, 810175, 813579, 817306, 821631, 826003, 829167, 830850, 832698, 836457, 841751, 846821, 851004, 855004, 858922, 861737, 863082, 863994, 865284, 866440, 866874, 867195, 868364, 870385, 872614, 874659, 876138, 876197, 874241, 870983, 868006, 866402, 866313, 867595, 870199, 873733, 876993, 878322, 876669, 872496, 867562, 863519, 860712, 858502, 856488, 854909, 854025, 853737, 853872, 854384, 855226, 856428, 858176, 860310, 862029, 862873, 863821, 866478, 871109, 876446, 881587]
60091H81587N486O740Q200R689J1545J3222J3544J2553J1751J2051J2532J1762
60079A010662R669P522O518O678P009O576N354L750J550j699n096o531n260l189
60065A043513k483k992l274l132l238l152j733O64K400K918L141L484L385L009
60051A042510L526N162O647P178P426P973Q210P499O118M456K462M10j119k437
60037A106021m484o898p911o873n238m184l097j536q27j898l067j983J072L779
60023A062876M945N164M740K990j26l210m837m812l976l535m513o920r368j0307
60009A029111r657q698q581r574j1364j3172j3840j2826j1093j0178j0390j0660
59997H99078j0113r048q334q484r239r541q188n241k441j488k200l140l537l447
$$ y = [881587, 887073, 893813, 902013, 911702, 923247, 936469, 950013, 962566, 974317, 986368, 998900, 1010662, 1020331, 1027853, 1034371, 1041049, 1048058, 1054634, 1059988, 1063738, 1065288, 1063589, 1058493, 1051962, 1046702, 1043513, 1041030, 1038038, 1034764, 1031632, 1028394, 1025242, 1023509, 1024173, 1026573, 1029491, 1032632, 1036116, 1039501, 1042510, 1046036, 1051198, 1057845, 1065023, 1072449, 1080422, 1088632, 1096131, 1102249, 1106705, 1109167, 1109577, 1108458, 1106021, 1101537, 1094639, 1086728, 1079855, 1074617, 1070433, 1067336, 1065800, 1064973, 1063075, 1060008, 1058025, 1059097, 1062876, 1067821, 1072985, 1077725, 1080715, 1080589, 1077379, 1072542, 1067730, 1063754, 1060219, 1055706, 1048786, 1039418, 1029111, 1019454, 1010756, 1002175, 992601, 981237, 968065, 954225, 941399, 930306, 920128, 909738, 899078, 888965, 879917, 871583, 863099, 853860, 844319, 836131, 830890, 828449, 826961, 824761, 821621, 818084, 814637]
59983H14637k563n40J518J697j33j754j421M9Q83P79N78M70m2q50j298j395j786
59966H08829k499k895l031l978o172q334q839p711o403n819n418m462l313k910
59952G37045l345l691l282k644k769l724m325l231k74L217N403N368L715J757
59938G29220K15j012j918j858m49J531K771K898K736L087L862M606N228N778O028
59923G62723N785N377N206N055M456L690L670M611N477N186L857K434J548J340
59909H20415J938L307M723N288N013M676M554M159L381K933L141L247K685K246
59895H71706K933M179M425L288J954J332R28o6j473k415k407j660p67m68j270
59880H80219k911m378m749l888k282n57O81R70L50n66j072r74o03l28l7P99K344
$$ y = [814637, 812074, 811534, 813052, 814749, 814616, 812862, 811441, 811490, 812373, 813152, 813730, 814200, 814158, 813308, 812010, 810615, 808829, 806330, 803435, 800404, 796426, 790254, 781920, 773081, 765370, 758967, 753148, 747730, 743268, 739955, 737045, 733700, 730009, 726727, 724083, 721314, 717590, 713265, 710034, 709760, 712977, 718380, 723748, 727463, 729220, 729435, 728423, 726505, 724647, 724198, 725729, 728500, 731398, 734134, 737221, 741083, 745689, 750917, 756695, 762723, 768508, 773885, 779091, 784146, 788602, 792292, 795962, 800573, 806050, 811236, 815093, 817527, 819075, 820415, 822353, 825660, 830383, 835671, 840684, 845360, 849914, 854073, 857454, 860387, 863528, 866775, 869460, 871706, 874639, 878818, 883243, 886531, 888485, 889817, 890745, 890679, 889206, 886791, 884384, 882724, 881957, 881489, 880219, 877308, 872930, 868181, 864293, 862011, 861454, 862135, 863105, 863455, 862889, 861817, 860843, 860240, 859912, 859875, 860674, 863018]
59863H63018L702L687K504J970L349N649O953O917O730O903O650N660N033N799
59849I34524P543R050R462Q432O194L940L059L335K885P10j802k734k016r78n83
59834I81021j224l166n626o277l595N81K726J844K44l0L38q7q39k58K039M694
59818I72385O299O620O346O251O474O239M590J737p56j624j279r75j060q78k10
59803A010159K25r3o60o64o0O56J398K495L854M747M707M196L956M009L911L884
59787A046720N056Q231J2612J6171J7195J5452J2040Q340N097K332L9j279j068
59774A146938L43J742K126J464O1k319o067j0572j4288j6297j7277j8361j9352
59761A048141j8877j6436j3409j1396j0164q348n949m710n537o877o667m982l443
$$ y = [863018, 866720, 870407, 872911, 874881, 878230, 883879, 890832, 897749, 904479, 911382, 918032, 923692, 928725, 934524, 942067, 951117, 960579, 969011, 975205, 979145, 982204, 985539, 988424, 989134, 987332, 984598, 982582, 981604, 981021, 979797, 976631, 971005, 964728, 961133, 961714, 964440, 966284, 966528, 966498, 966836, 966749, 965910, 965652, 967691, 972385, 978684, 985304, 991650, 997901, 1004375, 1010614, 1015204, 1016941, 1016185, 1014561, 1013282, 1012307, 1011247, 1010369, 1010159, 1010384, 1010291, 1009631, 1008967, 1008907, 1009563, 1010961, 1013456, 1017310, 1022057, 1026764, 1030960, 1034916, 1038925, 1042836, 1046720, 1051776, 1060007, 1072619, 1088790, 1105985, 1121437, 1133477, 1141817, 1146914, 1149246, 1149285, 1148006, 1146938, 1147281, 1149023, 1151149, 1152613, 1152674, 1150355, 1144288, 1133716, 1119428, 1103131, 1085854, 1067493, 1048141, 1029264, 1012828, 999419, 988023, 977859, 969511, 963562, 958852, 953315, 946438, 939771, 934789, 931346]
59748I31346k709k065j324j329k314l280l635m127n455p032q012q544q999q858
59734H63663p590o013n562o445p524p846p370o407n356m918n607o811p218o380
59720G72616n208m613m329l542k310j640k090k726k043j3J446O82j458k594j910
59705G40268r81j155j562o98J051J967J466O77O63J283J887K174K233K409L160
59690G54842M411N174M553L015J948K057K932L982M843M933L687J555j38o36m57
59675G96701m43p87j283j788k017j389K42J989K520J448j51p69j47L71m20j782
59659G92295j871m01Q04M72k95K5Q49O54k51j49J221K392K918M156O510Q011O890
59642H24230M217K596L148M918O489P078O582N596M983M746L855J927K80L45J671
$$ y = [931346, 928637, 926572, 925248, 923919, 921605, 918325, 914690, 910563, 905108, 898076, 890064, 881520, 872521, 863663, 856073, 850060, 844498, 838053, 830529, 822683, 815313, 808906, 803550, 798632, 793025, 786214, 778996, 772616, 767408, 762795, 758466, 754924, 752614, 750974, 748884, 746158, 744115, 744102, 745548, 746230, 744772, 742178, 740268, 739287, 738132, 736570, 735872, 736923, 738890, 740356, 741033, 741696, 742979, 744866, 747040, 749273, 751682, 754842, 759253, 764427, 768980, 771995, 773943, 776000, 778932, 782914, 787757, 792690, 796377, 797932, 797794, 797158, 796701, 796258, 795471, 794188, 792400, 790383, 788994, 789236, 791225, 793745, 795193, 795042, 794273, 794126, 794497, 794077, 792295, 790424, 790023, 790827, 791299, 791004, 791029, 791878, 792532, 792281, 792132, 793353, 795745, 798663, 802819, 809329, 817340, 824230, 828447, 831043, 834191, 839109, 845598, 852676, 859258, 864854, 869837, 874583, 878438, 880365, 880645, 880990, 882661]
59627H82661K667K868L133L744L696K288L71p02q00r87j966l069l044j660j56
59612H89044L7j210k824l833m050l592k547j324o68q88j497j824j541n43R82K133
59596H65855J905O59J50J401L410M683N183N648N754M472K012l1o50m23m21j090
59580H98517k437m214n646n944n574o003p542q444p057m206k286k339l156l243
59566H30426k596k151k253k349j861r28l37q95k708m891o197o114n287m739m846
59551G82274n228n388n149m581l802k968k218j610j138q43p76q92j090j286j346
59536G43959j076m94N8L00L74M72K80o94k238l436l703l421l189k943k211j045
59520G20993k60o29k029l415l710k828j719j313j591j889j784j306n93Q3K18k61
$$ y = [882661, 885328, 888196, 891329, 895073, 898769, 901057, 901428, 900726, 899926, 898939, 896973, 893904, 890860, 889200, 889044, 889081, 887871, 885047, 881214, 877164, 873572, 871025, 869701, 869033, 868145, 866648, 864824, 863283, 862740, 863722, 865855, 867760, 868419, 868569, 869970, 873380, 878063, 883246, 888894, 894648, 899120, 901132, 901101, 900451, 900028, 899607, 898517, 896080, 891866, 886220, 880276, 874702, 868699, 861157, 852713, 845656, 841450, 839164, 836825, 833669, 830426, 827830, 825679, 823426, 821077, 819216, 818288, 817951, 817056, 814348, 809457, 803260, 797146, 791859, 787120, 782274, 777046, 771658, 766509, 761928, 758126, 755158, 752940, 751330, 750192, 749349, 748573, 747681, 746591, 745305, 743959, 742883, 742389, 742447, 742747, 743121, 743593, 743873, 743179, 740941, 737505, 733802, 730381, 727192, 724249, 722038, 720993, 720733, 720104, 718075, 714660, 710950, 708122, 706403, 705090, 703499, 701610, 699826, 698520, 697927, 698010, 698228, 697967]
59504F97967n06K23J301J540J116J411K820M049L982K894J433j44j028J49L306
59489G20513O240P171O776O587O779O959P606Q999J0010R958J0512J3421J7459
59476H38990K0049K0931K1331K0181J4832N864k231o332p774q944r579q314n689
59463H93315l499k496k366k776l076k185q6J597J644O09p00k466m506n455m842
59448H62712m320n169o242o307o635q768j1131j0783p861n379m830m791m065l475
59434G72956l770m086l548k736k457k450k183j825j629j310o61M7P39J688K655
59419G51430K859K276J883K071J934Q51j80K42K014L802M713M742L979K402N94
59404G85612l01L01J694K649K706K462K643L313M082M719N166N170M613M222N173
$$ y = [697967, 697461, 697684, 698985, 700525, 701641, 703052, 705872, 709921, 713903, 716797, 718230, 718086, 717058, 717207, 720513, 726753, 733924, 740700, 747287, 754066, 761025, 768631, 777630, 787640, 797598, 808110, 821531, 838990, 859039, 879970, 901301, 921482, 936314, 942178, 939947, 933615, 925841, 916897, 907318, 899004, 893315, 889816, 887320, 884954, 882178, 879102, 876917, 876831, 878428, 880072, 880681, 879981, 877515, 873009, 867554, 862712, 858392, 853223, 846981, 840674, 834039, 825271, 814140, 803357, 795496, 790117, 785287, 780496, 776431, 772956, 769186, 765100, 761552, 758816, 756359, 753909, 751726, 749901, 748272, 746962, 746301, 746348, 747087, 748775, 751430, 754289, 756565, 758448, 760519, 762453, 763304, 763124, 763366, 765380, 769182, 773895, 778637, 782616, 785018, 785612, 785311, 785612, 787306, 789955, 792661, 795123, 797766, 801079, 805161, 809880, 815046, 820216, 824829, 829051, 834224]
59389H34224P567R855J0294Q759O743N799O194O685N545K304j384l340l471l798
59375H91976n575p585q152p479o712n761l679p60J413K009J822K026L111M994
59361H61648P184Q888R806J0745J2672J5430J8247K1095K4492K8279L1568L3465
59349A083519L2817K8072J8987Q066j389q295j3257j5668j3987q870l350P81M200
59336A111626O609M918k909j3921k2570k6257k6721k6669k6996k7020k5667k2257
59324I02166j7281j2445r094o868m710k780k186l030l988l846k460q9L138O619
59310H43146Q971R096P357N349M504N023O020O566O514O388O653P329Q073Q351
59296I39340P919P520Q581J1261J3473J3188J1528J1729J4749J7904J8735J8266
$$ y = [834224, 841791, 851646, 861940, 870699, 877442, 883241, 889435, 896120, 901665, 903969, 902585, 899245, 895774, 891976, 886401, 878816, 870664, 863185, 856473, 850712, 847033, 846273, 847686, 849695, 851517, 853543, 856654, 861648, 868832, 877720, 887526, 898271, 910943, 926373, 944620, 965715, 990207, 1018486, 1050054, 1083519, 1116336, 1144408, 1163395, 1171461, 1170072, 1161777, 1148520, 1132852, 1118865, 1109995, 1106645, 1107426, 1111626, 1118235, 1123153, 1120244, 1106323, 1083753, 1057496, 1030775, 1004106, 977110, 950090, 924423, 902166, 884885, 872440, 863346, 856478, 851768, 848988, 846802, 843772, 839784, 835938, 833478, 833389, 836527, 843146, 852117, 861213, 868570, 873919, 878423, 883446, 889466, 896032, 902546, 908934, 915587, 922916, 930989, 939340, 947259, 954779, 963360, 974621, 988094, 1001282, 1012810, 1024539, 1039288, 1057192, 1075927, 1094193]
59284A094193J8854K0528K1529K1515K1735K2393K2108K0375J8651J8246J8510
59273A318637J7839J5376J1209N871M70l532n449n946o169o738p804r343j0997
59260A313424j2155j2648j2881j3064j2888j2328j2069j2614j3369j3182j1486
59249A174740q625n466k992j787j410p14Q26K606M070N698Q053J0478J1894J2684
59235A210055J4559J8338K2795K5909K6333K3303J6363O326m103j1929j6226j8248
59223A313475j9359j9735j9124j7770j6029j3815j1206q985p693o461l872j49
59211A169277K616K905J761J526K981M656M920L875K808K390K096J111q15l497
59197A198610o669r867j2336j3540j3838j4242j5299j6345j6168j4421j2164j0799
$$ y = [1094193, 1113047, 1133575, 1155104, 1176619, 1198354, 1220747, 1242855, 1263230, 1281881, 1300127, 1318637, 1336476, 1351852, 1363061, 1368932, 1369402, 1365870, 1360421, 1354475, 1348306, 1341568, 1333764, 1324421, 1313424, 1301269, 1288621, 1275740, 1262676, 1249788, 1237460, 1225391, 1212777, 1199408, 1186226, 1174740, 1166115, 1160649, 1157657, 1155870, 1154460, 1153746, 1154572, 1157178, 1161248, 1166946, 1174999, 1185477, 1197371, 1210055, 1224614, 1242952, 1265747, 1291656, 1317989, 1341292, 1357655, 1363981, 1359878, 1347949, 1331723, 1313475, 1294116, 1274381, 1255257, 1237487, 1221458, 1207643, 1196437, 1187452, 1179759, 1173298, 1169426, 1169277, 1171893, 1174798, 1176559, 1178085, 1181066, 1185722, 1190642, 1194517, 1197325, 1199715, 1201811, 1202922, 1202107, 1198610, 1191941, 1182074, 1169738, 1156198, 1142360, 1128118, 1112819, 1096474, 1080306, 1065885, 1053721, 1042922]
59185A042922j0580j0530r798q630p661o657m852k409o57m79j183j553j418j353
59171I75162j464j405j355j773k224j667j92P03Q6j214k108k820l991n066m898
59156I45774l662k753k840l087k679k028j961k299k005n54J296K207J653M90J9
59141I27571O90J959L378N121P191Q771Q982P929O385M919L860L801N248P799
59127A003604J0329J1952J2436J1875J0589R255Q478Q218Q033P665O981N677L727
59114A118819J904J140J527K453L461M233M138K737O29r30j245l60J557M030N851
59099A149944O069N365N186N587N188L466J538K41j062k965m568m675l665l052
59085A162597l726n383p293q726q933p523n055k810j832k196k985l054k038n92
$$ y = [1042922, 1032342, 1021812, 1012014, 1003384, 995723, 989066, 984214, 981805, 981148, 980669, 979486, 977933, 976515, 975162, 973698, 972293, 970938, 969165, 966941, 965274, 965082, 965785, 965871, 964657, 962549, 959729, 955738, 950672, 945774, 942112, 939359, 936519, 933432, 930753, 928725, 926764, 924465, 922460, 921906, 923202, 925409, 927062, 927552, 927571, 928261, 930220, 933598, 938719, 945910, 954681, 963663, 971592, 977977, 982896, 986756, 990557, 995805, 1003604, 1013933, 1025885, 1038321, 1050196, 1060785, 1070040, 1078518, 1086736, 1094769, 1102434, 1109415, 1115092, 1118819, 1120723, 1121863, 1123390, 1125843, 1129304, 1133537, 1137675, 1140412, 1141041, 1140111, 1138866, 1138506, 1140063, 1144093, 1149944, 1156013, 1161378, 1166564, 1172151, 1177339, 1180805, 1182343, 1182584, 1181522, 1178557, 1173989, 1169314, 1165649, 1162597, 1158871, 1153488, 1146195, 1137469, 1128536, 1121013, 1115958, 1113148, 1111316, 1109120, 1106135, 1103081, 1101043, 1100451]
59071A100451O17J743L044L949L837L405L960N498O823P603Q733J0414J1575J1722
59057A183374J1779J2317J2584J2264J2505J3887J4907J4070J2185J0834R690
59046A320396P470M743L464L862L898K186l74k347l585m561n215n340n410o136
59032A313051p564q957r498r020q298q474r676j0508r563p311n837o713r682j3255
59018A188695j5884j6650j5746j4443j4067j4805j5749j5956j5082j3262j1020
59007A026031r085p794o817n968n767o515p309p009n847n057n017m856l923k599
58993I42468j478p67p06j689l499m980m880k930k28J192j05l095m672l018J05
58978I11718J794K074L377O157P778O600M632M471N519N456M184L856N524P981
$$ y = [1100451, 1101068, 1102811, 1105855, 1109804, 1113641, 1117046, 1121006, 1126504, 1133327, 1140930, 1149663, 1160077, 1171652, 1183374, 1195153, 1207470, 1220054, 1232318, 1244823, 1258710, 1273617, 1287687, 1299872, 1310706, 1320396, 1327866, 1332609, 1336073, 1339935, 1343833, 1346019, 1345645, 1343298, 1339713, 1335152, 1329937, 1324597, 1319187, 1313051, 1305487, 1296530, 1287032, 1278012, 1269714, 1261240, 1251564, 1241056, 1231493, 1224182, 1218345, 1211632, 1201950, 1188695, 1172811, 1156161, 1140415, 1125972, 1111905, 1097100, 1081351, 1065395, 1050313, 1037051, 1026031, 1016946, 1009152, 1002335, 996367, 990600, 984085, 976776, 969767, 963920, 958863, 953846, 948990, 945067, 942468, 940990, 940223, 939517, 937828, 934329, 929349, 924469, 921539, 921311, 922503, 922398, 919303, 914631, 911613, 911718, 913512, 915586, 918963, 925120, 932898, 939498, 944130, 948601, 954120, 959576, 963760, 967616, 973140, 981121]
58964I81121R994J1652J3101J3701J3241J2729J3118J4056J4583J4307J3221J1190
58952A136014Q429N950M525L552J865m31j907j709o61j90p64j807k443j916J29
58937A148636K986M965M959L754L021L103K704Q00k134n044p463r199r793r118
58923A132177q081p812q390q937q698p522n576l318j538p10l55M34J879L382M380
58908A081315M881N275N982P111Q242Q843R163R993J1107J0875Q467N513M165
58895A180932L965K399j481n745q254q970r034r000r018r459j0196j0248r295
58882A096596q703r727j1259j0845p817m125k060k208l771n718p169p537o950
58869A008707o188n827n795n934o461p499q434q331o879m661k492p38O22J418
$$ y = [981121, 991115, 1002767, 1015868, 1029569, 1042810, 1055539, 1068657, 1082713, 1097296, 1111603, 1124824, 1136014, 1144443, 1150393, 1154918, 1158470, 1160335, 1159904, 1157997, 1156288, 1155627, 1155437, 1154673, 1152866, 1150423, 1148507, 1148636, 1151622, 1156587, 1161546, 1165300, 1168321, 1171424, 1174128, 1174928, 1172794, 1167750, 1160287, 1151088, 1141295, 1132177, 1124096, 1116284, 1107894, 1098957, 1090259, 1082737, 1077161, 1073843, 1072305, 1071595, 1071240, 1071674, 1073553, 1076935, 1081315, 1086196, 1091471, 1097453, 1104564, 1112806, 1121649, 1130812, 1140805, 1151912, 1162787, 1171254, 1176767, 1180932, 1184897, 1187296, 1185815, 1180070, 1171816, 1162846, 1153812, 1144812, 1135794, 1126335, 1116139, 1105891, 1096596, 1087893, 1078166, 1066907, 1056062, 1048245, 1044120, 1042060, 1039852, 1036081, 1030363, 1023194, 1015657, 1008707, 1002519, 996692, 990897, 984963, 978502, 971003, 962569, 954238, 947359, 942698, 940206, 939468, 940090, 941508]
58855I41508J051q02l226m156k196J706M873N527M439L704M336N644O674P410
58841I76492Q308R414J0515J1800J3620J5615J6713J6279J4889J3768J3716J4799
58829A135928J6680J8811K0497K1250K1240K1058K1045K1006K0634J9835J8455
58818A356439J6087J2593Q639N159K213r76m564p356q278q147q837j0654j1803
58805A340515j0979r433r376j1044j2583j2591j1636j1207j2091j3934j5634j6120
58793A193887j5472j5161j6298j7858j7921j6548j5815j6501j6558j4089j0386
58782A021280q379q869j0029j0280r948r875r863r208p913o674o013n929o185
58769I12115o517o576o015m897l901l727m049l573j641O20J513Q55n8l29k03j6
$$ y = [941508, 942559, 941757, 938531, 934375, 932179, 933885, 938758, 944285, 948724, 952428, 956764, 962408, 969082, 976492, 984800, 994214, 1004729, 1016529, 1030149, 1045764, 1062477, 1078756, 1093645, 1107413, 1121129, 1135928, 1152608, 1171419, 1191916, 1213166, 1234406, 1255464, 1276509, 1297515, 1318149, 1337984, 1356439, 1372526, 1385119, 1393758, 1398917, 1401130, 1400154, 1395590, 1388234, 1379956, 1371809, 1362972, 1352318, 1340515, 1329536, 1320103, 1310727, 1299683, 1287100, 1274509, 1262873, 1251666, 1239575, 1225641, 1210007, 1193887, 1178415, 1163254, 1146956, 1129098, 1111177, 1094629, 1078814, 1062313, 1045755, 1031666, 1021280, 1012901, 1004032, 994003, 983723, 973775, 963900, 954037, 944829, 936916, 930242, 924229, 918300, 912115, 905598, 899022, 893007, 888110, 884209, 880482, 876433, 872860, 871219, 871839, 873352, 874207, 874149, 873820, 873617, 873601]
58753H73601K96N63N62R53K498M092L488O02j820j861p35k15R1R63J184n65k847
58736H80850l377k679k950l963l393j093K41n99j393rK599M382N067N489N706
58721H84878N467N452O478Q032Q840Q413P300O256N639N152L910J358j695l807
58707I51673m643n060n528n760n921o608p360o746m537k268j114o20j14K71P37
58692H96402K200M387N244L702J696J831M099O381P405P576P535P535P967R203
58678I73163J0854J2190J3107J4047J5192J6283J6945J6794J5799J4785J4753
58667A133912J5313J4883J2929J0706R184P801O304O115Q139J0609J1049R500
58655A256444P899P080O470O209P104Q427Q010N067J301j459l270n217p863j1166
$$ y = [873601, 873897, 874460, 875022, 875975, 878473, 882565, 886053, 886655, 884835, 882974, 882239, 882024, 882115, 883078, 884262, 883697, 880850, 877473, 874794, 871844, 867881, 864488, 863395, 863636, 863037, 861644, 861635, 864234, 868616, 873683, 879172, 884878, 890345, 895797, 902275, 910307, 919147, 927560, 934860, 941116, 946755, 951907, 955817, 957175, 955480, 951673, 947030, 941970, 936442, 930682, 924761, 918153, 910793, 904047, 899510, 897242, 896128, 895508, 895394, 895665, 896402, 898602, 902989, 908233, 911935, 913631, 915462, 919561, 925942, 933347, 940923, 948458, 955993, 963960, 973163, 984017, 996207, 1009314, 1023361, 1038553, 1054836, 1071781, 1088575, 1104374, 1119159, 1133912, 1149225, 1164108, 1177037, 1187743, 1196927, 1204728, 1211032, 1217147, 1225286, 1235895, 1246944, 1256444, 1264343, 1271423, 1277893, 1284102, 1291206, 1299633, 1307643, 1312710, 1314011, 1312552, 1309282, 1304065, 1296202, 1285036]
58641A285036j4832j8033j9729j9963k0146k1448k3351k4349k3674k2015k0808
58630A056688k0982k2111k2666k1377j8401j5094j2861j2316j3028j3607j2623
58619H71622j0045p352n696m511k694l84J433K475L093L132K220J042R08J948
58605H57191L005L422L673M144M514M685N047N354M572K420J04j208j733k273
58591H92917k905l219l181k973k581k114k125k968m284n600o902q037q189o724
58577H31115m283k189r90k51M25R06J027R70R54J013J015P39M9n39J16K421M874
58560H37372N307L573K005K657M892O623P174P689Q935J0086J0022Q750O934M934
58546I26953L102K279K987M367M759L335P70j471k077o44J825L548L698L065K411
$$ y = [1285036, 1270204, 1252171, 1232442, 1212479, 1192333, 1170885, 1147534, 1123185, 1099511, 1077496, 1056688, 1035706, 1013595, 990929, 969552, 951151, 936057, 923196, 910880, 897852, 884245, 871622, 861577, 854225, 848529, 844018, 841324, 840940, 842373, 844848, 847941, 851073, 853293, 854335, 855243, 857191, 860196, 863618, 867291, 871435, 875949, 880634, 885681, 891035, 895607, 898027, 898131, 896923, 895190, 892917, 890012, 886793, 883612, 880639, 878058, 875944, 873819, 870851, 866567, 860967, 854065, 846028, 837839, 831115, 826832, 824643, 823653, 823402, 823827, 824733, 825760, 826730, 827684, 828697, 829712, 830451, 830500, 829961, 830077, 832498, 837372, 842679, 846252, 848257, 850914, 855806, 862429, 869603, 877292, 886227, 896313, 906335, 915085, 922019, 926953, 930055, 932334, 935321, 939688, 944447, 947782, 948552, 947081, 945004, 944360, 946185, 949733, 953431, 956496, 958907]
58531I58907J154j035k320m27L834P046P584P419Q682J0537J1065J0531J0693
58518A033670J1797J2431J2060J1805J2384J2922J2357J1035J0252J0811J2389
58507A163913J4000J4887J5216J5901J7521J9654K1472K2723K3683K4467K4912
58496A378349K4809K3826K1453J7685J3564J0480Q737P300M825P75m348r462j3585
58483A484408j6346j7895j8557j8713j8828j9090j9124j8643j8281j8937k0372
58472A279622k1331k1148k0188j8656j6202j3155j0815r877r594r025p996o332
58460A115303l622n79Q76O7j296j641j753k858l986l319j236K19L55J95J73k75
58444A096623j007j137q93j469k740l099k111j336j817k481k139j451j583k145
$$ y = [958907, 960061, 959026, 956706, 956279, 960113, 967159, 974743, 982162, 990844, 1001381, 1012446, 1022977, 1033670, 1045467, 1057898, 1069958, 1081763, 1094147, 1107069, 1119426, 1130461, 1140713, 1151524, 1163913, 1177913, 1192800, 1208016, 1223917, 1241438, 1261092, 1282564, 1305287, 1328970, 1353437, 1378349, 1403158, 1426984, 1448437, 1466122, 1479686, 1490166, 1498903, 1506203, 1511028, 1511803, 1507455, 1497993, 1484408, 1468062, 1450167, 1431610, 1412897, 1394069, 1374979, 1355855, 1337212, 1318931, 1299994, 1279622, 1258291, 1237143, 1216955, 1198299, 1182097, 1168942, 1158127, 1148250, 1138656, 1129631, 1121635, 1115303, 1111681, 1111102, 1111978, 1112045, 1110749, 1109108, 1107355, 1104497, 1100511, 1097192, 1095956, 1096175, 1096530, 1096725, 1096898, 1096623, 1095616, 1094479, 1093586, 1092117, 1089377, 1086278, 1084167, 1082831, 1081014, 1078533, 1076394, 1074943, 1073360, 1071215]
58430A071215j801k22J822L774N538O801P204P080P181P614P850P845Q369R864
58416A150134J1582J2435J2466J2731J3600J3914J2295Q811M779J368q54j509
58404A251752q75n06j987m784o643o460n339m402l123q13J790L505M170M001K814
58389A233100J116N74J874L201K536N46n27n9O59O45K0r04j684j370K24J530J129
58372A242610O6M02K146L625M407N522P040P898Q134Q973J0403J1005J0658J1095
58358A333984J2964J4405J3562J0712P093L447O01l24M49R71J16q05k39J012Q53
58343A398801j144l283l888k857j260j94J6j6O53K315M372N923O293N234L281
58328A414246J718J517K377L407M429N760O988P107N890M282L391L733N189P004
$$ y = [1071215, 1069414, 1069192, 1071014, 1074788, 1080326, 1087127, 1094331, 1101411, 1108592, 1116206, 1124056, 1131901, 1140270, 1150134, 1161716, 1174151, 1186617, 1199348, 1212948, 1226862, 1239157, 1247968, 1252747, 1254115, 1253261, 1251752, 1250877, 1250371, 1248384, 1243600, 1236957, 1230497, 1225158, 1220756, 1217633, 1216820, 1218610, 1222115, 1226285, 1230286, 1233100, 1234216, 1234790, 1236664, 1239865, 1242401, 1242947, 1242420, 1242361, 1243020, 1243665, 1243685, 1242781, 1241097, 1239727, 1239951, 1241481, 1242610, 1242676, 1243078, 1245224, 1248849, 1253256, 1258778, 1265818, 1273716, 1281850, 1290823, 1301226, 1312231, 1322889, 1333984, 1346948, 1361353, 1374915, 1385627, 1392720, 1396167, 1396768, 1396444, 1396893, 1397864, 1397980, 1397175, 1396936, 1397948, 1398801, 1397657, 1394374, 1390486, 1387629, 1386369, 1386175, 1386191, 1386175, 1386828, 1389143, 1393515, 1399438, 1405731, 1410965, 1414246, 1415964, 1417481, 1419858, 1423265, 1427694, 1433454, 1440442, 1447549, 1453439, 1457721, 1461112, 1464845, 1470034, 1477038]
58314A477038Q141Q414Q869J0243J1739J2347J2591J3634J5248J6156J6022J5624
58302A626066J5417J5267J5278J5521J5355J4351J3365J3406J4055J4457J4865
58291A787403J5546J5255J3057J0775J1068J3530J5199J4667J3282J2537J2768
58280A935087J4275J7115J9760K0542K0380K1524K3697K4400K3262K2881K4662
58269B167585K6733K6954K5517K3659K2188K1974K3536K5394K5199K3137K1812
58258B433688K2221K2542K1595K0688K0975K1748K2543K4352K7455L0283L1701
58247B699791L2354L2802L2531L1760L1935L3476L5012L5697L6207L7008L7891
58236C076464L9417M2212M4711M4646M3022M3193M5570M7085M6639M7017M9975
$$ y = [1477038, 1485179, 1493593, 1502462, 1512705, 1524444, 1536791, 1549382, 1563016, 1578264, 1594420, 1610442, 1626066, 1641483, 1656750, 1672028, 1687549, 1702904, 1717255, 1730620, 1744026, 1758081, 1772538, 1787403, 1802949, 1818204, 1831261, 1842036, 1853104, 1866634, 1881833, 1896500, 1909782, 1922319, 1935087, 1949362, 1966477, 1986237, 2006779, 2027159, 2048683, 2072380, 2096780, 2120042, 2142923, 2167585, 2194318, 2221272, 2246789, 2270448, 2292636, 2314610, 2338146, 2363540, 2388739, 2411876, 2433688, 2455909, 2478451, 2500046, 2520734, 2541709, 2563457, 2586000, 2610352, 2637807, 2668090, 2699791, 2732145, 2764947, 2797478, 2829238, 2861173, 2894649, 2929661, 2965358, 3001565, 3038573, 3076464, 3115881, 3158093, 3202804, 3247450, 3290472, 3333665, 3379235, 3426320, 3472959, 3519976, 3569951]
58225C569951N3481N5733N8061O1725O5293O7554O9932P3711P7736Q0808Q3616
58214D317601Q6528Q8459Q9591R2200R7101J02414J07244J13038J19785J24819
58204E338780J27355J30275J35416J41052J46096J52431J60673J68031J73161
58195F673270J78902J87284J96084K03234K10401K19164K28123K36859K48071
58186H581392K62451K76409K88533L03282L24145L48221L72061L97875M29006
58177A1583375M64116N01112N42171N89338O39399O88636P38613P92068Q47441
58168A7386269R02917R61525J026574J096325J168553J245774J330408J420010
58160B6538355J513329J615894J733128J863182K002855K154650K321023K498146
$$ y = [3569951, 3623432, 3679165, 3737226, 3798951, 3864244, 3931798, 4001730, 4075441, 4153177, 4233985, 4317601, 4404129, 4492588, 4582179, 4674379, 4771480, 4873894, 4981138, 5094176, 5213961, 5338780, 5466135, 5596410, 5731826, 5872878, 6018974, 6171405, 6332078, 6500109, 6673270, 6852172, 7039456, 7235540, 7438774, 7649175, 7868339, 8096462, 8333321, 8581392, 8843843, 9120252, 9408785, 9712067, 10036212, 10384433, 10756494, 11154369, 11583375, 12047491, 12548603, 13090774, 13680112, 14319511, 15008147, 15746760, 16538828, 17386269, 18289186, 19250711, 20277285, 21373610, 22542163, 23787937, 25118345, 26538355, 28051684, 29667578, 31400706, 33263888, 35266743, 37421393, 39742416, 42240562]
58152D2240562K683427K883325L105825L351655L621218L923327M268417M660761
58144G0738517N107152N625336O233518O939800P752099Q687689R760457J0970160
58136A31814728J2318422J3822707J5498562J7341736J9344258K1510159K3833432
58129B55484004K6267760K8689284L0758868L1700642L0312102K5514142J7197050
58122D45923852O615998m126029j3119541j9388343k2921511k4263419k4117722
58115C44603285k3147804k1901468k0763979j9915066j9316129j8774141j8086116
58108B02698582j7170766j6077462j4890955j3660242j2414035j1194909j0046317
58101A07243896q985250q010932p128309o345436n658916n058916m541110m100450
$$ y = [42240562, 44923989, 47807314, 50913139, 54264794, 57886012, 61809339, 66077756, 70738517, 75845669, 81471005, 87704523, 94644323, 102396422, 111084111, 120844568, 131814728, 144133150, 157955857, 173454419, 190796155, 210140413, 231650572, 255484004, 281751764, 310441048, 341199916, 372900558, 403212660, 428726802, 445923852, 452539850, 448413821, 435294280, 415905937, 392984426, 368721007, 344603285, 321455481, 299554013, 278790034, 258874968, 239558839, 220784698, 202698582, 185527816, 169450354, 154559399, 140899157, 128485122, 117290213, 107243896, 98258646, 90247714, 83119405, 76773969, 71115053, 66056137, 61515027, 57414577]
58093E7414577l721172l386201l090596k834878k611942k411698k232678k077533
58085C5047879j941189j813772j692021j578674j473483j373324j278561j191526
58077B2705329j110619j032669r59015q93350q35885p85162p42630p09519o81685
58068A4954795o53286o23578n95079n67497n38655n09291m81861m56382m31645
58059A0097521m08484l87771l67581l46432l26759l11134k97649k83354k69438
58050G098919k58390k48686k37316k25461k16633k10699k04335j96198j87424
58041E113777j78383j69016j61006j55668j51009j44499j37282j31860j27464
58032C757590j21793j15708j11798j09506j06061j01370r7720r5315r2240q8456
$$ y = [57414577, 53693405, 50307204, 47216608, 44381730, 41769788, 39358090, 37125412, 35047879, 33106690, 31292918, 29600897, 28022223, 26548740, 25175416, 23896855, 22705329, 21594710, 20562041, 19603026, 18709676, 17873791, 17088629, 16345999, 15636480, 14954795, 14301509, 13677931, 13082852, 12515355, 11976700, 11467409, 10985548, 10529166, 10097521, 9689037, 9301266, 8933685, 8587253, 8260494, 7949360, 7651711, 7368357, 7098919, 6840529, 6591843, 6354527, 6129066, 5912433, 5701734, 5497399, 5301201, 5113777, 4935394, 4766378, 4605372, 4449704, 4298695, 4154196, 4016914, 3885054, 3757590, 3635797, 3520089, 3408291, 3298785, 3192724, 3091354, 2993634, 2898319, 2806079, 2717623]
58022B717623q5779q4100q1373p7492p4644p3591p2633p0460o7428o3988o0307
58011A905828n7116n4716n1736m7197m2851m0890m0412l8944l6389l4452l3125
58000A428000l1077k8729k7548k6800k4485k1246j9866k0845k1858k1728k1635
57989A162183k1963k1167j8654j5995j4498j3884j3938j4989j6182j5628j3096
57978I82189j0526r283q830q599r005j0019j0627j0529j0685j1615j2616j3127
57966H56728j3412j3532j3073j2179j1560j1289j0842j0300j0163j0154r594q778
57954G21852q473q253o994m892l485l728n293p346q663p784m865k594l185n130
57940F41167n190l018j154r00j141j283k266l992m594l260j448m16K47P54J63
$$ y = [2717623, 2631844, 2547744, 2466371, 2388879, 2314235, 2240644, 2168011, 2097551, 2030123, 1966135, 1905828, 1848712, 1793996, 1742260, 1695063, 1652212, 1611322, 1570910, 1531966, 1495577, 1461125, 1428000, 1396923, 1368194, 1340646, 1313846, 1289361, 1268115, 1248249, 1227404, 1205546, 1183818, 1162183, 1140220, 1119053, 1100399, 1084404, 1069906, 1056022, 1042084, 1027095, 1010913, 995285, 982189, 971663, 962380, 953550, 944951, 935946, 925927, 915300, 904771, 894086, 882471, 869855, 856728, 843316, 829784, 816711, 804532, 792972, 781683, 770841, 760541, 750378, 740224, 730630, 721852, 713379, 705126, 698132, 693240, 689755, 686027, 680734, 673388, 664725, 656941, 652076, 649482, 646297, 641167, 635977, 632959, 631805, 630905, 629764, 628481, 626215, 622223, 617629, 614369, 612921, 612505, 612752, 613506, 613669]
57925F13669j570k673k029q15n35j083j803k765l811l958l012k367k995l988m275
57910E75990m337m948n545n263m455l687k265N66L603M569K933O40p7J251L337
57895E62312M547M227L052K118J764J585J407J539K075K710L287L713L481K301
57881F00118J141J286K250K170P30j7J376L506M104L141K407K777L501L808L810
57866F36108L644L002J909J063Q90P49l11k278m243n738p363r605j1572j1842
57852E94413j0471r008q261p250n154l045k495l381m384m926n115m543k864j249
57838E22267j227k241k147l82J205J067k96j740k909l522k906j275j95p18j985
57823E02996k538k060j154l21R4j33o33p77r15k135m333n800n503m479m113m303
$$ y = [613669, 612099, 609426, 607397, 606582, 606047, 604964, 603161, 600396, 596585, 592627, 589615, 587248, 584253, 580265, 575990, 571653, 566705, 561160, 555897, 551442, 547755, 545490, 546056, 549659, 554228, 557161, 557801, 557724, 558975, 562312, 566859, 571086, 574138, 576256, 578020, 579605, 581012, 582551, 584626, 587336, 590623, 594336, 597817, 600118, 601259, 602545, 604795, 606965, 607695, 607678, 609054, 612560, 616664, 619805, 622212, 624989, 628490, 632298, 636108, 639752, 642754, 644663, 645726, 646616, 647365, 647054, 644776, 640533, 634795, 627432, 617827, 606255, 594413, 583942, 574934, 566673, 559423, 554269, 551224, 548729, 545348, 540964, 536038, 530923, 526380, 523516, 522267, 521040, 518799, 516652, 516270, 517475, 518542, 518246, 516506, 513597, 510075, 507169, 505894, 505699, 504981, 502996, 500458, 498398, 497244, 496923, 497017, 496884, 496251, 495474, 494559, 492424, 488091, 482291, 476788, 472309, 468196, 463893]
57807D63893m317m274m575m825m577m233m091l446j888n21l98n64N98K658L650
57792D33090L093K581L161L942L971L926M844O237O702N914M854M234L719K934
57778D93202K332K387K497J658R6q19o17m98j281j696k48J896J851r66l584l029
57762D93181K83L527M768M197L090K666L403M493M313K224m94k139k493k595l200
57747E15224m273n538o703p373p465p412p491p474p296p335p382o359m086k411
57733D26626l074n056n672m103k177j553j695j266j14R68J591K005K456K965L400
57718D15301L375K504J193P13J977M489O902Q407R095R162Q372O504M102K373
57704D84469K162L019L500K503K58k096l655m295m362m159l820l342k754k325
$$ y = [463893, 459576, 455302, 450727, 445902, 441325, 437092, 433001, 429555, 427667, 427146, 426748, 426184, 426782, 429440, 433090, 436183, 438764, 441925, 445867, 449838, 453764, 458608, 464845, 471547, 477461, 482315, 486549, 490268, 493202, 495534, 497921, 500418, 502076, 502172, 501353, 500736, 500238, 498957, 497261, 497013, 498909, 500760, 499794, 496210, 493181, 493464, 496991, 501759, 505956, 509046, 511712, 515115, 519608, 523921, 526145, 525651, 523512, 521019, 518424, 515224, 510951, 505413, 498710, 491337, 483872, 476460, 468969, 461495, 454199, 446864, 439482, 433123, 429037, 426626, 423552, 418496, 412824, 408721, 406544, 404991, 403296, 402030, 401916, 402884, 404475, 406480, 408936, 411901, 415301, 418676, 421180, 422373, 423086, 425063, 429552, 436454, 444861, 453956, 463118, 471490, 477994, 482096, 484469, 486631, 489650, 493150, 495653, 495911, 493815, 490160, 485865, 481503, 477344, 473524, 470182, 467428, 465103]
57690D65103k428k925k949j814o5Q96L57j024k170k623k280q29J652L831L927
57675D56659J804n31j066M9J070Q98l8q21r34j79J199K143J565n6r35l32M54K44
57657D61193j91K55P40l31k393l119j794l28m06j446k121k370k736k986k659k194
57641D37114k263k482j893m05J074J795J723J159M75P2K28J068K708M902O451
57626D51726O001L956K708M023O857Q714Q716Q330R320J1995J5511J9012K2306
57613E79175K5796K9917L4431L8679M2774M7963N4992O2280O6364O4235N5040
57602A101646M0004K1429J719j7186l3728m6313n3585n5434n3286m9018m3970
57591H12278l9044l4845l1129k6943k2044j7582j4681j3037j1653j0209q793p092
$$ y = [465103, 462675, 459750, 456801, 454987, 454922, 455818, 456175, 455151, 452981, 450358, 448078, 447249, 448901, 452732, 456659, 458463, 457932, 456866, 456915, 457985, 458883, 458845, 458024, 457090, 456911, 458110, 460253, 461818, 461762, 460827, 460495, 460949, 461193, 461002, 461257, 461997, 461666, 459273, 456154, 454360, 454032, 453626, 452180, 450059, 447689, 444953, 441967, 439308, 437114, 434851, 432369, 430476, 430071, 431145, 432940, 434663, 435822, 436297, 436369, 436597, 437665, 440373, 445275, 451726, 457727, 461683, 464391, 468414, 475271, 483985, 492701, 501031, 510351, 522346, 537857, 556869, 579175, 604971, 634888, 669319, 707998, 750772, 798735, 853727, 916007, 982371, 1046606, 1101646, 1141650, 1163079, 1164798, 1147612, 1113884, 1067571, 1013986, 958552, 905266, 856248, 812278, 773234, 738389, 707260, 680317, 658273, 640691, 626010, 612973, 601320, 591111, 582318, 575226]
57579E75226n011l461l168l256k343o91K90L73O77J484J662P02l06m95o05j584
57563E59494k911l394k947k511k577k642k009o29P58J158K61j012j380p01q0l12
57547E38566r10j046p60p28j263j956k080j185K91J004k3j980k924k199j229j401
57531E20177k154k088j160o00j045j905k511k811k865k526j936j545j380q98J14
57516D94867J031J207P91L27j49r94k090k664k113o75Q64J869K167J898J489J575
57500D99400K568M101N153M948L599J757j27j832k873k581j017O16J009K63j14
57485E14870J069L316N127N787N845N877N611M825M291M847N880N926M880M365
57471E82516N457P042P333O220N089M705M383L222J281p17k199l043l468l736
$$ y = [575226, 570215, 566754, 563586, 560330, 557987, 557296, 557586, 557959, 558636, 560120, 561782, 562484, 562178, 561683, 561078, 559494, 556583, 553189, 550242, 547731, 545154, 542512, 540503, 539874, 540632, 541790, 542051, 541039, 539659, 538958, 538878, 538566, 537656, 536610, 535850, 535122, 533859, 531903, 529823, 528638, 528929, 529933, 529910, 527930, 525006, 522807, 521578, 520177, 518023, 515935, 514775, 514175, 513130, 511225, 508714, 505903, 503038, 500512, 498576, 497031, 495651, 494753, 494867, 495898, 497105, 497896, 498223, 498074, 497080, 494990, 492326, 490213, 489538, 490402, 492271, 494438, 496336, 497825, 499400, 501968, 506069, 511222, 516170, 519769, 521526, 521399, 519567, 516694, 514113, 513096, 513712, 514721, 514984, 514870, 515939, 519255, 524382, 530169, 536014, 541891, 547502, 552327, 556618, 561465, 567345, 573271, 578151, 582516, 587973, 595015, 602348, 608568, 613657, 618362, 622745, 625967, 627248, 626531, 624332, 621289, 617821, 614085]
57457F14085l792l281k223j414j608k433k598j290J016L078L941L603K995L135
57443F13214M001M522L946K796K075K082K694M115O227P628O754M095K088K356
57429F68593M014N111M966M482M720N761O713O666N799N443O519Q187Q781P934
57415G53689O787O147N740N415N730O625O823N528L849L458M430N384N329M488
57401H29422L565L023K887K828K601K785M403P333R721R871Q274O865O568O543
57387I06689N749M430L802M730O760Q339Q305P310P194Q554R825R438Q004P257
57373A006386P547P736P270O811O874P229P895R293J0948J1371R954Q111P604
57360A115029Q481R405R480Q893Q151P539P283P566Q251Q935R332R391R191Q916
$$ y = [614085, 610293, 607012, 604789, 603375, 601767, 599334, 596736, 595446, 596462, 599540, 603481, 607084, 610079, 613214, 617215, 621737, 625683, 628479, 630554, 632636, 635330, 639445, 645672, 653300, 660054, 664149, 666237, 668593, 672607, 677718, 682684, 687166, 691886, 697647, 704360, 711026, 716825, 722268, 728787, 736974, 745755, 753689, 760476, 766623, 772363, 777778, 783508, 790133, 796956, 802484, 806333, 809791, 814221, 819605, 824934, 829422, 832987, 836010, 838897, 841725, 844326, 847111, 851514, 858847, 868568, 878439, 886713, 893578, 900146, 906689, 912438, 916868, 920670, 925400, 932160, 940499, 948804, 956114, 963308, 971862, 981687, 991125, 999129, 1006386, 1013933, 1021669, 1028939, 1035750, 1042624, 1049853, 1057748, 1067041, 1077989, 1089360, 1099314, 1107425, 1115029, 1123510, 1132915, 1142395, 1151288, 1159439, 1166978, 1174261, 1181827, 1190078, 1199013, 1208345, 1217736, 1226927, 1235843]
57346A235843Q813Q978R214R244Q950Q362P636P207P737R613J2402J4836J5574
57333A364409J4257J2063J0817J1220J2220J2593J2651J3590J5301J6148J5254
57322A510523J3878J3686J4425J4472J3295J2242J2721J4491J6151J6732J6376
57311A668992J5706J5127J4684J4242J3669J2948J2357J2329J2971J3656J3536
57300A820217J2553J1683J1792J2589J3167J3258J3301J3417J3290J3124J3746
57289A962137J5224J6268J5810J4494J3707J3633J3320J2361J1408J1009J1033
57278B110404J1421J2429J3739J4339J3918J3558J4277J5554J6118J5694J5044
57267B266495J4646J4379J4335J4835J5588J5817J5546J5748J6807J7706J7485
$$ y = [1235843, 1244656, 1253634, 1262848, 1272092, 1281042, 1289404, 1297040, 1304247, 1311984, 1321597, 1333999, 1348835, 1364409, 1378666, 1390729, 1401546, 1412766, 1424986, 1437579, 1450230, 1463820, 1479121, 1495269, 1510523, 1524401, 1538087, 1552512, 1566984, 1580279, 1592521, 1605242, 1619733, 1635884, 1652616, 1668992, 1684698, 1699825, 1714509, 1728751, 1742420, 1755368, 1767725, 1780054, 1793025, 1806681, 1820217, 1832770, 1844453, 1856245, 1868834, 1882001, 1895259, 1908560, 1921977, 1935267, 1948391, 1962137, 1977361, 1993629, 2009439, 2023933, 2037640, 2051273, 2064593, 2076954, 2088362, 2099371, 2110404, 2121825, 2134254, 2147993, 2162332, 2176250, 2189808, 2204085, 2219639, 2235757, 2251451, 2266495, 2281141, 2295520, 2309855, 2324690, 2340278, 2356095, 2371641, 2387389, 2404196, 2421902, 2439387]
57256B439387J6827J7228J8947K0686K1177K0373J9120J8312J8433J9336K0347
57245B650173K1062K1984K3755K5829K6784K6249K5610K6179K7287K7184K5504
57234B927600K3874K3872K5155K6161K6149K5861K6228K7033K7305K6697K5795
57223C211730K5158K4674K4156K3839K3746K3162K1685K0414K0847K2671K3851
57212C465933K3293K2162K1970K2489K2496K1720K0943K0674K0661K0404J9454
57201C702199J7719J6176J6476J8792K0831K0325J7848J5677J4455J2910J0636
57190C884044Q871Q180P590O858P467J0043J2515J2578J0674Q904Q162Q205R497
57177D003588J2683J6506J8536J8331J8105J9666K2250K4097K4849K5348K5951
$$ y = [2439387, 2456214, 2473442, 2492389, 2513075, 2534252, 2554625, 2573745, 2592057, 2610490, 2629826, 2650173, 2671235, 2693219, 2716974, 2742803, 2769587, 2795836, 2821446, 2847625, 2874912, 2902096, 2927600, 2951474, 2975346, 3000501, 3026662, 3052811, 3078672, 3104900, 3131933, 3159238, 3185935, 3211730, 3236888, 3261562, 3285718, 3309557, 3333303, 3356465, 3378150, 3398564, 3419411, 3442082, 3465933, 3489226, 3511388, 3533358, 3555847, 3578343, 3600063, 3621006, 3641680, 3662341, 3682745, 3702199, 3719918, 3736094, 3752570, 3771362, 3792193, 3812518, 3830366, 3846043, 3860498, 3873408, 3884044, 3892915, 3901095, 3908685, 3915543, 3923010, 3933053, 3945568, 3958146, 3968820, 3977724, 3985886, 3994091, 4003588, 4016271, 4032777, 4051313, 4069644, 4087749, 4107415, 4129665, 4153762, 4178611, 4203959, 4229910]
57166D229910K6060K5068K3033K0665J8943J8514J9051J9378J8453J6247J3690
57155D449012J1883J1200J0858R685P587N866N621O352O927P321Q348J0116J2077
57142D562853J4445J7911K1760K4016K4183K4342K6312K9055L0282K9742K9257
57131D834158K9828L0434K9839K8180K6169K3757K0454J6427J2484R022N689K151
57119E068592j282m337p654j2264j8004k3402k7729l2369l9061m7228n4401n9217
57107D741644o2613o5792o8506p0095p0929p1726p2189p1392o9048o5595o1499
57096C992260n7203n3338n0255m7801m6138m6194m8527n2223n5749n8569o1252
57085C415011o4446o8223p1958p4333p4273p2409p0743o9924o8074o3359n6806
$$ y = [4229910, 4255970, 4281038, 4304071, 4324736, 4343679, 4362193, 4381244, 4400622, 4419075, 4435322, 4449012, 4460895, 4472095, 4482953, 4492638, 4500225, 4506091, 4511712, 4518064, 4524991, 4532312, 4540660, 4550776, 4562853, 4577298, 4595209, 4616969, 4640985, 4665168, 4689510, 4715822, 4744877, 4775159, 4804901, 4834158, 4863986, 4894420, 4924259, 4952439, 4978608, 5002365, 5022819, 5039246, 5051730, 5060752, 5066441, 5068592, 5067310, 5062973, 5055319, 5043055, 5025051, 5001649, 4973920, 4941551, 4902490, 4855262, 4800861, 4741644, 4679031, 4613239, 4544733, 4474638, 4403709, 4331983, 4259794, 4188402, 4119354, 4053759, 3992260, 3935057, 3881719, 3831464, 3783663, 3737525, 3691331, 3642804, 3590581, 3534832, 3476263, 3415011, 3350565, 3282342, 3210384, 3136051, 3061778, 2989369, 2918626, 2848702, 2780628, 2717269, 2660463]
57074B660463n0985m6694m2567l7527l2120k7858k6842l1615m3589o1579q3328
57063B175759j08277j37343j70323k05497k41905k80214l21113C46394f5405m64380
57053e29785n23816n90391o64629p47871q41272r45606j062071j191756j334362
57044h431559j489315j658463j846443k059160k304266k592848k937557l348132
57036b6667743l830484m389253n027771n744502o531514p375167q254162r136784
57028g6957380r983224j0749136j1385069j1844684j2113568j2224767j2203796
57021a57461624j1959015j1238634r754071p400085m376253j096140K026704M733693
57013a96525425O930628Q610776R792270J0509369J0830285J0860488J0716393
$$ y = [2660463, 2609478, 2562784, 2520217, 2482690, 2450570, 2422712, 2395870, 2364255, 2320666, 2259087, 2175759, 2067482, 1930139, 1759816, 1554319, 1312414, 1032200, 711087, 346394, -65405, -529785, -1053601, -1643992, -2308621, -3056492, -3897764, -4843370, -5905441, -7097197, -8431559, -9920874, -11579337, -13425780, -15484940, -17789206, -20382054, -23319611, -26667743, -30498227, -34887480, -39915251, -45659753, -52191267, -59566434, -67820596, -76957380, -86940604, -97689740, -109074809, -120919493, -133033061, -145257828, -157461624, -169420639, -180659273, -190413344, -197813429, -202189682, -203285822, -201259118, -196525425, -189594797, -180984021, -171191751, -160682382, -149852097, -138991609, -128275216]
57006a28275216J0486639J0210642R888094R505024R052959Q533723P958254P345183
56998e5294698O717048O094022N490293M914893M373626L870211L407948K990984
56990a7435673K622338K300596K020256J775682J563384J380441J222809J085980
56982c464187R66073Q59649P63836a97171D04139N36531M82868M38710M01999
56973B264247L71048L44992L23578L06117K90808K75690K60307K45886K33887
56964D916560K24757K18302K15351K18624K30124K45254K50119K28877J77152
56955F925120J07358L8845j6506n8074q9303j11495j24727j30634j32042j31426
56945F277116j30752j31160j31787j30363j26124j21052j17592j16357j16688
$$ y = [-128275216, -117788577, -107577935, -97689841, -88184817, -79131858, -70598135, -62639881, -55294698, -48577650, -42483628, -36993335, -32078442, -27704816, -23834605, -20426657, -17435673, -14813335, -12512739, -10492483, -8716801, -7153417, -5772976, -4550167, -3464187, -2498114, -1638465, -874629, -197171, 404139, 940670, 1423538, 1862248, 2264247, 2635295, 2980287, 3303865, 3609982, 3900790, 4176480, 4436787, 4682673, 4916560, 5141317, 5359619, 5574970, 5793594, 6023718, 6268972, 6519091, 6747968, 6925120, 7032478, 7071323, 7054817, 6996743, 6907440, 6795945, 6671218, 6540584, 6408542, 6277116, 6146364, 6015204, 5883417, 5753054, 5626930, 5505878, 5388286, 5271929, 5155241]
56936E155241j18007j19536j19947j18556j16318j14693j14095j14115j14578
56927D105396j15603j17061j18666j20333j22194j24621j28463j34572j42849
56918B981034j52200j61238j68354j71515j69612j64249j58629j54052j48799
56909A532386j40984j30886j19577j07014r3109p9523o8457o0057n2485m4351
56899F35943l5791k7530k0241j4875j2360j2588j4453j6899j9327k1086k1561
56888D19232k0975k0300k0063j9729j8574j6740j5047j3920j2785j0592o946k550
56876B41011J569N085Q258J1076J3168J4581J5784J6594J5835J2547P101P43n383
56863C57969j0481j4082j6289j7602j8078j7333j5619j4074j3300j2562j1068
$$ y = [5155241, 5037234, 4917698, 4797751, 4679195, 4562877, 4448184, 4334089, 4219974, 4105396, 3989793, 3872732, 3754066, 3633733, 3511539, 3386918, 3258455, 3123883, 2981034, 2828834, 2667596, 2499242, 2327727, 2158115, 1993866, 1835237, 1681185, 1532386, 1391402, 1260516, 1140939, 1033925, 940816, 861293, 792836, 732779, 680294, 635943, 600152, 572622, 552381, 537506, 525146, 512558, 498105, 481206, 461879, 440793, 419232, 398257, 377957, 357894, 338165, 319591, 302851, 287804, 273884, 261099, 250507, 243561, 241011, 242580, 247665, 255923, 266999, 280167, 294748, 310532, 327126, 342961, 355508, 362609, 363352, 357969, 347488, 333406, 317117, 299515, 281437, 264104, 248485, 234411, 221111, 208549, 197481]
56852A97481r197p680o467n406n099n803o204m911k744j815k380k356l28K440
56838A39531L811L382K503K503L752N859Q032R468R940R863R668R591J0090J1689
56824B39682J3793J4400J1914P136K726N90L27L14l19j132j342o53Q17K883N195
56809B96331P291R123J1287J4218J7468K0403K3327K6979L0934L3535L3735L1872
56797E56503K8279K2323J3833M438l710r891j4311j6499j5803j3256j1075r939
56785E30892q071l639K943R648J4969J8904K2481K6764L1862L6706M0255M2740
56773G66454M4824M5439M1796L2283J8577M157q535j8818k6566l1622l4297l5317
56761G98375l5009l3097k9470k4651j9377j4062q884l988O00N099R648J3964J7576
$$ y = [197481, 188284, 180604, 174137, 168731, 163632, 157829, 151625, 146714, 143970, 142155, 139775, 137419, 137091, 139531, 143342, 146724, 149227, 151730, 155482, 161341, 169373, 178841, 188781, 198644, 208312, 217903, 227993, 239682, 253475, 267875, 279789, 286925, 289651, 290241, 290568, 290882, 290563, 289431, 288089, 287436, 288253, 291136, 296331, 303622, 312745, 324032, 338250, 355718, 376121, 399448, 426427, 457361, 490896, 524631, 556503, 584782, 607105, 620938, 625376, 621666, 611775, 597464, 580965, 565162, 551906, 540831, 530892, 522821, 519182, 522125, 531773, 546742, 565646, 588127, 614891, 646753, 683459, 723714, 766454, 811278, 856717, 898513, 930796, 949373, 953530, 944995, 926177, 899611, 867989, 833692, 798375, 763366, 730269, 700799, 676148, 656771, 642709, 633825, 629837, 630437, 635536, 645184, 659148, 676724]
56748F76724K0449K2899K4579K3851J8974J0068o43j0727j9025k5116k8443k8951
56736F84639k7824k6393k4607k1748j8301j5670j4090j2193r089n488k263Q24
56724E07797M177P226R221J0257J0554R472O408K206j524m357p347j1399j6038
56711E26653j9937k2098k2494k1907k1050j9703j7082j3251r669p777p615q309
56699C35761r303j0302j0663r953q764p898o968n075k729j681k492l641l695l225
56685B49372l484m170l858k334j143j517k758l250k453j231n94q26j857l619n520
56670B10758o159m522j499O11M97q64j709j614j363j301r47k51m5p59j593j607
56654A87633r93n01q4Q51K014K122O17j360k298k112j871k052k009j251l59j28
$$ y = [676724, 697173, 720072, 744651, 768502, 787476, 797544, 796901, 786174, 767149, 742033, 713590, 684639, 656815, 630422, 605815, 584067, 565766, 550096, 536006, 523813, 514724, 509236, 506973, 507797, 511974, 519200, 528421, 538678, 549232, 558704, 565112, 567318, 565794, 561437, 554090, 542691, 526653, 506716, 484618, 462124, 440217, 419167, 399464, 382382, 369131, 359462, 351685, 344070, 335761, 326458, 316156, 305493, 295540, 286776, 278878, 271910, 266835, 264106, 262425, 259933, 256292, 252597, 249372, 245888, 241718, 237860, 235526, 234383, 232866, 230108, 226858, 224405, 223174, 222580, 221754, 219897, 216278, 210758, 204599, 200077, 198578, 199189, 199686, 198822, 197113, 195499, 194136, 192835, 191888, 191637, 191592, 190833, 189240, 187633, 186640, 186139, 186055, 186906, 188920, 191042, 191659, 190299, 188001, 185889, 184018, 181966, 179957, 178706, 178347, 178219]
56638A78219l41j34P21J522J573Q72q6o85m04P08J706J556N08L6J090K917L982
56621A93760L548J964Q0j021l84J736L499L246J618Q72J879K894J791j242l938
56606B10302m489l091j223j6M10L73k15j822m275o255o465n305m536m990n399
56591A63004m139j445J028K407L254M136M733M677M301L988L641L303L537M348
56577B00773M526L184J472J484L429N158M880L217K052K209K974L252K450O81
56563B41741j149j767o63J298K695K734J336j116l533m353l023q96K31J80J14
56548B33829O12J268J929K892L703L155J075j020j719j318r39q59n27K26P56L21
56532B43384j013k061j346J128L210K829Q10R4J832L920M139L054K537K754K519
$$ y = [178219, 177878, 177744, 178465, 179987, 181560, 182432, 182346, 181661, 181257, 181965, 183671, 185227, 185735, 185771, 186861, 189778, 193760, 197308, 199272, 199352, 198331, 197947, 199683, 203182, 206428, 208046, 208918, 210797, 213691, 215482, 214240, 210302, 205813, 202722, 201499, 201483, 201893, 202266, 202051, 200229, 195954, 189699, 183234, 177929, 173393, 168403, 163004, 158865, 157420, 158448, 160855, 164109, 168245, 172978, 177655, 181956, 185944, 189585, 192888, 196425, 200773, 205299, 208483, 209955, 211439, 214868, 220026, 224906, 228123, 230175, 232384, 235358, 238610, 241060, 241741, 240592, 238825, 238162, 239460, 242155, 244889, 246225, 245109, 241576, 237223, 234200, 233304, 233535, 233715, 233829, 234441, 235709, 237638, 240530, 244233, 247388, 248463, 247443, 245724, 244406, 243467, 242608, 242081, 242307, 243063, 243384, 242371, 240310, 238964, 240092, 243302, 246131, 246941, 247035, 248867, 252787, 256926, 259980, 262517, 265271, 267790]
56517B67790J747J619K457L138K837K052J644J780K039J901J252Q89K068M707
56503B97920O759O584N410N796P931R336Q433O532N627N882O269O320O088N342
56489C90229M016K729J990J457Q07O20J402K389K433J651J091J013O03o58k431
56474D09341m231n788o558n920m274l094l299m159m306l448k495k245k557k703
56460C54264k150j007q4l65k048m047m944m529l915l932l989l091j515o07r02
56445C17139j329o82P42J433M26j642l041k391J35K779L632K321K43r03m99R95
56429C19358K652L464K775Q57j256k806l604l185q80K572M568L308K41j612j530
56414C24922j482k599l179j303K010L916L362K047J628J505K28j813k493q65J337
$$ y = [267790, 269537, 271156, 273613, 276751, 279588, 281640, 283284, 285064, 287103, 289004, 290256, 291145, 293213, 297920, 304679, 311263, 316673, 322469, 330400, 339736, 348169, 354701, 360328, 366210, 372479, 378799, 384887, 390229, 394245, 396974, 398964, 400421, 401228, 401848, 403250, 405639, 408072, 409723, 410814, 411827, 412430, 411772, 409341, 405110, 399322, 392764, 386844, 382570, 379476, 376177, 372018, 367712, 364264, 361769, 359524, 356967, 354264, 352114, 351107, 351023, 350658, 348610, 344563, 339619, 335090, 331175, 327243, 323254, 320163, 318648, 318041, 317139, 315810, 315128, 315870, 317303, 317729, 316087, 313046, 310655, 310790, 313569, 317201, 319522, 319765, 318862, 318363, 319358, 322010, 325474, 328249, 329106, 327850, 325044, 321440, 318255, 317375, 319947, 324515, 327823, 328064, 326452, 324922, 323440, 320841, 317662, 316359, 318369, 322285, 325647, 327694, 329322, 330827, 331055, 329242, 326749, 325884, 327221]
56399C27221J903J024P56J861K750J904lj150q11L61J453J836J234J43l76n1K55
56382C40310K01Q45K628L791K549J5j058L6J548K318L046M245N048M617L217J414
56366C74770l24j110l92N40k84k394k989q84J660K101O90q00j671k150k165j798
56350C62800j694j692m46K179L871K838P37N45K420L814L151J367m7o47n64n7
56334C78575L14J95R7N94J155R73N30R78K177K854K604K389K824L260K861J750
56318D04130Q39J181L261O099P411N825K762R88J466K719L207K905K339J478K51
56303D46861p55q54j01Q62J451J450R98L80k45p98r76m86K62M80K48M60J088P70
56285D51095r45k324j779k36M87N83J438K705K647J207K85P01J071L70m41k31
$$ y = [327221, 329124, 330148, 330904, 332765, 335515, 337419, 337416, 336266, 335455, 335816, 337269, 339105, 340339, 340482, 340106, 340055, 340310, 340511, 341356, 343984, 347775, 350324, 350339, 349281, 349317, 350865, 353183, 356229, 360474, 365522, 370139, 373356, 374770, 374446, 373336, 372944, 373484, 373200, 370806, 367817, 366933, 368593, 370694, 371384, 370584, 368913, 366763, 364598, 362800, 361106, 359414, 358968, 361147, 365018, 367856, 368593, 369138, 371558, 375372, 378523, 379890, 379843, 379196, 378632, 378575, 378889, 379084, 379181, 379775, 380930, 381903, 382433, 383411, 385588, 388442, 391046, 393435, 396259, 399519, 402380, 404130, 404969, 406150, 409411, 415510, 422921, 428746, 431508, 432496, 433962, 436681, 439888, 442793, 445132, 446610, 446861, 446106, 445252, 445151, 446013, 447464, 448914, 449912, 450292, 450047, 449249, 448273, 447787, 448049, 448529, 448777, 449237, 450325, 451095, 450150, 447826, 446047, 445811, 446298, 446881, 448319, 451024, 453671, 454878, 455163, 455864, 456935, 457305, 456864, 456633]
56269D56633N73J031J102J078Q07L47L71J120J857K080K352L133L734L261K044
56254D81523J291J644K517K758J841P49J199L457N435N142L497L091M433N395
56240E23972M585L186K617K401J570O01M16O44L59k51l13K42Q30J434K546M119
56224E48958N429N905N532M800M516N151O025N955N043M952O651Q903R792R087
56210F36699Q110P987Q828J0091J0844J0159Q216O643O999R131J1572J3261J4249
56197G62789J5208J6724J8775K0537K1230K1418K2684K5559K8759L1034L2755
56186A017472L4787L6793L7978L8765M0289M2512M4145M4365M3574M2427M1016
56175A464123L9115L6420L2470K6987K0365J3426O706L35n572j0898j5669j9842
$$ y = [456633, 457206, 458237, 459339, 460417, 461224, 461571, 461942, 463062, 464919, 466999, 469351, 472484, 476218, 479479, 481523, 482814, 484458, 486975, 489733, 491574, 492323, 493522, 496979, 502414, 507556, 511053, 514144, 518577, 523972, 528557, 531743, 534360, 536761, 538331, 538932, 539348, 539992, 540351, 540100, 539787, 540029, 540859, 542293, 544839, 548958, 554387, 560292, 565824, 570624, 575140, 580291, 586316, 592271, 597314, 602266, 608917, 617820, 627612, 636699, 644809, 652796, 661624, 671715, 682559, 692718, 700934, 707577, 714576, 723707, 735279, 748540, 762789, 777997, 794721, 813496, 834033, 855263, 876681, 899365, 924924, 953683, 984717, 1017472, 1052259, 1089052, 1127030, 1165795, 1206084, 1248596, 1292741, 1337106, 1380680, 1423107, 1464123, 1503238, 1539658, 1572128, 1599115, 1619480, 1632906, 1639612, 1639947, 1634375, 1623477, 1607808, 1587966]
56163A587966k3191k5815k8336l1030l3025l3194l1690l0101k9917l1107l2193
56152A258367l1573k8965k5647k3076k1377j9652j7547j5660j4393j3403j2473
56141A034601j1830j1221r875q012p022p276p003m779j997j218k620l924l613
56128I54211k444j559q61Q3O99J08j394k342j509R32L534M768M413L812M473O390
56112I73314Q006Q010O838O154O955Q530R552R905J0726J2463J3938J4079J3767
56099A102237J4627J6553J7963J8289J8471J8937J9089J9165K0521K3078K4704
56088A313634K4686K5796L0745L7939M3229M5137M6017M8453N2911N9015O6686
56077A794248P5261Q3311R0374R7553J05591J13370J19080J21884J21608J17794
$$ y = [1587966, 1564775, 1538960, 1510624, 1479594, 1446569, 1413375, 1381685, 1351584, 1321667, 1290560, 1258367, 1226794, 1197829, 1172182, 1149106, 1127729, 1108077, 1090530, 1074870, 1060477, 1047074, 1034601, 1022771, 1011550, 1001675, 993663, 986641, 979365, 972362, 967583, 965586, 964368, 961748, 957824, 954211, 951767, 950208, 949347, 949430, 950129, 950237, 948843, 946501, 944992, 945924, 949458, 954226, 958639, 962451, 966924, 973314, 981320, 989330, 996168, 1002322, 1009277, 1017807, 1027359, 1037264, 1047990, 1060453, 1074391, 1088470, 1102237, 1116864, 1133417, 1151380, 1169669, 1188140, 1207077, 1226166, 1245331, 1265852, 1288930, 1313634, 1338320, 1364116, 1394861, 1432800, 1476029, 1521166, 1567183, 1615636, 1668547, 1727562, 1794248, 1869509, 1952820, 2043194, 2140747, 2246338, 2359708, 2478788, 2600672, 2722280, 2840074]
56067B840074J10360J00861R1992Q5531Q1192P7347P2148O3819N0894L3405J3950
56056C621573l426j6191k4896l1614l7684m3792n1205o1037p2343q2587r0433
56045C106365r6521j01046j02257r8593r1129q2703p5245o8810o2476n5222m6588
56034B225775l7352k9144k2819j7778j3252r352o325l852j750m18K17J160K980
56021B088090N005O637Q355J0503J2264J2989J3501J4887J6867J8440J9336J9965
56009B246839K0716K2061K4266K6373K6862K6078K6345K8659L1156L2279L3368
55998B545002L6140L9436M0936M0704M0594M1117M1328M1132M1314M1840M2221
55987B991764M2962M4622M6146M6288M6130M7889N1642N5369N8024O0482O3515
$$ y = [2840074, 2950434, 3051295, 3143287, 3228818, 3310010, 3387357, 3459505, 3523324, 3574218, 3607623, 3621573, 3618147, 3601956, 3577060, 3545446, 3507762, 3463970, 3412765, 3351728, 3279385, 3196798, 3106365, 3009844, 2908798, 2806541, 2707948, 2616819, 2534116, 2458871, 2390061, 2327585, 2272363, 2225775, 2188423, 2159279, 2136460, 2118682, 2105430, 2096078, 2089753, 2085901, 2084151, 2083733, 2083950, 2085110, 2088090, 2093095, 2099732, 2108087, 2118590, 2130854, 2143843, 2157344, 2172231, 2189098, 2207538, 2226874, 2246839, 2267555, 2289616, 2313882, 2340255, 2367117, 2393195, 2419540, 2448199, 2479355, 2511634, 2545002, 2581142, 2620578, 2661514, 2702218, 2742812, 2783929, 2825257, 2866389, 2907703, 2949543, 2991764, 3034726, 3079348, 3125494, 3171782, 3217912, 3265801, 3317443, 3372812, 3430836, 3491318, 3554833]
55976C554833O6791O9891P2788P5431P8077Q1479Q5557Q8848R0805R3390R8526
55965D456416J05093J10515J14260J17669J21368J25297J30262J37079J44893
55956E562852J52444J60057J68260J75963J82557J90237K01179K13699K24504
55947G231752K33665K43902K55961K68459K81648K97559L16594L37494L60511
55938I827545L87342M18144M51850M88958N30501N74782O18699O62012P06795
55929A4666628P53280Q00120Q48258R00467R57232J017042J080505J150199J226695
55920B3400426J308890J398148J498122J610538J734870J871454K021002K182018
55912C7025468K353171K537433K740062K964008L211579L488308L800720M153817
$$ y = [3554833, 3621624, 3691515, 3764303, 3839734, 3917811, 3999290, 4084847, 4173695, 4264500, 4357890, 4456416, 4561509, 4672024, 4786284, 4903953, 5025321, 5150618, 5280880, 5417959, 5562852, 5715296, 5875353, 6043613, 6219576, 6402133, 6592370, 6793549, 7007248, 7231752, 7465417, 7709319, 7965280, 8233739, 8515387, 8812946, 9129540, 9467034, 9827545, 10214887, 10633031, 11084881, 11573839, 12104340, 12679122, 13297821, 13959833, 14666628, 15419908, 16220028, 17068286, 17968753, 18925985, 19943027, 21023532, 22173731, 23400426, 24709316, 26107464, 27605586, 29216124, 30950994, 32822448, 34843450, 37025468, 39378639, 41916072, 44656134, 47620142, 50831721, 54320029, 58120749, 62274566]
55904F2274566M556546N025937N579091O225139O971518P831350Q815085R922866
55896A17202098J1159240J2550554J4135071J5942830J7996384K0310360K2853027
55889B32149564K5498336K8005793K9971935L0710347K9238803K4649375J6781630
55882D17005783O635682l960881j3231798k0165126k4603595k6893918k7535185
55875C07250962k7014744k5747134k4036873k2082888k0023368j7967951j5998589
55868A54379415j4170878j2525798j1088119r852460q786739p855796p035917
55861H3063708o310420n665673n094589m594248m157125l771240l428926l127875
55853D6913612k863508k627928k416725k229553k063332j911558j771034j643086
$$ y = [62274566, 66831112, 71857049, 77436140, 83661279, 90632797, 98464147, 107279232, 117202098, 128361338, 140911892, 155046963, 170989793, 188986177, 209296537, 232149564, 257647900, 285653693, 315625628, 346335975, 375574778, 400224153, 417005783, 423641465, 419680584, 406448786, 386283660, 361680065, 334786147, 307250962, 280236218, 254489084, 230452211, 208369323, 188345955, 170378004, 154379415, 140208537, 127682739, 116594620, 106742160, 97955421, 90099625, 83063708, 76753288, 71087615, 65993026, 61398778, 57241653, 53470413, 50041487, 46913612, 44050104, 41422176, 39005451, 36775898, 34712566, 32801008, 31029974, 29386888]
55845B9386888j527599j421622j324317j237404j159881j087418j017753r52012
55837A9658882q90392q31338p75366p24967o80135o38237n98617n63013n31009
55828A3425808m99391m66628m34117m02602l71185l40190l11075k83129k54155
55819A0063336k24821j98613j77227j60240j49925j51714j67851j93835k22848
55810H416262k50789k75643k95040l06846l10714l07705k99586k88765k77178
55801E803996k64790k50720k35665k21371k08125j94997j82169j70716j60323
55792C915120j49803j39647j31545j25516j20153j15379j12220j10052j07068
55783B803737j03405j00713r8608r4785q8953q3366p9020p4517o9411o5252o2349
$$ y = [29386888, 27859289, 26437667, 25113350, 23875946, 22716065, 21628647, 20610894, 19658882, 18768490, 17937152, 17161786, 16436819, 15756684, 15118447, 14519830, 13956817, 13425808, 12926417, 12459789, 12025672, 11623070, 11251885, 10911695, 10600620, 10317491, 10063336, 9838515, 9639902, 9462675, 9302435, 9152510, 9000796, 8832945, 8639110, 8416262, 8165473, 7889830, 7594790, 7287944, 6977230, 6669525, 6369939, 6081174, 5803996, 5539206, 5288486, 5052821, 4831450, 4623325, 4428328, 4246159, 4075443, 3915120, 3765317, 3625670, 3494125, 3368609, 3248456, 3133077, 3020857, 2910805, 2803737, 2700332, 2599619, 2501011, 2406226, 2317273, 2233907, 2154887, 2080370, 2010959, 1945707, 1883358]
55772A883358n8796n3970n0023m8431m7765m6341m4418m2372l9349l5400l2570
55761A383923l2023l2071l0761k8497k6558k4880k2977k1298k0105j8512j6097
55750A110144j4031j3226j2834j1875j0845j0445j0061q854p069n231l363j962
55738A000348k118l567m178k624j34J524K168K166J077j184l325m344m895n692
55724I75222o207o335p580j0732j3990j5463j6133j8085k0941k2564k2475k2107
55712G92610k2048k1345j9547j7348j5079j2509j0254r539j0106j0039q209n652
55700F30935l914l226k959k910l307m167n258o425p517q320q874r611j0874j2255
55686E41318j2704j1472r057o985o457p296q470r289r632r392q522p524o956o571
$$ y = [1883358, 1824562, 1770592, 1720569, 1672138, 1624373, 1578032, 1533614, 1491242, 1451893, 1416493, 1383923, 1351900, 1319829, 1289068, 1260571, 1234013, 1209133, 1186156, 1164858, 1144753, 1126241, 1110144, 1096113, 1082887, 1070053, 1058178, 1047333, 1036888, 1026827, 1017973, 1010904, 1005673, 1002310, 1000348, 998230, 994663, 990485, 987861, 987727, 989251, 991419, 993585, 994662, 993478, 990153, 985809, 980914, 975222, 969015, 962680, 955100, 944368, 930378, 914915, 898782, 880697, 859756, 837192, 814717, 792610, 770562, 749217, 729670, 712322, 697243, 684734, 674480, 664941, 654835, 644796, 636587, 630935, 627021, 623795, 620836, 617926, 614619, 610452, 605194, 598769, 591252, 582932, 574058, 564447, 553573, 541318, 528614, 517142, 508085, 501100, 494643, 487347, 478877, 469588, 459956, 450564, 442042, 434518, 427562, 420991]
55672D20991n808m983m834m950m093k312j260j837l014l738m502n908o962o221
55658C60569l910j687p31r97j731j928r36O19J190L29n87l85K37K44K29J189K171
55641C53885J123k033n026o131n974o069o806p498p576p015o091n177m657m671
55627B80284m873m467k718M9K206K293Q21l12l46l51r70j069K14J463P26j535
55611B71415l039k802j937j481j170o96o33j462k639l247k967k126j267q72r51
55596B44126q58O0J565K808L322L329L350L940N306O557O008L200J32p90M21J710
55580B84186J817J220M13r77k939m503n044n113n302n458n530o027o890p021n849
55565B26983m409l854l663k575p71J67n72k002k699k363j695j345j394j748k536
$$ y = [420991, 415183, 410200, 405366, 400416, 396323, 394011, 392751, 390914, 387900, 384162, 379660, 373752, 366790, 360569, 356659, 354972, 354241, 353244, 351513, 349585, 348649, 349268, 350458, 350787, 350200, 349815, 350052, 350296, 350525, 351714, 353885, 355008, 352975, 347949, 341818, 335844, 329775, 322969, 315471, 307895, 300880, 294789, 289612, 284955, 280284, 275411, 270944, 268226, 268275, 270481, 272774, 273595, 273283, 272937, 272586, 271616, 270547, 270761, 272224, 272950, 271415, 268376, 265574, 263637, 262156, 260986, 260290, 259657, 258195, 255556, 252309, 249342, 247216, 245949, 245077, 244126, 243268, 243328, 244893, 247701, 251023, 254352, 257702, 261642, 266948, 273505, 279513, 282713, 282845, 282055, 282476, 284186, 286003, 287223, 287636, 286659, 283720, 279217, 274173, 269060, 263758, 258300, 252770, 246743, 239853, 232832, 226983, 222574, 218720, 215057, 212482, 211711, 211878, 211306, 209304, 206605, 204242, 202547, 201202, 199808, 198060, 195524]
55550A95524l924n463o033m861k526n94j13q72k071l139l758l634k745j533n08
55535A53750J12K97J08k02l54m89j033j920k445k162j412p07j03M28N80J73l54
55518A44267n28o30j207j940j697R1K462L690L012J497J007K104L304K855R89
55503A59276m46n53m89j467k792k837j393J2j26j958m427n876m964k097L31K05
55487A30399j733k712j416O06J304N30o21j669k737l443l127k044j247j148j009
55472A09933j84P91Q44j71j158j074k89j15j016j886j555m35K60M58J006J714
55456A07123J186p26j982r89J053J903J298O32K62q02k529l182j631J036K953
55441A05605L529L320K733J676J57j387k221j793l56R90J369J072Q96R56J037
$$ y = [195524, 191600, 186137, 180104, 175243, 172717, 172123, 172010, 171138, 169067, 165928, 162170, 158536, 155791, 154258, 153750, 153862, 154159, 154267, 154065, 153711, 153222, 152189, 150269, 147824, 145662, 144250, 143543, 143440, 143868, 144448, 144621, 144267, 143739, 143109, 141902, 139962, 138265, 138356, 140818, 144508, 147520, 149017, 150024, 152128, 155432, 158287, 159276, 158830, 158277, 157788, 156321, 153529, 150692, 149299, 149311, 149185, 147227, 142800, 136924, 131960, 129863, 130194, 130399, 128666, 125954, 124538, 125144, 126448, 126978, 126357, 124688, 121951, 118508, 115381, 113337, 112090, 110942, 109933, 109749, 110540, 111384, 111213, 110055, 108981, 108692, 108577, 107561, 105675, 104120, 103685, 103945, 104403, 105409, 107123, 108309, 107583, 105601, 104612, 105665, 107568, 108866, 109498, 109760, 108958, 106429, 103247, 101616, 102652, 105605, 109134, 112454, 115187, 116863, 117020, 115633, 113412, 111619, 111263, 112253, 113622, 114694, 115590, 116546, 117583]
55426A17583J538K710L388K160j31j018J26J264R79M67J025J630Q15o36j040o92
55410A30168j209k679l644l567l298l229k859k108j318j5K386M546L995O33k425
55395A15377k450q3K135K807K194Q70o94j828k054j641j096m99J83N61K14o86
55379A13310j572k063k061j636j023m77PN04P81O35M43O44Q12K36o25m56Q55J700
55361A10014Q87p78j766j705j165l82P34J821K329K329K312K421K413K191J780
55346A23435R76l52j806k747k969k710k152j257JJ463K771L400K919J419m62k004
55330A19925k788k743k199j678j207j62J597K743J792o88k337j853l99K85Q0J0
55314A10378M92J078J381J331Q56Rp65j115j266j605k015k026j421l45R03J912
$$ y = [117583, 119121, 121831, 125219, 127379, 127248, 126230, 126356, 127620, 128599, 129066, 130091, 131721, 132536, 131900, 130860, 130168, 128959, 126280, 122636, 119069, 115771, 112542, 109683, 107575, 106257, 106242, 108628, 113174, 117169, 117802, 115377, 112927, 112844, 114979, 117786, 119980, 120850, 120156, 118328, 116274, 114633, 113537, 113038, 113221, 113782, 113996, 113310, 111738, 109675, 107614, 105978, 104955, 104478, 104485, 104989, 105770, 106405, 106848, 107492, 108304, 108540, 107915, 107459, 108314, 110014, 110901, 110123, 108357, 106652, 105487, 105105, 105839, 107660, 109989, 112318, 114630, 117051, 119464, 121655, 123435, 124411, 124059, 122253, 119506, 116537, 113827, 111675, 110418, 110419, 111882, 114653, 118053, 120972, 122391, 121929, 119925, 117137, 114394, 112195, 110517, 109310, 109148, 110745, 113488, 115280, 114592, 112255, 110402, 110003, 110288, 110368, 110378, 110870, 111948, 113329, 114660, 115516, 115525, 114760, 113645, 112379, 110774, 108759, 106733, 105312, 104967, 105870, 107782]
55298A07782K278J918J058o9j153j638j211l72J47M03P96R36J99o82j54J739L084
55281A15061K834K162K220K252J123n81j492j517j479j511j238r13j023j224q90
55266A13784k03L30Q52J548J718P28o79j231q18k00K90N54J5j421k388j582K56
55249A11553J493K047K729K799O86k868m846l798j495rQ59J989K694J686o59k527
55233A12333k730j528J07J269J494J025M65K5l89k92J093L288M333K975L45j335
55217A22478j189j17O57O68J06n76r03p08k24K84P75J156J139O44J32J58P25J273
55199A26478J278P87L35K95L16k37j160j361m67J70r31k985l416j007K379L834
55183A24308K588N27j85N64J013j48k065k663j254O68J492J532K096L211L497
$$ y = [107782, 110060, 111978, 113036, 112967, 111814, 110176, 108965, 108593, 108740, 109143, 109939, 110875, 111074, 110392, 110238, 111977, 115061, 117895, 120057, 122277, 124529, 125652, 125071, 123579, 122062, 120583, 119072, 117834, 116921, 115898, 114674, 113784, 113581, 113911, 114763, 116311, 118029, 118757, 118078, 116847, 116029, 115829, 116119, 116673, 116688, 115267, 112879, 111297, 111553, 113046, 115093, 117822, 120621, 121307, 118439, 113593, 109795, 108300, 108291, 109150, 111139, 113833, 115519, 114860, 112333, 109603, 108075, 108182, 109451, 110945, 111970, 112435, 112460, 112071, 111779, 112872, 116160, 120493, 123468, 123813, 122478, 121289, 121172, 121829, 122497, 122603, 122027, 121124, 120416, 120192, 120476, 121251, 122407, 123546, 124190, 124322, 124480, 125205, 126478, 127756, 128543, 128878, 129173, 129489, 129252, 128092, 126731, 126264, 126434, 125503, 122518, 119102, 118095, 120474, 124308, 126896, 127423, 127238, 127802, 128815, 128667, 126602, 123939, 122685, 123353, 124845, 126377, 128473, 131684, 135181]
55168A35181K138r2j929k823k967k821k744k595j808l08R95J265Q71N93L36k91
55152A23001o40K71J883K479J533K37m23n91l37P88K397L025K145J085J023J244
55136A39120N24p80j375j084r83j583k005j195N04J457M73j462j952p4K082J955
55120A33622o4j273m50R22J464J760K555L025K238R25L50N16P97J252J904J709
55104A51252o9k089k230l71J561K086J440M92k88o28l19L46O34P7j209k666l464
55087A44555l014j760q47n66K8J258J725K62j908k505j207K48O98O27O16L78k18
55070A38370n43k68Ok61p63r78q24l08O43J622J791J086N29P73J032L61o08l11
55052A41349J380K607J691p60k572k378q00O65J143P16n9n00k17L15R5r00j121
$$ y = [135181, 137319, 137227, 135298, 132475, 129508, 126687, 123943, 121348, 119540, 119232, 120227, 121492, 122363, 122956, 123292, 123001, 122361, 122632, 124515, 126994, 128527, 128764, 128341, 127750, 127413, 128201, 130598, 133623, 135768, 136853, 137876, 139120, 139644, 138864, 137489, 136405, 135422, 133839, 131834, 130639, 131143, 132600, 133073, 131611, 129659, 129585, 131667, 133622, 133558, 132285, 131835, 132757, 134221, 135981, 138536, 141561, 143799, 144724, 145074, 145590, 146387, 147639, 149543, 151252, 151183, 149094, 146864, 146493, 148054, 150140, 151580, 152072, 151784, 151156, 150837, 151183, 151817, 151894, 150685, 148019, 144555, 141541, 139781, 138934, 138368, 138396, 139654, 141379, 141641, 139733, 137228, 136021, 136269, 136967, 137594, 138210, 138588, 138370, 137827, 137559, 137565, 137304, 136541, 135563, 134739, 134431, 135074, 136696, 138487, 139573, 140102, 140875, 141907, 142268, 141660, 141349, 142729, 145336, 147027, 146267, 143695, 141317, 140517, 141182, 142325, 143041, 142982, 142482, 142265, 142580, 142675, 141775, 140654]
55035A40654O13L082L863K558J307J754K979L145J932K93j084j975k093j595j446
55020A53987k228l005k537j097k0J86N9o7m22r82j470j987k676k931k070n62N26
55003A32704J172K228L586L962K762J016k6j46K96J071J747J668Q30J66L03O60
54987A53999K47j001k118k010l74J857K981K058L0j360j578j381j088j83J112
54972A51191J444L25q02n82J67k89j920k932k171l17J257J753J083l06j576k205
54956A44120k490k723k104L64L806N608M297J333p03j045q57r68p71M26J984K538
54940A52815J639K64k37N40J794K410K017J131L42l43j112j616j232LJ303K127
54924A61845K646K944K415O76j286j815n36J049J235J09o06L85K318L187K185
$$ y = [140654, 141267, 144349, 148212, 150770, 152077, 153831, 156810, 159955, 161887, 162180, 161096, 159121, 157028, 155433, 153987, 151759, 148754, 146217, 145120, 145100, 145286, 145345, 145278, 144856, 143874, 142404, 140417, 137741, 134810, 132740, 132178, 132704, 133876, 136104, 139690, 143652, 146414, 147430, 147404, 147258, 147554, 148625, 150372, 152040, 152870, 153036, 153339, 153999, 154246, 153245, 151127, 149117, 148743, 150600, 153581, 155639, 155669, 154309, 152731, 151350, 150262, 150079, 151191, 152635, 152960, 152158, 151576, 151743, 151454, 149534, 146602, 144431, 144114, 145371, 147124, 148207, 147901, 146325, 144120, 141630, 138907, 136803, 137167, 140973, 146581, 150878, 152211, 151508, 150463, 149606, 148638, 147867, 148293, 150277, 152815, 154454, 154718, 154481, 155021, 156815, 159225, 161242, 162373, 162715, 162372, 161260, 159644, 158412, 158415, 159718, 161845, 164491, 167435, 169850, 170526, 169240, 167425, 166889, 167938, 169173, 169282, 168676, 169061, 171379, 174566, 176751]
54909A76751P20M14P64J5j750k200j46K287K379L93j213j258m84N50J804K204
54893A81230M41k279k798k76K466L007K345K225J883o1k187j853N32J741K51j950
54877A84717k520j607o86l20q7K66O12Q57J025J319K133L648N368O577P010O629
54861B14941N275L377K475L768O369Q264Q956R736J1174J1788R899N949K120R5
54847C04186m06j018k930n548p230p284o663o282n705m451l533m235n949o892
54833B36060o616o099n505l867j225Q07J237R83J243J895K232K124J793J416J487
54818B27965K503L927M594M548N113O658P749P352O384O042N911N005L539K362
54804B99652J356k53k568n108p554r447r743q012n607m511n196o517p373p480
$$ y = [176751, 177471, 177885, 178649, 178664, 176914, 174714, 174568, 176855, 179234, 179627, 178414, 177156, 176672, 177222, 179026, 181230, 181671, 179392, 176594, 176318, 178784, 181791, 184136, 186361, 188244, 188183, 185996, 184143, 184675, 186416, 186667, 184717, 182197, 180590, 179904, 179584, 179497, 179763, 180375, 181232, 182257, 183576, 185709, 189357, 194725, 201302, 208312, 214941, 220216, 223593, 226068, 229836, 236205, 244469, 253425, 263161, 274335, 286123, 296022, 301971, 304091, 304186, 303780, 302762, 299832, 294284, 287054, 279770, 273107, 266825, 261120, 256669, 253136, 248901, 242952, 236060, 229444, 223345, 217840, 213973, 212748, 213555, 214792, 215775, 217018, 218913, 221145, 223269, 225062, 226478, 227965, 230468, 234395, 238989, 243537, 248650, 255308, 263057, 270409, 276793, 282835, 288746, 293751, 297290, 299652, 301008, 300755, 298187, 293079, 285525, 276078, 266335, 258323, 252716, 248205, 243009, 236492, 229119, 221639]
54790B21639o825n408l660k355k011k637l726m284l467j679l59j97l75k11m98
54775A83947j981l523l243j179O99J048M19p2o2K93P60Q52J10j025j330k58J212
54758A76667J578L84j429k433j855o0J838K894K830J813K05j314j859j091M60
54743A78628J974K929K938J706l07j779j742n72O51J272J135K67q48j306q55l47
54727A83744l84l01N32J311R86J44J78R58J093L85K11J208K342K866L494M781
54711B03548N698N088L530K612K924L858M907O116P408Q422R045R472R735R574
54697B91937Q715O996M476J738k52j117j594k596l977m956n517o463p888q534
54683B70968p388n311m123m230m215k990j317n08m66r8P52J174R06P68R56L95
$$ y = [221639, 214814, 209406, 205746, 203391, 201380, 198743, 195017, 190733, 187266, 185587, 185228, 185031, 184656, 184445, 183947, 181966, 178443, 175200, 174021, 174720, 175768, 176187, 176115, 176053, 176346, 177106, 177958, 178068, 177043, 175713, 175455, 176667, 178245, 178629, 177200, 174767, 172912, 172852, 174690, 177584, 180414, 182227, 182432, 181118, 179259, 178168, 178628, 180602, 183531, 186469, 188175, 187868, 186089, 184347, 183775, 184426, 185698, 186833, 187100, 186252, 184946, 184091, 183744, 183360, 183059, 183591, 184902, 185888, 186032, 186210, 187168, 188261, 188646, 188857, 190065, 192407, 195273, 198767, 203548, 209246, 214334, 217864, 220476, 223400, 227258, 232165, 238281, 245689, 254111, 263156, 272628, 282363, 291937, 300652, 307648, 312124, 313862, 313610, 312493, 310899, 308303, 304326, 299370, 293853, 287390, 279502, 270968, 263580, 258269, 254146, 249916, 245701, 242711, 241394, 240886, 240420, 240322, 241074, 242248, 243154, 243922, 244878, 245273]
54667B45273j340k641j683J039L319L951L667L650M347N696P334Q483Q552P843
54653B97490O896N473L252J098J24l81k260n517p944q323q038q438q516o910m678
54638B53328l946m673m953m079l254l193l107k440j979k427l261l684l704l560
54624B05068l001j798k64J183K263K395J025j132k375k203k009k793l452k637
54610A90270j084m26n39o7Q96Q09n07j331p94k29p94j613j524j065j159j043N31
54593A80331K778L495K047O4q74q11m62q5K41L20K54M56Q80J055R06P94O12r9
54575A91902j010j093j64P37R48J016J361J298L64m50L6J358K035J565P05L0o42
54558A99996j404j905j944j717j336o88R6N87N78K76kj8M09J169J708J584J149
$$ y = [245273, 243933, 241292, 239609, 240648, 243967, 247918, 251585, 255235, 259582, 265278, 272612, 281095, 289647, 297490, 304386, 309859, 313111, 314209, 314333, 313952, 311692, 306175, 298231, 289908, 281870, 273432, 264916, 258006, 253328, 249382, 244709, 239756, 235677, 232423, 229230, 226123, 223683, 221704, 219277, 216016, 212332, 208628, 205068, 202067, 200269, 200005, 201188, 203451, 205846, 206871, 205739, 203364, 201161, 199152, 196359, 192907, 190270, 189186, 188760, 188221, 188154, 189050, 189859, 189352, 188021, 187227, 186998, 186204, 184591, 183067, 182002, 180843, 179800, 180331, 183109, 186604, 188651, 188715, 187841, 187030, 186568, 186483, 186724, 187044, 187298, 187754, 188634, 189689, 190595, 191389, 192001, 191902, 190892, 189799, 189635, 190372, 191320, 192336, 193697, 194995, 195359, 194909, 194945, 196303, 198338, 199903, 200608, 200638, 199996, 198592, 196687, 194743, 193026, 191690, 191002, 191098, 191685, 192263, 192539, 192537, 192519, 192928, 194097, 195805, 197389, 198538]
54541A98538J141J662J973J468M67j38J28P81Q89J08r08j371j304j148p43L14
54525B01857J358R79p99j918p88J549K894K728K176J835J261N42O58J821K755
54510B18908K310R41oR4P70J169Q20Ol66L87J863K927K950K245J404P80O72J250
54492B39124K078K198J108p16k333l042k591j177N80K094L315M470N336N213L770
54477B59427J615j22o10K5P70P71M77J106K603L128J577m72o89P63J639R64M1
54460B73013J8M32O40P84O47o69k887m001k910j153o52j076r70l56k95o93n38
54443B59334J14K63r2%M86J54j297k699l280l497l499k424n5K194L041K955K984
54426B54682K986K304J435J520K480L067K712K073J677J169L50j01M60J674K819
$$ y = [198538, 199679, 201341, 203314, 204782, 205249, 205111, 205239, 206020, 206909, 207017, 206109, 204738, 203434, 202286, 201543, 201857, 203215, 204194, 203395, 201477, 200689, 202238, 205132, 207860, 210036, 211871, 213132, 213674, 214332, 216153, 218908, 221218, 222159, 222153, 222247, 223017, 224186, 225006, 225012, 224646, 225033, 226896, 229823, 232773, 235018, 236422, 237202, 237874, 239124, 241202, 243400, 244508, 243792, 241459, 238417, 235826, 234649, 235229, 237323, 240638, 245108, 250444, 255657, 259427, 261042, 260920, 260310, 260335, 261105, 261876, 262353, 263459, 266062, 269190, 270767, 270295, 269606, 270369, 272008, 272972, 273013, 273031, 273463, 274103, 274887, 275534, 274865, 271978, 267977, 265067, 263914, 263262, 262186, 261216, 260860, 260565, 259872, 259334, 259448, 259711, 259619, 259619, 260105, 260259, 258962, 256263, 252983, 249486, 245987, 243563, 243508, 245702, 248743, 251698, 254682, 257668, 259972, 261407, 262927, 265407, 268474, 271186, 273259, 274936, 276105, 276455, 276354, 276814, 278488, 281307]
54411B81307L810M843N477M943L398K076J892K368K305J282J82K10J557L100L473
54396C22223K478J224P35O79jj347k028j118M32Q34k79j522j650r91o30q85j278
54379C16876j549j949k499k714k360j949k037k359k220j605j216j239q22O66K355
54364B95379K709J534L17L18J147J584J222O56L54J31l49j009j401j095j56O36
54348C01977L82p65j416n22J146J760O13j178k114j785o65P05J822K023R66o45
54332C02304j448p64O29J390J084N26O07J185J415Q73r9j021j653j741j089p9
54316C02119M91M07K86N64Q14N47Q6Q5N94J085J026J08j463k565j907K75K108
54299C04660K342J777J592J466O55k71m59o87k203m210m624l224j948j912k258
$$ y = [281307, 285117, 289960, 295437, 300380, 303778, 305854, 307746, 310114, 312419, 313701, 313883, 314093, 315650, 318750, 322223, 324701, 325925, 326660, 327339, 327338, 325991, 323963, 322845, 323277, 324111, 323832, 322310, 320660, 319669, 319039, 318154, 316876, 315327, 313378, 310879, 308165, 305805, 303856, 301819, 299460, 297240, 295635, 294419, 293180, 292358, 293024, 295379, 298088, 299622, 299939, 300257, 301404, 302988, 304210, 304866, 305220, 305351, 305002, 303993, 302592, 301497, 301341, 301977, 302359, 301594, 300178, 299656, 300802, 302562, 303175, 301997, 299883, 298098, 297433, 298138, 299960, 301983, 302949, 302304, 300856, 300092, 300721, 302111, 303195, 303721, 304328, 305513, 306928, 307801, 307702, 306681, 305028, 303287, 302198, 302119, 302610, 303017, 303303, 303867, 304681, 305228, 305314, 305399, 305993, 307078, 308104, 308212, 306749, 304184, 302277, 302552, 304660, 307002, 308779, 310371, 311837, 312492, 312221, 311762, 311075, 308872, 304662, 300038, 296814, 294866, 292954, 290696]
54284B90696k236k319k593k163j025n68j202j386k92N03m11j647r83J185K444
54269B78003J721J07j270k336l003k744j646q16j220k688m134m417l095q30J151
54254B52783K211K517K179J065k26m68M30R10l7j288j334m68J7p7j8K65L10K74
54236B59045N97R14O10o0o41j590l266m509l967k246j006m20M56J210L92j623
54220B43896k460j073Q28J320M58q65k296l300k789p71R61J032K66K41J112J904
54204B38464K094J825J337J031J334J916J892J405J670K668K349n05l898m811
54190B48771k931m50J156K196K974K914J916R22M98P3q37j684j803j450j245j174
54174B49846q81o07j072k384l613l673k575j490j481k363l016k763j963j195m46
$$ y = [290696, 288460, 286141, 283548, 281385, 280360, 279792, 278590, 277204, 276912, 277415, 277004, 275357, 274374, 275559, 278003, 279724, 279831, 278561, 276225, 273222, 270478, 268832, 268016, 266796, 264108, 259974, 255557, 252462, 251632, 252783, 254994, 257511, 259690, 260755, 260529, 260061, 260491, 261401, 261364, 260076, 258742, 258274, 258291, 258214, 258196, 258461, 258771, 259045, 259642, 260556, 261166, 261106, 260465, 258875, 255609, 251100, 247133, 244887, 243881, 243461, 243917, 245127, 245519, 243896, 241436, 240363, 241191, 242511, 242969, 242104, 239808, 236508, 233719, 232948, 233909, 234941, 235207, 235448, 236560, 238464, 240558, 242383, 243720, 244751, 246085, 248001, 249893, 251298, 252968, 255636, 257985, 257480, 253582, 248771, 245840, 245390, 246546, 248742, 251716, 254630, 256546, 257468, 257966, 258039, 257202, 255518, 253715, 252265, 251020, 249846, 248965, 248358, 247286, 244902, 241289, 237616, 235041, 233551, 232070, 229707, 226691, 223928, 221965, 220770, 220324]
54159B20324N38J534K032J920J598J449J519J644J621J276N64m05j491k509l110
54144B28504k890j833m77M62N93J16k67Q5R26J221M77l51k8J263K353K859L232
54127B36245L102J289j952m277l909j865m36l48n79k61N13J310J701J253N4j056
54111B30784j478j599j848j760r24r6j40n55k96N03J003J280J881K168J024r14
54095B29033j703q70R0L14O55J455J374l08j962j767l48L52r8n39l61n2Q5L35
54077B25685O64P43Q55J683K998L568K655Q46p82j690j882j664j531j747j757
54062B28644p05J275K852K993K193J777K282K946K655J043j224k944l215k139
54048B38433p88l11q47j434j102j4P41N46lK9O54J060Q27L89K44K86J78j20l73
$$ y = [220324, 220862, 222396, 224428, 226348, 227946, 229395, 230914, 232558, 234179, 235455, 236019, 235614, 234123, 231614, 228504, 225614, 223781, 223304, 223766, 224359, 224475, 224208, 224293, 225219, 226440, 226917, 226566, 226538, 227801, 230154, 233013, 236245, 239347, 240636, 238684, 234407, 230498, 228633, 228197, 227849, 227270, 227009, 227522, 228832, 230533, 231786, 231840, 230784, 229306, 227707, 225859, 224099, 223175, 223079, 222939, 222384, 222088, 222591, 223594, 224874, 226755, 228923, 229947, 229033, 227330, 226460, 226550, 226864, 227519, 228974, 230348, 230040, 228078, 226311, 225963, 226315, 226217, 225678, 225317, 225265, 225350, 225685, 226349, 227092, 227947, 229630, 232628, 236196, 238851, 239697, 238915, 237225, 235343, 233679, 232148, 230401, 228644, 227939, 229214, 232066, 235059, 237252, 239029, 241311, 244257, 246912, 247955, 246731, 243787, 240572, 238433, 237645, 237334, 236487, 235053, 233951, 233937, 234678, 235224, 235221, 235250, 235904, 236964, 237791, 238180, 238424, 238710, 238888, 238768, 238395]
54029B38395l07K93J303K074K095J789J887J967Q76j056j688L4K158K262Q60N02
54013B53444K008L666M108L774L113J543p70k050j276O3L08M48K531N931P484
53998B84325N570K162J70K68J142J712J971K253K616K862K734K291K244L406N492
53983C21218P102P391P167P658Q737R236Q792Q291Q449Q889R078R341J0405J2331
53969D44085J4535J6491J7833J8036J6797J4786J3189J2256J0877Q089M449J348
53957E92771p03k276l787m912n477o017o917p616p370o524o238p027q249r167
53943E10491r854j0764j1778j2182j1424r639p516n802m909m697m623m287l905
53930D09111m167n403o946p508o474m771m069m979o274o197m358k016n10K5K83
$$ y = [238395, 238088, 238381, 239684, 241758, 243853, 245642, 247529, 249496, 250372, 249316, 247628, 247662, 249820, 252082, 252942, 253444, 255452, 259118, 263226, 267000, 270113, 271656, 270886, 268836, 267560, 267623, 267931, 268379, 270910, 276841, 284325, 289895, 292057, 292227, 292495, 293637, 295349, 297320, 299573, 302189, 305051, 307785, 310076, 312320, 315726, 321218, 328320, 335711, 342878, 350536, 359273, 368509, 377301, 385592, 394041, 402930, 412008, 421349, 431754, 444085, 458620, 475111, 492944, 510980, 527777, 542563, 555752, 568008, 578885, 586974, 591423, 592771, 592068, 589792, 586005, 581093, 575616, 569599, 562682, 555066, 547696, 541172, 534934, 527907, 519658, 510491, 500637, 489873, 478095, 465913, 454489, 444850, 437334, 431532, 426623, 421926, 417303, 413016, 409111, 404944, 399541, 392595, 385087, 378613, 373842, 369773, 364794, 358520, 352323, 347965, 345949, 345439, 345464, 345747]
53915C45747N73N60J9o85j117j395j887k433k379j447j32R73J866K732L284L099
53899C47378K360J571P44k95q57K28K747M745M818L878L679M414M991N128N599
53884C91128O350O051M066J681O25J211K613M233N834O905O991O522O479P099
53870D57788P669P663P461P592P890P980Q179R144J0643J1481J1090J0411J0550
53857E75541J1080J0780R794R642J0916J2413J3166J3850J5017J5364J3519J0632
53845G21714R122R173Q556O097L316J999J902J749J152M38l41j298k353l638n477
53830G52111p459q497q320p953q145q443q501q907r816j0046q713o788n774n784
53816F38965o034o330o763o866o386o000n964n170l169k082m285q861j2547j3895
$$ y = [345747, 346320, 346880, 346899, 346214, 345097, 343702, 341815, 339382, 337003, 335556, 335424, 336397, 338263, 340995, 344279, 347378, 349738, 351309, 352053, 351758, 350901, 351129, 353876, 358621, 363439, 367317, 370996, 375410, 380401, 385529, 391128, 397478, 403529, 407595, 409276, 409901, 411112, 413725, 417958, 423792, 430697, 437688, 444210, 450689, 457788, 465457, 473120, 480581, 488173, 496063, 504043, 512222, 521366, 532009, 543490, 554580, 564991, 575541, 586621, 597401, 607195, 616837, 627753, 640166, 653332, 667182, 682199, 697563, 711082, 721714, 730836, 740009, 748565, 754662, 757978, 759977, 761879, 763628, 764780, 765218, 764877, 763579, 761226, 757588, 752111, 744652, 736155, 727835, 719882, 711737, 703294, 694793, 685886, 676070, 666024, 657311, 650523, 644749, 638965, 632931, 626601, 619838, 612972, 606586, 600586, 594622, 589452, 586283, 584201, 579916, 571055, 558508, 544613]
53802E44613j4256j4679j4317j2495j0215q620p552o535n908o021o347o215n678
53789D25775n148m799m616m402l686k448j691k242l267l378k919l384m561m355
53775C74879j962P83J968J712Q78m24j943k707k639l176m807n575l732n47J334
53760C54042J212K48q72j953j845N65M020N780N122M163M752O211O802O001M599
53745C98847L547L492M602O251P412P838Q410R834J1496J1999J0745Q620P083
53732E00176O620O339N269L845L387M162M877M486L435K537J635M51k40L71J377
53717E48727Q98j571m662o823p481o763n358m605n452p168q100p765p134o915
53703D69828o866o934p570q414q057o075m100l853m838n202m276l099k612k579
$$ y = [544613, 530357, 515678, 501361, 488866, 478651, 470031, 462479, 455944, 450036, 444015, 437668, 431453, 425775, 420627, 415828, 411212, 406810, 403124, 400676, 398985, 396743, 393476, 390098, 387179, 383795, 379234, 374879, 372917, 373700, 375668, 377380, 378258, 377834, 375891, 373184, 370545, 367369, 362562, 356987, 353255, 352708, 354042, 355254, 355502, 354630, 352677, 350832, 351397, 355417, 361197, 366319, 370482, 375234, 381445, 388247, 394248, 398847, 402394, 405886, 410488, 416739, 424151, 431989, 440399, 450233, 461729, 473728, 484473, 493093, 500176, 506796, 513135, 518404, 522249, 525636, 529798, 534675, 539161, 542596, 545133, 546768, 547219, 546979, 547350, 548727, 549625, 548054, 543392, 536569, 529088, 522325, 516967, 512362, 506910, 499742, 491642, 483877, 476743, 469828, 462962, 456028, 448458, 440044, 431987, 425912, 421812, 417959, 413121, 407919, 403643, 400544, 397932, 395353]
53689C95353k492k631l594n193o313n840l599m88K025K774J739K26k65M39J092
53674C73233P51j3k84m15j228k088j519J15N85q35j995j161J75k46j725j856n87
53657C60907j95j359k039q24J016J789J647J433J023K19j08P92K114K592K332
53642C71339K355K928L477L719L833L773L312K628K159K076K331K931L623L756
53628D14240L037K074J677J902K249K413K362K000J204Oj427k625k627q99J310
53613D26896J585q33l735m396k795j284j482k651l127k283p72M70J026J062Q10
53598D08491J28j236k868l722l197j791m21M18N50no10k34J173K160J620N08O07
53581D01571J886K397R21j368k291r82J511L358L412J933K66l49K96J573K743
$$ y = [395353, 392861, 390230, 386636, 381443, 375130, 369290, 365691, 365203, 367228, 370002, 371741, 371967, 371702, 372141, 373233, 373984, 373971, 373687, 373272, 372044, 369956, 368437, 368552, 369137, 368302, 366307, 365146, 365321, 365075, 363350, 361494, 360907, 360712, 359353, 357314, 356490, 357506, 359295, 360942, 362375, 363398, 363617, 363509, 364301, 366415, 369007, 371339, 373694, 376622, 380099, 383818, 387651, 391424, 394736, 397364, 399523, 401599, 403930, 406861, 410484, 414240, 417277, 419351, 421028, 422930, 425179, 427592, 429954, 431954, 433158, 433164, 431737, 429112, 426485, 425586, 426896, 428481, 427648, 423913, 419517, 416722, 415438, 413956, 411305, 408178, 405895, 405123, 405593, 406619, 407681, 408491, 408619, 407383, 404515, 400793, 397596, 395805, 395384, 395802, 396352, 396347, 395737, 395503, 396676, 398836, 400456, 400964, 401571, 403457, 405854, 406775, 405407, 403116, 402134, 403645, 407003, 410415, 412348, 412614, 412265, 412561, 414134, 416877]
53566D16877L208K597J237L13Q06K366L729M184M091M158M789N966P082O983N008
53551D73394K094J66K68J800L562M889N668N895N505M370K412J20j294j021J30
53536E07958N47m5j76J167K880L092J615J84K46J254J406k42k687m042l502j948
53520E07707o23K47J105J877J935J116L7o40n78M18K075L179K567R73O35K386
53504E24416M159L555J110l55N50K099J789o83l271l791j731J631M315N040M071
53489E42904K853K653L533M675N544O320P238Q000Q166P866P630P658P858Q561
53475F31459J0374J2939J4707J4744J4153J4635J6098J6998J6908J7244J9030
53464G99289K1324K2695K3102K3275K3295K3132K3881K6825L1267L4757L5823
$$ y = [416877, 420085, 422682, 423919, 424232, 425038, 427404, 431133, 435317, 439408, 443566, 448355, 454321, 461403, 468386, 473394, 475488, 475654, 475922, 477722, 481284, 486173, 491841, 497736, 503241, 507611, 510023, 510143, 508849, 507828, 507958, 508505, 508460, 508284, 509451, 512331, 515423, 517038, 517222, 517468, 518722, 520128, 519886, 517199, 513157, 509655, 507707, 507084, 507331, 508436, 510313, 512248, 513364, 513401, 512761, 512183, 512601, 514676, 517855, 520422, 521395, 522030, 524416, 528575, 532130, 533240, 532885, 533435, 535534, 537323, 536640, 533369, 529578, 527847, 529478, 533793, 538833, 542904, 545757, 548410, 551943, 556618, 562162, 568482, 575720, 583720, 591886, 599752, 607382, 615040, 622898, 631459, 641833, 654772, 669479, 684223, 698376, 713011, 729109, 746107, 763015, 780259, 799289, 820613, 843308, 866410, 889685, 912980, 936112, 959993, 986818, 1018085, 1052842, 1088665]
53453A088665L5419L5255L5814L6633L7698L9478M1791M3528M3716M2455M0582
53442A521034L8696L6855L5251L4673L5717L7589L8468L7497L5858L5265L5846
53431A922749L6275L5616L4111L2225L0034K7840K6451K6238K6427K5822K3906
53420B247694K1119J8455J6890J6585J6412J4999J2393R971Q282O060K015l267
53408B387608q139j1843j4719j7083j9143k1598k4991k8520l0706l1285l1330
53397B148251l1480l1343l0910l1176l2616l4165l4622l4310l4418l5145l5443
53386A782623l4309l1684k8313k5277k3419k2644k1910k0364j8291j6553j5318
53375A524541j3830j1213p204k347K170N266P109R099J2164J5448J7479J8409
$$ y = [1088665, 1124084, 1159339, 1195153, 1231786, 1269484, 1308962, 1350753, 1394281, 1437997, 1480452, 1521034, 1559730, 1596585, 1631836, 1666509, 1702226, 1739815, 1778283, 1815780, 1851638, 1886903, 1922749, 1959024, 1994640, 2028751, 2060976, 2091010, 2118850, 2145301, 2171539, 2197966, 2223788, 2247694, 2268813, 2287268, 2304158, 2320743, 2337155, 2352154, 2364547, 2374518, 2382800, 2388860, 2390875, 2387608, 2379469, 2367626, 2352907, 2335824, 2316681, 2295083, 2270092, 2241572, 2210866, 2179581, 2148251, 2116771, 2085428, 2054518, 2023342, 1990726, 1956561, 1921939, 1887629, 1853211, 1818066, 1782623, 1748314, 1716630, 1688317, 1663040, 1639621, 1616977, 1595067, 1574703, 1556412, 1539859, 1524541, 1510711, 1499498, 1492294, 1489947, 1492117, 1497383, 1504492, 1513591, 1525755, 1541203, 1558682, 1577091]
53363A577091K0075K3708K8414L2369L4826L6361L7576L8438L9090M0598M4047
53352A952593M8881N3025N5226N6716N9513O3477O6482O7569O8424P0956P4871
53341B637733P8749Q2186Q5356Q7520Q7863Q7394Q7996Q9667R0550Q9752Q8339
53330C593105Q7164Q5667Q3510Q1565Q0138P7942P4103O9806O6353O2732N7099
53319D419184N0000M3976M0001L6046K9818K1497J3071O001K45n097j1061j8500
53307D625181k7707l8148m8836n9006o8324p6404q2559q6445q8952r1687r5175
53296C861938r8092r9052r8588r8321r8417r7387r4568r1333q9232q8190q7361
53285B821397q6452q5217q2854p9252p5813p3650p1786o8667o4649o1196n8253
$$ y = [1577091, 1597166, 1620874, 1649288, 1681657, 1716483, 1752844, 1790420, 1828858, 1867948, 1908546, 1952593, 2001474, 2054499, 2109725, 2166441, 2225954, 2289431, 2355913, 2423482, 2491906, 2562862, 2637733, 2716482, 2798668, 2884024, 2971544, 3059407, 3146801, 3234797, 3324464, 3415014, 3504766, 3593105, 3680269, 3765936, 3849446, 3931011, 4011149, 4089091, 4163194, 4233000, 4299353, 4362085, 4419184, 4469184, 4513160, 4553161, 4589207, 4619025, 4640522, 4653593, 4659594, 4659839, 4654742, 4643681, 4625181, 4597474, 4559326, 4510490, 4451484, 4383160, 4306756, 4224197, 4137752, 4048800, 3957113, 3861938, 3763846, 3664794, 3566206, 3467885, 3369468, 3272081, 3177513, 3086180, 2996948, 2908758, 2821397, 2734945, 2649728, 2566874, 2487622, 2411809, 2338159, 2266373, 2197706, 2133057, 2071861, 2013608]
53274B013608n4444m9712m5562m2449l8947l4206k9424k5981k3573k1210j8767
53263A629333j6541j4313j1866r480p020l544J015M765N857N048M857O564R296
53250A603971J1847J4066J6159J7936J9286K0704K2778K5433K8040L0135L1883
53239A842238L3972L6867M0072M2368M3161M3230M3690M4539M4839M4197M3248
53228B302421M2487M1278L8611L4602L0723K8290K6920K4893K1249J7062J3992
53217B622528J1927R022M250j242n869r677j3697j8036k1919k5192k8527l2165
53205B491403l5637l8855m2250m5570m7674m8156m8342m9855n2672n5255n6363
53194A970774n6205n5901n6148n6472n5796n3875n1799n0596m9699m7785m5026
$$ y = [2013608, 1959164, 1909452, 1863890, 1821441, 1782494, 1748288, 1718864, 1692883, 1669310, 1648100, 1629333, 1612792, 1598479, 1586613, 1577133, 1570113, 1566569, 1567584, 1572349, 1578206, 1583254, 1588111, 1594675, 1603971, 1615818, 1629884, 1646043, 1663979, 1683265, 1703969, 1726747, 1752180, 1780220, 1810355, 1842238, 1876210, 1913077, 1953149, 1995517, 2038678, 2081908, 2125598, 2170137, 2214976, 2259173, 2302421, 2344908, 2386186, 2424797, 2459399, 2490122, 2518412, 2545332, 2570225, 2591474, 2608536, 2622528, 2634455, 2643477, 2647727, 2646485, 2640616, 2630939, 2617242, 2599206, 2577287, 2552095, 2523568, 2491403, 2455766, 2416911, 2374661, 2329091, 2281417, 2233261, 2184919, 2135064, 2082392, 2027137, 1970774, 1914569, 1858668, 1802520, 1746048, 1690252, 1636377, 1584578, 1533982, 1484283, 1436498, 1391472]
53183A391472m3197m3185m3597m2705m0771l9334l8953l8764l7890l6081l3270
53172I53725k9707k6527k4941k4715k4364k3014k1117j9153j6889j4430j2823
53161G16045j2765j3515j3895j3753j3491j2772j0869q152o246o456q630j1466
53149E84035j3408j3376j1433q895p202o582o267n863n706n872n796n245m905
53136D83485n329n911n602m322l001k319k106k065k543m104o320p505o209l138
53122D23011r17j285k976l407k194j641l309n660o083m268k207j384j461j565
53108C84654j476j241o90J97J111J794K014J154j212m169n822n266l427j703o31
53093C65287k60o90j381j023P26K077J091j499k884j737K79R70L49oM95P85j7
$$ y = [1391472, 1348275, 1305090, 1261493, 1218788, 1178017, 1138683, 1099730, 1060966, 1023076, 986995, 953725, 924018, 897491, 872550, 847835, 823471, 800457, 779340, 760187, 743298, 728868, 716045, 703280, 689765, 675870, 662117, 648626, 635854, 624985, 616833, 610587, 604131, 595501, 584035, 570627, 557251, 545818, 536923, 529721, 523139, 516872, 511009, 505303, 499431, 493635, 488390, 483485, 478156, 472245, 466643, 462321, 459320, 457001, 454895, 452830, 450287, 446183, 439863, 432358, 426149, 423011, 422094, 420809, 417833, 414426, 412232, 410591, 407282, 401622, 395539, 391271, 389064, 387680, 386219, 384654, 383178, 381937, 381247, 381444, 382555, 384349, 386363, 387517, 386305, 382136, 376314, 371048, 367621, 365918, 365287, 365027, 364337, 362956, 361933, 362659, 364736, 365827, 364328, 361444, 359707, 359986, 360956, 361305, 361299, 361794, 362579, 362562]
53076C62562j107r87M66J555O82j598l062k417p95j21m89j78J738L793L852J757
53060C65651n55j464j372j688k763l487k789r44R01K063K671K886K450J301M0
53045C62901p05j061j534k089k170j674j272j599k522l446l984m118l954l505
53031C29268k629j153O70J935J840O83m07q66j162j670j885j391r01j276j921
53016C19135j269R79L212L767K700J247K21l84p26q82j177k004l056l232j732
53001C16799P78K473K091K68j062p26N94J438J288O51j23j154k177k355j527p90
52985C16466j161k210k713k245j365m95L94J036P44o12k104k559j636k9J093Q75
52969C03479m92j786j950j224o92q14j142j410j867k325j900l51J116J216J38
$$ y = [362562, 361455, 360468, 360934, 362489, 363171, 361573, 358511, 356094, 355299, 355178, 354689, 354511, 356249, 360042, 363894, 365651, 365096, 363632, 362260, 360572, 357809, 354322, 351533, 350589, 351490, 353553, 356224, 359110, 361560, 362861, 362901, 362196, 361135, 359601, 357512, 355342, 353668, 352396, 350797, 348275, 344829, 340845, 336727, 332773, 329268, 326639, 325486, 326156, 328091, 329931, 330614, 330207, 329341, 328179, 326509, 324624, 323233, 322332, 321056, 319135, 317866, 318845, 322057, 325824, 328524, 329771, 329992, 329608, 328882, 328000, 326823, 324819, 321763, 318531, 316799, 317577, 320050, 322141, 322409, 321347, 320621, 321215, 322653, 323941, 324592, 324469, 323315, 321138, 318783, 317256, 316466, 315305, 313095, 310382, 308137, 306772, 306277, 306671, 307707, 308451, 307839, 305735, 303176, 301540, 301511, 302604, 303479, 302987, 301201, 299251, 298027, 297335, 296521, 295379, 293969, 292102, 289777, 287877, 287526, 288642, 289858, 289996]
52954B89996j053j940k702k966j982o9J233R25j71m24P37K283K757J741L01o7
52938B88599R51K098K053R82J1m80j015j566j173L49J479P13j358k729k488j529
52922B84897r14o04j17M17N32K03k08m93o16n40l65l78n04m2J418L053L566K943
52904B92248K528L096L739L275J989R91L75p75k648m201m608m246l742l108k336
52889B82577j970k130j790r2K059K875J904K80r95j800j986j211l8K45m52n70
52873B76906P02J819J013r29j717q08J56J51P1P56J371P99m27q79k15N33L48r92
52855B78658l022m724m914l407j460k49O06J993L338L228J885J198J850K117N95
52840B77692j399j605l3J279J217P11Q71J476J679J169K38n49n02O45K144K747
$$ y = [289996, 288943, 287003, 284301, 281335, 279353, 279284, 280517, 281442, 281271, 280847, 281584, 283867, 286624, 288365, 288666, 288599, 289550, 291648, 293701, 294683, 294694, 294214, 293199, 291633, 290460, 290809, 292288, 293001, 291643, 288914, 286426, 284897, 283983, 283379, 283262, 283679, 284211, 284414, 284206, 283713, 283097, 282557, 282192, 281814, 281310, 281268, 282686, 285739, 289305, 292248, 294776, 297872, 301611, 304886, 306875, 307866, 308241, 307466, 304818, 300617, 296009, 291763, 288021, 284913, 282577, 280607, 278477, 276687, 276595, 278654, 281529, 283433, 283713, 282718, 280918, 278932, 277721, 277683, 277928, 277476, 276906, 277608, 279427, 280440, 279511, 277794, 276986, 277142, 277293, 277364, 278120, 279491, 280290, 279863, 278984, 278769, 279302, 279650, 278658, 275636, 270912, 265998, 262591, 261131, 260882, 261488, 263481, 266819, 270047, 271932, 273130, 274980, 277097, 277692, 276293, 274688, 274655, 275934, 277151, 277862, 278733, 280209, 281888, 283057, 283295, 282746, 282244, 282889, 285033, 287780]
52824B87780K052Q29n3l21M8J013K128K666K303J235l07j908k598j706j10N41
52808B93592M0k88K01P03R81K158M491O092N500M107M064M793L859P58k354l712
52792C24985l674l153k201q49J81L44k17j448l535n788o582n129k492l35N42Q1
52776B90730j425k980l180j757j78N0q66j531j015N02K174L010K499J186J61l25
52760B87055r42j685j296Q68L315L817J950o28k105j967r48j70j69k26Q93L150
52744B90912M817M407K368J70j436k366k329j356o07j153k170j863j86R21L21
52729B90450p92q43r0P5q15k000k768k975k525j294L43J519J699J138L09p37k121
52712B78573l454l870k845p44J584L445M343L861K121K01p26p33r75j913k537
$$ y = [287780, 289832, 290661, 290608, 290287, 290335, 291348, 293476, 296142, 298445, 299680, 299373, 297465, 294867, 293161, 293051, 293592, 293632, 293344, 293545, 294248, 295229, 297387, 301878, 307970, 313470, 317577, 321641, 326434, 330293, 331051, 328697, 324985, 321311, 318158, 315957, 315108, 315289, 315633, 315416, 313968, 310433, 304645, 298063, 292934, 290442, 290107, 290649, 290730, 289305, 286325, 283145, 281388, 281210, 281260, 280394, 278863, 277848, 278350, 280524, 283534, 286033, 287219, 287380, 287055, 286113, 284428, 283132, 284000, 287315, 291132, 293082, 292454, 290349, 288382, 287434, 287264, 287095, 286869, 287762, 290912, 295729, 300136, 302504, 302674, 301238, 298872, 296543, 295187, 294580, 293427, 291257, 289394, 289208, 290129, 290450, 289658, 288815, 288725, 288800, 287985, 285985, 283217, 280242, 277717, 276423, 276766, 278285, 279984, 281122, 281431, 280694, 278573, 275119, 271249, 268404, 267660, 269244, 272689, 277032, 280893, 283014, 283215, 282489, 281756, 280781, 278868, 276331]
52697B76331j781o8J193J209L09p48j351j170l03Q17J893K798L021J859l02j727
52681B81980j256J36O22j59j094j407j201m92R34K595L539L697L846M076L454
52666B99270J646j59o06L24J577K162J723N92m23q61j181j880k321j704r54j982
52650B95223m678o478n677l522j982j138k22M24L36O24K402M243L674Q71j490
52635B82610k165k653m000m737l365r31N01O70Q05J297J435R49M42L42N63J041
52619B72804J657J841J245O20R61J931K260J706J368J735J754N88p65p91K12M44
52603B89570q37k205k034o33L40K32Q3Q45J919K179J786J889K718L215K891K696
52587C04654L290L586K239j72j848k181j982j608o22N30N07o75j114J51J329L99
$$ y = [276331, 274550, 274482, 275675, 276884, 277193, 276445, 275094, 273924, 273621, 274438, 276331, 279129, 282150, 284009, 283707, 281980, 280724, 280860, 281482, 281323, 280229, 278822, 277621, 277129, 278063, 280658, 284197, 287894, 291740, 295816, 299270, 300916, 300757, 300151, 300475, 302052, 304214, 305937, 306529, 306106, 305245, 304064, 302184, 299863, 298159, 297205, 295223, 290545, 284067, 278390, 274868, 272886, 271748, 271526, 271950, 272286, 272910, 275312, 279555, 283229, 284100, 282610, 280445, 277792, 273792, 269055, 265690, 264759, 265260, 265930, 266735, 268032, 269467, 270416, 270858, 271200, 271763, 272804, 274461, 276302, 277547, 278167, 279128, 281059, 283319, 285025, 286393, 288128, 289882, 290470, 289705, 288914, 289126, 289570, 288733, 286528, 284494, 283861, 284201, 284433, 284516, 285361, 287280, 289459, 291245, 293134, 295852, 299067, 301958, 304654, 307944, 311530, 313769, 313597, 311749, 309568, 307586, 305978, 305356, 305886, 306393, 305718, 304604, 304755, 306084, 306483]
52571C06483j793k685j549k2O71J164K210L150K887J532K32k36k16n79j591k474
52555C07184k256j069p2J39K02O30P02k47j317j115J72J160J368J503J805J700
52539C10489J129P05M38l44j443j769j114m97l09L13J639K483K100J482J698K196
52523C19196J874P97k61j034j566j619j184o91p0J299K982L227J419o35j123n95
52507C22016m39m82L9L78o01j978j757O4J502J537J067Q73N48l37j441k376k893
52490C15720k503j136J08L24M72J939L743L344L49k710l690l057k286j933j977
52475C06707k294k114n74J557K252J020l34m74k49o96j060j81J435K327J923O07
52459C09852j028k081j557L42K038K498K260J944J236K82L86J929L118K511J441
$$ y = [306483, 304690, 302005, 300456, 300434, 301105, 302269, 304479, 307629, 310516, 312048, 312280, 312044, 311828, 311249, 309658, 307184, 304928, 303859, 303787, 303926, 304128, 304758, 305460, 305213, 303896, 302781, 302953, 304113, 305481, 306984, 308789, 310489, 311618, 312323, 312761, 312417, 310974, 309205, 308091, 307594, 307285, 307598, 309237, 311720, 313820, 315302, 317000, 319196, 321070, 321867, 321606, 320572, 319006, 317387, 316203, 315512, 315442, 316741, 319723, 322950, 324369, 323734, 322611, 322016, 321577, 321095, 321134, 321512, 320911, 318933, 317176, 317240, 318742, 320279, 321346, 322219, 322767, 322430, 320989, 318613, 315720, 313217, 312081, 312189, 312513, 312985, 314924, 318667, 322011, 322360, 319650, 315960, 312903, 310617, 308684, 306707, 304413, 302299, 301725, 303282, 305534, 306554, 306220, 305746, 305497, 304801, 303741, 303560, 304995, 307322, 309245, 309852, 308824, 306743, 305186, 305528, 307566, 310064, 312324, 314268, 315504, 315786, 316172, 318101, 321219, 323730, 325171]
52444C25171J918L215K963J072J27J548L470L246O39k303l697l399k496j856j324
52429C28294l67P07R91N09M68J409K164J537J14o11k35O25J651K786L380K724
52413C46146J308M16N72J217J754J989J905J802K237L016K789P69j755k736j823
52398C59606k83R76J881K141J304j13j091j705k851m299m648l511k330k351l028
52383C39698l099k258j104j94J60j66q19j030l50Q66J797J696L99j197j539j90
52367C32670J211P89r51j727n75J063J593J236J131J590K035K006J597J261J383
52352C46312J707J462O05M53J910L667L728K511K395M097N623N541N027N404N630
52337C96072M063J254r84k315l740n309n824m720k772r95O3J14n27o68N80K413
$$ y = [325171, 327089, 330304, 333267, 334339, 334466, 336014, 339484, 342730, 343369, 341066, 337369, 333970, 331474, 329618, 328294, 327927, 328634, 329625, 330134, 330602, 332011, 334175, 335712, 335826, 335215, 334980, 335605, 337256, 340042, 343422, 346146, 347454, 347870, 348442, 349659, 351413, 353402, 355307, 357109, 359346, 362362, 365151, 365920, 364165, 361429, 359606, 359323, 360299, 362180, 364321, 365625, 365512, 364421, 362716, 359865, 355566, 350918, 347407, 345077, 342726, 339698, 336599, 334341, 333237, 333043, 333203, 333037, 332218, 331188, 330838, 331704, 333501, 335197, 335596, 334399, 332860, 332670, 333881, 334670, 333719, 331992, 331417, 332480, 334073, 335309, 336440, 338030, 340065, 342071, 343668, 344929, 346312, 348019, 349481, 350086, 350539, 352449, 356116, 359844, 362355, 364750, 368847, 374470, 380011, 385038, 390442, 396072, 400135, 401389, 400405, 398090, 394350, 389041, 383217, 378497, 375725, 374730, 374793, 374907, 374380, 373712, 374292, 376705]
52321C76705L218K683J924J706J753J776J846J620N44q64j157J28J727K370K234
$$ y = [376705, 379923, 382606, 384530, 386236, 387989, 389765, 391611, 393231, 393775, 392911, 391754, 391882, 393609, 395979, 398213]
$$ [...]
##END NTUPLES=NMR SPECTRUM
##END=
