
##TITLE=AC1029_Robusta_6301173_GJ9ZwC42dt
##JCAMPDX= 6.0         $$ Bruker NMR JCAMP-DX V2.0
##DATA TYPE= NMR SPECTRUM
##DATA CLASS= NTUPLES
##ORIGIN= BRUKER
##OWNER= Administrator
$$ 1.72 TOPSPIN		Version 2.1
$$ 2012-06-05 22:00:21.312 -0500  Administrator@TOPSPIN
$$ Compression mode = diff/dup
##.OBSERVE FREQUENCY= 400.13188235
##.OBSERVE NUCLEUS= ^1H
##.ACQUISITION MODE= SIMULTANEOUS (DQD)
##.ACQUISITION SCHEME= undefined
##.AVERAGES= 8
##.DIGITISER RES= 22
##SPECTROMETER/DATA SYSTEM= spect
##.PULSE SEQUENCE= zg30
##.SOLVENT NAME= COFFEE_meoh
##.SHIFT REFERENCE= INTERNAL, COFFEE_meoh, 1, 14.98061
##AUDIT TRAIL= $$ (NUMBER, WHEN, WHO, WHERE, PROCESS, VERSION, WHAT)
$$ ##TITLE= Audit trail, TOPSPIN		Version 2.1
$$ ##JCAMPDX= 5.01
$$ ##ORIGIN= Bruker BioSpin GmbH
$$ ##OWNER= Administrator
$$ $$ C:\Bruker\TOPSPIN/data/COFFEE/nmr/AC1029_Robusta_6301173_GJ9ZwC42dt/10/pdata/1/auditp.txt
$$ ##AUDIT TRAIL=  $$ (NUMBER, WHEN, WHO, WHERE, PROCESS, VERSION, WHAT)
(   1,<2012-06-05 22:00:11.953 -0500>,<Administrator>,<TOPSPIN>,<go>,<TOPSPIN 2.1>,
      <created by zg
	started at 2012-06-05 21:59:04.687 -0500,
	POWCHK enabled, PULCHK disabled,
       configuration hash MD5:
       D5 CA 7A 23 FE 6B EE E2 50 67 74 61 24 F7 5E 3B
       data hash MD5: 64K
       04 81 48 14 6B 06 C4 5B 2C D5 C5 D5 BF 30 D1 A7>)
(   2,<2012-06-05 22:00:16.359 -0500>,<Administrator>,<TOPSPIN>,<proc1d>,<TOPSPIN 2.1>,
      <Start of raw data processing
       efp LB = 0 FT_mod = 6 PKNL = 1 PHC0 = 0 PHC1 = 0 SI = 32K 
       data hash MD5: 32K
       A6 FC 97 3D 63 5E 15 07 EE 69 C3 04 23 21 94 1C>)
(   3,<2012-06-05 22:00:17.015 -0500>,<Administrator>,<TOPSPIN>,<proc1d>,<TOPSPIN 2.1>,
      <pk PHC0 = 208.6249 PHC1 = 0 
       data hash MD5: 32K
       51 39 0E 07 03 B1 C4 F5 7B 05 40 26 A8 ED 08 63>)
(   4,<2012-06-05 22:00:17.093 -0500>,<Administrator>,<TOPSPIN>,<proc1d>,<TOPSPIN 2.1>,
      <abs ABSG = 1 
       data hash MD5: 32K
       CC 75 0C BC 5D EC E0 4C A3 91 1A EF 05 BA 95 9E>)
(   5,<2012-06-05 22:00:17.140 -0500>,<Administrator>,<TOPSPIN>,<proc1d>,<TOPSPIN 2.1>,
      <abs ABSG = 2 
       data hash MD5: 32K
       2D 27 D5 66 34 1C DD 2C B3 94 63 B7 D8 04 A6 CA>)
(   6,<2012-06-05 22:00:17.171 -0500>,<Administrator>,<TOPSPIN>,<proc1d>,<TOPSPIN 2.1>,
      <abs ABSG = 3 
       data hash MD5: 32K
       DA 27 63 DA E3 CE 96 6B 3F 10 E5 81 CF 52 4B 95>)
(   7,<2012-06-05 22:00:17.187 -0500>,<Administrator>,<TOPSPIN>,<proc1d>,<TOPSPIN 2.1>,
      <abs ABSG = 4 
       data hash MD5: 32K
       1F 05 42 DF AC F4 26 69 07 5E 83 30 0E 34 34 FD>)
(   8,<2012-06-05 22:00:17.234 -0500>,<Administrator>,<TOPSPIN>,<proc1d>,<TOPSPIN 2.1>,
      <abs ABSG = 5 
       data hash MD5: 32K
       61 9C 53 99 FD E6 81 65 15 33 39 4C AD 90 E9 B4>)
$$ ##END=
$$ 
$$ $$ hash MD5
$$ $$ 8A 95 0F DF 30 F6 29 D1 D9 09 15 5C 5D 1B 8A D2
##$RELAX= 
##$RELAX= 
##$RELAX= 
##$RELAX= 
##$RELAX= 
##$RELAX= 
##$RELAX= 
$$ Bruker specific parameters
$$ --------------------------
$$ [...]
150 150 150 150 150 150 150 150
##$TP07= 0
##$TPNAME0= <>
##$TPNAME1= <>
##$TPNAME2= <>
##$TPNAME3= <>
##$TPNAME4= <>
##$TPNAME5= <>
##$TPNAME6= <>
##$TPNAME7= <>
##$TPOAL= (0..7)
0.5 0.5 0.5 0.5 0.5 0.5 0.5 0.5
##$TPOFFS= (0..7)
0 0 0 0 0 0 0 0
##$TUNHIN= 0
##$TUNHOUT= 0
##$TUNXOUT= 0
##$USERA1= <user>
##$USERA2= <user>
##$USERA3= <user>
##$USERA4= <user>
##$USERA5= <user>
##$V9= 5
##$VALIST= <valist>
##$VCLIST= <CCCCCCCCCCCCCCC>
##$VD= 0
##$VDLIST= <DDDDDDDDDDDDDDD>
##$VPLIST= <PPPPPPPPPPPPPPP>
##$VTLIST= <TTTTTTTTTTTTTTT>
##$WBST= 2048
##$WBSW= 25
##$XGAIN= (0..3)
0 0 0 0
##$XL= 0
##$YL= 0
##$YMAX_a= 496126
##$YMIN_a= -602474
##$ZGOPTNS= <>
##$ZL1= 120
##$ZL2= 120
##$ZL3= 120
##$ZL4= 120
##$ABSF1= 14.98061
##$ABSF2= -5.57192
##$ABSG= 5
##$ABSL= 3
##$ALPHA= 0
##$AQORDER= 0
##$ASSFAC= 0
##$ASSFACI= 0
##$ASSFACX= 0
##$ASSWID= 0
##$AUNMP= <proc_prof1d_extract_pilot.lims>
##$AXLEFT= 0
##$AXNAME= <>
##$AXNUC= <1H>
##$AXRIGHT= 0
##$AXTYPE= 0
##$AXUNIT= <>
##$AZFE= 0.1
##$AZFW= 0.1
##$BCFW= 0
##$BC_mod= 0
##$BYTORDP= 0
##$COROFFS= 0
##$CY= 15
##$DATMOD= 1
##$DC= 0
##$DFILT= <>
##$DTYPP= 0
##$F1P= 0
##$F2P= 0
##$FCOR= 0.5
##$FTSIZE= 32768
##$FT_mod= 6
##$GAMMA= 0
##$GB= 0
##$INTBC= 1
##$INTSCL= 1
##$ISEN= 128
##$LB= 0
##$LEV0= 0
##$LPBIN= 0
##$MAXI= 10000
##$MC2= 0
##$MEAN= 0
##$ME_mod= 0
##$MI= 0
##$NCOEF= 0
##$NC_proc= -8
##$NLEV= 6
##$NOISF1= 0
##$NOISF2= 0
##$NSP= 0
##$NTH_PI= 0
##$NZP= 0
##$OFFSET= 14.98061
##$PC= 1
##$PHC0= 208.6249
##$PHC1= 0
##$PH_mod= 1
##$PKNL= yes
##$PPARMOD= 0
##$PPDIAG= 0
##$PPIPTYP= 0
##$PPMPNUM= 2147483647
##$PPRESOL= 1
##$PSCAL= 4
##$PSIGN= 0
##$PYNMP= <proc.py>
##$REVERSE= no
##$SF= 400.13
##$SI= 32768
##$SIGF1= 0
##$SIGF2= 0
##$SINO= 400
##$SIOLD= 32768
##$SPECTYP= <>
##$SREGLST= <1H.CDCl3>
##$SSB= 0
##$STSI= 32768
##$STSR= 0
##$SW_p= 8223.68421052632
##$SYMM= 0
##$S_DEV= 0
##$TDeff= 65536
##$TDoff= 0
##$TI= <>
##$TILT= no
##$TM1= 0
##$TM2= 0
##$TOPLEV= 0
##$USERP1= <user>
##$USERP2= <user>
##$USERP3= <user>
##$USERP4= <user>
##$USERP5= <user>
##$WDW= 1
##$XDIM= 32768
##$YMAX_p= 449377660
##$YMIN_p= -681853
##$CURPLOT= <Network HP LaserJet P1505>
##$CURPRIN= <$Network HP LaserJet P1505>
##$DFORMAT= <normdp>
##$LAYOUT= <+/1D_H.xwp>
##$LFORMAT= <normlp>
##$PFORMAT= <normpl>
##$SURQMSG= 1
$$ End of Bruker specific parameters
$$ ---------------------------------
##NTUPLES= NMR SPECTRUM
##VAR_NAME=  FREQUENCY,     SPECTRUM/REAL,   SPECTRUM/IMAG
##SYMBOL=    X,             R,               I
##VAR_TYPE=  INDEPENDENT,   DEPENDENT,       DEPENDENT
##VAR_FORM=  AFFN,          ASDF,            ASDF
##VAR_DIM=   32768,         32768,           32768
##UNITS=     HZ,            ARBITRARY UNITS, ARBITRARY UNITS
##FACTOR=    0.250966925370066, 1,           1
##FIRST=     8223.43324360095, -169924,      269095
##LAST=      0,             -53232,          -110239
##MIN=       0,             -681853,         0
##MAX=       8223.43324360095, 449377660,    0
$$ Real data points
##PAGE= N=1
##DATA TABLE= (X++(R..R)), XYDATA
$$ [...]
19568a43383q7214e7059o4019A28041a74228B55526c62805C0624K55680A14483
19557e003q1214q0532l6631e1090E3191L71333c89056A75360b66739H9202F023
19545a58967C72406b20454K6063f9933J0681n0684D1060a99340d8947j95849n0273
19534b95069R7243m0685A28578a94220E3065b15487f938k92419J46827j5090Q0043
19523h7577A02431C0970N4691a26837A13222k7178g076l28629A0263c11961G9766
19511a8542B81679j39341F5876c2474j49800f9337l205j94972a15963F7434K44033
19500C11467F0721h1344k25479J39196P1034c4365k5809B11119A3706J2827c6969
19488a52814B03873a46237j01071C5232a10474N987J5521j29614i4104A51244
$$ plain form
19568 -143383 -230597 -57059 -121078 128041 -174228 255526 -362805 30624 286304 114483
19557 -5003 -86217 -166749 -203380 -51090 53191 424524 -389056 175360 -266739 89202 6023
19545 -158967 372406 -220454 -194391 -69933 -59252 -109936 41060 -199340 -48947 -244796 -295069
19534 -295069 -197826 -238511 128578 -194220 53065 -215487 -6938 -299357 -152530 -167620 -87577
19523 -87577 102431 30970 85661 -126837 113222 86044 -7076 -335705 10263 -311961 79766
19511 -18542 281679 142338 65876 -32474 -182274 -69337 -72542 -267514 -115963 67434 311467
19500 311467 60721 -81344 -306823 -167627 -96593 -34365 -60174 211119 13706 26533 -36969
19488 -152814 203873 -146237 -247308 35232 -110474 -104487 -88966 -218580 -94104 151244
19477a7055j63540a4372C5704a20288J8651P874a2248k5650B34595b60543j53817
19466d14360d153A15316j7491m4923P9045K894G789i1238l2355K6526k13943J23372
19454a87638b2435k98659c5813k19496Q4603J3964r7946B9732h8029A1957e35100
19442b55178R3642A07645J2561c41933A72183a20174L6076m05237f9214B820L1904
19431C4724b98294E635g778B31961D7027A0450M3676Q1654b39418l6087d024k1114
19419b5138P790l323o5167B6176g7184p0779j3948A10464C2630a18306l2239A7469
19406G1500N2011A5709a16135m5581j21749P0732h0068j29583j82922B80735B5217
19394A34775b94229D76181E6764c12466A79509D494i1920r7194o1895K4815A3303
$$ plain form
19477 -17055 -180595 -14372 35704 -120288 -101637 -93763 -12248 -37898 234595 -260543 -414360
19466 -414360 -4153 115316 97825 52902 131947 134841 7789 -91238 -123593 -97067 -311010 -187638
19454 -187638 -22435 -321094 -35813 -255309 -170706 -156742 -254688 29732 -88029 11957 -535100
19442 -255178 -161536 107645 120206 -341933 172183 -120174 -84098 -489335 -69214 2820 34724
19431 34724 -298294 5635 -7778 231961 47027 10450 54126 135780 -239418 -275505 -4024 -25138
19419 -25138 -17348 -20671 -85838 26176 -77184 -147963 -161911 110464 32630 -118306 -150545 17469
19406 71500 123511 15709 -116135 -161716 -283465 -212733 -80068 -209651 -392573 280735 25217
19394 134775 -294229 476181 56764 -312466 179509 4494 -91920 -189114 -251009 -226194 13303
19382a62365A83283Q8876h6423k38930A89206a31947L5130A25647n0094b25959
19371b70095A631R8902L2065a53102o9256O9066o4579b9592C85385c78325G8312
19359G9787c7932l29379B7860b53559k0907g3785a1233C7476K47103L592j20911
19348A67260b85371A082a97780j57313C2532N8850P3360d1847P206A39198n9216
19337G9982M682c8532D6017L6245Q313L6406d9969D9387l856g1531E3796b25847
19324D721J12089b30433K4195C60850G2383J76765g6533o7281r9744B4576J30573
19313A55149f883m6783j31234m0072a00515k60196J35301k50769C5980a09395
19302a5335p5690E370c39018O7211J24002b1291p8319A18526J10088i125D6442
$$ plain form
19382 -162365 183283 272159 -86423 -325353 189206 -131947 -96817 125647 75553 -225959
19371 -270095 1631 100533 132598 -153102 -222358 -153292 -217871 -29592 385385 -378325 78312
19359 79787 -37932 -367311 27860 -253559 -274466 -73785 -11233 37476 284579 288171 167260
19348 167260 -285371 1082 -197780 -355093 32532 91382 164742 -41847 -34641 139198 79982
19337 79982 84664 -38532 46017 82262 90575 126981 -49969 49387 45531 -71531 53796 -225847
19324 4721 116810 -230433 -206238 360850 72383 249148 -76533 -143814 -243558 24576 155149
19313 155149 -6883 -53666 -184900 -224972 -100515 -360711 -225410 -476179 35980 -109395
19302 -15335 -91025 5370 -339018 -271807 -147805 -21291 -99610 118526 228614 -9125 46442
19290b02073c8650k79088K274A08547m3925N5269m3197J19103a76425a6843A99493
19278H8558a51585j31700d7724k71397I2352a96101B17487b5724F1879h896F8606
19266B73182b7941j15865B2793q359N3837B7837L4670i9791b4110A4303a92927
19254E8468b9231m5682j93432A2697n198a41429E463e331k32447A37829a99310
19242b44685R1412L4918B9082a60067M9172i173l11179N9026J08822A59719a90888
19230e8286o5290d4853I4181a50156B88420B9398d66672h5491b8624C8202P0094
19219A08296K09750B2353a0332l53688A42489a55401A6300d1845C2893e6942j63690
19208b20632h968k52068h1009B6071K2148L34102H526h2255B8952c26602H3377
$$ plain form
19290 -202073 -38650 -317738 -315464 108547 64622 119891 76694 195797 -176425 -16843 199493
19278 88558 -151585 -283285 -47724 -319121 92352 -196101 217487 -25724 61879 -8896 68606
19266 273182 -27941 -143806 22793 14434 68271 27837 62507 -99791 -24110 14303 -192927
19254 58468 -29231 -74913 -268345 12697 7499 -141429 5463 -5331 -237778 137829 -199310
19242 -244685 -153273 -118355 29082 -160067 -110895 -9173 -320352 -261326 -152504 159719 -190888
19230 -58286 -123576 -44853 94181 -150156 288420 29398 -466672 -85491 -28624 38202 108296
19219 108296 318046 22353 -10332 -364020 142489 -155401 16300 -41845 32893 -56942 -220632
19208 -220632 -8968 -261036 -81009 26071 48219 382321 8526 -82255 28952 -326602 83377
19196b80387J5623a28106m4550q828B3566b31803m1258A35977g5489i852k27730
19185b37582j11427c1344I6650b25776B30270A4167J53481a71398h1738D8928
19174d9386H9981C4901K15959a1480A7121N3677b67942a8708j73628M3695J008
19163a47633r376P2052k78639B46438b39200J02615C852f4622O531A66533c1790
19151G8306c08145L5280f7844A65835b91885c3031l13808c0548B72565o3721b19412
19139I6927a36716A5234R5582l6596b51134C1501b93795P7719H3259a08866L4489
19128g4377k12642A39125B7629c08109C36020b23496F7521A4537a73106I5313
19117a31015n0368k93327A30415e8746N316j38716c8256A71278h9605J7782A2109
$$ plain form
19196 -280387 -264764 -128106 -172656 -181484 23566 -231803 -273061 135977 -75489 -9852 -237582
19185 -237582 -349009 -31344 96650 -225776 230270 14167 167648 -171398 -81738 48928
19174 -49386 89981 34901 250860 -11480 17121 70798 -267942 -18708 -192336 -148641 -147633
19163 -147633 -157009 -84957 -363596 246438 -239200 -136585 3852 -64622 -58091 166533 -31790
19151 78306 -308145 -272865 -67844 165835 -291885 -33031 -346839 -30548 272565 208844 -219412
19139 96927 -136716 15234 110816 74220 -251134 31501 -293795 -216076 83259 -108866 -74377
19128 -74377 -287019 139125 27629 -308109 336020 -223496 67521 14537 -173106 95313
19117 -131015 -181383 -474710 130415 -58746 -53430 -192146 -38256 171278 -89605 -71823 12109
19105e3427k22086j29187B40585b87424f9304j29599K0736C18015a05981A07527
19094a9196A83120a9784l37197l401F8481h4732C39892c79433a37575r5563Q4508
19083a48630L4123A26869J5432g2803l6805A0900a67559j17424A96662r4357a91543
19071A29841b47431G2566k3348b7473A17529N8424g1463r2886F4351b9331d351
19059a15191A38786i5376M3203D1424A14d1159k52996a5291p538q6214j23480
19048b32523f321k1059k20187D8787g844k18774A31903B7130J9906e7996H568
19036A29922h7145A89889c18592G6185d2061E7677P0013c86651a39238A93051
19025c0894k44413C65979g5898F4571b89868A42817c78101b0314r4333J6392j42202
$$ plain form
19105 -53427 -275513 -404700 240585 -287424 -69304 -198903 -178167 318015 -105981 107527
19094 -19196 183120 -19784 -356981 -360382 68481 -84732 339892 -379433 -137575 -233138 -148630
19083 -148630 -114507 126869 142301 -72803 -109608 10900 -167559 -284983 196662 102305 -191543
19071 129841 -247431 72566 49218 -27473 117529 175953 -71463 -164349 64351 -29331 -4351
19059 -115191 138786 -95376 -52173 41424 114 -41159 -294155 -15291 -22829 -109043 -232523
19048 -232523 -6321 -27380 -247567 48787 -7844 -226618 131903 27130 47036 -57996 8568
19036 129922 -87145 189889 -318592 76185 -42061 57677 127690 -386651 -139238 193051
19025 -30894 -275307 365979 -75898 64571 -289868 142817 -378101 -20314 -114647 -98255 -240457
19014b40457A13413A0948K49982a43737C13921j54887b88493c7580B12079a89884
19003C1236a09920A34011e8746A58741N9884g9788c1885j53481a59q7844m2919
18992a30922K1916G3509b86882j1395Q877c9348r3302k0870B8493L10732h2054
18980E0609h9240A1378l747b81343g23I7921a40988l17213b12711k8992A65960
18968d6371k18989f5211K9555k96530i8036K5455j32983J1985M2126e7153C41833
18956b18616M6307K2368L3417j77126h411j71326L492D024K57685c64686B17848
18944b3150A15119K1035j0482a18547k28998d7298A03011K4477N9249c29797J39630
18933a90167n9267a19846A1408K3638J8948b12002k5536A8927a02931r2408M5462
$$ plain form
19014 -240457 113413 10948 260930 -143737 313921 159034 -288493 -37580 212079 -189884
19003 31236 -109920 134011 -58746 158741 218625 -79788 -31885 -185366 -159 -88003 -130922
18992 -130922 -109006 73509 -286882 -298277 -289400 -39348 -132650 -153520 28493 339225 -82054
18980 50609 -89240 11378 7631 -281343 -723 97921 -140988 -458201 -212711 -241703 165960
18968 -46371 -265360 -65211 -35656 -332186 -98036 -72581 -205564 -193579 -151453 -57153 341833
18956 -218616 -172309 -149941 -116524 -293650 -8411 -179737 -176245 4024 261709 -364686 217848
18944 -23150 115119 136154 125672 -118547 -347545 -47298 103011 127488 186737 -329797 -190167
18933 -190167 -249434 -119846 11408 35046 53994 -212002 -237538 18927 -102931 -195339 -149877
18922a49877A62027a09560m8257J6452L4685l06640A88154b67259A98114I5840
18911E8852b6477F6505c36666C17043D3465a14074A36832c46257j35845b15054
18900a41447A87127p8903K3188a46135r7337q0904G292K07005a23230j64227f1209
18888B66647c11209C177d03350D8677b03340B10408f6307o5590C63879b81023
18877g1576l94895J62397f0020G680A408b9884q2255k534J9126A60562a45572
18865c18438I4260M5760a29318q2489d3358A14419E5090a98902D08K6054a02886
18853A35987C6707d01416R6317A45121k8568B1412f0162k28921B18780a21235
18842a68731c3617j69586m4092E4005P9228a8982l68334H2673E8a71627n5728
$$ plain form
18922 -149877 162027 -109560 -157817 -141365 -106680 -413320 188154 -267259 198114 95840
18911 58852 -26477 66505 -336666 317043 43465 -114074 136832 -346257 -482102 -215054
18900 -141447 187127 108224 131412 -146135 -243472 -324376 7292 214297 -123230 -287457 -61209
18888 266647 -311209 3177 -403350 48677 -203340 210408 -66307 -131897 363879 -281023
18877 -71576 -466471 -304074 -60020 7680 1408 -29884 -112139 -114673 -95547 160562 -145572
18865 -318438 94260 140020 -129318 -211807 -43358 114419 55090 -198902 408 26462 -102886
18853 135987 36707 -401416 -305099 145121 116553 21412 -60162 -289083 218780 -121235
18842 -168731 -33617 -203203 -247295 54005 133233 -18982 -387316 82673 58 -171627 -227355
18831b27355C24495a29663l7883L6336D721a2631j21845f2887a5996F8170J5287
18820H3457a8434j09696L4928G4276M2578a06121J1826a8053A77395a68958f9735
18808A76554C2451J12807A766g7115A10394k7807d7820B22042I1083K61931j44781
18797B08233J49477j20717b23719A24041k6795J92248a00885E7078M4377N3412
18787A54867j2330c5339C008Q301a06301A48212A3269d538A2118i8887n3961k8230
18775a81078j4082C8452K38570a54891L134A73392D1017J68186a25365Q248C3135
18763a61690A76604a37093j19111J11351j9288b1483k64258J20573Q1595j73385
18753b56958A32287a61049N7167a4821E2648g9020l79420b4230n10967g6303B8345
$$ plain form
18831 -227355 324495 -129663 -167546 -131210 4721 -12631 -134476 -62887 -15996 68170 83457
18820 83457 -18434 -128130 -93202 74276 116854 -106121 -94295 -18053 177395 -168958 -69735
18808 176554 32451 145258 1766 -77115 110394 82587 -47820 222042 91083 353014 208233
18797 208233 357710 236993 -223719 124041 97246 289494 -100885 57078 101455 154867
18787 154867 142537 -35339 3008 11309 -106301 148212 13269 -4538 12118 -98887 -152848 -181078
18775 -181078 -195160 38452 277022 -154891 -151757 173392 41017 209203 -125365 -117117 33135
18763 -161690 176604 -137093 -256204 -144853 -164141 -21483 -285741 -165168 -83573 -256958
18753 -256958 132287 -161049 -103882 -14821 52648 -79020 -458440 -24230 -535197 -76303 28345
18741c78345R8883h7868A09256a32140G8086b60023a27766k91664G3660a71809
18730c5918j25868H791J60797a01779o5385B03351J18548j26009n2767a04105
18719a16897k00046i9906c8160A45942D4714K28757A11058a94295R5149J0217
18709h8929C48598a48023f7741O166l22598J18835C12844A53093f4567p9716A18667
18697A6356f9422B2966N8834a00165j95415J42219C36764a57266g3343C8958a61643
18685c18930j19181C24500p8664k4370R7184c21365B98814h4218j47581L2155
18675a99644E4722b54959K2224B68743A2062i7691B4689a4201k46583k6848i1031
18663e9951A45568q335i2822A8051d2801G677R6354a86790A8923c21481B94893
$$ plain form
18741 -378345 -279462 -87868 109256 -132140 78086 -260023 -127766 -419430 73660 -171809
18730 -35918 -161786 8791 169588 -101779 -167164 203351 321899 195890 143123 -104105
18719 -116897 -316943 -99906 -38160 145942 44714 273471 111058 -194295 -99146 -88929
18709 -88929 348598 -148023 -67741 -61575 -384173 -265338 312844 153093 -64567 -144283 118667
18697 16356 -69422 22966 81800 -100165 -295580 -153361 336764 -157266 -73343 38958 -161643
18685 -318930 -438111 324500 245836 221466 318650 -321365 298814 -84218 -231799 -199644
18675 -199644 54722 -254959 -232735 268743 12062 -97691 24689 -14201 -260784 -287632 -91031
18663 -59951 145568 137233 -92822 18051 -42801 7677 104031 -186790 18923 -321481 294893
18651a04997B35978D5309a70088P4435A16059B7712L0941J60744a96634k7635
18641b24269A82728a6773A98700e9726Q927F699b89640A13191E5607J52884a43151
18629a6247B04703b30882B0506K1076a28470k9141a4318j48005M9034K621C6623
18617A61600G9533a49777j5774j20984j18835D3303a17200M75B4082b41920R4332
18606a47588A3043b42687E7708k0590K5571M1561B5918a74953A20653b81281B89386
18594i8144A863a15026k76837b1210A45450h5505b5027k22203D3043A8292P85
18583A9077J28711b81038e1983j55853B48190l3069b127A25390n3361r069a62674
18571a64369i458j45493P2769o3722B34585C7478J1797R0419a00356B40558b27925
$$ plain form
18651 -104997 235978 45309 -170088 -95653 116059 27712 58653 219397 -196634 -224269
18641 -224269 182728 -16773 198700 -59726 -50799 6699 -289640 113191 55607 208491 -143151
18629 -16247 204703 -230882 20506 41582 -128470 -157611 -14318 -162323 -113289 -110668 36623
18617 161600 79533 -149777 -165551 -286535 -405370 43303 -117200 -116725 24082 -241920 -147588
18606 -147588 13043 -242687 57708 37118 62689 104250 25918 -174953 120653 -281281 289386
18594 -98144 1863 -115026 -391863 -21210 145450 -85505 -25027 -247230 43043 18292 19077
18583 19077 147788 -281038 -51983 -207836 248190 215121 -2127 125390 72029 62960 -162674
18571 -164369 -9458 -154951 -82182 -145904 234585 37478 49275 139694 -100356 240558 -227925
18559b46102b080j2457C3388b62183a30592L0292L2155p1968e1689A15844j996
18548A13848d9509j1113a0679A54289m0625J25170K9512a6871l9774M10Q886D9257
18535c96666e8088A57477o4558J39058a44217j97386A30876a66230j25376e5877
18524A73969b97386B28061A11741K51184a3594J736j3057j43308p6418a4488k08304
18513b22792G1661b41318j6783N0420A94795a23240D69b23748J08769b665A06871
18501a719E2276c71203c3453E4156b82325A06812a54648b6124o3145l7204G6261
18489b16545b5804j18419A0202L11509b23812B66143c0387l26879R1205h1303
18478D960c6674A69747a93071B06068d82815A08173N3629B800J1761J68007b57666
$$ plain form
18559 -246102 -2080 -14537 33388 -262183 -130592 -100300 -68145 -140113 -51689 115844 113848
18548 113848 -49509 -60622 -10679 154289 113664 238834 268346 -16871 -56645 -56235 -47349 49257
18535 -396666 -58088 157477 92919 231977 -144217 -341603 130876 -166230 -291606 -55877
18524 173969 -297386 228061 111741 362925 -13594 -11858 -24915 -168223 -244641 -14488 -222792
18513 -222792 71661 -241318 -258101 -207681 194795 -123240 469 -223748 -114979 -2665 106871
18501 -1719 52276 -371203 -33453 54156 -282325 106812 -154648 -26124 -89269 -126473 76261
18489 -216545 -25804 -144223 10202 321711 -223812 266143 -30387 -357266 -266061 -81303
18478 4960 -36674 169747 -193071 206068 -482815 108173 161802 2800 14561 182568 -257666
18466A14247e6950F4998d1892a6089p987q5872j81652i3220G3788R1773a03046
18454a98086K2461A53079b7017B12793E2713b01272H2301d2488k21111G7029c05959
18442e524j46621B21345b6329m31646n8058a96438e0484K0993G465J54603A2624
18430b53526P039b6707C1802Q5300M9193b31165A20601B7037E708a93444m8445
18419b41889B00519c6947A40609o6184i3366D6767O153d3724A03838J34893a3298
18407a87644G9951c8101R490m8506k69156A9472K62538g0465C199a09679I0107
18395G7344a44550E6732P8310i9448d9344j83311A61519I081b22668A16464b47770
18383i6482k01116F0170f6643l934B81L75606h2660h471k18980d5015f760j5076
$$ plain form
18466 114247 -56950 64998 -41892 -16089 -24076 -109948 -291600 -93220 73788 165561 -103046
18454 -198086 -175625 153079 -27017 212793 52713 -201272 82301 -42488 -263599 77029 -305959
18442 -5524 -152145 221345 -26329 -457975 -516033 -196438 -50484 -29491 7465 162068 12624
18430 -253526 -246487 -26707 31802 117102 166295 -231165 120601 27037 5708 -193444 -241889
18419 -241889 200519 -36947 140609 74425 -93366 46767 52920 -43724 103838 238731 -13298
18407 -187644 79951 -38101 -28611 -77117 -346273 19472 282010 -70465 3199 -109679 90107
18395 77344 -144550 56732 135042 -99448 -49344 -232655 161519 9081 -222668 116464 -247770
18383 -96482 -297598 60170 -66643 -70577 281 375887 -82660 -8471 -227451 -45015 -6760 -21836
18371b1836B3094L4966a26887o018K565E7850J23244E6351N0891P7815m1805d42146
18358B3199f4501k75519d7118p1366e0510H5246J17294c8503E1606e05713A48406
18346A5112h6951A29593A5146M10609A97745H6281i2997P967E8355c52152M2566
18335c09586H5398d363k35023B6784N0428B5888a08358j36509E0553K75497j53223
18324A72827a62564L8917C2593a89747k15130a3323A02016C0111o995a32611q1530
18313b14141C2628K02977a85658J4551r2354C214a95368G4042a47730E9397a06881
18301C3267b19852i3160C3953J6000b10336A84016b68625P5442M0362G5202i6293
18289a75453G8873g890B20849b31611f758H3474a06502J5711H0755b71459A20908
$$ plain form
18371 -21836 23094 58060 -126887 -132905 -130340 57850 181094 56351 107242 185057 143252 -442146
18358 23199 -64501 -340020 -47118 -118484 -50510 85246 202540 -38503 51606 -505713 148406
18346 15112 -86951 129593 15146 425755 197745 86281 -92997 -85030 58355 -352152 -309586
18335 -309586 85398 -4363 -239386 26784 77212 25888 -108358 -244867 50553 326050 172827
18324 172827 -162564 -123647 32593 -189747 -404877 -13323 102016 30111 23116 -132611 -214141
18313 -214141 32628 235605 -185658 -171107 -263461 3214 -195368 74042 -147730 59397 -106881
18301 33267 -219852 -93160 33953 49953 -210336 184016 -268625 -193183 -152821 75202 -96293
18289 -175453 78873 -7890 220849 -231611 -6758 83474 -106502 -90791 80755 -271459 120908
18277A16429l1242A0039a21341d76k01790B98375b3696l9301G6040c25685d4446
18265a49690B2365e4209k9828C3839a97406C6855J99626b8775o2807k1815d5884
18253A36142B045g984I5878A3992M6349f9540A64131a36869B5072a4079j48161
18242a62240K8805l257k64423B57023a33324c1091j52963B2384A1006a90782J4008
18231a76774h6992A63302a6640k19638R339j81144h5758B15522I2440k2912M9953
18220A19481K3738b18037j56476a10954L083L3196j70827a05884J8010a5845l2048
18209d7893D9386e7371o5992B954M3149g3002E7058i968j28872B64189b55783
18197A5548c78414h7020J5507m9350b0224j98252C2696b79314C33137a89838c7448
$$ plain form
18277 116429 85187 10039 -121341 -476 -202266 298375 -23696 -62997 76040 -325685 -44446
18265 -149690 22365 -54209 -84037 33839 -197406 36855 236481 -28775 -91582 -113397 -45884
18253 136142 2045 -7984 95878 13992 60341 -69540 164131 -136869 25072 -14079 -162240
18242 -162240 -133435 -136692 -401115 257023 -133324 -31091 -184054 22384 11006 -190782 -176774
18231 -176774 -86992 163302 -16640 -236278 -226939 -408083 -85758 215522 92440 69528 119481
18220 119481 143219 -218037 -374513 -110954 -107871 -74675 -245502 -105884 -87874 -15845 -47893
18209 -47893 49386 -57371 -123363 2954 46103 -73002 57058 -9968 -138840 264189 -255783
18197 15548 -378414 -87020 -71513 -120863 -20224 -218476 32696 -279314 333137 -189838 -37448
18185C7002a79492j44200A3647a23481G6847M6092a96789F2565a94001A89880
18174A41906i4907A34366B1170i1943n4590j83994a2827k64262m4076a08248J6122
18163i2126A54870a79732A79534F8686a61917F8698C2347c9583C8918L6036a25917
18151b16029m3923B63071j03815a38784c3327p6387H1337a94940E2699f8089H5139
18139B7138a70206J8693O5962j61389M8265B09572a24322d2809l71349J67991
18129b46167h0366j54508A2448c52459C5303M3720R1826c57144D06706c46414
18118h6359d275H0235J18632q1659g3607A13951J87435G5110K01298c18981H1213
18106a21881k94437C2629J7359J27358p3732J18401A614K96307G0708M01416A12307
$$ plain form
18185 37002 -179492 -323692 13647 -123481 76847 122939 -196789 62565 -194001 189880
18174 141906 -94907 134366 21170 -91943 -146533 -330527 -12827 -277089 -321165 -108248 -92126
18163 -92126 154870 -179732 179534 68686 -161917 68698 32347 -39583 38918 74954 -125917
18151 -216029 -259952 263071 159256 -138784 -33327 -109714 81337 -194940 52699 -68089 85139
18139 27138 -170206 -151513 -85551 -246940 -198675 209572 -124322 -42809 -414158 -246167
18129 -246167 -80366 -234874 12448 -352459 35303 79023 170849 -357144 406706 -346414
18118 -86359 -4275 80235 198867 117208 -73607 113951 301386 75110 276408 -318981 81213
18106 -121881 -416318 32629 49988 177346 103614 222015 1614 297921 70708 472124 112307
18094A62984a58520g1836m6161d9845A730K865a25030B37372b90553a32584B48628
18082a26238o8629A02091i9861F71f817A19850J8324N7059h6639c0852n3905F2231
18069C8905h9438K4638A75092b59632a15851j92240a6363q8065J4991B1266O6259
18058H7525a91795l6936j07344a9277j28000C06150d9403B6755A0233L2760c54193
18046h559j5679j24013B98630b83110H7312j0282C6864e6616j4711F1460b6406
18034b44184a4281E0780b70128D1627K90549j0363b701q2279G9300e172k28893
18023b34065A08731m5733J96315f793A27852C8597Q3382l8703R5236a27821p2109
18012a99930F0291a11365B1463A440b0146j73149M4007r015B8386b02508B01159
$$ plain form
18094 162984 -158520 -71836 -117997 -49845 1730 4595 -125030 237372 -290553 -132584 248628
18082 -126238 -194867 102091 -99861 671 -6817 119850 138174 195233 -86639 -30852 -84757 62231
18069 38905 -89438 -64800 175092 -259632 -115851 -308091 -16363 -104428 -89437 21266 87525
18058 87525 -191795 -228731 -336075 -19277 -147277 306150 -49403 26755 10233 42993 -354193
18046 -8559 -24238 -148251 298630 -283110 87312 77030 36864 -56616 -71327 61460 -26406
18034 -244184 -14281 50780 -270128 41627 332176 321813 -2701 -84980 79300 -5172 -234065
18023 -234065 108731 62998 259313 -6793 127852 38597 121979 83276 178512 -127821 -199930
18012 -199930 60291 -111365 21463 1440 -20146 -193295 -149288 -158303 28386 -202508 201159
18000A2375f9710j75050J04324I413a08221B32785c3258G8806A7633b65852e9293
17988c9274j15733o690K6471a9541j44031k57758A96954a36673l1990C8538h3273
17976a30687B66966b79691B34635j4009D4373N351K04021f1378F8656d1516l48294
17965c89810J84255E1778a07922a7708p2790A79757O4855j04230c64623J30203
17955b34420B33478b3840A7543L8391K4360k8348b09710g5615k3671b2890j14769
17944a37659r1277g292A05379D0442b79891A58372a12025K3346B19531c2941A51788
17932g2367L197A8727c30487a820G7783R9140b69335J04691O4345E1353K45851
17921B97204j3860J2331f0442r0902A67502N7135G5822b12275F5575a36598K3362
$$ plain form
18000 12375 -69710 -244760 -140436 9413 -108221 232785 -33258 78806 17633 -265852 -59293
17988 -39274 -155007 -161697 -135226 -19541 -163572 -421330 196954 -136673 -168663 38538 -83273
17976 -130687 266966 -279691 234635 220626 44373 49724 253745 -61378 68656 -41516 -389810
17965 -389810 -205555 51778 -107922 -17708 -90498 179757 244612 140382 -364623 -234420
17955 -234420 233478 -23840 17543 55934 80294 51946 -209710 -75615 -99286 -22890 -137659
17944 -137659 -228936 -7292 105379 40442 -279891 158372 -112025 -88679 219531 -32941 151788
17932 -72367 -69170 18727 -330487 -1820 77783 176923 -269335 -164644 -100299 51353 297204
17921 297204 283344 295675 -60442 -151344 167502 224637 75822 -212275 65575 -136598 -113236
17910a13236A61464i2790o7802K5120a9788l28708h222l3260E5226a43584A9551
17898a31908O5682j46212A2481J54996l2411C2578a3167C01765b55289K8094B3615
17886D9953J40878H0091c57708c4226k04960A09847r91a77740N5294A73842k2014
17875A51828h5922D7369M0155J52614e5150o6195P34B17650a19423d6209A13882
17863c49507E8309E804M8875e3617j41260j7004C48227b00053i821C1272b40245
17851d8321m7861j6077A3589l196J05550b52994a9224C78158C0524K43438I9315
17839a47098I454b38522J4335G9371j2566K19369b35491Q5506A82960F5544P3722
17828A39266C2035a30601M2083A68281q0926M3498a87593A16965J4629c50823
$$ plain form
17910 -113236 161464 -92790 -160592 -135472 -19788 -348496 -8222 -41482 55226 -143584 19551
17898 -131908 -66226 -212438 12481 167477 135066 32578 -13167 301765 -255289 -227195 23615
17886 49953 190831 80091 -357708 -34226 -239186 109847 108856 -177740 -122446 173842 151828
17875 151828 -85922 47369 87524 240138 -55150 -121345 -120611 217650 -119423 -46209 113882
17863 -349507 58309 5804 54679 -53617 -194877 -211881 348227 -200053 -9821 31272 -240245
17851 -48321 -96182 -112259 13589 10393 115943 -252994 -19224 378158 30524 273962 99315
17839 -147098 9454 -238522 -224187 79371 66805 286174 -235491 -149985 182960 65544 139266
17828 139266 32035 -130601 -88518 168281 87355 130853 -187593 116965 131594 -350823
17817a44269A12043K85185A80672F6973g9706D2740O3697a2467k31565a07812
17806A34201A902a32612F8137b44188A84312a35847C05392a13741k6209D9693
17795B21088f3802k17880A5844a08798E1505P198P2046J69377e2273j01472F8203
17783f0167j10016A26399D3000c371k5428l20373d9821k43036B67054c50159A40479
17771A46012a30841A75825g4811k20873b1234C1625a13347B44768I5687k0363
17761G5324L0269L169a13956E5628g6720K0767E6483K54119G0801K489P4052J31501
17749B78843A13218B4600a95210A9401J56100a28008k15787B47042G6355a22533
17738A87686o2047J9564a54551l0908o0852o7567A84284J13551C2221M4268i9292
$$ plain form
17817 -144269 112043 397228 180672 66973 -79706 42740 106437 -12467 -244032 -107812
17806 134201 1902 -132612 68137 -244188 184312 -135847 305392 -113741 -139950 49693
17795 221088 -63802 -281682 15844 -108798 51505 58703 130749 300126 -52273 -153745 68203
17783 -60167 -170183 126399 43000 -3371 -28799 -349172 -49821 -292857 267054 -350159 140479
17771 146012 -130841 175825 -74811 -295684 -21234 31625 -113347 244768 95687 75324
17761 75324 105593 108762 -113956 55628 -76720 -55953 56483 310602 70801 73290 147342 278843
17749 278843 113218 24600 -195210 19401 175501 -128008 -343795 247042 76355 -122533
17738 187686 125639 145203 -154551 -185459 -246311 -313878 184284 297835 32221 76489 -99292
17726e9764A45893h1637G6202a95849I0839b86872C53814F1337J94064b09243
17715d727j2279k3666A29274a09924r0625j80678J20314A70881c7001m4815J0179
17704g1637c2413j84382A66914D1564c6491G1487a5256l7248B52166b76648B92998
17692F0278Q94K3471B929b5119A42469B023J55012d12035H5485J03206a98730
17680b85881I1718e2116a8347A9256N639a2254k14312D1539b63382e1023K4806
17669b6217E8083p627h5364C7479b8912d317j61294F1325a85214A32620K37189
17658C69809e8654A3370R2211J18124c8602k56091F3375k4958A3186R6020f1585
17646A02982a36532A19225a54866B9656a14041C12776a86717I4729J02886E585
$$ plain form
17726 -59764 145893 -81637 76202 -195849 90839 -286872 353814 61337 255401 -209243
17715 -4727 -17006 -40672 129274 -109924 -200549 -381227 -260913 170881 -37001 -81816 -71637
17704 -71637 -32413 -216795 166914 41564 -36491 71487 -15256 -52504 252166 -276648 292998
17692 60278 61172 84643 2929 -25119 142469 2023 157035 -412035 85485 188691 -198730
17680 -285881 91718 -52116 -18347 19256 24895 -12254 -226566 41539 -263382 -51023 -26217
17669 -26217 58083 50456 -85364 37479 -28912 -4317 -165611 61325 -185214 132620 369809
17658 369809 -58654 13370 105581 223705 -38602 -294693 63375 38417 13186 109206 -61585
17646 102982 -136532 119225 -154866 29656 -114041 312776 -186717 94729 197615 5585
17635a77259E3800j4262a07473A96549q7099c7573F1561a00033A28929b9332B4100
17623A23288E87O7099J8882L9326g2282B4444c73234h4089o8713F6665J26389
17612A93054h1090j51705J11384a5022k3176p8427j16422C37015e3498j08318
17602a61816b991k4852A56878k9087a34799D11934a0497B76486j18164a28814
17591A91416a72246B6064J4973A5774d2928C08418o8469F2326f8434F9358Q6295
17580A55653J37636E8890J42e8365D06933b6209R644j47471P725k1573O6349A99793
17567a0381A04450f5867A35267D0225R0837R9365J24843a02872C99520a15052
17556A48164o0183K41674F8998a65553E5687J70875J9215a52008d2114k7687C98665
$$ plain form
17635 -177259 53800 39538 -107473 196549 109450 -37573 61561 -100033 128929 -29332 24100
17623 123288 587 67686 86568 125894 -72282 24444 -373234 -84089 -152802 66665 193054
17612 193054 -81090 -232795 -121411 -15022 -38198 -116625 -233047 337015 -53498 -161816
17602 -161816 -2991 -27843 156878 127791 -134799 411934 -10497 276486 158322 -128814
17591 191416 -172246 26064 41037 15774 -42928 308418 239949 62326 -68434 69358 155653
17580 155653 293289 58890 59032 -58365 406933 -26209 -16565 -164036 -156311 -177884 -111535 199793
17567 -10381 104450 -65867 135267 40225 131062 230427 355270 -102872 399520 -115052
17556 148164 87981 329655 68998 -165553 55687 226562 245777 -152008 -42114 -69801 398665
17544B58638F1465k7245Q3619K27113j38108q1732a6236k2828k173j7342A26427
17532A72852K34611A5617i8790D5663J58517a2109k10437e458A61782o1044j0087
17521I0651J78161o6066q9362D0895a38427r6726H8760a28468D38414B03573j4991
17510A88582d1381n2853A49126b9740B05742m0190i8729C773h1524A39256d7318
17498B58196b2251n6662J8722A84526q2659b695n1071A30796b1638A11276K64911
17487C76187f739E1495R5556J79704e5599C91942A10719f9520A18561J40969k079
17476B57451n5251h4767l05747E9830I654J30383C2448L78989e9959C7959L45822
17465C83781j38954r8643J55460b10864C00195q9681r1577n984C0563A0890l27
$$ plain form
17544 258638 61465 34220 117839 344952 206844 125112 -16236 -39064 -41237 -58579 126427
17532 172852 407463 15617 -98790 45663 204180 -12109 -222546 -5458 161782 100738 90651
17521 90651 268812 202746 113384 40895 -138427 -235153 88760 -128468 438414 203573 188582
17510 188582 -41381 -94234 149126 -29740 205742 165552 -98729 3773 -81524 139256 -47318
17498 258196 -22251 -78913 -60191 184526 101867 -2695 -53766 130796 -21638 111276 376187
17487 376187 -6739 51495 147051 326755 -55599 391942 110719 -69520 118561 259530 257451
17476 257451 202200 -84767 -390514 59830 9654 140037 32448 411437 -59959 37959 383781
17465 383781 244827 146184 301644 -210864 300195 210514 118937 112953 30563 10890 10563
17454A0563d84308H2275C9501P0419L01330A58524a10127A44086K0491b48568
17443B26527h0947B6025J36570N4984J34398A38402O9284K1112a24037A38248
17432D51546q1241J70904j64821M1923j48498l340Q71K23227k11657a34086L5519
17421i8567C09632l2206p16o5202a28605A45135c8032B04508i757D09635A01809
17409A4672L41713A50923K25820F4404K67762e9858B6816L47529C1827J54210
17399A86037k8330B8748L28M14956A52533J43852e44C11576j38429a19737A63563
17387G0958b82669D32295A67505N9043n8628i2079r7948C48208A53232a67776
17376D33071E4822K90768H1871L89366G4511K21883j07055g0151A11597c84650
$$ plain form
17454 10563 -484308 82275 39501 109920 411250 158524 -110127 144086 164577 -248568
17443 226527 -80947 26025 162595 217579 351977 138402 207686 228798 -124037 138248
17432 451546 370305 541209 376388 418311 269813 266473 267344 490571 278914 -134086 -98567
17421 -98567 309632 277426 276710 211508 -128605 145135 -38032 204508 -9757 409635 101809
17409 14672 356385 150923 376743 64404 332166 -59858 26816 374345 31827 186037
17399 186037 157707 28748 29076 444032 152533 296385 -544 311576 173147 -119737 163563
17387 70958 -282669 432295 167505 226548 167920 -92079 -190027 348208 153232 -167776
17376 433071 54822 345590 81871 471237 74511 296394 189339 -70151 111597 -384650
17365b72182i6726n7406F3704M19977A39642K2803J24149F8289P0543i5148C77021
17353B5607f6977E3693J47756b06020h075n9253J5085D0359J4660B7353J08915
17342A36268A2909J51692Q972a77925C05206j38709b1487g962B94401C7873Q7246
17331A25119J01534F2724a4299C75540I8115j2372f5979C51322A06614a21673
17320B15692J27518q4727J00985q2276L2864a3782B50961m0146A03014J26315
17310B29329m0179J8923J2179a99321B25008j535q1088a17420C61667J21443H858
17298c2296B46372M0095b8254B97352a45217B96317I0454k6755K63876A21346
17287A48069C7586g9345A31546K5552C9320j8621d5933C69666I6820L17542A32877
$$ plain form
17365 -272182 -96726 -154132 63704 483681 139642 162445 286594 68289 138832 -95148 377021
17353 25607 -66977 53693 201449 -206020 -8075 -67328 -52243 40359 55019 27353 136268
17342 136268 12909 164601 173573 -177925 305206 166497 -21487 -7962 294401 37873 125119
17331 125119 226653 62724 -14299 375540 98115 85743 -65979 351322 106614 -121673
17320 215692 343210 258483 359468 277192 310056 -13782 250961 210815 103014 229329
17310 229329 189150 208073 220252 -199321 225008 223473 142385 -117420 361667 483110 8858
17298 -32296 246372 286467 -28254 297352 -145217 296317 90454 63699 327575 121346
17287 148069 37586 -79345 131546 157098 39320 20699 -45933 369666 96820 414362 132877
17275B41303h6646B79396j6686i6909A1523R6220c40915a3773p6199E3661h8953
17263G7229M4099k0472h3759H9177b18143A56560J06095A9103b32694C32688b4534
17251B0738L58516j25814i9388c7740C94534B706a14993G9932l064B5803Q4116
17240A09919D5454K16711B0773J6690L7290g6604a4602A82525N4899E4830B715
17228B19562p1864L7441b62550a01951A32897K38540I1894K34950G4099g6865
17217A23111b48792E71872A59802b8697A74167N9501J2389l3135a11358A39543
17206E89545A25687a59067D15714j12390G0512M5881n6861N3714l9200k627P1633
17195A43052P2884k5290b20435d9119B80416c1951B55111p3145a22939A85859
$$ plain form
17275 241303 -86646 279396 262710 -96909 11523 107743 -340915 -13773 -89972 53661 -88953
17263 77229 121328 100856 -83759 89177 -218143 156560 262655 19103 -232694 332688 -24534
17251 20738 379254 253440 -99388 -37740 394534 2706 -114993 79932 76868 25803 109919
17240 109919 45454 262165 20773 37463 74753 -76604 -14602 182525 237424 54830 2715
17228 219562 147698 185139 -262550 -101951 132897 371437 91894 326844 74099 -76865
17217 123111 -248792 571872 159802 -28697 174167 233668 246057 212922 -111358 139543
17206 589545 125687 -159067 415714 303324 70512 116393 59532 113246 74046 71419 143052
17195 143052 215936 190646 -220435 -49119 280416 -31951 255111 181966 -122939 185859
17184H698R8920J98774e2668B55407B5782J54153H7807M76520A62499e7029A8201
17172a9427m6918B01585K05870b3168G3551N8218J90551F118O9957K74360A68103
17160A40104J17390J42067E8098R454i1012B85292P4876D0756a12449C98250A80820
17148D68695B10716r4587f945A78074J35712j11184L2109D0392J34004J31584
17138C05980p4662F7071J64185c3631B39629L30625h1995C24488K2302A18157
17127i2334A61998O3640O5257E8760B7553N0858R6611J739M09983D8659b26844
17115A75230K24966r7861q5974J09235j28767P3580K22800d702l6620C32550J49921
17104D82471n2783B13605b6213B62923o8100c0067D68611K09606l19033J8527
$$ plain form
17184 8698 107618 306392 -52668 255407 25782 179935 87807 564327 162499 -57029 18201
17172 -19427 -66345 201585 407455 -23168 73551 131769 322320 6118 76075 350435 168103
17160 140104 257494 399561 58098 67552 -91012 285292 360168 40756 -112449 398250 180820
17148 468695 210716 116129 -6945 178074 313786 202602 234711 40392 174396 305980
17138 305980 231318 67071 231256 -33631 239629 570254 -81995 324488 346790 118157
17127 -92334 161998 225638 290895 58760 27553 78411 175022 176761 586744 48659 -226844
17115 175230 400196 302335 216361 325596 196829 270409 493209 -4702 -41322 332550 482471
17104 482471 429688 213605 -26213 262923 194823 -30067 468611 678217 359184 377711
17094C77711A78496Q2684N3637J2841m472k9582K89033H6554J51435A04253L62045
17083D66298A90488J07095J52289A16267P2871o9521J63508J23742B01830o5681
17073A36149L63544L4016j70796l0465M1624A65242K62059k08672K0564K89382
17063E28575j15524Q3337O923i3580F78770j99969A05162P3419D9596K17757M1742
17052C09095j7369b094B73032J23144l1722A53638O96290C88045o4238o3540D4142
17040B77M07736o7052k1210P3536J73653B62957J61184m2889j76729O8621K51322
17029E24466j57349n5145R1066l2512K78495A95578K58215J24882B49897L62075
17019F11972j71567j01763J38269m9509J19730K37149n5435k04340A84715L53190
$$ plain form
17094 377711 178496 261180 314817 327658 323186 293604 582637 86554 237989 104253 466298
17083 466298 190488 297583 449872 116267 189138 119617 283125 406867 201830 136149
17073 136149 499693 533709 362913 332448 374072 165242 427301 218629 239193 528575
17063 528575 413051 496388 503311 -93580 678770 478801 105162 178581 49596 267353 309095
17052 309095 291726 -2094 273032 396176 364454 153638 849928 388045 323807 260267 44142
17040 277 408013 340961 319751 393287 566940 262957 424141 381252 204523 273144 524466
17029 524466 367117 311972 403038 370526 649021 195578 453793 578675 249897 611972
17019 611972 440405 338642 476911 427402 547132 784281 728846 524506 184715 537905
17009E37905j36604m1628j6765J45822l3898M9526O0278k40050O42723C55565
16998D30822A96976J67254J49664j63151J26484K8690O1997J44580l45965Q8341
16988D54870j2867P6993m5155L3066l2462J37680j28090K83019k7407k89083R5085
16977E45649l9012J50965n5603l9426J5892J97577C66748J80808N8933L2253k29599
16966D09143K59364K38771k08429j36013j02317K13379P4218k31704K72107k25821
16956E62698j91057K57478K46373j60946o8864J9263J67747k34505J91393J59627
16946I49207k59515O62K22274j58423K39324k95826K3561r1242P5956j99967M08328
16935I14339j60707J02036P6399k18353K34381j06255j05738J74196J21268n5008
$$ plain form
17009 537905 401301 359673 342908 488730 454832 504358 564636 324586 967309 355565
16998 430822 196976 364230 513894 350743 477227 505917 567914 712494 366529 454870
16988 454870 442003 518996 473841 506907 474445 612125 484035 767054 739647 450564 545649
16977 545649 506637 657602 601999 562573 578465 776042 366748 547556 606489 638742 409143
16966 409143 668507 907278 698849 562836 460519 673898 748116 516412 788519 562698
16956 562698 371641 629119 875492 714546 645682 664945 832692 598187 789580 949207
16946 949207 689692 690354 912628 754205 993529 697703 721264 630022 705978 506011 914339
16935 914339 753632 855668 932067 713714 948095 841840 736102 910298 1031566 976558
16925I76558l2560l8096K7521j53317J78426r6811k82627K61115Q5837m4574J90979
16914A072451j9896K2908J83630l30302j87935K55726k36007p8457K66632k31536
16904G17214L08402j23374M77367m63551K82389N9604l20569r091J73502J55935
16894A257828j8212k35447K82249k3001J53544J57742k74644J18147k83484K60812
16884A395534Q2124N2849N7284k32648l5035n8021Q3466j23477L43213M1044l11366
16873A294967L22520j40383K11729j71551K75522j91323j33992J621L11529l95506
16863A385133L93511j79965J59060j43780N74570k47054l62454M01492N7234l16000
16853A721747L32354k57494k26088N57672j70460J8739J23850n0856J47023K1295
$$ plain form
16925 976558 943998 905902 933423 780106 958532 861721 579094 840209 926046 881472 1072451
16914 1072451 1052555 1075463 1259093 928791 740856 996582 760575 682118 948750 717214
16904 717214 1025616 902242 1379609 916058 1198447 1258051 937482 928391 1101893 1257828
16894 1257828 1239616 1004169 1286418 1263417 1416961 1574703 1300059 1418206 1134722 1395534
16884 1395534 1477658 1530507 1587791 1355143 1320108 1262087 1345553 1222076 1565289 1606333 1294967
16873 1294967 1617487 1477104 1688833 1517282 1792804 1601481 1467489 1469110 1780639 1385133
16863 1385133 1778644 1598679 1757739 1613959 2188529 1941475 1579021 1980513 2037747 1721747
16853 1721747 2054101 1796607 1570519 2128191 1957731 1976470 2100320 2049464 2196487 2217782
16843B217782j53683N86552k73478m2026J75489m7765K20733l88862L28117j2744
16833B610115j4342j08695J49754J16333Q3415j55526K80044l0958J584r480K4402
16822B946646K08250j83145J91052J46426n614L5175k7795J32937M8385K79713
16812C772030K19791l09610J39036M09012k57338L27876K73226k48361L0785J45429
16802D501876k07721M22368K24428m37748N88333J16146m7009K81314j20081L18809
16792E640715J4594L54780J59000n7803R4686K21932J73890R1641J81422R3253
16782F968110M7074K56034L07057K51080M01696j2435M95430m5012J9616M07267
16772I095917K43107K07090O29247M8505L84177J65620M05649P62999L27526K39043
$$ plain form
16843 2217782 2064099 2650651 2377173 2335147 2510636 2462871 2683604 2294742 2622859 2610115
16833 2610115 2595773 2487078 2636832 2753165 2836580 2681054 2961098 2930140 2931724 2922244 2946646
16822 2946646 3154896 2971751 3162803 3309229 3303615 3338790 3310995 3443932 3492317 3772030
16812 3772030 3991821 3682211 3821247 4230259 3972921 4300797 4574023 4325662 4356447 4501876
16802 4501876 4294155 4716523 4940951 4503203 5091536 5207682 5160673 5441987 5321906 5640715
16792 5640715 5655309 6010089 6169089 6111286 6205972 6427904 6601794 6693435 6874857 6968110
16782 6968110 7015184 7271218 7578275 7829355 8231051 8218616 8714046 8669034 8688650 9095917
16772 9095917 9339024 9546114 10175361 10223866 10608043 10773663 11179312 11942311 12269837 12508880
16762A2508880K09630P36179K65010O09220K60479P21077M83508K33559Q03771
16753A6831313O99421P67059M90456O78719Q13677J095320R22248O88199J332460
16744B4318872J093442R86829J296061J133555J766455J252506J475022J694344
16736C5017086K004101J805308K520074K097008K301555K993720K722558K727400
16728E4188810L261373L575206L723025M637049M155300M770718N028916N757551
16720H9097948N538869O767608O579679O793954P609755P044602Q273741P613984
16712A45320140P658713P581925P451767P019024O349346N347283M419884L452645
16704A94600727J614744M89071r61274k175477l721290m604506o109644o755374
$$ plain form
16762 12508880 12718510 13454689 13719699 14328919 14589398 15310475 15793983 16027542 16831313
16753 16831313 17530734 18297793 18788249 19466968 20280645 21375965 22298213 22986412 24318872
16744 24318872 25412314 26399143 27695204 28828759 30595214 31847720 33322742 35017086
16736 35017086 37021187 38826495 41346569 43443577 45745132 48738852 51461410 54188810
16728 54188810 57450183 61025389 64748414 69385463 73540763 78311481 83340397 89097948
16720 89097948 94636817 101404425 107984104 114778058 122387813 129432415 137706156 145320140
16712 145320140 152978853 160560778 168012545 175031569 181380915 186728198 191148082 194600727
16704 194600727 196215471 196704542 195743268 193567791 189846501 185241995 179132351 172376977
16696A72376977p002810p960736q195019p951763p898226p805559p341971p510475
16688A10710418o697123o479302o195688n278186n544452m824541m841205m263491
16680F6586430m097334l598796l502499l311255k575801k886452k662145k702033
16672D1250115j827171k072852j941948j670524j943843j418873j868579r50768
16664B7555557j381641j210351j087541o58793j309221q93610q53068p78165p43524
16655A8639643q32873o98159o31429o39585k21374q34531o89361m28710m03074
16646A3260547k05284p35710k11494n99483k24578m75151n07710l08273l30006
16637I662858k5303n56805l31534j73269L0306n02576N3046k74379j95306j39875
$$ plain form
16696 172376977 165374167 157413431 149218412 141266649 133368423 125562864 118220893 110710418
16688 110710418 104013295 97533993 91338305 86060119 80515667 75691126 70849921 66586430
16680 66586430 62489096 58890300 55387801 52076546 49500745 46614293 43952148 41250115
16672 41250115 39422944 37350092 35408144 33737620 31793777 30374904 28506325 27555557
16664 27555557 26173916 24963565 23876024 23217231 21908010 21014400 20161332 19383167 18639643
16655 18639643 17806770 17108611 16477182 15837597 15616223 14781692 14092331 13663621 13260547
16646 13260547 13055263 12319553 12108059 11508576 11283998 10808847 10301137 9992864 9662858
16637 9662858 9637555 9080750 8749216 8575947 8606253 8103677 8156723 7882344 7687038 7547163
16627G547163l20507j00430l68413j87186o4522k32636k20364K79377o12042L6820
16617E757260j69303j80676m0280l34721K41454l26117K71928l96129m5483l10360
16607D467573J02424m16910L16997l22070l1026q42j68888k53275P3764k62614
16597C505133J26905o8499j40393L591m43599M37558N6955l51584j34936J74133
16587C165264l14306J00234j34419L74901m84657J63343n1545o6296j68468O7876
16577B651927l82531J03035k38311N04999m11163l5399K09890j50396j51860K9027
16567B129218J22566j93828J226j66765l3324o5495J01763j65153J49904k48317
16557A631795K56217l63141k3107P2075K80233k94347M7178K68868j77413m367
$$ plain form
16627 7547163 7226656 7126226 6757813 6570627 6506105 6273469 6053105 6332482 5720440 5757260
16617 5757260 5587957 5407281 5367001 5032280 5273734 4947617 5219545 4823416 4777933 4467573
16607 4467573 4569997 4153087 4470084 4148014 4116988 4116146 3947258 3693983 3767747 3505133
16597 3505133 3632038 3563539 3423146 3426737 2983138 3420696 3477651 3126067 2991131 3165264
16587 3165264 2850958 2951192 2816773 3191674 2707017 2870360 2818815 2752519 2584051 2651927
16577 2651927 2269396 2372431 2134120 2639119 2227956 2192557 2402447 2252051 2100191 2129218
16567 2129218 2251784 2057956 2059182 1892417 1859093 1793598 1895361 1730208 1880112 1631795
16557 1631795 1888012 1524871 1501764 1573839 1854072 1559725 1606903 1875771 1698358 1693991
16547A693991n69927P11398k39944k27288O0388n06K46381j67760n8241l21941
16537A126551K55535j97668j5882j35979K78850L8432j63613R2973M7541k28056
16527A098684K09286l21682J40269J70485J4364l29693O2387K38644l75264K33160
16517A140640l03582J13414J15073j39446K89436j16457j77764K96874n21916
16508F96272L58479O9577n102k1857j00960J02792k68261M2621k24947M60620
16498A109234k13047r7184J75848k6837j01317j15022l59171L84516J4654n1331
16488G20343C54284M24475J7017n0747j11176J24942L0684l18468Q2166K33229
16478G86406j13412J62749l43696K16208k07078Q3073J60402l04810K79922M7506
$$ plain form
16547 1693991 1124064 1835462 1595518 1368230 1428618 1428112 1674493 1506733 1448492 1126551
16537 1126551 1382086 1184418 1168536 1032557 1311407 1349839 1186226 1279199 1326740 1098684
16527 1098684 1307970 986288 1126557 1297042 1311406 981713 1044100 1282744 907480 1140640
16517 1140640 837058 950472 1065545 926099 1215535 1099078 921314 1218188 696272
16508 696272 1054751 1124328 1119226 1097369 996409 1099201 830940 873561 648614 1109234
16498 1109234 896187 799003 974851 948014 846697 731675 372504 757020 771674 720343
16488 720343 354284 778759 795776 745029 633853 758795 789479 471011 553177 786406
16478 786406 672994 835743 492047 708255 501177 584250 744652 439842 719764 767270
16468G67270j79068j69992Q301M54989m33862j34344M65180j11048q5335j19091
16458D63000N8795L7434j29198A85633M10589k12473j48846M75059k48486K4917
16448D86393M3326I7959K28890J73627J52460j35362P9194j05341A03381O09719
16438G13100k35450j82557L41276A96635J22471j58245N25941O572n390j25575
16428E62409k48413A41869O22184B85074l4908J27396l7616j334J30723n7350
16418D11985O1A69438K14927A33578M9502L32038j12608J3990K85121C22876A44280
16406B67529K1943P1325K70176c93H3591K57460J82573B27600K30246J48729A1326
16394C00788L23994j18259A89542K76721k09072K07523l8213i5315D54362A70156
$$ plain form
16468 767270 588202 418210 426511 881500 447638 313294 778474 667426 582091 463000
16458 463000 521795 559229 430031 185633 596222 383749 234903 709962 461476 486393
16448 486393 529719 97959 326849 500476 652936 517574 596768 491427 103381 713100
16438 713100 477650 295093 636369 196635 319106 160861 686802 693374 687984 562409
16428 562409 313996 141869 764053 285074 250166 377562 339946 338612 469335 411985
16418 411985 412046 169438 384365 133578 183080 515118 402510 416500 701621 322876 144280
16406 267529 289472 360797 630973 -393 83591 341051 523624 227600 457846 606575 11326
16394 300788 624782 506523 189542 466263 257191 464714 426501 -95315 454362 170156
16383E85769j92979j29907r424J97146j63831J58227A96542J10613Q3911j45291
16373B45775P4958j16060N8702K32426P250k35458L9523J20606h2870n7703E32215
16361B12635J90477M5265j64097J5881G8509K32387J17732k12014R913K17526
16351D44053A12476J81791J96047r2658r456A75065K17673j52559b1102A47051
16340B76703K53131a06451C41887j27902R9972J5933n2071A09163L14380j44027
16330B79516I2650K61669q6429J52272I2006L3522J16082K9669P7565q3954f5206
16318B1092L14038L4040j03120n8767k1805L46991A67710K57091r0839j19676
16308B14286J20868A14552Q2977J20064K1814H755L33711j46686L6265H056L01631
$$ plain form
16383 585769 392790 262883 253459 450605 286774 445001 196542 307155 391066 245775
16373 245775 320733 204673 263375 495801 503051 267593 307116 427722 -82870 -140573 532215
16361 212635 403112 448377 284280 300161 78509 310896 428628 216614 226527 444053
16351 444053 112476 294267 490314 397656 388200 175065 392738 240179 -21102 147051
16340 276703 529834 -106451 341887 213985 313957 329890 277819 109163 423543 279516
16330 279516 92650 354319 267890 420162 92006 125528 241610 271279 348844 264890 -65206
16318 21092 335130 369170 266050 207283 185478 532469 167710 424801 333962 214286
16308 214286 335154 114552 197529 317593 339407 8755 342466 195780 232045 8056 309687
16297C09687d2702B07503q4695a25424A1811e1727A74948K69423A06420n990e8506
16285c8442B36760J34151j81097Q45H4644k4997K64853a7803C55148A33515J02253
16274B35768j03910K1552b94007A28588E1906L73006j94533k6370l6535b0045
16263C10799Q842i6760A40046J43721I2261J61719A02645K08749J26825A07355
16252A95668L7524R5246A61969Q5273D2787Q2662K55735j48584j06740n5290M37020
16241E07590k47427j29564d124B71084j04953j7223F8226L02746A22313a36285
16230a4376E4762J14158a31730B59322m7300J11P9501p489a29235B89433j13197
16219A76236J89871o4228j22320C2986J97562q0138a62382H3311R0885g1972H3459
$$ plain form
16297 309687 -42702 207503 122808 -125424 11811 -51727 174948 444371 106420 100430 -58506
16285 -38442 236760 370911 189814 190659 84644 59647 324500 -17803 355148 133515 235768
16274 235768 131858 153410 -294007 128588 51906 424912 230379 204009 167474 -20045
16263 310799 319641 -96760 140046 283767 92261 253980 102645 311394 438219 107355
16252 195668 233192 328438 161969 247242 42787 125449 381184 232600 125860 70570 507590
16241 507590 260163 130599 -4124 271084 166131 148908 68226 370972 122313 -136285
16230 -14376 54762 168920 -131730 259322 212022 212133 291634 284145 -129235 289433 176236
16219 176236 366107 301879 179559 32986 230548 150410 -162382 83311 174196 -71972 83459
16207F8598K3702K98188a13517G5582g8709A84606q7580R3430c8240j41813d2921
16195D3603J84666g9618F0085H87J11700j9743L02882I6057b469j5715A18273
16183b4501I3232K30522d5348j65516A4233a17073C49511l1986A03387a67842
16172C7177J06516b14753J01064C28660j06188b18B17577j07029f3830F4546Q5035
16161A49581a13326d9052A17284C5982i1989M4684r5660g740A62956j5256D6028
16149B72403j06446c5458F1313J89932C5180A2484J17768J21598j02576O4800
16139B14074n1036J55193A47555C2373b28046E507N329J08920a14714r6109a6866
16127a9620o198k5339n9765A48249a46038e5224E7492K459a6329B54890F6539
$$ plain form
16207 68598 92300 390488 -113517 75582 -78709 184606 97026 190456 -38240 -180053 -42921
16195 43603 228269 -79618 60085 887 112587 92844 395726 96057 -2469 -18184 118273
16183 -24501 93232 323754 -45348 -210864 14233 -117073 349511 317525 103387 -167842
16172 37177 143693 -214753 -113689 328660 222472 -218 217577 110548 -63830 64546 149581
16161 149581 -113326 -49052 117284 35982 -91989 -47305 -142965 -7740 162956 147700 46028
16149 272403 165957 -35458 61313 251245 35180 12484 130252 251850 149274 214074
16139 214074 163038 318231 147555 32373 -228046 5507 10836 119756 -114714 -210823 -16866
16127 -19620 -25818 -51157 -110922 148249 -146038 -55224 57492 59951 -16329 254890 66539
16115C803a64475a9411A65305a69826c2689b807F5417a15199B59381p6280a28401
16103A89772e3690q2986F0157h956p8202F7218j0230L2522N7616j4471N051L40804
16091D78510a09163A9917L29402j35280b1416m4805A11853J17718A00007a26025
16080A87370f5492P341E7266b1871l37841F0475h6866A06097c01841A73979a87692
16068a57997o3672l8675j95102J21822B9481e9170j54485d2117A01181a03261
16057B28494a44910D0487b61048J07760E4145d6497A51096e0686j69587g8485
16046a28693l756j8552p2632C067a63393A00237b58505Q7780D34560c2874C24655
16034h750j81247e2537A17024M3739a52583a4668F7021o384f648o4719K8510A61631
$$ plain form
16115 3803 -164475 -19411 165305 -169826 -32689 -2807 65417 -115199 259381 183101 -128401
16103 189772 -53690 -136676 60157 -8956 -87158 67218 56988 89510 147126 132655 137706 478510
16091 478510 -109163 19917 349319 214039 -21416 -66221 111853 229571 100007 -126025
16080 187370 -65492 -58151 57266 -21871 -359712 60475 -86866 106097 -301841 173979 -187692
16068 -157997 -221669 -260344 -455446 -333624 29481 -59170 -213655 -42117 101181 -103261
16057 228494 -144910 40487 -261048 -153288 54145 -46497 151096 -50686 -220273 -78485
16046 -128693 -132449 -151001 -223633 3067 -163393 100237 -258505 -170725 434560 -32874 324655
16034 -8750 -189997 -52537 117024 160763 -152583 -14668 67021 60637 -6648 -71367 -42857 161631
16021A04888J71091a19317e9563h627A34897a8871m06060K03410H5688P5792d01137
16009a24687A82691H6108f305p3900A2704m777Q3192J957I718b94139A05139m8756
15997E6383d3076B8672J42401a26910j20240e1492l49600B4202b46995J14734
15987a32261O0134F5095J40829k0082a46687m5199l6743J05754o178e6227C87672
15975a07854k22730G4751a84418h456B78359B8826r88N46004B82908j8772A11524
15963B29591o9096a04336A19633a02333p2628A00868b07763B07027B7942a32236
15952c60436a05784l89659B90284A10904c65053G19J56187a74116B39906a3872
15941A42224a21430E0152J9204A0839c72556b8853A13534b08773r7526i2204H8151
$$ plain form
16021 104888 275979 -119317 -59563 -8627 134897 -18871 -424931 -221521 85688 161480 -401137
16009 -124687 182691 86108 -6305 -80205 12704 7927 91119 93076 9718 -294139 105139 56383
15997 56383 -43076 28672 171073 -126910 -247150 -51492 -401092 24202 -246995 -132261
15987 -132261 -72127 65095 205924 185842 -146687 -191886 -228629 -122875 -129053 -56227 387672
15975 -107854 -330584 74751 -184418 -8456 278359 28826 27838 573842 282908 264136 111524
15963 229591 160495 -104336 119633 -102333 -174961 100868 -207763 207027 27942 -132236
15952 -360436 -105784 -495443 290284 110904 -365053 719 156906 -174116 239906 -13872
15941 142224 -121430 50152 69356 10839 -372556 -28853 113534 -208773 -306299 -92204 88151
15929B63259i9768b0113k73470f9192C5365R3832a39280Q262f0446J5770k80102
15918c24778J44366c5879j86910H9518L091J52389f7160q4210D9157J17984d08233
15906G8402a62360k79582B04216i2346A91911b27857A99228a15360A89258a22610
15895c4177j60929E6914a08399j01392L781b5551B35995a25728A48673a24454
15884H5060j2973a6436k0553j8246B17142A08356A8171c607m7603k06720F4190
15872I8609B7204L0442a59854C0582L4481h7582F4960b11473F4547a57907j70421
15861c28328a34209G6105j1211a17899F0902a53255C6469a88448B30969d65282
15850c76352B48036b61652A1773b65241J12012g4135j23759M3519e9375H6236
$$ plain form
15929 263259 -99768 -20113 -293583 -69192 35365 129197 -139280 -131018 -60446 -44676 -324778
15918 -324778 -180412 -35879 -222789 89518 92609 244998 -67160 -151370 49157 167141 -408233
15906 78402 -162360 -441942 204216 -92346 191911 -227857 199228 -115360 189258 -122610
15895 -34177 -195106 56914 -108399 -209791 -206010 -25551 235995 -125728 148673 -124454
15884 85060 72087 -16436 -36989 -55235 217142 108356 18171 -3607 -51210 -257930 64190
15872 98609 27204 57646 -159854 30582 65063 -87582 64960 -211473 64547 -157907 -328328
15861 -328328 -134209 76105 64894 -117899 60902 -153255 36469 -188448 230969 -465282
15850 -376352 248036 -261652 11773 -265241 -153229 -74135 -197894 -154375 -59375 86236
15839B43439h4576c3030B22400a28114l4461C0962K00809b64726a0061p6954B992
15827a13773g163k51819A9742a02362L6378K1951A23669b32578k9859a0801A65621
15815a75071b8784A31567b4142b578B1041M6534b59796d3328D3501K1308b12880
15803c81834J23883C9984a89734B24413q2816E9112c81138J02916O7499A40082
15792A38192b7136j25364N0549B40839a48841g617m7667p256p7351e2087j06486
15781a58573c1875j0636p6206N2956j19482f6307h70C7781K9468B5550K2975i5487
15768H318J3158N9141k814a24529G7359l778c08120g7799G2162e8514l98100a99917
15755a38877e570A53186b2244G1384f4500n2320A32813C3386b57224a01909c3096
$$ plain form
15839 243439 -84576 -33030 222400 -128114 -162575 30962 231771 -264726 -10061 -87015 2992
15827 -113773 -7163 -258982 19742 -102362 -65984 -44033 123669 -232578 -262437 -10801 165621
15815 -175071 -28784 131567 -24142 -2578 21041 67575 -259796 -43328 43501 64809 -212880
15803 -381834 -257951 39984 -189734 224413 141597 59112 -381138 -278222 -210723 140082
15792 138192 -27136 -152500 -101951 240839 -148841 -7617 -55284 -62540 -139891 -52087 -158573
15781 -158573 -31875 -42511 -118717 -65761 -185243 -66307 -870 37781 67249 25550 48525 -95487
15768 8318 21476 80617 77803 -124529 77359 73581 -308120 -77799 72162 -58514 -456614 -199917
15755 -138877 -5570 153186 -22244 71384 -64500 -116820 132813 33386 -257224 -101909 -33096
15743a08862J5388j12050a1249G029b98347L9146n6527P7112o1932L9804H6464
15731i8165B67759E5743J75946f9273J8034I1020b27199b9647m1416a8085k6223
15720d4308k1475a7432F2931d8711G4543l2160f3653j0265k9427F0803c5105j48574
15708a83679l98520A58742C505N696f3124j56670i1085B3758b15651C88436G3822
15696H4005a21002A95295b69389A13949B919N5667f1725j50621A2411J63006e2239
15684a21959o9389B43129o2504b35936o5251D5909a87829i2658B3514g9321A72349
15672F4801a12009E6295b9048l37427A37016b514k24509f8809J0212k51644F5841
15660d7308N646r7325A58812g0540B55543f7338A18135I239d37783a14162N6275
$$ plain form
15743 -108862 -93474 -205524 -11249 7029 -298347 -259201 -315728 -238616 -300548 -260744 86464
15731 -98165 267759 55743 231689 -69273 -51239 91020 -227199 -29647 -71063 -18085 -44308
15720 -44308 -65783 -17432 62931 -48711 74543 42383 -63653 -73918 -103345 60803 -35105 -183679
15708 -183679 -582199 158742 3505 9201 -63124 -219794 -91085 23758 -215651 388436 73822
15696 84005 -121002 195295 -269389 113949 2919 58586 -61725 -212346 12411 175417 -52239
15684 -121959 -191348 243129 180625 -235936 -301187 45909 -187829 -92658 23514 -79321 172349
15672 64801 -112009 56295 -29048 -366475 137016 -2514 -227023 -68809 -58597 -310241 65841
15660 -47308 -41662 -138987 158812 -70540 255543 -67338 118135 9239 -437783 -114162 -57887
15649e7887n3680B2615a42291A35258h7334k5461G0832b89458e8284j04761B13932
15637A31277a10740j654A26218o1038K8052a72087O767P8483C9419a90187P7034
15626a13153N5338I8982K35137i5099j68959J06347o2596D2588K3734a53230j00477
15615b53707A48014a6830A39920J715o2041a93898M5989F5404d287j37301m3782
15604a85370E4514J99934c2720A68614h6913l3250j75516b7670C0335Q6497c48151
15592d6589m7747j1279G0806J27433a31861K244K2308J0045B0824k807b6975A6816
15579b10986i0311A24738P1454a80677e8316K5947o2449B00501C7998i2353B15434
15567B67186i5646B2270N9444L1144i3066j31762g3695B01320C165e9734p0721
$$ plain form
15649 -57887 -111567 22615 -142291 135258 -87334 -112795 70832 -289458 -58284 -163045 213932
15637 131277 -110740 -112394 126218 65180 93232 -172087 -165320 -86837 39419 -190187 -113153
15626 -113153 -57815 98982 334119 -95099 -264058 -157711 -220307 42588 66322 -153230 -253707
15615 -253707 148014 -16830 139920 141635 79594 -193898 -147909 65404 -4287 -141588 -185370
15604 -185370 54514 254448 -32720 168614 -86913 -120163 -295679 -27670 30335 116832 -348151
15592 -46589 -94336 -105615 70806 198239 -131861 -129617 -107309 -97264 20824 18017 -26975 16816
15579 -210986 -90311 124738 196192 -180677 -58316 -32369 -94818 200501 37998 -92353 215434
15567 267186 -95646 22270 81714 112858 -93066 -224828 -73695 201320 3165 -59734 -130455
15556a30455L4347b6241Q72j68961k10217K5418f0782A13283L23294a33108A65504
15544d9734A48375B8171c5114G3506c5275k73172A12365C7587c23274A03790c63322
15532a08149A98086l7638a00206C2977b382B90990o986c9401l2688d126A88972
15520a59396a3102j42504d6292C5209p414b89897a11333m83K2171j42620a12215
15508a91622d8041j35223f1838I5424c04151b6818F6663P7114a31337D3226J99403
15497B42629q7356m1545g258F1452d5234n6145B19758r749m2929C8823J48272
15486A87095J19363b13366C08513G1710c27825M2436d5247B79607f3848A48019
15475f3966k9421H9525R0434A6350a16754A6439K14367J33720D9818b78425j41763
$$ plain form
15556 -130455 -96108 -26241 -25369 -194330 -404547 -379129 -60782 113283 436577 -133108 165504
15544 -49734 148375 28171 -35114 73506 -35275 -308447 112365 37587 -323274 103790 -363322
15532 -108149 198086 160448 -100206 32977 -2382 290990 284004 -39401 -72089 -4126 188972
15520 -159396 -13102 -155606 -46292 35209 27795 -289897 -111333 -111816 -89645 -232265 -112215
15508 -191622 -48041 -183264 -61838 95424 -304151 -26818 66663 143777 -131337 43226 242629
15497 242629 155273 113728 -7258 61452 -45234 -101379 219758 210009 167080 38823 187095
15486 187095 306458 -213366 308513 71710 -327825 -285389 -45247 279607 -63848 148019
15475 -63966 -93387 89525 179959 16350 -116754 16439 230806 364526 49818 -278425 -420188
15464d20188a60988A52482c07245A76402b37099g6421n2992A933a58434n7865
15454b16299A1362J63001n5490I3J56150P130b26846D9984I133d7924m03818E6102
15441G0073g5607H1118a45122D22346A40804J97833i7962a479q9927B42572a29606
15429a18013A97168a97606b5553A79959a46812A19904K50135a14582D8843a50488
15418b0661k44887E1759b0768B99988d4797j52029B8179b62464n5128B9724h3041
15406d7785A62584G3180K15546b40853A06755a11324j42327a6897F0696a69109
15395C39701A65224f144F681J64805a51034e2161r9167k9549C6150F308h0853
15383c4356C009b54498J19270m5152I6377B5728a23893j00707N4824M3616j13341
$$ plain form
15464 -420188 -160988 152482 -307245 176402 -237099 -76421 -129413 1933 -158434 -216299
15454 -216299 11362 174363 118873 93 156243 163373 -226846 49984 9133 -47924 -451742 56102
15441 70073 -75607 81118 -145122 422346 140804 338637 -97962 -1479 -91406 242572 -129606
15429 -118013 197168 -197606 -25553 179959 -146812 119904 370039 -114582 48843 -150488
15418 -20661 -265548 51759 -20768 299988 -44797 -196826 28179 -262464 -317592 29724 -83041
15406 -47785 162584 73180 288726 -240853 106755 -111324 -253651 -16897 60696 -169109
15395 339701 165224 -6144 6681 171486 -151034 -52161 -151328 -180877 36150 6308 -80853
15383 -34356 3009 -254498 -135228 -180380 96377 25728 -123893 -224600 -169776 -126160 -239501
15372b39501B4300b82591B9402c62141B10823a3965r2691j34864J07992d6472
15361a46500m2880R2910k08884J19982A5694M7134h6045A87747a49382A48731
15350A88686C7717d0929A89086J7457m4722R5435E5257k0393a15143C8536i2987
15338a32342B4499a2639r902H7946a64397A18279C3159a12653L0366j01379C53447
15326a95193d4428A0472P5357j4105L63979i8479C2076g1330k30392i7751L1263
15315f6488K5206k29403B7955K6355Q0912j6353e808j69343b2798j64455j18804
15304c06057J51324H9434L79760e4243D7901L57039a20361h204A4593e8682k17232
15293b75914B13174J05019a05935A38108a33326A2213K86510h8527g292I3668
$$ plain form
15372 -239501 24300 -282591 29402 -362141 210823 -13965 -106656 -241520 -133528 -46472
15361 -146500 -189380 -96470 -305354 -185372 15694 62828 -86045 187747 -149382 148731
15350 188686 37717 -40929 189086 206543 161821 257256 55257 34864 -115143 38536 -92987
15338 -132342 24499 -12639 -22541 87946 -164397 118279 33159 -112653 -82287 -183666 353447
15326 -195193 -44428 10472 85829 71724 435703 -98479 32076 -71330 -301722 -97751 -66488
15315 -66488 -41282 -270685 27955 54310 135222 118869 -5808 -175151 -22798 -187253 -306057
15304 -306057 -154733 89434 469194 -54243 47901 404940 -120361 -8204 14593 -58682 -275914
15293 -275914 213174 318193 -105935 138108 -133326 12213 298723 -88527 -7292 93668
15282H3233J1038J60905D6860K11477d22106g5946j43741b6024D1445J07846J7271
15271A66562d7305H1929a06066E6333e1070A26234a34857O4954E7283K05373C1427
15259c8898j22284C8154J17372B2789p619h3451B80356A22469k843k1917j9439
15248G8270b34124A82944l8257b3302A50606l7681L42182a34522A27841J10836
15238B38677p8479J41870J39565M46103r0218N05208K53546m65911L61303l81504
15228A070160B96555j22258f3919A61018J25110i3858A55876p549n5832c9919
15217e2611l7961B60820e5020H9631a10890j4369L2658n3580B71092a36579A48789
15205c08153B18999H9547K55746D8269a41058B5956Q3113A9298a47139C06491
$$ plain form
15282 83233 94271 255176 46860 258337 -422106 -75946 -219687 -26024 41445 149291 166562
15271 166562 -47305 81929 -106066 56333 -51070 126234 -134857 -69903 57283 262656 31427
15259 -38898 -161182 38154 155526 22789 15170 -83451 280356 122469 119626 97709 78270
15248 78270 -234124 182944 144687 -23302 150606 112925 455107 -134522 127841 238677
15238 238677 160198 302068 441633 887736 797518 1302726 1556272 1090361 1451664 1070160
15228 1070160 296555 174297 -63919 161018 286128 -93858 155876 148327 92495 -39919
15217 -52611 -90572 260820 -55020 89631 -110890 -125259 -92601 -146181 271092 -136579 148789
15205 -308153 218999 89547 345293 48269 -141058 25956 109069 19298 -147139 306491
15194A83508a49617E3791i9775K2409c7547j49835A58587a75023a4228b64A4613
15182E1380a24315B31919n3494b55101J13390P853G1791K9028C2864J19427b2941
15170a26309A89424g3414A31811a01889A6110K23501r2049Q7573A6390L51923
15160C68313B0163a68164A81414a26659o6475G30J62275j511a31933F2337Q7855
15149A50192L48096D3198A4446J11918Q3056b07373C7237J50622G2968R2818n1176
15138A14610P2169F5644J64276h9015A26638D6508J61346b3451B16075E5915R3061
15127A48976k233j3375C3549L25854a51586I7009K4690E7543b7268C58246a93583
15115C11031j38479A0517J85504G8049K31630A13704i9741A83881D8586c19275
$$ plain form
15194 183508 -149617 53791 -99775 -77366 -37547 -187382 158587 -175023 -14228 -264 14613
15182 51380 -124315 231919 178425 -255101 -141711 -133858 71791 100819 32864 152291 -22941
15170 -126309 189424 -73414 131811 -101889 16110 239611 147562 235135 16390 368313
15160 368313 20163 -168164 181414 -126659 -193134 730 163005 161494 -131933 62337 150192
15149 150192 498288 43198 14446 126364 209420 -207373 37237 187859 72968 165786 114610
15138 114610 186779 65644 229920 -89015 126638 46508 207854 -23451 216075 55915 148976
15127 148976 146743 133368 33549 359403 -151586 97009 121699 57543 -27268 358246 -193583
15115 311031 172552 10517 196021 78049 309679 113704 -99741 183881 48586 -319275
15104A47943J26362p5841K10423b92360C8631K43600E2416a9383j9897A49191
15093C24912i9334A17077a92302A73175l4176j5080J50891C8781a137l4905F0201
15081c9224B35779O7150q5895G8851K2702a8135A7057J00529a22892A12141L5054
15070A47195L45049A87653N7658A02569J2989J34738r0439D1115K49255G2827
15059B04852C8769a7487m5562C13339A21816M948P1937o8710Q1659k755o0022
15048A48873J14063b03430e2173n7039A56583j9678l9930j6947R8453M0199f7738
15036B59817j10208K28544E3139J54850k3762K80205b9592D6598a00735n9838
15026a60573r3218C29492i759C48447A56389N7386L095K1590D5583g2409g337
$$ plain form
15104 147943 274305 198464 408887 -292360 38631 282231 52416 -19383 -39280 149191
15093 324912 -99334 117077 -192302 173175 138999 123919 274810 38781 -1137 -36042 60201
15081 -39224 235779 302929 217034 78851 101553 -18135 17057 117586 -122892 112141 147195
15070 147195 492244 187653 245311 102569 115558 250296 159857 41115 290370 72827
15059 204852 38769 -17487 -63049 313339 121816 126764 198701 129991 211650 208895 148873
15048 148873 262936 -203430 -52173 -109212 156583 136905 96975 80028 178481 218680 -67738
15036 259817 149609 378153 53139 207989 184227 464432 -29592 46598 -100735 -160573
15026 -160573 -253791 329492 -9759 348447 156389 213775 216870 238460 45583 -72409 -7337
15014B14524F6064K2447K1303C0275L49931H6709J13435J20681b5479B30400g1767
15002c5G2432M04526A39628i0736J3678A96031L1437l761N2694I9007a24809D5469
14989B53535a72747Q3373o0208D52645j73027P9376A18226K05603J7937a02215
14978H8417H426M50455k04579A26117J01773J40727A5901K2454K03038d667H3155
14966H678a92972I8782J19844P1786A38177P428C4019K30439L16722g9885A18782
14954d2020B05269a0690j15610b9023C18009K62134g1108A05927J21644L08315
14944E35886C2514L21318M5825j51048J53669i7658D1139Q3088j9816J39526L455
14933B47392J42957I0454m4496J10664K76953b39641A44351O6893g1477C44192
$$ plain form
15014 214524 66064 88511 109814 30275 380206 86709 200144 320825 -25479 230400 -71767
15002 -35 72432 476958 139628 -90736 -77058 196031 227468 223707 276401 99007 -124809 45469
14989 253535 -172747 -89374 -149582 452645 279618 358994 118226 323829 341766 -102215
14978 88417 8426 458881 254302 126117 227890 368617 15901 38355 241393 -4667 83155
14966 8678 -192972 98782 218626 290412 138177 145605 34019 264458 581180 -79885 118782
14954 -42020 205269 -10690 -126300 -29023 318009 580143 -71108 105927 227571 535886
14944 535886 32514 353832 399657 248609 402278 -97658 41139 124227 104411 243937 247392
14933 247392 390349 90454 45958 156622 433575 -239641 144351 211244 -71477 344192
14922b68120a0808l9410B19474Q1042o8620K3408A05446J01649K32L14785A39437
14910I3670K87119E7328j0413K17068J81156A24247L29159r6523j44476R0772
14900C03179j03634c8304C16412j383J60824m3440j25581j39358P1733N1792r7806
14889A93193L35395A72424N3084J37804F8903J23684K38675m4943A77011J95425
14879C72436j72229E3194Q2371M0826K55899L70263A06375J22407N5658I1064
14868D27544A47690M1980j8280P5662F7580Q5406k9804c2941B75401M5239p9967
14857B40673J89973j65719j04921J97k918L10654o4224j06429P1921j50264K77600
14846D96543A25459L01128R250B12396M69136o5773j63717Q2172A16840J16682
$$ plain form
14922 -268120 -10808 -50218 219474 300516 231896 255304 105446 207095 207327 522112 139437
14910 93670 380789 57328 46915 263983 445139 124247 453406 356883 212407 303179
14900 303179 199545 -38304 316412 315029 475853 432413 306832 167474 239207 290999 193193
14889 193193 528588 172424 225508 363312 68903 192587 431262 386319 177011 372436
14879 372436 200207 53194 135565 176391 432290 802553 106375 228782 284440 91064
14868 427544 147690 189670 171390 247052 67580 152986 123182 -32941 275401 320640 240673
14857 240673 430646 264927 160006 160203 157285 467939 403715 297286 369207 218943 496543
14846 496543 125459 426587 435837 212396 681532 615759 452042 534214 116840 233522
14836B33522R5873N8724A14044L5542L60329j31028j18375o1388j423L83684k37466
14825C43919m3599M8326j18070a15414E41154j84402p9964r4061J66300K49565
14815E98592k70182K97104B29274K02791j64656K7333J57033r5704J08477A48274
14804F4689L83291K8349A81113N17651k67048J28721B41239l5132F6464O90496
14794G56960B62167K06957J97362k57243j8639m9732L5230l2216H2983K80570
14784C63553K14026k85464j35712P3430L55603j6523o7269A75940J19995n1293
14774B44642J01519j31876L90150k24523J23917j19597L4567K33778k11525M25100
14764H66152l48398K92137l80991J77568j36091O9335R1081j46015l0637P4237
$$ plain form
14836 233522 329395 388119 114044 149586 509915 378887 260512 199124 197701 581385 343919
14825 343919 300320 348646 230576 -115414 541154 356752 276788 182727 349027 598592
14815 598592 328410 625514 229274 432065 267409 294742 451775 356071 464548 148274
14804 64689 447980 476329 181113 698764 431716 560437 241239 206107 66464 756960
14794 756960 262167 469124 666486 409243 390604 340872 376102 343886 82983 363553
14784 363553 577579 292115 156403 229833 585436 568913 501644 175940 295935 244642
14774 244642 346161 214285 604435 379912 503829 384232 418799 652577 441052 866152
14764 866152 517754 809891 428900 606468 470377 539712 630793 484778 454141 528378
14754E28378j89103K43236K6741A28096M56875B78292K13544J41605n1846k48077
14744C33518J01332J18947R9755l08508L64678j84240Q9105j37488J88614l1293
14734F34420k69085L85827k32135n3963K74311M9148C85712L61415k76051K03217
14724F74293O4077k41308j9564J33810L20351k26939j63403J76130r9680j89540
14714D28227J84667J36516k89332M00864m16170L36636k99457A68823N79395j7326
14704G30892j22863J58132k87579N9466j09705R5123k7672J06726q3714N5113
14694E73919J81682k99206K29273j03255Q8093p6398k3888j10772L10606J72272
14684I42326q4670N863j37550J34973D27768N00588l43151n2776K15742j60244
$$ plain form
14754 528378 339275 582511 609252 128096 584971 278292 491836 633441 581595 333518
14744 333518 434850 553797 653552 345044 709722 525482 614587 477099 665713 634420
14734 634420 365335 751162 519027 465064 739375 788523 385712 747127 471076 674293
14724 674293 738370 497062 477498 611308 931659 704720 541317 717447 617767 428227
14714 428227 612894 749410 460078 860942 444772 781408 481951 168823 748218 730892
14704 730892 608029 766161 478582 538048 428343 523466 495794 602520 518806 573919
14694 573919 755601 456395 685668 582413 670506 594108 570220 459448 770054 942326
14684 942326 857656 863519 725969 860942 427768 928356 585205 532429 748171 587927
14674E87927j20285L99186J21564D33883K35610k23344M43594k4878L6670j92010
14664G09525N8851J53930J57574j02920N7158j62978K97063l24748j78991K25779
14654H90243k87816L23182J56730j34701Q4604J47995m27437N2026k8627J22143
14644H98342q8924j02096j9533L93511j28331K23126j24824k74709M66639n16634
14634G26567K29816J40613n19634P57558l88348k08842L42771N6J02673L1307
14624A214537J42621j24986j71919J29504j80302J56292j66277j61691J77473
14615A015252L22740k01474J33389K36423o00043K54566J53965q156m61482M91602
14605A336782p1919k03304Q9245j18490K32305J88990l74525K35913J3175k07682
$$ plain form
14674 587927 467642 866828 988392 433883 669493 446149 889743 864865 901535 709525
14664 709525 768376 922306 1079880 976960 1034118 871140 1168203 843455 664464 890243
14654 890243 602427 925609 1082339 947638 1032242 1180237 752800 804826 776199 898342
14644 898342 809418 707322 687789 1081300 952969 1176095 1051271 776562 1243201 726567
14634 726567 956383 1096996 577362 1334920 946572 737730 1080501 1080557 1183230 1214537
14624 1214537 1357158 1232172 1060253 1189757 1009455 1165747 999470 837779 1015252
14615 1015252 1337992 1136518 1269907 1506330 906287 1160853 1314818 1306662 845180 1336782
14605 1336782 1264863 1061559 1150804 1032314 1264619 1453609 1079084 1314997 1328172 1120490
14595A120490N18802o21527O02396m74557K52459J43352n0270l17392L84868k15216
14585A343405J87365n04960L36110N8199R4099k5251j16259M15403k27307j6502
14575A544302N7864j02805N45380l69912R43j70927K77975k70799N92506m68118
14565A636409K85599l50484K17983Q5826j45215K05621j878L00009r4717l96004
14555A743149J81789K69920k73231K87840k4167J83417N8916k07128M96060l53420
14545B363145L57674o583M21985l7646K86384M62653M10709K93400J328600K13895
14535F094216J574853K336655L696528N886433O667838r91010p545375n959174
14527A1760964m437419k401944j125040o71224l53676l92565m7800j90373P9021
$$ plain form
14595 1120490 1639292 1017765 1620161 1145604 1398063 1541415 1491145 1173753 1558621 1343405
14585 1343405 1530770 1025810 1361920 1420119 1514218 1488967 1372708 1788111 1560804 1544302
14575 1544302 1602166 1499361 2044741 1674829 1675772 1504845 1782820 1512021 2104527 1636409
14565 1636409 1922008 1571524 1789507 1875333 1730118 1935739 1933861 2233870 2139153 1743149
14555 1743149 1924938 2194858 1921627 2209467 2185300 2368717 2427633 2220505 2716565 2363145
14545 2363145 2720819 2714236 3136221 3098575 3384959 3847612 4258321 4551721 5880321 6094216
14535 6094216 7669069 10005724 13702252 19588685 26256523 25265513 17720138 11760964
14527 11760964 7323545 4921601 3796561 3125337 2771661 2379096 2331296 2140923 2219944
14518B219944l4241l31569K85226M6096j33730J1491K79566j56203J14589k34297
14508B066872J7188k14544J20625J28617L06582P3814p17619O22198j36792J80933
14498B447874N5260q6065J14645J93109l52296L42301o493K70782m22390n1792
14488B504935P9303L05667j4076r8816j97456K59027j42492K44317o9431K62733
14478C133711j95554Q0342J47788j44765j23143K9320K45508P3663j82188J25299
14468C189981K7824J72081K03330k72451K58611l83911L52064J5704K10259l59634
14458C413858j4265K08175Q2958K16014j4347M6465M9094J01506J38268l77077
14448C850649J24520J25785k08761N91622p30k36771K97961o1979N1238J80625
$$ plain form
14518 2219944 2185703 1854134 2139360 2185456 2051726 2063217 2342783 2186580 2301169 2066872
14508 2066872 2084060 1869516 1990141 2118758 2425340 2499154 1781535 2403733 2266941 2447874
14498 2447874 2503134 2417069 2531714 2724823 2372527 2714828 2708335 2979117 2556727 2504935
14488 2504935 2584238 2889905 2875829 2777013 2579557 2838584 2696092 2940409 2870978 3133711
14478 3133711 2938157 3018499 3166287 3021522 2898379 2927699 3173207 3246870 3064682 3189981
14468 3189981 3217805 3389886 3593216 3320765 3579376 3195465 3547529 3563233 3773492 3413858
14458 3413858 3399593 3607768 3690726 3906740 3892393 3938858 3987952 4089458 4227726 3850649
14448 3850649 3975169 4100954 3892193 4483815 4483085 4246314 4544275 4482296 4533534 4714159
14438D714159m15146J42940N78241k69800M21627m56386L03181J47875j69147
14429D997544K11135j91804L88257j13730K89351n25051K84658m7921K37026J25765
14419E655230J04259j05985L36074q844J43069j85933Q16380o33777K38600J18178
14409F477251L77334j34084n0261J02189J11329J44259J59676J66984K21920O0314
14399G636911p1250L69943K91553l35728K41700J05539J73250J50209j30795N18617
14389H949949K32583k26121Q2204N87787o1788R7103K71739k95379N87091K3247
14379A0248415O1937L25357J44242L94203j40269M81079n4547L43385J18690L82934
14369A2305426L18112J39273n7734L56973N03356K46357m9248N11273L99759j43976
$$ plain form
14438 4714159 4299013 4441953 5020194 4750394 5172021 4715635 5018816 5166691 4997544
14429 4997544 5208679 5016875 5405132 5291402 5580753 5055702 5340360 5292439 5529465 5655230
14419 5655230 5759489 5653504 5989578 5980734 6123803 5937870 6754250 6120473 6359073 6477251
14409 6477251 6854585 6720501 6670240 6772429 6883758 7028017 7187693 7354677 7576597 7636911
14399 7636911 7565661 7935604 8227157 7891429 8133129 8238668 8411918 8562127 8431332 8949949
14389 8949949 9182532 8956411 9038615 9626402 9564614 9661717 9933456 9638077 10225168 10248415
14379 10248415 10310352 10635709 10779951 11174154 11033885 11514964 11460417 11803802 11922492 12305426
14369 12305426 12623538 12762811 12705077 13062050 13565406 13811763 13762515 14273788 14673547 14529571
14359A4529571P36637p9342M37001N23094K25900K09334N17304J47668M13769
14350A7660936J99822N50582O70566K55464N21015L40493L75980O32968M26375
14341B1634201O99617k3057J008190P19640N34672L71313P27887M51262R10542
14332B7034267M07222R37884Q62644N66509Q34024O85921J236370P95331N97756
14323C3957928J234523J090776J297472Q13398J259885J081918J448846J457482
14315D3642228J512043J392353J454777J505562J789661J266574J932549K321553
14307E6817300K319343J554652K838491K137974K820797K263074L062224K973465
14299G6787320L105975L453842L580215L620363M120140M359520M123214M699293
$$ plain form
14359 14529571 15266208 15186866 15623867 16146961 16372861 16582195 17099499 17247167 17660936
14350 17660936 17860758 18411340 19081906 19337370 19858385 20198878 20574858 21207826 21634201
14341 21634201 22333818 22310761 23318951 24038591 24573263 24944576 25672463 26123725 27034267
14332 27034267 27441489 28379373 29242017 29808526 30642550 31328471 32564841 33360172 33957928
14323 33957928 35192451 36283227 37580699 38394097 39653982 40735900 42184746 43642228
14315 43642228 45154271 46546624 48001401 49506963 51296624 52563198 54495747 56817300
14307 56817300 59136643 60691295 63529786 65667760 68488557 70751631 73813855 76787320
14299 76787320 79893295 83347137 86927352 90547715 94667855 99027375 103150589 107849882
14291A07849882N123456N454377N781472N887978O154928P199410P311850P681441
14283A58444794Q656633Q847594Q983093R992132J0528117J1231539J1450783
14276B28134685J2569880J3049647J3986904J4059174J5098489J5251372J5418532
14269C27568683J4754253J3585223J3897150J2346741J1701985R509635Q394997
14262D11758667Q233759P622638P805967P287410M322481J692135O54603l37341
14254D49040319m482714o755838p413010r937059j0907678j2397145j4067842
14247C83079033j4573701j4787720j4561469j4487809j4590953j3922681j3788002
14240B82366698j3285477j2183597j2148408j1556518j1703244j0856129j0618972
$$ plain form
14291 107849882 112973338 118427715 124209187 130097165 136252093 143451503 150763353 158444794
14283 158444794 167101427 175949021 184932114 194924246 205452363 216683902 228134685
14276 228134685 240704565 253754212 267741116 281800290 296898779 312150151 327568683
14269 327568683 342322936 355908159 369805309 382152050 393854035 403363670 411758667
14262 411758667 419992426 427615064 435421031 442708441 447030922 448723057 449377660 449040319
14254 449040319 444557605 437801767 430388757 420451698 409544020 397146875 383079033
14247 383079033 368505332 353717612 339156143 324668334 310077381 296154700 282366698
14240 282366698 269081221 256897624 244749216 233192698 221489454 210633325 200014353
14233B00014353r925830j0005965r244977q626550q048395p897813p279858o517544
14225A32467421o524113n763710n329511n333253m703885m798129m249449m000660
14217I1764711l738869l468824l520438l230882l195189l059792k464511k720127
14209F6366079k237940k564765j966441k185248j918946j829057j757626j794233
14201E0111823j736903j276692j557405j228764j636380j113035j526581o28418
14193C9407645j053225r39640j106625j029788j179744j335499p41110m45874
14185C1576140m76201j195851p93445j212496p6801r62384n95206m94617q56742
14176B4912397m24595j107579l10853p68723p0050n23085o89125j65249n46454
$$ plain form
14233 200014353 190088523 180082558 170837581 162211031 154162636 146264823 138984965 132467421
14225 132467421 125943308 120179598 114850087 109516834 104812949 100014820 95765371 91764711
14217 91764711 88025842 84557018 81036580 77805698 74610509 71550717 69086206 66366079
14209 66366079 64128139 61563374 59596933 57411685 55492739 53663682 51906056 50111823
14201 50111823 48374920 47098228 45540823 44312059 42675679 41562644 40036063 39407645
14193 39407645 38354420 37414780 36308155 35278367 34098623 32763124 32022014 31576140
14185 31576140 31099939 29904088 29110643 27898147 27821346 26858962 26263756 25769139 24912397
14176 24912397 24487802 23380223 23069370 22300647 22230597 21707512 21018387 20853138 20306684
14167B0306684l13378p23078l70624l07462l92176k38111p31606q6919o34447
14158A6508883n4896l28661k94042k32129k85396m41100k48194k60633k49244
14149A4114588l0489l82016n32963J35115k32404p54277N8984J20099l88746l82019
14139A1725872j38104j71252j96284J91252l39377l17474k63773l57076L539o5107
14129A0072216K09333q2617l10183m46441O9665j26753m63837P1796l30618K19039
14119H881600l59037k85623J47023n11306O44233l09376l07832j38122M0721l62781
14109G439500Q967j14596m7073k69695l4572j11435q1942k564j60341j20033j70468
14098F335748J10183K53158l65871j80901p3555j47897r0280J81594N947j16817
$$ plain form
14167 20306684 19993306 19270228 18899604 18592142 18199966 17961855 17230249 17143330 16508883
14158 16508883 16453987 16125326 15831284 15599155 15313759 14872659 14624465 14363832 14114588
14149 14114588 14084099 13702083 13169120 13304235 13071831 12317554 12376538 12496637 12107891 11725872
14139 11725872 11587768 11416516 11220232 11411484 11072107 10754633 10490860 10133784 10137323 10072216
14129 10072216 10281549 10198932 9888749 9442308 9511973 9385220 8921383 8993179 8662561 8881600
14119 8881600 8522563 8236940 8383963 7872657 8516890 8207514 7899682 7761560 7802281 7439500
14109 7439500 7448467 7333871 7286798 7017103 6982531 6871096 6789154 6786590 6626249 6506216 6335748
14098 6335748 6445931 6699089 6333218 6152317 6078762 5930865 5840585 6022179 6028126 5911309
14088E911309l88922J29879l86081M30606l02986l5864l8070K83915p65774N33624
14078E371636j5989l34971r5461m7870k07919J01984q6576j23357Q4456J57607
14068D803540k25167J38310n12073R4293n4348j716l8986k0927k7592o9025j3839
14057D072470j12068q8869j90680K28063Q336k35031J28781J28991N7702k68417
14047C729278N8193k40512K77417m76471K49655m41038J99689n5593j22707M98505
14037C676416m02123O9162k95713K38904K44528k54256l43498M80640n35679J18271
14027B996652Q6296k55283M08540m83384J27764L6738m53710M28838j60832J77903
14017B909522k18243K2980K00065m10889K64229m4212j9009k68179L06087m50855
$$ plain form
14088 5911309 5522387 5652266 5266185 5696791 5393805 5357941 5319871 5603786 4838012 5371636
14078 5371636 5355647 5020676 4925215 4877345 4669426 4771410 4684834 4561477 4645933 4803540
14068 4803540 4578373 4716683 4204610 4298903 4244555 4242839 4203853 4182926 4155334 4086309 4072470
14057 4072470 3960402 3871533 3680853 3908916 3917252 3682221 3811002 3939993 3997695 3729278
14047 3729278 3787471 3546959 3824376 3347905 3597560 3156522 3356211 3300618 3177911 3676416
14037 3676416 3274293 3343455 3047742 3286646 3531174 3276918 2933420 3414060 2878381 2996652
14027 2996652 3082948 2827665 3236205 2752821 2880585 2917323 2463613 2892451 2731619 2909522
14017 2909522 2691279 2714259 2914324 2503435 2767664 2723452 2704443 2436264 2742351 2291496
14007B291496J90479N4171k426j7144j71805k4886N2929m7426j26074J26343M5493
13996B371150j11761j7648J3880Q0768l83659K63347j87722J98856k05619N8112
13986B079704J30508K03634j48839m0281m0424L90674J66606L77317M48070J99202
13976C766171N58441J196560J260382L453359N583469Q026712J573519o903259
13968A8515354o318456l397251k211898j109690q78845o65548j20734m81979n07304
13959B823649K42079j81372k67274K3588m7406j95461j87306J22507J52644J02955
13949B588603m38559J44710m24560L0909K7469J41655m31628L79840n5756n9329
13939A903354j04106L80671J40278m25050k61233K12491m23112K46869L9123j43524
$$ plain form
14007 2291496 2481975 2536146 2533720 2516576 2344771 2319885 2372814 2325388 2199314 2325657 2371150
13996 2371150 2259389 2241741 2255621 2336389 1952730 2216077 2028355 2227211 2021592 2079704
13986 2079704 2210212 2413846 2265007 2224726 2184302 2574976 2741582 3118899 3566969 3766171
13976 3766171 4324612 5521172 6781554 10234913 15818382 23845094 25418613 18515354
13968 18515354 12196898 8799647 6587749 5478059 4599214 3933666 3812932 3330953 2823649
13959 2823649 3065728 2884356 2617082 2640670 2593264 2397803 2210497 2333004 2485648 2588603
13949 2588603 2150044 2294754 1870194 1901103 1928572 2070227 1638599 2018439 1962683 1903354
13939 1903354 1799248 2179919 2320197 1895147 1633914 1846405 1423293 1670162 1709285 1565761
13929A565761j0304N05445m21446k51135M38002l90124N3359K09647m70824N35024
13919A763405m46084Q7054M14886m63132p2343J63972L57554j21075m19361R5925
13909A360801R195M1471J03544J16748j53558r2976J34335J08239j65686p4302
13899A387811k59071L64787k84068J60777m53836J52948J92817L2937P9215j09406
13889A264911O6922m6541k72199O2847K42033n6179L14144j40914k31708l59688
13879H43628M54996l15576L51763k49971k33779K31337l8505J60702j69794J29660
13869A164461k984k70994K60971j87648R0515L13264m05442K77984j33630k71786
13859H34711M33807l26009N52248m62853K94868l06147j5174J34543j99667j72251
$$ plain form
13929 1565761 1555457 2060902 1639456 1388321 1826323 1436199 1489558 1699205 1228381 1763405
13919 1763405 1317321 1404375 1819261 1356129 1283786 1447758 1805312 1684237 1264876 1360801
13909 1360801 1369996 1411467 1515011 1631759 1478201 1385225 1519560 1627799 1462113 1387811
13899 1387811 1128740 1493527 1209459 1370236 916400 1069348 1262165 1295102 1374317 1264911
13889 1264911 1331833 1285292 1013093 1075940 1317973 1261794 1575938 1435024 1203316 843628
13879 843628 1298624 983048 1334811 1084840 851061 1082398 1043893 1204595 1034801 1164461
13869 1164461 1161477 890483 1151454 963806 1054321 1367585 962143 1240127 1106497 834711
13859 834711 1268518 942509 1494757 1031904 1326772 1020625 1005451 1139994 940327 768076
13849G68076J89405K70159j76559l1928J79118j30032Q2745j6280o8660D87961
13838A165872k53101k34904K77356R5950l10900P7610J35070L2665m03515M47722
13828A029825k65561L69006m46298M17456D70634M05121l02887M45245j0278k20927
13818G86908J6073J29143R6036l41626K51122j19822m8561M45299m18763J49096
13808I44905j15925O5908J4724k26858j5393J38164q2158q3738J80470Q1589M4731
13797I46419L710l30426R9496j95227L44342k8791J38082m09771J61683j52723
13787E76794K03173B61621K01687K54595K73138P315o3015m07396K94189k3614
13777G98520j24857J3203J72553k9402o3599j42517K36462M6027m40597K46558
$$ plain form
13849 768076 957481 1227640 1051081 1019153 1198271 1068239 1150984 1134704 1066044 487961
13838 1165872 912771 677867 955223 1051173 740273 817883 952953 985618 582103 1029825
13828 1029825 764264 1133270 686972 1104428 470634 875755 572868 1018113 1007835 786908
13818 786908 802981 932124 1028160 686534 937656 817834 769273 1214572 795809 944905
13808 944905 828980 894888 909612 682754 667361 805525 723367 639629 820099 901688 946419
13797 946419 950129 619703 719199 523972 868314 839523 977605 567834 729517 576794
13787 576794 779967 261621 463308 717903 991041 998356 935341 527945 822134 798520
13777 798520 673663 686866 859419 830017 766418 623901 860363 906390 465793 712351
13767G12351C13825M20736J24543k0646k40423o0397K59098k92198N22221k75363
13757G51396j59222p3900J59402n4940k60525K02501K30716j05920k15890p7749
13747C95869K44311J30126k80737J10127P6242l07719K40768J41979L5974n0911
13737G36029J96003l21630K23472m15962L47860n6300B54724J32593R8879K60187
13727G46383A36278M12120K3476Q4843j18849j38969M19884l34907K84115A96653
13716F95334k81466N7207O5719k7947O8647j91420K96918m629j39516k4591q6302
13705D27954P3821K73101r2691R9234n4962k71778K52077k01744k04934L44020
13695F44098j04285K47391l49561J67840j47072L22546l52509K72939j30285J02411
$$ plain form
13767 712351 313825 734561 859104 838458 598035 537638 796736 504538 1026759 751396
13757 751396 592174 518274 677676 622736 362211 564712 795428 689508 473618 395869
13747 395869 640180 770306 489569 599696 675938 368219 608987 750966 786940 736029
13737 736029 932032 610402 833874 417912 765772 709472 254724 387317 486196 746383
13727 746383 136278 548398 571874 656717 537868 398899 818783 483876 767991 196653
13716 695334 413868 471075 536794 508847 577494 386074 682992 678363 538847 514256 427954
13705 427954 501775 774876 682185 781419 726457 454679 706756 505012 300078 644098
13695 644098 539813 787204 437643 605483 458411 780957 428448 701387 571102 673513
13685F73513C03468K53580J86999k85993k9537j16234Q0568J17070j77944K55867
13675E87844B38259K96321K7551A21842M08991j25847K51447l13984L70038B93147
13664D85565j19286M76874B31022M81525l16801J03528j09983A83689K20687J83795
13654E88171k26364J26812j72551K64696k35320I6806J66251L02709M2873A7386
13643G15670C06322M8300j57220L08717M7118p2999N2162J0043l1493k00993K27453
13632E37410j85368R5456P8580B54450J12043K91j1151J57226o4323j36077n5214
13621B57245L04758j60518r4731q308K7274J5413A02845J87824J09354J02376
13611E02399B11952L11497A98089L13850B34604K48922J04739B92263r923A34364
$$ plain form
13685 673513 303468 557048 744047 458054 428517 312283 392851 509921 331977 587844
13675 587844 238259 534580 562131 121842 530833 404986 656433 342449 712487 293147
13664 485565 366279 843153 231022 712547 395746 499274 389291 183689 404376 588171
13654 588171 361807 488619 316068 580764 345444 96806 263057 565766 608639 17386
13643 715670 306322 354622 197402 506119 553237 480238 532400 542443 510950 309957 537410
13632 537410 352042 447498 526078 254450 366493 366784 355633 512859 448536 312459 257245
13621 257245 562003 401485 306754 298446 325720 341133 102845 290669 400023 502399
13611 502399 211952 523449 198089 511939 234604 483526 588265 292263 282340 134364
13600D73730B18484K01938J49554A45952J52441P5182K66018k03979j88549J31536
13590C78601J5153b34258I389J73254J91041A69762J11207j3535J29918j82530
13580B14822r5848K56286j08388K48978o2814j24925R7963A22587J95757o5130
13570B53214m4287J30260m9705K2112J37690F2896K10560A24788L7682P9842M5278
13559B87590P5181J29964j247O392l5859p6968r3435Q9039j72005p7265M81564
13548F12951k38044A15635J05868K07393Q7668A59521L4167K96907r978n1856
13538D28761B4539R4387N60953k63030R3881B29313a57555A91549b92540C60845
13527C56932J56357j91491P2151M5119l1619A27446K31383j15891j09645J10479
$$ plain form
13600 473730 218484 420422 569976 145952 298393 373575 639593 435614 247065 378601
13590 378601 393754 -234258 9389 182643 373684 169762 280969 267434 397352 214822
13580 214822 118974 375260 266872 515850 453036 328111 426074 122587 318344 253214
13570 253214 208927 339187 289482 311594 449284 62896 273456 124788 162470 242312 287590
13559 287590 362771 492735 491488 497880 462021 385053 291618 380657 208652 131387 612951
13548 612951 374907 115635 221503 428896 516564 159521 193688 490595 480617 428761
13538 428761 24539 118926 679879 416849 510730 229313 -157555 191549 -292540 360845
13527 356932 513289 321798 393949 439068 407449 127446 358829 242938 133293 243772
13517B43772Q9242j54250M36618k24182A4955L21851r9278j7612J19771A47703
13506A53233k4410J56388M56035C31943j24476J8324k7982Q2419P0846A33762
13495B89471E0926L57668L3662F7463M37090H3824M13800A30861L17831q9265
13485C59427A03606J25752j2344F7373i2194B68984J21059G2372J15436a97270
13474H0400L64963f1812D76834A23277E4889L30165b6503A53528M13986B52918
13463B28658j9372K32619j05129K61350B19520B9677Q6382D5740L04628m5217
13453C05151n0095a9263B37505J08883L945p8818G9648K94134F9938O6468D5311
13441A93179J6310J50381C6653K12400C9053K18674R5534K5089n6566j24773k0141
$$ plain form
13517 243772 333014 178764 615382 391200 14955 336806 237528 219916 339687 147703
13506 153233 128823 285211 741246 331943 207467 225791 197809 280228 351074 133762
13495 289471 50926 408594 442256 67463 504553 83824 497624 130861 448692 359427
13485 359427 103606 229358 217014 67373 -92194 268984 390043 72372 187808 -197270
13474 80400 445363 -61812 476834 123277 54889 385054 -26503 153528 567514 252918
13463 228658 209286 441905 336776 598126 219520 29677 116059 45740 350368 305151
13453 305151 255056 -19263 237505 346388 350333 271515 79648 373782 69938 136406 45311
13441 193179 209489 359870 36653 249053 39053 257727 353261 378350 321784 197011 176870
13430A76870J11809K97518k47557b2040D62174O1454m0483A53182a18602C08865
13419C05515a45317A02838J36648N3265E4170K19625M3508J61105h8635K7300
13409f1335D25780C1166A5177L69579r1438I1660K11935e3113B95136j5121R6686
13398C76701j26538j00201k0400a477j7501j74037D09545j88207A02028J90922
13388B92950c6126C89182A88532J2984P1154k2272K71959E5430f5654B27427R2618
13377C20045B8636M12358m6646A68014R7599E1960M7718J89599J16731F2403J34307
13366A96710Q8855M7511A42150J62753p067Q603q3705B6771L27431i927A60086
13354A85218J84006j14371N4531b9980B30939J90127J5312a07763B51036P8706
$$ plain form
13430 176870 288679 586197 338640 -22040 462174 523628 483145 153182 -118602 308865
13419 305515 -145317 102838 239486 292751 54170 273795 317303 478408 -88635 -61335
13409 -61335 425780 31166 15177 384756 293318 91660 303595 -53113 295136 280015 376701
13398 376701 250163 149962 129562 -1477 -18978 -193015 409545 221338 102028 292950
13388 292950 -36126 389182 188532 201516 272670 250398 522357 55430 -65654 227427 320045
13377 320045 28636 440994 394348 168014 265613 51960 99678 289277 406008 62403 196710
13366 196710 285565 333076 142150 304903 297836 306439 222734 26771 354202 -9927 160086
13354 185218 369224 254853 309384 -29980 230939 421066 436378 -107763 251036 329742
13344C29742j6717a96729C79514l4010A19591L78128A1153J43343e2515m7326
13334i9841A42887k0496M18086q7904j41333J6431J81684a01157C80981C1949
13323E4181A3362N30896j21505J26603D7328c362C7051b25067D82411B17567f3843
13311C92527m1345f2395A43906J5179j2298N0460D9653i713C33275j54833J69165
13300C47607J0847a36776A29853b62309A97471G6467l5600L13117a04683B68292
13289C01724e822C17519J6795A54803L6940a49062A65431o0093g112A60769P638
13278A68407D9114e6242A05626E2722J14899Q5801J41881A14603c7468G3022J53055
13267B26077q568K75203B21824N4498e0180A5095J11372R150j4841K18151A02609
$$ plain form
13344 329742 313025 -196729 379514 345504 119591 497719 11153 154496 -52515 -99841
13334 -99841 142887 122391 540477 452573 311240 327671 509355 -101157 380981 31949
13323 54181 13362 544258 422753 549356 47328 -3362 37051 -225067 482411 217567 -63843
13311 392527 351182 -62395 143906 159085 146787 197247 49653 -9713 333275 178442 347607
13300 347607 358454 -136776 129853 -262309 197471 76467 40867 353984 -104683 268292
13289 301724 -5822 317519 334314 154803 191743 -149062 165431 105338 -7112 160769 168407
13278 168407 49114 -56242 105626 52722 167621 253422 395303 114603 -37468 73022 226077
13267 226077 217509 492712 221824 276322 -50180 15095 126467 135617 120776 338927 102609
13255c636C47635p3213L0503p0705F069K77098j32410K0875J2751a56092A2594
13243B52302F1822J62726p3024N678J55160J38029j98389F8686g5818B96144J9625
13232C15769n9497l4040H4545a54181I5383Q3370J88465j38876E212L34114B5240
13220E28405A57328J22928A23603b33937B2176b06627B19231d1347A36228Q650
13210A44878D4437a84257M1768A71717N0795a24193A53284c4470G5980J78707
13200B54687L9143c2755A4797b84000I8833j8272P527K45133A52566I16K17213
13189B18129J03272b41299d788k652B26305A00098L20223A65647E5401B3514K25942
13178B49456K16977j90860D652P4947J67486a05333G2002P5465M5515E3728L51118
$$ plain form
13255 -3636 347635 274422 304925 234220 6069 283167 150757 171632 184383 -156092 12594
13243 252302 61822 224548 151524 157202 312362 450391 252002 68686 -75818 296144 315769
13232 315769 256272 222232 84545 -154181 95383 178753 367218 228342 5212 339326 25240
13220 528405 157328 280256 123603 -233937 22176 -206627 219231 -41347 136228 144878
13210 144878 44437 -184257 -142489 171717 222512 -124193 153284 -34470 75980 254687
13200 254687 293830 -32755 14797 -284000 98833 80561 88088 333221 152566 916 218129
13189 218129 321401 -241299 -4788 -7440 226305 100098 420321 165647 55401 23514 249456
13178 249456 466433 275573 4652 79599 247085 -105333 72002 147467 192982 53728 404846
13167D04846F85R5775J48377a40337A16831i1192K5091A75032j8754b1381k09610
13156b30991E87496H1206L47940H3812b7885D98151A00454D8626J24576M840a65037
13144a74002E1394A6207b04652c8239G6696L14320A17427Q67K1738F7276J00244
13133A67520A3555a7171B27232b57024C80153a63649H0991N3651B8342J73838
13123B02180k8159J18370b42327B51912H2004R871l3745O2731J2118D2224i0563
13111a9141A09601l7516L69254b75197f7225A61111c65485E8325J31686m0928
13101A49083B9090K37162b08829f3725E303b08357k4108C15630G9537J12025b87929
13089C83143J01207a13146F42360B7026j54K0197a03104A16641n2141k9162K20066
$$ plain form
13167 404846 685 96460 244837 -140337 116831 -91192 -66101 175032 156278 -21381 -230991
13156 -230991 587496 81206 429146 83812 -27885 498151 100454 48626 173202 178042 -165037
13144 -174002 51394 16207 -204652 -38239 76696 391016 117427 118294 140032 67276 167520
13133 167520 13555 -17171 227232 -257024 380153 -163649 80991 134642 28342 202180
13123 202180 174021 292391 -242327 251912 82004 91875 58130 120861 132979 42224 -90563
13111 -19141 109601 72085 441339 -275197 -67225 161111 -365485 58325 190011 149083
13101 149083 29090 266252 -208829 -63725 5303 -208357 -232465 315630 79537 191562 -287929
13089 383143 484350 -113146 642360 27026 26872 47069 -103104 116641 64500 35338 255404
13078B55404I6224Q5659n7635D997N0406j3913K01482a49913d9695k3860K6204
13067d7351A44257j7646O7192c51087a03145E2342L75287a4955D08308H4349j9959
13056F4390J99176H3475J66022A07617K6050K93982P2812D7045J5346J21207a6784
13044A10789K56294a5804B57000e4594C38816d0814C33997r4038I5645d2044B46839
13032A40222b21758Q1219A4581N1088h6886E0137J10819J35771E2112b64209a6697
13020b6605j59067d9025A23785b1646B33795H7523m1477a77270a0465E59389k28728
13009C30661A46933F7592J81010p2208F1137c12475B90722F010N9330g9127B77555
12997C3826K28910r3802e1990l4542l4539F8053a37427A70327a86048E7425R4038
$$ plain form
13078 255404 96224 181883 124248 4997 55403 41490 242972 -149913 -49695 -73555 -47351
13067 -47351 144257 126611 193803 -351087 -103145 52342 427629 -14955 408308 84349 64390
13056 64390 263566 83475 249497 107617 133667 427649 500461 47045 62391 183598 -16784
13044 110789 367083 -15804 257000 -54594 338816 -40814 333997 239959 95645 -42044 246839
13032 140222 -221758 -140539 14581 65669 -86886 50137 160956 296727 52112 -264209 -16697
13020 -26605 -185672 -49025 123785 -21646 233795 87523 46046 -177270 -10465 559389 330661
13009 330661 146933 67592 248602 176394 61137 -312475 290722 6010 65340 -79127 277555
12997 33826 262736 168934 -51990 -86532 -121071 68053 -137427 170327 -186048 57425 151463
12986A51463b16558A46601J2057p5967K76150a16264C05021H4874a75685j78851
12976c54536c0966p4328A35240Q4713a28616C05407f7257D3180f2537B1976K7549
12965D9525h4653C57488H2464K1429K7404a08710A20630n2990A7579i0490B11556
12953A4911b5303k85826A25717E5044K04864a16030L7832M508o1114K5899H6673
12941c8682B33125J60915a07415B68763a37013A73897A1045J27759F3818J18982
12931A82800o3422a78639g060A4399K72684E3686B5799K43686i0832q4054A24094
12919A15409L3625J40342J35858c4539j79295A11935a41626k55637f9071G2086
12908a27612F013c9907o2473M9667a1625B43992F7361b02228H5469a53653C8776
$$ plain form
12986 151463 -216558 146601 158658 82691 358841 -116264 305021 84874 -175685 -354536
12976 -354536 -30966 -105294 135240 219953 -128616 305407 -67257 43180 -62537 21976 49525
12965 49525 -84653 357488 82464 103893 131297 -108710 120630 67640 17579 -90490 211556
12953 14911 -25303 -311129 125717 55044 259908 -116030 -78198 -73690 -134804 -108905 86673
12941 -38682 233125 394040 -107415 268763 -137013 173897 11045 138804 63818 182800
12931 182800 119378 -178639 -7060 14399 287083 53686 25799 269485 -90832 -174886 124094
12919 115409 149034 289376 425234 -34539 -213834 111935 -141626 -397263 -69071 72086
12908 -127612 6013 -39907 -102380 -52713 -11625 243992 67361 -202228 85469 -153653 38776
12896b0165A46104N5801q039O0816A04022J14129e0201b854k1740m04978H3971
12884C91003a71034g2186B01836K5905b36817i8169F4231h8038I3869b54020J26901
12873a27119D6376R9684K34889G7236A3786J26473E0968K9442a98453A24700m8580
12862G6120O3814A0254a46102b819B2123g2253C93182a2594j20866K6799E41885
12850C66443a84477e4133k48394h5592J7954B4068L33549b11717B56596o7462
12840A89134E6487a64715k2547C28638o9547c3475G1466R6109P2206n6392d819
12828e2910C76967j30630C5655d2811F813J87614b13710B87024A14255J6486J30944
12817B61685E0933A2948J4668b91797b4592C2062e5389K6387o3444C25032d5868
$$ plain form
12896 -20165 146104 201905 193866 254682 104022 218151 -50201 -2854 -24594 -429572 83971
12884 391003 -171034 -72186 201836 227741 -236817 -98169 64231 -88038 93869 -254020 -127119
12873 -127119 46376 146060 380949 77236 13786 140259 50968 80410 -198453 124700 76120
12862 76120 139934 10254 -146102 -2819 22123 -72253 393182 -12594 -133460 -106661 541885
12850 366443 -184477 -54133 -302527 -85592 -67638 24068 357617 -211717 256596 189134
12840 189134 56487 -164715 -187262 328638 259091 -33475 71466 167575 239781 183389 -4819
12828 -52910 376967 246337 35655 -42811 6813 194427 -213710 287024 114255 130741 261685
12817 261685 50933 12948 27616 -291797 -24592 32062 -55389 -29002 -92446 325032 -45868
12805B57930A02953M73189A86609f0189j5714I9048g9709a2393A04809D6007R2883
12794A38890J58861j42703b68325A69830J51936I628c01911B22812j8545o7729
12784A36538A6132i3995k12598A62502a1384D6426K18689b34096j6840H8556c6183
12772F9746K53692a34905L4061j6779b2166j41074b8056B6126b527k4829k05710
12761b33066O6121A19842H372i8272E3930J16133N5342a06889B51650c89981A10125
12749c2287J2645A37265B1388J03959f4901r984e129A57659B8771L50264F2474
12737b19668a03797H9291i7544p6043F5031Q0633A6423R57O1040O6039L5688a11472
12724a42771C014a11842j01904C40122D3703A2617K37331E9308K7018J94513c4491
$$ plain form
12805 257930 102953 576142 186609 -60189 -75903 99048 -79709 -12393 104809 46007 138890
12794 138890 297751 155048 -268325 169830 321766 9628 -301911 222812 204267 136538
12784 136538 16132 -93995 -306593 162502 -11384 46426 265115 -234096 -250936 88556 -36183
12772 69746 323438 -134905 -100844 -117623 -22166 -163240 -28056 26126 -2527 -27356 -233066
12761 -233066 -166945 119842 8372 -98272 53930 170063 225405 -106889 251650 -389981 110125
12749 -32287 -19642 137265 21388 125347 -64901 -74885 -5129 157659 28771 379035 62474
12737 -219668 -103797 89291 -97544 -173587 65031 145664 16423 17380 78420 144459 180147 -111472
12724 -142771 3014 -111842 -213746 340122 43703 12617 249948 59308 86326 280839 -34491
12712B58526o6225L6323h8565o3806M0028E1296P937b9443k99474B25466b46470
12700a82606D24529a44084F4584a29598l13059i4881A61942b00733I2436a67728
12689B91146r1066K20115D5755b35631H1847a43480g1627A93243a06796B74349
12678G4691J8399e3195A38532g4333o113A36896d7900F1218k0822J09675m191
12667A45880K8509l0862j0133e6700n0216K0339A96914l4814J46542b03702m0059
12656b43761A3222b64542B10210c63552G9063O3506m968d3189r392B3144J06416
12645A29560e9259D7031M0414b5152n9668A50738J95090j64295J98784A36951
12634G7957a20696j2244E2760f3983B59200A4712J95186M1451J13014A20515a0554
$$ plain form
12712 258526 192301 228624 -88565 -152371 -112343 51296 59233 -29443 -328917 225466 -246470
12700 -182606 424529 -144084 64584 -129598 -442657 -94881 161942 -200733 92436 -167728
12689 291146 200080 420195 45755 -235631 81847 -143480 -71627 193243 -106796 274349
12678 74691 93090 -53195 138532 -74333 -80446 136896 -47900 61218 40396 150071 145880
12667 145880 174389 143527 133394 -56700 -106916 -86577 196914 162100 308642 -203702 -243761
12656 -243761 13222 -264542 210210 -363552 79063 142569 137601 -43189 -52581 23144 129560
12645 129560 -59259 47031 87445 -25152 -84820 150738 345828 181533 380317 136951
12634 77957 -120696 -132940 52760 -63983 259200 14712 209898 251349 364363 120515 -10554
12622d10569a5050B52604c84372A54300K81270A740P738N0007N5986O9989k2769
12611A62691K126j1632L8085P5628n1540I7931K27786B6326L34391A14045L21607
12600D35652d7583o5365A8973a01138q0579A66732n8726c4549C34983H7517j2782
12589G4735k4133Q0243b58798f589j53144D18091A22974b5221E31329b57654A44132
12577a81060B37989b81830A97180E8632a86875A94783i263m674p9236A36621J82961
12566C19582I5231a52480q203B5447a12375C4691i7440K9831o2071A91736f2548
12554C72478h3784A90452c1824D65289b11027e9225k8889L7955D3126a47245B70372
12542f89E7646g3927J4539p5188a5090n3669B45580a61167n2892b0116r4980A29951
$$ plain form
12622 -410569 -15050 252604 -384372 154300 435570 1740 9478 59485 115471 185460 162691
12611 162691 164817 153185 191270 266898 215358 97931 325717 26326 360717 114045 435652
12600 435652 -47583 -112948 18973 -101138 -181717 166732 108006 -34549 334983 87517 74735
12589 74735 50602 130845 -258798 -6589 -159733 418091 122974 -25221 531329 -257654 144132
12577 -181060 237989 -281830 197180 58632 -186875 194783 -9263 -13937 -93173 136621 319582
12566 319582 95231 -152480 -160683 25447 -112375 34691 -97440 -67609 -129680 191736 -62548
12554 372478 -83784 190452 -31824 465289 -211027 -59225 -88114 -50159 43126 -147245 270372
12542 -689 57646 -73927 -59388 -134576 -15090 -68759 245580 -161167 -214059 -20116 -115096 129951
12529b71008E0936K17124j11993G3645Q956a09861E9929c10789D782g2192B56779
12517A32323j7970P7108f1544B5276L30057j43821b1010B23003J54672G2823J08763
12506A81586O6028a69702E2280j2168D267g3B1038J12684J48728d8889b0084G9996
12493C4204b75579g2614b5012j39543b7785B43343a73195b9948C33921g2788L2876
12482c9912o7816A57117k017b59214A74711g495m79k06891A27139m4847l2669
12471D9623K47333a69809N1651k3086A22349d28226g2331j73367H1422c6789B03693
12459A94899d4547k49938R7732j7203L6694E4217e9432D0126J20133E9524Q8466
12448A47990L19503A61290g123k6806A91542m1974a84263D847d47452a20757e63
$$ plain form
12529 -271008 50936 268060 156067 73645 82601 -109861 59929 -310789 4782 -72192 256779
12517 132323 114353 191461 -61544 25276 355333 211512 -21010 223003 377675 72823 181586
12506 181586 247614 -169702 52280 40112 4267 -73 21038 133722 282450 -48889 -20084 79996
12493 34204 -275579 -72614 -25012 -164555 -27785 243343 -173195 -29948 333921 -72788 -39912
12482 -39912 -107728 157117 155100 -259214 174711 -7495 -7974 -214865 127139 82292 49623
12471 49623 296956 -169809 -118158 -141244 122349 -428226 -72331 -245698 81422 -36789 203693
12459 194899 -44547 -294485 -196753 -213956 -177262 54217 -59432 40126 160259 59524 147990
12448 147990 467493 161290 -7123 -33929 191542 149568 -184263 4847 -447452 -120757 -563
12436A29365N7059b7045l75254c0849j78752O3203M9490m28503B24372a30857
12425A24136b01264O2655k19488h5841c9148E8091J89207d7873j14195N5773A49600
12413G9869f5889B9777J18025a23250J1995j68282A709L0670D940a65291K0157
12402a45134B8521J16897C446a49062a0591m56984A0478L5405i1682l5341j1778
12391a38801B5548e7363B50287e5481n5460j0308C0772K72024a44217B98880f3219
12379a74760P2477k14567A10744a15721A69877q4873B4306b65003e1769l2619
12369h4388F1723a0820E6116a07941D4350b34285m4495F7758b74695d2997n4543
12358i7540e212m18312J77663C8089R1014i1701j39005A05582c68936b6830A68825
$$ plain form
12436 129365 186424 -27045 -402299 -30849 -209601 -146398 -96908 -525411 224372 -130857
12425 124136 -201264 -138609 -358097 -85841 -39148 58091 247298 -47873 -162068 -106295 149600
12413 79869 -65889 29777 147802 -123250 -111255 -279537 1709 32379 4940 -165291 -145134
12402 -145134 28521 145418 3446 -149062 -10591 -467575 10478 45883 -91682 -127023 -138801
12391 -138801 25548 -57363 250287 -55481 -110941 -121249 30772 302796 -144217 298880 -63219
12379 -174760 -102283 -316850 110744 -115721 169877 85004 24306 -265003 -51769 -84388
12369 -84388 61723 -10820 56116 -107941 44350 -234285 -278780 67758 -274695 -42997 -97540
12358 -97540 -5212 -423524 -245861 38089 129103 -91701 -230706 105582 -368936 -26830 168825
12346g4237m2650B913O5764P4819j5983b84519b3576A56934b15479A21095a46704
12334f7952A7417b2405p4381I9992Q2565B4424J73702q8052J19253B5388d37424
12322b4660M808k29456b200B72086A6747a53545b1619K388b244k63317D33286
12310A79753b44892f932A62848F0662a6931o2249C11312j04763l7488o5855N7047
12299A60253K20227D9840j5648R0727D876N0192d41052A750i8257B65765j920
12288B63845b04839C64171b4220j20572D9944a77228B53405b3593o7596r8519
12278a89708e1384m6898p0913B63841r6033b2867H1205d4323A45292l0425h6779
12266a92928E4554A2843M1968L3247a67201b9700A32137K45587f9190A3674Q7591
$$ plain form
12346 -74237 -116887 2913 68677 143496 127513 -284519 -23576 156934 -215479 121095 -146704
12334 -67952 17417 -22405 -96786 99992 182557 24424 198126 110074 229327 25388 -437424
12322 -24660 -19852 -249308 -2200 272086 16747 -153545 -21619 -19231 -2244 -265561 433286
12310 179753 -244892 -6932 162848 60662 -16931 -79180 311312 206549 169061 103206 160253
12299 160253 380480 49840 34192 124919 4876 55068 -441052 1750 -98257 265765 263845
12288 263845 -204839 364171 -24220 -144792 49944 -177228 253405 -23593 -91189 -189708
12278 -189708 -51384 -98282 -169195 263841 167808 -22867 81205 -44323 145292 114867 -86779
12266 -192928 54554 12843 54811 88058 -167201 -29700 132137 377724 -69190 13674 101265
12255A01265L1312a564r0190A22983e909j72590D5579J2624J59164a67680j54831
12244c22511A48921b951I9617O992J95061o4125P5323r6307A04624b18435b8173
12232c998k23406H5954f624B16333O5211A5451d43431b1216A16379M8198E9429
12220B60493G2945L23259A14528J0486e4095E2137J51954g3343q9732B93941r3350
12209B00591N7794K64907A25353J17310P7681P6114r6864L838j45265n0046J27246
12198B35367f7208k62923B62236j03494K02289j51130a57444A54570L95411B16018
12187B10715M67G5792K25870A34024K5455J00646A5180L7479M2661k0635R1172
12176A65857O5799J71722g3649A71554K984k5446h549C26254p7858b6702B78497
$$ plain form
12255 101265 132577 -1564 -91754 122983 -5909 -178499 45579 58203 217367 -167680 -322511
12244 -322511 148921 -2951 99617 106609 301670 237545 312868 216561 104624 -218435 -28173
12232 -3998 -227404 85954 -6624 216333 281544 15451 -443431 -21216 116379 164577 59429
12220 260493 72945 396204 114528 125014 -54095 52137 204091 -73343 -163075 293941 200591
12209 200591 258385 523292 125353 242663 320344 396458 299594 303432 158167 108121 235367
12198 235367 -67208 -330131 262236 158742 361031 209901 -157444 154570 549981 216018
12187 210715 211182 75792 301662 134024 159479 260125 15180 52659 95320 74685 165857
12176 165857 231656 403378 -73649 171554 174538 149092 -8549 326254 248396 -26702 278497
12164D7312L52104e9287D6188a2361B64048l5032o8584a08771C23142r2465a41594
12152A66891g2828B49701O856o8189B7966M1202R3955g0679C7529Q6140D7457
12140A35668l9135l4430a28696D6093M5008a17387A83257p6918a63146e9353K5693
12129c3660B38062m4173a72335c6848A88092c71647L5196K5194B08901J47928
12119C56829a30057k4787b2797n7556l05597a17611A63833A5582Q4859b64239
12108c11896I5870P0371K15895A39828d17175A10918a62335B81380I659d60376
12097E6709f9397A8574e25274a18163j4611L0519c1823A49858h1502B35651D4342
12085A43332R3566b00442a5092A08057B0728L0293B813K23623p2695g9026o6512
$$ plain form
12164 47312 399416 -59287 46188 -12361 264048 229016 160432 -108771 323142 230677 -141594
12152 166891 -72828 249701 256557 188368 27966 69168 163123 -70679 37529 123669 47457
12140 135668 96533 62103 -128696 46093 91101 -117387 183257 106339 -163146 -59353 -33660
12129 -33660 238062 193889 -172335 -36848 188092 -371647 -336451 -311257 208901 356829
12119 356829 -130057 -154844 -22797 -80353 -385950 -117611 163833 15582 100441 -264239
12108 -311896 95870 166241 382136 139828 -417175 110918 -162335 281380 9659 -460376
12097 56709 -69397 18574 -525274 -118163 -132774 -102255 -31823 149858 -81502 235651 44342
12085 143332 236898 -200442 -15092 108057 20728 51021 2813 226436 153741 -79026 -145538
12074a45538b8512I4299d79661a35615A28680b29965A72428b40265A86432m3214
12064A43218f4188I667P4870c7358A38759J25847c9150B96046b3935A69827b16609
12052A57230b77120k24704a2501j15236F5330j804a4869C31973j21016L3830K63599
12041E08386A62782L27453A38113J00398a45272j6677B69370b16134h4060C54128
12030c599j40939A13127a41282M4855C6444a81868n8098A91391n9601m3453a2545
12018c44356g6568l2202n6238O0605E4766C182b42332A17280i3909K3014a5486
12006a19237H0542R5327N5488D0062a61337L2253k307j22851A72799D8873R9141
11995A48014p2889b34550H9448M4711b47184d1681a1651A1192L3494a35800A20307
$$ plain form
12074 -145538 -28512 94299 -479661 -135615 128680 -229965 172428 -240265 186432 143218
12064 143218 -64188 9667 84537 -37358 138759 264606 -39150 296046 -23935 169827 -216609
12052 157230 -277120 -501824 -12501 -127737 65330 63526 -14869 331973 210957 244787 508386
12041 508386 162782 490235 138113 238511 -145272 -161949 269370 -216134 -84060 354128
12030 -3599 -144538 113127 -141282 -96427 36444 -181868 -239966 191391 131790 88337 -12545
12018 -344356 -76568 -108770 -165008 -104403 54766 3182 -242332 117280 -93909 -70895 -15486
12006 -119237 80542 175869 231357 40062 -161337 -129084 -131391 -254242 172799 48873 148014
11995 148014 75125 -234550 89448 134159 -247184 -41681 -11651 11192 44686 -135800 120307
11983a14917n0268f1957F5200M4180f7184A86049J08647d5022j55941c837B00421
11971A49256A4515d6331A43187D8593B2596a67621d0929C69651j78700a24581
11960g4132j76338C33184e0685k28184J35701B2331d9866F4487F786J28821b68957
11948a13455H0656e2338j58318R3400k9804M0984B04221r3769A3305e8977B1100
11936d3618D1777K6510a33241A60656M4353a0252n5772B08729p0146e7933j10679
11925a68612o3916R3599F9173J31798r7646D0062h3822o8698b3573n9084q0654
11914a63311B9191h1920A24009a68326j24831A52331d02562H2920c08374h3689
11903B94360a85600b5185A96819h6322A6709c09768a37980f6646j26430g714B15392
$$ plain form
11983 -114917 -165185 -61957 65200 109380 -67184 186049 294696 -45022 -200963 -3837 200421
11971 149256 14515 -46331 143187 48593 22596 -167621 -40929 369651 190951 -124581
11960 -74132 -250470 333184 -50685 -278869 -143168 22331 -49866 64487 6786 135607 -268957
11948 -113455 80656 -52338 -210656 -117256 -147060 -106076 204221 110452 13305 -58977 21100
11936 -43618 41777 68287 -133241 160656 205009 -10252 -66024 208729 138583 -57933 -168612
11925 -168612 -232528 -138929 69173 200971 103325 40062 -83822 -152520 -23573 -82657 -163311
11914 -163311 29191 -81920 124009 -168326 -293157 152331 -402562 82920 -308374 -83689
11903 294360 -185600 -25185 196819 -86322 16709 -309768 -137980 -66646 -193076 -7714 215392
11891a28326m5153P4361l9882A52461a05463A45492j8386D707a74326L4640I9388
11879A15703b42550e3751a4252B5707J37079C7953a31800j4505j29558C0692b39176
11867e2923D3761a08574o0196A13110l3668C2558L9938d3945a4938B62113h7742
11855e6599o0434j2111q3314a2392j92377I4194a79941E694i8570Q232j5923A12007
11842A9411K3457j485P3773J22765J03918a30330f4346B2260K40139c85495d8928
11830B59422c4897A15362I765a5487n512n8868i783D52298b8572C01277A33402
11818A92464B6444J62752c3166o8990B76209H9087J88g927E538J7828b7394j1204
11806c8598j71218F3933b98038A25265a80741N9899A14787c0212p392q5736c4155
$$ plain form
11891 -128326 -173479 -99118 -139000 152461 -105463 145492 127106 4707 -174326 -139686 99388
11879 115703 -242550 -53751 -14252 25707 162786 37953 -131800 -146305 -275863 30692 -239176
11867 -52923 43761 -108574 -168770 113110 79442 32558 72496 -43945 -14938 262113 -87742
11855 -56599 -117033 -129144 -212458 -12392 -204769 94194 -179941 5694 -98570 -90338 -106261 112007
11842 19411 42868 41383 115156 237921 341839 -130330 -64346 22260 262399 -385495 -48928
11830 259422 -34897 115362 9765 -15487 -20999 -79867 -9783 452298 -28572 301277 133402
11818 192464 26444 189196 -33166 -102156 276209 89087 89275 -7927 5538 23366 -27394 -38598
11806 -38598 -209816 63933 -298038 125265 -180741 -120842 114787 -30212 -37604 -123340 -34155
11794b05415L9592C12406h7467B19282a21907q0689Q8360D03047A73847B4270
11783a65703A28067Q6356c32424d417C0268L3471b19539N8751G6904h6655o0713
11772a47368A90661m7307A2103c9203k79258a01864o7363c673k85864a23286o4131
11761a87417A29996a07198D6109J6446a74508n0692l847H6105b02337e215j20951
11750a26166b6042k22287C98819a43517A01688K642O084a0588D5519d1647A82646
11738c33593g7772A09873a47513o9804K2380g5161B2170J27143a45596l58118
11728e03714h466l3428j4370l3694J7916C62496f1816l3857D6558a68840C1281
11716D0137M0518R5430a91483G1882h9770d463j51463c6568n2460j2867j8167
$$ plain form
11794 -205415 -165823 312406 -87467 219282 -121907 -202596 -114236 403047 173847 24270
11783 -165703 128067 214423 -332424 -4417 30268 63739 -219539 -160788 76904 -86655 -147368
11772 -147368 190661 143354 12103 -39203 -318461 -101864 -169227 -3673 -289537 -123286 -187417
11761 -187417 129996 -107198 46109 62555 -174508 -225200 -229047 86105 -202337 -5215 -126166
11750 -126166 -26042 -248329 398819 -143517 101688 104330 110414 -10588 45519 -41647 182646
11738 -333593 -77772 109873 -147513 -217317 -194937 -75161 22170 149313 -145596 -503714
11728 -503714 -8466 -41894 -56264 -89958 -72042 362496 -61816 -95673 46558 -168840 31281
11716 40137 80655 176085 -191483 71882 -89770 -4463 -155926 -36568 -89028 -101895 -120062
11705a20062N0315b2692A9638O5989h0420A42200E6804J75661a90520d1110m2733
11694h3843p9530C9708a03156L0626k10819D9524O4111b11329E3030B283K1939
11683B4222b72637A26716J0742b5974k379C17743d87763A06747a54859N0029k11087
11672c15917J18874B38856a74707F6343i1055G3050A4237K0360g4927n430K3565
11661e6792A01093K12084j53029n0950J73945j32607l2186b3849k17314J6062
11651b25101C83764A70700f1162A58629c9046H7311L20465p2119G3080M3981B8089
11639a3637A5222J27646a39749K2786B34095b38917c2434p6003j8950j41558A72498
11627H2174J27347a42310c9455J6271j68115C24430i2051i446n04021K49897j9799
$$ plain form
11705 -120062 -69747 -22692 19638 85627 -80420 142200 56804 232465 -190520 -41110 -83843
11694 -83843 -163373 39708 -103156 -72530 -283349 49524 113635 -211329 53030 2283 24222
11683 24222 -272637 126716 137458 -25974 -28353 317743 -487763 106747 -154859 -104830 -315917
11672 -315917 -197043 238856 -174707 66343 -91055 73050 14237 34597 -74927 -80357 -56792
11661 -56792 101093 313177 160148 109198 283143 150536 118350 -23849 -241163 -225101
11651 -225101 383764 170700 -61162 158629 -39046 87311 407776 335657 73080 117061 28089
11639 -13637 15222 142868 -139749 -116963 234095 -238917 -32434 -108437 -127387 -268945 172498
11627 82174 209521 -142310 -39455 -23184 -191299 324430 -92051 -9446 -513467 -263570 -283369
11616b83369A99873q9511J71979b53642C30505h6825F4240a35880H0092f3878
11605c49950A63386M5608g4811F4612C1156A3868N2837M798a43732B09190e57505
11593e22753B70999F3722J43327a2917k46509C41046a3214j59263A62988a51658
11582A36400a77905k6658R351L820e0224q685B16979a97978O5138A92481G038
11570C5345e4382D1531d9036j32A20263g9051P693l9502C71341b9331j10789p5570
11558b15690B05789r2522b8725k26462I2814N6877J89661g9810B33247F4390g8082
11546d4270j50064a3564A16870k3621i5874k2143b2172A38109N1060D1607J19444
11535A61051J76152a27256C38465f1458I1211R7660f5436B32846H5944e0283C28722
$$ plain form
11616 -283369 199873 110362 282341 -253642 330505 -86825 64240 -135880 80092 -63878
11605 -349950 163386 208994 -74811 64612 31156 13868 66705 71503 -143732 209190 -557505
11593 -522753 270999 63722 207049 -12917 -259426 341046 -13214 -172477 162988 -151658
11582 136400 -177905 -204563 -195212 -191392 -50224 -58909 216979 -197978 -132840 192481 7038
11570 35345 -54382 41531 -49036 -49168 120263 -79051 -71358 -110860 371341 -29331 -140120 -215690
11558 -215690 205789 113267 -28725 -255187 92814 149691 339352 -79810 233247 64390 -78082
11546 -44270 -194334 -13564 116870 93249 -95874 -118017 -22172 138109 189169 41607 161051
11535 161051 337203 -127256 338465 -61458 91211 188871 -65436 232846 85944 -50283 328722
11523A21192b09971F9421b64382a04609A16395b53270B71321E2351J7404R2683
11513A62438k7206B1826f1898Q49C9947P8306c6634n8332A84892e6019B56897
11501e0613b749A29091L0723e0224B08992q1960M4116B1565f7516A83227b91370
11489B14195C8853c53499B44883b1297B0765a6887j7948A2674N0526R7239F4337
11477f050C30287n3572G1211h2711k27875B66117f2583I4969K393L75328j54448
11466C18242j45984L7872D1410b1694C35458c48128G0998K12556J010A29650a5924
11454B9367b20681a01493k61182B58125K2590A7724K120J34443h4747D5792M2592
11443H8384M1252b6684k4159A8485K25497M2160i5422j95098J12613n490A22379
$$ plain form
11523 121192 -209971 69421 -264382 -104609 116395 -253270 271321 52351 69755 162438
11513 162438 135232 21826 -61898 -61049 39947 118253 -36634 -94966 184892 -56019 256897
11501 -50613 -2749 129091 159814 -50224 208992 127032 171148 21565 -67516 183227 -291370
11489 214195 38853 -353499 244883 -21297 20765 -16887 -34835 12674 63200 160439 64337
11477 -6050 330287 276715 71211 -82711 -310586 266117 -62583 94969 97362 472690 318242
11466 318242 172258 210130 41410 -21694 335458 -348128 70998 283554 284564 129650 -15924
11454 29367 -220681 -101493 -362675 258125 280715 17724 19844 154287 -84747 45792 88384
11443 88384 129636 -26684 -50843 18485 243982 286142 -95422 -290520 -177907 -183397 122379
11431g3238A95322r2124R5279R4761G6038K11742B11d5342q3206C9304b52520
11419B26387a26934A86644B2732J68539a65768P9944C54016I0968Q7122o3374
11409A14716D4690J67155e7724K8075b046j45445c4066E3019K24721a24144A72426
11397H0134K11984Q4512j83038b8555D8379a04966G1159c5552l82395a27205E3549
11385D53282j40478b29329i3071F5928a48462d0029j59368A11934A7733K37060
11375B54793a71572j3559C1115a97311D2699P9234j4758f3381B35557g3072C76453
11363a77244J2380A93487J9533o9504l050J16329B2265J83500j01196a75650P3291
11352a02359q3661A01378J4473e1505f561j41294M86A21226Q7787c35814g5845
$$ plain form
11431 -73238 195322 103198 198477 293238 76038 287780 211 -45342 -128548 39304 -252520
11419 226387 -126934 186644 22732 191271 -165768 -85824 354016 90968 178090 114716
11409 114716 44690 211845 -57724 -29649 -2046 -147491 -34066 53019 277740 -124144 172426
11397 80134 292118 376630 193592 -28555 48379 -104966 71159 -35552 -417947 -127205 53549
11385 453282 312804 -229329 -93071 65928 -148462 -40029 -199397 111934 17733 254793
11375 254793 -171572 -185131 31115 -197311 42699 121933 107175 -63381 235557 -73072 376453
11363 -177244 -164864 193487 213020 143516 140466 256795 22265 205765 104569 -175650 -102359
11352 -102359 -186020 101378 115851 -51505 -6561 -147855 -147369 121226 209013 -335814 -75845
11340A44661a15846E4945J5408e27174G4029b01024P2270a4716D8194A8775g1124
11328b72271d8638m747A76594C5967L3875A8416b51737O5788Q9250A27828O8492
11317A96320a87430o46A39066o1221f5732F887J58159c25695d4614n0690B04943
11305a1983N777p5838k37859F3019h4408I9695g0892a1180m0525a7104m7273j3411
11293g7788A09127b60797J05295P1929n6415A12555f4279A74940c25628D1005
11282a1397j33308j24395O5991P0749m1966d0946o4344M3269A60697h2761J9458
11271f3303B82406a02307d5490m53k29143D9350b2236l85005F367b89628N6596
11260b33032B04786d9534A02341L5821c48532g7050E031a46485j0430a7892C00132
$$ plain form
11340 144661 -115846 54945 70353 -527174 74029 -201024 -128754 -14716 48194 18775 -71124
11328 -272271 -48638 -53385 176594 35967 69842 18416 -251737 -185949 -96699 127828 196320
11317 196320 -187430 -188076 139066 77845 -65732 6887 165046 -325695 -44614 -95304 204943
11305 -11983 -6206 -82044 -319903 63019 -84408 99695 -70892 -11180 -51705 -17104 -64377 -77788
11293 -77788 109127 -260797 -155502 -83573 -139988 112555 -64279 174940 -325628 41005
11282 -11397 -144705 -269100 -203109 -132360 -174326 -40946 -105290 -62021 160697 -82761 -63303
11271 -63303 282406 -102307 -45490 -45943 -275086 49350 -22236 -407241 6367 -289628 -233032
11260 -233032 204786 -49534 102341 138162 -348532 -77050 5031 -146485 -156915 -17892 300132
11248B22878a24110j95193D04267a55645A31409b72489i3136j5981M2424j49425
11238b16118B78156G2040a55989m13513c0336A97663b59070B35217a32013A29006
11227d3164j09362C4024J64892F811c3897H2542b37370i5807d1389r0988d1032
11215a14644A86496l6456f7123n4077B3331a23721k682j88146G1143M7452a94883
11203A41134b55596a27093j32032J15141M6781a9760o411A30965a5953P343l7152
11192d5762E2313R312b41174A59891D4507a73803E4517b78437C06518a01312A76261
11180A90318f9251c725k3388j75669A44798c5207C72118A37680m7189R0337q8258
11169I2570a68603a9927j84567i9329F2603b08780I8686a63845e0162j14861B05063
$$ plain form
11248 222878 -124110 -319303 404267 -155645 131409 -272489 -93136 -109117 -66693 -216118
11238 -216118 278156 72040 -155989 -569502 -30336 197663 -259070 235217 -132013 129006
11227 -43164 -152526 34024 198916 6811 -33897 82542 -237370 -95807 -41389 -132377 -41032
11215 -114644 186496 150040 -67123 -121200 23331 -123721 -126403 -314549 71143 118595 -194883
11203 141134 -255596 -127093 -259125 -143984 -97203 -19760 -26171 130965 -15953 -8610 -45762
11192 -45762 52313 61625 -241174 159891 44507 -173803 54517 -278437 306518 -101312 176261
11180 190318 -69251 -3725 -27113 -202782 144798 -35207 372118 137680 90491 180828 92570
11169 92570 -168603 -19927 -204494 -99329 62603 -208780 98686 -163845 -50162 -165023 205063
11157A84058J12608a63007j33755a45908K9217B1254e7494A30114a43266O4535
11147g8731c8229j063E4844L32586A80703j8456a60522M5645B37044b88392J10385
11136a78007A05893a24455B83820j27671N0830a41884m2009j1540C42773B6079
11125B03354b87370a42867A13419c29094f5450H1517b14669A01435g0748b7180
11114A87153Q0643A12311B8715g1776j31223B50479A5346O21462B41819a67781
11103A07170a14487k73183a79004f7125r265j91452D4731c4375C9868K07530A10947
11091D1208r312K1974m645J43032F7659L6023h9816B69354K05216A56500K16624
11080C73124a34036F58010A18501J18009o1807N905m628G6861l7738L09388n9734
$$ plain form
11157 184058 296666 -163007 -296762 -145908 -116691 21254 -57494 130114 -143266 -78731
11147 -78731 -38229 -39292 54844 387430 180703 162247 -160522 -114877 237044 -288392 -178007
11136 -178007 105893 -124455 283820 156149 206979 -141884 -183893 -195433 342773 26079
11125 203354 -287370 -142867 113419 -329094 -65450 81517 -214669 101435 -70748 -27180
11114 187153 267796 112311 28715 -71776 -202999 250479 15346 636808 241819 -167781
11103 107170 -114487 -387670 -179004 -67125 -76390 -267842 44731 -34375 39868 247398 110947
11091 41208 31896 53870 49225 192257 67659 103682 -89816 269354 474570 156500 373124
11080 373124 -134036 658010 118501 236510 174703 180608 175980 76861 39123 348511 288777
11069B88777j32613b9504B27298I3237J50267J39577j43387q564p130O4853E5075
11057H9247K30202A13972J13923L5371L3990j1859F1777M5205K27820j35127M7527
11046B47202p1219L9075A8277J53291N74773k84722B19757M57075j67600j37947
11036C71285k3518J44785J55922J20913j10111K19986j18767R2437k03914O8797
11026G17815o0165l3183k87609m2928N19359l68089A35795M32691L0550L1017
11016F30053P6525C28683J22149l9478J48073K64109l98149N8600r7411J69590
11006E56166o891j77123L29406l42658L11188j11208B74129L83708A23432M96428
10996F19860P7060C04491N10178l90869J69669k80754R7324K3184J65400j66789
$$ plain form
11069 288777 156164 -29504 227298 93237 243504 383081 239694 231130 224000 288853 55075
11057 89247 319449 113972 227895 263266 297256 285397 61777 106982 334802 199675 247202
11046 247202 175983 215058 18277 171568 746341 461619 219757 676832 509232 371285
11036 371285 347767 492552 648474 769387 659276 879262 760495 852932 649018 717815
11026 717815 657650 624467 336858 293930 813289 445200 135795 568486 599036 630053
11016 630053 706578 328683 450832 411354 559427 823536 425387 483987 386576 556166
11006 556166 549275 372152 701558 358900 670088 558880 274129 657837 123432 619860
10996 619860 696920 304491 814669 423800 593469 312715 410039 433223 598623 431834
10986D31834R247q0386j27781K61773j21544M02862j47524B07605L19908J88096
10976G15609p9171m1445k0051L4697K68514k9390J40324k46109K8884M40793k93493
10965I19162Q9960M33513L8707r5118K01659j77346O83279J23285K249Q3927k92823
10954B010454K9701p278l95946N05042r59217K25249j1749n9628k14543k41810
10944H80275M51915m80861K40300K0530k23591J9622m45303l8315K39717k49615
10934D14674j25146J66684H5641K08061J40110j21977J22869k1628E5635a65253
10923b03265G6892l5417a7437B50802j02926a44616A2939c00924B2647Q5385K17479
10912C25511a27024A49854a07785k10780a6784B20038b0993m0952j55200i0756
$$ plain form
10986 431834 441081 360695 232914 494687 373143 776005 628481 207605 527513 715609
10976 715609 636438 594993 574942 609639 878153 848763 989087 742978 771862 1212655 919162
10965 919162 1009122 1442635 1481342 1386224 1587883 1410537 2093816 2217101 2219350 2303277 2010454
10954 2010454 2040155 2032877 1636931 2141973 1182756 1408005 1396256 1336628 1122085 880275
10944 880275 1332190 851329 1091629 1112159 888568 908190 462887 424572 664289 414674
10934 414674 289528 456212 85641 293702 433812 311835 434704 413076 55635 -165253
10923 -203265 76892 41475 -17437 250802 147876 -144616 12939 -300924 22647 108032 325511
10912 325511 -127024 149854 -107785 -318565 -16784 220038 -20993 -61945 -217145 -90756
10901h9564H0462L90781a58078P52l9813A51705J25214B6185a55006B49770G5829
10889I4518k4387c64128I7232C1229J58139b31964r76d73A96037a23496A326a7453
10876b6354B09469A2667a73042B36572a44815K7562D33039f9084b2692j81036
10866b03728A39240P327D0428a57602A1085K67277a1212m3119C58501e6578A005
10854G4461j1272b24527C86570E1314i7433l7121l4587A4053F679K7074a6356
10842B16304a80288E3724K41569H992K37046E0772C260i5305H3004J92149a7198
10830b40259g5484l6207q2181A61618a47326B11556J02356b6242B46913a51873
10819b38766C10497a27527k15830i4560a0807j62861L1451j3618A43663b28366
$$ plain form
10901 -89564 80462 471243 -158078 -157326 -197139 151705 276919 26185 -155006 249770 75829
10889 94518 70131 -364128 97232 31229 189368 -231964 -232940 -473 196037 -123496 1326 -17453
10876 -26354 209469 12667 -173042 236572 -144815 -117253 433039 -69084 -22692 -203728
10866 -203728 139240 146567 40428 -157602 11085 278362 -11212 -54331 358501 -56578 1005
10854 74461 63189 -224527 386570 51314 -97433 -134554 -169141 14053 6679 33753 -16356
10842 216304 -180288 53724 295293 8992 246038 50772 3260 -95305 83004 275153 -17198
10830 -240259 -75484 -111691 -193872 161618 -147326 211556 313912 -26242 246913 -151873
10819 -238766 310497 -127527 -343357 -94560 -10807 -173668 -142217 -155835 143663 -228366
10808c65455A10782Q2411j2621B3616R5506b04598G0600B2647a24201j8100a8394
10796a37611A0427b541P01I370K08340c96k13106a0456l2570l9915p7137c766
10783a57495D5778c38123e3500B356f2322j72586A83250R817r4768i3368G8243
10771a70110j66470a07196a5649p6447r5027d0976o1090k699k03753k7073G4441
10759A58950a65507B7477J37512C1320F2b07217g5279B10040a42566q9047n5021
10748b86634C19366b23469G891J34605J58946A20909b09571B1537b22386B15289
10737I6694e3256F4796a90283A83983a03468c0106k45575a5628j57402B2256a52267
10725i5479D0761g392A67694d22822H1150k6322d93943A74013A3972a04342H6237
$$ plain form
10808 -365455 110782 193193 180572 23616 119122 -204598 70600 22647 -124201 -142301 -18394
10796 -137611 10427 -2541 -1840 9370 217710 -396 -213502 -10456 -43026 -82941 -160078 -3766
10783 -157495 45778 -338123 -53500 2356 -62322 -234908 183250 193067 98299 -93368 78243
10771 -170110 -336580 -107196 -15649 -92096 -187123 -40976 -102066 -104765 -308518 -335591 74441
10759 158950 -165507 27477 164989 31320 62 -207217 -75279 210040 -142566 -231613 -286634
10748 -286634 319366 -223469 7891 142496 301442 120909 -209571 21537 -222386 215289
10737 96694 -53256 64796 -190283 183983 -103468 -30106 -275681 -15628 -173030 22256 -152267
10725 -95479 40761 -7392 167694 -422822 81150 54828 -493943 174013 13972 -104342 86237
10713E2163e6699A4915a35041B01617c66492P7965m390A7391a51936A41383b18598
10701a63548M0803B02899g6794b0154p6467l20492B4917b86754h064k04723A35104
10689a71463A35932b13357D5647J1133b37784A2371J2534e6562R612A45850C0694
10677b4314j69923B08852b48772k1287a17152j5491o5307G8348a91885D1820a46110
10665b92661i9198L2243o1090b1437m5798D1118b18705N2607j47902a0614j83107
10654a93721q7338N0981H1575a83020h14C5919a00756c0781F3786R76e1258B59081
10641A48439l3075c11043e8052A40338O4258B20f3705j87098h322o9189j10396
10630a87907h9588o1834n2798B2833L08315b2244D9867a00228A57611b0689j78359
$$ plain form
10713 52163 -56699 14915 -135041 201617 -366492 -288527 -292917 17391 -151936 141383 -218598
10701 -163548 -122745 202899 -76794 -20154 -96621 -417113 24917 -286754 -8064 -212787 135104
10689 -171463 135932 -213357 45647 56780 -237784 12371 24905 -56562 -46950 145850 30694
10677 -24314 -194237 208852 -248772 -270059 -117152 -132643 -197950 78348 -191885 41820 -146110
10665 -292661 -99198 -66955 -128045 -21437 -67235 41118 -218705 -166098 -314000 -10614 -193721
10654 -193721 -281059 -230078 81575 -183020 -814 35919 -100756 -30781 63786 64762 -51258 259081
10641 148439 115364 -311043 -58052 140338 204596 220 -63705 -250803 -8322 -77511 -187907
10630 -187907 -89588 -151422 -204220 22833 331148 -22244 49867 -100228 157611 -20689 -199048
10619a99048B2927J72832c4261B44671a26943C6877J73015p2197e6459j22765
10609a79224a030A8104d25993e0789k4386D7473B3520P9450b05178a1945j64513
10598a76458A91662M5102c34519A00774b67629D32242a74261A02953N4679o7841
10588H9791m0166L8399M5610K695d5705l612A93045b61678E7732J51958k1582
10577A88108b78233e3469E528K78719a40169c1365m9208M876k25714h2720A74719
10565D9646a11967F1445j9105j2590J66838c00376A22189k7012c50588C8132c508
10553c23484A80570J6072c8338k82894J47866h5661B84810a09483l31621c2796
10542h0894A29930j1062b35113P0470f3214b5400G0542O5Q1201n5405b22052o6650
$$ plain form
10619 -199048 22927 195759 -34261 244671 -126943 36877 209892 137695 -56459 -179224
10609 -179224 -1030 18104 -425993 -50789 -75175 47473 23520 102970 -205178 -11945 -176458
10598 -176458 191662 236764 -334519 100774 -267629 432242 -174261 102953 157632 89791
10588 89791 49625 88024 133634 136329 -45705 -49317 193045 -261678 57732 209690 188108
10577 188108 -278233 -53469 5528 284247 -140169 -31365 -80573 -75697 -301411 -82720 174719
10565 49646 -111967 61445 42340 29750 196588 -300376 122189 95177 -350588 38132 -3508
10553 -323484 180570 196642 -38338 -321232 -173366 -85661 284810 -109483 -441104 -32796
10542 -80894 129930 118868 -235113 -164643 -63214 -25400 70542 70607 151808 96403 -222052 -288702
10530b88702B76886i9291m7121k3795j33921j2532a21560e0801A72378F4934b17208
10518A8227b8915A85068D6324I582b3126r0655j84784j27333J69476a18526C06925
10506c0422p7321d9357K2812k05043h073j91211j3136D17072a40761b9731J3406
10495a6325j39013j1866G7286a90344A28450a56429o093C7415c1272A39723C596
10483B01269a12816A2360b82361I078a32303B02376a62349C2403i4701D1257q760
10472C2497J33131i8231l34192h2936F5584J133e4491F6462O5529a32331A18111
10460G8576J26854o0449a43022B74776j01754a8589E7908d69329A51417d4205
10449G2905b60918j49388E6500c53616C34993j48338A6074R3673Q6825D1215a5276
$$ plain form
10530 -288702 276886 -99291 -146412 -170207 -304128 -316660 -121560 -50801 172378 64934 -217208
10518 18227 -28915 185068 46324 9582 -23126 -113781 -298565 -425898 -256422 -118526 306925
10506 -30422 -107743 -49357 -26545 -231588 -8073 -199284 -212420 417072 -140761 -29731 -16325
10495 -16325 -155338 -167204 77286 -190344 128450 -156429 -162522 37415 -31272 139723 3596
10483 201269 -112816 12360 -282361 9078 -132303 202376 -162349 32403 -94701 41257 32497
10472 32497 165628 -98231 -432423 -82936 65584 66717 -54491 66462 131991 -132331 118111
10460 78576 205430 144981 -143022 274776 173022 -18589 57908 -469329 151417 -44205
10449 72905 -260918 -410306 56500 -353616 334993 186655 16074 109747 196572 41215 -15276
10437a69839P6978L1396a6614n613k66240A11162b72924m9940C17465c8734k52280
10426b91014Q1854A9249a51519D5452d7358j12752q0908g8359A07185d0529a5739
10414A76410M0519b56572B64565A21741e9786b9454B54735c921Q36k36367C3524
10402B26814a61554P1265A65962a59298j3510E5506a49159E5756N1377d7019q4211
10391a31230j1010E3877P5629l5042J69032K60530A02095O7556f4477E6944B185
10379b26468B78282j23807c138G3375m293J91567h7399B51388A18833g2335j8554
10368i0889m7431G0708J27648H7640J64581j16586L3407M11593A49404o8274K87011
10357C68141J04160A22739b67403B19815F2382L41610j87678J47859j81472l3205
$$ plain form
10437 -169839 -92861 -61465 -16614 -22227 -288467 111162 -272924 -322864 317465 -38734 -291014
10426 -291014 -209160 19249 -151519 45452 -47358 -160110 -241018 -78359 107185 -40529 -15739
10414 176410 216929 -256572 264565 121741 -59786 -29454 254735 -3921 -3085 -239452 33524
10402 226814 -161554 -90289 165962 -159298 -172808 55506 -149159 55756 107133 -47019 -131230
10391 -131230 -142240 53877 129506 94464 263496 524026 102095 169651 -64477 56944 2185
10379 -226468 278282 154475 -3138 73375 69082 260649 -87399 251388 118833 -72335 -90889
10368 -90889 -138320 70708 198356 87640 252221 135635 169042 580635 149404 81130 368141
10357 368141 472301 122739 -267403 219815 62382 403992 216314 364173 182701 149496
10347A49496D0J88389L74415B18154Q8480j34948d9838C12398J45668j85576n1721
10336B20769O8975K03183k29931O3678C1704M07199B0679L31849j73817J39170
10326C17881H6592K44942r0322c03541A09331L49056C0535a2412I0866a33128
10315C21689a34778b0003G9924d5891A10335C1498A5150g426A99470N3280c0223
10303b6730m7144B14226A02747f8692A3866R201a58248D07770A50860a92472A28871
10291b1478k1268j62753J3903e1101k89442h502k25414B96403b3202A87598l3297
10280A54301e8041A62763b8410j07710A64029n6682D6096a50503A98650I5423
10269b58j96907P1132A21161c37470d3505h384B0666O6120l5973M4590a29495
$$ plain form
10347 149496 40 188429 562844 218154 306634 171686 -49838 312398 458066 272490 220769
10336 220769 289744 492927 262996 326674 31704 438903 20679 352528 178711 317881
10326 317881 86592 331534 241212 -303541 109331 458387 30535 -12412 90866 -133128
10315 321689 -134778 -20003 79924 -45891 110335 31498 15150 -7426 199470 252750 -30223
10303 -26730 -73874 214226 102747 -68692 13866 23067 -158248 407770 150860 -192472 128871
10291 -21478 -42746 -205499 -191596 -51101 -340543 -8502 -233916 296403 -23202 187598 154301
10280 154301 -58041 162763 -28410 -136120 164029 107347 46096 -150503 198650 95423
10269 -258 -197165 -126033 121161 -337470 -43505 -8384 20666 86786 50813 95403 -129495
10257A48099b59221J10413C22671b58342A67100a43724G8817L2079a89191E3058
10246A81564G3990J92774R8559o333a00259J5568c0223A50399N9094a583l13230
10235c14813A68983b17643e8055k33984G8424c27719b7632B60885I2575c27230
10224a40561I4439e1463C5697a64092L9787A2893a1430j54444C7768a51814G5016
10212b66397A89873g5527B79128j19856G7451j0333k9550J47135f140C34880I8150
10200A44460a99407A13490J21256h0043j97156B28690N7135g6687L7227k46559
10190b86019Q8933d8840A46139a34983c2944I8862a13527o146A48010f9292k32279
10179c01571a10365A77415m6687c20578B13676a63210A8403a20238k8940j02369
$$ plain form
10257 148099 -259221 -148808 322671 -258342 167100 -143724 78817 110896 -189191 53058
10246 181564 73990 266764 365323 358990 -100259 -84691 -30223 150399 209493 -1583 -314813
10235 -314813 168983 -217643 -58055 -292039 78424 -327719 -27632 260885 92575 -327230
10224 -140561 94439 -51463 35697 -164092 -124305 12893 -11430 -165874 37768 -151814 75016
10212 -266397 189873 -75527 279128 159272 77451 67118 37568 184703 -6140 334880 98150
10200 144460 -199407 113490 234746 -80043 -277199 228690 285825 -76687 -39460 -286019
10190 -286019 -197086 -48840 146139 -134983 -32944 98862 -113527 -119673 148010 -69292 -301571
10179 -301571 -110365 177415 130728 -320578 213676 -163210 18403 -120238 -149178 -251547
10169b51547A07422O9665J07747F6139c70202J75410F4890f5722A02910a82275
10158a93745A97841d15878d7462j20700M9154r8573J04837A08390e2445j07621
10148a60066A21153k0703L62673g5792c1240l80337E0393e1976k24773h711j19107
10137a27818M6322j11742C4509J45978a35330J5376j1994E0561d4685l61649a46011
10125A4648g0557j8931k22054P4745b059m6032k9584j23427h1022C42880c49636
10113G3067j636A0836e4507n3372A02866c0827j9232j3433e158k12713C4076f6199
10100h0500J1624A07987N9414a20549A67120D9649f1527r2007C1607c29812a0432
10088A457b3540A8631b81258F3324b08674A13919D3173O7866B9445b50772f0822
$$ plain form
10169 -251547 107422 177087 284834 66139 -370202 -194792 64890 -65722 102910 -182275
10158 -193745 197841 -415878 -47462 -168162 -119008 -217581 -112744 108390 -52445 -160066
10148 -160066 121153 100450 463123 -75792 -31240 -411577 50393 -51976 -276749 -8711 -127818
10137 -127818 -81496 -193238 34509 180487 -135330 -119954 -131948 50561 -44685 -406334 -146011
10125 14648 -70557 -89488 -311542 -236797 -2059 -48091 -77675 -201102 -81022 342880 -349636
10113 73067 71431 10836 -54507 -107879 102866 -30827 -50059 -63492 -5158 -217871 34076 -66199
10100 -80500 -68876 107987 167401 -120549 167120 49649 -61527 -153534 31607 -329812 -10432
10088 1457 -23540 18631 -281258 63324 -208674 113919 43173 111039 29445 -250772 -60822
10076f3587j12246A28325q193i8969k6414j28135Q9339B11917D6643J71996a41743
10064A37043a42629B65893a07288K2896k8840C4465h8316Q166A22894D5898a17179
10052B81520f5952Q522J0328F6458b10162C69273f6130F5413i0120b8427n7686
10041h6113H7185a27153n5647j53946g7570l13908c8893p4816a6923k11434D1739
10029A04711A301i5202G6084a96896h1144m54969a59306q4641a4400r2244B80840
10017C35288e4665F522c20674J24094j14558J18842G3063k5737d05696m3940b01529
10005A76257Q0062g7309G5866j2832a49021I5220M5503a54965j4260F0973J41360
9994B02333a43402J9403G3035c87319j1816a58036l5679N0614j06113a18133j53464
$$ plain form
10076 -63587 -175833 128325 120132 -98969 -125383 -253518 -164179 211917 46643 218639 -141743
10064 137043 -142629 265893 -107288 -84392 -113232 34465 -88316 -80150 122894 45898 -117179
10052 281520 -65952 -57430 -47102 66458 -210162 369273 -66130 65413 -90120 -28427 -86113
10041 -86113 87185 -127153 -182800 -336746 -77570 -391478 -38893 -113709 -16923 -228357 41739
10029 104711 1301 -95202 76084 -196896 -81144 -536113 -159306 -243947 -14400 -106644 280840
10017 335288 -54665 6522 -320674 -196580 -311138 -192296 73063 47326 -405696 -449636 -201529
10005 176257 256319 -77309 75866 63034 -149021 95220 140723 -154965 -169225 60973 202333
9994 202333 -143402 -123999 73035 -387319 -399135 -158036 -193715 -143101 -249214 -118133 -271597
9983b71597Q1719G5697a99668O3729J2433b6153j36284c0883D39010h0727B44001
9971b02954j01358f7654L2092q0992J8273B06076B7034b24634r486q2820a22594
9959C14068b02075f835H1545L5702a07192o4899H4750H438e0285j37233A06329
9947C8812J3174b71340f4382A5247a1374C9679c54416J04642A9430a59482B29900
9935a75161N8477F9923a44715f6688J1853b4045n1000l6979A0294Q8741O9401
9924A68436b60629a21062N3002k24462A92388b30921c0981B08J57148f349A00676
9912B82400A4968b19618h4312A75390C5981J57417g5787I2595e1700H3963R125
9901I3088M9877i4925B01616f6787K5945k06023j18854i3231A64767g7100j56462
$$ plain form
9983 -271597 -189878 75697 -199668 -135939 -123506 -26153 -162437 -30883 439010 -80727 244001
9971 -202954 -304312 -67654 -35562 -116554 -98281 206076 27034 -224634 -234120 -316940 -122594
9959 314068 -202075 -6835 81545 117247 -107192 -172091 84750 8438 -50285 -187518 106329
9947 38812 51986 -271340 -64382 15247 -11374 39679 -354416 -249774 19430 -159482 229900
9935 -175161 -116684 69923 -144715 -66688 -54835 -24045 -75045 -112024 10294 99035 168436
9924 168436 -260629 -121062 -68060 -292522 192388 -230921 -30981 208 157356 -6349 100676
9912 282400 14968 -219618 -84312 175390 35981 193398 -75787 92595 -51700 83963 93088
9901 93088 142965 -94925 201616 -66787 -40842 -246865 -365719 -93231 164767 -77100 -233562
9890b33562B65234Q4279b063A83752q9140B6917J13467a70554G5045a04649A45691
9878b04297J6259A90290c15345b5633E4050c8237A11780a99111A12928a37683
9867b57635b7330k89236j4867i68j97681O1463l2181k5999b9266j49552G6829
9855a30640d6117J9436j35876D5188c19166C7516d3470F8054b449q5513d766k88017
9843b92783g2633A820b48492J11416m2444h3872o2890A44585a13113j11320g1468
9831F693J31549B0223a00180k57110Q7456b0648r5940k15814a3939k07932F1593
9819A70692f9115A20158a31292j00254b6278j6663k73261j2312E7094K3943b2868
9807B090f4286j7946j96586G8986e226l84742a8826k00911f4625r0362g0857h148
$$ plain form
9890 -233562 265234 349513 -2063 183752 94612 26917 140384 -170554 75045 -104649 145691
9878 -204297 -188038 190290 -315345 -25633 54050 -38237 111780 -199111 112928 -137683
9867 -257635 -27330 -316566 -331433 -968 -198649 -137186 -169367 -195366 -29266 -178818 76829
9855 -130640 -46117 -26681 -162557 45188 -319166 37516 -43470 68054 -2449 -87962 -4766 -292783
9843 -292783 -72633 1820 -248492 -137076 -179520 -83872 -146762 144585 -113113 -224433 -71468
9831 6693 138242 20223 -100180 -357290 -269834 -20648 -116588 -332402 -13939 -221871 61593
9819 170692 -69115 120158 -131292 -231546 -26278 -42941 -316202 -328514 57094 81037 -22868
9807 2090 -64286 -82232 -278818 78986 -5226 -389968 -18826 -219737 -64625 -154987 -70857 -8148
9794G3071b22275E4937J15945c49837j1747A33613a84977E9611K82384b48129
9783b21315a6433q5572l26975b8461I5711b48904B12453a80781j9542K1865k95045
9772d73503C2983K07822b13916k195i6143B7295J22822A7208a92747j34715g3366
9760a63193F1880P1152L29283c0824j02748l9515f6178k8029j75320a01499M4708
9749e6791n4378J2015b6349j42892c0900F4638f4474a2654A25561c2995j43786
9738a76781a2817j77975E1220Q436a06972B36318a13440k01582C9684P1108b84935
9726a14508K7860F6296k3649i3403B45433F052J68632J92354d8829D9481O0433
9715A09914a62711k78545a21586j69452l6682J21873b1700p0029j50823l4371
$$ plain form
9794 73071 -222275 54937 170882 -349837 -361584 133613 -184977 59611 341995 -248129
9783 -221315 -16433 -102005 -428980 -28461 95711 -248904 212453 -180781 -200323 -178458 -473503
9772 -473503 32983 240805 -213916 -216111 -96143 27295 150117 17208 -192747 -327462 -73366
9760 -163193 61880 133032 462315 -30824 -133572 -173087 -66178 -94207 -269527 -101499 -56791
9749 -56791 -111169 -99154 -26349 -169241 -30900 64638 -64474 -12654 125561 -32995 -176781
9738 -176781 -12817 -190792 51220 59656 -106972 236318 -113440 -315022 39684 110792 -284935
9726 -114508 -86648 66296 42647 -93403 245433 6052 174684 367038 -48829 49481 109914
9715 109914 -162711 -441256 -121586 -291038 -327720 -205847 -21700 -91729 -242552 -276923
9705b76923B4584a98082c7466A45945n5053K3484A6525J48409J35458g1518I5506
9693c03106f7684j15625k898F8746a46397A11020i7854q1979H380c0258k9473
9682e9731E4303h0024J5835D8012J7364a42071m1983a5556j4009q4372A83625
9670a83405A61116a87844F4395M6413D3426J24559K1837F7529g7178r9512L7469
9659a39221J1068a509A85509n6454J23880a98005c3018j01011j04547R3147R841
9648a35588e1820H8838c118o6220C247L0971b39140A987a10799L7859A75223H042
9635b54856D338K31313i0869A4701h5595c66B62377i9540D2878K51573a68557
9623a9224B12606a00384P061C25620a44044O1189j21585R20H4908a98283j3849
$$ plain form
9705 -276923 24584 -198082 -37466 145945 90892 114376 16525 164934 300392 -71518 95506
9693 -303106 -67684 -183309 -186207 68746 -146397 111020 -97854 -179833 8380 -30258 -59731
9682 -59731 54303 -80024 -64189 48012 65376 -142071 -184054 -15556 -29565 -113937 183625
9670 -183405 161116 -187844 64395 110808 43426 167985 189822 67529 -77178 -176690 -139221
9659 -139221 -128153 -1509 185509 129055 252935 -198005 -33018 -134029 -238576 -145429 -135588
9648 -135588 -51820 88838 -3118 -69338 3247 34218 -239140 1987 -110799 -72940 175223 8042
9635 -254856 4338 235651 -90869 14701 -85595 -366 262377 -99540 42878 294451 -168557
9623 -19224 212606 -100384 -93323 325620 -144044 -82855 -204440 -203520 84908 -198283 -212132
9612b12132A00853i7291A60558c08397A2720J01703c316H2080a36810j52785a31356
9600A05937J65413D236K4073h0385C35591C9657b56369P7919H6807K943J57063
9589B46813b01146K2165B25092b22023k2254e1513j96440A84365a61128l21231
9579d82359c9811j32969D04291I6397b21204A24479d9221k08858I8536K21344
9569C19880a08457J2567b0927E7984b19334d7777B35407A10028B1083K009b13554
9557B2159a67301O8776C7842b81812D7411K26842B7452e4508C54289i0456r8165
9546a88621J3441e9535d664l56575A06115b39076A33067h7962j61643A20995a64456
9534c62576a15824j89400N331H8525a77707B8187c27358A12859k0402h667k17931
$$ plain form
9612 -212132 100853 -97291 160558 -308397 12720 114423 -3316 82080 -136810 -289595 -131356
9600 105937 271350 4236 28309 -80385 335591 39657 -256369 -178450 86807 89750 246813
9589 246813 -201146 -178981 225092 -222023 -244277 -51513 -247953 184365 -161128 -482359
9579 -482359 -39811 -172780 404291 96397 -221204 124479 -49221 -258079 98536 319880
9569 319880 -108457 -95890 -20927 57984 -219334 -47777 235407 110028 21083 23092 -213554
9557 22159 -167301 -98525 37842 -281812 47411 274253 27452 -54508 354289 -90456 -188621
9546 -188621 -175180 -59535 -4664 -361239 106115 -239076 133067 -87962 -249605 120995 -164456
9534 -362576 -115824 -305224 -299893 88525 -177707 28187 -327358 112859 92457 -8667 -226598
9523b26598A16869a51575M0659m0647j33827J4480I0296J33651k8769i4129G6825
9511F7135k4969K41843b4200j72607o5137H5449c25700P0591G2307a07615J5971
9500i1644A48855h96m84748a38004j9393g6236K1016j55191l7589A17357b8587
9488I5416f9305l02633J70317D6605j2380b21304A128g9853j09946j55288a70161
9476e7450l5377B45055i0899p0106A5250i0024H6831a6151k6567A03260b79506
9464a43158b7175A68828b18133l8224h6894G7800g4719k12980c5089k2319q4054
9453a41462A07889b28551i7275h047j32105K7681j5258k8590o2975A54752b59229
9441A17858a46407k5917a3606j57428B00020a97729B06874d8473k77372D5705
$$ plain form
9523 -226598 116869 -151575 -110916 -151563 -285390 -270910 90296 223947 195178 -94129 76825
9511 67135 42166 284009 -24200 -196807 -261944 85449 -325700 -255109 72307 -107615 -91644
9500 -91644 148855 -896 -485644 -138004 -157397 -76236 -55220 -210411 -248000 117357 -28587
9488 95416 -69305 -371938 -201621 46605 34225 -221304 1128 -79853 -189799 -345087 -170161
9476 -57450 -92827 245055 -90899 -161005 15250 -90024 86831 -16151 -42718 103260 -279506
9464 -143158 -27175 168828 -218133 -256357 -86894 77800 -74719 -287699 -35089 -57408 -141462
9453 -141462 107889 -228551 -97275 -8047 -140152 -112471 -127729 -156319 -219294 154752 -259229
9441 117858 -146407 -172324 -13606 -171034 200020 -197729 206874 -48473 -325845 45705
9430f8957A3754k100b5953n1516A07845J88312c50236a08506k37008A56439d7693
9418h7222L0499G9486J0859b47873C8594J9362a45078L1175A52926i0545A96878
9406c94936M0624i7096B43706r3642o8141a56418N1434e0434k4604I0166J17986
9395B08152c3264h290n5237l91226A43578a86594D953d0514A2916J04347J72278
9384B89541A28197E7665a57867C04393l6116c79109C6683i6242r3863j76742J81839
9373a85008A86328a14617j60032B16181i2667j2138A52165h1812K2989j65658
9363b24481D2719f2739n7088C72809b08490J9661r2330A998d31984A43653a27371
9351a57264K0144h017A04649J3727b48602g8714o2522e1620B23876C3136a10206
$$ plain form
9430 -68957 13754 11654 -25953 -77469 107845 296157 -350236 -108506 -345514 156439 -47693
9418 -87222 -56723 79486 90345 -247873 38594 57956 -145078 -113903 152926 -90545 196878
9406 -394936 -354312 -97096 243706 150064 81923 -156418 -104984 -50434 -75038 90166 208152
9395 208152 -33264 -8290 -63527 -454753 143578 -186594 4953 -40514 12916 117263 289541
9384 289541 128197 57665 -157867 304393 268277 -379109 36683 -96242 -190105 -366847 -185008
9373 -185008 186328 -114617 -274649 216181 -92667 -104805 152165 -81812 -58823 -224481
9363 -224481 42719 -62739 -119827 372809 -208490 -188829 -281159 1998 -431984 143653 -127371
9351 -157264 -137120 -8017 104649 118376 -248602 -78714 -141236 -51620 223876 33136 -110206
9339f0630j31168b849l19309D4626J45366G9762a58853F9621b92025h3588j0454
9328i4042r2431F1588N7195b06554B27453N7440a54872M5177a7893I7457K9261
9317A26718b28505B09030m4036a51907d7385j76207B3103b0365i773A27799a3815
9305b38164B15740o405f2654k61375h0779B13250A1799a04181A25768f3094A02547
9293h4257A1396J05738r029n3763c75578H4512J84271g4483n7702E9143A1983
9281A09b21525J9223J2315F7593J65858A8725b47885N3355A45710b05432h8698
9269a58983r192o45a9019A0873b7106o2693M3083p0705K9385A14150d9056N895
9257d3161o4209j3216L1300j78479Q4500k3061b799k20888a2737k60619r440H0305
$$ plain form
9339 -60630 -191798 -2849 -322158 44626 189992 79762 -158853 69621 -292025 -83588 -94042
9328 -94042 -186473 61588 118783 -206554 227453 284893 -154872 -109695 -17893 97457 126718
9317 126718 -228505 209030 164994 -151907 -47385 -223592 23103 -20365 -9773 127799 -13815
9305 -238164 215740 209335 -62654 -324029 -80779 213250 11799 -104181 125768 -63094 102547
9293 -84257 11396 117134 108105 54342 -375578 84512 268783 -74483 -132185 59143 11983
9281 109 -221525 -202302 -189987 67593 233451 18725 -247885 -194530 145710 -205432 -88698
9269 -158983 -168175 -168820 -19019 10873 -27106 -89799 -46716 -117421 -88036 114150 -49056 -43161
9257 -43161 -107370 -120586 -89286 -267765 -183265 -206326 -2799 -223687 -12737 -273356 -282796 80305
9244D4700P1386l8550c09750G2815a60452A60998a88228Q201k67028A43071a36185
9232i3085b4819I7039a85591B062a43258N9173m4753C0846L8293a80030N8938
9221a21092Q060J0889r731o0518Q3590k27095J16462j41545h6512q7855l036A00474
9208G8318h3951G4700K72829o4584A940L68785e9355k5915A7039b65549d5243
9196a42820f8642L3247k88697C3729c0584B45646c06639A53381F6148a32778q5050
9185b17828A64915b63481G3856a22654N7872b2285m9749c4531m3685r5380g5475
9173g578J369b357M74j96103B15797c4201j02339d7140F8393b81307B03520d4449
9160A38626E9362k1841J56332c4045j80791q6122J20917G338c3038n5192K055
$$ plain form
9244 44700 116086 77536 -309750 72815 -160452 160998 -188228 -180027 -447055 143071 -136185
9232 -93085 -24819 97039 -185591 2062 -143258 -84085 -128838 30846 69139 -180030 -121092
9221 -121092 -113032 -102143 -111874 -172392 -88802 -315897 -199435 -340980 -86512 -174367 -177403 100474
9208 78318 -83951 74700 347529 282945 1940 370725 -59355 -85270 17039 -265549 -45243
9196 -142820 -68642 -35395 -324092 33729 -30584 245646 -306639 153381 66148 -132778 -217828
9185 -217828 164915 -263481 73856 -122654 -64782 -22285 -72034 -34531 -78216 -173596 -75475
9173 -7578 -6209 -2357 -1883 -197986 215797 -34201 -136540 -47140 68393 -281307 203520 -44449
9160 138626 59362 37521 193853 -34045 -214836 -300958 -180041 7338 -33038 -88230 -86175
9149h6175B10856e4484m53850i1754B8322E940d2942A54258N1171i8677A8967
9137A5630J33030L9811E17f0502E9295i9930B06053c84639I7480J63718b4386
9125B0873f9561k62774d7456r3440A06451h3005L9672k20410a18738A19493J71865
9114B91358b64637n6812J1331p4589a33028A51923m7987C0049K38449a1654r9985
9103a11639a501q4683l3967a6128j63207N2452D10694a26562j17235a04077E5434
9091E8412b11687C3735b83220f3703i111C4994N3192b60287Q4853b9303A67015
9079d7642C3775a41767F5716J62852a3455j62849K0922M8227j38868J09402p3681
9068b10302A41836a37328C50406F246d9935A9050a52810k405k67l50909a50591
$$ plain form
9149 -86175 210856 -54484 -508334 -91754 28322 5940 -42942 154258 205429 -98677 18967
9137 15630 148660 188471 517 -60502 59295 -99930 206053 -384639 97480 261198 -24386
9125 20873 -69561 -332335 -47456 -140896 106451 -83005 -43333 -263743 -118738 119493 291358
9114 291358 -264637 -321449 -310118 -384707 -133028 151923 103936 30049 268498 -11654 -111639
9103 -111639 -1501 -86184 -120151 -16128 -179335 -126883 410694 -126562 -243797 -104077 55434
9091 58412 -211687 33735 -283220 -63703 -9111 34994 88186 -260287 -175434 -29303 167015
9079 -47642 33775 -141767 65716 228568 -13455 -176304 -155382 -107155 -246023 -136621 -210302
9068 -210302 141836 -137328 350406 6246 -49935 19050 -152810 -155215 -155482 -506391 -150591
9056b15067b171j56830c0821q1573C69570I0506k1444r690b29296a10413d3476
9044b24409G3596J68112b40256K2688f3792K8477A7605c56043a21899B4248b11956
9032b72894A53267c32610B36609D8304K80423j60272a23588r9212F0875d0547
9021A11289J64582b78406B3048J12044m1800m4923i9688g886l59277a10234j8519
9010a28753e9224B31663D1901P6523a26387M3486j1748O036C26607c17821A22227
8998A10319d58840F0924c4852j00050j0253c0105A8013a5775B4078e5338j75552
8987b30890j77085J98144d1712A71374i5172A04278B5127h2357K9997B14985p7833
8976A37152a02011k3573l9270r6436g5538k09295B76277g672A52841a91974A10489
$$ plain form
9056 -215067 -2171 -159001 -30821 -112394 369570 90506 69062 59372 -229296 -110413 -43476
9044 -224409 73596 241708 -240256 -217568 -63792 -35315 17605 -356043 -121899 24248 -211956
9032 -272894 153267 -332610 236609 48304 328727 168455 -123588 -222800 60875 -40547
9021 111289 275871 -278406 23048 135092 93292 48369 -99688 -7886 -367163 -110234 -128753
9010 -128753 -59224 231663 41901 118424 -126387 -82901 -94649 -88613 326607 -317821 122227
8998 110319 -458840 60924 -34852 -134902 -145155 -30105 18013 -15775 24078 -55338 -230890
8987 -230890 -407975 -209831 -41712 171374 -95172 104278 25127 -82357 -52360 214985 137152
8976 137152 -102011 -125584 -164854 -261290 -75538 -284833 276277 -7672 152841 -191974 110489
8964g8622K4904B08689J36010A55746a7779k1926r1538o6350c3188C7878h8630
8952G8777b06466A5479c51146a6265j66785E5351K53250B2091K78663i86j80443
8941a81429b5105l44762Q6661N9140A08122j8423c21845a02128q494D2179a2420
8929a46892A88338C5581f7401b1623k92858H4985P9610N9000e0247I3417M14143
8918E07560i1801E16113a22484C7185K50494J29613J72211B81657J75628Q32400
8908A289685N39943K251692M803788k181018C182885A373755n22864j76277B49925
8898a04358A02319O721C8280i9922B62778P832e1961C41838a10220C05383I5050
8886b8764a0342j50187B69061R9853g665A24787E2786f9450q7935B23871a1085
$$ plain form
8964 -78622 -53718 208689 344699 155746 -17779 -39705 -131243 -197593 -33188 37878 -88630
8952 78777 -206466 15479 -351146 -16265 -183050 55351 308601 22091 300754 -986 -181429
8941 -181429 -25105 -369867 -283206 -224066 108122 89699 -321845 -102128 -110622 42179 -12420
8929 -146892 188338 35581 -67401 -21623 -314481 84985 164595 223595 -50247 93417 507560
8918 507560 -91801 516113 -122484 37185 287679 417292 589503 281657 457285 1289685
8908 1289685 1829628 4081320 8885108 6704090 3182885 1373755 850891 674614 249925
8898 -104358 102319 109040 38280 -99922 262778 270610 -51961 341838 -110220 305383 95050
8886 -28764 -10342 -160529 269061 368914 -7665 124787 52786 -69450 -157385 223871 -11085
8874a36915l5334A50796H429a23079F5647a01095a6568B81044j36048g1310K8811
8863d2499A84461a25819r361n3495A9685b29162k2755f3742r2264c8471l35119
8852c73590E019b5964o7005H5571L6378f4173A43722M1203F6002k7830j3664h7315
$$ plain form
8874 -136915 -172249 150796 8429 -123079 65647 -101095 -16568 281044 144996 -71310 -42499
8863 -42499 184461 -125819 -135180 -188675 19685 -229162 -251917 -63742 -156006 -38471 -373590
8852 -373590 5019 -25964 -92969 85571 121949 -64173 143722 184925 66002 38172 24508 -87315
$$ [...]
##END NTUPLES=NMR SPECTRUM
##END=
