
##TITLE=AC1029_Robusta_6301173_GJ9ZwC42dt
##JCAMPDX= 6.0         $$ Bruker NMR JCAMP-DX V2.0
##DATA TYPE= NMR SPECTRUM
##DATA CLASS= NTUPLES
##ORIGIN= BRUKER
##OWNER= Administrator
$$ 1.72 TOPSPIN		Version 2.1
$$ 2012-06-05 22:13:23.812 -0500  Administrator@TOPSPIN
$$ Compression mode = diff/dup
##.OBSERVE FREQUENCY= 400.13188235
##.OBSERVE NUCLEUS= ^1H
##.ACQUISITION MODE= SIMULTANEOUS (DQD)
##.ACQUISITION SCHEME= undefined
##.AVERAGES= 64
##.DIGITISER RES= 22
##SPECTROMETER/DATA SYSTEM= spect
##.PULSE SEQUENCE= noesygpps1d.comp
##.SOLVENT NAME= COFFEE_meoh
##.SHIFT REFERENCE= INTERNAL, COFFEE_meoh, 1, 14.96669
##AUDIT TRAIL= $$ (NUMBER, WHEN, WHO, WHERE, PROCESS, VERSION, WHAT)
$$ ##TITLE= Audit trail, TOPSPIN		Version 2.1
$$ ##JCAMPDX= 5.01
$$ ##ORIGIN= Bruker BioSpin GmbH
$$ ##OWNER= Administrator
$$ $$ C:\Bruker\TOPSPIN/data/COFFEE/nmr/AC1029_Robusta_6301173_GJ9ZwC42dt/12/pdata/1/auditp.txt
$$ ##AUDIT TRAIL=  $$ (NUMBER, WHEN, WHO, WHERE, PROCESS, VERSION, WHAT)
(   1,<2012-06-05 22:13:18.937 -0500>,<Administrator>,<TOPSPIN>,<go>,<TOPSPIN 2.1>,
      <created by zg
	started at 2012-06-05 22:01:48.312 -0500,
	POWCHK enabled, PULCHK disabled,
       configuration hash MD5:
       D5 CA 7A 23 FE 6B EE E2 50 67 74 61 24 F7 5E 3B
       data hash MD5: 64K
       07 50 06 1D F5 24 2C C9 5A 6A 73 01 CB E1 AA 7F>)
(   2,<2012-06-05 22:13:21.750 -0500>,<Administrator>,<TOPSPIN>,<proc1d>,<TOPSPIN 2.1>,
      <Start of raw data processing
       efp LB = 0.3 FT_mod = 6 PKNL = 1 PHC0 = 0 PHC1 = 0 SI = 128K 
       data hash MD5: 128K
       7D 8B 37 A1 42 A7 FA 96 DA BA 59 5B 70 A8 6C D5>)
(   3,<2012-06-05 22:13:23.062 -0500>,<Administrator>,<TOPSPIN>,<proc1d>,<TOPSPIN 2.1>,
      <pk PHC0 = 30.62439 PHC1 = 0 
       data hash MD5: 128K
       AF D5 08 56 70 DC A5 9A 01 B0 CF 06 35 AC 14 C8>)
(   4,<2012-06-05 22:13:23.515 -0500>,<Administrator>,<TOPSPIN>,<proc1d>,<TOPSPIN 2.1>,
      <abs ABSG = 1 
       data hash MD5: 128K
       C4 17 0D 2E F1 E4 DC 0D 3B 6E E3 C9 B7 BD E2 AB>)
(   5,<2012-06-05 22:13:23.578 -0500>,<Administrator>,<TOPSPIN>,<proc1d>,<TOPSPIN 2.1>,
      <abs ABSG = 2 
       data hash MD5: 128K
       89 54 F4 DF 6B 02 31 48 D5 25 DC 75 DF 01 9A 45>)
(   6,<2012-06-05 22:13:23.640 -0500>,<Administrator>,<TOPSPIN>,<proc1d>,<TOPSPIN 2.1>,
      <abs ABSG = 3 
       data hash MD5: 128K
       D8 57 7A 78 E5 77 F4 6B 86 4C D1 93 09 0B D7 74>)
(   7,<2012-06-05 22:13:23.687 -0500>,<Administrator>,<TOPSPIN>,<proc1d>,<TOPSPIN 2.1>,
      <abs ABSG = 4 
       data hash MD5: 128K
       DE 0F 7D 41 F1 47 B5 A2 2F AC 2B AF 59 2C 90 10>)
(   8,<2012-06-05 22:13:23.734 -0500>,<Administrator>,<TOPSPIN>,<proc1d>,<TOPSPIN 2.1>,
      <abs ABSG = 5 
       data hash MD5: 128K
       44 2E B3 80 6C 44 0C 88 B8 CD 21 3B 06 1D DB 0F>)
$$ ##END=
$$ 
$$ $$ hash MD5
$$ $$ D5 D3 2A FF 06 5A E1 92 4D 6E EF D6 79 E0 A3 72
##$RELAX= 
##$RELAX= 
##$RELAX= 
##$RELAX= 
##$RELAX= 
##$RELAX= 
##$RELAX= 
##$RELAX= 
$$ Bruker specific parameters
$$ [...]
##$TP07= 0
##$TPNAME0= <>
##$TPNAME1= <>
##$TPNAME2= <>
##$TPNAME3= <>
##$TPNAME4= <>
##$TPNAME5= <>
##$TPNAME6= <>
##$TPNAME7= <>
##$TPOAL= (0..7)
0.5 0.5 0.5 0.5 0.5 0.5 0.5 0.5
##$TPOFFS= (0..7)
0 0 0 0 0 0 0 0
##$TUNHIN= 0
##$TUNHOUT= 0
##$TUNXOUT= 0
##$USERA1= <user>
##$USERA2= <user>
##$USERA3= <user>
##$USERA4= <user>
##$USERA5= <user>
##$V9= 5
##$VALIST= <valist>
##$VCLIST= <CCCCCCCCCCCCCCC>
##$VD= 0
##$VDLIST= <DDDDDDDDDDDDDDD>
##$VPLIST= <PPPPPPPPPPPPPPP>
##$VTLIST= <TTTTTTTTTTTTTTT>
##$WBST= 2048
##$WBSW= 25
##$XGAIN= (0..3)
0 0 0 0
##$XL= 0
##$YL= 0
##$YMAX_a= 9344115
##$YMIN_a= -5276682
##$ZGOPTNS= <>
##$ZL1= 120
##$ZL2= 120
##$ZL3= 120
##$ZL4= 120
##$ABSF1= 14.96669
##$ABSF2= -5.58584
##$ABSG= 5
##$ABSL= 3
##$ALPHA= 0
##$AQORDER= 0
##$ASSFAC= 0
##$ASSFACI= 0
##$ASSFACX= 0
##$ASSWID= 0
##$AUNMP= <proc_prof1d_extract.lims>
##$AXLEFT= 0
##$AXNAME= <>
##$AXNUC= <1H>
##$AXRIGHT= 0
##$AXTYPE= 0
##$AXUNIT= <>
##$AZFE= 0.1
##$AZFW= 0.1
##$BCFW= 0
##$BC_mod= 0
##$BYTORDP= 0
##$COROFFS= 0
##$CY= 15
##$DATMOD= 1
##$DC= 0
##$DFILT= <>
##$DTYPP= 0
##$F1P= 0
##$F2P= 0
##$FCOR= 0.5
##$FTSIZE= 131072
##$FT_mod= 6
##$GAMMA= 0
##$GB= 0
##$INTBC= 1
##$INTSCL= 1
##$ISEN= 128
##$LB= 0.3
##$LEV0= 0
##$LPBIN= 0
##$MAXI= 10000
##$MC2= 0
##$MEAN= 0
##$ME_mod= 0
##$MI= 0
##$NCOEF= 0
##$NC_proc= -3
##$NLEV= 6
##$NOISF1= 0
##$NOISF2= 0
##$NSP= 0
##$NTH_PI= 0
##$NZP= 0
##$OFFSET= 14.96669
##$PC= 1
##$PHC0= 30.62439
##$PHC1= 0
##$PH_mod= 1
##$PKNL= yes
##$PPARMOD= 0
##$PPDIAG= 0
##$PPIPTYP= 0
##$PPMPNUM= 2147483647
##$PPRESOL= 1
##$PSCAL= 4
##$PSIGN= 0
##$PYNMP= <proc.py>
##$REVERSE= no
##$SF= 400.13000557139
##$SI= 131072
##$SIGF1= 0
##$SIGF2= 0
##$SINO= 400
##$SIOLD= 131072
##$SPECTYP= <>
##$SREGLST= <1H.CDCl3>
##$SSB= 0
##$STSI= 131072
##$STSR= 0
##$SW_p= 8223.68421052632
##$SYMM= 0
##$S_DEV= 0
##$TDeff= 65536
##$TDoff= 0
##$TI= <>
##$TILT= no
##$TM1= 0
##$TM2= 0
##$TOPLEV= 0
##$USERP1= <user>
##$USERP2= <user>
##$USERP3= <user>
##$USERP4= <user>
##$USERP5= <user>
##$WDW= 1
##$XDIM= 131072
##$YMAX_p= 392505083
##$YMIN_p= -164846479
##$CURPLOT= <Network HP LaserJet P1505>
##$CURPRIN= <$Network HP LaserJet P1505>
##$DFORMAT= <normdp>
##$LAYOUT= <+/1D_H.xwp>
##$LFORMAT= <normlp>
##$PFORMAT= <normpl>
##$SURQMSG= 1
$$ End of Bruker specific parameters
$$ ---------------------------------
##NTUPLES= NMR SPECTRUM
##VAR_NAME=  FREQUENCY,     SPECTRUM/REAL,   SPECTRUM/IMAG
##SYMBOL=    X,             R,               I
##VAR_TYPE=  INDEPENDENT,   DEPENDENT,       DEPENDENT
##VAR_FORM=  AFFN,          ASDF,            ASDF
##VAR_DIM=   131072,        131072,          131072
##UNITS=     HZ,            ARBITRARY UNITS, ARBITRARY UNITS
##FACTOR=    0.0627417313425165, 1,          1
##FIRST=     8223.62146879498, 5156,         -90330
##LAST=      0,             8119,            -89653
##MIN=       0,             -164846479,      0
##MAX=       8223.62146879498, 392505083,    0
$$ Real data points
##PAGE= N=1
##DATA TABLE= (X++(R..R)), XYDATA
$$ [...]
61466D74819L262J857L15j68K56P84P98n2j658l168l618l163k936l372l443k208
$$ 474819 478081 479938 480253 480085 480341 481125 481923 481871 480213 477045 473427 470264 467328 463956 460513 458305
61450D58305l78M70k8p51q46p06q03n39P21K091J935K26j132q73m9k90j325j644
$$ 458305 457927 458397 458369 457618 456772 456066 455263 454724 455445 457536 459471 459697 458565 457692 457643 457353 456028 454384
61432D54384r97o16q79m97J315L143K978P72j645k727k445j572p69l72m04m98
$$ 454384 453387 452771 451892 451395 452710 455853 458831 459603 457958 455231 452786 451214 450445 450073 449669 449171
61416D49171k03O19J768K886L454K991J709P18R04J821K265J872J364J131M83
$$ 449171 448968 449587 451355 454241 457695 460686 462395 463113 464017 465838 468103 469975 471339 472470 472953
61401D72953j212l152l701k226J61J782J884R34j11m85J00J292K196K012Q47k80
$$ 472953 471741 468589 464888 462662 462823 464605 466489 467423 467312 466827 466927 468219 470415 472427 473274 472994
61385D72994l84O50K162L355L663K942J699R58J445K888M402N459O106O495O659
$$ 472994 472610 473260 475422 478777 482440 485382 487081 488039 489484 492372 496774 502233 508339 514834 521493
61370E21493O762O985P055O370M795K949J506N67jK7R68K457L347K815J452Q65
$$ 521493 528255 535240 542295 548665 553460 556409 557915 558482 558481 558508 559476 561933 565280 568095 569547 570412
61354E70412J776K825K079k04j417J8K189J950r04l394l323j861j558l185n442
$$ 570412 572188 575013 577092 576888 575471 575489 577678 579628 578724 575330 572007 570146 568588 565403 559961
61339E59961o748o298m167j385M64P24M13P50J390J053m26j723j739p72J89O99
$$ 559961 553213 546915 542748 541363 541827 542551 542964 543714 545104 546157 545731 544008 542269 541497 541686 542385
61323E42385J033J537K040J922R21j06K39K169M150M548L390J856O47k06m00M84
$$ 542385 543418 544955 546995 548917 549838 549732 549971 552140 556290 560838 564228 566084 566731 566525 566125 566609
61307E66609J888K636K624L053M531N959O050N161M754N434O304O155M834L534
$$ 566609 568497 571133 573757 576810 581341 587300 593350 598511 603265 608699 615003 621158 625992 629526
61293F29526L835O153R015J0423J0131R837J0740J1978J2329J2430J3714J5628
$$ 629526 633361 639514 648529 658952 669083 678920 689660 701638 713967 726397 740111 755739
61281G55739J5882J3706J1031R605Q659O859N109N381P353Q396P086M787L252
$$ 755739 771621 785327 796358 805963 814622 821481 826590 831971 839324 847720 854806 859593 862845
61268H62845K374J279Q5p76j843l742n673o311n789n419n649n756n317m606l500
$$ 862845 865219 866498 866583 865807 863964 860222 854549 848238 842449 837030 831381 825625 820308 815702 812202
61253H12202j626K07L55j119j821mL070M918N011M756N020N346N532O396Q320
$$ 812202 810576 810783 811138 810019 808198 808194 811264 816182 821193 825949 830969 836315 841847 848243 856563
61238H56563J0146J0306Q615O213L869J121k659o764r482j0054r529r204q877
$$ 856563 866709 877015 885630 891843 895712 896833 894174 887410 877928 867874 858345 849141 840264
61225H40264p561n442l791l016k248j118m78o68n48P25K193K722L061M621O976
$$ 840264 832703 827261 823470 820454 818206 817088 816610 815942 815394 816119 818312 821034 824095 828716 835692
61210H35692Q312Q237Q253R300J0456J0635J0149R857R876J0142J1272J3719J6422
$$ 835692 844004 852241 860494 869794 880250 890885 901034 910891 920767 930909 942181 955900 972322
61197I72322J7517J6547J5192J5426J7354J9234J9376J7615J4884J1975R153O661
$$ 972322 989839 1006386 1021578 1037004 1054358 1073592 1092968 1110583 1125467 1137442 1146595 1153256
61185A153256M856L695K641J252n40k833n718q621j0383j0431r344p925o435n193
$$ 1153256 1158112 1161807 1164448 1165700 1165160 1162327 1156609 1147988 1137605 1127174 1117830 1109905 1103470 1098277
61171A098277m961n940p060p207o651o372o498o327n500m284l038k241k508l706
$$ 1098277 1093316 1087376 1080316 1073109 1066458 1060086 1053588 1047261 1041761 1037477 1034439 1032198 1029690 1025984
61157A025984m633m522m132m229l938k230k21J79n52j79J445J753n05l112l521
$$ 1025984 1021351 1016829 1012697 1008468 1004530 1002300 1002079 1002258 1001706 1001527 1002972 1004725 1004220 1001108 997587
61142I97587k152q98r1J182K873M091M846O044P973R991J1548J2514J2988J3561
$$ 997587 995435 994537 994446 995628 998501 1002592 1007438 1013482 1021455 1031446 1042994 1055508 1068496 1082057
61128A082057J5079J7214J8059J6363J3424J1471J0844J0311R472Q997Q657P286
$$ 1082057 1097136 1114350 1132409 1148772 1162196 1173667 1184511 1194822 1204294 1213291 1221948 1229234
61116A229234M985L496L689M318M049L217K614J860L50j180j465o34m7m88j689
$$ 1229234 1234219 1237715 1241404 1245722 1249771 1252988 1255602 1257462 1257812 1256632 1255167 1254533 1254486 1253998 1252309
61101A252309l361n479p525q632q886r538j1319j3273j3945j3188j2151j1640
$$ 1252309 1248948 1243469 1235944 1227312 1218426 1208888 1197569 1184296 1170351 1157163 1145012 1133372
61089A133372j1273j0339q911p708o969n952l828j058N57m02l388o544q820j0652
$$ 1133372 1122099 1111760 1102849 1095141 1088172 1082220 1078392 1077334 1077891 1077489 1074101 1067557 1058737 1048085
61075A048085j2363j3031j1793r583q157p650o460l816j071J83J83L14J229K591
$$ 1048085 1035722 1022691 1010898 1001315 993158 985508 979048 975232 974161 974344 974527 974841 976070 978661
61061I78661M058N487O661P768R646J2464J4749J5146J4805J6322K0109K3522
$$ 978661 982719 988206 994867 1002635 1012281 1024745 1039494 1054640 1069445 1085767 1105876 1129398
61049A129398K4264K3110K2287K2420K2522K2227K2315K3096K3578K2761K0934
$$ 1129398 1153662 1176772 1199059 1221479 1244001 1266228 1288543 1311639 1335217 1357978 1378912
61038A378912J9158J7812J6137J3174Q874M146o0l383n805p318q254r507j1692
$$ 1378912 1398070 1415882 1432019 1445193 1454067 1458213 1458153 1454770 1448965 1441647 1433393 1423886 1412194
61025A412194j4264j6172j7198j7784j7745j6362j4044j2538j2793j3563j3051
$$ 1412194 1397930 1381758 1364560 1346776 1329031 1312669 1298625 1286087 1273294 1259731 1246680
61014A246680j1171r296q356q107p891p209n727l521j159R78L120N351P044P887
$$ 1246680 1235509 1226213 1217857 1209750 1201859 1194650 1188923 1185402 1184243 1185221 1188341 1193692 1200736 1208623
61000A208623Q893J1370J5097J8702K1626K4483K7436K9617L0782L2336L5807
$$ 1208623 1217516 1228886 1243983 1262685 1284311 1308794 1336230 1365847 1396629 1428965 1464772
60989A464772M0882M5788M9352N1957N4679N8171O2456O7226P2082P6738Q1220
$$ 1464772 1505654 1551442 1600794 1652751 1707430 1765601 1828057 1895283 1967365 2044103 2125323
60978B125323Q5907R1286R7695J05323J14320J24727J36081J47313J57379J66225
$$ 2125323 2211230 2302516 2400211 2505534 2619854 2744581 2880662 3027975 3185354 3351579
60968C351579J74901J84416J94577K04156K12202K19108K26436K35737K47443
$$ 3351579 3526480 3710896 3905473 4109629 4321831 4540939 4767375 5003112 5250555
60959E250555K60797K74930K90053L07451L28287L52525L79277M08379M41874
$$ 5250555 5511352 5786282 6076335 6383786 6712073 7064598 7443875 7852254 8294128
60950H294128M83976N39014O08921O92954P90119R01285J028471J173222J337356
$$ 8294128 8778104 9317118 9926039 10618993 11409112 12310397 13338868 14512090 15849446
60941A5849446J524811J740817J989296K271999K585650K908234L179229L299196
$$ 15849446 17374257 19115074 21104370 23376369 25962019 28870253 32049482 35348678
60933C5348678L168426K746939K089753J329276O22070R7836j71686j90847m7439
$$ 35348678 38517104 41264043 43353796 44683072 45305142 45402978 45231292 45040445 44993006
60924D4993006J06341J08461j44967o58400j343600k061711k673900l082551l254720
$$ 44993006 45099347 45207808 45062841 44404441 43060841 40999130 38325230 35242679 31987959
60915C1987959l220750l047338k800857k525029k242387j966741j709763j479318
$$ 31987959 28767209 25719871 22919014 20393985 18151598 16184857 14475094 12995776
60907A2995776j277759j104130r56810q33873p32572o49343n79797n19157m64064
$$ 12995776 11718017 10613887 9657077 8823204 8090632 7441289 6861492 6342335 5878271
60898E878271m14041l70063l31685k96884k64627k35903k11470j90142j70379
$$ 5878271 5464230 5094167 4762482 4465598 4200971 3965068 3753598 3563456 3393077
60889C393077j52637j38739j29269j22572j16346j09561j02815r7099r2377q7345
$$ 3393077 3240440 3101701 2972432 2849860 2733514 2623953 2521138 2424039 2331662 2244317
60879B244317q0943p4000o8738o6226o4974o2524n8123n3202m9545m7602m6571
$$ 2244317 2163374 2089374 2020636 1954410 1889436 1826912 1768789 1715587 1666042 1618440 1571869
60868A571869m5468m3877m2015m0401l9333l8539l7269l4935l1725k8509k6011
$$ 1571869 1526401 1482524 1440509 1400108 1360775 1322236 1284967 1250032 1218307 1189798 1163787
60857A163787k4191k2573k1004j9590j8083j6018j3679j2144j1822j1674j0587
$$ 1163787 1139596 1117023 1096019 1076429 1058346 1042328 1028649 1016505 1004683 993009 982422
60846I82422q996q146q212q214p607o884o384n617m162k473j458j704l192n191
$$ 982422 973426 965280 957068 948854 941247 934363 927979 922362 918200 915727 914269 912565 909373 904182
60832I04182o424o212n582o337q738j1023j1659j1114j0791j1161j1740j2181
$$ 904182 897758 891546 885964 879627 870889 859866 848207 837093 826302 815141 803401 791220
60820G91220j2408j2062j0748q729o726n176m213l982m333m433l401j370O16J732
$$ 791220 778812 766750 756002 747273 740547 735371 731158 727176 722843 718410 715009 713639 714255 715987
60806G15987K038K141K646L848N538P106Q011Q099P340N762L982L154L704M427
$$ 715987 718025 720166 722812 726660 732198 739304 747315 755414 762754 768516 772498 775652 779356 783783
60792G83783L785J941O44R59K046K503K118J646J401Q60l87j999l305m033m407
$$ 783783 787568 789509 790153 791112 793158 795661 797779 799425 800826 801686 801299 799300 795995 791962 787555
60777G87555m814n557o800q453j0039j0932j0857j0127r248q402p482o570o089
$$ 787555 782741 777184 770384 761931 751892 740960 730103 719976 710728 702326 694844 688274 682185
60764F82185o320o961p311o913o037n472n734o333o121m599k733k005k698l633
$$ 682185 675865 668904 661593 654680 648643 643171 637437 631104 624983 620384 617651 615646 612948 609315
60750F09315l611k561j166P6R76J378J398J659K665M075N123N661O177O779O895
$$ 609315 605704 603143 601977 602053 603029 604407 605805 607464 610129 614204 619327 624988 631165 637944 644839
60735F44839O245N453N143N018M574M343N411P561R097R139R147J0977J3875J4916
$$ 644839 651084 656537 661680 666698 671272 675615 681026 688587 697684 706823 715970 726947 740822 755738
60721G55738J2663R070P028P143P963Q564R478J1078J2434J2337J0836R214Q703
$$ 755738 768401 777471 784499 791642 799605 808169 817647 828725 841159 853496 864332 873546 882249
60708H82249R443J0562J1159J1297J1893J3388J4846J4835J3096J0948J0024J0839
$$ 882249 891692 902254 913413 924710 936603 949991 964837 979672 992768 1003716 1013740 1024579
60696A024579J2367J2772J0998Q056O209O298O508M753J656l07k80q9j473l917
$$ 1024579 1036946 1049718 1060716 1068772 1074981 1081279 1087787 1092540 1094196 1093889 1093609 1093520 1092047 1088130
60682A088130n933p156q276r790j1816j4437j7335j9536k0317k0012j9335j8451
$$ 1088130 1082197 1075041 1066765 1056975 1045159 1030722 1013387 993851 973534 953522 934187 915736
60670I15736j7295j6280j5861j5701j4948j3152j0488p534n341n113o965r246
$$ 915736 898441 882161 866300 850599 835651 822499 812011 804477 799136 794023 787058 777812
60658G77812r884q468o469n534n974o909p428p448p513p757p500o325n268n844
$$ 777812 767928 759460 752991 747457 741483 734574 727146 719698 712185 704428 696928 690603 685335 679491
60644F79491p896r564r773r453r537r154p081m130k604l551n727p147o837n271
$$ 679491 671595 662031 652258 642805 633268 624114 617033 612903 610299 606748 601021 593874 587037 581766
60630E81766l868l792m702n032m009k560j596n42J222K527J867M7o17M85J749
$$ 581766 577898 574106 569404 564372 560363 557803 556207 555665 556887 559414 561281 561328 560711 561196 562945
60615E62945K107K268K705K513J228K20R58K906M233L944K423O29m00P3J710L081
$$ 562945 565052 567320 570025 572538 573766 573986 574944 577850 582083 586027 588450 589079 588679 588752 590462 593543
60599E93543L102K167J291P94L87Jj99k28l8O96J955L021L528M345O402Q825R409
$$ 593543 596645 598812 600103 600897 601284 601285 601086 600858 600820 601516 603471 606492 610020 614365 620767 629592 639001
60582F39001P241L989K019J809J889R70o22j761k042j911j753j585j637k318l286
$$ 639001 646242 650231 652250 654059 655948 656918 656296 654535 652493 650582 648829 647244 645607 643289 640003
60567F40003l412k303j225j604l061l935l503k660k453k950l641m042l695k396
$$ 640003 636591 634288 633063 631459 628398 624463 620960 618300 615847 612897 609256 605214 601519 599123
60553E99123p18L93O53N44N37R34K122L785M205J983j381k472j26L080M335L766
$$ 599123 598405 598798 599451 599995 600532 601466 603588 607373 611578 613561 612180 609708 609582 612662 616997 620763
60537F20763K979K187P35p27q06L36J192J256J477K370L198L255K739K091J573
$$ 620763 623742 625929 626664 625937 625131 625467 626659 627915 629392 631762 634960 638215 640954 643045 644618
60522F44618J644K703M266N338N667N825O187O862Q418J1273J4389J6065J6362
$$ 644618 646262 648965 653231 658569 664236 670061 676248 683110 691528 702801 717190 733255 749617
60509G49617J7239J9896K3351K6323K8843L1018L1635K9418K4815J9248J3437
$$ 749617 766856 786752 810103 836426 865269 896287 927922 957340 982155 1001403 1014840
60498A014840P678K837m81l226o701j0271j1913j0992q933o968m677j348K640
$$ 1014840 1022518 1025355 1024874 1021648 1014947 1004676 992763 981771 972838 965870 961193 959845 962485
60485I62485O473R929J3105J6079J9453K4128K9707L4204L6537L8301M1540M5362
$$ 962485 968958 978887 991992 1008071 1027524 1051652 1081359 1115563 1152100 1190401 1231941 1277303
60473A277303M6593M3842L9098L4612K9813K2591J2807K925m678r837j3732j7007
$$ 1277303 1323896 1367738 1406836 1441448 1471261 1493852 1506659 1509584 1504906 1495069 1481337 1464330
60461A464330j9387k0587k0654j9537j7081j3758j0758q814p306n164k365K84
$$ 1464330 1444943 1424356 1403702 1384165 1367084 1353326 1342568 1333754 1326448 1321284 1318919 1319203
60449A319203K722N922J0201J4362J7386K0210K4585L0662L6993M2882M9307N7115
$$ 1319203 1321925 1327847 1338048 1352410 1369796 1390006 1414591 1445253 1482246 1525128 1574435 1631550
60437A631550O5429P2561P7736Q1202Q3139Q3047P9976P3091O2502M9825L7358
$$ 1631550 1696979 1769540 1847276 1928478 2011617 2094664 2174640 2247731 2310233 2360058 2397416
60426B397416K6393J6758Q192J231l724p371j0864j4858j9918k7024l6742m8374
$$ 2397416 2423809 2440567 2448759 2449990 2446266 2438895 2428031 2413173 2393255 2366231 2329489 2281115
60414B281115o0753p3180q4684r3262r7327r7567r5960r3093q8002q0571p2392
$$ 2281115 2220362 2147182 2062498 1969236 1871909 1774342 1678382 1585289 1497287 1416716 1344324
60403A344324o4919n8238n2300m7900m5335m3191l9662l4679k9806k6263k3875
$$ 1344324 1279405 1221167 1168867 1120967 1075632 1032441 992779 958100 928294 902031 878156
60392H78156k1760j9395j6922j4706j2751j0686q445o727o235o639o941o727o310
$$ 878156 856396 837001 820079 805373 792622 781936 773491 766764 760529 753890 746949 740222 733912
60379G33912n724m701l731l885n122n917n313m313m310n023n120m354l785m066
$$ 733912 728188 723487 719756 715871 710749 704832 699519 695206 690896 685873 680753 676399 672614 668548
60365F68548m519m219l265k695l293m630n332m538k976k157k497l006k860k338
$$ 668548 664029 659810 656545 653850 650557 645927 640595 636057 633081 630924 628427 625421 622561 620223
60351F20223j828r79M13J564J687J206J131J651K147K110J313l50k340l324k418
$$ 620223 618395 617416 617829 619393 621080 622286 623417 625068 627215 629325 630638 630288 627948 624624 622206
60336F22206k69J852L342L966L179J126m27J68K019K624J162p10j421j180o61
$$ 622206 621937 623789 627131 631097 634276 635402 634975 635143 637162 639786 640948 640238 638817 637637 636976
60321F36976K57J590K395J969R99N87P27O62L21M06J247K287K763K528K163K370
$$ 636976 637233 638823 641218 643187 644186 644773 645500 646162 646483 646889 648136 650423 653186 655714 657877 660247
60305F60247L115L485K709J229K62L95J231K272L234L535K573Q75m5M93J585K320
$$ 660247 663362 666847 669556 670785 671047 671442 672673 674945 678179 681714 684287 685162 685117 685610 687195 689515
60289F89515K993L972M463L667K448K454L803M905M616L431K418J929J705J400
$$ 689515 692508 696480 700943 704610 707058 709512 713315 718220 722836 726267 728685 730614 732319 733719
60275G33719O80o31k071k695k003m52J090J960J838R29K12P22K135K873K132J217
$$ 733719 734399 733768 731697 729002 726999 726547 727637 729597 731435 732364 732576 733298 735433 738306 740438 741655
60259G41655J914M033N690N891N616O132P438R074J1306J4489J7897K0443K2301
$$ 741655 743569 747602 753292 759183 764799 770931 778369 787443 798749 813238 831135 851578 873879
60246H73879K4692K8145L2076L6029L9924M2710M2226L7320K9225J9841R499k450
$$ 873879 898571 926716 958792 994821 1034745 1077455 1119681 1157001 1186226 1206067 1215566 1213116
60234A213116j5348k6835l4723l8491l9012l7627l5457l2889k9642k5704k2009
$$ 1213116 1197768 1170933 1136210 1097719 1058707 1021080 985623 952734 923092 897388 875379
60223H75379j9537j8101j6672j4728j2580j0653r244q664q792q702p683o332n688
$$ 875379 855842 837741 821069 806341 793761 783108 773864 765200 756408 747706 740023 733691 728003
60210G28003n605n242m792n262o455o890o020m994m711m564l717k263m62J686
$$ 728003 722398 717156 712364 707102 700647 693757 687737 682743 678032 673468 669751 667488 667026 668712
60196F68712L393L209J247l47l07j80j682l629l507j197R99J576J089N34L59R43
$$ 668712 672105 675314 676561 676214 675907 675727 674045 670416 666909 665712 666711 668287 669376 669910 670269 671212
60180F71212K311L242K437O41l8R42J994J973J583J722K132K379K632K812K444
$$ 671212 673523 676765 679202 679843 679805 680747 682741 684714 686297 688019 690151 692530 695162 697974 700418
60165G00418K004K809M636N194L279R12P41K560M177M674M765M622L595K128J736
$$ 700418 702422 705231 709867 715061 718340 719252 719993 722553 726730 731404 736169 740791 744386 746514 748250
60150G48250K658L288K676K035K842M604N668N395M419L300K097J094Q48J205
$$ 748250 750908 754196 756872 758907 761749 766353 772021 777416 781835 785135 787232 788326 789174 790379
60136G90379J175K14p60l31J582L425L754K855K175K450L068L243L027K749K237
$$ 790379 791554 791768 791008 790677 792259 795684 799438 802293 804468 806918 809986 813229 816256 819005 821242
60121H21242J207Pq29j413k083k443j776m89Jr20k197k560k043j409q39l1Q12
$$ 821242 822449 822456 821627 820214 818131 815688 813912 813423 813424 812504 810307 807747 805704 804295 803456 803425 804237
60104H04237J026N75K41O29J576K657L743M743N380N570N697O037O099N094L058
$$ 804237 805263 805838 806079 806708 808284 810941 814684 819427 824807 830377 836074 842111 848210 853304 856362
60089H56362J112L91J100K645M289N311N036L523K138K519M555O159N701M085
$$ 856362 857474 857865 858965 861610 865899 871210 876246 879769 881907 884426 888981 895140 900841 904926
60075I04926L556M808O390O909O531N866M547J944j399m079n408n763n547m790
$$ 904926 908482 913290 919680 926589 933120 938986 943533 945477 944078 939999 934591 928828 923281 918491
60061I18491l828l468l972m481l916k186j62J244J708J522J357J852L075M407
$$ 918491 914663 911195 907223 902742 898826 896640 896478 897722 899430 900952 902309 904161 907236 911643
60047I11643N127N171N166N746O880P880Q045P379O591O191N773M582K730J335
$$ 911643 916770 921941 927107 932853 939733 947613 955658 963037 969628 975819 981592 986174 988904 990239
60033I90239J136J491J227J19j006j462j287o35O34K267L162K343K51j635k531
$$ 990239 991375 992866 994093 994212 993206 991744 990457 989822 990456 992723 995885 998228 998479 996844 994313
60018I94313l030l899m947n611o031o650p087o424m769l608m181o163q283r598
$$ 994313 991283 987384 982437 976826 970795 964145 957058 950634 945865 942257 938076 931913 923630 914032
60004I14032r732q655o961n806n817o392o752p142q155r409r991r904r941j0195
$$ 914032 904300 895645 888684 882878 877061 870669 863917 856775 848620 839211 829220 819316 809375 799180
59990G99180r927q911p733o615n156l420k067j128l7Q56L85j222j913o76Q25Q66
$$ 799180 789253 780342 772609 765994 760838 757418 755351 754223 754186 755042 755427 754205 752292 751616 752441 753307
59974G53307M03J339L169L702K507J378J230P83j092l449m604m215l332l107m025
$$ 753307 753710 755049 758218 761920 764427 765805 767035 767818 766726 763277 758673 754458 751126 748019 743994
59959G43994n650o818o691n730m930m279l083j653j172j665j672n23N77N57K38
$$ 743994 738344 731526 724835 719105 714175 709896 706813 705160 703988 702323 700651 700128 700705 701262 701500
59944G01500Q56J993K309J641J130J658L155N031O426O471N192L767L180L118
$$ 701500 702356 704349 706658 708299 709429 711087 714242 719273 725699 732170 737362 741129 744309 747427
59930G47427K968L126M140N225N032L655K465K091J922J639J772K299K104N41
$$ 747427 750395 753521 757661 762886 767918 771573 774038 776129 778051 779690 781462 783761 785865 786406
59916G86406j377k191j639m59P97J911K384J631k05k102l081k978k381j848j265
$$ 786406 785029 782838 781199 780740 781537 783448 785832 787463 787258 785156 782075 779097 776716 774868 773603
59901G73603l3J915L571L761K582J328Q83Q80O68M12O72J414K162K752L144K729
$$ 773603 773570 775485 779056 782817 785399 786727 787610 788490 789158 789570 790242 791656 793818 796570 799714 802443
59885H02443Q25j965l810l565j995o00J54N75L01j430m032n417m449k495j527
$$ 802443 803268 801303 797493 793928 791933 791333 791487 792062 792363 790933 786901 781484 777035 774540 773013
59870G73013j508j040q1j75j723k824j792M51J734J470P55K87k47p88m98R11K501
$$ 773013 771505 770465 770384 770209 768486 765662 763870 764321 766055 767525 768280 768567 768320 767532 767034 767945 770446
59853G70446L439M025M788N224M371K405R72J653M345P194Q156O737M242K302
$$ 770446 773885 777910 782698 787922 792293 794698 795670 797323 801668 808862 817018 823755 827997 830299
59839H30299J473J455K156L673N342N910N056L958L771M244M425M154L898L552
$$ 830299 831772 833227 835383 839056 844398 850308 855364 859322 863093 867337 871762 875916 879814 883366
59825H83366K581J370J278K817M591M825L478K058J619J772J756J682K122K937
$$ 883366 885947 887317 888595 891412 896003 900828 904306 906364 907983 909755 911511 913193 915315 918252
59811I18252L108J862l45k114k389j557j159k246m034m677l518j921j405j630
$$ 918252 921360 923222 922877 920763 918374 916817 915658 913412 909378 904701 901183 899262 897857 896227
59797H96227j109M79J926K445K817M074O027P767Q931R813J0726J1842J3117J3676
$$ 896227 895118 895597 897523 899968 902785 906859 912886 920653 929584 939397 950123 961965 975082 988758
59783I88758J1991P586K168j829l572l823l164j541M06R81r21m605q432j1311
$$ 988758 1000749 1008335 1010503 1008674 1005102 1001279 998115 996574 996980 997961 997040 992435 984003 972692
59769I72692j3069j4112j5157j6682j8173j8420j6944j4660j2744j1489j0636
$$ 972692 959623 945511 930354 913672 895499 877079 860135 845475 832731 821242 810606
59758H10606j0197j0218j0238r780r104q741q423p242m934k457j070j275k582
$$ 810606 800409 790191 779953 770173 761069 752328 743905 736663 731729 729272 728202 726927 724345
59745G24345l997m558l871k395j098p45j423k568l255k799j467m81q49k176l024
$$ 724345 720348 715790 711919 709524 708426 707681 706258 703690 700435 697636 696169 695688 694839 692663 689639
59730F89639k587j616j501k690m277m983m316k853j550q42m67r3O6m42j474k170
$$ 689639 687052 685436 683935 681245 676968 671985 667669 664816 663266 662424 661957 661864 661930 661488 660014 657844
59714F57844j839p19L22O63L15l29q31r09o07j97J61O71J555K672L669M332M477
$$ 657844 656005 655286 655608 656271 656586 656257 655426 654517 653910 653713 653874 654545 656100 658772 662441 666773 671250
59697F71250L777K314J072J060J844J903Q64L47J800M374O100O642P403Q906R629
$$ 671250 675027 677341 678413 679473 681317 683220 684084 684431 686231 690605 696705 703347 710750 719656 729285
59682G29285Q073M908K259J448K068K825K671J464N3n68m14m41j172k016k339
$$ 729285 737358 742266 744525 745973 748041 750866 753537 755001 755054 754486 754072 753631 752459 750443 748104
59667G48104k404k646k717k150j390j274j733j937j533q75j77P22J683K237K286
$$ 748104 745700 743054 740337 738187 736797 735523 733790 731853 730320 729445 729268 729990 731673 733910 736196
59652G36196K171J982J512J007J129J938K566K316J532J027R78P93M3p46k89K169
$$ 736196 738367 740349 741861 742868 743997 745935 748501 750817 752349 753376 754354 755147 755190 754444 754155 756324
59636G56324N671Q052Q013O350M700L577K433J228P89J546K773L325K512L29k371
$$ 756324 761995 770047 778060 784410 789110 792687 795120 796348 797137 798683 801456 804781 807293 807622 805251
59621H05251l929l149q34Q69R77O08J003J724J567M75o24j429k620m537o371p041
$$ 805251 801322 798173 797339 798208 799185 799793 800796 802520 804087 804562 803938 802509 799889 795352 788981 781940
59605G81940o398n155l793k060J39J742J283j059l000k583n59P15M23O9J039K724
$$ 781940 775542 770387 766594 764534 764673 766415 767698 766639 763639 761056 760497 761212 761635 761704 762743 765467
59589G65467L608L216K276J620J603K033K185J292n44k318l190l224k919k650
$$ 765467 769075 772291 774567 776187 777790 779823 782008 783300 782756 780438 777248 774024 771105 768455
59575G68455k748l351l978l956l504l506l980l853k689j450r67p18n1N16K42m90
$$ 768455 765707 762356 758378 754422 750918 747412 743432 739579 736890 735440 734473 733755 733704 734220 734462 733972
59559G33972r40j329k165k918k729k088k368l772n019n079m211l232k719l000
$$ 733972 733032 731703 729538 726620 723891 721803 719435 715663 710644 705565 701354 698122 695403 692403
59545F92403m000m864m545k924q71P82J760J963J286p0j580k659k747j569K07
$$ 692403 688403 683539 678994 676070 675199 675981 677741 679704 680990 680920 679340 676681 673934 672365 672572
59530F72572J160O82j39k0P24R89Q13J016J248K19j889l023k059n78p59k418l437
$$ 672572 673732 674414 674275 674255 674979 675968 676781 677797 679045 679264 677375 674352 672293 671715 670956 668538 665101
59513F65101k677j254q90j810k682k201m10J556K684K679J552n48k777l669k649
$$ 665101 662424 661170 660280 658470 655788 653587 653177 654733 657417 660096 661648 661100 658323 654654 652005
59498F52005r86l45p04p40K5P32Q83J193K256L454L850L506L288L820N096O694
$$ 652005 651019 650674 649970 649230 649255 649987 650870 652063 654319 657773 661623 665129 668417 672237 677333 684027
59482F84027Q059Q914R556J0425J1488J2569J4035J6150J7798J7083J3629R130
$$ 684027 692086 701000 710556 720981 732469 745038 759073 775223 793021 810104 823733 832863
59470H32863N049J055l415p217q676q065p339p389p014n001k016L78J773K941
$$ 832863 837912 838967 835552 828335 819659 811594 804255 796866 789852 784851 782835 783213 784986 787927
59456G87927M126M439L331J757J034R43N1j987l659l766l303m017n723o632o178
$$ 787927 792053 796492 799823 801580 802614 803557 803608 801621 797962 794196 790893 786876 781153 774521 768343
59441G68343n944p157q656q377o119l815l298m630o465p396o882n356l673k389
$$ 768343 762399 755242 746586 738209 732090 728275 724977 720347 713882 706486 699604 694248 690575 688186
59427F88186j556j057r16j098j248q02O20K836N006O119N867M929M160L734L294
$$ 688186 686630 685573 684657 683559 682311 681509 682129 684965 689971 696090 701957 706886 711046 714780 718074
59412G18074K536J327k55j446j073Q65K502K194P53K81J128J763J621J981L471
$$ 718074 720610 721937 721682 720236 719163 720028 722530 724724 725477 725758 726886 728649 730270 732251 735722
59397G35722M681M414L734M247N633O464O606P058P877Q032P411P369Q783J0541
$$ 735722 740403 744817 748551 752798 758431 764895 771501 778559 786436 794468 801879 809248 818031 828572
59383H28572J0730Q770N905L674K246M12k725o301q446q341o880n209l590k009
$$ 828572 839302 848072 853977 857651 859897 860309 857584 851283 842837 834496 827616 822407 818817 816808
59369H16808r76r11j439j929k156j812l00K153L942L889L140M038P282J1302J4423
$$ 816808 815832 814921 813482 811553 809397 807585 807285 809438 813380 817269 820409 824447 831729 843031 857454
59354H57454J6601J8851K1869K5452K8676L0205K8922K4498J7436Q805J79o562
$$ 857454 874055 892906 914775 940227 968903 999108 1028030 1052528 1069964 1078769 1078948 1072386
59342A072386j0073j0284q134m787j155K190M876O086M148k173j1601k0565k6228
$$ 1072386 1062313 1052029 1043895 1039108 1037953 1040143 1045019 1051105 1055253 1053080 1041479 1020914 994686
59329I94686k8435k8209k5856k1822j8085j6524j6297j4658j0529n752k733k121
$$ 994686 966251 938042 912186 890364 872279 855755 839458 824800 814271 808519 805786 803665
59317H03665k919l549k634J4K817L890L245K621L099M079M705N060N453N710N611
$$ 803665 800746 797197 794563 794577 797394 801284 804529 807150 810249 814328 819033 824093 829546 835256 840867
59302H40867N212M452L382K845L774N628O759O710O828Q131R899J0993J1240J0849
$$ 840867 846079 850531 853913 856758 860532 866160 872919 879629 886457 894588 904487 915480 926720 937569
59288I37569R761Q575Q715J0582J2626J3514J4102J5771J7792J8212J6827J5328
$$ 937569 947330 955905 964620 975202 987828 1001342 1015444 1031215 1049007 1067219 1084046 1099374
59276A099374J4529J3342J0993Q602P568P369O068K712j525m556n419n058n273
$$ 1099374 1113903 1127245 1138238 1146840 1154408 1161777 1167845 1170557 1169032 1164476 1159057 1153999 1148726
59263A148726o870q969j0222j0467j0795j1959j3205j2989j0774p846o068n857
$$ 1148726 1141856 1132887 1122665 1112198 1101403 1089444 1076239 1063250 1052476 1044630 1038562 1032705
59251A032705n827m687k953k109k422k551j347R36L484N967Q319J0286J1849J3440
$$ 1032705 1026878 1022191 1019238 1017129 1014707 1012156 1010809 1011745 1015229 1021196 1029515 1039801 1051650 1065090
59237A065090J5225J6853J8166J9160J8814J5302Q329J00p166j3477j9325k3124
$$ 1065090 1080315 1097168 1115334 1134494 1153308 1168610 1176939 1177039 1169873 1156396 1137071 1113947
59225A113947k2883j9809j7505j7224j6533j3548j0049q704r063q526o261l930
$$ 1113947 1091064 1071255 1053750 1036526 1019993 1006445 996396 987692 978629 970103 963842 959912
59213I59912k858k481j841r96l13M71J739L348M943O339P166O809N256L519K503
$$ 959912 957054 954573 952732 951736 951423 951894 953633 956981 961924 968263 975429 982238 987494 991013 993516
59198I93516J864O17j423l544n322o991q479r011q167o709n727n484n767o724
$$ 993516 995380 995997 994574 991030 985708 978717 970238 961227 953060 946351 940624 935140 929373 922649
59184I22649q415r866r879q805q160q114o857l336O50K515K169J641J954K198
$$ 922649 914234 904368 894489 885684 877524 869410 862553 859217 859867 862382 864551 866192 868146 870344
59170H70344J734J392J861K506K669K854L506L782K873J654J519K040J559j77
$$ 870344 872078 873470 875331 877837 880506 883360 886866 890648 893521 895175 896694 898734 900293 900116
59156I00116j641j955j981k450k704k267k110k972l625k618r71r87k545k839m84
$$ 900116 898475 896520 894539 892089 889385 887118 885008 882036 878411 875793 874822 873835 871290 868451 867967
59141H67967K189K283K08j319j121l14L91J938M853P694Q636P648O111N015M504
$$ 867967 870156 872439 872647 871328 870207 869893 870284 872222 877075 884769 893405 901053 907164 912179 916683
59126I16683M554N019N235M579L448K907L305L895L803K839J322j36p01O6J476
$$ 916683 921237 926256 931491 936070 939518 942425 945730 949625 953428 956267 957589 957453 956752 956818 958294
59111I58294K296K289K478L508M582M648L942L521L654L610K923K021J565J955
$$ 958294 960590 962879 965357 968865 973447 978095 982037 985558 989212 992822 995745 997766 999331 1001286
59097A001286L440N902Q212Q681O729L708J520O98K28r84k950m691n156m210l016
$$ 1001286 1004726 1010628 1018840 1027521 1034250 1037958 1039478 1040176 1040404 1039420 1036470 1031779 1026623 1022413 1019397
59082A019397l113m762o435o462m872l137k360k469k981l562l687k776j165j67
$$ 1019397 1016284 1011522 1005087 998625 993753 990616 988256 985787 982806 979244 975557 972781 971616 971449
59068I71449n48j436j411k59J024J655J784J964K542L533M639N523O409Q105J0813
$$ 971449 970901 969465 968054 967795 968819 970474 972258 974222 976764 980297 984936 990459 996868 1004973 1015786
59053A015786J3238J3782J2424J0579R065P468N735N053O165P750P744N904L960
$$ 1015786 1029024 1042806 1055230 1065809 1074874 1082342 1088077 1093130 1099295 1107045 1114789 1120693 1124653
59040A124653L271L395L129K079P52k26n29k02K07j07j380k904l785l849l525
$$ 1124653 1127924 1131319 1134448 1136527 1137279 1137053 1136524 1136322 1136529 1136422 1135042 1132138 1128353 1124504 1120979
59025A120979l180l077l677n211o971p820p699p907r462j1791j3531j4186j4238
$$ 1120979 1117799 1114722 1111045 1105834 1098863 1091043 1083344 1075437 1065975 1054184 1040653 1026467 1012229
59012A012229j4113j3778j3174j2239j0701q722p469p950r275r396p871o424o232
$$ 1012229 998116 984338 971164 958925 948224 939502 932033 924083 914808 905412 897541 891117 884885
58999H84885o243n251m155m501n729n868m532l262k934k691j821j039j189k042
$$ 884885 878642 873391 869236 864735 859006 853138 848606 845344 842410 839719 837898 836859 835670 833628
58985H33628k930l509l204j289J646L472K878J183O92J926L455L961L434K758
$$ 833628 830698 827189 823985 822696 824342 827814 830692 831875 832567 834493 837948 841909 845343 848101
58971H48101K969M629P140R002R404R098R065R111Q780Q806J0180J2133J2768
$$ 848101 851070 855699 862839 871841 881245 890343 899408 908519 917299 926105 936285 948418 961186
58958I61186J1856J1359J2670J4662J5297J4139J2273J0590R131P744O355M600
$$ 961186 973042 984401 997071 1011733 1027030 1041169 1053442 1064032 1073163 1080907 1087262 1091862
58946A091862K151m44j863j382J91J256Q85o00k193k885j990M41L164M291K985
$$ 1091862 1094013 1093569 1091706 1090324 1090515 1091771 1092656 1092056 1089863 1086978 1084988 1085429 1088593 1092884 1095869
58931A095869L92j645k605l277m033m259l719l360m121n689p078p786p841p411
$$ 1095869 1096261 1094616 1092011 1088734 1084701 1080442 1076723 1073363 1069242 1063553 1056475 1048689 1040848 1033437
58917A033437o970p088p342o312l559o91O51J087K310M271N305M940M670N701
$$ 1033437 1026467 1019379 1012037 1005725 1002166 1001475 1002126 1003213 1005523 1009794 1015099 1020039 1024709 1030410
58903A030410P454Q843R607R730Q745O475L683J356n6m48qL07p20l041n255o603
$$ 1030410 1037864 1046707 1056314 1066044 1074789 1081264 1084947 1086303 1086247 1085799 1085791 1086098 1085378 1082337 1077082 1070479
58887A070479p959j0137j2280j2903j1811j0021q459p614p717q220p678n371k633
$$ 1070479 1062520 1052383 1040103 1027200 1015389 1005368 996909 989295 981578 973358 965680 960309 957676
58874I57676j518k389l939n150n994o273n359l492k169k452l629m203l718l016
$$ 957676 956158 953769 949830 944680 938686 932413 927054 923562 921393 918941 915312 911109 907391 904375
58860I04375k959l492l845l379k244j405j792l196m145l213m88K454M130M522
$$ 904375 901416 897924 894079 890700 888456 887051 885259 882063 877918 874705 874217 876671 880801 885323
58846H85323M679N233N839O230P024Q832J0975J2014J1484J0349R643R593J0165
$$ 885323 890002 895235 901074 907304 914328 923160 934135 946149 957633 967982 977625 987218 997383
58833I97383J1479J3175J4301J4457J4331J4553J4730J4385J3999J4267J4814
$$ 997383 1008862 1022037 1036338 1050795 1065126 1079679 1094409 1108794 1122793 1137060 1151874
58822A151874J4735J3986J3345J3210J3303J3318J3036J1978R777O792L673N68
$$ 1151874 1166609 1180595 1193940 1207150 1220453 1233771 1246807 1258785 1268562 1275354 1279027 1279595
58810A279595k584n408p571r526j1783j3706j4156j3147j1811j0873j0288j0230
$$ 1279595 1277011 1271603 1264032 1254506 1242723 1229017 1214861 1201714 1189903 1179030 1168742 1158512
58798A158512j1111j2493j3324j3510j4070j5414j6624j6873j6407j5714j4876
$$ 1158512 1147401 1134908 1121584 1108074 1094004 1078590 1061966 1045093 1028686 1012972 998096
58787I98096j4157j3968j3768j2306r727q008q318r208q720p139o139o139o172
$$ 998096 983939 969971 956203 943897 934170 926162 917844 908636 899916 892777 886638 880499 874327
58774H74327n929o128o837p008o004m464l281k608k226k108k231k371k413k514
$$ 874327 868398 862270 855433 848425 842421 837957 834676 832068 829842 827734 825503 823132 820719 818205
58760H18205k847l322l612l258j993k46J047J433J327J115N42m00q25j84M81k10
$$ 818205 815358 812036 808424 805166 803173 802927 803974 805407 806734 807849 808391 807991 807166 806982 807463 807253
58744H07253j810k454j392J96J026J113R22L41p89j939k403k086j292k52P94J500
$$ 807253 805443 802989 801597 801793 802819 803932 804854 805195 804406 802467 800064 797978 796686 796434 797228 798728
58728G98728J752J743J483P66j45l41P56K603M043M317L520K359J680J872K558
$$ 798728 800480 802223 803706 804472 804327 803986 804742 807345 811388 815705 819225 821584 823264 825136 827694
58713H27694L046K999K356J070n33j488j294j035k143m063m575k906j052j180
$$ 827694 830740 833739 836095 837165 836632 835144 833850 832815 830672 826609 822034 819128 818076 816896
58699H16896k874m050l656k294q07M64J310J660J888K337K682K568K622L892O194
$$ 816896 814022 809972 806316 804022 803215 803679 804989 806649 808537 810874 813556 816124 818746 822638 828832
58684H28832Q036Q335P651P382Q172R419J0059R698Q978Q764R092R216Q816Q584
$$ 828832 836868 845203 852854 860236 868408 877827 887886 897584 906562 915326 924418 933634 942450 951034
58670I51034R239J0476J1402J1676J1659J1674J1573J0980R674P956O714O598
$$ 951034 960273 970749 982151 993827 1005486 1017160 1028733 1039713 1049387 1057343 1064057 1070655
58658A070655P032O793N895N830P297Q746Q264O065L878K483J406N19J89j88j949
$$ 1070655 1077687 1084480 1090375 1096205 1103502 1112248 1120512 1126577 1130455 1132938 1134344 1134863 1135052 1134864 1132915
58643A132915m965p247p661p711r621j3448j7262j9620k0675k0994k0532j9304
$$ 1132915 1127950 1120703 1113042 1105331 1095710 1082262 1065000 1045380 1024705 1003711 983179 963875
58631I63875j8260j8552j9884k0404j8725j5663j3199j2007j1023r519q293q166
$$ 963875 945615 927063 907179 886775 868050 852387 839188 827181 816158 806639 798346 790180
58619G90180q527q395p939p704p136n353k796o15J107K877M019L332J575J127
$$ 790180 781653 773258 765319 757615 750479 745126 742330 741715 742822 745699 749718 753050 754625 755752
58605G55752K758M591M968M532M497M543L771K516J810J824J960J782J003o62
$$ 755752 758510 763101 768069 772601 777098 781641 785412 787928 789738 791562 793522 795304 796307 795645
58591G95645k724l814l323k368k176k335j811r75j221k850m594n194m580l478
$$ 795645 792921 789107 785784 783416 781240 778905 777094 776119 774898 772048 767454 762260 757680 754202
58577G54202k606k224k019j569j037r30j003l66Q97J413O43J39J331L093L106
$$ 754202 751596 749372 747353 745784 744747 743817 742814 742448 743345 744758 745401 745540 746871 749964 753070
58562G53070J152o51p08N52K103L691N307O428O516N695M629M067M487N585O219
$$ 753070 754222 753571 752863 753415 755518 759209 764516 770944 777460 783155 787784 791851 796338 801923 808142
58547H08142N533M099L302L581L968L398J924N41J76Q94J853K216K084K048J808
$$ 808142 813675 817774 821076 824657 828625 832023 833947 834488 834664 835558 837411 839627 841711 843759 845567
58532H45567L81j930l190k390r81m47L19L169P182R545R694R964J1658J3013J2183
$$ 845567 845948 844018 840828 838438 837457 837010 837329 840498 847680 857225 866919 876883 888541 901554 913737
58517I13737J0112Q968R197R701R956J0341J0894J1119J0913J0714J0832J1333
$$ 913737 923849 932817 942014 951715 961671 972012 982906 994025 1004938 1015652 1026484 1037817
58505A037817J2384J4103J6131J7826J8814J9143J9186J9523K0439K1191K0316
$$ 1037817 1050201 1064304 1080435 1098261 1117075 1136218 1155404 1174927 1195366 1216557 1236873
58494A236873J7214J3178J0303R379R134P573L898q65n032p875r827j1354j2317
$$ 1236873 1254087 1267265 1277568 1286947 1296081 1303654 1307552 1306687 1301655 1293780 1283953 1272599 1260282
58481A260282j2835j3738j5381j6658j6398j5334j5399j7110j8911j9231j7998
$$ 1260282 1247447 1233709 1218328 1201670 1185272 1169938 1154539 1137429 1118518 1099287 1081289
58470A081289j5958j3735j1988j1383j1683j1707j0648q759o522l982j395M61
$$ 1081289 1065331 1051596 1039608 1028225 1016542 1004835 994187 985428 978906 974924 973529 973990
58458I73990J194J281J231R16K17m48p54r01j007p82l09k86q97j160j82J405J986
$$ 973990 975184 976465 977696 978612 978829 978381 977627 976726 975719 974937 974628 974342 973445 972285 972103 973508 975494
58441I75494P16j690l629l910k788j797k052k846k681j562r73j422j470O0K317
$$ 975494 976210 974520 970891 966981 964193 962396 960344 957498 954817 953255 952282 950860 949390 949450 951767
58426I51767L791M367M865N417N608N642O126O982P585P769P882Q023Q045Q152
$$ 951767 955558 959925 964790 970207 975815 981457 987583 994565 1002150 1009919 1017801 1025824 1033869 1042021
58412A042021Q719R598J0111R715Q309O079L494J137p62k409l857m824n331n818
$$ 1042021 1050740 1060338 1070449 1080164 1088473 1094552 1098046 1099183 1098421 1096012 1092155 1087331 1082000 1076182
58398A076182o278n913m199j853j16N48O51R93K077L745N053N058L951K890K488
$$ 1076182 1069904 1063991 1059792 1057939 1057823 1058371 1059022 1060015 1062092 1065837 1070890 1075948 1079899 1082789 1085277
58383A085277K265J797J500J796K303K372J706K78j549k555j576P24K242K204
$$ 1085277 1087542 1089339 1090839 1092635 1094938 1097310 1099016 1099294 1097745 1095190 1093614 1094338 1096580 1098784
58369A098784K167L494N344O225O104N776N450N471P128J0811J4253J4627J1991
$$ 1098784 1100951 1104445 1109789 1116014 1122118 1127894 1133344 1138815 1145943 1156754 1171007 1185634 1197625
58356A197625Q934P032N457L077K76j766k537k508k594l306m080l880k782k203
$$ 1197625 1206559 1213591 1219048 1222125 1222401 1220635 1218098 1215590 1212996 1209690 1205610 1201730 1198948 1196745
58342A196745k872l637l180j848o32N76K194L522L854M087N274O308N319L003
$$ 1196745 1193873 1190236 1187056 1185208 1184576 1185152 1187346 1190868 1194722 1198809 1204083 1210391 1215710 1218713
58328A218713K153L710N438N029K714K78q42J9K566N111N692M335L133L625N200
$$ 1218713 1220866 1224576 1230014 1235043 1237757 1238035 1237193 1237212 1239778 1244889 1250581 1254916 1258049 1261674 1266874
58313A266874O475O969O934O655O522O864P284P133O870P875J0459J3169J4651
$$ 1266874 1273349 1280318 1287252 1293907 1300429 1307293 1314577 1321710 1328580 1336455 1346914 1360083 1374734
58300A374734J5135J5570J6149J6354J5791J4512J3067J2470J3446J5423J6917
$$ 1374734 1389869 1405439 1421588 1437942 1453733 1468245 1481312 1493782 1507228 1522651 1539568
58289A539568J7024J5971J4249J2240J0739J0699J2044J3586J4462J4898J5349
$$ 1539568 1556592 1572563 1586812 1599052 1609791 1620490 1632534 1646120 1660582 1675480 1690829
58278A690829J5786J6202J7006J8451K0159K1528K2199K2013K1058J9899J9240
$$ 1690829 1706615 1722817 1739823 1758274 1778433 1799961 1822160 1844173 1865231 1885130 1904370
58267A904370J9317J9947K0922K1827K1929K1013K0052K0155K1049K1467K0809
$$ 1904370 1923687 1943634 1964556 1986383 2008312 2029325 2049377 2069532 2090581 2112048 2132857
58256B132857J9583J8462J7798J7892J8871K0363K1893K3290K4275K4413K4190
$$ 2132857 2152440 2170902 2188700 2206592 2225463 2245826 2267719 2291009 2315284 2339697 2363887
58245B363887K5038K7353K9637L0854L2261L5136L8029L8672L7727L8049M0528
$$ 2363887 2388925 2416278 2445915 2476769 2509030 2544166 2582195 2620867 2658594 2696643 2737171
58234B737171M3271M4837M5820M7001M8307N0044N2913N6223N8088N7880N6915
$$ 2737171 2780442 2825279 2871099 2918100 2966407 3016451 3069364 3125587 3183675 3241555 3298470
58223C298470N6452N6797N8459O1995O6366O9683P2032P5458Q0578Q5406Q8347
$$ 3298470 3354922 3411719 3470178 3532173 3598539 3668222 3740254 3815712 3896290 3981696 4070043
58212D070043R0259R2665R5819R9431J03676J08558J13738J19528J26692J34917
$$ 4070043 4160302 4252967 4348786 4448217 4551893 4660451 4774189 4893717 5020409 5155326
58202E155326J43091J51252J60485J70814J81201J91700K03389K15955K27872
$$ 5155326 5298417 5449669 5610154 5780968 5962169 6153869 6357258 6573213 6801085
58193F801085K39314K52509K68505K85989L03795L22231L41476L61235L82436
$$ 6801085 7040399 7292908 7561413 7847402 8151197 8473428 8814904 9176139 9558575
58184I558575M06613M32959M58697M83009N07946N35040N63994N95208O30120
$$ 9558575 9965188 10398147 10856844 11339853 11847799 12382839 12946833 13542041 14172161
58175A4172161O68230P07129P46604P89387Q36953Q88222R43534J005898J076592
$$ 14172161 14840391 15547520 16294124 17083511 17920464 18808686 19752220 20758118 21834710
58166B1834710J153082J232933J316158J402145J488185J572864J657273J741426
$$ 21834710 22987792 24220725 25536883 26939028 28427213 30000077 31657350 33398776
58158C3398776J823865J906614J995704K094570K201531K316084K442490K584382
$$ 33398776 35222641 37129255 39124959 41219529 43421060 45737144 48179634 50764016
58150E0764016K741383K914965L112957L344613L616108L934904M313896M767042
$$ 50764016 53505399 56420364 59533321 62877934 66494042 70428946 74742842 79509884
58142G9509884N304546N934713O665016P498729Q437335R489386J0668344J1975779
$$ 79509884 84814430 90749143 97414159 104912888 113350223 122839609 133507953 145483732
58134A45483732J3393052J4894048J6459916J8079991J9743062K1403838K2891644
$$ 145483732 158876784 173770832 190230748 208310739 228053801 249457639 272349283
58127B72349283K3800038K3497535K1355792J7092034J0988924L843283l310958
$$ 272349283 296149321 319646856 341002648 358094682 369083606 372926889 369615931
58120C69615931r551110j4329989j7546214j9410599k0238150k0331040j9974550
$$ 369615931 360064821 345734832 328188618 308778019 288539869 268208829 248234279
58113B48234279j9424479j8824998j8157958j7322242j6270632j5055849j3766350
$$ 248234279 228809800 209984802 191826844 174504602 158233970 143178121 129411771
58106A29411771j2462204j1177956r948813q809558p780971o871151o081181n401346
$$ 129411771 116949567 105771611 95822798 87013240 79232269 72361118 66279937 60878591
58098F0878591m811545m294464l843290l452856l111885k809601k542707k310082
$$ 60878591 56067046 51772582 47929292 44476436 41364551 38554950 36012243 33702161
58090C3702161k106314j925436j765585j625292j499702j384602j279820j185178
$$ 33702161 31595847 29670411 27904826 26279534 24779832 23395230 22115410 20930232
58082B0930232j097342j014211r38033q70644q09549p52180p00163o55829o17906
$$ 20930232 19832890 18818679 17880646 17010002 16200453 15448273 14748110 14092281 13474375
58073A3474375n84113n54715n29989n07164m83539m60196m39199m19336l98067
$$ 13474375 12890262 12335547 11805558 11298394 10814855 10354659 9915460 9496124 9098057
58064I098057l75890l55355l37025l19424l02143k86323k72530k60127k48367
$$ 9098057 8722167 8366812 8029787 7710363 7408220 7121897 6849367 6589240 6340873
58055F340873k36774k25128k14025k04522j96523j88685j80471j72707j65615
$$ 6340873 6104099 5878971 5664946 5460424 5263901 5075216 4894745 4722038 4556423
58046D556423j58302j50917j45092j41185j37184j31637j25601j20430j15691
$$ 4556423 4398121 4247204 4102112 3960927 3823743 3692106 3566505 3446075 3330384
58037C330384j10688j06038j02212r8255r3500q8830q4782q0148p4086o7882o2980
$$ 3330384 3219696 3113658 3011446 2913191 2819691 2730861 2646079 2565931 2491845 2423963 2360983
58026B360983n8851n4488n0453m7682m5684m3616m1835m0674l9151l6668l4625
$$ 2360983 2302132 2247644 2197191 2149509 2103825 2060209 2018374 1977700 1938549 1901881 1867256
58015A867256l4376l4850l4294l3155l2899l2837l0881k7270k4960k5722k7776
$$ 1867256 1832880 1798030 1763736 1730581 1697682 1664845 1633964 1606694 1581734 1556012 1528236
58004A528236k8176k6229k3709k2494k2763k3273k2930k1862k0858k0074j9083
$$ 1528236 1500060 1473831 1450122 1427628 1404865 1381592 1358662 1336800 1315942 1295868 1276785
57993A276785j8098j8053j8958j9334j8081j6101j5168j5760j6789j7026j6107
$$ 1276785 1258687 1240634 1221676 1202342 1184261 1168160 1152992 1137232 1120443 1103417 1087310
57982A087310j4552j3437j3517j4253j4148j2545j0503r458r633j0232j0668j0968
$$ 1087310 1072758 1059321 1045804 1031551 1017403 1004858 994355 984897 975264 965032 954364 943396
57970I43396j1306j1626j1585j0909j0023j0014j1298j2717j2924j2257j2021
$$ 943396 932090 920464 908879 897970 887947 877933 866635 853918 840994 828737 816716
57959H16716j2249j1767j0407r362r115q767p856p024o387n117l439k958l902
$$ 816716 804467 792700 782293 772931 763816 755049 747193 740169 733782 728665 725226 722268 718366
57946G18366m049j899P90J468K84q15j297k115l229l313k071j052j662l404m491
$$ 718366 714317 712418 713208 714676 714960 714145 712848 710733 707504 704191 702120 701068 699406 696002 691511
57931F91511l656j241J082J800R97k6n66j137k109k845k839k699l125l751l777
$$ 691511 687855 686614 687696 689496 690493 690467 689901 688764 686655 683810 680971 678272 675147 671396 667619
57916F67619l157k413j934j970k574l034k352p50L48L78M49J365K185J746L61
$$ 667619 664462 662049 660115 658145 655571 652537 650185 649435 649783 650161 650610 651975 654160 655906 656267
57901F56267j063k418l653l825k375n35p8j190k705l742m045l557k730k565l358
$$ 656267 655204 652786 649133 645308 642933 642398 642320 641130 638425 634683 630638 627081 624351 621786 618428
57886F18428m259m875n953p425p328m472q46N77n11k157l106l150j549K171O094
$$ 618428 614169 609294 603341 595916 588588 584116 583270 583847 583336 581179 578073 574923 573374 575545 581639
57871E81639P339N853M474M797N230L972J849Q75J412K099J777M85j026k097k654
$$ 581639 588978 594831 599305 604102 609332 613304 615153 616028 617440 619539 621316 621801 620775 618678 616024
57856F16024l235m267n395n933n793n478n371n594o178o815o898o467o503p509
$$ 616024 612789 608522 603127 597194 591401 585923 580552 574958 568780 561965 555067 548600 542097 534588
57842E34588q504q363p413o602n911m895m045m063m340l824l043l450m993o066
$$ 534588 526084 517721 510308 503706 497795 492900 488855 484792 480452 476628 473585 470135 465142 459076
57828D59076n809m863l798k515j262o62m93N2Q04Q51L61M81J305J579P58l61j273
$$ 459076 453267 448404 444606 442091 440829 440167 439674 439726 440530 441381 441742 442223 443528 445107 445865 445504 444231
57811D44231k256k959k458j322j567l596n162m533k912k365k817k806j853n00
$$ 444231 441975 439016 436558 435236 433669 430073 424911 420378 417466 415101 412284 409478 407625 407125
57797D07125J116K981M130L471J557L01R04K945N293P086Q006Q308Q533Q770Q390
$$ 407125 408241 411222 415352 418823 420380 420681 421585 424530 429823 436909 444915 453223 461756 470526 478916
57782D78916O920M765K747J401R95J635K721K952J580n55j748j079P87K181J754
$$ 478916 485836 490601 493348 494749 495744 497379 500100 503052 504632 504077 502329 501250 502037 504218 505972
57767E05972l43k484l277l164l653n131o385o317n081l308j334L78J151J076J151
$$ 505972 505629 503145 499868 496704 493051 487920 481535 475218 470137 466829 465495 465873 467024 468100 469251
57752D69251J962K917L155K338L02k929o280q041p808p008o831o770n991m887
$$ 469251 471213 474130 477285 479623 479925 476996 470716 462675 454867 447859 441028 434258 428267 423380
57738D23380m258l899l127j972q71M6N42N9j157j702q94ml91j302j043M12J511
$$ 423380 419122 415223 412096 410124 409253 409299 409841 409900 408743 407041 406147 406143 405752 404450 403407 403819 405330
57721D05330J399N50m52j326j474m69Q78J265P52O73J603K631K788K168J393Q85
$$ 405330 406729 407279 406827 405501 404027 403558 404436 405701 406453 407126 408729 411360 414148 416316 417709 418594
57705D18594Q03R25N78o41k196l369m210m842m458k480l35k56k198l697l274k217
$$ 418594 419397 420322 420900 420259 418063 414694 410484 405642 401184 398704 398369 398113 395915 392218 388944 386727
57689C86727k247k995l017k068j050m35j9J76j28p68j300j714k244k589k089p04
$$ 386727 384480 381485 378468 376400 375350 374915 374896 375072 374944 374176 372876 371162 368918 366329 364240 363536
57673C63536P41J390J025J1j059j605j356n13M78J292J790J879J518P63k40j235
$$ 363536 364277 365667 366692 366703 365644 364039 362683 362170 362648 363940 365730 367609 369127 369890 369650 368415
57657C68415j776j469m52O37J276J453J311P56k55j328j992k313k677l018k758
$$ 368415 366639 365170 364718 365355 366631 368084 369395 370151 369896 368568 366576 364263 361586 358568 355810
57642C55810j689m41J73P4j57p7L21R33J605J892J317J77l92L60J954L441M518
$$ 355810 354121 353680 353853 353927 353770 353693 354014 354947 356552 358444 359761 359938 359546 359906 361860 365301 369819
57625C69819N251N320M589M070M942O605P268O840P527J0608J4293J6363J7666
$$ 369819 375070 380390 384979 389049 393991 400596 407864 414704 422231 432839 447132 463495 481161
57612D81161K0860K6335L1768L5860M0045M5557N0555N1688M7324L8014K4753
$$ 481161 502021 528356 560124 595984 636029 681586 732141 783829 831153 869167 893920
57601H93920Q594q348k3244l4397m1918m6413m7881m6284m2456l7739l3020k8538
$$ 893920 902514 894166 870922 836525 794607 748194 700313 654029 611573 573834 540814 512276
57589E12276k4385k0740j7736j5468j4081j3587j3441j2623j0390o944l318o62
$$ 512276 487891 467151 449415 433947 419866 406279 392838 380215 369825 362881 359563 358901
57577C58901L63j84j547k646k759k023j090k42Q08K142L042K583O92j746l723
$$ 358901 359264 359080 357533 354887 352128 350105 349015 348773 349581 351723 354765 357348 358040 356294 352571
57562C52571m748m735l777k286j043o99j189j867k281k597l138l685l606k763
$$ 352571 347823 343088 339311 337025 335982 335283 334094 332227 329946 327349 324211 320526 316920 314157
57548C14157j889j743k133k164j390k73N09O61J70q79k053k729k822k983l622
$$ 314157 312268 310525 308392 306228 304838 304565 305074 305735 305905 305026 302973 300244 297422 294439 290817
57533B90817m202m075l570l475l703l378k340j570j763k286k127j347q12q59j072
$$ 290817 286615 282540 278970 275495 271792 268414 266074 264504 262741 260455 258328 256981 256169 255310 254238
57518B54238j278j829k685l046k512j965k455l572l857k832j641j478k215l059
$$ 254238 252960 251131 248446 245400 242888 240923 238468 234896 231039 228207 226566 225088 222873 219814
57504B19814l666l903l293j667J35J135J467J838K121J667P77M83Q74R59M44J70
$$ 219814 216148 212245 208952 207285 207420 208555 210022 211860 213981 215648 216425 216908 217782 218741 219185 219355
57488B19355L08k66j930l058k157k56L65p45j871j666p14m01j152k112k158j094
$$ 219355 219663 219397 217467 214409 212252 211996 212361 211616 209745 208079 207365 206964 205812 203700 201542 200448
57472B00448ll8q22p97M54J382P63l22r4J257K111K020J903J984J466M97M95J816
$$ 200448 200445 200407 199585 198788 199242 200624 201387 201065 200971 202228 204339 206359 208262 210246 211712 212209 212704 214520
57454B14520K792K005K90o77o35n27q02j043r69p42n27l93n02q42r75o55m34j111
$$ 214520 217312 219317 219607 218930 218295 217768 216966 215923 214954 214212 213685 213292 212790 211948 210973 210318 209884 208773
57436B08773k546l621l410k200j135j035j667k172k091j672j245q40o62j264k545
$$ 208773 206227 202606 199196 196996 195861 194826 193159 190987 188896 187224 185979 185139 184477 183213 180668
57421A80668l166j949L38J651J146L5k41K75N23j58j513k765l155k619k038k378
$$ 180668 177502 175553 175891 177542 178688 178723 178482 178757 179280 179122 177609 174844 171689 169070 167032 164654
57405A64654l474m227l945k810j191N39J540J102r9n42m1j06j563l111l061j440
$$ 164654 161180 156953 153008 150198 149007 149546 151086 152188 152089 151547 151506 151400 149837 146726 143665 142225
57389A42225N88K329L450L263J503o21j446p51K43M70k73j747l386m238l744k490
$$ 142225 142813 145142 148592 151855 153358 152737 151291 150540 150783 151253 150980 149233 145847 141609 137865 135375
57373A35375j463q15j35N19Q07R75J531K184K164J438O70J64j63L2J186K643L025
$$ 135375 133912 133097 132962 133481 134288 135263 136794 138978 141142 142580 143250 143414 143251 143283 144469 147112 150137
57356A50137K054R08N03M43R5m19p83j101j260o67O37J436R19J17O06K076K575
$$ 150137 152191 153099 153602 154045 154140 153721 152938 151837 150577 149910 150547 151983 152902 153019 153625 155701 158276
57339A58276J214n57r59j42M79N27J006K284L022J897l71j870k028k062k777l210
$$ 158276 159490 158933 157974 157832 158311 158838 159844 162128 165150 167047 166676 164806 162778 160716 157939 154729
57323A54729k172j37J369J677J291P21Q6l59l13j90p62j916k573k180j479j366
$$ 154729 152557 152420 153789 155466 156757 157478 157564 157205 156892 156702 155940 154024 151451 149271 147792 146426
57307A46426j618j380n50J7l26j035q76N99K254K385O20j609k670k321j319j65
$$ 146426 144808 143428 142878 142895 142569 141534 140658 141257 143511 145896 146516 144907 142237 139916 138597 138432
57291A38432R56J441P46m88q86k25Q0j091k933l601k307J9J812K162J207k73j515
$$ 138432 139388 140829 141575 141087 140201 139976 140056 138965 136032 132431 130124 130143 131955 134117 135324 135051 133536
57274A33536k099j787n77Q39J214Q8j369j737j282j347k054k125j192n88j050
$$ 133536 131437 129650 129073 129912 131126 131214 129845 128108 126826 125479 123425 121300 120108 119520 118470
57259A18470j264n0J385J103m23q29P21K576L314L586M499N644N873N069L986
$$ 118470 117206 117156 118541 119644 119221 118392 119113 121689 125003 128589 133088 138732 144605 149674 153660
57244A53660K806J112q14j709o04K099M957O577O425N027L497K589K180J860J783
$$ 153660 156466 157578 156764 155055 154451 156550 161507 168084 174509 179536 183033 185622 187802 189662 191445
57229A91445K426L635M597M946N262O175P579R048J0418J1375J1206R818Q555
$$ 191445 193871 197506 202103 207049 212311 218486 226065 235113 245531 256906 268112 277930 286485
57216B86485Q845J0294J1242J1156J0990J1075J0332Q521P660R566J2856J4243
$$ 286485 295330 305624 316866 328022 339012 350087 360419 368940 376600 386166 399022 413265
57204D13265J2573R904Q523Q454Q521Q502R202J0954J3013J4382J4770J4618J4405
$$ 413265 425838 435742 444265 452719 461240 469742 478944 489898 502911 517293 532063 546681 561086
57191E61086J4067J3320J2534J2716J4195J5831J6185J5184J3927J3266J3385
$$ 561086 575153 588473 601007 613723 627918 643749 659934 675118 689045 702311 715696
57180G15696J4353J5979J7412J8079J8891K1168K4263K5795K4652K2402K1134
$$ 715696 730049 746028 763440 781519 800410 821578 845841 871636 896288 918690 939824
57169I39824K1112K1390K1481K1524K1672K2144K3180K4223K4191K3222K3025
$$ 939824 960936 982326 1003807 1025331 1047003 1069147 1092327 1116550 1140741 1163963 1186988
57158A186988K4517K6277K6642K6243K6845K8430K9343K8918K8116K7615K7022
$$ 1186988 1211505 1237782 1264424 1290667 1317512 1345942 1375285 1404203 1432319 1459934 1486956
57147A486956K6450K7051K9312L1959L3507L3907L3970L3935L3499L2772L2241
$$ 1486956 1513406 1540457 1569769 1601728 1635235 1669142 1703112 1737047 1770546 1803318 1835559
57136A835559L1964L1544L1019L1113L2349L4156L5336L5371L4908L4725L4688
$$ 1835559 1867523 1899067 1930086 1961199 1993548 2027704 2063040 2098411 2133319 2168044 2202732
57125B202732L4240L3532L3280L3548L3674L3550L3828L4486L4284L2530L0379
$$ 2202732 2236972 2270504 2303784 2337332 2371006 2404556 2438384 2472870 2507154 2539684 2570063
57114B570063K9394K9499K9357K8219K6436K4711K3841K4627K6878K8891K9055
$$ 2570063 2599457 2628956 2658313 2686532 2712968 2737679 2761520 2786147 2813025 2841916 2870971
57103B870971K7652K6092K4910K3670K2391K1589K1113K0336J9392J9083J9668
$$ 2870971 2898623 2924715 2949625 2973295 2995686 3017275 3038388 3058724 3078116 3097199 3116867
57092C116867K1018K3650K8100L3394L7755M0876M4006M7604N0536N1871N1980
$$ 3116867 3137885 3161535 3189635 3223029 3260784 3301660 3345666 3393270 3443806 3495677 3547657
57081C547657N1460N0335M8634M6189M1585L2969K0496O477p365k1322l6090n1709
$$ 3547657 3599117 3649452 3698086 3744275 3785860 3818829 3839325 3845802 3838437 3817115 3781025 3729316
57069C729316o8858q9144j12876j38244j63899j90756k19981k50968k82899l16774
$$ 3729316 3660458 3571314 3458438 3320194 3156295 2965539 2745558 2494590 2211691 1894917
57059A894917l54008l94199m36182B30216b97602n78510o30901o84434p40011
$$ 1894917 1540909 1146710 710528 230216 -297602 -876112 -1507013 -2191447 -2931458
57050b931458p98867q62190r31583j008866j096019j196288j314604j455831j623530
$$ -2931458 -3730325 -4592515 -5524098 -6532964 -7628983 -8825271 -10139875 -11595706 -13219236
57041a3219236j821658k056356k334647k662152l043313l482449l982440m543089
$$ -13219236 -15040894 -17097250 -19431897 -22094049 -25137362 -28619811 -32602251 -37145340
57033c7145340n162217n837112o562324p325511q105827q874714r596231j0226030
$$ -37145340 -42307557 -48144669 -54706993 -62032504 -70138331 -79013045 -88609276 -98835306
57025i8835306j0706486j0954010j0847144j0241262r024283p185259m842752
$$ -98835306 -109541792 -120495802 -131342946 -141584208 -150608491 -157793750 -162636502
57018a62636502k209977M73770K999866N217757P042149Q448943R459850J0118390
$$ -162636502 -164846479 -164372709 -161372843 -156155086 -149112937 -140663994 -131204144 -121085754
57010a21085754J0467452J0537678J0349212R923436R296470Q524013P673204
$$ -121085754 -110618302 -100080624 -89731412 -79807976 -70511506 -61987493 -54314289
57003e4314289O808122N979056N219117M545671L963952L471387L060315K718474
$$ -54314289 -47506167 -41527111 -36307994 -31762323 -27798371 -24326984 -21266669 -18548195
56995a8548195K430123K179796J956020J751889J563725J390384J232594J090994
$$ -18548195 -16118072 -13938276 -11982256 -10230367 -8666642 -7276258 -6043664 -4952670
56987d952670R64650Q51857P51453O62545N83915N14747a68428B36001L60881
$$ -4952670 -3988020 -3136163 -2384710 -1722165 -1138250 -623503 -168428 236001 596882
56978E96882L22476K88918K60628K37041K16836J99119J83340J68981J56294J46272
$$ 596882 919358 1208276 1468904 1705945 1922781 2121900 2305240 2474221 2630515 2776787
56968B776787J38876J32523J26558J22496J20976J18960J12403J00796Q6707P1545
$$ 2776787 2915663 3048186 3174744 3297240 3418216 3537176 3649579 3750375 3837082 3908627
56958C908627N4503L5364J5658l373k1721l9105n4494o7471p8273q6264r0436
$$ 3908627 3963130 3998494 4014152 4010779 3989058 3949953 3895459 3827988 3749715 3663451 3573015
56947C573015r1832r3360r6414r9555j01290j02349j04166j06804j09569j12197
$$ 3573015 3481183 3387823 3291409 3191854 3090564 2988215 2884049 2777245 2667676 2555479
56937B555479j14260j14650j12981j10597j08930j07680j05588j02315r8430r4217
$$ 2555479 2441219 2326569 2213588 2102991 1994061 1886381 1780793 1678478 1580048 1485831
56927A485831q9535q4504p9366p3980o8272o3014n9502n8315n8644n8781n7360
$$ 1485831 1396296 1311792 1232426 1158446 1090174 1027160 967658 909343 850699 791918 734558
56916G34558n4389n1038m8158m5445m2556m0267l9289l8494l5884l1362k6907
$$ 734558 680169 629131 580973 535528 492972 452705 413416 374922 339038 307676 280769
56905B80769k3841k1546j9267j7426j6332j5216j3499j1793j0677r749q757q402
$$ 280769 256928 235382 216115 198689 182357 167141 153642 141849 131172 121423 112666 104264
56893A04264r011r688r911j0765j3198j6119j7611G79a4788j3252j0554q412p363
$$ 104264 95253 85565 75654 64889 51691 35572 17961 779 -14788 -28040 -38594 -47006 -54369
56880e4369o357m115j199Q81K126M016P184J0734J3792a1216E738J5357J1501
$$ -54369 -60726 -64841 -66040 -65159 -63033 -59017 -51833 -41099 -27307 -11216 5738 21095 32596
56867C2596P086L307k87m424q569j1504E359g953j3764j4315j4367j3167j0630
$$ 32596 39682 42989 42702 38278 29709 18205 5359 -7953 -21717 -36032 -50399 -63566 -74196
56854g4196p573n105l857l817m494m976m345k518l09J609L211M351M516L994M170
$$ -74196 -81769 -86874 -90731 -94548 -99042 -104018 -108363 -110881 -111190 -109581 -106370 -102019 -97503 -93509 -89339
56839h9339N617O863O502N637O448Q798J0267R558P933P079g276A462J1545J5181
$$ -89339 -83722 -76859 -70357 -64720 -58272 -49474 -39207 -29649 -21716 -14637 -7276 1462 13007 28188
56825B8188J7625J7439J5335J2652R322M756k0k747k504o37J025J903K327K435
$$ 28188 45813 63252 78587 91239 100561 105317 105297 102550 100046 99409 100434 102337 104664 107099
56811A07099K230K371M021P561J1774J4880J6438J7853K0641K4562K7850K9038
$$ 107099 109329 111700 115721 123282 135056 149936 166374 184227 204868 229430 257280 286318
56799B86318K7902K4812K0008J4030Q234M091J755k00l172o668q556p506m682
$$ 286318 314220 339032 359040 373070 381304 385395 387150 386950 383778 377110 368554 361048 356366
56786C56366k274p09J611N746J0734J5091J8544K1421K3592K5188K7345L0840
$$ 356366 354092 353383 354994 360740 371474 386565 405109 426530 450122 475310 502655 533495
56774E33495L4527L6414L5651L2305K6044J6788O115l770j2191j9509k5123k8022
$$ 533495 568022 604436 640087 672392 698436 715224 721339 717569 705378 685869 660746 632724
56762F32724k8961k9642k9775k7531k3116j8984j5739j0952l554L613P812J0457
$$ 632724 603763 574121 544346 516815 493699 474715 458976 448024 444470 448083 455895 466352
56750D66352J4386J9131K1943K2240K1720K0732J7646J1811M431l713j2731k1375
$$ 466352 480738 499869 521812 544052 565772 586504 604150 615961 620392 616679 603948 582573
56738E82573k6868k7988k6449k4392k2286k0131j8654j7985j6619j3272q716m604
$$ 582573 555705 527717 501268 476876 454590 434459 415805 397820 381201 367929 359213 354609
56726C54609j466J049K992M607O961J0462J3242J2719Q625L074k209p194j1990
$$ 354609 353143 354192 357184 361791 368752 379214 392456 405175 413800 416874 414665 407471 395481
56713C95481j5783j8103j9743k1342k1979k0424j7335j4829j3985j3861j3209
$$ 395481 379698 361595 341852 320510 298531 278107 260772 245943 231958 218097 204888
56702B04888j2019j0848r583p843o132n492o064o819o888o366n658m826l981l619
$$ 204888 192869 182021 172438 164595 158463 152971 146907 140088 133200 126834 121176 116350 112369 108750
56688A08750l886m074l526k664k403k751k846k286j564j082n35L55J172J322Q29
$$ 108750 104864 100790 97264 94600 92197 89446 86600 84314 82750 81668 81133 81488 82660 83982 84811
56673H4811K08j20O0Q38J876K297J455j16j039m81R80J932J370n20k359k451k99
$$ 84811 85019 84899 84959 85797 87673 89970 91425 91309 90270 89789 90769 92701 94071 93551 91192 88741 88442
56656H8442K418L010O26k477l327j758m23j096k249j399J258L094K693J462J145
$$ 88442 90860 93870 94496 92019 88692 86934 86511 85415 83166 81767 83025 86119 88812 90274 91419
56641I1419J332M83j527l191l267j910j04J114J113K27j78Q82K498K796J434J62
$$ 91419 92751 93234 91707 88516 85249 83339 83235 84349 85462 85689 85511 86393 88891 91687 93121 93283
56625I3283L28R50J74j902l161k235k26Q59O63O37J794L211L260J748J94j1R53
$$ 93283 93611 94561 94735 92833 89672 87437 87211 88070 88733 89370 91164 94375 97635 99383 99577 99566 100519
56608A00519J912K092J537O42j68m57k10nl02p14o24l70q11j680j451N42K817
$$ 100519 102431 104523 106060 106702 106534 106077 105867 105862 105560 104846 104222 103852 103041 101361 99910 100452 103269
56591A03269L506K714K120K574L308L504L413L547L668L181K002N86m11l51R04
$$ 103269 106775 109489 111609 114183 117491 120995 124408 127955 131623 134804 136806 137392 136981 136630 137534
56576A37534K344K532J494R50J841K613J321j237k242n63J977L275L225K733K143
$$ 137534 139878 142410 143904 144854 146695 149308 150629 149392 147150 146587 148564 151839 155064 157797 159940
56561A59940J585J599K304K918K996L059L089J926n16k013r95O07j7k072k300
$$ 159940 161525 163124 165428 168346 171342 174401 177490 179416 178900 176887 175892 176499 176482 174410 172110
56546A72110l56L80j842m173l243K43L053L728L176K282J305Q99J608K518K074
$$ 172110 171754 172134 170292 166119 162876 163119 166172 169900 173076 175358 176663 177562 179170 181688 183762
56531A83762J56j888k971k954k021p12j34q02j623j282k12K57K88J305L487N288
$$ 183762 183918 182030 179059 176105 174084 173372 173238 172436 170813 169531 169319 169576 169864 171169 174656 179944
56515A79944N711N361M899M128L184L123M358N749O037N328M382L521K961L330
$$ 179944 185655 191016 195915 200043 203227 206350 210708 216457 222494 227822 232204 235725 238686 242016
56501B42016M880O966R035J1211J3100J3180J0748P718O802Q070Q918P621N425
$$ 242016 246896 253862 262897 274108 287208 300388 311136 318854 325656 333726 342644 350265 355690
56488C55690M431M631M226K420N72L11J360J870O27j760l770m480l956k808j880
$$ 355690 360121 364752 368978 371398 371970 372281 373641 375511 376138 374378 370608 366128 362172 359364 357484
56473C57484j890k821l899m677n732p555r183r099p378n750n322n384m960m346
$$ 357484 355594 352773 348874 344197 338465 330910 321727 312628 305250 299500 294178 288794 283834 279488
56459B79488m271m454m101l285k781k832l059l389m071m648l975j737O69J445
$$ 279488 275217 270763 266662 263377 260596 257764 254705 251316 247245 242597 238622 236885 237554 238999
56445B38999L37j197j737j391j219j524j351J04K172L425L426K937K470J609J01
$$ 238999 239336 238139 236402 235011 233792 232268 230917 231021 233193 236618 240044 242981 245451 247060 247161
56430B47161j266j617j184p84m86L20J641K470J849j30k408l661k985n84K080
$$ 247161 245895 244278 243094 242310 241824 242144 243785 246255 248104 247974 245566 241905 238920 238336 240416
56415B40416L320K784J692J265J325Q81j96q12o6J498K489K250J413R80J297J967
$$ 240416 243736 246520 248212 249477 250802 251683 251487 250675 250609 252107 254596 256846 258259 259239 260536 262503
56399B62503K408K342K012K012K625L298L122J980Q17N28J041J732K170K128J410
$$ 262503 264911 267253 269265 271277 273902 277200 280322 282302 283119 283647 284688 286420 288590 290718 292128
56384B92128K79m72m66k65l74k82N84J630J853J452J374J566J078j01p90n17k36
$$ 292128 292407 291935 291469 291204 290830 290548 291132 292762 294615 296067 297441 299007 300085 299984 299194 298677 298441
56367B98441p30j560k099k385k289j223N80J678J343O70O91N87p60k415k384n30
$$ 298441 297711 296151 294052 291667 289378 288155 288735 290413 291756 292426 293117 293704 292944 290529 288145 287615
56351B87615J314K026K335K942L197K291P75j20r3M5m78j544k319j985m18J620
$$ 287615 288929 290955 293290 296232 299429 301720 302495 302375 302282 302327 301849 300305 297986 296001 295583 297203
56335B97203K962K948J946R95Q28J205J400J368J926L282L993K556k10j661n21
$$ 297203 300165 303113 305059 306054 306882 308087 309487 310855 312781 316063 320056 322612 322402 320741 320220
56320C20220J780L422M346N163N407M424L123L045M091M610L641J748j86j625
$$ 320220 322000 325422 329768 334931 340338 344762 347885 350930 355021 359631 363272 365020 364834 363209
56306C63209j928o39J490K907K987K456K025J618J066O12L59J59J80P21J373J321
$$ 363209 361281 360642 362132 365039 368026 370482 372507 374125 375191 375803 376162 376321 376501 377222 378595 379916
56290C79916O54K53L17J48l47k77N43R79M18Q1J302L422M628M253L208K552K688
$$ 379916 380570 380823 381140 381288 380941 380664 381207 382186 382604 382685 383987 387409 392037 396290 399498 402050 404738
56273D04738L629M986N848N584M723M201L907K938J309L71J071K657L647L536
$$ 404738 408367 413353 419201 424785 429508 433709 437616 440554 441863 442234 443305 445962 449609 453145
56259D53145K824J774J29j709k182k23K888M307K808K95n21O07J617J225M85Q72
$$ 453145 455969 457743 457872 456163 453981 453758 456646 460953 463761 464056 463535 464142 465759 466984 467469 468341
56243D68341K135K887K612K015J710J562J327J227J692K836M345N641O110N509
$$ 468341 470476 473363 475975 477990 479700 481262 482589 483816 485508 488344 492689 498330 504440 509949
56229E09949M265L283L270M074M721M439L806M399O747R118R316P518O086O454
$$ 509949 514214 517497 520767 524841 529562 534001 537807 542206 548953 558071 567387 574905 580991 587445
56215E87445P614Q322R091J0715J2050J1406R639R653J2510J5901J7289J6852
$$ 587445 595059 603381 612472 623187 635237 646643 656282 665935 678445 694346 711635 728487
56203G28487J6221J5797J4985J4287J5136J7759K0756K3139K5318K7648K9378
$$ 728487 744708 760505 775490 789777 804913 822672 843428 866567 891885 919533 948911
56192I48911L0020L0609L2444L5256L7908M0399M3748M8050N2096N5079N7432
$$ 948911 978931 1009540 1041984 1077240 1115148 1155547 1199295 1247345 1299441 1354520 1411952
56181A411952N9453O0525O0374N9957N9968N9285N6133N0351M3345L6135K8568
$$ 1411952 1471405 1531930 1592304 1652261 1712229 1771514 1827647 1877998 1921343 1957478 1986046
56170A986046K0313J1475K165p550j6938k4799l0777l5897m1294m6796n1067n2936
$$ 1986046 2006359 2017834 2019999 2012449 1995511 1970712 1939935 1904038 1862744 1815948 1764881 1711945
56158A711945n2569n1406n0920n1125n0554m8070m4307m0841l8361l6395l4420
$$ 1711945 1659376 1607970 1557050 1505925 1455371 1407301 1362994 1322153 1283792 1247397 1212977
56147A212977l2247k9645k6649k4075k2608k1463j9255j6297j4447j4344j4304
$$ 1212977 1180730 1151085 1124436 1100361 1077753 1056290 1037035 1020738 1006291 991947 977643
56136I77643j2770j0471q992q309p096m866k484q73k63n62j473k239k015o95R74
$$ 977643 964873 954402 945410 937101 930005 925139 922655 921782 921519 920957 919484 917245 915230 914535 915509
56121I15509K048K077J460J248K112L340L575K771K480L691N437O442P072Q415
$$ 915509 917557 919634 921094 922342 924454 927794 931369 934140 936620 940311 945748 952190 959262 967677
56107I67677J0047J0388R096P821Q268J0490J3284J5452J6437J6452J6291J6651
$$ 967677 977724 988112 997208 1005029 1013297 1023787 1037071 1052523 1068960 1085412 1101703 1118354
56095A118354J7418J7965J8021J7963J8428K0059K3147K6975K9871L0836L0963
$$ 1118354 1135772 1153737 1171758 1189721 1208149 1228208 1251355 1278330 1308201 1339037 1370000
56084A370000L2385L5989M0939M6301N1984N7957O3727O9251P5534Q3563R2899
$$ 1370000 1402385 1438374 1479313 1525614 1577598 1635555 1699282 1768533 1844067 1927630 2020529
56073B020529J01841J08647J12273J12209J08324J00986R1177Q0337P0030O1433
$$ 2020529 2122370 2231017 2343290 2455499 2563823 2664809 2755986 2836323 2906353 2967786
56063B967786N4782M9158M2917L4784K4833J4366M516m817j4153k2878k9580l4175
$$ 2967786 3022568 3071726 3114643 3149427 3174260 3188626 3193142 3188325 3174172 3151294 3121714 3087539
56051C087539l8715m5372n4277o3978p3260q1520q7872r1057r0322q5818p8322
$$ 3087539 3048824 3003452 2949175 2885197 2811937 2730417 2642545 2551488 2461166 2375348 2297026
56040B297026o9166o0039n2009m4868l7903l0928k4065j7247j0915o516m965m960
$$ 2297026 2227860 2167821 2115812 2070944 2033041 2002113 1978048 1960801 1949886 1943370 1938405 1933445
56028A933445m154j896N38K284L942O080Q182R664J0785J1915J2892J3639J4554
$$ 1933445 1929291 1927395 1927933 1930217 1934159 1940239 1948421 1958085 1968870 1980785 1993677 2007316 2021870
56015B021870J5796J6951J7873J8984K0360K1483K2399K4019K6628K9098L0514
$$ 2021870 2037666 2054617 2072490 2091474 2111834 2133317 2155716 2179735 2206363 2235461 2265975
56004B265975L1667L3786L6435L7987L7989L7846L8976M1281M3792M6068M8374
$$ 2265975 2297642 2331428 2367863 2405850 2443839 2481685 2520661 2561942 2605734 2651802 2700176
55993B700176N0789N2904N4556N6360N8879O1402O2427O1700O0982O1996O4202
$$ 2700176 2750965 2803869 2858425 2914785 2973664 3035066 3097493 3159193 3220175 3282171 3346373
55982C346373O5660O5708O5501O6093O7332O8940P1289P4519P7963Q1201Q4765
$$ 3346373 3412033 3477741 3543242 3609335 3676667 3745607 3816896 3891415 3969378 4050579 4135344
55971D135344Q9150R3951R8691J03798J09896J16703J23346J29361J34723J39472
$$ 4135344 4224494 4318445 4417136 4520934 4630830 4747533 4870879 5000240 5134963 5274435
55961E274435J44199J50542J60226J73293J87738K01150K12784K24182K37732
$$ 5274435 5418634 5569176 5729402 5902695 6090433 6291583 6504367 6728549 6966281
55952F966281K54396K72953K91643L10112L29169L49227L70083L91886M14930
$$ 6966281 7220677 7493630 7785273 8095385 8424554 8773781 9143864 9535750 9950680
55943I950680M38487M61360M84029N08761N37015N67905N99916O32876O67588
$$ 9950680 10389167 10850527 11334556 11843317 12380332 12948237 13548153 14181029 14848617
55934A4848617P04733P45056P89480Q37996Q89533R43915J003040J069050J142159
$$ 14848617 15553350 16298406 17087886 17925882 18815415 19759330 20762370 21831420 22973579
55925B2973579J221172J304983J392299J480725J567730J652441J735782J819419
$$ 22973579 24194751 25499734 26892033 28372758 29940488 31592929 33328711 35148130
55917C5148130J905459J996538K095322K204271K326199K464098K619983K795160
$$ 35148130 37053589 39050127 41145449 43349720 45675919 48140017 50760000 53555160
55909E3555160K992571L217980L478763L783242M142086M568550N076205N677555
$$ 53555160 56547731 59765711 63244474 67027716 71169802 75738352 80814557 86492112
55901H6492112O384414P206093Q145918R203282J0382060J1694150J3151579J4756282
$$ 86492112 92876526 100082619 108228537 117431819 127813879 139508029 152659608 167415890
55893A67415890J6496735J8345900K0252117K2124289K3808264K5042407K5411858
$$ 167415890 183912625 202258525 222510642 244634931 268443195 293485602 318897460
55886C18897460K4377784K1446721J6427587R611897J743634o203493j3307547
$$ 318897460 343275244 364721965 381149552 390761449 392505083 386301590 372994043
55879C72994043j8913255k2729109k4807773k5436753k4993281k3829965k2226849
$$ 372994043 354080788 331351679 306543906 281107153 256113872 232283907 210057058
55872B10057058k0394073j8488118j6621532j4867368j3264165j1823628j0540714
$$ 210057058 189662985 171174867 154553335 139685967 126421802 114598174 104057460
55865A04057460r403128q396289p503991o709380n998111n360491m790500m283767
$$ 104057460 94654332 86258043 78754052 72044672 66046561 60686070 55895570 51611803
55857E1611803l836326l443511l099232k797042k531864k299432k094525j911624
$$ 51611803 47775477 44331966 41232734 38435692 35903828 33604396 31509871 29598247
55849B9598247j747478j601043j470606j352797j245067j147282j060033r82782
$$ 29598247 27850769 26249726 24779120 23426323 22181256 21033974 19973941 18991159
55841A8991159r14212q52897p96934p44566o95849o52060o12747n75189n37839
$$ 18991159 18076947 17224050 16427116 15682550 14986701 14334641 13721894 13146705 12608866
55832A2608866n02274m70180m40163m09529l78061l47834l19906k93164k66134
$$ 12608866 12106592 11636412 11196249 10786720 10408659 10060825 9740919 9447755 9181621
55823I181621k38254k09434j80001j51315j25411j03965q8518q1394q5098j00404
$$ 9181621 8943367 8733933 8553932 8402617 8277206 8173241 8084723 8003329 7918231 7817827
55813G817827j25717j58056j93717k28198k57086k77920k90855k97223k97971
$$ 7817827 7692110 7534054 7340337 7112139 6855053 6577133 6286278 5989055 5691084
55804E691084k93485k84228k71042k55157k38138k21453k05925j91671j78523
$$ 5691084 5397599 5113371 4842329 4587172 4349034 4127581 3921656 3729985 3551462
55795C551462j66168j54086j41956j30221j19856j11333j04124r7414r0971q5054
$$ 3551462 3385294 3231208 3089252 2959031 2839175 2727842 2623718 2526304 2435333 2350279
55785B350279p9648p4264o8617o3192n8763n5240n1605m7296m3282m0994m0430
$$ 2350279 2270631 2196367 2127750 2064558 2005795 1950555 1898950 1851654 1808372 1767378 1726948
55774A726948m0052l8682l6612l4581l2615l0499k8661k7660k7114k6112k4663
$$ 1726948 1686896 1648214 1611602 1577021 1544406 1513907 1485246 1457586 1430472 1404360 1379697
55763A379697k4006k5130k7296k8442k7156k4251k2119k2197k3356k3377k1748
$$ 1379697 1355691 1330561 1303265 1274823 1247667 1223416 1201297 1179100 1155744 1132367 1110619
55752A110619k0034j9447j9279j8310j6553j4759j3094j1488j0553j0785j1263
$$ 1110619 1090585 1071138 1051859 1033549 1016996 1002237 989143 977655 967102 956317 945054
55741I45054j0542q826p951q905j0354j0104p487l905j421j002j811k130j092
$$ 945054 934512 925686 917735 908830 898476 888372 880885 876980 875559 874557 872746 870616 869524
55728H69524P22K342L360L436J916j071l919n270n916p620j0479j3029j4776j6686
$$ 869524 870246 872588 875948 879384 881300 880229 876310 871040 865124 857504 847025 833996 819220 802534
55714H02534j9027k0664k1002k0835k0345j8275j4297j0631r489j0070r771p715
$$ 802534 783507 762843 741841 721006 700661 682386 668089 657458 647969 637899 628128 620413
55702F20413n308l902l602m147n284o179n977n110m843n350n642n471n799o924
$$ 620413 615105 611203 607601 603454 598170 591991 586014 580904 576061 570711 565069 559598 553799 546875
55688E46875p691p400p120q001r395r955r791j0020j0587j0162q296o267n297
$$ 546875 539184 531784 524664 516663 507268 497313 487522 477502 466915 456753 448457 442190 436893
55675D36893n114m909m707m904n151m823m245m324m951m963m055l621m953p274
$$ 436893 431779 426870 422163 417259 412108 407285 403040 398716 393765 388802 384747 381126 376173 368899
55661C68899q560q021o768o070n869n338m258l271l088l704m378m269l287k202
$$ 368899 360339 352318 345550 339480 333611 328273 324015 320744 317656 313952 309574 305305 302018 299816
55647B99816j629j185k48P49O55o41j826j929j548j808k896m383o039p431p484
$$ 299816 298187 297002 296754 297503 298158 297517 295691 293762 292214 290406 287510 283127 277088 269657 262173
55632B62173n667l202j845j700j530r84j065k149l058k795k006j816k060j686
$$ 262173 256506 253304 251459 249759 248229 247245 246180 244031 240973 238178 236172 234356 232296 230610
55618B30610l88R87J454O65j036k782l654l536l257l433l589k958j808j143j268
$$ 230610 230222 231209 232663 233328 232292 229510 225856 222320 219063 215630 212041 209083 207275 206132 204864
55603B04864j427r79k57jn12j490k315k311j227K95J146R82O93J245K422L178
$$ 204864 203437 202458 202201 202200 201688 200198 197883 195572 194345 194640 195786 196768 197461 198706 201128 204306
55587B04306L013K397J910J602J378J474K119L090L948M400M121K648J32k111
$$ 204306 207319 209716 211626 213228 214606 216080 218199 221289 225237 229637 233758 236406 236538 234427
55573B34427k760k268k535m499o868p902p552p037o851o329m993l301j932j198
$$ 234427 231667 229399 226864 222365 215497 207595 200043 193006 186155 179826 174833 171532 169600 168402
55559A68402j273k229l539m268m029l369k937k786k631k314j824j381j501k449
$$ 168402 167129 164900 161361 157093 153064 149695 146758 143972 141341 139027 137203 135822 134321 131872
55545A31872l519l660k816j876j172j36J230J723O43r33j505j102p94r44j047
$$ 131872 128353 124693 121877 120001 118829 118693 119923 121646 122289 121356 119851 118749 117955 117011 115964
55530A15964r46r88j123q69j54N90J105J273O81q57k471k905k000p31J47N90N49
$$ 115964 115018 114030 112907 112038 111884 112474 113579 114852 115533 114676 112205 109300 107300 106569 106716 107306 107855
55513A07855q5p64o42J79P72R08J302K050K119J032r2k7R58J812K127J969J025
$$ 107855 107770 107006 106364 106543 107315 108223 109525 111575 113694 114726 114634 114607 115565 117377 119504 121473 122498
55496A22498q26k556k781j509k06o1r09j911k666l305l905m160l747k878k246
$$ 122498 121672 119116 116335 114826 114620 114559 113650 111739 109073 105768 101863 97703 93956 91078 88832
55481H8832k106j852j034l86p86j449o47J402K061j95l164l461q52J665J798L45
$$ 88832 86726 84874 83840 83454 82668 81219 80572 81974 84035 83840 80676 77215 76363 78028 79826 80171
55465H0171m68L90K120L142K383K69j408j251P0N75o17k369l016k025j69J234
$$ 80171 79703 80093 82213 85355 87738 88007 86599 85348 85418 85993 85376 83007 79991 77966 77797 79031
55449G9031J228N8q99o98p5l36j375j940j643j397j724k038j894j575j048K89
$$ 79031 80259 80317 79418 78720 78645 78309 76934 74994 73351 71954 70230 68192 66298 64723 63675 63964
55433F3964K209L268K639J208J71l34m63J10J103J021q83k984l129j444J67O58
$$ 63964 66173 69441 72080 73288 73459 73125 72662 72772 73875 74896 74013 71029 67900 66456 66623 67281
55417F7281M82K9p91j418q21Q50K069J768M12q88j333m79J477L181L156J704O47
$$ 67281 67763 67792 67001 65583 64762 65612 67681 69449 69861 68973 67640 67161 68638 71819 74975 76679 77326
55400G7326Q44J155M95m32m73m2m29j576k031j118J7l3j045j585j021l95r23k094
$$ 77326 78170 79325 79820 79388 78915 78873 78444 76868 74837 73719 73736 73703 72658 71073 70052 69657 68734 66640
55382F6640k082j28K275L216K566J552P65m5o01j59Q39Q31n58j647j001O41J716
$$ 66640 64558 64430 66705 69921 72487 74039 74804 74759 74158 73999 74838 75669 75111 73464 72463 73104 74820
55365G4820J943J827J214r1r70r5J809K513J227n02j147j009j054j176o34N24
$$ 74820 76763 78590 79804 79713 78743 78648 80457 82970 84197 83695 82548 81539 80485 79309 78675 79199
55349G9199J451J647J389J132R33M66n57j908k807k663j766q74k46L55Q04N96
$$ 79199 80650 82297 83686 84818 85751 86217 85660 83752 80945 78282 76516 75642 75396 75751 76555 77151
55333G7151j57n75j88M81Q71J152J479J397O89P2O2q8j184k377k118o33J78m41
$$ 77151 76994 76419 76231 76712 77583 78735 80214 81611 82300 82372 82434 82346 81162 78785 76667 76034 76212 75771
55315G5771j024k68R69J150M32J06L30K7j127j976j588m91K35L17K32L69Q03J342
$$ 75771 74747 74479 75448 76598 77030 77136 77466 77493 76366 74390 72802 72311 72546 72863 73095 73464 74267 75609
55297G5609J475P29n03j092o32j93r21k363l088k675k007j625r33M89J810J992
$$ 75609 77084 77813 77310 76218 75586 75393 74472 72109 69021 66346 64339 62714 61781 62270 64080 66072
55281F6072J306Q99J134J271Q44L75L87M03l25j490j906j107M6N08K03l35p90
$$ 66072 67378 68277 69411 70682 71526 71901 72288 72691 72366 70876 68970 67863 67909 68417 68620 68285 67495
55264F7495q31K41K443M028K966k11k463j848K42J427J558J975K607K057L70n96
$$ 67495 66664 66905 69348 73376 76342 76131 73668 71820 72062 73489 75047 77022 79629 81686 82056 81460
55248H1460p8L31p11k131k218j240p10r73j104p33m55o00q60j106j348r90O49
$$ 81460 81382 81713 81002 78871 76653 75413 74703 73730 72626 71893 71438 70838 69978 68872 67524 66534 67183
55231F7183K868L796K558L39j018p98M74J866K508J962P12j27K7O31Q26M50o1
$$ 67183 70051 73847 76405 76744 75726 74928 75402 77268 79776 81738 82450 82323 82350 82981 83807 84257 84196
55214H4196l85o16j038j694k039j177J036L215L554J785n09j674j333J00K139
$$ 84196 83811 83195 82157 80463 78424 77247 78283 81498 85052 86837 86328 84654 83321 83421 85560
55199H5560L887M002K034n66j755j007M04J051N83m76j397j637j144l96Q5J63
$$ 85560 89447 93449 95483 94917 93162 92155 92559 93610 94193 93717 92320 90683 89539 89143 89228 89391
55183H9391j14p52j405j268j18Q77M39q81j196K0R33j74k359l048j220J545L159
$$ 89391 89277 88525 87120 85852 85734 86611 87050 86169 84973 84993 85926 85752 83393 80345 79125 80670 83829
55166H3829L079K077R33J05J9P38J441J126l6q14o79o22j538k493j736O42K327
$$ 83829 86908 88985 89918 90023 90042 90780 92221 93347 93311 92497 91818 91196 89658 87165 85429 86071 88398
55149H8398J532p65k122j600m84k57q34j161q12l68l57m26J33J305K172J944Q71
$$ 88398 89930 89165 87043 85443 84959 84702 83868 82707 81895 81527 81170 80744 80877 82182 84354 86298 87169
55132H7169j17m86l58N8O80J148R64L83M83J803L375L811K871J344j69j373j588
$$ 87169 87052 86566 86208 86266 86946 88094 89058 89441 89924 91727 95102 98913 101784 103128 102959 101586 99998
55115I9998k37J816K631J470l00j088r36p04l90N50J684J796O46n79q11j43Q62
$$ 99998 99761 101577 104208 105678 105378 104290 103354 102650 102260 102810 104494 106290 106936 106357 105546 105403 106265
55098A06265K019L169L674K890Q67j757m065m996l899j485M71J022R72J246J172
$$ 106265 108284 111453 115127 118017 118884 117127 113062 108066 104167 102682 103153 104175 105147 106393 107565
55083A07565l35k475l063j395Q10J692J212K96o57j593k154k202k219k308j568
$$ 107565 107230 104755 101692 100297 101107 102799 104011 104307 103650 102057 99903 97701 95482 93174 91606
55068I1606N17K796L718L233K217O95j738m053m269k111M05J531J466J051L51
$$ 91606 92123 94919 98637 101870 104087 104782 103044 98991 94722 92611 93016 94547 96013 97064 97415
55053I7415n11o48K19P80q7j349j108O04J825J304j06q44l04J022K079J802K6
$$ 97415 96904 96256 96475 97255 97168 95819 94711 95315 97140 98444 98338 97494 97190 98212 100291 102093 102119
55036A02119j836j954k16J492J568N12k7O25J671K137J884J370R57P19O27O50
$$ 102119 100283 98329 98113 99605 101173 101685 101658 102283 103954 106091 107975 109345 110302 111021 111648 112298
55020A12298O97N98K13l30o21k22Q83K059K320J211n48j614j521j252j797k571
$$ 112298 112995 113593 113806 113476 112855 112633 113516 115575 117895 119106 118558 116944 115423 114171 112374 109803
55004A09803k163o08L48l08j291p72J106K501K265J029Q9J48J062K036K067Q62
$$ 109803 107640 107032 107380 107072 105781 105009 106115 108616 110881 111910 111999 112147 113209 115245 117312 118174
54988A18174o79j461j408j104o29J71O26k01j752k126n53J439K013J229M13J76
$$ 118174 117495 116034 114626 113522 112893 113064 113690 113489 111737 109611 109058 110497 112510 113739 114152 114328
54972A14328P4j98l93l78k99p5N30J138Q40n63j848j526L34J963J846M72l37K40
$$ 114328 114402 114204 113811 113433 113134 113059 113589 114727 115567 115004 113156 111630 111964 113927 115773 116245 115908 116148
54954A16148J068P08n94j229k80J458K550K355J320K92k24m34r12j762k346k191
$$ 116148 117216 117924 117330 116101 115821 117279 119829 122184 123504 123796 123572 123138 122226 120464 118118 115927
54938A15927j738j542j172J37J954K860K317J311Q97J013J012N28m66j627k010
$$ 115927 114189 112647 111475 111612 113566 116426 118743 120054 120951 121964 122976 123504 123038 121411 119401
54923A19401r07Q44J460N87k13P4M44j50p69Q6J921K852K159O85p77j880j848
$$ 119401 118494 119338 120798 121385 121172 121246 121690 121540 120771 120857 122778 125630 127789 128474 127697 125817 123969
54906A23969r4K129K504O82r85l90J845L626L936L147J745J4j358j581p83k6j1
$$ 123969 123875 126004 128508 129190 128205 127815 129660 133286 137222 140369 142114 142128 140770 139189 138406 138380 138369
54889A38369j56O64K566M109L723J676K3J61J119J093P5l42L37O61m58k015k533
$$ 138369 138213 138877 141443 145552 149275 150951 150974 151135 152254 153347 153422 153080 153417 154078 153620 151605 149072
54872A49072k167j997j969j096O09J923K250K487L557N013N685N122L804K379
$$ 149072 146905 144908 142939 141843 142452 144375 146625 149112 152669 157682 163367 168489 172293 174672
54858A74672J329J099J977L732N733P408Q462Q753Q315P535P023P037P159O585
$$ 174672 176001 177100 179077 182809 188542 195950 204412 213165 221480 229015 236038 243075 250234 256819
54844B56819M756J729j862n048p015p641p593p612p705p305o181m875m069l871
$$ 256819 261575 263304 261442 256394 249379 241738 234145 226533 218828 211523 205342 200467 196398 192527
54830A92527l872l623k878j784j000j170j922j949p28N57O55L39J475M090N857
$$ 192527 188655 185032 182154 180370 179370 178200 176278 174329 173601 174158 174813 175152 176627 180717 186574
54815A86574N130L100K063K493L138L270L506M460N841P033P651P340N848L623
$$ 186574 191704 194804 196867 199360 202498 205768 209274 213734 219575 226608 234259 241599 247447 251070
54801B51070J624K42j031k634m287n562o517p379q087q584r017r264q813p587
$$ 251070 252694 252936 251905 249271 244984 239422 232905 225526 217439 208855 199838 190574 181761 174174
54787A74174o312n487m565k938j240o48j170j731j910k340l182l389k209m91L12
$$ 174174 167862 162375 157810 154872 153632 152984 151814 150083 148173 145833 142651 139262 137053 136562 136874
54772A36874j48j145k057k645k509j315M51J712J970J728J669J935K242K173J310
$$ 136874 136726 135581 133524 130879 128370 127055 127506 129218 131188 132916 134585 136520 138762 140935 142245
54757A42245l90k285l481l741l535l167k370r47O64J713J766R57n7l76M03J603
$$ 142245 141855 139570 136089 132348 128813 125646 123276 122329 122993 124706 126472 127429 127372 126996 127399 129002
54741A29002K132J852J673K123K506K016R94L87L71K96j73o62q10p39n71o9Q76
$$ 129002 131134 132986 134659 136782 139288 141304 142298 142685 143056 143352 143179 142517 141707 140968 140397 140328 141204
54724A41204J789K076J889K011K734L253K693J562J410K610L392J961p88j952
$$ 141204 142993 145069 146958 148969 151703 154956 157649 159211 160621 163231 166623 168584 167796 165844
54710A65844j30K933M706M737M328M241M017L289K668L055M615O658Q239Q945
$$ 165844 165714 168647 173353 178090 182418 186659 190676 193965 196633 199688 204303 210961 219200 228145
54696B28145R182R575R863Q973O464L379J093k20j327k593l704m559n554o926
$$ 228145 237327 246902 256765 265738 272202 275581 276674 276454 275127 272534 268830 264271 258717 251791
54682B51791q239q724p906o134m655m595n543n698m038j606p1J92l21j527l151
$$ 251791 243552 234828 226922 220788 216133 211538 205995 200297 196259 194653 194582 194774 194453 192926 189775
54667A89775l691j829J310L131K886K237K384K683K695L489N692P886Q362P365
$$ 189775 186084 184255 185565 188696 191582 193819 196203 198886 201581 205070 210762 218648 227010 234375
54653B34375O229N367M461L762L614L316J916k22j982l270m827o481p120o471
$$ 234375 240604 245971 250432 254194 257808 261124 263040 262818 260836 257566 252739 246258 239138 232667
54639B32667n643n547n826n728n193m662m436m481m425l707k255r40p00j344j864
$$ 232667 227024 221477 215651 209923 204730 200068 195632 191151 186726 183019 180764 179824 179124 177780 175916
54624A75916j897j940k200k244k020k172k892l331k750j506l64N04J136J087O8
$$ 175916 174019 172079 169879 167635 165615 163443 160551 157220 154470 152964 152600 153104 154240 155327 155395
54609A55395j106j226l08L64m4q83j098o78m46o81p08O8J277K093K236J955J311
$$ 155395 154289 153063 152755 153119 153075 152192 151094 150416 149970 149289 148581 148649 149926 152019 154255 156210 157521
54592A57521J17j294k005j593p13k00m8J59L72M01O36J443K113J593K98j50O35
$$ 157521 157638 156344 154339 152746 152033 151833 151785 151944 152316 152717 153353 154796 156909 158502 158800 158650 159285
54575A59285R93l02j954j851m9J417J369N45j98j051k023k131r56Q5m89j736j286
$$ 159285 160278 159976 158022 156171 156122 157539 158908 159453 159255 158204 156181 154050 153094 153179 152690 150954 149668
54558A49668J148K951K035k51r38N94K022J398m72j535j151j73Q45K123L393L562
$$ 149668 150816 153767 155802 155551 154613 155207 157229 158627 158155 156620 155469 155296 156141 158264 161657 165219
54542A65219K223O45L44J202J860J610R62L42o09k017l064l033k413k053j688
$$ 165219 167442 168087 168431 169633 171493 173103 174065 174407 173798 171781 168717 165684 163271 161218 159530
54527A59530m32J470K489J711oj161j144k72R21J840J890J023j65j250k302k950
$$ 159530 159098 160568 163057 164768 164762 163601 162457 162185 163106 164946 166836 167859 167694 166444 164142 161192
54511A61192k116L45K541K444N42o74J69K042L295L313K159Q9j887k219o90Q58
$$ 161192 159076 159421 161962 164406 164948 164274 164443 166485 169780 173093 175252 175341 173454 171235 170545 171403
54495A71403O84n66p51R48L064L618K079m03k162k273j064M84J686K395K477J814
$$ 171403 172087 171521 170770 171718 174782 178400 180479 180076 177914 175641 174577 175061 176747 179142 181619 183433
54479A83433Q60M20O01O52K54J44J006K446L684M425M512L521J591j00n93l38
$$ 183433 184293 184713 185314 185966 186220 186364 187370 189816 193500 197925 202437 205958 207549 207449 206856 206518
54463B06518k39k50J18N53M28P3L04J011J421J419J387J003l36k071k919k756
$$ 206518 206279 206029 206147 206700 207128 207201 207505 208516 209937 211356 212743 213746 213410 211339 208420 205664
54447B05664k613k742k308j226o54j021j135j73Q33N88n21j190j077p89n71j43
$$ 205664 203051 200309 198001 196775 196121 195100 193965 193792 194625 195213 194692 193502 192425 191636 191065 190922
54431A90922N31J215J891K633L237L491L469L128K195R24L05Q22J582J456N62
$$ 190922 191453 192668 194559 197192 200429 203920 207389 210517 212712 213636 213941 214763 216345 217801 218363
54416B18363j05j19J63N10J027J689K362L138L946M110L057J356K49J78M69N25
$$ 218363 218258 218139 218302 218812 219839 221528 223890 227028 230974 235084 238141 239497 239746 239924 240393 240918
54400B40918N76J055J772K092J690Q65J89r3k67o47r70o47L75J429J823J207n98
$$ 240918 241494 242549 244321 246413 248103 248968 249157 249064 248797 248150 247180 246533 246908 248337 250160 251367 250769
54383B50769l232n186m837k640j084j516k256j115J195K001N24j151j072K71J137
$$ 250769 247537 242351 237514 234874 233790 232274 230018 228903 230098 232099 232623 231472 230400 230671 231808
54368B31808P15m56j308j018K56J176N28j091j823r06O13J651K172K137R40j111
$$ 231808 232523 232067 230759 229741 229997 231173 231701 230610 228787 227881 228494 230145 232317 234454 235394 234283
54352B34283k188j215J70m12k698l890k206J081L347L276J578n8l12P35J578Q47
$$ 234283 232095 230880 231050 230638 227940 224050 221844 222925 226272 229548 231126 231068 230756 231491 233069 233916
54336B33916q53j313O51L525M705L447J489P77J282J539Q63J52L03O84%j576k345
$$ 233916 233063 231750 232401 235926 240631 244078 245567 246344 247626 249165 250028 250180 250483 251167 251167 249591 247246
54319B47246j372J76O27n3p04q62r87j044l46Q69J104l71k186k619j982j916k656
$$ 247246 245874 246050 246677 246624 245920 245058 244071 243027 242681 243550 244654 244283 242097 239478 237496 235580 232924
54302B32924k467k36K606L693K597J071O01P91M63n63j518k037k477k869k465
$$ 232924 230457 230221 232827 236520 239117 240188 240789 241580 242043 241480 239962 237925 235448 232579 230114
54287B30114r10P20R25l24j558j765j563j960k697k734k038j774k600l599l490
$$ 230114 229204 229924 230849 230525 228967 227202 225639 223679 220982 218248 216210 214436 211836 208237 204747
54272B04747k242q15K63J225K081K197J228r0o19q5P72J156R82O56M34K55M5l3
$$ 204747 202505 201690 201953 203178 205259 207456 208684 208594 207975 207890 208662 209818 210800 211456 211890 212145 212190 212157
54254B12157K75R60J678K063K041J694R60k89j819k999l353l052k640k387k083
$$ 212157 212432 213392 215070 217133 219174 220868 221828 221539 219720 216721 213368 210316 207676 205289 203206
54239B03206j428m37N88J345J647J393N75n28j313j270o33m50j578l614m946m101
$$ 203206 201778 201341 201929 203274 204921 206314 206889 206361 205048 203778 203145 202695 201117 197503 192557 188456
54223A88456j062K657N049M925K653j87k051k445j783n20J075K486L008K549J790
$$ 188456 187394 190051 195100 200025 202678 202491 200440 197995 196212 195692 196767 199253 202261 204810 206600
54208B06600J205M79p29k034k908l469l903l666k220l12O73O34Q13J637J859O27
$$ 206600 207805 208284 207555 205521 202613 199144 195241 191575 189355 189043 189716 190350 191163 192800 194659 195286
54192A95286p52l79J474K651K062J014J157K237K719J939O21m98j445k192k068
$$ 195286 194534 194155 195629 198280 200342 201356 202513 204750 207469 209408 210029 209531 208086 205894 203826
54177B03826p57O93Q00m41j483j308o54o80j200j142m02m0o60j608k022j843j322
$$ 203826 203069 203762 204562 204121 202638 201330 200676 199996 198796 197654 197252 197212 196552 194944 192922 191079 189757
54160A89757l86Q21J374M99j096j705n34J321K040Q85j172k406j828RJ579J805
$$ 189757 189371 190192 191566 192065 190969 189264 188730 190051 192091 192976 191804 189398 187570 187579 189158 190963
54144A90963R15q3n20m71k96j39J33O56J304J620J261N26J73M64P24K17q24j416
$$ 190963 191878 191795 191275 190804 190508 190369 190502 191158 192462 194082 195343 195869 196042 196506 197230 197447 196623 195207
54126A95207q93N65K156K807J703q20l061l409k077p48n64j157j628j563p58R53
$$ 195207 194314 194879 197035 199842 201545 200725 197664 194255 192178 191430 190866 189709 188081 186518 185760 186713
54110A86713K996L878K702M10j225j513j021k52P73J660J549L06r26j007r8P23
$$ 186713 189709 193587 196289 196699 195474 193961 192940 192688 193461 195121 196670 196976 196050 195043 194945 195668
54094A95668P60P8j028k243k970k602j295k1M75M61O66J214J585J495J194Q46
$$ 195668 196428 196506 195478 193235 190265 187663 186368 186347 186822 187283 187949 189163 190748 192243 193437 194283
54078A94283K05p84j605j923k160k582k163L74M264O702N852K984Q04L20M93M15
$$ 194283 194488 193704 192099 190176 188016 185434 183271 183645 187909 194611 200463 203447 204251 204571 205064 205479
54062B05479L61N50K84r53k283k235m96J669K732K261J093L75M84Q30P71M47L77
$$ 205479 205840 206390 206674 205721 203438 201203 200707 202376 205108 207369 208462 208837 209321 210151 210922 211369 211746
54045B11746M30j09j371k469k572j873j147p53m29J85J178K218K660K166J345
$$ 211746 212176 212067 210696 208227 205655 203782 202635 201882 201453 201638 202816 205034 207694 209860 211205
54030B11205J188J666J612M38q73j144o75n96j145j546j303n34P42K525M102M522
$$ 211205 212393 214059 215671 216109 215236 214092 213417 212821 211676 210130 208827 208293 209035 211560 215662 220184
54014B20184L938L421L287K777J679R96J308J628R03k19k89P40J508J339J139
$$ 220184 224122 227543 230830 233607 235286 236282 237590 239218 240121 239902 239613 240353 241861 243200 244339
53999B44339J899L197L762L041J673N72K9j65q2M27J272K034K586L347M436N054
$$ 244339 246238 249435 253197 256238 257911 258483 258512 258347 258265 258692 259964 261998 264584 267931 272367 277421
53983B77421M469L379L291M413N295M958M317M748O201P673Q828R967J0800J0613
$$ 277421 281890 285269 288560 292973 298268 303226 307543 312291 318492 326165 334993 344960 355760 366373
53969C66373R605Q959R286R838R604Q413O709M842K989J365J37o01p13k26L58
$$ 366373 375978 384937 394223 404061 413665 422078 428787 433629 436618 437983 438120 437519 436806 436580 436938
53954D36938M80L16N23R72M57j777m706o450o305n337m923n323n868o116o369
$$ 436938 437418 437734 438257 439229 439686 437909 433203 426753 420448 415111 410188 404865 398997 392881 386512
53939C86512p014p775p901p016n478l886k584j717j348j215q00n8K33o22k147
$$ 386512 379498 371723 363822 356806 351328 347442 344858 343141 341793 340578 339778 339720 339953 339331 337184
53924C37184l145l030k222j309n16P1M78J133K369L504L287J660K64O65K549M363
$$ 337184 334039 331009 328787 327478 326962 327033 327511 328644 331013 334517 337804 339464 339728 340393 342942 347305
53908C47305N235N653O540Q190R831R891P180K475j637l317l541m675p242r277
$$ 347305 352540 358193 364733 372923 382754 392645 399825 402300 400663 397346 393805 389130 381888 372611
53894C72611r031p031m940l362j776j4J312J759J563J144P61P85J606K981M050
$$ 372611 363580 356549 351609 348247 346471 346457 347769 349528 351091 352235 352996 353781 355387 358368 362418
53879C62418M314M265M595N288N993O927Q554J0363J0894R470P315O252O661P349
$$ 362418 366732 370997 375592 380880 386873 393800 402354 412717 423611 433081 440396 446648 453309 460658
53865D60658P363P098P393Q116Q243P172N494M379M420N334O612Q125R811J1047
$$ 460658 468021 475119 482512 490628 498871 506043 511537 515916 520336 525670 532282 540407 550218 561265
53851E61265J1031R957R151R453R900Q891O462M389L743L467K094N8r23m49r6
$$ 561265 572296 582253 591404 600857 610757 619648 626110 630499 634242 637709 639803 639861 638938 638489 638393
53836F38393j186l005m033m195m798o513q505r815j0595j1339j1656j0762q940
$$ 638393 637207 634202 630169 625974 621176 614663 606158 596343 585748 574409 562753 551991 543051
53823E43051p536p420q226r223j0069j0435r757q050o359n691n905o204o165n662
$$ 543051 535515 528095 519869 510646 500577 490142 480385 472335 465976 460285 454380 448176 442011 436349
53809D36349m424k694j787k736m660n774n895o384p521p815o566n359n703o651
$$ 436349 431925 429231 427444 424708 420048 414274 408379 401995 394474 386659 380093 374734 369031 362380
53795C62380o384n053m209l988l026j165j52r38k032j538K97J731J851J087r8
$$ 362380 355996 350943 346734 342746 339720 338555 338403 337465 335433 333895 334192 335923 337774 338861 338763
53780C38763j648l136l626k757j317l87j78m5N50J317J420N25n59o15M45J250
$$ 338763 337115 333979 330353 327596 326279 325892 325714 325669 326219 327536 328956 329481 328922 328307 328752 330002
53764C30002P01m02k51J446K879K457Q66l1L98J291K129L484N659P778Q928R315
$$ 330002 330703 330301 330050 331496 334375 336832 337698 337667 338065 339356 341485 344969 350628 358406 367334 376649
53748C76649R607R792R715J0155J2205J5698J9189K1468K2241K1400J8778J4831
$$ 376649 386256 396048 405763 415918 428123 443821 463010 484478 506719 528119 546897 561728
53736E61728J0481N988R40m206p771q748q110p377o734n654m553m365m879m841
$$ 561728 572209 578197 579137 574931 567160 558412 550302 542925 536191 530537 525984 521619 516740 511899
53722E11899l833k780k493k804l365m257n422o488p465q659r477q546n828l537
$$ 511899 508066 505286 502793 499989 496624 492367 486945 480457 472992 464333 454856 446310 440482 436945
53708D36945l704n558o622n979n000m853m968m480l843m023m902n619o011o566
$$ 436945 433241 427683 421061 415082 410082 405229 400261 395781 391938 387915 383013 377394 371383 364817
53694C64817p116o721n100l231k150j789j524j211j112j193j172j058j006p90
$$ 364817 357701 350980 345880 342649 340499 338710 337186 335975 334863 333670 332498 331440 330434 329644
53680C29644K6J389K675L260K943J951J006J010K026K915K594J440N97K34l44
$$ 329644 329670 331059 333734 336994 339937 341888 342894 343904 345930 348845 351439 352879 353476 353710 353366
53665C53366j075j134p26j200k646l055j133J417K023P00m31m17k80o89p93J35
$$ 353366 352291 351157 350431 349231 346585 343530 342397 343814 345837 346537 346106 345689 345409 344720 343927 344062
53649C44062J513K518L154L591L542L040K828L188L218K114N89N7Q32J956K615
$$ 344062 345575 348093 351247 354838 358380 361420 364248 367436 370654 372768 373357 373414 374246 376202 378817
53634C78817K929L389M058M532M356L456K261J318P83M69L43N73J044J208O13
$$ 378817 381746 385135 389193 393725 398081 401537 403798 405116 405899 406368 406711 407284 408328 409536 410149
53619D10149p29k451l904m202k849n14J400K116J907J253L10o31j167j472k070
$$ 410149 409420 406969 403065 398863 396014 395500 396900 399016 400923 402176 402486 401855 400688 399216 397146
53604C97146k551j766R1R14n91k710k791q94M37k16j523j730r65m41n52p39o62
$$ 397146 394595 392829 392920 393834 393243 390533 387742 386848 387285 387069 385546 383816 382851 382410 381858 381119 380457
53587C80457n03m34l96l58l36k35J17Q86K168L733M766M329K468N03j17P94K229
$$ 380457 379954 379520 379124 378766 378430 378195 378312 379198 381366 385099 389865 394194 396662 397165 397048 397842 400071
53570D00071L235L756M165M381L887K690J812K221L482M159L780L492M160M715
$$ 400071 403306 407062 411227 415608 419495 422185 423997 426218 429700 433859 437639 441131 445291 450006
53556D50006L515R87m41P96L770O522Q067Q371P461N611L848L158L335L396L021
$$ 450006 453521 454508 454067 454863 458633 465155 473222 481593 489054 494665 498513 501671 505006 508402 511423
53541E11423K790K982K917J930M67k92J33Q55N90q57k365k858k560k471k844k866
$$ 511423 514213 517195 520112 522042 522509 522217 522350 523205 523795 522938 520573 517715 515155 512684 509840 506974
53525E06974j941o34Jm61j674k928l390k513q16K87N9n89l97M28O67O8l22J31
$$ 506974 505033 504399 504400 503939 502265 499337 495947 493434 492618 492905 492964 492375 491978 492406 493073 493141 492819 492950
53507D92950O92M51l71q30l77Q45K271L113K815J792J209J638K437K941L595N154
$$ 492950 493642 494093 493722 492892 492515 493360 495631 498744 501559 503351 504560 506198 508635 511576 515171 520325
53491E20325P141Q054P100N118L657L646M966O847Q517R709J0586J1207J1320
$$ 520325 527466 535520 542620 547738 551395 555041 560007 566854 575371 585080 595666 606873 618193
53478F18193J0910J0541J0777J1638J3039J5292J8475K1619K3411K3554K2821
$$ 618193 629103 639644 650421 662059 675098 690390 708865 730484 753895 777449 800270
53467H00270K1892K0951K0244K0030K0058K0075K0875K3639K7905L1471L2875
$$ 800270 822162 843113 863357 883387 903445 923520 944395 968034 995939 1027410 1060285
53456A060285L2937L3161L3661L3642L2979L2359L2410L3652L6475M0112M2335
$$ 1060285 1093222 1126383 1160044 1193686 1226665 1259024 1291434 1325086 1361561 1401673 1444008
53445A444008M1635L9309L7975L8288L8574L7678L6444L6008L6124L5977L5486
$$ 1444008 1485643 1524952 1562927 1601215 1639789 1677467 1713911 1749919 1786043 1822020 1857506
53434A857506L4896L3939L2312L0428K8884K7671K6565K5863K5956K6383K6011
$$ 1857506 1892402 1926341 1958653 1989081 2017965 2045636 2072201 2098064 2124020 2150403 2176414
53423B176414K4205K1425J8753J7008J6106J5041J2794R478O292M091K416K32
$$ 2176414 2200619 2222044 2240797 2257805 2273911 2288952 2301746 2311224 2317516 2321607 2324023 2324255
53411B324255k743o004r152j2339j5778j9329k2532k4937k6377k7122k7765k8772
$$ 2324255 2321512 2315508 2306356 2294017 2278239 2258910 2236378 2211441 2185064 2157942 2130177 2101405
53399B101405l0226l1827l3072l3569l3490l3535l4087l4592l4287l3294l2258
$$ 2101405 2071179 2039352 2006280 1972711 1939221 1905686 1871599 1837007 1802720 1769426 1737168
53388A737168l1105k9113k6300k3661k1777k0185j8510j7110j5964j4085j0893
$$ 1737168 1706063 1676950 1650650 1626989 1605212 1585027 1566517 1549407 1533443 1519358 1508465
53377A508465p214m027j088K111N030O960Q561J0922J3684J5575J6653J8415K1554
$$ 1508465 1501251 1497224 1496136 1498247 1503277 1510237 1518798 1529720 1543404 1558979 1575632 1594047 1615601
53364A615601K5063K7830K9978L2234L4990L8234M1540M3947M4842M5117M6468
$$ 1615601 1640664 1668494 1698472 1730706 1765696 1803930 1845470 1889417 1934259 1979376 2025844
53353B025844M9382N2847N6102N9426O2878O5697O7556O9252P1335P3247P4690
$$ 2025844 2075226 2128073 2184175 2243601 2306479 2372176 2439732 2508984 2580319 2653566 2728256
53342B728256P6767Q0555Q5160Q8342Q8820Q7240Q5272Q4424Q5212Q6707Q7188
$$ 2728256 2805023 2885578 2970738 3059080 3147900 3235140 3320412 3404836 3490048 3576755 3663943
53331C663943Q5840Q3483Q1231P8969P5753P1160O5647O0092N5437N2115M9182
$$ 3663943 3749783 3833266 3914497 3993466 4069219 4140379 4206026 4266118 4321555 4373670 4422852
53320D422852M4817L8363L1135K4418J7679R865J501o026j2645j9499k6936l4351
$$ 4422852 4467669 4506032 4537167 4561585 4579264 4589129 4590630 4584604 4571959 4552460 4525524 4491173
53308D491173m1852n0325n9618o8232p5310q1508q7312r1851r4188r4772r4832
$$ 4491173 4449321 4398996 4339378 4271146 4195836 4114328 4027016 3935165 3840977 3746205 3651373
53297C651373r5085r5592r6116r6003r4474r1673q8760q6501q4531q2444q0666
$$ 3651373 3556288 3460696 3364580 3268577 3174103 3082430 2993670 2907169 2822638 2740194 2659528
53286B659528p9490p8079p5448p1823o8148o4779o1514n8533n6263n4490n2403
$$ 2659528 2580038 2501959 2426511 2354688 2286540 2221761 2160247 2101714 2045451 1990961 1938558
53275A938558m9439m5504m0686l5440l0783k7527k5386k3418k1124j8533j5585
$$ 1938558 1889119 1843615 1802929 1767489 1736706 1709179 1683793 1660375 1639251 1620718 1605133
53264A605133j2332r613q451q573q356o491l245J66K912N062P207R780J2555J4901
$$ 1605133 1592801 1583188 1574737 1566164 1557808 1551317 1548072 1548238 1551150 1556212 1563419 1573199 1585754 1600655
53250A600655J6712J8801K1779K4883K6744K7254K7730K9110L0916L2353L3572
$$ 1600655 1617367 1636168 1657947 1682830 1709574 1736828 1764558 1793668 1824584 1856937 1890509
53239A890509L5071L6575L7405L7743L8593M0332M1948M2130M0840L9294L8385
$$ 1890509 1925580 1962155 1999560 2037303 2075896 2116228 2158176 2200306 2241146 2280440 2318825
53228B318825L7499L5293L1561K7700K5067K3307K0846J6813J1914P363L546j20
$$ 2318825 2356324 2391617 2423178 2450878 2475945 2499252 2520098 2536911 2548825 2556188 2559734 2559614
53216B559614m330r141j3958j8145k1633k4792k7763l0371l2881l6114m0289m4229
$$ 2559614 2555284 2546143 2532185 2514040 2492407 2467615 2439852 2409481 2376600 2340486 2300197 2255968
53204B255968m6537m7206m7318m7560m7982m8892n0679n2844n4427n5449n6597
$$ 2255968 2209431 2162225 2114907 2067347 2019365 1970473 1919794 1866950 1812523 1757074 1700477
53193A700477n7306n5824n1895m7808m5727m5147m4224m2617m1512m1435m1565
$$ 1700477 1643171 1587347 1535452 1487644 1441917 1396770 1352546 1309929 1268417 1226982 1185417
53182A185417m1080l9976l8591l7244l6252l5462l3960l1145k7846k5431k3949
$$ 1185417 1144337 1104361 1065770 1028526 992274 956812 922852 891707 863861 838430 814481
53171H14481k2244j9855j7765j6955j7121j7182j6443j5064j3747j3100j2922
$$ 814481 792237 772382 754617 737662 720541 703359 686916 671852 658105 645005 632083
53160F32083j2324j1004r965j0163j0861j0415q642p161p253q545j0032j1165
$$ 632083 619759 608755 598790 588627 577766 567351 558709 551548 544295 535750 525718 514553
53148E14553j1418j0034p129m275l025l284l877m260m869n964o895o726n281l443
$$ 514553 503135 493101 485972 481697 478672 475388 471511 467251 462382 456418 449523 442797 437516 434073
53134D34073k492k958m246n481o423p057o742m948k728k058l183l923k564l95
$$ 434073 431581 428623 424377 418896 412473 405416 398674 393726 390998 388940 385757 381834 379270 378875
53120C78875j2j816l609l591k306j352j319j633j735j595j404j321j496j886j979
$$ 378875 378863 377047 373438 369847 367541 366189 364870 363237 361502 359907 358503 357182 355686 353800 351821
53105C51821j147M69J760J741P71J19K72L61m08j485j858j588j479j665j639j512
$$ 351821 350674 351143 352903 354644 355415 355534 355806 356167 355759 354274 352416 350828 349349 347684 346045 344533
53089C44533j858k285j544M76K188K386J652Q92k37k182l771l257q10J418J720
$$ 344533 342675 340390 338846 339322 341510 343896 345548 346440 346203 344021 340250 336993 336183 337601 339321
53074C39321L79j222k040j805q10K77P94N11k95j085j231m40P86J537J617J680
$$ 339321 339700 338478 336438 334633 333823 334100 334894 335405 335110 334025 332794 332354 333140 334677 336294 337974
53058C37974J942J614K39j193j427o32K4p1p93k073l661m452l505j615o01r41
$$ 337974 339916 341530 341769 340576 339149 338517 338541 338470 337677 335604 331943 327491 323986 322371 321770 320829
53042C20829j366j030o77j156j874j656m82M39L9j596l370m003l039j284r2j35
$$ 320829 319463 318433 317756 316600 314726 313070 312588 313027 313066 311470 308100 304097 301058 299774 299682 299547
53026B99547r29j451r53N12J951K084P00q85j330q70p56j409k114k395k610k988
$$ 299547 298618 297167 296214 296726 298677 300761 301461 300576 299246 298376 297620 296211 294097 291702 289092 286104
53010B86104l018k166n79J077J942J291o19k052j239J487L821M046K573P56p68
$$ 286104 283086 280920 280341 281418 283360 284651 284032 281980 280741 282228 286049 290095 292668 293424 292656
52995B92656j974k610k318j219J20J144J516J201M59n58j931l222l116r51J635
$$ 292656 290682 288072 285754 284535 284655 285799 287315 288516 288975 288417 286486 283264 280148 279197 280832
52980B80832K022j69k529k908j650k14R05J879K353J913J022L02n39j977l321
$$ 280832 282854 282685 280156 277248 275598 275384 276289 278168 280521 282434 283456 283758 283219 281242 277921
52965B77921l256j629J92P19m10k338l659l387j751J49J638K846L688L392J694
$$ 277921 274665 273036 273228 273947 273537 271199 267540 264153 262402 262551 264189 267035 270723 274115 275809
52950B75809l40j397j284n67K34M94m93k254k838j060J628K822K123J016L15m27
$$ 275809 275469 274072 272788 272221 272455 272949 272456 270202 267364 266304 267932 270754 272877 273893 274208 273781
52934B73781j139q11O26J588Q82o71j445r59R8J099J851K200J943J084j59j431
$$ 273781 272642 271831 272457 274045 274927 274256 272811 271852 271950 273049 274900 277100 279043 280127 279968 278537
52918B78537k175j832m17J333K463K427J298k16j050n72P49J796J883J078k79
$$ 278537 276362 274530 274113 275446 277909 280336 281634 281418 280368 279796 280545 282341 284224 285302 285023
52903B85023j722k433j685K00J897K412J925J195O46L09O0l93j343k456k745j657
$$ 285023 283301 280868 279183 279383 281280 283692 285617 286812 287458 287767 287827 287434 286091 283635 280890 279233
52887B79233R3J169R86J6j042j857k254k002j123j35L25R3n23j275k168l039l333
$$ 279233 279326 280495 281481 281497 280455 278598 276344 274342 273219 273084 273409 273502 272979 271704 269536 266497 263164
52870B63164k607j154K24J038J411J578J442O94o82k054k320q64J356K246Q09
$$ 263164 260557 259403 259627 260665 262076 263654 265096 265790 265108 263054 260734 259870 261226 263472 264281
52855B64281j470k310j390l10QL58J372K216J978J098M39l0m86k92Q40J587M99
$$ 264281 262811 260501 259111 258801 258809 259167 260539 262755 264733 265831 266270 266240 265754 265462 266302 267889 268388
52838B68388j636k586j674m36j52j85O95K420L753L691K388R92O61J366J844J176
$$ 268388 266752 264166 262492 262056 261904 261719 262414 264834 268587 272278 274666 275658 276319 277685 279529 280705
52822B80705O5k28K63L98l27j338k129k645k489j150P12J468N47p25q96r5O47
$$ 280705 280770 280542 280805 281203 280876 279538 277409 274764 272275 271125 271837 273305 273852 273127 272231 272136 272783
52805B72783R55J254J843K503K842K696K311K160K238J730O7j926k800k403j944
$$ 272783 273738 274992 276835 279338 282180 284876 287187 289347 291585 293315 293382 291456 288656 286253 284309
52790B84309k068j946q46N48J004K48j009j900j797n67R80J502N54q59j535j336
$$ 284309 282241 280295 279449 279997 281001 281249 280240 278340 276543 275976 276956 278458 279012 278153 276618 275282
52774B75282r02p80j260k327l255k943j292L23O43L2k40K71R07J045P65M78L72
$$ 275282 274380 273600 272340 270013 266758 263815 262523 262846 263489 263521 263281 263552 264459 265504 266269 266747 267119
52757B67119K54k59j169j766j315j77M13j09r75j137l53J025K441L045K165M51
$$ 267119 267373 267114 265945 264179 262864 262687 263100 262991 262016 260879 260526 261551 263992 267037 269202 269653
52741B69653l51N08J717J586L5j799k931k828j337N06O24j810m793n652m259k751
$$ 269653 269302 269810 271527 273113 273148 271349 268418 265590 264253 264759 265383 263573 258780 253128 248869 246118
52725B46118k460k663k287j214K17J669K407J765L41m17p5M45O25J004J670J599
$$ 246118 243658 240995 238708 237494 237711 239380 241787 243552 243893 243476 243401 243846 244471 245475 247145 248744
52709B48744N04p0J140K902K995J302k18m55k87n86q18m16k17j186k578k708j320
$$ 248744 249248 249178 250318 253220 256215 257517 257299 256844 256557 255971 255153 254737 254520 253334 250756 248048 246728
52692B46728J13N08M77J081K257L031K737J485j06j148r97j4O23L89R0M89R20
$$ 246728 246841 247349 247826 248907 251164 254195 256932 258417 258311 257163 256166 256152 256775 257164 257254 257743 258663
52675B58663L23r17j390p99k89m83m91N41J946K403J761J238J947L526M322L052
$$ 258663 258986 258069 256679 255880 255591 255108 254617 255158 257104 259507 261268 262506 264453 267979 272301 275353
52659B75353M26j347j184m44p88j559r84N43P28q89j881o34J028N70j586k960
$$ 275353 275779 274432 273248 272804 272016 270457 269473 270016 270744 269855 267974 267340 268368 268938 267352 264392
52643B64392k494j270m02q9l72j274k089j872o83N67J258J302O51m30r90l85O79
$$ 264392 261898 260628 260226 260137 259765 258491 256402 254530 253847 254414 255672 256974 257625 257195 256205 255820 256499
52626B56499J072Q54R29J538K215K946L987M789M428L139K203K084J804M21j721
$$ 256499 257571 258425 259354 260892 263107 266053 270040 274829 279257 282396 284599 286683 288487 288908 287187
52611B87187l390l550k075j17N64o43k276k510j361k76K2MM7M3K43J119K327L037
$$ 287187 283797 280247 278172 278055 278619 277976 275700 273190 271829 271553 271575 271579 271626 271669 271912 273031 275358 278395
52593B78395L269L720M265M073L324L292M297M887L724J243j091k325k436k068
$$ 278395 281664 285384 289649 293722 297046 300338 304635 309522 313246 314489 313398 311073 308637 306569
52579C06569k187l234m381m391l199j884j135q21q78j298j353k36J411K062J573
$$ 306569 304382 301148 296767 292376 289177 287293 286158 285337 284459 283161 281808 281572 282983 285045 286618
52564B86618J335J969K553K457K241K171J614O27L09P36K89j765l760l914k658
$$ 286618 287953 289922 292475 294932 297173 299344 300958 301585 301894 302630 302919 301154 297394 293480 290822
52549B90822j391n01k9p43k697l990k875k06J918K948L521L328J602p68j835j179
$$ 290822 289431 288930 288901 288158 285461 281471 278596 278390 280308 283256 286777 290105 291707 290939 289104 287925
52533B87925r4O84J487K087J578K51k96O06J855K418K475K240J228m74j689j755
$$ 287925 287831 288515 290002 292089 293667 293918 293622 294228 296083 298501 300976 303216 304444 303970 302281 300526
52517C00526j472j512j135L90K064K389J614J276J684J478lj348q97R02J985J212
$$ 300526 299054 297542 296407 296797 298861 301250 302864 304140 305824 307302 307299 305951 305054 305956 307941 309153
52501C09153n32j737j929j632j367j180q29l0J149J902J293l43j340q02Lo17k299
$$ 309153 308621 306884 304955 303323 301956 300776 299947 299917 301066 302968 304261 303918 302578 301776 301779 301162 298863
52484B98863l262k913k045q23J250L206K809o4k458k065j37R40J105J598K004
$$ 298863 295601 292688 290643 289820 291070 294276 297085 297021 294563 292498 292361 293301 294406 296004 298008
52469B98008R16j074j685k23J550K071J568P60l11j473j921j234m8Q33J211J293
$$ 298008 298924 297850 296165 295942 297492 299563 301131 301891 301580 300107 298186 296952 296904 297737 298948 300241
52453C00241J398J981L079L757L046J449M60O46J158J256J194J353J436R35k25
$$ 300241 301639 303620 306699 310456 313502 314951 315411 316057 317215 318471 319665 321018 322454 323389 323164
52438C23164j684k721k620j591r02j205j292R8J818J466j041l002k486n62O95
$$ 323164 321480 318759 316139 314548 313646 312441 311149 311247 313065 314531 313490 310488 308002 307440 308135
52423C08135Q12N90N47P40J257J861J906J260O41N03M68L49P63K036L410M022
$$ 308135 308947 309537 310084 310824 312081 313942 315848 317108 317749 318252 318720 319069 319832 321868 325278 329300
52407C29300L863L197J946K72j069j623j601r97N99K591L232J833j7o44n19r99
$$ 329300 333163 336360 338306 338578 337509 335886 334285 333288 333887 336478 339710 341543 341526 340882 340363 339364
52391C39364j911k086j551j269j066K24K404L502K332O9j452j924k277k956l538
$$ 339364 337453 335367 333816 332547 331481 331705 334109 337611 339943 340012 338560 336636 334359 331403 327865
52376C27865l734l852m105l956k677m74J344J643O91l18p13p06m52K88J314J722
$$ 327865 324131 320279 316174 312218 309541 309067 310411 312054 312745 312427 311714 311008 310556 310844 312158 313880
52360C13880J121L53M14J172J788J880J685J597K038L219M486M612L427K437K957
$$ 313880 315001 315354 315768 316940 318728 320608 322293 323890 325928 329147 333633 338245 341672 344109 347066
52345C47066M385N268N434N785O519O893O562N803M443J942j252l643m443m365
$$ 347066 351451 356719 362153 367938 374457 381350 387912 393715 398158 400100 398848 395205 390762 386397
52331C86397m358m406m042l205k122r98k54l44j012j339j009q65j601k468k035
$$ 386397 382039 377633 373591 370386 368264 367266 367012 366668 365656 364317 363308 362443 360842 358374 356339
52316C56339l6K249L392L127K225J482J107R27R82J635K988M417N045M670L861
$$ 356339 356303 358552 361944 365071 367296 368778 369885 370812 371794 373429 376417 380834 385879 390549 394410
52301C94410L183K664K278K361L120L848L291J076j507k674j973n40N61J488K692
$$ 394410 397593 400257 402535 404896 408016 411864 415155 416231 414724 412050 410077 409537 410098 411586 414278
52286D14278L595L312K364K349L631M578L858K409K166L526N236O401P352Q491
$$ 414278 417873 421185 423549 425898 429529 434107 437965 440374 442540 446066 451302 457703 465055 473546
52272D73546R360R369Q795Q599R401J0815J1814J1827J1523J2081J3600J4760
$$ 473546 482906 492275 501070 509669 519070 529885 541699 553526 565049 577130 590730 605490
52260F05490J4444J3144J2148J1860J1696J1326J1063J1086J0952J0126Q602P023
$$ 605490 619934 633078 645226 657086 668782 680108 691171 702257 713209 723335 731937 738960
52248G38960O330P003Q376R153Q942Q662Q894Q623O671L850K518L943O980R279
$$ 738960 745290 752293 760669 769822 778764 787426 796320 804943 811614 815464 817982 821925 828905 838184
52234H38184R183O700L445J474J396J832J337K42k71j47j75k78K81J218J482J078
$$ 838184 847367 854067 857512 858986 860382 862214 863551 863793 863522 863375 863200 862922 863203 864421 865903 866981
52218H66981J038J488J592J604K903N379O814O051M868N314O795P488P360P742
$$ 866981 868019 869507 871099 872703 875606 880985 887799 893850 898718 904032 910827 918315 925675 933417
52204I33417Q826R524R516R575R921R792Q920Q047P663P391O936O716P039P486
$$ 933417 942243 951767 961283 970858 980779 990571 999491 1007538 1015201 1022592 1029528 1036244 1043283 1050769
52190A050769P644P868Q809J0368J1584J1530J0127Q071O036M186K607J943K859
$$ 1050769 1058413 1066281 1075090 1085458 1097042 1108572 1118699 1126770 1132806 1136992 1139599 1141542 1144401
52177A144401M757N765M597K047J11p8R52K059K747L335M224N156N340M519L608
$$ 1144401 1149158 1154923 1159520 1161567 1161678 1161600 1162552 1164611 1167358 1170693 1174917 1180073 1185413 1189932 1193540
52162A193540L718M743N571N646N465N471N538N758O611P851Q355P794P268P485
$$ 1193540 1197258 1202001 1207572 1213218 1218683 1224154 1229692 1235450 1242061 1249912 1258267 1266061 1273329 1280814
52148A280814P519O587N875O928Q900R258P108M197K523K355K964L938N073N907
$$ 1280814 1288333 1294920 1300795 1307723 1316623 1325881 1332989 1337186 1339709 1342064 1345028 1348966 1354039 1359946
52134A359946O091N745N023L747J856j47j480j720j027M1R70J579J874J654P48
$$ 1359946 1366037 1371782 1376805 1380552 1382408 1382261 1380781 1379061 1378034 1378075 1379045 1380624 1382498 1384152 1384900
52119A384900m64j371k122l409n054n885n571n399o251p053o582n720o196p744
$$ 1384900 1384436 1383065 1380943 1377534 1372480 1366595 1361024 1355625 1349374 1342321 1335739 1330019 1323823 1316079
52105A316079q364p115m929k833j172m91j272k440k044P6J897K068J525J619K140
$$ 1316079 1307715 1300600 1295671 1292838 1291666 1291175 1289903 1287463 1285419 1285495 1287392 1289460 1290985 1292604 1294744
52090A294744K184J541M22j055k251k193j231j083k287k996j639O82K016K556
$$ 1294744 1296928 1298469 1298891 1297836 1295585 1293392 1292161 1291078 1288791 1285795 1284156 1284838 1286854 1289410
52076A289410L799N498N765M086K219J693K067K245K192K500L268M228N504P493
$$ 1289410 1293209 1298707 1304472 1308558 1310777 1312470 1314537 1316782 1318974 1321474 1324742 1328970 1334474 1341967
52062A341967J0163J2935J5314J7351J9449K1677K3333K3564K2546K1535K1404
$$ 1341967 1352130 1365065 1380379 1397730 1417179 1438856 1462189 1485753 1508299 1529834 1551238
52051A551238K1488K0419J7854J4807J2399J0811R425P643N520L747K806K066
$$ 1551238 1572726 1593145 1610999 1625806 1638205 1649016 1658441 1666084 1671604 1675351 1678157 1680223
52039A680223K83k686n225n707m432l063k429j805m38J186J963J615R15O12N73
$$ 1680223 1680506 1677820 1672595 1666888 1662456 1659393 1656964 1655159 1654721 1655907 1657870 1659485 1660400 1661012 1661585
52024A661585K26l43m19q6q55l752p107p800n147k051j432k793l602k878j621
$$ 1661585 1661811 1661468 1661049 1660963 1660108 1656356 1649249 1641449 1636302 1634251 1632819 1630026 1626424 1623546 1621925
52009A621925l73J489L889N389N170M269M070M499M533L714K294M92j435k756
$$ 1621925 1621552 1623041 1626930 1632319 1637489 1641758 1645828 1650327 1654860 1658574 1660868 1661360 1659925 1657169
51995A657169k769j929j803l580o772r622j0689r886q051n996m409m212n901q245
$$ 1657169 1654400 1652471 1650668 1647088 1640316 1630694 1620005 1610119 1602068 1596072 1591663 1587451 1581550 1573305
51981A573305q837o847m497m669p451j0220j0914r954q784p883o842n521m313
$$ 1573305 1564468 1557621 1553124 1548455 1541004 1530784 1519870 1509916 1501132 1493249 1486407 1480886 1476573
51968A476573l552l169k815k195j542j518k248k731j982o20l47j772l754n115
$$ 1476573 1473021 1469852 1467037 1464842 1463300 1461782 1459534 1456803 1454821 1454201 1453854 1452082 1448328 1443213
51954A443213n882o473o688o374o254p176r053j1248j3579j6124j8484k0065k1016
$$ 1443213 1437331 1430858 1424170 1417796 1411542 1404366 1395313 1384065 1370486 1354362 1335878 1315813 1294797
51941A294797k2142k3795k5451k6379k6406k5938k5547k5519k5660k5587k5187
$$ 1294797 1272655 1248860 1223409 1197030 1170624 1144686 1119139 1093620 1067960 1042373 1017186
51930A017186k4593k3708k2227k0250j8430j7189j6251j5186j3990j2750j1217
$$ 1017186 992593 968885 946658 926408 907978 890789 874538 859352 845362 832612 821395
51919H21395r224p155n603m868n089o375q293r729r943r467r275r376q948p709
$$ 821395 812171 805016 799413 794545 789456 783081 774788 765059 755116 745649 736374 726998 718050 710341
51905G10341o268n076l878k364p89M49J382K394L786N602P530Q887R100Q354P499
$$ 710341 704073 698997 695119 692755 691966 692415 693797 696191 699977 705579 713109 721996 731096 739450 746949
51890G46949P114O957O494N566M281K465m9k643l912k980o34J321J973K194L429
$$ 746949 754063 761020 767514 773080 777361 779826 779777 777134 773222 770242 769608 770929 772902 775096 778525
51875G78525N928Q666J0680J1997J3201J4569J5682J5533J3211R012M680J774
$$ 778525 784453 793119 803799 815796 828997 843566 859248 874781 887992 897004 901684 903458
51863I03458k50l365q292j3474j7093j8961j9778j9725j8905j8300j8839j9928
$$ 903458 903208 899843 891551 878077 860984 842023 822245 802520 783615 765315 746476 726548
51851G26548k0168j9169j7495j5273j2379r742q737r093r035p804o280m694j766
$$ 726548 706380 687211 669716 654443 642064 632322 623585 614492 605457 597653 591373 586679 584913
51838E84913K526N412M581J784R46L236O273Q034R070J0282J0700Q906N217J112
$$ 584913 587439 592851 597432 599216 600162 603398 609671 617705 626775 637057 647757 656663 661880 662992
51824F62992k592n629p288o958n431m256l841l255j828J04K103M060N617O280
$$ 662992 660400 654771 647483 640525 635094 630838 626997 623742 621914 622018 624121 628181 633798 640078
51810F40078O488P401R113J0176R739R076R839J1595J2394J1455R908Q996Q782
$$ 640078 646566 653967 663080 673256 682995 692071 701910 713505 725899 737354 747262 756258 765040
51797G65040Q800Q665P772N369J585k422n895r302j3158j6678j8362j7589j5135
$$ 765040 773840 782505 790277 795646 797231 794809 788914 779612 766454 749776 731414 713825 698690
51784F98690j2389j0500r763r419q468p081o632p752r099q972p550o413o091n543
$$ 698690 686301 675801 666038 656619 648151 641070 634438 626686 617587 608615 601065 594652 588561 583018
51770E83018m189l086l309m153l962k246m8J520K238K337J950J317R22R12P99
$$ 583018 578829 575743 572434 568281 564319 562073 562025 563545 565783 568120 570070 571387 572309 573221 574020
51755E74020J13q79j522j568j184m27O16J260P30m93p35R81L792O295Q043Q902
$$ 574020 574133 573254 571732 570164 568980 568553 569169 570429 571159 570666 569931 570912 574704 580999 589042 597944
51739E97944P922M481J24k541k964l107m439o111o727o380n890n359m695m491
$$ 597944 605866 610347 610471 607930 604966 601859 597420 591309 584582 578202 572312 566953 562258 557767
51725E57767m953m862l087o25L89n89k095k799k696k214j490o89n2O05J572K406
$$ 557767 552814 547952 544865 544240 544629 544040 541945 539146 536450 534236 532746 532057 532005 532610 534182 536588
51709E36588K317J398O06N27R97J867L102M184M501M423M906N966O688O845P165
$$ 536588 538905 540303 540909 541436 542433 544300 547402 551586 556087 560510 565416 571382 578070 584915 592080
51694E92080P787P778O689N235L845J811j247m248n965o606p128p685p682o785
$$ 592080 599867 607645 614334 619569 623414 625225 623978 619730 613765 607159 600031 592346 584664 577879
51680E77879n043k617j32J351J508J395K183L908O076Q673J1555J3657J4130J3677
$$ 577879 572836 570219 570087 571438 572946 574341 576524 580432 586508 595181 606736 620393 634523 648200
51666F48200J3489J3222J1521Q479O063N714O670P071N854L119m35l864o265p479
$$ 648200 661689 674911 686432 694911 700974 706688 713358 720429 726283 729402 728967 725103 718838 711359
51652G11359q201r017r504q735o649m611m333o099q269q860p645o135n350m376
$$ 711359 703158 694141 684637 675902 669253 664642 660309 654210 645941 637081 629436 623301 617951 613575
51638F13575j726K356N813O865N530L210J400Q33J158J317N89n98j187p43J16
$$ 613575 611849 614205 620018 626883 632413 635623 637023 637856 639014 640331 640920 640322 639135 638392 638508
51623F38508M63j96j775l774n537o677p174o867n219k148J086K681K200J268K074
$$ 638508 638971 638775 637000 633226 627689 621012 613838 606971 601752 599604 600690 603371 605571 606839 608913
51608F08913N281R534J2891J4603J5507J6600J7593J7375J5735J3556J1002O718
$$ 608913 614194 623728 636619 651222 666729 683329 700922 718297 734032 747588 758590 765308
51596G65308j77q037j3898j6473j6867j6547j5894j4786j3447j2035j0148p324
$$ 765308 765131 757094 743196 726723 709856 693309 677415 662629 649182 637147 626999 619675
51584F19675l880j027k20k070n470q179q890q498q679r627j0201r933r570r526
$$ 619675 615795 614768 614548 612478 607008 598829 589939 581441 572762 563135 552934 543001 533431 523905
51570E23905r149p930o378n192m377l695l144k513j288L71J226K65j922l647l712
$$ 523905 514756 506826 500448 495256 490879 487184 484040 481527 480239 480610 481836 482101 480179 476532 472820
51555D72820k212j86J241J638J486J418J399J094P73J012J636K005K211K812L337
$$ 472820 470608 470422 471663 473301 474787 476205 477604 478698 479471 480483 482119 484124 486335 489147 492484
51540D92484K529N56n77M39K628M496O036P792R300R921J0223J0944J1376J0430
$$ 492484 495013 495569 494992 495431 498059 502555 508591 516383 525683 535604 545827 556771 568147 578577
51526E78577Q665P485O834N452L337K002K131K680K755K878L764N123O479Q040
$$ 578577 587242 594727 601561 607013 610350 612352 614483 617163 619918 622796 626560 631683 638162 646202
51512F46202J0123J2433J4559J6479J8119J9144J9656K0436K1958K3730K4911
$$ 646202 656325 668758 683317 699796 717915 737059 756715 777151 799109 822839 847750
51501H47750K5067K4140K2483K1105K1122K2535K4348K6175K8757L2414L5954
$$ 847750 872817 896957 919440 940545 961667 984202 1008550 1034725 1063482 1095896 1131850
51490A131850L7703L6783L2877K5916J6870P746l84q440j7224k5230l0329l3044
$$ 1131850 1169553 1206336 1239213 1265129 1281999 1289745 1289361 1280921 1263697 1238467 1208138 1175094
51478A175094l6045m0333m3858m4562m2972m0786l8290l4727l0404k6848k4855
$$ 1175094 1139049 1098716 1054858 1010296 967324 926538 888248 853521 823117 796269 771414
51467G71414k3588k1818j9322j6751j4647j2953j1292r486p844o825o342n682
$$ 771414 747826 726008 706686 689935 675288 662335 651043 641557 633713 626888 620546 614864
51455F14864m458l473m001o147q357q919p672n874m632l934l262k635k616l391
$$ 614864 610406 606933 602932 596785 588428 579509 571837 565963 561331 557397 554135 551500 548884 545493
51441E45493m224m134k970j676j355k111k937k797j770r56j164j912j974q91M39
$$ 545493 541269 537135 534165 532489 531134 529023 526086 523289 521519 520563 519399 517487 515513 514622 515061
51426E15061Q23J42p27j160j451k113k883k980k155r92r6N46J078J119J60j514
$$ 515061 515884 516026 515299 514139 512688 510575 507692 504712 502557 501565 501469 502015 503093 504212 504372 502858
51410E02858k984l877m729n785o146m803k225J0J096J720K590L166K510Q61m20
$$ 502858 499874 495997 491268 485483 479337 474534 472309 472319 473415 475135 477725 480891 483401 484262 483842
51395D83842l81O92J939K857L393L617L603L455L273L225L612M617N897O828P301
$$ 483842 483461 484153 486092 488949 492342 495959 499562 503017 506290 509515 513127 517744 523641 530469 537770
51380E37770P923R132J0460J1074J0862J0450J0144R389P521M751J986o5j241
$$ 537770 545693 554825 565285 576359 587221 597671 607815 617204 624725 629476 631462 631397 630156
51367F30156j596j254q16j411l702o921r309r734q606p084n792m682l736l021
$$ 630156 628560 627306 626490 625079 621377 614456 605147 595413 586807 579723 573931 569249 565513 562492
51353E62492k090j75K526M408M105K214O13K49N82J124K221L773M454L452K146
$$ 562492 560402 560227 562753 567161 571266 573480 574093 574342 574924 576048 578269 582042 586496 589948 592094
51338E92094K575M512N632M625K659J325P88P14J576L618N581O212O423Q172J1427
$$ 592094 594669 599181 604813 609438 612097 613422 614210 614924 616500 620118 625699 631911 638334 646506 657933
51323F57933J4021J4823J5269J7124K0322K3955K8019L2762L7207L9983M1310
$$ 657933 671954 686777 702046 719170 739492 763447 791466 824228 861435 901418 942728
51312I42728M2842M5474M8323M9847M9027M5325L8560K9407J9423J0079J814n923
$$ 942728 985570 1031044 1079367 1129214 1178241 1223566 1262126 1291533 1310956 1321035 1322849 1316926
51300A316926j4036k2996l2172l9854m4543m6282m6451m6262m5980m5440m4507
$$ 1316926 1302890 1279894 1247722 1207868 1163325 1117043 1070592 1024330 978350 932910 888403
51289H88403m2861m0058l6267l2376k9022k5989k2956k0250j8356j7056j5722
$$ 888403 845542 805484 769217 736841 707819 681830 658874 638624 620268 603212 587490
51278E87490j4272j3203j2741j2470j1871j0854r598q190o674n268m281l698l128
$$ 587490 573218 560015 547274 534804 522933 512079 502481 494291 487617 482349 478068 474370 471242
51265D71242k442k282l385n229o095m959k724q47O23K490M384M833L532J911J000
$$ 471242 468800 466518 463133 457904 451809 446850 444126 443279 443902 446392 450776 455609 459141 461052 462052
51250D62052J80j122j959j348p4M37K07K27N08K90k12J8R44J411J043O76O77L94
$$ 462052 462232 461110 459151 457803 457729 458166 458373 458600 459108 459398 459186 459204 460148 461559 462602 463278 463955 464349
51232D64349k98m71J11J22j356l138l397k105q24n65r42j170r48k78P87K069L260
$$ 464349 464051 463580 463691 463813 462457 459319 455922 453817 452993 452428 451486 450316 449368 449090 449877 451946 455206
51215D55206M092M473M629M960N410N081L300R75j70J43N24L76J051L445N849
$$ 455206 459298 463771 468400 473360 478770 483851 487151 488126 487956 488099 488623 488999 490050 493495 499344
51200D99344N840L538J258L09j07r78k142l157m026m504m020k889k490l449m581
$$ 499344 505184 508722 509980 510289 510182 509204 507062 503905 499879 495375 491355 488466 485976 482527 477946
51185D77946m523l643l235l333k604n89J107O30j619l172k407m94J78r79k247
$$ 477946 473423 469780 466545 463212 460608 460019 461126 461756 460137 456965 454558 454064 454242 453263 451016
51170D51016k113j038k78m8J60K73q2m11K01J577K493K355J778J458J400J448
$$ 451016 448903 447865 447587 447539 447699 447972 447890 447479 447680 449257 451750 454105 455883 457341 458741 460189
51154D60189J616J696J409J118J521K422K862K644K653L282L670L073K051J568
$$ 460189 461805 463501 464910 466028 467549 469971 472833 475477 478130 481412 485082 488155 490206 491774
51140D91774J758K178K520K435J502R1n51J53J232J506J101P54M51j93r50j399
$$ 491774 493532 495710 498230 500665 502167 502258 501707 501860 503092 504598 505699 506453 506904 506711 505761 504362
51124E04362j806k447k651j673p6R58J356J805K158J593L16m24j57L92Q44J590
$$ 504362 502556 500109 497458 495785 495709 496667 498023 499828 501986 503579 503895 503471 503314 503706 504550 506140
51108E06140K314J677o11k805l185k130j137p19m52l25p06j314j489j284j234
$$ 506140 508454 510131 509520 506715 503530 501400 500263 499544 499092 498767 498061 496747 495258 493974 492740
51093D92740j210o49M8l60k074l536l286j783o52o08r69q67k33M31O20J01q39
$$ 492740 491530 490881 490929 490569 488495 484959 481673 479890 479238 478630 477661 476794 476561 476992 477612 477713 476874
51076D76874j344p93L15P89L63J72J138K502K737J604L84J44P08J465K245K894
$$ 476874 475530 474737 475052 475841 476204 476376 477514 480016 482753 484357 484741 484885 485593 487058 489303 492197
51060D92197K886K086J390J756K816L211K267Q21L22J474L698N582N921M731L208
$$ 492197 495083 497169 498559 500315 503131 506342 508609 509430 509752 511226 514924 520506 526427 531158 534366
51045E34366K506K683K974K845K372J933J894K365K923K838J970J111R32J084
$$ 534366 536872 539555 542529 545374 547746 549679 551573 553938 556861 559699 561669 562780 563712 564796
51031E64796R27O77R01J318J087K00m68n52n41p08p32o04q35j361j316l40Q80
$$ 564796 565723 566400 567301 568619 569706 569906 569438 568886 568345 567637 566905 566301 565466 564105 562789 562449 563329
51014E63329J899L189M825N590M583K895K367L255M303M772N057N280M798L394
$$ 563329 565228 568417 573242 578832 583415 586310 588677 591932 596235 601007 606064 611344 616142 619536
51000F19536K114K239M025O765R551J1536J1942J0423P480M374K471K474L967
$$ 619536 621650 623889 627914 634679 644230 655766 667708 678131 685611 689985 692456 694930 698897
50987F98897N865P382Q447R087R055Q419P907P831P278N388L080K139K677K972
$$ 698897 704762 712144 720591 729678 738733 747152 755059 762890 770168 775556 778636 780775 783452 786424
50973G86424K189J568K036K149q8m221p895j0037j1788j4149j6313j6984j6101
$$ 786424 788613 790181 792217 794366 794278 790057 782162 772125 760337 746188 729875 712891 696790
50960F96790j4442j2449j0243q165o325m132j115K044M224N306O045O666O731
$$ 696790 682348 669899 659656 651491 645166 641034 639919 641963 646187 651493 657538 664204 670935
50947F70935O415O660P621Q098P316O316O594Q022R256R688R790R731R116Q264
$$ 670935 677350 684010 691631 699729 707045 713361 719955 727977 737233 746921 756711 766442 775558 783822
50933G83822Q315R472J0292R585Q099P379P726Q394R286J1024J3411J5124J5444
$$ 783822 792137 801609 811901 821486 829585 836964 844690 853084 862370 873394 886805 901929 917373
50920I17373J5333J6194J8101J9787K0064J8839J6887J4947J3026J0569P374M185
$$ 917373 932706 948900 967001 986788 1006852 1025691 1042578 1057525 1070551 1081120 1088494 1092679
50908A092679K010J011O10P04K048N075Q934J2203J4266J5628J7134J9299K2124
$$ 1092679 1094689 1095700 1096310 1097014 1099062 1104137 1113071 1125274 1139540 1155168 1172302 1191601 1213725
50895A213725K5194K7956L0063L1275L1151K9434K6960K5446K5790K7149K8179
$$ 1213725 1238919 1266875 1296938 1328213 1359364 1388798 1415758 1441204 1466994 1494143 1522322
50884A522322K8537K8481K7893K6949K7172K9989L4230L6762L6075L3681L1183
$$ 1522322 1550859 1579340 1607233 1634182 1661354 1691343 1725573 1762335 1798410 1832091 1863274
50873A863274K7738K1867J4478Q147L843K94l484o874r384j2019j6017k1124k6148
$$ 1863274 1891012 1912879 1927357 1935504 1939347 1939641 1936157 1929283 1919899 1907880 1891863 1870739 1844591
50860A844591l0521l4473l8014m0686m2216m2805m2839m2732m2896m3312m3105
$$ 1844591 1814070 1779597 1741583 1700897 1658681 1615876 1573037 1530305 1487409 1444097 1400992
50849A400992m1046l6822l1686k7642k5817k5521k4994k3235k0922j9262j8204
$$ 1400992 1359946 1323124 1291438 1263796 1237979 1212458 1187464 1164229 1143307 1124045 1105841
50838A105841j6548j3924j1765j1628j3019j3728j2338r740p869p451p428o569
$$ 1105841 1089293 1075369 1063604 1051976 1038957 1025229 1012891 1003151 995282 987831 980403 973834
50826I73834n044l986l759l429k284r84m75l21O69K396L393L051K548L082M346
$$ 973834 968790 964804 961045 957616 955332 954348 953873 953552 954221 956617 960010 963061 965609 968691 973037
50811I73037N569O833Q353R466R718J0143J2013J4716J6359J6270J5580J5508
$$ 973037 978606 985439 993792 1003258 1012976 1023119 1035132 1049848 1066207 1082477 1098057 1113565
50799A113565J6462J8697K2188K5629K7190K6871K6741K8258L0785L3474L6972
$$ 1113565 1130027 1148724 1170912 1196541 1223731 1250602 1277343 1305601 1336386 1369860 1406832
50788A406832M1903M6930N0119N1722N3864N7572O1543O4170O5537O6790O8399
$$ 1406832 1448735 1495665 1545784 1597506 1651370 1708942 1770485 1834655 1900192 1966982 2035381
50777B035381O9682O9791O8568O6563O4538O2924O1491N9457N6115N1699M7630
$$ 2035381 2105063 2174854 2243422 2309985 2374523 2437447 2498938 2558395 2614510 2666209 2713839
50766B713839M5575M5866M7110M7769M7866M8509N0088N1840N3376N5390N8211
$$ 2713839 2759414 2805280 2852390 2900159 2948025 2996534 3046622 3098462 3151838 3207228 3265439
50755C265439O0483O0082N6016M8861L9745K9515J8529O612o526k0531l4357m7230
$$ 3265439 3325922 3386004 3442020 3490881 3530626 3560141 3578670 3585282 3578756 3558225 3523868 3476638
50743C476638n9014o9233p6617q0504q1986q2631q2539q0664p6705p1412o5239
$$ 3476638 3417624 3348391 3271774 3191270 3109284 3026653 2944114 2863450 2786745 2715333 2650094
50732B650094n8174n0900m4739l9858l4785k8361k1364j5500j1534r151p831p064
$$ 2650094 2591920 2541020 2496281 2456423 2421638 2393277 2371913 2356413 2344879 2335728 2327897 2320833
50720B320833o209n133m707n835q105j0156j1403j2561j4380j6641j8880k1479
$$ 2320833 2314624 2309491 2304784 2298949 2290844 2280688 2269285 2256724 2242344 2225703 2206823 2185344
50708B185344k5257l0028l4280l6683l7607l8745m1222m4439m6917m7843m7459
$$ 2185344 2160087 2130059 2095779 2059096 2021489 1982744 1941522 1897083 1850166 1802323 1754864
50697A754864m6224m4163m1161l7522l3915l0832k8179k5371k1977j8336j5240
$$ 1754864 1708640 1664477 1623316 1585794 1551879 1521047 1492868 1467497 1445520 1427184 1411944
50686A411944j2801j0032o134j852J355L480O126J0106J4071J6518J8267K1392
$$ 1411944 1399143 1389111 1382977 1381125 1382480 1385960 1392086 1402192 1416263 1432781 1451048 1472440
50674A472440K6054L0082L1961L2708L4106L6442L9021M1733M4576M6428M6098
$$ 1472440 1498494 1528576 1560537 1593245 1627351 1663793 1702814 1744547 1789123 1835551 1881649
50663A881649M4394M3360M3300M2427L9985L7777L7372L7339L5028L0179K4976
$$ 1881649 1926043 1969403 2012703 2055130 2095115 2132892 2170264 2207603 2242631 2272810 2297786
50652B297786K1056J8246J6021J4434J3328J2290J1818J3233J6908K1692K6429
$$ 2297786 2318842 2337088 2353109 2367543 2380871 2393161 2404979 2418212 2435120 2456812 2483241
50641B483241L0906L4893L7750L9605M1677M4384M6201M5384M1935L7052L1586
$$ 2483241 2514147 2549040 2586790 2626395 2668072 2712456 2758657 2804041 2845976 2883028 2914614
50630B914614K5928K0489J5181R311L166j243k383j353l76K36J924N126Q467J0728
$$ 2914614 2940542 2961031 2976212 2985523 2988689 2987446 2985063 2983710 2983334 2983570 2985494 2990620 2999087 3009815
50616C009815J2048J3004J3997J5779J9227K4227K9837L5660M1831M7678N1897
$$ 3009815 3021863 3034867 3048864 3064643 3083870 3108097 3137934 3173594 3215425 3263103 3315000
50605C315000N4418N6483N8289N8033N4349M8446M2895L9045L6547L4517L2193
$$ 3315000 3369418 3425901 3484190 3542223 3596572 3645018 3687913 3726958 3763505 3798022 3830215
50594C830215K9124K5630K2698K0813J9309J7361J4960J2433R849P611O827Q189
$$ 3830215 3859339 3884969 3907667 3928480 3947789 3965150 3980110 3992543 4002392 4010003 4016830 4025019
50582D025019J1067J4462J8239K2611K7170L1468L5908M0776M4778M5847M3498
$$ 4025019 4036086 4050548 4068787 4091398 4118568 4150036 4185944 4226720 4271498 4317345 4360843
50571D360843L9267L4759L0154K4806J8396J1199L912k623q153j3793k1470l2139
$$ 4360843 4400110 4434869 4465023 4489829 4508225 4519424 4523336 4520713 4512560 4498767 4477297 4445158
50559D445158m4719n6819o6223p1614p2585o9392o2774n3798m3683l3453k3642
$$ 4445158 4400439 4343620 4277397 4205783 4133198 4063806 4001032 3947234 3903551 3870098 3846456
50548C846456j4603p222k760j698l318p041j3555k3611l6033m8156n8377o7193
$$ 3846456 3831853 3824631 3821871 3820173 3816855 3809814 3796259 3772648 3736615 3688459 3630082 3562889
50536C562889p5466q2769q8188r1838r4532r6292r6197r3730q9524q4612p9468
$$ 3562889 3487423 3404654 3316466 3224628 3130096 3033804 2937607 2843877 2754353 2669741 2590273
50525B590273p3968o7820o0785n2933m4979l7973l2169k6493j9758j2297n635
$$ 2590273 2516305 2448485 2387700 2334767 2289788 2251815 2219646 2193153 2173395 2161098 2155463
50514B155463m55M337J0076J6531K2314K6611K9656L1679L2443L1939L0807K9654
$$ 2155463 2155008 2159345 2169421 2185952 2208266 2234877 2264533 2296212 2328655 2360594 2391401 2421055
50502B421055K8479K7060K5549K4481K4604K6713L1174L7298M3739M9708N5461
$$ 2421055 2449534 2476594 2502143 2526624 2551228 2577941 2609115 2646413 2690152 2739860 2795321
50491B795321O1434O7406P2758P7131Q0625Q3675Q6748Q9614R0927Q9454Q5901
$$ 2795321 2856755 2924161 2996919 3074050 3154675 3238350 3325098 3414712 3505639 3595093 3680994
50480C680994Q2720Q1683Q2510Q4265Q7099R1737R8096J05353J12841J20052J26278
$$ 3680994 3763714 3845397 3927907 4012172 4099271 4191008 4289104 4394457 4507298 4627350 4753628
50469D753628J31280J35998J41719J48719J56364J63993J70855J75641J77272
$$ 4753628 4884908 5020906 5162625 5311344 5467708 5631701 5802556 5978197 6155469
50460F155469J76092J73328J69334J63182J53857J40981J24340J03635P8970N1119
$$ 6155469 6331561 6504889 6674223 6837405 6991262 7132243 7256583 7360218 7439188 7490307
50450G490307K1249r213l8766o6621r3047j18127j40305j57061j67051j70818
$$ 7490307 7511556 7502343 7463577 7396956 7303909 7185782 7045477 6888416 6721365 6550547
50440F550547j69551j63953j54264j40455j22397j00705p7378n4726l3668j4194
$$ 6550547 6380996 6217043 6062779 5922324 5799927 5699222 5621844 5567118 5533450 5519256
50430E519256K585J4154J8739J6535Q333n886k6058n0678p7242j03609j28160
$$ 5519256 5521841 5535995 5554734 5571269 5579602 5573716 5547658 5496980 5419738 5316129 5187969
50419E187969j49142j64816j74482j79006j80259j79895j78284j74581j68116
$$ 5187969 5038827 4874011 4699529 4520523 4340264 4160369 3982085 3807504 3639388
50410C639388j59545j50279j41083j32004j23304j15376j07804r9693r1098q2966
$$ 3639388 3479843 3329564 3188481 3056477 2933173 2817797 2709993 2610300 2519202 2436236
50400B436236p5536o8118o0775n4636m9869m4896l8739l2782k8737k5900k2083
$$ 2436236 2360700 2292582 2231807 2177171 2127302 2082406 2043667 2010885 1982148 1956248 1934165
50389A934165j6731j1516q000o068m671k903l48K737N373O893P897R481J1631
$$ 1934165 1917434 1905918 1897918 1891850 1887179 1884276 1883928 1886665 1892038 1898931 1906828 1916309 1927940
50376A927940J3324J4197J5064J6549J8235J9650K1264K3879K7377L0740L3249
$$ 1927940 1941264 1955461 1970525 1987074 2005309 2024959 2046223 2070102 2097479 2128219 2161468
50365B161468L5270L7816M1473M5817M9797N2626N4406N6096N8957O3635O9424
$$ 2161468 2196738 2234554 2276027 2321844 2371641 2424267 2478673 2534769 2593726 2657361 2726785
50354B726785P4810P9194Q3614Q9105R4943R9751J03735J08000J11664J11986
$$ 2726785 2801595 2880789 2964403 3053508 3148451 3248202 3351937 3459937 3571601 3683587
50344C683587J08214J03185R9594R6439R0975Q2673P3036O2617N0612L6912K2173
$$ 3683587 3791801 3894986 3994580 4091019 4181994 4264667 4337703 4400320 4450932 4487844 4510017
50333D510017N975j2900l4125n5525p5092r1608j03637j10258j12912j14028j13331
$$ 4510017 4515992 4503092 4468967 4413442 4338350 4246742 4143105 4032847 3919935 3805907 3692576
50322C692576j08019r7394q4736p3232o2404n0249l6911k4186j3144m431M95Q63
$$ 3692576 3584557 3487163 3402427 3329195 3266791 3216542 3179631 3155445 3142301 3137870 3138365 3139228
50310C139228j622m856r564j8165l0797m4727n7600o9001p8634q5403q9041r0745
$$ 3139228 3137606 3132750 3123186 3105021 3074224 3029497 2971897 2902896 2824262 2738859 2649818 2559073
50298B559073r1268q9921q6416q2253p8999p6212p2289o6780o0925n6145n2756
$$ 2559073 2467805 2377884 2291468 2209215 2130216 2054004 1981715 1914935 1854010 1797865 1745109
50287A745109m9851m6070m0900l5506l1669k9641k7806k4939k1704j9226j7144
$$ 1745109 1695258 1649188 1608288 1572782 1541113 1511472 1483666 1458727 1437023 1417797 1400653
50276A400653j4370j1115q802q066q166q390q764q990q012n477k826j815k355
$$ 1400653 1386283 1375168 1366366 1358300 1350134 1341744 1332980 1323990 1315978 1310501 1307675 1305860 1303505
50263A303505k731j824q5J646L282M846N650N062L814L554M937O849P870P976
$$ 1303505 1300774 1298950 1298865 1300511 1303793 1308639 1314289 1319351 1323165 1326719 1331656 1338505 1346375 1354351
50249A354351Q361R800J1648J2622J2325J1799J2338J3824J4752J4180J3083J2997
$$ 1354351 1362712 1372512 1384160 1396782 1409107 1420906 1433244 1447068 1461820 1476000 1489083 1502080
50237A502080J3811J3993J3015J2154J2443J3196J3451J3674J4724J5951J6005
$$ 1502080 1515891 1529884 1542899 1555053 1567496 1580692 1594143 1607817 1622541 1638492 1654497
50226A654497J5156J5147J6507J7650J7161J5714J4950J5481J6745J7962J8104
$$ 1654497 1669653 1684800 1701307 1718957 1736118 1751832 1766782 1782263 1799008 1816970 1835074
50215A835074J5450Q452k588j5212k6166l3038l4989l2884k8918k5509k3792k3021
$$ 1835074 1850524 1858976 1856388 1841176 1815010 1781972 1746983 1714099 1685181 1659672 1635880 1612859
50203A612859k1608j8906j5917j4189j4159j4854j5043j4195j2296r515o472m172
$$ 1612859 1591251 1572345 1556428 1542239 1528080 1513226 1498183 1483988 1471692 1462177 1455705 1451533
50191A451533l018k341j564j127j418j389L64L361N504N691M846M120L501K732
$$ 1451533 1448515 1446174 1444610 1443483 1442065 1440676 1441040 1444401 1449905 1455596 1460442 1464562 1468063 1470795
50177A470795K289K581L140L410L474L305K211j15k709m335m803m650m287m186
$$ 1470795 1473084 1475665 1478805 1482215 1485689 1488994 1491205 1491090 1488381 1484046 1479243 1474593 1470306 1466120
50163A466120n037o727p914p610o590o252o569o294m716k291J01J798K767M073
$$ 1466120 1461083 1454356 1446442 1438832 1432242 1425990 1419421 1413127 1408411 1406120 1406221 1408019 1410786 1414859
50149A414859P132J1743J5955J8873K2169K7268L2465L5194L6114L8198M2167
$$ 1414859 1421991 1433734 1449689 1468562 1490731 1517999 1550464 1585658 1621772 1659970 1702137
50138A702137M5636M6928M6827M5934M3233L8500L3683L0226K7074K2960J8846
$$ 1702137 1747773 1794701 1841528 1887462 1930695 1969195 2002878 2033104 2060178 2083138 2101984
50127B101984J6172J4131J0723N436r47q204j6412k4593l1581l7757m4155n0223
$$ 2101984 2118156 2132287 2143010 2148446 2147499 2139295 2122883 2098290 2066709 2028952 1984797 1934574
50115A934574n4232n5681n5511n4066n0604m5087l8885l3375k8990k5827k3759
$$ 1934574 1880342 1824661 1769150 1715084 1664480 1619393 1580508 1547133 1518143 1492316 1468557
50104A468557k1786j8709j5061j3017j3731j5724j6687j5982j4619j3460j2376
$$ 1468557 1446771 1428062 1413001 1399984 1386253 1370529 1353842 1337860 1323241 1309781 1297405
50093A297405j0803q408n326k129M76K167L104L529L538L244K807K198J320L71
$$ 1297405 1286602 1278194 1272868 1270739 1271215 1273382 1276486 1280015 1283553 1286797 1289604 1291802 1293122 1293493
50079A293493k82o49j157k107l421m775n511m646j697K345N469O395N587M476
$$ 1293493 1293211 1292562 1291405 1289298 1285877 1281102 1275591 1270945 1269248 1271593 1277062 1283457 1289044 1293520
50065A293520M149M884O386Q024R068R067Q238P513Q090J0344J3125J4584J4106
$$ 1293520 1297669 1302553 1308939 1316963 1326031 1335098 1343336 1350849 1358939 1369283 1382408 1396992 1411098
50052A411098J2907J2333J2345J2321J2578J3961J6266J8264J9254J9613J9877
$$ 1411098 1424005 1436338 1448683 1461004 1473582 1487543 1503809 1522073 1541327 1560940 1580817
50041A580817K0256K1055K2609K4726K6897K8948L0732L1745L2104L3410L7033
$$ 1580817 1601073 1622128 1644737 1669463 1696360 1725308 1756040 1787785 1819889 1853299 1890332
50030A890332M1931M6016M9527N4852O2638P0458P6283Q0869Q5298Q8362Q8526
$$ 1890332 1932263 1978279 2027806 2082658 2145296 2215754 2292037 2372906 2458204 2546566 2635092
50019B635092Q6841Q5466Q4214Q1031P5416O9043O3042N6848N0088M3711L8344
$$ 2635092 2721933 2807399 2891613 2972644 3048060 3117103 3180145 3236993 3287081 3330792 3369136
50008C369136L2855K5376J4976J971j2663k7794m2615n6854p0100q1213q9231
$$ 3369136 3401991 3427367 3442343 3444314 3431651 3403857 3361242 3304388 3234288 3153075 3063844
49997C063844r4627r8667j01478j01871r9225r4539q9289q4078p8726p2854o6108
$$ 3063844 2969217 2870550 2769072 2667201 2567976 2473437 2384148 2300070 2221344 2148490 2082382
49986B082382n8489n0754m3957l8488l4173l1042k9035k7167k4366k1233j9491
$$ 2082382 2023893 1973139 1929182 1890694 1856521 1825479 1796444 1769277 1744911 1723678 1704187
49975A704187j9335j8882j6935j4640j3352j2417j0606q546p767q124q125p638
$$ 1704187 1684852 1665970 1649035 1634395 1621043 1608626 1598020 1589474 1581707 1573583 1565458 1557820
49963A557820q190j0271j2137j2081j0626r553r748j0847j2272j3661j4631j4991
$$ 1557820 1549630 1539359 1527222 1515141 1504515 1494962 1485214 1474367 1462095 1448434 1433803 1418812
49951A418812j5081j5330j5566j5228j4193j3089j2752j3500j4826j5712j5441
$$ 1418812 1403731 1388401 1372835 1357607 1343414 1330325 1317573 1304073 1289247 1273535 1258094
$$ [...]
##END NTUPLES=NMR SPECTRUM
##END=
