
##TITLE=AC1038_TOCA01_5867811_QMO5yyarsU
##JCAMPDX= 6.0         $$ Bruker NMR JCAMP-DX V2.0
##DATA TYPE= NMR SPECTRUM
##DATA CLASS= NTUPLES
##ORIGIN= BRUKER
##OWNER= Administrator
$$ 1.72 TOPSPIN		Version 2.1
$$ 2012-03-30 22:23:44.828 -0500  Administrator@TOPSPIN
$$ Compression mode = diff/dup
##.OBSERVE FREQUENCY= 400.13188235
##.OBSERVE NUCLEUS= ^1H
##.ACQUISITION MODE= SIMULTANEOUS (DQD)
##.ACQUISITION SCHEME= undefined
##.AVERAGES= 8
##.DIGITISER RES= 22
##SPECTROMETER/DATA SYSTEM= spect
##.PULSE SEQUENCE= zg30
##.SOLVENT NAME= COFFEE_meoh
##.SHIFT REFERENCE= INTERNAL, COFFEE_meoh, 1, 14.98061
##AUDIT TRAIL= $$ (NUMBER, WHEN, WHO, WHERE, PROCESS, VERSION, WHAT)
$$ ##TITLE= Audit trail, TOPSPIN		Version 2.1
$$ ##JCAMPDX= 5.01
$$ ##ORIGIN= Bruker BioSpin GmbH
$$ ##OWNER= Administrator
$$ $$ C:\Bruker\TOPSPIN/data/COFFEE/nmr/AC1038_TOCA01_5867811_QMO5yyarsU/10/pdata/1/auditp.txt
$$ ##AUDIT TRAIL=  $$ (NUMBER, WHEN, WHO, WHERE, PROCESS, VERSION, WHAT)
(   1,<2012-03-30 22:23:37.625 -0500>,<Administrator>,<TOPSPIN>,<go>,<TOPSPIN 2.1>,
      <created by zg
	started at 2012-03-30 22:22:31.046 -0500,
	POWCHK enabled, PULCHK disabled,
       configuration hash MD5:
       1A 1E CE 29 27 FD 77 03 67 4E F0 E3 C4 B2 CB 90
       data hash MD5: 64K
       3F ED 83 05 07 16 F1 6B BE 2E 86 BA 65 E3 4D 3D>)
(   2,<2012-03-30 22:23:40.281 -0500>,<Administrator>,<TOPSPIN>,<proc1d>,<TOPSPIN 2.1>,
      <Start of raw data processing
       efp LB = 0 FT_mod = 6 PKNL = 1 PHC0 = 0 PHC1 = 0 SI = 32K 
       data hash MD5: 32K
       60 25 20 2E 33 9F D7 47 5E 21 B9 97 47 61 90 03>)
(   3,<2012-03-30 22:23:40.765 -0500>,<Administrator>,<TOPSPIN>,<proc1d>,<TOPSPIN 2.1>,
      <pk PHC0 = 211.2396 PHC1 = 0 
       data hash MD5: 32K
       91 06 20 00 7D 17 94 AA 36 4E 41 A4 21 C8 3D 33>)
(   4,<2012-03-30 22:23:40.843 -0500>,<Administrator>,<TOPSPIN>,<proc1d>,<TOPSPIN 2.1>,
      <abs ABSG = 1 
       data hash MD5: 32K
       6B 0C 85 B2 A2 63 7A 9E 25 3E 5A 7D 4C 6B B4 69>)
(   5,<2012-03-30 22:23:40.906 -0500>,<Administrator>,<TOPSPIN>,<proc1d>,<TOPSPIN 2.1>,
      <abs ABSG = 2 
       data hash MD5: 32K
       EB DE 9A FF F2 8E 8C 30 B8 80 90 9E 4B 06 4F CD>)
(   6,<2012-03-30 22:23:40.953 -0500>,<Administrator>,<TOPSPIN>,<proc1d>,<TOPSPIN 2.1>,
      <abs ABSG = 3 
       data hash MD5: 32K
       D9 3E 7D 23 E1 96 B8 24 5D BD A9 51 C3 F7 ED 0D>)
(   7,<2012-03-30 22:23:41.000 -0500>,<Administrator>,<TOPSPIN>,<proc1d>,<TOPSPIN 2.1>,
      <abs ABSG = 4 
       data hash MD5: 32K
       FE F9 4F 2C 1E DB E8 1C 50 56 C9 50 9F AA 92 AD>)
(   8,<2012-03-30 22:23:41.046 -0500>,<Administrator>,<TOPSPIN>,<proc1d>,<TOPSPIN 2.1>,
      <abs ABSG = 5 
       data hash MD5: 32K
       98 F3 3D 3A 6C 40 77 4F 28 8E C9 07 42 3A 2E DC>)
$$ ##END=
$$ 
$$ $$ hash MD5
$$ $$ FC 64 9D AA 98 81 67 0F 8A 14 0A FB 49 B5 F0 FB
##$RELAX= 
##$RELAX= 
##$RELAX= 
##$RELAX= 
##$RELAX= 
##$RELAX= 
##$RELAX= 
$$ Bruker specific parameters
$$ --------------------------
$$ [...]
150 150 150 150 150 150 150 150
##$TP07= 0
##$TPNAME0= <>
##$TPNAME1= <>
##$TPNAME2= <>
##$TPNAME3= <>
##$TPNAME4= <>
##$TPNAME5= <>
##$TPNAME6= <>
##$TPNAME7= <>
##$TPOAL= (0..7)
0.5 0.5 0.5 0.5 0.5 0.5 0.5 0.5
##$TPOFFS= (0..7)
0 0 0 0 0 0 0 0
##$TUNHIN= 0
##$TUNHOUT= 0
##$TUNXOUT= 0
##$USERA1= <user>
##$USERA2= <user>
##$USERA3= <user>
##$USERA4= <user>
##$USERA5= <user>
##$V9= 5
##$VALIST= <valist>
##$VCLIST= <CCCCCCCCCCCCCCC>
##$VD= 0
##$VDLIST= <DDDDDDDDDDDDDDD>
##$VPLIST= <PPPPPPPPPPPPPPP>
##$VTLIST= <TTTTTTTTTTTTTTT>
##$WBST= 2048
##$WBSW= 25
##$XGAIN= (0..3)
0 0 0 0
##$XL= 0
##$YL= 0
##$YMAX_a= 551275
##$YMIN_a= -662991
##$ZGOPTNS= <>
##$ZL1= 120
##$ZL2= 120
##$ZL3= 120
##$ZL4= 120
##$ABSF1= 14.98061
##$ABSF2= -5.57192
##$ABSG= 5
##$ABSL= 3
##$ALPHA= 0
##$AQORDER= 0
##$ASSFAC= 0
##$ASSFACI= 0
##$ASSFACX= 0
##$ASSWID= 0
##$AUNMP= <proc_prof1d_extract_pilot.lims>
##$AXLEFT= 0
##$AXNAME= <>
##$AXNUC= <1H>
##$AXRIGHT= 0
##$AXTYPE= 0
##$AXUNIT= <>
##$AZFE= 0.1
##$AZFW= 0.1
##$BCFW= 0
##$BC_mod= 0
##$BYTORDP= 0
##$COROFFS= 0
##$CY= 15
##$DATMOD= 1
##$DC= 0
##$DFILT= <>
##$DTYPP= 0
##$F1P= 0
##$F2P= 0
##$FCOR= 0.5
##$FTSIZE= 32768
##$FT_mod= 6
##$GAMMA= 0
##$GB= 0
##$INTBC= 1
##$INTSCL= 1
##$ISEN= 128
##$LB= 0
##$LEV0= 0
##$LPBIN= 0
##$MAXI= 10000
##$MC2= 0
##$MEAN= 0
##$ME_mod= 0
##$MI= 0
##$NCOEF= 0
##$NC_proc= -8
##$NLEV= 6
##$NOISF1= 0
##$NOISF2= 0
##$NSP= 0
##$NTH_PI= 0
##$NZP= 0
##$OFFSET= 14.98061
##$PC= 1
##$PHC0= 211.2396
##$PHC1= 0
##$PH_mod= 1
##$PKNL= yes
##$PPARMOD= 0
##$PPDIAG= 0
##$PPIPTYP= 0
##$PPMPNUM= 2147483647
##$PPRESOL= 1
##$PSCAL= 4
##$PSIGN= 0
##$PYNMP= <proc.py>
##$REVERSE= no
##$SF= 400.13
##$SI= 32768
##$SIGF1= 0
##$SIGF2= 0
##$SINO= 400
##$SIOLD= 32768
##$SPECTYP= <>
##$SREGLST= <1H.CDCl3>
##$SSB= 0
##$STSI= 32768
##$STSR= 0
##$SW_p= 8223.68421052632
##$SYMM= 0
##$S_DEV= 0
##$TDeff= 65536
##$TDoff= 0
##$TI= <>
##$TILT= no
##$TM1= 0
##$TM2= 0
##$TOPLEV= 0
##$USERP1= <user>
##$USERP2= <user>
##$USERP3= <user>
##$USERP4= <user>
##$USERP5= <user>
##$WDW= 1
##$XDIM= 32768
##$YMAX_p= 467924487
##$YMIN_p= -738450
##$CURPLOT= <Network HP LaserJet P1505>
##$CURPRIN= <$Network HP LaserJet P1505>
##$DFORMAT= <normdp>
##$LAYOUT= <+/1D_H.xwp>
##$LFORMAT= <normlp>
##$PFORMAT= <normpl>
##$SURQMSG= 1
$$ End of Bruker specific parameters
$$ ---------------------------------
##NTUPLES= NMR SPECTRUM
##VAR_NAME=  FREQUENCY,     SPECTRUM/REAL,   SPECTRUM/IMAG
##SYMBOL=    X,             R,               I
##VAR_TYPE=  INDEPENDENT,   DEPENDENT,       DEPENDENT
##VAR_FORM=  AFFN,          ASDF,            ASDF
##VAR_DIM=   32768,         32768,           32768
##UNITS=     HZ,            ARBITRARY UNITS, ARBITRARY UNITS
##FACTOR=    0.250966925370066, 1,           1
##FIRST=     8223.43324360095, 27435,        -85413
##LAST=      0,             143295,          -207733
##MIN=       0,             -738450,         0
##MAX=       8223.43324360095, 467924487,    0
$$ Real data points
##PAGE= N=1
##DATA TABLE= (X++(R..R)), XYDATA
$$ [...]
19543b07739C5995J01640c601l43314g9589D8286K2104b89891f5540A2001d00236
$$ -207739 35995 137635 -3601 -346915 -79589 48286 70390 -289891 -65540 12001 -400236
19531g159p7526l42650A35291l8563k3110j3691e6926B77527j7651a4367j197
$$ -7159 -84685 -427335 135291 96728 73618 59927 -56926 277527 259876 -14367 -15564
19520a5564B48e4166P379k08104J20020D8886b01235b8597l3886a2589D8076a77411
$$ -15564 248 -54166 -46787 -254891 -134871 48886 -201235 -28597 -62483 -12589 48076 -177411
19507b05509C06410a68221H0511a67246g4598q2973L2000l6803A3409a40353c6437
$$ -205509 306410 -168221 80511 -167246 -74598 -157571 -125571 -162374 13409 -140353 -36437
19495a67231A5700g0302A25355a40549r6119A97362a47722p3352n9k65990A43739
$$ -167231 15700 -70302 125355 -140549 -236668 197362 -147722 -221074 -221133 -487123 143739
19483a01724q045A34722l8571D3154a81016d1063j11119q2822P4979k8021Q0988
$$ -101724 -109769 134722 96151 43154 -181016 -41063 -152182 -235004 -160025 -188046 -107058
19472a07058j41313N4485n5727Q9505C30507b99749h1183P880n2118B9079f1497
$$ -107058 -248371 -193886 -249613 -160108 330507 -299749 -81183 -73303 -125421 29079 -61497
19460A50781l9295l9420b53150E8373b76433n6292a49588k444p9684h7123r5358
$$ 150781 111486 72066 -253150 58373 -276433 -332725 -149588 -152032 -231716 -87123 -182481
19449a82481l2334d9826j58562K8971Q1840B7237b42496J04772f7335m8129A11408
$$ -182481 -214815 -49826 -208388 -179417 -97577 27237 -242496 -137724 -67335 -115464 111408
19437F2257A6966J71231a0299G0362h3046o1777C95066n7211H1029N8446a02262
$$ 62257 16966 188197 -10299 70362 -83046 -144823 395066 337855 81029 139475 -102262
19425b33294B22164b45621o6152a3137k12102h6483k33612B82101C9549a15977
$$ -233294 222164 -245621 -311773 -13137 -225239 -86483 -320095 282101 39549 -115977
19414b31218L6573O116o935l803M6906k36651A58196b6267D2189l057b34312j5478
$$ -231218 -194645 -188529 -195464 -199267 -152361 -389012 158196 -26267 42189 39132 -234312 -249790
19402b49790N9739j66491R4529A098J70176b5459m78737J33410a45057M3539K243
$$ -249790 -190051 -356542 -262013 1098 171274 -25459 -504196 -370786 -145057 -101518 -99275
19391i9275k31059J11331A34631f0458G652N6700i5439d1835B12857J2578A00137
$$ -99275 -330334 -219003 134631 -60458 7652 64352 -95439 -41835 212857 225435 100137
19379A82423J10737j43958a03441J19A9499a58682m7151A8023b65671D6681K45015
$$ 182423 293160 149202 -103441 -103322 19499 -158682 -205833 18023 -265671 46681 291696
19368B91696J02110j10300j30459J66186b26362e7391l9877A16903a30985C9991
$$ 291696 393806 283506 153047 319233 -226362 -57391 -97268 116903 -130985 39991
19357h5155B80067j32032a16890F1973b1071B82705b4368B48923A10868a75429
$$ -85155 280067 148035 -116890 61973 -21071 282705 -24368 248923 110868 -175429
19346f2065q8606Q020C37864I4871J36096g6470j26638i3157L4487A16028O8720
$$ -62065 -150671 -142651 337864 94871 230967 -76470 -203108 -93157 -58670 116028 184748
19335A84748b79158J28222j28662R8450j14069B5303J3008c08139A54930a54360
$$ 184748 -279158 -150936 -279598 -181148 -295217 25303 38311 -308139 154930 -154360
19324a75803j4263m3673B4033c0794j2242j33989E8149K7423C4334b94182B49732
$$ -175803 -190066 -233739 24033 -30794 -43036 -177025 58149 85572 34334 -294182 249732
19312b0369o7380L1025C8845J27452h4127J5552A4050h4243l2696A05053a186
$$ -20369 -87749 -56724 38845 166297 -84127 -68575 14050 -84243 -116939 105053 -1186
19300C8997K29788b930k53183D3363a14900q9873B27467r1229E7603a22972N8300
$$ 38997 268785 -2930 -256113 43363 -114900 -204773 227467 136238 57603 -122972 -64672
19289f4672A72014A1494d4363k9571G7638c05964E0075a77117k65417A28074i3191
$$ -64672 172014 11494 -44363 -73934 77638 -305964 50075 -177117 -442534 128074 -93191
19277A43888b89096j88440K08116o7928d4304F917D96K6163g9500j44504g7401
$$ 143888 -289096 -477536 -269420 -337348 -44304 6917 496 26659 -79500 -224004 -77401
19265A48346d7585p4084p9431M5132m5359C22742f4768R609I1374K9915D2916
$$ 148346 -47585 -121669 -201100 -155968 -201327 322742 -64768 -55159 91374 121289 42916
19253f9536m7850B56718c6507k46021a24061q2855G8566a04333j75072A3380R6678
$$ -69536 -117386 256718 -36507 -282528 -124061 -206916 78566 -104333 -279405 13380 110058
19242A10058L0359b13083A97888F9240c9735D00a13945r957m0416d8126I2285
$$ 110058 140417 -213083 197888 69240 -39735 400 -113945 -123902 -164318 -48126 92285
19230d0831j82931d7491l17438A84848a20004M100E1870J72097G9784a97444A55770
$$ -40831 -223762 -47491 -364929 184848 -120004 -115904 51870 223967 79784 -197444 155770
19218a01947j99280D4671c23205D0651c38139C6015K3708c4216D0975d06705i164
$$ -101947 -301227 44671 -323205 40651 -338139 36015 59723 -34216 40975 -406705 -9164
19206G2830b23770h9450A03019g265j37245n5896i1261q0143P2439D8490g7460
$$ 72830 -223770 -89450 103019 -7265 -144510 -200406 -91261 -171404 -98965 48490 -77460
19194B17415H0567a17740j10030G1928a27056a5224m0149H4646l9906I81K7783
$$ 217415 80567 -117740 -227770 71928 -127056 -15224 -55373 84646 44740 981 28764
19183B8764a88188P3008m96652c6156k02266J6910a4728k29608C2183K02193b63244
$$ 28764 -188188 -115180 -611832 -36156 -238422 -221512 -14728 -244336 32183 234376 -263244
19171i1562L7956P342f163H1934a01061a3833D34906b00101L4002M4946j5951
$$ -91562 -53606 -46264 -6163 81934 -101061 -13833 434906 -200101 -166099 -121153 -137104
19160a37104M3546B9427a0973j42614c0617k9682n976p929C8082a29049j7722
$$ -137104 -93558 29427 -10973 -153587 -30617 -60299 -66275 -74204 38082 -129049 -146771
19149a46771j14496i6727A04439i3839K7290l8595D8873A1674a98080r6840E641
$$ -146771 -261267 -96727 104439 -93839 -66549 -105144 48873 11674 -198080 -294920 5641
19137f02438a25761c0186k7876j44678J5570B71684b06927G8167A7205b09294
$$ -602438 -125761 -30186 -58062 -202740 -187170 271684 -206927 78167 17205 -209294
19126h3135n9236A42448h8196k59286J69612j95890C33893d12118J84826A55083
$$ -83135 -142371 142448 -88196 -347482 -177870 -373760 333893 -412118 -227292 155083
19115c51998a53563A03112h981j68588k80290c2715a0609j19351A638O7464b44765
$$ -351998 -153563 103112 -8981 -177569 -457859 -32715 -10609 -129960 1638 69102 -244765
19103b20021B723a8207O817a32j39320H3757h8844A56496E537i745o6403c363
$$ -220021 2723 -18207 -11390 -132 -139452 83757 -88844 156496 5537 -9745 -76148 -3363
19090D310a03482q876B09351B910a34267f1264m4828k6136M7789C2819A5446Q1676
$$ 4310 -103482 -112358 209351 2910 -134267 -61264 -106092 -132228 -84439 32819 15446 97122
19078I7122m4891a69628G7793c4253F6676b804j35792H5731J02905b09043h0402
$$ 97122 52231 -169628 77793 -34253 66676 -2804 -138596 85731 188636 -209043 -80402
19066C85257C30a57092F9173A3907h1663E8527b31146e2628C05313I5501b61812
$$ 385257 330 -157092 69173 13907 -81663 58527 -231146 -52628 305313 95501 -261812
19054b21813d9389D9056K04088J1321D5850a77204c0601n4713H1189C3478d6495
$$ -221813 -49389 49056 253144 264465 45850 -177204 -30601 -85314 81189 33478 -46495
19042F5097j4240N2165f5105E4885a52664a7512j09718k06353n0849H4471d0061
$$ 65097 50857 103022 -65105 54885 -152664 -17512 -127230 -333583 -384432 84471 -40061
19030b19271P0655A29402f3783r4476F5304Q5249b34481k04364A12929a26794
$$ -219271 -148616 129402 -63783 -158259 65304 150553 -234481 -438845 112929 -126794
19019E00996k24026a63425B08571a3300j40316A30362A4815g8635k69252A69442
$$ 500996 276970 -163425 208571 -13300 -153616 130362 14815 -78635 -347887 169442
19008a22925A77810a59606j82206g6580p9348J5344j01684k07682B678Q7850h281
$$ -122925 177810 -159606 -341812 -76580 -155928 -140584 -242268 -449950 2678 90528 -8281
18996A62464p6440a96351A34496e8828I6610J29546c16967J55098B06968A7822
$$ 162464 86024 -196351 134496 -58828 96610 226156 -316967 -161869 206968 17822
18985A07181b00179R2370j92335H8937B1520l878b52497M5788B27197E1975K7291
$$ 107181 -200179 -107809 -300144 88937 21520 17642 -252497 -206709 227197 51975 79266
18974G9266a12758A02920b36028q0793O0260B17225r3008J25815b21517a0472
$$ 79266 -112758 102920 -236028 -316821 -256561 217225 124217 250032 -221517 -10472
18963h2180E7733J82693a93929g7435j14033R5595K1710C60689a50214I3321P1508
$$ -82180 57733 240426 -193929 -77435 -191468 -95873 -74163 360689 -150214 93321 164829
18952A64829c49567a19364O922k7084A40833a2010H3896C5590J11828g8792k26183
$$ 164829 -349567 -119364 -112442 -139526 140833 -12010 83896 35590 147418 -78792 -304975
18941c04975E1728f064l6111j0357A3333d1528j04531A87166a29226A69059D1483
$$ -304975 51728 -6064 -42175 -52532 13333 -41528 -146059 187166 -129226 169059 41483
18929B48373D8048a8648j31379B05179a48340A31874b39598A32780B8334a63024
$$ 248373 48048 -18648 -150027 205179 -148340 131874 -239598 132780 28334 -163024
18918e0013l6744j47318A31295D6460L47233E3790M6600e9376A1748J33353a05009
$$ -50013 -86757 -234075 131295 46460 393693 53790 100390 -59376 11748 145101 -105009
18906A16729C4319J06664b04673R3006B04604k3227p4718h3570p9372A38602c7034
$$ 116729 34319 140983 -204673 -111667 204604 181377 106659 -83570 -162942 138602 -37034
18894C6929a06076B01122a42673B09840a17044l0667A10779b42741a15083k95877
$$ 36929 -106076 201122 -142673 209840 -117044 -147711 110779 -242741 -115083 -410960
18884d10960c6403H1273g1430n8802c0506p9278m6400K7581H9383a91070D9460
$$ -410960 -36403 81273 -71430 -130232 -30506 -109784 -156184 -128603 89383 -191070 49460
18872e4142p5444a3692j70944B7176O8318a59166c3598j06812b4696A12470A7351
$$ -54142 -129586 -13692 -184636 27176 95494 -159166 -33598 -140410 -24696 112470 17351
18860C1837J57675a57912b0614k52041M5453d6348A2606a1529j78521D6044g8864
$$ 31837 189512 -157912 -20614 -272655 -227202 -46348 12606 -11529 -190050 46044 -78864
18848I6984a19727j5294E5395a84490P109k8116D5768a06297j57225A57754p3450
$$ 96984 -119727 -135021 55395 -184490 -177381 -205497 45768 -106297 -263522 157754 84304
18837H4304k5720c12119a53233g1056A92771f3491l51967A74696g8482C2563J02700
$$ 84304 58584 -312119 -153233 -71056 192771 -63491 -415458 174696 -78482 32563 135263
18826A35263c44756i7255k7540a1118l0587A09549a58919I3935L2091D3841N5967
$$ 135263 -344756 -97255 -124795 -11118 -41705 109549 -158919 93935 126026 43841 99808
18815I9808D3321a69051J6302b4754B72625D3847J158c41574e3901B02781k92
$$ 99808 43321 -169051 -152749 -24754 272625 43847 45005 -341574 -53901 202781 202489
18804B02489E3659K53567I3590K51297F7003J19593E8231a16914B71763f8229
$$ 202489 53659 307226 93590 344887 67003 186596 58231 -116914 271763 -68229
18793A8510n438i3737l31802A07105e7545A46081l4159a6512B12111A5645a57987
$$ 18510 13072 -93737 -425539 107105 -57545 146081 111922 -16512 212111 15645 -157987
18781a6996j69973k4081a013j3217n7193K6685b0910H7931f2445j2773B34129
$$ -16996 -186969 -211050 -1013 -14230 -71423 -44738 -20910 87931 -62445 -75218 234129
18769a13092j68771J05741E6435K903a18305b7391l1543j63107J9759N733P7106
$$ -113092 -281863 -176122 56435 59338 -118305 -27391 -58934 -222041 -202282 -196549 -119443
18758a19443P596o2201f31A79620a8892B37a43702O6277k4420C2124J0983a66498
$$ -119443 -111847 -174048 -631 179620 -18892 237 -143702 -77425 -101845 32124 43107 -166498
18745i6233d1770j83092M4020j97550A08001b46445J7950a3533l87585d4912k2807
$$ -96233 -41770 -224862 -180842 -378392 108001 -246445 -228495 -13533 -401118 -44912 -67719
18734f7719A85261b80223K4376h0194B3496Q8941L3357a37495p9596g6581A2042
$$ -67719 185261 -280223 -255847 -80194 23496 112437 145794 -137495 -217091 -76581 12042
18722C08268F7966A3403B691a79245A97835a03310b6638I0958a31698O3363j31840
$$ 308268 67966 13403 2691 -179245 197835 -103310 -26638 90958 -131698 -68335 -200175
18711b00175I8074a65915O4474A52574i6045E9183a3144k9784m94458i3286j66214
$$ -200175 98074 -165915 -101441 152574 -96045 59183 -13144 -42928 -537386 -93286 -259500
18700b59500r1511f9896A22824a47119d1577j10726c6156o9248K1201j44144c6295
$$ -259500 -351011 -69896 122824 -147119 -41577 -152303 -36156 -105404 -84203 -228347 -36295
18688c3176l23438A07222f9250B7785b16849p8896i0760D2781h8427j97500D40711
$$ -33176 -356614 107222 -69250 27785 -216849 -295745 -90760 42781 -88427 -285927 440711
18676d3487k40274B91702j09233C6622M37851C5710K5485J84744H2120a4028F3540
$$ -43487 -283761 291702 182469 36622 474473 35710 61195 245939 82120 -14028 63540
18664g6493A3947L072d5331I6141i9909o047A96513a1432H2607a92510A8823d9378
$$ -76493 13947 17019 -45331 96141 -99909 -105956 196513 -11432 82607 -192510 18823 -49378
18651b72017a06359c1073j05048B5865a60450E3136b51076a11679l46907C7998
$$ -272017 -106359 -31073 -136121 25865 -160450 53136 -251076 -111679 -458586 37998
18640c86926a10439A54400b70810A16672a36572K8196d1377k5986A55545C8624
$$ -386926 -110439 154400 -270810 116672 -136572 -108376 -41377 -67363 155545 38624
18629A28110i6155G4562g4090J6804b1853A13794J78184h5397A25844j8566d9252
$$ 128110 -96155 74562 -74090 -57286 -21853 113794 291978 -85397 125844 107278 -49252
18617I46O9750j6046a09986l25163A23114A9959a18472j37079r6009a33048j52420
$$ 946 70696 54650 -109986 -435149 123114 19959 -118472 -255551 -351560 -133048 -285468
18606b85468C45698a15202q1963P4643k61564a51349E1531j2418b7956A49351
$$ -285468 345698 -115202 -197165 -122522 -384086 -151349 51531 39113 -27956 149351
18595I457c19302C6735a7716j94887i5905k5934e6543k0487l7154I1261g4202
$$ 9457 -319302 36735 -17716 -212603 -95905 -121839 -56543 -77030 -114184 91261 -74202
18583c69531I3311e1935D586e09411a05597C5932c0837j08847M4145d5799I1524
$$ -369531 93311 -51935 4586 -509411 -105597 35932 -30837 -139684 -95539 -45799 91524
18571c05388H4366a10007H195K28353a15055l5185A01974b18657B47502a52245
$$ -305388 84366 -110007 8195 236548 -115055 -150240 101974 -218657 247502 -152245
18560d04958f0195B86363j01907g1671a7183p7261G5112J11902b94430b4692A0053
$$ -404958 -60195 286363 184456 -71671 -17183 -94444 75112 187014 -294430 -24692 10053
18548a36258k33951a776A03822d26761A5748b811l11256L2613E7486k1830P6133
$$ -136258 -370209 -1776 103822 -426761 15748 -2811 -314067 -281454 57486 35656 111789
18537A11789K6302d8832A21841B4234J88609C1746a80407j86703a81385g7168
$$ 111789 138091 -48832 121841 24234 212843 31746 -180407 -367110 -181385 -77168
18526c69843B52522c08682B19875M9143d0556k02248L2297F2647l656k7670e3464
$$ -369843 252522 -308682 219875 269018 -40556 -242804 -210507 62647 58991 31321 -53464
18514B10512a04988B8945b4177m3345o6729o9538e3421J2371j40784r1453G3541
$$ 210512 -104988 28945 -24177 -67522 -134251 -203789 -53421 -41050 -181834 -273287 73541
18502B37331E852K02229h8212A2700c389k50471f5665R751b5503a224B8301J79154
$$ 237331 5852 208081 -88212 12700 -3389 -253860 -65665 -55914 -25503 -1224 28301 207455
18490B07455c71086a12236B7911g6735j16039A51626b15240a314B90059f7045
$$ 207455 -371086 -112236 27911 -76735 -192774 151626 -215240 -1314 290059 -67045
18479G0435a02k19706C48228a28523J2169I0861Q8610J363a91706A09564a15683
$$ 70435 -102 -219808 348228 -128523 -116354 90861 179471 180834 -191706 109564 -115683
18467g7180j51564A92043b35391d9202k87033J49368P1809B2873b51897J07882
$$ -77180 -228744 192043 -235391 -49202 -336235 -186867 -115058 22873 -251897 -144015
18457a44015k95005K14303q2614B63527a40276O6100A00464J53449a57383b7068
$$ -144015 -439020 -224717 -307331 263527 -140276 -74176 100464 253913 -157383 -27068
18446B15608O7683a93414K4950B82233E1409j3511g1892r5259H2536l3982c96816
$$ 215608 283291 -193414 -168464 282233 51409 37898 -71892 -167151 82536 48554 -396816
18434a98507Q8226A53001o8079F877P1522f2229A24012R9810C9248i7309k21266
$$ -198507 -110281 153001 84922 6877 78399 -62229 124012 223822 39248 -97309 -318575
18423c18575p7241A96097a05044A68161a79857j7109F1446c6480A16074n0957
$$ -318575 -395816 196097 -105044 168161 -179857 -196966 61446 -36480 116074 65117
18413F5117c03790Q7914Q5496A0245b19399g9526k65670d1503E20884B15439F9760
$$ 65117 -303790 -215876 -130380 10245 -219399 -79526 -345196 -41503 520884 215439 69760
18401B2137P3511A5477d44833n5232H9869J22838L3818g439n1420A15989n7704
$$ 22137 95648 15477 -444833 -500065 89869 212707 246525 -7439 -58859 115989 58285
18390E8285e8431A2728J34682O3221d9946A26811d1363k84003B0514b65212o5405
$$ 58285 -58431 12728 147410 210631 -49946 126811 -41363 -325366 20514 -265212 -330617
18379c30617O4619I7758Q1012d26678J85953B124h7657p1852e2947j99799J15664
$$ -330617 -265998 97758 178770 -426678 -240725 2124 -87657 -159509 -52947 -252746 -137082
18368a37082o6717B47168b02456A92824a32552G5059d0658k71312B21892f6090
$$ -137082 -203799 247168 -202456 192824 -132552 75059 -40658 -311970 221892 -66090
18357A52064G3809a6985k60274F8874a57443H4128c22437a12770C7533a56034
$$ 152064 73809 -16985 -277259 68874 -157443 84128 -322437 -112770 37533 -156034
18346f1125c0552E6156R665b11163d9130H5711b2058j39223A6502P9847b41289
$$ -61125 -30552 56156 65821 -211163 -49130 85711 -22058 -161281 16502 96349 -241289
18334e225o4482A26181g2925B39699q6936J26782G0683m400a4997C21434h5003
$$ -5225 -69707 126181 -72925 239699 152763 279545 70683 66283 -14997 321434 -85003
18322a8950G9629f3575a8816F7146h6438l9383o5260B51856k4471D9291c29096
$$ -18950 79629 -63575 -18816 67146 -86438 -125821 -191081 251856 227385 49291 -329096
18310a02612p8629N1438A9510J03806L6401a7283n1408B2604a6440N839A92523
$$ -102612 -181241 -129803 19510 123316 159717 -17283 -68691 22604 -16440 -10601 192523
18298g1625C23718f6572L2907k65622B56335b98293B14149f5892B1602B752J13830
$$ -71625 323718 -66572 -33665 -299287 256335 -298293 214149 -65892 21602 2752 116582
18287A16582J0324B3659b920G7668a37471A91917j4551h9545p538M1292c959j05307
$$ 116582 126906 23659 -2920 77668 -137471 191917 177366 -89545 -97083 -55791 -3959 -109266
18275a09266A60694k0985a37775j94847Q9411Q6242K6493e8944j66992B0497c8598
$$ -109266 160694 139709 -137775 -332622 -243211 -156969 -130476 -58944 -225936 20497 -38598
18263f2603K847B91039E4339J84240b31520A69761G5236e9899E9739j494K3691
$$ -62603 -59756 291039 54339 238579 -231520 169761 75236 -59899 59739 58245 81936
18252H1936i6121c4954M765j5196A96008D1926i5190H6853b08880Q4052A32958
$$ 81936 -96121 -34954 -30189 -45385 196008 41926 -95190 86853 -208880 -124828 132958
18240c28138b7127q6758L3452r2596j61395J27780C41816d6767j7493l58665a98898
$$ -328138 -27127 -113885 -80433 -173029 -334424 -206644 341816 -46767 -64260 -422925 -198898
18228h6708D0431J63488H1325a77626B9182c9325A00545K9833k9013g8370b8863
$$ -86708 40431 203919 81325 -177626 29182 -39325 100545 130378 101365 -78370 -28863
18216e964k08582A86367d23715G2994i2611l0289j09181Q4373L0145A6001d15992
$$ -5964 -214546 186367 -423715 72994 -92611 -122900 -232081 -147708 -117563 16001 -415992
18204a38943C5305i9704K7668D0168p532A4238a09833e0470A68751c27731e7799
$$ -138943 35305 -99704 -72036 40168 32636 14238 -109833 -50470 168751 -327731 -57799
18192e8120m9793q0773B04991d465j24721E1185b58895E0948P7883k7694Q453
$$ -58120 -107913 -188686 204991 -4465 -129186 51185 -258895 50948 128831 101137 109590
18181A09590Q0794P0972a17004A97614A9457i6184B1569a93540A53966a4917j82342
$$ 109590 190384 261356 -117004 197614 19457 -96184 21569 -193540 153966 -14917 -197259
18170a97259K3766q3961B13250H1114a93991D9558J53179b8707a0124j520n9714
$$ -197259 -173493 -257454 213250 81114 -193991 49558 202737 -28707 -10124 -11644 -71358
18159g1358j16351A50555b00447e5156a8838H867L7690g4084B65263F0075J14333
$$ -71358 -187709 150555 -200447 -55156 -18838 8867 46557 -74084 265263 60075 174408
18148A74408A8518i4246o5265e0288b1350D8118h8338G7822e6610J2702N017B8375
$$ 174408 18518 -94246 -159511 -50288 -21350 48118 -88338 77822 -56610 -43908 -38891 28375
18135h3035A13891Q6004b4378k76892C15613c81017i5672B83699c40828F8255
$$ -83035 113891 199895 -24378 -301270 315613 -381017 -95672 283699 -340828 68255
18124d5302j24345K7794D30316e5195k91064A65461J66514c6152o8777l7063k04450
$$ -45302 -169647 -141853 430316 -55195 -346259 165461 331975 -36152 -104929 -141992 -346442
18113c46442I3344c75078D9389c6028k8656o0819K2800C15048l3357b28334A62425
$$ -346442 93344 -375078 49389 -36028 -64684 -125503 -102703 315048 281691 -228334 162425
18101b38196A67010g0099o3371a2430A628b2186l38783d7991r0979D18300C2636
$$ -238196 167010 -70099 -133470 -12430 1628 -22186 -360969 -47991 -138970 418300 32636
18089b29511f5265b7335J0417A8942M8353a97919A04174J3927Q7019c04134C03544
$$ -229511 -65265 -27335 -16918 18942 67295 -197919 104174 118101 205120 -304134 303544
18077b21633j7317l8241J35210p7722A16376j3627i4891J6821j35860B0857P1105
$$ -221633 -238950 -277191 -141981 -219703 116376 102749 -94891 -78070 -213930 20857 91962
18066I1962g9287b1331l5622q7769C4538L54342A18671b4813B5824J15823a26707
$$ 91962 -79287 -21331 -56953 -144722 34538 388880 118671 -24813 25824 141647 -126707
18054b6888m115A61773A3345b49785D707b28017d3374p9286A885i9810A58031
$$ -26888 -31003 161773 13345 -249785 4707 -228017 -43374 -122660 1885 -99810 158031
18042A18728R7217i7209A72739b73833C75504a61366A97199a68739B68014I6689
$$ 118728 215945 -97209 172739 -273833 375504 -161366 197199 -168739 268014 96689
18031a02800k23478f5471C43844A65048g8716b8062B15830I6192m0276b6951j07283
$$ -102800 -326278 -65471 343844 165048 -78716 -28062 215830 96192 55916 -26951 -134234
18020a34234h949r3230k5908L3365l7145j53116J33161R593d1468B21763h7203
$$ -134234 -8949 -102179 -128087 -94722 -131867 -284983 -151822 -142229 -41468 221763 -87203
18008A72831A7032O4927i0598C85135A20934B0322h5662B19930j08851J31104
$$ 172831 17032 81959 -90598 385135 120934 20322 -85662 219930 111079 242183
17998B42183a6477p929k5431j32676J4908A15611c11530C9696a94688H7148a60335
$$ 242183 -16477 -24406 -49837 -182513 -167605 115611 -311530 39696 -194688 87148 -160335
17986H2816b38538i5617B92437a40035d4811H6873A3786a59411n8790c781H8490
$$ 82816 -238538 -95617 292437 -140035 -44811 86873 13786 -159411 -218201 -3781 88490
17974A6871a0170j11038A83033c7048j01060B5282d4714k30590j80660K06171
$$ 16871 -10170 -121208 183033 -37048 -138108 25282 -44714 -275304 -455964 -249793
17964b49793h9428j83001i3154B8694J02833h550k8183m5868j53706E0346i6519
$$ -249793 -89428 -272429 -93154 28694 131527 -8550 -36733 -82601 -236307 50346 -96519
17952b14436A30109a01784k11161a32967c9422A25868m6657b24526a10948j36390
$$ -214436 130109 -101784 -312945 -132967 -39422 125868 79211 -224526 -110948 -247338
17942b47338L9171D4989K5311c17031a54745A92662G5697C4287J97377c8101m683
$$ -247338 -208167 44989 70300 -317031 -154745 192662 75697 34287 231664 -38101 -42784
17931d2784B448a77743O6625A35393b57886f2714m8481A08920b087k19980A63160
$$ -42784 2448 -177743 -111118 135393 -257886 -62714 -111195 108920 -2087 -222067 163160
17919c4354k02492B04462c97508J73850A72434D3686J09837f6045D7649R3791
$$ -34354 -236846 204462 -397508 -223658 172434 43686 153523 -66045 47649 141440
17909A41440h0711A50556a21779j00021B3071a00313L6426o1451r3841O3521P3334
$$ 141440 -80711 150556 -121779 -221800 23071 -100313 -63887 -125338 -219179 -155658 -82324
17898h2324j66064n5013a05873A44529h2448n8801H8705D2156h7926B81430g2347
$$ -82324 -248388 -303401 -105873 144529 -82448 -141249 88705 42156 -87926 281430 -72347
17886b48018D6882a05067e2514k86072B22664d4733A36131b31538R7386B903J65955
$$ -248018 46882 -105067 -52514 -338586 222664 -44733 136131 -231538 -134152 2903 168858
17875A68858c223j28996k368B34208a16604B1362J75466J01851D6843e4314A29584
$$ 168858 -3223 -132219 -134587 234208 -116604 21362 196828 298679 46843 -54314 129584
17863a4488A04246C9270a59378B77300d6145A76325K27451A4413b7554j3584E2364
$$ -14488 104246 39270 -159378 277300 -46145 176325 403776 14413 -27554 -41138 52364
17851A57196e3416p0680B75190a69105a8695j27884A49659l6498P3138q3250i8634
$$ 157196 -53416 -124096 275190 -169105 -18695 -146579 149659 113161 186299 103049 -98634
17839a48494B349J23863c01438a3242G3715J04147a09655o4952H6380b22686B19276
$$ -148494 2349 126212 -301438 -13242 73715 177862 -109655 -174607 86380 -222686 219276
17827b49772I0084j4196a17473A62214b52240c7603A75844B595K97880p0984j3701
$$ -249772 90084 75888 -117473 162214 -252240 -37603 175844 2595 300475 229491 215790
17816B15790J37293r5151J83989H8217a8126C36528e0344C0013J50374a22182
$$ 215790 353083 257932 441921 88217 -18126 336528 -50344 30013 180387 -122182
17805b84774B55380I5502a69491D11867A11326f2883I8468a85186A62596h9188
$$ -284774 255380 95502 -169491 411867 111326 -62883 98468 -185186 162596 -89188
17794E0458i6452K4001H9957a23921b5998k65006B81106f0219B01572a6211n2516
$$ 50458 -96452 -72451 89957 -123921 -25998 -291004 281106 -60219 201572 -16211 -68727
17783f8727I4677J65824d7417B15521r0227a04006p2129c326o7129h779B57982
$$ -68727 94677 260501 -47417 215521 125294 -104006 -176135 -3326 -70455 -8779 257982
17771E6383a39132E1309J39117k3106b9553a2702F4329A2797J54269C4129a48185
$$ 56383 -139132 51309 190426 167320 -29553 -12702 64329 12797 167066 34129 -148185
17759D4014J1574b2050j47221e3705K0039l8403D1848F079J50709c41853A0015
$$ 44014 55588 -22050 -169271 -53705 -33666 -72069 41848 6079 156788 -341853 10015
17747B15136p5211i6842D147K71503A06646a24056b8073H1473c29014E7309a3165
$$ 215136 139925 -96842 4147 275650 106646 -124056 -28073 81473 -329014 57309 -13165
17735A35166a10534G4988B6927n438Q8621J80282F7798b63229A05003J22426j7067
$$ 135166 -110534 74988 26927 21489 110110 290392 67798 -263229 105003 227429 210362
17724B10362e5664m0307A32033a64946A17923R8970q4476Q852F396K34697j00595
$$ 210362 -55664 -95971 132033 -164946 117923 216893 132417 141269 6396 241093 140498
17713A40498e7919C2110A017a19649B90178a82280B23817l4250C5850J44238a26794
$$ 140498 -57919 32110 1017 -119649 290178 -182280 223817 189567 35850 180088 -126794
17701A56789k1565b46730L5010o319B2254N8489i9767A44299i9202A40642O0837
$$ 156789 135224 -246730 -211720 -218039 22254 80743 -99767 144299 -99202 140642 201479
17690B01479h0294l7517N4581A20264J83667a51438J0914H7144a00368B82806
$$ 201479 -80294 -117811 -63230 120264 303931 -151438 -140524 87144 -100368 282806
17679a98614B22991a03201A98360d5923j40252A40252O2582g1611A54480b55953
$$ -198614 222991 -103201 198360 -45923 -186175 140252 202834 -71611 154480 -255953
17668H1020J24337b08378M7212M6225C05705b376j01668A05252f0974j36907C7065
$$ 81020 205357 -208378 -161166 -114941 305705 -2376 -104044 105252 -60974 -197881 37065
17656B56866a1959p01B26534C9233J13795R5696b19638A09935a99191B76112n9369
$$ 256866 -11959 -12660 226534 39233 153028 248724 -219638 109935 -199191 276112 216743
17645B16743g5317B08532P6521B9512j287N3041a3669C25423E2621J14600n3200
$$ 216743 -75317 208532 285053 29512 28225 81266 -13669 325423 52621 167221 114021
17634A14021j8842O5402p0451B178J71510a98450A33993J30797d1268a9302n2002
$$ 114021 95179 160581 90130 2178 173688 -198450 133993 264790 -41268 -19302 -71304
17623g1304j36549C02724I8617j0590J44878D0913A4761a85488k6641E5197f0778
$$ -71304 -207853 302724 98617 88027 232905 40913 14761 -185488 -212129 55197 -60778
17611G6704b80204A34226E6508c86798A03073a59183A51035a6013j0477C2122
$$ 76704 -280204 134226 56508 -386798 103073 -159183 151035 -16013 -26490 32122
17600i9674a5529k19606e6957A44317b11950C5535Q502J9625a095D78239b00420
$$ -99674 -15529 -235135 -56957 144317 -211950 35535 44037 63662 -1095 478239 -200420
17588a88265a3575B95068A43629b0014m6174k15613B19332a08520d3286B12688
$$ -188265 -13575 295068 143629 -20014 -66188 -281801 219332 -108520 -43286 212688
17577F1239e1442A12226c24548L1824a00226F6749L4902L00393i9777q1909A33365
$$ 61239 -51442 112226 -324548 -292724 -100226 66749 101651 402044 -99777 -181686 133365
17565a42373K8114d8592A43956b81034A6609b57025F84J02404a45770B42878k2552
$$ -142373 -114259 -48592 143956 -281034 16609 -257025 684 103088 -145770 242878 220326
17554B20326e4459a0529o054l1757C2690N3958a58655P9237c2761A14014L2887
$$ 220326 -54459 -10529 -16583 -48340 32690 86648 -158655 -79418 -32761 114014 146901
17543A46901a4041j47938L679A43128J85393A402K48994K08334j27366k7444c38900
$$ 146901 -14041 -161979 -158300 143128 328521 1402 250396 458730 331364 303920 -338900
17531F5924e8872C17137j21466J90325g5654C4639a6702B01227k5337a07220a6699
$$ 65924 -58872 317137 195671 385996 -75654 34639 -16702 201227 175890 -107220 -16699
17519A47312l241a10215A02938C57a12044C59984j51009m9932b9214k35270P9743
$$ 147312 144071 -110215 102938 357 -112044 359984 208975 159043 -29214 -264484 -184741
17508a84741h6540C78567A3726b27381B57516b1775G5180c0231D995g0133A95719
$$ -184741 -86540 378567 13726 -227381 257516 -21775 75180 -30231 4995 -70133 195719
17496A29662g777B37952j16817K63330j31266A0112L69752d0985G886J08261J91116
$$ 129662 -7777 237952 121135 384465 253199 10112 379864 -40985 7886 116147 307263
17485C07263a58772B74045d1015k13796C3291a35095K5124E4212i8072j4300C06213
$$ 307263 -158772 274045 -41015 -254811 33291 -135095 -109971 54212 -98072 -112372 306213
17473a7470q9240A75797K7575H5217K21155f0776p1830H26J99873k8820P4253
$$ -17470 -106710 175797 203372 85217 306372 -60776 -132606 826 200699 171879 246132
17462B46132m5348A6615M78205g8956A41442o6246L0086J55078i3296C54876q9687
$$ 246132 200784 16615 494820 -78956 141442 75196 105282 260360 -93296 354876 265189
17451B65189M2118m0218q8392j2140M8043d3477J2810B81516o3666P2933e910
$$ 265189 307307 267089 178697 166557 214600 -43477 -30667 281516 217850 290783 -5910
17439A26951a31715A33042M6688J01718j10267K36294J43287O5031a6196A71298
$$ 126951 -131715 133042 179730 281448 171181 407475 550762 615793 -16196 171298
17428B12296Q4154n7753J07471A27432M07363c0648F44295B10807F3725K89056
$$ 212296 296450 238697 346168 127432 534795 -30648 644295 210807 63725 352781
17418C52781G5390K28750R2263e2373k96036C20407I8467M9315R0770O45j01897
$$ 352781 75390 304140 396403 -52373 -348409 320407 98467 147782 238552 239197 137300
17407A37300J45773h3575D61440J82906B61216n4886m9789b6169H6870N6975b060
$$ 137300 283073 -83575 461440 644346 261216 206330 156541 -26169 86870 143845 -2060
17395D45038B10387p5848f2528D02083B2711N5961b43322A69720P4839a2464A83642
$$ 445038 210387 134539 -62528 402083 22711 78672 -243322 169720 244559 -12464 183642
17383d3273C67298j20106J29418J6949C2552K24069J05069p0610b7270B97634
$$ -43273 367298 247192 376610 393559 32552 256621 361690 291080 -27270 297634
17372g2756H3484K8522L0766F0314p640k0837b89077A53771J40888C7751R1213
$$ -72756 83484 112006 142772 60314 52674 31837 -289077 153771 294659 37751 128964
17361A28964K46866a21574m0275H4366N2541J02506d9322A6478L74631a3901B39940
$$ 128964 375830 -121574 -161849 84366 136907 239413 -49322 16478 391109 -13901 239940
17349F7011Q1813c2098I7894a64982C66962q3974L0238r9134F3150K099b40799
$$ 67011 148824 -32098 97894 -164982 366962 282988 313226 214092 63150 65249 -240799
17337D1495R3051K07956f8852D17930e8832k01619B12336L2739p9956M727J57895
$$ 41495 134546 342502 -68852 417930 -58832 -260451 212336 245075 165119 169846 327741
17326C27741D7637J20625k0346J16200d5037n047F0786N2310K01326I2285J75041
$$ 327741 47637 168262 147916 264116 -45037 -50084 60786 113096 314422 92285 267326
17315B67326f5634a1325B16708K53721a2140A12988L1361K01146A8993K40930
$$ 267326 -65634 -11325 216708 470429 -12140 112988 144349 345495 18993 259923
17305B59923A00608J64691J67181j31952a7872C2031O7063K61573j32579J75269
$$ 259923 100608 265299 432480 300528 -17872 32031 99094 360667 228088 403357
17295D03357K0555A67R7951J42828a0442j07815B87695G0216J40323a0899C39125
$$ 403357 423912 167 98118 240946 -10442 -118257 287695 70216 210539 -10899 339125
17283C5862M34035G1211K03167E1556J61454J29579A53692L2452p3436B7169e37627
$$ 35862 469897 71211 274378 51556 213010 342589 153692 186144 112708 27169 -537627
17271A42924N3019a95665D51726O4685A21114D2504H062J10026i63A34114L6593
$$ 142924 195943 -195665 451726 516411 121114 42504 8062 118088 -963 134114 170707
17260A70707P8768A17872a24909I954M61936b16666A83776R9790J73235a8718
$$ 170707 249475 117872 -124909 9954 471890 -216666 183776 283566 456801 -18718
17249B21683C9796b14534B05332M74011d9669I9161K00770M2802B8740Q9815B8064
$$ 221683 39796 -214534 205332 679343 -49669 99161 299931 342733 28740 118555 28064
17237h1614C08095c07970C83249A44002l7120l1673Q0059j8099B0089h4934B0728
$$ -81614 308095 -307970 383249 144002 106882 75209 155268 137169 20089 -84934 20728
17225A61338k5454M3032J93039b47592C56225j09652C4908Q5093J61629c471C00852
$$ 161338 135884 178916 371955 -247592 356225 246573 34908 120001 281630 -3471 300852
17213B10547N4341j28325N60K65267j89426K28279A45362O9078A03549B9069L09618
$$ 210547 264888 136563 137123 402390 212964 441243 145362 214440 103549 29069 338687
17202C38687A43223J23636r1175P307K88566A80504L6288B7925R6254A7580J37231
$$ 338687 143223 266859 175684 182991 471557 180504 216792 27925 124179 17580 154811
17191A54811b2233H8879J22009R0946J78464E9774J45816F7953J57045K8150k8221
$$ 154811 -22233 88879 210888 301834 480298 59774 205590 67953 224998 253148 224927
17180B24927L47562a11555A55719q274m0929J13197L48886A98905m3902K40828
$$ 224927 572489 -111555 155719 147445 106516 219713 568599 198905 155003 395831
17170C95831A22585M3374c7784D89032A34708l6314J39724c1861C04446L754J20621
$$ 395831 122585 165959 -37784 489032 134708 98394 238118 -31861 304446 308200 428821
17159D28821A34493J62628L65104c3131P187D17883P3863F2435J43838J05387
$$ 428821 134493 297121 662225 -33131 -25944 417883 491746 62435 206273 311660
17149C11660A49988K75909A17150K57913J30607j22468N7545E4829K44883j11150
$$ 311660 149988 425897 117150 375063 505670 383202 440747 54829 299712 188562
17139A88562L96517B8144L2031N44688C00963j09106q4572M1034K98373r5915
$$ 188562 585079 28144 60175 604863 300963 191857 107285 148319 446692 350777
17129C50777m3481h0123a9712C04987A8449K91727q5463l1629J46296j07344L46196
$$ 350777 307296 -80123 -19712 304987 18449 310176 224713 193084 339380 232036 578232
17118E78232k84675J74811k24099E2114L88418r7083K37323k69523J54466I6732
$$ 578232 293557 468368 244269 52114 440532 343449 580772 311249 465715 96732
17107B1782M54882j97626A36333R5538e2084A45365J30037K77051B36392j2878
$$ 21782 476664 279038 136333 231871 -52084 145365 275402 552453 236392 223514
17097B23514N9312P1253J21055B26838k7081P1722j5982L06209A78857K02302
$$ 223514 282826 354079 475134 226838 199757 271479 255497 561706 178857 381159
17087C81159O6948K6744j67923J38422m1773j68178N76754l12519p1782j1904
$$ 381159 448107 474851 306928 445350 403577 235399 812153 499634 427852 415948
17077D15948o8127N00699l05456A89338O1625J20803K75961k23983K80258A76828
$$ 415948 347821 848520 543064 189338 250963 371766 647727 423744 704002 176828
17066B95604K6214J94223q2222n2448L5572r6925M5811M519J11341J34211k39157
$$ 295604 321818 516041 433819 381371 416943 320018 365829 370348 481689 615900 376743
17055C76743N2343k13423K16852L70210C59125L29588k76068K22243j7942m0551
$$ 376743 429086 215663 432515 802725 359125 688713 412645 634888 616946 576395
17045E76395J44824A75222J48647K25495L26402l01095j63367k2249J07478K05224
$$ 576395 721219 175222 323869 549364 875766 574671 411304 389055 496533 701757
17035G01757C29689l0032J75651j9272k12600K99964O9207r0268j09393k0337
$$ 701757 329689 299657 475308 456036 243436 543400 612607 522339 412946 392609
17025C92609Q9357k01602K13087j60828J00425N6985J9654J22408B80820J72101
$$ 392609 481966 280364 493451 332623 433048 490033 509687 632095 280820 452921
17015D52921j355K22248B51525R4828J99120J13533j27326j21214K04659k52638
$$ 452921 451566 673814 251525 346353 545473 659006 531680 410466 615125 362487
17005C62487J87815r2714Q4809j51796J59980K98214j43811n8911B64804K27492
$$ 362487 550302 457588 542397 390601 550581 848795 704984 646073 264804 492296
16995D92296J51441l6376k07082J61427J52950K27305D57239j112m6290L51759
$$ 492296 643737 607361 400279 561706 714656 941961 457239 456127 409837 761596
16985G61596j09122K48724j76237q8928j38444j29812M40775O1176k19127N0750
$$ 761596 652474 901198 724961 636033 497589 367777 808552 869728 650601 701351
16975G01351k22921K71826l0564L757o5882j57568L88857j52722K2848L26175
$$ 701351 478430 750256 719692 723449 657567 499999 888856 736134 758982 1085157
16965A085157m03821j46885P23279m60674r8608N8006J51274M7224l55198Q6536
$$ 1085157 681336 534451 1257730 797056 698448 756454 907728 954952 599754 686290
16955F86290N2822o1086K09293M3600Q1655k84378L37499k70326L75795j85678
$$ 686290 739112 678026 887319 930919 1012574 728196 1065695 795369 1171164 985486
16945I85486k66584J90179Q9278C90491O74818k04864L29994n69855M74645l66010
$$ 985486 718902 909081 998359 390491 1065309 860445 1190439 620584 1095229 729219
16935G29219J43236J25943J06562J38374n96318M73897k39801J7985J56504j74993
$$ 729219 872455 998398 1104960 1243334 647016 1120913 881112 899097 1055601 880608
16925H80608J74215R1250l46539K53907m9709J00235m1218K37713m17743J79395
$$ 880608 1054823 1146073 799534 1053441 1003732 1103967 1062749 1300462 882719 1062114
16915A062114J82595R057k0073Q4895r3706J30192q6816q7811O2135J32123K43399
$$ 1062114 1244709 1253766 1233693 1318588 1224882 1355074 1268258 1180447 1242582 1374705 1618104
16904A618104k51854k39518M82100j14816j78551p0774k27101N27905J5291j23123
$$ 1618104 1366250 1126732 1608832 1494016 1315465 1244691 1017590 1545495 1560786 1437663
16894A437663m1888K68991j72479P9535m0228J33617r9022J66359j52729j00326
$$ 1437663 1395775 1664766 1492287 1571822 1531594 1665211 1566189 1732548 1579819 1479493
16884A479493K05820O0803P2398l72354M25641j00965J89157k05663R1493l43206
$$ 1479493 1685313 1746116 1818514 1446160 1871801 1770836 1959993 1754330 1845823 1502617
16874A502617L81275J47866Q1388k92096P9218n0203J41174k05894m39926O84420
$$ 1502617 1883892 2031758 2113146 1821050 1900268 1850065 1991239 1785345 1345419 2029839
16864B029839J48510n1060M2575k03520L17262j983n40226L42562J5934N8418
$$ 2029839 2178349 2127289 2169864 1966344 2283606 2281623 1741397 2083959 2099893 2158311
16854B158311n2680N36345m00239o4812K91873N3306m1238J98077j67087o3650
$$ 2158311 2105631 2641976 2241737 2176925 2468798 2522104 2480866 2678943 2511856 2448206
16844B448206J36226L72070l39511r7789J21453K40158l50136M13265j17577M6099
$$ 2448206 2584432 2956502 2616991 2519202 2640655 2880813 2530677 2943942 2826365 2872464
16834B872464L90249J9087K08534j95308j3828j18424K28030K67802k69622r8000
$$ 2872464 3262713 3281800 3490334 3295026 3281198 3162774 3390804 3658606 3388984 3290984
16824C290984L55680K53028j67604j61220L00890m06791P02339J3407p3302J20059
$$ 3290984 3646664 3899692 3732088 3570868 3871758 3464967 4167306 4180713 4107411 4227470
16814D227470L24965j82604L75303l9851k3293J6896Q8461J88227Q2456J7380
$$ 4227470 4552435 4369831 4745134 4705283 4681990 4698886 4787347 4975574 5058030 5075410
16804E075410q6190O00650m49487R61212m13652K11613N7080K64676J10608j9648
$$ 5075410 4989220 5589870 5140383 6101595 5687943 5899556 5956636 6221312 6331920 6312272
16794F312272m9572L68633j50809J28328L85162K1823K82794L60689J90149Q2172
$$ 6312272 6262700 6631333 6480524 6608852 6994014 7015837 7298631 7659320 7849469 7931641
16784G931641P3413K3835M07768L09982L10490P4215l9831N37029J70041N71265
$$ 7931641 8005054 8028889 8436657 8746639 9057129 9131344 9091513 9628542 9798583 10369848
16774A0369848M37824j79422L50044L10595K94878O60373L28898M21867K73831
$$ 10369848 10807672 10628250 10978294 11288889 11583767 12244140 12573038 12994905 13268736
16765A3268736L42501M77713O15750K78248M78593J092656R7171R58789L48267
$$ 13268736 13611237 14088950 14704700 14982948 15461541 16554197 16651368 17610157 17958424
16756A7958424Q93335L38749P44826O82729O64828J242695O03348J155318R54383
$$ 17958424 18851759 19190508 19935334 20618063 21282891 22525586 23128934 24284252 25238635
16747B5238635J003109J056377J185904J279508J197646J471007J400878J615749
$$ 25238635 26241744 27298121 28484025 29763533 30961179 32432186 33833064 35448813
16739C5448813J852549J919162K104089K066798K164157K542743K522178K676718
$$ 35448813 37301362 39220524 41324613 43391411 45555568 48098311 50620489 53297207
16731E3297207L101737K979440L561801L773756L773777M036118M827153M825939
$$ 53297207 56398944 59378384 62940185 66713941 70487718 74523836 79350989 84176928
16723H4176928N234762N284327O207546O561279O729424O935789P297395P540077
$$ 84176928 89411690 94696017 100903563 107464842 114194266 121130055 128427450 135967527
16715A35967527Q227821P885090Q459276P810285Q000556P430475P050872O203566
$$ 135967527 144195348 152080438 160539714 168349999 176350555 183781030 190831902 197035468
16707A97035468N210373M170488L205400Q91173P7944j226446k684907m051726
$$ 197035468 202245841 206416329 209621729 210512902 210590846 209364400 206679493 202627767
16699B02627767n370260o254348o354683p539363q339614p636863p966832q611030
$$ 202627767 197257507 191003159 184648476 177109113 168769499 161132636 153165804 144554774
16691A44554774p635122p781804p464251o886384o995384n952720o571490n693090
$$ 144554774 136919652 129137848 121673597 114787213 107791829 101839109 95267619 89574529
16683H9574529n164462n021790m582806m276147m269592l600633l747780l035517
$$ 89574529 84410067 79388277 74805471 70529324 66259732 62659099 58911319 55875802
16675E5875802l203396k817602k666479k098061k882413j791035k038906j786680
$$ 55875802 52672406 49854804 47188325 45090264 42207851 40416816 38377910 36591230
16667C6591230j916945j695294j430768j436651j443779j100927r12914j491733
$$ 36591230 34674285 32978991 31548223 30111572 28667793 27566866 26653952 25162219
16659B5162219q00380q89549j501465o95517m82369r79262n11614p91068r74408
$$ 25162219 24361839 23472290 21970825 21275308 20792939 19813677 19302063 18510995 17536587
16650A7536587l11688q85525m4849o27969o52272l84165o48991n14525n81851
$$ 17536587 17224899 16339374 16294525 15666556 15014284 14630119 13981128 13466603 12884752
16641A2884752k26636l40522m74222k07507m13779j312q61175J49622q31022o9307
$$ 12884752 12658116 12317594 11843372 11635865 11222086 11220774 10359599 10509221 9678199 9608892
16631I608892p5739l45735l35538k57757P5034n86448J1422k26666J48893m63315
$$ 9608892 9533153 9187418 8851880 8594123 8669157 8082709 8094131 7867465 8016358 7553043
16621G553043l79405j16075r5800j96592j43003j76602j6450q7439m95006k8411
$$ 7553043 7173638 7057563 6961763 6765171 6622168 6445566 6429116 6341677 5846671 5818260
16611E818260j47846m0868l1645k91177J7476l46381L3811q9987l17908K04994
$$ 5818260 5670414 5629546 5597901 5306724 5324200 4977819 5011630 4921643 4603735 4808729
16601D808729m39608J16145k73703K82314O9445m53180q5742l03403J5045k22739
$$ 4808729 4369121 4485266 4211563 4493877 4563322 4110142 4024400 3720997 3736042 3513303
16591C513303K61438K471R8162n55622J61725J12148m10193L76924p05136M59102
$$ 3513303 3774741 3777212 3875374 3319752 3481477 3593625 3183432 3560356 2855220 3314322
16581C314322o0770l41161M39253l45802k55009K64727L7634j77661l26104K50022
$$ 3314322 3253552 2912391 3351644 3005842 2750833 3015560 3053194 2875533 2549429 2799451
16571B799451l31091N47936m97413J81811j40103k46471N27786o27268J98662
$$ 2799451 2468360 3016296 2518883 2700694 2560591 2314120 2841906 2214638 2413300
16562B413300r2833m80497Q7012J69496J39117l39770K4944K45952l50486L35755
$$ 2413300 2320467 1839970 1926982 2096478 2235595 1895825 1920769 2166721 1816235 2151990
16552B151990k38856j56652K71271p8422J43625l34124J20639k47045M30867l41577
$$ 2151990 1913134 1756482 2027753 1949331 2092956 1758832 1879471 1632426 2063293 1721716
16542A721716m2955k1629O9526m43296L29466k12206K9580L32373j40807j16391
$$ 1721716 1678761 1657132 1726658 1283362 1612828 1400622 1430202 1762575 1621768 1505377
16532A505377m5519m1525K050p9912J74524j73302M4804l75531L30380J08554
$$ 1505377 1459858 1418333 1420383 1340471 1514995 1341693 1386497 1010966 1341346 1449900
16522A449900L9239l88391K80702k8919n0705l59024M38716l29473N9472k00754
$$ 1449900 1489139 1100748 1381450 1352531 1301826 942802 1381518 1052045 1111517 910763
16512I10763K70729l0493K27290q6213k78389J27100j5682l48758o6152O8805
$$ 910763 1181492 1150999 1378289 1292076 1013687 1140787 1125105 776347 710195 779000
16502G79000J39533J82175j83251J74219j28599J82405l8639k25782k20074K32061
$$ 779000 918533 1100708 917457 1091676 963077 1145482 1106843 881061 660987 893048
16492H93048M5073j52236j1594K23290j69942j74262N71481k23105m22961K38105
$$ 893048 938121 785885 774291 997581 827639 653377 1224858 1001753 578792 816897
16482H16897C70461N24882K17420m79808J59737J39878k70080k7060K55346j80675
$$ 816897 370461 895343 1112763 632955 792692 932570 662490 635430 890776 710101
16472G10101J7197l5434k22570K82288j60664J38830l5865L22629r3602O9856
$$ 710101 727298 691864 469294 751582 590918 729748 693883 1016512 922910 992766
16462I92766j11318l01854B57732M59511p8082J25160M7950j86595K60998j96196
$$ 992766 881448 579594 257732 717243 639161 764321 812271 625676 886674 690478
16452F90478P4562J03422m13686M14694m23017K24264k12622q3569O87055l38690
$$ 690478 765040 868462 454776 869470 446453 670717 458095 374526 1061581 722891
16442G22891l5890p3228O7874A71873O57604k97153A89449M85924m8652n6051
$$ 722891 687001 613773 681647 171873 829477 532324 189449 675373 626721 570670
16432E70670B69772L33036q304P2946C03992P2768J54740q3122O5668q9466j41495
$$ 570670 269772 602808 594504 667450 303992 376760 531500 448378 514046 424580 283085
16421B83085P3024j9555J53290J53115n6629K3956o9872j06646O9470N1298k18744
$$ 283085 356109 336554 489844 642959 586330 610286 540414 433768 503238 554536 335792
16410C35792J19578K15405j35933j82107A52604K51097L55361k85225j2616O3036
$$ 335792 455370 670775 534842 352735 152604 403701 759062 473837 461221 524257
16400E24257j16312L8981j50015L18563k51632J69850N0026k80280J33758E3569
$$ 524257 407945 446926 296911 615474 363842 533692 583718 303438 437196 53569
16389F02273j20564A87090K98181j58446k2941M50552B78941J93879o8274j97544
$$ 602273 481709 187090 485271 326825 303884 754436 278941 472820 404546 207002
16379B07002J23635A38219M48235r5010p1018A29358L22291j35210K37J8399j54582
$$ 207002 330637 138219 586454 491444 420426 129358 451649 316439 316676 335075 180493
16368A80493K03173j08820J74674j19750j22913l895M49851B57561L5127P3431
$$ 180493 383666 274846 449520 329770 206857 202962 652813 257561 292688 366119
16358C66119D3235N9330L78345J45903B84402a06290D02236j00377j2977G2834
$$ 366119 43235 102565 480910 626813 284402 -106290 402236 301859 288882 72834
16347A04400P8612J17220L370j9048n7705h8354B28062L71230B61645H8767K64439
$$ 104400 183012 300232 303602 284554 226849 -88354 228062 599292 261645 88767 353206
16336C53206N4752A29584A4060b4576B76183K73573l5157F3378L82348B05946
$$ 353206 407958 129584 14060 -24576 276183 549756 514599 63378 445726 205946
16325B60234j0776j06567J23436e3912B60035m7186J28946r1749J42062A55542
$$ 260234 249458 142891 266327 -53912 260035 212849 341795 250046 392108 155542
16314D44243m6928j93874J53869A43077J1581J57988k5974K5893j31572J41135
$$ 444243 397315 203441 357310 143077 154658 312646 286672 312565 180993 322128
16304C22128J92017I7861a14274C89411a1419C47542j63718B8459J19986a52502
$$ 322128 514145 97861 -114274 389411 -11419 347542 183824 28459 148445 -152502
16293D18152a25046A98213F8515J13434L54238A28566K5217M46779A59565J78955
$$ 418152 -125046 198213 68515 181949 536187 128566 153783 600562 159565 338520
16283C38520A53159N7955Q3858r9837Q4622J75637H476J84790K8714G1351L3671
$$ 338520 153159 211114 294972 195135 279757 455394 8476 193266 221980 71351 105022
16272A05022J40638E1059K55038Q2251j89321O5584l666M389h9902B14542J70006
$$ 105022 245660 51059 306097 388348 199027 264611 260945 265334 -89902 214542 384548
16261C84548b3379C56150G0141J76410h2740f67I1755K33468B9238L02020A55292
$$ 384548 -23379 356150 70141 246551 -82740 -667 91755 325223 29238 331258 155292
16249B09226J37362a38325D9587K302a14599B26537I8808O70O6710P5794p3091
$$ 209226 346588 -138325 49587 51889 -114599 226537 98808 99478 166188 241982 168891
16238A68891l6453a52935j7622E3428J56820m5034f0614j17666B14688A01201
$$ 168891 132438 -152935 -170557 53428 210248 165214 -60614 -178280 214688 101201
16227A76642D8332G713L33571a09695k1009A53813O8637f4796B36317J89500A22873
$$ 176642 48332 7713 341284 -109695 -130704 153813 222450 -64796 236317 425817 122873
16215A5685f9154G9894A6964K59229b19153A45128G0881k9176K35213A24209j6650
$$ 15685 -69154 79894 16964 276193 -219153 145128 70881 41705 276918 124209 107559
16204A07559n1071Q0255K44173j01122O8545a06210j40665C50491a0006C7367
$$ 107559 56488 136743 380916 279794 348339 -106210 -246875 350491 -10006 37367
16193B05277b1488B87196q0857j0360l1191G1234a78397A35410M5967c4432j824
$$ 205277 -21488 287196 206339 195979 164788 71234 -178397 135410 181377 -34432 -36256
16182c6256A85397J00461k0953b05023G9342a5462j73851A14959d9706H0959c772
$$ -36256 185397 285858 264905 -205023 79342 -15462 -189313 114959 -49706 80959 -3772
16170B43929B2829J10468B3294a07055A11935M02991I0689C1036L4954J9811e6717
$$ 243929 22829 133297 23294 -107055 111935 514926 90689 31036 65990 85801 -56717
16158B5738G48K9551A4113i1297E8931h007C18421i8340C81382A70215a01732
$$ 25738 748 30299 14113 -91297 58931 -8007 318421 -98340 381382 170215 -101732
16146A22665n0314b33098A00857C402M8986P1358g3713C11000c6656D51666a88794
$$ 122665 72351 -233098 100857 3402 52388 123746 -73713 311000 -36656 451666 -188794
16134I3970c22591G596a08421F34778h3868G2299k1269d6899B8446K88109b56169
$$ 93970 -322591 7596 -108421 634778 -83868 72299 51030 -46899 28446 316555 -256169
16122a22675B43122b75878B09240G9483e4944r8418j11356i2596B44586F723b1618
$$ -122675 243122 -275878 209240 79483 -54944 -153362 -264718 -92596 244586 6723 -21618
16110h3850H5508l1984J64392i8014c863p448j33750D456h263C39189C3774J25683
$$ -83850 85508 53524 217916 -98014 -3863 -11311 -145061 4456 -8263 339189 33774 159457
16098A59457K9381n1020p801i2655j8232L6362G7530h9776l6340L2388A78428
$$ 159457 188838 137818 130017 -92655 -110887 -74525 77530 -89776 -126116 -93728 178428
16086H0844L39899a6399A1049J58031a12323A33477m5789h7913b4321n1126j13493
$$ 80844 420743 -16399 11049 169080 -112323 133477 87688 -87913 -24321 -75447 -188940
16075a88940A29862B3338l532a09764A46846c54762a07872q3307n4019G8903a37886
$$ -188940 129862 23338 19806 -109764 146846 -354762 -107872 -191179 -245198 78903 -137886
16063E6532g0600k25244h6410C8717N0461a90629A97347D9205g5988F1800a30039
$$ 56532 -70600 -295844 -86410 38717 89178 -190629 197347 49205 -75988 61800 -130039
16051B1037L2872c66228A68136e7760A64908a83174l0008I2686C8512J70185L2613
$$ 21037 53909 -366228 168136 -57760 164908 -183174 -213182 92686 38512 208697 241310
16040B41310g9339j946A10206e5490h139j1756p1113B3192e8443B09316b00592
$$ 241310 -79339 -81285 110206 -55490 -8139 -19895 -91008 23192 -58443 209316 -200592
16028b11174B24103N4369b43609b0293k10125i6320A56427l1152a14964B13294
$$ -211174 224103 278472 -243609 -20293 -230418 -96320 156427 125275 -114964 213294
16017e9817B58921a2400B36882e2392H060J48560l7009K0891b14123L3561A19641
$$ -59817 258921 -12400 236882 -52392 8060 156620 119611 140502 -214123 -180562 119641
16005d1205A32137b27918C32609A10783J77163b0932l10104B5061p162K92501
$$ -41205 132137 -227918 332609 110783 287946 -20932 -331036 25061 17899 310400
15995C10400H8444c24178A92627b09558c5471k4260l7249k45506a16801j13638
$$ 310400 88444 -324178 192627 -209558 -35471 -59731 -96980 -342486 -116801 -230439
15985b30439n1017a2926R31j33107B20306i3857m7040j59509J17649D568b20059
$$ -230439 -281456 -12926 -11995 -145102 220306 -93857 -140897 -300406 -182757 4568 -220059
15973a64462A60764O2278a6025m4821A89243L20746c2858A96645R3203a34843
$$ -164462 160764 223042 -16025 -60846 189243 509989 -32858 196645 289848 -134843
15962A51855l2260D4075a29767j5683e8517k12726C8923A1060f8046C6468g3707
$$ 151855 119595 44075 -129767 -145450 -58517 -271243 38923 11060 -68046 36468 -73707
15950b20984A83075b24246b5796L716j19955A55701g546r130k40617h1804Q575
$$ -220984 183075 -224246 -25796 -22080 -142035 155701 -7546 -16676 -257293 -81804 -73229
15939g3229m31084b1228F945c1231j37926H2836e7312j29956H4854c05673r8168
$$ -73229 -504313 -21228 6945 -31231 -169157 82836 -57312 -187268 84854 -305673 -403841
15928d03841O6050f4130k19819E7593c45291F3824g0587n1135k44521B3031Q5872
$$ -403841 -337791 -64130 -283949 57593 -345291 63824 -70587 -121722 -366243 23031 108903
15917A08903k2290K3407b9073G3023J28559a38709B25635I8481d80553a65648
$$ 108903 86613 110020 -29073 73023 201582 -138709 225635 98481 -480553 -165648
15906A2386h606k1775o0443j98352G1013l4888a52964h442k31000A98775j4183
$$ 12386 -8606 -30381 -90824 -289176 71013 36125 -152964 -8442 -239442 198775 184592
15895A84592m2382B0972a05413d428j28643c6428B27904H5209d0052B47931k5521
$$ 184592 142210 20972 -105413 -4428 -133071 -36428 227904 85209 -40052 247931 222410
15884B22410e9713j73072A2563g9624j24826g2086m5718m02217J18433J28069
$$ 222410 -59713 -232785 12563 -79624 -204450 -72086 -117804 -520021 -401588 -273519
15874b73519F1134J44489H862M1012a7473G8093d53359J50066f833l44739a1013
$$ -273519 61134 205623 8862 49874 -17473 78093 -453359 -303293 -6833 -351572 -11013
15862d04597A85511B0575b15258G3952e1395j65539k13392E8909c0980l730q3464
$$ -404597 185511 20575 -215258 73952 -51395 -216934 -430326 58909 -30980 -34710 -118174
15851a18174G1935a71645k35991I9405Q4772a05053C59355p9771j09610L0916
$$ -118174 71935 -171645 -407636 99405 184177 -105053 359355 279584 169974 200890
15841B00890a39594p4695j11111A07166j5540a10252r427o7916i606A8655f9503
$$ 200890 -139594 -214289 -325400 107166 91626 -110252 -119679 -187595 -9606 18655 -69503
15829C0606a88730c8375A81613J9546A8835i231j81646A21876C8874E607e7510
$$ 30606 -188730 -38375 181613 201159 18835 -9231 -190877 121876 38874 5607 -57510
15817B57845a38999A01809b36240a7898m2050J6181F1436a7594k11975H8676o955
$$ 257845 -138999 101809 -236240 -17898 -59948 -43767 61436 -17594 -229569 88676 81721
15806H1721C8809O1829O2103b0451m675n8032J9572m8163p9357C30477c4966G5237
$$ 81721 38809 100638 162741 -20451 -25126 -83158 -63586 -111749 -191106 330477 -34966 75237
15793d9403A194J2160O1104b66437b1620B3004a32607C7266b29050a00936j67228
$$ -49403 1194 13354 74458 -266437 -21620 23004 -132607 37266 -229050 -100936 -268164
15782b68164e7987A88260a85011m9581A58262D2845a23410L9704B63239b02613
$$ -268164 -57987 188260 -185011 -234592 158262 42845 -123410 -83706 263239 -202613
15771d63644a80891l5521J8754b907m1414A75315l8603J2745d4981k18382o5017
$$ -463644 -180891 -216412 -197658 -2907 -44321 175315 136712 149457 -44981 -263363 -328380
15760c28380e6929j29334P3256E781J53337b16745E8635a41408p5332I1506e5538
$$ -328380 -56929 -186263 -113007 5781 159118 -216745 58635 -141408 -216740 91506 -55538
15748e4559k08933C4171J12725F7372J2218g9856A37277D514M0573K08826h7267
$$ -54559 -263492 34171 146896 67372 79590 -79856 137277 4514 45087 253913 -87267
15736h0299k1380A7693P2125M069B2971a35041H3938a82094L6680I5193c9734
$$ -80299 -101679 17693 89818 93887 22971 -135041 83938 -182094 -145414 95193 -39734
15724B30231b25191e592I6739e2513q9104a5292D1057K6155g5095J1873B3084
$$ 230231 -225191 -5592 96739 -52513 -141617 -15292 41057 67212 -75095 -63222 23084
15712I1659O8006n1421M623D1964J44392d23945M0869b7466e226A0502a32162
$$ 91659 159665 108244 112867 41964 186356 -423945 -383076 -27466 -5226 10502 -132162
15700f6550j3883A37635i7700k34360J56344e3913P980H2766H857a00813a0461
$$ -66550 -80433 137635 -97700 -332060 -175716 -53913 -45933 82766 8857 -100813 -10461
15688a66121l4159N6715c2267A23084B6193a87115B13315P9993h2298L8456p9328
$$ -166121 -200280 -143565 -32267 123084 26193 -187115 213315 293308 -82298 -43842 -123170
15677a23170B03730g947j62507c0427j8669m5577B65857j12098f2013B3338J16632
$$ -123170 203730 -7947 -170454 -30427 -49096 -94673 265857 153759 -62013 23338 139970
15666A39970D8518d00316F1807d04518P3472C2362b58659G9621K3589O9803E2217
$$ 139970 48518 -400316 61807 -404518 -331046 32362 -258659 79621 103210 173013 52217
15654b42587B07008h8432q6042C4040d1664r7917M1715c872l04935A585J94628
$$ -242587 207008 -88432 -174474 34040 -41664 -139581 -97866 -3872 -308807 1585 196213
15643A96213j6051G0218A4906L3338J2919L62207C4757a11317I8814j5504A7027
$$ 196213 180162 70218 14906 48244 61163 423370 34757 -111317 98814 83310 17027
15631A0257R6075b3349k90015h1794A1156J10099a50639G8989c8691n8449I0578
$$ 10257 106332 -23349 -313364 -81794 11156 121255 -150639 78989 -38691 -97140 90578
15619d41130C04134g2850a1217j6602l98063c6520C52742f2667b1474A97861b8422
$$ -441130 304134 -72850 -11217 -27819 -425882 -36520 352742 -62667 -21474 197861 -28422
15607B34678c3838A42057B6307c20044P1975M6970i0941j10941P9644C73044b85669
$$ 234678 -33838 142057 26307 -320044 -248069 -201099 -90941 -201882 -122238 373044 -285669
15595a50304M7477C83344e3006D74201b40522A18972c36123B22014J20296h0119
$$ -150304 -102827 383344 -53006 474201 -240522 118972 -336123 222014 342310 -80119
15584G1081J33454j3750H0500a14233l02380N5139J74882D4491a26970l2212B49819
$$ 71081 204535 190785 80500 -114233 -416613 -361474 -186592 44491 -126970 -159182 249819
15572F5681f3942J1571A20332J16781q0375P8105I4032A8668a68928c5433a3013
$$ 65681 -63942 -52371 120332 237113 156738 234843 94032 18668 -168928 -35433 -13013
15560a57809b5604k998j04619k5971L6602A12339b03723B8623E742i2877A393
$$ -157809 -25604 -28602 -133221 -159192 -122590 112339 -203723 28623 5742 -92877 1393
15548F6988L06752i3952k59576D14476b24651J5003Q2738A6325g3242A6288c25740
$$ 66988 373740 -93952 -353528 414476 -224651 -209648 -126910 16325 -73242 16288 -325740
15536e2449r2424A92241A1780L12019a66277b7364A64478P5593k8428q1294a2591
$$ -52449 -144873 192241 11780 323799 -166277 -27364 164478 240071 211643 130349 -12591
15524a96270f5097k729j36378o2602g9728j8447A57396c619j0964j50864B09846
$$ -196270 -65097 -67826 -204204 -266806 -79728 -98175 157396 -3619 -14583 -165447 209846
15512h9730M1433j95974Q6859F5981b37545D279a22070n0276A05718a63106E7368
$$ -89730 -48297 -244271 -157412 65981 -237545 4279 -122070 -172346 105718 -163106 57368
15500F1825K9838K19390A32269c51833A5899K7378K0599b36970E2602j9224h2623
$$ 61825 91663 311053 132269 -351833 15899 43277 63876 -236970 52602 33378 -82623
15488A35782b0459j10093a7233H673a0620p2248B29708b2250C14385L5166d81083
$$ 135782 -20459 -130552 -17233 8673 -10620 -82868 229708 -22250 314385 349551 -481083
15476b00797B7024N9359J42668b8338k18083L7213l9754A13983b89893b3425C12386
$$ -200797 27024 86383 229051 -28338 -246421 -209208 -248962 113983 -289893 -23425 312386
15464C11950J2895d54634A75266n313a35391L4376J3589p1324C6964M5960K04687
$$ 311950 324845 -454634 175266 169953 -135391 -101015 -87426 -158750 36964 82924 287611
15453B87611b28000A48831a92426A86822a54359G523Q169a51757A45944P0395
$$ 287611 -228000 148831 -192426 186822 -154359 7523 15692 -151757 145944 216339
15443B16339o8914c597C25464a94463E3952I708g6067L4495A03105J95425c08857
$$ 216339 147425 -3597 325464 -194463 53952 9708 -76067 -41572 103105 298530 -308857
15431A5198J74827I4080i0994F8246P8267c9972l56925E0412b9882k33490k946
$$ 15198 190025 94080 -90994 68246 146513 -39972 -396897 50412 -29882 -263372 -266318
15420b66318B66031b55637A30591m45d140A38452b27629R3543N2861o9494j8626
$$ -266318 266031 -255637 130591 130146 -4140 138452 -227629 -134086 -81225 -150719 -169345
15409a69345p8654a04285A91235d8557j48038p7123M0584F8218a84667D3856f1493
$$ -169345 -247999 -104285 191235 -48557 -196595 -273718 -233134 68218 -184667 43856 -61493
15397a47123D9987r453J00938B3605d4548q6652F958e6766K4499k32204A09866
$$ -147123 49987 40534 141472 23605 -44548 -131200 6958 -56766 -32267 -264471 109866
15385E6664c11645a35390F2727e9577B68920D0930O2217L9903b01348G4317R176
$$ 56664 -311645 -135390 62727 -59577 268920 40930 103147 143050 -201348 74317 83493
15374H3493c23531A29247m2790J2837J3662K3729F3030c99642a15527F3409J18968
$$ 83493 -323531 129247 86457 99294 112956 136685 63030 -399642 -115527 63409 182377
15363A82377L72983a95775G237J56679G4770a15349c9236J856l5030I9533c17193
$$ 182377 555360 -195775 7237 163916 74770 -115349 -39236 -37380 -72410 99533 -317193
15351B7037P106d5248j68098B9650M117J35731q2909g596j93347F822a64819N8640
$$ 27037 34143 -45248 -213346 29650 33767 169498 86589 -7596 -200943 6822 -164819 -106179
15339a06179A07568J90638E649d1268A23310B0295N6340R499h4691b2287A08272
$$ -106179 107568 298206 5649 -41268 123310 20295 76635 86134 -84691 -22287 108272
15327e0308E0281R9281a94622c2492p2405I9517b07816K2204B92932G6412a94220
$$ -50308 50281 149562 -194622 -32492 -104897 99517 -207816 -185612 292932 76412 -194220
15315b25221C19168a65259A16140b2802k3164A92542j2633J05818h1354q7765
$$ -225221 319168 -165259 116140 -22802 -45966 192542 179909 285727 -81354 -169119
15305a69119L7271A28620n5870J03310D9725g9877B62346r8573i830j24460A57247
$$ -169119 -131848 128620 72750 176060 49725 -79877 262346 163773 -9830 -134290 157247
15293a03557A66355b04248d2350F3310Q2826R6248C2067b11394A74590L21938
$$ -103557 166355 -204248 -42350 63310 146136 242384 32067 -211394 174590 496528
15283D96528I1343L27169m897A43042D8082L43254j49960I9484J74232j27952
$$ 496528 91343 418512 413615 143042 48082 391336 241376 99484 273716 145764
15273A45764J3719B2710H881b18730d9435o8960B2024D897a0582k65178e1696
$$ 145764 159483 22710 8881 -218730 -49435 -118395 22024 4897 -10582 -275760 -51696
15261I7445b91803a1536j91678C3671L5441J38583a75032A73420a2881B43108
$$ 97445 -291803 -11536 -203214 33671 69112 207695 -175032 173420 -12881 243108
15250H8652d3586E6151e4388D17907I3967L24514q6621p5147H0372e2554A5794
$$ 88652 -43586 56151 -54388 417907 93967 418481 331860 256713 80372 -52554 15794
15238E9865M66152J70260j51501L09418j71909L01044D85789j05594g2889C6034
$$ 59865 526017 696277 544776 854194 682285 983329 485789 380195 -72889 36034
15227A58355J11633i6104C2976J17887j7209Q4463E7850J72632A04716d540D14990
$$ 158355 269988 -96104 32976 150863 133654 218117 57850 230482 104716 -4540 414990
15215H3689d7423l29285B44758H448J55481b3689B40485B2660K60495M5249a31626
$$ 83689 -47423 -376708 244758 8448 163929 -23689 240485 22660 283155 328404 -131626
15203c9949l3598C3134L85994k04652A5528J74315f0640B0766M2053O9079C6846
$$ -39949 -73547 33134 419128 214476 15528 189843 -60640 20766 62819 131898 36846
15191a40747A00417J15289H8125J95970l9347o7564k6231g7949A0258f5785H2519
$$ -140747 100417 215706 88125 284095 244748 177184 150953 -77949 10258 -65785 82519
15179e2817p349A27526o2928Q0411c64322g0587L671E4907b21838l961B28563
$$ -52817 -60166 127526 64598 145009 -364322 -70587 -66916 54907 -221838 -225799 228563
15167D7087k0052J59402J69201i1600B41929c68467A69776C6851f2098m4062B78625
$$ 47087 27035 186437 355638 -91600 241929 -368467 169776 36851 -62098 -106160 278625
15155D00217e3437A40172J40209D0054J25286b25869A94213n0620J91763g9210
$$ 400217 -53437 140172 280381 40054 165340 -225869 194213 143593 335356 -79210
15144i4038j4211B17844K04985j75486C5078L41336g0028B5932J32244J71973
$$ -94038 -108249 217844 422829 247343 35078 376414 -70028 25932 158176 330149
15134C30149c9779A02796P7513C3497O273b56829B78381q9937B7892b93205B8060
$$ 330149 -39779 102796 180309 33497 39770 -256829 278381 188444 27892 -293205 28060
15122D47695g24E1381a65133C03018a8891A29479a90300B36361m3886a9969C54626
$$ 447695 -724 51381 -165133 303018 -18891 129479 -190300 236361 192475 -19969 354626
15110C90895H4769h8427o2671I0968K29349o0219J19618j77661H8127a56539B20636
$$ 390895 84769 -88427 -151098 90968 320317 260098 379716 202055 88127 -156539 220636
15098B06916C1897J14051E3909K8952J55877N4006L2161A45358K03224A64402
$$ 206916 31897 145948 53909 82861 238738 292744 324905 145358 348582 164402
15087C7509a14506C70231H3794M38932A51515N5023r5705A6251J94436m4992c3341
$$ 37509 -114506 370231 83794 522726 151515 206538 110833 16251 210687 165695 -33341
15075D45601q2431p3614d8266A76936p3232M7726g7297C56013F2525a27562E56736
$$ 445601 363170 289556 -48266 176936 103704 151430 -77297 356013 62525 -127562 556736
15063B04545M3965r523l7518K20579k09447o101e4848G7901d8985B15006j05892
$$ 204545 248510 238987 201469 422048 212601 206500 -54848 77901 -48985 215006 109114
15052A09114K9309N9676L8508G0500M6669e8948k33406A29945D2956K23641A8926
$$ 109114 138423 198099 236607 70500 117169 -58948 -292354 129945 42956 266597 18926
15040H9811J64384a2062D80779A31512K3394b33923H8407K27959j18451P2847
$$ 89811 254195 -12062 480779 131512 154906 -233923 88407 316366 197915 270762
15030B70762J38670j55091b33830c6666F1490N2963P9415l8393J02810j3893j05047
$$ 270762 409432 254341 -233830 -36666 61490 114453 193868 155475 258285 244392 139345
15019A39345P0698J77303q1248A9279M94824f4412B04358c2462B2033K63927j31674
$$ 139345 210043 387346 306098 19279 514103 -64412 204358 -32462 22033 285960 154286
15008A54286J05924n2942J30554m1314d7222D79113A44331K33347j27808k8261
$$ 154286 260210 207268 337822 296508 -47222 479113 144331 377678 249870 221609
14998B21609o2648K30047G5764O50556l16496F0754K47347j6671M1196E0735K5318
$$ 221609 158961 389008 75764 726320 409824 60754 308101 291430 332626 50735 76053
14987G6053R7232R2762j6255r7108J08522K49946I5708J87616a07861E6957P6350
$$ 76053 173285 266047 249792 152684 261206 511152 95708 283324 -107861 56957 133307
14976A33307K58791O6032c64364F6126J12403P7971B1007J64306a3001A58559
$$ 133307 392098 458130 -364364 66126 178529 256500 21007 185313 -13001 158559
14965B03215K6408J4959l5497j8413e002A2369L69292A15650B6847J08519J05014
$$ 203215 229623 244582 209085 190672 -5002 12369 381661 115650 26847 135366 240380
14954B40380J95334M5229A16343O6567q4040p540J34458J55634j04216K93428
$$ 240380 435714 480943 116343 182910 98870 91330 225788 381422 277206 570634
14944E70634b9931G8537K77552K04022k66708c8035B84616J62823j97622p7798
$$ 570634 -29931 78537 356089 560111 293403 -38035 284616 447439 249817 172019
14934A72019L47273B11355Q5561A14740M10853j94263B2400M68901I111M63319
$$ 172019 519292 211355 296916 114740 525593 331330 22400 491301 9111 472430
14924D72430m2845J17245l2683n9022B15198n6314o2349P9070K87269k20039A14797
$$ 472430 429585 546830 514147 455125 215198 158884 96535 175605 462874 242835 114797
14912D24416K06037A80613J18626O1365K99120C17281A47297J50014M1088j45328
$$ 424416 630453 180613 299239 360604 659724 317281 147297 297311 338399 193071
14902A93071M06462a05309C10345P8213K3896L5263j51779R3571n6879c3247F04201
$$ 193071 599533 -105309 310345 388558 412454 447717 295938 389509 332630 -33247 604201
14890C14305A40974M9590L15197j42363K37760A97869l8474J63470K22835k52713
$$ 314305 140974 190564 505761 363398 601158 197869 159395 322865 545700 292987
14880B92987j7097J67862O417j49360m9089K2119p9372K08376j84400p8172J30255
$$ 292987 275890 443752 450169 300809 251720 273839 194467 402843 218443 140271 270526
14869B70526M58331k23391n7382j95988L08707P2744F1090K21781o6226K64962
$$ 270526 728857 505466 448084 252096 560803 633547 61090 282871 216645 481607
14859D81607O7174o1549O7368A33370L25123K44188I0528L18051P4190A00015
$$ 481607 548781 487232 554600 133370 458493 702681 90528 408579 482769 100015
14848F52376k87399J66905J15116k33907J1082J20553k7137K8366M4482j79288
$$ 652376 364977 531882 646998 413091 424173 544726 517589 545955 590437 411149
14838D11149O6242J37518G3554M23111m9661J47269k29165R0011o6755O7411H8608
$$ 411149 477391 614909 73554 496665 447004 594273 365108 455119 388364 455775 88608
14826C76348J57796k29156J44019k06326K87887j31329j2198J27203E3754L81248
$$ 376348 534144 304988 449007 242681 530568 399239 387041 514244 53754 435002
14816D35002J15343N7453j02247n5318j72374m5793L66777r0825P3393k71133
$$ 435002 550345 607798 505551 450233 277859 232066 598843 508018 581411 310278
14806C10278o5576L33575j08854q0201J40382K02534k07635L19354k26312J12626
$$ 310278 244702 578277 469423 389222 529604 732138 524503 843857 617545 730171
14796G30171j74171o9308j31050j40868K31704N2605L8810l5442J12226K9861
$$ 730171 556000 486692 355642 214774 446478 499083 537893 502451 614677 644538
14786F44538j2924J6101C18346J93035J80585O5182j12477k51039J09836J68868
$$ 644538 631614 647715 318346 511381 691966 757148 644671 393632 503468 672336
14776F72336L7461p5671M7313l06769L57535B17964K26707L93784C38610O34830
$$ 672336 709797 634126 681439 374670 732205 217964 444671 838455 338610 973440
14766I73440k34848j76912L48607k37417j03489J161j07768K15992L39576m61179
$$ 973440 738592 561680 910287 672870 569381 570542 462774 678766 1018342 557163
14756E57163L3051A75138J51196L50558J11420n8718k05859O23373C67501K87669
$$ 557163 590214 175138 326334 676892 788312 729594 523735 1147108 367501 655170
14746F55170j46844J00192k33255K14241O8872J97404m4127L859j60292k47709
$$ 655170 508326 608518 375263 589504 658376 855780 811653 815512 655220 407511
14736D07511O98040m38255K41378k68624j41059K43434L9606l68735M89474k4579
$$ 407511 1105551 667296 908674 640050 498991 742425 782031 413296 902770 878191
14726H78191j61419J08964j26821j38048K29776O7776l8079k4871l2214R241K8648
$$ 878191 716772 825736 698915 560867 790643 858419 820340 795469 763255 772496 801144
14715H01144Q2667P4085j09959n2402R3203j60528j05443J98619L20561n41193
$$ 801144 883811 957896 847937 795535 888738 728210 622767 821386 1141947 600754
14705F00754J61732K09292L85837m73644j33084j58143K7988M2597N27149k14512
$$ 600754 762486 971778 1357615 883971 750887 592744 620732 663329 1190478 975966
14695I75966Q8959k58783k69900L49610j786K6593M2207l81110L29966j32365
$$ 975966 1064925 806142 536242 885852 884066 910659 952866 571756 901722 769357
14685G69357N252q1606O5890J99627R1553K47330m71648L70881j89620K6823k074
$$ 769357 774609 693003 758893 958520 1050073 1297403 825755 1196636 1007016 1033839 1031765
14674A031765j83770M0452r7322K35305P6374K30830j60506j46066j8433J33294
$$ 1031765 847995 888447 791125 1026430 1102804 1333634 1173128 1027062 1008629 1141923
14664A141923l17886L12790K4321M4379j05115j1414j43601k30142P15581o31689
$$ 1141923 824037 1136827 1161148 1205527 1100412 1088998 945397 715255 1430836 799147
14654G99147K67176O4008L83624m25893L80353o45541J26131r600L53193j27794
$$ 799147 1066323 1130331 1513955 1088062 1468415 822874 949005 939405 1292598 1164804
14644A164804J40083j42866M55J75626m89247L94099J9233J39499L3744k13305
$$ 1164804 1304887 1162021 1162476 1338102 848855 1242954 1262187 1401686 1435430 1222125
14634A222125K0069J9054J2615q303R1082j4597J32810j12033Q3749k25435K82267
$$ 1222125 1242194 1261248 1273863 1265560 1356642 1342045 1474855 1362822 1446571 1221136 1503403
14623A503403k05798j42810J24238K05211P6334l34126J14456m6227j69870J78876
$$ 1503403 1297605 1154795 1279033 1484244 1560578 1226452 1340908 1294681 1124811 1303687
14613A303687K77518j76407J31910L9164j83387J93435j38647J48941m6375k77585
$$ 1303687 1581205 1404798 1536708 1575872 1392485 1585920 1447273 1596214 1549839 1272254
14603A272254L06172K03313l26661Q2935R0449p7329j39916N6911J02514j06751
$$ 1272254 1578426 1781739 1455078 1538013 1628462 1551133 1411217 1468128 1570642 1463891
14593A463891J78607Q9874j54470J58310M07008n4037n18548J63279j54194L70626
$$ 1463891 1642498 1732372 1577902 1736212 2143220 2089183 1570635 1733914 1579720 1950346
14583A950346M5059j53548M9782R2080k0855j42007N02418k33081J46396m41745
$$ 1950346 1995405 1841857 1891639 1983719 1962864 1820857 2323275 2090194 2236590 1794845
14573A794845J68037K16970m23705J3948J43479J29814j90082L86263l37462K2595
$$ 1794845 1962882 2179852 1756147 1770095 1913574 2043388 1853306 2239569 1902107 1924702
14563A924702J8054J93482J02404K61528l12236L02864k51437r5679M11837m02018
$$ 1924702 1942756 2136238 2238642 2500170 2187934 2490798 2239361 2143682 2555519 2153501
14553B153501K48386J59974L61279j10267o0262N217K76021l9126j03181O18504
$$ 2153501 2401887 2561861 2923140 2812873 2752611 2757828 3033849 2994723 2891542 3510046
14543C510046Q707N0947K09959M54487J92840L83767J124998N18466K090883K446237
$$ 3510046 3518753 3569700 3779659 4234146 4426986 4810753 5935751 6454217 8545100 10991337
14533A0991337M384254O608600P150411j816024q202990o200015l949103k707129
$$ 10991337 15375591 21984191 29134602 27318578 19115588 12915573 8966470 6259341
14525F259341j308472r29681l96966m13645k99995j57703K83125n26814M44056
$$ 6259341 4950869 4021188 3624222 3210577 2910582 2752879 3036004 2509190 2953246
14516B953246o8436l67258J2178J44024j97627Q0034J82238o0380r1481J49057
$$ 2953246 2884810 2517552 2529730 2673754 2476127 2556161 2738399 2678019 2586538 2735595
14506B735595K23123o2580n24494K64782J39163N6206K05628k62306k7887L6418
$$ 2735595 2958718 2896138 2371644 2636426 2775589 2831795 3037423 2775117 2747230 2783648
14496B783648M23178l84248O9825L82638k47904L10951l37667J00720K54301J06773
$$ 2783648 3206826 2822578 2892403 3275041 3027137 3338088 3000421 3101141 3355442 3462215
14486C462215l01073J44169m8396M25666m36695L46245k05781M33246N7195j7746
$$ 3462215 3161142 3305311 3256915 3682581 3245886 3592131 3386350 3819596 3876791 3859045
14476C859045k35901j1565M90125k53679L93770m96856J93623K73606j60719j40897
$$ 3859045 3623144 3611579 4101704 3848025 4241795 3744939 3938562 4212168 4051449 3910552
14466C910552M85662k7837k07538J19285P4160j1755J75030k96627K44503J7770
$$ 3910552 4396214 4368377 4160839 4280124 4354284 4342529 4517559 4220932 4465435 4483205
14456D483205K09175k28963L31049q6075J28442j56198P8473K86432J62366L8705
$$ 4483205 4692380 4463417 4794466 4708391 4836833 4680635 4759108 5045540 5207906 5246611
14446E246611J09129r7314k32021M55007l35544N74406l57052L98371j7188j00989
$$ 5246611 5355740 5258426 5026405 5481412 5145868 5720274 5363222 5761593 5744405 5643416
14436E643416Q4561q5967M25352o0102J15997J29647J05703l88789L29729J19387
$$ 5643416 5727977 5642010 6067362 6007260 6123257 6252904 6358607 5969818 6299547 6418934
14426F418934L96987l67096J67940k34137N66934L19490m68166N39864o69232
$$ 6418934 6815921 6448825 6616765 6382628 6949562 7269052 6800886 7340750 6671518
14417F671518N10684L30752k5955K51723J91423l22962J08919K44668R2310L64413
$$ 6671518 7182202 7512954 7486999 7738722 7930145 7607183 7716102 7960770 8053080 8417493
14407H417493K35234m47214M72327J51344R5150J1426M03L89779j22685M69560
$$ 8417493 8652727 8205513 8677840 8829184 8924334 8935760 8936163 9325942 9203257 9672817
14397I672817J02532K21163n02756N96179N6200J64787J21433J97008M93802k2349
$$ 9672817 9775349 9996512 9493756 10089935 10146135 10310922 10432355 10629363 11123165 11100816
14387A1100816K22272j12294M89125k762M1599J48888M03683j34241O34870J64518
$$ 11100816 11323088 11210794 11699919 11697157 11738756 11887644 12291327 12157086 12791956 12956474
14377A2956474J93739Q8099L20454K00948O31302k78117N06953M69904K26575
$$ 12956474 13150213 13238312 13558766 13759714 14391016 14112899 14619852 15089756 15316331
14368A5316331N8530M82182q8968N08988K21393M12533j98408J205503k83015
$$ 15316331 15374861 15857043 15768075 16277063 16498456 16910989 16712581 17918084 17635069
14359A7635069M19688L37883O15950L10984K23991L05613Q24545K50903K32489
$$ 17635069 18054757 18392640 19008590 19319574 19543565 19849178 20673723 20924626 21157115
14350B1157115O35925M74090N43723L21041N38008O10169L99193M06940R44817
$$ 21157115 21793040 22267130 22810853 23131894 23669902 24280071 24679264 25086204 26031021
14341B6031021L69446P53331N43865M05302J095357M93670O97283Q24587P89696
$$ 26031021 26400467 27153798 27697663 28102965 29198322 29691992 30389275 31213862 32003558
14332C2003558P91334J056210L97649J146573O59609J135083J280439P87028J280882
$$ 32003558 32794892 33851102 34248751 35395324 36054933 37190016 38470455 39257483 40538365
14323D0538365J229589J337975R69685J254294J018077J865882J504853J860702
$$ 40538365 41767954 43105929 44075614 45329908 46347985 48213867 49718720 51579422
14315E1579422J185157K097350J685208J802527J653130K279550K286909K054333
$$ 51579422 52764579 54861929 56547137 58349664 60002794 62282344 64569253 66623586
14307F6623586K443553J898869L266566K430278L060485K621237L193711L690518
$$ 66623586 69067139 70966008 74232574 76662852 79723337 82344574 85538285 89228803
14299H9228803L577120L324289M071385M164942M445326M602444N048603N221869
$$ 89228803 92805923 96130212 100201597 104366539 108811865 113414309 118462912 123684781
14291A23684781N155235N884649O091975O889790O423740P491161P838679P937121
$$ 123684781 128840016 134724665 140816640 147706430 154130170 161621331 169460010 177397131
14283A77397131Q721008R266623R393987J0319435J0377903J1310776J1743491
$$ 177397131 186118139 195384762 204778749 215098184 225476087 236786863 248530354
14276B48530354J2034118J3078512J3582237J3681933J4236017J4575701J4476155
$$ 248530354 260564472 273642984 287225221 300907154 315143171 329718872 344195027
14269C44195027J4413950J4513206J3881117J3288518J2515977J1300981J0092332
$$ 344195027 358608977 373122183 387003300 400291818 412807795 424108776 434201108
14262D34201108R375071Q346617O785841N577372L171877M66601j284842k603838
$$ 434201108 443576179 451922796 458708637 464286009 467457886 467924487 466639645 464035807
14254D64035807o358256p399380o267527o239821q093352r881142j1831772j2907593
$$ 464035807 457677551 450278171 444010644 437770823 429677471 419796329 407964557 395056964
14246C95056964j3080593j3290280j3581855j3470944j3338380j3532895j3214957
$$ 395056964 381976371 368686091 355104236 341633292 328294912 314762017 301547060
14239C01547060j2993838j2680978j2134977j1270060j1584695j0771814j0564299
$$ 301547060 288553222 275872244 263737267 252467207 240882512 230110698 219546399
14232B19546399j0217573j0652874r819701r312224q665150q230748p400578p170379
$$ 219546399 209328826 198675952 188856251 179544027 170878877 162648129 155247551 148077172
14224A48077172o908862o035574o220413n254851n269512n282084m548506m200000
$$ 148077172 141168310 135132736 128912323 123657472 118387960 113105876 108557370 104357370
14216A04357370l894564m329472l763861l773133k956791l605156k720149l187034
$$ 104357370 100462806 96133334 92369473 88596340 85639549 82034393 79314244 76127210
14208G6127210k782147k179143k427104k269554k274316j891782j870841k231849
$$ 76127210 73345063 71165920 68738816 66469262 64194946 62303164 60432323 58200474
14200E8200474j471263j805353j740382j744870j339292j684183j244913r85557
$$ 58200474 56729211 54923858 53183476 51438606 50099314 48415131 47170218 46184661
14192D6184661r84019j410597j445792j382197j000349j259828q32210p31411
$$ 46184661 45200642 43790045 42344253 40962056 39961707 38701879 37869669 37138258
14184C7138258j143616j296887q94772o55088n69746r09288q65463o22242p77521
$$ 37138258 35994642 34697755 33802983 33147895 32578149 31668861 30803398 30181156 29403635
14175B9403635p62833m73560n59619q33047p45944k09219q86681n12127m24702
$$ 29403635 28640802 28167242 27607623 26774576 26028632 25819413 24932732 24420605 23995903
14166B3995903p57595j77476p05112r0888r94515l92412j44041m69518l58726
$$ 23995903 23238308 23060832 22355720 22264832 21270317 20877905 20733864 20264346 19905620
14157A9905620o38436m85647j860l53025n74887l94785k36569J2917l59060m77824
$$ 19905620 19267184 18781537 18779677 18426652 17851765 17456980 17220411 17233328 16874268 16396444
14147A6396444n11035K74557p53049m304n44950k90149N0995k12125o36105J09446
$$ 16396444 15885409 16159966 15406917 15402613 14857663 14567514 14618509 14406384 13770279 13879725
14137A3879725l34981k75586j26774n29014J90630k19384k82857j90265m49728
$$ 13879725 13544744 13269158 13142384 12613370 12804000 12584616 12301759 12111494 11661766
14128A1661766J47503o8331j70307n18624n9179m26383N39018R4445p68541m02006
$$ 11661766 11809269 11740938 11570631 11052007 10992828 10566445 11105463 11199908 10431367 10029361
14118A0029361R164m98315M61800k34245j03311j70523q9221m62696J62997k19310
$$ 10029361 10038525 9540210 10002010 9767765 9664454 9493931 9404710 8942014 9105011 8885701
14108H885701q6185j08358n2731k80446K50344n79984j79031L61799j3000m66912
$$ 8885701 8799516 8691158 8638427 8357981 8608325 8028341 7849310 8211109 8198109 7731197
14098G731197k03279J03154p9754m22492J63624j35718J86055j89598k24772j63459
$$ 7731197 7527918 7631072 7551318 7128826 7292450 7156732 7342787 7153189 6928417 6764958
14088F764958j55291O11032q30500l0906J73300m38279K50066K34677m91873j43225
$$ 6764958 6609667 7220699 6390199 6359293 6532593 6094314 6344380 6579057 6087184 5943959
14078E943959k18167k0073J74213j32642J84178k38212J38799k14621K9987j58547
$$ 5943959 5725792 5705719 5879932 5747290 5931468 5693256 5832055 5617434 5647421 5488874
14068E488874k4754k25596J16446k67797O4145L7829k33086J9995j66146K45565
$$ 5488874 5464120 5238524 5354970 5087173 5151318 5189147 4956061 4976056 4809910 5055475
14058E055475j15230k78320J92197j69807m2950k43272J64120J71012j35205L3719
$$ 5055475 4940245 4661925 4854122 4684315 4641365 4398093 4562213 4733225 4598020 4631739
14048D631739j25546p0844l39238m4328L74630l77974J16108K12072k14758J39639
$$ 4631739 4506193 4435349 4096111 4051783 4426413 4048439 4164547 4376619 4161861 4301500
14038D301500o88611N51170k82827K572j98297P2358l16787q6672M51456k32070
$$ 4301500 3612889 4164059 3881232 3883804 3685507 3757865 3441078 3354406 3805862 3573792
14028C573792J9771J23029J2890j37185j66728l29958K85488j12916k1009M18776
$$ 3573792 3593563 3716592 3729482 3592297 3425569 3095611 3381099 3268183 3247174 3665950
14018C665950m70766k9950K07750l15132M92096j95884j35317m4250L674r8818
$$ 3665950 3195184 3165234 3372984 3057852 3549948 3354064 3218747 3174497 3178171 3079353
14008C079353l15683J26112k43375J98388O0568k27828M01828l36907J32056k21112
$$ 3079353 2763670 2889782 2646407 2844795 2905363 2677535 3079363 2742456 2874512 2653400
13998B653400Q4139j09858J96921k94607L6287J72724k35778j19415J03398O8917
$$ 2653400 2737539 2627681 2824602 2529995 2566282 2739006 2503228 2383813 2487211 2556128
13988B556128j39586o4568K63008J49524m6909K16735n04036J61736n1740M48375
$$ 2556128 2416542 2351974 2614982 2764506 2717597 2934332 2430296 2592032 2540292 2988667
13978B988667N86902J49494L80635R03927J754431L899634N964501R288281J554692
$$ 2988667 3575569 3725063 4105698 5009625 6764056 10663690 16628191 25916472 27471164
13969B7471164o175464n637412m044758k511323j879734j344216r78687j51195
$$ 27471164 21295700 15658288 11613530 9102207 7222473 5878257 4899570 4748375
13961D748375n28171l10689k92972k92795K45296o70822J70074K1936l73904J3005
$$ 4748375 4220204 3909515 3616543 3323748 3569044 2898222 3068296 3090232 2716328 2729333
13951B729333q8421j81667n3889J92624q7806j79674k79070M89588k14435J24129
$$ 2729333 2640912 2459245 2405356 2597980 2510174 2330500 2051430 2541018 2326583 2450712
13941B450712k95576L5872J8212j8395J05195K3563l15549n7107L29402Q3426
$$ 2450712 2155136 2191008 2209220 2190825 2296020 2319583 2004034 1946927 2276329 2359755
13931B359755r1826j62668j72486j27116K95657k5732L2513k76581L1818J48158
$$ 2359755 2267929 2105261 1932775 1805659 2101316 2075584 2108097 1831516 1863334 2011492
13921B011492k59861M846P8548j87644K71014m16795O13871l63038m8434J90676
$$ 2011492 1751631 1756477 1835025 1647381 1918395 1501600 2115471 1752433 1703999 1894675
13911A894675j20800O0382Q126k23174j08758L07105o20270O39166j27420p6063
$$ 1894675 1773875 1834257 1842383 1619209 1510451 1817556 1197286 1836452 1709032 1632969
13901A632969k33458K62537k59926J24080K13900j56338J52711j21618l78232
$$ 1632969 1399511 1662048 1402122 1526202 1740102 1583764 1736475 1614857 1236625
13892A236625J18532l1529J93614p0676N9145Q5688r4525O8188k88864n9058J8267
$$ 1236625 1355157 1323628 1517242 1446566 1505711 1591399 1496874 1565062 1276198 1217140 1235407
13881A235407O9206K77477n16560R2011n234R5893j82969M35895j00289O7649
$$ 1235407 1304613 1582090 1065530 1157541 1152307 1248200 1065231 1501126 1400837 1468486
13871A468486k14083r8799J32134j80417K00285j38670J15086n4202j23031j1403
$$ 1468486 1254403 1155604 1287738 1107321 1307606 1168936 1284022 1229820 1106789 1095386
13861A095386K94811k6306r5475k38850L02528k2876j46252J4932N2205j79314
$$ 1095386 1390197 1363891 1268416 1029566 1332094 1309218 1162966 1177898 1230103 1050789
13851A050789J94478K04798k61472q5812K2205j83094K07804J49908l42521K16149
$$ 1050789 1245267 1450065 1188593 1102781 1124986 941892 1149696 1299604 957083 1173232
13841A173232L2035k79766n9249q0208M41972j16911j33097K84541p5632j19961
$$ 1173232 1205267 925501 866252 786044 1228016 1111105 978008 1262549 1186917 1066956
13831A066956r1009j31905M00043p1942k42361K71246J3946O6773k11518L2935
$$ 1066956 975947 844042 1244085 1172143 929782 1201028 1214974 1281747 1070229 1103164
13821A103164P8707k0207J42262m42563O87712m28497m06685k6802K17356R9501
$$ 1103164 1181871 1161664 1303926 861363 1549075 1120578 713893 687091 904447 1003948
13811A003948j17690k11113M45169J32509k37971j9974m8738k027k04062K05908
$$ 1003948 886258 675145 1120314 1252823 1014852 994878 946140 944113 740051 945959
13801I45959K11037Q7512n93883K15225K00593l42229K60648k72131M89386m2492
$$ 945959 1156996 1244508 650625 865850 1066443 724214 984862 712731 1202117 1159625
13791A159625m54079j2820J97202k02013K94393k6217J22831L900j62759K21641
$$ 1159625 705546 692726 889928 687915 982308 956091 1078922 1082822 920063 1141704
13781A141704k03119P8974M6996O3973k44137m9405N3063J29292j00160j16970
$$ 1141704 938585 1017559 1064555 1128528 884391 834986 888049 1017341 917181 800211
13771H00211J5185j34575J77800L20662j64405m06467L49059k53401j81958K79951
$$ 800211 815396 680821 858621 1179283 1014878 608411 957470 704069 522111 802062
13761H02062j37832K26536m4816k09678K96268k08533K57543j38977j16331K98109
$$ 802062 664230 890766 845950 636272 932540 724007 981550 842573 726242 1024351
13751A024351n11594J98332j3683L9104l3231R494k14471K23803K8536j62463
$$ 1024351 512757 711089 697406 736510 703279 712773 498302 722105 750641 588178
13741E88178M98066l77633k28493L15340j54221L10737j71737M5954l97123K92941
$$ 588178 1086244 708611 480118 795458 641237 951974 780237 826191 429068 722009
13731G22009K6739J71931m50239m4370R9184L208k4563K68261n6521Q5352r5988
$$ 722009 748748 920679 470440 426070 525254 528462 503899 772160 715639 800991 705003
13720G05003K4774K11140l16101J30284A42076N27176K11471B84263L32823J71105
$$ 705003 729777 940917 624816 755100 142076 669252 880723 284263 617086 788191
13710G88191l71949J48825L9964K47949l52834q9615K83582j63147P5866B45673
$$ 788191 416242 565067 605031 852980 500146 410531 694113 530966 606832 245673
13699D75372K96604j20942K76166m42429j16701J57208k47768K65847P9724K10182
$$ 475372 771976 651034 927200 484771 368070 525278 277510 543357 623081 833263
13689H33263J07437l80234J41570j10316Q9719B28327J79696J81270k7492K32789
$$ 833263 940700 560466 702036 591720 681439 228327 408023 589293 561801 794590
13679G94590j69563j00923j38829O6375L75981l37269L50361k34874B34099O33513
$$ 794590 625027 524104 385275 451650 827631 490362 840723 605849 234099 867612
13669H67612l17457o188l595K6869n8965K43574j88350r3379l0614J54790r8099
$$ 867612 550155 543967 540372 567241 508276 751850 563500 470121 439507 594297 496198
13658D96198M69N2750j21440B07663O407K41823n9270M0624M56369k12928l18251
$$ 496198 496667 549417 427977 207663 214070 455893 396623 437247 893616 680688 362437
13647C62437L7968K35801J9718l19636L19291J2826k974k79732J16568k9904j22596
$$ 362437 400405 636206 655924 336288 655579 668405 665431 385699 502267 472363 349767
13636C49767j05918J21344K27923n5722B28429N3521q3318L79780n0075L08724
$$ 349767 243849 365193 593116 537394 228429 281950 198632 578412 528337 837061
13626H37061H7517N2924K32106M8936R9312k47334J07513J81597k13785J94975
$$ 837061 87517 140441 372547 421483 520795 273461 380974 562571 348786 543761
13616E43761k32014K40795K8314j73624K13555j16803R3332M7021B71895J77931
$$ 543761 311747 552542 580856 407232 620787 503984 597316 644337 271895 449826
13606D49826o9817J03399J05032M7403I4207N55771B81502M12497r5329j20518
$$ 449826 380009 483408 588440 635843 94207 649978 281502 693999 598670 478152
13596D78152p9085j77244k1141L26229B22011M77109k79599K77210B59581P0786
$$ 478152 399067 221823 200682 526911 222011 699120 419521 696731 259581 330367
13586C30367J30661M0034j74618K23940j79006K23487q9383j95502J06106N6989
$$ 330367 461028 501062 326444 550384 371378 594865 505482 309980 416086 473075
13576D73075A55167L75457B37396n0924J40234O2861j38628Q7264J10870A98891
$$ 473075 155167 530624 237396 186472 326706 389567 250939 338203 449073 198891
13565C19102K25098A41715N11304j58213A91159J87134j53853K56298J1598n2483
$$ 319102 544200 141715 653019 494806 191159 378293 224440 480738 492336 439853
13555D39853M744A92654J24833J41777o8333J28575B45407K43939K9462N664o7037
$$ 439853 444597 192654 317487 459264 390931 519506 245407 489346 518808 524472 457435
13544D57435l8608m077q5344j26157K34366A43673K99078A71408J08777O043M94908
$$ 457435 418827 414750 329406 203249 437615 143673 442751 171408 280185 286228 781136
13533G81136C28201j05991J63763j62631R415K67899D1885K73055m3970J45656
$$ 781136 328201 222210 385973 223342 232757 500656 41885 314940 270970 416626
13523D16626j27096p7074J92944j07859k3722A2311K78444q9461M47869r0111
$$ 416626 289530 212456 405400 297541 273819 12311 290755 201294 649163 559052
13513E59052B16177J24837J34100P3563k13496K80644k44683n6249k1381E4963
$$ 559052 216177 341014 475114 548677 335181 615825 371142 314893 293512 54963
13502C04276j00846l9359M2674R931J07187K07130B24400J01044P4612j56506
$$ 304276 203430 164071 206745 216676 323863 530993 224400 325444 400056 243550
13492B43550J94468i5587B56517C4820J39387K35306j15106B573K18328I8562
$$ 243550 438018 -95587 256517 34820 174207 409513 294407 2573 220901 98562
13481C23473p695E1021N05812k24734J958j23930M4669R4746j38260m742p0912
$$ 323473 315778 51021 556833 332099 334057 210127 254796 349542 211282 206540 135628
13470A35628K77149A78037n071J0974K72558n791M8962k33923K5568J9051H8448
$$ 135628 412777 178037 172966 183940 456498 450707 499669 265746 291314 310365 88448
13458I8058D2935K98735j06366M8820P8317J0420R2351E0804J60191j9101f3738
$$ 98058 42935 341670 235304 284124 362441 372861 465212 50804 210995 191894 -63738
13446D06438J8464A40598Q0397K43981A18340J3413a20584A2739J58317J81138
$$ 406438 424902 140598 220995 464976 118340 131753 -120584 12739 171056 352194
13436C52194A18651K27132P8993k04944b9585B83659K8809K31705c5966D8421
$$ 352194 118651 345783 424776 219832 -29585 283659 312468 544173 -35966 48421
13425C53861D1250L79757j44616J20373o8217j16328K86688c0977D06570A72858
$$ 353861 41250 421007 276391 396764 328547 212219 498907 -30977 406570 172858
13414C09517j3074J94683n1084A87443M1722o3396j4546a86666A29321j8581D4943
$$ 309517 296443 491126 440042 187443 229165 165769 151223 -186666 129321 110740 44943
13402E03876B10296p6376N1048q6196L17507A59327e079A8557L79952A53783K2065
$$ 503876 210296 133920 184968 98772 416279 159327 -5079 18557 398509 153783 175848
13391A75848J62851d8746C85024j66020c3813H6262K47532D1285K40656q2044
$$ 175848 338699 -48746 385024 219004 -33813 86262 333794 41285 281941 199897
13381A99897p3499M47050j61166A34431L05420B13549n3265J6403L41877k17613
$$ 199897 126398 573448 412282 134431 439851 213549 160284 176687 518564 300951
13371C00951H8127J74204f7873c3050D07759j94327J10032j13970q2204N07659
$$ 300951 88127 262331 -67873 -33050 407759 213432 323464 209494 127290 634949
13361F34949k78631J02514b788A51228J05369I7120N28885a20167B94161e6584
$$ 634949 356318 458832 -2788 151228 256597 97120 626005 -120167 294161 -56584
13350A91512J79995A80280F6453L21121j00920F6906P0658K6342K41248j88071
$$ 191512 371507 180280 66453 387574 286654 66906 137564 163906 405154 217083
13340B17083f7896a1563E74926A4189d1290C65015j43653Q2792K40780B53765
$$ 217083 -67896 -11563 574926 14189 -41290 365015 221362 304154 544934 253765
13329A94076J84990A79613O3251K15833k5863d6815A38985J9096P32396C10640
$$ 194076 379066 179613 242864 458697 432834 -46815 138985 158081 890477 310640
13318B97350J40212A8346R9235K01777D2748R497K57692A00024J54792q2408K64119
$$ 297350 437562 18346 117581 319358 42748 52245 309937 100024 254816 172408 436527
13307D36527j19425P1504J15623J04950a02520A65057M421K04722d798C94540
$$ 436527 317102 388606 504229 609179 -102520 165057 169478 374200 -4798 394540
13296A04599M85314A50671a65061G08475B56250K7348f1057D00994A06066C9487
$$ 104599 589913 150671 -165061 708475 256250 283598 -61057 400994 106066 39487
13285B15664q9996f4489C24083B8085K89499j58071k7800D6216M5610j6812K29874
$$ 215664 125668 -64489 324083 28085 317584 159513 131713 46216 91826 75014 304888
13274C04888A47413J71074A14527M17947j57238j40881H0892C3960r853J26546
$$ 304888 147413 318487 114527 532474 375236 234355 80892 33960 24107 150653
13264A50653b45277d7788G2790m518J79990J71680j74144j1799D6828J09215C2007
$$ 150653 -245277 -47788 72790 68272 248262 419942 245798 233999 46828 156043 32007
13252B70111n3495c2271A77334l4962J94579G57g7806A34260K36913H7512l1979
$$ 270111 216616 -32271 177334 142372 336951 757 -77806 134260 371173 87512 55533
13241E5533K1795L84336a15137a4233A95034c3069j26516N1460a2559C57066A42471
$$ 55533 77328 461664 -115137 -14233 195034 -33069 -159585 -108125 -12559 357066 142471
13229A7272K79585D6374h7548C87435h7531B8502a03305A4266R5995J91227m5851
$$ 17272 296857 46374 -87548 387435 -87531 28502 -103305 14266 110261 301488 255637
13218B55637o7793E8964A2705J29015a24955I5359K59629N6293P4652A83693N9518
$$ 255637 187844 58964 12705 141720 -124955 95359 354988 411281 485933 183693 243211
13207B43211f6657j04782O4637C36969B281J56173a48200B33983b51215D9776
$$ 243211 -66657 -171439 -106802 336969 2281 158454 -148200 233983 -251215 49776
13196B57618O656I7165J81904A10736M0100i515C12058a4930B11423b65646i1724
$$ 257618 264274 97165 279069 110736 150836 -9515 312058 -14930 211423 -265646 -91724
13184a38882G1422R2769J50464m4766D6155A5893a1550A19435b8007D44668k19487
$$ -138882 71422 164191 314655 269889 46155 15893 -11550 119435 -28007 444668 225181
13173B25181n3141P9699j20447n2889O4095a54969B59343L8137p4503A7340f0578
$$ 225181 172040 251739 131292 78403 142498 -154969 259343 297480 222977 17340 -60578
13161C28320F0777O2607K21867D0690R5825N1373a89609C54666a74633N0187B80021
$$ 328320 60777 123384 345251 40690 136515 187888 -189609 354666 -174633 -124446 280021
13149B1386L35082a83025B20901l0083F7800K58984j46499J47073r6634A11836
$$ 21386 356468 -183025 220901 190818 67800 326784 180285 327358 230724 111836
13138D34554G9750K04824b50455A29549L7598A7512a23466C1283J66406J13148
$$ 434554 79750 284574 -250455 129549 167147 17512 -123466 31283 197689 310837
13128C10837j44627K4699o1338k2987B2454L9742J16791a17334F3452b57488A57832
$$ 310837 166210 190909 129571 106584 22454 62196 178987 -117334 63452 -257488 157832
13116A34362D7239A7336J66893D7707J42965o2978R3588a17812C55310h6138K708
$$ 134362 47239 17336 184229 47707 190672 127694 221282 -117812 355310 -86138 -83430
13105h3430C69694A72533D6307J33730F9932K88508G9380a72461A50240l7299
$$ -83430 369694 172533 46307 180037 69932 358440 79380 -172461 150240 112941
13095A12941a34051f009A0992L934G387M5398j2730M68251G2670g8510I6330b61435
$$ 112941 -134051 -6009 10992 14926 7387 52785 40055 508306 72670 -78510 96330 -261435
13082a34174a3328A22723b4972A24398k5551E137J33167L21013A57970a6233j44539
$$ -134174 -13328 122723 -24972 124398 98847 5137 138304 459317 157970 -16233 -160772
13071a60772P5497L0165B65332G5791a68041A08912K86772o3807O6018F0780a73024
$$ -160772 -85275 -55110 265332 75791 -168041 108912 395684 331877 397895 60780 -173024
13059E4325L9178N2198j6973M2051J7035M4035J09515i9240B3298K60490c0493
$$ 54325 93503 145701 128728 170779 187814 231849 341364 -99240 23298 283788 -30493
13047A19892i2649F9283b61323B39674j8841a16551j3735A49941K23935f2434
$$ 119892 -92649 69283 -261323 239674 220833 -116551 -130286 149941 373876 -62434
13036a84354d4633H803g672B66173A31764D3843d7699B7919L2019Q1525J57750
$$ -184354 -44633 8803 -7672 266173 131764 43843 -47699 27919 59938 141463 299213
13025B99213M3908A16051J52332b6802B40322F3343K63773A44375J15342c11548
$$ 299213 343121 116051 268383 -26802 240322 63343 327116 144375 259717 -311548
13014A38938m2111f2530K7619D18309A21654b48436H6664J60927D5934L52639
$$ 138938 96827 -62530 -34911 418309 121654 -248436 86664 247591 45934 398573
13004C98573A72968j2306M6495e6732A87325l1961c1603j5582r0068I966b49946
$$ 398573 172968 160662 207157 -56732 187325 155364 -31603 -47185 -137253 9966 -249946
12992I3767a4440j96903b0702A36288R2693j04874e109B02985Q6046b3865H0009
$$ 93767 -14440 -211343 -20702 136288 228981 124107 -5109 202985 289031 -23865 80009
12980c20995C48932A56390b2106E121P0337M5865J09188a48710a0829C19309A7551
$$ -320995 348932 156390 -22106 5121 75458 121323 230511 -148710 -10829 319309 17551
12968C60578b53295A22158E0540b1416B71697m2148g3078B45527A02955J70359
$$ 360578 -253295 122158 50540 -21416 271697 229549 -73078 245527 102955 273314
12958B73314J03279B9795M8339K44114b42944B77097j26581i1664k7621e1298
$$ 273314 376593 29795 78134 322248 -242944 277097 150516 -91664 -119285 -51298
12947H5900O5356l7960r871a0590o925j51353a2731D35578b92158C44017O1986
$$ 85900 151256 113296 103425 -10590 -17515 -168868 -12731 435578 -292158 344017 406003
12936D06003A25716E2257a9467j9335m5383C0408b3076j45111A62037I960O684
$$ 406003 125716 52257 -19467 -38802 -84185 30408 -23076 -168187 162037 9960 16644
12925A6644c345B15971b35859R4896f2655C26466I8165P0004C7845J303b1203
$$ 16644 -3345 215971 -235859 -140963 -62655 326466 98165 168169 37845 39148 -21203
12913A35091c9287h055B23194b6911B9175K30234q9033b5259o9482C00234d2383
$$ 135091 -39287 -8055 223194 -26911 29175 259409 170376 -25259 -94741 300234 -42383
12901A87234n4970j6989P7484i5468k07393E2283g632I9965b4598A72772D0935
$$ 187234 132264 115275 192759 -95468 -302861 52283 -7632 99965 -24598 172772 40935
12889a15076B53285p5032A1533R3874a20755b8687B42164K693a28855A05128l56
$$ -115076 253285 178253 11533 105407 -120755 -28687 242164 244857 -128855 105128 104772
12878A04772j7090B6434K14528d2265B4829K77883A30576b3341B34641H0076M1830
$$ 104772 87682 26434 240962 -42265 24829 302712 130576 -23341 234641 80076 121906
12867A21906B7056J10738M56452A60436e7239j66645f7310B0527Q1568b43637
$$ 121906 27056 137794 594246 160436 -57239 -223884 -67310 20527 102095 -243637
12856a8863o1694A2743K60362A19703f9398f010A28909m7315J69790C1497c052
$$ -18863 -80557 12743 273105 119703 -69398 -6010 128909 81594 251384 31497 -3052
12844D4558i0587a6546A84837j1468d0226C1840J64195P1879c8643C5359L49216
$$ 44558 -90587 -16546 184837 173369 -40226 31840 196035 267914 -38643 35359 384575
12833C84575c833B72331a9853l23697I0307Q9084b51172D5273d8964A31448b05390
$$ 384575 -3833 272331 -19853 -343550 90307 179391 -251172 45273 -48964 131448 -205390
12821a4334p5875C00185C0147J40436J134c7209j30256C68631b98429a12070k909
$$ -14334 -90209 300185 30147 170583 171717 -37209 -167465 368631 -298429 -112070 -114979
12810a14979B45869h937B4273L1875M2344a48911D3449g7001B01948L506A427
$$ -114979 245869 -8937 24273 56148 98492 -148911 43449 -77001 201948 205454 1427
12798B04592J03651H8906N7648O9397b09132B41562E4326h5639G0066C1974A5116
$$ 204592 308243 88906 146554 215951 -209132 241562 54326 -85639 70066 31974 15116
12786a18345e8146K453j12322b7403j5866k1874A60503a20688L1467o96J9339
$$ -118345 -58146 -55693 -168015 -27403 -43269 -65143 160503 -120688 -89221 -89917 -70578
12775g0578j94900e0881k4595A53782N0680e2553j11206F4226J45187a21094j80819
$$ -70578 -265478 -50881 -75476 153782 204462 -52553 -163759 64226 209413 -121094 -301913
12764c01913h5268A41536o6208K29830c02261G2173b16102O8248n4418A57574
$$ -301913 -85268 141536 75328 305158 -302261 72173 -216102 -147854 -202272 157574
12753B91186j18117q0759a25975Q504E7899c46958B06930A8639c28113i4739B03528
$$ 291186 173069 92310 -125975 -117471 57899 -346958 206930 18639 -328113 -94739 203528
12741A03301a75175C16342j27429q6017b50274d8899p9273j36949Q5218J3944
$$ 103301 -175175 316342 188913 102896 -250274 -48899 -128172 -265121 -179903 -165959
12731a65959g8617B3755K02861d5064k82359h2847L234m7768J0909A98092J3504
$$ -165959 -78617 23755 226616 -45064 -327423 -82847 -79613 -127381 -116472 198092 211596
12720B11596B3940h7287A08083a42855F2989L960b12999A08424b1510C58581I7026
$$ 211596 23940 -87287 108083 -142855 62989 66949 -212999 108424 -21510 358581 97026
12708a0685A42526g7820M417a5335n7250m051A6818L23994C5326K31921a07505
$$ -10685 142526 -77820 -73403 -15335 -72585 -76636 16818 340812 35326 267247 -107505
12696A95317q8692a80501A29559K2215k5578K00791A36374O6066J8000R4008A26470
$$ 195317 106625 -180501 129559 151774 126196 326987 136374 202440 220440 314448 126470
12684A74222K9067D587K2730d7014B85309A7611l828K49769j6525A3943b43655
$$ 174222 203289 4587 27317 -47014 285309 17611 13783 263552 247027 13943 -243655
12672a79160B91196a3244A43858B7368b1661o1373C4082A2425K496L0598M1355
$$ -179160 291196 -13244 143858 27368 -21661 -83034 34082 12425 14921 45519 86874
12661H6874M35661A23349R4835a65802N9950D9985a10294D4061O7183A8506J36911
$$ 86874 522535 123349 218184 -165802 -105852 49985 -110294 44061 111244 18506 155417
12650A55417G2430a56815e5783A69169c8541H089J45694k0461G126b87397C99792
$$ 155417 72430 -156815 -55783 169169 -38541 8089 153783 133322 7126 -287397 399792
12638C01441A8360O5112J94561a26635k4455A58031f906B91668c4513A50547c5421
$$ 301441 18360 83472 278033 -126635 -151090 158031 -6906 291668 -34513 150547 -35421
12626A08778j2350q739B132L8086J63909c41410A44540N3502D9694B0629M34342
$$ 108778 96428 87689 2132 40218 204127 -341410 144540 198042 49694 20629 454971
12615D54971r6259j13834k2136J16836A42117o6660R6179J04532A37200p765J26866
$$ 454971 358712 244878 222742 339578 142117 75457 171636 276168 137200 129435 256301
12604B56301q7059B3805R8141i5542b051B14672g6046K9196A03605R5609p3951
$$ 256301 169242 23805 121946 -95542 -2051 214672 -76046 -46850 103605 199214 125263
12593A25263B7388J24534a22933A38700b50177D61069j82988a66810A30966k5961
$$ 125263 27388 151922 -122933 138700 -250177 461069 278081 -166810 130966 105005
12583A05005J04945c6797A27345J24004l0796l4365Q0177A29935A0447d354G1666
$$ 105005 209950 -36797 127345 251349 220553 186188 266365 129935 10447 -4354 71666
12571a2822k17007Q1589C68118j35902i4846I7235P4446B0767a05965D9015e4116
$$ -12822 -229829 -148240 368118 232216 -94846 97235 171681 20767 -105965 49015 -54116
12559b94207a615H2869f9801a9570B27286q6490D3864K2027J53448I4560L02210
$$ -294207 -1615 82869 -69801 -19570 227286 140796 43864 65891 219339 94560 396770
12548C96770g3926p7109N9297C39249Q8159D6490J29847o4142D2751M9361J20099
$$ 396770 -73926 -151035 -91738 339249 427408 46490 176337 112195 42751 92112 212211
12537B12211C6796J0605k0885n374e21443A65118J12727c77895c5023A66910n6320
$$ 212211 36796 47401 26516 21142 -521443 165118 277845 -377895 -35023 166910 110590
12526A10590m8596d63747E2059L04654C1465g6197B0392H155h539l4236A79063
$$ 110590 61994 -463747 52059 356713 31465 -76197 20392 8155 -8539 -42775 179063
12514C55208a3028A21118h9861q9709A35934M9549f7041j91321h3942L0693B16034
$$ 355208 -13028 121118 -89861 -179570 135934 185483 -67041 -258362 -83942 -53249 216034
12502B7716L91214a8224A59885k0031B3982M0868K5706a03724L7311j5189A51565
$$ 27716 418930 -18224 159885 139854 23982 64850 90556 -103724 -66413 -81602 151565
12490A0312J3462K29938c13703H5362J9053l0811J55497A01534J39079A20216
$$ 10312 23774 253712 -313703 85362 104415 73604 229101 101534 240613 120216
12479a87214A45800m2107D2968m845d9632m804k09014p7774a1074A9289J18513
$$ -187214 145800 103693 42968 38123 -49632 -54436 -263450 -341224 -11074 19289 137802
12468A37802K39932e1477A55824K30297a68605A82454d24921K04237M930A05360
$$ 137802 377734 -51477 155824 386121 -168605 182454 -424921 -220684 -215754 105360
12457a41285b7461j59984B34563b52974B89543P8496E1440a54510a0305j22925
$$ -141285 -27461 -187445 234563 -252974 289543 368039 51440 -154510 -10305 -133230
12447a33230c7031r4569B1145N6085b70613I9746Q4715b535A37985e3484b1620
$$ -133230 -37031 -131600 21145 77230 -270613 99746 184461 -2535 137985 -53484 -21620
12435b89322A87342a27067q7883B28259A10398b4803m6854l2271j98350J26451
$$ -289322 187342 -127067 -214950 228259 110398 -24803 -71657 -103928 -302278 -175827
12425a75827m4348M4446I3255a41628d2538k01671a2536A21004K3416b05365M8103
$$ -175827 -220175 -175729 93255 -141628 -42538 -244209 -12536 121004 144420 -205365 -157262
12414a57262G2443a0722B4350e5982A34281f4707j81674a17106d5622J8333q8713
$$ -157262 72443 -10722 24350 -55982 134281 -64707 -246381 -117106 -45622 -27289 -116002
12403a16002A37691D165i1780K8407l1943A94669n0909b7308j9357B06351j9721
$$ -116002 137691 4165 -91780 -63373 -95316 194669 143760 -27308 -46665 206351 186630
12392A86630a11382k44016B18585L0543A07131b97819L6797N5821c0246j13744
$$ 186630 -111382 -355398 218585 249128 107131 -297819 -261022 -205201 -30246 -143990
12382a43990j96864A05747k7426a40731L2754E7433a63962b2533B9097K5544b6490
$$ -143990 -340854 105747 78321 -140731 -107977 57433 -163962 -22533 29097 54641 -26490
12370b77909B43008C1217a32155C2859a96925j45257b7982A29297a6946A20464
$$ -277909 243008 31217 -132155 32859 -196925 -342182 -27982 129297 -16946 120464
12359E7562J20972c4774D82262G1308A7109n454Q788e616A73805a1186I2683a30790
$$ 57562 178534 -34774 482262 71308 17109 11655 20443 -5616 173805 -11186 92683 -130790
12346B39166r4255a46493r9302J17776l0199c9919E1027G802a82628l8228B11129
$$ 239166 144911 -146493 -245795 -128019 -158218 -39919 51027 7802 -182628 -220856 211129
12334f5455a8542B27742a23736B37199d57523a89880j76594B21963a8291C4071
$$ -65455 -18542 227742 -123736 237199 -457523 -189880 -366474 221963 -18291 34071
12323D2444M7998c20364D23394a12434j17447P3570P0418C16624b47401a4219
$$ 42444 90442 -320364 423394 -112434 -229881 -156311 -85893 316624 -247401 -14219
12312e3705O388A59091g5992o3956C31102f7214K4450A6949m96L30575l2349A29831
$$ -53705 -47317 159091 -75992 -139948 331102 -67214 -42764 16949 16453 347028 314679 129831
12299h6323C59587G6236c8476l1492A64754a86090e9769k1331A22653M9511a26325
$$ -86323 359587 76236 -38476 -69968 164754 -186090 -59769 -81100 122653 172164 -126325
12287A11116d7579j13283o2077D5939J4746o895i8163A17762C7245a23371I967
$$ 111116 -47579 -160862 -222939 45939 60685 53790 -98163 117762 37245 -123371 9967
12275A72706J50924A19576a99797p8454H5101e9163H1831L46584d4521A61089
$$ 172706 323630 119576 -199797 -278251 85101 -59163 81831 428415 -44521 161089
12264f6229j56510B98630a62414C2168a23929l8606A58155o3880f5185B15139
$$ -66229 -222739 298630 -162414 32168 -123929 -162535 158155 94275 -65185 215139
12253i3208B35361A05013a7713B85934o5995m4777K1292K4791l9674D7814L5697
$$ -93208 235361 105013 -17713 285934 219939 175162 196454 221245 181571 47814 83511
12242H3511c0531A52468j5712L6205J44758H6908a19351h550k07558b1594D6197
$$ 83511 -30531 152468 136756 172961 317719 86908 -119351 -8550 -216108 -21594 46197
12230D50959m6785g3010B28614d988j00443j55153I8812a95443D06730a79658
$$ 450959 404174 -73010 228614 -4988 -105431 -260584 98812 -195443 406730 -179658
12219g1415D9380J66913a68080C70108i3820I4692O0579J14158l2318L6751k1990
$$ -71415 49380 216293 -168080 370108 -93820 94692 155271 269429 237111 273862 251872
12208B51872j20190M8241J00624b0649B58149a15013A57845J94083g1108G8676
$$ 251872 131682 179923 280547 -20649 258149 -115013 157845 351928 -71108 78676
12197e4812D53002B02074A7497a35883N588m563C62153j09872f1200m3851B26332
$$ -54812 453002 202074 17497 -135883 -130295 -134858 362153 252281 -61200 -105051 226332
12185A19359J58546G5637B2985a33618B55222r4692Q6715l4920k2052g3287C34604
$$ 119359 277905 75637 22985 -133618 255222 160530 247245 212325 190273 -73287 334604
12173A25239K34726j29116b30808b2689D9958b7092a2445B54910c49662B18734
$$ 125239 359965 230849 -230808 -22689 49958 -27092 -12445 254910 -349662 218734
12162A58272J61970a50354B28027q4485g800B25034h5513d270H3515J57487o7673
$$ 158272 320242 -150354 228027 143542 -7800 225034 -85513 -4270 83515 241002 173329
12151A73329h9191A14535l7950J94541I7827b4393B01115I4929e3761H9062C6093
$$ 173329 -89191 114535 76585 271126 97827 -24393 201115 94929 -53761 89062 36093
12139a44818C07909o303C9555c8919B49265b23590b252D53644a10021A42688a72649
$$ -144818 307909 301606 39555 -38919 249265 -223590 -2252 453644 -110021 142688 -172649
12127h4813A62824a88922L2343a9587D9977J7648q274K44889A48907J90623a57687
$$ -84813 162824 -188922 -156579 -19587 49977 67625 59351 304240 148907 339530 -157687
12115B43407c4926B6656L85a08370G6252a46552O5732A82260d6678m152l2572
$$ 243407 -34926 26656 27041 -108370 76252 -146552 -80820 182260 -46678 -50830 -83402
12104h3402C2401f6668l36357H6697A1642J61591c19089e0019m8971j09332c8249
$$ -83402 32401 -66668 -403025 86697 11642 173233 -319089 -50019 -98990 -208322 -38249
12092a40555A87293a21453n9534A83152j7532a29270m20539J46247A61515J4281
$$ -140555 187293 -121453 -180987 183152 165620 -129270 -549809 -403562 161515 175796
12082A75796G2030k7055L96667a32806E9519a82054E6795b99960k7041B04264
$$ 175796 72030 44975 441642 -132806 59519 -182054 56795 -299960 -327001 204264
12071a3556G317J40976a41679I1029b60678e5595j10554d0869I7745J25874i7729
$$ -13556 7317 148293 -141679 91029 -260678 -55595 -166149 -40869 97745 223619 -97729
12059D10345I9909k1508L39491J62693P8432j52755n575E8691d4137k0649j6732
$$ 410345 99909 78401 417892 580585 659017 506262 500687 58691 -44137 -64786 -81518
12048h1518r8863E0124L22138a42791E4316a37153A1737a85681A01937C2825J19660
$$ -81518 -180381 50124 372262 -142791 54316 -137153 11737 -185681 101937 32825 152485
12037A52485b17881b3528j14709B37235A8456M3251i8653A19792a10223c4927
$$ 152485 -217881 -23528 -138237 237235 18456 61707 -98653 119792 -110223 -34927
12026f6547H8192C843e5785k24767d3863k5119b1380Q317k2799O358k6428A02538
$$ -66547 88192 3843 -55785 -280552 -43863 -68982 -21380 -13063 -35862 -29504 -55932 102538
12013a70125G9118f2505A7749R3309a95702A83106C5446c1558E7760e6944I3227
$$ -170125 79118 -62505 17749 111058 -195702 183106 35446 -31558 57760 -56944 93227
12001c1923k29224b8285k77392a1638F7357a95014e2843l7561I1271b70031E7142
$$ -31923 -261147 -28285 -305677 -11638 67357 -195014 -52843 -90404 91271 -270031 57142
11989B96922b1763o1963j50152R5360h363q2615a701C33360A7567J60242k7915
$$ 296922 -21763 -83726 -233878 -138518 -8363 -90978 -1701 333360 17567 177809 149894
11978A49894b86575B49343a30875I2055B1232L68118e8421j44864e858A2729J54061
$$ 149894 -286575 249343 -130875 92055 21232 389350 -58421 -203285 -5858 12729 166790
11967A66790b50552J18024j34241e4042j27563G3230L1471e5564j53259j47178
$$ 166790 -250552 -132528 -266769 -54042 -181605 73230 104701 -55564 -208823 -356001
11957c56001g775j83760m7873B97831A651K04934f9823k29804E4975H471d62037
$$ -356001 -7775 -191535 -239408 297831 1651 206585 -69823 -299627 54975 8471 -462037
11945A9311C442a81845g1363L0609l29822A2839g6599c8235k20315l3802A1772
$$ 19311 3442 -181845 -71363 -40754 -370576 12839 -76599 -38235 -258550 -292352 11772
11933b43990I0173i0878m814A61359r297P072c58315E5765b85575J19684r7254
$$ -243990 90173 -90878 -95692 161359 152062 159134 -358315 55765 -285575 -165891 -263145
11922b63145e7999A07824e881j28393j61825Q0526c2392A53202i6178F0245f4648
$$ -263145 -57999 107824 -5881 -134274 -296099 -215573 -32392 153202 -96178 60245 -64648
11910F5589k6296a25472n8502n9307c7929A02312O292b70080j06763a26894P591
$$ 65589 39293 -125472 -183974 -243281 -37929 102312 108604 -270080 -376843 -126894 -119303
11899a19303l9904C6266f794C07179j26253a53014k07146i146D0624e2166B22005
$$ -119303 -159207 36266 -6794 307179 180926 -153014 -360160 -9146 40624 -52166 222005
11887c6309l67695g1775B30582A07885J10379a19126L5625e195r4954A0657B443
$$ -36309 -404004 -71775 230582 107885 218264 -119126 -83501 -5195 -100149 10657 2443
11875a35363C95943f319A0292c40819a44092I6230d62438n9925a40771B41863
$$ -135363 395943 -6319 10292 -340819 -144092 96230 -462438 -522363 -140771 241863
11864i0389I9600J17367b16047A61455G583L8925R2103e4350h671D3445R4870
$$ -90389 99600 216967 -216047 161455 7583 46508 138611 -54350 -8671 43445 138315
11853A38315o2381A2988J98890E154c50166K5425N9066C3286c76662b0915H9915
$$ 138315 75934 12988 211878 5154 -350166 -324741 -265675 33286 -376662 -20915 89915
11841f3177j37320F4723J32458f2161D114P0530a22977M2609A17380a89985L4994
$$ -63177 -200497 64723 197181 -62161 4114 74644 -122977 -80368 117380 -189985 -154991
11830a54991p0639B8990b7647A32394a17836g016E7657L9042i0397B71358a31081
$$ -154991 -225630 28990 -27647 132394 -117836 -7016 57657 96699 -90397 271358 -131081
11818A67694a47106P2224A41768A4714b10586f3352o070C63714a73918K4587B69021
$$ 167694 -147106 -74882 141768 14714 -210586 -63352 -69422 363714 -173918 -149331 269021
11806A09358b90424b7131O422C22882c44132n3031A40333p819d3346D7436i6471
$$ 109358 -290424 -27131 -20709 322882 -344132 -397163 140333 132514 -43346 47436 -96471
11794G9132d84751b4918r2216A3751K48979a33337A19098N3225b6660E8964a95270
$$ 79132 -484751 -24918 -117134 13751 262730 -133337 119098 172323 -26660 58964 -195270
11782e3519B51341p751a95932o5387A4865J2254K18639i6246J5262k1154B0635
$$ -53519 251341 243590 -195932 -261319 14865 27119 245758 -96246 -80984 -102138 20635
11770a07703H2833A1541O0626a80933F1772J11417b49711n575k05759D45972e2723
$$ -107703 82833 11541 72167 -180933 61772 173189 -249711 -255286 -461045 445972 -52723
11758a81911A01858f5944F0882b5012q4748n3870P7417I1638R5475a8922k73058
$$ -181911 101858 -65944 60882 -25012 -109760 -163630 -86213 91638 187113 -18922 -291980
11747b91980J14703C4618p330J38881B1443a51290O1884D4876M9135a21175B05604
$$ -291980 -177277 34618 27288 166169 21443 -151290 -89406 44876 94011 -121175 205604
11735D3964c65229D2496J57824m6459c6688E5036a62273b1162k63098M0708B84177
$$ 43964 -365229 42496 200320 153861 -36688 55036 -162273 -21162 -284260 -243552 284177
11723b18554A06654d0458H5405M250O3152k2225J8225a96383o0460a8967E3686
$$ -218554 106654 -40458 85405 89655 152807 130582 148807 -196383 -256843 -18967 53686
11711A1072g7631A35213e1433D4439P0749d4089I1576e8900A63963G8582b04409
$$ 11072 -77631 135213 -51433 44439 115188 -44089 91576 -58900 163963 78582 -204409
11699b13042I9852d1729k20192A03359J60787a08823a0343A25949l5936c16860
$$ -213042 99852 -41729 -261921 103359 264146 -108823 -10343 125949 90013 -316860
11688B53148F3641R497e283C58516A3933a8864D7845j7260J5067J4381a76677
$$ 253148 63641 73138 -5283 358516 13933 -18864 47845 30585 45652 60033 -176677
11676E6531J91021a16828j50597A71072b6715r2684D57726a87546h2087A01474
$$ 56531 247552 -116828 -267425 171072 -26715 -119399 457726 -187546 -82087 101474
11665B78547B8467K6138k11b76570M2143B48685a64761j54142A83057P302c35201
$$ 278547 28467 54605 54394 -276570 -234427 248685 -164761 -318903 183057 190359 -335201
11653a22528n1641E18786h5924I8848A248N9572a97991F8526b5862j83340F0145
$$ -122528 -174169 518786 -85924 98848 1248 60820 -197991 68526 -25862 -209202 60145
11641G8803d6206k15392J28814k3515j32847f8573k43740a10361j3661A56873
$$ 78803 -46206 -261598 -132784 -156299 -289146 -68573 -312313 -110361 -124022 156873
11630E7264J22706k0884n5240O17D3428a90385j30463f1273p0811D3582e4267
$$ 57264 179970 159086 103846 104463 43428 -190385 -320848 -61273 -132084 43582 -54267
11618d0265A85986a39866k95212i200B22827i3154D8279J62199i9560C32569F989
$$ -40265 185986 -139866 -435078 -9200 222827 -93154 48279 210478 -99560 332569 6989
11606b21482c6563r8717C08334i5394A15274a2478A83783a9189A34903m3307p124
$$ -221482 -36563 -135280 308334 -95394 115274 -12478 183783 -19189 134903 91596 84472
11595H4472K3314J73714a8898A8343i2336A08470a0867B56897a66540f6641d843
$$ 84472 107786 281500 -18898 18343 -92336 108470 -10867 256897 -166540 -66641 -4843
11583g0928a107j09618r0176G0995J54769H5666f0967A36693c4765H3922l5301
$$ -70928 -1107 -110725 -200901 70995 225764 85666 -60967 136693 -34765 83922 48621
11572D8621J40548e651B53384n8678p5293a19787E7515a20760C17136b35645Q7499
$$ 48621 189169 -5651 253384 194706 119413 -119787 57515 -120760 317136 -235645 -148146
11561a48146B91757d8864j45822c5541B0483J70038b57729F6572e1077m3003p9544
$$ -148146 291757 -48864 -194686 -35541 20483 190521 -257729 66572 -51077 -94080 -173624
11550a73624a7074B44234E3624J80684j8031c25888F7935J26281d9207D53709
$$ -173624 -17074 244234 53624 234308 216277 -325888 67935 194216 -49207 453709
11539c4212l1818H3380e6282j37490A66962p3042P9703L7320p7887e6568A67471
$$ -34212 -66030 83380 -56282 -193772 166962 93920 173623 210943 133056 -56568 167471
11527A97580a53690A29853f9129D63589A346a4602B15425J70612g6704B30799
$$ 197580 -153690 129853 -69129 463589 1346 -14602 215425 386037 -76704 230799
11516G0477L8851a47085A7580K08703D2899b18620L1698A37927B7457a09759F4052
$$ 70477 109328 -147085 17580 226283 42899 -218620 -186922 137927 27457 -109759 64052
11504H7482J34460J91647A66317F8454K74732a68935e9259E0746J4065K04544
$$ 87482 221942 413589 166317 68454 343186 -168935 -59259 50746 64811 269355
11494B69355C2306b00164A60839h4287a7256A2147J24818E8537i266n738A17785
$$ 269355 32306 -200164 160839 -84287 -17256 12147 136965 58537 -9266 -15004 117785
11482c31982B01292e4149J0599B91175G7270a34081C32268A46550M742i9144D89869
$$ -331982 201292 -54149 -43550 291175 77270 -134081 332268 146550 151292 -99144 489869
11470A07369r27J77650j2839P9739F9204l1571K92654e7228j0889a9068F6553
$$ 107369 106442 284092 271253 350992 69204 37633 330287 -57228 -68117 -19068 66553
11458a57651A39749c0255A78728N4203L18116D3837o552K02334R6813d1315A3540
$$ -157651 139749 -30255 178728 232931 551047 43837 37285 239619 336432 -41315 13540
11446C8113J31592K57473A35375l7114r104J4809C6153e9591j059A43109d604
$$ 38113 169705 427178 135375 98261 89157 103966 36153 -59591 -60650 143109 -4604
11434A27344L66271A46531D0834J64139g2786J451b5835D36871A20064a64917
$$ 127344 493615 146531 40834 204973 -72786 -71335 -25835 436871 120064 -164917
11423A43477h8306D7106K86618I748P165J69323a6963j45073B40560A0288c52007
$$ 143477 -88306 47106 333724 9748 16913 186236 -16963 -162036 240560 10288 -352007
11411A69719C6524K26765k2632L21959a85869A05651M6236K89926F5360c43403
$$ 169719 36524 263289 240657 562616 -185869 105651 151887 441813 65360 -343403
11400C74990D1799e6457C1006J74593h4655l23881A70796D779K6510a39029n0339
$$ 374990 41799 -56457 31006 205599 -84655 -408536 170796 4779 31289 -139029 -189368
11389a89368b5972A59867J40886a54617C10352g0653D8914O9192h2177B00068
$$ -189368 -25972 159867 300753 -154617 310352 -70653 48914 118106 -82177 200068
11378a83452A58764b56983a6423j73424g2529l2977p6780M1553f7969K8950j07986
$$ -183452 158764 -256983 -16423 -189847 -72529 -105506 -182286 -140733 -67969 -39019 -147005
11367a47005E418c53940R0838C31363D4765L5531j7432J15834C9440J85004b7086
$$ -147005 5418 -353940 -263102 331363 44765 80296 62864 178698 39440 224444 -27086
11355C16399i5784E8425a79734K7227G0997Q1428B3426c60088a75109A73910A3912
$$ 316399 -95784 58425 -179734 -152507 70997 152425 23426 -360088 -175109 173910 13912
11343B08700b15045Q7360a5403o482k04975O0520c8013A48530f6339D1803N2781
$$ 208700 -215045 -127685 -15403 -21885 -226860 -166340 -38013 148530 -66339 41803 94584
11332I4584a40082L1406a0433L756C22681i9140b352j38228O9989j04450B79104
$$ 94584 -140082 -108676 -10433 -6677 322681 -99140 -2352 -140580 -70591 -175041 279104
11320b00982A70498a81966d2242B21999c37000c5901a6513l13955p478B26325
$$ -200982 170498 -181966 -42242 221999 -337000 -35901 -16513 -330468 -337946 226325
11309A87165o7975b5679C6824N7062b7681m5785p5072H4474c2198B6490J19179
$$ 187165 119190 -25679 36824 93886 -27681 -73466 -148538 84474 -32198 26490 145669
11298A45669e0456A039a38060K8340D0029e0110q4577j83508k5619J54392P9939
$$ 145669 -50456 1039 -138060 -109720 40029 -50110 -134687 -318195 -343814 -189422 -109483
11287a09483j84988A32875k9290c50578c3506j25020L9493M335G2544R7702p34
$$ -109483 -294471 132875 103585 -350578 -33506 -158526 -119033 -114698 72544 170246 169512
11276A69512a76087l28353a98139j30252I9351a75194A55617K64368A85234c28848
$$ 169512 -176087 -504440 -198139 -328391 99351 -175194 155617 419985 185234 -328848
11265A68223a72083P1022B5273e6794C30042b43397j0958A33419N486n4927a62418
$$ 168223 -172083 -101061 25273 -56794 330042 -243397 -254355 133419 138905 83978 -162418
11253a2344j91862P7805j12337I6289J65232e9162A8586i8668k3296q99d6141
$$ -12344 -204206 -126401 -238738 96289 261521 -59162 18586 -98668 -121964 -122863 -46141
11241B49434G3630h2460A44637e3699l3545j31123P1271C0348K0557b4506F6343
$$ 249434 73630 -82460 144637 -53699 -87244 -218367 -147096 30348 50905 -24506 66343
11229a05977A53957a71177e0967B33620a08442A03198a43291B02677h9632A04727
$$ -105977 153957 -171177 -50967 233620 -108442 103198 -143291 202677 -89632 104727
11218F4568i33E586N4392e5526n2847k06611G0684L9630b30767k2090r13f204
$$ 64568 -933 5586 59978 -55526 -108373 -314984 70684 110314 -230767 -252857 -253770 -6204
11205A32875i4807B4949K8515f8810j03837g2755A98511R5049b34380R5543j2921
$$ 132875 -94807 24949 53464 -68810 -172647 -72755 198511 293560 -234380 -138837 -151758
11194a51758C21559f5292k00713m9941J30826p0839h6290k50166a66622D6421
$$ -151758 321559 -65292 -266005 -315946 -185120 -255959 -86290 -336456 -166622 46421
11183g6867p9421m6024j55435c3665j33628K0460d0579D6923I320c48331c1416
$$ -76867 -156288 -202312 -357747 -33665 -167293 -146833 -40579 46923 9320 -348331 -31416
11171b67315J0292g1769L5107E9347K08464A17267P1015a0831l57989e8580B50487
$$ -267315 -257023 -71769 -36662 59347 267811 117267 188282 -10831 -368820 -58580 250487
11159d9752B25259H3488k5942c44960k4265d4345r690k17071H2872b36816F5896
$$ -49752 225259 83488 57546 -344960 -369225 -44345 -54035 -271106 82872 -236816 65896
11147D4398c9984A3162J53780A2376a5108A7288i4559A08943e0200A69253R448
$$ 44398 -39984 13162 166942 12376 -15108 17288 -94559 108943 -50200 169253 178701
11136A78701L42420A15961L6478g5A82713b10332k112F5736g296r4425A19180
$$ 178701 521121 115961 152439 -75 182713 -210332 -212444 65736 -7296 -101721 119180
11124b26548j9200j39781A39374d60190B82031b9468H6444J07817a63657q0438
$$ -226548 -245748 -385529 139374 -460190 282031 -29468 86444 194261 -163657 -244095
11114b44095C44736c16154i3080R030K5767A43746A3105L78888A17876R4428a2259
$$ -244095 344736 -316154 -93080 -84050 -58283 143746 13105 391993 117876 212304 -12259
11102I3958h5498M2465B44201c0656a3085p406A89386G9045a76551G2442J47402
$$ 93958 -85498 -43033 244201 -30656 -13085 -20491 189386 79045 -176551 72442 219844
11091B19844J03304j54871O1395f7192A69877a47082C44060a90673B71685e1888
$$ 219844 323148 168277 229672 -67192 169877 -147082 344060 -190673 271685 -51888
11080E7788J05247K2320K19213j64296J46845a24235D08786j54118a05942A08883
$$ 57788 163035 185355 404568 240272 387117 -124235 408786 254668 -105942 108883
11069e1696C33720L620G1505j4648Q84P4051l3763K06250o8552F0720L34364P9770
$$ -51696 333720 337340 71505 56857 57741 131792 98029 304279 235727 60720 395084 474854
11057D74854E5813J1969P05239k82422A09111l7008L16188R4512A37719L08998
$$ 474854 55813 67782 773021 490599 109111 72103 388291 482803 137719 446717
11047D46717B18675K14307K1214P8720J670B66632M4629K78817k3541J23643A96579
$$ 446717 218675 432982 454196 532916 534586 266632 311261 590078 566537 690180 196579
11035H57569l61082r6333M59234o3163j65681K22676k74562P5151j83609L03041
$$ 857569 496487 400154 859388 796225 630544 853220 578658 653809 470200 773241
11025G73241o6860J20455J0571j99127L9266l4186o5452M34946D80436J7867B48334
$$ 773241 706381 826836 837407 638280 677546 643360 577908 1012854 480436 498303 248334
11013B89868L39295q3528L14229k9277q1358m1863p9332k65459m6852j08457L71700
$$ 289868 629163 545635 859864 830587 749229 707366 628034 362575 315723 207266 578966
11002E78966J57576j50747k2181q686l9249O6768J26941j30903M7965B20352M09802
$$ 578966 736542 585795 563614 554928 515679 582447 709388 578485 626450 220352 630154
10991F30154Q4693j11438k1958J7785J52459j74725A73802O76111K45217l50292
$$ 630154 714847 603409 581451 599236 751695 576970 173802 849913 1095130 744838
10981G44838j14930k10023n1392J48804K55971J596p3272J87307r524l07222K60214
$$ 744838 629908 419885 368493 517297 773268 774864 701592 888899 879375 572153 832367
10970H32367J44597n2900k20143K72627q930j4452K59626j72249N50024K36197
$$ 832367 976964 924064 703921 976548 967618 953166 1212792 1040543 1590567 1826764
10960A826764j3855O73336m23346N73978m40878k02552L46421k11507m50400l4402
$$ 1826764 1812909 2486245 2062899 2636877 2195999 1993447 2339868 2128361 1677961 1643559
10950A643559k57034j1718j42652K74308l04732K45442P6254j83159k54365R0980
$$ 1643559 1386525 1374807 1232155 1506463 1201731 1447173 1523427 1340268 1085903 1176883
10940A176883j43964P8308j71343k71828r3801Q5456j15242k64618q377J94939
$$ 1176883 1032919 1111227 939884 668056 574255 659711 544469 279851 271474 466413
10930D66413n7365A53661J90375j71293a4510A99156E285K23384I200J07031K38505
$$ 466413 409048 153661 344036 172743 -14510 199156 5285 228669 9200 116231 354736
10919C54736b4629A10986a16484j51503P0624C01085a54867B88281r8084H984
$$ 354736 -24629 110986 -116484 -267987 -197363 301085 -154867 288281 190197 8984
10908b11327i7959B54946q217a49063A28067M2077H3027R8079D3447J45291b93509
$$ -211327 -97959 254946 246729 -149063 128067 170144 83027 181106 43447 188738 -293509
10896a64259k04170G2935b60825d8255H5259R328B0521b00932K580c6409B6941
$$ -164259 -368429 72935 -260825 -48255 85259 94587 20521 -200932 -198352 -36409 26941
10884a67828B72836g6343m8079E0707K7316a56792B04683l7189Q4613A5882O3364
$$ -167828 272836 -76343 -124422 50707 78023 -156792 204683 167494 252107 15882 79246
10873G9246a69114c0751H985b24992B6116f5466B56676b57604A52278L22016B23541
$$ 79246 -169114 -30751 8985 -224992 26116 -65466 256676 -257604 152278 474294 223541
10861f6230A61120N5836C8461b12369B1565h2160A79675b47485a04747p3157g9645
$$ -66230 161120 216956 38461 -212369 21565 -82160 179675 -247485 -104747 -177904 -79645
10849B02144B4268b62385M2833A50278i5510j67953R5895D6262a27882B51070
$$ 202144 24268 -262385 -219552 150278 -95510 -263463 -167568 46262 -127882 251070
10838e03059b36979C01181j30833a24652B76839a57581f703j4970n1678a9174
$$ -503059 -236979 301181 170348 -124652 276839 -157581 -6703 -21673 -73351 -19174
10827D3242J9487J54882b16097A91075a04269C4039K12237q327h6313b3281k37721
$$ 43242 62729 217611 -216097 191075 -104269 34039 246276 237949 -86313 -23281 -261002
10816b61002A34727e0634A29738K44725f5449A28089D878b74579a02113q5105
$$ -261002 134727 -50634 129738 374463 -65449 128089 4878 -274579 -102113 -187218
10806a87218J9859A06015d8629m83067G4338c48649A67856b8461A8230b3302l5903
$$ -187218 -167359 106015 -48629 -531696 74338 -348649 167856 -28461 18230 -23302 -59205
10795e9205q7315O6874f059A16457J38230g2570R373A09043b8328J2747A15611
$$ -59205 -146520 -79646 -6059 116457 254687 -72570 -63197 109043 -28328 -15581 115611
10783A29107L0964p7197a43467A90752j3412b39222A20466k790j4845a33708k67045
$$ 129107 160071 82874 -143467 190752 177340 -239222 120466 117676 102831 -133708 -400753
10772d00753J75251k9214f8493q062o7229l15190b19141n4597b0022n1184B76391
$$ -400753 -225502 -254716 -68493 -76555 -143784 -458974 -219141 -273738 -20022 -71206 276391
10760f7377q2731m5936K7221n233B6336b9231l03304g0173B43888a19161L3181
$$ -67377 -150108 -196044 -168823 -174056 26336 -29231 -332535 -70173 243888 -119161 -85980
10749h5980A56937G0579f5707A73334e5937q8613C61320p7624f963p1987j54429
$$ -85980 156937 70579 -65707 173334 -55937 -144550 361320 283696 -6963 -78950 -233379
10738b33379p7185c9075e400j86961m0631k14087B0435M0944f7566m7980H9063
$$ -233379 -310564 -39075 -5400 -192361 -232992 -447079 20435 61379 -67566 -115546 89063
10726E7784i746B43168f5259N36E0736K3529e554o8882k63558I3270D4418M5755
$$ 57784 -9746 243168 -65259 -64723 50736 74265 -5554 -74436 -337994 93270 44418 90173
10714I0173K1000a96023B44983c66868E3446c02496J16882l9589J3430a7647M72
$$ 90173 111173 -196023 244983 -366868 53446 -302496 -185614 -225203 -211773 -17647 -17175
10703a7175b876j10609l722I6099M9001B0963a20214l396j42949K135a00395j77296
$$ -17175 -2876 -113485 -117207 96099 145100 20963 -120214 -123610 -266559 -264424 -100395 -277691
10691b77691f7707l6598C07854B4428Q3519a55270J9388H5469b66066J06765C13275
$$ -277691 -67707 -104305 307854 24428 107947 -155270 -135882 85469 -266066 -159301 313275
10679c82199A11586c30735B19251a60330A33444J01587a54958c0731j1816p268
$$ -382199 111586 -330735 219251 -160330 133444 235031 -154958 -30731 -42547 -49815
10669d9815A67313e7966A92701a7556A14452A485a31430B8293a35512q4206A43853
$$ -49815 167313 -57966 192701 -17556 114452 1485 -131430 28293 -135512 -219718 143853
10657e6447A57176d477j50252G066a57167q5760a5881I1816a35190q6332B01628
$$ -56447 157176 -4477 -154729 7066 -157167 -242927 -15881 91816 -135190 -221522 201628
10645C43660b12086A89038c4607q2742A51801f4726b9420B8380i064d097j11988
$$ 343660 -212086 189038 -34607 -117349 151801 -64726 -29420 28380 -9064 -4097 -116085
10634a16085F2478b78623h852j07563j65158i2333B26714R0684c2694m8494E0178
$$ -116085 62478 -278623 -8852 -116415 -281573 -92333 226714 317398 -32694 -81188 50178
10622F0054a53655b8259A711f5258r8755B9766a62282d7048m6633B33065B0249
$$ 60054 -153655 -28259 1711 -65258 -164013 29766 -162282 -47048 -93681 233065 20249
10610e4078B3733b0340o363A71402e4781a4779j96266n7791A40981n7957a62316
$$ -54078 23733 -20340 -26703 171402 -54781 -14779 -211045 -268836 140981 83024 -162316
10598E7829g7170K2311D4380e6915k92363g4991J5829m47639J69630F5764e1267
$$ 57829 -77170 -54859 44380 -56915 -349278 -74991 -59162 -506801 -337171 65764 -51267
10586A48679g0182E9152a28147q6658A21906l160a41230j92669J56750g9653G981
$$ 148679 -70182 59152 -128147 -214805 121906 118746 -141230 -333899 -177149 -79653 7981
10574h6503M0107k14833a20864D132h3102A19337i196r9493a6058k56640i3807
$$ -86503 -46396 -261229 -120864 4132 -83102 119337 -9196 -108689 -16058 -272698 -93807
10562d4961D01864a59559C35144A49725b12475d1308B95435a57216O3310A57753
$$ -44961 401864 -159559 335144 149725 -212475 -41308 295435 -157216 -93906 157753
10551A25792o432d41076b4925A33929b94343H0658k2354N2438b58833A0793e6124
$$ 125792 119360 -441076 -24925 133929 -294343 80658 58304 110742 -258833 10793 -56124
10539A40657a72640e3454n9198c9819I7870a65166C69299a39820D8252b48516
$$ 140657 -172640 -53454 -112652 -39819 97870 -165166 369299 -139820 48252 -248516
10528B54633j06646B1155M1085Q587B4640I100c31811A46716a23753d6783A9391
$$ 254633 147987 21155 62240 70827 24640 9100 -331811 146716 -123753 -46783 19391
10516b43457J11570A11307i3564A75394b68985m5236c5809k08510C5478Q6587
$$ -243457 -131887 111307 -93564 175394 -268985 -314221 -35809 -244319 35478 122065
10506A22065a3188k67902j86275a18999A48359f3241p4993j40189G3777C2605
$$ 122065 -13188 -281090 -467365 -118999 148359 -63241 -138234 -278423 73777 32605
10495a04790l2681d4271A40259J57615C6714e6120H8042l2593e2823j520j64330
$$ -104790 -137471 -44271 140259 297874 36714 -56120 88042 55449 -52823 -54343 -218673
10484b18673B19093b56568f4292C2974a18971H2800g1007B3478g2668B8542a93984
$$ -218673 219093 -256568 -64292 32974 -118971 82800 -71007 23478 -72668 28542 -193984
10472A60376m1469K1973J15491M2256a01914D71089A70234E1575R610f0018A3051
$$ 160376 118907 140880 256371 298627 -101914 471089 170234 51575 61185 -60018 13051
10460f2924I6212h7071A40494g2748l2877A75823c76171a1836A55627e9410j7041
$$ -62924 96212 -87071 140494 -72748 -105625 175823 -376171 -11836 155627 -59410 -76451
10449g6451c6594A51261a12459B81012B3877b78113E6811K40697b71914g1963
$$ -76451 -36594 151261 -112459 281012 23877 -278113 56811 297508 -271914 -71963
10438b85696G5480c4286M592A63993H1514a25026l30613a20045o3757j96171C6330
$$ -285696 75480 -34286 -29694 163993 81514 -125026 -455639 -120045 -183802 -379973 36330
10426h5941B38095a14804j01126b9059B5126f1713j4966L7264A46495a12947l69318
$$ -85941 238095 -114804 -215930 -29059 25126 -61713 -76679 -39415 146495 -112947 -482265
10415d82265a12375B72966a27665k78194a9646I976e33032G2814J13846a24018
$$ -482265 -112375 272966 -127665 -405859 -19646 9976 -533032 72814 186660 -124018
10404a08899B54891e59251B4480J58952i0118B17574F3101A6016a25992M866F895
$$ -108899 254891 -559251 24480 183432 -90118 217574 63101 16016 -125992 -121126 6895
10392D02597b46473G2244b104j01031d1664j00316a9896o8805B18723a09044l8936
$$ 402597 -246473 72244 -2104 -103135 -41664 -141980 -19896 -88701 218723 -109044 -147980
10381a47980c4734A01133K69987H7117B6505J79149a53665A35464b06547d3463
$$ -147980 -34734 101133 371120 87117 26505 205654 -153665 135464 -206547 -43463
10370A6737D967K57287J20340A88322a71252B40933H8568J05820j7622K88785
$$ 16737 4967 262254 382594 188322 -171252 240933 88568 194388 176766 465551
10360D65551j58705J74120k31706Q6128J435r0386q9876J95868b00851C63626
$$ 465551 306846 480966 249260 335388 336823 246437 156561 352429 -200851 363626
10349C73646j863A23829O0783p29L77192B73010l1752r9436n5705g1532A15942
$$ 373646 371783 123829 184612 183883 561075 273010 241258 141822 86117 -71532 115942
10337D68385p3517A17116M77984B92119j38101K58623M6232M279K60962B92700
$$ 468385 394868 117116 595100 292119 154018 412641 458873 463152 724114 292700
10326i4691C83089F7130Q7494a21194E06352A55899a23947C34697A8497a36773
$$ -94691 383089 67130 154624 -121194 506352 155899 -123947 334697 18497 -136773
10315D1612e0024k0293l19877A63435g798k14057A91194B4309L11347r2772m3793
$$ 41612 -50024 -70317 -390194 163435 -7798 -221855 191194 24309 335656 242884 199091
10304A99091J48631D5618g1328j25304A9467a21314B21662a31204j7889J4999
$$ 199091 347722 45618 -71328 -196632 19467 -121314 221662 -131204 -149093 -134094
10294a34094M5301L7175C60953a35277B36523a3072C0569b4746C06012c01174
$$ -134094 -88793 -51618 360953 -135277 236523 -13072 30569 -24746 306012 -301174
10283I3858a44187B3999e8914J5773A11925l3725d73856a34971G1340N2919b73119
$$ 93858 -144187 23999 -58914 -43141 111925 78200 -473856 -134971 71340 124259 -273119
10271F9366b7683I3408b00364J0003g2344q5230d0076A55301a46262N0493F6721
$$ 69366 -27683 93408 -200364 -190361 -72344 -157574 -40076 155301 -146262 -95769 66721
10259c4579o9822n9067j08149g9027A20464a47468G715N9984k5137i5516j7398
$$ -34579 -104401 -163468 -271617 -79027 120464 -147468 7715 67699 42562 -95516 -112914
10248a12914B73291A34842K28266A56504a44209D25677j89094A6918a06462G31
$$ -112914 273291 134842 363108 156504 -144209 425677 236583 16918 -106462 731
10237a08154B32348A13069b31250a00930j4589a703A74442a80008m1192e8286
$$ -108154 232348 113069 -231250 -100930 -115519 -1703 174442 -180008 -221200 -58286
10226A23050b05019E7901c72838A35774a25861L7716B56839A16599I31a13699
$$ 123050 -205019 57901 -372838 135774 -125861 -88145 256839 116599 931 -113699
10215B64587a05495A19174e8358I8506b02146A7027a82883I2473b15533c1576
$$ 264587 -105495 119174 -58358 98506 -202146 17027 -182883 92473 -215533 -31576
10204b6490l4438l61774F6366A5241e819j52454R675E0109J17218J19007c65894
$$ -26490 -60928 -422702 66366 15241 -5819 -158273 -148598 50109 167327 286334 -365894
10192a31499J5697E0570B1482e87A33509L7206b41496H5230J00351a27095B66558
$$ -131499 -115802 50570 21482 -587 133509 170715 -241496 85230 185581 -127095 266558
10180C398K767a23170A13896A1537b0237k9948p5751d1814B96973c48709A02845
$$ 3398 6165 -123170 113896 11537 -20237 -50185 -125936 -41814 296973 -348709 102845
10168A42084R4595H3239e5258o0596K1099H5391a22912A44975a79730K574k0204
$$ 142084 236679 83239 -55258 -115854 -94755 85391 -122912 144975 -179730 -177156 -197360
10157a97360I40i835l42674M9790j22506h6951A41566a63443N3364A4564b68919
$$ -197360 940 -9835 -352509 -302719 -425225 -86951 141566 -163443 -110079 14564 -268919
10145A59735a49530A4175c24605c6437j35493d9363m38831a48031F2588B8625
$$ 159735 -149530 14175 -324605 -36437 -171930 -49363 -488194 -148031 62588 28625
10134a69272b4314l2299A93334B5295c7003l71865J63482i4944j45883H1041g6490
$$ -169272 -24314 -56613 193334 25295 -37003 -408868 -245386 -94944 -240827 81041 -76490
10122g7732j22538R2532M2380H4843N5568A2468c19268i465j16689o7981F4748
$$ -77732 -200270 -107738 -65358 84843 140411 12468 -319268 -9465 -126154 -194135 64748
10110a33962q1998N9490b4514k09940A84645a9225m8059k49772a26201L7508d3432
$$ -133962 -215960 -156470 -24514 -234454 184645 -19225 -67284 -317056 -126201 -88693 -43432
10098B3833a51702k8398B31779A00169a3045l01382J05602j1636i6307p6383B7196
$$ 23833 -151702 -180100 231779 100169 -13045 -314427 -208825 -220461 -96307 -172690 27196
10086b36362j21196H5994a36550e5851A49632g7476G0641Q2172M5189H1491l1181
$$ -236362 -357558 85994 -136550 -55851 149632 -77476 70641 152813 198002 81491 50310
10075E0310M7865a06716m355B0421J06208b56119J15174c1196A59701a76843h4630
$$ 50310 98175 -106716 -111071 20421 126629 -256119 -140945 -31196 159701 -176843 -84630
10063A5852e4402G746d7476A07930a68648j3731C51651c10653f3229j19570o4314
$$ 15852 -54402 7746 -47476 107930 -168648 -182379 351651 -310653 -63229 -182799 -247113
10052b47113i6283C4679K13951c74889J35546P6367E102J56260b58126D7044O1880
$$ -247113 -96283 34679 248630 -374889 -239343 -162976 5102 161362 -258126 47044 108924
10041A08924a6191m41240C2006h2975l6863C5599M6152b47039G0742f1182A87362
$$ 108924 -16191 -457431 32006 -82975 -119838 35599 81751 -247039 70742 -61182 187362
10029a01160J5002p3427A8408a9436j69833j4325J9166q3045A17617a3667k17631
$$ -101160 -86158 -159585 18408 -19436 -189269 -203594 -184428 -267473 117617 -13667 -231298
10018b31298k1236L9307Q1499d7390j29336N9966A8145a85317C48365I9953b4484
$$ -231298 -252534 -213227 -131728 -47390 -176726 -116760 18145 -185317 348365 99953 -24484
10006g3940b1948j67372c6390D1697B238a1870F4769Q2540M8697E6916j490b462
$$ -73940 -21948 -189320 -36390 41697 2238 -11870 64769 147309 196006 56916 55426 -2462
9993I9365h8491A1469a94730n5271C19812a09620l02354R0254d1029N799j01396
$$ 99365 -88491 11469 -194730 -250001 319812 -109620 -411974 -321720 -41029 -35230 -136626
9982a36626k6092A86624b00668o232h9448A73911k1921m2511Q80e5237k8780j65267
$$ -136626 -162718 186624 -200668 -206900 -89448 173911 151990 109479 110359 -55237 -84017 -249284
9970b49284n1246i9469l6495D24396i3982A41308m6953b12094B03214a63620c912
$$ -249284 -300530 -99469 -135964 424396 -93982 141308 94355 -212094 203214 -163620 -3912
9958c29019D9250c6041k1694B7647R1737B8088a83622F0243a38085k63868E4242
$$ -329019 49250 -36041 -57735 27647 119384 28088 -183622 60243 -138085 -401953 54242
9946a3363A48616E3345a15679j44618G498J41649L47242A71992O9998E1171a89911
$$ -13363 148616 53345 -115679 -260297 7498 149147 496389 171992 241990 51171 -189911
9934A72750E993K2630b40733A77220c57914M9773F5454L2984a13977Q285A12677
$$ 172750 5993 28623 -240733 177220 -357914 -308141 65454 98438 -113977 -105692 112677
9922A23092a62405m0318K2333O5897d8480j82322P0878f8853D4843c4053j20534
$$ 123092 -162405 -202723 -180390 -114493 -48480 -230802 -159924 -68853 44843 -34053 -154587
9911a54587M6449c2580k07962d630n8551B22321a89297D3787f1229j14796j12816
$$ -154587 -108138 -32580 -240542 -4630 -63181 222321 -189297 43787 -61229 -176025 -288841
9900b88841A39725h6464l2862j3701e902j6995A43431o5344d2390A7871c22799
$$ -288841 139725 -86464 -119326 -133027 -5902 -22897 143431 78087 -42390 17871 -322799
9888D3477M8585b52116J5900B43252c5816l3199j08107B93707H963c8910k78130
$$ 43477 92062 -252116 -236216 243252 -35816 -69015 -177122 293707 8963 -38910 -317040
9877c17040A217K7854J28841B9761J21783f3355A71103a51708m66270i5542L557
$$ -317040 1217 29071 157912 29761 151544 -63355 171103 -151708 -617978 -95542 -91985
9866i1985k85263K5594c9680C1706b66828i5257j24307P6854c226A49003J89965
$$ -91985 -377248 -351654 -39680 31706 -266828 -95257 -219564 -142710 -3226 149003 338968
9855C38968E481e1700r8820b8672A14354b15459j2647I1543L4008c8491n7818
$$ 338968 5481 -51700 -150520 -28672 114354 -215459 -228106 91543 125551 -38491 -96309
9844i6309A02778b09524N7831l65927B58976a29131n3050d6708q8400H9383B357
$$ -96309 102778 -209524 -151693 -517620 258976 -129131 -182181 -46708 -135108 89383 2357
9832c73113A06892b77073e2334C32640f9383r7277a4259E1253O6155g6509C4229
$$ -373113 106892 -277073 -52334 332640 -69383 -166660 -14259 51253 117408 -76509 34229
9820E6578Q612b29137O1083B56974j25998b27765J02603G3280N6410i4402m49308
$$ 56578 65190 -229137 -168054 256974 130976 -227765 -125162 73280 129690 -94402 -543710
9809e43710e0778b3183k25715R7315A98622e2891B84642j07663a07013f558l5927
$$ -543710 -50778 -23183 -248898 -151583 198622 -52891 284642 176979 -107013 -6558 -42485
9798d2485O372n7530A1785a54525j71922I8457a9379k56055f1306o487n8689N4218
$$ -42485 -36113 -93643 11785 -154525 -326447 98457 -19379 -275434 -61306 -67793 -126482 -72264
9786g2264A17531h8910j7977r0279f8599A84131k7192f8232j18738A71772i475
$$ -72264 117531 -88910 -106887 -197166 -68599 184131 156939 -68232 -186970 171772 -9475
9774b55321G2082N893b65602E7279d99406a49291p6511j2975a13388m55517A45524
$$ -255321 72082 77975 -265602 57279 -499406 -149291 -225802 -238777 -113388 -568905 145524
9762a87803A90727d3435l96885b9217G9059b01636O9372A96760a50380A05678
$$ -187803 190727 -43435 -440320 -29217 79059 -201636 -132264 196760 -150380 105678
9751H2199a99860A308b73375J6512A16535g6505C00449c942f04B0062Q9495a22507
$$ 82199 -199860 1308 -273375 -256863 116535 -76505 300449 -3942 -604 20062 109557 -122507
9738a8857p8203o725k6118m8600j46652e1196E7827c88339A99465l542n1123g8758
$$ -18857 -97060 -103785 -129903 -178503 -325155 -51196 57827 -388339 199465 195923 144800 -78758
9725D394a47416M2923j32202A38206i5002G692c48997I6233C1592J71196a81998
$$ 4394 -147416 -104493 -236695 138206 -95002 7692 -348997 96233 31592 202788 -181998
9713a99597f2105A44838a95728B23163J24844f5250q5282G9685c62801A989K51033
$$ -199597 -62105 144838 -195728 223163 348007 -65250 -150532 79685 -362801 1989 253022
9702B53022f9731l0555A54806c29268L2978a25749c7904a3273o526j85600D6898
$$ 253022 -69731 -100286 154806 -329268 -296290 -125749 -37904 -13273 -19799 -205399 46898
9690C7688J15130b15407R4451m751j51158M2457A01944c2031l54964C8665K891
$$ 37688 152818 -215407 -120956 -125707 -276865 -234408 101944 -32031 -386995 38665 41556
9679D1556J46146g9868k06306M3233a13530k92609g0484A61217D4522M4057a02785
$$ 41556 187702 -79868 -286174 -242941 -113530 -406139 -70484 161217 44522 88579 -102785
9667A18425B1217O0409e65k52033b6132I0552b39260B4880b41195A03102a77497
$$ 118425 21217 81626 -565 -252598 -26132 90552 -239260 24880 -241195 103102 -177497
9655A91075c51073a65519K7433r3054B02855e5636o6240A06621m6720J43248o6460
$$ 191075 -351073 -165519 -138086 -231140 202855 -55636 -121876 106621 59901 203149 136689
9644A36689a67320L3381c4026j91490h4346B5264a1878k55752B56301I6945d9759
$$ 136689 -167320 -133939 -34026 -225516 -84346 25264 -11878 -267630 256301 96945 -49759
9632d2501A09967b74915B0474a51237I7288J8550h5693K8044j51706Q1862L1077
$$ -42501 109967 -274915 20474 -151237 97288 115838 -85693 -57649 -209355 -127493 -96416
9621i6416B25617a95873m2555i1290J5303A82450b29476c1397C1775a12614B62160
$$ -96416 225617 -195873 -238428 -91290 -75987 182450 -229476 -31397 31775 -112614 262160
9609a00259d6309k3266l6337B41431F804f282p2811P768H0317a45640J3823c5052
$$ -100259 -46309 -69575 -105912 241431 6804 -6282 -79093 -71325 80317 -145640 -131817 -35052
9596d34153B3061a8063j37745F2113C0071L75535B5829a71089j24478J6933c9701
$$ -434153 23061 -18063 -155808 62113 30071 405606 25829 -171089 -295567 -278634 -39701
9584F9342a78986G3917C6288a53245L3012c0572A75338a01109H010a85763O8609
$$ 69342 -178986 73917 36288 -153245 -120233 -30572 175338 -101109 8010 -185763 -117154
9573a17154A25036e1061M799j8419K6910A15674a91693d9085C1064K25184b00667
$$ -117154 125036 -51061 -46262 -64681 -37771 115674 -191693 -49085 31064 256248 -200667
9561A03374b66952a07229e379q4473L5870j64179L3725h6549A02024M2698E8215
$$ 103374 -266952 -107229 -5379 -89852 -53982 -218161 -184436 -86549 102024 144722 58215
9549b08076a01919D0261b990A37207m4359b06509j12491A45938c24929d3904k02465
$$ -208076 -101919 40261 -2990 137207 92848 -206509 -319000 145938 -324929 -43904 -246369
9538b46369a4482j70413n8837A48764b38926i9784C04173F8719O7222b9791k98951
$$ -246369 -14482 -184895 -243732 148764 -238926 -99784 304173 68719 135941 -29791 -328742
9527c28742A952L1095m127g5629A34244g0689C80709j06452g6413B87312G8996
$$ -328742 1952 33047 28920 -75629 134244 -70689 380709 274257 -76413 287312 78996
9515b66682P3830G7016a12569A0352a67936d6681d725k0336F3756J46108g905
$$ -266682 -192852 77016 -112569 10352 -167936 -46681 -4725 -25061 63756 209864 -7905
9503f0699l6545l92398A82869p7318a66954g7777k12268A26264c35400e7769k74133
$$ -60699 -97244 -489642 182869 105551 -166954 -77777 -290045 126264 -335400 -57769 -331902
9492c31902I5103c67993a11929p8622J5945j587A0858a07600F3498i7936n5697
$$ -331902 95103 -367993 -111929 -190551 -174606 -176193 10858 -107600 63498 -97936 -153633
9481a53633j10498J30970A01377K61963F7818b18974F1291a08357a4493F0132
$$ -153633 -264131 -133161 101377 363340 67818 -218974 61291 -108357 -14493 60132
9470A65817b49800r9894A09802n2319d74543B1296J43273b72503b3855p7750o5002
$$ 165817 -249800 -349694 109802 57483 -474543 21296 164569 -272503 -23855 -101605 -166607
9459a66607j17575C8130a02093K2964p2478K4709a7661k39728J22306H6585b59038
$$ -166607 -284182 38130 -102093 -79129 -151607 -126898 -17661 -257389 -135083 86585 -259038
9447a46155B4931a51615A51321c6932k46512G4410P5615K50186a46397J8619a0683
$$ -146155 24931 -151615 151321 -36932 -283444 74410 150025 400211 -146397 -127778 -10683
9435A5894a25356B69976a28920m480B49237a6048l26336a46533p0756j1547a08284
$$ 15894 -125356 269976 -128920 -133400 249237 -16048 -342384 -146533 -217289 -228836 -108284
9423a53927K1861a1056m2896p0727K3015a0107B5152J39375b18630m9906i5858
$$ -153927 -132066 -11056 -53952 -124679 -101664 -10107 25152 164527 -218630 -268536 -95858
9411a23892l54248A97099J44890a31916C55600a8041G6478c5447E500J52302G7679
$$ -123892 -478140 197099 341989 -131916 355600 -18041 76478 -35447 5500 157802 77679
9399f7776n9898l5600K4722A1273e6115C4430O7492O7750J33804m7536c27835
$$ -67776 -127674 -163274 -138552 11273 -56115 34430 101922 169672 303476 255940 -327835
9387a052l64156a59010Q598A56567a77134Q4571H7720c7090J7437k21616B42390
$$ -1052 -365208 -159010 -150412 156567 -177134 -92563 87720 -37090 -19653 -241269 242390
9375a04356B0038n523L8279a29454f2472B5083J52295A5962c92247A8208d33983
$$ -104356 20038 14515 52794 -129454 -62472 25083 177378 15962 -392247 18208 -433983
9363b21100e4269p1035p6179b2598j1654l24680A21802E9536R7620G567K3474
$$ -221100 -54269 -125304 -201483 -22598 -34252 -358932 121802 59536 157156 7567 31041
9352C1041c5823k77953P2055G608c66612a75355L8144O755j04567A70045b79058
$$ 31041 -35823 -313776 -241721 7608 -366612 -175355 -137211 -130456 -235023 170045 -279058
9340a3886q2989j7385c882C93811b53498a17559A29888h8900A0213K3331a52738
$$ -13886 -96875 -114260 -3882 393811 -253498 -117559 129888 -88900 10213 33544 -152738
9328g5966k51303D6938d25458a1457p0445p9409j84509J22228k8692e2407A28282
$$ -75966 -327269 46938 -425458 -11457 -81902 -161311 -345820 -223592 -252284 -52407 128282
9316h637A49904g8543K0495f557j18167E4714J2635c20429I5182i99q5508m1092
$$ -8637 149904 -78543 -58048 -6557 -124724 54714 67349 -320429 95182 -999 -86507 -127599
9304a27599c2807B11176G5424e1137k26353J09471M0083A6674P2105a20919p3325
$$ -127599 -32807 211176 75424 -51137 -277490 -168019 -127936 16674 88779 -120919 -194244
9293a94244A18982j9064c5883k8341k12639f38F9508C4678D410Q2413b32295J14206
$$ -194244 118982 99918 -35883 -64224 -276863 -638 69508 34678 4410 86823 -232295 -118089
9281a18089k3574b7966l75968E1452c9164j55972c5398B57786b2003l90662A9430
$$ -118089 -141663 -27966 -403934 51452 -39164 -195136 -35398 257786 -22003 -412665 19430
9269c61652J18713C4669d68986A33933K03402a21053I4321g8650D20691d4655
$$ -361652 -242939 34669 -468986 133933 337335 -121053 94321 -78650 420691 -44655
9258A39368b24957A07353c07402h1085k2652k42074a33752F4733J90863b4328
$$ 139368 -224957 107353 -307402 -81085 -103737 -345811 -133752 64733 255596 -24328
9247C6359N5627b4553A46177a54607A38977a15951c3750k5215A70753e4491j0543
$$ 36359 91986 -24553 146177 -154607 138977 -115951 -33750 -58965 170753 -54491 -65034
9236f5034d260k0784A14987a74255E3529K4375b29285e2216B1546e9480p4312
$$ -65034 -4260 -25044 114987 -174255 53529 77904 -229285 -52216 21546 -59480 -133792
9225a33792c896l79417A04383K62712a28595K2962F936b56405K2905O0849A12403
$$ -133792 -3896 -383313 104383 367095 -128595 -105633 6936 -256405 -233500 -172651 112403
9213A9568J07423N9164b86584J39951J6963R535B6475K0742a82455k99328A54524
$$ 19568 126991 186155 -286584 -146633 -129670 -120135 26475 47217 -182455 -481783 154524
9201F2205b4671o5836J5958j18420A25245d1555l6811l00560B58599b32361g0338
$$ 62205 -24671 -90507 -74549 -192969 125245 -41555 -78366 -378926 258599 -232361 -70338
9189c68144a34779L384B63591A4706L07072a43348k95601i3480C0734b77926a33658
$$ -368144 -134779 -131395 263591 14706 321778 -143348 -438949 -93480 30734 -277926 -133658
9177c39670J05546J9339C02710l5167I0924K0449C2263J20961J3939b72907I395
$$ -339670 -234124 -214785 302710 267543 90924 111373 32263 153224 167163 -272907 9395
9165c1419p3787k93750Q5397d1948A44403a90206f4046l08648a33255N5496L467
$$ -31419 -105206 -398956 -313559 -41948 144403 -190206 -64046 -372694 -133255 -77759 -74292
9154g4292D7281b63156a20382J8587j42738I677L6790a44578d9216h142r1707
$$ -74292 47281 -263156 -120382 -101795 -244533 9677 46467 -144578 -49216 -8142 -99849
9143i9849j19424p904k09760I0945f6400C3806d871B84173c95164a57346e6853
$$ -99849 -219273 -227177 -436937 90945 -66400 33806 -4871 284173 -395164 -157346 -56853
9131b95625J4429D3729E573P7047L25476b40231e2959l25747J05166B11943e8318
$$ -295625 -281196 43729 5573 82620 408096 -240231 -52959 -378706 -273540 211943 -58318
9119a0648A42116a56832C3692a74139C92334A1252f07833F6038a14673N252n7252
$$ -10648 142116 -156832 33692 -174139 392334 11252 -607833 66038 -114673 -109421 -166673
9108a66673P7964n9826C08250a0580A31163J020F5814b27517I0456K950b86709
$$ -166673 -88709 -148535 308250 -10580 131163 132183 65814 -227517 90456 93406 -286709
9096c11160a42238r2441a414k9411n7746r6171A86490b01359O147j43379b856
$$ -311160 -142238 -234679 -1414 -30825 -88571 -184742 186490 -201359 -195212 -338591 -2856
9084I2453a15066d8562I3113c5845A45744b02803R6725J9729r7037A00106a55705
$$ 92453 -115066 -48562 93113 -35845 145744 -202803 -106078 -86349 -183386 100106 -155705
9072a59190o0699f0065l76511a5947A26241a44456E6392J36241J0838i3986m5378
$$ -159190 -219889 -60065 -436576 -15947 126241 -144456 56392 192633 203471 -93986 -139364
9061a39364c4422B9522J76212C1719M04125c94005a5169j63186A63552b7889J3044
$$ -139364 -34422 29522 205734 31719 435844 -394005 -15169 -178355 163552 -27889 -14845
9050a4845m2647B08343G1442O2701b10781O5943p5987R0553A36841c89887J49220
$$ -14845 -57492 208343 71442 134143 -210781 -144838 -220825 -130272 136841 -389887 -240667
9039b40667A71327b1327B84056a50977C4321A0019d11589C68065a69896f4980
$$ -240667 171327 -21327 284056 -150977 34321 10019 -411589 368065 -169896 -64980
9028i3889c1036r0895d2575j63500j31879h1344P115A60328d49532a72119k31873
$$ -93889 -31036 -121931 -42575 -206075 -337954 -81344 -74229 160328 -449532 -172119 -403992
9017d03992b4584j34963D4153O0727d810D1158b43224A30133b37277I4021a77007
$$ -403992 -24584 -159547 44153 104880 -4810 41158 -243224 130133 -237277 94021 -177007
9005d5648D8011m126b27026I8055b34262h4747c4105l10720h1296B05504i6738
$$ -45648 48011 43885 -227026 98055 -234262 -84747 -34105 -344825 -81296 205504 -96738
8993a04781A54906b6441j28712J9672B08263a53434M4461p0991b1828k90711a05864
$$ -104781 154906 -26441 -155153 -135481 208263 -153434 -108973 -179964 -21828 -312539 -105864
8981b50093J02041M600r5865a0795j85102F905e5641A21339d9908K0378j70529
$$ -250093 -148052 -143452 -239317 -10795 -195897 6905 -55641 121339 -49908 -29530 -200059
8970b00059A946L2862d61128I024R4454e0809G6528a83391L7019A40605F3084
$$ -200059 1946 34808 -461128 9024 103478 -50809 76528 -183391 -146372 140605 63084
8958A4590c53634c8872m8540I6215g5639p9471D298J47333A5543L5509i4868C2043
$$ 14590 -353634 -38872 -87412 96215 -75639 -155110 4298 151631 15543 51052 -94868 32043
8945B94103B6116b03608C17542i2683P043A92397D7524a65848j22740a09029A86803
$$ 294103 26116 -203608 317542 -92683 -85640 192397 47524 -165848 -288588 -109029 186803
8933B4851J52111a22637B08013c48086A76538b52266J10474B48647I0129a96103
$$ 24851 176962 -122637 208013 -348086 176538 -252266 -141792 248647 90129 -196103
8922G4480g3284H8150K3512B9307a73976A15915K06699b04411I9135P8330F9379
$$ 74480 -73284 88150 111662 29307 -173976 115915 322614 -204411 99135 177465 69379
8910C36584L76430K70912N15056J923935M075441k816931k061800q24852q06971
$$ 336584 713014 983926 1498982 3422917 7498358 4681427 2619627 1794775 987804
8901I87804D37001p3022M5244j54821l1484g3174B90969P7307G8500a10355b2778
$$ 987804 437001 363979 409223 254402 222918 -73174 290969 368276 78500 -110355 -22778
8889D48990a08965j30654G8703a07079e261k58351A19698a03885a385l05984A76782
$$ 448990 -108965 -239619 78703 -107079 -5261 -263612 119698 -103885 -1385 -307369 176782
8877b17078A16828J0241b18005d1770j1154a6351E3250c06747j07341G3843J22582
$$ -217078 116828 127069 -218005 -41770 -52924 -16351 53250 -306747 -414088 73843 196425
8866A96425a01847E1011L0100a25236j28877g2208D6192d2920j02305L9430C8981
$$ 196425 -101847 51011 81111 -125236 -254113 -72208 46192 -42920 -145225 -105795 38981
8854F0212O060J39463a82895j85971a05008K1490A22328f6231k1015L033A47487
$$ 60212 66272 205735 -182895 -368866 -105008 -83518 122328 -66231 -87246 -84213 147487
8842d1288A00280j3016c51087a60324b6115C86136C2347c9023k65971B89326H4646
$$ -41288 100280 87264 -351087 -160324 -26115 386136 32347 -39023 -304994 289326 84646
8830a67627A3366J59741b76705L0265Q5308A22005O1915J45797i5350B1400a6447
$$ -167627 13366 173107 -276705 -246440 -161132 122005 183920 329717 -95350 21400 -16447
$$ [...]
##END NTUPLES=NMR SPECTRUM
##END=
