
##TITLE=AC1038_TOCA01_5867811_QMO5yyarsU
##JCAMPDX= 6.0         $$ Bruker NMR JCAMP-DX V2.0
##DATA TYPE= NMR SPECTRUM
##DATA CLASS= NTUPLES
##ORIGIN= BRUKER
##OWNER= Administrator
$$ 1.72 TOPSPIN		Version 2.1
$$ 2012-03-30 22:37:20.109 -0500  Administrator@TOPSPIN
$$ Compression mode = diff/dup
##.OBSERVE FREQUENCY= 400.13188235
##.OBSERVE NUCLEUS= ^1H
##.ACQUISITION MODE= SIMULTANEOUS (DQD)
##.ACQUISITION SCHEME= undefined
##.AVERAGES= 64
##.DIGITISER RES= 22
##SPECTROMETER/DATA SYSTEM= spect
##.PULSE SEQUENCE= noesygpps1d.comp
##.SOLVENT NAME= COFFEE_meoh
##.SHIFT REFERENCE= INTERNAL, COFFEE_meoh, 1, 14.96664
##AUDIT TRAIL= $$ (NUMBER, WHEN, WHO, WHERE, PROCESS, VERSION, WHAT)
$$ ##TITLE= Audit trail, TOPSPIN		Version 2.1
$$ ##JCAMPDX= 5.01
$$ ##ORIGIN= Bruker BioSpin GmbH
$$ ##OWNER= Administrator
$$ $$ C:\Bruker\TOPSPIN/data/COFFEE/nmr/AC1038_TOCA01_5867811_QMO5yyarsU/12/pdata/1/auditp.txt
$$ ##AUDIT TRAIL=  $$ (NUMBER, WHEN, WHO, WHERE, PROCESS, VERSION, WHAT)
(   1,<2012-03-30 22:37:15.421 -0500>,<Administrator>,<TOPSPIN>,<go>,<TOPSPIN 2.1>,
      <created by zg
	started at 2012-03-30 22:25:43.796 -0500,
	POWCHK enabled, PULCHK disabled,
       configuration hash MD5:
       1A 1E CE 29 27 FD 77 03 67 4E F0 E3 C4 B2 CB 90
       data hash MD5: 64K
       E1 C8 5A 78 FF 8C CA E9 94 0E 0B 2D D6 3D 0E 3B>)
(   2,<2012-03-30 22:37:18.203 -0500>,<Administrator>,<TOPSPIN>,<proc1d>,<TOPSPIN 2.1>,
      <Start of raw data processing
       efp LB = 0.3 FT_mod = 6 PKNL = 1 PHC0 = 0 PHC1 = 0 SI = 128K 
       data hash MD5: 128K
       B3 A9 12 9C 71 24 BA 71 6D DD BE 86 4C A2 54 25>)
(   3,<2012-03-30 22:37:19.375 -0500>,<Administrator>,<TOPSPIN>,<proc1d>,<TOPSPIN 2.1>,
      <pk PHC0 = 33.09631 PHC1 = 0 
       data hash MD5: 128K
       2B 05 77 0B 6B 75 E9 2F DA B5 5B 1C 8A FC DF DD>)
(   4,<2012-03-30 22:37:19.609 -0500>,<Administrator>,<TOPSPIN>,<proc1d>,<TOPSPIN 2.1>,
      <abs ABSG = 1 
       data hash MD5: 128K
       AE 8C 5D 9B 9D 1E 6A F6 FF AB FA 6A 52 4F E6 83>)
(   5,<2012-03-30 22:37:19.671 -0500>,<Administrator>,<TOPSPIN>,<proc1d>,<TOPSPIN 2.1>,
      <abs ABSG = 2 
       data hash MD5: 128K
       A2 21 1B EA 4C 13 18 E0 67 2A AC 2A 64 79 E7 24>)
(   6,<2012-03-30 22:37:19.734 -0500>,<Administrator>,<TOPSPIN>,<proc1d>,<TOPSPIN 2.1>,
      <abs ABSG = 3 
       data hash MD5: 128K
       B5 00 20 D2 6D 44 8F BD 57 2F F9 45 10 15 A2 47>)
(   7,<2012-03-30 22:37:19.968 -0500>,<Administrator>,<TOPSPIN>,<proc1d>,<TOPSPIN 2.1>,
      <abs ABSG = 4 
       data hash MD5: 128K
       01 CB 67 32 9E CB 7A F9 59 0F 5E 1D 64 33 8A 6D>)
(   8,<2012-03-30 22:37:20.015 -0500>,<Administrator>,<TOPSPIN>,<proc1d>,<TOPSPIN 2.1>,
      <abs ABSG = 5 
       data hash MD5: 128K
       07 EC 67 3E 59 82 C2 A5 24 F0 42 51 E7 A8 D8 E4>)
$$ ##END=
$$ 
$$ $$ hash MD5
$$ $$ 8F 90 A8 CD F9 A5 C1 50 84 C6 A9 28 33 FE 31 53
##$RELAX= 
##$RELAX= 
##$RELAX= 
##$RELAX= 
##$RELAX= 
##$RELAX= 
##$RELAX= 
##$RELAX= 
$$ Bruker specific parameters
$$ [...]
##$TP07= 0
##$TPNAME0= <>
##$TPNAME1= <>
##$TPNAME2= <>
##$TPNAME3= <>
##$TPNAME4= <>
##$TPNAME5= <>
##$TPNAME6= <>
##$TPNAME7= <>
##$TPOAL= (0..7)
0.5 0.5 0.5 0.5 0.5 0.5 0.5 0.5
##$TPOFFS= (0..7)
0 0 0 0 0 0 0 0
##$TUNHIN= 0
##$TUNHOUT= 0
##$TUNXOUT= 0
##$USERA1= <user>
##$USERA2= <user>
##$USERA3= <user>
##$USERA4= <user>
##$USERA5= <user>
##$V9= 5
##$VALIST= <valist>
##$VCLIST= <CCCCCCCCCCCCCCC>
##$VD= 0
##$VDLIST= <DDDDDDDDDDDDDDD>
##$VPLIST= <PPPPPPPPPPPPPPP>
##$VTLIST= <TTTTTTTTTTTTTTT>
##$WBST= 2048
##$WBSW= 25
##$XGAIN= (0..3)
0 0 0 0
##$XL= 0
##$YL= 0
##$YMAX_a= 9592049
##$YMIN_a= -5439829
##$ZGOPTNS= <>
##$ZL1= 120
##$ZL2= 120
##$ZL3= 120
##$ZL4= 120
##$ABSF1= 14.96664
##$ABSF2= -5.58589
##$ABSG= 5
##$ABSL= 3
##$ALPHA= 0
##$AQORDER= 0
##$ASSFAC= 0
##$ASSFACI= 0
##$ASSFACX= 0
##$ASSWID= 0
##$AUNMP= <proc_prof1d_extract.lims>
##$AXLEFT= 0
##$AXNAME= <>
##$AXNUC= <1H>
##$AXRIGHT= 0
##$AXTYPE= 0
##$AXUNIT= <>
##$AZFE= 0.1
##$AZFW= 0.1
##$BCFW= 0
##$BC_mod= 0
##$BYTORDP= 0
##$COROFFS= 0
##$CY= 15
##$DATMOD= 1
##$DC= 0
##$DFILT= <>
##$DTYPP= 0
##$F1P= 0
##$F2P= 0
##$FCOR= 0.5
##$FTSIZE= 131072
##$FT_mod= 6
##$GAMMA= 0
##$GB= 0
##$INTBC= 1
##$INTSCL= 1
##$ISEN= 128
##$LB= 0.3
##$LEV0= 0
##$LPBIN= 0
##$MAXI= 10000
##$MC2= 0
##$MEAN= 0
##$ME_mod= 0
##$MI= 0
##$NCOEF= 0
##$NC_proc= -3
##$NLEV= 6
##$NOISF1= 0
##$NOISF2= 0
##$NSP= 0
##$NTH_PI= 0
##$NZP= 0
##$OFFSET= 14.96664
##$PC= 1
##$PHC0= 33.09631
##$PHC1= 0
##$PH_mod= 1
##$PKNL= yes
##$PPARMOD= 0
##$PPDIAG= 0
##$PPIPTYP= 0
##$PPMPNUM= 2147483647
##$PPRESOL= 1
##$PSCAL= 4
##$PSIGN= 0
##$PYNMP= <proc.py>
##$REVERSE= no
##$SF= 400.130005589036
##$SI= 131072
##$SIGF1= 0
##$SIGF2= 0
##$SINO= 400
##$SIOLD= 131072
##$SPECTYP= <>
##$SREGLST= <1H.CDCl3>
##$SSB= 0
##$STSI= 131072
##$STSR= 0
##$SW_p= 8223.68421052632
##$SYMM= 0
##$S_DEV= 0
##$TDeff= 65536
##$TDoff= 0
##$TI= <>
##$TILT= no
##$TM1= 0
##$TM2= 0
##$TOPLEV= 0
##$USERP1= <user>
##$USERP2= <user>
##$USERP3= <user>
##$USERP4= <user>
##$USERP5= <user>
##$WDW= 1
##$XDIM= 131072
##$YMAX_p= 403293908
##$YMIN_p= -141840421
##$CURPLOT= <Network HP LaserJet P1505>
##$CURPRIN= <$Network HP LaserJet P1505>
##$DFORMAT= <normdp>
##$LAYOUT= <+/1D_H.xwp>
##$LFORMAT= <normlp>
##$PFORMAT= <normpl>
##$SURQMSG= 1
$$ End of Bruker specific parameters
$$ ---------------------------------
##NTUPLES= NMR SPECTRUM
##VAR_NAME=  FREQUENCY,     SPECTRUM/REAL,   SPECTRUM/IMAG
##SYMBOL=    X,             R,               I
##VAR_TYPE=  INDEPENDENT,   DEPENDENT,       DEPENDENT
##VAR_FORM=  AFFN,          ASDF,            ASDF
##VAR_DIM=   131072,        131072,          131072
##UNITS=     HZ,            ARBITRARY UNITS, ARBITRARY UNITS
##FACTOR=    0.0627417313425165, 1,          1
##FIRST=     8223.62146879498, 6393,         -99954
##LAST=      0,             9572,            -99674
##MIN=       0,             -141840421,      0
##MAX=       8223.62146879498, 403293908,    0
$$ Real data points
##PAGE= N=1
##DATA TABLE= (X++(R..R)), XYDATA
$$ [...]
63790I28484j3660j3325j3749j5116j6121j6456j7393j9475k1363k1875k1749
63779G38202k2304k3350k3638k2725k1398k0473k0069j9818j9219j7928j6178
63768E11102j4785j4342j4629j5022j5077j4447j2835j0528q506p443p049o837
63756C69602p015p802q402p629n490l289k124j995k345k770l079l288l664m180
63742C06530m030k475k52Q39P1j281j712j401j588k529l034k038P3J914K479J802
63726B93368M50j241l169m864n443m544k950j686q54m9L62m47k054k704j492L97
63710B63080J360J344J112N23j023k934l784l280k519k121j448j52Q76Q83O09
63695B52526J156K169K203P93q73j374m78J038K291K756K307J340P10R82J703
$$ plain form
63790 928484 914824 901499 887750 872634 856513 840057 822664 803189 781826 759951 738202
63779 738202 715898 692548 668910 646185 624787 604314 584245 564427 545208 527280 511102
63768 511102 496317 481975 467346 452324 437247 422800 409965 399437 390931 383488 376439 369602
63756 369602 362587 354785 346383 338754 333264 329975 327851 325856 323511 320741 317662 314374 310710 306530
63742 306530 302500 300025 299773 300612 300683 299402 297690 296289 294701 292172 289138 287100 287173 289087 291566 293368
63726 293368 293818 292577 289408 284544 279101 274557 271607 269921 269067 269018 269380 268933 266879 264175 262683 263080
63710 263080 264440 265784 266896 267419 266396 263462 259678 256398 253879 251758 250310 250158 251034 251917 252526
63695 252526 253682 255851 258054 258847 257974 256600 256122 257160 259451 262207 264514 265854 266564 267546 269249
63680B69249J874J340J281K783N148O443N721M048K994K912L199L462L588L195
63666C17237K076J009J103K384L892N092O221P195P256O089M431L215K794L090
63652C73084L710L689K133n17k734l724m012l926k954j303n84j719l346l705l073
63637C51019k713k291m32K540M510M453L572L075K623J691J038J591K857L536
63623C77069L184K530K525L571N126N742M305J680K96J364L334L968L047J975
63609D19716J440J017P36J392K862L556K320N0j457j626j317j310j525j737k159
63594D21958l001l966m530m493l889k811j616r62j016q76M46K466L549L097K511
63579D06867L389N523P542Q832R715J0167R786R043R197J0538J1828J2103J2029
$$ plain form
63680 269249 271123 272463 273744 276527 281675 288118 293839 297887 300881 303793 306992 310454 314042 317237
63666 317237 319313 320322 321425 323809 327701 332793 339014 346209 353465 359554 363985 367200 369994 373084
63652 373084 376794 380483 382616 382099 379365 375641 371629 367703 364749 363446 362862 361143 357797 354092 351019
63637 351019 348306 346015 345583 348123 352633 357086 360658 363733 366356 368047 369085 370676 373533 377069
63623 377069 380253 382783 385308 388879 394005 399747 404052 405732 406028 407392 410726 414694 417741 419716
63609 419716 421156 422173 422909 424301 427163 430719 433039 433089 431632 430006 428689 427379 425854 424117 421958
63594 421958 418957 414991 410461 405968 402079 399268 397652 396690 395674 394798 395244 397710 401259 404356 406867
63579 406867 410256 415779 423321 432153 441868 452035 461821 470864 480061 490599 502427 514530 526559
63566E26559J2759J4258J5692J6852J8287K0257K2462K4720K7200K9916L2440
63555G61402L4281L5412L6527L8752M2592M7032N0310N1957N3259N5157N6482
63544A263163N5271N1235M5734L9628L2511K4165J5559P981J948k748o555j0037
63532A517855j3439j6211j7750j8825k1366k6329l2469l7716m0972m2082m1062
63521A209634l8453l5780l4450l4239l3719l2082k9721k7170k4401k1302j7999
63510H80318j4446j0356n868j728J408L487M732N410O157P880J0929J4729J8499
63497I21151K1942K5059K7878L0728L4099L7803M0913M3148M5673M9663N4493
63486A332550N8346O0146N9830N7020N0896M1733L1360K1578J2914N299j094o261
$$ plain form
63566 526559 539318 553576 569268 586120 604407 624664 647126 671846 699046 728962 761402
63555 761402 795683 831095 867622 906374 948966 995998 1046308 1098265 1151524 1206681 1263163
63544 1263163 1318434 1369669 1415403 1455031 1487542 1511707 1527266 1535247 1537195 1534447 1527892 1517855
63532 1517855 1504416 1488205 1470455 1451630 1430264 1403935 1371466 1333750 1292778 1250696 1209634
63521 1209634 1171181 1135401 1100951 1066712 1032993 1000911 971190 944020 919619 898317 880318
63510 880318 865872 855516 849648 847920 849328 852815 857547 862957 869114 876994 887923 902652 921151
63497 921151 943093 968152 996030 1026758 1060857 1098660 1139573 1182721 1228394 1278057 1332550
63486 1332550 1390896 1451042 1510872 1567892 1618788 1660521 1691881 1713459 1726373 1731672 1730578 1724317
63474A724317j0683j4512j7146j8358j9157k0788k3595k7539l2887l9219m4628
63463A455805m7435m8403m9759n2151n4025n4008n2422n0095m7225m4024m1240
63452I15018l9151l7015l4317l1792l0331k9497k7946k4994k1151j7568j5337
63441F05919j4803j4996j4318j2249r903q484p988p874q036q185p257m742k054
63428D85030j161j999k523j369O83K140K580K523K371K138J884J842K176K708
63414D99023K972K653J992J449R06j73j555k050j220m52j282l219m440m312l856
63399D86436l740l263j642P86L141M975O213O882P244P615P872P772P791Q822
63385E46904J0902J3119J4999J7036J9577K2112K4191K6087K8104L0060L1937
$$ plain form
63474 1724317 1713634 1699122 1681976 1663618 1644461 1623673 1600078 1572539 1539652 1500433 1455805
63463 1455805 1408370 1359967 1310208 1258057 1204032 1150024 1097602 1047507 1000282 956258 915018
63452 915018 875867 838852 804535 772743 742412 712915 684969 659975 638824 621256 605919
63441 605919 591116 576120 561802 549553 539650 531166 523178 515304 507268 499083 491826 487084 485030
63428 485030 483869 481870 479347 477978 478661 480801 483381 485904 488275 490413 492297 494139 496315 499023
63414 499023 501995 504648 506640 508089 508995 508822 507267 505217 503997 503545 502263 499044 494604 490292 486436
63399 486436 482696 479433 477791 478577 481718 486693 492906 499788 507032 514647 522519 530291 538082 546904
63385 546904 557806 570925 585924 602960 622537 644649 668840 694927 723031 753091 785028
63374G85028L4146L6591L8311L8676L8158L7274L5761L3649L2197L2651L4684
63363A177126L7154L9879M3487M7935N2431N6692O1107O5511O8810O9988O8666
63352A788786O4625N7636M8149L7426K6669J6471P297k05n765r978j3881j8121
63340A999109k2655k7040l1038l5090m0042m6012n1732n5569n7277n8075n8887
63329A515692n9058n7332n3774n0097m7872m6755m4761m0437l4408k8598k4108
63318A028492k0404j6587j2624q859m958k60N014R673J2852J4870J6666J8817
63306A042692K1371K4296K7710L1699L6115M0646M5136M9686N4326N8732O2422
63295A494831O5118O6506O5848O2505N6883N0101M2494L3333K2470J1377J818
$$ plain form
63374 785028 819174 855765 894076 932752 970910 1008184 1043945 1077594 1109791 1142442 1177126
63363 1177126 1214280 1254159 1297646 1345581 1398012 1454704 1515811 1581322 1650132 1720120 1788786
63352 1788786 1853411 1911047 1959196 1996622 2023291 2039762 2047059 2046854 2041089 2031111 2017230 1999109
63340 1999109 1976454 1949414 1918376 1883286 1843244 1797232 1745500 1689931 1632654 1574579 1515692
63329 1515692 1456634 1399302 1345528 1295431 1247559 1200804 1156043 1115606 1081198 1052600 1028492
63318 1028492 1008088 991501 978877 970018 965060 964800 969814 979487 992339 1007209 1023875 1042692
63306 1042692 1064063 1088359 1116069 1147768 1183883 1224529 1269665 1319351 1373677 1432409 1494831
63295 1494831 1559949 1626455 1692303 1754808 1811691 1861792 1904286 1937619 1960089 1971466 1973284
63284A973284n845j2178j7156k0281k1911k3397k5817k9334l3701l8595m3540
63273A701529m8247n2938n7561o0882o1395n9172n5847n2663m9532m6095m2547
63262A114650l8992l5130l1196k8357k7374k7637k8158k8825k9815l0519l0105
63251G78542k8809k7527k6216k3841k0198j6774j5163j5105j4920j3737j2437
63240E63815j2119j2265j1342r111p336p546q876r055p256m796l103k202j704
63227D67104k097l928o281p258o098m048k864k957l367l221k726k529k484j654
63213D15592K90K237K750J819P40M16N43O79J150K327L625M024L395K734L124
63198D45445M765O863Q237Q184P176O571P319Q997J0414J1024J1394J2265J3570
$$ plain form
63284 1973284 1967439 1955261 1938105 1917824 1895913 1872516 1846699 1817365 1783664 1745069 1701529
63273 1701529 1653282 1600344 1542783 1481901 1420506 1361334 1305487 1252824 1203292 1157197 1114650
63262 1114650 1075658 1040528 1009332 980975 953601 925964 897806 868981 839166 808647 778542
63251 778542 749733 722206 695990 672149 651951 635177 620014 604909 589989 576252 563815
63240 563815 551696 539431 528089 518978 511642 504096 495220 486165 478909 474113 471010 468808 467104
63227 467104 465007 461079 454798 447540 441442 437394 434530 431573 428206 424985 422259 419730 417246 415592
63213 415592 415882 418119 420869 422688 423428 423844 424387 425066 426216 428543 432168 436192 439587 442321 445445
63198 445445 450210 457073 465310 473494 480670 487241 494560 503557 513971 524995 536389 548654 562224
63185E62224J4575J4917J5223J6467J8752K1098K2659K3844K5632K7928K9368
63174G92687K8993K7592K6882K7639K9017K9615K8891K7522K6509K6115K5916
63163A097378K5804K6339K7661K8607K7794K5290K2286J9250J5543J1001O595
63152A333548K917r44o098j2196j7874k2320k5604k7911k9250k9646k8991k7046
63140A108585k4114k1267j9244j7548j5278j2427r559o629l083J050N021Q242
63128I93749J0729J2756J4692J6862J8996K0105J9697J8704J8457J9102J9883
63117A183732K0512K1082K1016J9563J7208J5095J3009R565M681J41l033o131
63105A316440j0579j5713j9999k3303k6388k9104l0738l1632l2762l4032l4626
$$ plain form
63185 562224 576799 591716 606939 623406 642158 663256 685915 709759 735391 763319 792687
63174 792687 821680 849272 876154 903793 932810 962425 991316 1018838 1045347 1071462 1097378
63163 1097378 1123182 1149521 1177182 1205789 1233583 1258873 1281159 1300409 1315952 1326953 1333548
63152 1333548 1336465 1335521 1329423 1317227 1299353 1277033 1251429 1223518 1194268 1164622 1135631 1108585
63140 1108585 1084471 1063204 1043960 1026412 1011134 998707 989148 982519 979436 980486 985507 993749
63128 993749 1004478 1017234 1031926 1048788 1067784 1087889 1107586 1126290 1144747 1163849 1183732
63117 1183732 1204244 1225326 1246342 1265905 1283113 1298208 1311217 1320782 1325463 1325604 1322571 1316440
63105 1316440 1305861 1290148 1270149 1246846 1220458 1191354 1160616 1128984 1096222 1062190 1027564
63094A027564l4793l5537l6371l5253l1475k6971k3889k2124k0381j8398j6762
63083G25610j5364j3626j1819j0773j0411r952r462r698j0240r278o076k376m83
63070F06052p89j984k934l255k736j374K28J444K418L509M288M111L446L477M421
63055F20322N349N706N797N608M528K744J671K101L020L207L128M015N677O511
63041F79384N661M027L013L040L504L673L407L245L804M923N661N334M241L173
63027G36090K648K971M389O445P702P004M924L329L615N809R050J2215J4277J4954
63013H35422J5038J5465J6164J6498J6743J8233K1748K6372L0312L2513L3421
63002A077929L4470L6836M0345M3700M6043M7990N0579N3651N6098N7582N9046
$$ plain form
63094 1027564 992771 957234 920863 885610 854135 827164 803275 781151 760770 742372 725610
63083 725610 710246 696620 684801 674028 663617 653665 644203 634505 624265 614987 608911 606535 606052
63070 606052 605263 603279 600345 597090 594354 592980 593208 594652 597070 600579 604867 608978 612424 615901 620322
63055 620322 625671 631377 637174 642782 647310 650054 651725 653826 656846 660053 663181 667196 672873 679384
63041 679384 685045 689072 692085 695125 698629 702302 705709 708954 712758 717681 723342 728676 732917 736090
63027 736090 738738 741709 746098 752543 760245 767249 772173 775502 779117 784926 793976 806191 820468 835422
63013 835422 850460 865925 882089 898587 915330 933563 955311 981683 1011995 1044508 1077929
63002 1077929 1112399 1149235 1189580 1233280 1279323 1327313 1377892 1431543 1487641 1545223 1604269
62991A604269O1267O3824O5793O6867O7304O7311O6949O6482O6364O6795O7356
62980B330581O7194O5770O3561O1555N9822N7085N2290M6104M0026L4172K6857
62969B905017J6532L543j0133k2430l2410m0508m7683n4216n9411o2636o4056
62958B531609o4005o2308n8924n4633n0154m5057l8503l0697k2654j4946p721
62947B082007j367M043R428J5365K0550K3388K4781K7302L1475L4982L6066L5612
62935B343632L5081L4375L2923L1249L0010K8694K6406K2925J8108J1338K596
62924B617337p022j6716k6700l6688m5286n2082n8709o6157p2409p4746p3520
62913B087302p1632p0915p0835p0252o8585o5452o0927n6135n2286m9262m6302
$$ plain form
62991 1604269 1665536 1729360 1795153 1862020 1929324 1996635 2063584 2130066 2196430 2263225 2330581
62980 2330581 2397775 2463545 2527106 2588661 2648483 2705568 2757858 2803962 2843988 2878160 2905017
62969 2905017 2921549 2925092 2914959 2892529 2860119 2819611 2771928 2717712 2658301 2595665 2531609
62958 2531609 2467604 2405296 2346372 2291739 2241585 2196528 2158025 2127328 2104674 2089728 2082007
62947 2082007 2080640 2084683 2094111 2109476 2130026 2153414 2178195 2205497 2236972 2271954 2308020 2343632
62935 2343632 2378713 2413088 2446011 2477260 2507270 2535964 2562370 2585295 2603403 2614741 2617337
62924 2617337 2610315 2593599 2566899 2530211 2484925 2432843 2374134 2307977 2235568 2160822 2087302
62913 2087302 2015670 1944755 1873920 1803668 1735083 1669631 1608704 1552569 1500283 1451021 1404719
62902A404719m3515m1290l8847l5294l1674k9903k9717k8720k5798k2551k0816
62891A056594k0521k0676k0873k0882k0126j8603j7413j7406j7993j7968j6915
62880H47218j5285j3639j2313j1406j0784j0380j0341j0464r885q185o421n982
62868G22133o673p156o993o801o609n737m387l609l506l250l025l851m978m002
62854F51556o53J942J418o18j517j587k570l853l465k065k518n270p255o286m016
62839F13243l114l594l532k218q19m69j023j590j502q22k10q8P0J072K528K996
62823F00928J922N52K15N54L25o62j436j339p22j48J51K7o22j409j629j140p37
62806E94830j219k405l198k557l81K310L988L689J734o57k365k864k048k25J640
$$ plain form
62902 1404719 1361204 1319914 1281067 1245773 1214099 1184196 1154479 1125759 1099961 1077410 1056594
62891 1056594 1036073 1015397 994524 973642 953516 934913 917500 900094 882101 864133 847218
62880 847218 831933 818294 805981 794575 783791 773411 763070 752606 742721 734536 728115 722133
62868 722133 715460 708304 701311 694510 687901 682164 677777 674168 670662 667412 664387 660536 655558 651556
62854 651556 650903 652845 654263 653645 652128 650541 647971 644118 640653 638588 636070 630800 623545 617259 613243
62839 613243 610129 606535 603003 600785 599966 599497 598474 596884 595382 594560 594350 594262 594332 595404 597932 600928
62823 600928 602850 603402 603617 604171 604496 603834 602398 601059 600337 600189 600340 600367 599745 598336 596707 595567 594830
62806 594830 593611 591206 588008 585451 585070 587380 591368 595057 596791 596134 593769 590905 588857 588632 590272
62791E90272K381J764P89M30N13K54l83o18K1J108J830J648N33r12j650j153q8
62774E96739N38P83J473K542K828J889R38J228K344K905K319J075p8m70N19K829
62758F20401N378P030P638P616P175O736P300R172J0954J1145J0340J0414J1841
62745G33140J3378J4324J5341J6782J7948J8582J9600K1624K4069K6467K9323
62734I50578L2767L5650L7111L8153M0325M3653M7075N0433N4728O0572O7350
62723A458395P3960P9657Q4276Q8117R1515R4340R6207R7215R7635R6518R1753
62712B449588Q2333O9730N6188M2483K8239J3500j346j6503l2068m6677n8291
62701B587176o6376p2203p7103q1444q5173q8037q9286q8306q5767q3056q0479
$$ plain form
62791 590272 592653 594417 595206 595636 596149 596403 596020 595402 595423 596531 598361 600009 600542 599630 597980 596827 596739
62774 596739 597277 598060 599533 602075 604903 606792 607730 608958 611302 614207 616526 617601 617523 617053 617572 620401
62758 620401 625779 632809 640447 648063 655238 661974 669274 678446 689400 700545 710885 721299 733140
62745 733140 746518 760842 776183 792965 810913 829495 849095 870719 894788 921255 950578
62734 950578 983345 1018995 1056106 1094259 1134584 1178237 1225312 1275745 1330473 1391045 1458395
62723 1458395 1532355 1612012 1696288 1784405 1875920 1970260 2066467 2163682 2261317 2357835 2449588
62712 2449588 2531921 2601651 2657839 2700322 2728561 2742061 2740715 2724212 2692144 2645467 2587176
62701 2587176 2520800 2448597 2371494 2290050 2204877 2116840 2027554 1939248 1853481 1770425 1689946
62690A689946p7153p2824o8487o4827o1270n7202n3022m9219m5349m0929l6601
62679A063063l3360l0937k8009k4079k0303j8057j7171j6150j4130j2034j1146
62668H37687j0876r038m848m77J497J499K177M594P009P876Q221R975J3239J6673
62654H85208J9688K2815K6194K9161L1507L4006L7360M1296M5128M8766N2786
62643A273915N7696O3321O8920P3844P8106Q2145Q5901Q8468Q8778Q6529Q2179
62632B129802P6309O9131O0405M9703L7010K3213R474l995j7906l2245m5391n5637
62620B299873o3052o8927p3849p7382p9460q0729q1331q0573p8229p5119p1850
62609A469372o8048o3640n9807n7517n5826n2935m8563m3974m0028l6577l3678
$$ plain form
62690 1689946 1612793 1539969 1471482 1406655 1345385 1288183 1235161 1185942 1140593 1099664 1063063
62679 1063063 1029703 998766 970757 946678 926375 908318 891147 874997 860867 848833 837687
62668 837687 826811 817773 812925 812448 813945 815444 817621 822215 829224 837100 845321 855296 868535 885208
62654 885208 904896 927711 953905 983066 1014573 1048579 1085939 1127235 1172363 1221129 1273915
62643 1273915 1331611 1394932 1463852 1537696 1615802 1697947 1783848 1872316 1961094 2047623 2129802
62632 2129802 2206111 2275242 2335647 2385350 2422360 2445573 2455047 2451052 2433146 2400901 2355510 2299873
62620 2299873 2236821 2167894 2094045 2016663 1937203 1856474 1775143 1694570 1616341 1541222 1469372
62609 1469372 1401324 1337684 1277877 1220360 1164534 1111599 1063036 1019062 979034 942457 908779
62598I08779l1732l0113k7420k3781k1323k1157k1345j9412j5841j3180j2287
62587F71188j1600j0111q901q975r360q538o634m991m353m440m759m845m121k479
62573E77081p65K8n4k29j03J03K80O44J233J698J679J157N76P25J984L553M146
62556E93736L811M251O591R707J1716J2339J2609J2941J3173J4071J6868K0993
62544G32806K4040K4787K4935K6948L1138L5839L9556M1957M3419M4628M6228
62533A116281M7918M8191M5893M1856L8056L5062L1285K5035J6625P862q1p538
62521A446445j5144k2431k8163l1824l4270l6703l9451m1914m3399m3638m2818
62510A066690m1433l9970l8366l6078l2978k9855k7578k6078k4658k2853k0404
$$ plain form
62598 908779 877047 846934 819514 795733 774410 753253 731908 712496 696655 683475 671188
62587 671188 659588 649477 640576 631601 622241 613703 607069 602078 597725 593285 588526 583681 579560 577081
62573 577081 576316 576344 576290 576061 575958 576061 576341 576985 578218 579916 581595 582752 583328 584053 586037 589590 593736
62556 593736 597547 601798 608389 618096 629812 642151 654760 667701 680874 694945 711813 732806
62544 732806 756846 781633 806568 833516 864654 900493 940049 982006 1025425 1070053 1116281
62533 1116281 1164199 1212390 1258283 1300139 1338195 1373257 1404542 1429577 1446202 1454064 1453983 1446445
62521 1446445 1431301 1408870 1380707 1348883 1314613 1277910 1238459 1196545 1153146 1109508 1066690
62510 1066690 1025257 985287 946921 910843 877865 848010 820432 794354 769696 746843 726439
62499G26439j6895j2491q653p003p434q403q962r307r323q167n892m056l807m383
62485F11663m436l836l132k082q2K381L991M282M139M584N778P182Q081Q062P400
62470F53975O922P130P832Q870J0629J3186J5726J7611J9575K2785K7131L1444
62458H42816L5193L8831M2530M5792M8342N0308N1258N0319M7700M5000M3149
62447A341238M0924L6420K9423K1386J3395N283l156j1092j7344k1647k4596k6526
62435A383708k7051k5970k4132k2927k2961k3539k3472k1996j9060j5216j1397
62424A145987q259n491k111K262O868J0665J3218J4582J5094J5611J7062J9022
62412A244510J9554J7426J3895J1146R498P341L574j265o196j0847j5150j9132
$$ plain form
62499 726439 709544 697053 688400 681397 673963 665560 656598 647291 637968 629801 623909 619853 616046 611663
62485 611663 607227 603391 600259 598177 598095 600476 604467 608749 612888 617472 623250 630432 638513 646575 653975
62470 653975 660897 668027 675859 684729 695358 708544 724270 741881 761456 784241 811372 842816
62458 842816 878009 916840 959370 1005162 1053504 1103812 1155070 1205389 1253089 1298089 1341238
62447 1341238 1382162 1418582 1448005 1469391 1482786 1488069 1484913 1473821 1456477 1434830 1410234 1383708
62435 1383708 1356657 1330687 1306555 1283628 1260667 1237128 1213656 1191660 1172600 1157384 1145987
62424 1145987 1137728 1132237 1130126 1132388 1139256 1149921 1163139 1177721 1192815 1208426 1225488 1244510
62412 1244510 1264064 1281490 1295385 1306531 1316029 1323370 1326944 1325679 1319483 1308636 1293486 1274354
62400A274354k3174k7435l0972l2662l3124l4158l5912l6228l3670k9749k6864
62389I30406k5256k3505k1149j9148j7953j6693j4442j1334q244n983m847m334
62377G57518l450j826k27N51P73R71O71r25l235m692m886n095o406q389j0100
62362G11253j1375j2465j3057j2469j0621q429p266p888r549j0459r709q432q126
62349E81408q198o610l053J56R76K0q41r00n59k4N18L99m42n14J404M089N135
62332E72964M121K817K438K565K918M188O422Q289Q890Q831Q697P981O715O653
62318F54489R158J2906J5377J6095J6724J8345K0399K2172K3753K5246K6588K8474
62306H89726L2083L7214M2045M5535M8990N4154O0599O6357P0820P5604Q2205
$$ plain form
62400 1274354 1251180 1223745 1192773 1160111 1126987 1092829 1056917 1020689 987019 957270 930406
62389 930406 905150 881645 860496 841348 823395 806702 792260 780926 772682 766699 761852 757518
62377 757518 754068 752242 752015 752566 753339 754310 754981 754056 750821 746129 741243 736148 729742 721353 711253
62362 711253 699878 687413 674356 661887 651266 642837 635571 627683 618134 607675 597966 589534 581408
62349 581408 573210 566600 563547 563703 564679 564699 563858 562958 562399 562375 562893 563292 562850 562336 563740 567829 572964
62332 572964 577085 579902 582340 584905 587823 592011 598433 606722 615612 624443 633140 641121 647836 654489
62318 654489 663647 676553 691930 708025 724749 743094 763493 785665 809418 834664 861252 889726
62306 889726 921809 959023 1001068 1046603 1095593 1149747 1210346 1276703 1347523 1423127 1505332
62295A505332Q9763R5818R8839R9209R7690R3688Q5804P3941N9962M5806L1681
62284B377533J6912K107j0789k0854k9589l9265n0219o0358o7225p0262p1099
62273A976892p1822p2925p3046p0802o6546o1949n8047n4439n0301m5507m0617
62262A310891l6474l3968l3412l3785l3318l1377k9146k7911k7316k6089k4006
62251I74089k2286k2061k3184k4618k5312k4621k2346j8917j5411j3034j2204
62240G50095j2062j1197r150o928n678n221m639l856l547l470k362pJ969K350
62226F86297K277L723O642R020R426Q427P618Q168J0224J2878J4759J5348J5444
62213H10251J5830J6155J6115J6926K0021K4587K8168K9908L1559L4846L9429
$$ plain form
62295 1505332 1595095 1690913 1789752 1888961 1986651 2080339 2166143 2240084 2300046 2345852 2377533
62284 2377533 2394445 2396552 2385763 2364909 2335320 2296055 2245836 2185478 2118253 2047991 1976892
62273 1976892 1905070 1832145 1759099 1688297 1621751 1559802 1501755 1447316 1397015 1351508 1310891
62262 1310891 1274417 1240449 1207037 1173252 1139934 1108557 1079411 1051500 1024184 998095 974089
62251 974089 951803 929742 906558 881940 856628 832007 809661 790744 775333 762299 750095
62240 750095 738033 726836 717686 710758 705080 699859 695220 691364 687817 684347 681985 681978 683947 686297
62226 686297 688574 692297 698939 707959 717385 725812 733430 741598 751822 764700 779459 794807 810251
62213 810251 826081 842236 858351 875277 895298 919885 948053 977961 1009520 1044366 1083795
62202A083795M4141M8815N3851N9132O4513P0533P7503Q4487R0194R4454R7720
62191A869138R9478R8159R2613Q3015P0523N6641M2686K9086J5259P09j3845k6956
62179B416506l7928m7386n6498o5958p5406q3313q7893q8700q7101q4605q1259
62168A620459p6545p1254o7132o4641o2299n8629n3655m8177m2682l7557l3430
62157A004458l0431k7707k4541k1379j9008j7220j5226j2967j0931q878o003k556
62145H07611j20K80l83k34J506M124O460P683P454O124M707M146M542N366O234
62130H65500P075P744Q042Q115Q404R158J0278J1518J2546J3106J3500J4461J5993
62117A005440J6859J6276J5604J7015K0531K4016K6413K9176L3721L9277M4626
$$ plain form
62202 1083795 1127936 1176751 1230602 1289734 1354247 1424780 1502283 1586770 1676964 1771418 1869138
62191 1869138 1968616 2066775 2159388 2242403 2312926 2369567 2412253 2441339 2456598 2457307 2443462 2416506
62179 2416506 2378578 2331192 2274694 2208736 2133330 2050017 1962124 1873424 1786323 1701718 1620459
62168 1620459 1543914 1472660 1405528 1340887 1278588 1219959 1166304 1118127 1075445 1037888 1004458
62157 1004458 974027 946320 921779 900400 881392 864172 848946 835979 825048 816170 810167 807611
62145 807611 807491 807771 807388 807154 808660 812784 819244 826927 834381 840505 845212 849358 853900 859266 865500
62130 865500 872575 880319 888361 896476 904880 914038 924316 935834 948380 961486 974986 989447 1005440
62117 1005440 1022299 1038575 1054179 1071194 1091725 1115741 1142154 1171330 1205051 1244328 1288954
62106A288954N0313N7137O3629O7445O8782O9820P0711O8659O1878N2264M2784
62095A962376L3987K4622J4423M368n044j4010k2288k9489l6336m4003n1915n7595
62083A779096n9353n8208n6566n5680n4884n2714m8214m1578l4180k7934k3995
62072A265790k1809j9529j5664j0599o515n407p039r135r844r375q819q266p255
62059A126534o546p632j0169j1590j0349q199p902r593j1089j1288j1266j1807
62047A009104j1903j0623q898q082p749o461m158k182j089O1K004M147N663O623
62033I66457P533Q488R395J0313J1129J1609J2160J3666J6032J7868J8461J9083
62021A122194K1129K3762K4913K4383K4328K6539L0475L4383L7229L9095M0540
$$ plain form
62106 1288954 1339267 1396404 1460033 1527478 1596260 1666080 1736791 1805450 1867328 1919592 1962376
62095 1962376 1996363 2020985 2035408 2039776 2034732 2020722 1998434 1968945 1932609 1888606 1836691 1779096
62083 1779096 1719743 1661535 1604969 1549289 1494405 1441691 1393477 1351899 1317719 1289785 1265790
62072 1265790 1243981 1224452 1208788 1198189 1191674 1186267 1179228 1170093 1160249 1150874 1142055 1133789 1126534
62059 1126534 1119988 1112356 1102187 1090597 1080248 1072049 1064147 1054554 1043465 1032177 1020911 1009104
62047 1009104 997201 986578 977680 969598 961849 955388 951230 949048 947959 948020 950024 954171 959834 966457
62033 966457 973990 982478 991873 1002186 1013315 1024924 1037084 1050750 1066782 1084650 1103111 1122194
62021 1122194 1143323 1167085 1191998 1216381 1240709 1267248 1297723 1332106 1369335 1408430 1448970
62010A448970M2173M4243M6276M7561M8337M9841N2910N6939O0461O2292O1957
61999B021960N9515N5211M8992M0459K9776J8359P896j212r721j8155k6487l4950
61987B191643m3719n1849n7945o2216o6176o9931p1607p0318o7886o6307o5108
61976A498581o2782n9437n6144n2783m8534m3832l9889l6795l3905l1579l0415
61965A002486k9214k6093k1673j8746j8350j8471j7337j5795j5219j5140j4400
61954G92048j3198j2319j1556j0390r241q596p769n975l912k754k236j237K00
61941G03065J065J283J751K591K967K768K902L565L656K500Q47m51j578k838l780
61926G20313m190m987o942r139r945r136p984p442p340p293p302p208o510n111
$$ plain form
62010 1448970 1491143 1535386 1581662 1629223 1677560 1727401 1780311 1837250 1897711 1960003 2021960
61999 2021960 2081475 2136686 2185678 2226137 2255913 2274272 2282168 2280956 2271235 2253080 2226593 2191643
61987 2191643 2147924 2096075 2038130 1975914 1909738 1839807 1768200 1697882 1629996 1563689 1498581
61976 1498581 1435799 1376362 1320218 1267435 1218901 1175069 1135180 1098385 1064480 1032901 1002486
61965 1002486 973272 947179 925506 906760 888410 869939 852602 836807 821588 806448 792048
61954 792048 778850 766531 754975 744585 735344 726748 718979 713004 709092 706338 704102 702865 703065
61941 703065 704130 705413 707164 709755 712722 715490 718392 721957 725613 728113 728960 728509 726931 724093 720313
61926 720313 716123 711136 704194 695055 685110 675974 667990 660548 653208 645915 638613 631405 624895 619784
61912F19784l613k489j587p61l36n18q67q98q28j208k087k969l290k575o59J681
61896E96780K886K303J371K087M407O294O490O034O542Q086R525J0181J0301J0445
61882F83732J1215J3056J5562J7366J7598J6969J6595J6286J5275J4135J4396
61871H52185J5993J6748J5083J2019R579Q214O868M912K684M21j999m172n037
61858I33498m268l083l029m143m848l745j193J179K354K949M121N892P197P545
61844I40426P808R017J0822J1779J0848Q165M550Q50k251m398n781p053q802j1149
61830I64831j3671j5645j6525j6482j6330j6619j6958j6635j5681j4828j4393
61819G91064j3871j2825j1597j0684r860q510o697n293m992n513n878n140k820
$$ plain form
61912 619784 616171 613682 612095 611334 610998 610480 609613 608715 607887 606679 604592 601623 598333 595758 595099 596780
61896 596780 599666 601969 603340 605427 609834 616128 622618 628652 635194 643280 652805 662986 673287 683732
61882 683732 694947 708003 723565 740931 758529 775498 792093 808379 823654 837789 852185
61871 852185 868178 884926 900009 912028 921607 929821 936689 941601 944285 944706 942707 938535 933498
61858 933498 929230 926147 923118 918975 914127 910382 909189 910368 912722 915671 919792 925684 932881 940426
61844 940426 948234 957251 968073 979852 990700 998865 1003415 1004265 1002014 997616 991835 984782 975980 964831
61830 964831 951160 935515 918990 902508 886178 869559 852601 835966 820285 805457 791064
61819 791064 777193 764368 752771 742087 732227 723717 717020 711727 706735 701222 695344 690204 687384
61806F87384Q20M625P012P170N931N181O194Q587J0937J2321J3191J4773J7690
61793H01816K1307K4457K6655K8360L0117L1805L2924L3240L2880L1993L0627
61782A126181K8733K5975K1848J6417J0763O101K512p74l994o457p693q188q628
61769A202796r014q952q245o820m555j608J485M388P016Q786Q610O276L048R6
61755A203307k985p199j2370j7350k1451k4577k6479k7166k7665k8848k9813k9041
61743I48363k7104k6373k7608k8672k7381k4108k0560j7463j4788j3046j2787
61732G08473j3382j3620j3206j2622j1999j1073r954q951q059p392p556q572q991
61719E73096p455m785l149l240l721l487k966k800k667k185j841k090k360j874
$$ plain form
61806 687384 688204 692829 699841 707011 712942 718123 724317 732904 743841 756162 769353 784126 801816
61793 801816 823123 847580 874235 902595 932712 964517 997441 1030681 1063561 1095554 1126181
61782 1126181 1154914 1180889 1202737 1219154 1229917 1236018 1238530 1237756 1233762 1227305 1219612 1211424 1202796
61769 1202796 1193782 1184830 1176585 1169765 1165210 1163602 1165087 1169475 1176491 1185277 1193887 1200163 1203211 1203307
61755 1203307 1200322 1193123 1180753 1163403 1141952 1117375 1090896 1063730 1036065 1007217 977404 948363
61743 948363 921259 894886 867278 838606 811225 787117 766557 749094 734306 721260 708473
61732 708473 695091 681471 668265 655643 643644 632571 622617 613666 605607 598215 590659 582087 573096
61719 573096 565641 560856 557707 554467 550746 547259 544293 541493 538826 536641 534800 532710 530350 528476
61705E28476q82j78K08Q75J782K071J334L40J51Q95J787K149K098K193K727L457
61689E49483L851L511K446J145K20j83m79p89l91J233K966K824O27j274p59J398
61673E65829K769K538K068K419K941K756K253K183K209J397j64j184o56J021K569
61658E90948L172L136L276L837M268M084L466K697J512k59j778j897q19m9m25
61643F15169j183j473j822l129m842n311l993k264j759k577l665m445n238o029
61629E67439n787l753j049J58p69k170k420j975k171k898k915k030j379j506j644
61614E35131j215o98n20l73k53q89k406l578l316j974m87Q10J706J615O80L24
61598E24557J437K908L268K815K641K486J517N23J077K653L007J672P88J730K964
$$ plain form
61705 528476 527594 527416 527624 528499 530281 532352 533686 534026 534177 535072 536859 539008 541106 543299 546026 549483
61689 549483 553334 556845 559291 560436 560656 560473 559994 559205 558814 560047 563013 565837 566464 565190 564431 565829
61673 565829 568598 571136 573204 575623 578564 581320 583573 585756 587965 589362 589198 588014 587358 588379 590948
61658 590948 594120 597256 600532 604369 608637 612721 616187 618884 620396 620137 618359 616462 615643 615594 615169
61643 615169 613986 612513 610691 607562 602720 597409 593416 591152 589393 586816 583151 578706 573468 567439
61629 567439 561652 557899 556850 557008 556239 554069 551649 549674 547503 544605 541690 539660 538281 536775 535131
61614 535131 533916 533218 532698 532325 532072 531183 528777 525199 521883 519909 519422 520232 521938 523553 524233 524557
61598 524557 525994 528902 532170 534985 537626 540112 541629 542152 543229 545882 548889 550561 551349 553079 556043
61583E56043K558J103O91K066M138N508N333L476Q71q30j008q60j705l192m150
61568E70042m343m221l719k713k187l263n253o148n171l472k104q56M31Q54k03
61553E27674j629j739n02L85m23k474m283m960m900n119o079p178p346o253m858
61538D70316m577n842p490p841o470m669l901m043l777k621j701k108l398m303
61524D07575m346l862l013j797q32r83k159l335l856l910l644k826j642q92r54
61509C69524j312j530j953k896l773l680k468p12R75K215K778K800K745K777K439
61494C67929J366Q8l83M09J917L033K954J874Q40M62nj591l647m181k444p8J014
61477C69557P95K36m67j448j847o81J174J619J20j490j454j51Q21P09N7l48m24
$$ plain form
61583 556043 558601 559704 560395 562461 566599 572107 577440 580916 581787 580957 579949 579089 577384 574192 570042
61568 570042 565699 561478 557759 555046 552859 549596 544343 538195 533024 529552 527448 526592 527023 527877 527674
61553 527674 526045 524306 523804 524189 523766 521292 517009 512049 507149 502030 495951 488773 481427 475174 470316
61538 470316 465739 459897 452407 444566 438096 433427 429526 425483 421706 419085 417384 415276 411878 407575
61524 407575 403229 399367 396354 394557 393725 392742 390583 387248 383392 379482 375838 373012 371370 370478 369524
61509 369524 368212 366682 364729 361833 358060 354380 351912 351200 352175 354390 357168 359968 362713 365490 367929
61494 367929 369295 369383 369000 369409 371326 374359 377313 379187 380027 380489 380484 378893 375246 371065 368621 368543 369557
61477 369557 370352 370588 370121 368673 366826 366145 367319 368938 369058 367568 366114 365963 366784 367493 367550 367202 366778
61460C66778p24j629k543k331r95k13j283k967k836o56J073M10j688l039k944
61445C44413k138j076K98J560J904J371R68J299J688R95q80k604k640q99J056
61430C45315J813J700J859K126J114j335l245k814n89J697L386M732N330M319
61416C65408J988k34j490j980j804o50J061K011J513L08o52j271j664j451m54
61401C60639O58J305J897K875L501K713R32k74l49l79j229k053j465M50K141K359
61385C73721J353L93N88K052L836M640L952K495J387R99R63J097J678K682L333
61370D05169K822J290j05q2J700M152N441M695L053K410L088L601L000K351L026
61355D45611M451M786L489J890J239J400J639J649J368O24n44j766k759l415l504
$$ plain form
61460 366778 366054 364425 361882 359551 358556 358343 357060 354093 351257 350601 351674 352084 350396 347357 344413
61445 344413 342275 341199 341497 343057 344961 346332 347300 348599 350287 351282 350402 347798 345158 344259 345315
61430 345315 347128 348828 350687 352813 353927 352592 349347 346533 345944 347641 351027 355759 361089 365408
61416 365408 367396 367162 365672 363692 361888 361238 362299 364310 365823 366131 365479 364208 362544 361093 360639
61401 360639 361297 362602 364499 367374 370875 373588 374520 374246 373897 373518 372289 370236 368771 369221 371362 373721
61385 373721 375074 375467 376055 378107 381943 386583 390535 393030 394417 395416 396379 397476 399154 401836 405169
61370 405169 407991 409281 409176 409094 410794 414946 420387 425082 428135 430545 433633 437234 440234 442585 445611
61355 445611 450062 454848 458337 460227 461466 462866 464505 466154 467522 468146 467602 465836 463077 459662 456158
61340D56158k985k581l030l664k970j019K9j316l712m656l514j603l3J152J904
61325D28160J752P47k72o98p71q27o49M9R53J340R36L41M71J396J916Q92r38j425
61307D33373K88K423K889K077K091L583M963M890M027L750M192M479M289M184
61293D81498M666N563O444P185P912Q477Q225O553L844J527Q51J720K971L657
61279E51093L700L567L708M316N289O319P107P359O723N217L708L153L188K396
61265F16843M58j117j130l81j45q1P80J918K067J583K083L845N541O562P636Q853
61249F55315R049P852O587O443P312Q905J1205J3068J2499R440O512N600N510
61236G65297M431K813J900J148n75k572l503l921n142o467o317n505o344q586
$$ plain form
61340 456158 453173 450592 447562 443898 440928 439909 439938 438622 434910 430254 426740 425137 425104 426256 428160
61325 428160 429912 430659 430387 429689 428918 428091 427442 427491 428444 429784 430720 431061 431532 432928 434844 435736 434798 433373
61307 433373 433661 436084 438973 441050 443141 446724 451687 456577 460604 464354 468546 473025 477314 481498
61293 481498 486164 491727 498171 505356 513268 521745 529970 536523 540367 541894 542745 544465 547436 551093
61279 551093 554793 558360 562068 566384 571673 577992 585099 592458 599181 604398 608106 611259 614447 616843
61265 616843 617301 616184 615054 614673 614528 614447 615227 617145 619212 620795 622878 626723 632264 638826 646462 655315
61249 655315 664364 672216 678803 685246 692558 701463 712668 725736 738235 747675 754187 759787 765297
61236 765297 769728 772541 774441 775589 775014 772442 768939 765018 759876 753409 747092 741587 735243 726657
61222G26657r491q368p772r067r888p968m915l728m367m408l064j925j923j891
61208F47882m94J971M226N408N586N540N987O568O048M188K719L292N084N875
61194G09880N017L731K718J572Q46K374O333R763R774P146N023M706M658L427
61180G76968J619M88N9m41j155j504j129l59Qp29k414l716l184r63J195J925J623
61163G68291J381J535J988L179N379P439P699O263N151N799P458Q629R037R275
61149H48503R312Q596P329O456O247N913N062M636N665P673R139R364Q997Q777
61135I51669Q619Q316Q276Q821R301Q709O960M802K789J142L69Q63J864K102J647
61120A026249J813K651K114j162n454p758p258n578m307l806l997m657n002m505
$$ plain form
61222 726657 717166 708798 701026 691959 682071 674103 669188 665460 661093 656685 653621 651696 649773 647882
61208 647882 647388 649359 653585 658993 664579 670119 676106 682674 688722 692910 695629 698921 704005 709880
61194 709880 714897 718628 721346 722918 723764 726138 732471 742234 752008 759154 764177 768883 773541 776968
61180 776968 778587 779075 779134 778693 777538 776034 774905 774546 774554 773825 771411 767695 764511 763548 764743 766668 768291
61163 768291 769672 771207 773195 776374 781753 789192 796891 803154 808305 814104 821562 830191 839228 848503
61149 848503 857815 866411 873740 880196 886443 892356 897418 902054 907719 915392 924531 933895 942892 951669
61135 951669 960288 968604 976880 985701 995002 1003711 1010671 1015473 1018262 1019404 1019773 1020636 1022500 1024602 1026249
61120 1026249 1028062 1030713 1032827 1031665 1026211 1018453 1011195 1005617 1001310 997504 993507 988850 983848 979343
61106I79343m008m558n367m741l052k737m863p726r535j0448j0865r896p300n283
61092H88964o092q645r681p843m813k693k067k712m429o667q490r487r923r893
61078G95529r133p799o541n557m267k260l0J433J524N91p1Q59L302N632O518O417
61062G86147O588P265P901Q669J0292J2538J4393J5826J7939K0890K3122K3434
61050I55004K2776K3011K4607K6417K7216K6615K4844K2476K0332J8959J8065
61039A210322J6757J4610J2223J0492R283P238L409j108m127n220o503r700j3508
61026A244168j5343j5011j4733j5663j6438j5815j4760j4739j5382j5275j4155
61015A076854j2817j1513r945q515q068q260p504m953j649Q42K235L431N204P550
$$ plain form
61106 979343 975335 970777 965410 960669 957617 954880 950017 942291 932756 922308 911443 901547 894247 888964
61092 888964 882872 874227 864546 856703 851890 849197 847130 844418 839989 833322 824832 815345 805422 795529
61078 795529 786396 778597 772056 766499 762232 759972 759942 761375 762899 763490 763419 764278 767580 773212 779730 786147
61062 786147 792735 800000 807901 816570 826862 839400 853793 869619 887558 908448 931570 955004
61050 955004 977780 1000791 1025398 1051815 1079031 1105646 1130490 1152966 1173298 1192257 1210322
61039 1210322 1227079 1241689 1253912 1264404 1273687 1280925 1284334 1283226 1279099 1273879 1267376 1257676 1244168
61026 1244168 1228825 1213814 1199081 1183418 1166980 1151165 1136405 1121666 1106284 1091009 1076854
61015 1076854 1064037 1052524 1042579 1034064 1025996 1017736 1010232 1005279 1003630 1004472 1006707 1010138 1015342 1022892
61001A022892J0103J2548J4604J6082J7139J8304K0054K2396K5008K7686L0501
60990A237317L3491L6414L8960M1192M3764M7649N3407O0439O7196P2583P7120
60979A809532Q2193Q8252R4524J00554J06956J14179J21612J28852J37052J47780
60969B931486J60994J75199J89314K03433K18172K34599K54699K80747L14252
60960D962895L56345M08757M72882N48041O32160P24431Q26189R40242J072191
60951A0944133J231909J427072J647201J850686J970208J938566J721980J343673
60943B4075428Q84916M59072J67345N8065J11137K51991L80954M02773K52579
60934B7044260q0702n42339j027200j424780j668978j758067j734104j645784
$$ plain form
61001 1022892 1032995 1045543 1060147 1076229 1093368 1111672 1131726 1154122 1179130 1206816 1237317
60990 1237317 1270808 1307222 1346182 1387374 1431138 1478787 1532194 1592633 1659829 1732412 1809532
60979 1809532 1891725 1979977 2074501 2175055 2282011 2396190 2517802 2646654 2783706 2931486
60969 2931486 3092480 3267679 3456993 3660426 3878598 4113197 4367896 4648643 4962895
60960 4962895 5319240 5727997 6200879 6748920 7381080 8105511 8931700 9871942 10944133
60951 10944133 12176042 13603114 15250315 17101001 19071209 21009775 22731755 24075428
60943 24075428 24960344 25419416 25586761 25644826 25755963 26007954 26388908 26791681 27044260
60934 27044260 26963558 26421219 25394019 23969239 22300261 20542194 18808090 17162306
60926A7162306j526679j396476j268719j151675j046280r49162q58307p74267
60918H190741o97487o27398n63843n07045m56026m08863l64837l24890k89823
60909C950529k59285k32581k09203j88345j69077j51293j35653j22405j11116
60900B371571j01517r3719q7464q2071p7182p2762o8429o3649n8487n3190m7280
60889A565821m0203l2928k7506k4718k3267k1538j9100j6216j3077j0010p457
60878A329801n255k899p88L4j78K58J960L409L577L958O175Q814R078P126O153
60863A371223P856J0290J1274J1746J3826J7022J8720J7977J6590J6073J5524
60852A528121J3495J0404P765N883L797J002k210n967j0724j5755j9161k0164
$$ plain form
60926 17162306 15635627 14239151 12970432 11818757 10772477 9823315 8965008 8190741
60918 8190741 7493254 6865856 6302013 5794968 5338942 4930079 4565242 4240352 3950529
60909 3950529 3691244 3458663 3249460 3061115 2892038 2740745 2605092 2482687 2371571
60900 2371571 2270054 2176335 2088871 2006800 1929618 1856856 1788427 1724778 1666291 1613101 1565821
60889 1565821 1525618 1492690 1465184 1440466 1417199 1395661 1376561 1360345 1347268 1337258 1329801
60878 1329801 1324546 1321647 1320859 1320893 1320715 1320973 1322933 1326342 1329919 1333877 1340052 1348866 1357944 1365070 1371223
60863 1371223 1379079 1389369 1400643 1412389 1426215 1443237 1461957 1479934 1496524 1512597 1528121
60852 1528121 1541616 1552020 1559785 1565668 1569465 1570467 1568257 1562290 1551566 1535811 1516650 1496486
60840A496486k0310k1577k4119k6641k8167k8448k7446k5707k4748k5667k7358
60829A216298k7442k5139k2126k0296j9750j9610j9713k0534k1790k2229k0970
60818I76699j8653j6870j6491j6777j6314j4705j2902j1819j1237j0379r042p647
60806H13863o790p188r289j2045j2900j0363o248l835m102n269o082p348r616
60793G12788j1359j1068r744r502j0360j0251q160n596m610n427o632o929o166
60780F06984n095m584m924n685o314o847p669q572q523o939m866m233n655p510
60766E19568p721o081m108k727j289P01K172J875M48l14J2J59n53j109m53R36
60750E01516J893K113K065J948J555P75k32j020p76R89L301M072K297o16k424
$$ plain form
60840 1496486 1476176 1454599 1430480 1403839 1375672 1347224 1319778 1294071 1269323 1243656 1216298
60829 1216298 1188856 1163717 1141591 1121295 1101545 1081935 1062222 1041688 1019898 997669 976699
60818 976699 958046 941176 924685 907908 891594 876889 863987 852168 840931 830552 821510 813863
60806 813863 807073 799885 790596 778551 765651 755288 749040 745205 741103 735834 729752 722404 712788
60793 712788 701429 690361 680617 671115 660755 650504 642344 636748 632138 626711 620079 613150 606984
60780 606984 601889 597305 592381 586696 580382 573535 565866 557294 548771 541832 536966 532733 527078 519568
60766 519568 511847 505766 501658 498931 497642 498343 500515 502390 502838 502524 502536 502695 502142 501033 500580 501516
60750 501516 503409 505522 507587 509535 511090 511865 511633 510613 509837 510826 514127 518199 520496 519880 517456
60735E17456k336j133L35J628K183J440l41k170l387m037m309m229m005m075m471
60720D88549m499l416j414J31k78k640n076n708m834m357m946n010l207p56J35
60705D42674o14j050k13O18J47q63p47O08J514P00r47j185J090M398O022M810
60689D56962K275P80J229K878M690N983O266N461M326L756L536K609O44j471k971
60674D96953m179n569o609o285m681l293l493n010o218o068n214m864m910m203
60660D26357k736k196l578n402n569m155k907k485k027j290j304k376l101k262
60646C84969m37J055J721J636P51n76j255p90j46l33q29n46L27Q01R37J717L181
60629C92183M073L585K383J557J467J974K927L967M504M397M188M327M541M307
$$ plain form
60735 517456 515120 513987 514322 515950 518133 519573 519232 517062 513675 509638 505329 501100 497095 493020 488549
60720 488549 484050 480634 479220 479351 479073 476433 471357 465649 460815 456458 451512 446502 443295 442539 442674
60705 442674 442060 441010 440797 441415 441562 440699 439952 440560 442074 442774 441827 440642 441732 446130 452152 456962
60689 456962 459237 460017 461246 464124 468814 474797 481063 486524 490850 494606 498142 500751 501395 499924 496953
60674 496953 492774 487205 480596 474311 469630 466337 462844 457834 451616 445548 440334 435470 430560 426357
60660 426357 423621 421425 417847 412445 406876 402721 399814 397329 395302 394012 392708 390332 387231 384969
60646 384969 384532 385587 387308 388944 389695 389119 387864 387074 386928 386595 385766 385220 385547 386348 387285 389002 392183
60629 392183 396256 399841 402224 403781 405248 407222 410149 414116 418620 423017 427205 431532 436073 440380
60615D40380L588K781K271K323L124M488N669N814M804L468K899L397M191M269
60601D93466L476K455J618O85n36j612k231k861l827m222k873l48J229P00o90
60586D84429j027k6R70P90o09k595m397n207m526k790j283j067k096l448m330
60571D52788m591m413l913l349l332m121m733l714j214N52j32k061k425l10K449
60556D17481L864L741K728J048q90j920j538r66j417k047j172R25K189J810J265
60541D25101J837K731K640J853J535J645J134k9m30P64K357K429O49j439k288
60526D40489j802p79M00J775K909K937J853Q77J023J910K666L377M719O529P887
60511D76770Q563R307J0481J1358J1096R617P273M480J972M99j43r76k304l123
$$ plain form
60615 440380 443968 446749 449020 451343 454467 458955 464624 470438 475242 478710 481609 485006 489197 493466
60601 493466 496942 499397 501015 501700 501164 499552 497321 494460 490633 486411 483538 483190 484419 485119 484429
60586 484429 483402 483376 484346 485136 484527 481932 477535 472328 467802 465012 463729 462662 460566 457118 452788
60571 452788 448197 443784 439871 436522 433190 429069 424336 420622 419408 419960 419828 417767 415342 415032 417481
60556 417481 421345 425086 427814 428862 427972 426052 424514 423548 422131 420084 418912 419837 422026 423836 425101
60541 425101 426938 429669 432309 434162 435697 437342 438476 438447 438017 438781 441138 443567 444216 442777 440489
60526 440489 438687 437908 438308 440083 442992 445929 447782 448659 449682 451592 454258 457635 462354 468883 476770
60511 476770 485333 494640 505121 516479 527575 537192 544465 548945 550917 551416 551273 550297 547993 544870
60497E44870k566j046O06K190L583M118L562K983L555N124O918Q859J0964J2223
60483F05943J1747J0535J0311J0802J0050P505M818L113J506o71k113j609l61
60470F71576m70j885k752k390k133k997m118m068k809j550j140j126k98J947M748
60455F50535O395O130N043M856O124Q208J0680J3786J7447K0714K2750K3950K5590
60442H22208K8458L2154L5569L7872L9042L9529L9361L7735L3689K7101J8789
60431A191507R670J66r468j8677k6648l2665l6331l7715l7455l6448l5212l3758
60419H96966l2210l1136l0849l0608k9191k6334k3087k0557j8778j7150j5514
60408F21552j4188j3308j2707j2343j2125j1438r690p471o272o667p549p628o821
$$ plain form
60497 544870 542304 541258 541864 544054 547637 551755 555317 558300 561855 566979 573897 582756 593720 605943
60483 605943 617690 628225 638536 649338 659388 666893 671711 674824 676330 675659 673546 671937 671576
60470 671576 671106 669221 666469 664079 661946 658949 654831 650763 647954 646404 645264 644138 643840 645787 650535
60455 650535 656930 663060 668103 672959 679083 687291 697971 711757 729204 749918 772668 796618 822208
60442 822208 850666 882820 918389 956261 995303 1034832 1074193 1111928 1145617 1172718 1191507
60431 1191507 1201177 1201343 1191875 1173198 1146550 1113885 1077554 1039839 1002384 965936 930724 896966
60419 896966 864756 833620 802771 772163 742972 716638 693551 672994 654216 637066 621552
60408 621552 607364 594056 581349 569006 556881 545443 535753 528282 522010 515343 507794 500166 493345
60395D93345n522l587j132M76k9j769k631k185k125l466m848m488k558p01Kl45
60379D58437j144j722j589j062j163k194k993k341n59J026J720J676J106L04K4
60364D49526P26J570J204n11k408l449l415k509j338r81j859k613j430J352L424
60349D37289L532K841K716K797K309J878K421L196K715J202L99R06J450J236J365
60334D68252K854M543M452K684J331J617K537K714K214J796J438Q65O70J527K712
60319E02206K985K824L950O237P087N017K283K067M149N402M294K638K557L609
60305E57305L946L076K080J720J570J112R03K152N188Q594J0254R499P888P523
60291F22810Q870J0695J1599J0951Q722N448K218k83k657n811r053j0453r332
$$ plain form
60395 493345 487823 484236 483104 483580 483551 481782 479151 476966 474841 471375 466527 462039 459481 458780 458782 458437
60379 458437 457293 455571 453982 452920 451757 449563 446570 444229 443670 444696 446416 448092 449198 449502 449526
60364 449526 450252 451822 453026 452515 450107 446658 443243 440734 439396 438415 436556 433943 432513 433865 437289
60349 437289 440821 443662 446378 449175 451484 453362 455783 458979 461694 462896 463295 464201 465651 466887 468252
60334 468252 471106 475649 480101 482785 484116 485733 488270 490984 493198 494994 496432 497297 497967 499494 502206
60319 502206 505191 508015 511965 518202 525289 530306 532589 534656 538805 544207 548501 551139 553696 557305
60305 557305 561251 564327 566407 568127 569697 570809 571712 573864 579052 587646 597900 607399 615287 622810
60291 622810 631680 642375 653974 664925 673647 679095 681313 681030 678373 672562 663509 653056 643724
60278F43724p254o042n860n823n529n125m674m173l832l686l444l119l182l611
60264E78370l502k297o00Q26K109L531M495M353L677L629M349N187O248Q523J2253
60249F31151J6171J8733J9516J9154J8396J7453J5823J2694P714J473m943j0606
60237G62729j4781j6918j7220j6856j6812j6730j5567j3289j1112j0089j0128
60226F03227j0448j0307r238p259n062l484k533j426K93K017K671J745k36k093
60212E57867k941k978l152l813m200l728l155l492m177l572j366P29J011k98j680
60197E21055k072j473m85J95J61l40o22l41J94N61O66O16O47J225K531L787L769
60180E30074K381J021J064K451M071M880M405K832J069J31J5j86q07j038l55M51
$$ plain form
60278 643724 636470 630428 624568 618745 613216 608091 603417 599244 595412 591726 588282 585163 581981 578370
60264 578370 574868 572571 571971 572797 574906 578437 582932 587285 590962 594591 598940 604127 610375 618898 631151
60249 631151 647322 666055 685571 704725 723121 740574 756397 769091 776805 778278 773335 762729
60237 762729 747948 731030 713810 696954 680142 663412 647845 634556 623444 613355 603227
60226 603227 592779 582472 573234 565975 560913 557429 554896 553470 553763 555780 558451 560196 559960 557867
60212 557867 554926 551948 548796 544983 540783 537055 533900 530408 526231 522659 521293 522022 523033 522735 521055
60197 521055 518983 517510 517025 517220 517381 517041 516419 516078 516272 516833 517499 518115 518762 519987 522518 526305 530074
60180 530074 532455 533476 534540 536991 541062 545942 550347 553179 554248 554379 554394 554208 553401 552363 552008 552459
60164E52459N35L65Q42J648J781J256J035J442J907K239K865L637L694K902K331
60149E80938K703L457M065N246P731J0417J1023Q770N479L825M891P488R421R243
60135F74697P247N057M197M810N783O014N391M524L755K708R73j016k233k310
60121G19597k157k849m140m710l901k556j842j895k116k317k845l714m422m810
60107F75323n459o822q182q068n803k462p4J56j229k704l245k887k170j487r61
60092F23926n13J26J143K174K593K367K197K518K930L033L182L696L872K779Q49
60077F56872m22l48L39Q66J418K296L110L361L186K980K864K957L465M095M131
60062F91170L614L583M365M671L386J455N92Q50J025R47J586K856L297K387J413
$$ plain form
60164 552459 552994 553359 554201 555849 557630 558886 559921 561363 563270 565509 568374 572011 575705 578607 580938
60149 580938 583641 587098 591163 596409 604140 614557 625580 634350 639829 643654 648545 656033 665454 674697
60135 674697 681944 687001 691198 696008 701791 707805 713196 717720 721475 724183 725156 724140 721907 719597
60121 719597 717440 714591 710451 705741 701840 699284 697442 695547 693431 691114 688269 684555 680133 675323
60107 675323 669864 663042 654860 646792 640989 638527 638453 638609 637380 634676 631431 628544 626374 624887 623926
60092 623926 623413 623539 624682 626856 629449 631816 634013 636531 639461 642494 645676 649372 653244 656023 656872
60077 656872 656450 656102 656441 657307 658725 661021 664131 667492 670678 673658 676522 679479 682944 687039 691170
60062 691170 694784 698367 702732 707403 710789 712244 712836 713686 714711 715658 717244 720100 723397 725784 727197
60047G27197J259R92k28j209k62K150L834L598K281J150M71k26j298k597l504
60032G33608l358k325j463j476j807j711j687k733m375m787l213j191o38j497
60018G01347k050j249R1M21p15k312l160l121k969l234l708m160m864n944o705
60003F57668o309m936l717l548m385n554o360o566o635p133p569o470l338J31
59989E85279J855J877J721J711P11j366k703j987p2J686L318N217O591O526N688
59974F16052N324N167M048K260J451K023K377J204q78k537l287l128j925j30P58
59959F28779l78k833m925n770n472m225k446j477k699n713q463r508r326r044
59945E56500q731p681n722l584k158j947k834l958m073k674o09Q34J250J089O39
$$ plain form
60047 727197 728456 729448 729220 728011 727749 729899 733733 737331 739612 740762 741233 741007 739709 737112 733608
60032 733608 730250 727925 726462 724986 723179 721468 719781 717048 712673 707886 704673 703482 702844 701347
60018 701347 699297 698048 698139 698560 697845 695533 692373 689252 686283 683049 679341 675181 670317 664373 657668
60003 657668 651359 646423 642706 639158 634773 629219 622859 616293 609658 602525 594956 588486 585148 585279
59989 585279 587134 589011 590732 592443 593154 591788 589085 587098 587026 588712 592030 597247 603838 610364 616052
59974 616052 621376 626543 630591 632851 634302 636325 638702 639906 639028 636491 633204 630076 628151 628021 628779
59959 628779 628401 625568 620643 614873 609401 605176 602730 601253 598554 592841 584378 574870 565544 556500
59945 556500 547769 540088 534366 530782 528624 526677 523843 519885 515812 513138 512529 513363 514613 515702 516341
59930E16341j35r48j255j099j112j414j293k81J148K433L701N048N659M624K322
59915E33739O1j491k584l138k362j39K053K415Q20j139k019j927j984k865m163
59900E15277m971m683l300j378P5K44n19p04N89K140J928L6j092J08K102K379
59884E08231R01j59M10J583K029J722J185N25r5r4O56J319J179O14M16P57J378
59867E22557K145K788K757K101J855K764M034M311L567L061L569M531N050M984
59853E70074M830M999N451N710N223L900K325J215Q27J021J565K079K105J664
59839F12988J382J579J670J016Q0j03O05J223Q92k89j563k059j132J106L573N198
59823F26166O078P040Q131Q522P903O976O196N072L339J877J514J570P08r72j835
$$ plain form
59930 516341 516206 515258 514003 512904 511792 510378 509085 508804 509952 512385 516086 521134 526793 531417 533739
59915 533739 533800 532309 529725 526587 524225 524086 526139 528554 529374 528235 526216 524289 522305 519440 515277
59900 515277 510306 505623 502323 500945 501020 501264 500745 500041 500630 502770 504698 504734 503642 503750 505852 508231
59884 508231 509132 508973 509383 510966 512995 514717 515902 516427 516332 516238 516894 518213 519392 520006 520422 521179 522557
59867 522557 524702 527490 530247 532348 534203 536967 541001 545312 548879 551940 555509 560040 565090 570074
59853 570074 574904 579903 585354 591064 596287 600187 602512 603727 604554 605575 607140 609219 611324 612988
59839 612988 614370 615949 617619 618635 618715 618612 619217 620440 621332 621043 619480 617421 616289 617395 620968 626166
59823 626166 632244 639284 647415 655937 663840 670816 677012 682084 685423 687300 688814 690384 691092 690120 688285
59808F88285q64R54J816J153O8L0J541L803N345N098L418K028K420M045M705L145
59792G26990P53j78M83O54q08k361k107p50q12l362o931r635j0978j1224j0411
59777F69323q744p141o404o331o282o129n947n278l671j789r73j489k000j311
59763F05834n0J49j045k022j291N18J447P77j97j95K91K5r45j422r23k57k40q13
59745E99641j641k488k805k078j039j367l388n047m312j834k5L9n83p71p20r81
59729E70601j371j513j599j924k236k185j934j765j362k35J309K264K088J309
59715E61447P43M50j81j321k047j051J824M996O330N077K532P87R75K619M367
59700E87547N111M560L230J973J337J250J315J368J572J991K383K644L139M149
$$ plain form
59808 688285 687421 688375 690191 691344 691412 691442 692983 696786 702131 707229 710647 712675 715095 719140 723845 726990
59792 726990 727743 727565 728048 728702 727894 725533 723426 722676 721864 718502 711571 701936 690958 679734 669323
59777 669323 660579 653438 647034 640703 634421 628292 622345 617067 613396 611607 610634 609145 607145 605834
59763 605834 605784 605933 604888 602866 601575 602093 603540 604317 604120 603925 604216 604241 603296 601874 600951 600694 600454 599641
59745 599641 598000 595512 592707 590629 589590 588223 584835 579788 575476 573642 573617 573656 573073 572302 571582 570601
59729 570601 569230 567717 566118 564194 561958 559773 557839 556074 554712 554477 555786 558050 560138 561447
59715 561447 562190 562640 562459 561138 559091 558040 559864 564860 571190 576267 578799 579586 580561 583180 587547
59700 587547 592658 597218 600448 602421 603758 605008 606323 607691 609263 611254 613637 616281 619420 623569
59686F23569N175N332M544L762L749M171M364M431M779M920L839J676J26N47K309
59671F77293L572L277J790J9j360j977j785j230r16r40q39m04j59p14j759k140
59655F71728j236N0J95r26j650p16P83P06j117k474j726Q7Q66J28r49j355r33
59638F61461J83J536K053J097k65l29Q72J556P30n83j045o62j97j36q89k837n210
59621F57335o019m334j808p30j263j900k049k469l393l878l363k482j835j137
59607F20675k16J44q72k954m987o017n473l253j94K101K680K187J824J836J677
59592F09158J198Q32P00M32j9j11N18J454J933J572N25p31j618j778j412j182
59576F11471j541k209k427j724m57N16O72L56K85O57R41N87l74j502k369k746
$$ plain form
59686 623569 628744 634076 638620 642382 646131 650302 654666 659097 663876 668796 672635 674311 674437 674984 677293
59671 677293 680865 684142 685932 685951 684591 682614 680829 679599 678683 677743 676904 676500 676341 675627 673868 671728
59655 671728 670492 670542 670737 669811 668161 667445 668228 668934 667817 665343 663617 663704 664570 664698 663749 662394 661461
59638 661461 661644 663180 665233 666330 666065 665736 666608 668164 668894 668311 667266 666604 666407 666271 665382 662545 657335
59621 657335 651316 646982 645174 644444 643181 641281 639232 636763 633370 629492 626129 623647 621812 620675
59607 620675 620459 620603 619731 616777 611790 605773 600300 597047 596853 598954 601634 603821 605645 607481 609158
59592 609158 610356 611188 611888 612320 612301 612190 612708 614162 616095 617667 618192 617461 615843 614065 612653 611471
59576 611471 609930 607721 605294 603570 603113 603629 604301 604657 604942 605599 606540 607127 606753 605251 602882 600136
59560F00136k794l204m536o194o642n213l062j666r66rJ098J281N50M06J615K843
59544E73643K507J102N34J533K886L125K021K89j257j936j351R7J222J198N26
59529E86139L87J021J442R41K58N00J315J161m18j863j643l49K47l12r27r94j196
59512E85709k002k735k779k619k905l264k933j922q11L9M23J34m24k05R99J873
59496E66578J405O12J057K263K369J126L38J114K450L174L722N073P142R273J1232
59481F18928J2853J3708J4171J5783J9082K1725K0454J4838P742J924k360o004
59469G52844q688r097p088m423l131l624m719n220n017m631m184l369k206j254
59455F86193q50o54k79mm27j645l139m378n239n884o500p082p329o841n609m189
$$ plain form
59560 600136 597342 594138 589602 583408 576766 571553 568491 566825 565859 565850 566948 568229 568779 569185 570800 573643
59544 573643 576150 577252 577786 579319 582205 585330 587351 587640 586383 584447 583096 583193 584415 585613 586139
59529 586139 586526 587547 588989 589930 590188 590688 592003 593164 592746 590883 589240 588891 589138 588826 587899 586905 585709
59512 585709 583707 580972 578193 575574 572669 569405 566472 564550 563739 563778 564201 564335 563911 563706 564705 566578
59496 566578 567983 568595 569652 571915 574284 575410 575748 576862 579312 582486 586208 591281 598423 607696 618928
59481 618928 631781 645489 659660 675443 694525 716250 736704 751542 759284 761208 758848 752844
59469 752844 744156 735059 727971 723548 720417 716793 712074 706854 701837 697206 693022 689653 687447 686193
59455 686193 685343 684689 684410 684406 683979 682334 679195 674817 669578 663694 657194 650112 642783 635942 630333 626144
59439F26144l269l201l891m788m928l599j399j50j013k927l605k145J5R68M90
59424E92702k02l49l65n97k80J428L790M944M216L037L065M205N203N490N363
59409F31650M832L595K081J288J445J997K898M583O276N990L109k13j349o1J912
59394F70033L257L933M339M813N599O390O360N524N427P266R830J0466P980L605
59380G54822n26k855k940j801j479k916m565m332k550j460j980k827k881k492
59366G19218j963o10J717L769M491M378M381M705N535P642J1163J4948J8271K2056
59352H19701K7056L1690L3203L0419K4123J5515N909k490p478q852q197o504l245
59339I50850J702O507Q577O711J542n588j3476k0925k6418k8510k6934k3383k0513
$$ plain form
59439 626144 622875 619674 615783 610995 606067 602468 601069 600919 599906 596979 593374 591229 591244 592212 592702
59424 592702 592500 592151 591786 591189 590909 592337 596127 601071 605287 608324 611389 615594 620797 626287 631650
59409 631650 636482 640077 642158 643446 644891 646888 649786 654369 660645 666635 669744 669531 668182 668121 670033
59394 670033 673290 677223 681562 686375 691974 698364 704724 710248 715675 722941 732771 743237 751217 754822
59380 754822 754296 751441 748501 746700 745221 742305 737740 733408 730858 729398 727418 724591 721710 719218
59366 719218 717255 716645 718362 722131 726622 731000 735381 740086 745621 753263 764426 779374 797645 819701
59352 819701 846757 878447 911650 942069 966192 981707 987616 985126 977648 968796 960599 954095 950850
59339 950850 952552 959059 967636 974347 975889 970301 956825 935900 909482 880972 854038 830655 810142
59326H10142j9578j9308j7718j4597j1573r927r285q550p229n566l963k786k283
59313F77779k273k166j544o29P1L92O31J103J696J984J828J759K497M062N656
59298F92846O588O938P157P402P564P635P679P742Q044Q894J0133J1157J1789
59285H01568J2573J3638J4054J3119J1748J1486J2389J3018J2400J0984R596Q561
59273I45134P995P828P188M847R14k823m927n983p388r188j0196r838q830p937
59259I06796p039n756m248k849j400N13K788M819O265P267P687O648L351j799
59245I23043p331j1866j4676j5400j4055j1638r845r584j0172j0400r839q649
59233G89588o836m475k265r80o62j048k321m511o504o842n443l478j621M22K560
$$ plain form
59326 810142 790564 771256 753538 738941 727368 717441 708156 699606 692377 686811 682848 680062 677779
59313 677779 675506 673340 671796 671167 671238 671630 672261 673364 675060 677044 678872 680631 683128 687190 692846
59298 692846 699434 706372 713529 720931 728495 736130 743809 751551 759595 768489 778622 789779 801568
59285 801568 814141 827779 841833 854952 866700 878186 890575 903593 915993 926977 936573 945134
59273 945134 953129 960957 968145 972992 973906 971083 966156 960173 952785 943597 933401 923563 914733 906796
59259 906796 899757 894001 889753 886904 885504 886017 888805 893624 899889 907156 914843 921491 924842 923043
59245 923043 915712 903846 889170 873770 859715 848077 838232 828648 818476 808076 798237 789588
59233 789588 782752 778277 776012 775032 774370 773322 771001 766490 759986 753144 747701 744223 742602 743024 745584
59218G45584L813L702L071K895L116L190L041K890K765K807L383M441N272N402
59204G95372N152M893M469L858L574L711L328J718l51j640k202l134m803o370
59190H07575p013o717n845m745l960m060m970n854n905m963l502k298j961k322
59176G43460k441j666m82J20j46q46j705k618k928j735O91K672K739J156n63j289
59160G34419j060o42p13j467k623l734m439m572m181l659l529l853m009l444k419
59145F90075j565r18n3R53J415J061M83L11N28R30J753L295N172O386O049L947
59129G19822P75j924k529p12J991L583L590L295L861M837M952M033L322L745M605
59114G57246M544L439K472K393K619K359J758J386J394J940L712O774R231Q673
$$ plain form
59218 745584 749397 753099 756170 759065 762181 765371 768412 771302 774067 776874 780257 784698 789970 795372
59204 795372 800524 805417 809886 813744 817318 821029 824357 826075 825724 824084 821882 818748 813945 807575
59190 807575 800562 793845 788000 783255 779295 775235 770265 764411 758506 753543 750041 747743 745782 743460
59176 743460 741019 739353 738871 738991 738845 737999 736294 733676 730748 729013 729704 732376 735115 736271 735708 734419
59160 734419 733359 732717 732004 730537 727914 724180 719741 715169 710988 707329 703800 699947 695938 692494 690075
59145 690075 688510 687592 687539 688492 689907 690968 691451 691762 692290 693220 694973 698268 703440 709826 715875 719822
59129 719822 720597 718673 716144 715432 717423 721006 724596 727891 731752 736589 741541 745574 748896 752641 757246
59114 757246 761790 765229 767701 770094 772713 775072 776830 778216 779610 781550 785262 792036 801267 809940
59100H09940N273K062J438K466K627J270k7j71j6p90k250l236l369l302l546l855
59084H04514l889l816l885l863l317k340j479j069r84j082j444k029k609l235
59070G69473m246n421n686m382k481j618k019k335j598k98Q45K063L656M829M654
59055G55436L729L531M245M624M291M623O512Q492Q546O986N929O174O265M961
59041H34344K990J655J046P03Q21J474J553J14j717j924n42L87n0m67K41R51K35
59024H41814j338k296k628l361m467m917m614m634n434o211o340o199o189n974
59010G77212n299m784n307o886q527q908p332m542k445k289l176l186j936j030
58996G11565j680l056l543k925k422l030m417n287m488j980J018K953L065J585
$$ plain form
59100 809940 815213 817275 818713 821179 823806 825076 825049 824878 824862 824072 821822 818586 815217 811915 808369 804514
59084 804514 800625 796809 792924 789061 785744 783404 781925 780856 779872 778790 777346 775317 772708 769473
59070 769473 765227 759806 754120 749738 747257 745639 743620 741285 739687 739389 740234 742297 745953 750782 755436
59055 755436 759165 762696 766941 771565 775856 780479 786991 795483 804029 811015 816944 823118 829383 834344
59041 834344 837334 838989 840035 840738 841559 843033 844586 844700 842983 841059 840517 840904 840854 840387 840628 841579 841814
59024 841814 840476 838180 835552 832191 827724 822807 818193 813559 808125 801914 795574 789375 783186 777212
59010 777212 771913 767129 761822 754936 746409 737501 730169 725627 723182 720893 717717 714531 712595 711565
58996 711565 709885 706829 703286 700361 697939 694909 690492 685205 680717 678737 679755 682708 685773 687358
58982F87358p15k641k802r01J330J652l3j673j764p30O36K420M441N467M949M293
58966G01287M956O237O530N987O121P185P870P603P322P604P720P176O785P305
58952G97688Q089Q060P212O258N348M122K681J618J146Q94N48K73M07J139K420
58937H47903L793M486M112L312L209M017M662M150K987K639L676N136N815N598
58923I05495N021M173K806J335P62J488K881M205N330O438P603Q948J0588J2162
58909I79235J3032J3170J3152J3031J2162J0599R660J0334J1906J3018J3324J3119
58897A125742J2102R857P175N461M877M159K445K49j488k507l267m546o874r704
58883A143681j1361j0736q788p512p706q860j0595j2625j3620j2252r694q935
$$ plain form
58982 687358 686643 684002 681200 680299 681629 683281 683248 681575 679811 679081 679717 682137 686578 692045 696994 701287
58966 701287 706243 712480 719010 724997 731118 738303 746173 753776 761098 768702 776422 783598 790383 797688
58952 797688 805777 813837 821049 827307 832655 836777 839458 841076 842222 843116 843664 843937 844344 845483 847903
58937 847903 851696 856182 860294 863606 866815 870832 875494 879644 882631 885270 888946 894082 899897 905495
58923 905495 910516 914689 917495 918830 919592 921080 923961 928166 933496 939934 947537 956485 967073 979235
58909 979235 992267 1005437 1018589 1031620 1043782 1054381 1064041 1074375 1086281 1099299 1112623 1125742
58897 1125742 1137844 1147701 1154876 1160337 1165214 1169373 1171818 1172067 1170579 1168072 1164805 1160259 1153385 1143681
58883 1143681 1132320 1121584 1112796 1105284 1097578 1088718 1078123 1065498 1051878 1039626 1029932 1020997
58871A020997j0707j2209j1063q600p369p090n585k790j078j579k589k277r90
58858I47071P8P66J288J113J0p06K87K018K239R01O97L419P187Q751P653O474
58842I89246P214R170J0756J1755J2716J3229J2330J0255Q541Q299R173J0131
58830A112815J0557J0548J0608J1116J1667J1316J0011R241J0319J2309J2885
58819A233392J1169Q507O372M789L178J424n50l127o105q346r112r066r366j0440
58805A212719j2158j4216j5684j5236j2851j0412r564r784r704r414r931j1031
58793A072734j1374j0648r957r951j0188j0584j1901j4064j5374j4338j1525q618
58781I34212o469m982m345n119p022q682q986q318q008q738r769r763q235n962
$$ plain form
58871 1020997 1010290 998081 987018 978418 971049 963959 958374 955584 954506 952927 950338 948061 947071
58858 947071 947149 947915 949203 950316 950326 949620 949907 951925 954164 955065 955762 959181 966368 975119 982772 989246
58842 989246 996460 1005630 1016386 1028141 1040857 1054086 1066416 1076671 1085212 1093511 1102684 1112815
58830 1112815 1123372 1133920 1144528 1155644 1167311 1178627 1188638 1197879 1208198 1220507 1233392
58819 1233392 1244561 1253068 1259440 1264229 1267407 1268831 1268281 1265154 1259049 1250703 1241591 1232525 1223159 1212719
58805 1212719 1200561 1186345 1170661 1155425 1142574 1132162 1122598 1112814 1103110 1093696 1083765 1072734
58793 1072734 1061360 1050712 1040755 1030804 1020616 1010032 998131 984067 968693 954355 942830 934212
58781 934212 927743 922761 918416 913297 906275 897593 888607 880289 872281 863543 853774 844011 835776 829814
58767H29814m080l055k729k845l088k803j369R46K983L784L491K913K467J923
58753H28352J170P26J135K046K492K247K287L327M413L855J405j389l037l378
58739H45651k907k073j649k642m891o769p077o477o169o107n682n262n530n908
58725G76508n276m003l615m450n170m733l366j516O15K171J966L87n53J76J161
58710G50302O27j259l031l839l692k868k149k751m826o780p200o583o065n317
58696F94569l447j245m91j093r86O97K192J790M19K67J698L075L310L238M146
58681G08139N820O751N982M215K866K446K323K094K366L667N224N819N661O212
58667G69585P929R293Q755O788N064M284L876L390L000K659K060J655K422M053
$$ plain form
58767 829814 825734 822679 819950 817105 814017 811214 809845 810791 813774 817558 821049 823962 826429 828352
58753 828352 829522 830248 831383 833429 835921 838168 840455 843782 848195 852050 853455 852066 849029 845651
58739 845651 842744 840671 839022 836380 831489 824720 817643 811166 804997 798890 793208 787946 782416 776508
58725 776508 771232 767229 763614 759164 753994 749261 745895 744379 744994 747165 749131 749518 748965 749141 750302
58710 750302 750929 749670 746639 742800 739108 736240 734091 731340 726514 719734 712534 705951 699886 694569
58696 694569 691122 689877 689386 688293 687307 688004 690196 691986 692405 692672 694370 697445 700755 703993 708139
58681 708139 713959 720710 726692 730907 733773 736219 738542 740636 743002 746669 751893 757712 763373 769585
58667 769585 777514 786807 795562 802350 807414 811698 815574 818964 821964 824623 826683 828338 830760 834813
58653H34813M717L640K835M603P903R130O700L066J372J744K085J353L23m19j504
58638H82361l591o327q846j0536j1157j0937j0660j0922j1262j0793r685r028
58626G68617r116r005q146p342p450q032q136p663p122o596n784m740l798l052
58612F72635k427j907j223R2J783K710K374J911K589L919M446L960L481L352K890
58597G00585K008J577J698J120p07k381k501j918k525m309n097l495p91N39l33
58582F83470j884k051m15J405J413o49k861l029r19J611K662K060R93N51J021
58567F83378K233L781M829M463K612L09j374k283k764k729j907o81J58N28J020
58552F91573J659J716J183J398L226N341N441L020m9j626j257l2P47O12K01O24
$$ plain form
58653 834813 839530 843170 846005 850608 858511 867641 874341 877407 878779 880523 882608 883961 884284 883865 882361
58638 882361 878770 872443 863597 853061 841904 830967 820307 809385 798123 787330 777645 768617
58626 768617 759501 750496 742350 735008 727558 719526 711390 703727 696605 690009 684225 679485 675687 672635
58612 672635 670208 668301 667078 667170 668953 671663 674037 675948 678537 682456 686902 690862 694343 697695 700585
58597 700585 702593 704170 705868 706988 706281 703900 701399 699481 696956 692647 687550 684055 683264 683803 683470
58582 683470 681586 679535 679120 680525 681938 681289 678428 675399 674480 676091 678753 680813 681806 682357 683378
58567 683378 685611 689392 694221 698684 701296 701605 700231 697948 695184 692455 690548 689867 690025 690553 691573
58552 691573 693232 694948 696131 697529 700755 706096 711537 714557 714508 712882 711625 711593 712340 712952 713153 713777
58536G13777K109L459L422K380J837K286K597J761K77p30q68k90J122L495O178
58521G42812Q130R075R641J0305J0690J0211R071Q290Q665R816J0527J0207R734
58508H67174J0372J1988J3087J2771J1985J2350J4243J6619J8371J9270J9760
58497A027990K0348K1123K1494K0560J8167J5415J3573J2575J1154Q524N347K798
58485A199068J214Nj392l037m808o674q431r495r484q973r231j0923j3332j5152
58471A099355j5779j5445j4450j3014j1788j1542j2035j1997j0743r131q314q138
58459I56979p562o198m529k958j646j113j877l372m260m093l784m062m409m135
58445I02981l602l561l858l788l233k456j127J204L636M292K679O40J65J101J979
$$ plain form
58536 713777 715886 719345 722767 725147 726984 729270 731867 733628 733905 733175 732307 732017 733139 736634 742812
58521 742812 750942 760017 769658 779963 790653 800864 809935 818225 826890 836706 847233 857440 867174
58508 867174 877546 889534 902621 915392 927377 939727 953970 970589 988960 1008230 1027990
58497 1027990 1048338 1069461 1090955 1111515 1129682 1145097 1158670 1171245 1182399 1190923 1196270 1199068
58485 1199068 1200282 1200287 1198895 1195858 1191050 1184376 1175945 1166450 1156966 1147993 1138762 1127839 1114507 1099355
58471 1099355 1083576 1068131 1053681 1040667 1028879 1017337 1005302 993305 982562 973431 965117 956979
58459 956979 949417 943219 938690 935732 934086 932973 931096 927724 923464 919371 915587 911525 907116 902981
58445 902981 899379 895818 891960 888172 884939 882483 881356 882560 886196 890488 893167 893807 893972 895073 897052
58430H97052K402L240M640N372M611L208K432K372K502L017M444O293P442P833
58416I56860Q565J0122J1638J2247J2046J1157R114O046L494K862L626M149L724
58403A055650K805J681L07q31r82l52J34L57J201L027N046O519P476Q045Q063
58388A098146P703P307O346L832K71k221k566k151k652l748m228m073l837k971
58374A095158p84J590K193J129N52J607L215M221M975N992O665O424O109O974
58360A146020Q904J0604J1161J0705R814Q879P864O328L875R27j310j931j215
58347A220625l39n11k246m898o850o821n175l434k487j940j121J06J605L074L850
58332A193438L649L586N055P316P875N999M101M362N558N100L001J568J735J999
$$ plain form
58430 897052 899454 902694 907334 912706 917317 920525 922957 925329 927831 930848 935292 941585 949027 956860
58416 956860 965425 975547 987185 999432 1011478 1022635 1031749 1037795 1041289 1044151 1047777 1051926 1055650
58403 1055650 1058455 1060136 1060443 1059612 1058630 1058278 1058412 1058769 1059970 1062997 1068043 1074562 1082038 1090083 1098146
58388 1098146 1105849 1113156 1119502 1123334 1123605 1121384 1118818 1116667 1114015 1110267 1106039 1101966 1098129 1095158
58374 1095158 1094374 1095964 1098157 1099286 1099838 1101445 1104660 1108881 1113856 1119848 1126513 1132937 1139046 1146020
58360 1146020 1154924 1165528 1176689 1187394 1197208 1206087 1213951 1220279 1224154 1225081 1223771 1221840 1220625
58347 1220625 1220286 1219775 1217529 1212631 1205781 1198960 1193785 1190351 1187864 1185924 1184803 1184909 1186514 1189588 1193438
58332 1193438 1197087 1200673 1205728 1213044 1220919 1226918 1231019 1235381 1240939 1246039 1249040 1250608 1252343 1254342
58318A254342J212K46K21P43R68J215K409M471O299P084P041O949P427Q692J0584
58303A319903J2642J4183J4644J4144J3658J4108J5231J5889J5657J5289J5309
58292A480657J5180J4571J4372J5241J5993J4885J2165R829R017R097R331R931
58280A630269J1080J2282J3304J4646J6445J7842J8164J7989J8391J9607K1024
58269A811043K2068K2680K3194K3988K4995K5551K5180K4425K4209K4512K4479
58258B076324K3809K3147K2909K2747K2432K2344K2663K2981K3116K3528K4487
58247B330487K5602K6608K7879K9622L1351L2642L3761L5032L6194L6905L7314
58236B683397L7736L8303L9289M1061M3272M4902M5535M5928M6800M7891M8831
$$ plain form
58318 1254342 1255554 1255800 1256021 1256764 1257732 1258947 1261356 1265827 1272126 1279210 1286251 1293200 1300627 1309319 1319903
58303 1319903 1332545 1346728 1361372 1375516 1389174 1403282 1418513 1434402 1450059 1465348 1480657
58292 1480657 1495837 1510408 1524780 1540021 1556014 1570899 1583064 1592893 1601910 1611007 1620338 1630269
58280 1630269 1641349 1653631 1666935 1681581 1698026 1715868 1734032 1752021 1770412 1790019 1811043
58269 1811043 1833111 1855791 1878985 1902973 1927968 1953519 1978699 2003124 2027333 2051845 2076324
58258 2076324 2100133 2123280 2146189 2168936 2191368 2213712 2236375 2259356 2282472 2306000 2330487
58247 2330487 2356089 2382697 2410576 2440198 2471549 2504191 2537952 2572984 2609178 2646083 2683397
58236 2683397 2721133 2759436 2798725 2839786 2883058 2927960 2973495 3019423 3066223 3114114 3162945
58225C162945N0060N2127N4643N6878N8984O1831O5794P0260P4205P6976P8768
58214C863471Q0645Q3708Q8026R2710R7049J01099J05104J09136J13408J18246
58204D852602J23551J29061J35107J42165J49633J56226J61826J67780J75074
58195F193025J83561J93320K05086K18523K31615K42989K53772K66080K80582
58186H268553K96525L13116L29830L46279L62970L81502M03043M27096M52396
58177A1581310M78281N04673N31832N60973N94113O32403O75248P21463P70443
58168A7050739Q21903Q75909R33526R96122J063689J135413J211960J295149J385317
58159B6769727J481570J584899J697830J820359J949964K087334K238417K409070
$$ plain form
58225 3162945 3213005 3265132 3319775 3376653 3435637 3497468 3563262 3633522 3707727 3784703 3863471
58214 3863471 3944116 4027824 4115850 4208560 4305609 4406708 4511812 4620948 4734356 4852602
58204 4852602 4976153 5105214 5240321 5382486 5532119 5688345 5850171 6017951 6193025
58195 6193025 6376586 6569906 6774992 6993515 7225130 7468119 7721891 7987971 8268553
58186 8268553 8565078 8878194 9208024 9554303 9917273 10298775 10701818 11128914 11581310
58177 11581310 12059591 12564264 13096096 13657069 14251182 14883585 15558833 16280296 17050739
58168 17050739 17872642 18748551 19682077 20678199 21741888 22877301 24089261 25384410 26769727
58159 26769727 28251297 29836196 31534026 33354385 35304349 37391683 39630100 42039170
58151D2039170K601686K819289L068526L355136L680829M049024M470264M957550
58143G1041474N519390O161627O893286P728657Q691144R819968J1159830J2722897
58135A39738273J4455181J6249657J7999112J9639840K1157645K2563174K3837121
58128B75640003K4837419K5210752K4408124K1864951J7279477J0833062L220120
58121D03293908m542308j1443894j6791277k0346868k2255631k2859606k2539170
58114B82515154k1636018k0424396j9095304j7758077j6464885j5238021j4082805
58107A57815648j2993684j1963634j0990089j0071233r202079q378552p602159
58100H6614218o877017o205057n587089n025625m522952m077666l685179l340086
$$ plain form
58151 42039170 44640856 47460145 50528671 53883807 57564636 61613660 66083924 71041474
58143 71041474 76560864 82722491 89615777 97344434 106035578 115855546 127015376 139738273
58135 139738273 154193454 170443111 188442223 208082063 229239708 251802882 275640003
58128 275640003 300477422 325688174 350096298 371961249 389240726 400073788 403293908
58121 403293908 398751600 387307706 370516429 350169561 327913930 305054324 282515154
58114 282515154 260879136 240454740 221359436 203601359 187136474 171898453 157815648
58107 157815648 144821964 132858330 121868241 111797008 102594929 94216377 86614218
58100 86614218 79737201 73532144 67945055 62919430 58396478 54318812 50633633 47293547
58092D7293547l036596k768799k532407k324708k142005j979258j833068j702258
58084B8974448j584484j475397j372749j278185j192885j114365j039982r70935
58076A8945466r09788q55993q06682p60451p17578o77604o39222o02050n66574
58067A2409524n32957n01446m73029m48104m25307m03247l82434l64114l48104
58058H530782l33223l18959l05215k91508k77822k65343k54760k44761k33756
58049F005435k22226k11866k03129j95302j88267j82481j77531j72312j66560
58040D285761j60995j56127j51801j47594j42722j36067j27344j17926j09680
58031C035505j03248r7988r2962q7459q1401p5863p2320p0672o9003o5974o2286
$$ plain form
58092 47293547 44256951 41488152 38955745 36631037 34489032 32509774 30676706 28974448
58084 28974448 27389964 25914567 24541818 23263633 22070748 20956383 19916401 18945466
58076 18945466 18035678 17179685 16373003 15612552 14894974 14217370 13578148 12976098 12409524
58067 12409524 11876567 11375121 10902092 10453988 10028681 9625434 9243000 8878886 8530782
58058 8530782 8197559 7878600 7573385 7281877 7004055 6738712 6483952 6239191 6005435
58049 6005435 5783209 5571343 5368214 5172912 4984645 4802164 4624633 4452321 4285761
58040 4285761 4124766 3968639 3816838 3669244 3526522 3390455 3263111 3145185 3035505
58031 3035505 2932257 2834269 2741307 2653848 2572447 2496584 2424264 2353592 2284589 2218615 2156329
58020B156329n9139n6545n4164n2299n0885m8861m5952m3635m2844m2124l9855
58009A620026l6970l5355l4691l3197l0724k8753k7705k6578k5096k4055k3567
57998A293335k2897k2067k1727k1464k0254j8655j8413j9510j9709j7636j4608
57987A076395j2581j1923j2011j2495j2952j2500j0879r149q484q862r520j0091
57975I44948j0728j1540j2324j2585j1917j0848j0859j2702j5005j5774j4913
57964H05753j3862j3051j1570r678r391j1555j3996j4077j1970r944r277r360
57952F68022r476r761j0203r943q377o442o023p793j0021j0190p822n071m073
57939E62827m553m853m547m651n554o429o817p256p787p335n424l358k591k763
$$ plain form
58020 2156329 2097190 2040645 1986481 1934182 1883297 1834436 1788484 1744849 1702005 1659881 1620026
58009 1620026 1583056 1547701 1513010 1479813 1449089 1420336 1392631 1366053 1340957 1316902 1293335
57998 1293335 1270438 1248371 1226644 1205180 1184926 1166271 1147858 1128348 1108639 1091003 1076395
57987 1076395 1063814 1051891 1039880 1027385 1014433 1001933 991054 981905 973421 964559 955039 944948
57975 944948 934220 922680 910356 897771 885854 875006 864147 851445 836440 820666 805753
57964 805753 791891 778840 767270 757592 748201 736646 722650 708573 696603 686659 677382 668022
57952 668022 658546 648785 638582 628639 620262 613820 607797 600004 589983 579793 571971 566900 562827
57939 562827 558274 553421 548874 544223 538669 532240 525423 518167 510380 503045 497621 494263 491672 488909
57925D88909k420j108K47P57M85K4j64l3j4o98k151l674m512m509l934k971j786
57908D62448q28o22j241k121k402j586j6J332J756J266J0k119m699o229n464l207
57892D36278j633j814k855l480l316k456j033K35K82p84j345k79J482K291K013
57877D23586J989L137M936O159O040M855L658L279L359K838J437L2p22j286k295
57862D61002l379l681l086k340k209k931m111m900m764m225m224m640m343l096
57848D09073k114k136k224j462p30j257k395k524j805k110m093o004n964m162
57834C70093k162j006q47j669l417n545p138p467o231l409O10M668P068O740M331
57819C54619J721J42q70k190l305k917j114L72M51q8l02p05k013l421l536k419
$$ plain form
57925 488909 486489 485381 485628 486385 486870 486894 486730 486697 486683 485985 483834 480160 475648 471139 467205 464234 462448
57908 462448 461620 460998 459757 457636 455234 453648 453632 454964 456720 457986 457996 455877 451178 444949 439485 436278
57892 436278 434645 432831 429976 426496 423180 420724 419691 419926 420208 419424 418079 417800 419282 421573 423586
57877 423586 425575 428712 433648 439807 445847 450702 454360 457639 460998 463836 465273 465305 464583 463297 461002
57862 461002 457623 453942 450856 448516 446307 443376 439265 434365 429601 425376 421152 416512 412169 409073
57848 409073 406959 404823 402599 401137 400407 399150 396755 394231 392426 390316 386223 380219 374255 370093
57834 370093 367931 366925 366078 364409 360992 355447 348309 340842 334611 331202 331812 336480 343548 350288 354619
57819 354619 356340 356482 355612 353422 350117 347200 346086 346458 346909 346821 346519 345814 343801 340380 336844 334425
57803C34425j263n22K34R03Q64L71M52J137J254M15j08P38K049K094N41j220j782
57786C40582j152n21r36k193l083k966k734l649n385o154m906k663j254j346k090
57771B99550k334j828j315j595k368k379j038N72R47P4q04j104j397k097k852
57756B80032l440m085m585m352l631l380l503k625n29P40n53l307n077n159m589
57741B31957l868k565r90k29k73J82J537K333J340n10j259k12J667L084L283K135
57725B37612L31p38j52J423K386K085J428J453J945K055J861K446M177N619M896
57710B68827J941j281k899k760j825q05o5k01j576l388m193l611k779k774l245
57695B39366l141k333j826k379l429l520j763J139L327L461K025Q16J058K303
$$ plain form
57803 334425 333162 332640 332874 333777 334641 335012 335464 336601 337855 338270 338162 338900 340949 343043 343584 342364 340582
57786 340582 339430 338909 337973 335780 332697 329731 326997 323348 317963 311809 306903 304240 302986 301640 299550
57771 299550 297216 295388 294073 292478 290110 287731 286693 287265 288212 288286 287482 286378 284981 282884 280032
57756 280032 276592 272507 267922 263570 259939 256559 253056 250431 249902 250642 250089 246782 241705 236546 231957
57741 231957 228089 225524 224534 224305 224032 224214 225751 228084 229424 228914 227655 227443 229110 232194 235477 237612
57725 237612 237943 237205 237053 238476 240862 242947 244375 245828 247773 249828 251689 254135 258312 263931 268827
57710 268827 270768 269487 266588 263828 262003 261198 261133 260932 259356 255968 251775 248164 245385 242611 239366
57695 239366 236225 233892 232066 229687 226258 222738 220975 222114 225441 228902 230927 231743 232801 235104
57681B35104L235L155K410J691J423J655K067K004R45q43k253k217o28J511K801
57666B52060K483R93m80j165j417k010k886l160k441j540j320j450j058l40m93
57651B35776j915l537m396m925n849o590n989m176k432j196K64J923K260M65j764
57636A97919k102p01J08q96k266k147q45j53q14j689j466k71P81J132J280J885
57620A89755K868L761M498N420O659Q144J0112J2813J5557J6981J6941J7354K0149
57607C31012K4712K8253K8453K4874J8108Q988j047j0038j6729k1089k3339k3287
57595C68871k1256j8704j7062j6379j5873j5226j4549j3514j1618r209p304o224
57583B01953n233l692j946p98n93j096j881k650l342l997m387l947k520r46l70
$$ plain form
57681 235104 238339 241494 243904 245595 247018 248673 250740 252744 253689 252846 250593 248376 247748 249259 252060
57666 252060 254543 255536 255056 253891 252474 250464 247578 244418 241977 240437 239117 237667 236609 236269 235776
57651 235776 233861 230324 225928 221003 215154 208564 202575 198399 195967 194771 195035 196958 199218 199683 197919
57636 197919 195817 195116 195224 194328 192062 189915 189070 188917 188103 186414 184948 184677 185458 186590 187870 189755
57620 189755 192623 196384 200882 206302 212961 221105 231217 244030 259587 276568 293509 310863 331012
57607 331012 355724 383977 412430 437304 455412 464400 463353 453315 436586 415497 392158 368871
57595 368871 347615 328911 311849 295470 279597 264371 249822 236308 224690 215481 208177 201953
57583 201953 196720 193028 191082 190284 189691 188595 186714 184064 180722 176725 172338 168391 165871 164925 164555
57568A64555q57j350j137p19q95j466j455m72O14N42r44k649k971j535L64J077
57552A50702K25j249k387k996l259l241l060l007l136l069k449j337n5R72J103
57537A23757j57k267l737l735l145l338m226m463l491k399k383l194l698l441
57523H0083k928k578k197j609j170j211j358r08J19P81L18q83j727j701j409j688
57507E9934k532l112k785j812r60n47j50N50J041N08p94j424m07J402K201J280
57491E2393m70j846k307j735k70J246J534K69j368k059j708r12J47J321J699N40
57475D6474j190j650o90j99j291k460j641P34K153J229q31k093k123j768j516
57460C3138j057j97N22L25q58k188k557j567m6N77l43j929k725k251j343r51j136
$$ plain form
57568 164555 163698 162348 161211 160492 159597 158131 156676 156204 156818 157360 156416 153767 150796 149261 149625 150702
57552 150702 150927 149678 147291 144295 141036 137795 134735 131728 128592 125523 123074 121737 121682 122654 123757
57537 123757 123600 121333 117596 113861 110716 107378 103152 98689 95198 92799 90416 87222 83524 80083
57523 80083 77155 74577 72380 70771 69601 68390 67032 66124 66243 67024 67342 66459 64732 63031 61622 59934
57507 59934 57402 54290 51505 49693 48733 48186 48036 48586 49627 50135 49341 47917 47510 48912 51113 52393
57491 52393 51923 50077 47770 46035 45765 47011 48545 48814 47446 45387 43679 42767 42914 44235 45934 46474
57475 46474 45284 43634 42944 42745 41454 38994 37353 38087 40240 41469 40638 38545 36422 34654 33138
57460 33138 32081 31884 32406 32731 31873 29685 27128 25561 25515 26092 25749 23820 21095 18844 17501 16550 15414
57443A5414j391j462j404j252j168j630k787F10b497j040P86P53j054l301m916
57428a1269n626n441m437l004j703q12l52m55j160j809j412R6J425J255k46j748
57412c6698k354k360k350k255j675p49q9O0j1j58n83j116r92R7J224J237K99l28
57394d8801P2J083K093K869L073K212N01r84j556j587j568j334p57l58m28l30
57378d5800L76Q65L06m03L56K377L593K765R28k32l50j29k1P1K44L74K32k57p43
57359c5448m96O68J754J555K15j049j711k267k768k393j032O7O6k26N2J34r44
57342d3823k127j455Q18K125R89j099j888j176k98J39O59J420J727J237O01M36
57326d1715L56l87j742k869l104k394j085J67M87m29j597j629n26K89p4r15j413
$$ plain form
57443 15414 14023 12561 11157 9905 8737 7107 4320 610 -2497 -3537 -2751 -1998 -3052 -6353 -11269
57428 -11269 -16895 -22336 -26773 -29777 -31480 -32292 -32644 -33099 -34259 -36068 -37480 -37384 -35959 -34704 -34950 -36698
57412 -36698 -39052 -41412 -43762 -46017 -47692 -48441 -48530 -48470 -48481 -48639 -49222 -50338 -51330 -51233 -50009 -48772 -48473 -48801
57394 -48801 -48729 -47646 -45553 -42684 -39611 -37399 -36898 -37882 -39438 -41025 -42593 -43927 -44684 -45042 -45470 -45800
57378 -45800 -45424 -44559 -44253 -44656 -44300 -41923 -38330 -35565 -34637 -34869 -35219 -35348 -35369 -35298 -35054 -34680 -34448 -34705 -35448
57359 -35448 -35944 -35276 -33522 -31967 -31752 -32801 -34512 -36779 -39547 -41940 -42972 -42905 -42839 -43065 -43013 -42879 -43823
57342 -43823 -45950 -47405 -46587 -44462 -43473 -44572 -46460 -47636 -47934 -47795 -47136 -45716 -43989 -42752 -42151 -41715
57326 -41715 -41359 -41746 -43488 -46357 -49461 -51855 -52940 -52773 -52286 -52715 -54312 -55941 -56467 -56178 -56252 -57167 -58580
57309e8580j900k678k658q40J388J375j213l633l424j100J163K172K096J377M68
57294f5987K6K00J94n81j356r06O36J826J635M44o69r88o19l65j002k310k983
57277g2805k039%J661J968R95n54j719j684m96R02J814K471L109L092K031J107
57261f0147J894M016N357M793L484L080L710M430M751M926N201N600b672D636
57246A3461J0447J1661J1910J0867Q730O217M118K907K644K974L370L645M125
57233I7076N088O133O537O145N538N302N464N580N174M159L019K413K382K326
57219A62336J947J675J716J468N69j85j09k46k141n107o349m316n76K295L475
57204A56452L741L711L505L576M504N946O711O056M456L126L255N405Q977J2191
$$ plain form
57309 -58580 -60480 -63158 -65816 -66656 -65268 -63893 -65106 -68739 -72163 -73263 -72100 -69928 -67832 -66455 -65987
57294 -65987 -65961 -65761 -65567 -66148 -67504 -68410 -67774 -65948 -64313 -63869 -64538 -65526 -66145 -66510 -67512 -69822 -72805
57277 -72805 -74844 -74844 -73183 -71215 -70220 -70774 -72493 -74177 -74673 -73771 -71957 -69486 -66377 -63285 -61254 -60147
57261 -60147 -58253 -54237 -48880 -44087 -40603 -37523 -33813 -29383 -24632 -19706 -14505 -8905 -2672 4636
57246 13461 23908 35569 47479 58346 67076 73293 77411 80318 82962 85936 89306 92951 97076
57233 97076 102164 108297 114834 120979 126517 131819 137283 142863 148037 152196 155215 157628 160010 162336
57219 162336 164283 165958 167674 169142 169711 169526 169417 169171 167030 161923 155574 151258 150682 152977 156452
57204 156452 160193 163904 167409 170985 175489 181435 188146 194202 198658 201784 205039 210444 219421 231612
57190B31612J3340J2391J0992J0522J0562R734P898O801Q168J1557J4773J6211
57178C64561J6161J5733J5418J5234J5460J6325J7326J7709J7501J7444J8095
57167E46967J9605K1947K4410K5275K3369J9923J7649J7662J8461J8242J6906
57156G70416J5177J3163J0967R724J0677J3479J6431J8266J9027J9517K0594K2790
57144I60228K5833K8629L0245L0747L0696L0338K9940L0401L2400L5000L6206
57133A300663L5270L3688L3401L4478L5207L4267L2336L1285L1950L3152L3141
57122A668838L1691L0120K9301K8625K7347K6161K6413K8035K9304K8721K6434
57111A980990K3567K0851J8306J5763J3150J0328P196M100J794O05k48k001m812
$$ plain form
57190 231612 244952 257343 268335 278857 289419 299153 307051 313852 322020 333577 348350 364561
57178 364561 380722 396455 411873 427107 442567 458892 476218 493927 511428 528872 546967
57167 546967 566572 588519 612929 638204 661573 681496 699145 716807 735268 753510 770416
57156 770416 785593 798756 809723 819447 830124 843603 860034 878300 897327 916844 937438 960228
57144 960228 986061 1014690 1044935 1075682 1106378 1136716 1166656 1197057 1229457 1264457 1300663
57133 1300663 1335933 1369621 1403022 1437500 1472707 1506974 1539310 1570595 1602545 1635697 1668838
57122 1668838 1700529 1730649 1759950 1788575 1815922 1842083 1868496 1896531 1925835 1954556 1980990
57111 1980990 2004557 2025408 2043714 2059477 2072627 2082955 2090151 2094251 2096045 2096650 2096402 2094401 2089589
57098B089589p446r058j0764j4405j9797k4348k5872k4850k3354k2694k3034k4457
57086A859510k6979k9714l1422l2276l4180l8869m6269n4982o3795p2287q0549
57075A348188q8881r7565j06544j15459j24363j34161j45883j59601j74492A1082
57064a96186k26637k47837k69613k91569l14979l41600l72238m06813m45383m88406
57054c601261n36287n89408o48482p14270p87031q67124r56288j057568j173653
57045a0931372j305853j454892j622057j809345k019137k254031k516484k808364
57037b6721535l131051l485429l870753m283833m720711n178533n652722o131015
57029f3175582o592398p013429p372446p642955p782827p735148p446345o890697
$$ plain form
57098 2089589 2082143 2073085 2062321 2047916 2028119 2003771 1977899 1953049 1929695 1907001 1883967 1859510
57086 1859510 1832531 1802817 1771395 1739119 1704939 1666070 1619801 1564819 1501024 1428737 1348188
57075 1348188 1259307 1161742 1055198 939739 815376 681215 535332 375731 201239 11082
57064 -196186 -422823 -670660 -940273 -1231842 -1546821 -1888421 -2260659 -2667472 -3112855 -3601261
57054 -3601261 -4137548 -4726956 -5375438 -6089708 -6876739 -7743863 -8700151 -9757719 -10931372
57045 -10931372 -12237225 -13692117 -15314174 -17123519 -19142656 -21396687 -23913171 -26721535
57037 -26721535 -29852586 -33338015 -37208768 -41492601 -46213312 -51391845 -57044567 -63175582
57029 -63175582 -69767980 -76781409 -84153855 -91796810 -99579637 -107314785 -114761130 -121651827
57021a21651827o085622n089200l980254k829352j676266n27900O23988J781056
57013a39435377K927789M033638N060630N971193O734986P333034P757412Q008177
57005i1608518Q091333Q018711P807566P478941P056138O564074O028282N472912
56997c5090561M918927M383631L880808L420204L006483K639222K314903K029622
56989h496761J780393J564285J377216J214340J071706e41733B97466P46541O67011
56980A711018N98468N39366M88866M45902M07634L69253L26528K79103K30999
56971E397137J87514J51816J23976J02140Q3977O7842N3538M1926L3458K7232
56961F270556K1687J5731Q783M44q985j8018k5084l0391l5906m3102n1352n8990
$$ plain form
57021 -121651827 -127737449 -132826649 -136806903 -139636255 -141312521 -141840421 -141216433 -139435377
57013 -139435377 -136507588 -132473950 -127413320 -121442127 -114707141 -107374107 -99616695 -91608518
57005 -91608518 -83517185 -75498474 -67690908 -60211967 -53155829 -46591755 -40563473 -35090561
56997 -35090561 -30171634 -25788003 -21907195 -18486991 -15480508 -12841286 -10526383 -8496761
56989 -8496761 -6716368 -5152083 -3774867 -2560527 -1488821 -541733 297466 1044007 1711018
56980 1711018 2309486 2848852 3337718 3783620 4191254 4560507 4887035 5166138 5397137
56971 5397137 5584651 5736467 5860443 5962583 6046560 6114402 6167940 6209866 6243324 6270556
56961 6270556 6292243 6307974 6316757 6317201 6308216 6290198 6265114 6234723 6198817 6155715 6104363 6045373
56949F045373o5459p1637p8322q5307r2117r8917j06035j13167j19897j26875
56939E087640j35466j46018j57288j67969j77991j87707j96570k03529k08198
56930C506904k10513k09547k03975j94110j82365j71194j61134j51389j41590
56921A881087j32304j23934j15901j07234r7903q9230q2552p7439p1928o4928
56911I17734n7650n1893m7638m3546l9344l6038l3699l0791k6337k1294j6946
56900E12558j3253r761o936n342m439l691m067o845j1144j4337j5050j4478j4449
56887C88766j5310j6203j6423j5836j4560j2720j0347p367m013j099P37K043M079
56874B81747P135J0007J1478J1670J1464J1154J0189P926M179p54o085j0594j3174
$$ plain form
56949 6045373 5979914 5908277 5829955 5744648 5652531 5553614 5447579 5334412 5214515 5087640
56939 5087640 4952174 4806156 4648868 4480899 4302908 4115201 3918631 3715102 3506904
56930 3506904 3296391 3086844 2882869 2688759 2506394 2335200 2174066 2022677 1881087
56921 1881087 1748783 1624849 1508948 1401714 1303811 1214581 1132029 1054590 982662 917734
56911 917734 860084 808191 760553 717007 677663 641625 607926 577135 550798 529504 512558
56900 512558 499305 489544 482608 477266 472827 469136 465069 458224 447080 432743 417693 403215 388766
56887 388766 373456 357253 340830 324994 310434 297714 287367 280000 275987 274888 275625 277668 281747
56874 281747 288882 298889 310367 322037 333501 344655 354844 362770 366949 366195 360110 349516 336342
56861C36342j3604j2701j1668j1120j0701r755q459p957q914j0248j0059p939
56849B13217n577m678m962m853l654k289j952k746l681l497j477J865M738N308
56835A85762L458J000j34N05K257M643P531J0455J2706J4153J5195J5865J5824
56822B89220J5335J5189J5227J3999J0871P577O437P424Q325P723O588O686Q469
56809D19070J1019J3206J4451J4965J5666J7304J9508K1295K2608K4333K6414
56798F19839K7088K4772J9881J4003P993J930l671p812j0028j0606r951q468o763
56785F58207n111k906N60M959R322J3351J7360K1273K4687K7896L1598L5433L7796
56772H74425L7294L3498K6356J6084M049p458j6907k4042k8503k9453k7409k4954
$$ plain form
56861 336342 322738 310037 298369 287249 276548 266793 258334 250377 241463 231215 221156 213217
56849 213217 207640 202962 198000 193147 189493 187204 185252 182506 178825 175328 173851 175716 180454 185762
56835 185762 189220 190220 190086 190591 192848 197491 205022 215477 228183 242336 257531 273396 289220
56822 289220 304555 319744 334971 348970 359841 367418 373855 381279 389604 397327 403915 410601 419070
56809 419070 430089 443295 457746 472711 488377 505681 525189 546484 569092 593425 619839
56798 619839 646927 671699 691580 705583 713576 715506 711835 704023 693995 683389 673438 664970 658207
56785 658207 653096 650190 650750 655709 665031 678382 695742 717015 741702 769598 801196 836629 874425
56772 874425 911719 945217 971573 987657 991706 984248 967341 943299 914796 885343 857934 832980
56760H32980k4114k3803k1422j6458j1045p067m230j179K703P129J1591J5664
56748G60749J9045K1562K2683K1112J5735P205k078r888j5624j9708k2494k4183
56736G74116k5110k5281k4143k1533j8482j6332j5220j4166j2572j0745q954o749
56724E74829l639J14L729O448P558O433L205r54m765q015j1254j4465j6819j7814
56710E24591j7986j8059j7921j7005j5393j3899j3063j2633j2054j1084r785q398
56698C57311p448p517q476r208q603o776n006m442n162o301o734n765l731j954
56684B70188j593k318k732k220j740k247l126l090k141j535j752j749o24R15J471
56669B45707P32l80j020j112r39o10jJ026K299L062K466O95q18q96j8M41J02j42
$$ plain form
56760 832980 808866 785063 763641 747183 736138 729071 724841 723662 726365 733494 745085 760749
56748 760749 779794 801356 824039 845151 860886 868091 866013 856125 840501 820793 798299 774116
56736 774116 749006 723725 699582 678049 659567 643235 628015 613849 601277 590532 581578 574829
56724 574829 571190 571304 575033 581481 589039 595472 598677 597723 592958 584943 573689 559224 542405 524591
56710 524591 506605 488546 470625 453620 438227 424328 411265 398632 386578 375494 365709 357311
56698 357311 349863 342346 333870 324662 316059 309283 304277 299835 294673 288372 281638 275873 272142 270188
56684 270188 268595 266277 263545 261325 259585 257338 254212 251122 248981 247446 245694 243945 243321 244236 245707
56669 245707 246439 246059 245039 243927 242988 242378 242377 243403 245702 248764 251230 251925 251107 250211 250193 250634 250736 250594
56651B50594K24M76j91j441k305k445k176j489J08K575M706N075L644K027J819
56636B61201K780L176J940k5j107j017q69j467k289k363j579p29n25q77j158j121
56620B53971j292k137k961k446n77Q42L62j173j940j690j620k037j867o16O58
56605B35477Q76J82p50j468j399j00J656K365K019K298L764M600L359J330M30
56590B54639K17q79k416k494j003J07j42o29k58P17J898L390M656M480K814J146
56574B66243K97n87k074l046k418r16J10N59R88J168O79J49M44J043O44q50k242
56557B60191k698k390j566k73J010J512J278J127J302J088J45p04o44k06n55j746
56541B56871k413j396Q20K578K793J823O81r2m42k19N90J214O46q95j914j509
$$ plain form
56651 250594 250818 251294 251103 249662 247357 244912 242736 241247 241355 243930 248636 253711 257355 259382 261201
56636 261201 263981 267157 269097 269072 267965 266948 266079 264612 262323 259960 258381 257652 257127 256250 255092 253971
56620 253971 252679 250542 247581 245135 244558 245400 245762 244589 242649 240959 239339 237302 235435 234819 235477
56605 235477 236353 236535 235785 234317 232918 232818 234474 236839 238858 241156 244920 249520 252879 254209 254639
56590 254639 254856 253977 251561 249067 248064 248171 248029 247400 247142 247859 249757 253147 257803 262283 265097 266243
56574 266243 266540 265953 263879 260833 258415 257499 257609 258168 259156 260324 261003 261152 261596 262639 263283 262433 260191
56557 260191 257493 255103 253537 253264 254274 255786 257064 258191 259493 260581 260726 260022 259378 259172 258617 256871
56541 256871 254458 253062 253882 256460 259253 261076 261757 261665 261223 261004 261594 262808 263454 262559 260645 259136
56525B59136n16k46q74j805k793l566l080o17K473L616J953o00j630n94J435L328
56509B55620M520M855M579M125L465K200O96L19J819M079N425N699N930O276N642
56494C15249L586J398N59R49J346J183R82J201J461J033l03k040l226l092j623
56479C18663K45J334J151J02j081j942k376k453k182j353J81J850K413J178r70
56464C14760k379k432j893j503j170p78p79j372j810j378n11j16k57m00m81p44
56448B96757p34K56J816K672K559K611L419L873K779O69q71j133o67j75J5l17
56432C13529j163j926j988j619j632k102k085q84R80K318K442J505J37r41j096
56417C05475m8J837L573M045K738K38j997k592j216J186L074L412K397J192P10
$$ plain form
56525 259136 258620 258374 257500 255695 252902 249336 246256 245639 248112 251728 253681 253081 251451 250857 252292 255620
56509 255620 260140 264995 269574 273699 277164 279364 280060 280379 282198 286277 291702 297401 303331 309607 315249
56494 315249 318835 320233 320792 321741 323087 324270 325252 326453 327914 328947 328644 326604 323378 320286 318663
56479 318663 318908 320242 321393 321495 320414 318472 316096 313643 311461 310108 310289 312139 314552 315730 314760
56464 314760 312381 309949 308056 306553 305383 304605 303826 302454 300644 299266 298755 298639 298382 297982 297501 296757
56448 296757 296023 296279 298095 300767 303326 305937 309356 313229 316008 316677 315806 314673 314006 313831 313846 313529
56432 313529 312366 310440 308452 306833 305201 303099 301014 300130 301110 303428 305870 307375 307512 306571 305475
56417 305475 305427 307264 310837 314882 317620 317858 315861 313269 312053 313239 316313 319725 322122 323314 324024
56402C24024O83K39p54j432j149l14L35P18J050J065L95m90o66q3K70k26r67j019
56384C21679k28R27K138L285L964L614K189L28j208k055k242j959j388o14L59
56369C28789J387K050J968J291O94P84J501K143J968Q85k73l11J165L033L473
56354C50547J795p44k256k114j148k70L95R16R66L79j95O3R63J399P07m91r27
56337C49985mJ584K395J568j88j173n14Q77J491R85J63l51n62m48O6M27r5r52
56319C55254m98J676L662L460J553R8R7O60P96N07q3j346l166m306l669j726J07
56302C53076J168J857K486K834K965L524M607N055L762J397k20m26l82j053j610
56287C79040p93R48J965J757J455J875K362K129J642J799K500K865K583K194K207
$$ plain form
56402 324024 324707 324946 324192 322760 321611 321297 321632 322350 323400 324465 324860 324370 323704 323621 323891 323665 322698 321679
56384 321679 321451 322378 324516 327801 331765 335379 337568 337896 336688 334633 332391 330432 329044 328430 328789
56369 328789 330176 332226 334194 335485 336179 336963 338464 340607 342575 343460 343187 342876 344041 347074 350547
56354 350547 352342 351598 349342 347228 346080 345810 346205 347121 348087 348466 348271 348334 349297 350696 351403 350912 349985
56337 349985 349981 351565 353960 355528 355340 354167 353653 354530 356021 357006 357169 356818 356256 355808 355874 356301 356206 355254
56319 355254 354756 356432 360094 363554 365107 365205 365302 365962 366758 367265 367182 365836 362670 358364 354695 352969 353076
56302 353076 354244 356101 358587 361421 364386 367910 372517 377572 381334 382731 382511 382085 381703 380650 379040
56287 379040 378247 379195 381160 382917 384372 386247 388609 390738 392380 394179 396679 399544 402127 404321 406528
56272D06528K549K860K872K639K607L284M481N277N044M238L652L280K469J122
56258D52902J05K76J381K138J462k54j225l5K760N237O243O168N651M673L410
56243D90892K826L464M492M899M956N478O362P012P637Q644R241Q212O126N123
56229E75364O167P909Q684Q364P737P244P188Q067R854J1613J2615J3261J4237
56216F98304J5442J6416J7201J8053J8796J9223J9729K0781K2149K3494K5304
56205I14892K8264L1847L4605L6081L7592M0651M5140M9502N2452N4242N6442
56194A381710O0723O7676P6413Q5323R3409J00961J08942J17762J26780J35002
56184B354701J41938J47586J51803J54136J54253J52111J47533J40089J29664
$$ plain form
56272 406528 409077 411937 414809 417448 420055 423339 427820 433097 438141 442379 446031 449311 451780 452902
56258 452902 453007 453283 454664 456802 458264 458010 456785 456750 459510 464747 470990 477158 482809 487482 490892
56243 490892 493718 497182 501674 506573 511529 517007 523369 530381 538018 546662 555903 564115 570241 575364
56229 575364 581531 589440 598124 606488 614225 621469 628657 636724 646578 658191 670806 684067 698304
56216 698304 713746 730162 747363 765416 784212 803435 823164 843945 866094 889588 914892
56205 914892 943156 975003 1009608 1045689 1083281 1123932 1169072 1218574 1271026 1325268 1381710
56194 1381710 1442433 1510109 1586522 1671845 1765254 1866215 1975157 2092919 2219699 2354701
56184 2354701 2496639 2644225 2796028 2950164 3104417 3256528 3404061 3544150 3673814
56175C673814J16640J01196Q2974O2009L9551J7082n176k7793n0237p0520q7071
56164C852469j00093j10549j18556j23638j26051j27053j27731j28100j27463
56155B763235j25289j21556j16536j10600j04319r8408r3118q7788q1598p4855
56145A749168o8977o4768o1429n7692n3282m8638m3954l9448l5903l3677l1675
56134A209725k8739k5625k3943k3255k1290j7454j4058j3054j3288j2365r868
56123A006786p202n304m146l789m216m470l495j839j214k254l722m038k645J0
56109I58462K880M565M218K565J438K012L891N945P452Q370R017R713J0501J1274
56095A042303J2235J3934J6480J9236K1700K4163K6981K9804L2331L5112L8721
$$ plain form
56175 3673814 3790454 3891650 3974624 4036633 4076184 4093266 4088090 4060297 4010060 3939540 3852469
56164 3852469 3752376 3641827 3523271 3399633 3273582 3146529 3018798 2890698 2763235
56155 2763235 2637946 2516390 2399854 2289254 2184935 2086527 1993409 1905621 1824023 1749168
56145 1749168 1680191 1615423 1553994 1496302 1443020 1394382 1350428 1310980 1275077 1241400 1209725
56134 1209725 1180986 1155361 1131418 1108163 1086873 1069419 1055361 1042307 1029019 1016654 1006786
56123 1006786 999584 994280 990134 986345 982129 977659 974164 972325 971111 968857 965135 961097 958452 958462
56109 958462 961342 965907 970125 972690 974128 976140 980031 985976 993428 1001798 1010815 1020528 1031029 1042303
56095 1042303 1054538 1068472 1084952 1104188 1125888 1150051 1177032 1206836 1239167 1274279 1313000
56084A313000M2738M6744N1602N8196O5122O9365O9454O6435O1704N5604M8820
56073A948784M3287M0396L9349L8311L6278L3014K8326K2639J7388J3490J0122
56062B271384O224K475K8k168o820j4857k4252l2636l9461m4889m8231m8860m7649
56049A970288m5975m3851m0313l5466l0759k7204k4362k1369j8077j4798j1736
56038A656378r063p039n658m601l671k792j511P18L431N301N959O783R031J2044
56024A665310J4296J5539J6573J7400J7228J6216J5633J5965J6446J6925J8556
56013A846087K1665K4403K4955K4157K4359K6178K8056K8850K9335L0667L2529
56002B141241L3637L3449L2734L2613L3561L5249L7007L8246L8693L8560L8578
$$ plain form
56084 1313000 1355738 1402482 1454084 1512280 1577402 1646767 1716221 1782656 1844360 1899964 1948784
56073 1948784 1992071 2032467 2071816 2110127 2146405 2179419 2207745 2230384 2247772 2261262 2271384
56062 2271384 2277608 2280083 2280111 2277943 2271123 2256266 2232014 2199378 2159917 2115028 2066797 2017937 1970288
56049 1970288 1924313 1880462 1840149 1804683 1773924 1746720 1722358 1700989 1682912 1668114 1656378
56038 1656378 1647315 1640276 1634618 1630017 1626346 1623554 1622043 1622761 1626192 1631493 1637452 1644235 1653266 1665310
56024 1665310 1679606 1695145 1711718 1729118 1746346 1762562 1778195 1794160 1810606 1827531 1846087
56013 1846087 1867752 1892155 1917110 1941267 1965626 1991804 2019860 2048710 2078045 2108712 2141241
56002 2141241 2174878 2208327 2241061 2273674 2307235 2342484 2379491 2417737 2456430 2494990 2533568
55991B533568L9504M1190M2476M2595M2468M3777M6688M9484N0767N1198N2440
55980C036155N5140N8566O1768O4377O6576O8788P1248P3797P6458Q0025Q5065
55969C797963R0318R3581R4804R6824J01927J08910J14881J18928J22501J27059
55959D867696J33046J40717J50112J60248J69777J78632J87864J98042K08873
55950F395007K20176K31891K43374K54136K65267K78745K95113L12917L30588
55941H827214L47835L65260L83706M04076M26735M51074M76404N03009N31618
55932A2716931N62659N97155O37220O83615P33494P82942Q31767Q83798R42431
55923A9372012J007901J078827J153900J231804J311957J396355J488770J591394
$$ plain form
55991 2533568 2573072 2614262 2656738 2699333 2741801 2785578 2832266 2881750 2932517 2983715 3036155
55980 3036155 3091295 3149861 3211629 3276006 3342582 3411370 3482618 3556415 3632873 3712898 3797963
55969 3797963 3888281 3981862 4076666 4173490 4275417 4384327 4499208 4618136 4740637 4867696
55959 4867696 5000742 5141459 5291571 5451819 5621596 5800228 5988092 6186134 6395007
55950 6395007 6615183 6847074 7090448 7344584 7609851 7888596 8183709 8496626 8827214
55941 8827214 9175049 9540309 9924015 10328091 10754826 11205900 11682304 12185313 12716931
55932 12716931 13279590 13876745 14513965 15197580 15931074 16714016 17545783 18429581 19372012
55923 19372012 20379913 21458740 22612640 23844444 25156401 26552756 28041526 29632920
55915B9632920J704083J827349J964053K117506K289772K482510K697548K936285
55907D7652026L200703L495779L829261M209346M645059N148674N734437O414981
55899H4330266P202635Q114105R168473J0379122J1752656J3297680J5028888
55892A59273825J6957380J9073384K1319479K3538525K5406926K6414677K5955347
55885C17939543K3520197J8918449J2427060M794009k940752r762577j4992868
55878C49903061j8427180k0251172k0840173k0588926j9830445j8813022j7697340
55871B13454803j6568358j5461997j4391639j3362085j2374623j1430275j0530722
55864A19335104r676297q865333q096611p370976o690146o055698n469648m934337
$$ plain form
55915 29632920 31337003 33164352 35128405 37245911 39535683 42018193 44715741 47652026
55907 47652026 50852729 54348508 58177769 62387115 67032174 72180848 77915285 84330266
55899 84330266 91532901 99647006 108815479 119194601 130947257 144244937 159273825
55892 159273825 176231205 195304589 216624068 240162593 265569519 291984196 317939543
55885 317939543 341459740 360378189 372805249 377599258 374658506 364895929 349903061
55878 349903061 331475881 311224709 290384536 269795610 249965165 231152143 213454803
55871 213454803 196886445 181424448 167032809 153670724 141296101 129865826 119335104
55864 119335104 109658807 100793474 92696863 85325887 78635741 72580043 67110395 62176058
55856F2176058m451002m019147l636897l300547l004172k741479k508278k302008
55848C6212528k119311j955823j808307j675268j555368j446519j346826j255178
55840B3049928j170774j092932j021256r55164q93521q35766p82945p36578o96661
55831A4864331o61634o29627n98790n67326n34740n02680m73243m46858m22922
55822A0026511m01463l82629l65358l48482l32527l18500l05522k91891k77994
55813G002145k65755k55292k44734k33615k23816k16407k09854k02351j93922
55804D956399j85263j76553j68561j62929j59842j56994j52437j47020j42341
55795C504459j37575j30465j20806j11001j03125r6986r1379q5962q1267p7530
$$ plain form
55856 62176058 57725056 53705909 50069012 46768465 43764293 41022814 38514536 36212528
55848 36212528 34093217 32137394 30329087 28653819 27098451 25651932 24305106 23049928
55840 23049928 21879154 20786222 19764966 18809802 17916281 17080515 16297570 15560992 14864331
55831 14864331 14202697 13573070 12974280 12406954 11872214 11369534 10896291 10449433 10026511
55822 10026511 9625048 9242419 8877061 8528579 8196052 7877552 7572030 7280139 7002145
55813 7002145 6736390 6481098 6236364 6002749 5778933 5562526 5352672 5150321 4956399
55804 4956399 4771136 4594583 4426022 4263093 4103251 3946257 3793820 3646800 3504459
55795 3504459 3366884 3236419 3115613 3004612 2901487 2804501 2713122 2627160 2545893 2468363
55785B468363p4278p1036o8032o5766o4016o1836n8836n5708n2893m9621m5400
55774A800941m1586l9799l9269l7679l4634l2229l1821l2197l1693l0297k8726
55763A421011k7065k5448k4600k4594k4264k2965k1682k1353k1340k0760k0048
55752A166892j9941j9860j8751j6669j4461j2686j1794j2161j2866j1779q326
55741A007598m974m285n644o589o271n574m768l460k375k790m238m887m247l464
55727I44032k849j312J255L076K720P05j890m943q635j2424j5388j6746j5829
55714H71772j2642q688o041n235n205n399o473q580j0639j2004j3318j4804j5253
55701G47491j3829j1729j0707j0875j1122j0942j0627j0229r641r352j0051j1568
$$ plain form
55785 2468363 2394085 2323049 2255017 2189251 2125235 2063399 2004563 1948855 1895962 1846341 1800941
55774 1800941 1759355 1719556 1680287 1642608 1607974 1575745 1543924 1511727 1480034 1449737 1421011
55763 1421011 1393946 1368498 1343898 1319304 1295040 1272075 1250393 1229040 1207700 1186940 1166892
55752 1166892 1146951 1127091 1108340 1091671 1077210 1064524 1052730 1040569 1027703 1015924 1007598
55741 1007598 1002624 998339 992695 986106 979835 974261 969493 966033 963658 960868 956630 951743 947496 944032
55727 944032 941183 939871 941126 944202 946922 947627 945737 940794 932159 919735 904347 887601 871772
55714 871772 859130 850442 844401 839166 833961 828562 822089 813509 802870 790866 777548 762744 747491
55701 747491 733662 721933 711226 700351 689229 678287 667660 657431 647790 638438 628387 616819
55689F16819j2990j3680j3538j2608j1106r665q854q555q133p118n403l239j415
55676E00515r15j859l097l448l052k938l526m117l887k957k431l369n653p877
55662D51389q660p982o893o067n293m383l711l506l286k494j214L3Q63J231J397
55647D01424J752K245K129Q45r90k220k610k788k986l004l211m143n064m580k941
55632C73858j991k451l064l070l357m145l756j412P54N68q75j093j01J52o73j020
55616C48324m67l93j436k528k790k511j931r01j06q13k913m743n315n171m741
55601C11565l580j795n76n00p09m78j67K8Q51K510L777L477J949J85j334k263
55585C12940k024p75K71L76J76L08K80l82j076j278j657k771l620k935j218j33
$$ plain form
55689 616819 603829 590149 576611 564003 552897 543232 534378 525823 517690 510572 505169 501930 500515
55676 500515 499600 497741 494644 491196 488144 485206 481680 477563 473676 470719 468288 464919 459266 451389
55662 451389 442729 434747 427854 421787 416494 412111 408400 404894 401608 399114 397900 397933 398796 400027 401424
55647 401424 403176 405421 407550 408395 407405 405185 402575 399787 396801 393797 390586 386443 381379 376799 373858
55632 373858 371867 369416 366352 363282 359925 355780 352024 350612 351366 351934 351059 349966 349865 350017 349344 348324
55616 348324 347857 347464 346028 343500 340710 338199 336268 335367 335261 334448 331535 326792 321477 316306 311565
55601 311565 307985 306190 305614 305114 304405 303927 303760 303788 304639 307149 310926 314403 316352 316537 315203 312940
55585 312940 310916 310141 310412 310788 310964 311272 311552 311170 310094 308816 307159 304388 300768 297833 296615 296482
55569B96482m12j554k979m281m896m783m930n981o869o200m423l193k963k829
55555B40189k461k385k390j588l83n20k368l796k921p46K30p51k153k497j947
55540B13513j479j424j317p92j71l8m76j062j614k427l522m183l859l063k637
55525A85449k456j733l65J016K156L181L594K633R88O76K471M620N060L990L148
55510B14428L357L913L931L021R85j876m198m461k823j123q23j604k252k164j535
55495B06776p70k52l36r78j648j894j895k102k538k732k272j222j17M48L84L16
55479A89168Q24J432R32q50k298j802PQ91j33j561j499m7J203J364R63P00O25
55462A89919O08O97O34k35j914l248l143j976j162j418k163k603k704k916l413
$$ plain form
55569 296482 296070 294516 291537 287256 282360 277577 272647 266666 259797 253597 249174 245981 243018 240189
55555 240189 237728 235343 232953 231365 230982 230462 228094 224298 221377 220631 220861 220110 217957 215460 213513
55540 213513 212034 210610 209293 208501 208330 208292 207816 206754 205140 202713 199191 195008 191149 188086 185449
55525 185449 182993 181260 180895 181911 184067 187248 190842 193475 194463 195139 197610 202230 207290 211280 214428
55510 214428 217785 221698 225629 228650 229635 227759 223561 219100 216277 215154 214331 212727 210475 208311 206776
55495 206776 206006 205754 205418 204440 202792 200898 199003 196901 194363 191631 189359 188137 188020 188468 188852 189168
55479 189168 189992 191424 192356 191506 189208 187406 187413 188304 188171 186610 185111 185064 186267 187631 188594 189294 189919
55462 189919 190527 191224 191858 191623 189709 186461 183318 181342 180180 178762 176599 173996 171292 168376 164963
55447A64963l997m424m507m110l391k853k913l409l709l304k164p02M13N90j08
55432A26375p64l37J207K810L428K892J549l04k199l222k792j557o31K2J394L424
55416A31295M451L430J652R82J183O09q95j600o82M26L09m04m52j66p37k013k679
55399A34709k371k038k178k145j449m45O16J935L089K878J157l63k75M44j26j921
55383A31517k951k081k12J507K980L956L167O7l408m521k965r80j97R6J016J930
55367A28921J537K07k70Q21K182K305J191j26r00r40k64P85J453J207L89k46m64
55350A37788n92q22r24p06l55k49n65j070j260q85l46k25m58m15k0p6r76j746
55332A26098j151O41K336L090K898J699n71k964l759k385j84J309K067K805L305
$$ plain form
55447 164963 160966 156542 152035 147925 144534 141681 138768 135359 131650 128346 126182 125480 125893 126483 126375
55432 126375 125611 125274 126481 129291 132719 135611 137160 136856 134657 131435 128643 127086 126455 126477 127871 131295
55416 131295 135746 139176 140828 141810 142993 143602 142707 141107 140425 140851 141160 140756 140304 140138 139401 137388 134709
55399 134709 132338 130300 128122 125977 124528 124083 124699 126634 129723 132601 133758 133395 133120 133564 133438 131517
55383 131517 128566 126485 126273 127780 130760 134716 137883 137950 134542 130021 127056 126076 125879 125975 126991 128921
55367 128921 130458 130665 130395 131216 133398 135703 136894 136768 135868 134928 134664 135449 136902 138109 138498 138252 137788
55350 137788 137196 136374 135450 134744 134389 134140 133575 132505 131245 130360 130014 129789 129331 128916 128896 128820 127844 126098
55332 126098 124947 125588 127924 131014 133912 135611 135040 132076 128317 125932 125748 127057 129124 131929 135234
55317A35234K573M44j869k981k611j619j141j666k627l000k375j256j69R91K274
55302A20202K924K105J87j474j968j378m8J696K916K333j36k775l773l108k047
55287A15656j279n13L11N40j60j081j272n54N68J569K081J859J094M81M79P49
55271A20528O93K43l84j286k444k965j834M49J950J586M58L26J337K135J844J065
55255A23701R18J695K629K626J303m76j312q17j21l48j061r38K64J372J387M94
55239A31316n95j379j399l84Q83Q38r82l001l499k790k426k700k371r14L60K18
55223A11175o01l85J120K443K451J631J015O43p9j054j365n94N29J140J315J606
55207A20990J988J944J440R71O61Q9p35j060n99k98j089k306k346q56P17R67J38
$$ plain form
55317 135234 137807 138251 136382 133401 130790 129171 128030 126364 123737 120737 118362 117106 116937 117928 120202
55302 120202 123126 125231 125418 123944 121976 120598 120550 122246 125162 127495 127359 124584 120811 117703 115656
55287 115656 114377 113864 114175 114715 114555 113474 112202 111648 112216 113785 115866 117725 118819 119300 119779 120528
55271 120528 121221 121464 121080 119794 117350 114385 112551 113000 114950 116536 116994 117320 118657 120792 122636 123701
55255 123701 124619 126314 128943 131569 132872 132396 131084 130267 130146 129798 128737 127799 128063 129435 130822 131316
55239 131316 130721 129342 127943 127559 128442 129280 128298 125297 121798 119008 116582 113882 111511 110597 110957 111175
55223 111175 110574 110189 111309 113752 116203 117834 118849 119492 119413 118359 116994 116400 116929 118069 119384 120990
55207 120990 122978 124922 126362 127333 127994 128083 127348 126288 125689 125391 124302 121996 119650 118794 119511 120478 120616
55190A20616n77o50n44p58j138j188o27L85J372J942K144K255K153J278l90j867
55174A24406k183j655j339j452j192k80M02J36n23p86r79j794k696k369q31J76
55158A07041o07k166k416o04K035L718L704K597J615J486J841J742Q32k26n21
55143A20071J73J401K553L071K533R57j007k415k528j145J194L274M028L417K204
55128A37781Q69n41j525j203K75J409J240O65R37J691J616M99p53j803l143m654
55112A33360n147l780j070J699L426L571K439J154O38O59N29K69R9o14k328l651
55096A31253k666l6J371N31l38N58J818J456L09M71J573J402l73j586r71J92M33
55079A35397J79N57J453J906J498M80q33k039k513j993r92j89L17P27Q92L86q49
$$ plain form
55190 120616 120039 119389 118845 118087 116949 115761 115134 115519 116891 118833 120977 123232 125385 126663 126273 124406
55174 124406 122223 120568 119229 117777 116585 116305 116707 116843 116320 115534 114555 112761 110065 107696 106865 107041
55158 107041 106434 104268 101852 101248 103283 107001 110705 113302 114917 116403 118244 119986 120818 120592 120071
55143 120071 120244 121645 124198 127269 129802 130759 129752 127337 124809 123664 124858 128132 132160 135577 137781
55128 137781 138650 138109 136584 135381 135656 137065 138305 138970 139907 141598 143214 143713 142960 141157 138014 133360
55112 133360 128213 124433 123363 125062 128488 132059 134498 135652 136290 136949 137478 137747 137846 137232 134904 131253
55096 131253 128587 128551 129922 130453 130115 130673 132491 133947 134256 134727 136300 137702 137329 135743 134772 134964 135397
55079 135397 135576 136133 137586 139492 140990 141470 140637 138598 136085 134092 133100 132911 133228 133955 134847 135233 134384
55062A34384k174k587j487N57J951J510k14j507j538j052r34q99k57O40P23j95
55046A26921r98o86M11J225J301J037P87L90k98q69p98k7J175K640M112M896M402
55029A45621K991J623O84j89j088j500j200o69k81J14M81M40K53Q43K054K153
55013A52330K23k020k349j093l26m73Q5J984L551L165J389j96r75j254j315j317
54997A51409j330q34P48K491K270l73k921k859r21J94l79j157j155j177j857k321
54981A39828j750q30n37m89K57J450K027J877J835J916J036r47k267j413N46J245
54965A43784L30j09J187K558J733q78k663k246r15m72j068j676j656j173o86p34
54949A35316j558k403j825N51L131L999L021J546M45m39j109j005k7R19J011M44
$$ plain form
55062 134384 132210 129623 128136 128693 130644 132154 131940 130433 128895 127843 126909 126010 125753 126393 127116 126921
55046 126921 125923 125237 125648 126873 128174 129211 129998 130388 130090 129221 128423 128396 129571 132211 136323 141219 145621
55029 145621 148612 150235 150919 150730 149642 148142 146942 146273 145992 146106 146587 147027 147280 148123 150177 152330
55013 152330 152553 150533 148184 147091 146765 146292 146377 148361 151912 155077 156466 156270 155295 154041 152726 151409
54997 151409 150079 149245 149993 152484 154754 154381 151460 148601 147680 147874 147495 146338 145183 144006 142149 139828
54981 139828 138078 137248 136711 136222 136479 137929 139956 141833 143668 145584 146620 145673 143406 141993 142539 143784
54965 143784 144114 144005 145192 147750 149483 148605 145942 143696 142781 142309 141241 139565 137909 136736 136050 135316
54949 135316 133758 131355 129530 130081 133212 137211 140232 141778 142223 141784 140675 139670 139643 140562 141573 142017
54933A42017j40m94o02l00L41O65J34q02j181o71J74P18P57L74k01n03k68P0j10
54914A39978n13n7J535L003K970J632K78m35r56j650k011j354K29J826K420J651
54898A48546K46m49J83J223J258K39m41L01K086L743M387L637J619p52k238k534
54882A61054k527k954l479l535l232k836k089q21M38J230J917K821L249K366N59
54867A52161j058j976k245j671k45J071J252P19Q05J968L597N182O431O610N266
54852A77867L507K962L607M144M411N374O640O138L162j79j678j665j802k594
54838B09894l332l485k957j813o43m22j284k295k956l702m442m141k708j604j496
54823A72614j038N42J507K28j879k308j138k65K2R71K392K652J661J281K351L689
$$ plain form
54933 142017 141877 141383 140781 140481 140822 141487 141621 140819 139638 138967 139141 139859 140616 140990 140789 140286 140018 140088 139978
54914 139978 139465 139408 140943 143946 146916 148548 148826 148391 147435 145785 143774 142420 142649 144475 146895 148546
54898 148546 148792 148343 148526 149749 151007 151246 150805 151106 153192 156935 161322 164959 166578 165826 163588 161054
54882 161054 158527 155573 152094 148559 145327 142491 140402 139581 140019 141249 143166 145987 149236 151602 152161
54867 152161 151103 149127 146882 145211 144966 146037 147289 148008 148813 150781 154378 159560 165991 172601 177867
54852 177867 181374 184336 187943 192087 196498 201872 208512 214650 217812 217633 215955 214290 212488 209894
54838 209894 206562 203077 200120 198307 197664 197242 195958 193663 190707 187005 182563 178422 175714 174110 172614
54823 172614 171576 172118 173625 173853 171974 169666 168528 168263 168285 169256 171648 174300 175961 177242 179593 183282
54807A83282M475N248N979N422L404J723J621K093J784Q71q2j515l627n164n041
54792B00473m147l928m090l305j660p89j666l519m933n019l688j634l1N02N04
54777A63070P39J048Q24J75k70m31p52j248j417j160r82j191j501j543j250o31
54761A53480L34J310J588P53p25j800j812j083m35o7O83K086L024K142Oj065K53
54744A58672K605L688K773Q05j135k355k189n49J240J433j45j954k721k598k170
54729A55400j406j07J372K403K663K041O26p63q30O82K280K443J590J342K070
54714A71806K592K340K315K989K838M65k654l478j371J163K051K033K563L227
54700A88879K959K501L410N167N554L927K116J621J818J589J031M92m79j929k545
$$ plain form
54807 183282 187757 193005 198984 204406 207810 209533 211154 213247 215031 215902 215820 214305 210678 205514 200473
54792 200473 196326 192398 188308 185003 183343 182554 180888 177369 172436 167417 163729 162095 162064 162566 163070
54777 163070 163809 164857 165681 165856 165586 165155 164403 163155 161738 160578 159596 158405 156904 155361 154111 153480
54761 153480 153814 155124 156712 157465 156740 154940 153128 152045 151610 151543 152226 154312 157336 159478 159484 158419 158672
54744 158672 161277 164965 167738 168543 167408 165053 162864 162315 163555 164988 164843 162889 160168 157570 155400
54729 155400 153994 153887 155259 157662 160325 162366 162992 162229 161399 162081 164361 166804 168394 169736 171806
54714 171806 174398 176738 179053 182042 184880 185345 182691 179213 177842 179005 181056 183089 185652 188879
54700 188879 191838 194339 197749 202916 208470 212397 214513 216134 217952 219541 220572 221064 220585 218656 216111
54685B16111j441L5j53j975l597m017l842l640l095k038j036m83n9N31R89Q70
54669A93160J5j522l255m020k859m25J406J595Q57K88K7k01j75M23J301J994K561
54652A91170L154L379K921K485L085M430M952L773J814M13m95k009m284n922n657
54637B03209m071k935l081l603l249k001r27q63j606k225j864m63R87J195o7j553
54621A76883j860q77N04J586K121J707Q1j892k689k040j426k082l269l425k373
54606A60949j318r07m90M81J381J304M06l46m95n13q50j179q81lO99P29M54N16
54588A59937Q38P12o8o13M9J568K354J306q44k184j656j42N51k96j635j983j125
54571A56769j28O0m24q85j011q87n41P3P68J287J682K050K060J299J10o19n84
$$ plain form
54685 216111 214670 214705 214552 212577 208980 204963 201121 197481 194386 192348 191312 190829 190770 191301 192290 193160
54669 193160 193175 191653 188398 184378 181519 181094 182500 184095 184952 185240 185267 185066 184891 185314 186615 188609 191170
54652 191170 194324 197703 200624 203109 206194 210624 215576 219349 221163 221576 221081 219072 214788 208866 203209
54637 203209 199138 196203 193122 189519 186270 184269 183342 182479 180873 178648 176784 176321 177308 178503 178436 176883
54621 176883 175023 174146 174650 176236 178357 180064 180145 178253 175564 173524 172098 170016 166747 163322 160949
54606 160949 159631 158724 158234 158715 160096 161400 161806 161460 160965 160452 159602 158423 157542 157539 158238 158967 159421 159937
54588 159937 160775 161487 161419 160806 160855 162423 164777 166083 165239 163055 161399 161257 161808 161512 159877 157894 156769
54571 156769 156641 156701 156277 155392 154381 153494 152953 153026 153794 155081 156763 158813 160873 162172 162282 161663 161079
54554A61079l28j29L88J106Q71p97k323j795K17J213J98j042o33Q96J796J554
54538A62271R33L95j61n57m34kK23J67j54j145k687l252j454J748L758L358J698
54521A64705L25k94k16M02P79O7j140j289l76k15j576k858k666j899j797j650
54505A50302k32J731K611K400K245K212J681J272K111L395L094J131l20j20M55
54490A73968J88l13l08m71j418k114j207R30K791L613L618K921J452l20j494j625
54474A80211j044l58J14N76J416K381K403R21r00j355m51K10j20m45N9P16N56
54457A84890l19j360k317k664j609L89J250l07k955m412m017k633j035L63J011
54442A64275Q15O19R67J094K71p39q57m23k75l9R69J987J905J443K083L261L094
$$ plain form
54554 161079 160751 160622 161010 162116 162987 162190 159867 158072 158289 159502 159700 158658 158025 158921 160717 162271
54538 162271 163204 163599 163438 162881 162447 162445 162668 162835 162681 161536 158849 155597 154143 155891 159649 163007 164705
54521 164705 165030 164736 164520 164922 165701 165768 164628 163339 162963 162748 161172 158314 155648 153749 151952 150302
54505 150302 150070 151801 154412 156812 159057 161269 162950 164222 166333 169728 172822 173953 173633 173513 173968
54490 173968 174156 173843 173535 173064 171646 169532 168325 169255 172046 175659 179277 182198 183650 183330 181836 180211
54474 180211 179167 178809 178923 179499 180915 183296 185699 186620 185720 184365 183914 184124 184004 183559 183618 184334 184890
54457 184890 184571 183211 180894 178230 176621 177010 178260 177953 174998 170586 166569 163936 162901 163264 164275
54442 164275 165090 165709 166676 167770 168041 167302 166445 166022 165747 165708 166677 168664 170569 172012 174095 177356 180450
54425A80450J630Q24J138R48j24j37J620K767J381q69j320k71J58k78k12J59p77
54408A87087k661k761P4L334M066K487R20M52L95L37P53J497J352j97j850k106
54392A93179j306j058j905k602j890q0J562K331K401K129J583O34q40k551l493
54377A88094k697p04N69J29p33m68L67K76l28L78K280K800N87k291l104j881n75
54360A82699KN86J528K197K126J481M94m04k73J277K910K797J001o49j039p24
54344A96009k72P13K177K781J619j31n47M43J067J74j210j219O12K811L599K739
54328B11365J511Q65K17j306k878k474L90L549M661L792K556J502j33k298l492
54313B17827k877j642j340j699j219N73K586L739L972L573K542J042k40p84p79
$$ plain form
54425 180450 182080 182904 184042 184990 184866 184729 186349 189116 190497 189628 188308 188037 188195 187917 187705 187864 187087
54408 187087 184426 181665 181739 185073 189139 191626 192546 192998 193393 193730 194483 195980 197332 197135 195285 193179
54392 193179 191873 190815 188910 186308 184418 184338 185900 188231 190632 192761 194344 194978 194138 191587 188094
54377 188094 185397 184693 185262 185391 184658 184190 184557 184833 184505 184883 187163 189963 190550 188259 185155 183274 182699
54360 182699 182701 183287 184815 187012 189138 190619 191113 190709 190436 191713 194623 197420 198421 197772 196733 196009
54344 196009 195737 196450 198627 201408 203027 202896 202349 202792 203859 204033 202823 201604 202216 205027 208626 211365
54328 211365 212876 213741 213958 212652 209774 207300 207690 211239 215900 219692 222248 223750 223617 221319 217827
54313 217827 214950 213308 211968 210269 209050 209623 212209 215948 219920 223493 226035 227077 226837 226053 225274
54298B25274n83j74L72M89Qp1J348L658M846L705R89j737l459l708k366j60J315
54281B29746J070k20j270j865k633l509l571k558j537j606k458k737j596L77J614
54266B07247R48j220l084l111j571j15J67j96r4P31J613J981J769J083L9r65j344
54249B03878j067q72j401k261k413j515l31K65J74l51j346k689l427k550m78J126
54233A84742J268N89J78K38M29O81J048J343J606K270L130K844O25k016k518k96
54217A96161K506L512K437P29j33L18J443J993J157n83j952k240j699p79K11P16
54201B03797K60o11o52M52J597J781J226O32K55L36J319K850L385J966k25j191
54185B17177o66k22j025k545l492l177j790k4J286J636J135K32o21q79o3J439
$$ plain form
54298 225274 224691 224517 224889 225378 225386 225315 226663 230321 235167 238872 239861 238124 234665 230957 228591 228431 229746
54281 229746 230816 230596 229326 227461 224828 221319 217748 215190 213653 212047 209589 206852 205256 205633 207247
54266 207247 208195 206975 203891 200780 199209 199094 199261 199065 198971 199702 201315 203296 205065 206148 206187 205222 203878
54249 203878 202811 201939 200538 198277 195864 194349 194018 194283 194457 194106 192760 190071 186644 184094 183616 184742
54233 184742 186010 186599 186777 187015 187444 188125 189173 190516 192122 194392 197522 200366 200991 198975 196457 196161
54217 196161 198667 202179 204616 205345 205212 205530 206973 208966 210123 209540 207588 205348 203649 202870 203081 203797
54201 203797 204057 203446 202794 203246 204843 206624 207850 208482 208737 209073 210392 213242 216627 218593 218368 217177
54185 217177 216511 216289 215264 212719 209227 206050 204260 204236 205522 207158 208293 208525 207904 207025 206962 208401
54169B08401K304J792P87M46K50j220l691m930l532p50J154J474J033M05o36j957
54153B01330k486j369O28J570M17j635k431j410j24O2j87N01J865K354J527M92
54137B01104r9q94k132k631j465M67J659J848J639J148L85J79J187K358K020L70
54121B07143o36o5R35J216J181J462J449L71j111j641r83KP46J190R69l64k201
54104B09663l071k335r65l11p70j709k144j337N46K173K147O25q37j251j137j149
54088A98138q70K23J491J893J434Q34K77l26l48Q53K307K121J34j455q15J311
54072B07202K827K821J996J292R78P85L23m12p31n2R19P46o00j400o65L05J8q01
54054B15551n08O03P62k52o45N79K107K260J105o8l20M72J781K550K049R30N79
$$ plain form
54169 208401 210705 212497 213284 213730 213980 212760 209069 204139 200607 199857 201011 202485 203518 203923 203287 201330
54153 201330 198844 197475 198103 199673 200090 198455 196024 194614 194490 194552 194365 194866 196731 199085 200612 201104
54137 201104 201005 200111 197979 195348 193883 194350 196009 197857 199496 200644 201029 201208 202395 204753 206773 207143
54121 207143 206507 206442 207377 208593 209774 211236 212685 213056 211945 210304 209321 209323 210069 211259 212228 211864 209663
54104 209663 206592 204257 203292 202981 202211 200502 198358 197021 197567 199740 201887 202512 201675 200424 199287 198138
54088 198138 197268 197491 198982 200875 202309 203143 203420 203094 202746 203599 205906 208027 208161 206706 205891 207202
54072 207202 210029 212850 214846 216138 217116 217901 218224 217812 217081 217029 217948 218694 218094 216694 216029 216334 216352 215551
54054 215551 215043 215646 216408 216156 215511 216090 218197 220457 221562 221494 221174 221646 223427 225977 228026 228956 229535
54037B29535J101J098q2j239j191n75o36j169r48K80J388J289k4j617k261j328
54021B23621L82J211N86k03K65J818L319M196M328L376J502N6J43R08Q01J18O31
54004B47058K658M364M345L406L104L890N339P034Q283P927N502K113n35j645
53990C02843j492q21n61j315k470k481p49J352K193K085K795N074P604Q510P258
53975C29825M975L339L262M265N009M644L530K631K427K598K510J801Q00M84J547
53960C73647L283L881K265p90l653n370n816n171m070l647m393n277m912l431
53946C36546k184j875k073k466l217l899l539k328j967l318m810m490k890k324
53932B95166l583m872m331k276l79L71J20o49j379j351l50O99O99j4l0R57J444
$$ plain form
54037 229535 230636 231734 231652 230413 229222 228647 228011 226842 225894 226174 227562 228851 228827 227210 224949 223621
54021 223621 224003 225214 225800 225597 225862 227680 230999 235195 239523 242899 244401 244457 244600 245508 246309 246427 247058
54004 247058 249716 254080 258425 261831 264935 268825 274164 281198 289481 297408 302910 305023 304488 302843
53990 302843 301351 300530 299969 298654 296184 293703 292954 294306 296499 298584 301379 306453 314057 322567 329825
53975 329825 334800 338139 341401 345666 350675 355319 358849 361480 363907 366505 369015 370816 371616 372100 373647
53960 373647 376930 380811 383076 382286 378633 373263 367447 362276 358206 354559 350166 344889 339977 336546
53946 336546 334362 332487 330414 327948 324731 320832 317293 314965 312998 309680 304870 300380 297490 295166
53932 295166 291583 286711 282380 280104 279725 280096 280216 279567 278188 276837 276487 277186 277885 277871 277841 278798 280242
53915B80242K54j477j641NJ563J550O13K94J176K789M440N352M759K952J664K228
53899C06763L619L510J300j268k592k927l010k416m55K218M246N230N491M689
53885C24398K344l86j212L88K279K628K423L715O335Q072P880P180P615Q908R726
53870C92293R643R254Q849Q186P457P594R194J1619J3540J4255J4180J4159J4474
53857E34697J4587J3722J1516Q196M435J083j241k602l625m668n382n392n030
53844E60296m804m486l582k617k856m457n984o296o012o363p409q296q639q616
53830D79879q175p358p002p923r440r919q830p224o064n306m795m883n553n990
53816C81417n689n101m734m454m285m856o150o691n139k258k31k95j803l333l831
$$ plain form
53915 280242 280496 279019 277378 277383 278946 280496 281109 281403 282579 285368 289808 295160 299919 302871 304535 306763
53899 306763 310382 313892 315192 313924 311332 308405 305395 302979 302524 304742 308988 314218 319709 324398
53885 324398 326742 326356 325144 325532 327811 330439 332862 336577 342912 350984 358864 366044 373659 382567 392293
53870 392293 401936 411190 420039 428225 435682 443276 452470 464089 477629 491884 506064 520223 534697
53857 534697 549284 563006 574522 582718 587153 588236 586995 584393 580768 576100 570718 565326 560296
53844 560296 555492 551006 547424 544807 541951 537494 531510 525214 519202 512839 505430 497134 488495 479879
53830 479879 471704 464346 457344 449421 439981 430062 421232 414008 407944 402638 397843 392960 387407 381417
53816 381417 375728 370627 365893 361439 357154 352298 346148 339457 334318 332060 331829 331534 329731 326398 322567
53801C22567l060j792j450k626m150m432l516k895l259l547k534m91J198J572
53787B91585Q27j58o36m81r3Q7j03o63j355j492m70J114J770J168Q86K068L206
53770B97260J978j218l343k403N79L434M906M512K286l51j236j24P04k98j543
53755C05143p74J398K462J723R43J589L363N418P155P674O213L637J967K014K704
53740C52629L125L604M277M258L247K610L546N230N985N400M178K714J201L82
53726D02386P10J183M50j139k018j817j724k382k956k833k830l817n147n487m642
53711C67937l746l887n147o729p629p296n921m077k152n03J82n16j823k462k317
53696C13914k398k938k822j535k43j6j84J78L61p30k184k086n33L76j84m92Q99
$$ plain form
53801 322567 319507 317715 316265 313639 309489 305057 301541 298646 295387 291840 289306 288815 290013 291585
53787 291585 292412 292254 291618 291137 291044 291131 291028 290365 289010 287518 287048 288162 289932 291100 291986 294054 297260
53770 297260 299238 298020 294677 292274 292853 296287 301193 305705 307991 307640 306404 306280 306984 306686 305143
53755 305143 304369 305767 308229 309952 310895 312484 315847 321265 328420 336094 342307 345944 347911 349925 352629
53740 352629 355754 359358 363635 367893 371140 373750 377296 382526 388511 393911 398089 400803 402004 402386
53726 402386 403096 404279 404729 403590 401572 399755 398031 395649 392693 389860 387030 383213 378066 372579 367937
53711 367937 364191 360304 355157 348428 340799 333503 327582 323505 321353 320850 321032 320516 318693 316231 313914
53696 313914 311516 308578 305756 304221 303978 303962 303778 303956 304317 303587 301403 299317 298784 299160 298976 298484 299383
53679B99383K814L019J172r01j237N56L107M256K938M88o11M12J955K556K719
53664C22626L427M225M111L420L280L685L586K714K015K233L139M142M745M477
53650C71825L327K249K266L142L841M128M604N142M693L003J275N88O76R41J611
53635D13311L058M600N034M073K539J342Q00P50Q35P55N58N26O60N83K14M5L93
53618D40076O96N1j683l617m626m210k803j426r33j438k391l046k755j292O49
53603D11252J594P82o77r14L47J478J132k56j419j765j393n44L54P61Q64J602
53587D13198L254M680M789M029L540L444L013K173J697K052K979M147N302N901
53573D64198N494M572M196M651N172N097M616M212M035M128M661N542O130N771
$$ plain form
53679 299383 302197 305216 306388 305487 304250 304806 307913 312169 315107 315595 314984 315396 317351 319907 322626
53664 322626 326053 330278 334389 337809 341089 344774 348360 351074 353089 355322 358461 362603 367348 371825
53650 371825 375152 377401 379667 382809 386650 390778 395382 400524 405217 408220 409495 410083 410759 411700 413311
53635 413311 416369 420969 426003 430076 432615 433957 434757 435507 436342 437097 437655 438181 438841 439424 439638 439683 440076
53618 440076 440772 440823 439140 435523 430897 426687 423884 422458 421525 420087 417696 414650 411895 410603 411252
53603 411252 412846 413628 412951 412037 412384 413862 414994 414738 413319 411554 410161 409617 409971 410732 411596 413198
53587 413198 416452 421132 425921 429950 433490 436934 439947 442120 443817 445869 448848 452995 458297 464198
53573 464198 469692 474264 478460 483111 488283 493380 497996 502208 506243 510371 515032 520574 526704 532475
53559E32475M616L687M001N413O515O122M894M823O780R254J0112Q900O839N196
53545F19627M536M974N998O310M931K407J33j255j972j994j111J39Q06P75N65
53530F44869N9j355l333m689n012m958m820m250l462l164l064k248j426k606n617
53515E94924p234n272j684L19N76J133K395K762J685O29P87J765K731L252K915
53500F01683J731R24J676L067L052J623R95K196L626L927M137N516O977O699N211
53485F53040M840O481Q712J0053J0592J1120J1888J2660J3251J3624J3964J4786
53473G85011J6515J8844K0828K1757K1781K1744K2430K3788K4803K4627K3856
53462A025984K3962K5258K6467K6837K7636L0370L4342L7346L8413L8455L8390
$$ plain form
53559 532475 537091 540778 544779 550192 556707 562829 567723 572546 579326 588580 598692 607592 614431 619627
53545 619627 624163 629137 635135 641445 646376 648783 648916 647661 645689 643695 642584 642723 643529 644304 644869
53530 644869 644928 643573 640240 635551 630539 625581 620761 616511 613049 609885 606821 604573 603147 600541 594924
53515 594924 587690 582418 580734 581053 581629 582762 585157 587919 589604 590233 591020 592785 595516 598768 601683
53500 601683 603414 604338 606014 609081 612133 613756 614751 616947 620573 624500 628637 634153 641130 647829 653040
53485 653040 657880 664361 673073 683126 693718 704838 716726 729386 742637 756261 770225 785011
53473 785011 801526 820370 841198 862955 884736 906480 928910 952698 977501 1002128 1025984
53462 1025984 1049946 1075204 1101671 1128508 1156144 1186514 1220856 1258202 1296615 1335070 1373460
53451A373460L8136L7631L7469L8046L9058M0208M1447M2214M1592L9738L8094
53440A807093L7566L7429L6660L5336L3975L2475L0718K9486K9612L0735L1757
53429B172842L2064L1474K9797K7625K6730K8058K9725K8770K4908K0757J8111
53418B470861J5817J2180P715M184J865o58m353q621j2284j4912j7014j9315k1910
53405B413555k4064k5150k5661k6666k8154k8914k8491k8274k9721l2361l4553
53394B101546l5634l6114l6033l4642l1936k9311k7995k7475k6136k3227j9730
53383A773313j7176j5842j4394j1518p629m288k016L29L548O590Q091Q674J0288
53370A737970J3411J6254J6992J5962J5302J7003K1317K6491L0164L1707L2953
$$ plain form
53451 1373460 1411596 1449227 1486696 1524742 1563800 1604008 1645455 1687669 1729261 1768999 1807093
53440 1807093 1844659 1882088 1918748 1954084 1988059 2020534 2051252 2080738 2110350 2141085 2172842
53429 2172842 2204906 2236380 2266177 2293802 2320532 2348590 2378315 2407085 2431993 2452750 2470861
53418 2470861 2486678 2498858 2506573 2510757 2512622 2511964 2507611 2498990 2486706 2471794 2454780 2435465 2413555
53405 2413555 2389491 2364341 2338680 2312014 2283860 2254946 2226455 2198181 2168460 2136099 2101546
53394 2101546 2065912 2029798 1993765 1959123 1927187 1897876 1869881 1842406 1816270 1793043 1773313
53383 1773313 1756137 1740295 1725901 1714383 1706754 1702466 1700450 1700779 1704327 1710917 1719008 1727682 1737970
53370 1737970 1751381 1767635 1784627 1800589 1815891 1832894 1854211 1880702 1910866 1942573 1975526
53359A975526L5905M0220M4008M6685M9379N2490N4781N5540N6094N8063O1365
53348B530056O4906O8244P1448P4303P6867P9999Q4026Q7536Q8925Q8695Q8777
53337C403782Q9842R0740R0657R0296R0469R0751R0232Q8659Q6186Q2737P8318
53326D372669P3547O9051O4612N9475N3385M6824M0157L3052K4974J6097P402
53315D861245j93o735j3199k0685k9602l9346m8532n5929o1664o7296p4070q1173
53303D362821q6430q8728q8955q8567q8268q8358q9005q9421q8000q4491q1028
53292C401570p9630p9418p8014p5099p2643p1600p0448o7692o4053o1020n8530
53281B623423n5385n1312m7327m4321m2138l9915l6796l2611k8393k5896k5847
$$ plain form
53359 1975526 2011431 2051651 2095659 2142344 2191723 2244213 2298994 2354534 2410628 2468691 2530056
53348 2530056 2594962 2663206 2734654 2808957 2885824 2965823 3049849 3137385 3226310 3315005 3403782
53337 3403782 3493624 3584364 3675021 3765317 3855786 3946537 4036769 4125428 4211614 4294351 4372669
53326 4372669 4446216 4515267 4579879 4639354 4692739 4739563 4779720 4812772 4837746 4853843 4861245
53315 4861245 4861052 4854317 4841118 4820433 4790831 4751485 4702953 4647024 4585360 4518064 4443994 4362821
53303 4362821 4276391 4187663 4098708 4010141 3921873 3833515 3744510 3655089 3567089 3482598 3401570
53292 3401570 3321940 3242522 3164508 3089409 3016766 2945166 2874718 2807026 2742973 2681953 2623423
53281 2623423 2568038 2516726 2469399 2425078 2382940 2343025 2306229 2273618 2245225 2219329 2193482
53270B193482k6828k6556k4217k1091j8949j8338j8385j7881j6408j4672j3551
53259A976606j2695j0478n960o11K831L407L019M025O518Q821J0146J1562J4181
53246B011372J7545K0566K3210K6313K9989L3313L5595L7136L8509L9847M1079
53235B354474M2175M2824M2508M1258L9662L7887L5466L2468K9987K8653K7434
53224B754796K4768K0392J5220R962M742l96n473j0574j5188j8241j9821k1932
53212B738255k6098l1031l4387l6204l8481m1677m4080m4982m5901m7809m9483
53201B298122m9879n0090n1333n2707n2859n2414n2701n3106n1881m9091m6567
53190A735494m5259m4506m3956m4135m4800m4489m2430l9583l7106l5017l3064
$$ plain form
53270 2193482 2166654 2140098 2115881 2094790 2075841 2057503 2039118 2021237 2004829 1990157 1976606
53259 1976606 1963911 1953433 1947473 1946862 1949693 1953100 1956119 1960144 1966662 1975483 1985629 1997191 2011372
53246 2011372 2028917 2049483 2072693 2099006 2128995 2162308 2197903 2235039 2273548 2313395 2354474
53235 2354474 2396649 2439473 2481981 2523239 2562901 2600788 2636254 2668722 2698709 2727362 2754796
53224 2754796 2779564 2799956 2815176 2825138 2829880 2829484 2824011 2813437 2798249 2780008 2760187 2738255
53212 2738255 2712157 2681126 2646739 2610535 2572054 2530377 2486297 2441315 2395414 2347605 2298122
53201 2298122 2248243 2198153 2146820 2094113 2041254 1988840 1936139 1883033 1831152 1782061 1735494
53190 1735494 1690235 1645729 1601773 1557638 1512838 1468349 1425919 1386336 1349230 1314213 1281149
53179A281149l1734l1382l1043k9300k6084k2762k0503j9199j8226j7514j7472
53168A015930j8098j8795j9189j9505j9736j9113j7309j5722j6281j8795k0879
53157H12508k0970k0069j9718j9630j8583j6647j4883j3512j1985j0549j0105
53146F35857j0557j0795j0401j0028r980r816r666j0479j2365j3938j4003j2890
53134E00939j1481r939q207o884o589o929o949o345n525m782l978k964j857r66
53120D17544o23r24j524k042k591l508m472m631l830l060l133l490k878j038Q35
53105C80635J302J63j310j667q50k36q03j740j532o1J330J666J194L54q09j980
53089C75656k465k298k311k613k138n78M58n81k882m197l642k265j096J7J426
$$ plain form
53179 1281149 1249415 1218033 1186990 1157690 1131606 1108844 1088341 1069142 1050916 1033402 1015930
53168 1015930 997832 979037 959848 940343 920607 901494 884185 868463 852182 833387 812508
53157 812508 791538 771469 751751 732121 713538 696891 682008 668496 656511 645962 635857
53146 635857 625300 614505 604104 594076 584096 574280 564614 554135 541770 527832 513829 500939
53134 500939 489458 479519 471312 464428 457839 450910 443961 437616 432091 427309 423331 420367 418510 417544
53120 417544 416921 415997 414473 412431 409840 406332 401860 397229 393399 390339 387206 383716 380838 379800 380635
53105 380635 381937 382100 380790 379123 378273 378037 377234 375494 373962 373901 375231 376897 378091 378445 377636 375656
53089 375656 373191 370893 368582 365969 363831 363253 363711 363130 360248 356051 352409 350144 349048 349065 350491
53074C50491K650K783J527m52j955k085r48N16J499J810J415K70j017j240j12
53059C55152J026R89N56J268K801L105J268j147k177j779j296j447j776j764j615
53044C53164j782k193k272j779j360j916l267l941k720k06J786K243J795J564
53030C39116J787J815J046m83k166l246l300k503j439o24k22J9N88J708K873L146
53014C38115K199P77j53m26n55r26j518k095k296j823j011p79j490k219j875p40
52998C23185j42p32j792k210j487J26J810K553J986Q61J62m0k91o75r04j212k065
52981C19133l088l417l082k866k728j712J78J438J124K70L68J425K407K817K768
52966C15035K227J226M03L02M73N6r64j778j756q03P97K280K692K004J350J356
$$ plain form
53074 350491 353141 355924 357451 356999 355044 352959 352011 352527 354026 355836 357251 357521 356504 355264 355152
53059 355152 356178 357167 357723 358991 361792 364897 366165 365018 362841 361062 359766 358319 356543 354779 353164
53044 353164 351382 349189 346917 345138 343778 341862 338595 334654 331934 331728 333514 335757 337552 339116
53030 339116 340903 342718 343764 343281 341115 337869 334569 332066 330627 330003 329781 329800 330388 332096 334969 338115
53014 338115 340314 341091 340938 340512 339957 339031 337513 335418 333122 331299 330288 329509 328019 325800 323925 323185
52998 323185 323043 322311 320519 318309 316822 316948 318758 321311 323297 324158 324320 324280 323989 323314 322410 321198 319133
52981 319133 316045 312628 309546 306680 303952 302240 302418 303856 304980 305250 305618 307043 309450 312267 315035
52966 315035 317262 318488 318891 319193 319666 319722 318758 316980 315224 314421 315218 317498 320190 322194 323544 324900
52950C24900R64r01l159l669k204o41j89j31L09N79J81q2M92J083O32k91m23L4
52932C17484j55r24p82O45J676R30o60j168q8J689L450M865N092L291K15k017
52916C33543k243j458j222j752k191j949j029L15J542J968J713J939L345M878
52902C37399M921L321J252m53j617j742l73J449J718j5j960k561k362k658l446
52887C32873l784l307k330j196l92o76j998l005k589j379o83o00m09k34q65k097
52871C07329k660j913m63R66K097K571J999Q32J17K00N41Q71J345J535N70j272
52855C14665k408j960q94m89p04q30p94r36j224j487j857k202j819m66Q91J248
52839B98734Q95Q13J165J335J046N61J6o32j152j209p71O2J277K392K410J132
$$ plain form
52950 324900 325864 324963 321804 318135 315931 315290 315101 314970 315279 315858 316039 315957 316449 317532 318164 317873 317450 317484
52932 317484 317329 316405 315623 316268 317944 318874 318214 317046 316958 318647 322097 326962 332054 335345 335560 333543
52916 333543 331300 329842 328620 326868 324677 322728 321699 322014 323556 325524 327237 329176 332521 337399
52902 337399 342320 345641 346893 346440 344823 343081 342708 344157 345875 345860 343900 341339 338977 336319 332873
52887 332873 329089 325782 323452 322256 321864 321188 319190 316185 313596 312217 311534 310934 310525 310291 309426 307329
52871 307329 304669 302756 302293 303259 305356 307927 309926 310758 310875 311075 311616 312487 313832 315367 315937 314665
52855 314665 312257 310297 309403 308914 308210 307380 306586 305650 304426 302939 301082 298880 297061 296595 297486 298734
52839 298734 299629 300442 301607 302942 303988 304549 304565 303933 302781 301572 300801 300863 302140 304532 306942 308074
52823C08074p9R9J044J118J50l98K96J413J998K177K372K522K621L062L709L487
52807C33665J747n44j851j857j481j358j105k77N55P3k208m786n206k811P3O30
52791C13259j040k245j440j6J59n66p78n44j118k515l131j929J75J472J115m54
52775C00404k002k325j366n69j328l023l581k169l31J27n23n36Q91K715L445K812
52759B92641J815J433J542J185j58j843k798k629j634k26J015J139k24j743j489
52744B88026M98J954J219o61j555r13J80Q94J296J484J353J195J428J712J260
52729B99370J00q17r97r40j152j392j303j070j044j202j347j401j229o72Q8O19
52713B85611R09J295J541Q67o10j388m03J247J593N46R0J442L131K790K87j948
$$ plain form
52823 308074 307995 308094 309138 310256 310406 310008 310304 311717 313715 315892 318264 320786 323407 326469 330178 333665
52807 333665 335412 334868 333017 331160 329679 328321 327216 326939 327494 327567 325359 320573 315367 312556 312629 313259
52791 313259 312219 309974 308534 308518 308677 308111 307333 306789 305671 303156 300025 298096 298271 299743 300858 300404
52775 300404 298402 296077 294711 294142 292814 289791 286210 284041 283710 283837 283314 282778 283669 286384 289829 292641
52759 292641 294456 295889 297431 298616 298458 296615 293817 291188 289554 289328 290343 291482 291258 289515 288026
52744 288026 288524 290478 291697 291036 289481 288568 288748 289642 290938 292422 293775 294970 296398 298110 299370
52729 299370 299470 298653 297656 296716 295564 294172 292869 291799 290755 289553 288206 286805 285576 284904 284992 285611
52713 285611 286520 287815 289356 290223 289613 288225 287822 289069 290662 291208 291298 292740 295871 298661 298948 297000
52697B97000j777K67J882J770P18N6l6j90n68p99q06p18q0J746M104N096L764
52680C11429J407%l0M17Q35J502K306K455J594M40r4K05R79J765K075J556M43
52663C29284m79p15o21r21j858l002l696l542k649j582r15p64q89j186j729k246
52647C02490k003o03J329K541K295R12o99j949k819l360l171j744N85K473K844
52632B99121K195J996K765L304K330L26r86q58l97q33j647j255O34K404K577J590
52616C13266P18J9j367l168l771k524q24p8K53J467L307M249L708K539J489M50
52600C19733o81j629k389l173l458k249K99K565L348L074K662K193J396M98k18
52585C21971r38j570j251M13K184K374R18o19r07PJ218J874J688J149J067J520
$$ plain form
52697 297000 295223 295490 297372 299142 299860 299916 299880 299690 299122 298323 297517 296799 296719 298465 302569 307665 311429
52680 311429 312836 312836 312806 313223 314058 315560 317866 320321 321915 322355 322261 322466 323445 325210 327285 328841 329284
52663 329284 328805 328090 327469 326548 324690 321688 317992 314450 311801 310219 309304 308540 307651 306465 304736 302490
52647 302490 300487 299884 301213 303754 306049 306961 306262 304313 301494 298134 294963 293219 293804 296277 299121
52632 299121 301316 303312 306077 309381 311711 312037 311051 310193 309796 308963 307316 306061 306695 309099 311676 313266
52616 313266 313984 314003 312636 309468 305697 303173 302349 302271 302524 303991 307298 311547 315255 317794 319283 319733
52600 319733 319052 317423 315034 311861 308403 306154 306453 309018 312366 315440 318102 320295 321691 322189 321971
52585 321971 321033 319463 318212 318625 320809 323183 324101 323482 322575 322582 323800 325674 327362 328511 329578 331098
52569C31098J618P66l86q69n88N7J006K032K162R03n21o32J16K04k77K27J830
52552C38746K542J237o42j320j053j093j614k077k517l018k779j132J010K152
52538C28442K185K120K211J788P25l02j013j675k015j266L87J641J692J058M38
52523C36416j50o44n66K1J81m12n33R57L153L997K880J209L64K07J6o1O06J713
52505C49354J819qk857m697m480l039j805j120l51P14J502J704J823K221K324
52490C43104J460Mj048j436j714k063j814m48J408K472K074O95p08j594j995j980
52474C36417j344r7R86Q91l66j565j642p47L49J301K021K079J198K9m88n40j126
52457C37356k339k951k065k58J328K193K325J744R19Q15J720K691K868K671K805
$$ plain form
52569 331098 332716 333482 333096 332227 331639 331696 332702 334734 336896 337799 337278 336646 336762 336966 336689 336916 338746
52552 338746 341288 342525 341883 340563 339510 338417 336803 334726 332209 329191 326412 325280 326290 328442
52538 328442 330627 332747 334958 336746 337471 337169 336156 334481 332466 331200 331587 333228 334920 335978 336416
52523 336416 336266 335622 335056 335077 335258 334846 334313 335270 338423 342420 345300 346509 346873 347080 347096 347035 347641 349354
52505 349354 351173 351165 348308 343611 339131 336092 334287 333167 332816 333530 335032 336736 338559 340780 343104
52490 343104 344564 344568 343520 342084 340370 338307 336493 336045 337453 339925 341999 342694 341986 340392 338397 336417
52474 336417 335073 334976 335962 336853 336487 334922 333280 332533 332882 334183 336204 338283 339481 339510 339022 338482 337356
52457 337356 335017 332066 330001 329743 331071 333264 335589 337333 338252 339067 340787 343478 346346 349017 351822
52442C51822K867K173J384J845L373M267L571J986L20j517l422m466m211l501
52428C56491k929j719P25L063L360J700Mn17l99m77p91j046r76l8K018L981L914
52411C66364J716k91k23R72J158J94j50Q91J856J190o19j820j559n24L04Q18J605
52394C71882K911M086M115K729P82o60j366j825k207k113j406p26p87j520k292
52379C71603k673k623k180j395m67M75J557K721L266K426M83j320k206k524k706
52364C64437k300q30R13J472O65J8R12K979M736N328N088M770M771M992N115N040
52348D08106N226O311Q086R247Q684O736M644L027J583J03j099j909k737l797
52334D52211m740n347n862o118n152k499M99J822J126Q5J90J073J433R45N21R54
$$ plain form
52442 351822 354689 356862 358246 360091 363464 367731 371302 373288 373608 372091 368669 364203 359992 356491
52428 356491 353562 351843 352568 355631 358991 360691 360695 360178 359779 359302 358511 357465 356489 356451 358469 362450 366364
52411 366364 368080 367789 367566 368538 369696 369890 369740 370631 372487 373677 373058 371238 369679 369155 369459 370277 371882
52394 371882 374793 378879 382994 385723 386505 385845 384479 382654 380447 378334 376928 376202 375415 373895 371603
52379 371603 368930 366307 364127 362732 362265 362740 364297 367018 370284 372710 373193 371873 369667 367143 364437
52364 364437 362137 361307 362220 363692 364357 364375 365287 368266 373002 378330 383418 388188 392959 397951 403066 408106
52348 408106 413332 419643 427729 436976 445660 452396 457040 460067 461650 461753 460654 458745 456008 452211
52334 452211 447471 442124 436262 430144 424992 422493 422992 424814 425940 426025 426215 427288 428721 429666 430187 431141
52318D31141J984K847L227L429L751M105M264M266M299M324M167M016M493N826
52304D86139P234P593O761N826N863O736P313O729N149L413K181J520J217J275
52290E54949J928L165M450N153N323N764P200R397J1326J2220J2394J2907J4418
52277F60594J6521J8359J9625K0711K1896K2857K3174K3043K3092K3737K4970
52266H98579K6606K8347K9662L0055K9499K8397K7126K5899K4976K4500K4097
52255A197743K3050K1062J8518J5905J3430J1264R655Q480P219N769M727M364
52243A341186L790J948p71k791l282l086l444m498n421n493m546k820r92q3o19
52228A309078j758j882k54K275M436N958P370Q819R852J0497J1717J4179J6999
$$ plain form
52318 431141 433125 435972 439199 442628 446379 450484 454748 459014 463313 467637 471804 475820 480313 486139
52304 486139 493373 500966 507727 513553 519416 526152 533465 540194 545343 548756 550937 552457 553674 554949
52290 554949 556877 560042 564492 569645 574968 580732 587932 597329 608655 620875 633269 646176 660594
52277 660594 677115 695474 715099 735810 757706 780563 803737 826780 849872 873609 898579
52266 898579 925185 953532 983194 1013249 1042748 1071145 1098271 1124170 1149146 1173646 1197743
52255 1197743 1220793 1241855 1260373 1276278 1289708 1300972 1310627 1319107 1326326 1332095 1336822 1341186
52243 1341186 1344976 1346924 1346153 1343362 1340080 1336994 1333550 1329052 1323631 1318138 1313592 1310772 1309780 1309697 1309078
52228 1309078 1307320 1305438 1305184 1307459 1311895 1317853 1325223 1334042 1343894 1354391 1366108 1380287 1397286
52215A397286J8574J8580J8300J8733J9201J8505J6802J5434J5027J4728J3408
$$ plain form
52215 1397286 1415860 1434440 1452740 1471473 1490674 1509179 1525981 1541415 1556442 1571170 1584578
$$ [...]
##END NTUPLES=NMR SPECTRUM
##END=
