
##TITLE=AC1040_TOFR01_5803208_MlVvfZni1d
##JCAMPDX= 6.0         $$ Bruker NMR JCAMP-DX V2.0
##DATA TYPE= NMR SPECTRUM
##DATA CLASS= NTUPLES
##ORIGIN= BRUKER
##OWNER= Administrator
$$ 1.72 TOPSPIN		Version 2.1
$$ 2012-03-23 09:56:25.609 -0500  Administrator@TOPSPIN
$$ Compression mode = diff/dup
##.OBSERVE FREQUENCY= 400.13188235
##.OBSERVE NUCLEUS= ^1H
##.ACQUISITION MODE= SIMULTANEOUS (DQD)
##.ACQUISITION SCHEME= undefined
##.AVERAGES= 64
##.DIGITISER RES= 22
##SPECTROMETER/DATA SYSTEM= spect
##.PULSE SEQUENCE= noesygpps1d.comp
##.SOLVENT NAME= COFFEE_meoh
##.SHIFT REFERENCE= INTERNAL, COFFEE_meoh, 1, 14.98061
##AUDIT TRAIL= $$ (NUMBER, WHEN, WHO, WHERE, PROCESS, VERSION, WHAT)
$$ ##TITLE= Audit trail, TOPSPIN		Version 2.1
$$ ##JCAMPDX= 5.01
$$ ##ORIGIN= Bruker BioSpin GmbH
$$ ##OWNER= Administrator
$$ $$ C:\Bruker\TOPSPIN/data/DARMN/nmr/AC1040_TOFR01_5803208_MlVvfZni1d/12/pdata/1/auditp.txt
$$ ##AUDIT TRAIL=  $$ (NUMBER, WHEN, WHO, WHERE, PROCESS, VERSION, WHAT)
(   1,<2012-03-22 17:34:19.515 -0500>,<Administrator>,<TOPSPIN>,<go>,<TOPSPIN 2.1>,
      <created by zg
	started at 2012-03-22 17:22:47.921 -0500,
	POWCHK enabled, PULCHK disabled,
       configuration hash MD5:
       1A 1E CE 29 27 FD 77 03 67 4E F0 E3 C4 B2 CB 90
       data hash MD5: 64K
       B3 35 24 FC 79 9D 51 8F FB 35 F8 8D 57 63 7F 12>)
(   2,<2012-03-23 09:56:22.859 -0500>,<Administrator>,<TOPSPIN>,<proc1d>,<TOPSPIN 2.1>,
      <Start of raw data processing
       efp LB = 0.3 FT_mod = 6 PKNL = 1 PHC0 = 0 PHC1 = 0 SI = 128K 
       data hash MD5: 128K
       A0 FF 75 34 AA F4 1B 88 DA 4C 3B D2 60 A9 1C 87>)
(   3,<2012-03-23 09:56:24.187 -0500>,<Administrator>,<TOPSPIN>,<proc1d>,<TOPSPIN 2.1>,
      <pk PHC0 = 33.9917 PHC1 = 0 
       data hash MD5: 128K
       C8 C4 AB 62 51 74 1C DE 5E 51 9F 71 41 06 90 DE>)
(   4,<2012-03-23 09:56:24.765 -0500>,<Administrator>,<TOPSPIN>,<proc1d>,<TOPSPIN 2.1>,
      <abs ABSG = 1 
       data hash MD5: 128K
       32 3D BE A2 10 FA 1C 6B A4 72 A6 67 C6 7D 44 27>)
(   5,<2012-03-23 09:56:24.937 -0500>,<Administrator>,<TOPSPIN>,<proc1d>,<TOPSPIN 2.1>,
      <abs ABSG = 2 
       data hash MD5: 128K
       54 0D E9 E7 ED 18 A5 66 57 0E 7A B6 2F DD FC BD>)
(   6,<2012-03-23 09:56:25.093 -0500>,<Administrator>,<TOPSPIN>,<proc1d>,<TOPSPIN 2.1>,
      <abs ABSG = 3 
       data hash MD5: 128K
       3A 57 78 E7 83 33 6A 05 AF C2 49 DA 62 74 A5 22>)
(   7,<2012-03-23 09:56:25.265 -0500>,<Administrator>,<TOPSPIN>,<proc1d>,<TOPSPIN 2.1>,
      <abs ABSG = 4 
       data hash MD5: 128K
       1B B2 4F 7D 80 2C 0A 68 70 6C 05 69 22 34 8B B2>)
(   8,<2012-03-23 09:56:25.406 -0500>,<Administrator>,<TOPSPIN>,<proc1d>,<TOPSPIN 2.1>,
      <abs ABSG = 5 
       data hash MD5: 128K
       74 CB 0D 76 B6 2D 5D 88 76 1C E0 07 D4 3E 47 F3>)
$$ ##END=
$$ 
$$ $$ hash MD5
$$ $$ 53 E6 7D F1 92 A3 E7 0A 2A AF D1 98 5D 89 DA B3
##$RELAX= 
##$RELAX= 
##$RELAX= 
##$RELAX= 
##$RELAX= 
##$RELAX= 
##$RELAX= 
##$RELAX= 
$$ Bruker specific parameters
$$ [...]
150 150 150 150 150 150 150 150
##$TP07= 0
##$TPNAME0= <>
##$TPNAME1= <>
##$TPNAME2= <>
##$TPNAME3= <>
##$TPNAME4= <>
##$TPNAME5= <>
##$TPNAME6= <>
##$TPNAME7= <>
##$TPOAL= (0..7)
0.5 0.5 0.5 0.5 0.5 0.5 0.5 0.5
##$TPOFFS= (0..7)
0 0 0 0 0 0 0 0
##$TUNHIN= 0
##$TUNHOUT= 0
##$TUNXOUT= 0
##$USERA1= <user>
##$USERA2= <user>
##$USERA3= <user>
##$USERA4= <user>
##$USERA5= <user>
##$V9= 5
##$VALIST= <valist>
##$VCLIST= <CCCCCCCCCCCCCCC>
##$VD= 0
##$VDLIST= <DDDDDDDDDDDDDDD>
##$VPLIST= <PPPPPPPPPPPPPPP>
##$VTLIST= <TTTTTTTTTTTTTTT>
##$WBST= 2048
##$WBSW= 25
##$XGAIN= (0..3)
0 0 0 0
##$XL= 0
##$YL= 0
##$YMAX_a= 13452940
##$YMIN_a= -6425696
##$ZGOPTNS= <>
##$ZL1= 120
##$ZL2= 120
##$ZL3= 120
##$ZL4= 120
##$ABSF1= 14.98061
##$ABSF2= -5.57192
##$ABSG= 5
##$ABSL= 3
##$ALPHA= 0
##$AQORDER= 0
##$ASSFAC= 0
##$ASSFACI= 0
##$ASSFACX= 0
##$ASSWID= 0
##$AUNMP= <proc_prof1d_extract.lims>
##$AXLEFT= 0
##$AXNAME= <>
##$AXNUC= <1H>
##$AXRIGHT= 0
##$AXTYPE= 0
##$AXUNIT= <>
##$AZFE= 0.1
##$AZFW= 0.1
##$BCFW= 0
##$BC_mod= 0
##$BYTORDP= 0
##$COROFFS= 0
##$CY= 15
##$DATMOD= 1
##$DC= 0
##$DFILT= <>
##$DTYPP= 0
##$F1P= 0
##$F2P= 0
##$FCOR= 0.5
##$FTSIZE= 131072
##$FT_mod= 6
##$GAMMA= 0
##$GB= 0
##$INTBC= 1
##$INTSCL= 1
##$ISEN= 128
##$LB= 0.3
##$LEV0= 0
##$LPBIN= 0
##$MAXI= 10000
##$MC2= 0
##$MEAN= 0
##$ME_mod= 0
##$MI= 0
##$NCOEF= 0
##$NC_proc= -3
##$NLEV= 6
##$NOISF1= 0
##$NOISF2= 0
##$NSP= 0
##$NTH_PI= 0
##$NZP= 0
##$OFFSET= 14.98061
##$PC= 1
##$PHC0= 33.9917
##$PHC1= 0
##$PH_mod= 1
##$PKNL= yes
##$PPARMOD= 0
##$PPDIAG= 0
##$PPIPTYP= 0
##$PPMPNUM= 2147483647
##$PPRESOL= 1
##$PSCAL= 4
##$PSIGN= 0
##$PYNMP= <proc.py>
##$REVERSE= no
##$SF= 400.13
##$SI= 131072
##$SIGF1= 0
##$SIGF2= 0
##$SINO= 400
##$SIOLD= 131072
##$SPECTYP= <>
##$SREGLST= <1H.CDCl3>
##$SSB= 0
##$STSI= 131072
##$STSR= 0
##$SW_p= 8223.68421052632
##$SYMM= 0
##$S_DEV= 0
##$TDeff= 65536
##$TDoff= 0
##$TI= <>
##$TILT= no
##$TM1= 0
##$TM2= 0
##$TOPLEV= 0
##$USERP1= <user>
##$USERP2= <user>
##$USERP3= <user>
##$USERP4= <user>
##$USERP5= <user>
##$WDW= 1
##$XDIM= 131072
##$YMAX_p= 451564161
##$YMIN_p= -11746228
##$CURPLOT= <Network HP LaserJet P1505>
##$CURPRIN= <$Network HP LaserJet P1505>
##$DFORMAT= <normdp>
##$LAYOUT= <+/1D_H.xwp>
##$LFORMAT= <normlp>
##$PFORMAT= <normpl>
##$SURQMSG= 1
$$ End of Bruker specific parameters
$$ ---------------------------------
##NTUPLES= NMR SPECTRUM
##VAR_NAME=  FREQUENCY,     SPECTRUM/REAL,   SPECTRUM/IMAG
##SYMBOL=    X,             R,               I
##VAR_TYPE=  INDEPENDENT,   DEPENDENT,       DEPENDENT
##VAR_FORM=  AFFN,          ASDF,            ASDF
##VAR_DIM=   131072,        131072,          131072
##UNITS=     HZ,            ARBITRARY UNITS, ARBITRARY UNITS
##FACTOR=    0.0627417313425165, 1,          1
##FIRST=     8223.62146879498, 781,          -83643
##LAST=      0,             4279,            -85011
##MIN=       0,             -11746228,       0
##MAX=       8223.62146879498, 451564161,    0
$$ Real data points
##PAGE= N=1
##DATA TABLE= (X++(R..R)), XYDATA
$$ [...]
$$ plain form
60754 1350943 1341439 1332274 1323553 1314435 1303623 1290534 1275692 1259930 1243795 1228053 1214172 1203292
60742 1203292 1194670 1186110 1176338 1166274 1157513 1150304 1143845 1137984 1133520 1130880 1129482 1128710 1128847 1130692
60728 1130692 1134786 1141328 1150375 1161531 1173664 1185555 1197043 1209276 1223541 1239987 1257648 1275579
60716 1275579 1293474 1311223 1328543 1345570 1363251 1382396 1402530 1422343 1441061 1458542 1474308
60705 1474308 1487654 1498809 1508821 1517902 1525102 1530169 1534575 1539799 1545501 1550297 1553621 1555895 1557599
60692 1557599 1559146 1560998 1562941 1563771 1562709 1560508 1558164 1555282 1550970 1545630 1540276 1534583 1527282 1518259
60678 1518259 1508423 1497600 1484690 1470370 1457556 1448007 1440031 1430800 1419750 1408398 1397885 1388300
60666 1388300 1379882 1373259 1368411 1364554 1361339 1359362 1359186 1360402 1361997 1363414 1364973 1367201 1369720 1371078
$$ packed form
60754A350943r504r165q721r118j0812j3089j4842j5762j6135j5742j3881j0880
60742A203292q622q560r772j0064q761p209o459n861m464k640j398p72J37J845
60728A130692M094O542R047J1156J2133J1891J1488J2233J4265J6446J7661J7931
60716A275579J7895J7749J7320J7027J7681J9145K0134J9813J8718J7481J5766
60705A474308J3346J1155J0012R081P200N067M406N224N702M796L324K274J704
60692A557599J547J852J943Q30j062k201k344k882m312n340n354n693p301r023
60678A518259r836j0823j2910j4320j2814r549p976r231j1050j1352j0513r585
60666A388300q418o623m848l857l215j977j76J216J595J417J559K228K519J358
$$ plain form
60652 1371078 1370160 1367773 1366088 1366161 1366635 1365450 1362206 1358078 1353835 1349180 1344064 1339392 1335634 1331566 1325573
60637 1325573 1317992 1310998 1305838 1301195 1295060 1287356 1279427 1271376 1261493 1248612 1233536 1217412 1200032
60624 1200032 1181030 1161740 1144198 1128548 1112978 1096317 1079400 1063568 1049074 1035615 1023547
60613 1023547 1013693 1006283 1000650 995924 991850 989026 988387 990299 994252 999525 1005788 1012803 1020087 1027423
60599 1027423 1035136 1043138 1050284 1055704 1060339 1066066 1073540 1082002 1090769 1099542 1107489 1113823 1119412 1126179
60585 1126179 1134462 1142583 1149411 1155575 1161453 1166029 1169067 1172755 1179408 1188669 1198583 1208417 1218679 1229293
60571 1229293 1239930 1251752 1266731 1285028 1304751 1324535 1344663 1365141 1384406 1401062 1415821
60560 1415821 1430507 1445666 1460083 1472438 1482577 1491097 1498228 1503500 1506410 1507168 1506488 1504688 1501455
$$ packed form
60652A371078r18k387j685P3M74j185l244m128m243m655n116m672l758m068n993
60637A325573p581o994n160m643o135p704p929q051r883j2881j5076j6124j7380
60624A200032j9002j9290j7542j5650j5570j6661j6917j5832j4494j3459j2068
60613A023547r854p410n633m726m074k824o39J912L953N273O263P015P284P336
60599A027423P713Q002P146N420M635N727P474Q462Q767Q773P947O334N589O767
60585A126179Q283Q121O828O164N878M576L038L688O653R261R914R834J0262J0614
60571A229293J0637J1822J4979J8297J9723J9784K0128K0478J9265J6656J4759
60560A415821J4686J5159J4417J2355J0139Q520P131N272K910P58o80j800l233
$$ plain form
60547 1501455 1496775 1491598 1486901 1482253 1475930 1466472 1453705 1438383 1421483 1403906 1386275 1368792
60535 1368792 1351618 1335478 1321480 1310178 1301102 1293268 1285914 1278817 1272404 1267669 1265488 1265747 1267364
60522 1267364 1269377 1271862 1275657 1281339 1288512 1295945 1302318 1306893 1309566 1310468 1309901 1308786 1308673 1310722 1314719
60507 1314719 1319577 1324709 1330488 1337340 1344908 1352345 1359141 1365451 1371695 1377829 1382886 1385439 1384897 1382409
60493 1382409 1380053 1379082 1379345 1380539 1383394 1389041 1397496 1407568 1418515 1431317 1447817 1468795 1493381
60480 1493381 1520417 1549932 1583015 1620610 1662787 1708784 1757083 1805428 1851262 1892304 1926443
60469 1926443 1951420 1965468 1968408 1961476 1946014 1923276 1895788 1867583 1841881 1819204 1798867 1781820
60457 1781820 1770596 1766496 1768268 1773955 1782786 1794578 1808373 1823029 1838809 1857353 1879954 1906605
$$ packed form
60547A501455m680n177m697m648o323r458j2767j5322j6900j7577j7631j7483
60535A368792j7174j6140j3998j1302r076p834p354p097o413m735k181K59J617
60522A267364K013K485L795N682P173P433O373M575K673R02n67j115j13K049L997
60507A314719M858N132N779O852P568P437O796O310O244O134N057K553n42k488
60493A382409k356r71K63J194K855N647Q455J0072J0947J2802J6500K0978K4586
60480A493381K7036K9515L3083L7595M2177M5997M8299M8345M5834M1042L4139
60469A926443K4977J4048K940o932j5462k2738k7488k8205k5702k2677k0337j7047
60457A781820j1224m100J772N687Q831J1792J3795J4656J5780J8544K2601K6651
$$ plain form
60445 1906605 1936812 1970656 2008829 2052271 2102306 2160725 2229015 2307452 2395440 2492894 2600902
60434 2600902 2720892 2853535 2998694 3155965 3324862 3504941 3696661 3902141 4124380
60425 4124380 4365634 4627245 4911141 5220326 5556603 5917387 6294254 6673268 7035671
60416 7035671 7359195 7621047 7801709 7887361 7870734 7752004 7539943 7251096 6906133 6525631
60406 6525631 6127892 5728315 5338457 4964998 4610573 4276535 3964944 3677966 3416245
60397 3416245 3178809 2964276 2771202 2597271 2439389 2295387 2165053 2048778 1945665
60388 1945665 1853696 1771334 1697962 1632920 1575117 1523587 1477413 1435052 1394964 1357354 1324137
60377 1324137 1296352 1272458 1249981 1228027 1207142 1187495 1168591 1150570 1134296 1119931 1106556
$$ packed form
60445A906605L0207L3844L8173M3442N0035N8419O8290P8437Q7988R7454J08008
60434B600902J19990J32643J45159J57271J68897J80079J91720K05480K22239
60425D124380K41254K61611K83896L09185L36277L60784L76867L79014L62403
60416G035671L23524K61852J80662Q5652j6627j18730k12061k88847l44963l80502
60406F525631l97739l99577l89858l73459l54425l34038l11591k86978k61721
60397C416245k37436k14533j93074j73931j57882j44002j30334j16275j03113
60388A945665r1969q2362p3372o5042n7803n1530m6174m2361m0088l7610l3217
60377A324137k7785k3894k2477k1954k0885j9647j8904j8021j6274j4365j3375
$$ plain form
60366 1106556 1093595 1081595 1071037 1061333 1051900 1043618 1038122 1035717 1035045 1035075 1036489 1040422 1046473 1053013
60352 1053013 1059239 1065638 1072065 1076569 1077256 1074637 1070948 1067542 1064255 1061263 1059802 1060496 1062282 1063933
60338 1063933 1065637 1068096 1070990 1073520 1075924 1079193 1083523 1088143 1092512 1096701 1100729 1104581 1108877 1114367
60324 1114367 1120454 1125144 1126921 1126042 1123701 1120700 1117471 1114686 1112930 1111791 1109887 1106224 1101396 1097168
60310 1097168 1094668 1093180 1091144 1088263 1085939 1085463 1086609 1088467 1090743 1093292 1095248 1096055 1097067 1100605
60296 1100605 1107249 1115322 1123231 1130999 1139067 1147081 1154815 1163120 1172703 1182590 1191100 1198085 1205082 1213264
60282 1213264 1222203 1230865 1238905 1246490 1253275 1258142 1260011 1258886 1256116 1253634 1252688 1253199 1254364 1255773
60268 1255773 1257874 1261426 1266651 1272904 1279071 1284292 1288321 1291171 1292574 1292108 1289910 1286903 1284011 1281236
$$ packed form
60366A106556j2961j2000j0558r704r433q282n496k405o72L0J414L933O051O540
60352A053013O226O399O427M504O87k619l689l406l287k992j461O94J786J651
60338A063933J704K459K894K530K404L269M330M620M369M189M028L852M296N490
60324A114367O087M690J777q79k341l001l229k785j756j139j904l663m828m228
60310A097168k500j488k036k881k324m76J146J858K276K549J956Q07J012L538
60296A100605O644Q073P909P768Q068Q014P734Q305R583R887Q510O985O997Q182
60282A213264Q939Q662Q040P585O785M867J869j125k770k482r46N11J165J409
60268A255773K101L552N225O253O167N221M029K850J403m66k198l007k892k775
$$ plain form
60254 1281236 1277721 1272694 1266271 1259455 1253528 1249275 1246492 1244195 1241600 1239078 1238001 1239391 1242699 1246093
60240 1246093 1247972 1248099 1247361 1246803 1247087 1248452 1250629 1252822 1254188 1254434 1253807 1252798 1252270 1253559 1257593 1263915
60224 1263915 1271329 1279623 1289710 1301780 1314376 1325995 1336739 1347613 1358990 1370695 1382927 1395882
60212 1395882 1408889 1421215 1433478 1447063 1462224 1478027 1494286 1512123 1532205 1553693 1575756
60201 1575756 1599294 1626291 1657926 1693902 1733131 1774582 1817992 1864436 1915944 1973912 2038011
60190 2038011 2107020 2180557 2259583 2345436 2438881 2540143 2649486 2767419 2894229 3029304
60180 3029304 3171215 3318869 3472649 3634078 3804154 3981917 4164386 4347644 4528268
60171 4528268 4704127 4873649 5034083 5181074 5310880 5422792 5518359 5598179 5660539 5703515
$$ packed form
60254A281236l515n027o423o816n927m253k783k297k595k522j077J390L308L394
60240A246093J879J27p38n58K84J365K177K193J366K46o27j009n28J289M034O322
60224A263915P414Q294J0087J2070J2596J1619J0744J0874J1377J1705J2232J2955
60212A395882J3007J2326J2263J3585J5161J5803J6259J7837K0082K1488K2063
60201A575756K3538K6997L1635L5976L9229M1451M3410M6444N1508N7968O4099
60190B038011O9009P3537P9026Q5853R3445J01262J09343J17933J26810J35075
60180C029304J41911J47654J53780J61429J70076J77763J82469J83258J80624
60171D528268J75859J69522J60434J46991J29806J11912R5567P9820O2360M2976
$$ plain form
60161 5703515 5727355 5734207 5726388 5705792 5674509 5635125 5590555 5544079 5499232 5459103 5425844 5401239
60149 5401239 5387423 5386524 5399739 5427310 5469420 5526716 5599970 5689620 5795734 5918085 6055781
60138 6055781 6206657 6367112 6532879 6700109 6865620 7026127 7177819 7317056 7440940
60129 7440940 7546594 7630470 7689413 7722325 7729932 7713019 7672092 7608808 7526545 7429076 7319726
60118 7319726 7202266 7081496 6962085 6847655 6741579 6647693 6569215 6507688 6463984 6439686
60108 6439686 6436341 6453697 6489808 6542720 6611198 6693949 6788986 6893527 7003689 7114431 7220790
60097 7220790 7319317 7407785 7483814 7544856 7589692 7619169 7635358 7640695 7638057 7630781 7622161 7615268
60085 7615268 7613299 7619470 7636364 7666007 7710909 7774587 7860725 7972085 8110452 8277253 8473937
$$ packed form
60161E703515K3840O852p819k0596l1283l9384m4570m6476m4847m0129l3259k4605
60149E401239j3816q99J3215K7571M2110N7296P3254Q9650J06114J22351J37696
60138F055781J50876J60455J65767J67230J65511J60507J51692J39237J23884
60129G440940J05654Q3876N8943L2912P607j6913m0927o3284q2263r7469j09350
60118G319726j17460j20770j19411j14430j06076r3886p8478o1527m3704k4298
60108F439686l345J7356L6111N2912O8478Q2751R5037J04541J10162J10742J06359
60097G220790R8527Q8468P6029O1042M4836K9477J6189N337k638p276q620o893
60085G615268j969O171J6894K9643M4902O3678Q6138J11360J38367J66801J96684
$$ plain form
60074 8473937 8701771 8961446 9253042 9576777 9933924 10326332 10754220 11214584 11702498
60065 11702498 12213870 12746098 13295841 13856841 14420237 14976421 15516258 16031028 16511877
60056 16511877 16949627 17335495 17662415 17925505 18120745 18243490 18289181 18255659 18144208 17958499
60046 17958499 17703771 17387391 17018991 16609108 16168169 15707236 15238595 14774237 14323897
60037 14323897 13895258 13495384 13130745 12806015 12523924 12286281 12094168 11947203 11843767
60028 11843767 11782194 11760668 11775572 11820889 11889765 11975859 12072742 12173077 12269416 12355362 12425425
60017 12425425 12474596 12499202 12497814 12470367 12416683 12336623 12231071 12101487 11948723 11773553
60007 11773553 11578329 11366803 11142143 10906335 10661698 10411593 10159298 9907781 9661332
$$ packed form
60074H473937K27834K59675K91596L23735L57147L92408M27888M60364M87914
60065A1702498N11372N32228N49743N61000N63396N56184N39837N14770M80849
60056A6511877M37750L85868L26920K63090J95240J22745M5691l3522j11451j85709
60046A7958499k54728l16380l68400m09883m40939m60933m68641m64358m50340
60037A4323897m28639l99874l64639l24730k82091k37643j92113j46965j03436
60028A1843767o1573k1526J4904M5317O8876Q6094R6883J00335R6339Q5946P0063
60017A2425425M9171K4606j388k7447n3684q0060j05552j29584j52764j75170
60007A1773553j95224k11526k24660k35808k44637k50105k52295k51517k46449
$$ plain form
59998 9661332 9425882 9206368 9004856 8822440 8661788 8526135 8416539 8332029 8272323 8238760
59988 8238760 8232522 8253371 8300228 8371536 8464767 8576892 8705794 8850049 9006770 9170481
59978 9170481 9334447 9492232 9637910 9766242 9873528 9957489 10015735 10045194 10043573 10010435
59968 10010435 9946242 9851461 9727727 9579195 9411565 9229903 9038122 8840283 8641594 8448096
59958 8448096 8265626 8098610 7949296 7818286 7706101 7614011 7543429 7495348 7470787 7471047 7496927
59947 7496927 7548262 7624788 7726954 7855376 8009894 8189381 8391657 8613150 8849381 9096063
59937 9096063 9348750 9601016 9844494 10071726 10277936 10459117 10610065 10726080 10805436 10848110
59927 10848110 10852813 10817689 10743827 10635861 10498939 10337142 10155351 9960499 9759855 9559537
$$ packed form
59998I661332k35450k19514k01512j82416j60652j35653j09596q4510n9706l3563
59988H238760o238K0849M6857P1308R3231J12125J28902J44255J56721J63711
59978I170481J63966J57785J45678J28332J07286Q3961N8246K9459j621l3138
59968A0010435o4193r4781j23734j48532j67630j81662j91781j97839j98689j93498
59958H448096j82470j67016j49314j31010j12185r2090p0582m8081k4561K60K5880
59947G496927N1335P6526J02166J28422J54518J79487K02276K21493K36231K46682
59937I096063K52687K52266K43478K27232K06210J81181J50948J16015P9356M2674
59927A0848110M703l5124p3862j07966j36922j61797j81791j94852k00644k00318
$$ plain form
59917 9559537 9365488 9184196 9020949 8878331 8757664 8661045 8590715 8547174 8529432 8537020
59907 8537020 8570520 8630022 8713965 8819714 8944481 9085296 9238539 9400119 9566275 9734085
59897 9734085 9901096 10064502 10221108 10368341 10504945 10630259 10743300 10843489 10932262 11012932
59887 11012932 11088656 11161388 11233237 11308058 11391013 11487150 11601166 11738070 11903132 12101023
59877 12101023 12335456 12609574 12926097 13286713 13691279 14137532 14621451 15137871 15680476
59868 15680476 16240746 16806800 17363630 17894658 18382865 18810829 19161129 19418267 19570981
59859 19570981 19613298 19544436 19368673 19095178 18737117 18310233 17831561 17318260 16786178 16248786
59849 16248786 15717434 15202412 14713177 14257329 13839837 13463799 13131927 12846888 12610215
$$ packed form
59917I559537j94049j81292j63247j42618j20667r6619p0330m3541j7742P588
59907H537020L3500N9502Q3943J05749J24767J40815J53243J61580J66156J67810
59897I734085J67011J63406J56606J47233J36604J25314J13041J00189Q8773Q0670
59887A1012932P5724P2732P1849P4821Q2955R6137J14016J36904J65062J97891
59877A2101023K34433K74118L16523L60616M04566M46253M83919N16420N42605
59868A5680476N60270N66054N56830N31028M88207M27964L50300K57138J52714
59859A9570981M2317o8862j75763k73495l58061m26884m78672n13301n32082n37392
59849A6248786n31352n15022m89235m55848m17492l76038l31872k85039k36673
$$ plain form
59840 12610215 12421541 12279467 12183022 12131771 12124538 12158775 12231415 12339622 12479837 12646226
59830 12646226 12830527 13023300 13214831 13395122 13553794 13680381 13764722 13797586 13771966 13684237
59820 13684237 13534043 13323422 13056761 12741413 12387115 12003882 11600406 11184266 10762849
59811 10762849 10343521 9933191 9537826 9161762 8807157 8474632 8164881 7879321 7618973
59802 7618973 7383399 7171304 6981681 6813571 6665013 6533030 6414772 6308159 6211417 6122546
59792 6122546 6039482 5960447 5884058 5809378 5736205 5665322 5598365 5537196 5482891 5434935 5391492
59781 5391492 5350653 5311235 5272066 5230842 5184589 5131692 5073076 5010988 4946885 4881035 4813996
59770 4813996 4747815 4685404 4629117 4580141 4538838 4505066 4478395 4458560 4445702 4439786 4439909 4444937
$$ packed form
59840A2610215j88674j42074r6445n1251p233L4237P2640J08207J40215J66389
59830A2646226J84301J92773J91531J80291J58672J26587Q4341L2864k5620q7729
59820A3684237j50194k10621k66661l15348l54298l83233m03476m16140m21417
59811A0762849m19328m10330l95365l76064l54605l32525l09751k85560k60348
59802G618973k35574k12095j89623j68110j48558j31983j18258j06613r6742q8871
59792F122546q3064p9035p6389p4680p3173p0883o6957o1169n4305m7956m3443
59781E391492m0839l9418l9169m1224m6253n2897n8616o2088o4103o5850o7039
59770D813996o6181o2411n6287m8976m1303l3772k6671j9835j2858n916J23N028
$$ plain form
59758 4444937 4455054 4472126 4498305 4534641 4580943 4636010 4697576 4762963 4830803 4901858 4977583
59747 4977583 5058200 5142510 5228778 5314933 5398507 5477379 5550360 5616317 5673446 5720714 5759760
59736 5759760 5794066 5826295 5857643 5889693 5925322 5967461 6018301 6080139 6155588 6246324 6353023
59725 6353023 6477467 6623520 6794896 6992884 7217394 7469474 7751575 8065923 8413967
59716 8413967 8797012 9215791 9668850 10151722 10656971 11173110 11682231 12159038 12573559
59707 12573559 12896903 13107577 13195796 13164322 13026298 12801986 12515502 12191101 11849313 11505139
59697 11505139 11169376 10850796 10556561 10291494 10058377 9859072 9694717 9565179 9469450
59688 9469450 9406856 9377320 9380548 9415694 9481925 9578733 9705808 9863391 10052782 10275653 10532581
$$ packed form
59758D444937J0117J7072K6179L6336M6302N5067O1566O5387O7840P1055P5725
59747D977583Q0617Q4310Q6268Q6155Q3574P8872P2981O5957N7129M7268L9046
59736E759760L4306L2229L1348L2050L5629M2139N0840O1838P5449R0736J06699
59725F353023J24444J46053J71376J97988K24510K52080K82101L14348L48044
59716H413967L83045M18779M53059M82872N05249N16139N09121M76807M14521
59707A2573559L23344K10674Q8219l1474j38024k24312k86484l24401l41788l44174
59697A1505139l35763l18580k94235k65067k33117j99305j64355j29538r5729
59688I469450o2594k9536L228L5146O6231R6808J27075J57583J89391K22871K56928
$$ plain form
59677 10532581 10822948 11146553 11504824 11900322 12335623 12812752 13332998 13897051 14506055
59668 14506055 15162876 15871612 16635302 17454451 18327906 19254118 20230651 21252938 22314359
59659 22314359 23407074 24521673 25646072 26765977 27867383 28939031 29973355 30966733
59651 30966733 31919986 32838441 33730640 34606195 35474010 36341258 37212708 38090061 38971164
59642 38971164 39849169 40712177 41544148 42326917 43042143 43672534 44203044 44622723 44926315
59633 44926315 45114396 45192554 45171151 45065720 44896464 44686127 44457538 44232210 44029820 43867986
59623 43867986 43762386 43727302 43775737 43918744 44164892 44520725 44991313 45579753 46286222 47107841
59613 47107841 48038926 49070036 50185840 51363471 52572378 53774948 54927247 55980270
$$ packed form
59677A0532581K90367L23605L58271L95498M35301M77129N20246N64053O09004
59668A4506055O56821P08736P63690Q19149Q73455R26212R76533J022287J061421
59659B2314359J092715J114599J124399J119905J101406J071648J034324R93378
59651C0966733R53253R18455Q92199Q75555Q67815Q67248Q71450Q77353Q81103
59642C8971164Q78005Q63008Q31971P82769P15226O30391N30510M19679L03592
59633D4926315J88081P8158k1403j05431j69256k10337k28589k25328k02390j61834
59623D3867986j05600l5084M8435J43007K46148L55833M70588N88440P06469Q21619
59613D7107841R31085J031110J115804J177631J208907J202570J152299J053023
$$ plain form
59605 55980270 56882062 57580656 58028188 58186631 58033861 57567122 56802131 55769129 54508381
59596 54508381 53066445 51492938 49837219 48144856 46454626 44797103 43194959 41663441
59588 41663441 40209487 38830150 37512379 36235011 34972297 33698698 32394891 31052995
59580 31052995 29677661 28282425 26884799 25503422 24156695 22860699 21626622 20460132
59572 20460132 19363457 18337992 17384962 16504216 15693172 14947538 14263100 13636589 13064793
59563 13064793 12543517 12068244 11635748 11244242 10891664 10574403 10288106 10029273 9795520
59554 9795520 9584515 9393215 9218199 9056363 8905038 8761410 8622047 8483326 8342604
59545 8342604 8198801 8051674 7900896 7746232 7588307 7428600 7268913 7111334 6958310
$$ packed form
59605E5980270R01792O98594M47532J58443j52770m66739p64991j033002j260748
59596E4508381j441936j573507j655719j692363j690230j657523j602144j531518
59588D1663441j453954j379337j317771j277368j262714j273599j303807j341896
59580C1052995j375334j395236j397626j381377j346727j295996j234077j166490
59572B0460132j096675j025465r53030q80746q11044p45634o84438o26511n71796
59563A3064793n21276m75273m32496l91506l52578l17261k86297k58833k33753
59554I795520k11005j91300j75016j61836j51325j43628j39363j38721j40722
59545H342604j43803j47127j50778j54664j57925j59707j59687j57579j53024
$$ plain form
59536 6958310 6811741 6672156 6539792 6416401 6304648 6205462 6117369 6039122 5971653 5916439
59526 5916439 5873071 5839840 5816000 5801989 5797710 5802067 5814325 5834731 5863397 5899368 5941150 5987559
59514 5987559 6037768 6091079 6147037 6205683 6267611 6333947 6406104 6485249 6572067 6667280 6772196
59503 6772196 6888302 7016553 7157535 7312297 7482478 7669518 7874092 8096474 8337281
59494 8337281 8597898 8880282 9186133 9515898 9868428 10241520 10632669 11039449 11459594
59485 11459594 11890756 12329588 12770875 13208129 13635359 14047922 14441719 14812558 15156808
59476 15156808 15471678 15753999 15999640 16205488 16371928 16502688 16602654 16676605 16729409 16765950
59466 16765950 16790673 16808155 16824190 16845497 16878431 16928815 17002606 17104977 17237819 17398649
$$ packed form
59536F958310j46569j39585j32364j23391j11753r9186q8093p8247o7469n5214
59526E916439m3368l3231k3840j4011m279M357J2258K0406K8666L5971M1782M6409
59514E987559N0209N3311N5958N8646O1928O6336P2157P9145Q6818R5213J04916
59503F772196J16106J28251J40982J54762J70181J87040K04574K22382K40807
59494H337281K60617K82384L05851L29765L52530L73092L91149M06780M20145
59485A1459594M31162M38832M41287M37254M27230M12563L93797L70839L44250
59476A5156808L14870K82321K45641K05848J66440J30760R9966P3951N2804L6541
59466A6765950K4723J7482J6035K1307L2934N0384P3791J02371J32842J60830
$$ plain form
59456 17398649 17581925 17780100 17982740 18175880 18343799 18471849 18547715 18561052 18503315 18368343
59446 18368343 18152932 17857091 17484310 17041748 16539923 15991861 15412027 14815077 14214658
59437 14214658 13622544 13048231 12498848 11979460 11493783 11044601 10633371 10259921 9923452
59428 9923452 9624041 9362594 9139174 8952066 8799031 8679016 8592012 8537522 8514019 8520130
59418 8520130 8555701 8621135 8715940 8838672 8988475 9165890 9371394 9603475 9858974 10135115
59408 10135115 10429847 10739684 11058336 11378450 11693755 11998056 12282479 12535463 12746104
59399 12746104 12906611 13011235 13054333 13031019 12939789 12783707 12568903 12302369 11991124 11642730
59389 11642730 11265708 10869149 10461880 10051802 9645366 9247123 8859888 8485891 8127844
$$ packed form
59456A7398649J83276J98175K02640J93140J67919J28050P5866J3337n7737j34972
59446A8368343k15411k95841l72781m42562n01825n48062n79834n96950o00419
59437A4214658n92114n74313n49383n19388m85677m49182m11230l73450l36469
59428I923452k99411k61447k23420j87108j53035j20015q7004n4490k3503O111
59418H520130L5571O5434R4805J22732J49803J77415K05504K32081K55499K76141
59408A0135115K94732L09837L18652L20114L15305L04301K84423K52984K10641
59399A2746104J60507J04624M3098k3314r1230j56082k14804k66534l11245l48394
59389A1642730l77022l96559m07269m10078m06436l98243l87235l73997l58047
$$ plain form
59380 8127844 7788490 7469195 7169710 6889538 6628858 6387792 6165698 5961996 5777097
59371 5777097 5611563 5464500 5333546 5216339 5111511 5018646 4938068 4870445 4815763 4772632
59361 4772632 4739280 4715119 4700688 4696058 4700078 4711230 4728686 4752571 4783711 4822899 4869382 4919887
59349 4919887 4969919 5016546 5059873 5102189 5146498 5195817 5252892 5319985 5399178 5492833 5603012
59338 5603012 5729916 5870903 6021158 6175671 6331621 6490033 6655263 6832559 7026319
59329 7026319 7240725 7480572 7749831 8049898 8381026 8745610 9148487 9593790 10083129
59320 10083129 10617429 11198965 11830451 12513095 13246378 14028474 14855319 15719322 16609788
59311 16609788 17514310 18419357 19310375 20172903 20994400 21765320 22479194 23132352 23723408
$$ packed form
59380H127844l39354l19295k99485k80172k60680k41066k22094k03702j84899
59371E777097j65534j47063j30954j17207j04828r2865q0578o7623n4682m3131
59361D772632l3352k4161j4431m630M020J1152J7456K3885L1140L9188M6483N0505
59349D919887N0032M6627M3327M2316M4309M9319N7075O7093P9193R3655J10179
59338E603012J26904J40987J50255J54513J55950J58412J65230J77296J93760
59329G026319K14406K39847K69259L00067L31128L64584M02877M45303M89339
59320A0083129N34300N81536O31486O82644P33283P82096Q26845Q64003Q90466
59311A6609788R04522R05047Q91018Q62528Q21497P70920P13874O53158N91056
$$ plain form
59302 23723408 24252587 24721354 25132112 25487051 25786634 26029563 26214113 26338342 26398540
59293 26398540 26388677 26302692 26137068 25890856 25564373 25159454 24680889 24136366 23534639 22884138
59283 22884138 22193038 21469502 20721276 19955411 19178812 18398893 17623450 16859736 16113616
59274 16113616 15389762 14692756 14027648 13398939 12809176 12259118 11748936 11278344 10845710
59265 10845710 10448640 10086165 9759268 9468372 9211201 8984155 8785054 8613347 8468024
59256 8468024 8346654 8246569 8166047 8104121 8059801 8031585 8017290 8014454 8021250 8036703 8059522
59245 8059522 8087125 8116476 8145496 8172829 8196629 8214801 8226558 8232678 8233855 8229738 8220120 8206320
59233 8206320 8190664 8175059 8160891 8150112 8145581 8149987 8164884 8191177 8230362 8284729 8356191 8445292
$$ packed form
59302B3723408N29179M68767M10758L54939K99583K42929J84550J24229O0198
59293B6398540r863q5985j65624k46212l26483m04919m78565n44523o01727o50501
59283B2884138o91100p23536p48226p65865p76599p79919p75443p63714p46120
59274A6113616p23854o97006o65108o28709n89763n50058n10182m70592m32634
59265A0845710l97070l62475l26897k90896k57171k27046j99101j71707j45323
59256H468024j21370j00085q0522o1926m4320k8216j4295k836O796J5453K2819
59245H059522K7603K9351K9020K7333K3800J8172J1757O120J177m117r618j3800
59233H206320j5656j5605j4168j0779m531M406J4897K6293L9185N4367P1462Q9101
$$ plain form
59221 8445292 8551656 8675116 8815923 8974001 9148482 9337912 9540169 9751952 9968737
59212 9968737 10185273 10395490 10591957 10766653 10913241 11028358 11110524 11158858 11173748 11157916
59202 11157916 11115275 11048740 10960230 10852854 10731768 10602320 10468075 10331113 10193450 10057205
59192 10057205 9923591 9792550 9663608 9536774 9412419 9290588 9170786 9052597 8936473
59183 8936473 8823996 8717542 8619717 8532744 8457992 8396222 8348668 8317834 8306749 8317473 8350898
59172 8350898 8408032 8490822 8601576 8742451 8916020 9125556 9373858 9662040 9989919 10357022
59162 10357022 10762428 11204025 11678544 12181706 12706944 13243748 13778052 14294253 14776199
59153 14776199 15206641 15567637 15842924 16019997 16090268 16048746 15894855 15633324 15273613 14828554
$$ packed form
59221H445292J06364J23460J40807J58078J74481J89430K02257K11783K16785
59212I968737K16536K10217J96467J74696J46588J15117Q2166M8334J4890j5832
59202A1157916m2641o6535q8510j07376j21086j29448j34245j36962j37663j36245
59192A0057205j33614j31041j28942j26834j24355j21831j19802j18189j16124
59183H936473j12477j06454r7825q6973p4752o1770m7554l0834j1085J0724L3425
59172H350898N7134Q2790J10754J40875J73569K09536K48302K88182L27879L67103
59162A0357022M05406M41597M74519N03162N25238N36804N34304N16201M81946
59153A4776199M30442L60996K75287J77073P0271m1522j53891k61531l59711m45059
$$ plain form
59143 14828554 14313725 13746861 13146006 12527332 11904587 11289696 10692418 10119209 9573682
59134 9573682 9058830 8577958 8132908 7722567 7344534 6997877 6683012 6399185 6143539
59125 6143539 5913024 5705836 5520452 5354487 5205487 5072018 4953107 4847494 4754516 4674966
59115 4674966 4609506 4556448 4512525 4476011 4447833 4429399 4420509 4419876 4426593 4440347 4460863 4487873
59103 4487873 4521287 4560939 4606478 4657762 4715031 4778573 4848594 4925445 5009314 5099375 5193652
59092 5193652 5289839 5385921 5480247 5571890 5660944 5747484 5829923 5905253 5971162 6027003 6072411
59081 6072411 6106176 6127216 6135731 6132657 6118963 6096454 6068361 6037871 6006366 5974151 5942627 5914729
59069 5914729 5893303 5879894 5875083 5879249 5893027 5917626 5954694 6005390 6069768 6147582 6239448 6346549
$$ packed form
59143A4828554n14829n66864o00855o18674o22745o14891n97278n73209n45527
59134I573682n14852m80872m45050m10341l78033l46657l14865k83827k55646
59125F143539k30515k07188j85384j65965j49000j33469j18911j05613r2978p9550
59115D674966o5460n3058m3923l6514k8178j8434q890o33O717J3754K0516K7010
59103D487873L3414L9652M5539N1284N7269O3542P0021P6851Q3869R0061R4277
59092E193652R6187R6082R4326R1643Q9054Q6540Q2439P5330O5909N5841M5408
59081F072411L3765K1040Q515l074j3694k2509k8093l0490l1505l2215l1524k7898
59069E914729k1426j3409m811M166J3778K4599L7068N0696O4378P7814R1866J07101
$$ plain form
59057 6346549 6469368 6607545 6761013 6930468 7116320 7317702 7533065 7761747 8004684
59048 8004684 8263414 8538389 8828285 9130750 9443168 9762282 10083604 10402121 10713329
59039 10713329 11012417 11292100 11542156 11751571 11910691 12011596 12048155 12017099 11918714 11755940
59029 11755940 11533488 11258321 10939956 10588877 10214389 9824091 9424542 9021563 8620302
59020 8620302 8225659 7842202 7473047 7119305 6781255 6459598 6155076 5867688 5597248
59011 5597248 5344237 5109145 4891262 4688784 4499783 4322590 4156036 4000178 3856183
59002 3856183 3724440 3603254 3490334 3384967 3287665 3198137 3114887 3036602 2962841 2893501
58992 2893501 2828719 2769256 2715863 2668142 2624741 2584554 2546970 2511213 2476460 2442570 2409788
$$ packed form
59057F346549J22819J38177J53468J69455J85852K01382K15363K28682K42937
59048H004684K58730K74975K89896L02465L12418L19114L21322L18517L11208
59039A0713329K99088K79683K50056K09415J59120J00905L6559l1056r8385j62774
59029A1755940k22452k75167l18365l51079l74488l90298l99549m02979m01261
59020H620302l94643l83457l69155l53742l38050l21657l04522k87388k70440
59011E597248k53011k35092k17883k02478j89001j77193j66554j55858j43995
59002C856183j31743j21186j12920j05367r7302q9528q3250p8285p3761o9340
58992B893501o4782n9463n3393m7721m3401m0187l7584l5757l4753l3890l2782
$$ plain form
58981 2409788 2377878 2346452 2316116 2288298 2263909 2242883 2224879 2209525 2196076 2183862 2173226
58970 2173226 2165229 2160373 2158250 2158359 2160498 2164461 2170093 2177463 2186240 2195201 2203236 2210444 2217175 2222527
58956 2222527 2225393 2226904 2230076 2236519 2244823 2252667 2259293 2265325 2271457 2278252 2286329 2295725 2305605 2315356
58942 2315356 2325476 2336591 2347878 2357258 2363250 2366329 2368487 2371553 2375824 2380215 2383719 2386501 2389361
58929 2389361 2392588 2396099 2400513 2407133 2416516 2427669 2439147 2450646 2463072 2477073 2491959 2506541
58917 2506541 2521094 2537867 2559009 2584376 2612359 2642549 2676053 2712958 2751275 2789404 2828172
58906 2828172 2869208 2912620 2957770 3005030 3054901 3106344 3158076 3211020 3267378 3327557 3390132
58895 3390132 3454698 3522553 3594283 3668857 3745973 3827576 3916057 4012019 4114419 4221873 4333497
$$ packed form
58981B409788l1910l1426l0336k7818k4389k1026j8004j5354j3449j2214j0636
58970B173226p997m856k123J09K139L963N632P370Q777Q961Q035P208O731N352
58956B222527K866J511L172O443Q304P844O626O032O132O795Q077R396R880R751
58942B315356J0120J1115J1287R380N992L079K158L066M271M391L504K782K860
58929B389361L227L511M414O620R383J1153J1478J1499J2426J4001J4886J4582
58917B506541J4553J6773K1142K5367K7983L0190L3504L6905L8317L8129L8768
58906B828172M1036M3412M5150M7260M9871N1443N1732N2944N6358O0179O2575
58895C390132O4566O7855P1730P4574P7116Q1603Q8481R5962J02400J07454J11624
$$ plain form
58884 4333497 4449685 4572610 4704934 4847547 4999360 5159326 5327641 5505048 5692360
58875 5692360 5890884 6101980 6325941 6562610 6813427 7081653 7370428 7681719 8017076
58866 8017076 8377906 8765025 9179679 9625112 10105307 10622021 11175063 11765758 12397720
58857 12397720 13073542 13793180 14556688 15366013 16222259 17122977 18063844 19041052 20049731
58848 20049731 21081120 22123143 23162514 24183927 25167561 26089364 26923955 27646707 28234580
58839 28234580 28667704 28931504 29017629 28924247 28656729 28227308 27652758 26952520 26148910 25266656
58829 25266656 24329419 23356636 22364541 21368992 20385135 19424610 18494858 17601170 16748002
58820 16748002 15938429 15173797 14454241 13778788 13145358 12551799 11996775 11478676 10994284
$$ packed form
58884D333497J16188J22925J32324J42613J51813J59966J68315J77407J87312
58875E692360J98524K11096K23961K36669K50817K68226K88775L11291L35357
58866H017076L60830L87119M14654M45433M80195N16714N53042N90695O31962
58857A2397720O75822P19638P63508Q09325Q56246R00718R40867R77208J008679
58848B0049731J031389J042023J039371J021413R83634R21803Q34591P22752N87873
58839B8234580M33124K63800Q6125r3382k67518m29421n74550p00238q03610q82254
58829B5266656r37237r72783r92095r95549r83857r60525r29752q93688q53168
58820A6748002q09573p64632p19556o75453o33430n93559n55024n18099m84392
$$ plain form
58811 10994284 10540005 10114311 9717524 9349102 9006405 8686367 8387279 8108705 7850673
58802 7850673 7613345 7396584 7199249 7019223 6854308 6702974 6564552 6439208 6327549
58793 6327549 6229730 6145179 6073522 6015119 5969966 5936651 5913440 5900148 5898020 5907995 5930030 5963966
58781 5963966 6009999 6068130 6137973 6219358 6312588 6418085 6536327 6668163 6814662 6976524
58771 6976524 7153926 7346937 7555798 7780997 8023362 8283955 8563832 8864417 9188284
58762 9188284 9538859 9918867 10329602 10772044 11247976 11759499 12308349 12896470 13526556
58753 13526556 14201102 14921404 15688032 16501348 17360446 18261998 19200935 20171258 21164643
58744 21164643 22168410 23165826 24137956 25064026 25920589 26682327 27324690 27825920 28167970
$$ packed form
58811A0994284m54279m25694l96787l68422l42697l20038k99088k78574k58032
58802G850673k37328k16761j97335j80026j64915j51334j38422j25344j11659
58793F327549r7819q4551p1657n8403m5153l3315k3211j3292k128R975K2035L3936
58781E963966M6033N8131O9843Q1385R3230J05497J18242J31836J46499J61862
58771F976524J77402J93011K08861K25199K42365K60593K79877L00585L23867
58762I188284L50575L80008M10735M42442M75932N11523N48850N88121O30086
58753A3526556O74546P20302P66628Q13316Q59098R01552R38937R70323R93385
58744B1164643J003767R97416R72130R26070Q56563P61738O42363N01230L42050
$$ plain form
58735 28167970 28338025 28330423 28146809 27794530 27285778 26637929 25872869 25014348 24085472 23107837
58725 23107837 22101348 21083601 20069301 19070310 18095938 17153189 16247324 15382444 14561321
58716 14561321 13784704 13051360 12359308 11707192 11094615 10521266 9985733 9485244 9016824
58707 9016824 8578506 8168970 7786331 7428207 7092970 6779792 6487190 6212786 5955128
58698 5955128 5714604 5491660 5285128 5093221 4915196 4750902 4599548 4460069 4331831
58689 4331831 4213645 4102872 3997349 3897840 3806926 3725372 3650988 3581159 3515127 3453367 3395947
58678 3395947 3342096 3290843 3241640 3194616 3150101 3107494 3065083 3021649 2977818 2934982 2893292
58667 2893292 2851727 2809787 2767889 2726191 2684195 2641634 2598715 2555338 2511041 2465924 2420722
$$ packed form
58735B8167970J70055p602j83614l52279n08752o47849p65060q58521r28876r77635
58725B3107837j006489j017747j014300r98991r74372r42749r05865q64880q21123
58716A4561321p76617p33344o92052o52116o12577n73349n35533n00489m68420
58707I016824m38318m09536l82639l58124l35237l13178k92602k74404k57658
58698E955128k40524k22944k06532j91907j78025j64294j51354j39479j28238
58689D331831j18186j10773j05523r9509r0914q1554p4384o9829o6032o1760n7420
58678C395947n3851n1253m9203m7024m4515m2607m2411m3434m3831m2836m1690
58667B893292m1565m1940m1898m1698m1996m2561m2919m3377m4297m5117m5202
$$ plain form
58656 2420722 2375634 2329788 2282307 2233509 2185041 2139069 2097056 2058566 2021314 1983048 1943463
58645 1943463 1903987 1866128 1830688 1798119 1768529 1741233 1715102 1689565 1664809 1641095 1618414
58634 1618414 1596716 1575901 1555608 1535543 1515950 1497379 1480187 1464645 1451178 1440071 1431272
58623 1431272 1424885 1421323 1420480 1421347 1423043 1425584 1428900 1431794 1432870 1432154 1430934 1430242 1430159 1430174 1429536 1427611
58607 1427611 1424558 1421257 1418185 1414983 1411540 1408485 1406027 1403543 1401186 1400507 1402160 1404300 1404851 1404368 1404945
58592 1404945 1407365 1411365 1417823 1428149 1441617 1455606 1468880 1482891 1499677 1520049 1544037 1571391
58580 1571391 1601273 1632865 1666655 1703943 1745019 1789073 1835952 1886522 1941248 1999942 2063137
58569 2063137 2132245 2207954 2289821 2377758 2472738 2575708 2687134 2807998 2940118 3084991
$$ packed form
58656B420722m5088m5846m7481m8798m8468m5972m2013l8490l7252l8266l9585
58645A943463l9476l7859l5440l2569k9590k7296k6131k5537k4756k3714k2681
58634A618414k1698k0815k0293k0065j9593j8571j7192j5542j3467j1107q799
58623A431272o387l562q43Q67J696K541L316K894J076p16j220o92q3J5o38j925
58607A427611l053l301l072l202l443l055k458k484k357o79J653K140N51m83N77
58592A404945K420M000O458J0326J3468J3989J3274J4011J6786K0372K3988K7354
58580A571391K9882L1592L3790L7288M1076M4054M6879N0570N4726N8694O3195
58569B063137O9108P5709Q1867Q7937R4980J02970J11426J20864J32120J44873
$$ plain form
58559 3084991 3243145 3414727 3599701 3797356 4006809 4228282 4462989 4711612 4973607
58550 4973607 5247727 5531960 5822889 6116040 6406575 6688394 6952682 7188680 7386020
58541 7386020 7535846 7630995 7667561 7646542 7572406 7450000 7284238 7082254 6853332 6606012
58531 6606012 6346684 6081054 5814955 5553065 5298380 5053393 4820264 4599570 4390761
58522 4390761 4194484 4012851 3846866 3695205 3556129 3429018 3313309 3207536 3110281 3020883
58512 3020883 2938636 2862631 2792827 2729812 2672874 2619839 2569401 2522132 2478534 2437649 2398344
58501 2398344 2360390 2323363 2285822 2246481 2205002 2161121 2114552 2066572 2020033 1976601 1935194
58490 1935194 1894163 1853723 1815217 1779321 1746300 1716936 1691674 1669464 1648669 1628801 1610471
$$ packed form
58559C084991J58154J71582J84974J97655K09453K21473K34707K48623K61995
58550D973607K74120K84233K90929K93151K90535K81819K64288K35998J97340
58541G386020J49826R5149L6566k1019p4136j22406j65762k01984k28922k47320
58531F606012k59328k65630k66099k61890k54685k44987k33129k20694k08809
58522D390761j96277j81633j65985j51661j39076j27111j15709j05773r7255q9398
58512C020883q2247p6005o9804o3015n6938n3035n0438m7269m3598m0885l9305
58501B398344l7954l7027l7541l9341m1479m3881m6569m7980m6539m3432m1407
58490A935194m1031m0440l8506l5896l3021k9364k5262k2210k0795j9868j8330
$$ plain form
58479 1610471 1593973 1578678 1563664 1548620 1534350 1522285 1512984 1505378 1498172 1491367 1485179 1478146
58467 1478146 1468228 1455593 1442274 1428920 1413942 1396301 1377058 1357538 1337859 1318044 1298710
58456 1298710 1279814 1260471 1240831 1222490 1206330 1191747 1178683 1168344 1160950 1154878 1149171 1144799
58444 1144799 1142090 1139094 1134320 1129275 1126370 1125781 1126212 1127396 1129768 1132657 1134790 1135971 1136787 1137363 1137836
58429 1137836 1139253 1142582 1147374 1152517 1157626 1162587 1166587 1168741 1169046 1167821 1165153 1161838 1159740 1159854
58415 1159854 1160761 1160226 1157764 1154667 1152186 1150605 1149517 1148178 1146081 1143660 1141759 1140169 1137711 1133962
58401 1133962 1129604 1124832 1119013 1112413 1106398 1101212 1095347 1088148 1081252 1076316 1072955 1070159 1068167 1067663
58387 1067663 1068587 1070876 1074881 1079851 1083657 1085399 1086831 1089875 1094269 1099027 1104601 1111937 1120703 1130024
$$ packed form
58479A610471j6498j5295j5014j5044j4270j2065r301p606p206o805o188p033
58467A478146r918j2635j3319j3354j4978j7641j9243j9520j9679j9815j9334
58456A298710j8896j9343j9640j8341j6160j4583j3064j0339p394o072n707m372
58444A144799k709k996m774n045k905n89M31J184K372K889K133J181Q16N76M73
58429A137836J417L329M792N143N109M961M000K154L05j225k668l315k098J14
58415A159854R07n35k462l097k481j581j088j339k097k421j901j590k458l749
58401A133962m358m772n819o600o015n186n865p199o896m936l361k796j992n04
58387A067663R24K289M005M970L806J742J432L044M394M758N574P336Q766R321
$$ plain form
58373 1130024 1139703 1149295 1157266 1162583 1166053 1168807 1170615 1170780 1169315 1166199 1161148 1155346 1151551 1151042
58359 1151042 1152138 1153201 1155158 1159404 1165278 1171677 1179344 1189190 1199894 1209600 1218891 1229912 1243478
58346 1243478 1258941 1275730 1292980 1308669 1321130 1330683 1338199 1343221 1345059 1344375 1341884 1336831 1328697
58333 1328697 1319103 1310074 1301615 1292927 1284724 1278295 1273472 1269505 1266814 1265839 1265360 1263957 1261979 1260108
58319 1260108 1257333 1252584 1247283 1244014 1243495 1244787 1247438 1251413 1255932 1260464 1266066 1273976 1283862 1294991
58305 1294991 1307754 1322214 1336604 1349276 1360862 1372684 1384547 1396042 1408338 1422481 1437382
58294 1437382 1451585 1465584 1480248 1494627 1507575 1519901 1532599 1544590 1554599 1563568 1572717 1580937
58282 1580937 1586687 1590883 1595218 1599214 1601592 1603116 1605469 1608765 1612588 1617783 1624794 1632025 1638366 1645406
$$ packed form
58373A130024R679R592P971N317L470K754J808J65j465l116n051n802l795n09
58359A151042J096J063J957M246N874O399P667R846J0704R706R291J1021J3566
58346A243478J5463J6789J7250J5689J2461R553P516N022J838o84k491n053q134
58333A328697r594r029q459q688q203o429m823l967k691r75m79j403j978j871
58319A260108k775m749n301l269n19J292K651L975M519M532N602P910R886J1129
58305A294991J2763J4460J4390J2672J1586J1822J1863J1495J2296J4143J4901
58294A437382J4203J3999J4664J4379J2948J2326J2698J1991J0009Q969R149Q220
58282A580937N750M196M335L996K378J524K353L296L823N195P011P231O341P040
$$ plain form
58268 1645406 1654724 1665265 1676098 1689153 1706087 1724949 1743405 1762776 1785144 1808805 1830585
58257 1830585 1850622 1870962 1891476 1911251 1931974 1955595 1980267 2002676 2022703 2041923 2059551
58246 2059551 2074141 2087222 2100923 2114170 2125741 2138685 2156699 2178371 2200345 2223961 2252978
58235 2252978 2286507 2320218 2353199 2387617 2422761 2455611 2486731 2519787 2555728 2592776 2631253
58224 2631253 2672843 2716138 2758647 2802121 2850049 2901172 2951785 3003215 3060247 3123116 3187999
58213 3187999 3254721 3326745 3403928 3482662 3563114 3648944 3739606 3830329 3920271 4013532 4111701
58202 4111701 4212616 4316941 4428531 4547634 4671221 4800716 4941901 5096440 5261103
58193 5261103 5435951 5625164 5828738 6041665 6262876 6497142 6746715 7009034 7283934
$$ packed form
58268A645406R318J0541J0833J3055J6934J8862J8456J9371K2368K3661K1780
58257A830585K0037K0340K0514J9775K0723K3621K4672K2409K0027J9220J7628
58246B059551J4590J3081J3701J3247J1571J2944J8014K1672K1974K3616K9017
58235B252978L3529L3711L2981L4418L5144L2850L1120L3056L5941L7048L8477
58224B631253M1590M3295M2509M3474M7928N1123N0613N1430N7032O2869O4883
58213C187999O6722P2024P7183P8734Q0452Q5830R0662R0723Q9942R3261R8169
58202D111701J00915J04325J11590J19103J23587J29495J41185J54539J64663
58193E261103J74848J89213K03574K12927K21211K34266K49573K62319K74900
$$ plain form
58184 7283934 7574950 7882036 8201284 8533350 8884073 9255700 9646094 10057449 10496467
58175 10496467 10964816 11459117 11981587 12540443 13138237 13770596 14438475 15150682 15912017
58166 15912017 16720281 17577635 18493446 19473225 20516607 21629038 22823196 24106067 25477510
58157 25477510 26944549 28523974 30228780 32067404 34059682 36238219 38631964 41267408
58149 41267408 44190505 47466999 51152895 55280854 59878464 64977758 70603714 76784550
58141 76784550 83591022 91151051 99628284 109221103 120186146 132809853 147319736 163839398
58133 163839398 182429153 203129365 225995303 251224420 279265918 310489866 344258954
58126 344258954 378059962 407682262 428629656 437831316 434544477 420169187 397457384
$$ packed form
58184G283934K91016L07086L19248L32066L50723L71627L90394M11355M39018
58175A0496467M68349M94301N22470N58856N97794O32359O67879P12207P61335
58166A5912017Q08264Q57354R15811R79779J043382J112431J194158J282871J371443
58157B5477510J467039J579425J704806J838624J992278K178537K393745K635444
58149D1267408K923097L276494L685896M127959M597610N099294N625956O180836
58141G6784550O806472P560029Q477233R592819J0965043J2623707J4509883J6519662
58133A63839398J8589755K0700212K2865938K5229117K8041498L1223948L3769088
58126C44258954L3801008K9622300K0947394R201660l286839j4375290k2711803
$$ plain form
58119 397457384 369640149 339697831 309876437 281543644 255342379 231451912 209807576
58112 209807576 190260130 172680061 156977696 143054321 130767288 119955849 110484827
58105 110484827 102255610 95195169 89250831 84382273 80535478 77621259 75533473 74196386
58097 74196386 73577875 73615619 74090637 74569895 74513055 73489087 71334289 68147341 64179012
58088 64179012 59731929 55104203 50544544 46217030 42204560 38541667 35235092 32265876
58080 32265876 29600907 27214007 25087973 23198387 21510804 19996304 18637167 17415510
58072 17415510 16309076 15301318 14384244 13547837 12776579 12059351 11393437 10775966 10200021
58063 10200021 9661464 9160958 8696771 8263351 7858719 7485132 7140759 6818916 6517219
$$ packed form
58119C97457384k7817235k9942318k9821394k8332793k6201265k3890467k1644336
58112B09807576j9547446j7580069j5702365j3923375j2287033j0811439r471022
58105A10484827q229217p060441n944338m868558l846795k914219k087786j337087
58097G4196386o18511L7744M75018M79258n6840j023968k154798l186948l968329
58088F4179012m447083m627726m559659m327514m012470l662893l306575k969216
58080C2265876k664969k386900k126034j889586j687583j514500j359137j221657
58072A7415510j106434j007758r17074q36407p71258p17228o65914o17471n75945
58063A0200021n38557n00506m64187m33420m04632l73587l44373l21843l01697
$$ plain form
58054 6517219 6238868 5982611 5739799 5504266 5277448 5060996 4852225 4650252 4459434
58045 4459434 4282795 4118010 3962938 3819194 3687263 3563800 3446650 3337176 3235124
58036 3235124 3136662 3040052 2948011 2862117 2780074 2700633 2625780 2555802 2487610 2420382 2357380
58025 2357380 2299599 2242938 2184515 2126831 2072991 2022624 1975131 1932047 1893287 1855663 1817861
58014 1817861 1782390 1750089 1717651 1683575 1651684 1625209 1601750 1577712 1553706 1531841 1511280
58003 1511280 1490252 1469430 1449835 1430051 1408603 1386521 1364900 1342683 1319536 1298133 1280723
57992 1280723 1265876 1251201 1237052 1225179 1215871 1208459 1202462 1196500 1188517 1178618 1169137 1160654 1151038
57979 1151038 1139744 1129471 1121792 1114878 1107678 1102546 1101075 1100927 1099805 1099258 1101195 1103508 1102668 1098526
$$ packed form
58054F517219k78351k56257k42812k35533k26818k16452k08771k01973j90818
58045D459434j76639j64785j55072j43744j31931j23463j17150j09474j02052
58036C235124r8462r6610r2041q5894q2043p9441p4853o9978o8192o7228o3002
58025B357380n7781n6661n8423n7684n3840n0367m7493m3084l8760l7624l7802
58014A817861l5471l2301l2438l4076l1891k6475k3459k4038k4006k1865k0561
58003A511280k1028k0822j9595j9784k1448k2082k1621k2217k3147k1403j7410
57992A280723j4847j4675j4149j1873r308p412n997n962p983r899r481q483r616
57979A151038j1294j0273p679o914p200n132j471j48j122n47J937K313q40m142
$$ plain form
57965 1098526 1093495 1089020 1085599 1084256 1085149 1086397 1086591 1086629 1087117 1086411 1083498 1080242 1078154 1075375 1069613
57950 1069613 1061718 1053421 1043886 1031684 1018225 1005897 994418 982202 969943 959684 951534 944311
57938 944311 938438 935109 933291 930283 924790 917123 907147 894595 881030 869241 860713 855113 851622
57925 851622 849326 847213 845320 845032 846833 848982 849874 850402 852312 855505 858705 861539 864164 866041 866832
57910 866832 867330 867834 866911 863581 859440 856813 856002 856027 856637 857629 857559 855298 851803 848468 844882 840068 834608
57893 834608 829504 824187 817761 810939 804634 797979 790116 782695 778001 775615 773589 772050 772764 775557
57879 775557 777956 778416 777629 776733 776386 777409 780120 782884 783221 780423 775547 769230 761368 752646 744339
57864 744339 736630 728854 721290 714850 709210 703182 696974 692215 689536 687940 686807 686897 688967 692805 697987
$$ packed form
57965A098526n031m475l421j343Q93J248J94L8M88p06k913l256k088k779n762
57950A069613p895q297r535j2202j3459j2328j1479j2216j2259j0259q150p223
57938I44311n873l329j818l008n493p667r976j2552j3565j1789q528n600l491
57925H51622k296k113j893k88J801K149Q92N28J910L193L200K834K625J877P91
57910H66832M98N04r23l330m141k627q11K5O10R92p0k261l495l335l586m814n460
57893H34608n104n317o426o822o305o655p863p421m694k386k026j539P14K793
57879G75557K399M60p87q96l47J023K711K764L37k798m876o317p862q722q307
57864G44339p709p776p564o440n640o028o208m759k679j596j133R0K070L838N182
$$ plain form
57849 697987 704382 711603 718954 726045 732673 738371 743108 748000 754004 760141 764308 765759 765626 765259 765234
57834 765234 765683 766231 765655 762872 758274 753104 747819 742079 735973 730011 724176 718204 712486 707570 703251
57819 703251 699383 696929 696584 696771 694868 690434 685605 682275 680504 679864 680552 682521 684855 686831 688899
57804 688899 692204 697676 705570 714999 723911 730383 734185 736565 738702 741032 743587 745890 746714 745025
57790 745025 741227 736686 732246 728038 724285 721040 717299 711662 704113 696228 689565 684598 681026 678057
57776 678057 674417 669138 662580 656033 650290 645173 640197 634927 628890 621959 614665 607370 599389 589744
57762 589744 578614 567244 556665 547241 539120 532275 526286 520748 515601 510511 504605 497726 491303
57749 491303 486963 484707 483383 482319 481406 480263 478704 477688 478500 481223 485123 490123 496628 504211 511750
$$ packed form
57849F97987O395P221P351P091O628N698M737M892O004O137M167J451j33l67k5
57834G65234M49N48n76k783m598n170n285n740o106n962n835n972n718m916m319
57819G03251l868k454l45J87j903m434m829l330j771o40O88J969K334J976K068
57804F88899L305N472P894R429Q912O472L802K380K137K330K555K303Q24j689
57790G45025l798m541m440m208l753l245l741n637p549p885o663m967l572k969
57776F78057l640n279o558o547n743n117m976n270o037o931p294p295p981r645
57762E89744j1130j1370j0579r424q121o845n989n538n147n090n906o879o423
57749D91303m340k256j324j064r13j143j559j016Q12K723L900N000O505P583P539
$$ plain form
57734 511750 518650 524793 529733 533262 536370 540146 543958 546218 546713 546639 546482 545718 544708 545051 547408 550331
57718 550331 551943 551699 550046 547442 544313 541065 537593 533364 528303 523133 518753 515765 514312 513640 512072
57703 512072 508418 503294 498246 493890 489880 486323 483992 483290 484129 486607 490626 495146 499163 503257 508828
57688 508828 515951 523452 530924 539003 547591 555483 562080 567972 573612 578949 584551 591361 598834 605021
57674 605021 609160 612568 616349 619972 623156 627574 635257 646304 659322 673145 687018 700071 712154
57661 712154 724760 739927 758254 778698 800092 822232 845699 871090 898150 925491 951742
57650 951742 977300 1004241 1033992 1065725 1097680 1129511 1162576 1198320 1237107 1278532 1322242
57639 1322242 1368223 1416603 1467570 1521807 1580936 1646863 1720180 1799709 1884439 1975669 2076505
$$ packed form
57734E11750O900O143M940L529L108L776L812K260M95p4j57p64j010L43K357K923
57718E50331J612k44j653k604l129l248l472m229n061n170m380k988j453o72j568
57703E12072l654n124n048m356m010l557k331p02Q39K478M019M520M017M094N571
57688E08828P123P501P472Q079Q588P892O597N892N640N337N602O810P473O187
57674F05021M139L408L781L623L184M418P683J1047J3018J3823J3873J3053J2083
57661G12154J2606J5167J8327K0444K1394K2140K3467K5391K7060K7341K6251
57650I51742K5558K6941K9751L1733L1955L1831L3065L5744L8787M1425M3710
57639A322242M5981M8380N0967N4237N9129O5927P3317P9529Q4730R1230J00836
$$ plain form
57628 2076505 2189417 2314952 2452570 2601808 2762830 2936745 3125246 3329034 3546838
57619 3546838 3776979 4019445 4274869 4541405 4813968 5086432 5352805 5605903 5837150
57610 5837150 6039254 6208099 6340652 6431543 6472688 6456321 6378557 6241559 6053775 5828050
57600 5828050 5578406 5317337 5054525 4796399 4546567 4307586 4082644 3874950 3685658
57591 3685658 3513530 3356857 3214741 3086556 2971496 2869222 2779880 2703007 2637250 2581483
57581 2581483 2535308 2498373 2470287 2451343 2441992 2441353 2447684 2460690 2481964 2512720 2552658 2601517
57569 2601517 2659958 2728084 2804943 2890601 2986940 3095059 3213663 3341663 3480739 3633156
57559 3633156 3798075 3972200 4153190 4340039 4530207 4718458 4898666 5064873 5210272
$$ packed form
57628B076505J12912J25535J37618J49238J61022J73915J88501K03788K17804
57619C546838K30141K42466K55424K66536K72563K72464K66373K53098K31247
57610E837150K02104J68845J32553R0891M1145j6367p7764j36998j87784k25725
57600E828050k49644k61069k62812k58126k49832k38981k24942k07694j89292
57591C685658j72128j56673j42116j28185j15060j02274q9342p6873o5757n5767
57581B581483m6175l6935k8086j8944r351o39O331J3006K1274L0756L9938M8859
57569B601517N8441O8126P6859Q5658R6339J08119J18604J28000J39076J52417
57559C633156J64919J74125J80990J86849J90168J88251J80208J66207J45399
$$ plain form
57550 5210272 5326922 5407656 5447941 5446062 5402597 5320132 5202816 5055829 4885276 4697854
57540 4697854 4499660 4295464 4089678 3887195 3691950 3504879 3324629 3150561 2984287
57531 2984287 2828284 2683915 2550819 2427372 2311669 2202884 2101866 2009909 1926955 1851532
57521 1851532 1782185 1718240 1659423 1605686 1557386 1514754 1477051 1442898 1411454 1382696 1356773
57510 1356773 1333922 1314880 1300308 1289536 1280683 1272412 1265044 1259946 1258375 1260881 1266926 1274826 1282861
57497 1282861 1290891 1300458 1313090 1329001 1347492 1367747 1388802 1409353 1428397 1446005 1463149 1480860
57485 1480860 1499623 1519307 1539533 1560441 1583300 1610043 1641907 1678739 1719837 1765217 1815774
57474 1815774 1872307 1934828 2003043 2077296 2158713 2248340 2346508 2453477 2570325 2698281 2836725
$$ packed form
57550E210272J16650Q0734M0285j879m3465q2465j17316j46987j70553j87422
57540D697854j98194k04196k05786k02483j95245j87071j80250j74068j66274
57531B984287j56003j44369j33096j23447j15703j08785j01018r1957q2954p5423
57521A851532o9347o3945n8817n3737m8300m2632l7703l4153l1444k8758k5923
57510A356773k2851j9042j4572j0772q853q271p368n098j571K506O045P900Q035
57497A282861Q030R567J2632J5911J8491K0255K1055K0551J9044J7608J7144J7711
57485A480860J8763J9684K0226K0908K2859K6743L1864L6832M1098M5380N0557
57474A815774N6533O2521O8215P4253Q1417Q9627R8168J06969J16848J27956J38444
$$ plain form
57463 2836725 2982506 3131861 3282726 3434549 3585972 3733147 3870052 3989829 4086079 4154002
57453 4154002 4191102 4196929 4172327 4119250 4041074 3942276 3827324 3700032 3564053 3423429 3282088
57442 3282088 3142794 3006892 2875233 2749255 2631024 2522102 2422499 2331008 2246713 2169969
57432 2169969 2101763 2042420 1991203 1946939 1908608 1875449 1847028 1823464 1805428 1793720 1788804
57421 1788804 1790652 1798884 1813037 1832729 1857556 1886954 1920519 1958700 2002980 2054951 2115146 2182918
57409 2182918 2257622 2339742 2430605 2530824 2639249 2753929 2874094 3000504 3133270 3269799
57399 3269799 3405588 3536601 3659602 3770030 3860992 3925500 3959427 3961798 3933028 3874045 3787083
57388 3787083 3676305 3547098 3404890 3254556 3100263 2945365 2792307 2642729 2497748
$$ packed form
57463B836725J45781J49355J50865J51823J51423J47175J36905J19777R6250O7923
57453D154002L7100N827k4602n3077p8176r8798j14952j27292j35979j40624j41341
57442C282088j39294j35902j31659j25978j18231j08922r9603r1491q4295p6744
57432B169969o8206n9343n1217m4264l8331l3159k8421k3564j8036j1708m916
57421A788804J848Q232J4153J9692K4827K9398L3565L8181M4280N1971O0195O7772
57409B182918P4704Q2120R0863J00219J08425J14680J20165J26410J32766J36529
57399C269799J35789J31013J23001J10428R0962O4508L3927K371k8770n8983q6962
57388C787083j10778j29207j42208j50334j54293j54898j53058j49578j44981
$$ plain form
57379 2497748 2358319 2225358 2099554 1981275 1870910 1769070 1675896 1590354 1510907 1436998
57369 1436998 1369057 1306964 1249566 1196326 1148411 1107022 1071136 1038063 1006114 975643 947477
57358 947477 921340 896291 871975 848886 827723 808856 792146 776977 762536 748252 733968
57347 733968 719822 706258 694018 683586 674406 664994 654229 642479 631255 621717 613694 606178
57335 606178 598550 591081 584251 577968 571772 565655 560240 556145 553476 551976 551241 550718 549989 549339 549643
57320 549643 551289 553469 554890 554914 553662 551296 547911 544178 541415 540586 541334 542160 541554 539001 535218 531725
57304 531725 530010 530626 532809 535103 536583 537494 538607 540274 542552 546032 551654 559408 567844 575412 581745
57289 581745 587120 591343 594085 595968 598230 601297 604524 607352 609930 612560 615325 618378 621803 625138
$$ packed form
57379B497748j39429j32961j25804j18279j10365j01840r3174q5542p9447p3909
57369A436998o7941o2093n7398n3240m7915m1389l5886l3073l1949l0471k8166
57358I47477k6137k5049k4316k3089k1163j8867j6710j5169j4441j4284j4284
57347G33968j4146j3564j2240j0432r180r412j0765j1750j1224r538q023p516
57335F06178p628p469o830o283o196o117n415m095k669j500p35n23p29o50L04
57320E49643J646K180J421K4j252k366l385l733k763q29P48Q26o06k553l783l493
57304E31725j715O16K183K294J480R11J113J667K278L480N622P754Q436P568O333
57289E81745N375M223K742J883K262L067L227K828K578K630K765L053L425L335
$$ plain form
57275 625138 627883 630531 634053 638156 641213 642519 643548 646184 650496 655198 659788 665279 672941 682878
57261 682878 693730 703537 711358 718357 726767 737408 748829 759366 769288 780095 792277 804836
57249 804836 816914 829074 842870 859654 879847 902896 927789 953737 980344 1007229 1033960
57238 1033960 1060536 1087476 1115224 1143921 1173970 1206178 1240893 1277504 1315158 1353455 1392070
57227 1392070 1430395 1468148 1505749 1543388 1580253 1615379 1648795 1680919 1711054 1737358 1758318
57216 1758318 1773736 1784416 1791426 1795525 1796624 1793831 1786388 1774530 1759073 1740465 1718777 1694501
57204 1694501 1668806 1643073 1618543 1596185 1576316 1558319 1541314 1525334 1511519 1501058 1494074
57193 1494074 1489713 1487166 1486415 1487959 1491918 1497784 1505044 1513589 1523180 1533112 1543094 1554039 1567102 1582050
$$ packed form
57275F25138K745K648L522M103L057J306J029K636M312M702M590N491P662R937
57261F82878J0852R807P821O999Q410J0641J1421J0537R922J0807J2182J2559
57249H04836J2078J2160J3796J6784K0193K3049K4893K5948K6607K6885K6731
57238A033960K6576K6940K7748K8697L0049L2208L4715L6611L7654L8297L8615
57227A392070L8325L7753L7601L7639L6865L5126L3416L2124L0135K6304K0960
57216A758318J5418J0680P010M099J099k793p443j1858j5457j8608k1688k4276
57204A694501k5695k5733k4530k2358j9869j7997j7005j5980j3815j0461o984
57193A494074m361k547p51J544L959N866P260Q545R591R932R982J0945J3063J4948
$$ plain form
57179 1582050 1597416 1612078 1625788 1638519 1650667 1663926 1680367 1700119 1721181 1742060 1763316
57168 1763316 1785888 1809271 1832335 1854878 1877293 1899512 1921255 1942624 1963656 1983963 2003445
57157 2003445 2022542 2041142 2058350 2074195 2090369 2108108 2126357 2143398 2159396 2175805 2192957
57146 2192957 2209834 2226001 2242366 2260017 2279358 2300298 2322483 2345498 2369404 2394650 2420922
57135 2420922 2447057 2472905 2500254 2530680 2563375 2596443 2629346 2662459 2695055 2725911 2755677
57124 2755677 2786596 2819710 2854132 2889318 2926251 2965837 3007817 3052168 3100235 3153363 3211247
57113 3211247 3272665 3337354 3406172 3479511 3556310 3634783 3713687 3792575 3871095 3948711 4025386
57102 4025386 4101945 4179013 4256008 4332139 4408313 4486914 4569600 4656525 4747977 4845536 4951083
$$ packed form
57179A582050J5366J4662J3710J2731J2148J3259J6441J9752K1062K0879K1256
57168A763316K2572K3383K3064K2543K2415K2219K1743K1369K1032K0307J9482
57157B003445J9097J8600J7208J5845J6174J7739J8249J7041J5998J6409J7152
57146B192957J6877J6167J6365J7651J9341K0940K2185K3015K3906K5246K6272
57135B420922K6135K5848K7349L0426L2695L3068L2903L3113L2596L0856K9766
57124B755677L0919L3114L4422L5186L6933L9586M1980M4351M8067N3128N7884
57113C211247O1418O4689O8818P3339P6799P8473P8904P8888P8520P7616P6675
57102D025386P6559P7068P6995P6131P6174P8601Q2686Q6925R1452R7559J05547
$$ plain form
57091 4951083 5065671 5189523 5321724 5459449 5599074 5738625 5877780 6015103 6147363
57082 6147363 6272480 6391108 6504081 6610297 6708538 6799268 6882739 6957085 7020306 7072629
57072 7072629 7115001 7146716 7166572 7174972 7172863 7159973 7136171 7103170 7062622 7013724 6954802 6885916
57060 6885916 6807742 6719237 6618707 6505975 6381386 6244277 6094990 5937309 5776946 5619340
57050 5619340 5471359 5343717 5249948 5205886 5233628 5364245 5632033 6063041 6664458 7417566
57040 7417566 8279655 9203508 10168222 11197190 12349620 13697577 15301560 17186438 19336131
57031 19336131 21737935 24448917 27579670 31141575 34876474 38260226 40709105 41807377
57023 41807377 41382840 39451796 36165038 31802519 26755564 21454042 16274219 11476829
$$ packed form
57091D951083J14588J23852J32201J37725J39625J39551J39155J37323J32260
57082F147363J25117J18628J12973J06216R8241R0730Q3471P4346O3221N2323
57072G072629M2372L1715J9856Q400k109j2890k3802l3001m0548m8898n8922o8886
57060F885916p8174q8505j00530j12732j24589j37109j49287j57681j60363j57606
57050E619340j47981j27642r3769m4062K7742J30617K67788M31008O01417P53108
57040G417566Q62089R23853R64714J028968J152430J347957J603983J884878K149693
57031A9336131K401804K710982L130753L561905L734899L383752K448879J098272
57023D1807377m24537j931044l286758m362519n046955n301522n179823m797390
$$ plain form
57015 11476829 7186931 3411406 91284 -2833664 -5386425 -7552664 -9297845 -10585032
57007 -10585032 -11395664 -11746228 -11681060 -11245631 -10474226 -9407789 -8115041 -6687635 -5216527
56998 -5216527 -3774438 -2411575 -1156985 -23173 985734 1869098 2632386 3289199 3855480
56989 3855480 4342542 4757600 5107906 5400805 5641829 5836168 5990776 6112529 6206015 6275761
56979 6275761 6329161 6374468 6416734 6457517 6497269 6536099 6573562 6609847 6646380 6683876 6720959
56968 6720959 6755997 6788751 6818715 6843547 6861072 6871552 6876236 6874919 6866622 6851287 6828700 6796910
56956 6796910 6754212 6702421 6646192 6589041 6531536 6473425 6416252 6363565 6319453 6287317 6269815
56945 6269815 6269779 6290914 6337542 6414119 6524385 6667326 6829271 6979484 7078083 7093549 7015865
$$ packed form
57015A1476829m289898C411406I1284b833664k552761k166239j745181j287187
57007a0585032q10632l50564O5168M35429P71405J066437J292748J427406J471108
56998e216527J442089J362863a156985b3173I85734Q83364P63288O56813N66281
56989C855480M87062M15058L50306K92899K41024J94339J54608J21753R3486O9746
56979F275761N3400M5307M2266M0783L9752L8830L7463L6285L6533L7496L7083
56968F720959L5038L2754K9964K4832J7525J0480M684j317q297j5335k2587l1790
56956F796910m2698n1791n6229n7151n7505n8111n7173n2687m4112l2136j7502
56945F269815l6K1135M6628P6577J10266J42941J61945J50213R8599J5466p7684
$$ plain form
56934 7015865 6856139 6637342 6385229 6122216 5863288 5615185 5379712 5157687 4950026
56925 4950026 4757050 4578554 4414190 4262915 4122634 3990927 3865654 3744765 3626703
56916 3626703 3511375 3399696 3292029 3188297 3089573 2997643 2912483 2832109 2755754 2685485
56906 2685485 2623733 2570772 2525488 2486928 2454064 2425711 2401856 2383514 2370078 2358259 2344632
56895 2344632 2327619 2305887 2276935 2239268 2194615 2146189 2095806 2044206 1992855 1943406 1896165
56884 1896165 1850885 1808465 1770250 1736127 1704668 1674830 1646463 1619803 1595606 1575246 1559600
56873 1559600 1548255 1540280 1534669 1529191 1520003 1503663 1478830 1445389 1403378 1354034 1300553 1246258
56861 1246258 1192688 1140422 1090555 1044188 1001581 962928 928693 898070 868767 839813 812865
$$ packed form
56934G015865j59726k18797k52113k63013k58928k48103k35473k22025k07661
56925D950026j92976j78496j64364j51275j40281j31707j25273j20889j18062
56916C626703j15328j11679j07667j03732r8724r1930q5160q0374p6355p0269
56906B685485o1752n2961m5284l8560l2864k8353k3855j8342j3436j1819j3627
56895B344632j7013k1732k8952l7667m4653m8426n0383n1600n1351m9449m7241
56884A896165m5280m2420l8215l4123l1459k9838k8367k6660k4197k0360j5646
56873A559600j1345p975n611n478r188j6340k4833l3441m2011m9344n3481n4295
56861A246258n3570n2266m9867m6367m2607l8653l4235l0623k9303k8954k6948
$$ plain form
56850 812865 789047 766264 741961 717064 694565 675277 657565 640413 623889 607025 588111
56839 588111 567349 546827 527622 509011 490685 473548 457916 442957 428458 415505 405089
56828 405089 397592 393722 394037 397100 399993 401363 402358 403945 404912 403502 399779 395453 392293 391355 392769
56813 392769 395459 397735 398848 399663 401784 406735 416008 430744 450814 474947 502235 532977 567766
56800 567766 606152 646149 684342 716331 737990 747046 743744 730317 710026 686038 660511 634805
56788 634805 610688 590491 575542 565526 560223 560763 567958 580707 597932 621251 653531 695192
56776 695192 744116 798934 859611 923872 985084 1035043 1067915 1081284 1075374 1052724 1017621 974487
56764 974487 926963 878556 832821 791960 756119 724850 698661 678600 665076 657821 656466 660525
$$ packed form
56850H12865k3818k2783k4303k4897k2499j9288j7712j7152j6524j6864j8914
56839E88111k0762k0522j9205j8611j8326j7137j5632j4959j4499j2953j0416
56828D05089p497l870L15L063K893J370R95J587R67j410l723m326l160r38J414
56813C92769K690K276J113Q15K121M951R273J4736K0070K4133K7288L0742L4789
56800E67766L8386L9997L8193L1989K1659R056l302j3427k0291k3988k5527k5706
56788F34805k4117k0197j4949j0016n303N40P195J2749J7225K3319L2280M1661
56776F95192M8924N4818O0677O4261O1212M9959L2872J3369n910k2650l5103m3134
56764I74487m7524m8407m5735m0861l5841l1269k6189k0061j3524p255j355M059
$$ plain form
56752 660525 669365 682804 701340 725266 753730 784760 815477 841839 858854 862151 849952 823783
56740 823783 787563 745831 702219 658906 616947 576716 538245 502072 470040 444397 425594
56729 425594 411922 402032 396695 396990 402008 409956 420663 434933 451750 468064 481265 490009 492680
56716 492680 487377 474212 455929 435321 413171 389130 363208 335881 308279 282955 262822 248134
56704 248134 235573 221459 205167 188839 174755 163859 155856 149670 144248 139607 136673 135761 135978
56691 135978 136396 136798 136814 135502 132640 129533 127712 127535 128629 130793 133595 135922 136837 136437 135241 133415
56675 133415 131230 129491 128703 128371 127841 127210 126792 126404 125908 125751 126174 126508 126061 125075 123951 122176 118997
56658 118997 114830 111036 108485 107047 106282 105997 106316 107737 110793 115147 119377 122158 123385 123800 124066
$$ packed form
56752F60525Q840J3439J8536K3926K8464L1030L0717K6362J7015L297j2199k6169
56740H23783l6220m1732m3612m3313m1959m0231l8471l6173l2032k5643j8803
56729D25594j3672r890n337K95N018P948J0707J4270J6817J6314J3201Q744K671
56716D92680n303j3165j8283k0608k2150k4041k5922k7327k7602k5324k0133j4688
56704B48134j2561j4114j6292j6328j4084j0896q003o186n422m641k934r12K17
56691A35978M18M02J6j312k862l107j821j77J094K164K802K327R15m00j196j826
56675A33415k185j739p88l32n30o31m18l88m96j57M23L34m47r86j124j775l179
56658A18997m167l794k551j438p65k85L19J421L056M354M230K781J227M15K66
$$ plain form
56643 124066 124638 125798 127090 127220 125251 121520 116822 111259 104673 97766 91843 87514 84190 80774 76492
56628 76492 71502 67004 64221 62794 60983 58012 55382 54898 56243 57718 58798 60383 62685 64509 65040
56613 65040 65089 65906 67647 69720 72081 75523 80825 87933 95807 103061 109169 115119 122443 131461 140968
56598 140968 149803 158089 166503 174939 182633 189348 195533 201215 205507 207718 208415 208705 208598 206677 201414
56583 201414 192466 180914 168850 158494 150579 143300 133911 122014 110460 102295 97633 94441 91388
56570 91388 88523 85793 82690 79490 77425 77220 78503 80846 84233 88282 92079 95188 97850 99966 100992
56555 100992 101268 102261 104834 108219 111286 113939 116569 118979 120722 121824 122429 122181 120646 118016 114949
56540 114949 112107 110212 109948 111236 112999 114074 114060 113099 111320 108834 105918 102961 100419 98690 97618
$$ packed form
56643A24066N72J160J292J30j969l731m698n563o586o907n923m329l324l416m282
56628G6492m990m498k783j427j811k971k630m84J345J475J080J585K302J824N31
56613F5040M9Q17J741K073K361L442N302P108P874P254O108N950P324R018R507
56598A40968Q835Q286Q414Q436P694O715O185N682M292K211O97K90j07j921n263
56583B01414q948j1552j2064j0356p915p279r389j1897j1554q165m662l192l053
56570I1388k865k730l103l200k065k05J283K343L387M049L797L109K662K116J026
56555A00992K76R93K573L385L067K653K630K410J743J102O05k48j535k630l067
56540A14949k842j895k64J288J763J075j4r61j779k486k916k957k542j729j072
$$ plain form
56525 97618 96493 95124 94392 94741 94779 92941 90174 89086 90375 92183 93352 95060 98321 101982 104624
56510 104624 106675 109060 111281 112670 114327 117895 123127 128385 132993 137611 142727 148249 154273 161016
56496 161016 168179 175312 182302 188723 193659 197307 201829 208985 217464 224080 227266 228100 228403 229344 231600
56481 231600 235195 239006 241669 243073 244046 244766 244566 243260 241580 240259 239372 238401 236307 232123 226328
56466 226328 220965 217344 214368 210376 205888 202893 201919 201583 200876 200008 198826 196181 191577 186299 182291
56451 182291 180592 181011 182434 183330 182780 181160 179274 177128 174399 171713 170228 170049 170127 169612 168310 166135
56435 166135 163433 161654 162271 164782 166951 167214 165970 164618 164379 165926 168949 172005 173902 175152 176935
56420 176935 178928 179652 178938 178457 179534 181886 184787 188002 191194 193873 196563 200708 206732 213278 218936
$$ packed form
56525I7618j125j369p32L49L8j838k767j088J289J808J169J708L261L661K642
56510A04624K051K385K221J389J657L568N232N258M608M618N116N522O024O743
56496A61016P163P133O990O421M936L648M522P156Q479O616L186Q34L03R41K256
56481B31600L595L811K663J404R73P20k00j306j680j321q87r71k094m184n795
56466B26328n363l621k976l992m488k995r74l36p07q68j182k645m604n278m008
56451A82291j699M19J423Q96n50j620j886k146k729k686j485j79P8n15j302k175
56435A66135k702j779O17K511K169K63j244j352k39J547L023L056J897J250J783
56420A76935J993P24p14m81J077K352K901L215L192K679K690M145O024O546N658
$$ plain form
56405 218936 223706 228278 232933 237761 242990 248450 253589 258522 264115 270464 276160 279777 281490 282671
56391 282671 284416 286766 288762 288991 286791 283237 280377 279357 279813 280896 281863 281691 279395 275205 270494
56376 270494 266171 262013 257792 254040 251299 249543 248671 248584 248412 246742 243247 239239 236151 234164 232683
56361 232683 231211 229234 226153 222027 217823 214470 212221 211202 211752 213708 216037 217795 219117 220845
56347 220845 223439 226372 228412 228675 227757 227457 228760 230638 231692 232277 233655 235544 236216 235050 233374
56332 233374 232565 232744 233594 234983 236467 237546 238752 241183 244766 248446 252297 257696 265068 273199 281348
56317 281348 290134 299524 307710 313068 315841 317028 317269 317719 320127 324532 328462 330014 330447 332128 335099
56302 335099 337561 338852 340027 341874 344186 346901 350473 354776 358625 360762 361010 360595 361454 364713 369496
$$ packed form
56405B18936M770M572M655M828N229N460N139M933N593O349N696L617J713J181
56391B82671J745K350J996K29k200l554k860j020M56J083R67j72k296m190m711
56376B70494m323m158m221l752k741j756q72q7j72j670l495m008l088j987j481
56361B32683j472j977l081m126m204l353k249j019N50J956K329J758J322J728
56347B20845K594K933K040K63r18l00J303J878J054N85J378J889O72j166j676
56332B33374q09J79Q50J389J484J079J206K431L583L680L851N399P372Q131Q149
56317B81348Q786R390Q186N358K773J187K41M50K408M405L930J552M33J681K971
56302C35099K462J291J175J847K312K715L572M303L849K137K48m15Q59L259M783
$$ plain form
56287 369496 373788 376614 378627 380526 382187 383699 385829 388667 391127 392676 394400 397392 401235 405123
56273 405123 409397 414744 420752 426439 431578 436625 442048 448542 456971 467179 477701 487575 497592
56260 497592 508969 521781 535555 550215 565340 579564 591955 603145 614084 624655 634601 644682
56248 644682 655618 666822 677358 687249 696720 705345 713186 721495 730670 738754 743840 747066 751277
56235 751277 757340 763697 769114 774032 779510 786522 796098 808631 823164 838661 855573 874872 896118
56222 896118 918095 940962 966061 993885 1023891 1056311 1092549 1133649 1179549 1229768 1283656
56211 1283656 1340262 1399353 1462510 1532018 1608822 1692587 1783365 1881815 1988234 2102891 2227118
56200 2227118 2362415 2508533 2664016 2828743 3004368 3191840 3389747 3595379 3806221
$$ packed form
56287C69496M292K826K013J899J661J512K130K838K460J549J724K992L843L888
56273D05123M274N347O008N687N139N047N423O494Q429J0208J0522R874J0017
56260D97592J1377J2812J3774J4660J5125J4224J2391J1190J0939J0571R946J0081
56248F44682J0936J1204J0536R891R471Q625P841Q309R175Q084N086L226M211
56235G51277O063O357N417M918N478P012R576J2533J4533J5497J6912J9299K1246
56222H96118K1977K2867K5099K7824L0006L2420L6238M1100M5900N0219N3888
56211A283656N6606N9091O3157O9508P6804Q3765R0778R8450J06419J14657J24227
56200B227118J35297J46118J55483J64727J75625J87472J97907K05632K10842
$$ plain form
56191 3806221 4019908 4233649 4444134 4647461 4839108 5014662 5170714 5304678 5414159
56182 5414159 5497264 5553316 5582697 5586437 5566534 5525967 5467485 5392922 5304425 5205393 5099035
56171 5099035 4986680 4868651 4746009 4620141 4491359 4359366 4224596 4087751 3948608
56162 3948608 3806675 3662519 3517213 3371175 3224921 3080146 2938467 2799780 2663547
56153 2663547 2531019 2404441 2284617 2171155 2064479 1965544 1873915 1788234 1708376 1635135
56143 1635135 1567966 1505254 1446822 1394009 1346941 1303846 1263597 1227144 1195728 1169031 1145651
56132 1145651 1124177 1103574 1083630 1065191 1048981 1034495 1021189 1010106 1002551 997536 992493 986488
56120 986488 980950 977272 975570 975811 978180 982094 986624 992242 1000556 1012146 1026166 1042084 1060087
$$ packed form
56191C806221K13687K13741K10485K03327J91647J75554J56052J33964J09481
56182E414159Q3105N6052K9381L740j9903m0567n8482p4563q8497r9032j06358
56171E099035j12355j18029j22642j25868j28782j31993j34770j36845j39143
56162C948608j41933j44156j45306j46038j46254j44775j41679j38687j36233
56153B663547j32528j26578j19824j13462j06676r8935r1629q5681p9858p3241
56143A635135o7169o2712n8432n2813m7068m3095m0249l6453l1416k6697k3380
56132A145651k1474k0603j9944j8439j6210j4486j3306j1083p555n015n043o005
56120I86488n538l678j702K41K369L914M530N618Q314J1590J4020J5918J8003
$$ plain form
56107 1060087 1079670 1099636 1119727 1140701 1162652 1184780 1206702 1228295 1248495 1266264 1282675
56096 1282675 1299948 1318321 1336008 1352439 1369377 1388549 1410377 1435412 1464662 1497737 1532810
56085 1532810 1569404 1609687 1656425 1711122 1774340 1845868 1924201 2008044 2099197 2202206 2320231
56074 2320231 2452449 2595498 2745448 2897901 3048150 3192290 3327275 3450241 3559761
56065 3559761 3657774 3747948 3831578 3906644 3970517 4021072 4055258 4069971 4065639 4046644 4017163
56054 4017163 3978482 3930634 3873610 3805515 3722142 3620581 3502211 3371350 3232575 3090209
56044 3090209 2948535 2811177 2681081 2561207 2453714 2358389 2273624 2198988 2134912 2080138
56034 2080138 2031962 1989008 1951292 1917606 1885835 1856010 1829962 1807647 1786958 1767487 1750914
$$ packed form
56107A060087J9583J9966K0091K0974K1951K2128K1922K1593K0200J7769J6411
56096A282675J7273J8373J7687J6431J6938J9172K1828K5035K9250L3075L5073
56085A532810L6594M0283M6738N4697O3218P1528P8333Q3843R1153J03009J18025
56074B320231J32218J43049J49950J52453J50249J44140J34985J22966J09520
56065C559761R8013R0174Q3630P5066O3873N0555L4186J4713m332j8995k9481
56054D017163l8681m7848n7024o8095q3373j01561j18370j30861j38775j42366
56044C090209j41674j37358j30096j19874j07493r5325q4765p4636o4076n4774
56034B080138m8176m2954l7716l3686l1771k9825k6048k2315k0689j9471j6573
$$ plain form
56023 1750914 1737037 1723278 1709249 1697990 1691099 1686284 1681511 1678032 1677262 1678046 1679434 1683147 1690728
56010 1690728 1700745 1710987 1721226 1731968 1742976 1754826 1769341 1786706 1804707 1822488 1842227
55999 1842227 1865415 1890538 1916423 1944759 1976927 2011109 2044908 2078324 2112121 2145987 2180248
55988 2180248 2216559 2254911 2292950 2330162 2369274 2411424 2453735 2494457 2536804 2584450 2636613
55977 2636613 2691041 2748609 2811060 2876835 2943090 3010026 3079977 3154124 3232891 3317387 3407650
55966 3407650 3501485 3597596 3697740 3803745 3915130 4031751 4155512 4287017 4423856 4564996
55956 4564996 4713575 4872763 5042295 5221670 5412854 5616774 5830948 6053647 6286602
55947 6286602 6530876 6784565 7047731 7324733 7618165 7925551 8245887 8584143 8944999
$$ packed form
56023A750914j3877j3759j4029j1259o891m815m773l479p70P84J388L713P581
56010A690728J0017J0242J0239J0742J1008J1850J4515J7365J8001J7781J9739
55999A842227K3188K5123K5885K8336L2168L4182L3799L3416L3797L3866L4261
55988B180248L6311L8352L8039L7212L9112M2150M2311M0722M2347M7646N2163
55977B636613N4428N7568O2451O5775O6255O6936O9951P4147P8767Q4496R0263
55966C407650R3835R6111J00144J06005J11385J16621J23761J31505J36839J41140
55956D564996J48579J59188J69532J79375J91184K03920K14174K22699K32955
55947F286602K44274K53689K63166K77002K93432L07386L20336L38256L60856
$$ plain form
55938 8944999 9327556 9731036 10160070 10618939 11105965 11619418 12163877 12744861 13362299
55929 13362299 14015346 14708595 15447488 16232845 17066130 17954629 18905222 19919095 20999069
55920 20999069 22155500 23397807 24727459 26147481 27671964 29318415 31099314 33030990
55912 33030990 35142906 37468728 40038199 42890144 46084370 49686473 53746834 58304409
55904 58304409 63400213 69075496 75373609 82366690 90175358 98950824 108855320 120078167
55896 120078167 132846366 147386277 163890111 182549740 203600999 227299951 253883000
55889 253883000 283551013 316278515 351236193 386119134 417129765 440008080 451564161
55882 451564161 450709949 438488746 417384449 390451890 360586540 330048213 300301893
$$ packed form
55938H944999L82557M03480M29034M58869M87026N13453N44459N80984O17438
55929A3362299O53047O93249P38893P85357Q33285Q88499R50593J013873J079974
55920B0999069J156431J242307J329652J420022J524483J646451J780899J931676
55912C3030990K111916K325822K569471K851945L194226L602103M060361M557575
55904E8304409N095804N675283O298113O993081P808668Q775466R904496J1222847
55896A20078167J2768199J4539911J6503834J8659629K1051259K3698952K6583049
55889B53883000K9668013L2727502L4957678L4882941L1010631K2878315J1556081
55882D51564161q54212j2221203k1104297k6932559k9865350l0538327k9746320
$$ plain form
55875 300301893 272142455 245933098 221797825 199742048 179732192 161723790 145633874
55868 145633874 131315286 118580203 107242054 97130055 88089108 79992387 72749001
55861 72749001 66284467 60518882 55372251 50778216 46677701 43007213 39706811 36733269
55853 36733269 34053542 31630984 29428675 27420331 25586921 23907133 22360921 20937933
55845 20937933 19632793 18435480 17334149 16322697 15396844 14546598 13760749 13035060 12368040
55836 12368040 11752224 11177651 10640815 10142295 9678147 9241157 8828232 8439250 8070755
55827 8070755 7717978 7381597 7065768 6770526 6491919 6228116 5979545 5744273 5518917
55818 5518917 5303178 5098456 4903277 4714935 4534211 4363583 4202175 4047295 3899504
$$ packed form
55875C00301893k8159438k6209357k4135273k2055777k0009856j8008402j6089916
55868A45633874j4318588j2735083j1338149j0111999r040947q096721p243386
55861G2749001o464534n765585n146631m594035m100515l670488l300402k973542
55853C6733269k679727k422558k202309k008344j833410j679788j546212j422988
55845B0937933j305140j197313j101331j011452r25853q50246p85849p25689o67020
55836A2368040o15816n74573n36836m98520m64148m36990m12925l88982l68495
55827H070755l52777l36381l15829k95242k78607k63803k48571k35272k25356
55818E518917k15739k04722j95179j88342j80724j70628j61408j54880j47791
$$ plain form
55809 3899504 3761247 3631598 3507257 3387896 3276032 3172539 3076487 2988412 2909474 2838279
55799 2838279 2772646 2713466 2662582 2617506 2572176 2522366 2467032 2405688 2338576 2268757 2200226
55788 2200226 2134303 2070701 2010590 1955034 1902059 1849433 1799217 1755381 1717876 1683308 1650648
55777 1650648 1621818 1597132 1574785 1554920 1539697 1528590 1517540 1503760 1488099 1471812 1454062
55766 1454062 1433484 1409561 1381806 1350045 1316033 1282523 1250289 1218059 1185441 1153743 1123866
55755 1123866 1095463 1068219 1042084 1016470 991121 967338 946479 928009 911122 897370 888882
55744 888882 884525 880545 874905 868599 862927 857931 853353 848855 843428 836611 829732 823934 817828 809634
55730 809634 800699 793851 788825 782498 773590 764051 755629 748046 740966 735041 730475 726922 725025 725619
$$ packed form
55809C899504j38257j29649j24341j19361j11864j03493r6052q8075p8938p1195
55799B838279o5633n9180n0884m5076m5330m9810n5334o1344o7112o9819o8531
55788B200226o5923o3602o0111n5556n2975n2626n0216m3836l7505l4568l2660
55777A650648k8830k4686k2347j9865j5223j1107j1050j3780j5661j6287j7750
55766A454062k0578k3923k7755l1761l4012l3510l2234l2230l2618l1698k9877
55755A123866k8403k7244k6135k5614k5349k3783k0859j8470j6887j3752q488
55744H88882m357l980n640o306n672m996m578m498n427o817o879n798o106q194
55730H09634q935o848n026o327q908r539q422p583p080n925m566l553j897N94
$$ plain form
55716 725619 727202 726804 723842 720626 718746 717657 717471 720474 728618 741608 758514 779292 803286 827477
55702 827477 847218 858122 857348 844605 822314 793653 760378 723391 684643 646550 609936 574490
55690 574490 540980 511013 484814 461428 441060 424991 413010 403109 393942 385759 378805 372812
55678 372812 368183 365700 364961 364978 366126 369286 373237 375382 375040 373466 370613 364845 356357 347849 340801
55663 340801 333843 325956 318655 313368 308886 303189 296210 289377 283800 280050 278339 277919 277619 277687 279661
55648 279661 283877 288882 293927 300067 307806 315540 321448 325330 327521 327607 325260 320888 314663 306576 298217
55633 298217 292460 290228 289352 287783 286101 285604 285986 286570 288048 291116 294815 298060 301579 306469 311858
55618 311858 315785 317562 317728 316554 314230 311724 309855 308011 305111 301171 296807 292121 287486 284426
$$ packed form
55716G25619J583l98k962l216j880j089j86L003Q144J2990J6906K0778K3994K4191
55702H27477J9741J0904p74j2743k2291k8661l3275l6987l8748l8093l6614l5446
55690E74490l3510k9967k6199k3386k0368j6069j1981r901r167q183o954n993
55678C72812m629k483p39J7J148L160L951K145l42j574k853n768q488q508p048
55663C40801o958p887p301n287m482n697o979o833n577l750j711m20l00O8J974
55648B79661M216N005N045O140P739P734N908L882K191Q6k347m372o225q087q359
55633B98217n757k232q76j569j682m97L82N84J478L068L699L245L519M890N389
55618C11858L927J777J66j174k324k506j869j844k900l940m364m686m635l060
$$ plain form
55604 284426 284004 284945 284945 283385 281242 278881 275619 271277 266589 262051 257616 253523 250256 247696 245403
55589 245403 243676 243375 244628 246587 248365 249483 249645 248953 248068 247196 245103 240339 233460 226945 222511
55574 222511 219317 215207 209022 201172 192410 182822 172270 161446 151896 144554 138540 132004 124190 116028
55560 116028 108671 102276 96613 92016 89044 87698 87565 88211 88771 87642 83530 76835 69516 63587 60096
55545 60096 59210 60523 63000 65051 65268 63415 60652 58463 57246 56246 54922 53808 53578 53947 54299 54856
55529 54856 56151 57663 58218 57747 57437 57960 58639 58712 58375 58212 58544 59663 61752 64100 65292 64721 63163
55512 63163 61542 59967 58437 57514 57606 58321 59132 60156 61797 64119 66926 69878 72240 73197 72765 71811
55496 71811 70919 69898 68536 67096 65860 64928 64531 64647 64266 62191 58809 55974 54759 54485 54225 53983
$$ packed form
55604B84426m22R41%j560k143k361l262m342m688m538m435m093l267k560k293
55589B45403j727l01J253J959J778J118J62o92q85q72k093m764o879o515m434
55574B22511l194m110o185p850q762r588j0552j0824r550p342o014o536p814q162
55560A16028p357o395n663m597k972j346j33O46N60j129m112o695p319n929l491
55545F0096q86J313K477K051K17j853k763k189j217j000j324j114k30L69L52N57
55529E4856J295J512N55m71l10N23O79P3l37j63L32J119K089K348J192n71j558
55512F3163j621j575j530r23R2P15Q11J024J641K322K807K952K362R57m32r54
55496G1811q92j021j362j440j236r32l97J16l81k075l382k835j215k74k60k42
$$ plain form
55480 53983 53791 52910 50774 47743 44407 41178 39014 39186 41484 43917 45089 45748 47091 48738 49551 49392
55464 49392 48829 47917 46468 44797 43111 40828 37484 33615 29798 25727 21311 17770 16277 16186 16035 15825
55448 15825 16814 19327 22170 24323 26017 27958 30317 32724 34714 36102 37156 38203 38853 38164 35886
55433 35886 32939 30313 28214 26698 26189 26714 27466 27811 27923 27844 26903 24808 22299 19970 17614 15644
55417 15644 15774 18843 22985 25501 25837 25461 25624 26654 28574 30841 32131 31827 31061 30900 30515 28852
55401 28852 27068 27041 28080 27674 25322 23170 22631 22733 22391 22127 22731 24009 25669 27742 29321 28683 25828
55384 25828 23434 23981 26977 30137 32239 33585 34483 34827 34903 35472 37070 39816 43609 47856 51246 52588
55368 52588 51964 50749 50478 51860 54606 57898 60974 63249 63941 62115 57723 52407 48376 46361 45276
$$ packed form
55480E3983j92q81k136l031l336l229k164J72K298K433J172O59J343J647Q13j59
55464D9392n63r12j449j671j686k283l344l869l817m071m416l541j493r1j51k10
55448A5825R89K513K843K153J694J941K359K407J990J388J054J047O50o89k278
55433C5886k947k626k099j516n09N25P52L45J12p9r41k095k509k329k356j970
55417A5644J30L069M142K516L36l76J63J030J920K267J290l04p66j61l85j663
55401B8852j784k7J039m06k352k152n39J02l42k64O04J278J660K073J579o38k855
55384B5828k394N47K996L160K102J346Q98L44P6N69J598K746L793M247L390J342
55368E2588o24j215k71J382K746L292L076K275O92j826m392n316m031k015j085
$$ plain form
55353 45276 44015 42782 42343 42735 43351 43866 44391 44879 44989 44759 45068 46916 50071 52725 53011 50847 47753
55336 47753 44881 41995 38667 35476 33258 31920 30901 30234 30113 29867 28489 26098 23857 22513 21862
55321 21862 21581 21739 22491 23984 26389 29294 31324 31293 29582 27495 25405 22576 18659 14277 10147 6698
55305 6698 4572 4238 4885 4854 3588 2172 1619 1621 1417 881 135 -1099 -3006 -5043 -6451 -7086 -7393 -7765
55287 -7765 -8142 -8080 -7327 -6573 -7164 -9382 -11421 -11086 -8320 -4980 -2329 -92 1997 3374 3946 4804 6630
55270 6630 8423 8765 7708 6420 5506 4532 2936 740 -1451 -2755 -2558 -1253 -173 -425 -1993 -4152
55254 -4152 -6407 -8731 -11046 -12711 -12630 -10206 -6380 -3210 -1750 -848 1155 3974 5786 5828 5139 4686
55238 4686 4246 3584 3265 3542 3540 2419 503 -1439 -3223 -4801 -5607 -5187 -4013 -3088 -3187 -4777 -7891 -11547
$$ packed form
55353D5276j261j233m39L92O16N15N25M88J10k30L09J848L155K654K86k164l094
55336D7753k872k886l328l191k218j338j019o67j21k46j378k391k241j344o51
55321B1862k81J58P52J493K405K905K030l1j711k087k090k829l917m382m130l449
55305F698k126l34O47l1j266j416n53Kk04n36A35a099j907k037j408o35l07l72
55287g765l77O2P53P54n91k218k039L35K766L340b329i2A997J377N72Q58J826
55270F630J793L42j057j288r14r74j596G40a451j304J97a253a73k52j568k159
55254d152k255k324k315j665Q1K424L826L170J460h48A155K819J812M2o89m53
55238D686m40o62l19K77kj121E03a439j784j578q06M20J174R25r9j590l114l656
$$ plain form
55220 -11547 -14037 -14433 -13253 -11341 -8930 -6233 -3884 -2087 -279 1652 2767 2525 1823 1540 1079 -385
55203 -2080 -2550 -1816 -1078 -554 841 3640 7074 10284 12938 14368 13450 10015 5522 1695 -835 -2132
55187 -2132 -2038 -554 1336 2100 1051 -1160 -3562 -5894 -8326 -10315 -10453 -7889 -3716 -287 960 660 426
55170 426 1157 2601 4076 5125 5722 6145 6515 6478 5762 5097 5856 8479 11729 13797 13680 11438 8037
55153 8037 5220 4559 5886 7468 8234 8817 9779 10145 9056 7654 7543 8074 7213 4926 3571 4559 6493
55136 6493 7326 6786 5818 5159 5525 7893 12124 16091 17659 17082 16262 15989 15332 13671 11879 10962 10596
55119 10596 9737 8133 6629 6263 7449 9782 12242 13734 13750 12601 11024 9820 9710 10920 12626 13385
55103 13385 12662 11576 11541 12438 12874 12080 10710 9610 8703 7598 6590 6292 6649 7044 7278 7759 8660 9399
$$ packed form
55220a1547k490l96J180J912K411K697K349J797b79A652J115k42p02k83m61c85
55203b080m70P34P38N24H41K799L434L210K654J430r18l435m493A695h35j297
55187b132R4e54A336P64j049a160k402k332k432j989j38K564c716b87I60l00k34
55170D26P31J444J475J049N97M23L70l7p16o65P59K623L250K068j17k242l401
55153H037k817o61J327J582P66N83R62L66j089j402j11N31q61k287j355R88J934
55136F493Q33n40r68o59L66K368M231L967J568n77q20k73o57j661j792r17l66
55119A0596q59j604j504l66J186K333K460J492J6j149j577j204j10J210J706P59
55103A3385p23j086l5Q97M36p94j370j100r07j105j008k98L57L95K34M81R01P39
$$ plain form
55085 9399 9234 8097 6648 5676 5517 6057 7168 8885 10967 12645 13372 13629 14174 14474 13039 9762 6764
55068 6764 6129 7693 10046 12706 15873 18830 20395 20796 21473 23014 24815 26846 29952 33894 36825
55053 36825 37651 37561 38177 39320 39761 39276 38688 38344 37695 36290 34390 32702 31888 32131 32935 33719 34613 35991
55035 35991 37220 37102 35966 35996 38611 42592 45772 47541 48486 48583 47404 45630 44751 45222 46172 47027 48367
55018 48367 50998 54943 59396 63039 64655 64287 63594 64192 65779 66713 66223 65021 63879 62871 62070 61815
55002 61815 61877 61496 60726 60731 61909 62635 60998 57457 54603 54110 54863 54672 53171 52083 52675 54041 54471 53772
54984 53772 53170 53375 53942 54490 55225 55913 55637 54242 52940 52652 52837 52823 53283 55185 58144 61115 63996
54967 63996 67096 69509 69624 67167 63402 59437 55663 52706 51373 51428 51781 52153 53388 55893 59003 62126
$$ packed form
55085I399j65j137j449r72j59N40J111J717K082J678P27K57N45L00j435l277k998
55068F764o35J564K353K660L167K957J565M01O77J541J801K031L106L942K931
55053C6825Q26r0O16J143M41m85n88l44o49j405j900j688q14K43Q04P84Q94J378
55035C5991J229j18j136L0K615L981L180J769R45R7j179j774q79M71R50Q55J340
55018D8367K631L945M453L643J616l68o93N98J587R34m90j202j142j008q01k55
55002F1815O2l81p70NJ178P26j637l541k854m93P53j91j501j088N92J366M30o99
54984E3772o02K05N67N48P35O88k76j395j302k88J85j4M60J902K959K971K881
54967F3996L100K413J15k457l765l965l774k957j333N5L53L72J235K505L110L123
$$ plain form
54951 62126 65193 67583 68095 66758 65398 65490 66451 67022 67344 68401 70034 70845 69971 67953 65845 64326
54935 64326 63844 64728 66647 68311 68325 66411 63478 60355 56836 52497 48200 45799 45994 47428 48615 49851
54919 49851 52037 54379 54980 53659 52488 53119 55052 57135 59348 62085 64761 66442 67316 68450 70337
54904 70337 72606 74940 77417 79904 81936 83480 85453 89196 95381 103372 111696 119342 126514 133865
54890 133865 141256 147958 154060 160969 170183 182100 196079 210878 224759 236063 244429 250978 256788
54877 256788 261567 264158 263702 259764 252075 241086 228524 216544 206233 197294 188890 180258 170840
54864 170840 160587 150231 140742 132546 125618 120207 116839 115457 115103 114708 113999 113451 113555 114413 116027
54849 116027 118702 122817 128113 133646 138756 143953 150431 158957 169549 181844 194993 207415 217662
$$ packed form
54951F2126L067K390N12j337j360R2R61N71L22J057J633Q11q74k018k108j519
54935F4326m82Q84J919J664J4j914k933l123l519m339m297k401J95J434J187J236
54919D9851K186K342O01j321j171O31J933K083K213K737K676J681Q74J134J887
54904G0337K269K334K477K487K032J544J973L743O185P991Q324P646P172P351
54890A33865P391O702O102O909R214J1917J3979J4799J3881J1304Q366O549N810
54877B56788M779K591m56l938p689j0989j2562j1980j0311q939q404q632r418
54864A70840j0253j0356r489q196o928n411l368j382l54l95p09n48J04Q58J614
54849A16027K675M115N296N533N110N197O478Q526J0592J2295J3149J2422J0247
$$ plain form
54836 217662 225741 232637 238319 241183 239967 235262 228434 219988 209894 198759 187472 176046 164060
54823 164060 152206 142251 135036 129301 122969 115243 107147 100280 95380 91942 88968 85932 82991 80505
54809 80505 78682 77646 77326 77123 76229 74624 73307 73222 74311 75934 77554 78478 77557 74136 69144 64428
54793 64428 61017 58673 57039 56395 56951 57997 58243 56947 54583 52461 51611 51914 52435 52607 52746 53266 53875
54776 53875 53932 53216 51886 50177 48661 48335 49592 51370 52184 51948 51988 53231 55259 57269 59058 60644
54760 60644 61632 61613 60829 60034 59911 60883 63187 66686 70655 74033 76026 76607 76599 77087 78524 80502 82656
54743 82656 85456 89608 94935 100597 106418 113140 121114 129473 137134 144131 151414 159607 168449 177381
54729 177381 186411 196360 208244 222165 236768 250090 260983 269296 274744 276365 273511 266953 258496
$$ packed form
54836B17662Q079O896N682K864j216m705o828q446j0094j1135j1287j1426j1986
54823A64060j1854r955p215n735o332p726q096o867m900l438k974l036k941k486
54809H0505j823j036l20k03q94j605j317q5J089J623J620R24r21l421m992m716
54793F4428l411k344j634o44N56J046K46j296k364k122q50L03N21J72J39N20O09
54776E3875N7p16j330j709j516l26J257J778Q14k36M0J243K028K010J789J586
54760F0644R88j9p84p95j23R72K304L499L969L378J993N81qM88J437J978K154
54743H2656K800M152N327N662N821O722P974Q359P661O997P283Q193Q842Q932
54729A77381R030R949J1884J3921J4603J3322J0893Q313N448J621k854o558q457
$$ plain form
54716 258496 249813 241872 234979 228802 222661 216325 210432 205791 202460 199891 197688 195747 193894 191936
54702 191936 190021 188604 188151 189167 192135 196872 202279 207465 213022 220455 230378 242034 254638 268281
54688 268281 283205 299071 315521 332805 351107 369650 387016 402086 414098 422123 425200 423003
54676 423003 415998 405071 391390 376325 360777 344444 326277 305896 284351 263526 244997 229320
54664 229320 215979 204064 193214 183794 175819 168183 159765 151202 144660 141522 140927 140900 140201 138625
54650 138625 136249 133227 130068 127320 124947 122528 120086 118267 117591 117826 118203 118101 117413 116387 115264
54635 115264 114217 113699 114555 117314 121248 124639 126220 126182 125666 125610 126207 127029 127410 127017 126317 126144 126730 127701
54617 127701 129152 131887 136009 140073 142601 143978 145934 149460 154255 160038 167166 175614 184271 191722
$$ packed form
54716B58496q683p941o893o177o141o336n893m641l331k569k203j941j853j958
54702A91936j915j417m53J016K968M737N407N186N557P433R923J1656J2604J3643
54688B68281J4924J5866J6450J7284J8302J8543J7366J5070J2012Q025L077k197
54676D23003p005j0927j3681j5065j5548j6333j8167k0381k1545k0825j8529j5677
54664B29320j3341j1915j0850r420p975p636q418q563o542l138n95k7o99j576
54650A38625k376l022l159k748k373k419k442j819o76K35L77j02o88j026j123
54635A15264j047n18Q56K759L934L391J581l8n16n6N97Q22L81l93p00j73N86R71
54617A27701J451K735M122M064K528J377J956L526M795N783P128Q448Q657P451
$$ plain form
54603 191722 197305 201235 204319 207794 212683 218673 224017 227064 227887 228099 229173 231155 233118 234722 236967
54588 236967 240998 246369 251299 254988 258893 265074 274010 284879 297199 310898 325279 339644 354985
54575 354985 373288 394463 415377 432849 446574 458225 468585 476608 480537 478867 470746 456665
54563 456665 438826 420022 402014 385187 369284 353799 338090 322000 306342 292220 279959
54552 279959 269186 259649 251386 244351 238650 234929 233625 233764 233331 231182 227960 224841 221931 218350
54538 218350 213471 207565 201334 195306 189746 184798 180427 176202 171408 165599 159066 152640 146997 142245
54524 142245 138122 134480 131494 129414 127960 125952 121971 115883 109498 105072 103094 102043 100375 98012
54510 98012 95729 93860 92241 90942 90322 90382 90531 90062 88699 86781 85056 84100 83721 83074 81481 79075
$$ packed form
54603A91722N583L930L084L475M889N990N344L047Q23K12J074J982J963J604K245
54588B36967M031N371M930L689L905O181Q936J0869J2320J3699J4381J4365J5341
54575C54985J8303K1175K0914J7472J3725J1651J0360Q023L929j670q121j4081
54563D56665j7839j8804j8008j6827j5903j5485j5709j6090j5658j4122j2261
54552B79959j0773r537q263p035n701l721j304J39m33k149l222l119k910l581
54538B18350m879n906o231o028n560m948m371m225m794n809o533o426n643m752
54524A42245m123l642k986k080j454k008l981o088o385m426j978j051j668k363
54510I8012k283j869j619j299o20O0J49m69j363j918j725r56l79o47j593k406
$$ plain form
54494 79075 76710 75439 75954 78059 80668 82721 84162 85722 87895 90633 93870 97596 101454 105092 108983
54479 108983 113951 119680 124712 128338 131516 135361 139707 143843 147846 152365 157789 164437 172846 182898
54465 182898 193165 202012 209060 214891 219830 223771 226687 228405 228244 225594 220569 213542 204749 195120
54451 195120 186609 180481 175795 170772 165123 159723 154478 148268 141033 134278 129059 124655 119742 113987
54437 113987 108100 103138 100022 98956 99013 98853 97921 96376 94179 91323 88897 88554 90463 92799 93743 93200
54421 93200 92182 91421 91166 91668 93211 95907 99615 103619 106383 106416 103765 100217 97898 97987 100437 103990
54405 103990 106575 106813 105428 104297 104008 103390 101608 99510 98384 98469 99304 100623 102180 103491 104335 104863
54389 104863 104782 103292 100389 97403 95669 95375 96162 97846 99932 101461 102177 102848 103554 102821 99678 95645
$$ packed form
54494G9075k365j271N15K105K609K053J441J560K173K738L237L726L858L638L891
54479A08983M968N729N032L626L178L845M346M136M003M519N424O648Q409J0052
54465A82898J0267Q847P048N831M939L941K916J718j61k650n025p027q793r629
54451A95120q511o128m686n023n649n400n245o210p235o755n219m404m913n755
54437A13987n887m962l116j066N7j60r32j545k197k856k426l43J909K336R44n43
54421I3200j018p61k55N02J543K696L708M004K764L3k651l548k319Q9K450L553
54405A03990K585K38j385j131k89o18j782k098j126Q5Q35J319J557J311Q44N28
54389A04863q1j490k903k986j734k94P87J684K086J529P16O71P06p33l143m033
$$ plain form
54373 95645 93177 92800 93287 94103 95782 97948 98885 97811 96269 96332 98190 100249 101104 100815 100494 101166 103025
54356 103025 105535 108185 110906 113668 116018 117512 118457 119702 121761 124569 127949 131806 135849 139720
54342 139720 143532 147805 152714 157762 162390 166692 171426 177374 184649 192414 199322 204381 207341 208315
54328 208315 207473 205374 203094 201385 199844 197463 193923 189852 185881 181955 177641 172655 167012 160952
54314 160952 154906 149314 144498 140777 138398 137003 135517 133175 130548 128891 128464 128201 127221 125941 125243
54299 125243 125103 124697 123675 122648 122367 122948 124123 125887 128436 131627 134901 137892 140801 143963 147352
54284 147352 150878 154957 160234 166648 173193 178733 182845 185914 188800 192449 197114 201640 203992 202976
54270 202976 199221 194245 188974 183545 178099 173081 168838 165331 162136 158434 153333 146725 139720 133737
$$ packed form
54373I5645k468l77M87Q16J679K166R37j074j542O3J858K059Q55k89l21O72J859
54356A03025K510K650K721K762K350J494R45J245K059K808L380L857M043L871
54342A39720L812M273M909N048M628M302M734N948P275P765O908N059K960R74
54328B08315q42k099k280j709j541k381l540m071l971l926m314m986n643o060
54314A60952o046n592m816l721k379j395j486k342k627j657m27k63r80j280o98
54299A25243j40m06j022j027k81N81J175J764K549L191L274K991K909L162L389
54284A47352L526M079N277O414O545N540M112L069K886L649M665M526K352j016
54270B02976l755m976n271n429n446n018m243l507l195l702n101o608p005n983
$$ plain form
54256 133737 129156 125185 120935 116237 111569 107588 104583 102004 98693 94129 89357 86080 84726 83893
54242 83893 81861 78256 74123 70799 68910 68022 66978 64801 61600 58537 56801 56726 57867 59566 61194
54227 61194 62181 62271 61825 61580 61938 62562 62776 62335 61727 61726 62641 63922 64436 63297 60769 58398 57743 58724 59565
54208 59565 58829 57187 56703 58591 62240 66171 69099 70171 69245 67423 66541 67607 70107 72961 75455
54193 75455 76997 76968 75511 73730 72432 71282 69857 68691 68392 68441 68056 67808 69056 71845 74511 75527
54177 75527 74843 73442 72455 72747 74321 75970 76358 75634 75144 75554 76257 76778 77581 79083 80997 83251 86411
54160 86411 90315 93283 93878 92849 92169 92510 92855 92430 91705 91232 90588 89047 86563 83545 80254 77059
54144 77059 74837 74206 74427 73942 72293 70839 71024 72479 73584 73643 73481 73798 73982 73153 71537 69955 68585
$$ packed form
54256A33737m581l971m250m698m668l981l005k579l311m564m772l277j354q33
54242H3893k032l605m133l324j889q88j044k177l201l063j736p5J141J699J628
54227F1194R87R0m46k45L58O24K14m41o08jR15J281N14j139k528k371o55R81Q41
54208E9565p36j642m84J888L649L931K928J072r26j822q82J066K500K854K494
54193G5455J542k9j457j781j298j150j425j166k99M9l85k48J248K789K666J016
54177G5527o84j401r87K92J574J649L88p24m90M10P03N21Q03J502J914K254L160
54160H6411L904K968N95j029o80L41L45m25p25m73o44j541k484l018l291l195
54144G7059k222o31K21m85j649j454J85J455J105N9j62L17J84q29j616j582j370
$$ plain form
54127 68585 67284 66783 68307 71832 75746 78517 79885 80196 79628 78629 78115 78346 78288 77012 75185 74139
54111 74139 73822 72973 71291 70150 70658 72073 72968 73244 73963 75453 76613 76328 74843 73329 72536 72266 71985
54094 71985 71570 71459 72208 73770 75196 75375 74323 73326 73367 73754 72946 70517 67544 65088 63170 61504 60297
54077 60297 59748 59417 58804 58147 58043 58628 59678 61133 62904 64521 65598 66362 67044 67241 66689 66232 66918
54060 66918 68315 68854 67781 65599 62624 58551 53921 50542 49542 50059 50768 51700 53439 55413 56524
54045 56524 57076 58525 61166 63386 63691 62557 61728 62399 64576 67569 70431 72219 72586 72156 71952 72439
54029 72439 73358 74309 75038 75163 74297 72761 71730 72087 73259 73754 72867 71345 70254 69880 70066 70956 72649
54012 72649 74495 75633 76255 77535 80079 83005 84893 85272 84874 84646 84791 84723 83963 83058 83334 85389 88188
$$ packed form
54127F8585j301n01J524L525L914K771J368L11n68r99n14K31n8j276j827j046
54111G4139l17q49j682j141N08J415Q95K76P19J490J160k85j485j514p93k70k81
54094G1985m15j11P49J562J426J79j052r97M1L87q08k429k973k456j918j666j207
54077F0297n49l31o13o57j04N85J050J455J771J617J077P64O82J97n52m57O86
54060F6918J397N39j073k182k975m073m630l379j000N17P09R32J739J974J111
54045E6524N52J449K641K220L05j134q29O71K177K993K862J788L67m30k04M87
54029G2439R19R51P29J25q66j536j031L57J172M95q87j522j091l74J86Q90J693
54012G2649J846J138O22J280K544K926J888L79l98k28J45o8p60r05K76K055K799
$$ plain form
53995 88188 90152 90936 91452 92389 93668 95367 98123 102175 106798 111156 115042 118396 120975 123022 125483
53980 125483 128818 132338 135464 138957 143881 149915 155808 161189 166685 172413 177707 182599 188377 195992
53966 195992 204711 213030 220389 227369 234451 241264 247102 251785 255796 259535 262671 264539 265260 266001 267747
53951 267747 270152 272111 273098 273286 272576 270396 266539 261485 255756 249613 243464 237760 232258 226227 219791
53936 219791 214294 210664 208053 204818 200410 195533 190773 185940 180809 175804 171662 168723 166705 165096
53922 165096 163879 163791 165477 168187 170010 169869 168745 168211 168318 167969 167090 167101 168991 172046 174932 177096
53906 177096 178506 178921 178402 177993 178843 180686 181973 181638 180311 179689 180983 183829 186419 186918 185133 182640
53890 182640 181000 180251 179620 179196 179922 182075 184690 186717 187958 188700 189130 189549 190560 192596 195677 199818
$$ packed form
53995H8188J964P84N16R37J279J699K756M052M623M358L886L354K579K047K461
53980A25483L335L520L126L493M924O034N893N381N496N728N294M892N778P615
53966A95992Q719Q319P359O980P082O813N838M683M011L739L136J868P21P41J746
53951B67747K405J959R87J88p10k180l857n054n729o143o149n704n502o031o436
53936B19791n497l630k611l235m408m877m760m833n131n005m142k939k018j609
53922A65096j217q8J686K710J823j41j124n34J07l49q79J1J890L055K886K164
53906A77096J410M15n19m09Q50J843J287l35j327o22J294K846K590M99j785k493
53890A82640j640p49o31m24P26K153K615K027J241P42M30M19J011K036L081M141
$$ plain form
53874 199818 205184 211561 218225 224650 230757 236150 239847 241373 241597 241827 242504 243373 244405 245788 247386
53859 247386 249059 251310 254782 259278 264028 268816 274120 280240 287043 294420 302094 309145 314824 319969
53845 319969 326449 334741 343023 349246 353287 356431 359492 362286 364440 365754 365963 364920 363066 361135
53831 361135 359230 356553 352175 346001 338952 332225 326265 320457 313978 306770 299350 291813 283668 274757
53817 274757 265696 257133 249076 241221 233418 225570 217632 210040 203545 198265 193440 188526 183864 179795
53803 179795 175781 171166 166248 161856 158323 155536 153436 151598 148909 144852 140796 138698 138503 138034 135674
53788 135674 132013 128579 126108 124703 124592 125728 127086 127314 125954 123576 121028 119140 118814 120563 123717
53773 123717 126529 127334 125645 122303 118843 116610 116107 116934 118291 119501 120156 120091 119515 119010 119112 119854 120929
$$ packed form
53874A99818N366O377O664O425O107N393L697J526K24K30O77Q69J032J383J598
53859B47386J673K251L472M496M750M788N304O120O803P377P674P051N679N145
53845C19969O480Q292Q282O223M041L144L061K794K154J314K09j043j854j931
53831C61135j905k677m378o174p049o727n960n808o479p208p420p537q145q911
53817B74757r061q563q057p855p803p848p938p592o495n280m825m914m662m069
53803A79795m014m615m918m392l533k787k100j838k689m057m056k098j95m69k360
53788A35674l661l434k471j405j11J136J358K28j360k378k548j888l26J749L154
53773A23717K812Q05j689l342l460k233n03Q27J357J210O55o5n76n05J02P42J075
$$ plain form
53756 120929 122370 124835 128865 133796 137784 139405 139200 139199 140708 143118 145288 147489 151033 156048 160639
53741 160639 162809 162754 162721 164834 169516 175909 183239 191440 200610 210286 219559 227732 234549 239783 243239
53726 243239 245473 247974 251892 256753 261010 263803 265439 266269 265954 264250 261841 259901 259115 259328 259653
53711 259653 258685 255337 250111 245080 241990 240641 239588 237970 235822 232985 228932 223959 219551 216937
53697 216937 215757 214742 213295 211771 210448 208982 207050 204939 203126 201666 200386 199452 199148 199123 198440
53682 198440 196653 194411 192553 190989 189035 186701 184899 184119 183440 181288 177027 171601 166795 164033 163638
53667 163638 164919 166902 169044 171240 173372 175169 176446 177097 176904 175908 174980 175269 176742 177995 178006 177443
53651 177443 177619 178765 180259 182081 184916 188870 193071 196739 199850 202663 205432 208787 213525 219584
$$ packed form
53756A20929J441K465M030M931L988J621k05jJ509K410K170K201L544N015M591
53741A60639K170n5l3K113M682O393P330Q201R170R676R273Q173O817N234L456
53726B43239K234K501L918M861M257K793J636Q30l15j704k409j940p86K13L25
53711B59653r68l348n226n031l090j349j053j618k148k837m053m973m408k614
53697B16937j180j015j447j524j323j466j932k111j813j460j280r34l04k5o83
53682A98440j787k242j858j564j954k334j802p80o79k152m261n426m806k762l95
53667A63638J281J983K142K196K132J797J277O51j93r96r28K89J473J253J1n63
53651A77443J76J146J494J822K835L954M201L668L111K813K769L355M738O059
$$ plain form
53637 219584 225941 231806 237209 242118 245975 248755 251635 255646 260238 264070 266916 269854 273808 278725
53623 278725 283999 288751 291840 292630 292047 292068 293803 296556 298947 300408 301361 302375 303344 303278 301173 297552
53607 297552 294805 295004 297435 299349 299266 298292 297860 297691 296940 295985 295657 295524 294579 293163 292554 292715 292145 290304
53589 290304 288550 287832 286866 283914 279618 276641 276478 277723 277746 275402 271786 268812 267597 268053 269586 271872
53573 271872 274968 278888 283219 287189 290078 291694 292624 293921 296236 299177 301671 303088 303904 305209 307647
53558 307647 310873 314020 316612 319000 321910 325707 330258 335307 340593 345640 350039 354165 359092 365408
53544 365408 372576 379874 387449 395806 404693 413300 421332 429086 436617 443668 450335 456956 463319 468952
53530 468952 474247 480283 487176 493644 498775 503319 508544 514549 520492 525952 531139 536100 540522 544258
$$ packed form
53637B19584O357N865N403M909L857K780K880M011M592L832K846K938L954M917
53623B78725N274M752L089P90n83K1J735K753K391J461R53J014R69o6k105l621
53607B97552k747J99K431J914q3r74m32j69p51r55l28j33r45j416o09J61n70j841
53589B90304j754p18r66k952m296k977j63J245K3k344l616k974j215M56J533K286
53573B71872L096L920M331L970K889J616R30J297K315K941K494J417Q16J305K438
53558C07647L226L147K592K388K910L797M551N049N286N047M399M126M927O316
53544C65408P168P298P575Q357Q887Q607Q032P754P531P051O667O621O363N633
53530D68952N295O036O893O468N131M544N225O005N943N460N187M961M422L736
$$ plain form
53516 544258 547474 550391 553261 556421 559786 562496 563598 563096 562004 561449 561918 563081 563966 563573 561824
53501 561824 559823 558849 559154 560010 560725 561299 562258 564118 566885 569955 572724 575294 578055 580502 581352 580314
53485 580314 578954 579020 580533 582348 583953 585641 587343 588660 590006 592444 596095 599773 602680 605663 610313
53470 610313 617391 626366 635958 644893 652797 660657 669805 680270 690869 701085 711953 724532 738509
53457 738509 753120 768695 786128 805223 824749 844051 863584 883796 904585 926242 949894
53446 949894 976280 1004753 1034310 1065138 1098220 1133669 1170454 1207863 1246202 1285701 1325786
53435 1325786 1366156 1407651 1450880 1494479 1536147 1575411 1614164 1654172 1695336 1736911 1779134
53424 1779134 1822608 1866967 1911442 1956211 2001896 2047915 2092582 2134946 2175405 2214387 2251568
$$ packed form
53516E44258L216K917K870L160L365K710J102n02j092n55M69J163Q85l93j749
53501E61824k001r74L05Q56P15N74R59J860K767L070K769K570K761K447Q50j038
53485E80314j360O6J513J815J605J688J702J317J346K438L651L678K907K983M650
53470F10313P078Q975R592Q935P904P860R148J0465J0599J0216J0868J2579J3977
53457G38509J4611J5575J7433J9095J9526J9302J9533K0212K0789K1657K3652
53446I49894K6386K8473K9557L0828L3082L5449L6785L7409L8339L9499M0085
53435A325786M0370M1495M3229M3599M1668L9264L8753M0008M1164M1575M2223
53424A779134M3474M4359M4475M4769M5685M6019M4667M2364M0459L8982L7181
$$ plain form
53413 2251568 2286919 2321505 2356435 2391509 2425622 2458145 2489205 2518767 2546191 2570923 2593270
53402 2593270 2614172 2634318 2653567 2671229 2686678 2699538 2709367 2715533 2717624 2715830 2710658 2702394
53390 2702394 2691012 2676464 2658921 2638830 2616900 2593726 2569178 2542402 2512728 2480398 2446150
53379 2446150 2410398 2373246 2334992 2296073 2256667 2216917 2177483 2139323 2102756 2067137 2031661
53368 2031661 1996353 1962316 1931043 1903258 1878248 1854611 1831843 1810713 1791836 1774617 1758287
53357 1758287 1743385 1731315 1722798 1717632 1715620 1716650 1720018 1724878 1731540 1741253 1754557 1770873 1790075
53344 1790075 1813211 1840841 1871471 1902728 1933963 1966964 2003985 2045425 2089622 2134816 2181072
53333 2181072 2229999 2282669 2338566 2396906 2458091 2522911 2590889 2660614 2731493 2804073 2878930
$$ packed form
53413B251568L5351L4586L4930L5074L4113L2523L1060K9562K7424K4732K2347
53402B593270K0902K0146J9249J7662J5449J2860R829O166K091j794n172q264
53390B702394j1382j4548j7543k0091k1930k3174k4548k6776k9674l2330l4248
53379B446150l5752l7152l8254l8919l9406l9750l9434l8160l6567l5619l5476
53368B031661l5308l4037l1273k7785k5010k3637k2768k1130j8877j7219j6330
53357A758287j4902j2070q517n166k012J030L368M860O662R713J3304J6316J9202
53344A790075K3136K7630L0630L1257L1235L3001L7021M1440M4197M5194M6256
53333B181072M8927N2670N5897N8340O1185O4820O7978O9725P0879P2580P4857
$$ plain form
53322 2878930 2956534 3038128 3125078 3216799 3310541 3403746 3495671 3586413 3675762 3763711 3850913
53311 3850913 3937590 4022673 4104743 4183239 4258288 4330108 4398956 4464595 4525302 4578563 4623579
53300 4623579 4662128 4696210 4725970 4750624 4769873 4782995 4787877 4782832 4768862 4748450 4722564 4690272
53288 4690272 4650793 4604196 4550383 4489233 4421940 4350570 4275835 4196633 4112308 4024293 3935149
53277 3935149 3846939 3760769 3676769 3593892 3510650 3426610 3342602 3259269 3176343 3093809 3012805
53266 3012805 2934663 2859708 2787710 2719009 2654380 2594032 2537391 2483832 2433158 2385331 2340193
53255 2340193 2297630 2257781 2220874 2186770 2154787 2124176 2094764 2066952 2041078 2017183 1995452
53244 1995452 1976353 1960124 1946605 1935868 1928333 1923836 1921300 1920024 1920625 1923888 1929329 1935943 1943756
$$ packed form
53322B878930P7604Q1594Q6950R1721R3742R3205R1925R0742Q9349Q7949Q7202
53311C850913Q6677Q5083Q2070P8496P5049P1820O8848O5639O0707N3261M5016
53300D623579L8549L4082K9760K4654J9249J3122M882n045j3970k0412k5886l2292
53288D690272l9479m6597n3813o1150o7293p1370p4735p9202q4325q8015q9144
53277C935149q8210q6170q4000q2877q3242q4040q4008q3333q2926q2534q1004
53266C012805p8142p4955p1998o8701o4629o0348n6641n3559n0674m7827m5138
53255B340193m2563l9849l6907l4104l1983l0611k9412k7812k5874k3895k1731
53244A995452j9099j6229j3519j0737p535m497k536j276O01L263N441O614P813
$$ plain form
53231 1943756 1953313 1964014 1974576 1985273 1998241 2015100 2035414 2058083 2083122 2111402 2143431
53220 2143431 2179097 2218027 2259518 2302462 2345717 2388325 2429442 2468801 2507328 2546390 2586014
53209 2586014 2624629 2660834 2694526 2725879 2754348 2779545 2802161 2822915 2841052 2854953 2864012
53198 2864012 2869153 2871733 2872582 2871741 2868268 2860437 2847014 2828439 2806205 2781186 2753225 2722209 2688654
53185 2688654 2652904 2614474 2572720 2527977 2481755 2435788 2390923 2346651 2301644 2254963 2206918
53174 2206918 2158763 2111554 2065363 2019566 1973773 1928499 1884841 1843542 1804419 1766783 1730194
53163 1730194 1694519 1659530 1625030 1591380 1559381 1529536 1501881 1476402 1452883 1430278 1407296
53152 1407296 1384059 1362241 1342864 1324757 1305962 1285903 1265194 1244091 1222541 1201369 1181843
$$ packed form
53231A943756R557J0701J0562J0697J2968J6859K0314K2669K5039K8280L2029
53220B143431L5666L8930M1491M2944M3255M2608M1117L9359L8527L9062L9624
53209B586014L8615L6205L3692L1353K8469K5197K2616K0754J8137J3901R059
53198B864012N141K580Q49q41l473p831j3423j8575k2234k5019k7961l1016l3555
53185B688654l5750l8430m1754m4743m6222m5967m4865m4272m5007m6681m8045
53174B206918m8155m7209m6191m5797m5793m5274m3658m1299l9123l7636l6589
53163A730194l5675l4989l4500l3650l1999k9845k7655k5479k3519k2605k2982
53152A407296k3237k1818j9377j8107j8795k0059k0709k1103k1550k1172j9526
$$ plain form
53141 1181843 1163953 1146400 1128496 1110796 1093620 1076373 1058996 1042757 1028578 1015544 1002129
53130 1002129 988086 973904 959092 942445 923784 904108 884090 863701 843380 824216 806546
53119 806546 789556 772861 757335 743589 730578 716807 702291 688207 674966 661757 647985
53108 647985 634240 621658 610893 601668 592756 582512 570264 557213 545311 535159 525706 516002
53096 516002 506357 497462 489237 481079 472680 464174 455997 448883 443311 438579 433126 426353 419393 413401
53082 413401 407861 401582 394825 389140 385170 381774 377589 372562 367513 362935 358723 354760 351220 348322
53068 348322 345939 343525 340570 337289 334586 333032 332146 331098 329840 328945 328503 327852 326451 324424 322188
53053 322188 320130 318716 318264 318351 317964 316538 314571 313041 312558 313178 314566 316162 317561 318926 320712 322998
$$ packed form
53141A181843j7890j7553j7904j7700j7176j7247j7377j6239j4179j3034j3415
53130A002129j4043j4182j4812j6647j8661j9676k0018k0389k0321j9164j7670
53119H06546j6990j6695j5526j3746j3011j3771j4516j4084j3241j3209j3772
53108F47985j3745j2582j0765r225q912j0244j2248j3051j1902j0152r453r704
53096E16002r645q895q225q158q399q506q177p114n572m732n453o773o960n992
53082D13401n540o279o757n685l970l396m185n027n049m578m212l963l540k898
53068C48322k383k414k955l281k703j554q86j048j258q95m42o51j401k027k236
53053C22188k058j414m52Q7l87j426j967j530m83O20J388J596J399J365J786K286
$$ plain form
53037 322998 325588 328832 333495 339387 344831 348314 350334 352688 355944 358400 358003 354793 350893 348186
53023 348186 346565 344691 342013 339443 337989 337259 335646 331771 325436 317478 309116 301362 294584 288534
53009 288534 282907 277787 273297 269081 264576 259805 255475 252279 250311 249145 248116 246535 244024 240738
52995 240738 237100 233350 229514 225650 221917 218537 215922 214552 214304 214220 213420 211951 210261 208205 205414
52980 205414 202364 200036 198461 196592 193968 191580 190535 190569 190569 190127 189852 190244 190802 190374 188239 184848 181558
52963 181558 179630 179402 180250 181090 180972 179766 178495 178343 178901 178187 175182 171579 169831 170102 170559 170313 170257
52946 170257 170914 171353 170874 170186 169992 169810 169222 168988 169665 170166 169096 166803 164673 163052 161317 159711 159444
52929 159444 160836 162710 163975 164687 165162 165094 164249 163260 162863 162653 161463 159099 157058 157078 159164 161583 162915
$$ packed form
53037C22998K590L244M663N892N444L483K020K354L256K456l97l210l900k707
53023C48186j621j874k678k570j454p30j613l875o335p958q362p754o778o050
53009B88534n627n120m490m216m505m771m330l196j968j166j029j581k511l286
52995B40738l638l750l836l864l733l380k615j370k48q4q00j469j690k056k791
52980B05414l050k328j575j869k624k388j045L4%m42k75L92N58m28k135l391l290
52963A81558j928k28Q48Q40j18j206j271j52N58p14l005l603j748K71M57k46n6
52946A70257O57M39m79o88j94j82n88k34O77N01j070k293k130j621j735j606k67
52929A59444J392J874J265P12M75o8q45r89l97k10j190k364k041K0K086K419J332
$$ plain form
52912 162915 163567 164831 166954 168918 169915 170119 169955 169609 169647 171200 174905 180205 186147 192288 198480 204427
52896 204427 209967 215212 220028 224193 228432 234209 241652 248720 253562 256949 261056 266484 272027 277045
52882 277045 282338 288369 294064 298063 300310 301740 302871 303250 302030 298905 294598 290335 286550 282440
52868 282440 277251 271652 267152 264355 262535 260781 258779 256496 254001 251799 250561 250178 249607 247995 245611
52853 245611 243518 242555 242662 242929 242368 240907 239466 238754 238311 237216 235361 233370 231661 230432 230376 232312
52837 232312 235873 239350 241176 241199 240493 240439 241863 244298 246104 246037 244755 244099 244881 246274 247514 249142
52821 249142 252023 255880 259475 261821 262636 261976 259967 257012 253997 252094 252042 253417 254995 256150 257412
52806 257412 259149 260349 259830 258227 257425 258024 258753 258632 258326 258696 259336 259575 260070 262219 266330 271198 275261
$$ packed form
52912A62915O52J264K123J964R97K04j64l46L8J553L705N300N942O141O192N947
52896B04427N540N245M816M165M239N777P443P068M842L387M107N428N543N018
52882B77045N293O031N695L999K247J430J131L79j220l125m307m263l785m110
52868B82440n189n599m500k797j820j754k002k283k495k202j238l83n71j612k384
52853B45611k093r63J07K67n61j461j441p12m43j095j855j991j709j229n6J936
52837B32312L561L477J826K3p06n4J424K435J806o7j282o56P82J393J240J628
52821B49142K881L857L595K346Q15o60k009k955l015j903n2J375J578J155J262
52806B57412J737J200n19j603q02N99P29j21l06L70O40K39M95K149M111M868M063
$$ plain form
52789 275261 277541 277842 276734 275369 274851 275704 277840 280564 282724 283719 284736 288120 294761 302689 308845
52774 308845 311681 311530 309421 306681 305150 306160 309066 311793 313256 314537 317366 322117 327670 332695
52760 332695 336405 338331 338104 335830 332491 329528 327775 326881 325810 323724 320213 315143 308955 303004 298722
52745 298722 296056 293339 289083 283513 278054 273857 271081 268949 265951 260719 253515 246509 241769 239181
52731 239181 237026 234222 231111 228181 225080 221181 216418 211305 206671 203486 202239 202193 201835 200418 198594
52716 198594 197297 196552 195781 194701 193353 191637 189489 187316 185654 184502 183529 182852 182907 183506 183661 182670
52700 182670 180856 178906 176970 174867 172754 170984 169523 168125 166927 166226 165719 164665 162823 160459 157391
52685 157391 153043 147966 144255 143353 144053 143755 141513 138664 136540 134875 132926 131022 130032 129917 129756 129047
$$ packed form
52789B75261K280L01j108j365n18Q53K136K724K160R95J017L384O641P928O156
52774C08845K836j51k109k740j531J010K906K727J463J281K829M751N553N025
52760C32695L710J926k27k274l339k963j753q94j071k086l511n070o188n951m282
52745B98722k666k717m256n570n459m197k776k132k998n232p204p006m740k588
52731B39181k155k804l111k930l101l899m763n113m634l185j247m6l58j417j824
52716A98594j297p45p71j080j348j716k148k173j662j152r73o77N5N99J55r91
52700A82670j814j950j936k103k113j770j461j398j198p01n07j054j842k364l068
52685A57391m348n077l711r02P00k98k242k849k124j665j949j904r90j15j61p09
$$ plain form
52669 129047 128241 127966 128376 129381 130957 132882 134474 135109 134998 135028 135632 136128 135524 133726 131376 128605 124775
52652 124775 119835 115106 111986 110344 109077 107939 107834 109284 111603 113823 115675 117267 118489 119225 119714
52637 119714 120219 120598 120576 120205 119763 119383 118991 118553 118374 119279 122306 127755 134485 140698 145507 149467 153564
52620 153564 158156 162911 167262 170823 173876 177386 181934 186643 189937 191399 191924 191911 190519 187356 183740
52605 183740 181214 179546 177265 173729 169618 165647 161779 157642 152872 147138 140639 134587 130418 128376
52591 128376 127407 126437 125109 123348 121084 118699 117085 116799 117476 118311 118816 118916 118707 118414 118348 118664 119321
52574 119321 120357 121913 123810 125370 125991 125842 125721 126202 127015 127210 125884 122877 118984 115480 113279 112419
52558 112419 112430 113108 114676 117068 119454 120937 121551 122032 122603 122698 122073 121422 121391 121738 122123 123072 125042 127001
$$ packed form
52669A29047q06k75M10J005J576J925J592O35j11L0O04M96o04j798k350k771l830
52652A24775m940m729l120j642j267j138j05J450K319K220J852J592J222P36M89
52637A19714N05L79k2l71m42l80l92m38j79R05L027N449O730O213M809L960M097
52620A53564M592M755M351L561L053L510M548M709L294J462N25j3j392l163l616
52605A83740k526j668k281l536m111l971l868m137m770n734o499o052m169k042
52591A28376r69r70j328j761k264k385j614k86O77Q35N05J00k09k93o6L16O57
52574A19321J036J556J897J560O21j49j21M81Q13J95j326l007l893l504k201q60
52558A12419J1O78J568K392K386J483O14M81N71R5o25o51l1L47L85R49J970J959
$$ plain form
52540 127001 127123 124948 121816 119190 117645 117428 118609 120227 120654 119538 118396 118537 119516 120514 122159 125603
52524 125603 130434 134944 138169 140433 141923 141998 140371 138170 137314 138955 142596 146524 149315 151095 153026
52509 153026 155494 157555 158545 159263 160650 162051 162137 161207 161219 163431 167082 170577 172986 174140 174231 173854 173820
52492 173820 174526 175868 177896 180957 184875 188499 190480 190376 188993 187836 188098 189708 191442 192297 192622
52477 192622 193444 195026 196749 198190 199450 200450 200848 200800 201025 201812 202672 203222 203730 204486 205269 205824 206369
52460 206369 207311 208843 210943 213244 214763 214557 212947 211425 210867 210421 208646 205275 201407 198401 197037
52445 197037 197255 198168 198677 198579 198784 200023 201743 202731 202383 200886 198731 196802 196451 198402 201572 203880
52429 203880 204318 203561 202602 201792 201423 202164 204136 206329 207820 209148 211538 214943 217801 218924 218830 218920 219891
$$ packed form
52540A27001J22k175l132k626j545k17J181J618M27j116j142J41R79R98J645L444
52524A25603M831M510L225K264J490P5j627k201q56J641L641L928K791J780J931
52509A53026K468K061R90P18J387J401Q6r30J2K212L651L495K409J154R1l77l4
52492A73820P06J342K028L061L918L624J981j04j383j157K62J610J734Q55L25
52477A92622Q22J582J723J441J260J000L98m8K25P87Q60N50N08P56P83N55N45
52460B06369R42J532K100K301J519k06j610j522n58m46j775l371l868l006j364
52445A97037K18R13N09r8K05J239J720R88l48j497k155j929l51J951L170K308
52429B03880M38p57r59q10l69P41J972K193J491J328K390L405K858J123r4R0R71
$$ plain form
52412 219891 221443 223100 224794 226735 228962 230949 231754 231027 229901 230138 231981 233665 233829 233734 235895 240767
52396 240767 246038 249292 250186 249623 248000 245161 241483 238142 236412 236946 239380 242366 244465 245363 245930
52381 245930 247104 249246 252442 256394 259752 260726 259010 256217 253904 252239 251251 252068 255530 260473 264787
52366 264787 267690 269778 271519 273068 275041 277871 280684 282281 283059 284483 286696 288229 288184 287215 286106
52351 286106 284827 283393 282274 281490 280536 279629 279684 280468 280164 277688 274349 272348 272522 274379 277300 280565
52335 280565 282888 283200 281879 280467 280253 281442 283326 284890 285609 285893 286338 286553 285501 283205 281090 280231
52319 280231 280206 280244 280482 281347 282661 284290 286815 290452 293977 295947 296629 297571 299436 301409 302768 304108
52303 304108 306727 311432 318035 325436 332032 336581 339011 340272 341391 342803 344603 347268 351818 358778
$$ packed form
52412B19891J552J657J694J941K227J987Q05p27j126K37J843J684J64r5K161M872
52396B40767N271L254Q94n63j623k839l678l341j730N34K434K986K099Q98N67
52381B45930J174K142L196L952L358R74j716k793k313j665r88Q17L462M943M314
52366B64787K903K088J741J549J973K830K813J597P78J424K213J533m5r69j109
52351B86106j279j434j119p84r54r07N5P84l04k476l339k001J74J857K921L265
52335B80565K323L12j321j412k14J189J884J564P19K84M45K15j052k296k115q59
52319B80231k5L8K38Q65J314J629K525L637L525J970O82R42J865J973J359J340
52303C04108K619M705O603P401O596M549K430J261J119J412J800K665M550O960
$$ plain form
52289 358778 366775 372839 375012 374505 374247 375411 376587 376487 375935 376469 378309 380716 383317 386018 388515
52274 388515 391107 395211 401769 409543 416185 420630 423454 425455 427152 429335 432696 436769 440260 442519
52260 442519 443968 445400 447832 452700 460878 471360 481968 491519 500421 509292 518182 527296 537234 548064
52246 548064 559134 570225 582038 595095 608905 622748 636677 651327 667203 684453 702815
52235 702815 721613 740341 759439 779916 802024 824956 847962 870957 893745 915649 936575
52224 936575 957720 980366 1004322 1028238 1051184 1073182 1094314 1114161 1132409 1149568 1166481
52213 1166481 1183093 1198071 1210024 1219074 1226770 1234369 1241755 1248481 1255124 1262605 1270432 1276861 1281043
52200 1281043 1284022 1287064 1289817 1290958 1290199 1288743 1287748 1287129 1286230 1285216 1285203 1286798 1289032 1290313 1290416 1290897
$$ packed form
52289C58778P997O064K173n07k58J164J176j00n52N34J840K407K601K701K497
52274C88515K592M104O558P774O642M445K824K001J697K183L361M073L491K259
52260D42519J449J432K432M868Q178J0482J0608R551Q902Q871Q890R114R938J0830
52246E48064J1070J1091J1813J3057J3810J3843J3929J4650J5876J7250J8362
52235G02815J8798J8728J9098K0477K2108K2932K3006K2995K2788K1904K0926
52224I36575K1145K2646K3956K3916K2946K1998K1132J9847J8248J7159J6913
52213A166481J6612J4978J1953R050P696P599P386O726O643P481P827O429M182
52200A281043K979L042K753J141p59j456r95o19q99j014j3J595K234J281J03M81
$$ plain form
52184 1290897 1293251 1297328 1302111 1307515 1314504 1323688 1334628 1346503 1358634 1370385 1381559 1393173
52172 1393173 1406964 1423581 1441684 1459134 1474528 1487378 1497639 1505846 1513294 1521261 1529877 1538005
52160 1538005 1544179 1547578 1548314 1547092 1544504 1540683 1535670 1529937 1524072 1517990 1510958 1502502 1492764 1481904
52146 1481904 1469760 1456413 1442559 1428875 1415294 1401235 1386297 1370564 1354678 1339903 1327671
52135 1327671 1318506 1311508 1305177 1298623 1291837 1285138 1278715 1272516 1266226 1259557 1252820 1247084 1243385 1241779
52121 1241779 1241339 1241004 1240297 1239332 1238321 1237103 1235078 1231638 1226702 1220775 1214562 1208603 1203193 1198494 1194745
52106 1194745 1192397 1191731 1192069 1191707 1189250 1184970 1180473 1177007 1174406 1171428 1166619 1159183 1149837 1140877 1134494
52091 1134494 1130784 1127967 1124683 1121241 1118439 1116188 1114027 1112240 1111435 1111233 1110198 1107298 1103018 1098850
$$ packed form
52184A290897K354M077M783N404O989R184J0940J1875J2131J1751J1174J1614
52172A393173J3791J6617J8103J7450J5394J2850J0261Q207P448P967Q616Q128
52160A538005O174L399P36j222k588l821n013n733n865o082p032q456r738j0860
52146A481904j2144j3347j3854j3684j3581j4059j4938j5733j5886j4775j2232
52135A327671r165o998o331o554o786o699o423o199o290o669o737n736l699j606
52121A241779m40l35p07r65j011j218k025l440m936n927o213n959n410m699l749
52106A194745k348o66L38l62k457m280m497l466k601k978m809p436r346q960o383
52091A134494l710k817l284l442k802k251k161j787q05k02j035k900m280m168
$$ plain form
52077 1098850 1095699 1092882 1088915 1083406 1077750 1073484 1070395 1067109 1063211 1059519 1056148 1051756 1045332 1037721
52063 1037721 1030628 1025037 1021244 1019361 1018704 1017571 1014899 1011708 1009803 1009517 1009872 1010566 1012467 1016162 1021218
52048 1021218 1026989 1033279 1040285 1048778 1060174 1075229 1092581 1109764 1125964 1142707 1161545 1182184
52036 1182184 1203423 1224895 1247120 1270602 1295667 1322575 1351081 1380295 1409480 1438524 1467092
52025 1467092 1493971 1518143 1540122 1561385 1582651 1603462 1623277 1642030 1659429 1674521 1686531
52014 1686531 1695864 1703857 1711558 1718807 1724361 1726875 1725909 1722163 1716801 1710630 1703825 1696160 1687386 1677646
52000 1677646 1667618 1658004 1648707 1638930 1628440 1618283 1609696 1602605 1595944 1589359 1583675 1579527 1576493
51987 1576493 1574105 1572930 1573756 1576103 1578546 1580492 1582835 1586593 1591606 1596881 1601765 1606365 1611134 1616500
$$ packed form
52077A098850l151k817l967n509n656m266l089l286l898l692l371m392o424p611
52063A037721p093n591l793j883o57j133k672l191j905k86L55O94J901L695N056
52048A021218N771O290P006Q493J1396J5055J7352J7183J6200J6743J8838K0639
52036A182184K1239K1472K2225K3482K5065K6908K8506K9214K9185K9044K8568
52025A467092K6879K4172K1979K1263K1266K0811J9815J8753J7399J5092J2010
52014A686531R333P993P701P249N554K514r66l746n362o171o805p665q774r740
52000A677646j0028r614r297r777j0490j0157q587p091o661o585n684m148l034
51987A576493k388j175Q26K347K443J946K343L758N013N275M884M600M769N366
$$ plain form
51973 1616500 1622705 1629592 1636528 1642695 1647357 1649949 1650450 1650052 1650868 1654089 1658380 1660767 1659320 1654529 1647967
51958 1647967 1640294 1631082 1620103 1608007 1595547 1582606 1568277 1551842 1533450 1513848 1493605 1472775
51946 1472775 1451181 1428689 1405108 1380179 1353930 1326805 1299117 1270687 1241451 1212104 1183374
51935 1183374 1154730 1124667 1092561 1059590 1027497 997064 968200 940815 914902 890140 866132
51924 866132 842834 820150 797341 773611 749274 725673 703809 683451 663776 644407 625687
51913 625687 608265 592577 578408 564836 550894 536406 522043 508560 496267 485161 475012
51902 475012 465148 454648 443204 431530 420650 411029 402698 395873 390831 387209 384025 380588 376993
51889 376993 373535 370102 366491 362922 359666 356363 352380 347855 343720 340491 337665 334614 331477 328676
$$ packed form
51973A616500O205O887O936O167M662K592N01l98Q16L221M291K387j447m791o562
51958A647967p673r212j0979j2096j2460j2941j4329j6435j8392j9602k0243k0830
51946A472775k1594k2492k3581k4929k6249k7125k7688k8430k9236k9347k8730
51935A183374k8644l0063l2106l2971l2093l0433k8864k7385k5913k4762k4008
51924H66132k3298k2684k2809k3730k4337k3601k1864k0358j9675j9369j8720
51913F25687j7422j5688j4169j3572j3942j4488j4363j3483j2293j1106j0149
51902D75012r864j0500j1444j1674j0880r621q331o825n042l622l184l437l595
51889C76993l458l433l611l569l256l303l983m525m135l229k826l051l137k801
$$ plain form
51875 328676 326203 324050 322722 322331 321587 318927 314578 310239 306639 302869 298510 294784 292463 290188 286584
51860 286584 283127 282701 285345 287461 285838 280982 275674 271563 268378 265626 263536 262231 260989 258787
51846 258787 255368 251667 249228 248965 250274 251483 251378 250077 248391 246709 244834 242559 239967 237297 234842
51831 234842 232925 231813 231639 232301 233066 232421 229149 223980 219423 217257 216684 215828 214529 214390 216133 218351
51815 218351 219406 219382 219347 219598 219812 220313 221892 224392 226606 227805 228440 229072 229597 230055 231343 234217 238014
51798 238014 241241 243308 244972 247166 250092 253470 256906 259698 260905 260201 258518 257489 258176 260340 262790
51783 262790 264389 264859 264714 264458 264120 263692 263597 264144 264746 264430 263155 261890 261156 260329 258790 257126 256500
51766 256500 257271 258964 261217 263972 266797 268844 269807 270396 271505 273156 274552 275063 274924 274856 275114 275181 274544
$$ packed form
51875C28676k473k153j328l91p44k660m349m339l600l770m359l726k321k275l604
51860B86584l457m26K644K116j623m856n308m111l185k752k090j305j242k202
51846B58787l419l701k439k63J309J209j05j301j686j682j875k275k592k670k455
51831B34842j917j112j74O62P65o45l272n169m557k166n73q56j299j39J743K218
51815B18351J055k4l5K51K14N01J579K500K214J199O35O32N25M58J288K874L797
51798B38014L227K067J664K194K926L378L436K792J207p04j683j029O87K164K450
51783B62790J599M70j45k56l38m28r5N47O02l16j275j265p34q27j539j664o26
51766B56500P71J693K253K755K825K047R63N89J109J651J396N11j39o8K58O7o37
$$ plain form
51749 274544 273523 272881 272816 272907 273070 273788 275061 275894 275441 274108 272893 272102 271477 271201 271774 273030 274140
51732 274140 274750 275424 276787 278785 280811 282119 282203 281438 281227 282714 285272 287129 287647 288115 289882 292645
51716 292645 295148 296813 297860 298292 297804 296714 296311 297983 302117 307744 313071 316557 317863 317855 317817 318771
51700 318771 321340 325574 330750 335854 340610 345627 351337 357390 363456 369980 377501 385711 393930 402199
51686 402199 411046 420252 428613 435064 439438 442057 443204 443307 443192 443721 445239 447379 449296 450195 450009
51671 450009 449551 449702 450427 451006 451236 451871 453525 455580 456731 456513 455792 455590 455841 455635 454493 452864 451252
51654 451252 449394 446784 443673 440951 439096 437921 437424 438015 439557 440958 441367 441160 441012 440566 439051 436938
51638 436938 435818 436539 438459 440712 443259 446372 449985 454076 458816 463689 467235 468580 468740 469593 471908
$$ packed form
51749B74544j021o42o5R1J63P18J273Q33m53j333j215p91o25k76N73J256J110
51732B74140O10O74J363J998K026J308Q4p65k11J487K558J857N18M68J767K763
51716B92645K503J665J047M32m88j090m03J672M134N627N327L486J306ql8R54
51700C18771K569M234N176N104M756N017N710O053O066O524P521Q210Q219Q269
51686D02199Q847R206Q361O451M374K619J147J03j15N29J518K140J917Q99j86
51671D50009m58J51P25N79K30O35J654K055J151k18p21k02K51k06j142j629j612
51654D51252j858k610l111k722j855j175m97N91J542J401M09k07j48m46j515k113
51638D36938j120P21J920K253K547L113L613M091M740M873L546J345J60Q53K315
$$ plain form
51623 471908 475170 478973 483526 488860 494462 499822 504531 507745 508507 506997 504642 502538 500496 498235
51609 498235 496713 497282 499783 502427 503573 502923 500963 497997 494061 489294 483993 478427 472742 466906 460757
51594 460757 454301 447909 441894 436040 429946 423757 418039 412884 407756 402333 396838 391283 385119 378076
51580 378076 370784 363977 357700 352005 347835 346134 346241 346228 345004 343279 342263 342248 342769 343340 343456 342527
51564 342527 340469 338103 336381 335346 334187 332174 329294 326222 323887 322663 321671 319323 315118 310625
51550 310625 308082 308099 309240 309771 309294 308617 308647 309702 311633 314201 317261 320524 323315 324979 325790 327063
51534 327063 329868 333839 337731 340934 343861 346984 350307 353949 358523 364522 371704 379387 386999 394140
51520 394140 400558 406329 411583 415792 417879 417531 415878 414268 412759 410616 407929 405694 404177 402212
$$ packed form
51623D71908L262L803M553N334N602N360M709L214P62j510k355k104k042k261
51609D98235j522N69K501K644J146o50j960k966l936m767n301n566n685n836o149
51594D60757o456o392o015n854o094o189n718n155n128n423n495n555o164p043
51580C78076p292o807o277n695m170j701J07j3j224j725j016j5N21N71J16r29
51564C42527k058k366j722j035j159k013k880l072k335j224r92k348m205m493
51550C10625k543J7J141N31m77o77L0J055J931K568L060L263K791J664Q11J273
51534C27063K805L971L892L203K927L123L323L642M574N999P182P683P612P141
51520C94140O418N771N254M209K087l48j653j610j509k143k687k235j517j965
$$ plain form
51506 402212 398686 394162 390526 389258 390366 392633 394502 395060 394721 394892 396647 399767 403296 406734 410237
51491 410237 413909 417590 421339 425407 429444 432393 433679 434129 435192 437478 440583 443999 447411 450072
51477 450072 450906 449780 448113 447539 448229 449240 450289 452336 456084 460605 464055 465522 465644 465535 465600 465538
51461 465538 465025 464059 462772 461184 459202 456713 453611 449783 445152 439835 434264 429046 424572 420760 417245
51446 417245 413734 410059 406014 401496 396947 393349 391419 390877 390710 390173 389320 388544 387855 386805 385067 382958
51430 382958 381292 380707 381138 382053 383183 384890 387718 391622 395866 399664 402865 406049 409967 414862 420229
51415 420229 425356 430137 435171 440924 447067 452956 458562 464470 471022 477967 485071 492611 501084 510713
51401 510713 521360 532451 542714 550435 554578 555663 555382 555401 556583 558934 561875 564692 567067 569186
$$ packed form
51506D02212l526m524l636j268J108K267J869N58l39J71J755L120L529L438L503
51491D10237L672L681L749M068M037K949J286M50J063K286L105L416L412K661
51477D50072Q34j126j667n74O90J011J049K047L748M521L450J467J22j09O5o2
51461D65538n13r66j287j588j982k489l102l828m631n317n571n218m474l812l515
51446D17245l511l675m045m518m549l598j930n42j67n37q53p76o89j050j738k109
51430C82958j666n85M31R15J130J707K828L904M244L798L201L184L918M895N367
51415D20229N127M781N034N753O143N889N606N908O552O945P104P540Q473R629
51401E10713J0647J1091J0263P721M143J085k81J9J182K351K941K817K375K119
$$ plain form
51387 569186 571368 573825 576758 580136 583226 585044 585723 586637 588421 589600 588387 585326 582601 580695 577475
51372 577475 571308 563618 557109 552345 547484 540938 532953 524629 516681 509594 503954 499927 496817 493629
51358 493629 489917 485829 481644 477581 473813 470354 467058 464021 461864 461296 462359 464396 466859 469940
51344 469940 474094 479010 483352 485766 485986 484771 483008 481234 479834 478993 478156 476114 472149 466860 461371
51329 461371 455859 449334 440798 430239 418610 407301 397527 389516 382070 373541 363694 354285 347322
51316 347322 342854 338745 332607 323904 314448 307008 303064 301520 299683 295787 290442 285469 281655 278186
51302 278186 274030 269202 264497 260581 257623 255366 253142 250036 245582 240313 235437 231965 230255 230124
51288 230124 230942 231623 231072 229115 226935 226249 227869 231062 234361 236827 238443 239551 240452 241690 244020
$$ packed form
51387E69186K182K457K933L378L090J818O79R14J784J179j213l061k725j906l220
51372E77475o167p690o509m764m861o546p985q324p948p087n640m027l110l188
51358D93629l712m088m185m063l768l459l296l037k157n68J063K037K463L081
51344D69940M154M916M342K414K20j215j763j774j400q41q37k042l965n289n489
51329D61371n512o525q536j0559j1629j1309r774q011p446q529r847r409o963
51316C47322m468m109o138q703r456p440l944j544j837l896n345m973l814l469
51302B78186m156m828m705l916k958k257k224l106m454n269m876l472j710j31
51288B30124Q18O81n51j957k180o86J620L193L299K466J616J108R01J238K330
$$ plain form
51273 244020 247422 250404 251209 249957 248936 250369 254384 259468 264224 268139 271382 274836 279947 287367
51259 287367 295728 302746 307638 311458 315035 317790 319171 319984 321209 322287 321812 319586 316844 314439 311786
51244 311786 307871 302591 296701 290839 284966 278704 272081 265761 260301 255324 250044 244634 240215 237056
51230 237056 233875 229824 226241 225066 226038 227009 226852 226420 226435 226169 224768 222482 219749 216424 213010 211391
51214 211391 212774 215519 216548 214688 211364 208150 205181 202353 200712 201555 204606 208008 210192 211301
51200 211301 212571 214511 216030 215598 213092 210088 208168 207374 206536 204782 202265 199661 197395 195311 192858
51185 192858 189712 186363 183813 182454 181641 180701 179958 180209 181535 183285 185024 186711 187909 187719 185876
51170 185876 183459 182063 182466 184333 186961 189952 193139 196082 197920 197932 196285 194005 192069 190794 190266
$$ packed form
51273B44020L402K982Q05j252j021J433M015N084M756L915L243L454N111P420
51259B87367Q361P018M892L820L577K755J381Q13J225J078m75k226k742k405k653
51244C11786l915n280n890n862n873o262o623o320n460m977n280n410m419l159
51230B37056l181m051l583j175R72R71j57m32J5k66j401k286k733l325l414j619
51214B11391J383K745J029j860l324l214k969k828j641Q43L051L402K184J109
51200B11301J270J940J519m32k506l004j920p94q38j754k517k604k266k084k453
51185A92858l146l349k550j359q13r40p43K51J326J750J739J687J198j90j843
51170A85876k417j396M03J867K628K991L187K943J838J2j647k280j936j275n28
$$ plain form
51155 190266 190851 192714 194978 196141 195585 194308 193923 195244 198017 201689 205869 209963 212858 213647 212811
51140 212811 212213 213349 215688 217296 217019 215411 213499 211642 210072 209648 211012 213443 215576 217066 218640
51125 218640 220518 221806 221710 220500 218861 216895 214354 211518 209308 208534 209242 210721 212002 212409 211767 210201
51109 210201 208028 205833 204248 203290 202225 200530 198667 197438 196804 195936 194306 192106 189697 187371 185635
51094 185635 184970 185114 185194 184767 184216 183982 184051 184366 185037 185770 185748 184593 183050 182180 182103 181957 181041 179731 179221
51075 179221 180360 182641 184566 185265 185497 186568 188594 190587 192046 193411 194806 195429 194699 193190 191855
51060 191855 190939 190153 189352 188578 187973 187938 188654 189054 187321 183133 178592 175972 175286 175083 174856 175264 176376
51043 176376 177287 177597 177978 178929 180050 180994 182136 183761 185306 186038 185997 185749 185652 185892 186930 189282 192885
$$ packed form
51155A90266N85J863K264J163n56j277l85J321K773L672M180M094K895P89q36
51140B12811n98J136K339J608k77j608j912j857j570m24J364K431K133J490J574
51125B18640J878J288r6j210j639j966k541k836k210p74P08J479J281M07o42j566
51109B10201k173k195j585r58j065j695j863j229o34q68j630k200k409k326j736
51094A85635o65J44Q0m27n51k34O9L15O71P33k2j155j543q70p7j46r16j310n10
51075A79221J139K281J925O99K32J071K026J993J459J365J395O23p30j509j335
51060A91855r16p86q01p74o05l5P16M00j733m188m541k620o86k03k27M08J112
51043A76376R11L10L81R51J121R44J142J625J545P32m1k48r7K40J038K352L603
$$ plain form
51026 192885 197004 200795 203782 205905 207359 208458 209506 210637 211618 211976 211563 210993 211079 211779 212186 211912
51010 211912 211885 213252 215909 218747 221044 222899 224502 225798 226871 227954 229025 229911 230687 231397 231619 231113
50994 231113 230682 231331 232598 232939 231975 231078 231200 231478 230913 230227 230695 231847 231908 230428 229144 229985 233111
50977 233111 237186 240811 243351 244916 246001 246985 247875 248606 249327 250077 250463 250332 250582 252511 256195 260119
50961 260119 262644 263428 263217 262844 262731 263009 263740 265190 267904 272122 277033 281206 284123 286793 290367 294563
50945 294563 298196 301068 304526 309781 316276 322323 327287 332573 340030 349624 359277 367201 373971 381816
50931 381816 392110 404137 416242 427556 438438 449845 462634 477055 492601 508705 525813
50920 525813 545239 567611 592042 617431 644070 673232 705559 740782 778858 820333 865479
$$ packed form
51026A92885M119L791K987K123J454J099J048J131R81L58m13n70Q6P00M07k74
51010B11912k7J367K657K838K297J855J603J296J073J083J071Q86P76P10K22n06
50994B31113m31O49J267L41r64q97J22K78n65o86M68J152O1j480j284Q41L126
50977B33111M075L625K540J565J085R84Q90P31P21P50L86j31K50J929L684L924
50961B60119K525P84k11l73j13K78P31J450K714M218M911M173K917K670L574M196
50945B94563L633K872L458N255O495O047M964N286P457R594R653P924O770P845
50931C81816J0294J2027J2105J1314J0882J1407J2789J4421J5546J6104J7108
50920E25813J9426K2372K4431K5389K6639K9162L2327L5223L8076M1475M5146
$$ plain form
50909 865479 913890 965120 1018873 1074552 1131724 1191499 1256258 1327069 1402121 1478657 1555748
50898 1555748 1634017 1713140 1791129 1866093 1937331 2004347 2066109 2121896 2171777 2215306 2250684
50887 2250684 2276436 2293552 2304753 2311677 2313761 2309982 2300620 2287012 2270585 2252847 2235531 2219696
50875 2219696 2204735 2188919 2170921 2150364 2127119 2100808 2071186 2038361 2002300 1962562 1918866
50864 1918866 1871632 1821622 1769225 1714400 1657171 1597852 1536837 1474416 1410907 1347113 1284829
50853 1284829 1226588 1174107 1126771 1082334 1039625 999846 964588 933349 904176 876310 850835
50842 850835 828790 810127 794802 783236 774781 766983 757692 747255 737630 730079 724902 722647 723783
50829 723783 727124 730271 732190 734213 737887 742879 747763 752153 757119 763800 772383 782312 792955 803994
$$ packed form
50909H65479M8411N1230N3753N5679N7172N9775O4759P0811P5052P6536P7091
50898A555748P8269P9123P7989P4964P1238O7016O1762N5787M9881M3529L5378
50887B250684K5752J7116J1201O924K084l779r362j3608j6427j7738j7316j5835
50875B219696j4961j5816j7998k0557k3245k6311k9622l2825l6061l9738m3696
50864A918866m7234n0010n2397n4825n7229n9319o1015o2421o3509o3794o2284
50853A284829n8241n2481m7336m4437m2709l9779l5258l1239k9173k7866k5475
50842H50835k2045j8663j5325j1566q455p798r291j0437r625p551n177k255J136
50829G23783L341L147J919K023L674M992M884M390M966O681Q583R929J0643J1039
$$ plain form
50815 803994 815559 828071 841866 857049 873787 892564 913992 938456 965964 996150 1028440
50804 1028440 1062474 1098431 1136810 1178047 1222622 1271393 1325347 1385042 1450759 1523156 1603159
50793 1603159 1691142 1786938 1890812 2003594 2125394 2254934 2391026 2534294 2686599 2848669
50783 2848669 3018733 3193494 3369998 3546463 3721475 3892480 4055320 4205580 4340463
50774 4340463 4458944 4560197 4642762 4705652 4749467 4775609 4785011 4778637 4758997 4730144 4695936
50763 4695936 4658803 4620091 4580871 4542255 4505440 4471363 4439687 4408144 4373647 4334188 4288993
50752 4288993 4236797 4175134 4102003 4017402 3922438 3817527 3702531 3578476 3448064 3314235
50742 3314235 3178930 3043487 2909606 2779435 2655074 2538365 2430800 2333202 2245632 2167893
$$ packed form
50815H03994J1565J2512J3795J5183J6738J8777K1428K4464K7508L0186L2290
50804A028440L4034L5957L8379M1237M4575M8771N3954N9695O5717P2397Q0003
50793A603159Q7983R5796J03874J12782J21800J29540J36092J43268J52305J62070
50783B848669J70064J74761J76504J76465J75012J71005J62840J50260J34883
50774D340463J18481J01253Q2565O2890M3815K6142R402o374j9640k8853l4208
50763D695936l7133l8712l9220l8616l6815l4077l1676l1543l4497l9459m5195
50752D288993n2196o1663p3131q4601r4964j04911j14996j24055j30412j33829
50742C314235j35305j35443j33881j30171j24361j16709j07565r7598q7570p7739
$$ plain form
50732 2167893 2099886 2041185 1990770 1948036 1913879 1889825 1875748 1869349 1868358 1872321 1881333 1893790
50720 1893790 1906786 1918646 1929696 1940215 1948884 1953931 1954863 1952120 1945662 1935002 1920403 1902982
50708 1902982 1883476 1861655 1837147 1810286 1781749 1751748 1720064 1686908 1653498 1621512 1591860
50697 1591860 1564136 1537622 1512844 1491782 1476336 1466897 1462595 1462570 1466676 1475149 1487918 1504199 1522899
50684 1522899 1543875 1568790 1599928 1637738 1680233 1725281 1772710 1823502 1878007 1936352 1999895
50673 1999895 2070282 2146873 2226937 2309263 2396143 2490505 2591971 2696994 2802300 2906666
50663 2906666 3009273 3107838 3199254 3281444 3353728 3415526 3465330 3501203 3521972 3527738 3519410
50652 3519410 3498214 3465860 3424837 3377989 3327617 3275293 3222788 3172827 3128252 3090094 3056805
$$ packed form
50732B167893o8007n8701n0415m2734l4157k4054j4077o399r91L963R012J2457
50720A893790J2996J1860J1050J0519Q669N047R32k743o458j0660j4599j7421
50708A902982j9506k1821k4508k6861k8537l0001l1684l3156l3410l1986k9652
50697A591860k7724k6514k4778k1062j5446r439m302k5M106Q473J2769J6281J8700
50684A522899K0976K4915L1138L7810M2495M5048M7429N0792N4505N8345O3543
50673A999895P0387P6591Q0064Q2326Q6880R4362J01466J05023J05306J04366
50663B906666J02607R8565R1416Q2190P2284O1798M9804L5873K0769N766q328
50652C519410k1196l2354m1023m6848n0372n2324n2505m9961m4575l8158l3289
$$ plain form
50641 3056805 3025864 2996132 2968106 2941812 2915224 2885455 2850985 2811748 2767377 2716867 2660314
50630 2660314 2599549 2536066 2469420 2398935 2326288 2255053 2187997 2126222 2070565 2022077 1980835
50619 1980835 1945887 1917184 1896417 1885246 1883738 1891351 1908467 1935867 1973284 2019547 2073766 2135388
50607 2135388 2203325 2275943 2351839 2429863 2508347 2584996 2657649 2724837 2785790 2840359 2888683
50596 2888683 2930415 2964469 2990155 3008361 3020932 3028968 3032412 3031274 3026440 3019035 3009643 2998480
50584 2998480 2985955 2972907 2960541 2950061 2941803 2934750 2927677 2920938 2916439 2915528 2917524 2920720 2924093
50571 2924093 2927491 2930801 2933803 2936522 2938894 2940152 2939282 2936152 2931672 2926781 2921714 2916220 2910083 2903492
50557 2903492 2897415 2893513 2893117 2896294 2902408 2911337 2923294 2937499 2952181 2966070 2978727 2988939 2994218
$$ packed form
50641C056805l0941k9732k8026k6294k6588k9769l4470l9237m4371n0510n6553
50630B660314o0765o3483o6646p0485p2647p1235o7056o1775n5657m8488m1242
50619A980835l4948k8703k0767j1171j508P613J7116K7400L7417M6263N4219O1622
50607B135388O7937P2618P5896P8024P8484P6649P2653O7188O0953N4569M8324
50596B888683M1732L4054K5686J8206J2571Q036L444j138m834p405r392j1163
50584B998480j2525j3048j2366j0480q258p053p073o739m499r11J996L196L373
50571B924093L398L310L002K719K372J258q70l130m480m891n067n494o137o591
50557B903492o077l902l96L177O114Q929J1957J4205J4682J3889J2657J0212N279
$$ plain form
50544 2994218 2993032 2986583 2976950 2964082 2945958 2921220 2889976 2852137 2806721 2753310 2692804 2626234
50532 2626234 2554079 2477401 2398411 2318978 2239523 2160237 2082553 2008488 1939194 1874855 1815105
50521 1815105 1758670 1703724 1650050 1600181 1556945 1520285 1487909 1458660 1433639 1414146 1400186
50510 1400186 1391294 1387221 1387299 1390437 1396381 1405946 1419515 1436368 1456113 1479720 1508403 1542292 1580819
50497 1580819 1623573 1670095 1719712 1772497 1829766 1892792 1961478 2034904 2112589 2194361 2279452
50486 2279452 2366571 2454544 2542163 2627724 2709524 2786695 2859070 2926564 2989331 3048181 3104143
50475 3104143 3157821 3209748 3261073 3313094 3366179 3419707 3472930 3525307 3576285 3625615 3673987
50464 3673987 3722706 3772576 3823365 3874195 3923933 3971289 4015162 4055092 4091077 4123005 4150402
$$ packed form
50544B994218j186o449r633j2868j8124k4738l1244l7839m5416n3411o0506o6570
50532B626234p2155p6678p8990p9433p9455p9286p7684p4065o9294o4339n9750
50521A815105n6435n4946n3674m9869m3236l6660l2376k9249k5021j9493j3960
50510A400186q892m073P8L138N944R565J3569J6853J9745K3607K8683L3889L8527
50497A580819M2754M6522M9617N2785N7269O3026O8686P3426P7685Q1772Q5091
50486B279452Q7119Q7973Q7619Q5561Q1800P7171P2375O7494O2767N8850N5962
50475C104143N3678N1927N1325N2021N3085N3528N3223N2377N0978M9330M8372
50464C673987M8719M9870N0789N0830M9738M7356M3873L9930L5985L1928K7397
$$ plain form
50453 4150402 4172394 4187489 4193731 4189800 4175905 4153152 4122229 4083260 4036645 3983217 3923620 3858307
50441 3858307 3788341 3715637 3642309 3570342 3501869 3439004 3383051 3334426 3293585 3261521 3239061
50430 3239061 3226027 3221252 3222910 3228624 3235808 3242476 3247469 3249387 3245397 3231669 3205353 3166125 3115549
50417 3115549 3054825 2983520 2900914 2808418 2709831 2608933 2507517 2406223 2306312 2209471 2116351
50406 2116351 2026665 1940905 1860859 1788111 1722839 1664436 1612486 1566742 1526780 1492082 1461960
50395 1461960 1435197 1410620 1388572 1371203 1360600 1356887 1358510 1363850 1372040 1382759 1396053 1412267
50383 1412267 1431604 1453783 1478483 1505805 1535897 1568393 1602713 1638726 1676625 1716308 1757488
50372 1757488 1800265 1844921 1890949 1936773 1980770 2022496 2062862 2103234 2144284 2185475 2225613
$$ packed form
50453D150402K1992J5095O242l931j3895k2753l0923l8969m6615n3428n9597o5313
50441C858307o9966p2704p3328p1967o8473o2865n5953m8625m0841l2064k2460
50430C239061j3034m775J658N714P184O668M993J918l990j3728k6316l9228n0576
50417C115549o0724p1305q2606r2496r8587j00898j01416j01294r9911r6841r3120
50406B116351q9686q5760q0046p2748o5272n8403n1950m5744l9962l4698l0122
50395A461960k6763k4577k2048j7369j0603l713J623N340Q190J0719J3294J6214
50383A412267J9337K2179K4700K7322L0092L2496L4320L6013L7899L9683M1180
50372A757488M2777M4656M6028M5824M3997M1726M0366M0372M1050M1191M0138
$$ plain form
50361 2225613 2263962 2300718 2336303 2370484 2402549 2432185 2459881 2486538 2513053 2540224 2568612
50350 2568612 2598265 2628629 2658853 2688250 2716715 2744792 2772964 2800554 2825555 2845916 2860831
50339 2860831 2870352 2874140 2871365 2861803 2846161 2824960 2797721 2763716 2723020 2676176 2623196 2563654
50327 2563654 2497920 2427750 2355445 2282690 2210441 2139669 2071826 2008470 1950553 1898306 1851788
50316 1851788 1811341 1777299 1749467 1727359 1710923 1700533 1695929 1695537 1697251 1699620 1701879 1703081 1701855
50303 1701855 1697035 1687889 1673689 1653774 1628415 1599068 1567203 1533234 1497081 1459463 1421975 1385928
50291 1385928 1351636 1318895 1287633 1258000 1230215 1204479 1180738 1158471 1137076 1116596 1097729
50280 1097729 1081082 1066851 1055311 1046988 1041796 1038449 1035435 1032581 1031189 1032508 1036514 1042386 1049851
$$ packed form
50361B225613L8349L6756L5585L4181L2065K9636K7696K6657K6515K7171K8388
50350B568612K9653L0364L0224K9397K8465K8077K8172K7590K5001K0361J4915
50339B860831R521L788k775r562j5642k1201k7239l4005m0696m6844n2980n9542
50327B563654o5734p0170p2305p2755p2249p0772o7843o3356n7917n2247m6518
50316A851788m0447l4042k7832k2108j6436j0390m604l92J714K369K259J202j226
50303A701855m820r146j4200j9915k5359k9347l1865l3969l6153l7618l7488l6047
50291A385928l4292l2741l1262k9633k7785k5736k3741k2267k1395k0480j8867
50280A097729j6647j4231j1540q323n192l347l014k854j392J319M006N872P465
$$ plain form
50267 1049851 1059617 1072403 1087844 1104624 1121700 1139110 1157518 1177291 1198351 1220616 1244021
50256 1244021 1268225 1292942 1318662 1346335 1376027 1406472 1436426 1465921 1495568 1524986 1552838
50245 1552838 1578379 1602220 1625235 1647156 1666571 1682169 1693876 1702853 1710427 1716807 1720859 1721215
50233 1721215 1717585 1710810 1701757 1690532 1676890 1661071 1643834 1625623 1606010 1584317 1560768 1536572
50221 1536572 1512606 1488458 1463324 1437561 1412406 1388168 1363739 1338355 1312875 1288533 1265126
50210 1265126 1241453 1217086 1192675 1168711 1145188 1122557 1101943 1084044 1068666 1055695 1045667
50199 1045667 1038740 1033798 1029412 1025446 1022933 1022384 1022877 1023042 1022526 1022121 1022589 1023664 1024287 1023549 1021307 1018149
50183 1018149 1015103 1013164 1012613 1012798 1012971 1013146 1013407 1012491 1008310 1000444 991087 982725 975790 969546 964165
$$ packed form
50267A049851R766J2786J5441J6780J7076J7410J8408J9773K1060K2265K3405
50256A244021K4204K4717K5720K7673K9692L0445K9954K9495K9647K9418K7852
50245A552838K5541K3841K3015K1921J9415J5598J1707Q977P574O380M052L56
50233A721215l630o775r053j1225j3642j5819j7237j8211j9613k1693k3549k4196
50221A536572k3966k4148k5134k5763k5155k4238k4429k5384k5480k4342k3407
50210A265126k3673k4367k4411k3964k3523k2631k0614j7899j5378j2971j0028
50199A045667o927m942m386l966k513n49M93J65n16m05M68J075O23p38k242l158
50183A018149l046j939n51J85J73J75K61r16m181p866r357q362o935o244n381
$$ plain form
50168 964165 960285 957157 953173 948298 944229 941797 939884 937497 935286 934006 932880 930832 928446 927271
50154 927271 927676 928628 929423 930511 932602 935864 940128 945189 950655 955887 960273 963407 965159 965742 965515
50139 965515 964502 962359 958987 954805 950173 945019 939332 933507 927777 921800 915322 908737 902451 896216
50125 896216 889803 883859 879158 875260 870800 865058 858494 851761 845041 838422 832071 825722 818710 811037
50111 811037 804021 799371 797620 797716 798094 798013 797836 798039 798237 797465 795262 791941 787657 781901 774271 765146
50095 765146 755172 744732 734425 725270 717580 710296 702561 695356 690234 686809 683235 679255 676919 677480
50081 677480 679172 679338 677730 676259 676117 676630 676884 677151 678339 680947 684955 690021 695317 699660 702434
50066 702434 704260 706416 709694 714111 719577 726269 734220 743010 752321 762507 773922 785630 795650
$$ packed form
50168I64165l880l128l984m875m069k432j913k387k211j280j126k048k386j175
50154I27271M05R52P95J088K091L262M264N061N466N232M386L134J752N83k27
50139I65515j013k143l372m182m632n154n687n825n730n977o478o585o286o235
50125H96216o413n944m701l898m460n742o564o733o720o619o351o349p012p673
50111H11037p016m650j751R6L78q1j77K03J98p72k203l321m284n756p630r125
50095G65146r974j0440j0307r155p690p284p735p205n122l425l574l980k336N61
50081F77480J692J66j608j471j42N13K54K67J188K608M008N066N296M343K774
50066G02434J826K156L278M417N466O692P951Q790R311J0186J1415J1708J0020
$$ plain form
50053 795650 803000 808980 815646 823265 830177 835207 839256 844013 849796 855383 859683 862873 865840 869109
50039 869109 872599 876158 879895 883898 887914 891707 895724 900850 907226 913824 919861 926327 935216 947148
50025 947148 960558 973447 985161 996089 1006586 1017063 1028524 1041884 1056825 1072262 1087966
50014 1087966 1104944 1123869 1143846 1163320 1181916 1200930 1221952 1245125 1268769 1290766 1310448
50003 1310448 1329020 1347973 1367421 1386455 1404910 1423828 1443858 1464008 1482708 1499615 1515568
49992 1515568 1530924 1544895 1556759 1567089 1577390 1588873 1601866 1615928 1630026 1642843 1653485
49981 1653485 1662124 1669906 1678324 1688728 1702062 1718658 1738369 1761085 1786964 1815892 1847152 1880322
49969 1880322 1916329 1956806 2002193 2051224 2102539 2155914 2211018 2265466 2315321 2357831 2393016
$$ packed form
50053G95650P350N980O666P619O912N030M049M757N783N587M300L190K967L269
50039H69109L490L559L737M003M016L793M017N126O376O598O037O466Q889J1932
50025I47148J3410J2889J1714J0928J0497J0477J1461J3360J4941J5437J5704
50014A087966J6978J8925J9977J9474J8596J9014K1022K3173K3644K1997J9682
50003A310448J8572J8953J9448J9034J8455J8918K0030K0150J8700J6907J5953
49992A515568J5356J3971J1864J0330J0301J1483J2993J4062J4098J2817J0642
49981A653485Q639P782Q418J0404J3334J6596J9711K2716K5879K8928L1260L3170
49969A880322L6007M0477M5387M9031N1315N3375N5104N4448M9855M2510L5185
$$ plain form
49958 2393016 2422320 2446407 2464991 2478443 2488620 2497644 2506257 2513838 2519766 2523967 2525793 2522992 2512586
49945 2512586 2492662 2462689 2422274 2370756 2308605 2238416 2163601 2086407 2007939 1929665 1853706
49934 1853706 1781391 1712402 1645908 1582045 1521842 1466131 1415030 1368199 1325057 1284812 1246786
49923 1246786 1210894 1177576 1147131 1119223 1093084 1068109 1044224 1021823 1001435 983433 967951
49912 967951 954926 944144 935156 927232 919520 911529 903646 897050 892643 889876 886969 882684 877658 873482
49898 873482 870568 867672 863729 859494 856690 855899 856048 856008 855967 856866 859032 861868 864672 867183 869399 871452
49882 871452 873855 877413 882549 888969 896261 904571 914337 925573 937883 951134 965702 982074 1000663
49869 1000663 1021947 1046231 1073086 1101615 1131615 1164080 1200187 1240128 1283347 1329544 1379023
$$ packed form
49958B393016K9304K4087J8584J3452J0177R024Q613P581N928M201J826k801j0406
49945B512586j9924k9973m0415n1518o2151p0189p4815p7194p8468p8274p5959
49934A853706p2315o8989o6494o3863o0203n5711n1101m6831m3142m0245l8026
49923A246786l5892l3318l0445k7908k6139k4975k3885k2401k0388j8002j5482
49912I67951j3025j0782q988p924p712p991p883o596m407k767k907m285n026m176
49898H73482k914k896l943m235k804p91J49m0m1Q99K166K836K804K511K216K053
49882H71452K403L558N136O420P292Q310R766J1236J2310J3251J4568J6372J8589
49869A000663K1284K4284K6855K8529L0000L2465L6107L9941M3219M6197M9479
$$ plain form
49858 1379023 1432314 1490014 1552896 1621715 1696870 1778503 1866690 1961124 2060774 2164331 2270683
49847 2270683 2378272 2484098 2584425 2676989 2762008 2840666 2913165 2978819 3037500 3090122 3137741
49836 3137741 3180891 3219914 3255135 3286062 3310616 3325711 3328657 3317828 3292253 3251372 3195699
49825 3195699 3127338 3049195 2963626 2872115 2776063 2677171 2576851 2475872 2374944 2275127 2177221
49814 2177221 2081260 1987296 1896430 1810363 1730001 1655112 1585258 1520309 1459946 1403341 1349775
49803 1349775 1299170 1251876 1208348 1169164 1134705 1104425 1076911 1051080 1027011 1005242 985731
49792 985731 968017 951907 937179 922870 907781 891893 876547 862945 851013 839992 829516
$$ packed form
49858A379023N3291N7700O2882O8819P5155Q1633Q8187R4434R9650J03557J06352
49847B270683J07589J05826J00327R2564Q5019P8658P2499O5654N8681N2622M7619
49836C137741M3150L9023L5221L0927K4554J5095K946j0829k5575m0881n5673
49825C195699o8361p8143q5569r1511r6052r8892j00320j00979j00928r9817r7906
49814B177221r5961r3964r0866q6067q0362p4889o9854o4949o0363n6605n3566
49803A349775n0605m7294m3528l9184l4459l0280k7514k5831k4069k1769j9511
49792I85731j7714j6110j4728j4309j5089j5888j5346j3602j1932j1021j0476
$$ [...]
##END NTUPLES=NMR SPECTRUM
##END=
