
##TITLE=AC1041_TOFR02_5906800_kBFjP5VRSq
##JCAMPDX= 6.0         $$ Bruker NMR JCAMP-DX V2.0
##DATA TYPE= NMR SPECTRUM
##DATA CLASS= NTUPLES
##ORIGIN= BRUKER
##OWNER= Administrator
$$ 1.72 TOPSPIN		Version 2.1
$$ 2012-04-10 10:29:21.265 -0500  Administrator@TOPSPIN
$$ Compression mode = diff/dup
##.OBSERVE FREQUENCY= 400.13188235
##.OBSERVE NUCLEUS= ^1H
##.ACQUISITION MODE= SIMULTANEOUS (DQD)
##.ACQUISITION SCHEME= undefined
##.AVERAGES= 8
##.DIGITISER RES= 22
##SPECTROMETER/DATA SYSTEM= spect
##.PULSE SEQUENCE= zg30
##.SOLVENT NAME= COFFEE_meoh
##.SHIFT REFERENCE= INTERNAL, COFFEE_meoh, 1, 14.98061
##AUDIT TRAIL= $$ (NUMBER, WHEN, WHO, WHERE, PROCESS, VERSION, WHAT)
$$ ##TITLE= Audit trail, TOPSPIN		Version 2.1
$$ ##JCAMPDX= 5.01
$$ ##ORIGIN= Bruker BioSpin GmbH
$$ ##OWNER= Administrator
$$ $$ C:\Bruker\TOPSPIN/data/COFFEE/nmr/AC1041_TOFR02_5906800_kBFjP5VRSq/10/pdata/1/auditp.txt
$$ ##AUDIT TRAIL=  $$ (NUMBER, WHEN, WHO, WHERE, PROCESS, VERSION, WHAT)
(   1,<2012-04-04 18:22:45.875 -0500>,<Administrator>,<TOPSPIN>,<go>,<TOPSPIN 2.1>,
      <created by zg
	started at 2012-04-04 18:21:37.609 -0500,
	POWCHK enabled, PULCHK disabled,
       configuration hash MD5:
       1A 1E CE 29 27 FD 77 03 67 4E F0 E3 C4 B2 CB 90
       data hash MD5: 64K
       11 A0 EA E2 2A E2 A2 BE 28 21 AE 56 53 B6 DB C2>)
(   2,<2012-04-04 18:22:53.109 -0500>,<Administrator>,<TOPSPIN>,<proc1d>,<TOPSPIN 2.1>,
      <Start of raw data processing
       efp LB = 0 FT_mod = 6 PKNL = 1 PHC0 = 0 PHC1 = 0 SI = 32K 
       data hash MD5: 32K
       38 E5 40 61 A6 22 3E 42 35 C5 8A 5F 1D 81 30 3C>)
(   3,<2012-04-04 18:22:54.000 -0500>,<Administrator>,<TOPSPIN>,<proc1d>,<TOPSPIN 2.1>,
      <pk PHC0 = 210.943 PHC1 = 0 
       data hash MD5: 32K
       AF B8 34 91 C4 48 4E 10 43 DA 71 7E 4A 33 41 9B>)
(   4,<2012-04-04 18:22:54.375 -0500>,<Administrator>,<TOPSPIN>,<proc1d>,<TOPSPIN 2.1>,
      <abs ABSG = 1 
       data hash MD5: 32K
       A0 C1 59 4B E4 F9 3F 28 97 69 F6 E5 63 F8 C3 D8>)
(   5,<2012-04-04 18:22:54.640 -0500>,<Administrator>,<TOPSPIN>,<proc1d>,<TOPSPIN 2.1>,
      <abs ABSG = 2 
       data hash MD5: 32K
       57 D7 FC 3E 39 FA 64 D9 E9 6A 3D 99 AE 9E A9 9A>)
(   6,<2012-04-04 18:22:54.859 -0500>,<Administrator>,<TOPSPIN>,<proc1d>,<TOPSPIN 2.1>,
      <abs ABSG = 3 
       data hash MD5: 32K
       4E AB CC 0C CC 82 D0 3E DD EC 0B 4B 53 1E 67 FE>)
(   7,<2012-04-04 18:22:55.109 -0500>,<Administrator>,<TOPSPIN>,<proc1d>,<TOPSPIN 2.1>,
      <abs ABSG = 4 
       data hash MD5: 32K
       E0 A1 18 49 C7 E4 F3 34 93 BC 41 18 92 E3 71 AE>)
(   8,<2012-04-04 18:22:55.328 -0500>,<Administrator>,<TOPSPIN>,<proc1d>,<TOPSPIN 2.1>,
      <abs ABSG = 5 
       data hash MD5: 32K
       13 FF 0E 06 BF 5A B8 C1 1E FA 18 DF 74 51 29 32>)
(   9,<2012-04-04 18:23:00.937 -0500>,<Administrator>,<TOPSPIN>,<audit>,<TOPSPIN 2.1>,
      <user comment:
       ICON-NMR User ID: COFFEE
       data hash MD5: 32K
       13 FF 0E 06 BF 5A B8 C1 1E FA 18 DF 74 51 29 32>)
$$ ##END=
$$ 
$$ [...]
##$TP= (0..7)
150 150 150 150 150 150 150 150
##$TP07= 0
##$TPNAME0= <>
##$TPNAME1= <>
##$TPNAME2= <>
##$TPNAME3= <>
##$TPNAME4= <>
##$TPNAME5= <>
##$TPNAME6= <>
##$TPNAME7= <>
##$TPOAL= (0..7)
0.5 0.5 0.5 0.5 0.5 0.5 0.5 0.5
##$TPOFFS= (0..7)
0 0 0 0 0 0 0 0
##$TUNHIN= 0
##$TUNHOUT= 0
##$TUNXOUT= 0
##$USERA1= <user>
##$USERA2= <user>
##$USERA3= <user>
##$USERA4= <user>
##$USERA5= <user>
##$V9= 5
##$VALIST= <valist>
##$VCLIST= <CCCCCCCCCCCCCCC>
##$VD= 0
##$VDLIST= <DDDDDDDDDDDDDDD>
##$VPLIST= <PPPPPPPPPPPPPPP>
##$VTLIST= <TTTTTTTTTTTTTTT>
##$WBST= 2048
##$WBSW= 25
##$XGAIN= (0..3)
0 0 0 0
##$XL= 0
##$YL= 0
##$YMAX_a= 543544
##$YMIN_a= -674438
##$ZGOPTNS= <>
##$ZL1= 120
##$ZL2= 120
##$ZL3= 120
##$ZL4= 120
##$ABSF1= 14.98061
##$ABSF2= -5.57192
##$ABSG= 5
##$ABSL= 3
##$ALPHA= 0
##$AQORDER= 0
##$ASSFAC= 0
##$ASSFACI= 0
##$ASSFACX= 0
##$ASSWID= 0
##$AUNMP= <proc_prof1d_extract_pilot.lims>
##$AXLEFT= 0
##$AXNAME= <>
##$AXNUC= <1H>
##$AXRIGHT= 0
##$AXTYPE= 0
##$AXUNIT= <>
##$AZFE= 0.1
##$AZFW= 0.1
##$BCFW= 0
##$BC_mod= 0
##$BYTORDP= 0
##$COROFFS= 0
##$CY= 15
##$DATMOD= 1
##$DC= 0
##$DFILT= <>
##$DTYPP= 0
##$F1P= 0
##$F2P= 0
##$FCOR= 0.5
##$FTSIZE= 32768
##$FT_mod= 6
##$GAMMA= 0
##$GB= 0
##$INTBC= 1
##$INTSCL= 1
##$ISEN= 128
##$LB= 0
##$LEV0= 0
##$LPBIN= 0
##$MAXI= 10000
##$MC2= 0
##$MEAN= 0
##$ME_mod= 0
##$MI= 0
##$NCOEF= 0
##$NC_proc= -8
##$NLEV= 6
##$NOISF1= 0
##$NOISF2= 0
##$NSP= 0
##$NTH_PI= 0
##$NZP= 0
##$OFFSET= 14.98061
##$PC= 1
##$PHC0= 210.943
##$PHC1= 0
##$PH_mod= 1
##$PKNL= yes
##$PPARMOD= 0
##$PPDIAG= 0
##$PPIPTYP= 0
##$PPMPNUM= 2147483647
##$PPRESOL= 1
##$PSCAL= 4
##$PSIGN= 0
##$PYNMP= <proc.py>
##$REVERSE= no
##$SF= 400.13
##$SI= 32768
##$SIGF1= 0
##$SIGF2= 0
##$SINO= 400
##$SIOLD= 32768
##$SPECTYP= <>
##$SREGLST= <1H.CDCl3>
##$SSB= 0
##$STSI= 32768
##$STSR= 0
##$SW_p= 8223.68421052632
##$SYMM= 0
##$S_DEV= 0
##$TDeff= 65536
##$TDoff= 0
##$TI= <>
##$TILT= no
##$TM1= 0
##$TM2= 0
##$TOPLEV= 0
##$USERP1= <user>
##$USERP2= <user>
##$USERP3= <user>
##$USERP4= <user>
##$USERP5= <user>
##$WDW= 1
##$XDIM= 32768
##$YMAX_p= 471129867
##$YMIN_p= -752421
##$CURPLOT= <Network HP LaserJet P1505>
##$CURPRIN= <$Network HP LaserJet P1505>
##$DFORMAT= <normdp>
##$LAYOUT= <+/1D_H.xwp>
##$LFORMAT= <normlp>
##$PFORMAT= <normpl>
##$SURQMSG= 1
$$ End of Bruker specific parameters
$$ ---------------------------------
##NTUPLES= NMR SPECTRUM
##VAR_NAME=  FREQUENCY,     SPECTRUM/REAL,   SPECTRUM/IMAG
##SYMBOL=    X,             R,               I
##VAR_TYPE=  INDEPENDENT,   DEPENDENT,       DEPENDENT
##VAR_FORM=  AFFN,          ASDF,            ASDF
##VAR_DIM=   32768,         32768,           32768
##UNITS=     HZ,            ARBITRARY UNITS, ARBITRARY UNITS
##FACTOR=    0.250966925370066, 1,           1
##FIRST=     8223.43324360095, -6469,        -303349
##LAST=      0,             -92508,          -28802
##MIN=       0,             -752421,         0
##MAX=       8223.43324360095, 471129867,    0
$$ Real data points
##PAGE= N=1
##DATA TABLE= (X++(R..R)), XYDATA
$$ [...]
19476a37126m8734A47144k6978H30J31353g3348A0744a11594q7523D3392b7225
19464a81654M1294A85028g1071A01538c98188Q7319a03833j04585A40252e28041
19453a42912j11085B3991h2224p3593k42526l6091f0155D0435a03829n8530j49630
19442c11989E4970b33765C4758J02600E3413d52393a69591e8421k53893h5835
19431a67811K0944D3975M0335h8312B46782a34931m2932k12887D7990O5586a01054
19419H2937O9940a61653K4793N2424B52581A8155a05604l8704m4221A93996c8368
19407d11675J73150h3210o8189L0007J4597A62346c1204j09695e1542O620m9368
19396i4290k04359D0780R6140m9361g9130j68025b0837n9384j66958L7787n8518
$$ plain form
19476 -137126 -185860 147144 120166 830 132183 -73348 10744 -111594 -199117 43392 -27225
19464 -181654 -140360 185028 -71071 101538 -398188 -310869 -103833 -208418 140252 -528041
19453 -142912 -253997 23991 -82224 -155817 -398343 -434434 -60155 40435 -103829 -162359 -311989
19442 -311989 54970 -233765 34758 137358 53413 -452393 -169591 -58421 -312314 -85835
19431 -167811 -146867 43975 84310 -88312 246782 -134931 -177863 -390750 47990 113576 -101054
19419 82937 152877 -161653 -136860 -84436 252581 18155 -105604 -144308 -188529 193996 -38368
19407 -411675 -238525 -83210 -151399 -121392 -106795 162346 -31204 -140899 -51542 -44922 -94290
19396 -94290 -298649 40780 136920 87559 -79130 -247155 -20837 -80221 -247179 -209392 -267910
19385b67910i7742r9415B53512a93322Q8116A3362a56470C82613b19783H0442
19374A63789F6121a19367p78B4175d09904I9776B1572a59802r199d2039j9295
19363f1334B41350a32359k98671a24768A13827o465Q7444C190J39352n2064N1698
19352A42176i2453J1799k02485A00228a32973A48986c33252C0441K6667j9504
19342C7604d80484e9791k9176D3974f3316E5170b75416R4411L4662L5138K7857
19331h3348D5890c49130C61582b74405a2223B46104g5166R406L010j47131J505
19320b08376L3518h3946r7240M6118l65139a19850O226r3837d9124a4976p5750
19309i0726K3262H0774L7010D1715c7265o7281A14434d3912n2542b7240G4008
$$ plain form
19385 -267910 -97742 -197157 253512 -193322 -105206 13362 -156470 382613 -219783 80442
19374 163789 66121 -119367 -120145 24175 -409904 99776 21572 -159802 -169001 -42039 -61334
19363 -61334 241350 -132359 -431030 -124768 113827 107362 194806 3190 142542 90478 142176
19352 142176 -92453 -80654 -283139 100228 -132973 148986 -333252 30441 57108 37604
19342 37604 -480484 -59791 -88967 43974 -63316 55170 -275416 -181005 -146343 -111205 -83348
19331 -83348 45890 -349130 361582 -274405 -12223 246104 -75166 -65760 -62750 -209881 -208376
19320 -208376 -174858 -83946 -181186 -135068 -500207 -119850 -113624 -207461 -49124 -14976 -90726
19309 -90726 -67464 80774 117784 41715 -37265 -104546 114434 -43912 -96454 -27240 74008
19297B36485b43081F7465a2830G4840a95589A32322l9993k5254b09472L7044P6566
19286i5862A38948a57876p1400B16876a74984O4963F1871O511b27405a06331I7155
19274b6467P802F1365b35829a2466B7908b60081g8014p4353M4752l6319O0766
19263h3168r1681c9517a0389l28599a67627N7464j01026o2148B71090a07353r0715
19252a98068l611l3856G753c9815o5559c5693k671l90755A55021D5510a99938
19240B823K66418g5237B81824b77525i3919i384k44460o7784b5696I0957b34603
19228a53425k15558J62320C8779b5864A19229i4340A65811a43153K5851k3060
19218a40362B35657G6801k7339a5157P67m5779I3131c80957J63596F4102d8085
$$ plain form
19297 236485 -243081 67465 -12830 74840 -195589 132322 92329 67075 -209472 -172428 -95862
19286 -95862 138948 -157876 -229276 216876 -174984 -110021 61871 68382 -227405 -106331 97155
19274 -26467 -18665 61365 -235829 -12466 27908 -260081 -78014 -152367 -107615 -143934 -83168
19263 -83168 -174849 -39517 -10389 -338988 -167627 -110163 -211189 -273337 271090 -107353 -198068
19252 -198068 -201679 -235535 7753 -39815 -105374 -35693 -38364 -429119 155021 45510 -199938
19240 2823 269241 -75237 281824 -277525 -93919 -9384 -253844 -321628 -25696 90957 -234603
19228 -153425 -368983 -206663 38779 -25864 119229 -94340 165811 -143153 -117302 -140362
19218 -140362 235657 76801 49462 -15157 -14390 -60169 93131 -380957 -217361 64102 -48085
19206A00674c98965a69039K151A57655b32752l1050I3977i3087E6763O9928c78267
19194A95180B2110c73399C6091L84922j88730j09553a60589A12701a20035n401
19184a25436M4282E2026J70467I5702d4264l59028J96904l8325J11578D8895k0311
19173B8584c33213A71541p3589i7280m3809j42867A61977a01234j35057F1060
19162g0151A49618h2381b8812B64865b65570e9352C279b38574G3603b74619E303
19150f7493k0031G2929b88518f5091k08886o6163a56495q8479J4390l2252g8300
19138A34456B2175P4949c49630A07890a5116C0657K9931g0037B61891j22634a8900
19126A68233D4423R9950d7278o435H9270c8080A55723p1422b0327k74670p8347
$$ plain form
19206 100674 -398965 -169039 -166888 157655 -232752 -263802 93977 -93087 56763 126691 -378267
19194 195180 22110 -373399 36091 421013 232283 122730 -160589 112701 -120035 -125436
19184 -125436 -81154 52026 222493 95702 -44264 -403292 -206388 -244713 -133135 48895 28584
19173 28584 -333213 171541 97952 -97280 -141089 -283956 161977 -101234 -236291 61060
19162 -70151 149618 -82381 -28812 264865 -265570 -59352 3279 -238574 73603 -274619 5303
19150 -67493 -87524 72929 -288518 -65091 -273977 -340140 -156495 -244974 -230584 -262836 -78300
19138 134456 22175 97124 -349630 107890 -15116 30657 60588 -70037 261891 139257 -18900
19126 168233 44423 144373 -47278 -53713 89270 -38080 155723 84301 -20327 -294997 -373344
19115c73344A08964l1793g1116j62261A99866F2265A3204b20392Q2007A37280
19104a64369A31800c55995B29515I7880h2322k48549O9721M52J23789r2768a12703
19092c67179C4644c13567Q4676b9944J4187j06378F9571a51741N4929B06201F8198
19080I5642b24696F433a72337q6904C9314e33034f612E4896c6343l39079i865
19068I6899a45397j54721a19301M633K6416j89224a21282f853o7713A46661a66940
19056H1259c96D0056J87228I4483B6112L1937P106h2997K6536r5258A15637g8743
19043E6744K19574A04096m9292c677H4558d5838l7714A2211a86221a6743j64367
19032a81110d5817k1907B85612b23473E512c65527a66603D253g7180o5061q2554
$$ plain form
19115 -373344 108964 77171 -71116 -233377 199866 62265 13204 -220392 -138385 137280
19104 -164369 131800 -355995 229515 97880 -82322 -330871 -261150 -260698 -136909 -229677 -112703
19092 -367179 34644 -313567 -228891 -29944 -15757 -122135 69571 -151741 -96812 206201 68198
19080 95642 -224696 6433 -172337 -259241 39314 -533034 -6612 54896 -36343 -375422 -9865
19068 96899 -145397 -300118 -119301 -114668 -88252 -277476 -121282 -6853 -74566 146661 -166940
19056 81259 -396 40056 227284 94483 26112 58049 65155 -82997 -56461 -151719 115637 -78743
19043 56744 276318 104096 54804 -3677 84558 -45838 -83552 12211 -186221 -16743 -181110
19032 -181110 -45817 -67724 285612 -223473 5512 -365527 -166603 4253 -77180 -142241 -224795
19021b24795q4311I5966B649L9550h3248J5094C9168d7187e985k43244C01270
19009G6827k1721a24300A89097r2961C1608M2258e3015i741j7838B8987a02495
18997H4662l46L89309B33227a31154A64549f6976j45053D8525c93869B30444j12188
18986A18256K50306a02830C66N1730n241c60825a6097C04187b32598F7193d9277
18974B94769C0824e2992l9597K0009c32A4197b43389A04022A577b44030C1751
18962b41794B25278a17708G7860L7022P5896L5526P4030J29939p6538f5853A7690
18950a78059A98840a10376B3214f8497q4266C7972c23826a16189j92999a12663
18939d3343F5702a06571b780m14975O0304e550B30951k521G3097a33064A4276
$$ plain form
19021 -224795 -309106 95966 2649 42199 -83248 -68154 39168 -47187 -5985 -249229 301270
19009 76827 55106 -124300 189097 96136 31608 73866 -53015 -9741 -27579 28987 -102495
18997 84662 84316 473625 233227 -131154 164549 -66976 -212029 48525 -393869 230444 118256
18986 118256 368562 -102830 366 52096 46855 -360825 -16097 304187 -232598 67193 -49277
18974 294769 30824 -52992 -92589 -72580 -332 14197 -243389 104022 1577 -244030 31751
18962 -241794 225278 -117708 77860 114882 190778 226304 300334 430273 353735 -65853 17690
18950 -178059 198840 -110376 23214 -68497 -152763 37972 -323826 -116189 -309188 -112663
18939 -43343 65702 -106571 -2780 -417755 -357451 -5550 230951 228430 73097 -133064 14276
18927c079k14425A42447f3812m1141M5550H7455a66526A47211b28815b3454b120
18915F1810N714f8328j2367A00427b8947a265A51939o9962J6599b02967I9876
18903B38035r9970h8149I5359d4670H5681B6274L0052P4797q307J54490R7871
18892C75177K33917M950G3314K43176f8289A20526h6000C5362O1817a3634q6213
18881i9847A10708i4510M690j81482B46962e1078j95174B25350a3596n4069k17250
18870b84915C9881g3268r5947n4921P7244j17604h4172B50794c2346j25193A42754
18858b71611R517E5021e1197o2782G9145a23303r8161P1002c5801K826a336B39779
18845a19640k4023H214a86961A73095b57927B05243E7336a91106g8714j69997
$$ plain form
18927 -3079 -217504 142447 -63812 -104953 -59403 87455 -166526 147211 -228815 -23454 -2120
18915 61810 67524 -68328 -80695 100427 -28947 -1265 151939 81977 98576 -202967 99876
18903 238035 138065 -88149 95359 -44670 85681 26274 56326 131123 122816 277306 375177
18892 375177 609094 614044 73314 316490 -68289 120526 -86000 35362 97179 -13634 -99847
18881 -99847 110708 -94510 -89820 -271302 246962 -51078 -246252 225350 -13596 -67665 -284915
18870 -284915 39881 -73268 -169215 -224136 -146892 -264496 -84172 250794 -32346 -157539 142754
18858 -271611 -262094 55021 -51197 -113979 79145 -123303 -221464 -150462 -35801 -32975 -1336 239779
18845 -119640 -143663 8214 -186961 173095 -257927 205243 57336 -191106 -78714 -248711
18835b48711B05910j0659B5949Q4606l6190K46506i9204A45623N2323b9357A24600
18823c57607J29127r6588F3366b16445m527b6047k73010a01140A59081F3508L9535
18812A03043a93102g0833A63399a37822o9019B08808D0413A816a28630B38252
18801A5365i5100A81180a69735B92502a08353A74129n0035a00246B988K68241
18791B71229F599a91517H658Q0673J00269d216l1011a4322k01255M2123K0341
18780a53113n6716B4805K62582d9706a2378C6126a66598F7361J1178A8580d0060
18768A2838a89330a339k84606R5501P5814H800b56279k24623a91391N3307D853
18756A2799a17056r5298G0340b96847B43491a91778A73520a63502j26873l1519
$$ plain form
18835 -248711 205910 195251 25949 110555 74365 320871 -99204 145623 197946 -29357 124600
18823 -357607 -228480 -325068 63366 -216445 -220972 -26047 -299057 -101140 159081 63508 103043
18812 103043 -193102 -70833 163399 -137822 -206841 208808 40413 1816 -128630 238252
18801 15365 -95100 181180 -169735 292502 -108353 174129 124094 -100246 2988 271229
18791 271229 6599 -191517 8658 89331 189600 -4216 -35227 -14322 -215577 -173454 -153113
18780 -153113 -209829 24805 287387 -49706 -12378 36126 -166598 67361 78539 18580 -40060
18768 12838 -189330 -1339 -285945 -190444 -114630 8800 -256279 -480902 -191391 -138084 4853
18756 12799 -117056 -212354 70340 -296847 243491 -191778 173520 -163502 -290375 -321894
18746c21894J09780O0275j5450H2138k3466c1601j70115C2967J32551h9308I376
18734a98126a7429B86149c04992P2868c4005m3275j67624Q8837J4771A05108g3734
18722a3486l07913i4952b1724C9338P5445d68695J67490A63064a4463K870j53774
18711a65367N151l5678K2475B68335E6658f2960c1005p4135k71909a66584B00643
18699c88368A52068h5014D1272b3773m9881E039L70534j76189b19808B46326c32915
18687a84091Q1676A48864c80575J79779g4961l949q9388A6840g0384K7326p7570
18676a20628D921b06569G89J65306G7717N9060b1891l27449J50340F913R2729
18665I9642a32034e4289j25269c6217j95984B20768b11628J0126B45721C4731
$$ plain form
18746 -321894 -212114 -151839 -167289 82138 58672 -31601 -201716 32967 165518 -89308 9376
18734 -198126 -17429 286149 -304992 -232124 -34005 -77280 -244904 -156067 -141296 105108 -73734
18722 -13486 -321399 -94952 -21724 39338 114783 -468695 -301205 163064 -14463 -11593 -165367
18711 -165367 -160216 -195894 -173419 268335 56658 -62960 -31005 -105140 -377049 -166584 200643
18699 -388368 152068 -85014 41272 -23773 -73654 5039 375573 199384 -219808 246326 -332915
18687 -184091 -102415 148864 -380575 -200796 -74961 -78910 -168298 16840 -70384 -43058 -120628
18676 -120628 4921 -206569 789 166095 77717 136777 -21891 -349340 -199000 6913 99642
18665 99642 -132034 -54289 -179558 -36217 -232201 220768 -211628 -201502 245721 34731
18654f370F9015a64138A27972b02510e4419i944D14267B5798a84671j70916k1962
18643c77549a66230A84456a126j36004b3580l9189A05322a947k0543j48863j73978
18632c45331J39536F7361J43837a86274B8969M2787a46416Q37j70026J07668B1668
18620f2233A34502a81923j85887g2189A01390K68112c51078H5072d9348E1106
18609A24623c8259a0608I4905A1561f8761r014n2216E8153b02862M1719B3594
18597B15516a31008M3704B43120H945h8034D5410c48495R6122A13129l7759f4311
18585a69896d4804k2789B3903a48201p0814A34014a35722M0114F670R8121c11138
18573b6749q0763D7567a29845B902h0955k05566j703J4109e445A77294G6960L3529
$$ plain form
18654 -6370 69015 -164138 127972 -202510 -54419 -9944 414267 25798 -184671 -355587 -377549
18643 -377549 -166230 184456 -1126 -137130 -23580 -62769 105322 -1947 -22490 -171353 -345331
18632 -345331 -205795 67361 211198 -186274 28969 71756 -146416 -145579 -315605 -207937 21668
18620 -62233 134502 -181923 -367810 -72189 101390 369502 -351078 85072 -49348 51106
18609 124623 -38259 -10608 94905 11561 -68761 -77775 -129991 58153 -202862 -161143 23594
18597 215516 -131008 -87304 243120 8945 -88034 45410 -348495 -252373 113129 75370 -64311
18585 -169896 -44804 -67593 23903 -148201 -219015 134014 -135722 -95608 6670 104791 -311138
18573 -26749 -107512 47567 -129845 2902 -80955 -286521 -288224 -274115 -5445 177294 76960 110489
18561A10489c2782D0316Q9890a02432M4706A30752a74451e0981D8180f6498l6003
18550a02501c7959A32815O6253G631b14116A25928a1305I0904h142m1896A33633
18538a04151M5784q6079A64739g270j77191j19665P2973B41614n1990g0451m717
18527g5168B69249G8442j3947b68909B19248b51102J02195M9775j23777j22951
18517c45860i470B95557c19990A23443a6578A94781D0000J52591b00729A43006
18506a4662A15961D1970b61090O7824D6172J14393D8001K97372j04643A08249
18495b1803A6606e817l40328l9760a45540k3638P6333k36873i3531m2620b2440
18483A20382g5887a4721r5421p3489M6970j70959a28360k91545A93047b45682
$$ plain form
18561 110489 -32782 40316 130206 -102432 -57726 130752 -174451 -50981 48180 -66498 -102501
18550 -102501 -37959 132815 199068 7631 -214116 125928 -11305 90904 -8142 -50038 133633
18538 -104151 -58367 -144446 164739 -7270 -184461 -304126 -231153 241614 189624 -70451 -75168
18527 -75168 269249 78442 64495 -268909 219248 -251102 -148907 -99132 -222909 -345860
18517 -345860 -9470 295557 -319990 123443 -16578 194781 40000 192591 -200729 143006
18506 -14662 115961 41970 -261090 -193266 46172 160565 48001 345373 240730 108249
18495 -21803 16606 -5817 -346145 -385905 -145540 -169178 -92845 -329718 -93531 -136151 -22440
18483 120382 -75887 -14721 -110142 -183631 -136661 -307620 -128360 -419905 193047 -245682
18472b6977j30753A07950D4277a3433l51616g0992A07287P6485j2463e8078j21654
18461a79732a073j67579A32853b06288A88055L74a64379O1064c5812l10192c2947
18449e7945j52683A35492J12532B5444R8864c13115a40052q2666B94781i5992
18438c24100A30775a88976r8100A2689a15672F3603h4199C03978c3701p9962j01982
18427b15645m282A45758g9828B94248B4801a94233f0003A13589j9976J5687D5254
18415F4470a92432H8237a14297n531k68147C569M1695a87652J224A75064h067
18403B2258J12150b52945A94336a39335A00718K9478a22880F5364b64278A74810
18392b62206B44819e22069C94897b76185f1932I2598f9953B33021F2651J82810
$$ plain form
18472 -26977 -157730 107950 44277 -13433 -365049 -70992 107287 183772 171309 -58078 -179732
18461 -179732 -1073 -168652 132853 -206288 188055 188429 -164379 -103315 -35812 -346004 -32947
18449 -57945 -210628 135492 248024 25444 124308 -313115 -140052 -222718 294781 -95992
18438 -324100 130775 -188976 -287076 12689 -115672 63603 -84199 303978 -33701 -113663 -215645
18427 -215645 -219927 145758 -79828 294248 24801 -194233 -60003 113589 93613 109300 45254
18415 64470 -192432 88237 -114297 -119828 -387975 3569 45264 -187652 -186428 175064 -8067
18403 22258 134408 -252945 194336 -139335 100718 130196 -122880 65364 -264278 174810
18392 -262206 244819 -522069 394897 -276185 -61932 92598 -69953 233021 62651 245461
18382B45461F3515h3489c3159B61761b30928D0052F496K64886c3841k43034O4750
18371b12125A24516c66300h1560D5666i1105C28882I5029a64856h0410E6640a47075
18359C9410c5977j30910f2839j99720A55971n8415d197j83059A17089b02380D0308
18347A82003R6635a45244n4327A353J13245O8242h589A70346h7069j7120e1986
18335A17L16685A25058a6136D9094c08642d8227I7607A4080a35422H4197R4352
18324A78549d19522J72595k7785A42069d45656B01143a7145l5087k27644J12186
18314a67690e3620A1720J5845g6846q0440d440j51406E7326j663J32736p3568
18303A14831a46687j7277d3805m56145B5828a86569k3567a2293k29544a19451
$$ plain form
18382 245461 63515 -83489 -33159 261761 -230928 40052 6496 271382 -33841 -276875 -212125
18371 -212125 124516 -366300 -81560 45666 -91105 328882 95029 -164856 -80410 56640 -147075
18359 39410 -35977 -166887 -62839 -262559 155971 97556 -4197 -187256 117089 -202380 40308
18347 182003 278638 -145244 -199571 1353 114598 182840 -8589 170346 -87069 -104189 -51986
18335 117 316802 125058 -16136 49094 -308642 -48227 97607 14080 -135422 84197 178549
18324 178549 -419522 -246927 -274712 142069 -445656 201143 -17145 -52232 -279876 -167690
18314 -167690 -53620 11720 27565 -76846 -157286 -4440 -155846 57326 55663 188399 114831
18303 114831 -146687 -163964 -43805 -499950 25828 -186569 -210136 -12293 -241837 -119451
18292B44439c39642b2410j94249A45495F758i4162H4551I704i1006B6279J51046
18281A77325N4980d3092j17371B89093f7276L1287A90007a142A37767b45380G9735
18269F6272M8711a18894I3820a24461o2841h9645b8541j30404j0603O7273B60379
18257c12470H7869h2155A18177g2401J4796j49100I1120c8745B48271a19928j0743
18246a30671M8938A83582j396C0282a21952M9675B0361O0029i1841m3465A7698
18234a24355J2784o2421O0303c5226l3201j08534d3309H5406b74264B11675a59066
18222A32468B0257a78882A7814R5059b34499h0213j5167J0047A58137B2392P8851
18211A01243a57056p6328G5295b11256N5956P4229q6825d4314r8841A32148d7440
$$ plain form
18292 244439 -339642 -22410 -216659 145495 6758 -94162 84551 9704 -91006 26279 177325
18281 177325 232305 -43092 -160463 289093 -67276 -35989 190007 -1142 137767 -245380 79735
18269 66272 114983 -118894 93820 -124461 -187302 -89645 -28541 -158945 -169548 -102275 260379
18257 -312470 87869 -82155 118177 -72401 -57605 -206705 91120 -38745 248271 -119928 -130671
18246 -130671 -81733 183582 182186 30282 -121952 -72277 20361 80390 -91841 -135306 17698
18234 -124355 -111571 -173992 -113689 -35226 -68427 -176961 -43309 85406 -274264 211675 -159066
18222 132468 20257 -178882 17814 112873 -234499 -80213 -95380 -85333 158137 22392 101243
18211 101243 -157056 -233384 75295 -211256 -155300 -81071 -167896 -44314 -143155 132148 -47440
18199b56813R0774j12327f9039D9987b59218G143K050J02459k1718Q4558d1550
18187a72701J0269D1732d2256H4914b55167A16989e0429l890A29585a2593j31729
18176a44322m8605f7887j93100B1126b17415A63658i6820B7419d17656A80891
18165e9161B06438h1135a9466A76282b9398j38533D00707j08496b64317n6562
18155c20879B1886N3674a89410c7055j8630C4782b31510a13101F8593c1611f880
18143b68725E3213J6197C2130I286d3811A70665m4932a54340c2322j13632A5157
18131C6807M37531H1628P3363J8520p7951M7469A0292a49977l1842j2328P7424
18120a16723j1142A89145A8141h8323d468A36681j5423c7909B02618E9018a88693
$$ plain form
18199 -256813 -166039 -278366 -69039 49987 -259218 7143 9193 111652 89934 174492 -41550
18187 -172701 -162432 41732 -42256 84914 -255167 116989 -50429 -54319 129585 -12593 -144322
18176 -144322 -192927 -67887 -260987 21126 -217415 163658 -96820 27419 -417656 180891
18165 -59161 206438 -81135 -19466 176282 -29398 -167931 400707 292211 -264317 -320879
18155 -320879 21886 75560 -189410 -37055 -55685 34782 -231510 -113101 68593 -31611 -6880
18143 -268725 53213 69410 32130 9286 -43811 170665 125733 -154340 -32322 -145954 15157
18131 36807 474338 81628 154991 173511 95560 143029 10292 -149977 -181819 -194147 -116723
18120 -116723 -127865 189145 18141 -88323 -4468 136681 121258 -37909 202618 59018 -188693
18108D8477c15002M2597C4459R9673c636A39480E9121e2164q4655A74788b15704
18096h5265B65824a07507A13932J791j2812d4819j73219A62843m6991j0909J94105
18085B99048D3994R2751c60259b5068B00178n1601a27802A51829E7433K42912
18075C00345d4884C17601a33799A48124c6455A93635K4748I2430K2680i4875K7529
18064f7346L0163k48266a0348A64141C6042a65422D98548b7219D2565a02110n9237
18053a61347K0877A4350K12439G6016Q6942b03977i7279A87187a84853l50B75085
18041h4284j80334L3637B37872o2133h8330b162B08982n1047B6965a14080m4374
18030a58454m6691a8476B59337c00605J0614f8891B94853a6907B8501a51247j07709
$$ plain form
18108 48477 -315002 -272405 34459 134132 -3636 139480 59121 -52164 -136819 174788 -215704
18096 -85265 265824 -107507 113932 115723 102911 -44819 -218038 162843 115852 104943 299048
18085 299048 43994 136745 -360259 -25068 200178 148577 -127802 151829 57433 300345
18075 300345 -44884 317601 -133799 148124 -36455 193635 218383 92430 115110 -94875 -67346
18064 -67346 -37183 -285449 -10348 164141 36042 -165422 498548 -27219 42565 -102110 -161347
18053 -161347 -140470 14350 226789 76016 162958 -203977 -97279 187187 -184853 -185203 275085
18041 -84284 -264618 -230981 237872 175739 -88330 -2162 208982 157935 26965 -114080 -158454
18030 -158454 -205145 -18476 259337 -300605 -289991 -68891 294853 -16907 28501 -151247 -258956
18019b58956J4605H0142l7290a03323j83495C8561J5847J29631e4698A03017h827
18007c39404N2820a01041B0275K19795H1647J26318J18335D8312e4468A50774
17996a78913G1923P0680c0903D6951a77763L6558D5872P670b3165B89824a82919
17984b4077q3386A2210J98789e7957B33560c58330i8039A0026O0562J06546b12836
17972A35727L2699a39011B84172a2844p8403G5911c01873J5885D6306a23669o4108
17961a87777C4928L4705f6926k37510A34291i4643G7047f656j42150A73466O3042
17950B36508b32670B44771P1798b58297B71849e4646G8332K86569b93324A16136
17939B3199c61084c4230B2845b7185p3749j23180B06643G769a42523B54947b40880
$$ plain form
18019 -258956 -244351 80142 42852 -103323 -286818 38561 54408 184039 -54698 103017 -8827
18007 -339404 -286584 -101041 20275 240070 81647 207965 326300 48312 -54468 150774
17996 -178913 71923 142603 -30903 46951 -177763 -141205 45872 53542 -23165 289824 -182919
17984 -24077 -107463 12210 210999 -57957 233560 -358330 -98039 10026 70588 177134 -212836
17972 135727 168426 -139011 284172 -12844 -91247 75911 -301873 -285988 46306 -123669 -187777
17961 -187777 34928 69633 -66926 -304436 134291 -94643 77047 -6656 -148806 173466 236508
17950 236508 -232670 244771 316569 -258297 271849 -54646 78332 364901 -293324 116136
17939 23199 -361084 -34230 22845 -27185 -100934 -224114 206643 7769 -142523 254947 -240880
17927D75402B01709n767Q016e0477A44562d2094j639G8814P1239f1724j75897
17916b37621C8430K7193d920p9733H6225a17676e6623o7406n4201D5928a90410
17904a79640O390C6315J53832a83581A6069o762c0402D59269a12452c3248B9187
17892C0289a68919H3932l3967B1633a74077K076j02595B46042b17344M5394A21773
17880a51312g2233A59852e6736D6154h4159A82391A4363P9922M24161A12470e6038
17868E3961b42038J10580K7420E48097j60623i8596L7028A6215E024R0492b35740
17856C74339a74092f1837C0074K17146b92981G5779L2830a96220H7246c6910C5511
17844i6811j1394M5559j36480c243A46488J48706D898J50244O3505C2174b03748
$$ plain form
17927 475402 201709 195942 203958 -50477 144562 -42094 -43733 78814 150053 -61724 -237621
17916 -237621 38430 65623 -4920 -84653 86225 -117676 -56623 -124029 -178230 45928 -190410
17904 -179640 -173250 36315 190147 -183581 16069 9307 -30402 459269 -112452 -33248 29187
17892 30289 -168919 83932 49965 21633 -174077 -172001 -274596 246042 -217344 -171950 121773
17880 -151312 -72233 159852 -56736 46154 -84159 182391 14363 94285 518446 112470 -56038
17868 53961 -242038 -131458 -104038 548097 387474 -98596 -61568 16215 5024 95516 -235740
17856 374339 -174092 -61837 30074 247220 -292981 75779 108609 -196220 87246 -36910 35511
17844 -96811 -108205 -62646 -199126 -3243 146488 295194 4898 155142 218647 32174 -203748
17832A94685H3203K10259j20677H1642M8939J36589b02487b6212j51617B04289
17821H4912C9071N0597a56152b8382j29971k9746E438K29515B446b41941G2486
17809a419B04207m3165E4836c2622H9086d3808L644B00476b53678C4116J14432
17798A48548c16401a48006A43578K59848L0925F528L0258d6532B23390q6853Q0885
17787B17422E8252J08011d3430k27326A34640b26061R9050A148b66120B72607
17776g5700C1470K5792K40452a45589A13651N9601j5260d4283k15306I2989J53686
17765B46675G6586J78201F0650P6298b09530e0304A25574C7806A4785M2750k8683
17754B8852K6900O8213j1013D6727b36305C19871A30308J59351J17596j21808
$$ plain form
17832 194685 83203 293462 172785 81642 130581 267170 -202487 -26212 -177829 204289
17821 84912 39071 89668 -156152 -28382 -158353 -188099 5438 234953 2446 -241941 72486
17809 -1419 204207 161042 54836 -32622 89086 -43808 -40164 200476 -253678 34116 148548
17798 148548 -316401 -148006 143578 403426 434351 6528 36786 -46532 223390 136537 217422
17787 217422 58252 166263 -43430 -270756 134640 -226061 -127011 1148 -266120 272607
17776 -75700 31470 57262 297714 -145589 113651 173252 157992 -44283 -259589 92989 246675
17765 246675 76586 254787 60650 136948 -209530 -50304 125574 37806 14785 57535 28852
17754 28852 55752 123965 112952 46727 -236305 319871 130308 289659 407255 285447
17744B85447i149k9938H1239b57493B5553J29110f5261J0809l5715C5772f5882
17732c3281A31163o2656k9263L0231f0727B6945J28216A9857e499j43149a1281
17720g681A50987k1316M0297p1411C1188a8311j79298A03743m1547g1873j40422
17709b12295B62283a52456A13863a13065B00104e134n4634G7186K08151P3266
17699C58603b79127A53227P3114b5923B18640C9167J54772b55168I972J21921
17689A31893A8127a47944D7253g670J26A22181b21526C78381A68911e3656B79804
17677B55591K01387b38316A52701Q373C9580b12496E6894b67905B78161a50717
17666a00959l07307D09882A11396J78086A9230b1217o9668C6769R5249o3538J21704
$$ plain form
17744 285447 -9149 -39087 81239 -257493 25553 154663 -65261 -54452 -90167 35772 -65882
17732 -33281 131163 68507 39244 69475 -60727 26945 155161 19857 -5499 -148648 -11281
17720 -7681 150987 129671 169968 98557 31188 -18311 -197609 103743 62196 -71873 -212295
17709 -212295 262283 -152456 113863 -113065 200104 -5134 -59768 77186 285337 358603
17699 358603 -279127 153227 226341 -25923 218640 39167 193939 -255168 9972 131893
17689 131893 18127 -147944 47253 -7670 -7544 122181 -221526 378381 168911 -53656 279804
17677 255591 456978 -238316 152701 161074 39580 -212496 56894 -267905 278161 -150717
17666 -100959 -408266 409882 111396 289482 19230 -21217 -90885 36769 132018 68480 190184
17655A90184k0252J43097j36887A2475f4528E1028I573M83153A25304b52663C68194
17643C7329J69931a148k17712Q6602I4678L2409h6798J5478A78822l5202b3301
17631a81039D42103b9841c897B0479a04310B09714G4505k7511K74589A0383J23569
17620A33952l6033c07719C9651c4636B22974D9935a73542A87156h5574C55959
17609A08627N64279a50065D336b41612B22000q2108K73455l5553o6859H8068M22798
17598E10866C425R4751J77210K82058f668B4713Q6566m6958j8276a7510A91982
17586a70602b6759j709A18006m2063K15949h0131p6341A72665J71241Q4176j97222
17575B30860J02136r4348g412C21197H2963L9985E27K95608j28956F3523B8253
$$ plain form
17655 190184 169932 313029 176142 12475 -64528 51028 9573 492726 125304 -252663 368194
17643 37329 207260 -1148 -218860 -132258 94678 127087 -86798 -71320 178822 143620 -23301
17631 -181039 442103 -29841 -3897 20479 -104310 209714 74505 46994 321583 10383 133952
17620 133952 97919 -307719 39651 -34636 222974 49935 -173542 187156 -85574 355959
17609 108627 672906 -150065 4336 -241612 222000 139892 413347 377794 310935 88068 510866
17598 510866 3425 98176 275386 557444 -6668 24713 111279 64321 46045 -17510 191982
17586 -170602 -26759 -28468 118006 75943 291892 -80131 -156472 172665 343906 428082 230860
17575 230860 332996 238648 -7412 321197 82963 122948 527 296135 167179 63523 28253
17563C46372j06564j9948D5087J99372k5310I0327B0482J84949L20863A34051
17552D11885Q0704H2176K96056A11701N8167H2362L09852B0895L05293l2345E9749
17540A32517Q454r218R9663N1704m325j13112r315K01229A6709f39C25131A21014
17527C59781J01996k25111p3053L10006B26561B6511b33145B59240G3781C4579
17516B69268A14842M84720B88370J49081j13361J28694L39984K09685O9856j04036
17506I68273l94660m1589j68180j77178J52430n8963M10925j23647K90296m17362
17496D40345N44415j77064M3545L18855k38826k48849K33219k94483m3110B70345
17485B53029J13455q8676A15890J15710J43530j46277m3257B9770N4960P3005
$$ plain form
17563 346372 239808 219860 45087 244459 219149 90327 20482 205431 526294 134051
17552 411885 492589 82176 378232 111701 169868 82362 392214 20895 326188 293843 59749
17540 132517 140971 131753 231416 283120 278795 165683 156368 357597 16709 -639 325131 121014
17527 359781 461777 236666 163613 473619 226561 26511 -233145 259240 73781 34579
17516 269268 114842 599562 288370 437451 324090 452784 792768 1002453 1072309 968273
17506 968273 573613 532024 363844 186666 339096 280133 691058 567411 857707 440345
17496 440345 984760 807696 851241 1170096 931270 682421 915640 621157 578047 270345
17485 253029 366484 277808 115890 231600 375130 228853 185596 29770 84730 157735
17475A57735R5904J15222r7367J11038J38157m9753k10000K12476j58741j30713
17465A83958R8342L8592r5647L66624N0255A09709L39521A54229J55410E0917
17454A56708K610N950j4813J74884j43704J89682A51148L19445B22271I8708M22225
17443E20933A91403L07784j17752c7758B76937k8016J62612j53478K80086A15249
17432C98805K30770J36431C43233K8690o7917K12702A90294J93772j65803K33018
17422D51281j9607j71802j21059K69759n8952n8407N9843L7858J3674L65937A24915
17410C50810M33235k00802j56705R4409j30806J01407A33556M33419j16810a1426
17399A10884M49814k09372J85105p2747N2890b5623B85638J55253q9257C0922
$$ plain form
17475 157735 253639 368861 271494 382532 520689 470936 260936 473412 314671 183958
17465 183958 282300 320892 225245 591869 642124 109709 449230 154229 309639 50917
17454 156708 159318 165268 150455 325339 181635 371317 151148 470593 222271 98708 520933
17443 520933 191403 499187 381435 -37758 276937 248921 411533 258055 538141 115249
17432 398805 629575 766006 343233 371923 304006 516708 190294 384066 218263 451281
17422 451281 431674 259872 138813 408572 349620 291213 351056 388914 402588 768525 124915
17410 350810 784045 583243 426538 520947 390141 491548 133556 566975 450165 -11426
17399 110884 560698 351326 536431 463684 516574 -25623 285638 440891 351634 30922
17388D34883j73203I7186e4181A58571Q4646E6785L91220j07828j33816L09484
17378E15845j81011n827H2431h3208D84063H5595N27010B59576J15094j7563J01274
17367D58381J39229B74730e3292B83588j29475J7235Q7960J96583A33400L81787
17357E15187L9927k42305L7068j51090N3437j1561N9577I7690B6867K28102p8805
17346A76164A358M42597A76554p8944K43760C6250J48499k3962M4563J91816j59417
17335B37749J54600l0972e0788C38972r3989P3097J49439k3788E7131h9410C9541
17323C92271A77033n7969M31844B7410M07305A16713L23977K76976l54754j80068
17313A82844Q7064I0264J33572J36011E6815M03902E1620L52693A35686K10446
$$ plain form
17388 434883 261680 97186 -54181 158571 243217 56785 448005 340177 206361 515845
17378 515845 334834 329007 82431 -83208 484063 85595 612605 259576 374670 357107 458381
17367 458381 597610 274730 -53292 283588 154113 171348 259308 455891 133400 515187
17357 515187 555114 312809 349877 198787 252224 240663 300240 97690 26867 254969 176164
17346 176164 1358 443955 176554 97610 341370 36250 184749 160787 205350 397166 237749
17335 237749 392349 361377 -50788 338972 244983 318080 467519 443731 57131 -89410 39541
17323 392271 177033 119064 550908 27410 434715 116713 440690 717666 362912 182844
17313 182844 269908 90264 223836 359847 56815 460717 51620 404313 135686 346132
17303C46132r5719o775k1243L43314E8282L05763M2697j54299K30117A37434B2863
17291C83669K4912r2461A49967K76685Q1123A13802K80530E0295R5301K26496
17281C72092O9968a4206B29901A11941L20963O4382J59016A82372J10084J39072
17271D31528N4623N5803B28732N1273K87794B29806J79426j08603J42582M4604
17261D87815j46646G6448L72363e3767F84832A82384K59272E5956K59346J08847
17251D24149A01943L46786L3690k01059k1537A26955M15682A92124K61837q2099
17241C71862K08585j35154A82995K72877A16929L18242j98406q729L07580R8494
17231F34110k49350K08577k80311A18090L3625P60L27484k5138n330q7785l0539
$$ plain form
17303 346132 250413 243638 222395 565709 58282 364045 406742 252443 482560 137434 22863
17291 383669 408581 316120 149967 426652 507775 113802 394332 50295 145596 372092
17281 372092 442060 -14206 229901 111941 432904 497286 656302 182372 292456 431528
17271 431528 486151 541954 228732 280005 567799 229806 409232 300629 443211 487815
17261 487815 341169 76448 448811 -53767 684832 182384 441656 55956 315302 424149
17251 424149 101943 448729 482419 281360 259823 126955 542637 192124 453961 371862
17241 371862 580447 445293 182995 455872 116929 435171 236765 228036 535616 634110
17231 634110 384760 593337 313026 118090 151715 152475 479959 454821 449491 361706 331167
17220C31167Q6353E8624Q8287K09491J23293j22446j16478a4327C74714K19899
17210E94613k21423J31999o7242j06935j37224P9208L17506B20228K95943j81170
17200C35001K1791O7338L1423r4528J1620J29963k0739k40460K76264H152M96522
17189E04674k6067j31093k7577J30940a7058D17382r4819Q8028J04569J12000
17179F27160k89973J78653m5060R7727o2002j55647O4727N2660J24713B14132
17168C69832Q9471J56299B61388m8471J36911P6118q5307j712L24211B30956K52354
17157D83310K16864k74601J6639J2629R1628j31165j44243L47744L2241j58316
17147D92730K1000K84521k70595k3369J22370j51344k00270M33430B21237M79426
$$ plain form
17220 331167 417520 58624 146911 356402 479695 357249 240771 -14327 374714 594613
17210 594613 373190 505189 437947 331012 193788 272996 590502 220228 516171 335001
17200 335001 356792 424130 455553 361025 372645 502608 481869 241409 517673 8152 504674
17189 504674 478607 347514 319937 450877 -17058 417382 322563 410591 515160 627160
17179 627160 337187 515840 470780 568507 506505 350858 415585 468245 592958 214132
17168 369832 459303 615602 261388 212917 349828 425946 340639 338927 663138 230956 483310
17157 483310 700174 425573 442212 454841 546469 415304 271061 618805 651046 492730
17147 492730 513730 798251 527656 504287 626657 475313 275043 708473 221237 700663
17137G00663j93309q1544L60184j50990k37590j9502K24433J34178l1735k39783
17127D65005L78168j99844k30009M83890k25620H3047K78562N19707j72215M6971
17117G56072l39799K17214n9290M47859C15320J57591P1160A95193M91240O0052
17107G46485M5767k67719L98689l39061J17898j16467K54788j10038K0417m4264
17097G06495j04778m7014j75749L16874M1776R9198l07037J78403j02592R7658
17087G03234P724o9305k5649K27991K48272E21503L64369n6924J55175j6208Q5688
17076A053603l04670L3064M2076j89346P0604J45232k81384K24070J76029l96213
17066E73065p7546L66366k66990L20801o0828N9933J33464k69546M2203j85391
$$ plain form
17137 700663 507354 425810 785994 635004 397414 377912 602345 736523 704788 465005
17127 465005 843173 643329 413320 897210 671590 83047 361609 881316 709101 756072
17117 756072 416273 633487 574197 1022056 315320 472911 544071 195193 686433 746485
17107 746485 792252 524533 923222 584161 702059 585592 840380 730342 750759 706495
17097 706495 601717 554703 378954 695828 737604 836802 529765 708168 605576 703234
17087 703234 710958 641653 616004 843995 1092267 521503 885872 828948 984123 967915 1053603
17076 1053603 748933 781997 824073 634727 705331 850563 569179 793249 969278 573065
17066 573065 495519 861885 594895 915696 854868 914801 1048265 778719 820922 635531
17056F35531K62786J16583m1713O5199L5936K3505l49889k66724N43908j26116
17046H99006j70158J95020k5479R653m5082r5438j44583K97755j89951K83773
17036A014516j87000R8725j72664J60689l25258N09871k72388K29104k79616K34542
17026A010521o4372k65192N20531k19443k60185K64608R5345k44292J11435K40104
17016A189060k77474j03754L90987n3528n2298O7707k02708K52569J22496j51578
17006A181479J79932k96709J66864o1877J18377l92505Q9396O2247k30293O24258
16996A441169k69898l15274J74126L59853k41773J26717k56432J17089N0247J96740
16986A382564j20674j32933q8070j02756O03169p0726p8575Q2993j4340k15284
$$ plain form
17056 635531 898317 1014900 973187 1038386 1074322 1097827 747938 481214 1025122 899006
17046 899006 728848 923868 898389 908042 862960 767522 622939 920694 730743 1014516
17036 1014516 827516 926241 753577 914266 589008 1098879 826491 1055595 775979 1010521
17026 1010521 946149 680957 1201488 982045 721860 986468 1081813 837521 948956 1189060
17016 1189060 911586 807832 1198819 1145291 1092993 1160700 957992 1210561 1333057 1181479
17006 1181479 1361411 1064702 1231566 1169689 1288066 895561 984957 1047204 816911 1441169
16996 1441169 1171271 855997 1030123 1389976 1148203 1274920 1018488 1135577 1185824 1382564
16986 1382564 1261890 1128957 1040887 938131 1541300 1470574 1391999 1474992 1460652 1245368
16976A245368K24242l57922L28455M390M497l45271P2897L69666q6213k9782m6617
16965A383710M8968O6926O305J09517q3194k50964L13774j34935K24091k84995
16955A399203L95450o5414j33348k00446L11666K5391J20292j70849k42712R7773
16945A537006K00559r9475Q5684J07031j31799N4645O2428K02588k82023K89177
16935B025821m7404K12779p0430j90506P7762R7498j71824k66589J73242J42560
16925A982909k00173m7091O65759l96810J61188j94079n0774J53892N23648n90817
16915B007652J19561M57910m48374J89074k39969j2835M32919j45346K05286m54685
16905B111193K60424P5786K85859m9386J5138o9063p9867K19193L0394l8389O4249
$$ plain form
16976 1245368 1469610 1111688 1440143 1444533 1449030 1103759 1176656 1546322 1460109 1430327 1383710
16965 1383710 1432678 1499604 1505909 1615426 1532232 1281268 1595042 1460107 1684198 1399203
16955 1399203 1794653 1729239 1595891 1395445 1707111 1732502 1852794 1681945 1439233 1537006
16945 1537006 1737565 1638090 1723774 1830805 1699006 1753651 1816079 2018667 1736644 2025821
16935 2025821 1978417 2191196 2120766 1930260 2008022 2105520 1933696 1667107 1840349 1982909
16925 1982909 1782736 1735645 2401404 2004594 2165782 1971703 1920929 2074821 2598469 2007652
16915 2007652 2127213 2585123 2136749 2325823 2085854 2073019 2505938 2360592 2565878 2111193
16905 2111193 2371617 2447403 2733262 2683876 2699014 2629951 2550084 2769277 2799671 2761282 2825531
16894B825531K5074J69804o4029J0907J7171J00208j48948j1399J06297r9838
16884B930778K98975k29118M36330l74113K23940R5793k1720k38790L3837M09657
16874C565569J9805o6677L83028Q6255o25158L19951k83696K91095L05568P2131
16864D067871O6315k99786l44192L27237J96397J6064M51863j45534J650k19573
16854D118312J33528K91245o4941R2072K29078j25564K24913j59073N7857J45212
16844D942639M29104l10613J28302M36911k56416j02292J62560J03827n105L36415
16834E865332K65442q9363Q776j12665K95720j27135K45770l2287L96981j08621
16824F607950J88592K94924M2339K12156O1016K54052L0865J23853l05898M52925
$$ plain form
16894 2825531 2850605 3020409 2956380 2967287 2984458 3084666 2935718 2924319 3030616 2930778
16884 2930778 3229753 3000635 3436965 3062852 3286792 3382585 3360865 3122075 3155912 3565569
16874 3565569 3585374 3518697 3901725 3987980 3362822 3682773 3399077 3690172 3995740 4067871
16864 4067871 4134186 3834400 3490208 3817445 4013842 4029906 4481769 4336235 4337885 4118312
16854 4118312 4251840 4543085 4478144 4570216 4799294 4673730 4898643 4739570 4797427 4942639
16844 4942639 5371743 5061130 5189432 5626343 5369927 5267635 5430195 5534022 5528917 5865332
16834 5865332 6130774 6041411 6050187 5937522 6233242 6106107 6351877 6319590 6716571 6607950
16824 6607950 6796542 7091466 7133805 7345961 7406977 7661029 7691894 7815747 7509849 7962774
16814G962774M18542j8317J18683L5861l5641K36533j35723M06681N49997O1820
16804I601210R1316M18704k3038M70668l95583P03991K88037K52448j90513M66015
16794A1683255O77312j17463L63032O06504o4169N05989K2938k52485Q02673M28421
16784A4656007L69405M68970N67496j54255N83864N02171L85393O0600R70107
16775A8409758K55124L67072P48916l0720J431172M84156P3950J092170N78681
16766B3410279L30481M31956J108505Q94382O26918R16580Q82296Q05884Q24850
16757C0232131Q18253J053283J604161R43867J185407J136926J014951J623868
16749C9612847J033590J272971J932645J601242J444862J577928J941387J792916
$$ plain form
16814 7962774 8381316 8362999 8481682 8517543 8481902 8718435 8582712 8989393 9539390 9601210
16804 9601210 9692526 10111230 10088192 10558860 10163277 10867268 11155305 11407753 11217240 11683255
16794 11683255 12360567 12243104 12606136 13212640 13148471 13654460 13677398 13424913 14227586 14656007
16784 14656007 15025412 15494382 16061878 15907623 16491487 16993658 17379051 17439651 18409758
16775 18409758 18664882 19031954 19780870 19750150 21181322 21665478 21739428 22831598 23410279
16766 23410279 23740760 24172716 25281221 26175603 26802521 27719101 28601397 29407281 30232131
16757 30232131 31050384 32103667 33707828 34651695 35837102 36974028 37988979 39612847
16749 39612847 40646437 41919408 43852053 45453295 46898157 48476085 50417472 52210388
16741E2210388J705440K131674J989112K316564K376584J963344K382239K645394
16733F9720739L009702K193433L168425K209957L125808L257519K853003L221230
16725I2759816K870977L119101L140628K632975L266598K987676L089211K324087
16717A16191069K638821K335192J576272K272019J685578J492313R94909P66513
16709A29952686L43161K7358l78969m56561j249029j151592j419356j683037k336190
16700A21648471k339645k620924k291832l066667k607330l220422l068110k859967
16692I9573574l352983l160471k920079l325122k913810l219260k650212k714034
16684G5317603k634014k617056k704625k369305k398134k672248k011584k038594
$$ plain form
16741 52210388 53915828 56047502 58036614 60353178 62729762 64693106 67075345 69720739
16733 69720739 72730441 74923874 78092299 80302256 83428064 86685583 89538586 92759816
16725 92759816 95630793 98749894 101890522 104523497 107790095 110777771 113866982 116191069
16717 116191069 118829890 121165082 122741354 125013373 126698951 128191264 129186173 129952686
16709 129952686 130295847 130323205 129944236 129487675 128238646 127087054 125667698 123984661 121648471
16700 121648471 119308826 116687902 114396070 111329403 108722073 105501651 102433541 99573574
16692 99573574 96220591 93060120 90140041 86814919 83901109 80681849 78031637 75317603
16684 75317603 72683589 70066533 67361908 64992603 62594469 59922221 57910637 55872043
16676E5872043k260048j707171j981410j966983j550779j497896j701387j112190
16668D2094179j710045j483408j447054j034506j426488j192377j174759q40146
16660C1785396q99806r77257j122503q04157j031884l78782j256755k46819j092483
16651B3974950n72102r30396n91394m91673m82494m71463q90714o15380k88406
16642A8640928l19627n86940l97890m67409k46036o51474o18843r4915k27057
16633A5030737l58146l89623j75349n44868m48708j46398p01110J46810m54333
16624A1959012N3404m95232j69267O8245o01863k90602k15008k21925l24184J00454
16614I863034k43868l16918l21880K23843l09476m49757K79627n22140J04957
$$ plain form
16676 55872043 53611995 51904824 49923414 47956431 46405652 44907756 43206369 42094179
16668 42094179 40384134 38900726 37453672 36419166 34992678 33800301 32625542 31785396
16660 31785396 30885590 29908333 28785830 27981673 26949789 26571007 25314252 25067433 23974950
16651 23974950 23402848 22472452 21881058 21389385 20906891 20435428 19544714 18929334 18640928
16642 18640928 18321301 17734361 17336471 16869062 16623026 15971552 15352709 15257794 15030737
16633 15030737 14672591 14282968 14107619 13562751 13114043 12967645 12266535 12413345 11959012
16624 11959012 12012416 11517184 11347917 11416162 10814299 10523697 10308689 10086764 9762580 9863034
16614 9863034 9619166 9302248 8980368 9204211 8894735 8444978 8724605 8202465 8307422
16605H307422n68669j05109J87582J07844m65047k6204m80223J79094k31402m45255
16595F460033k6446L12780m22757L44639l04515j51081j30016k20992l6912O1177
16585E885910l06121m12391L42822J94223l54522l13139J41834n9305l76914K00830
16575D943227K8110q472k03386p8971k01583q3538K0733J79712j57253k80023
16565D158556L8147P9599K086l20615Q9114K63714l33377j64097j46246K17374
16555C884255j07447o7878k68176J2238j4055L4566N1568j24895J47164L9688
16545C587028N8542m57909K71073j6448l01119M9093l51505L52762m43315L71682
16535C119884l90962J17812p4861J54232k52745J85589l16394j27940J55125L0692
$$ plain form
16605 8307422 7738753 7633644 7821226 7929070 7464023 7437819 6957596 7136690 6905288 6460033
16595 6460033 6433587 6746367 6323610 6668249 6363734 6212653 6082637 5861645 5824733 5885910
16585 5885910 5579789 5167398 5510220 5704443 5349921 5036782 5178616 5119311 4742397 4943227
16575 4943227 4971337 4962865 4759479 4680508 4478925 4395387 4416120 4595832 4438579 4158556
16565 4158556 4196703 4276302 4278388 3957773 4046887 4310601 3977224 3813127 3666881 3884255
16555 3884255 3776808 3708930 3440754 3452992 3438937 3473503 3525071 3400176 3547340 3587028
16545 3587028 3645570 3187661 3458734 3442286 3141167 3190260 2838755 3191517 2748202 3119884
16535 3119884 2728922 2846734 2771873 2926105 2673360 2858949 2542555 2414615 2569740 2600432
16525B600432j78365K61085j34660R7946l36855J47131L2973j56281O7844l30392
16515B070858L97090j32896J23058j50265j68331L07584m01345R3214L28018r9212
16505B367773m74675L61639J824j68383K92737l59687Q3640j66586J7356n1272
16495A904366J58589k925n36660N74226j03396J19972j28481j19948j05416k93977
16485A466350m4643M70607K44494j61995m25837L3051J35723j79463P5427j80647
16475A433067K86250l52689L32093j53077K48300j27935j67370j00599j72296
16466A225744J33572q1887J56455p0308K25371p929o8498j71632M4754J76580
16456A562222k22784p1051J54144J7616j00669k59202L76849M1377l15474R5068
$$ plain form
16525 2600432 2422067 2683152 2548492 2646438 2309583 2456714 2489687 2333406 2401250 2070858
16515 2070858 2467948 2335052 2458110 2307845 2139514 2447098 2045753 2138967 2466985 2367773
16505 2367773 1893098 2254737 2256561 2088178 2380915 2021228 2104868 1938282 1955638 1904366
16495 1904366 2062955 2060030 1523370 2097596 1994200 2114172 1985691 1865743 1760327 1466350
16485 1466350 1421707 1892314 2136808 1974813 1548976 1582027 1717750 1538287 1613714 1433067
16475 1433067 1719317 1366628 1698721 1545644 1793944 1666009 1498639 1398040 1225744
16466 1225744 1359316 1277429 1433884 1363576 1588947 1581018 1512520 1340888 1385642 1562222
16456 1562222 1339438 1268387 1422531 1440147 1339478 1080276 1457125 1498502 1183028 1278096
16446A278096J20618j37575J57186k76514Q4378o410N82193l84705m74566J25537
16436A068238K21784k63744K04863m1335J24418m15717M09100j20536P3570q0649
16426A179992j18417l13988M94235j65328j41500J82480k55736K83239j64971
16417I80006J45418l02794M342R4357k3726Q3198l64228O60159l51092j0115J35010
16406A050535J13000j83150L0728l1810k22472L72752j44337K08827j42370l64996
16396F86707K68327j47190J52909J14407J84175k25085o8946l63048K00772j97591
16386F05437J37471N9798L40711k09379j33923r7859J32317k34331K30837J0579
16376H41658k59348J49837k41622B11943P35107j98289K76753m69853J05526N2202
$$ plain form
16446 1278096 1398714 1261139 1418325 1141811 1226189 1219779 1801972 1417267 942701 1068238
16436 1068238 1290022 1026278 1231141 1189806 1314224 898507 1307607 1187071 1260641 1179992
16426 1179992 1061575 747587 1241822 1076494 934994 1117474 861738 1144977 980006
16417 980006 1125424 822630 826972 921329 897603 980801 616573 1276732 925640 915525 1050535
16406 1050535 1163535 980385 1011113 979303 756831 1129583 985246 1194073 1051703 686707
16396 686707 955034 807844 960753 1075160 1259335 1034250 965304 602256 803028 605437
16386 605437 742908 802706 1143417 934038 800115 702256 834573 600242 831079 841658
16376 841658 582310 732147 490525 211943 947050 748761 1025514 555661 661187 713389
16366G13389j41203J22359k34682K17560M1991j77123K34121r761p5579r750r2268
16355E89054J556R5111J45338k0436k58688J68278l43736L78373j57155L10127
16345I07822l47432l8555K39447r8357K4583o423o6265j15819L00280r5257J95961
16334H99985R8306l91918J29594k7853n2157J69639r7238J01527N6707k36347
16324F50245j91449J6299R9339M9562J32773r9574j62356j4161K49066o3278l4210
16313F32256r6924K8394K1483K803P323k22494o9009j9401K41560k06208J00953
16302D20736j66658L04504p4588j9834K28115A78846K12090Q9601J55299o3028
16292E72808A61094N39247K28128D38827j86393L98496G8376O10904B85398J62131
$$ plain form
16366 713389 572186 694545 459863 677423 719414 542291 776412 766651 691072 681322 589054
16355 589054 590610 685721 831059 810623 551935 720213 376477 754850 597695 907822
16345 907822 560390 521835 761282 662925 687508 681085 614820 499001 799281 704024 899985
16334 899985 998291 606373 735967 708114 655957 825596 728358 829885 886592 650245
16324 650245 458796 475095 574434 623996 756769 657195 494839 480678 729744 666466 632256
16313 632256 535332 563726 585209 588012 595335 372841 303832 284431 525991 319783 420736
16302 420736 254078 558582 483994 464160 692275 178846 390936 480537 635836 572808
16292 572808 161094 700341 928469 438827 252434 650930 78376 689280 285398 447529
16282D47529l2648J10453j69717o6756J07826m3535J0369l259J47784K4403N5208
16271E87657k02816L18120j89132j09256A12248K21778K78877B01812M2733K75486
16261E20031R3065j5670j5025I8368K23124R1414A03945J09176M15068j14576
16251E13613j03842A38203b9208D37673k3236j89262K86479j55600P7890m4105
16241C89839l9674M26163j57252k87547J77900k38997j1968n2939K79789P08P8763
16230E64785r4963r6909A13050N9115J94441K620q292j2707P6385j03362M02252
16219G23502I4386J28243J17477j44817K40289B03376r4082j831K04009p2479
16209B38993J69999k0906G2428K84417K0781j34480k2323C5562J30177m1029K91108
$$ plain form
16282 447529 414881 525334 355617 288861 396687 353152 363521 360262 508046 532449 587657
16271 587657 384841 702961 513829 404573 112248 334026 612903 201812 244545 520031
16261 520031 613096 597426 582401 98368 321492 412906 103945 213121 628189 513613
16251 513613 409771 138203 -29208 437673 414437 225175 511654 356054 433944 389839
16241 389839 350165 776328 619076 331529 509429 270432 258464 205525 485314 486022 564785
16230 564785 469822 372913 113050 172165 366606 369226 360934 348227 424612 321250 723502
16219 723502 94386 222629 340106 195289 435578 203376 109294 107463 311472 238993
16209 238993 408992 388086 72428 356845 377626 243146 220823 35562 165739 124710 415818
16198D15818j18724A40634F8609R1964J48726c2089A80246a401j99048B43457
16187D78901h816B98460Q7366d2075g064A90094R1520J30173A46062K74606j3296
16176D07372k9241k506A57481a2529k98575B51830r4659J7923D7727K30681J11315
16165C89723A12212M22963b71403A06053K99649j01351M4493a7507k38A88152
16154d5414E12191r6483j42047b7556D53979j98945h04A63641K07036r9156e5495
16142B44410j09877E703L8604M0638L59808j94679J51521K50223B24376a56378
16131B2442L56639A01016J55084J32342j50096J47294G8494b20755N8298B16249
16120E5449J96507l6543J24012F0196J80226K46283A68701l9284C5076K43525
$$ plain form
16198 415818 297094 140634 68609 160573 309299 -32089 180246 -1401 -200449 243457
16187 478901 -8816 298460 385826 -42075 -7064 190094 281614 411787 146062 420668 407372
16176 407372 378131 375625 157481 -12529 -311104 251830 157171 175094 47727 278408 389723
16165 389723 112212 535175 -271403 106053 405702 304351 348844 -17507 -17745 188152
16154 -45414 512191 415708 273661 -27556 453979 255034 -804 163641 370677 271521 -55495
16142 244410 134533 5703 44307 84945 444753 250074 401595 651818 224376 -156378
16131 22442 379081 101016 256100 388442 238346 385640 78494 -220755 -162457 216249
16120 55449 251956 215413 339425 60196 240422 486705 168701 129417 35076 278601
16110B78601B5029J74147J99634A93461j856E9556q139O2122k0275J52032a52470
16098B01725i1840B03237c567B4169K96156l1176A08444a96829c5508C34267I1230
16086a60343H0651c6043A62891D2733Q5799a66405K4232B23698F1335J44042K5237
16075B30614f22E1258N9284g5537B27649b59176B89417p8158G1453b54164C20872
16063F9997J76864q6185G9917a35434p4787d0632A89307m1667L18711I9637e7792
16051A66046J03289j08888m1250d4206p0650A31664J23686k3107j03128J32460
16041B61575h8400o8997A02706J34276d9571j10692G5934B5298J397P3744m2067
16030E8372B0225L27429j66153B9159f8681I0178K06094e7494J9857A15241i066
$$ plain form
16110 278601 25029 199176 398810 193461 191605 59556 51417 113539 93264 245296 -152470
16098 201725 -91840 203237 -3567 24169 320325 289149 108444 -196829 -35508 334267 91230
16086 -160343 80651 -36043 162891 42733 128532 -166405 -142173 223698 61335 205377 230614
16075 230614 -622 51258 110542 -75537 227649 -259176 289417 211259 71453 -254164 320872
16063 69997 246861 160676 79917 -135434 -210221 -40632 189307 147640 466351 99637 -57792
16051 166046 269335 160447 119197 -44206 -114856 131664 255350 232243 129115 261575
16041 261575 -88400 -157397 102706 236982 -49571 -160263 75934 25298 26695 100439 58372
16030 58372 20225 347654 181501 29159 -68681 90178 296272 -57494 -37637 115241 -9066
16018A3787K59940b77968b1625B6277K16648j04754a56332B50893C9013f0905
16007h5426E4488P5876J79775h5222A82881G0705J01812F9552a05505n7301L1235
15996a31571B74392b54060F2746J99205C4880K2184a69950e342c56G4704K20871
15985B95575j08445G8515J88339B3713a26680A17568N8360J7892J32753j26322
15975B00251P499B7715L54857M8620J4507J44378J91909q080L4946j8691j56791
15964F33370k25065O3828B29382N3788A16624H667P3261e0450C62421C9982N388
15953D5370b9027A0815J40548b39506e3597a2501A64188l7882M9377E414J8166
15942B3580b44964M4947N0033c5248A24279g8798L757C0654a00578c351k4847
$$ plain form
16018 13787 273727 -277968 -21625 26277 242925 138171 -156332 250893 39013 -60905
16007 -85426 54488 130364 310139 -85222 182881 70705 172517 69552 -105505 -162806 -131571
15996 -131571 274392 -254060 62746 261951 34880 57064 -169950 -5342 -356 74704 295575
15985 295575 187130 78515 266854 23713 -126680 117568 175928 193820 326573 200251
15975 200251 207750 27715 382572 431192 445699 590077 781986 773906 808852 790161 633370
15964 633370 408305 472133 229382 283170 116624 8667 81928 -50450 362421 39982 45370
15953 45370 -29027 10815 151363 -239506 -53597 -12501 164188 126306 175683 5414 23580
15942 23580 -244964 -200017 -149984 -35248 124279 -78798 -75041 30654 -100578 -3351 -28198
15931b8198q4173B11771h2154a5725A2858J88113C628h3120k7617d7529B79138
15919A40273a29941A55267a20822r9119A22928a57820j52279A95751j8158a35033
15908B20398a61234A81007m7303H845a20294B70496j2440G7788i8554k6881p7081
15897b02516j62670C1971a59711O7499D9612K0153k5987o507K99950A5740l321
15886A2419M0915M3056O8343E4224M2496C2604h5769l1480d9623G5204L0966O2317
15874A68487b38740E8065B5349a10674a1823A15990b22419B10213E1854a2892
15863h2978l48182b9120o6363q467a9860k00007a03769H9399i6370a0285A14281
15851c20454A70305c31505j08201A5635J05989L6010C1528J58310a92171B13337
$$ plain form
15931 -28198 -112371 211771 -82154 -15725 12858 200971 3628 -83120 -110737 -47529 279138
15919 140273 -129941 155267 -120822 -219941 122928 -157820 -310099 195751 177593 -135033
15908 220398 -161234 181007 133704 8845 -120294 270496 258056 77788 -98554 -125435 -202516
15897 -202516 -365186 31971 -159711 -92212 49612 69765 43778 37271 337221 15740 12419
15886 12419 53334 96390 164733 54224 96720 32604 -85769 -117249 -49623 75204 106170 168487
15874 168487 -238740 58065 25349 -110674 -11823 115990 -222419 210213 51854 -12892
15863 -82978 -431160 -29120 -95483 -103950 -19860 -219867 -103769 89399 -96370 -10285 114281
15851 -320454 170305 -331505 -439706 15635 121624 157634 31528 189838 -192171 213337
15840b671m21083b2291A59701D4049d0138m7654m4491L6163E4321P3758a32691
15828A0686L4400c22667c8206H7823O3450b28996A39109a33045G4719J00230c0227
15816g9939A08555J052b29429b8960j7825n828j19555E9970J09168f3854G2203
15804f563p2959o8610D3398c00117A04054l4313P4984o3895d6289j22289H393
15792F0742N4276R3676a72391g4784j35807c7164k63499a11033N5470j4955A09327
15780b52232K2715g8263B35994l3149M2766f4738n3285D50354b6787o7723k94158
15769c88668c7078j5268l8562j69881p2693H3286J73649b27571B24713i1141E8539
15757a11992A42569a36122C58290b9680j54074L431n4934C06787B968b26048h2073
$$ plain form
15840 -2671 -423754 -22291 159701 44049 -40138 -87792 -132283 -96120 54321 128079 -132691
15828 10686 45086 -322667 -38206 87823 151273 -228996 139109 -133045 74719 174949 -30227
15816 -79939 108555 109607 -229429 -28960 -46785 -52613 -172168 59970 169138 -63854 72203
15804 -6563 -79522 -148132 43398 -300117 104054 69741 144725 80830 -46289 -168578 8393
15792 60742 115018 208694 -172391 -74784 -210591 -37164 -300663 -111033 -55563 -70518 109327
15780 -252232 -229517 -78263 235994 202845 245611 -64738 -118023 450354 -26787 -94510 -388668
15769 -388668 -37078 -52346 -90908 -260789 -333482 83286 256935 -227571 224713 -91141 58539
15757 -111992 142569 -136122 358290 -29680 -183754 -180323 -235257 306787 2968 -226048 -82073
15745H912b21379A02134r957l5129A2863a98843A12784b10859a04565G9142B9053
15733a55872F5830J44859A01413a85579E2696J73198k681a02411I8031I129J70666
15722A79795L66512d42298J95870A0612J34659m0964e42718B6663g8475o788A14999
15710A66565a61428o923P2449B71174d9377B0530b34278F1708a76893o8591A18030
15698A03737a17332M5770A51774a48529B44420J27834p0736g6446K2654j96024
15688b49816B92667j7652b0966j500j38828F4360J77935b69596a29824I6951d0961
15676B45388a78159F9798J73046D1913h4701c7212p7018C64678a8956f126q9786
15665i5912A45212c87437M329f4463G2690B3385P254J41107b08639H0294D0085
$$ plain form
15745 8912 -221379 102134 92177 57048 12863 -198843 112784 -210859 -104565 79142 29053
15733 -155872 65830 210689 101413 -185579 52696 225894 223213 -102411 98031 9129 179795
15722 179795 546307 -442298 -246428 10612 145271 104307 -542718 26663 -78475 -85263 114999
15710 166565 -161428 -168351 -95902 271174 -49377 20530 -234278 61708 -176893 -245484 118030
15698 103737 -117332 -71562 151774 -148529 244420 372254 301518 -76446 -53792 -249816
15688 -249816 292667 275015 -20966 -22466 -161294 64360 242295 -269596 -129824 96951 -40961
15676 245388 -178159 69798 242844 41913 -84701 -37212 -114230 364678 -18956 -6126 -95912
15665 -95912 145212 -387437 -383108 -64463 72690 23385 30639 171746 -208639 80294 40085
15653d6201j51667j42263A99871B2658K11349E7515a71477P5485B09310a60899
15642B28456k5313c7506D8507i6131j33430J04913j82911e7220A76515A8568M3801
15631F2369J11247e07605A59394a02307j57752J2295d7775B71164a63802g105
15620a62627L7967A37392c8023q0209M7253q1358p2292j254k5298B20625a3265
15608A7813J75627d80472J47262B29853f5768j46073F9788b7927o5850j65014
15598b58791r0551B17060a58485B14507G5154c88943a94040A15405b8107B71133
15587i7335o6835f5846j00282F6946a27625e3390A31023J17523E6781d66185c7683
15575A23366h6132j43895I9887e9462J7652k39549D8227a3443k50873O3168e867
$$ plain form
15653 -46201 -197868 -340131 199871 22658 234007 57515 -171477 -95992 209310 -160899
15642 228456 203143 -37506 48507 -96131 -229561 -124648 -307559 -57220 176515 18568 62369
15631 62369 173616 -507605 159394 -102307 -260059 -247764 -47775 271164 -163802 -7105
15620 -162627 -124660 137392 -38023 -118232 -70979 -152337 -224629 -225883 -251181 220625 -13265
15608 17813 193440 -480472 -333210 229853 -65768 -211841 69788 -27927 -93777 -258791
15598 -258791 -349342 217060 -158485 214507 75154 -388943 -194040 115405 -28107 271133
15587 -97335 -164170 -65846 -166128 66946 -127625 -53390 131023 248546 56781 -466185 -37683
15575 123366 -86132 -230027 99887 -59462 -41810 -281359 48227 -13443 -264316 -201148 -5867
15563A59171p9028J55457h4886j13522O7904H6515J75338A28632a4182j81342
15553a95524Q9810A71974c00509B6712b16797N4550B31670b00028E356b86442
15542g9554B05565L8031j18768h3795k04375P8448h7710A84221K24988b43795
15531d3778j85208c3890l0179A74069b6912J1364A2860e5657k9062C58412b92981
15519B47145a57277k1383a4469B0450L2498J70575D0835K5586K6817e3496A47278
15507B07818F2442j6400k1651M4524N46853B63757P404q7705n8689J41189j27341
15496A38615o5615J51253l4897o7463J27183j12918a99151G972P0026k7119J29765
15485A80644h6281G8857i7308A59948K0875K35547j75154A16307a39772D63210
$$ plain form
15563 159171 80143 235600 -84886 -198408 -130504 86515 261853 128632 -14182 -195524
15553 -195524 -105714 171974 -300509 26712 -216797 -162247 231670 -200028 5356 -286442
15542 -79554 205565 243596 124828 -83795 -288170 -209722 -87710 184221 409209 -243795
15531 -43778 -228986 -33890 -64069 174069 -26912 -15548 12860 -55657 -84719 358412 -292981
15519 247145 -157277 -178660 -14469 20450 52948 223523 40835 66421 93238 -53496 147278
15507 207818 62442 46042 24391 68915 615768 263757 271161 183456 124767 265956 138615
15496 138615 73000 224253 189356 121893 249076 136158 -199151 7972 77998 50879 180644
15485 180644 -86281 78857 -97308 159948 180823 416370 241216 116307 -139772 463210
15474I0764K24081g5766E63089a24514A05726j4583a51173e7361J7384C74825
15463f4371k9619D2399a32667E36112r9185J86575m2370A60022R3099B2462K49196
15452B71658c4758B55544C8812a47128e1699C83316A47820Q2300K5882a91101
15441A57302f3609F7995K59627E4489e7075C21555A44695a88324E6550j2718K30679
15430B74511m2719K74490j29484K86197P1373M51313m60938J17346l97741F2152
15419B7563L30634A05562C0775b261j5765B22276I224J04602Q1167a0413l88473
15408c98886C25489a4969I9578k8040L9138K11191j16209R4988a17572A74138
15397F4554J51301D8293J38045a80447A57542L83538I1295a2972A27498a70719
$$ plain form
15474 90764 314845 -75766 563089 -124514 105726 91143 -151173 -57361 -39977 374825
15463 -64371 -93990 42399 -132667 536112 436927 623502 581132 160022 253121 22462 271658
15452 271658 -34758 255544 38812 -147128 -51699 383316 147820 230120 256002 -191101
15441 157302 -63609 67995 327622 54489 -57075 321555 144695 -188324 56550 43832 274511
15430 274511 231792 506282 376798 662995 734368 1185681 724743 842089 444348 62152
15419 27563 358197 105562 30775 -2261 -18026 222276 9224 113826 194993 -10413 -398886
15408 -398886 325489 -14969 99578 71538 110676 321867 205658 300646 -117572 174138
15397 64554 215855 48293 186338 -180447 157542 541080 91295 -12972 127498 -170719
15386d2859j15124a5979J437j11055M362j3412c9181a1612A42725l0605a21347
15374A2581l190J89289q1649J04966a42319b8983o8731j63922a1866c443q6655
15363i0098A95080E9526Q1489a72680L9276E49925j76425g3440D07886A56030
15352B63970a2470C91227A0749f2782B75485O7553J00608A57811K87299F6400
15341A54362L73617B21855B1578K74898j09454K19113r1836j9013i7524A70051
15330h8214A68418D6553K60362r6416N17237B99000A25302n498C7650J09065C2949
15318i562A64042b18238C6231J98079J96524j0772H1601C2023h5948B79439J05967
15307C85406A24867J62371C3183J76228G514b7454j35062C21138A11277K50035
$$ plain form
15386 -42859 -157983 -15979 -14542 -125597 -121235 -134647 -39181 -11612 142725 112120 -121347
15374 12581 9391 198680 117031 221997 -142319 -28983 -97714 -261636 -11866 -3443 -90098
15363 -90098 195080 59526 141015 -172680 -133404 549925 373500 -73440 407886 156030
15352 263970 -12470 391227 10749 -62782 275485 343038 443646 157811 445110 66400
15341 154362 527979 221855 21578 296476 187022 406135 314299 295286 -97524 170051
15330 -88214 168418 46553 306915 210499 727736 299000 125302 119804 37650 146715 32949
15318 -9562 164042 -218238 36231 234310 430834 420062 81601 32023 -85948 279439 385406
15307 385406 124867 287238 33183 209411 7514 -27454 -162516 321138 111277 361312
15297C61312f7170D91058j54559e9547D5131K26674A1308J10648a90573R4896
15287i5677C02971g4362C21031a80434A2503e2821D7177L91000c2536A99512D4650
15275A20148J02723G284L26576h7394G2023K43201i584k93230a41217F7825f3248
15263A44247J8021p9439J33492b99328a13467G4916o055a70225B25566b0006G942
15251a60795B0535b38481A73995m4719K02701A44628J50210j20880e4234A84984
15240A40392M73948e2676C95181B4148J36940k8092j3432j5335J54028o7074q3256
15229A07927O17596l2529L87036J113588m50390l92196L55116G34713o8253A51781
15218E19676n781b7485k04819C20053a15910n6036O8817B29145a21867C40117
$$ plain form
15297 361312 -67170 491058 336499 -59547 45131 271805 11308 121956 -190573 -95677
15287 -95677 302971 -74362 321031 -180434 12503 -52821 47177 438177 -32536 199512 44650
15275 120148 222871 7284 333860 -87394 72023 315224 -9584 -302814 -141217 67825 -63248
15263 144247 162268 82829 216321 -299328 -113467 74916 68861 -170225 225566 -20006 7942
15251 -160795 20535 -238481 173995 129276 331977 144628 294838 173958 -54234 184984
15240 140392 614340 -52676 395181 24148 161088 132996 119564 104229 258257 191183 107927
15229 107927 725523 692994 1080030 2193618 1743228 1351032 1706148 734713 666460 151781
15218 519676 513895 -27485 -232304 320053 -115910 -171946 -103129 229145 -121867 340117
15207B57893n8584J0820a34258B20515A2730L7075J57331C0880e3203A78712j4455
15196A64257c04248E9275J25888m802K2272e4417D5836B0605K53606d9795l9646
15185h9441C42032A30060L02893I4295C8136b33463A37231L4810B4857N9867K46357
15174C31081j10725D2688P0469a99581F21718B77906G4378a54472F27a37606e1931
15162A18001a35154A19968R7574J217Q8601A00996K14851a79764F5075a90230
15151f537B65922j32830L4553o1858e1528A04588h9287a2998F8466J36895e5867
15139A19751J87190J791f9437E3449P1911J57410D0833R0251K09724J1193q1121
15128B70880a11008A16626J51600a33987e1731j40397D81615b01251B55057a25132
$$ plain form
15207 257893 199309 210129 -134258 220515 12730 49805 207136 30880 -53203 178712 164257
15196 164257 -304248 59275 185163 180361 202633 -54417 45836 20605 274211 -49795 -89441
15185 -89441 342032 130060 432953 94295 38136 -233463 137231 172041 24857 84724 331081
15174 331081 220356 42688 113157 -199581 621718 277906 74378 -154472 627 -137606 -51931
15162 118001 -135154 119968 217542 218759 307360 100996 315847 -179764 65075 -190230
15151 -6537 265922 133092 167645 105787 -51528 104588 -89287 -12998 68466 205361 -55867
15139 119751 306941 308732 -69437 53449 125360 282770 40833 131084 340808 352001 270880
15128 270880 -111008 116626 268226 -133987 -51731 -192128 481615 -201251 255057 -125132
15117B17085l0207J1712I0791b8466B5468J02819c3752l21286A68132c9501A40864
15105A14414m1798Q2183L83259B13336L59694j08768a14074E8638L37233H8488
15094H0015K19261B9467L56326j66751G9919K82808J7362G54O13562E5716g4915
15082C57022c7807I0673R4576b9309B61733J3794B9501d306A85474G8784b13958
15070A35876K4901b103C31891A05950K08057A43739b53198B14630j574a9777D63933
15058F996e2313B19068R8246j39528K23450j51854p9426n6352D4792L52658j71962
15047B25488l4233H159L98387j07876J96613J6738j07278A96724K00381M87j31990
15036B65602J55716B6049O51912C25819K90486B71864Q8878J37701O2865k65609
$$ plain form
15117 217085 186878 198590 90791 -28466 25468 128287 -33752 -355038 168132 -39501 140864
15105 114414 72616 154799 538058 213336 573030 464262 -114074 58638 395871 88488
15094 80015 299276 29467 385793 219042 79919 362727 380089 754 614316 55716 -74915
15082 357022 -37807 90673 185249 -29309 261733 275527 29501 -4306 185474 78784 -213958
15070 135876 160777 -2103 331891 105950 314007 143739 -253198 214630 213056 -19777 463933
15058 6996 -52313 219068 317314 177786 401236 249382 169956 113604 44792 397450 225488
15047 225488 191255 8159 406546 298670 495283 512021 404743 196724 397105 397592 265602
15036 265602 421318 26049 677961 325819 616305 271864 360742 498443 561308 295699
15026B95699R4591Q4774A51846E4405K27420n2535a588B11712K63416B33529L53008
15015E86537j74220J60947J82080l62501J99752k8492j55869j50786N04512k7742
15005G34218n2203K2634l9765j64946o3782q5574J31838j04659E4331L62137N7538
14994D74006L8825q4226M00739A60545K82222p7277J95910j27849J05969B30521
14983D00717J56863o2750o6862M4912o4401k8410J24329p5128J7157B22520L26028
14972E48548r1868K15083l33923J25518M01404j77212R5907J6780P944J02413
14962I10594k15648L5383p1415C18039L52206k98409K02090Q1592j98840l8564
14952D18114A70780L01385K758j5101j70638l6592M0363J6128P1151K1420j47298
$$ plain form
15026 295699 390290 475064 151846 54405 281825 229290 -1588 211712 475128 233529 586537
15015 586537 412317 573264 755344 392843 592595 564103 408234 257448 761960 734218
15005 734218 682015 704649 664884 499938 436156 350582 482420 377761 54331 416468 474006
14994 474006 512831 428605 829344 160545 442767 365490 561400 433551 539520 230521
14983 400717 557580 494830 427968 472880 408479 380069 504398 429270 446427 222520 548548
14972 548548 456680 671763 337840 463358 864762 687550 783457 800237 808181 910594
14962 910594 694946 730329 658914 318039 670245 371836 573926 655518 456678 418114
14952 418114 170780 472165 474923 459822 289184 252592 292955 309083 380234 401654 254356
14941B54356o7324J19011A49867N57653B57010L9687K422O4933A45913m127L40960
14930D82746j20132L21250B61017M16418p2566J93256j36201r4558n2835j65863
14920C48668j28574J23288O04902l19156J60399Q2469K03622L40201M2284n6384
14910A401719K32940J49256k9997k30971J44535j32025J94229O1087L49980l93595
14900A747158N19763q2067m90888k38707k12399j61685m3802k73165j44993k9179
14890E90036K9379j23522J14152j20263J80198l20313L18345C29026J08603j2884
14880D24745O9853r9815Q0790J99350j95867K85395l83p1933N298j56645J97471
14869G38259j15036Q5709r8599J08907R0877r1098J91280L0129q3714m04606L99290
$$ plain form
14941 254356 187032 306043 149867 707520 257010 296697 299119 364052 145913 141786 482746
14930 482746 362614 683864 261017 677435 604869 798125 661924 567366 514531 348668
14920 348668 220094 343382 948284 629128 789527 871996 1075618 1415819 1458103 1401719
14910 1401719 1634659 1783915 1753918 1522947 1667482 1535457 1729686 1790773 2140753 1747158
14900 1747158 2266921 2184854 1693966 1455259 1242860 1081175 1037373 764208 619215 590036
14890 590036 619415 495893 610045 489782 669980 349667 668012 329026 437629 424745
14880 424745 494598 394783 475573 674923 479056 764451 764068 692135 697433 540788 738259
14869 738259 623223 708932 610333 719240 810117 719019 910299 940428 856714 452108 851398
14858H51398k06954j41396L8896j90026J86760n0165K55621M066l68888L81310
14848G60622Q4932j61718k44927J775j15489q835L13994j89193J29483j3604j71661
14837C85379M8423K00869Q5377k8094Q3904l79588J94000R5118J07577n8102L30572
14826A065435J15347k32914J66075l04746K03350j25167k34118L82639q5774k38441
14816G11686O0431k55922P2185j37789Q9546J70223N1898B05784K95290J47239
14806F48313m5091J6817J23604k36265O76091l53381k13397K18946J28934j52602
14796H11969r3083J74101k81031k02217K17296J39453K76790J2710k27784L4122
14786H62326l38772J98949j5233n1035j82398m4015J31011n4609J29039p917j06138
$$ plain form
14858 851398 644444 503048 541944 351918 538678 488513 744134 748200 379312 760622
14848 760622 845554 683836 438909 440684 325195 316360 630354 441161 570644 557040 385379
14837 385379 433802 634671 720048 691954 775858 396270 590270 685388 792965 734863 1065435
14826 1065435 1180782 947868 1113943 809197 1012547 887380 653262 1035901 950127 711686
14816 711686 772117 516195 588380 450591 540137 710360 762258 205784 501074 648313
14806 648313 603222 620039 743643 507378 1183469 830088 616691 835637 964571 811969
14796 811969 718886 892987 611956 409739 627035 766488 1043278 1055988 828204 862326
14786 862326 523554 722503 707270 656235 473837 429822 560833 506224 635263 627346 521208
14775E21208L24441k98471M31635L4188p4326K757n8010k78615K94897l83625
14765E16079K19045j81629N36615l32069K52634k03571j03222K16519j28850k0111
14755G71440k20L3385l85244J72908K13406o7223j70976K48114k25221M17546
14745A007915m4180k06039k52026p018L42091q7731r6658J07227K87907j65045
14735H86443n6564O419l14621K2804O1139m5211K34383m1335r967J2644n9037
14724F97097Q7364p9316N17826l23833j2704m633J07030q6484o3160K78006K23064
14713A340257j10338M10301j46564M65357K21536o85793k41144l37937L87237
14704A302912l92184J00814p4637j47586J25433K15869m12066L09219J09482j33258
$$ plain form
14775 521208 845649 547178 978813 1013001 938675 941432 883422 604807 899704 516079
14765 516079 735124 553495 1090110 758041 1010675 807104 703882 920401 791551 771440
14755 771440 771220 804605 419361 592269 805675 738452 567476 815590 590369 1007915
14745 1007915 963735 757696 505670 498652 840743 753012 656354 763581 1051488 886443
14735 886443 829879 836298 521677 544481 605620 560409 794792 753457 743490 756134 697097
14724 697097 784461 705145 1222971 899138 886434 881801 988831 902347 839187 1117193 1340257
14713 1340257 1229919 1640220 1493656 1959013 2180549 1494756 1253612 915675 1302912
14704 1302912 910728 1011542 936905 789319 914752 1130621 718555 1027774 1137256 1003998
14694A003998N6464K55144k24901Q1844L0541Q0511m31101N56711K72114p296
14684A674029L02383q903n33635l82553K49864j69885r7721j55937J27937L16962
14674A322541k93064m45282K36057L40986O6181l63706J77959l5206J42774j86586
14664I62654k9959J24533r4040q3052J54598r5207N6758K90606l18911J69727
14654A137707J62217n73513N19646k47530R0649j39382L39642l66590L6531L7178
14644I96555j74284N75813n23351L28988Q1256K20683l68389J60800L51390j72131
14634A477330J1852p8669k62747L02577j48525l82668N71142l00230j38738P12744
14624A764068m42340k01943O7131k1852M37378l42350N40037l17841k676j49360
$$ plain form
14694 1003998 1060462 1315606 1090705 1172549 1203090 1283601 852500 1409211 1681325 1674029
14684 1674029 1976412 1967509 1433874 1051321 1301185 1131300 1033579 877642 1005579 1322541
14674 1322541 1029477 584195 820252 1161238 1227419 863713 1041672 1006466 1149240 962654
14664 962654 932695 1057228 963188 880136 1034734 939527 996285 1286891 967980 1137707
14654 1137707 1299924 726411 1246057 998527 1089176 949794 1289436 922846 959377 996555
14644 996555 822271 1398084 874733 1203721 1284977 1505660 1137271 1298071 1649461 1477330
14634 1477330 1489182 1410513 1147766 1450343 1301818 919150 1490292 1190062 1051324 1764068
14624 1764068 1321728 1119785 1186916 1165064 1602442 1260092 1800129 1482288 1479612 1330252
14614A330252n2075L72881r4668r1881j278P9315o9126k20645K93764l8215M0001
14603A548325K2391k10323p7832J19480L44897Q921k65887K0809J53850p0934
14593A593697R8845l13400K88471p534J36652k76358J27777J74254k68461L43591
14583A897534j2691r3650k74419q609L47875K94721l69580P6442J47779j59159
14573A846243j45121K39492O7548Q7723j70327n7959j48587M00576j76362K74966
14563B218192n5217n6967j17826J24559J76760m93233M92600J37262j0760L58041
14553B773411k97292k6836M2814K77251J2804j47795m3167J85763L57326R5022
14543C229301J42387q8432K94482N20828N34251K35431N80548P58655J584063
$$ plain form
14614 1330252 1278177 1651058 1556390 1464509 1463231 1542546 1473420 1252775 1546539 1508324 1548325
14603 1548325 1570716 1360393 1282561 1402041 1746938 1755859 1489972 1510781 1664631 1593697
14593 1593697 1692542 1379142 1667613 1660079 1796731 1520373 1648150 1822404 1553943 1897534
14583 1897534 1884843 1791193 1516774 1508165 1856040 2150761 1781181 1857623 2005402 1846243
14573 1846243 1701122 1940614 2008162 2095885 1925558 1867599 1719012 2119588 1943226 2218192
14563 2218192 2162975 2106008 1988182 2112741 2289501 1796268 2288868 2426130 2415370 2773411
14553 2773411 2476119 2449283 2492097 2769348 2782152 2634357 2591190 2776953 3134279 3229301
14543 3229301 3371688 3283256 3577738 4098566 4632817 4868248 5448796 6207451 7791514
14534G791514J895410M501514O092424J0912994L467893j4244189q591311m154261
14526G671988k619557j018008J450k60711Q84607Q22048j179192j116237o57484
14517B528904M147k1739m3952l96j09704J59522j67180K60138k05257n0749M81424
14506B835158k38540J32622J62982l20585K90783m2780J02176j24627J12002l74597
14496B534594K46496Q3122N62347j98194J89184k48694p5888o0244N5359k876
14486C085206L08114n6666J55059j96764k1922L25854J09293j34106J9445J89494
14476C783007m2120k39911L8882K41122J85321k77586L9369J14876m3925O06201
14466D405236m79713J20855j75392K31315J45870p227m5755J82218L09742l0365
$$ plain form
14534 7791514 9686924 14188438 20280862 31193856 34661749 20417560 11826249 7671988
14526 7671988 5052431 4034423 4035873 3775162 4659769 5481817 4302625 3186388 2528904
14517 2528904 2533051 2511312 2467360 2466964 2357260 2516782 2349602 2609740 2404483 2353734 2835158
14506 2835158 2596618 2729240 2892222 2571637 2862420 2819640 2921816 2797189 2909191 2534594
14496 2534594 2781090 2864212 3426559 3228365 3417549 3168855 3092967 3032723 3088082 3085206
14486 3085206 3393320 3336654 3491713 3294949 3273027 3598881 3708174 3574068 3593513 3783007
14476 3783007 3740887 3500976 3539858 3780980 3966301 3688715 3728084 3842960 3799035 4405236
14466 4405236 3925523 4046378 3870986 4102301 4248171 4240944 4195189 4377407 4687149 4656784
14456D656784O3610k75464m9420J99418J46622J32821j0419j91940M68674r9699
14446E040987L4371m2273K47249m7783J25405l01935L79232M59995o12041N57148
14436E840355J3398J309L43386l09679j0834l5739N13759m9984j37083R9382J87648
14425F455918L03038n712J18951k9062q5978L46121j03172K652J56599O8927K58139
14414G486421L7358J50707K20682K0364k09007O51976j12323L06796J09975J20256
14404H783205N38471r5588K6070O6938j50016N34754l17727J37609J57509L54064
14394A0035289J21798J47379K54672j68011N52226N6294J65816N92608j67205
14385A1590866j15752N41812k46667K04061J19075K53811J98812L7863N32759
$$ plain form
14456 4656784 4720394 4444930 4395510 4594928 4741550 4874371 4863952 4672012 5140686 5040987
14446 5040987 5075358 5033085 5280334 5232551 5357956 5056021 5435253 5895248 5283207 5840355
14436 5840355 5853753 5855062 6198448 5888769 5877935 5842196 6355955 6305971 6168888 6268270 6455918
14425 6455918 6758956 6753244 6872195 6843133 6757155 7103276 7000104 7002756 7159355 7228282 7486421
14414 7486421 7523779 7674486 7895168 7915532 7706525 8358501 8246178 8552974 8662949 8783205
14404 8783205 9321676 9226088 9252158 9319096 9169080 9703834 9386107 9523716 9681225 10035289
14394 10035289 10157087 10304466 10559138 10391127 10943353 10999647 11165463 11758071 11590866
14385 11590866 11475114 12016926 11770259 11974320 12093395 12347206 12546018 12583881 13116640
14376A3116640K99809j54169O54665O5738o9059M74945L37687N41379k41965P72094
14366A5797764L13988M17048j02179M48108J49733R5570R55812m0021J45788O58808
14356A8840419p1477M42306Q26335K77074M98686L00845Q36664K44706L17634
14347B2513192N80300L48211M25035K26379M25271J238770M71642Q75612o8039
14338B7036373P54626J048341Q63950L96566Q01404N20372J060601R79219O96816
14329C4158268Q78574J070147P47576J667153N43082J398968R70666J110707J316188
14320D3861329J302372R75293J878298J182874J680929J835887J789657J607237
14312E6113876K239741J588114J968976K181112K602272K329934K373043K723034
$$ plain form
14376 13116640 13416449 13262280 13916945 13982683 13913624 14388569 14726256 15267635 15025670 15797764
14366 15797764 16111752 16528800 16426621 16874729 17024462 17120032 18075844 18035823 18181611 18840419
14356 18840419 18768942 19211248 20037583 20314657 20813343 21114188 21950852 22195558 22513192
14347 22513192 23093492 23441703 23866738 24093117 24518388 25757158 26228800 27104412 27036373
14338 27036373 27790999 28839340 29703290 30099856 30901260 31421632 32482233 33461452 34158268
14329 34158268 35036842 36106989 36854565 38521718 39064800 40463768 41434434 42545141 43861329
14320 43861329 45163701 46138994 48017292 49200166 50881095 52716982 54506639 56113876
14312 56113876 58353617 59941731 61910707 64091819 66694091 69024025 71397068 74120102
14304G4120102K888515K395748L009856L019071L387578L654936L498695M298690
14296A00273191L901057M705163M456655M852374N223435N550150N999897N980552
14288A40942474O795832P195051P023330P598435Q272442Q420283R280289R759394
14280B05287530R803289J1315329J0916475J1938918J2337312J3084534J3394319
14273B88077706J4360303J4557901J5242575J4057580J4376995J4349529J3485165
14266C88507754J2482909J1467701J1057942J0349583R828307Q408275O948220
14259D59050691O405038M586022J54387l0436R64165j902333q674511o838927
14251D53714096q588920q244988j1761142j2746331j4117383j3337376j4049374
$$ plain form
14304 74120102 77008617 79404365 82414221 85433292 88820870 92475806 95974501 100273191
14296 100273191 104174248 108879411 113336066 118188440 123411875 128962025 134961922 140942474
14288 140942474 147738306 154933357 161956687 169555122 177827564 186247847 195528136 205287530
14280 205287530 215090819 226406148 237322623 249261541 261598853 274683387 288077706
14273 288077706 302438009 316995910 332238485 346296065 360673060 375022589 388507754
14266 388507754 400990663 412458364 423516306 433865889 443694196 452102471 459050691
14259 459050691 465455729 470041751 470196138 470165702 471129867 469227534 460553023 453714096
14251 453714096 445125176 436880188 425119046 412372715 398255332 384917956 370868582
14244C70868582j4334457j3804148j4485385j3574342j2626091j3323552j3609239
14237B75111368j2343649j2377082j1769507j0720746j0997477j0235526r862728
14230A96804653j0373687r180857q595198q086590p860068o976325o520776n954427
14222A33256725n773988n785754n146251m701512m843111m420822l348691m453855
14214I4782741l649194l641636l224861k832067l433081k610489k449422k738981
14206G0203010k193141k499834j841429k319776k124379j927553j740815j438248
14198E4117835j912291j435472j352020j591327j533320j171724q62139j186731
14190D3072811j594004p25559j765768o97540j072293p37320j093493n57809j056788
$$ plain form
14244 370868582 356534125 342729977 328244592 314670250 302044159 288720607 275111368
14237 275111368 262767719 250390637 238621130 227900384 216902907 206667381 196804653
14230 196804653 186430966 177250109 168654911 160568321 152708253 145731928 139211152 133256725
14222 133256725 127482737 121696983 116550732 111849220 107006109 102585287 99236596 94782741
14214 94782741 91133547 87491911 84267050 81434983 78001902 75391413 72941991 70203010
14206 70203010 68009869 65510035 63668606 61348830 59224451 57296898 55556083 54117835
14198 54117835 52205544 50770072 49418052 47826725 46293405 45121681 44259542 43072811
14190 43072811 41478807 40753248 38987480 38289940 37217647 36480327 35386834 34829025 33772237
14181C3772237j170339j119398j03254o18179r78786n84072q98890m52454p88086
14172B7058779m61498r04106l06541m88979o90627p67908k44948n05207n71699
14163B2117266m04756m96953l44262l63510n39237j56327l80058m69364m51125
14154A8511674l44287j41712o34376m27577k90870k09793k55653k68975l08394
14145A5630037k18841l62828j64251j40051l65136q8210j84681m54992q3762o17819
14135A2949466p332j31363k38079j35771j16959l83313j93836J42682l83392j70109
14125A1331994o03269J18079J88134k07738k34357k02746n6905m87996q0893k8822
14115I735481j87193r869L12543o61865j33146k99054K13430k4915k27440o5941
$$ plain form
14181 33772237 32601898 31482500 31379246 30761067 29782281 29198209 28299319 27846865 27058779
14172 27058779 26597281 25693175 25386634 24897655 24207028 23439120 23194172 22688965 22117266
14163 22117266 21712510 21215557 20871295 20507785 19968548 19812221 19432163 18962799 18511674
14154 18511674 18167387 18025675 17391299 16963722 16672852 16463059 16207406 15938431 15630037
14145 15630037 15411196 15048368 14884117 14744066 14378930 14290720 14106039 13651047 13567285 12949466
14135 12949466 12942134 12810771 12572692 12436921 12319962 11936649 11742813 11885495 11502103 11331994
14125 11331994 10728725 10846804 11034938 10827200 10592843 10390097 10333192 9845196 9764303 9735481
14115 9735481 9548288 9538419 9850962 9189097 9055951 8756897 8970327 8945412 8717972 8652031
14105H652031l94299K75257k41656k72990Q3606k37860p8247J6122k77032J02408
14095G627340L1688m61758O07935q08212N4862k42658L0210k3965l31362m7864
14085F436216J24401l19150K95127l14336k27038M30828k51026k0491j97270j19970
14075E837291k89069L10288J318m13158k3215m9940K39242l17123j51644P3317
14065E217307j08153K1579J01525O43908r70600K46430l57192k36621N61611j39771
14055D980023q2007l29119L99000n3560j15708j84445l04220K23275k37894L41195
14045D636540j8522R4508j56797n8358j83870J44113m35956J15436J8959k36146
14035C919907k5217J83727l66854K87178l79109J53724j11242J31885k72595M2325
$$ plain form
14105 8652031 8257732 8532989 8291333 8018343 8101949 7864089 7785842 7801964 7524932 7627340
14095 7627340 7659028 7197270 7805205 6996993 7051855 6809197 6839407 6815442 6484080 6436216
14085 6436216 6560617 6241467 6536594 6222258 5995220 6426048 6175022 6154531 5957261 5837291
14075 5837291 5548222 5858510 5859828 5446670 5423455 5373515 5612757 5295634 5143990 5217307
14065 5217307 5109154 5130733 5232258 5876166 4905566 5151996 4794804 4558183 5119794 4980023
14055 4980023 4898016 4568897 4967897 4914337 4798629 4614184 4309964 4533239 4295345 4636540
14045 4636540 4618018 4712526 4555729 4497371 4313501 4457614 4021658 4137094 4156053 3919907
14035 3919907 3894690 4078417 3711563 3998741 3619632 3773356 3662114 3793999 3521404 3563729
14025C563729j00683K12637n3320j35992J2587k34888m3439l02696M24477o9074
14015C273338J05517j7184J41773j62702j11835k78680K20597j68095o9206M2744
14005B976267j37019j93375J16209N01344n40554m8367q3720J68865K66890n05810
13995B520730L74164o13061N00875j09276P2336n7358j08371M6801P1787k33909
13985B464718J33844k74607K09863l39084L80122m8892L14691N43608j46410M92752
13975C730605R71789J589003L248214N637414J0319637J0754680j1577305q480654
13967A6193383m925928k990485k053297p94060l94098o51981m34026m03182k65085
13958C281241j4340l91833n0974K10476m34136r515R9692J26258l12692j1322
$$ plain form
14025 3563729 3463046 3675683 3622363 3486371 3498958 3264070 3220631 2917935 3342412 3273338
14015 3273338 3378855 3361671 3503444 3340742 3228907 2950227 3170824 3002729 2933523 2976267
14005 2976267 2839248 2645873 2762082 3263426 2722872 2674505 2590785 2759650 3026540 2520730
13995 2520730 2894894 2281833 2782708 2673432 2745768 2688410 2580039 2626840 2698627 2464718
13985 2464718 2598562 2323955 2533818 2194734 2574856 2525964 2840655 3384263 3237853 3730605
13975 3730605 4702394 6291397 9539611 15177025 25496662 36251342 24674037 16193383
13967 16193383 11267455 8276970 6223673 5429613 5035515 4383534 3949508 3546326 3281241
13958 3281241 3266901 2875068 2824094 3034570 2600434 2590919 2690611 2816869 2504177 2492855
13948B492855j79291K315p5118K06208j7032l14270L32533k36202k75743J47940
13938B084195L09844l35993O09k03364K18091r4501Q6373J11749q8695l317j63391
13927A921600o7941J38565O4147k81110K84332k42685r8263K40191J29501q1108
13917B007229r3764M8223n7517j57294q0020J175j11300k01476N48358m20499
13907A483115N02744j83252j94779K41158j70569P9j87929O3005Q4287j05079
13897A532780L5822r8129L36467o48817K96665O4208J9992k01970M99407m17334
13887A419091K14324j29320M4648q6164j33873n3112m1891J56973j40498M9281
13877A299459o7932J74716r2542M7419q5218K86674k23766J43237l90668J97635
$$ plain form
13948 2492855 2313564 2315879 2240761 2446969 2429937 2115667 2448200 2211998 1936255 2084195
13938 2084195 2394039 2058046 2058655 1855291 2073382 1978881 2065254 2177003 2088308 2084991 1921600
13927 1921600 1853659 1992224 2056371 1775261 2059593 1816908 1718645 1958836 2088337 2007229
13917 2007229 1913465 1961688 1904171 1746877 1666857 1668032 1556732 1355256 1903614 1483115
13907 1483115 1985859 1802607 1607828 1848986 1678417 1678496 1490567 1553572 1637859 1532780
13897 1532780 1568602 1470473 1806940 1158123 1454788 1518996 1538988 1337018 1836425 1419091
13887 1419091 1633415 1504095 1548743 1462579 1328706 1275594 1233703 1390676 1250178 1299459
13877 1299459 1231527 1406243 1313701 1361120 1275902 1562576 1338810 1482047 1091379 1289014
13867A289014N1158J33913q8086k98785M20798k9247k62719P6975m7208j29954
13857A115859j41295M36231j8946q437n7146j00481O2049K29593n90836J54812
13847A081403K97935l27250m7538J44242J62719n79766O28734q0613q2030m64679
13837G33157K34965K53671j80817O67K1905Q3870j32559j05441P88821n36755
13827A161484P1864k39229j13884J36922P1501P966N2228j16496n0685l80543
13817F01128N24232o6635K5796k90665L21267j96610J31520k27290L47903l94866
13807G75780J87265l18046K04011K97726l76289K33044J49134j38582q5769K19741
13797A148015l85606M70035k19736k08041m275K62077m43659J33911J67967j05232
$$ plain form
13867 1289014 1340172 1474085 1385999 1087214 1508012 1478765 1216046 1293021 1245813 1115859
13857 1115859 974564 1410795 1391849 1383412 1326266 1225785 1287834 1517427 926591 1081403
13847 1081403 1379338 1052088 1004550 1148792 1311511 731745 1360479 1279866 1197836 733157
13837 733157 968122 1221793 1040976 1041643 1063548 1147418 1014859 909418 1698239 1161484
13827 1161484 1233348 994119 880235 1017157 1088658 1096624 1148852 1032356 981671 601128
13817 601128 1125360 1058725 1084521 793856 1115123 918513 1050033 822743 1170646 775780
13807 775780 963045 644999 849010 1146736 770447 1003491 1152625 1014043 928274 1148015
13797 1148015 762409 1232444 1012708 804667 800392 1062469 618810 752721 920688 815456
13787H15456J65987J77609m98404j5657J5805M28869k63483o5433O3678o9954
13777G54473L3471N031L699K05105l49145O57908n50980j55328K15959r4543K13305
13766I38955j30056J80876J92169m10621J65816m1725j3526k60124J38248J74202
13756I34214j85901K35607k49623M8458n1641N9562J24592p7429m0622l04322
13746D92895J81251J61503K02460l18850j28221B92374P64744m35529L65572n5853
13736I31308k45818L2468m506Q0107j1534r9258j05686K47705o7211j63887K15069
13725H08757K2774l03284M16985j78889l48416K43761q4702q8179K11023k67249
13715D32581L92109k33527L1633j27072J0687Q487M0457M5827O2278N7547J24557
$$ plain form
13787 815456 981443 1159052 660648 644991 660796 1089665 826182 760749 824427 754473
13777 754473 787944 792975 796674 1001779 652634 1310542 759562 604234 820193 725650 938955
13766 938955 808899 989775 1181944 771323 937139 895414 881888 621764 760012 934214
13756 934214 748313 983920 734297 782755 731114 790676 915268 837839 797217 492895
13746 492895 674146 835649 1038109 719259 591038 292374 1057118 621589 987161 931308
13736 931308 685490 717958 713452 793559 782025 682767 577081 824786 757575 593688 808757
13725 808757 831531 528247 945232 766343 417927 661688 576986 488807 699830 432581
13715 432581 824690 591163 622796 495724 506411 514898 555355 601182 663460 721007 845564
13704H45564O2886l80555J80886l22543L12476j35335N6775B50017K71522l5092
13694D86447J69535k55166L62830J2018K51014m19635q8736j6739K21612k9153
13684F94027K22427k50166j76161K47151K67537l98223j49795n999K11523j37414
13674E24907A80908O68876j59545k05712j10349K16662P2128j77931j6373J83259
13664F51923B35869M74304m2741j45104L58059C37493K79632j87433j631J97279
13654F25340N2952n4645k18187K35014O7897j17898O9303N275k66543P964o0823
13643C45649K14723L9079J9932J47944J1122A85916K60428j62556M09359J4054
13633G07201C38824J83494j13360M1666O141m6263R7162J18081K22072C75642
$$ plain form
13704 845564 908450 527895 708781 386238 698714 563379 620154 250017 521539 486447
13694 486447 655982 400816 763646 775664 1026678 607043 518307 501568 723180 694027
13684 694027 916454 666288 490127 737278 1004815 606592 456797 450798 662321 524907
13674 524907 180908 849784 690239 484527 374178 590840 662968 485037 468664 651923
13664 651923 235869 710173 667432 522328 880387 337493 617125 429692 428061 625340
13654 625340 678292 623647 405460 640474 708371 590473 659776 665051 398508 406472 345649
13643 345649 560372 599451 619383 767327 778449 185916 446344 283788 693147 707201
13633 707201 338824 522318 408958 450624 456765 410502 507664 625745 847817 375642
13622F15627r9516j64832j30244J74185m1251K84052j74748A0610N14611j88389
13612C36832L31524k17316N3573R381O2431j22284J80791Q6755k26906A27367
13601C83553J64617I4121L03508p2348k2656O1646R6934I7830K10069o1083J25474
13590C72290K33749l01210L78459I8756L72834j11596l8515n5001K29599L21315
13580H17392l78402B01866B5953J89731l2775L81670J83030k81795p5535G236
13569F95437A73343k6639L3675L29384A38870L61647M5884r9414j77557K07788
13559D77218P4871k36812Q4707l1603J60353k36757k0737L16225B03837J27117
13549C30954K44173A05951K71950J1587l7305o1087J90477p4167n3955j18170
$$ plain form
13622 615627 516111 351279 221035 395220 353969 638021 463273 10610 525221 336832
13612 336832 668356 451040 504613 513994 576425 454141 634932 721687 494781 127367
13601 383553 548170 94121 397629 325281 302625 364271 461205 97830 307899 246816 372290
13590 372290 606039 304829 683288 98756 471590 359994 321479 266478 496077 817392
13580 817392 438990 201866 25953 215684 182909 564579 747609 465814 390279 7236
13569 695437 173343 146704 180379 509763 138870 500517 546401 446987 269430 477218
13559 477218 552089 315277 399984 368381 528734 291977 271240 587465 203837 330954
13549 330954 575127 105951 377901 389488 352183 291096 481573 407406 353451 235281
13539B35281J1827P4892r4317J61530D0663N4283J33002K50804J1285B33440K6796
13528B60236K14307M33528B16222J41154N2418m903k1288J91202J250H9681K94828
13517C84509k7840j67040P8490L28336B31763O3978K54120A77175K26200j65030
13507B38345F1433K43073G6321R6575L15151A89679K68795R2409j6135j67618
13497C67130A20620J45295r7150K56040r4754j1786L32591C00322K24182B33901
13486B24744O8456M9379n3782O2389j52784J2783J79077o6207r6871n474I6199
13474C45854h1822I3466M29092n388k53262H1040K46247J51982B04793J59990
13464C64783j06209J5296J70139p3091H8747M8561J68061o128g6140D72951a1127
$$ plain form
13539 235281 247108 322000 227683 389213 40663 94946 227948 478752 490037 233440 260236
13528 260236 474543 908071 216222 357376 409794 404891 383603 574805 576055 89681 384509
13517 384509 356669 189629 268119 596455 231763 295741 549861 177175 403375 238345
13507 238345 61433 304506 76321 172896 488047 189679 458474 550883 534748 367130
13497 367130 120620 265915 168765 424805 330051 318265 650856 300322 524504 233901
13486 224744 293200 342579 288797 351186 198402 211185 390262 324055 227184 221710 96199
13474 345854 -81822 93466 522558 517170 263908 81040 327287 479269 204793 364783
13464 364783 258574 273870 444009 370918 88747 137308 305369 299241 -76140 472951 -11127
13452A29786J14184L50958k11271A23554K57165j18807o5631r631Q5724r3747
13442A78627R4990j0254j17572e568H0173O1991O6149j1454C6258M3323J04902
13431A84483p6836C6272J63668K8623M051J12863F768J82439B3418J02853K59935
13420C86206A80803b14951E68246A61980j6921J41995J25499j6369P6405p1696
13410D00893M9587O9122J4624B41721A2114b32168C93650m2565r7414j732J93534
13399D45473r6511A15032E6927O2148J08998J44301A04124M6172e7426G76L04715
13388C05491n6129l7481N1097P9801q3161K01644C4304J02143L17448A3269O3065
13377G6334Q5545L2685L15969j51920j76734K65940j63186j17122J85870k5239
$$ plain form
13452 129786 243970 594928 383657 123554 380719 261912 196281 186650 272374 178627
13442 178627 273617 263363 145791 -5568 80173 142164 208313 196859 36258 79581 184483
13431 184483 107647 36272 199940 228563 232614 345477 6768 189207 23418 126271 386206
13420 386206 180803 -214951 568246 161980 145059 287054 412553 396184 472589 400893
13410 400893 450480 519602 534226 241721 12114 -232168 393650 351085 253671 251939 445473
13399 445473 348962 115032 56927 119075 228073 372374 104124 150296 -57426 776 305491
13388 305491 249362 211881 262978 342779 259618 461262 34304 136447 453895 13269 76334
13377 76334 161879 194564 510533 358613 181879 447819 284633 167511 353381 328142
13367C28142o5661o3561J82992j46554n7594a10949A28513L29738c7138B38449
13356A82498k0839p2712J72211q0792J52689J18747B4359G416J24535L22848A94711
13344A78953K41841J88181B55413N6453I811K17068K8468J47954G8407J30344
13334B08751L7206p8037a16932C59007j28935F2003b5700B64912j21015J44942
13324B88839L84170A28386O3885a9694A80758J07089j6790O7450K21423B00049
13313A72134J54484A5179R3444L07915L248I8011K65942n1346H37J92428a18634
13301a21985B63536o3527p685L58929H4210Q7737o9244L19086D1637M04555j35573
13290C10619j44377i5730C86418A68374J17069F4216K15521i1191C24598n3440
$$ plain form
13367 328142 262481 198920 381912 235358 177764 -110949 128513 458251 -37138 238449
13356 182498 161659 88947 261158 180366 333055 451802 24359 7416 131951 454799 194711
13344 178953 420794 608975 255413 311866 9811 226879 255347 403301 78407 208751
13334 208751 245957 167920 -116932 359007 230072 62003 -25700 264912 143897 288839
13324 288839 673009 128386 192271 -19694 180758 287847 271057 338507 559930 200049
13313 172134 326618 15179 108623 416538 419786 98011 363953 312607 837 193265 -118634
13301 -121985 263536 200009 192324 551253 84210 171947 102703 421789 41637 446192 310619
13290 310619 166242 -95730 386418 168374 285443 64216 279737 -91191 324598 271158
13280B71158A27777F2194K04565j29857C8429h5240c2176G9486o080J43360D5
13268D87208k22195a7727C7699L2395a46789A47627J74501K5163I1274M6355K61760
13257C99389j88205G8097O7730m6619D5L80899d3761D48581a2711B06906k3626
13246A83280a4830A82497K19230E5509J07929l3154J72636I9059l4771K4031J45575
13235B33894A12601K10755A05278J24714b89695e8025H696J01841a52253B78673
13224H5046e8351A43054E4696L22249A69464A1137a3027G1212J45030a8775B17773
13212A81504j5911a46221A10055J12952J52689G4985K81090c9058r0345B81202
13201A98751a09746a5686B73553q7451k3886J13538F6756a73B14896q6754Q1700
$$ plain form
13280 271158 127777 62194 266759 136902 38429 -85240 -32176 79486 73406 216766 45
13268 487208 265013 -17727 37699 70094 -146789 147627 322128 347291 91274 137629 399389
13257 399389 211184 78097 145827 99208 45 380944 -43761 448581 -12711 206906 183280
13246 183280 -14830 182497 401727 55509 163438 130284 302920 99059 64288 88319 233894
13235 233894 112601 323356 105278 229992 -289695 -58025 8696 110537 -152253 278673
13224 85046 -58351 143054 54696 376945 169464 11137 -13027 71212 216242 -18775 217773
13212 181504 165593 -146221 110055 223007 375696 74985 356075 -39058 -129403 281202
13201 198751 -109746 -15686 273553 186102 162216 275754 66756 -173 214896 128142 209842
13190B09842E3167K36123m7415F2221i5818k30926B01943e3166A39105J62388
13180C01493a67258C21634a3547B77439K7429n4967A20698E9358a57663J1862
13170a45801A59833K18529j87133G3300O019l7082R0772g3119A78433i125C6131
13158d2841B66749F496J40328C684c9685B41239P0438H4105C945L94342D4852
13146B67690N0655A56342J78673f4355B7382h1952B84823a08081H0091L97842
13136D77933A32931P0259E1418K03503D7383c9471I3286c20084E1210K6598J25671
13125B03479q6583k917c30264B10902p363K63819e4315k1070C09741j52489g6455
13113A59570m611o6614L53765e7032B34600a45891f5504B32984a02351B78998
$$ plain form
13190 209842 53167 289290 241875 62221 -95818 -326744 201943 -53166 139105 301493
13180 301493 -167258 321634 -13547 277439 304868 249901 120698 59358 -157663 -145801
13170 -145801 159833 378362 191229 73300 79319 42237 133009 -73119 178433 -9125 36131
13158 -42841 266749 6496 146824 3684 -39685 241239 311677 84105 3945 398287 44852
13146 267690 318345 156342 335015 -64355 27382 -81952 284823 -108081 80091 477933
13136 477933 132931 203190 51418 254921 47383 -39471 93286 -320084 51210 77808 203479
13125 203479 116896 113979 -330264 210902 203539 467358 -54315 -75385 309741 157252 -76455
13113 159570 154959 88345 442110 -57032 234600 -145891 -65504 232984 -102351 278998
13102B26896L14687D6522a00912H5808J33085j08805F091J27231a9101o8474C69499
13090d3534B52749c1571A65636M4290a60321j0754a9421C5144A2122J30921P9348
13079B22391f686C63088I5374b66333b1544H5548J00467B2890B344K42448o2355
13068A82437K0300E1327d1144A87625K56766a37457N6340C8254E57L42729e0901
13056B98782B8239J37502e0223B99786f4638B6109q815a42584C67590A62250J11934
13045B74184e9825K7110A62958G7836e9202b0282A78543K7171D2741J92897q0140
13034A55498o1646e9111A48916k0584k3777J95281h8825D30519H8197b25333Q5783
13023a39550B44785i6392o8848A40504e7108B42836j18345J38996A20579h048
$$ plain form
13102 226896 541583 46522 -100912 85808 218893 110088 6091 133322 -19101 -87575 369499
13090 -43534 252749 -31571 165636 209926 -160321 -171075 -19421 35144 12122 143043 222391
13079 222391 -6686 363088 95374 -266333 -21544 85548 186015 22890 2344 244792 182437
13068 182437 202737 51327 -41144 187625 444391 -137457 -81117 38254 557 343286 -50901
13056 298782 28239 165741 -50223 299786 -64638 26109 17294 -142584 367590 162250 274184
13045 274184 -59825 -32715 162958 77836 -59202 -20282 178543 205714 42741 235638 155498
13034 155498 93852 -59111 148916 128332 104555 299836 -88825 430519 88197 -225333 -139550
13023 -139550 244785 -96392 -165240 140504 -57108 242836 124491 263487 120579 -8048
13012C78120A6162d2616E67112A5295K6082i4618C03710D3463J86314L60666A06681
13000A71184c85646A31621b0402D81261a2471k7607H1579N9295a4184C38839j37225
12989B01614n3999b05176e990A88439I3602J16242K2421a21436A03473J64837
12979B68310J5798c06086B35422k2866H754a8270j5793J2452A11377K65787d4258
12967i5507C30877c4077A41098J83510i239F8677K4228a16216j14731C83464i211
12955G4722J88992b7731B3253J36424a7593k53831A07721c41688a4227A89667
12944a49348f017A44142e845D78718A08966J488e8720o7794k6868A49273D3120
12932B9522c36187J18093A20352n5727K99410a6308k95067e7574J9182A30122
$$ plain form
13012 378120 16162 -42616 567112 15295 41377 -94618 303710 43463 229777 590443 106681
13000 171184 -385646 131621 -20402 481261 -12471 -40078 81579 140874 -14184 338839 201614
12989 201614 147615 -205176 -5990 188439 93602 209844 232265 -121436 103473 268310
12979 268310 284108 -306086 235422 212556 8754 -18270 -34063 -21611 111377 377164 -44258
12967 -95507 330877 -34077 141098 324608 -9239 68677 92905 -116216 -230947 383464 -9211
12955 74722 263714 -27731 23253 159677 -17593 -271424 107721 -341688 -14227 189667
12944 -149348 -6017 144142 -5845 478718 108966 110454 -58720 -126514 -153382 149273 43120
12932 29522 -336187 -218094 120352 64625 364035 -16308 -311375 -57574 -38392 130122
12921a75460H851J38014d7994G0492k2540b25019B6673R1890f8114j10811G216
12909A46165D8332K3116b01901M4973E4908K416J9145K2374a31588C603K4863
12898B8466J61086f3929B55617a65727N7272N3794q1501D5157J97459G6174l4347
12887D1827d4151A92540G8183a7928o9069h959D28002C2452f4840A00429J5161
12876A15590J98840f5461B02667a46806B11867j0944a45326e9297b224A5868b20551
12864H2331h2789C1567b2274A92543E3377Q6583Q0189A4922L8799M4537m567a37864
12851B06917e11295B22031j4597J17521r4266b21841c2572B85756F2019d33987
12840D47820A09770e2857H2621b99472a17723k2783n7370O2675A96774d6914D6207
$$ plain form
12921 -175460 8851 146865 -47994 70492 47952 -225019 26673 118563 -68114 -178925 7216
12909 146165 48332 71448 -201901 -156928 54908 57324 76469 98843 -131588 3603 28466
12898 28466 189552 -63929 255617 -165727 -108455 -54661 -136162 45157 242616 76174 41827
12887 41827 -44151 192540 78183 -17928 -86997 -8959 428002 32452 -64840 100429 115590
12876 115590 314430 -65461 202667 -146806 211867 200923 -145326 -59297 -2224 15868 -220551
12864 82331 -82789 31567 -22274 192543 53377 139960 220149 14922 53721 98258 93691 -137864
12851 206917 -511295 222031 207434 324955 230689 -221841 -32572 285756 62019 -433987
12840 447820 109770 -52857 82621 -299472 -117723 -140506 -197876 -135201 196774 -46914 46207
12828b12593j34726A05899j2621a94869A74830F3718K64117H1349j0426K68627
12818C39550e5650D1828J56725d8643J3119B9086J57979a06809B65501b25615
12807b90258K6846c4719F0985J05128L7504l8612e6397r3693B64410B9568F893
12795A3227L2840f0229A32746a27274p6278d7884B66930a54069n9934b6166B54827
12783b26854h705j80364e9715A42164a3984l34014A57724g7344F1272J35928K9216
12772B26416B1826c28665O3775b982A20735k9590a8051A08749B8347K46881i0478
12760A5240K62380g3893A09106J06987c538l67480a32014C981a42386d371l30064
12749c34435J64278C51488E2459a53866N1820B24090F277c11027G1085d9633E09225
$$ plain form
12828 -212593 -347319 105899 93278 -194869 174830 63718 327835 81349 70923 339550
12818 339550 -55650 41828 198553 -48643 -35524 29086 187065 -106809 265501 -225615
12807 -290258 -263412 -34719 60985 166113 203617 165005 -56397 -150090 264410 29568 6893
12795 13227 46067 -60229 132746 -127274 -203552 -47884 266930 -154069 -214003 -26166 254827
12783 -226854 -8705 -189069 -59715 142164 -13984 -347998 157724 -77344 61272 197200 226416
12772 226416 21826 -328665 -264890 -2982 120735 91145 -18051 108749 28347 275228 -90478
12760 15240 277620 -73893 109106 216093 -3538 -371018 -132014 3981 -142386 -4371 -334435
12749 -334435 -170157 351488 52459 -153866 -102046 224090 6277 -311027 71085 -49633 509225
12737C14826a08199j12569B15129b29989C3174Q4422p161o255a8868j84436B98404
12725A8281R1677R647E3683a9576j02299C86541f8118F7202O7349d319F2362e5661
12712B26782e812r625I1793k4496e1579j59927c3146j57564B4675a73416J9731
12701a53685r1928i3759B6820e7151A90251b86464G8846C7790O3281M60091b8868
12689D42574H5251e1541A86723F4749P6625L1657a33364c0273I6339O1240F0960
12677f469E2373J01679F0267O6034b10487A22752d81B25157K07077E9910l86b63751
12664e5144a9327d918H6607L1610a97177B78212J51310j25719b16651H2993O4980
12653A47973E8377N9581O3049O619e7720C96082A39676J2689a3219A14777L9142
$$ plain form
12737 314826 -108199 -220768 215129 -229989 33174 117596 110435 104180 -18868 -203304 298404
12725 18281 109958 119605 53683 -19576 -121875 386541 -68118 67202 134551 -4319 62362 -55661
12712 226782 -5812 -15437 91793 67297 -51579 -211506 -33146 -190710 24675 -173416 -153685
12701 -153685 -245613 -93759 26820 -57151 190251 -286464 78846 37790 101071 561162 -28868
12689 442574 85251 -51541 186723 64749 141374 173031 -133364 -30273 96339 157579 60960
12677 -6469 52373 154052 60267 126301 -210487 122752 -481 225157 432234 59910 59524 -263751
12664 -55144 -19327 -4918 86607 118217 -197177 278212 429522 303803 -216651 82993 147973
12653 147973 58377 117958 181007 187626 -57720 396082 139676 152365 -13219 114777 153919
12642A53919a20682F2437j6201A5438o207a56811L1856c0683j77986C8227J3067
12631E1294h9833o4834B86690i4591l9545F6762B0117K60406A5827l75o831K30254
12619B38875B0000M2243K08845b5358C66890C5893J99136k4693m7021G0645M18910
12608D89555a406B9920M1926K75273B8709L23708l799a2686G3974M55578c0628
12596a69228A58580d8187j30612C7815A5749M1235K7414a05551A60275h2932D13442
12584B21058C3776b71315B1849c19767G2401k9133a38459f4857B13835l4025A1650
12572B35946A03724D0487K69763A6621b37206a1020D5817K60208b596E3506b09392
12560a09377e273A32661C5614a27644C1914h3664C27801b41049i815B22257o813
$$ plain form
12642 153919 -120682 62437 46236 15438 9231 -156811 -124955 -30683 -208669 38227 51294
12631 51294 -89833 -154667 286690 -94591 -134136 66762 20117 280523 15827 15452 8621 238875
12619 238875 20000 62243 271088 -25358 366890 35893 235029 210336 163315 70645 489555
12608 489555 -1406 29920 71846 347119 28709 352417 348618 -12686 73974 529552 -30628
12596 -169228 158580 -48187 -178799 37815 15749 56984 84398 -105551 160275 -82932 413442
12584 221058 33776 -271315 21849 -319767 72401 43268 -138459 -64857 213835 179810 11650
12572 235946 103724 40487 310250 16621 -237206 -11020 45817 306025 -2596 53506 -209392
12560 -109377 -5273 132661 35614 -127644 31914 -83664 327801 -241049 -9815 222257 215444
12549B15444A03547J00108b15187l6707i1308K2853B90459E373a01643A03318
12538e4588C54231a70729f8659r4565G2645a14131i526E6682a35953d7763B52436
12526a69622j26735a27158B2440a15668A66689f8244j52542a06250H315R4241
12516A02556L4326c02158A56487d0483A36378c3969q6908j8297j33087B162K66652
12505B68814D5109A6787c0035A92733a17451d6191A77294i7628A95468C5616A5929
12493E5794i0830B46081m5506d64335d2412A25233M0260a6623m0078D45091j34770
12482C10321A15619q221l3658a4900D1271a15939A96094f516j6711H453a97627
12470C0927a09722A01982d6762B27692H2152b02411p0274k11342H2654b16104
$$ plain form
12549 215444 103547 203655 -215187 -251894 -91308 -68455 290459 5373 -101643 103318
12538 -54588 354231 -170729 -68659 -163224 72645 -114131 -9526 56682 -135953 -47763 252436
12526 -169622 -296357 -127158 22440 -115668 166689 -68244 -220786 -106250 8315 102556
12516 102556 136882 -302158 156487 -40483 136378 -33969 -120877 -139174 -272261 2162 268814
12505 268814 45109 16787 -30035 192733 -117451 -46191 177294 -97628 195468 35616 15929
12493 55794 -90830 246081 200575 -464335 -42412 125233 165493 -16623 -56701 445091 310321
12482 310321 115619 107398 73740 -14900 41271 -115939 196094 -6516 -23227 8453 -197627
12470 30927 -109722 101982 -46762 227692 82152 -202411 -272685 -484027 82654 -216104
12459A3499e02939a12239j01333B29487l314F2997N8799h254A48782g420I384
12447g9730J5641K2729l376A11410J21449h3443r0817A7090a26275D8326b63771
12435b98422a9567p5674j77761j34904I7723J33911i2628C04462b57006J09795
12425a47211A50643b47669A2687K59920g2966F2422L416f8158o485j43397g376
12413A07108k0049J29m1709J74826a07748D5315b96108i1094K4764A3818g42A88510
12400A1708g723C824h3989F8338a61247A1580J10903e944k0614d19j90917O9703
12388a21633C75011b77386N6166c4762A29062k89a96360A50244a8666r9768j61919
12377b80353h7032A6664J46167P0409J1100b58666G1212B8520i3128g105k42096
$$ plain form
12459 13499 -502939 -112239 -213572 229487 226173 62997 121796 -8254 148782 -7420 9384
12447 -79730 -64089 -41360 -44736 111410 232859 -83443 -174260 17090 -126275 48326 -263771
12435 -298422 -19567 -95241 -273002 -407906 97723 231634 -92628 304462 -257006 -147211
12425 -147211 150643 -247669 12687 272607 -72966 62422 65838 -68158 -74643 -218040 -7376
12413 107108 87059 87188 45479 220305 -107748 45315 -296108 -91094 -66330 13818 -742 188510
12400 11708 -7723 3824 -83989 68338 -161247 11580 122483 -5944 -26558 -419 -191336 -121633
12388 -121633 375011 -277386 -221220 -34762 129062 128773 -196360 150244 -18666 -118434 -280353
12377 -280353 -87032 16664 162831 233240 244340 -258666 71212 28520 -93128 -7105 -249201
12366b49201J5962C7650e5971H1484G852K6025L07886a9249I0391J07894N706
12355B03991R0562a05650H7880J71793K2028b12143B85265F3590J06544i0174
12344B81051a40556B24772K4187p6381a62083f414C0491f8329A54561o3093B7117
12332A32513K74464A60708g6643C63248f8775A19469J85373L370N9359j37668
12322B29903o1826e9458C05666b08309C27717j12273r7995b130C21381D4022K76942
12311C20964H0554Q6869J57497J0943R3631j79989a25976B48234j1169I8727j2301
12300H6426M7604J81422P8822E6702P9996o1636J56312b11097B14660E2901b15758
12288A4626f6108J9712C99051l0864H3102N07108G9936o454e6975I8015J46909
$$ plain form
12366 -249201 -233239 37650 -55971 81484 7852 33877 341763 -19249 90391 198285 203991
12355 203991 294553 -105650 87880 259673 281701 -212143 285265 63590 170134 -90174
12344 281051 -140556 224772 248959 172578 -162083 -6414 30491 -68329 154561 91468 27117
12332 132513 406977 160708 -76643 363248 -68775 119469 304842 308212 367571 229903
12322 229903 168077 -59458 305666 -208309 327717 215444 117449 -2130 321381 44022 320964
12311 320964 80554 167423 324920 335863 429494 249505 -125976 248234 237065 98727 86426
12300 86426 134030 315452 394274 56702 136698 75062 231374 -211097 214660 52901 -215758
12288 14626 -66108 -46396 399051 368187 83102 590210 79936 73482 -56975 98015 244924
12277B44924j8647i9686F2907A9834Q6065e2684a5143G5860a35623C09278A23537
12265A75072H5477J9074j0071C9608b9175l30330e4923a3768F7809R3606D1218
12253C431M91634c659A60738B8875K61544j32317C3674K64183A16337p822J04167
12242B12682n2887k5949J17601E5750a39123k76807C23204a18514C98381A72357
12231a77206A36008e1135A99721h9649n7145A51493K18947j55598H9288A005g8762
12219A91181g2683D6560O7435C5003K17202f7906A41194j6691e4487j9270q2422
12208a56179C02777A13682K17853r7600j02472C2028J85317A6037O2019J79933
12198B57989N1021A17072d635C27678M5951j5301b05601A60376J95965j06996
$$ plain form
12277 244924 226277 -99686 62907 19834 105899 -52684 -15143 75860 -135623 309278 123537
12265 175072 85477 104551 94480 39608 -29175 -359505 -54923 -13768 67809 161415 41218
12253 3431 495065 -3659 160738 28875 290419 158102 33674 297857 116337 108515 212682
12242 212682 159795 133846 251447 55750 -139123 -415930 323204 -118514 398381 172357
12231 -177206 136008 -51135 199721 -89649 -146794 151493 370440 214842 89288 1005 -78762
12219 191181 -72683 46560 113995 35003 252205 -67906 141194 124503 -54487 -73757 -156179
12208 -156179 302777 113682 331535 233935 131463 32028 217345 16037 78056 257989
12198 257989 309010 117072 -4635 327678 373629 358328 -205601 160376 356341 249345
12188B49345b5985C31898j48945b7388h096A45951R3884J18853j14547c775C59236
12176g612A65370L8575M3907E8181N14194A54266O4515p3879J21951A12985b3131
12164C20609A31189L63383k46093A10141e2120A37410M94999A4617m046J97446
12154B08017A1262J22421g2021D63119Q1180B33039N847R9034k5889A51666R3082
12143B44748j07899a36086a6247B29013j10698J7462K2783M3308p9819J38806
12133B60855D1056K80170g6950A07698c25829D7400b22614B19294p3658a88731
12122B5295b41157G3419b70906A48758R7419E2853L60127A35632c3124C78794
12111A23332J81588J1231K0856A14838J43275J11108j28623O4793A18970D7078
$$ plain form
12188 249345 -25985 331898 182953 -27388 -8096 145951 239835 358688 244141 -3775 359236
12176 -7612 165370 203945 247852 58181 572375 154266 218781 144902 266853 112985 -23131
12164 320609 131189 494572 248479 110141 -52120 137410 632409 14617 10571 208017
12154 208017 11262 133683 -72021 463119 544299 233039 238886 337920 312031 151666 244748
12143 244748 136849 -136086 -16247 229013 118315 135777 158560 201868 122049 260855
12133 260855 41056 321226 -76950 107698 -325829 47400 -222614 219294 145636 -188731
12122 25295 -241157 73419 -270906 148758 246177 52853 412980 135632 -33124 378794
12111 123332 304920 316151 337007 114838 258113 369221 240598 305391 118970 47078
12100C24805J732j53258i4189l2455B10821g0170l71151C04484q9673o5503m1929
12089A07379d7835B38802J09249j33759K3166B8357Q1692k8514B3495J89483O1285
12078B74263J31220a05086B8462j3287i7886B63791j24330B1891J03575m844f2697
12066D7347N3574a09227B01963F2036A0787K19540D1765J24636Q3266q2261F8873
12054H7092J24131j03356G884K46221A05637Q8660b80441E2742c73j39484A0695
12042h0009A61321l1996n8261b26041R2239k00807c1155A18363D6242J7278K05888
12031B69408j12483c91336N2060E2203a02946n67B3960J71031R2159d2070A90300
12019a07702F0537f0574C631J43799a11595j74692J32233f3365B40617C8903K59487
$$ plain form
12100 324805 326537 173279 -94189 -126644 210821 -70170 -441321 304484 214811 149308 107379
12089 107379 -47835 238802 348051 214292 237458 28357 110049 81535 23495 212978 274263
12078 274263 405483 -105086 28462 15175 -97886 263791 139461 21891 125466 120622 -62697
12066 47347 100921 -109227 201963 62036 10787 230327 41765 166401 249667 167406 68873
12054 87092 211223 107867 7884 254105 105637 194297 -280441 52742 -373 -139857 10695
12042 -80009 161321 129325 71064 -226041 -133802 -334609 -31155 118363 46242 63520 269408
12031 269408 156925 -391336 -339276 52203 -102946 -103513 23960 194991 287150 -42070 190300
12019 -107702 60537 -60574 3631 147430 -111595 -286287 -154054 -63365 240617 38903 298390
12008B98390g9175B78541a45669A65568A1628g6313A23659M408n0623Q3002J45813
11997C06259C8527A8739K8334N9899J55078p7103D5822J06189C2513O1804J96066
11986B90383c56332a31111N168A95367E2736g0982H2225g2431m02482C90327b29849
11974c0439o5975c6971b491n7129a4195j68567k2647Q0068c04p5793A63094a31444
11961d3765A99142e3972B89591H0361C0704b16289Q6376J8584j62670F7449K44043
11950C11492j31338J2214D5515i5423A51293a5777B61749c8270A5164c41008B43919
11938H6728e3698A81065c68414E2287c40756A39844i6856B55631a82747A76315
11927b06914C09370b09566f7450r726B4737O6746a28890I7787b46798K8187j127
$$ plain form
12008 298390 -79175 278541 -145669 165568 11628 -76313 123659 128067 77444 160446 306259
11997 306259 38527 18739 47073 106972 262050 184947 45822 152011 32513 94317 290383
11986 290383 -356332 -131111 -125943 195367 52736 -70982 82225 -72431 -474913 390327 -229849
11974 -30439 -96414 -36971 -2491 -59620 -14195 -182762 -205409 -125341 -304 -76097 163094 -131444
11961 -43765 199142 -53972 289591 80361 30704 -216289 -129913 -111329 -273999 67449 311492
11950 311492 180154 192368 45515 -95423 151293 -15777 261749 -38270 15164 -341008 243919
11938 86728 -53698 181065 -368414 52287 -340756 139844 -96856 255631 -182747 176315
11927 -206914 309370 -209566 -67450 -77176 24737 91483 -128890 97787 -246798 -218611 -219738
11916b19738A31788a29924A75242n4783C5892c79512I3679l5505A7633J56539
11906A74172b62936M1422a2296j29439D7685K56209H0163J8806f0620k05040h274
11894a39435k1419j73963B18949J04787H9890b67106M987A43727J47399j24256
11884A66870a296k6663C56730j53868b47154c7944j24265L1145p1783B52845c9213
11872a80312C10651H971O9652e4883l05943a5165k16422h8136J9762b2973A65740
11860d7305m4867C4753M5348K995d7446D6895j4599c8521l5031C6031A4866J79834
11848A94700a09786L8458B0623O2684P7462c97169a66135B47315b36955l0015
11838b66970j7637A05509C6306N729b10864K6473b1411j8206j3684k8417A33708
$$ plain form
11916 -219738 131788 -129924 175242 120459 35892 -379512 93679 58174 17633 174172
11906 174172 -262936 -221514 -12296 -141735 47685 303894 80163 98969 -60620 -265660 -8274
11894 -139435 -160854 -334817 218949 323736 89890 -267106 -262119 143727 291126 166870
11884 166870 -1296 -27959 356730 202862 -247154 -37944 -162209 -131064 -202847 252845 -39213
11872 -180312 310651 8971 78623 -54883 -360826 -15165 -231587 -88136 -68374 -22973 165740
11860 -47305 -92172 34753 80101 83096 -47446 46895 32296 -38521 -73552 36031 14866 194700
11848 194700 -109786 -71328 20623 83307 160769 -397169 -166135 247315 -236955 -266970
11838 -266970 -284607 105509 36306 42035 -210864 -184391 -21411 -39617 -53301 -81718 133708
11826b48315H2773K67117C9669a29200B57110f7169j42888a01619A21989c04672
11815b61252D3552K4709e05921a34515b159l49559N8473L5076I7791a26635k10368
11804c37003c5884j22270l2448A59944g5436K4417B29873g7199k93388J39617
11794b30970J14649A95551c21045H804J16781c11398h6451A73672g7295F4166
11783C06242a55569g7489j40499p0598a16141A39349B9529a4791E27144a9157
11772a86268B10634m0821a52630A6756b83419A98700a35963k30463J68149P4079
11762a24198k22727B09384a39240A06100J44294d0076j43986m715A0888b13762
11751C15019a90285n5945f7064j24954e7855A4260L3433K6404J29017p1177N480
$$ plain form
11826 -248315 82773 349890 39669 -129200 257110 -67169 -210057 -101619 121989 -304672
11815 -261252 43552 68261 -505921 -134515 -2159 -351718 -293245 -258169 97791 -126635 -337003
11804 -337003 -35884 -158154 -190602 159944 -75436 -51019 229873 -77199 -370587 -230970
11794 -230970 -116321 195551 -321045 8804 125585 -311398 -86451 173672 -77295 64166
11783 306242 -155569 -77489 -217988 -288586 -116141 139349 29529 -14791 527144 -19157
11772 -186268 210634 169813 -152630 16756 -283419 198700 -135963 -366426 -198277 -124198
11762 -124198 -346925 209384 -139240 106100 250394 -40076 -184062 -188777 10888 -213762
11751 315019 -190285 -246230 -67064 -192018 -57855 14260 47693 74097 203114 131937 137417
11740A37417d0314J1306B50817G5425J77186a67114a5685n2516A40096M4185d2298
11728a75092h4378E4146h7014F9134k5963a26898B5447J47187b10815b8782j57744
11717a86526B04285K9737r8974h1267H928Q9931a16680H9715R7664p9914B2878
11705h5596C5614b73649O3987N491l47276a72101C6207J36288K05861j11872I9482
11693e0803A20777Q952A4023b0045B32515f5553b7823R344j20738B84119o1748
11682B22371g0505B08824F5604J52248c7494G6445K36064a86045b0015B43053
11671B06820I0923J18082J01843A53840J78798c171B02605n8164m0050a46348
11660a08304F1799r996K66914A16788j7960a8789A17284i0144b8211C70860C2634
$$ plain form
11740 137417 -40314 -29008 250817 75425 252611 -167114 -15685 -68201 140096 184281 -42298
11728 -175092 -84378 54146 -87014 69134 43171 -126898 25447 172634 -210815 -28782 -186526
11717 -186526 204285 234022 135048 -81267 8928 98859 -116680 89715 187379 107465 22878
11705 -85596 35614 -273649 -209662 -204171 -551447 -172101 36207 172495 378356 266484 99482
11693 -50803 120777 129729 14023 -20045 232515 -65553 -27823 -18479 -139217 284119 222371
11682 222371 -70505 208824 65604 217852 -37494 76445 312509 -186045 -20015 243053
11671 206820 90923 209005 310848 153840 332638 -3171 202605 144441 104391 -146348
11660 -108304 61799 51803 318717 116788 98828 -18789 117284 -90144 -28211 370860 32634
11648a00231l6715K6057A50832b88930h7985M198b9200j66437Q2706F7679J1247
11637G8926f6668p916l4836F6628N5096a61376A9227c1458B41914a58690l0776
11626a89466h8226a1259A35094m8031l4425b00842C48283b35134a04525o1735
11616a66260B00567a37728q734k04373i3483l0451B01287b3975I9997D2122a55940
11604a13818A16265L248d2916A89978r4799c8483a7561h415A775c57802F145a26880
11591c8788C0775K00914b70621A00813b31505b0347j95046C51313a27902n6031
11581a83933D5614a26367f088A99457J0582b84032N3048L9476g7692A27790b59014
11569A90417C5918K01289I9989N1502d5855A68319O6668K7506m7861m1532A4923
$$ plain form
11648 -100231 -136946 -110889 150832 -288930 -87985 -83787 -29200 -195637 -112931 67679 78926
11637 78926 -66668 -74584 -109420 66628 121724 -161376 19227 -31458 241914 -158690 -189466
11626 -189466 -88226 -11259 135094 87063 52638 -200842 348283 -235134 -104525 -166260
11616 -166260 200567 -137728 -146462 -350835 -93483 -123934 201287 -23975 99997 42122 -155940
11604 -113818 116265 119513 -42916 189978 95179 -38483 -17561 -8415 1775 -357802 6145 -126880
11591 -38788 30775 231689 -270621 100813 -231505 -20347 -215393 351313 -127902 -183933
11581 -183933 45614 -126367 -6088 199457 210039 -284032 -230984 -191508 -77692 127790 -259014
11569 190417 35918 237207 99989 151491 -45855 168319 234987 262493 214632 173100 14923
11557A8616g490j48510B6744J12578c88109D25499j04153i5408B17747c88448
11546B23300b24846A12877K0379D6336P6984a46004M9692F7018a6815m440I516
11534A29641K78459A24718K86355a20313r204a0471A35167c54941a26218o5521
11524a91739A5200b07569A45671C0420J39647J66910I6889c7107j30663B71573
11513A71648Q9986a17183A54572k491J9558q5399C3585i6537A02195J61251b45279
11501D6641A6201K23741J6271a9860R738A841K964c22766f7160E3028f8636C29779
11488I0507K68710A77869b20158B55001j2363k5042E3055J14430m6105J39068
11478B60448J18066c6961B86190B3032a01863A00696e9427C0530b7453j20789
$$ plain form
11557 18616 -7490 -156000 26744 139322 -388109 425499 321346 -95408 217747 -388448
11546 223300 -224846 112877 133256 46336 123320 -146004 -96312 67018 -16815 -21255 9516
11534 129641 408100 124718 411073 -120313 -129517 -10471 135167 -354941 -126218 -191739
11524 -191739 15200 -207569 145671 30420 170067 336977 96889 -37107 -167770 271573
11513 171648 261634 -117183 154572 152081 171639 86240 33585 -96537 102195 263446 -245279
11501 46641 16201 239942 256213 -19860 -10122 1841 4805 -322766 -67160 53028 -68636 329779
11488 90507 359217 177869 -220158 255001 242638 217596 53055 167485 121380 260448
11478 260448 378514 -36961 286190 23032 -101863 100696 -59427 30530 -27453 -148242
11468a48242B53399b42326A71278c17744e9643A24815K12269f5432C37161a48670
11457c09614N0213B58550i3051C09892B7414b47784B61181J07275j63617E05K29561
11446B30066J9865e3912A82075A308J54983N1534c6861A75046g647k4930n718
11435c8295p5916j10878A44032J04816a29097A2944c028j76976B42210j0202f589
11423B47834E6047J36508H9447J07134L7587e73A18886K40806a44902k74674B81796
11411a25077A54881b01776A12190K14453a12127k86525C36947b01418j5165C3888
11400a61005j79859f1494F3068a14330d3925I8498L8294C4391d0090j16303H6999
11388E6591J87535A16263l1639a1227m2581A06092J89505C3282K01687j2064I1078
$$ plain form
11468 -148242 253399 -242326 171278 -317744 -59643 124815 337084 -65432 337161 -148670
11457 -309614 -259401 258550 -93051 309892 27414 -247784 261181 368456 204839 505 230066
11446 230066 249931 -53912 182075 1308 156291 207825 -36861 175046 -7647 -32577 -38295
11435 -38295 -114211 -225089 144032 248848 -129097 12944 -3028 -180004 242210 232008 -6589
11423 247834 56047 192555 89447 196581 234168 -573 118886 359692 -144902 -419576 281796
11411 -125077 154881 -201776 112190 326643 -112127 -398652 336947 -201418 -216583 33888
11400 -161005 -340864 -61494 63068 -114330 -43925 98498 136792 34391 -40090 -156393 86999
11388 56591 244126 116263 84624 -11227 -53808 106092 295597 33282 234969 222905 91078
11376G5690a22856A16006e4255k49870C7014a39263f3841A24505P1798a47933
11365a47376g183B0420J28503a41975F7060J39669f9974B33820g860A34020o4104
11354F9916K52780j7022b63248R5273A50973k5352J18084I1154A0337e178E5212
11342a67602j75503G0129f5445k7461j76597h1432A05649B368O1432b72795I2996
11330a20499B0433J14565a36448D21740H4096B0440K9015a89687d723m740C11695
11318A49367N5302g3752K7322j43465A37310c85710M8931a61722a5416B5291m067
11307B1224J28551a09105A668b63680R0411P8657F2633a57161A1678K46796f8092
11295f4900l1016J2005q9415A63750a51807A43798K0974b1088k60102g8446k29996
$$ plain form
11376 75690 -122856 116006 -54255 -304125 37014 -139263 -63841 124505 196303 -147933
11365 -147376 -7183 20420 148923 -141975 67060 206729 -69974 233820 -7860 134020 69916
11354 69916 322696 305674 -263248 -167975 150973 125621 243705 91154 10337 -5178 55212
11342 -167602 -343105 70129 -65445 -92906 -269503 -81432 105649 2368 63800 -272795 92996
11330 -120499 20433 134998 -136448 421740 84096 20440 49455 -189687 -4723 -9463 311695
11318 149367 204669 -73752 -46430 -189895 137310 -385710 -336779 -161722 -15416 25291 21224
11307 21224 149775 -109105 1668 -263680 -173269 -94612 62633 -157161 11678 258474 -68092
11295 -64900 -95916 -83911 -173326 163750 -151807 143798 164772 -21088 -281190 -78446 -308442
11284c08442B01989c0590j30507A56450N7305c78598B00614b94135A12060a63439
11273F6316a16265j23479A5927N2684e846m8535A2057a69826N9649B0339a71773
11261d711k37849J07519j002j43906C28980J89739B56237m960f23j15754B19271
11249F1277Q3295b80729D62564b45858a12227C9363a05253D9430j1785d285j12527
11238a16812j9882N2224j39129Q4411j4800A98318c92487j49730C2876L18920
11228C51796f845n6300a5237A28998c33013B6215a55307N2673G1219K00792j26550
11217A45461I330b47315b152j0089B81017d8162o5096F5713P3677O6790N7967
11206B64147F9393h3179j5508a705F1418A158J44528b02064k05569J74383J9010
$$ plain form
11284 -308442 201989 -30590 -161097 156450 213755 -378598 200614 -294135 112060 -163439
11273 66316 -116265 -239744 15927 68611 -5846 -54381 12057 -169826 -110177 20339 -171773
11261 -4711 -242560 -135041 -136043 -279949 328980 518719 256237 251277 -623 -116377 219271
11249 61277 144572 -280729 462564 -245858 -112227 39363 -105253 49430 37645 -4285 -116812
11238 -116812 -136694 -84470 -223599 -139188 -153988 198318 -392487 -542217 32876 351796
11228 351796 -6845 -63145 -15237 128998 -333013 26215 -155307 -102634 71219 272011 145461
11217 145461 9330 -247315 -2152 -12241 281017 -48162 -113258 65713 139390 206180 264147
11206 264147 69393 -83179 -98687 -1705 61418 1158 145686 -202064 -407633 -233250 -214240
11195b14240A89835d9226A19853C8081O6571j4337b33117a7972D9363a41193H8160
11183a30172C4367a86223E4655j0076k599d20840F6092b57052A26784K202a85542
11171c41224D1788N6145a35867A06121R0896o1951d4989m9260q2377q8764R4870
11160a70520A7838a59138a3581o6455O454j590B36139C8969K7705b74747G2370
11148b61194j46461d0571n5836j73673a03286K2052L4982D17423I2018g3205k43374
11137c16579a44582j81897B2540m745b0019j55322a7127q8881B08855F215N2901
11126E9116h9187D2486a5646m0640j41903a3804l31643A58839E3819J82271b30113
11114e264r0015c4445k00017A2641a43078f90j368j97544A58937G5488c7836F1745
$$ plain form
11195 -214240 189835 -49226 119853 38081 104652 90315 -233117 -17972 49363 -141193 88160
11183 -130172 34367 -186223 54655 44579 41980 -420840 66092 -257052 126784 128986 -185542
11171 -341224 41788 97933 -135867 106121 197017 135066 -44989 -94249 -176626 -265390 -170520
11160 -170520 17838 -159138 -13581 -80036 -73582 -75172 236139 38969 66674 -274747 72370
11148 -261194 -407655 -40571 -96407 -270080 -103286 -81234 -46252 417423 92018 -73205 -316579
11137 -316579 -144582 -326479 22540 17795 -20019 -175341 -17127 -106008 208855 6215 59116
11126 59116 -89187 42486 -15646 -56286 -198189 -13804 -345447 158839 53819 236090 -230113
11114 -5264 -95279 -34445 -234462 12641 -143078 -690 -2058 -199602 158937 75488 -37836 61745
11101a57899A17073A2021a40753B6812i0792k69438N0665C45911e5157J5139C64301
11089a68118C87592h4900C72826C6819E140Q2110A1338b01814A48828j0027K49277
11078C88078F693a11750D07359k6990a07640j9586B64463J07076j62075f7330
11067A39095L14209K2453H4823e3965D45876q9960J69612a07925C60290C0399
11056B09761D6345J55230M14949k47177K76904k38647m8979M2209j38184M59747
11046G22397B20722o4741K03696K49471r7722j73858r5019L26859p593k25937
11036C35878M90061N6723k94652L62081J41106k83240l64610K76916K67970J03735
11026A091968n28139J42716J2254R168J7737j87593k3060L46202J28186J4418
$$ plain form
11101 -157899 117073 12021 -140753 26812 -90792 -360230 -309565 345911 -55157 -40018 364301
11089 -168118 387592 -84900 372826 36819 5140 87250 11338 -201814 148828 138801 388078
11078 388078 6693 -111750 407359 380369 -107640 -127226 264463 371539 209464 -67330
11067 139095 453304 475757 84823 -53965 445876 355916 525528 -107925 360290 30399
11056 209761 46345 201575 616524 369347 646251 407604 358625 400834 262650 722397
11046 722397 220722 155981 359677 609148 511426 337568 242549 569408 561815 335878
11036 335878 825939 882662 588010 950091 1091197 807957 443347 720263 988233 1091968
11026 1091968 563829 706545 718799 727967 745704 558111 535051 881253 1009439 1023857
11016A023857K4031m6948R260q4119k95106N2748K91618k95485j35765K70430
11006H14521j43908J65579J74010k64909o6523j54220K48433j02981J4198N0034
10996G34234Q2024l10221k339K34988J65214B27951M10462j55234J26887J47425
10986G57491k31390J25813m2850p5847J92080Q4994k95256K11453j91051K3802
10976E59239K00482k89432N60687m83205L05693k91341K25635k15978J32423J04899
10966H09102r7775J4857O56269o45392L05653N991J3561M08606R8583j74043M72405
10955A867817J13347j7187M83389K07708o5153J095L30890n6567m82810j51405
10945B231124M8595q36738K44571M0847k39321J80781j43254L97196J4607n30299
$$ plain form
11016 1023857 1047888 1000940 1010200 926081 630975 683723 975341 679856 544091 814521
11006 814521 670613 836192 1010202 745293 678770 524550 772983 670002 684200 734234
10996 734234 816258 506037 503698 738686 903900 227951 638413 483179 610066 757491
10986 757491 526101 651914 609064 533217 725297 810291 515035 726488 535437 559239
10976 559239 759721 470289 1030976 547771 853464 562123 787758 571780 704203 809102
10966 809102 711327 726184 1382453 737061 1042714 1048705 1062266 1470872 1569455 1395412 1867817
10955 1867817 1981164 1963977 2447366 2655074 2589921 2591016 2921906 2865339 2382529 2231124
10945 2231124 2279719 1442981 1687552 1728399 1489078 1669859 1526605 1923801 1938408 1408109
10935A408109K24745j73822k17809n6975M7595m02206n7587j29239k18702J73079
10925E97188I3797J32003K16254o6595B7039O23717F2757a5549B2473J54023q8137
10914H8359K51814A42374b1875B50280E8959a23439D8896J33043P6124j02531
10904A55532G4316O4641H647O1629c9527B20638B8223a39563B53003j25815B6492
10892A60546J60353E3819k3861L0131f2327A67019b33566L9941A77508E0144a19376
10880B39018g3647q1851l50745K51285C65803c66260M1368c4055j47418O4794
10870a16679b2735A75407c66732F7719J24184b5867j57257h9668j17093A54633
10859f413j58379k7743B37244D1111F823k096J65239a18898j01620D49587a37279
$$ plain form
10935 1408109 1632854 1459032 1241223 1184248 1231843 829637 772050 642811 424109 597188
10925 597188 93797 225800 442054 375459 27039 650756 62757 -15549 22473 176496 88359
10914 88359 340173 142374 -21875 250280 58959 -123439 48896 181939 258063 155532
10904 155532 74316 138957 8647 70276 -39527 220638 28223 -139563 253003 127188 26492
10892 160546 320899 53819 29958 60089 -62327 167019 -233566 -193625 177508 50144 -119376
10880 239018 -73647 -155498 -506243 -254958 365803 -366260 -324892 -34055 -181473 -116679
10870 -116679 -22735 175407 -366732 67719 191903 -25867 -183124 -89668 -206761 154633
10859 -6413 -164792 -192535 237244 41111 6823 4727 169966 -118898 -220518 449587 -137279
10847B61365b00184l0256M8077A76443b0725A96017b179A39944a58382f4572k10781
10836b75353C0630L7203A3496b50454A99150C8888K06994c15076k3175A60946
10825i1429j47825A39159a99580A21702b82092F8993B2628g7197D5593o803o085
10814C2705a09998M3707A69779K539b35781F4508d54732b12985p0763J31147J1019
10803a41582R185k80711D0578Q9468C2647P4599b11100M8039c8613B1561b21021
10791e6763A15626M4945c90702B23793d9202N557B24547d0999G7069c38941G3053
10779f2728G5630b13397I0447k4392a73022a0926A9131L4523d17429a77636P7271
10768a00365J1545r8217k8403B4560b61138a8860k56599e8408o8787j0699A32012
$$ plain form
10847 261365 -200184 -230440 -182363 176443 -20725 196017 -2179 139944 -158382 -64572 -275353
10836 -275353 30630 67833 13496 -250454 199150 38888 245882 -315076 -338251 160946
10825 -91429 -239254 139159 -199580 121702 -282092 68993 22628 -77197 45593 38790 32705
10814 32705 -109998 -66291 169779 172318 -235781 64508 -454732 -212985 -283748 -152601 -141582
10803 -141582 -132397 -413108 40578 130046 32647 107246 -211100 -163061 -38613 21561 -221021
10791 -56763 115626 160571 -390702 223793 -49202 -43645 224547 -40999 77069 -338941 73053
10779 -62728 75630 -213397 90447 66055 -173022 -10926 19131 53654 -417429 -177636 -100365
10768 -100365 -88820 -187037 -215440 24560 -261138 -18860 -275459 -58408 -127195 -137894 132012
10756i1187M3380A53181b86523P4287f5149j91345J05234H1882f6475D8896c08272
10744c9459A69765e5153A60141b48238c753C2424J63524b37216J14057N4961j20050
10733a88248F3572a98873i7736j00768A44987d4484p324F5958J36588F1196k115
10722E9081K4286H856a58555F1904g16n6938L343k507n1713C46793F8984g9058
10709a61125R33d8568e447k38199p5475C2731b2700j33743b0446l37263J04580
10698b53129A27043R4777b72386e6470G0008d1141B46736M082f0499A4287c60543
10686a93179A12440c8854C9621J73997g190j63348j43564l08934K99230F6376
10675a43525J0904A06926c6537A592a53734B43191o8913a4623j8081A302b14266
$$ plain form
10756 -91187 -47807 153181 -286523 -212236 -65149 -256494 -151260 81882 -66475 48896 -308272
10744 -39459 169765 -55153 160141 -248238 -3753 32424 195948 -237216 -123159 -68198 -188248
10733 -188248 63572 -198873 -97736 -198504 144987 -44484 -51808 65958 202546 61196 59081
10722 59081 83367 8856 -158555 61904 -716 -57654 -54311 -56818 -108531 346793 68984 -79058
10709 -161125 -160192 -48568 -5447 -243646 -319121 32731 -22700 -156443 -20446 -357709 -253129
10698 -253129 127043 221820 -272386 -56470 70008 -41141 246736 250818 -60499 14287 -360543
10686 -193179 112440 -38854 39621 213618 -7190 -170538 -314102 -623036 -323806 66376
10675 -143525 -132621 106926 -36537 1592 -153734 243191 174278 -14623 -32704 1302 -214266
10663b04769C15035i2046j21197E6977o746b25122c2425k4708J367j72079g3173
10651d48879a67614C9490a71208D8518b41993b4048A24701P3729f932B96733c01949
10639b7795l06901k7875e6993A32433j6598a30792B7198c8669E6125g9908C5728
10627I1598b09657L4048o0647A47373b30993P3185k7263A17375R956a44120c2749
10615a33620C60655c18569G003c94400d9511I7923l9747e7145F3310b14952L8875
10604a76077A74946a24704o2949m932M9691k6316q4676j7736e0324E7697d72115
10592a44643A82784A3062N0391l0919e0086h740F6038a76855C57187j29880b25913
10580I1319a18172e7581j83272G0838B0612K32963q7206H2715C221a64616M1282
$$ plain form
10663 -204769 315035 -92046 -213243 56977 50231 -225122 -32425 -57133 -55766 -227845 -73173
10651 -448879 -167614 39490 -171208 48518 -241993 -24048 124701 198430 -6932 296733 -301949
10639 -27795 -334696 -362571 -56993 132433 115835 -130792 27198 -38669 56125 -79908 35728
10627 91598 -209657 -175609 -236256 147373 -230993 -157808 -185071 117375 127331 -144120 -32749
10615 -133620 360655 -318569 7003 -394400 -49511 97923 58176 -57145 63310 -214952 -176077
10604 -176077 174946 -124704 -187653 -192585 -142894 -169210 -253886 -271622 -50324 57697 -472115
10592 -144643 182784 13062 63453 32534 -50086 -8740 66038 -176855 357187 227307 -225913
10580 91319 -118172 -57581 -240853 70838 20612 253575 166369 82715 3221 -164616 -123334
10569a23334j73832J13102B4184g6747A0920c3359p3502D5639e2083I1734a69851
10557a04244k6382L3398l818o8690A61188g7197j18083A69877b54084i4239j18636
10546b12875o968J08340A09673a3227D3888J915g3207C79074d12374j09685a33896
10534B89853A999J50884a50229A91445e7867A322a36775l8826M4714j4829F7529
10522b32009R378B47615C3359O6026j8260b38342B04732a38023H8660h2236j64228
10511b46464C8858a0879j15094H383c15949O949A27041a43200j66109l156F4718
10499C53186f3604j10716B27267c4072j91369b5482l4443A3692c6107k62822i0176
10487F6114b75216C28360B413a55013c4964j3913k41514D530a20756K625n5918
$$ plain form
10569 -123334 -297166 -184064 24184 -76747 10920 -33359 -106861 45639 -52083 91734 -169851
10557 -104244 -130626 -97228 -101046 -169736 161188 -77197 -195280 169877 -254084 -94239 -212875
10546 -212875 -219843 -111503 109673 -13227 43888 45803 -73207 379074 -412374 -522059 -133896
10534 289853 1999 152883 -150229 191445 -57867 1322 -136775 -175601 -130887 -145716 67529
10522 -232009 -222631 247615 33359 99385 81125 -238342 204732 -138023 88660 -82236 -246464
10511 -246464 38858 -10879 -125973 8383 -315949 -309000 127041 -143200 -309309 -312465 64718
10499 353186 -63604 -174320 227267 -34072 -225441 -25482 -59925 13692 -36107 -298929 -90176
10487 66114 -275216 328360 2413 -155013 -34964 -48877 -290391 4530 -120756 -118131 -174049
10476a74049j44143O9094F0910i7616j65817K0420A19407k6994L63614A51405
10465a32368l6327b5382B14914m9969j4966J96358K31292k05529L69898l17560
10455D24438o3277q4883J33820a25027A25533e9223j0663G5719R1445E3946a22413
10443a16932G0973b13877A75836h2623k773a859j42833l3816J3219m8866A31478
10431a2167j6727E9388b06283H6368g7212l4432r1283l6170O010K3603A94879
10419b74502C2455P8166b68116C02939a65423k38294A36091a5991A07287a5471
10408A72189g7160Q935B06101q6343l0991A5422n687a65547r7516a4121j87979
10397b02100g9916D8868K20321b37646m3748o0868A8636c91694A05487b66251
$$ plain form
10476 -174049 -318192 -249098 60910 -97616 -263433 -243013 119407 92413 456027 151405
10465 -132368 -168695 -25382 214914 164945 149979 346337 577629 372100 741998 424438
10455 424438 361161 276278 410098 -125027 125533 -59223 -69886 75719 167164 53946 -122413
10443 -116932 70973 -213877 175836 -82623 -85396 -1859 -144692 -178508 -165289 -214155 131478
10431 -12167 -28894 59388 -206283 86368 -77212 -111644 -202927 -239097 -233087 -209484 194879
10419 -274502 32455 110621 -268116 302939 -165423 -403717 136091 -15991 107287 -15471
10408 172189 -77160 -68225 206101 119758 88767 15422 9735 -165547 -263063 -14121 -202100
10397 -202100 -79916 48868 269189 -237646 -281394 -342262 18636 -391694 105487 -266251
10386D9356d5480J4392B8638O3381e4620e659A56546e9366A18662a29555k0550
10375a50105B28226e6626o5407c8080l8417A50500J37581C3110P5366b37730R0985
10364a46745A33413M9101M5833a51557E18854A63868a55011C16008O9463G9296
10353B70823K9696m6044P9529l9222K4955N872L49597B61862K56435o3497j71786
10342B83014K52410C5284B229J79829a69722A81417O2798F9022J57268J34020
10332C60310K16816M8260p7439k21306p9785l1605J42383J42489A34654K02531
10322C37185F5166J02768Q1310N6556a46347P49D28966A2144b11884G1074J12409
10311A83483L7557J46405I5931b3496A37518N448C6498e4659p9395I0425a02040
$$ plain form
10386 49356 -45480 -31088 28638 92019 -54620 -5659 156546 -59366 118662 -129555 -150105
10375 -150105 228226 -56626 -122033 -38080 -76497 150500 288081 33110 108476 -237730 -146745
10364 -146745 133413 182514 228347 -151557 518854 163868 -155011 316008 385471 79296
10353 270823 300519 254475 334004 294782 319737 325609 675206 261862 518297 454800 283014
10342 283014 535424 35284 2229 182058 -169722 181417 244215 69022 226290 360310
10332 360310 577126 625386 547947 326641 246856 215251 357634 500123 134654 337185
10322 337185 65166 167934 249244 305800 -146347 -145598 428966 12144 -211884 71074 183483
10311 183483 221040 367445 95931 -23496 137518 142966 36498 -54659 -134054 90425 -102040
10299C45307j22581e5922A17966a44502O2418A23537P4667a79835f0115A16702
10288a19953J6844B67705L6055a23502j12731A84576a55627I0294Q5709L2053
10278B08056a21001e2038k12211L8674L3532B03457a74250A09887D8281j9479
10268B8802d1592D5377d1529k2236B98752k2728I5042J61350A329i8814j26224
10257b25038f8103A23770J119M3577d1576J7644n7682B3935a54824g2225H5107
10245A0261R3095J93316b03147D9879k2003J43168Q20L7459J56567n7066K6618
10234C35442E7532M0318J75429D4927N0635B6929R3465J85022b7946A84019A9933
10222A85071d0594l11283C3123J68659c3587k1325C9204a46789A66623m0481b43195
$$ plain form
10299 345307 222726 -55922 117966 -144502 -82084 123537 198204 -179835 -60115 116702
10288 -119953 -103109 267705 303760 -123502 -236233 184576 -155627 90294 176003 208056
10278 208056 -121001 -52038 -264249 -225575 -192043 203457 -174250 109887 48281 28802
10268 28802 -41592 45377 -41529 -63765 298752 276024 95042 256392 1329 -98814 -225038
10257 -225038 -68103 123770 124889 168466 -41576 -23932 -81614 23935 -154824 -72225 85107
10245 10261 103356 296672 -203147 49879 27876 171044 171864 209323 365890 308824 335442
10234 335442 57532 97850 273279 44927 95562 26929 120394 305416 -27946 184019 19933
10222 185071 -40594 -351877 33123 201782 -33587 -54912 39204 -146789 166623 126142 -243195
10210c3460k79138J18234o0546k04265N5777N1510a67559A97700b41009b8171
10199a83618A39036c28717G8093a01746D9899c9812k49358M8094A07115c6092
10188B76731c143l2181p8008A64636b78698l35A84635e3882o0286J7382J9162
10177g7624k37517I4486D2955K6746a41762D3991c62262a09932d5057k9863p052
10166h1972j67533N5455j46404A73228f1556k8802k928l19725b05390j52970f9526
10154b3361A93538N8879c16339h7383n9526d4214D9295c9751B8588a73962N3389
10143a20573A21989P0153c73823h5344q6427j4298I8480O2660k3374a59250A9328
10131a09520m9711j65148i9614B9222K3703a52784N4625q5655Q0806l3433l3709
$$ plain form
10210 -33460 -312598 -194364 -254910 -459175 -403398 -351888 -167559 197700 -241009 -28171
10199 -183618 139036 -328717 78093 -101746 49899 -39812 -289170 -241076 107115 -36092
10188 276731 -3143 -35324 -113332 164636 -278698 -279033 184635 -53882 -114168 -96786 -77624
10177 -77624 -315141 94486 42955 69701 -141762 43991 -362262 -109932 -45057 -74920 -81972
10166 -81972 -249505 -194050 -340454 173228 -61556 -90358 -93286 -413011 -205390 -358360 -69526
10154 -23361 193538 252417 -316339 -87383 -146909 -44214 49295 -39751 28588 -173962 -120573
10143 -120573 121989 192142 -373823 -85344 -171771 -186069 98480 161140 137766 -159250 19328
10131 -109520 -159231 -324379 -99614 29222 52925 -152784 -98159 -183814 -103008 -136441 -170150
10120a70150k49158G4734J00822h2263j33808A69169A9846g3343j3767I2740c6657
10108A42156c32149a00856L1085A76469N73b22688H2770c83167B48781a66641
10097B0758a58527j51513O0942g2164n8494r1953A57484c31643A82143a2476J907
10086a0569q8773k5044A18693d3417p3814M6916K2000Q26p2617o9211o0197a0943
10073a86413d3773j35366b6996r3942c5640m6241j65806e7744F2650A1780c9690
10061b31443i2831k00079a30876F6638J92889q3289a47764N2038K7039j82386
10051b51073b740A48748d763F4971J9779N2332D7938A9661a48269l95549E9179
10039b59417f4953l7686B81091c03760A07002b388A11738C1511b07354D2948a4533
$$ plain form
10120 -170150 -419308 74734 175556 -82263 -216071 169169 19846 -73343 -87110 92740 -36657
10108 142156 -332149 -100856 -69771 176469 177042 -222688 82770 -383167 248781 -166641
10097 20758 -158527 -310040 -249098 -72164 -130658 -222611 157484 -331643 182143 -12476 -10569
10086 -10569 -99342 -124386 118693 -43417 -117231 -70315 -48315 -47489 -120106 -189317 -249514 -10943
10073 -186413 -43773 -179139 -26996 -120938 -35640 -81881 -247687 -57744 62650 11780 -39690
10061 -231443 -92831 -292910 -130876 66638 259527 176238 -147764 -95726 -68687 -251073
10051 -251073 -2740 148748 -4763 64971 84750 137082 47938 19661 -148269 -543818 59179
10039 -259417 -64953 -102639 281091 -303760 107002 -2388 111738 31511 -207354 42948 -14533
10027a44263D8055c30785J42591L2642D4979J30787E963Q4864K4289C4669O7274
10016A01943b26122B073a58808a9316j57561j19141o4350R8912D8849d16315h4946
10004f9792l61535J21881b8670B79137a57619f125r5035j00758O5032A56001b5797
9992C3075a02591p0702B27595a24087M2431l95483B7656c35334G3529L0944a34805
9980c04159j13340B7502f6707q7358A13539K57257A14702m4003d33043A09218
9969b56329a03087q3598h7445k39039G2300A8998a04107A70512K98876A9750K55421
9958B75171d8547m12261B5304a26231C2786c14094a8686m8585J2207p331j63604
9947b25999A42315a14755j95737a04685B13711a50154l50681C23322g0643K3645
$$ plain form
10027 -144263 48055 -330785 -188194 -155552 44979 175766 5963 90827 115116 34669 101943
10016 101943 -226122 2073 -158808 -19316 -176877 -296018 -360368 -261456 48849 -416315 -84946
10004 -69792 -431327 -309446 -28670 279137 -157619 -6125 -101160 -201918 -136886 156001 -25797
9992 33075 -102591 -173293 227595 -124087 -81656 -477139 27656 -335334 73529 104473 -134805
9980 -304159 -417499 27502 -66707 -154065 113539 370796 114702 70699 -433043 109218
9969 -256329 -103087 -186685 -87445 -326484 72300 18998 -104107 170512 469388 19750 275171
9958 275171 -48547 -460808 25304 -126231 32786 -314094 -18686 -67271 -55064 -62395 -225999
9947 -225999 142315 -114755 -310492 -104685 213711 -150154 -500835 323322 -70643 -46998
9937d6998r3099p6339l9136o8346B47162i8385I1530J80222C5967b6651B1023
9925c02291h9634G1128g9984D434a00895m4239B54913j25198e4832k97516C3867
9913g2802L1476C28110a4594I3366M0745a42193I7596c22403e504j70649Q7436
9902h8717l08304a17505e6186C0889a59107E0361a83293N1516m254A35931C7038
9890b58438K8123d4149n8702d9706B52389b0742r3077a7340m3561B8892M6297
9879G5189e9370B7846K51330d23989b815l37428C86502b10621a5957k5581q5625
9868a27163j0641a8343k7891B1177a29697A35638i3697I7472l3252O1313b97305
9856H02c01103C48427a03890j53439a25151J2516D84033k7357C2336a75520j88494
$$ plain form
9937 -46998 -140097 -216436 -255572 -323918 247162 -98385 91530 271752 35967 -26651 21023
9925 -302291 -89634 71128 -79984 4434 -100895 -145134 254913 129715 -54832 -352348 33867
9913 -72802 -41326 328110 -14594 93366 134111 -142193 97596 -322403 -5504 -176153 -88717
9902 -88717 -397021 -117505 -56186 30889 -159107 50361 -183293 -131777 -136031 135931 37038
9890 -258438 -230315 -44149 -102851 -49706 252389 -20742 -113819 -17340 -60901 28892 75189
9879 75189 -59370 27846 279176 -423989 -2815 -340243 386502 -210621 -15957 -41538 -127163
9868 -127163 -137804 -18343 -46234 21177 -129697 135638 -93697 97472 64220 125533 -297305
9856 802 -301103 348427 -103890 -257329 -125151 -112635 484033 456676 32336 -175520 -364014
9845c64014M2609h0356o3193A65916h1552A11227b41386E8211b64539E8029f9690
9833A73999b41771p5656N8203n846O9289G8766h3329D345Q8073b81576G3809c68760
9820B526c24559B39083a58882l9127h5982j09906c2673q8126c9769G4074f6335
9808a35888j44259c7006m7280C5356e3374l52989a60120m2401D36803a60896j7151
9797a78047e7314k64641I3687c95036a33154N1323A01714N0100b0966A41598c17411
9785A74894J8099l1507m5775j6053i9298G8080R9879k8488d579k6525k57707J3437
9773b75374i3039D7174a0109j60560A90410a80408b675j85969B5849K6391f548
9761A38451c2931a2540q5993L4646E9277b05210c8473B1393b8898C5309d1232
$$ plain form
9845 -364014 -321405 -80356 -143549 165916 -81552 111227 -241386 58211 -264539 58029 -69690
9833 173999 -241771 -317427 -259224 -265070 -195781 78766 -83329 4345 92418 -281576 73809 -368760
9820 2526 -324559 239083 -158882 -198009 -85982 -195888 -32673 -120799 -39769 74074 -66335
9808 -135888 -280147 -37006 -84286 35356 -53374 -406363 -160120 -202521 436803 -160896 -178047
9797 -178047 -57314 -321955 93687 -395036 -133154 -81831 101714 151814 -20966 141598 -317411
9785 174894 192993 161486 115711 99658 -99298 78080 177959 149471 -4579 -31104 -288811 -275374
9773 -275374 -93039 47174 -10109 -170669 190410 -180408 -2675 -188644 25849 52240 -6548
9761 138451 -32931 -12540 -98533 -63887 59277 -205210 -38473 21393 -28898 35309 -41232
9749B6221d1607j71478i4373k6838B25485d60187b13979A28666h9405q6958A58347
9737A58228a80176g7624a4335C7115r947a40288l8630f2576j74093I6356i6110
9725e6195k0441n6258A4515d17526A0735K10949h4261k9704A22287a48412k89172
9714d37584A63292B3171b11956K9196c1688j11647N305d8402A32294f6195k78976
9703c45171l3320A54948P0452c15061A85167a07082k98750a06960A58084A3785
9692b22352g5896j6121E0815d79j67285j00762B36019a9202m7050D790R5092c81463
9679a81517k31472K00957C01509g7742k66242G946J52349e6383A65352a44442
9668A1901a92765A75042J14045a98422n462D9104O2065n3823a08355I3990D4264
$$ plain form
9749 26221 -41607 -213085 -94373 -121211 225485 -460187 -213979 128666 -89405 -176363 158347
9737 158228 -180176 -77624 -14335 37115 27168 -140288 -178918 -62576 -236669 96356 -96110
9725 -56195 -76636 -132894 14515 -417526 10735 221684 -84261 -113965 122287 -148412 -437584
9714 -437584 163292 23171 -211956 -182760 -31688 -143335 -138030 -48402 132294 -66195 -345171
9703 -345171 -378491 154948 225400 -315061 185167 -107082 -405832 -106960 158084 13785
9692 -222352 -75896 -92017 50815 -479 -167764 -268526 236019 -19202 -66252 4790 99882 -381463
9679 -181517 -412989 -212032 301509 -77742 -343984 7946 160295 -56383 165352 -144442
9668 11901 -192765 175042 289087 -198422 -203884 49104 111169 57346 -108355 93990 44264
9656a77503a354k65316A50889A4804f4492k12658N6510L1663L1135B0024K68828
9645B88852m6226c97864a48277m4804H1600a71404e8693A04624e6314j79518c595
9633d28552c3352n9823A68766A8690f63234a52367C4650f4587A87377m3726a91334
9621b4770p9261d3179k42472D4315c6297q7965C5069J05383A6301b84613e9944
9609a48696D85279b41250J05952j33182q97F1209J14588H2105Q083b74226g3309
9597B38372a85514A5691a08309q7582A77385F1859a22197A63696a41220H094g439
9585B00137o4993A1723M0383m41b01078L7926m2036k4016R0334A41038n1526a77443
9572a76610k07365J54501l6078F7768h7474A03711e0918j38056A76421c19084
$$ plain form
9656 -177503 -1354 -266670 150889 14804 -64492 -277150 -220640 -188977 -157842 20024 288852
9645 288852 242626 -397864 -148277 -193081 81600 -171404 -58693 104624 -56314 -235832 -3595
9633 -428552 -33352 -93175 168766 18690 -663234 -152367 34650 -64587 187377 143651 -191334
9621 -24770 -104031 -43179 -285651 44315 -36297 -124262 35069 140452 16301 -284613 -59944
9609 -148696 485279 -241250 -135298 -268480 -269377 61209 175797 82105 90188 -274226 -73309
9597 238372 -185514 15691 -108309 -195891 177385 61859 -122197 163696 -141220 8094 -7439
9585 200137 135144 11723 52106 51665 -201078 -163152 -205188 -229204 -138870 141038 89512 -177443
9572 -176610 -383975 -229474 -265552 67768 -87474 103711 -50918 -188974 176421 -319084
9561F7925b49152h4844K7031B1119a20385F2804K09045D3888a57216A35719I57
9549d59161a28280j30399K0342h2346j01938e6956k1969A67648a34693r2216c9676
9537g9653G5034C3607N0757J25758a29070m4578k2378C1082P1981a16333k0538
9526a36871C7122a49715a4078j46530j12317g3582j55308B5088d48492A00374
9515a12515l1782j5193P2603j95149J37753c0778A11139f3824C37028a70806E7307
9503c44688c0910A23204d2054j33485A62625c9671A53545a92450H7291B117a11885
9491e1777A62268f8014j82447E398N7364P7779a53356G1891c52645e0142C0675
9479C9011a5181A01917b03824Q9318c9200l9024A06880c40296a66656d9580A37323
$$ plain form
9561 67925 -249152 -84844 -57813 21119 -120385 62804 271849 43888 -157216 135719 957
9549 -459161 -128280 -258679 -238337 -82346 -184284 -56956 -78925 167648 -134693 -226909 -39676
9537 -79653 75034 33607 84364 210122 -129070 -173648 -196026 31082 103063 -116333 -136871
9526 -136871 37122 -149715 -14078 -160608 -272925 -73582 -228890 25088 -448492 100374
9515 -112515 -144297 -159490 -86887 -282036 -144283 -30778 111139 -63824 337028 -170806 57307
9503 -344688 -30910 123204 -42054 -175539 162625 -39671 153545 -192450 87291 2117 -111885
9491 -51777 162268 -68014 -250461 5398 62762 140541 -153356 71891 -352645 -50142 30675
9479 39011 -15181 101917 -203824 -114506 -39200 -78224 106880 -340296 -166656 -49580 137323
9467c3029j0149H2743b0485k1517N482B62373a23582A07718c56878D58517A7534
9455A91564J09378a46791A43633f3069C1256b37152e7923j20548L4952k01759
9445c45278A09155b10949h5533l04263B13054D5898J09923K27950A58646f4517
9434A46194c9976A01311a46817c5434I7547a31460N2539k80096J8808a0687j44500
9423a55187G0603R2327A9696b12485C52611j11164a06256A11565a56317r3913
9413b50230i6459j951L9670j05433C20317D2834P1343J48654a46393k56879c2931
9401b56261P600A04705A3782L3453j4649d77028h2014I7023j7949f612A02339
9389A52942a15054N0008k12516g4470B32892b64588a09050B51042a16387j11933
$$ plain form
9467 -33029 -43178 82743 -20485 -42002 -36520 262373 -123582 107718 -356878 458517 17534
9455 191564 300942 -146791 143633 -63069 31256 -237152 -57923 -178471 -143519 -345278
9445 -345278 109155 -210949 -85533 -389796 213054 45898 155821 383771 158646 -64517
9434 146194 -39976 101311 -146817 -35434 97547 -131460 -78921 -359017 -340209 -10687 -155187
9423 -155187 70603 162930 19696 -212485 352611 241447 -106256 111565 -156317 -250230
9413 -250230 -96459 -98410 -58740 -164173 320317 42834 114177 262831 -146393 -403272 -32931
9401 -256261 -248661 104705 13782 47235 32586 -477028 -82014 97023 79074 -6612 102339
9389 152942 -115054 -65046 -277562 -74470 232892 -264588 -109050 251042 -116387 -228320
9379b28320P3058o6722F1984a61890j5501O9241n0296m2268L8557j38777J46511
9368a54423h121k15939P1083l60032b35955a00177A0853J95202G6593Q9536c53922
9356A46992J15082c824C46877A29289B1362g4603n8504p6296B9954J32164a19821
9344a45339C3098a95131r197g906q2667I2026b98726K7973A53185b6532D83412
9332c2432C36395c166m41539a78687A14062a11572j9139p8953B60724F3633g5664
9320D51793I4508K3827a98189q104B91310a58955j12791A12558B0323a31345j08683
9309b40028l7816h511k98435e9659q4837r5772f1944A50506d5564m8932b4419
9297b55274N4680j4615g7999k2139r5504l0387N0056P4375j09128j14960H9105
$$ plain form
9379 -228320 -155262 -221984 61984 -161890 -177391 -108150 -158446 -200714 -162157 -300934 -154423
9368 -154423 -8121 -224060 -152977 -513009 -235955 -100177 10853 206055 76593 166129 -353922
9356 146992 262074 -3824 346877 129289 21362 -74603 -133107 -209403 29954 162118 -119821
9344 -145339 33098 -195131 -204328 -7906 -90573 92026 -298726 -270753 153185 -26532 483412
9332 -32432 336395 -3166 -444705 -178687 114062 -111572 -130711 -209664 260724 63633 -75664
9320 451793 94508 118335 -198189 -206293 291310 -158955 -271746 112558 20323 -131345 -240028
9309 -240028 -277844 -8511 -306946 -59659 -144496 -240268 -61944 150506 -45564 -94496 -24419
9297 -255274 -200594 -215209 -77999 -100138 -195642 -226029 -175973 -101598 -210726 -325686 89105
9285b62276c4102l09964P3377A83910G5162K61176A48762a4568A12413B8808a829
9273a1162p2378G6724c67906F9491a82538L6068k09226A63459l8319a6334O13
9262a5721C7196c6168n36359b58219A9440b72901b8893o4302k55997J71883j862
9251a79171A68065d0565J3522k06994c2627r8125N9825p7865o7868L5721F3809
9239a193I5384a67900I666d64692b7502j82037N8567K6362b4887A06714b7226
9227A29883b41110o456J00355k00188a48656B34360B7343H518b46340H616b13162
9215B43886H8732C7107a08036F0860a30122k0525j55160d8647D4338M2678J67564
9204B54580p7421K1247e41277A23409A6107a08947G4591J97196b02172e7068j94503
$$ plain form
9285 -262276 -34102 -344066 -270689 183910 75162 336338 148762 -14568 112413 28808 -1829
9273 -11162 -83540 76724 -367906 69491 -182538 -146470 -355696 163459 125140 -16334 -15721
9262 -15721 37196 -36168 -572527 -258219 19440 -272901 -28893 -93195 -349192 -177309 -179171
9251 -179171 168065 -40565 -27043 -234037 -32627 -130752 -70927 -148792 -216660 -180939 63809
9239 -1193 95384 -167900 9666 -464692 -27502 -209539 -150972 -124610 -24887 106714 -27226
9227 129883 -241110 -247566 -147211 -347399 -148656 234360 27343 8518 -246340 8616 -213162
9215 243886 88732 37107 -108036 60860 -130122 -150647 -305807 -48647 44338 87016 254580
9204 254580 177159 198406 -541277 123409 16107 -108947 74591 271787 -202172 -57068 -251571
9193b51571I8728a42144a2141A50183d302H4346d2102m1544A32891b30430M2867
9182a87563k5047N1055p8017j06437g4484B73407b60222B89142a74168A27953
9171h0152k76751F6003P5400c97498I3989c08869D7959j5348b98088J19720P6438
9160a01930j2962j33461D9858L7524r424M1084d21951Q1182B0933b43352l1465
9149b74817a21788l6664H3823b13256b1726A89549F3521J66775H8997C5444a2924
9137g4775C45640B6643a74671E6806J65021a29711j47058J16657G31J81796B6533
9125a44232a5339A00138f8987A535d1860A74231J5877D3299a27549g728G6119
9113f9669q2936l0258Q3104A91613b86641a03778j48646A08741l524d994l699
$$ plain form
9193 -251571 98728 -142144 -12141 150183 -4302 84346 -42102 -83646 132891 -230430 -187563
9182 -187563 -212610 -161555 -239572 -346009 -74484 273407 -260222 289142 -174168 127953
9171 -80152 -356903 66003 141403 -397498 93989 -308869 47959 32611 -298088 -178368 -101930
9160 -101930 -114892 -248353 49858 87382 77958 119042 -421951 -340769 20933 -243352 -274817
9149 -274817 -121788 -158452 83823 -213256 -21726 189549 63521 230296 88997 35444 -12924
9137 -74775 345640 26643 -174671 56806 221827 -129711 -276769 -160112 731 182527 26533
9125 -144232 -15339 100138 -68987 1535 -41860 174231 190108 43299 -127549 -7728 76119
9113 -69669 -152605 -182863 -99759 191613 -286641 -103778 -252424 108741 105217 -4994 -8693
9102h693A38302b12538k6460k7169H7904b01196m2534B9196M16A0466f9956b573
9089A85248a69006B7964b53157M1175K9202A09697i9483G7051l6255b74227Q7827
9078a86400F983b90481e4135D8580d543n8382m5275J6473G9926a45148J968p335
9066a50515k41765d7344j31504J2879N9148l6704C64925b52345L0775Q3091l0771
9055a69250d0454F8617a25180l11765J55361i0025K3327A28426a39724D9413b70814
9043C7090c29482B18594B9959J7772d6562F416h4057B2853J08768c49373J6167
9032c33206r2828d778j60280g0648Q142K694J3941M427j55373O735f821H9390
9019D6161p218J43392a29696B23759o5028a88634m1626J10801k8942r0572G6886
$$ plain form
9102 -8693 138302 -212538 -238998 -266167 87904 -201196 -243730 29196 29612 10466 -69956 -2573
9089 185248 -169006 27964 -253157 -211982 -182780 109697 -99483 77051 40796 -274227 -186400
9078 -186400 6983 -290481 -54135 48580 -4543 -62925 -108200 -91727 79926 -145148 -143180 -150515
9066 -150515 -392280 -47344 -178848 -165969 -106821 -143525 364925 -252345 -221570 -138479 -169250
9055 -169250 -40454 68617 -125180 -436945 -281584 -90025 -66698 128426 -139724 49413 -270814
9043 37090 -329482 218594 29959 47731 -46562 6416 -84057 22853 131621 -349373 -333206
9032 -333206 -426034 -4778 -165058 -70648 -62506 -59812 -45871 -41444 -196817 -190082 -6821 89390
9019 46161 38943 182335 -129696 223759 158731 -188634 -230260 -119459 -148401 -238973 76886
9007g4714A5425K64c7691A70599d06911A05394a46344J4648l73990B2095c46042
8995a80734j18150f0870j25058f6608r2627F7690c3867k5584H3105a35826O4346
8984g1480j54821j3581Q6280A83444K7380I403a56413F8842b97905A18556J48256
8973B66812a61869k9542G6260a39029A91065h9363j58208j02635E6423a99063
8962a47402A29391c33628F3473a18856A6367c26255a40045A66829b4591j86056
8952b10647n2140a27690m5012a168l28462R3257q846I0376b36986c7680k48093
8941b85773R0053J9327A09293a6664G5700i9332I3002a6467A11224c18275j88844
8930e07119A8141a36362M5069A64576B3774J53762c30078B30755d4854A86161
$$ plain form
9007 -74714 15425 15689 -37691 170599 -406911 105394 -146344 -131696 -505686 22095 -346042
8995 -180734 -298884 -60870 -185928 -66608 -159235 67690 -33867 -59451 83105 -135826 -71480
8984 -71480 -226301 -239882 -153602 183444 210824 9403 -156413 68842 -297905 118556 266812
8973 266812 -161869 -191411 76260 -139029 191065 -89363 -247571 -350206 56423 -199063
8962 -147402 129391 -333628 63473 -118856 16367 -326255 -140045 166829 -24591 -210647
8952 -210647 -262787 -127690 -172702 -1168 -329630 -236373 -245219 90376 -236986 -37680 -285773
8941 -285773 -195720 -176393 109293 -16664 75700 -99332 93002 -16467 111224 -318275 -507119
8930 -507119 18141 -136362 -91293 164576 23774 177536 -330078 230755 -44854 186161
8919a27125B33035P3202b32676A38552J00213C2984R0661d16515A39485g5400
8908d24205g3997E02361k5828M53288R33646R76750L497174B802815j208063G62143
8897E14066q963d1355B1091K30741A00227D7660M69787j95229C0554J75597a86426
8885g5666H9203J00868f2117A97668p6324B2485o740a10218r8211B8657a06958
8873c4897D0078a41961B4203b10148d4655D0089j1652J81561a56966A84474d4405
$$ plain form
8919 -127125 233035 306237 -232676 138552 238765 32984 123645 -416515 139485 -75400
8908 -424205 -73997 502361 476533 929821 1863467 2840217 6337391 2802815 1594752 762143
8897 514066 505103 -41355 21091 251832 100227 47660 517447 322218 30554 206151 -186426
8885 -75666 89203 190071 -62117 197668 121344 22485 15745 -110218 -208429 28657 -106958
8873 -34897 40078 -141961 24203 -210148 -44655 40089 28437 209998 -156966 184474 -44405
$$ [...]
##END NTUPLES=NMR SPECTRUM
##END=
