
##TITLE=AC1041_TOFR02_5906800_kBFjP5VRSq
##JCAMPDX= 6.0         $$ Bruker NMR JCAMP-DX V2.0
##DATA TYPE= NMR SPECTRUM
##DATA CLASS= NTUPLES
##ORIGIN= BRUKER
##OWNER= Administrator
$$ 1.72 TOPSPIN		Version 2.1
$$ 2012-04-10 10:29:29.062 -0500  Administrator@TOPSPIN
$$ Compression mode = diff/dup
##.OBSERVE FREQUENCY= 400.13188235
##.OBSERVE NUCLEUS= ^1H
##.ACQUISITION MODE= SIMULTANEOUS (DQD)
##.ACQUISITION SCHEME= undefined
##.AVERAGES= 64
##.DIGITISER RES= 22
##SPECTROMETER/DATA SYSTEM= spect
##.PULSE SEQUENCE= noesygpps1d.comp
##.SOLVENT NAME= COFFEE_meoh
##.SHIFT REFERENCE= INTERNAL, COFFEE_meoh, 1, 14.96892
##AUDIT TRAIL= $$ (NUMBER, WHEN, WHO, WHERE, PROCESS, VERSION, WHAT)
$$ ##TITLE= Audit trail, TOPSPIN		Version 2.1
$$ ##JCAMPDX= 5.01
$$ ##ORIGIN= Bruker BioSpin GmbH
$$ ##OWNER= Administrator
$$ $$ C:\Bruker\TOPSPIN/data/COFFEE/nmr/AC1041_TOFR02_5906800_kBFjP5VRSq/12/pdata/1/auditp.txt
$$ ##AUDIT TRAIL=  $$ (NUMBER, WHEN, WHO, WHERE, PROCESS, VERSION, WHAT)
(   1,<2012-04-04 18:36:31.000 -0500>,<Administrator>,<TOPSPIN>,<go>,<TOPSPIN 2.1>,
      <created by zg
	started at 2012-04-04 18:24:59.359 -0500,
	POWCHK enabled, PULCHK disabled,
       configuration hash MD5:
       1A 1E CE 29 27 FD 77 03 67 4E F0 E3 C4 B2 CB 90
       data hash MD5: 64K
       12 5F 81 9D 1E 93 28 49 5A 76 38 0D 0E C4 A8 41>)
(   2,<2012-04-04 18:36:33.718 -0500>,<Administrator>,<TOPSPIN>,<proc1d>,<TOPSPIN 2.1>,
      <Start of raw data processing
       efp LB = 0.3 FT_mod = 6 PKNL = 1 PHC0 = 0 PHC1 = 0 SI = 128K 
       data hash MD5: 128K
       3D 97 89 C6 53 2C 18 17 0B 67 FC CC 84 BC 83 A5>)
(   3,<2012-04-04 18:36:34.953 -0500>,<Administrator>,<TOPSPIN>,<proc1d>,<TOPSPIN 2.1>,
      <pk PHC0 = 33.21716 PHC1 = 0 
       data hash MD5: 128K
       4B 7D FF 5F 00 70 13 CE 85 B4 C9 4D D3 D1 1E 4F>)
(   4,<2012-04-04 18:36:35.171 -0500>,<Administrator>,<TOPSPIN>,<proc1d>,<TOPSPIN 2.1>,
      <abs ABSG = 1 
       data hash MD5: 128K
       CC 9F 99 E0 FF 84 9C 38 0A FD E0 4E DC 1C 9C E2>)
(   5,<2012-04-04 18:36:35.250 -0500>,<Administrator>,<TOPSPIN>,<proc1d>,<TOPSPIN 2.1>,
      <abs ABSG = 2 
       data hash MD5: 128K
       66 A9 EC 4B 1B 62 63 2C F6 75 72 A3 38 DB 3A A9>)
(   6,<2012-04-04 18:36:35.437 -0500>,<Administrator>,<TOPSPIN>,<proc1d>,<TOPSPIN 2.1>,
      <abs ABSG = 3 
       data hash MD5: 128K
       38 C6 1A 14 6F 80 ED C6 E2 25 DD 0C 5F 9F 06 1B>)
(   7,<2012-04-04 18:36:35.546 -0500>,<Administrator>,<TOPSPIN>,<proc1d>,<TOPSPIN 2.1>,
      <abs ABSG = 4 
       data hash MD5: 128K
       57 C5 68 B3 50 48 A0 9B 87 06 4A 0F 1D 9F A8 0B>)
(   8,<2012-04-04 18:36:35.593 -0500>,<Administrator>,<TOPSPIN>,<proc1d>,<TOPSPIN 2.1>,
      <abs ABSG = 5 
       data hash MD5: 128K
       30 18 9A 2E A3 4E B6 E9 D2 33 13 BB C2 87 E6 79>)
(   9,<2012-04-04 18:36:35.828 -0500>,<Administrator>,<TOPSPIN>,<audit>,<TOPSPIN 2.1>,
      <user comment:
       ICON-NMR User ID: COFFEE
       data hash MD5: 128K
$$ [...]
##$TP07= 0
##$TPNAME0= <>
##$TPNAME1= <>
##$TPNAME2= <>
##$TPNAME3= <>
##$TPNAME4= <>
##$TPNAME5= <>
##$TPNAME6= <>
##$TPNAME7= <>
##$TPOAL= (0..7)
0.5 0.5 0.5 0.5 0.5 0.5 0.5 0.5
##$TPOFFS= (0..7)
0 0 0 0 0 0 0 0
##$TUNHIN= 0
##$TUNHOUT= 0
##$TUNXOUT= 0
##$USERA1= <user>
##$USERA2= <user>
##$USERA3= <user>
##$USERA4= <user>
##$USERA5= <user>
##$V9= 5
##$VALIST= <valist>
##$VCLIST= <CCCCCCCCCCCCCCC>
##$VD= 0
##$VDLIST= <DDDDDDDDDDDDDDD>
##$VPLIST= <PPPPPPPPPPPPPPP>
##$VTLIST= <TTTTTTTTTTTTTTT>
##$WBST= 2048
##$WBSW= 25
##$XGAIN= (0..3)
0 0 0 0
##$XL= 0
##$YL= 0
##$YMAX_a= 14989497
##$YMIN_a= -6652112
##$ZGOPTNS= <>
##$ZL1= 120
##$ZL2= 120
##$ZL3= 120
##$ZL4= 120
##$ABSF1= 14.96892
##$ABSF2= -5.583611
##$ABSG= 5
##$ABSL= 3
##$ALPHA= 0
##$AQORDER= 0
##$ASSFAC= 0
##$ASSFACI= 0
##$ASSFACX= 0
##$ASSWID= 0
##$AUNMP= <proc_prof1d_extract.lims>
##$AXLEFT= 0
##$AXNAME= <>
##$AXNUC= <1H>
##$AXRIGHT= 0
##$AXTYPE= 0
##$AXUNIT= <>
##$AZFE= 0.1
##$AZFW= 0.1
##$BCFW= 0
##$BC_mod= 0
##$BYTORDP= 0
##$COROFFS= 0
##$CY= 15
##$DATMOD= 1
##$DC= 0
##$DFILT= <>
##$DTYPP= 0
##$F1P= 0
##$F2P= 0
##$FCOR= 0.5
##$FTSIZE= 131072
##$FT_mod= 6
##$GAMMA= 0
##$GB= 0
##$INTBC= 1
##$INTSCL= 1
##$ISEN= 128
##$LB= 0.3
##$LEV0= 0
##$LPBIN= 0
##$MAXI= 10000
##$MC2= 0
##$MEAN= 0
##$ME_mod= 0
##$MI= 0
##$NCOEF= 0
##$NC_proc= -3
##$NLEV= 6
##$NOISF1= 0
##$NOISF2= 0
##$NSP= 0
##$NTH_PI= 0
##$NZP= 0
##$OFFSET= 14.96892
##$PC= 1
##$PHC0= 33.21716
##$PHC1= 0
##$PH_mod= 1
##$PKNL= yes
##$PPARMOD= 0
##$PPDIAG= 0
##$PPIPTYP= 0
##$PPMPNUM= 2147483647
##$PPRESOL= 1
##$PSCAL= 4
##$PSIGN= 0
##$PYNMP= <proc.py>
##$REVERSE= no
##$SF= 400.130004679771
##$SI= 131072
##$SIGF1= 0
##$SIGF2= 0
##$SINO= 400
##$SIOLD= 131072
##$SPECTYP= <>
##$SREGLST= <1H.CDCl3>
##$SSB= 0
##$STSI= 131072
##$STSR= 0
##$SW_p= 8223.68421052632
##$SYMM= 0
##$S_DEV= 0
##$TDeff= 65536
##$TDoff= 0
##$TI= <>
##$TILT= no
##$TM1= 0
##$TM2= 0
##$TOPLEV= 0
##$USERP1= <user>
##$USERP2= <user>
##$USERP3= <user>
##$USERP4= <user>
##$USERP5= <user>
##$WDW= 1
##$XDIM= 131072
##$YMAX_p= 505902827
##$YMIN_p= -350979949
##$CURPLOT= <Network HP LaserJet P1505>
##$CURPRIN= <$Network HP LaserJet P1505>
##$DFORMAT= <normdp>
##$LAYOUT= <+/1D_H.xwp>
##$LFORMAT= <normlp>
##$PFORMAT= <normpl>
##$SURQMSG= 1
$$ End of Bruker specific parameters
$$ ---------------------------------
##NTUPLES= NMR SPECTRUM
##VAR_NAME=  FREQUENCY,     SPECTRUM/REAL,   SPECTRUM/IMAG
##SYMBOL=    X,             R,               I
##VAR_TYPE=  INDEPENDENT,   DEPENDENT,       DEPENDENT
##VAR_FORM=  AFFN,          ASDF,            ASDF
##VAR_DIM=   131072,        131072,          131072
##UNITS=     HZ,            ARBITRARY UNITS, ARBITRARY UNITS
##FACTOR=    0.0627417313425165, 1,          1
##FIRST=     8223.62146879498, 1530,         -99363
##LAST=      0,             4819,            -99087
##MIN=       0,             -350979949,      0
##MAX=       8223.62146879498, 505902827,    0
$$ Real data points
##PAGE= N=1
##DATA TABLE= (X++(R..R)), XYDATA
$$ [...]
$$ plain form
60691 1779046 1778363 1776849 1774821 1772527 1769892 1766678 1762716 1758069 1753104 1748122 1742755 1736057 1727490 1717501
60677 1717501 1706810 1695514 1683370 1670541 1657358 1643649 1629135 1614547 1601434 1590623 1581575
60666 1581575 1573593 1566857 1561538 1556627 1550730 1543947 1537959 1533979 1531381 1528862 1526368 1525038 1525246 1525400
60652 1525400 1523235 1518213 1512306 1508164 1506638 1506314 1505429 1503741 1502177 1501059 1499491 1496653 1492990 1489570
60638 1489570 1486603 1483247 1478763 1473241 1466931 1459328 1449408 1436673 1421672 1405490 1388934 1372256 1355395
60625 1355395 1338164 1320236 1301241 1281216 1260901 1241386 1223355 1206748 1191193 1176608 1163295
60614 1163295 1151547 1141296 1132244 1124441 1118706 1116233 1117413 1121156 1125790 1130708 1136656 1144215 1152582
60601 1152582 1160410 1167533 1175091 1183931 1193461 1202360 1209994 1216849 1223817 1231410 1239589 1248054 1256580 1265154
$$ packed form
60691A779046o83j514k028k294k635l214l962m647m965m982n367o698q567r989
60677A717501j0691j1296j2144j2829j3183j3709j4514j4588j3113j0811r048
60666A581575p982o736n319m911n897o783n988l980k598k519k494j330K08J54
60652A525400k165n022n907m142j526l24q85j688j564j118j568k838l663l420
60638A489570k967l356m484n522o310p603r920j2735j5001j6182j6556j6678j6861
60625A355395j7231j7928j8995k0025k0315j9515j8031j6607j5555j4585j3313
60614A163295j1748j0251r052p803n735k473J180L743M634M918N948P559Q367
60601A152582P828P123P558Q840R530Q899P634O855O968P593Q179Q465Q526Q574
$$ plain form
60587 1265154 1273871 1282726 1291492 1299749 1307098 1313537 1319684 1326441 1334317 1343260 1353283 1364891 1378501
60574 1378501 1393649 1409258 1424728 1440387 1456882 1474450 1492782 1511167 1528733 1545177 1561460
60563 1561460 1579192 1598725 1618154 1634665 1646765 1654870 1660093 1663104 1664091 1663012 1659550 1653260 1644181
60550 1644181 1633122 1621093 1608645 1595952 1583336 1571461 1561116 1552938 1547111 1543184 1540419 1538386
60538 1538386 1536800 1534604 1529995 1522168 1512615 1503699 1496104 1488834 1481713 1476397 1474170 1473964 1473781 1473287 1473661
60523 1473661 1475259 1476941 1477909 1478948 1481250 1484808 1488568 1491729 1494416 1497211 1500281 1502945 1504283 1504435
60509 1504435 1504875 1506793 1509501 1511312 1511802 1512129 1513133 1514325 1515100 1515689 1516201 1515827 1513966 1511355 1508969 1506291
60493 1506291 1501808 1495186 1488056 1482562 1479662 1478859 1479213 1480592 1484195 1491694 1503747 1519665 1538637 1560680
$$ packed form
60587A265154Q717Q855Q766Q257P349O439O147O757P876Q943J0023J1608J3610
60574A378501J5148J5609J5470J5659J6495J7568J8332J8385J7566J6444J6283
60563A561460J7732J9533J9429J6511J2100Q105N223L011R87j079l462o290r079
60550A644181j1059j2029j2448j2693j2616j1875j0345q178n827l927k765k033
60538A538386j586k196m609p827r553q916p595p270p121n316k227k06j83m94L74
60523A473661J598J682R68J039K302L558L760L161K687K795L070K664J338J52
60509A504435M40J918K708J811M90L27J004J192P75N89N12l74j861k611k386k678
60493A506291m483o622p130n494k900q03L54J379L603P499J2053J5918J8972K2043
$$ plain form
60479 1560680 1586190 1615386 1648730 1687129 1730897 1779050 1830417 1884968 1943130 2004141 2065834
60468 2065834 2125536 2180096 2225399 2257387 2274224 2276927 2267874 2249401 2223881 2194170 2163316 2133969
60456 2133969 2108129 2087045 2071254 2061032 2056773 2058686 2066330 2078906 2095869 2116792 2140860 2167025
60444 2167025 2194604 2223377 2253550 2286241 2323709 2368237 2420750 2481063 2549270 2626203 2712662
60433 2712662 2809060 2915965 3034469 3165967 3311922 3473548 3651108 3843749 4050766 4272956
60423 4272956 4512293 4770813 5050715 5355004 5686595 6046395 6432642 6840970 7262435
60414 7262435 7680273 8069913 8403950 8657949 8812816 8854962 8777937 8585695 8293702 7925326
60404 7925326 7505400 7055657 6594297 6137380 5698166 5284579 4898887 4541126 4212208
$$ packed form
60479A560680K5510K9196L3344L8399M3768M8153N1367N4551N8162O1011O1693
60468B065834N9702N4560M5303L1988J6837K703r053j8473k5520k9711l0854k9347
60456B133969k5840k1084j5791j0222m259J913P644J2576J6963K0923K4068K6165
60444B167025K7579K8773L0173L2691L7468M4528N2513O0313O8207P6933Q6459
60433B712662R6398J06905J18504J31498J45955J61626J77560J92641K07017K22190
60423D272956K39337K58520K79902L04289L31591L59800L86247M08328M21465
60414G262435M17838L89640L34037K53999J54867M2146p7025j92242k91993l68376
60404G925326m19926m49743m61360m56917m39214m13587l85692l57761l28918
$$ plain form
60395 4212208 3913051 3642222 3396517 3173628 2972752 2792825 2631726 2487230 2357432
60386 2357432 2240452 2135172 2041928 1960692 1888737 1822293 1760668 1706361 1660351 1619633 1580627
60375 1580627 1542925 1508003 1476018 1445900 1417420 1391091 1366647 1343292 1321036 1300354 1281004
60364 1281004 1262692 1246526 1234168 1225464 1218108 1209917 1200692 1191954 1185668 1183018 1183464 1184814 1184837 1182958
60350 1182958 1180262 1178218 1177727 1178769 1180372 1181405 1181903 1183011 1185198 1187488 1189264 1191727 1196335 1202622
60336 1202622 1209179 1216189 1225119 1235759 1245396 1251721 1255495 1259561 1265833 1273798 1281516 1287499 1291706 1294964
60322 1294964 1297586 1298938 1298528 1296981 1295321 1293558 1290715 1286152 1280335 1274386 1269263 1265234 1261695 1257716
60308 1257716 1253189 1249149 1246605 1245553 1245673 1247379 1251163 1256210 1260670 1263336 1264437 1264999 1266306 1269754
$$ packed form
60395D212208k99157k70829k45705k22889k00876j79927j61099j44496j29798
60386B357432j16980j05280r3244q1236p1955o6444o1625n4307m6010m0718l9006
60375A580627l7702l4922l1985l0118k8480k6329k4444k3355k2256k0682j9350
60364A281004j8312j6166j2358q704p356q191r225q738o286k650M46J350K3j879
60350A182958k696k044m91J042J603J033M98J108K187K290J776K463M608O287
60336A202622O557P010Q930J0640R637O325L774M066O272P965P718N983M207L258
60322A294964K622J352m10j547j660j763k843m563n817n949n123m029l539l979
60308A257716m527m040k544j052J20J706L784N047M460K666J101N62J307L448
$$ plain form
60294 1269754 1276134 1284717 1293802 1302363 1310600 1318870 1326956 1334747 1342877 1352093 1362325 1372813 1383018
60281 1383018 1393073 1403436 1414253 1425056 1435032 1443615 1450853 1457336 1463957 1471597 1480586 1490254 1499376
60268 1499376 1507211 1513838 1519663 1525309 1532033 1541225 1552882 1565286 1576700 1586646 1594948 1600517 1602183
60255 1602183 1600132 1595352 1588025 1577648 1564629 1550664 1537391 1525465 1515051 1506408 1499675 1494482
60243 1494482 1489898 1484709 1478155 1470847 1464535 1460445 1458190 1456745 1455885 1456017 1457310 1459955 1464638 1471553
60229 1471553 1479371 1486479 1493015 1500410 1509002 1517538 1525258 1533205 1543012 1555285 1569491 1584476 1598690
60216 1598690 1610811 1620852 1630252 1640653 1652956 1667471 1684177 1702626 1722310 1743388 1766477
60205 1766477 1791666 1818390 1846361 1875876 1907135 1940176 1975699 2015026 2058734 2106055 2156238
$$ packed form
60294A269754O380Q583R085Q561Q237Q270Q086P791Q130R216J0232J0488J0205
60281A383018J0055J0363J0817J0803R976Q583P238O483O621P640Q989R668R122
60268A499376P835O627N825N646O724R192J1657J2404J1414R946Q302N569J666
60255A602183k051m780p327j0377j3019j3965j3273j1926j0414q643o733n193
60243A494482m584n189o554p308o312m090k255j445q60J32J293K645M683O915
60229A471553P818P108O536P395Q592Q536P720P947R807J2273J4206J4985J4214
60216A598690J2121J0041R400J0401J2303J4515J6706J8449J9684K1078K3089
60205A766477K5189K6724K7971K9515L1259L3041L5523L9327M3708M7321N0183
$$ plain form
60194 2156238 2209986 2268916 2333931 2404713 2480859 2563152 2653419 2752979 2861365 2977028 3099403
60183 3099403 3229608 3368802 3516857 3673520 3839888 4017124 4203929 4396724 4592469
60174 4592469 4789965 4988121 5184243 5374572 5555574 5724297 5878432 6016591 6137840
60165 6137840 6240661 6323188 6384816 6426703 6450193 6455548 6442904 6414007 6372630 6323609 6271589
60154 6271589 6220124 6171705 6129006 6095634 6074641 6066497 6070050 6085910 6117561 6168506 6239467 6329173
60142 6329173 6436675 6561713 6703518 6860374 7029993 7209519 7395382 7583617 7769899
60133 7769899 7949004 8115303 8264664 8395222 8505546 8592799 8653689 8686598 8691741 8669804
60123 8669804 8621735 8549741 8457331 8348264 8226324 8096142 7963266 7833095 7710224 7598829
$$ packed form
60194B156238N3748N8930O5015P0782P6146Q2293R0267R9560J08386J15663J22375
60183C099403J30205J39194J48055J56663J66368J77236J86805J92795J95745
60174D592469J97496J98156J96122J90329J81002J68723J54135J38159J21249
60165F137840J02821Q2527O1628M1887K3490N355j2644k8897m1377m9021n2020
60154F271589n1465m8419m2699l3372k0993q144L553J5860L1651N0945P0961Q9706
60142F329173J07502J25038J41805J56856J69619J79526J85863J88235J86282
60133G769899J79105J66299J49361J30558J10324Q7253O0890L2909N143k1937
60123H669804m8069p1994r2410j09067j21940j30182j32876j30171j22871j11395
$$ plain form
60113 7598829 7502720 7424500 7365074 7324486 7303247 7302705 7324213 7367958 7432431 7514940 7612606 7722757
60101 7722757 7842339 7967271 8092688 8213933 8327496 8431242 8523818 8603752 8669158 8718592
60091 8718592 8752068 8771128 8778392 8777679 8774176 8773252 8778704 8792829 8818413 8859718 8920998 9004741 9112027
60078 9112027 9244126 9403188 9591735 9812039 10065849 10354464 10679283 11042211 11444940
60069 11444940 11887633 12368924 12887171 13440541 14025185 14634115 15258677 15890488 16521214
60060 16521214 17141077 17738677 18302340 18821381 19286601 19690247 20025339 20284798 20461832
60051 20461832 20551601 20551929 20462194 20282926 20017823 19675535 19268233 18808692 18309544 17784451
60041 17784451 17248018 16714056 16194575 15699999 15238869 14817086 14438673 14107568 13827573
$$ packed form
60113G598829r6109p8220n9426m0588k1239n42K1508M3745O4473Q2509R7666J10151
60101G722757J19582J24932J25417J21245J13563J03746R2576P9934O5406M9434
60091H718592L3476J9060P264p13l503r24N452J4125K5584M1305O1280Q3743J07286
60078I112027J32099J59062J88547K20304K53810K88615L24819L62928M02729
60069A1444940M42693M81291N18247N53370N84644O08930O24562O31811O30726
60060A6521214O19863N97600N63663N19041M65220M03646L35092K59459J77034
60051B0461832Q9769L28q9735j79268k65103l42288m07302m59541m99148n25093
60041A7784451n36433n33962n19481m94576m61130m21783l78413l31105k79995
$$ plain form
60032 13827573 13600278 13424284 13297203 13217400 13182947 13189630 13230959 13299783 13389146 13491831
60022 13491831 13600058 13705869 13801505 13879561 13933503 13958721 13953238 13917337 13852295 13759144 13638504
60011 13638504 13491477 13320385 13128341 12918093 12691565 12450478 12197173 11934908 11667720
60002 11667720 11399988 11135733 10878132 10629908 10394191 10174604 9974328 9795299 9638492
59993 9638492 9504796 9395437 9311839 9255342 9226932 9226980 9255190 9310856 9393041 9500336 9630483
59982 9630483 9780339 9946102 10123366 10306981 10491135 10669682 10836259 10984170 11106849
59973 11106849 11199246 11258921 11285377 11278305 11236928 11161158 11052585 10913915 10748192 10559556
59963 10559556 10354337 10140136 9923484 9709030 9500939 9303913 9122251 8958672 8814724
$$ packed form
60032A3827573k27295j75994j27081p9803l4453O683M1329O8824Q9363J02685
60022A3491831J08227J05811R5636P8056N3942K5218n483l5901o5042r3151j20640
60011A3638504j47027j71092j92044k10248k26528k41087k53305k62265k67188
60002A1667720k67732k64255k57601k48224k35717k19587k00276j79029j56807
59993I638492j33696j09359q3598n6497k8410M8K8210N5666Q2185J07295J30147
59982I630483J49856J65763J77264J83615J84154J78547J66577J47911J22679
59973A1106849R2397N9675K6456p072m1377p5770j08573j38670j65723j88636
59963A0559556k05219k14201k16652k14454k08091j97026j81662j63579j43948
$$ plain form
59954 8814724 8691823 8591298 8514025 8460822 8433027 8431991 8458258 8512008 8594302 8707116 8851670
59943 8851670 9026853 9229369 9455149 9700516 9962043 10235373 10514197 10790589 11056436
59934 11056436 11304454 11528091 11721336 11879422 11999556 12080388 12120742 12119324 12075836 11992118
59924 11992118 11872176 11721331 11545409 11350466 11143023 10930242 10719484 10517339 10329065
59915 10329065 10159013 10011332 9889841 9797204 9734511 9701742 9698433 9723817 9776572 9854852 9956691
59904 9956691 10080337 10224073 10385742 10562436 10750496 10945652 11143334 11339303 11530179
59895 11530179 11713232 11885721 12045022 12189757 12320425 12438537 12545397 12642174 12731002 12815617
59885 12815617 12901116 12993335 13098034 13220130 13363922 13534369 13737585 13979377 14263700 14593122
$$ packed form
59954H814724j22901j00525p7273n3203k7795j036K6267N3750Q2294J12814J44554
59943H851670J75183K02516K25780K45367K61527K73330K78824K76392K65847
59934A1056436K48018K23637J93245J58086J20134Q0832M0354j418m3488q3718
59924A1992118j19942j50845j75922j94943k07443k12781k10758k02145j88274
59915A0329065j70052j47681j21491r2637o2693l2769l309K5384N2755P8280J01839
59904I956691J23646J43736J61669J76694J88060J95156J97682J95969J90876
59895A1530179J83053J72489J59301J44735J30668J18112J06860R6777Q8828Q4615
59885A2815617Q5499R2219J04699J22096J43792J70447K03216K41792K84323L29422
$$ plain form
59875 14593122 14969984 15395786 15869600 16388153 16946985 17539797 18156301 18781985 19400372
59866 19400372 19994285 20544699 21030211 21429300 21723397 21898561 21946664 21866722 21664701 21351303
59856 21351303 20940495 20450035 19901042 19314612 18708530 18097476 17494897 16913042 16361565
59847 16361565 15847391 15375704 14950312 14573838 14248824 13978188 13763590 13604084 13497611
59838 13497611 13442983 13438781 13481054 13564272 13684379 13838686 14022318 14226695 14441994 14659050
59828 14659050 14867731 15055258 15207908 15313775 15363120 15347633 15261438 15102775 14873659 14578433
59818 14578433 14223975 13820805 13381989 12919945 12444667 11964718 11488486 11023652 10576075
59809 10576075 10149733 9747245 9369987 9018483 8693576 8397001 8130036 7891797 7679629
$$ packed form
59875A4593122L76862M25802M73814N18553N58832N92812O16504O25684O18387
59866A9400372N93913N50414M85512L99089K94097J75164M8103p9942k02021l13398
59856B1351303m10808m90460n48993n86430o06082o11054o02579n81855n51477
59847A6361565n14174m71687m25392l76474l25014k70636k14598j59506j06473
59838A3497611n4628m202M2273Q3218J20107J54307J83632K04377K15299K17056
59828A4659050K08681J87527J52650J05867M9345j5487q6195j58663k29116k95226
59818A4578433l54458m03170m38816m62044m75278m79949m76232m64834m47577
59809A0576075m26342m02488l77258l51504l24907k96575k66965k38239k12168
$$ plain form
59800 7679629 7491216 7325463 7181072 7055066 6943355 6842333 6749500 6662974 6581144 6502677
59790 6502677 6426433 6351561 6278218 6208034 6143351 6085942 6036668 5995751 5962443 5934341 5907745
59779 5907745 5878960 5845099 5804161 5755307 5699123 5636824 5569055 5496129 5419514 5342373 5268404
59768 5268404 5200594 5140783 5089498 5046145 5010336 4983183 4966542 4961119 4966480 4982892 5011566 5052550
59756 5052550 5103775 5162868 5228726 5300694 5377797 5459920 5548565 5645006 5748395 5856469 5966908
59745 5966908 6076637 6181011 6275700 6359218 6432276 6495139 6547176 6588793 6622201 6650060 6674641
59734 6674641 6698597 6725483 6759017 6802221 6857168 6924998 7006463 7103252 7218640 7356243 7518539
59723 7518539 7707326 7925144 8175146 8459835 8780897 9139980 9538478 9976404 10452162
$$ packed form
59800G679629j88413j65753j44391j26006j11711j01022r2833q6526q1830p8467
59790F502677p6244p4872p3343p0184o4683n7409m9274m0917l3308k8102k6596
59779E907745k8785l3861m0938m8854n6184o2299o7769p2926p6615p7141p3969
59768E268404o7810n9811n1285m3353l5809k7153j6641n423N361J6412K8674M0984
59756E052550N1225N9093O5858P1968P7103Q2123Q8645R6441J03389J08074J10439
59745E966908J09729J04374R4689Q3518P3058O2863N2037M1617L3408K7859K4581
59734F674641K3956K6886L3534M3204N4947O7830Q1465R6789J15388J37603J62296
59723G518539J88787K17818K50002K84689L21062L59083L98498M37926M75758
$$ plain form
59714 10452162 10963071 11504853 12069836 12645127 13210929 13739424 14196797 14549913 14774326
59705 14774326 14858771 14805782 14631015 14360897 14026525 13656134 13271613 12889959 12525094 12187296
59695 12187296 11882613 11614286 11384374 11193879 11042517 10929389 10853665 10814533 10811196 10843180
59685 10843180 10910127 11011332 11146215 11314994 11517903 11753956 12021931 12322699 12659295
59676 12659295 13034355 13448770 13903211 14399545 14940074 15526634 16161373 16847464 17588060
59667 17588060 18385086 19239516 20151969 21122221 22148524 23227618 24354345 25520447 26714282
59658 26714282 27922278 29130355 30324236 31490289 32617887 33701174 34738805 35733416
59650 35733416 36692340 37627609 38553248 39481735 40422432 41381339 42360070 43354595 44355617
$$ packed form
59714A0452162N10909N41782N64983N75291N65802N28495M57373L53116K24413
59705A4774326Q4445n2989j74767k70118l34372l70391l84521l81654l64865l37798
59695A2187296l04683k68327k29912j90495j51362j13128p5724l9132l337L1984
59685A0843180O6947J01205J34883J68779K02909K36053K67975L00768L36596
59676A2659295L75060M14415M54441M96334N40529N86560O34739O86091P40596
59667A7588060P97026Q54430R12453R70252J026303J079094J126727J166102J193835
59658B6714282J207996J208077J193881J166053J127598J083287J037631R94611
59650C5733416R58924R35269R25639R28487R40697R58907R78731R94525J001022
$$ plain form
59641 44355617 45349795 46319560 47242303 48092021 48843785 49477678 49979852 50342289 50563700
59632 50563700 50650916 50618373 50485340 50273425 50006372 49710739 49414629 49144221 48921122 48762748
59622 48762748 48684457 48700801 48825242 49069390 49442214 49949276 50592672 51372011 52284968 53325924
59612 53325924 54483454 55738542 57063877 58423623 59773906 61064118 62238062 63234916
59604 63234916 63992606 64455090 64580571 64346502 63751084 62813188 61570412 60074065 58382869
59595 58382869 56558084 54659300 52739215 50839676 48992108 47219885 45537756 43949247
59587 43949247 42446891 41015163 39631603 38266866 36889564 35475942 34016519 32515402
59579 32515402 30986910 29453349 27941087 26473444 25066072 23728902 22469673 21293274
$$ packed form
59641D4355617R94178R69765R22743Q49718P51764O33893N02174L62437K21411
59632E0563700Q7216l2543j33033k11915k67053k95633k96110k70408k23099j58374
59622D8762748p8291J6344J24441K44148L72824N07062O43396P79339R12957J040956
59612E3325924J157530J255088J325335J359746J350283J290212J173944R96854
59604F3234916P57690M62484J25481k34069n95418r37896j242776j496347j691196
59595E8382869j824785j898784j920085j899539j847568j772223j682129j588509
59587D3949247j502356j431728j383560j364737j377302j413622j459423j501117
59579C2515402j528492j533561j512262j467643j407372j337170j259229j176399
$$ plain form
59571 21293274 20199616 19185253 18246865 17381528 16585026 15852619 15181239 14568783 14011512
59562 14011512 13504268 13043187 12626099 12250034 11910242 11602186 11322886 11069828 10840013
59553 10840013 10630665 10439469 10263281 10097480 9937357 9779523 9621584 9461295 9296906
59544 9296906 9128035 8955637 8780936 8604385 8425683 8245197 8065611 7891567 7727026
59535 7727026 7573293 7430018 7297301 7175793 7065516 6966213 6878810 6805007 6745103 6697621
59525 6697621 6661513 6637407 6625831 6625370 6633801 6650461 6676306 6711839 6755975 6806995 6863647 6924982
59513 6924982 6989824 7057060 7126413 7198693 7275383 7358084 7448081 7546097 7652617 7768829 7897210
59502 7897210 8040725 8201222 8378897 8573415 8785211 9015610 9266331 9539229 9836017
$$ packed form
59571B1293274j093658j014363r38388q65337p96502p32407o71380o12456n57271
59562A4011512n07244m61081m17088l76065l39792l08056k79300k53058k29815
59553A0840013k09348j91196j76188j65801j60123j57834j57939j60289j64389
59544I296906j68871j72398j74701j76551j78702j80486j79586j74044j64541
59535G727026j53733j43275j32717j21508j10277r9303q7403p3803n9904m7482
59525F697621l6108k4106j1576m61Q431J6660K5845L5533M4136N1020N6652O1335
59513F924982O4842O7236O9353P2280P6690Q2701Q9997R8016J06520J16212J28381
59502G897210J43515J60497J77675J94518K11796K30399K50721K72898K96788
$$ plain form
59493 9836017 10157537 10503522 10873351 11266564 11682112 12117720 12570682 13038665 13518804
59484 13518804 14006463 14495907 14981680 15458114 15918111 16354350 16762141 17139895 17486747
59475 17486747 17801190 18082132 18329510 18543169 18722638 18868885 18985310 19076652 19148273 19206967
59465 19206967 19260724 19316618 19380111 19456947 19553709 19674777 19819652 19983962 20161137 20341404
59455 20341404 20510726 20653217 20754384 20801103 20780440 20681508 20498555 20230580 19878656 19445932
59445 19445932 18939936 18372469 17756795 17106574 16437132 15764717 15102865 14460621 13844787
59436 13844787 13262076 12718038 12215439 11755124 11337563 10962546 10628389 10332926 10074898
59427 10074898 9853461 9667036 9514067 9394581 9309415 9257478 9235101 9239082 9269715 9329834
$$ packed form
59493I836017L21520L45985L69829L93213M15548M35608M52962M67983M80139
59484A3518804M87659M89444M85773M76434M59997M36239M07791L77754L46852
59475A7486747L14443K80942K47378K13659J79469J46247J16425R1342P1621N8694
59465A9206967N3757N5894O3493P6836R6762J21068J44875J64310J77175J80267
59455B0341404J69322J42491J01167M6719k0663r8932j82953k67975l51924m32724
59445A9445932n05996n67467o15674o50221o69442o72415o61852o42244o15834
59436A3844787n82711n44038n02599m60315m17561l75017l34157k95463k58028
59427A0074898k21437j86425j52969j19486q5166n1937k2377L981L0633O0119
$$ plain form
59417 9329834 9421207 9543035 9694017 9874397 10084901 10324398 10589911 10878757 11189465 11520345
59407 11520345 11867858 12226229 12587637 12942702 13281875 13596499 13877577 14113799 14292692
59398 14292692 14404525 14444105 14408946 14298124 14114189 13864261 13557392 13201898 12806377 12381433
59388 12381433 11938029 11484799 11028594 10576430 10134707 9707215 9296285 8905433 8538690
59379 8538690 8197516 7880625 7586817 7315824 7066445 6836455 6625139 6433856 6263293
59370 6263293 6111948 5978062 5861069 5760136 5673123 5598546 5537287 5490741 5457964 5435951
59360 5435951 5422311 5416733 5420215 5433550 5456272 5486569 5522682 5564722 5614596 5674010 5743295 5822016
59348 5822016 5909038 6001138 6093052 6180692 6264272 6347635 6435234 6530670 6637310 6758502 6896724
$$ packed form
59417I329834R1373J21828J50982J80380K10504K39497K65513K88846L10708L30880
59407A1520345L47513L58371L61408L55065L39173L14624K81078K36222J78893
59398A4292692J11833L9580l5159j10822j83935k49928l06869l55494l95521m24944
59388A2381433m43404m53230m56205m52164m41723m27492m10930l90852l66743
59379H538690l41174l16891k93808k70993k49379k29990k11316j91283j70563
59370F263293j51345j33886j16993j00933q7013p4577o1259m6546l2777k2013
59360E435951j3640n578L482J3335K2722L0297L6113M2040M9874N9414O9285P8721
59348E822016Q7022R2100R1914Q7640Q3580Q3363Q7599R5436J06640J21192J38222
$$ plain form
59337 6896724 7053451 7229993 7427370 7644580 7877741 8122471 8378078 8649367 8943915
59328 8943915 9267663 9623615 10014466 10444931 10920350 11443785 12015859 12637271 13310068
59319 13310068 14036119 14815303 15645339 16522033 17438559 18384652 19346876 20309459 21255209
59310 21255209 22167035 23030178 23833874 24571577 25240352 25840023 26371966 26837846 27239196
59301 27239196 27577672 27854873 28071481 28226683 28318187 28342374 28294663 28170640 27967337 27683753
59291 27683753 27321261 26884759 26383189 25827618 25228144 24592759 23928357 23241220 22536171
59282 22536171 21816362 21084374 20342955 19594963 18844068 18096035 17358185 16637042 15937466
59273 15937466 15264274 14623114 14018501 13451983 12923380 12433019 11981653 11568910 11193315
$$ packed form
59337F896724J56727J76542J97377K17210K33161K44730K55607K71289K94548
59328H943915L23748L55952L90851M30465M75419N23435N72074O21412O72797
59319A3310068P26051P79184Q30036Q76694R16526R46093R62224R62583R45750
59310B1255209R11826Q63143Q03696P37703O68775N99671N31943M65880M01350
59301B7239196L38476K77201K16608J55202R1504K4187m7711j24023k03303k83584
59291B7683753l62492m36502n01570n55571n99474o35385o64402o87137p05049
59282B2536171p19809p31988p41419p47992p50895p48033p37850p21143o99576
59273A5937466o73192o41160o04613n66518n28603m90361m51366m12743l75595
$$ plain form
59264 11193315 10853643 10549001 10277732 10037541 9826999 9645849 9493355 9367174 9264435
59255 9264435 9183400 9123423 9083688 9062609 9058372 9069352 9093849 9129843 9175207 9227758 9284793
59244 9284793 9342887 9398555 9449035 9492217 9526302 9550300 9564706 9570821 9569113 9558897 9539976 9514055
59232 9514055 9484392 9454687 9428596 9409413 9399446 9399990 9412370 9438612 9480930 9541196 9621202 9722511
59220 9722511 9845343 9988266 10149454 10327471 10520405 10725413 10939987 11162401 11389560
59211 11389560 11615273 11831942 12033355 12214770 12371483 12499349 12596262 12661261 12692227 12686266
59201 12686266 12642707 12564689 12457993 12329688 12187605 12039135 11889585 11742073 11598580 11460022
59191 11460022 11325872 11195314 11068637 10946232 10826798 10708481 10591687 10478991 10372400
$$ packed form
59264A1193315l39672l04642k71269k40191k10542j81150j52494j26181j02739
59255I264435q1035n9977l9735k1079m237J0980K4497L5994M5364N2551N7035
59244I284793N8094N5668N0480M3182L4085K3998J4406O115j708j0216j8921k5921
59232I514055k9663k9705k6091j9183r967N44J2380K6242M2318O0266Q0006J01309
59220I722511J22832J42923J61188J78017J92934K05008K14574K22414K27159
59211A1389560K25713K16669K01413J81415J56713J27866R6913O4999L0966n961
59201A2686266m3559p8018j06696j28305j42083j48470j49550j47512j43493j38558
59191A1460022j34150j30558j26677j22405j19434j18317j16794j12696j06591
$$ plain form
59182 10372400 10272636 10181056 10100013 10031065 9975106 9934894 9915323 9920459 9952254 10012806 10105448
59171 10105448 10232427 10393841 10590579 10826469 11105654 11429374 11797078 12209027 12665268
59162 12665268 13162424 13693083 14247536 14814154 15378342 15922853 16429317 16878798 17252031
59153 17252031 17531451 17703977 17761586 17699962 17518132 17219652 16813361 16312851 15735586 15101721
59143 15101721 14431917 13744878 13056098 12377938 11720092 11090156 10494247 9936915 9420330
59134 9420330 8944158 8506807 8106633 7741880 7410282 7109452 6837316 6591801 6370519
59125 6370519 6171164 5991959 5831459 5688298 5561164 5448613 5349066 5261632 5186613 5124189
59115 5124189 5072796 5030183 4996053 4971967 4958237 4952630 4953030 4959908 4975027 4998836 5030247 5068117
$$ packed form
59182A0372400r9764r1580q1043o8948n5959m0212j9571N136L1795O0552R2642
59171A0105448J26979J61414J96738K35890K79185L23720L67704M11949M56241
59162A2665268M97156N30659N54453N66618N64188N44511N06464M49481L73233
59153A7252031K79420J72526N7609o1624j81830k98480m06291n00510n77265o33865
59143A5101721o69804o87039o88780o78160o57846o29936n95909n57332n16585
59134I420330m76172m37351m00174l64753l31598l00830k72136k45515k21282
59125F370519j99355j79205j60500j43161j27134j12551r9547q7434p5019o2424
59115E124189n1393m2613l4130k4086j3730n607M00O878J5119K3809L1411L7870
$$ plain form
59103 5068117 5111989 5162220 5220343 5288463 5367217 5454776 5548488 5646945 5750075 5858194 5971430
59092 5971430 6089035 6208807 6328376 6447437 6566983 6685491 6797676 6898338 6985838 7060530
59082 7060530 7121728 7168317 7200796 7220211 7226071 7217983 7198879 7173959 7146236 7115332 7081075 7046173
59070 7046173 7014664 6989467 6972416 6965364 6970066 6987577 7018623 7064373 7126535 7206830 7306370 7425224
59058 7425224 7562644 7718062 7891782 8084632 8297492 8531316 8786756 9063127 9358522
59049 9358522 9671704 10003007 10352315 10716687 11090856 11469142 11845450 12211799 12558412
59040 12558412 12875429 13153513 13382946 13553569 13656555 13686416 13641826 13525191 13341292 13095873
59030 13095873 12795645 12449447 12067929 11660845 11235092 10796081 10350135 9904412 9465064
$$ packed form
59103E068117M3872N0231N8123O8120P8754Q7559R3712R8457J03130J08119J13236
59092E971430J17605J19772J19569J19061J19546J18508J12185J00662Q7500P4692
59082G060530O1198M6589L2479J9415N860q088j9104k4920k7723l0904l4257l4902
59070G046173l1509k5197j7051p052M702J7511L1046M5750O2162Q0295R9540J18854
59058G425224J37420J55418J73720J92850K12860K33824K55440K76371K95395
59049I358522L13182L31303L49308L64372L74169L78286L76308L66349L46613
59040A2558412L17017K78084K29433J70623J02986K9861m4590j16635j83899k45419
59030A3095873l00228l46198l81518m07084m25753m39011m45946m45723m39348
$$ plain form
59021 9465064 9036499 8621843 8223023 7840903 7476491 7131572 6807236 6502465 6215285
59012 6215285 5944791 5691003 5453591 5232112 5026692 4836845 4660247 4494558 4340040
59003 4340040 4198477 4069622 3950732 3839796 3737273 3644024 3559204 3481028 3408501 3341626
58993 3341626 3280626 3225224 3173861 3123713 3072641 3021232 2971743 2924988 2879728 2835243 2792649
58982 2792649 2752800 2714485 2676056 2637938 2602364 2571203 2544971 2523334 2505535 2490661 2478522
58971 2478522 2470162 2466706 2467757 2471697 2477672 2486437 2498775 2513740 2529230 2544106 2558806 2573666
58959 2573666 2587675 2599625 2609624 2618202 2624439 2626682 2625287 2623033 2622306 2623310 2625627 2629914 2636881 2645981
58945 2645981 2656480 2668723 2682930 2697662 2711055 2722794 2733378 2742177 2747980 2751027 2752791 2753943
$$ packed form
59021I465064m28565m14656l98820l82120l64412l44919l24336l04771k87180
59012F215285k70494k53788k37412k21479k05420j89847j76598j65689j54518
59003D340040j41563j28855j18890j10936j02523r3249q4820p8176p2527o6875
58993C341626o1000n5402n1363n0148n1072n1409m9489m6755m5260m4485m2594
58982B792649l9849l8315l8429l8118l5574l1161k6232k1637j7799j4874j2139
58971B478522q360l456J051L940N975Q765J2338J4965J5490J4876J4700J4860
58959B573666J4009J1950R999Q578O237K243j395k254p27J004K317M287O967R100
58945B645981J0499J2243J4207J4732J3393J1739J0584Q799N803L047J764J152
$$ plain form
58933 2753943 2754059 2753189 2752246 2752015 2753169 2756942 2764165 2773746 2783803 2794459 2807932 2825681 2846964 2870478
58919 2870478 2895806 2922855 2951429 2982076 3016056 3053723 3093906 3135513 3178723 3224138 3271819
58908 3271819 3321823 3374649 3430310 3487819 3546539 3607539 3672673 3742534 3816062 3892197 3971265
58897 3971265 4054366 4141607 4231547 4322831 4416132 4513713 4617081 4726030 4840234 4960583
58887 4960583 5088218 5223427 5366661 5519599 5683723 5858543 6042804 6237192 6444339
58878 6444339 6666307 6903412 7155444 7422771 7706226 8007130 8327466 8669057 9032750
58869 9032750 9419477 9831905 10273762 10747626 11254515 11795517 12372762 12989045 13647776
58860 13647776 14353004 15107983 15913701 16769993 17677733 18638144 19649829 20707903 21805914
$$ packed form
58933B753943J16q70r43k31J154L773P223R581J0057J0656J3473J7749K1283K3514
58919B870478K5328K7049K8574L0647L3980L7667M0183M1607M3210M5415M7681
58908C271819N0004N2826N5661N7509N8720O1000O5134O9861P3528P6135P9068
58897C971265Q3101Q7241Q9940R1284R3301R7581J03368J08949J14204J20349
58887D960583J27635J35209J43234J52938J64124J74820J84261J94388K07147
58878F444339K21968K37105K52032K67327K83455L00904L20336L41591L63693
58869I032750L86727M12428M41857M73864N06889N41002N77245O16283O58731
58860A3647776P05228P54979Q05718Q56292R07740R60411J011685J058074J098011
$$ plain form
58851 21805914 22936546 24089662 25250812 26401890 27521687 28585228 29564148 30429141
58843 30429141 31152399 31708910 32078140 32246482 32208654 31967585 31534226 30927072 30169746
58834 30169746 29287727 28307150 27255126 26158240 25039382 23916733 22805615 21719546
58826 21719546 20669117 19661390 18701227 17792123 16935663 16131810 15380393 14681097 14031671
58817 14031671 13427686 12864769 12339866 11850057 11391965 10963322 10563675 10192429 9847208
58808 9847208 9525006 9224033 8943728 8683922 8444627 8225550 8025098 7840829 7671571
58799 7671571 7518076 7381002 7259340 7151510 7056821 6974926 6904919 6846037 6798601 6763375
58789 6763375 6740591 6730246 6732660 6748046 6776116 6816682 6870083 6936595 7016223 7109505 7217678
$$ packed form
58851B1805914J130632J153116J161150J151078J119797J063541R78920Q64993
58843C0429141P23258N56511L69230J68342l7828k41069m33359o07154p57326
58834C0169746q82019r80577j052024j096886j118858j122649j111118j086069
58826B1719546j050429j007727r60163r09104q56460q03853p51417o99296o49426
58817A4031671o03985n62917n24903m89809m58092m28643l99647l71246l45221
58808I847208l22202l00973k80305k59806k39295k19077k00452j84269j69258
58799G671571j53495j37074j21662j07830r4689q1895p0007n8882m7436l5226
58789F763375k2784j0345K414J5386K8070M0566N3401O6512P9628R3282J08173
$$ plain form
58778 7217678 7341425 7480164 7633174 7800827 7984177 8183985 8400849 8635899 8890697
58769 8890697 9166400 9463199 9780718 10119317 10481144 10869326 11285787 11730877 12205953
58760 12205953 12715151 13263281 13853031 14485919 15164889 15893580 16673471 17504175 18386318
58751 18386318 19321208 20306888 21336568 22401272 23491393 24594437 25693008 26765798
58743 26765798 27788678 28734239 29572864 30276395 30820481 31184100 31350434 31310886 31067522
58734 31067522 30630976 30017673 29249721 28354485 27361026 26296462 25185354 24049920 22908781
58725 22908781 21776618 20666099 19588601 18551962 17559619 16613792 15718027 14875019 14083884
58716 14083884 13341931 12647885 12001093 11398622 10835601 10308116 9813891 9350714 8916268
$$ packed form
58778G217678J23747J38739J53010J67653J83350J99808K16864K35050K54798
58769H890697K75703K96799L17519L38599L61827L88182M16461M45090M75076
58760A2205953N09198N48130N89750O32888O78970P28691P79891Q30704Q82143
58751A8386318R34890R85680J029680J064704J090121J103044J098571J072790
58743B6765798J022880R45561Q38625P03531N44086L63619J66334l9548k43364
58734C1067522m36546o13303p67952q95236r93459j064564j111108j135434j141139
58725B2908781j132163j110519j077498j036639r92343r45827q95765q43008p91135
58716A4083884p41953o94046o46792o02471n63021n27485m94225m63177m34446
$$ plain form
58707 8916268 8509367 8129561 7775455 7444660 7135107 6845220 6573286 6318022 6079424
58698 6079424 5857609 5651101 5457593 5276250 5107880 4952812 4809746 4676910 4553445
58689 4553445 4439433 4335044 4239610 4151313 4068118 3989335 3915718 3847759 3784654 3725371 3669752
58678 3669752 3617849 3568974 3522106 3476539 3431602 3386580 3341549 3297369 3254228 3211147 3167529
58667 3167529 3123998 3080781 3036362 2988868 2938103 2885342 2831821 2778148 2724451 2670486 2616349
58656 2616349 2563367 2513085 2464966 2416704 2367510 2319386 2274076 2230556 2187021 2143740 2102150
58645 2102150 2062405 2023908 1987389 1954411 1925084 1897924 1871856 1847005 1823622 1801329 1779390
58634 1779390 1757096 1734258 1711887 1691739 1674529 1659187 1644336 1629699 1615688 1602863 1592449
$$ packed form
58707H916268m06901l79806l54106l30795l09553k89887k71934k55264k38598
58698F079424k21815k06508j93508j81343j68370j55068j43066j32836j23465
58689D553445j14012j04389r5434q8297q3195p8783p3617o7959o3105n9283n5619
58678C669752n1903m8875m6868m5567m4937m5022m5031m4180m3141m3081m3618
58667C167529m3531m3217m4419m7494n0765n2761n3521n3673n3697n3965n4137
58656B616349n2982n0282m8119m8262m9194m8124m5310m3520m3535m3281m1590
58645B102150l9745l8497l6519l2978k9327k7160k6068k4851k3383k2293k1939
58634A779390k2294k2838k2371k0148j7210j5342j4851j4637j4011j2825j0414
$$ plain form
58623 1592449 1585908 1582912 1580820 1577131 1571505 1564813 1557668 1550835 1545418 1541288 1536689 1530762 1525131 1521617
58609 1521617 1519754 1518097 1516719 1516670 1518007 1520016 1522571 1525739 1528905 1531739 1535140 1539828 1544822 1548785
58595 1548785 1552127 1556477 1562832 1571423 1582548 1596387 1612701 1631581 1653467 1677767 1702979 1729042
58583 1729042 1757852 1790343 1825049 1860987 1899840 1943534 1991651 2043333 2099661 2161734 2228066
58572 2228066 2296598 2367921 2444057 2525527 2612286 2706214 2809684 2922638 3044060 3175558
58562 3175558 3320485 3480002 3652983 3839491 4041589 4260833 4497746 4753697 5030376
58553 5030376 5326795 5638827 5962004 6292918 6627662 6960551 7284014 7587836 7858834
58544 7858834 8083525 8251647 8356381 8392831 8359269 8259754 8103068 7898796 7656023 7384771
$$ packed form
58623A592449o541k996k092l689n626o692p145o833n417m130m599n927n631l514
58609A521617j863j657j378m9J337K009K555L168L166K834L401M688M994L963
58595A548785L342M350O355Q591J1125J3839J6314J8880K1886K4300K5212K6063
58583A729042K8810L2491L4706L5938L8853M3694M8117N1682N6328O2073O6332
58572B228066O8532P1323P6136Q1470Q6759R3928J03470J12954J21422J31498
58562C175558J44927J59517J72981J86508K02098K19244K36913K55951K76679
58553E030376K96419L12032L23177L30914L34744L32889L23463L03822K70998
58544G858834K24691J68122J04734L6450l3562r9515j56686k04272k42773k71252
$$ plain form
58534 7384771 7095513 6796486 6493349 6191445 5896213 5611182 5337662 5076981 4831467
58525 4831467 4603153 4393027 4201485 4027905 3869994 3725339 3593535 3475343 3370183
58516 3370183 3276148 3191902 3116525 3047992 2983980 2924144 2869605 2820235 2774189 2729842 2686444
58505 2686444 2643286 2600019 2557337 2515469 2472626 2426964 2379318 2331721 2284048 2234781 2184481
58494 2184481 2135556 2088775 2042991 1998445 1957351 1920577 1886321 1852858 1820472 1790047 1761781
58483 1761781 1735846 1712576 1691496 1671644 1652918 1635643 1619134 1602440 1586006 1570587 1554920
58472 1554920 1536803 1516233 1495262 1475001 1455015 1435289 1416342 1397644 1378418 1359736 1343184
58461 1343184 1327695 1310572 1291587 1273174 1256531 1240648 1225431 1212467 1201805 1190983 1178515
$$ packed form
58534G384771k89258k99027l03137l01904k95232k85031k73520k60681k45514
58525D831467k28314k10126j91542j73580j57911j44655j31804j18192j05160
58516C370183r4035q4246p5377o8533o4012n9836n4539m9370m6046m4347m3398
58505B686444m3158m3267m2682m1868m2843m5662m7646m7597m7673m9267n0300
58494B184481m8925m6781m5784m4546m1094l6774l4256l3463l2386l0425k8266
58483A761781k5935k3270k1080j9852j8726j7275j6509j6694j6434j5419j5667
58472A554920j8117k0570k0971k0261j9986j9726j8947j8698j9226j8682j6552
58461A343184j5489j7123j8985j8413j6643j5883j5217j2964j0662j0822j2468
$$ plain form
58450 1178515 1165953 1155429 1147271 1140915 1136122 1132415 1129126 1126667 1126125 1127377 1129240 1131386 1134178 1136922
58436 1136922 1138718 1140789 1145219 1151346 1156257 1159248 1162882 1169056 1176757 1184408 1191747 1198534 1203896 1208004
58422 1208004 1212332 1217407 1222153 1225926 1229261 1232249 1234129 1234668 1233988 1231207 1225558 1218590 1212643 1207180
58408 1207180 1199343 1188126 1175251 1162043 1148498 1135454 1124380 1114595 1103916 1092570 1083323 1077153
58396 1077153 1072023 1066583 1061882 1058559 1055450 1051931 1048774 1045871 1042085 1038136 1036628 1038294 1041035 1043400
58382 1043400 1046239 1050405 1055944 1064047 1076454 1092025 1107097 1120027 1132185 1143904 1153149 1159261
58370 1159261 1164317 1169341 1172545 1172699 1171154 1169260 1166928 1164839 1164773 1166481 1167458 1167046 1167630 1170655 1174794
58355 1174794 1179101 1184468 1190819 1196471 1201612 1208829 1218739 1228602 1236680 1244467 1253240 1261967 1270043 1278473
$$ packed form
58450A178515j2562j0524q158o356m793l707l289k459n42J252J863K146K792K744
58436A136922J796K071M430O127M911K991L634O174P701P651P339O787N362M108
58422A208004M328N075M746L773L335K988J880N39o80k781n649o968n947n463
58408A207180p837j1217j2875j3208j3545j3044j1074r785j0679j1346r247o170
58396A077153n130n440m701l323l109l519l157k903l786l949j508J666K741K365
58382A043400K839M166N539Q103J2407J5571J5072J2930J2158J1719R245O112
58370A159261N056N024L204J54j545j894k332k089o6J708R77m12N84L025M139
58355A174794M307N367O351N652N141P217R910R863Q078P787Q773Q727Q076Q430
$$ plain form
58341 1278473 1286852 1292716 1295300 1296445 1296740 1294677 1290688 1287621 1285785 1282035 1275403 1268988 1264414 1259269
58327 1259269 1252334 1246583 1244312 1243817 1243570 1245177 1249206 1252522 1253003 1252892 1254369 1255852 1255796 1256157 1258825 1262516
58311 1262516 1266491 1273413 1285034 1298652 1311274 1323752 1337520 1351018 1362921 1375458 1390819 1407305
58299 1407305 1422336 1436324 1450535 1464283 1477160 1490876 1506144 1521000 1534599 1549027 1565059
58288 1565059 1580276 1593835 1608455 1624931 1639544 1650120 1659568 1669823 1677424 1679360 1678514 1678892 1679968
58275 1679968 1680203 1681680 1686550 1692990 1699282 1707901 1721092 1736454 1751297 1767228 1786089 1805770 1824629
58262 1824629 1845535 1870780 1897517 1923107 1950248 1981537 2013607 2042397 2069911 2100047 2131766
58251 2131766 2162063 2191628 2221823 2250013 2273665 2295279 2317797 2339156 2356952 2374183 2394501
$$ packed form
58341A278473Q379N864K584J145K95k063l989l067j836l750o632o415m574n145
58327A259269o935n751k271m95k47J607M029L316M81j11J477J483n6L61K668L691
58311A262516L975O922J1621J3618J2622J2478J3768J3498J1903J2537J5361J6486
58299A407305J5031J3988J4211J3748J2877J3716J5268J4856J3599J4428J6032
58288A565059J5217J3559J4620J6476J4613J0576R448J0255P601J936q46L78J076
58275A679968K35J477M870O440O292Q619J3191J5362J4843J5931J8861J9681J8859
58262A824629K0906K5245K6737K5590K7141L1289L2070K8790K7514L0136L1719
58251B131766L0297K9565L0195K8190K3652K1614K2518K1359J7796J7231K0318
$$ plain form
58240 2394501 2416049 2435941 2456541 2481108 2507505 2532531 2558334 2588168 2620150 2651800 2686461
58229 2686461 2728398 2775537 2823712 2873875 2928363 2984398 3038534 3093483 3153364 3216179 3278012
58218 3278012 3340611 3407725 3478114 3549223 3623417 3703537 3786955 3871173 3960273 4058210 4160871
58207 4160871 4262554 4365048 4472353 4582241 4691728 4805157 4927760 5056781 5188366
58198 5188366 5327507 5481381 5648347 5823478 6009403 6211445 6427650 6654036 6893912
58189 6893912 7151432 7422087 7700758 7992959 8306590 8639115 8985044 9349506 9741552
58180 9741552 10160649 10603136 11075373 11586219 12132541 12706331 13309978 13950277 14624227
58171 14624227 15326027 16061359 16839019 17655157 18501749 19383653 20311353 21285380 22305582
$$ packed form
58240B394501K1548J9892K0600K4567K6397K5026K5803K9834L1982L1650L4661
58229B686461M1937M7139M8175N0163N4488N6035N4136N4949N9881O2815O1833
58218C278012O2599O7114P0389P1109P4194Q0120Q3418Q4218Q9100R7937J02661
58207D160871J01683J02494J07305J09888J09487J13429J22603J29021J31585
58198E188366J39141J53874J66966J75131J85925K02042K16205K26386K39876
58189F893912K57520K70655K78671K92201L13631L32525L45929L64462L92046
58180I741552M19097M42487M72237N10846N46322N73790O03647O40299O73950
58171A4624227P01800P35332P77660Q16138Q46592Q81904R27700R74027J020202
$$ plain form
58162 22305582 23387228 24549058 25793576 27117772 28533529 30057058 31688834 33426621
58154 33426621 35288423 37299840 39470068 41804234 44325686 47058570 50002548 53155662
58146 53155662 56550002 60236061 64251635 68644874 73512784 78978721 85151051 92147511
58138 92147511 100139498 109325485 119889014 132040117 146059108 162206810 180591271
58131 180591271 201186130 223973309 249067297 276862099 308155946 343704008 382776089
58124 382776089 421628149 453775383 472702515 475117493 462121265 437737473 406578004
58117 406578004 372448819 338085979 305277433 274991816 247594525 223114193 201386429
58110 201386429 182102707 164910975 149536510 135797245 123548100 112670682 103089607
$$ packed form
58162B2305582J081646J161830J244518J324196J415757J523529J631776J737787
58154C3426621J861802K011417K170228K334166K521452K732884K943978L153114
58146E3155662L394340L686059M015574M393239M867910N465937O172330O996460
58138I2147511P991987R185987J0563529J2151103J4018991J6147702J8384461
58131A80591271K0594859K2787179K5093988K7794802L1293847L5548062L9072081
58124C82776089L8852060L2147234J8927132K414978j2996228k4383792l1159469
58117D06578004l4129185l4362840l2808546l0285617k7397291k4480332k1727764
58110B01386429j9283722j7191732j5374465j3739265j2249145j0877418r581075
$$ plain form
58103 103089607 94737289 87510936 81299697 76030565 71650381 68088543 65274084 63161152
58095 63161152 61698795 60803354 60403855 60503809 61186307 62593079 64879704 68038358 71616555
58086 71616555 74654880 76088431 75343411 72584174 68443363 63593087 58530182 53579828
58078 53579828 48937582 44690202 40854008 37417276 34348032 31590750 29088226 26805565
58070 26805565 24724517 22829215 21109804 19565589 18190288 16962902 15861192 14873211
58062 14873211 13988812 13191917 12468313 11809571 11203228 10630956 10083002 9563880 9078770
58053 9078770 8624982 8200727 7809961 7452920 7122549 6814922 6532406 6272261 6023267
58044 6023267 5778458 5540671 5311294 5084697 4859015 4641753 4438912 4247924 4066304
$$ packed form
58103A03089607q352318p226353o211239n269132m380184l561838k814459k112932
58095F3161152j462357q95441l99499R9954O82498J406772K286625L158654L578197
58086G1616555L038325J433551p45020k759237m140811m850276n062905m950354
58078E3579828m642246m247380l836194l436732l069244k757282k502524k282661
58070B6805565k081048j895302j719411j544215j375301j227386j101710r87981
58062A4873211q84399p96895p23604o58742o06343n72272n47954n19122m85110
58053I078770m53788m24255l90766l57041l30371l07627k82516k60145k48994
58044F023267k44809k37787k29377k26597k25682k17262k02841j90988j81620
$$ plain form
58035 4066304 3897558 3742757 3595260 3449826 3309454 3178108 3054176 2936026 2826735
58026 2826735 2728296 2637465 2551504 2471908 2398954 2328940 2260165 2195302 2134928 2075323 2015594
58015 2015594 1960209 1911438 1865886 1821350 1780293 1743483 1707095 1669454 1634102 1602925 1572694
58004 1572694 1541755 1513606 1490259 1468301 1445289 1424152 1407396 1392404 1376195 1359753 1344210
57993 1344210 1327756 1309652 1292662 1278410 1264879 1251021 1238989 1229338 1219142 1207521 1197914 1192108
57981 1192108 1186999 1180061 1173031 1167404 1161251 1153543 1146843 1142652 1138523 1132673 1127125 1123527 1120227 1116107
57967 1116107 1113045 1112067 1111332 1110136 1110267 1111140 1108671 1101784 1095144 1092375 1091204 1088297 1084172 1080031 1074457
57952 1074457 1066971 1060636 1057305 1054065 1048056 1041122 1036027 1031422 1024315 1014676 1004266 993640 983258
$$ packed form
58035D066304j68746j54801j47497j45434j40372j31346j23932j18150j09291
58026B826735r8439r0831q5961p9596p2954p0014o8775o4863o0374n9605n9729
58015B015594n5385m8771m5552m4536m1057l6810l6388l7641l5352l1177l0231
58004A572694l0939k8149k3347k1958k3012k1137j6756j4992j6209j6442j5543
57993A344210j6454j8104j6990j4252j3531j3858j2032r651j0196j1621r607n806
57981A192108n109o938p030n627o153p708o700m191m129n850n548l598l300m120
57967A116107l062r78p35j196J31Q73k469o887o640k769j171k907m125m141n574
57952A074457p486o335l331l240o009o934n095m605p107r639j0410j0626j0382
$$ plain form
57939 983258 974720 968134 961048 952473 944861 939576 933834 924959 914476 905068 896583 888087 880940 876777
57925 876777 874945 874535 876287 880064 883415 885310 888411 894859 902560 908421 912653 917206 922452 928051
57911 928051 934526 941385 946094 947418 947431 948034 948013 945770 942231 938628 934175 928392 923091 919471 915714
57896 915714 909840 902444 894343 884291 871540 858081 845909 834720 824552 817612 814682 812695 809050
57883 809050 805818 806421 810405 814660 817891 820876 823952 826954 830157 833113 834230 833267 832045 830953 827504
57868 827504 820373 811801 803529 793515 779697 764073 749780 736760 723626 711348 701582 693546
57856 693546 686002 680367 678482 679222 680640 683535 689412 696651 702364 706623 711428 716838 721532 726044
57842 726044 732134 739694 747166 754036 760357 765122 767825 770325 774460 779194 782658 785369 788638 791614
$$ packed form
57939I83258q538o586p086q575p612n285n742q875j0483r408q485q496p147m163
57925H76777j832m10J752L777L351J895L101O448P701N861M232M553N246N599
57911I28051O475O859M709J324J3O03k1k243l539l603m453n783n301l620l757
57896I15714n874p396q101j0052j2751j3459j2172j1189j0168o940k930j987l645
57883H09050l232O03L984M255L231K985L076L002L203K956J117r63j222j092l449
57868H27504p131q572q272j0014j3818j5624j4293j3020j3134j2278r766q036
57856F93546p544n635j885P40J418K895N877P239N713M259M805N410M694M512
57842G26044O090P560P472O870O321M765K703K500M135M734L464K711L269K976
$$ plain form
57828 791614 792936 793500 794312 793361 788258 780606 774063 769222 763919 757437 750607 742795 732868 722689 715785
57813 715785 712587 710426 708035 706564 706263 705732 704913 705647 708755 713285 718975 726740 736372 746149 754996
57798 754996 762886 769289 773661 777332 782351 788271 792442 793540 792618 790717 787737 783696 778940 773122
57784 773122 765951 758645 752461 746259 738001 728375 720258 714531 708953 701469 692285 682455 672639 663599
57770 663599 655878 648685 640866 633024 626883 622682 619013 614841 609674 602235 591508 579059 567776
57757 567776 558164 548128 536562 524695 513652 503206 493616 486359 482013 479139 476153 472903 469849
57744 469849 467116 464975 464177 465324 468500 473207 477847 480236 480152 480600 484762 492312 500613 508732 518018
57729 518018 529193 541255 553019 563486 571032 574759 576610 579787 584951 590210 594642 599154 603696
$$ packed form
57828G91614J322N64Q12r51n103p652o543m841n303o482o830p812r927j0179o904
57813G15785l198k161k391j471l01n31q19P34L108M530N690P765R632R777Q847
57798G54996P890O403M372L671N019N920M171J098r22j901k980m041m756n818
57784G73122p171p306o184o202q258r626q117n727n578p484r184r830r816r040
57770F63599p721p193p819p842o141m201l669m172n167p439j0727j2449j1283
57757E67776r612j0036j1566j1867j1043j0446r590p257m346k874k986l250l054
57744D69849k733k141p98J147L176M707M640K389q4M48M162P550Q301Q119R286
57729E18018J1175J2062J1764J0467P546L727J851L177N164N259M432M512M542
$$ plain form
57716 603696 606472 606674 605614 604356 602275 598644 593624 587091 578521 568789 560176 553798 548689 543983
57702 543983 540240 537965 536520 535326 534780 535430 537382 540729 545282 549970 554067 558806 565910 574689 582638
57687 582638 588810 594377 599867 604444 608312 613239 619874 626839 633282 640127 647872 655261 661231 666406
57673 666406 671773 677627 684472 693012 702628 711878 721331 733736 750411 769563 789190 809474 831037
57660 831037 853118 875117 898078 922775 947828 971506 994295 1018220 1044656 1074000 1106309
57649 1106309 1140926 1176486 1212570 1250559 1292015 1337178 1385689 1437488 1492226 1549305 1609505
57638 1609505 1675180 1747821 1826840 1911710 2003572 2103446 2210582 2324363 2446617 2580273
57628 2580273 2726735 2886145 3059346 3247834 3452277 3672423 3907791 4157132 4417700
$$ packed form
57716F03696K776K02j060j258k081l631n020o533q570r732q613o378n109m706
57702E43983l743k275j445j194n46O50J952L347M553M688M097M739P104Q779P949
57687E82638O172N567N490M577L868M927O635O965O443O845P745P389N970N175
57673F66406N367N854O845Q540R616R250R453J2405J6675J9152J9627K0284K1563
57660H31037K2081K1999K2961K4697K5053K3678K2789K3925K6436K9344L2309
57649A106309L4617L5560L6084L7989M1456M5163M8511N1799N4738N7079O0200
57638A609505O5675P2641P9019Q4870R1862R9874J07136J13781J22254J33656
57628B580273J46462J59410J73201J88488K04443K20146K35368K49341K60568
$$ plain form
57619 4417700 4686117 4959345 5233548 5502483 5757815 5990379 6190575 6349183 6460068
57610 6460068 6522463 6540142 6519108 6466557 6390250 6296167 6185879 6056572 5903528 5722872
57600 5722872 5514096 5282131 5036862 4789200 4547135 4315355 4097087 3894717 3709216
57591 3709216 3540573 3388978 3254836 3137967 3037678 2953274 2883576 2826215 2778563 2739559
57581 2739559 2710049 2691295 2683457 2685335 2695303 2712791 2739054 2775978 2823820 2880794 2945321 3018098
57569 3018098 3101473 3197405 3306613 3429148 3565095 3714790 3878595 4056171 4245874 4445220
57559 4445220 4651680 4862191 5072039 5275170 5465444 5636193 5778654 5882868 5941408 5951628
57549 5951628 5914314 5831827 5708274 5549834 5363533 5156354 4935696 4708866 4480852 4253849
$$ packed form
57619D417700K68417K73228K74203K68935K55332K32564K00196J58608J10885
57610F460068O2395J7679k1034n2551p6307r4083j10288j29307j53044j80656
57600E722872k08776k31965k45269k47662k42065k31780k18268k02370j85501
57591C709216j68643j51595j34142j16869j00289q4404o9698n7361m7652l9004
57581B739559k9510j8754p838J878R968J7488K6263L6924M7842N6974O4527P2777
57569C018098Q3375R5932J09208J22535J35947J49695J63805J77576J89703J99346
57559D445220K06460K10511K09848K03131J90274J70749J42461J04214N8540J0220
57549E951628l7314q2487j23553j58440j86301k07179k20658k26830k28014k27003
$$ plain form
57539 4253849 4029984 3813132 3606917 3412352 3228992 3057182 2897533 2749229 2610775
57530 2610775 2481892 2363159 2254339 2154542 2063520 1981192 1906203 1836502 1771308 1711210 1656393
57519 1656393 1605938 1558881 1514939 1474191 1436899 1403619 1374782 1350171 1329211 1311347 1295777
57508 1295777 1281548 1268621 1258089 1250573 1245129 1240553 1236899 1234798 1234322 1235647 1239823 1247328 1256619
57495 1256619 1265782 1275207 1287054 1302466 1320821 1341452 1364434 1389730 1417105 1447057 1480511 1517535
57483 1517535 1557645 1601362 1650021 1703846 1761630 1822758 1888383 1960179 2039058 2125634 2220882
57472 2220882 2325565 2439552 2562085 2692234 2828981 2971608 3120232 3275175 3435401
57463 3435401 3597964 3758910 3913847 4057387 4182933 4283795 4354576 4391687 4393392 4359860
$$ packed form
57539D253849k23865k16852k06215j94565j83360j71810j59649j48304j38454
57530B610775j28883j18733j08820r9797r1022q2328p4989o9701o5194o0098n4817
57519A656393n0455m7057m3942m0748l7292l3280k8837k4611k0960j7864j5570
57508A295777j4229j2927j0532p516n444m576l654k101m76J325M176P505R291
57495A256619R163R425J1847J5412J8355K0631K2982K5296K7375K9952L3454L7024
57483A517535M0110M3717M8659N3825N7784O1128O5625P1796P8879Q6576R5248
57472B220882J04683J13987J22533J30149J36747J42627J48624J54943J60226
57463C435401J62563J60946J54937J43540J25546J00862P0781L7111J705l3532
$$ plain form
57453 4359860 4292895 4195576 4072482 3930128 3776147 3617235 3457766 3300254 3146582 2998491
57443 2998491 2857334 2723921 2598802 2482602 2376013 2279507 2193153 2116802 2050180 1992534
57433 1992534 1942524 1899210 1863023 1834872 1814098 1798264 1785465 1776084 1771783 1773613 1781821 1796719
57421 1796719 1818647 1847278 1881597 1920386 1962518 2007570 2056757 2112650 2177208 2250578 2332291
57410 2332291 2422805 2523016 2633045 2752535 2881448 3019296 3163854 3311642 3459415 3604149
57400 3604149 3741771 3866734 3972743 4053426 4103001 4117484 4095397 4037131 3944586 3822105
57390 3822105 3676564 3514920 3341991 3161578 2978704 2798857 2625337 2459046 2300776
57381 2300776 2151963 2013199 1883753 1763028 1651122 1547567 1451031 1360930 1278166 1203465
$$ packed form
57453D359860o6965r7319j23094j42354j53981j58912j59469j57512j53672j48091
57443B998491j41157j33413j25119j16200j06589r6506q6354p6351o6622n7646
57433A992534n0010m3314l6187k8151k0774j5834j2799r381m301J830Q208J4898
57421A796719K1928K8631L4319L8789M2132M5052M9187N5893O4558P3370Q1713
57410B332291R0514J00211J10029J19490J28913J37848J44558J47788J47773J44734
57400C604149J37622J24963J06009Q0683M9575J4483k2087n8266r2545j22481
57390C822105j45541j61644j72929j80413j82874j79847j73520j66291j58270
57381B300776j48813j38764j29446j20725j11906j03555r6536r0101q2764p4701
$$ plain form
57371 1203465 1135798 1073129 1014117 958598 906917 859257 815307 774340 735820 699922 667177
57360 667177 637900 612144 589537 568606 547246 525011 504112 486737 472013 457321 442062
57349 442062 427937 415570 403320 390262 378076 368562 360768 352253 342276 332263 323597 316267 309613
57336 309613 303456 298273 294619 292442 290928 289234 287240 285182 282832 279926 277300 276458 277745 279915
57322 279915 281840 283687 285965 288382 290238 291131 290705 288496 284783 280945 278164 276008 272889 267739 260916
57307 260916 253861 248200 244821 243393 242787 241975 240356 237598 233858 230068 227239 225467 224239 223511 223615
57292 223615 224212 224530 224725 225819 228041 230452 232630 235468 239704 244898 250573 257093 264380 271010 276037
57277 276037 281061 288876 300139 312697 324308 334968 346204 358966 373015 388089 404842 424078
$$ packed form
57371A203465o7667o2669n9012n5519n1681m7660m3950m0967l8520l5898l2745
57360F67177k9277k5756k2607k0931k1360k2235k0899j7375j4724j4692j5259
57349D42062j4125j2367j2250j3058j2186r514p794q515r977j0013q666p330o654
57336C09613o157n183l654k177j514j694j994k058k350k906k626q42J287K170
57322B79915J925J847K278K417J856Q93m26k209l713l838k781k156l119n150o823
57307B60916p055n661l379j428o06q12j619k758l740l790k829j772j228p28J04
57292B23615N97L18J95J094K222K411K178K838M236N194N675O520P287O630N027
57277B76037N024P815J1263J2558J1611J0660J1236J2762J4049J5074J6753J9236
$$ plain form
57265 424078 445224 466341 486169 505738 527269 551845 578971 608028 638799 670393 701061
57254 701061 729829 757451 785045 812480 838848 864056 889361 916643 947344 981630 1018230
57243 1018230 1055529 1092971 1130934 1169418 1207898 1246612 1286806 1329082 1372484 1415808 1458956
57232 1458956 1502359 1545852 1588906 1631371 1673442 1715539 1758792 1804852 1854366 1905994 1957466
57221 1957466 2007317 2055468 2102766 2150023 2196545 2239294 2274559 2300859 2319176 2330178 2332898
57210 2332898 2326872 2313893 2296465 2275931 2253409 2231149 2211312 2194470 2180833 2171858 2168870 2171102
57198 2171102 2177120 2187496 2203985 2226645 2253987 2285701 2322746 2364253 2406469 2445584 2480153
57187 2480153 2510318 2536330 2558732 2578702 2597315 2615209 2633252 2652545 2673428 2695670 2720033
$$ packed form
57265D24078K1146K1117J9828J9569K1531K4576K7126K9057L0771L1594L0668
57254G01061K8768K7622K7594K7435K6368K5208K5305K7282L0701L4286L6600
57243A018230L7299L7442L7963L8484L8480L8714M0194M2276M3402M3324M3148
57232A458956M3403M3493M3054M2465M2071M2097M3253M6060M9514N1628N1472
57221A957466M9851M8151M7298M7257M6522M2749L5265K6300J8317J1002K720
57210B332898o026j2979j7428k0534k2522k2260j9837j6842j3637q975k988K232
57198B171102O018J0376J6489K2660K7342L1714L7045M1507M2216L9115L4569
57187B480153L0165K6012K2402J9970J8613J7894J8043J9293K0883K2242K4363
$$ plain form
57176 2720033 2748297 2781094 2816865 2853820 2891949 2932317 2975341 3020830 3069109 3120981 3176662
57165 3176662 3235453 3296455 3359327 3424515 3492875 3564738 3639318 3715507 3793303 3873745 3957247
57154 3957247 4042718 4128632 4214190 4298864 4381312 4459564 4532363 4600081 4664333 4726678 4787534
57143 4787534 4846396 4903076 4958284 5012670 5065985 5117882 5168959 5220001 5270626 5319824 5367506
57132 5367506 5414234 5459585 5502242 5541805 5579119 5614722 5648556 5681564 5715787 5752064 5789046
57121 5789046 5825409 5861666 5898780 5936199 5972403 6006427 6037852 6066371 6092462 6117412 6141215
57110 6141215 6161155 6173765 6177613 6173010 6159907 6137785 6107396 6071204 6032041 5992214 5953575 5917277
57098 5917277 5883476 5852056 5823383 5797638 5774013 5751612 5730842 5713052 5699316 5690444 5687290 5689465
$$ packed form
57176B720033K8264L2797L5771L6955L8129M0368M3024M5489M8279N1872N5681
57165C176662N8791O1002O2872O5188O8360P1863P4580P6189P7796Q0442Q3502
57154C957247Q5471Q5914Q5558Q4674Q2448P8252P2799O7718O4252O2345O0856
57143D787534N8862N6680N5208N4386N3315N1897N1077N1042N0625M9198M7682
57132E367506M6728M5351M2657L9563L7314L5603L3834L3008L4223L6277L6982
57121E789046L6363L6257L7114L7419L6204L4024L1425K8519K6091K4950K3803
57110F141215J9940J2610L848m603j3103k2122l0389l6192l9163l9827l8639l6298
57098E917277l3801l1420k8673k5745k3625k2401k0770j7790j3736q872l154K175
$$ plain form
57086 5689465 5693900 5695862 5691208 5676853 5649938 5608312 5551726 5481220 5397481 5300843 5192371 5073469
57074 5073469 4944670 4806041 4658159 4500867 4331222 4144133 3934738 3698847 3431948
57065 3431948 3129963 2790710 2412529 1991681 1522907 1001809 424067 -217410 -932004
57056 -932004 -1728150 -2613334 -3596981 -4690610 -5905643 -7254773 -8755760 -10430552 -12300907
57047 -12300907 -14388997 -16722268 -19332723 -22251016 -25507558 -29142376 -33210127 -37775236
57039 -37775236 -42909388 -48696986 -55236748 -62634163 -70998756 -80453386 -91139868 -103207022
57031 -103207022 -116787213 -131967800 -148756950 -167061606 -186700399 -207415953 -228811708
57024 -228811708 -250242293 -270838371 -289777435 -306603545 -321238197 -333607301 -343250356
$$ packed form
57086E689465M435J962m654j4355k6915m1626n6586p0506q3739r6638j08472j18902
57074E073469j28799j38629j47882j57292j69645j87089k09395k35891k66899
57065C431948l01985l39253l78181m20848m68774n21098D24067b17410p14594
57056i32004p96146q85184r83647j093629j215033j349130j500987j674792j870355
57047a2300907k088090k333271k610455k918293l256542l634818m067751m565109
57039c7775236n134152n787598o539762p397415q364593r454630j0686482j2067154
57031a03207022j3580191j5180587j6789150j8304656j9638793k0715554k1395755
57024b28811708k1430585k0596078j8939064j6826110j4634652j2369104r643055
$$ plain form
57017 -343250356 -349322969 -350979949 -347754891 -339648774 -327002418 -310386754 -290590757
57010 -290590757 -268605202 -245512210 -222314582 -199799275 -178489906 -158678518 -140492625
57003 -140492625 -123955812 -109025918 -95619329 -83631232 -72949344 -63458256 -55041830
56996 -55041830 -47589707 -41002256 -35188359 -30062024 -25544548 -21567877 -18073004 -15006729
56988 -15006729 -12321731 -9976476 -7931286 -6145648 -4581526 -3207399 -1997141 -927939
56979 17340 848145 1570666 2194151 2730942 3192578 3589410 3933001 4235434 4506220 4752049
56969 4752049 4978653 5190020 5385599 5560294 5707409 5821122 5898167 5939949 5952676 5943609
56959 5943609 5917627 5878552 5831934 5783714 5736648 5689920 5641398 5588323 5527014 5454548 5370501
$$ packed form
57017c43250356o072613j656980L225058Q106117J2646356J6615664J9795997
57010b90590757K1985555K3092992K3197628K2515307K1309369J9811388J8185893
57003a40492625J6536813J4929894J3406589J1988097J0681888R491088Q416426
56996e5041830P452123O587451N813897N126335M517476L976671L494873L066275
56988a5006729K684998K345255K045190J785638J564122J374127J210258i27939
56979A7340Q30805P22521O23485N36791M61636L96832L43591L02433K70786K45829
56969D752049K26604K11367J95579J74695J47115J13713P7045M1782J2727r067
56959E943609k5982l9075m6618m8220m7066m6728m8522n3075o1309p2466q4047
$$ plain form
56948 5370501 5275614 5170164 5056048 4939094 4826211 4720605 4621920 4529593 4442693 4357473
56938 4357473 4269512 4179106 4091587 4012365 3945314 3895645 3867438 3852772 3825289 3750090 3603305
56927 3603305 3383873 3109589 2804649 2489809 2179659 1884393 1611243 1363795 1141421
56918 1141421 941173 760574 598173 452377 321546 205320 104449 18944 -52486 -111158
56908 -111158 -157724 -193087 -218656 -235360 -243373 -243137 -235774 -222250 -202962 -178165 -147936 -111850
56896 -111850 -70038 -25013 18331 54773 80525 93910 95910 90107 80669 69966 58804 48529
56884 48529 41331 38381 39094 42513 48281 56108 65569 76649 89420 103141 116980 131697 149185
56871 149185 170073 193043 216439 238620 256128 263591 257239 238173 211380 181997 152837 124549
$$ packed form
56948E370501r4887j05450j14116j16954j12883j05606r8685r2327q6900q5220
56938D357473q7961r0406q7519p9222o7051m9669k8207j4666k7483p5199j46785
56927C603305k19432k74284l04940l14840l10150k95266k73150k47448k22374
56918A141421k00248j80599j62401j45796j30831j16226j00871A8944e2486n8672
56908a11158m6566l5363k5569j6704q013K36P363J3524J9288K4797L0229L6086
56896a11850M1812b5013A8331L6442K5752J3385K000n803r438j0703j1162j0275
56884D8529p198k950P13L419N768P827R461J1080J2771J3721J3839J4717J7488
56871A49185K0888K2970K3396K2181J7508P463o352j9066k6793k9383k9160k8288
$$ plain form
56859 124549 97086 70968 47296 26636 8417 -8001 -22351 -34416 -45272 -56140 -66516 -75082
56847 -75082 -82194 -89615 -97724 -104800 -109384 -111705 -112423 -111766 -110508 -110133 -111156 -112464 -112921 -112320 -110213 -105139
56831 -105139 -95731 -81523 -62276 -37862 -9354 21141 52486 85428 121076 159476 199782 240436
56819 240436 278898 312737 341555 366567 388215 405974 420782 435427 451539 467964 483042
56808 483042 496829 510124 523159 536453 551372 568651 587881 609550 635889 668277 705052
56797 705052 742681 777200 803527 816058 812621 796718 773998 747685 718987 690093 663957 641924
56785 641924 623871 610197 601746 598453 600164 608248 624320 647721 676332 709799 750084 798759
56773 798759 855284 917526 981759 1041580 1088568 1115386 1118625 1099530 1063138 1016189 964440 911471
$$ packed form
56859A24549k7463k6118k3672k0660H417h001j4350j2065j0856j0868j0376q566
56847g5082p112p421q109p076m584k321p18O57J258L75j023j308m57O01K107N074
56831a05139R408J4208J9247K4414i354B1141L1345L2942L5648L8400M0306M0654
56819B40436L8462L3839K8818K5012K1648J7759J4808J4645J6112J6425J5078
56808D83042J3787J3295J3035J3294J4919J7279J9230K1669K6339L2388L6775
56797G05052L7629L4519K6327J2531l437j5903k2720k6313k8698k8894k6136k2033
56785F41924j8053j3674q451l293J711Q084J6072K3401K8611L3467M0285M8675
56773G98759N6525O2242O4233N9821M6988K6818L239j9095l6392m6949n1749n2969
$$ plain form
56761 911471 859946 812620 771126 735168 704606 681250 666700 659396 656280 657096 664653 680834
56749 680834 704586 734158 768903 807789 847637 883714 910904 924134 919806 898414 864912 825289
56737 825289 783146 740025 697895 659813 628173 603247 583787 568721 557943 551596 549126 549611
56725 549611 552846 559345 569258 582190 598226 617804 639778 660677 676804 686213 687953 680980 665502
56712 665502 644305 620749 595828 568916 540895 514464 491220 470248 450052 430490 412412
56701 412412 396644 383761 373834 365882 358307 350184 341742 333729 326861 321525 317234 312867 308221 304699
56687 304699 303383 303183 302351 301137 301144 302335 302589 300368 296200 291324 286484 282308 279281 276799 273579 269420
56671 269420 265390 261962 258316 253893 249321 245319 241928 239354 238305 238704 239053 237911 235384 232671 230808
$$ packed form
56761I11471n1525m7326m1494l5958l0562k3356j4550p304l116Q16P557J6181
56749F80834K3752K9572L4745L8886L9848L6077K7190J3230m328k1392l3502l9623
56737H25289m2143m3121m2130l8082l1640k4926j9460j5066j0778o347k470M85
56725E49611L235O499R913J2932J6036J9578K1974K0899J6127R409J740o973j5478
56712F65502k1197k3556k4921k6912k8021k6431k3244k0972k0196j9562j8078
56701D12412j5768j2883r927p952p575q123q442q013o868n336m291m367m646l522
56687C04699j316k00q32j214PJ191K54k221m168m876m840m176l027k482l220m159
56671B69420m030l428l646m423m572m002l391k574j049L99L49j142k527k713j863
$$ plain form
56656 230808 230260 231021 232603 234301 235655 236364 236051 234822 233712 233634 234108 234075 233606 233465 233205 231241 227003
56639 227003 221662 216585 212476 210026 209683 210329 209725 207049 203729 201286 199715 198570 198199 199002 200619
56624 200619 202736 205689 209507 213367 216753 220249 224477 229136 233808 238772 244245 249670 254538 259203
56610 259203 264154 269150 273655 277451 280321 281946 282677 283520 284698 285061 283672 281205 278956 277169 275151
56595 275151 272494 269360 266016 262865 260686 260101 260790 261480 260737 257953 254030 250883 249545 248917 247353
56580 247353 245273 244807 246592 248498 248386 246900 246421 248098 250951 253390 254580 254653 254451 255063 257072 260219
56564 260219 263880 267577 270950 273655 275490 276359 276199 275414 275112 276187 278263 280275 281814 283052 283718
56549 283718 283526 283424 284807 287210 288365 287127 285046 284426 285949 288846 292178 295139 297088 298194 299377
$$ packed form
56656B30808n48P61J582J698J354P09l13j229j110p8M74l3m69j41k60j964m238
56639B27003n341n077m109k450l43O46o04k676l320k443j571j145l71Q03J617
56624B00619K117K953L818L860L386L496M228M659M672M964N473N425M868M665
56610B59203M951M996M505L796K870J625P31Q43J178L63j389k467k249j787k018
56595B75151k657l134l344l151k179n85O89O90p43k784l923l147j338o28j564
56580B47353k080m66J785J906j12j486m79J677K853K439J190P3k02O12K009L147
56564B60219L661L697L373K705J835Q69j60p85l02J075K076K012J539J238O66
56549B83718j92j02J383K403J155j238k081o20J523K897L332K961J949J106J183
$$ plain form
56534 299377 301079 302761 303932 304781 305407 305385 304509 303132 301500 299826 299210 301136 305537 310575 314844 318487
56518 318487 321630 323253 322680 321081 320463 321892 325281 329882 334414 337870 340868 345084 350800 356366 360768
56503 360768 365157 370848 377404 384015 391245 399729 408268 415109 420450 426033 432655 439609 446354 453250
56489 453250 460458 467177 472361 475736 478055 480415 483160 485463 486418 486246 485601 484080 480831 476589 473312
56474 473312 471469 469435 466063 461970 457514 451576 443771 436063 430605 427212 424297 420978 416963 411785
56460 411785 405714 400184 395827 391314 385545 379585 374749 370195 364403 357843 352082 347163 342127 337468
56446 337468 334805 334400 334974 335886 337748 340974 345153 349686 353822 356619 358270 360715 365232 370037 372282
56431 372282 372164 373002 377231 384113 391549 398247 403548 406716 407434 406339 404510 402767 401453 400551 400171
$$ packed form
56534B99377J702J682J171Q49O26k2q76j377j632j674o16J926M401N038M269L643
56518C18487L143J623n73j599o18J429L389M601M532L456K998M216N716N566M402
56503C60768M389N691O556O611P230Q484Q539O841N341N583O622O954O745O896
56489D53250P208O719N184L375K319K360K745K303R55j72o45j521l249m242l277
56474D73312j843k034l372m093m456n938p805p708n458l393k915l319m015n178
56460D11785o071n530m357m513n769n960m836m554n792o560n761m919n036m659
56446C37468k663m05N74R12J862L226M179M533M136K797J651K445M517M805K245
56431C72282j18Q38M229O882P436O698N301L168P18j095j829j743j314r02l80
$$ plain form
56416 400171 401166 404576 409957 415231 419046 422460 427275 433607 440171 446019 450679 453545 454826 456500
56402 456500 460596 466646 472097 475167 476333 477433 480233 485366 491687 497172 501129 504717 508664 511877
56388 511877 513368 513945 514516 514249 512304 510084 509611 510760 512201 513981 516728 519237 519524 517886 516349
56373 516349 515230 512802 508503 504098 501176 499377 497512 494903 491348 487158 483299 480361 477697 474713
56359 474713 472191 470781 469097 465298 459830 454532 449756 444676 439760 436288 433796 430668 427070 424620
56345 424620 423160 420781 417367 415210 415336 415815 414755 412771 411445 411227 411839 413153 414876 416718 419176
56330 419176 422696 425990 427049 425939 424660 424125 423405 422120 421202 420832 420079 419323 420725 425204 430907 435746
56314 435746 439814 444433 450362 457461 464542 469264 470160 469223 470364 474781 480009 484124 488265 493892 500085
$$ packed form
56416D00171R95L410N381N274L815L414M815O332O564N848M660K866J281J674
56402D56500M096O050N451L070J166J100K800N133O321N485L957L588L947L213
56388E11877J491N77N71k67j945k220m73J149J441J780K747K509K87j638j537
56373E16349j119k428m299m405k922j799j865k609l555m190l859k938k664k984
56359D74713k522j410j684l799n468n298m776n080m916l472k492l128l598k450
56345D24620j460k379l414k157J26M79j060j984j326k18O12J314J723J842K458
56330D19176L520L294J059j110j279n35p20j285r18l70p53p56J402M479N703M839
56314D35746M068M619N929P099P081M722Q96r37J141M417N228M115M141N627O193
$$ plain form
56299 500085 505204 509311 513248 516894 519947 523103 526901 530359 532010 531582 529965 528442 528388 530486 533623
56284 533623 535769 536422 537082 539180 542964 548395 555225 561991 567103 571428 577591 586056 594153 599892 604567
56269 604567 610534 618460 627973 638990 651142 663617 676801 692225 709733 726657 741096 754167
56257 754167 767649 781324 794294 807138 820801 834630 847283 858495 868466 876618 882498 887038
56245 887038 891558 896283 900866 905372 909685 912961 914822 916247 918397 921375 924880 929130 934489 941178
56231 941178 949789 960919 973914 987339 1001074 1016375 1033571 1051660 1070807 1093115 1119752 1149081
56219 1149081 1178878 1208898 1240284 1273945 1310610 1350982 1394854 1441303 1490414 1543331 1600256
56208 1600256 1660343 1724190 1794322 1872300 1957456 2049424 2149680 2259528 2378822 2507981
$$ packed form
56299E00085N119M107L937L646L053L156L798L458J651m28j617j523n4K098L137
56284E33623K146O53O60K098L784N431O830O766N112M325O163Q465Q097N739M675
56269F04567N967P926R513J1017J2152J2475J3184J5424J7508J6924J4439J3071
56257G54167J3482J3675J2970J2844J3663J3829J2653J1212R971Q152N880M540
56245H87038M520M725M583M506M313L276J861J425K150K978L505M250N359O689
56231I41178Q611J1130J2995J3425J3735J5301J7196J8089J9147K2308K6637K9329
56219A149081K9797L0020L1386L3661L6665M0372M3872M6449M9111N2917N6925
56208A600256O0087O3847P0132P7978Q5156R1968J00256J09848J19294J29159
$$ plain form
56198 2507981 2648915 2802361 2966431 3139540 3322825 3517915 3723957 3938527 4159816
56189 4159816 4386223 4615283 4844452 5071417 5292124 5500016 5688745 5854531 5995078
56180 5995078 6108082 6191999 6246521 6271173 6265483 6231727 6175345 6101156 6011129 5906977 5792400
56169 5792400 5670993 5544322 5413952 5283004 5153415 5023510 4890449 4753515 4613356
56160 4613356 4470068 4323987 4176459 4027855 3876723 3722854 3569252 3419106 3272725
56151 3272725 3129351 2989762 2854911 2724293 2598319 2480405 2373847 2277902 2189305 2106334
56141 2106334 2029165 1957732 1891649 1831156 1776171 1725439 1678144 1634904 1595838 1559535 1525392
56130 1525392 1494835 1468619 1445263 1423887 1405986 1392350 1380904 1369827 1360239 1353483 1348534 1344585
$$ packed form
56198B507981J40934J53446J64070J73109J83285J95090K06042K14570K21289
56189D159816K26407K29060K29169K26965K20707K07892J88729J65786J40547
56180E995078J13004Q3917N4522K4652n690l3756n6382p4189r0027j04152j14577
56169E792400j21407j26671j30370j30948j29589j29905j33061j36934j40159
56160D613356j43288j46081j47528j48604j51132j53869j53602j50146j46381
56151C272725j43374j39589j34851j30618j25974j17914j06558r5945q8597q2971
56141B106334p7169p1433o6083o0493n4985n0732m7295m3240l9066l6303l4143
56130A525392l0557k6216k3356k1376j7901j3636j1446j1077r588o756m949l949
$$ plain form
56118 1344585 1343197 1345083 1347781 1349775 1353920 1363052 1374940 1385575 1395104 1406382 1419780 1433779 1448948
56105 1448948 1466824 1486033 1503746 1520036 1536975 1554346 1570068 1583999 1597707 1611304 1624002
56094 1624002 1636868 1651426 1666536 1680311 1694331 1712366 1735654 1763025 1794766 1832380 1874929
56083 1874929 1919634 1966437 2018736 2079388 2148743 2226630 2313562 2409888 2516012 2633445 2763955
56072 2763955 2908261 3066902 3240779 3428682 3625500 3824545 4019849 4204905 4372653
56063 4372653 4520042 4650428 4768676 4876333 4973893 5063551 5144882 5210623 5251939 5266576
56053 5266576 5258268 5230844 5187647 5134005 5073996 5005145 4920732 4816715 4692846 4549372 4387923
56042 4387923 4214694 4037910 3862609 3691449 3528837 3379490 3244163 3121165 3010786
$$ packed form
56118A344585j388J886K698J994M145R132J1888J0635R529J1278J3398J3999J5169
56105A448948J7876J9209J7713J6290J6939J7371J5722J3931J3708J3597J2698
56094A624002J2866J4558J5110J3775J4020J8035K3288K7371L1741L7614M2549
56083A874929M4705M6803N2299O0652O9355P7887Q6932R6326J06124J17433J30510
56072B763955J44306J58641J73877J87903J96818J99045J95304J85056J67748
56063D372653J47389J30386J18248J07657R7560Q9658Q1331O5741M1316J4637
56053E266576q308k7424m3197n3642o0009o8851q4413j04017j23869j43474j61449
56042D387923j73229j76784j75301j71160j62612j49347j35327j22998j10379
$$ plain form
56033 3010786 2913872 2827675 2747852 2673398 2605425 2542976 2484714 2432888 2390506 2355973 2325250
56022 2325250 2297632 2274738 2255928 2239882 2228596 2224397 2224924 2226313 2229082 2235397 2243185 2249219 2255532
56009 2255532 2266314 2280769 2295636 2312227 2333834 2358510 2381974 2405404 2432552 2461364 2486962
55998 2486962 2511088 2539693 2572558 2604432 2635389 2670564 2710135 2749284 2788141 2832012 2881051
55987 2881051 2929338 2975383 3024321 3078291 3133565 3188774 3247200 3309287 3371282 3432897 3498103
55976 3498103 3567070 3635527 3703115 3774232 3850195 3929278 4014611 4112153 4219979 4329481 4438377
55965 4438377 4552551 4674168 4798740 4925698 5060920 5206410 5357930 5515231 5684149
55956 5684149 5866087 6055882 6252410 6460803 6682070 6911550 7149846 7403865 7674640
$$ packed form
56033C010786r6914q6197p9823p4454o7973o2449n8262n1826m2382l4533l0723
56022B325250k7618k2894j8810j6046j1286m199N27J389K769O315P788O034O313
56009B255532J0782J4455J4867J6591K1607K4676K3464K3430K7148K8812K5598
55998B486962K4126K8605L2865L1874L0957L5175L9571L9149L8857M3871M9039
55987B881051M8287M6045M8938N3970N5274N5209N8426O2087O1995O1615O5206
55976C498103O8967O8457O7588P1117P5963P9083Q5333R7542J07826J09502J08896
55965D438377J14174J21617J24572J26958J35222J45490J51520J57301J68918
55956E684149J81938J89795J96528K08393K21267K29480K38296K54019K70775
$$ plain form
55947 7674640 7955895 8247273 8556953 8888489 9237417 9603677 9994608 10412724 10853845
55938 10853845 11320539 11823580 12366285 12941176 13545630 14186349 14864820 15574003 16313886
55929 16313886 17094388 17917714 18773873 19659229 20583860 21556104 22577101 23655560 24809505
55920 24809505 26047404 27365909 28771434 30283895 31913621 33656732 35520700 37532156
55912 37532156 39712090 42066523 44608223 47361223 50336138 53530527 56965267 60693716
55904 60693716 64768584 69235638 74172806 79700175 85940038 93008253 101058845 110290914
55896 110290914 120895357 133047531 146971480 162948850 181237784 202051249 225644791
55889 225644791 252350441 282504388 316414404 354231042 395223340 436541282 472747144
$$ packed form
55947G674640K81255K91378L09680L31536L48928L66260L90931M18116M41121
55938A0853845M66694N03041N42705N74891O04454O40719O78471P09183P39883
55929A6313886P80502Q23326Q56159Q85356R24631R72244J020997J078459J153945
55920B4809505J237899J318505J405525J512461J629726J743111J863968K011456
55912C7532156K179934K354433K541700K753000K974915L194389L434740L728449
55904F0693716M074868M467054M937168N527369O239863P068215Q050592R232069
55896A10290914J0604443J2152174J3923949J5977370J8288934K0813465K3593542
55889B25644791K6705650L0153947L3910016L7816638M0992298M1317942L6205862
$$ plain form
55882 472747144 497376376 505902827 497805869 476173655 445607124 410351194 373606837
55875 373606837 337587129 303671974 272557423 244480692 219413505 197136850 177306043
55868 177306043 159581092 143717308 129539957 116892565 105639392 95670862 86868706
55861 86868706 79090136 72204987 66119206 60744959 55977795 51721674 47909986 44485488
55853 44485488 41385059 38560808 35992775 33663783 31540814 29593555 27809997 26179118
55845 26179118 24676648 23281367 21988254 20792915 19679347 18635119 17663068 16766099
55837 16766099 15934413 15158041 14437441 13770729 13143845 12544117 11971547 11427285 10903425
55828 10903425 10394115 9905268 9443739 9007297 8593587 8207868 7852942 7521569 7207182
$$ packed form
55882D72747144K4629232Q526451q096958k1632214l0566531l5255930l6744357
55875C73606837l6019708l3915155l1114551k8076731k5067187k2276655j9830807
55868A77306043j7724951j5863784j4177351j2647392j1253173r968530q802156
55861H6868706p778570o885149o085781n374247m767164m256121l811688l424498
55853D4485488l100429k824251k568033k328992k122969j947259j783558j630879
55845B6179118j502470j395281j293113j195339j113568j044228r72051q96969
55837A6766099q31686p76372p20600o66712o26884n99728n72570n44262n23860
55828A0903425n09310m88847m61529m36442m13710l85719l54926l31373l14387
$$ plain form
55819 7207182 6912231 6638126 6377089 6122260 5876448 5643043 5417692 5196984 4986269
55810 4986269 4790590 4606243 4429020 4262379 4109368 3964226 3820044 3677692 3539870
55801 3539870 3403613 3266461 3133514 3010870 2897826 2792038 2696157 2612642 2537804 2467484
55791 2467484 2403252 2347152 2295905 2245874 2197920 2151787 2101837 2044503 1984586 1928545 1876847
55780 1876847 1827979 1783937 1745886 1710066 1673882 1640723 1613178 1586972 1557508 1527004 1499075
55769 1499075 1471336 1439725 1405690 1372986 1341352 1308885 1276630 1245497 1212849 1177339 1142892
55758 1142892 1112774 1084151 1053813 1024650 1000746 980445 960262 941619 927531 916123 903704
55747 903704 891384 882791 877677 873161 868934 866367 864838 863558 864338 868020 870897 869066 863598 857179
$$ packed form
55819G207182k94951k74105k61037k54829k45812k33405k25351k20708k10715
55810D986269j95679j84347j77223j66641j53011j45142j44182j42352j37822
55801C539870j36257j37152j32947j22644j13044j05788r5881q3515p4838p0320
55791B467484o4232n6100n1247n0031m7954m6133m9950n7334n9917n6041n1698
55780A876847m8868m4042l8051l5820l6184l3159k7545k6206k9464l0504k7929
55769A499075k7739l1611l4035l2704l1634l2467l2255l1133l2648l5510l4447
55758A142892l0118k8623l0338k9163k3904k0301k0183j8643j4088j1408j2419
55747I03704j2320q593n114m516m227k567j529j280P80L682K877j831n468o419
$$ plain form
55733 857179 848841 836556 821932 807518 792175 773779 753868 735244 717717 700511 685866 675623
55721 675623 667118 657089 646848 639068 632537 625130 619075 617691 619027 617924 612656 604773 594390
55708 594390 580741 565846 552725 540976 528319 515177 503807 494434 486160 479818 475830 471004
55696 471004 461699 448787 435678 423179 410104 397041 385413 374493 363303 353583 346917 341006
55684 341006 333073 325006 320578 319306 317579 314332 311085 307923 304164 301625 302366 304164 303037 299632
55670 299632 298408 300892 304160 305712 305623 303959 300115 294795 289270 282838 274244 264972 257688 252122 246018
55655 246018 239542 235138 233481 232977 232686 232481 231165 228063 225817 227933 233955 240404 245771 251078 256323
55640 256323 260301 263656 268350 274168 279067 282757 286682 290932 294459 297803 302229 306752 309573 311845
$$ packed form
55733H57179q338j2285j4624j4414j5343j8396j9911j8624j7527j7206j4645j0243
55721F75623q505j0029j0241p780o531p407o055j384J336j103n268p883j0383
55708E94390j3649j4895j3121j1749j2657j3142j1370r373q274o342l988m826
55696D71004r305j2912j3109j2499j3075j3063j1628j0920j1190r720o666n911
55684C41006p933q067m428j272j727l247l247l162l759k539P41J798j127l405
55670B99632j224K484L268J552q9j664l844n320n525o432q594r272p284n566o104
55655B46018o476m404j657n04k91k05j316l102k246K116O022O449N367N307N245
55640B56323L978L355M694N818M899L690L925M250L527L344M426M523K821K272
$$ plain form
55626 311845 316227 322142 326320 327919 329311 331824 334413 336649 339361 342044 343127 342958 343223 343415 341427
55611 341427 337699 335051 334131 332776 330354 329006 329750 330858 331040 331071 331394 331155 330501 330906 332409 333407 333841
55594 333841 335666 339384 343067 345655 348180 350676 350845 347303 341710 336256 331042 325083 317994 309741
55580 309741 300430 291050 282785 275200 266806 257505 248536 240115 231341 222392 214359 206929 198855 190838
55566 190838 185088 181655 177968 172559 166523 160737 154583 148318 143758 141366 139174 135918 132927 131513
55552 131513 130610 128518 125350 122445 120710 120375 121024 121251 119725 117096 115294 114708 113863 112100 110467 109423
55536 109423 107897 105480 103555 103186 103471 102922 101136 98461 95422 93004 92139 92506 93030 93588 94719 95727
55520 95727 95003 92476 89927 88524 87674 86528 84922 82705 79834 77321 76411 76817 77369 78089 79672 81309
$$ packed form
55626C11845M382N915M178J599J392K513K589K236K712K683J083j69K65J92j988
55611C41427l728k648r20j355k422j348P44J108J82L1L23k39o54M05J503R98M34
55594C33841J825L718L683K588K525K496J69l542n593n454n214n959p089q253
55580C09741r311r380q265p585q394r301q969q421q774q949q033p430q074q017
55566A90838n750l433l687n409o036n786o154o265m560k392k192l256k991j414
55552A31513r03k092l168k905j735l35O49K27j526k629j802n86q45j763j633j044
55536A09423j526k417j925l69K85n49j786k675l039k418q65L67N24N58J131J008
55520I5727p24k527k549j403q50j146j606k217k871k513r10M06N52P20J583J637
$$ plain form
55504 81309 81362 80144 79713 81001 83427 87089 92521 98204 101267 101168 100060 99156 97572 95237 93863 94021
55488 94021 93992 92582 90562 88486 85796 83094 82481 84307 86216 86641 86678 87245 87261 86428 87092 91113 97018
55471 97018 102383 107153 112523 118251 123221 127341 130916 133273 133794 133371 133365 134010 134902 135937 136756 136540 135332
55454 135332 134151 132874 129732 124011 117542 112216 107682 102958 98548 95261 92441 89147 85824 83009
55440 83009 79545 74002 67068 60688 55460 50581 45969 42749 41569 41604 41428 40218 38061 35535 33015
55425 33015 30471 28098 26598 26071 25276 23245 21153 20925 22305 23146 22368 20624 18172 14558 10656 8465
55409 8465 8196 7906 6794 6392 7652 9308 10237 11070 12202 12699 12532 13378 15524 16386 14056 10154 7207
55392 7207 5346 3745 3163 4394 5907 5776 4790 5025 6364 6970 6462 6111 6335 6321 5932 5896 6171 5931
$$ packed form
55504H1309N3j218m31J288K426L662N432N683L063r9j108r04j584k335j374J58
55488I4021k9j410k020k076k690k702o13J826J909M25L7N67J6q33O64M021N905
55471I7018N365M770N370N728M970M120L575K357N21m23oO45Q92J035Q19k16j208
55454A35332j181j277l142n721o469n326m534m724m410l287k820l294l323k815
55440H3009l464n543o934o380n228m879m612l220j180L5j76j210k157k526k520
55425C3015k544k373j500n27p95k031k092k28J380Q41p78j744k452l614l902k191
55409H465k69k90j112m02J260J656R29Q33J132M97j67Q46K146Q62k330l902k947
55392G207j861j601n82J231J513j31r86K35J339O06n08l51K24j4l89l6K75k40
$$ plain form
55374 5931 5208 5024 5859 7225 8707 10315 11973 13630 15683 18430 21284 23136 23265 21700 19280 17519
55358 17519 17399 18159 18490 18880 20926 24151 25942 25493 25256 27065 29278 29691 28981 28907 29091 28285 27297 27796
55340 27796 29251 29781 29302 29122 29010 27511 25078 24150 25596 27235 26532 23301 19327 16576 15954 16762
55324 16762 17212 16308 14968 14513 14819 15127 15849 17955 21003 23272 23674 22301 19553 16076 13165 11817
55308 11817 11670 11967 13006 15244 17611 18374 17389 15946 14627 12871 10532 8370 6889 5981 5704 6218
55292 6218 6964 7033 6392 5809 5596 5348 4783 4044 3452 3701 5728 9419 12961 14571 14447 14037 14011 14142 14637
55273 14637 16149 18671 21488 23944 25337 24729 22118 19276 18021 18052 17744 16683 15916 15935 15944 15231 14012
55256 14012 12806 11948 11803 12513 13498 13849 13129 11352 8710 5968 4479 4899 6417 7942 9322 10656
$$ packed form
55374E931p23j84Q35J366J482J608J658J657K053K747K854J852J29j565k420j761
55358A7519j20P60L31L90K046L225J791m49k37J809K213M13p10p4J84q06r88M99
55340B7796J455N30m79j80j12j499k433r28J446J639p03l231l974k751o22Q08
55324A6762M50r04j340m55L06L08P22K106L048K269M02j373k748l477k911j348
55308A1817j47K97J039K238K367P63r85j443j319j756k339k162j481r08k77N14
55292F218P46O9o41n83k13k48n65p39n92K49K027L691L542J610j24m10k6J31M95
55273A4637J512K522K817K456J393o08k611k842j255L1l08j061p67J9Rp13j219
55256A4012j206q58j45P10R85L51p20j777k642k742j489M20J518J525J380J334
$$ plain form
55240 10656 11363 10929 9686 7934 5450 2933 2438 4713 7435 8116 7647 8693 11392 13203 12729 11180
55224 11180 10058 9652 10064 11517 13119 13231 11728 10371 10430 11396 12395 13409 14553 15545 16486 17941 19675
55207 19675 20414 19474 17863 17271 18616 21665 25291 27881 28264 26489 23425 19957 17039 15706 15943 16099
55191 16099 14708 12460 11155 11220 11690 12186 13190 14534 15257 15099 14724 14402 13845 13344 13600 14349 14604 14420
55173 14420 15048 17096 19830 22363 24267 24920 23782 21706 20694 21872 24543 27296 29044 29152 27904
55158 27904 26852 27371 28790 29311 28691 28418 29050 29205 27820 25885 25097 25914 27732 30053 32702 35391
55142 35391 37545 38318 37059 34417 32554 33147 35413 37144 37268 36164 34088 31214 28985 29211 31340
55127 31340 32540 31265 29168 28654 29914 31258 31267 29828 27960 27178 28231 30011 30545 29229 27116 24974
$$ packed form
55240A0656P07m34j243j752k484k517m95K275K722O81m69J046K699J811m74j549
55224A1180j122m06M12J453J602J12j503j357N9R66R99J014J144R92R41J455J734
55207A9675P39r40j611n92J345L049L626K590L83j775l064l468k918j333K37J56
55191A6099j391k248j305O5M70M96J004J344P23j58l75l22n57n01K56P49K55j84
55173A4420O28K048K734K533J904O53j138k076j012J178K671K753J748J08j248
55158B7904j052N19J419N21o20k73O32J55j385j935p88Q17J818K321K649K689
55142C5391K154P73j259k642j863N93K266J731J24j104k076k874k229K26K129
55127C1340J200j275k097n14J260J344Rj439j868p82J053J780N34j316k113k142
$$ plain form
55111 24974 22445 19465 17072 16097 16177 16758 18133 20762 24284 27671 29948 30572 29737 28232 26429 23845
55095 23845 20540 18290 18835 21388 23566 24580 25644 27332 28656 29101 29525 30382 30954 31129 32135 34503
55079 34503 36795 37373 36194 34146 31904 30190 29761 30252 30200 29030 27947 28321 30379 33921 38753 43746
55063 43746 47041 48165 48663 49854 51349 52586 54281 57151 60405 62637 63351 62889 61924 61524 62359 63222
55047 63222 61939 58568 55990 56341 58496 60203 60909 61108 60678 59734 59687 61483 63761 64517 63802 63159 63264
55030 63264 63723 64439 65571 66763 67859 69723 72963 76630 79550 82061 84896 87330 88311 88640 89899
55015 89899 91706 92170 91001 90033 90380 90972 90418 88806 86981 85364 84292 84647 87229 91707 96490 99608
54999 99608 99997 98257 95876 93512 90580 86840 83281 80672 78304 75491 73462 74183 77611 81583 84260
$$ packed form
55111B4974k529k980k393r75Q0N81J375K629L522L387K277O24q35j505j803k584
55095B3845l305k250N45K553K178J014J064J688J324M45M24Q57N72J75J006K368
55079C4503K292N78j179k048k242j714m29M91n2j170j083L74K058L542M832M993
55063D3746L295J124M98J191J495J237J695K870L254K232P14m62r65m00Q35Q63
55047F3222j283l371k578L51K155J707P06J99m30r44m7J796K278P56p15o43J05
55030F3264M59P16J132J192J096J864L240L667K920K511K835K434R81L29J259
55015H9899J807M64j169r68L47N92n54j612j825j617j072L55K582M478M783L118
54999I9608L89j740k381k364k932l740l559k609k368k813k029P21L428L972K677
$$ plain form
54984 84260 85365 85208 83968 82154 80544 79350 78379 78109 79591 83040 87325 90995 93141 93397 92049
54969 92049 90199 88866 87805 86010 83417 81107 79700 78551 77007 75635 75600 77328 80197 83238 85786
54954 85786 87726 89308 90671 91578 91845 91855 92283 93423 95113 97096 99094 100718 101782 102526 103045 102749
54938 102749 101069 98602 96869 96693 97302 97271 95986 93960 91929 90034 88027 86142 85359 86435 88827
54923 88827 91030 91990 91795 91088 90455 90381 91027 91807 91847 91196 90913 91706 93211 94976 97358 100862 105161 109439
54905 109439 113261 116666 119772 122597 124978 126514 127166 127893 129910 133290 137286 142055 148734 157468 166828
54890 166828 175807 184948 194793 204870 215300 227639 242451 257470 270141 280885 291707 302365
54878 302365 310343 314297 315054 312906 306348 294606 279749 264993 251790 239470 227021 214351 202199
$$ packed form
54984H4260J105j57j240j814j610j194r71k70J482L449M285L670K146K56j348
54969I2049j850j333j061j795k593k310j407j149j544j372l5J728K869L041K548
54954H5786J940J582J363R07K67J0M28J140J690J983J998J624J064P44N19k96
54938A02749j680k467j733j76O09l1j285k026k031j895k007j885p83J076K392
54923H8827K203R60j95p07o33p4O46P80M0o51k83P93J505J765K382L504M299M278
54905A09439L822L405L106K825K381J536O52P27K017L380L996M769O679Q734R360
54890A66828Q979R141R845J0077J0430J2339J4812J5019J2671J0744J0822J0658
54878C02365P978L954P57k148o558j1742j4857j4756j3203j2320j2449j2670j2152
$$ plain form
54865 202199 191461 182527 175059 168559 163038 158767 155486 152408 148990 145312 141817 139100 137817 138360
54851 138360 140673 144577 149970 156408 163061 169555 176358 183894 191994 200800 211277 223820 237057
54838 237057 249193 259986 270068 278762 284065 284807 281597 275522 267124 256808 245201 232738 219633
54825 219633 206429 193876 182259 171553 162171 154639 148583 142937 137283 132133 127731 123504 118987
54812 118987 114542 110809 108047 106305 105679 106052 106891 107564 107726 107438 107042 106728 106107 104611 102491 100735
54796 100735 99581 97960 95169 92293 90877 90760 90406 89029 87228 85685 84433 83320 82205 80668 78444
54781 78444 76040 74092 72351 70242 68054 66451 65120 63348 61820 62364 65582 69977 73738 76272 77771
54766 77771 78499 79018 80112 82041 84571 87821 91937 95784 97346 96195 94520 94951 98068 102617 107309
$$ packed form
54865B02199j0738q934p468o500n521m271l281l078l418l678l495k717j283N43
54851A38360K313L904N393O438O653O494O803P536Q100Q806J0477J2543J3237
54838B37057J2136J0793J0082Q694N303P42l210o075q398j0316j1607j2463j3105
54825B19633j3204j2553j1617j0706r382p532o056n646n654n150m402m227m517
54812A18987m445l733k762j742o26L73Q39O73J62k88l96l14o21j496k120j756
54796A00735j154j621k791k876j416j17l54j377j801j543j252j113j115j537k224
54781G8444k404j948j741k109k188j603j331j772j528N44L218M395L761K534J499
54766G7771P28N19J094J929K530L250M116L847J562j151j675M31L117M549M692
$$ plain form
54751 107309 111636 115553 119218 122847 126343 129368 132059 135224 139408 144085 148154 151078 153427 156488
54737 156488 161326 167910 175157 182142 189113 197150 207222 219974 235679 253468 271116 286751 300552
54724 300552 313559 325093 332733 334974 332541 326968 319375 311083 303791 298091 292781 286644 280164 274598
54710 274598 270028 265326 259825 254330 250491 249410 250573 252040 252190 251400 251538 253852 258177 264149 271965
54695 271965 281359 291084 300392 310327 322524 337152 353061 369720 387875 408024 428950 448371
54683 448371 464875 478831 491232 501800 508546 509269 503205 491148 474503 454694 433067 410749
54671 410749 388664 367951 349753 334094 319537 304857 290624 278228 267727 257780 247501 237215
54659 237215 227388 217961 208951 200861 194249 189360 185956 182890 178534 172831 168322 167549 169618 171007
$$ packed form
54751A07309M327L917L665L629L496L025K691L165M184M677M069K924K349L061
54737A56488M838O584P247O985O971Q037J0072J2752J5705J7789J7648J5635J3801
54724C00552J3007J1534P640K241k433n573p593q292p292n700n310o137o480n566
54710B74598m570m702n501n495l839j081J163J467J50p90J38K314M325N972P816
54695B71965R394R725R308R935J2197J4628J5909J6659J8155K0149K0926J9421
54683D48371J6504J3956J2401J0568O746P23o064j2057j6645j9809k1627k2318
54671D10749k2085k0713j8198j5659j4557j4680j4233j2396j0501r947j0279j0286
54659B37215r827r427r010q090o612m889l404l066m356n703m509p73K069J389
$$ plain form
54645 171007 169789 167330 165792 165929 167704 170930 174356 176002 175720 175924 178463 181976 183650 182576 180118
54630 180118 177977 177188 178194 180381 181994 181685 179906 178070 176934 176571 177127 178521 180125 181767 184430
54615 184430 188794 193740 197568 200219 202985 206356 209591 212342 215336 219208 223821 229121 235683 243905
54601 243905 253200 262337 270185 276048 279910 282701 285933 290653 296788 303643 310825 318467 326623 334743
54587 334743 342194 349320 357529 367901 380181 393656 408557 425639 444642 464369 484340 505076
54575 505076 526438 546911 565144 581042 594451 603728 606630 602233 591417 576063 558301 539631
54563 539631 519876 497633 472659 447231 424246 404408 386177 368130 350473 334457 321146
54552 321146 310781 302755 296173 290648 286353 283239 280817 278897 277753 277130 275972 273686 270796 267578
$$ packed form
54645A71007j218k459j538J37J775L226L426J646k82K04K539L513J674j074k458
54630A80118k141p89J006K187J613l09j779j836j136l63N56J394J604J642K663
54615A84430M364M946L828K651K766L371L235K751K994L872M613N300O562Q222
54601B43905R295R137P848N863L862K791L232M720O135O855P182P642Q156Q120
54587C34743P451P126Q209J0372J2280J3475J4901J7082J9003J9727J9971K0736
54575E05076K1362K0473J8233J5898J3409R277K902m397j0816j5354j7762j8670
54563E39631j9755k2243k4974k5428k2985j9838j8231j8047j7657j6016j3311
54552C21146j0365q026o582n525m295l114k422j920j144o23j158k286k890l218
$$ plain form
54538 267578 262969 255928 247234 238785 231483 224807 218169 211717 205870 200909 196936 193737 190828 187972
54524 187972 185217 182102 177716 172243 167505 164885 163357 160806 156833 152943 150281 148473 146751 145015
54510 145015 143553 142547 142004 141492 139985 136719 132327 128564 126902 127683 130180 132806 133748 132451 130409
54495 130409 129674 130687 132277 133532 134707 136368 138606 141240 144108 146977 149664 152294 155075 158051
54481 158051 161461 165828 171103 176256 180496 184398 189000 194350 200035 206546 214702 223984 232928 241235
54467 241235 250081 260159 270736 280903 290365 298449 303649 305014 303160 299281 293841 286867 278716
54454 278716 269816 260173 249849 239580 230352 222513 215726 209499 203519 197712 192245 187296 182710 178156
54440 178156 173616 169380 165550 161914 158340 154869 151462 148057 144811 141826 138834 135827 133828 134122
$$ packed form
54538B67578m609p041q694q449p302o676o638o452n847m961l973l199k909k856
54524A87972k755l115m386n473m738k620j528k551l973l890k662j808j722j736
54510A45015j462j006n43n12j507l266m392l763j662P81K497K626R42j297k042
54495A30409p35J013J590J255J175J661K238K634K868K869K687K630K781K976
54481A58051L410M367N275N153M240L902M602N350N685O511Q156R282Q944Q307
54467B41235Q846J0078J0577J0167R462Q084N200J365j854l879n440o974q151
54454B78716q900r643j0324j0269r228p839o787o227n980n807n467m949m586m554
54440A78156m540m236l830l636l574l471l407l405l246k985k992l007j999K94
$$ plain form
54426 134122 136575 139525 141608 142960 144258 145306 145252 143886 142183 141518 142443 144254 145900 147355 149598
54411 149598 152927 156046 157675 158442 159899 162001 163122 162654 161975 162307 163179 163861 164940 167155 169717 171245
54395 171245 171761 172339 173146 173340 172879 172891 173830 174444 173315 170697 168097 166413 165029 162631 158617 153897
54379 153897 150351 149102 149215 148680 147015 146106 147744 150906 152588 151186 147911 144796 142681 141688 142263
54364 142263 144430 146723 147353 146238 144719 143582 142732 142711 144805 149053 153561 156640 158596 160618 162968
54349 162968 165224 167401 169692 171682 172922 173811 174952 176204 177420 179624 184151 190772 197844 204206
54335 204206 209840 214708 218259 220527 222791 226525 232030 238188 243167 245443 244760 242297 239527 237052
54321 237052 234755 232610 230623 228333 225191 221294 217059 212438 207257 202059 197711 194275 191082 187749
$$ packed form
54426A34122K453K950K083J352J298J048n4j366j703o65R25J811J646J455K243
54411A49598L329L119J629P67J457K102J121m68o79L32Q72O82J079K215K562J528
54395A71245N16N78Q07J94m61J2R39O14j129k618k600j684j384k398m014m720
54379A53897l546j249J13n35j665r09J638L162J682j402l275l115k115r93N75
54364A42263K167K293O30j115j519j137q50k1K094M248M508L079J956K022K350
54349A62968K256K177K291J990J240Q89J141J252J216K204M527O621P072O362
54335B04206N634M868L551K268K264L734N505O158M979K276o83k463k770k475
54321B37052k297k145j987k290l142l897m235m621n181n198m348l436l193l333
$$ plain form
54307 187749 184360 180940 177703 175512 174894 174765 173463 171043 169286 169276 170268 171141 171669 171909 171678 171292 171687
54290 171687 173149 174755 175698 176302 177227 178646 180793 184315 189301 194727 199567 203773 207555 210601 212776
54275 212776 214751 217060 219173 220405 221069 221740 222025 221099 219082 216705 213903 209917 204798 199734 195648
54260 195648 192287 188909 185124 180771 175647 169837 163902 158315 152923 147335 141684 136661 132752 129797
54246 129797 127401 125494 124068 122471 119645 115404 111027 107972 106271 104797 102938 101231 100218 99437
54232 99437 97982 95640 93110 91288 90560 90607 90743 90469 89714 88593 87344 86660 87422 89441 91009 90676 89248
54215 89248 89040 91119 94174 96203 96465 95673 95138 95883 97804 99489 99713 99191 99916 102592 105776 107900
54199 107900 109052 110208 111707 113140 114027 114000 112983 111719 111478 112735 114743 116650 118184 119026 118705 117747
$$ packed form
54307A87749l389l420l237k191o18j29j302k420j757j0R92Q73N28K40k31l86L95
54290A71687J462J606R43O04R25J419K147L522M986N426M840M206L782L046K175
54275B12776J975K309K113J232O64O71K85r26k017k377k802l986n119n064m086
54260A95648l361l378l785m353n124n810n935n587n392n588n651n023l909k955
54246A29797k396j907j426j597k826m241m377l055j701j474j859j707j013p81
54232I9437j455k342k530j822p28M7J36k74p55j121j249o84P62K019J568l33j428
54215H9248k08K079L055K029K62p92n35P45J921J685K24n22P25K676L184K124
54199A07900J152J156J499J433Q87k7j017j264k41J257K008J907J534Q42l21r58
$$ plain form
54183 117747 117743 119362 121243 121858 121563 121728 122588 123284 123540 123996 125027 126280 127352 128093 128327 127869 126742
54166 126742 124937 122410 119821 118622 119613 121896 124034 125647 126978 127502 126264 123425 120342 118167 117178
54151 117178 117252 117971 118388 117779 116610 115867 115492 114591 113168 112470 113265 114821 116033 116717 117269 117815 118268 118691
54133 118691 119064 119019 118304 117214 116282 115687 115129 114083 112160 109577 107355 106683 107786 109608 110717 110378
54117 110378 108807 106721 104813 103506 103078 103818 105703 107763 108281 106195 102235 98313 95878 95108 95380
54102 95380 96091 97061 98553 100775 103151 104441 103968 102475 101325 101243 102240 104236 106885 109089 109651 108517
54086 108517 106703 105054 103791 103180 103703 105326 107295 108916 109965 110245 109535 108248 107439 107598 107850 106794
54070 106794 103895 99919 96315 94387 94581 96220 98078 99317 99706 99032 97008 93968 91115 89502 88911
$$ packed form
54183A17747mJ619J881O15k95J65Q60O96K56M56J031J253J072P41K34m58j127
54166A26742j805k527k589j199R91K283K138J613J331N24j238k839l083k175r89
54151A17178P4P19M17o09j169p43l75r01j423o98P95J556J212O84N52N46M53M23
54133A18691L73m5p15j090r32n95n58j046j923k583k222o72J103J822J109l39
54117A10378j571k086j908j307m28P40J885K060N18k086l960l922k435p70K72
54102I5380P11R70J492K222K376J290m73j493j150q2R97J996K649K204N62j134
54086A08517j814j649j263o11N23J623J969J621J049K80p10j287q09J59K52j056
54070A06794k899l976l604j928J94J639J858J239L89o74k024l040k853j613n91
$$ plain form
54055 88911 88053 85875 82579 79483 77926 78175 79392 80766 82414 84898 88138 91389 94159 96508 98461
54040 98461 99836 100756 101623 102375 102498 102111 102263 103554 105064 105380 104267 102588 101008 99611 98614 98422 98842
54023 98842 99120 99127 99744 101532 103621 104666 104593 104580 105366 106342 106618 106303 106240 106830 107666 108068 107433 105281 101770
54004 101770 98383 97368 99864 104700 109360 112091 112951 113124 113616 114624 115892 117476 119890 123308 126895
53989 126895 129495 131116 133080 136421 140637 144481 147488 150140 152897 155746 158557 161224 163568 165769
53975 165769 168842 173907 180735 187657 193313 198107 203624 210949 219853 229234 237886 245078 251016 256890
53961 256890 263953 272245 280437 287222 292687 297915 303338 308161 311678 314528 317941 322056 325838 328655
53947 328655 330982 333186 334460 333698 331062 327900 325220 322747 319447 314572 308198 301096 294094 287392
$$ packed form
54055H8911q58k178l296l096j557K49J217J374J648K484L240L251K770K349J953
54040I8461J375R20Q67P52J23l87J52J291J510L16j113j679j580j397r97j92M20
54023I8842K78PO17J788K089J045p3j3P86R76K76l15o3N90Q36M02o35k152l511
54004A01770l387j015K496M836M660K731Q60J73M92J008J268J584K414L418L587
53989A26895K600J621J964L341M216L844L007K652K757K849K811K667K344K201
53975A65769L073N065O828O922N656M794N517P325Q904R381Q652P192N938N874
53961B56890P063Q292Q192O785N465N228N423M823L517K850L413M115L782K817
53947C28655K327K204J274p62k636l162k680k473l300m875o374p102p002o702
$$ plain form
53933 287392 280617 273649 267156 261946 258024 254705 251572 248876 246929 245498 243982 242055 239926 237973
53919 237973 236203 234240 231844 229275 226919 224783 222576 220152 217468 214394 211140 208654 207839 208380 209104
53904 209104 209602 210621 212736 215590 218699 221895 224477 225118 223455 221022 219684 219886 221079 222949 225207
53889 225207 227002 227725 227850 227999 228007 228083 229923 234880 241550 247125 250982 255090 260831 267408 273813 280341
53873 280341 287240 293601 298891 304341 311415 319639 327098 332456 335500 336429 335793 334778 334336 334109 333168
53858 333168 331745 331331 332986 336428 341050 347053 354986 364539 374403 383345 391197 398733 406755 415445
53844 415445 424481 433565 442730 452240 462156 471871 480204 486391 490943 494953 498362 499625 497650 493431
53830 493431 489106 485819 483163 480193 476026 469893 461812 453156 445481 438682 431212 422135 411994 401601
$$ packed form
53933B87392o775o968o493n210l922l319l133k696j947j431j516j927k129j953
53919B37973j770j963k396k569k356k136k207k424k684l074l254k486q15N41P24
53904B09104M98J019K115K854L109L196K582O41j663k433j338K02J193J870K258
53889B25207J795P23J25J49QP6J840M957O670N575L857M108N741O577O405O528
53873B80341O899O361N290N450P074Q224P459N358L044R29o36j015m42k27r41
53858C33168j423m14J655L442M622O003P933R553R864Q942P852P536Q022Q690
53844D15445R036R084R165R510R916R715Q333O187M552M010L409J263j975m219
53830D93431m325l287k656k970m167o133q081q656p675o799p470r077j0141j0393
$$ plain form
53816 401601 391135 380714 370741 361178 351384 341143 331092 321718 312843 304481 297225 291102 284955
53803 284955 277728 269733 261997 255049 248978 243843 239203 233967 227748 221766 217379 214208 210809 206805
53789 206805 203042 199820 196438 192771 189942 188645 187751 185509 181694 177722 174836 172970 171436 169950
53775 169950 168580 167173 165452 163612 162281 161781 161810 162031 162527 163428 164536 165698 167174 169052 170630 170984
53759 170984 170069 168776 168120 168871 171450 175316 178746 180312 180594 181413 183477 186031 188838 192887 198464
53744 198464 203975 207743 209943 211871 214398 218329 225025 234749 244803 251344 253495 254368 257589 263974
53730 263974 272102 280812 289838 298567 305716 310777 315009 320173 326443 332265 336452 339614 342949 346308
53716 346308 348563 349594 350480 351464 351176 348689 345236 342782 341642 340655 339056 336823 333531 328412 321892
$$ packed form
53816D01601j0466j0421r973r563r794j0241j0051r374q875q362p256o123o147
53803B84955p227p995p736o948o071n135m640n236o219n982m387l171l399m004
53789B06805l763l222l382l667k829j297q94k242l815l972k886j866j534j486
53775A69950j370j407j721j840j331n00K9K21M96R01J108J162J476J878J578L54
53759A70984r15j293o56P51K579L866L430J566K82Q19K064K554K807M049N577
53744A98464N511L768K200J928K527L931O696R724J0054O541K151Q73L221O385
53730B63974Q128Q710R026Q729P149N061M232N164O270N822M187L162L335L359
53716C46308K255J031Q86R84k88k487l453k454j140r87j599k233l292n119o520
$$ plain form
53701 321892 315901 312134 310595 310084 309370 307570 304138 299100 293118 287000 281340 276592 273017 270335 267913
53686 267913 265566 263875 263317 263348 262748 260790 257813 254623 251605 248486 244893 240989 237546 235426 234935
53671 234935 235538 236068 235405 233256 230445 228299 227665 228462 229868 230779 230371 228726 226783 225220 223538 220937
53655 220937 217969 216454 217523 220489 223952 227198 230140 232729 235155 237954 241228 244317 246902 249765
53641 249765 253624 257948 262023 266609 272965 280379 286304 289483 291579 294992 300163 306032 312217 319306
53627 319306 327194 334589 340579 345789 351335 357248 362659 367171 371159 374749 377512 379534 381920 385442
53613 385442 389175 391296 391012 388992 386274 383684 382147 382405 384127 386143 387767 389057 389768 389244 387703
53598 387703 386442 386078 385651 384239 382471 381563 381758 382645 384122 385937 387064 386840 386110 386001 386063 384936 382448
$$ packed form
53701C21892n991l767j539n11p14j800l432n038n982o118n660m748l575k682k422
53686B67913k347j691n58L1o00j958k977l190l018l119l593l904l443k120m91
53671B34935O03N30o63k149k811k146o34P97J406R11m08j645j943j563j682k601
53655B20937k968j515J069K966L463L246K942K589K426K799L274L089K585K863
53641B49765L859M324M075M586O356P414N925L179K096L413N171N869O185P089
53627C19306P888P395N990N210N546N913N411M512L988L590K763K022K386L522
53613C85442L733K121k84k020k718k590j537K58J722K016J624J290P11n24j541
53598C87703j261l64m27j412j768r08J95Q87J477J815J127k24p30j09O2j127k488
$$ plain form
53581 382448 379691 377287 374998 372891 371435 370449 369362 368662 369621 372220 374656 375520 375372 375568 376435 377263
53565 377263 377434 377102 377287 379462 384277 390476 395885 399684 402832 406163 409237 411563 413832 417104 421564
53550 421564 426834 432882 439960 448031 456764 465647 473920 481072 487650 494764 502559 510220 517821 526763
53536 526763 537512 548206 556795 563544 570117 577113 584162 591801 601276 612418 623385 632835 640989
53523 640989 648266 654377 659360 664288 670036 676186 681898 687066 691839 695737 698347 700448 703341 707051
53509 707051 710144 711617 712290 713914 717226 721281 724565 726397 727175 727453 727145 725840 723766 722017 721676
53494 721676 722919 725110 727485 729535 731077 732403 734260 737130 740513 743327 745167 746740 748890 751677
53480 751677 754790 758362 762738 767604 772085 775792 779204 782899 786988 791567 797208 804500 813395 823335
$$ packed form
53581C82448k757k404k289k107j456r86j087p00R59K599K436Q64j48J96Q67Q28
53565C77263J71l32J85K175M815O199N409L799L148L331L074K326K269L272M460
53550D21564N270O048P078Q071Q733Q883Q273P152O578P114P795P661P601Q942
53536E26763J0749J0694Q589O749O573O996P049P639R475J1142J0967R450Q154
53523F40989P277O111M983M928N748O150N712N168M773L898K610K101K893L710
53509G07051L093J473O73J624L312M055L284J832P78K78l08j305k074j749l41
53494G21676J243K191K375K050J542J326J857K870L383K814J840J573K150K787
53480G51677L113L572M376M866M481L707L412L695M089M579N641P292Q895R940
$$ plain form
53466 823335 833729 844021 853750 863182 873557 886041 900515 916016 932218 949659 968508 988055
53454 988055 1007864 1028581 1050941 1074622 1098951 1124286 1151610 1180797 1210457 1239983 1270750
53443 1270750 1304431 1340653 1377466 1414052 1451854 1492620 1536212 1581046 1626057 1671341 1717213
53432 1717213 1763756 1811307 1860457 1911202 1962859 2015099 2068221 2121955 2174824 2225591 2274760
53421 2274760 2323837 2373503 2423368 2473072 2522544 2571319 2618828 2665599 2713051 2761542 2809506
53410 2809506 2855098 2898037 2939140 2978712 3016322 3051889 3085950 3118694 3149451 3177509 3202958
53399 3202958 3226372 3247920 3267139 3283382 3296162 3305261 3311028 3314538 3316742 3317087 3313537 3304657 3291291
53386 3291291 3275503 3258175 3238626 3216294 3191323 3163192 3130463 3092993 3053156 3013432 2973609
$$ packed form
53466H23335J0394J0292R729R432J0375J2484J4474J5501J6202J7441J8849J9547
53454I88055J9809K0717K2360K3681K4329K5335K7324K9187K9660K9526L0767
53443A270750L3681L6222L6813L6586L7802M0766M3592M4834M5011M5284M5872
53432A717213M6543M7551M9150N0745N1657N2240N3122N3734N2869N0767M9169
53421B274760M9077M9666M9865M9704M9472M8775M7509M6771M7452M8491M7964
53410B809506M5592M2939M1103L9572L7610L5567L4061L2744L0757K8058K5449
53399C202958K3414K1548J9219J6243J2780R099N767L510K204L45l550q880j3366
53386C291291j5788j7328j9549k2332k4971k8131l2729l7470l9837l9724l9823
$$ plain form
53375 2973609 2932005 2888844 2846371 2805522 2764401 2720803 2674915 2628761 2584093 2541654 2501616
53364 2501616 2463836 2428195 2395257 2366006 2340510 2317668 2296773 2278360 2262803 2249131 2236355
53353 2236355 2225115 2216709 2211125 2207487 2206206 2209120 2217329 2230089 2246047 2264455 2284991 2307667
53341 2307667 2333493 2364139 2400133 2440127 2482679 2528007 2577110 2629699 2684105 2739150 2795296
53330 2795296 2853930 2916256 2983023 3054592 3130807 3211072 3294841 3381864 3471894 3564413 3658825
53319 3658825 3754828 3852465 3951957 4053513 4157124 4262415 4368728 4475313 4581257 4685395
53309 4685395 4786688 4884974 4981019 5075665 5168997 5260333 5348587 5432331 5509859 5579750 5641377
53298 5641377 5694684 5739687 5776573 5806059 5829000 5845473 5854536 5854983 5846143 5828225 5802406 5770442
$$ packed form
53375B973609m1604m3161m2473m0849m1121m3598m5888m6154m4668m2439m0038
53364B501616l7780l5641l2938k9251k5496k2842k0895j8413j5557j3672j2776
53353B236355j1240q406n584l638j281K914Q209J2760J5958J8408K0536K2676
53341B307667K5826L0646L5994L9994M2552M5328M9103N2589N4406N5045N6146
53330B795296N8634O2326O6767P1569P6215Q0265Q3769Q7023R0030R2519R4412
53319C658825R6003R7637R9492J01556J03611J05291J06313J06585J05944J04138
53309D685395J01293R8286R6045R4646R3332R1336Q8254Q3744P7528O9891O1627
53298E641377N3307M5003L6886K9486K2941J6473R063M47q840j7918k5819l1964
$$ plain form
53286 5770442 5733388 5690485 5639902 5580813 5514157 5441140 5361759 5275489 5182993 5086482 4988514
53275 4988514 4890721 4793391 4695857 4597583 4499209 4402172 4306924 4212071 4116010 4019199 3924003
53264 3924003 3832413 3744540 3659313 3575982 3494785 3416636 3342461 3272650 3207075 3145657 3088595
53253 3088595 3035843 2986692 2940313 2896422 2855052 2816004 2778932 2743691 2710173 2678262 2648428
53242 2648428 2621857 2599314 2580345 2564307 2551489 2542222 2535453 2529654 2524934 2522754 2523438 2525496 2527898
53229 2527898 2531699 2538664 2549280 2562867 2578808 2596850 2616770 2638600 2663018 2690998 2723080 2758968
53217 2758968 2797537 2837328 2877748 2919714 2964381 3011200 3058119 3103779 3148431 3192469 3235332
53206 3235332 3276451 3316068 3354216 3389706 3421077 3448032 3471193 3490946 3507216 3519875 3528765
$$ packed form
53286E770442l7054m2903n0583n9089o6656p3017p9381q6270r2496r6511r7968
53275D988514r7793r7330r7534r8274r8374r7037r5248r4853r6061r6811r5196
53264C924003r1590q7873q5227q3331q1197p8149p4175o9811o5575o1418n7062
53253C088595n2752m9151m6379m3891m1370l9048l7072l5241l3518l1911k9834
53242B648428k6571k2543j8969j6038j2818r267o769n799m720k180O84K058K402
53229B527898L801O965J0616J3587J5941J8042J9920K1830K4418K7980L2082L5888
53217B758968L8569L9791M0420M1966M4667M6819M6919M5660M4652M4038M2863
53206C235332M1119L9617L8148L5490L1371K6955K3161J9753J6270J2659Q890
$$ plain form
53195 3528765 3533747 3535155 3533651 3529268 3521380 3510006 3495996 3479159 3457440 3429255 3395934 3360484
53183 3360484 3324317 3286365 3244912 3199045 3148608 3094316 3038152 2982492 2928340 2875070 2821902
53172 2821902 2768853 2716194 2663852 2611669 2559780 2508542 2458440 2409906 2362906 2316958 2272070
53161 2272070 2229169 2188838 2150054 2111153 2071871 2033327 1996099 1959451 1922755 1886676 1852458
53150 1852458 1820668 1791015 1762816 1735344 1708114 1681049 1654065 1626586 1598041 1568707 1539372
53139 1539372 1510211 1480812 1451405 1423107 1396557 1371118 1345945 1321171 1297351 1274149 1250253
53128 1250253 1224622 1197492 1170140 1143759 1118462 1093387 1067942 1042710 1018705 995908 973131
53117 973131 949446 925171 901308 878503 856756 835692 814864 794115 773857 754688 736736
$$ packed form
53195C528765M982J408j504m383p888j1374j4010j6837k1719k8185l3321l5450
53183C360484l6167l7952m1453m5867n0437n4292n6164n5660n4152n3270n3168
53172B821902n3049n2659n2342n2183n1889n1238n0102m8534m7000m5948m4888
53161B272070m2901m0331l8784l8901l9282l8544l7228l6648l6696l6079l4218
53150A852458l1790k9653k8199k7472k7230k7065k6984k7479k8545k9334k9335
53139A539372k9161k9399k9407k8298k6550k5439k5173k4774k3820k3202k3896
53128A250253k5631k7130k7352k6381k5297k5075k5445k5232k4005k2797k2777
53117I73131k3685k4275k3863k2805k1747k1064k0828k0749k0258j9169j7952
$$ plain form
53106 736736 719751 703819 689342 676149 663289 650138 637162 625081 613640 601871 589402
53095 589402 576995 565681 555696 546404 537075 527567 518273 509584 501580 494239 487656 481819 476334 470669
53081 470669 464634 458463 452482 446880 441643 436542 431382 426542 422950 421025 419866 418019 414988 411493
53067 411493 408342 405667 403431 402019 401917 403031 404622 405855 406326 406201 405883 405560 405165 404838 405109 406383
53051 406383 408445 410721 412767 414251 414854 414618 414095 413673 413125 412374 412257 413667 416049 417492 416483 413168
53035 413168 409026 405679 403641 401608 397387 390234 381916 374629 368413 361810 354656 348626 344866 342622
53021 342622 340559 338126 335093 331075 326262 321600 317535 313581 309723 307018 305856 304733 301910 297570
53007 297570 293160 289231 285165 280625 276098 272187 269279 267581 266560 264686 260865 255999 252066 249701
$$ packed form
53106G36736j6985j5932j4477j3193j2860j3151j2976j2081j1441j1769j2469
53095E89402j2407j1314r985r292r329r508r294q689q004p341o583n837n485n665
53081D70669o035o171n981n602n237n101n160m840l592j925j159j847l031l495
53067D11493l151k675k236j412j02J114J591J233M71j25l18l23l95l27K71J274
53051D06383K062K276K046J484O03k36n23m22n48p51j17J410K382J443j009l315
53035D13168m142l347k038k033m221p153q318p287o216o603p154o030l760k244
53021C42622k063k433l033m018m813m662m065l954l858k705j162j123k823m340
53007B97570m410l929m066m540m527l911k908j698j021j874l821m866l933k365
$$ plain form
52993 249701 247783 245483 243637 243695 246139 250243 254683 257970 258975 257660 255077 252468 250597 249831 250085
52978 250085 250379 249156 245775 241410 237900 235843 234317 232421 230423 229165 228758 228370 227124 224741 221436
52963 221436 217802 214933 213963 214939 216532 217483 217945 218734 219628 219443 217734 215381 213321 211738 210783 210901
52947 210901 211807 212212 211527 210998 212122 214500 216335 216645 215963 215124 214419 213869 213394 212708 211805 211396 212122 213501
52929 213501 214564 215376 216922 219471 222172 224443 226641 228908 230369 230146 228497 226343 224237 222398 221297
52914 221297 221483 222995 225464 228660 232616 237327 242606 248174 253693 258815 263313 267204 270822 274832
52900 274832 279869 285889 292269 298948 306884 316475 325943 332645 336179 338870 342604 346309 347465 345307
52886 345307 341482 338004 335501 333361 330783 327686 324933 323563 323530 323552 322489 320418 317971 315297 312284
$$ packed form
52993B49701j918k300j846N8K444M104M440L287J005j315k583k609j871p66K54
52978B50085K94j223l381m365l510k057j526j896j998j258m07l88j246k383l305
52963B21436l634k869r70R76J593R51M62P89Q94j85j709k353k060j583r55J18
52947B10901R06M05o85n29J124K378J835L10o82q39p05n50m75o86r03m09P26J379
52929B13501J063Q12J546K549K701K271K198K267J461k23j649k154k106j839j101
52914B21297J86J512K469L196L956M711N279N568N519N122M498L891L618M010
52900B74832N037O020O380O679P936R591R468O702L534K691L734L705J156k158
52886C45307l825l478k503k140k578l097k753j370l3K2j063k071k447k674l013
$$ plain form
52871 312284 309258 306633 304262 301883 299814 298406 297148 295260 292872 290679 288594 285842 282377 279206
52857 279206 277260 276870 278208 281073 284109 285564 285267 284716 284822 284836 284171 283885 285263 287968 290816 293496
52841 293496 296140 297951 297903 296665 296218 297433 299220 300335 300826 301332 302049 303040 304753 307513 310893 314061
52825 314061 316461 317955 318730 319316 320268 321583 322688 323020 322219 319950 316401 313072 312006 313675 316368
52810 316368 318340 319888 322499 326491 330521 333296 334785 335596 335979 335991 336215 337658 340682 344182 346228
52795 346228 345901 344404 343977 345686 348678 351630 354192 356672 359016 360977 363005 366091 370521 375308 379208
52780 379208 382160 385504 390689 397727 404983 410612 414099 416155 417494 418404 419402 421278 423985 426150 426297
52765 426297 424116 420266 415660 411351 408201 405816 402519 397333 391409 386395 382053 376886 370782 365429
$$ packed form
52871C12284l026k625k371k379k069j408j258j888k388k193k085k752l465l171
52857B79206j946l90J338K865L036J455k97n51J06J4o65k86J378K705K848K680
52841B93496K644J811m8j238m47J215J787J115M91N06P17R91J713K760L380L168
52825C14061K400J494P75N86R52J315J105L32q01k269l549l329j066J669K693
52810C16368J972J548K611L992M030K775J489Q11L83J2K24J443L024L500K046
52795C46228l27j497m27J709K992K952K562K480K344J961K028L086M430M787L900
52780C79208K952L344N185P038P256N629L487K056J339R10R98J876K707K165J47
52765D26297k181l850m606m309l150k385l297n186n924n014m342n167o104n353
$$ plain form
52751 365429 361904 359336 356378 352734 348557 343528 337438 330926 324810 319267 314406 310965 309397 308599
52737 308599 306707 303226 299563 297223 296159 295252 293902 292500 291495 290627 289337 287596 285945 284820 284141
52722 284141 283403 281762 278263 272795 266990 263224 262139 261769 259759 255843 251476 247839 245340 244448 245359
52707 245359 246777 246450 243495 239266 235558 232750 230048 226748 222868 219179 216859 216443 216895 216485 214678
52692 214678 212301 209777 206466 202189 198078 195028 192344 188941 185123 182144 180591 180109 180169 180140 179112
52677 179112 176663 173463 170239 166562 161731 156586 153163 152394 153076 153359 152632 151716 151791 153288 155457 156952
52661 156952 157099 156439 155770 155114 154199 153468 153699 154728 155470 155287 154506 153489 152061 150253 148898 148788 149482
52644 149482 149504 147856 145190 143323 143484 145136 146862 148400 151047 155613 160636 163675 164206 164318 166387
$$ packed form
52751C65429l525k568k958l644m177n029o090o512o116n543m861l441j568p98
52737C08599j892l481l663k340j064r07j350j402j005q68j290j741j651j125o79
52722B84141p38j641l499n468n805l766j085l70k010l916m367l637k499q92R11
52707B45359J418l27k955m229l708k808k702l300l880l689k320m16M52m10j807
52692B14678k377k524l311m277m111l050k684l403l818k979j553m82O0k9j028
52677A79112k449l200l224l677m831n145l423p69O82K83p27r16P5J497K169J495
52661A56952J47o60o69o56r15p31K31J029P42j83p81j017j428j808j355j10O94
52644A49482K2j648k666j867J61J652J726J538K647M566N023L039N31J12K069
$$ plain form
52629 166387 170719 175734 179825 182681 185083 187731 190264 191596 191406 190910 191585 193336 194609 194264 192490
52614 192490 189876 186650 183294 180888 179883 179070 176837 173346 170485 169478 169296 167908 164536 160142 156124
52599 156124 153194 151401 150367 149241 147103 143923 140716 138306 136286 133801 130984 128846 127908 127745 127863
52584 127863 128192 128655 129080 129677 130698 131364 130255 127335 124644 124066 125175 126125 126110 125945 126607 128197 130221
52567 130221 132047 133159 133489 133443 133226 132540 131435 130805 131294 132211 132419 131830 131128 130565 130240 131116 134221 138723
52549 138723 142190 143115 142199 140945 140133 140019 140851 142492 144249 145675 146924 148067 148778 149133 149960 151871
52533 151871 154487 156928 158512 158826 158001 157246 158095 160477 162488 162837 162638 163700 165855 167395 167826 168692
52517 168692 171318 174964 177861 179360 180349 181853 183837 185294 185155 183205 180546 179237 180949 185552 191136
$$ packed form
52629A66387M332N015M091K856K402K648K533J332j90m96O75J751J273l45j774
52614A92490k614l226l356k406j005q13k233l491k861j007j82j388l372m394m018
52599A56124k930j793j034j126k138l180l207k410k020k485k817k138r38j63J18
52584A27863L29M63M25N97J021O66j109k920k691n78J109R50j5j65O62J590K024
52567A30221J826J112L30m6k17o86j105o30M89R17K08n89p02n63l25Q76L105M502
52549A38723L467R25r16j254q12j14Q32J641J757J426J249J143P11L55Q27J911
52533A51871K616K441J584L14q25p55Q49K382K011L49j99J062K155J540M31Q66
52517A68692K626L646K897J499R89J504J984J457j39j950k659j309J712M603N584
$$ plain form
52502 191136 195811 199343 202602 205690 207640 208278 209201 211853 215306 217249 217016 216350 217054 219036 221033
52487 221033 222182 222401 222189 222763 225557 230705 236428 240592 242548 242974 242558 241696 241076 241537 243195 245261
52471 245261 246903 247977 248895 250043 251341 252354 252976 253934 256084 259040 261101 260994 259184 257026 255182
52456 255182 253564 252330 251896 252003 251767 250957 250509 251221 252419 252503 250844 248714 248118 249821 252698 254905
52440 254905 255421 254330 252150 249495 247201 245919 245343 244438 242832 241407 241090 241633 242147 242480 243325 245157
52424 245157 247687 250416 253258 256552 260663 265370 269450 271346 270781 269308 268618 268665 268409 268079 269372 273009
52408 273009 277237 279568 279358 277970 276988 277114 278363 280255 281761 281937 280887 279638 278974 279010 279882 282027
52392 282027 285309 288499 290241 290273 289401 288680 288965 290598 292885 294396 294604 294802 296526 299451 301970 303516
$$ packed form
52502A91136M675L532L259L088J950O38R23K652L453J943k33o66P04J982J997
52487B21033J149K19k12N74K794N148N723M164J956M26m16q62o20M61J658K066
52471B45261J642J074R18J148J298J013O22R58K150K956K061j07j810k158j844
52456B55182j618j234m34J07k36q10m48P12J198Q4j659k130n96J703K877K207
52440B54905N16j091k180k655k294j282n76r05j606j425l17N43N14L33Q45J832
52424B45157K530K729K842L294M111M707M080J896n65j473o90M7k56l30J293L637
52408B73009M228K331k10j388r82J26J249J892J506J76j050j249o64L6Q72K145
52392B82027L282L190J742L2q72p21K85J633K287J511K08J98J724K925K519J546
$$ plain form
52376 303516 304886 306237 306444 305103 303770 304259 306712 310127 313537 315716 315055 311380 307052 304598 303786
52361 303786 302670 300881 299832 299819 299197 297011 294535 293273 292915 292240 290718 288234 284350 279182 274285
52346 274285 271482 271147 272408 274514 277106 279609 281374 282394 283159 283779 283817 283021 281903 281443 282263 283985
52330 283985 285655 287017 288963 292082 295289 297119 298128 300383 304305 307715 308832 308648 309202 310757 312196
52315 312196 313271 314872 317524 320964 324922 329198 333227 336637 339898 343442 346676 349073 351732 356219
52301 356219 361962 366474 368661 370576 375164 383091 392401 400684 406972 411802 415910 419126 420872 421703
52287 421703 423466 427114 431091 433086 433128 433750 437057 442713 448929 454374 458871 463118 468006 473611 478857
52272 478857 482951 486873 492247 498779 504306 507718 510358 513866 518022 521747 525040 528636 532527 536204
$$ packed form
52376C03516J370J351K07j341j333M89K453L415L410K179o61l675m328k454q12
52361C03786j116j789j049j3o22k186k476j262l58o75j522k484l884n168m897
52346B74285k803l35J261K106K592K503J765J020P65O20L8p96j118m60Q20J722
52330B83985J670J362J946L119L207J830J009K255L922L410J117j84N54J555J439
52315C12196J075J601K652L440L958M276M029L410L261L544L234K397K659M487
52301C56219N743M512K187J915M588P927R310Q283O288M830M108L216J746Q31
52287D21703J763L648L977J995M2O22L307N656O216N445M497M247M888N605N246
52272D78857M094L922N374O532N527L412K640L508M156L725L293L596L891L677
$$ plain form
52258 536204 539897 544380 549749 555608 562359 571050 581583 592086 600671 607377 613864 621564 630631 640573
52244 640573 651311 663326 676984 692124 708421 725748 743882 762222 780387 798983 818966
52233 818966 840052 860549 879413 898065 919448 945357 975091 1006578 1038194 1069392 1100236
52222 1100236 1131000 1162197 1194358 1227294 1259689 1290084 1318563 1347022 1377168 1408451 1438611
52211 1438611 1466225 1491898 1516701 1540331 1561618 1580386 1597715 1614227 1629005 1640808 1649929
52200 1649929 1658098 1666456 1674230 1679768 1682556 1683678 1684410 1684891 1684406 1682505 1679538 1676339 1673671 1671847 1670722
52185 1670722 1670123 1670315 1671611 1673503 1674747 1674731 1674257 1674578 1676308 1679948 1686841 1698351 1714077 1731880 1749946
52170 1749946 1768100 1786931 1806412 1825862 1844730 1863013 1881156 1899743 1918927 1937996 1955831
$$ packed form
52258E36204L693M483N369N859O751Q691J0533J0503Q585O706O487P700R067R942
52244F40573J0738J2015J3658J5140J6297J7327J8134J8340J8165J8596J9983
52233H18966K1086K0497J8864J8652K1383K5909K9734L1487L1616L1198L0844
52222A100236L0764L1197L2161L2936L2395L0395K8479K8459L0146L1283L0160
52211A438611K7614K5673K4803K3630K1287J8768J7329J6512J4778J1803R121
52200A649929Q169Q358P774N538K788J122P32M81m85j901k967l199k668j824j125
52185A670722n99J92J296J892J244j6m74L21J730L640O893J1510J5726J7803J8066
52170A749946J8154J8831J9481J9450J8868J8283J8143J8587J9184J9069J7835
$$ plain form
52159 1955831 1971870 1986228 1998892 2009483 2018022 2025320 2032158 2038499 2043840 2047908 2050534 2051157 2049040
52146 2049040 2043958 2036407 2027135 2016522 2004399 1990334 1974229 1956566 1937978 1918824 1899455 1880570
52134 1880570 1862666 1845327 1827748 1809977 1792891 1776940 1761870 1748014 1736731 1728722 1722528 1715629
52122 1715629 1706794 1696765 1686994 1678459 1671456 1665654 1660166 1654164 1647689 1641520 1636116 1630991 1625250 1618604
52108 1618604 1611768 1605872 1601443 1597919 1594236 1589880 1585138 1580404 1575672 1570823 1565954 1561135 1556271 1551514
52094 1551514 1547409 1544129 1540821 1536182 1529587 1521402 1512485 1503775 1496064 1489484 1483262 1476503 1469306 1462695
52080 1462695 1457389 1453009 1448595 1443640 1438491 1433821 1429638 1424775 1417694 1408218 1398254 1390256 1385017 1381481
52066 1381481 1378571 1376326 1374914 1373376 1370264 1365264 1359387 1353547 1347682 1341541 1335577 1330362 1325587 1320524
$$ packed form
52159A955831J6039J4358J2664J0591Q539P298O838O341N341M068K626O23k117
52146B049040n082p551r272j0613j2123j4065j6105j7663j8588j9154j9369j8885
52134A880570j7904j7339j7579j7771j7086j5951j5070j3856j1283q009o194o899
52122A715629q835j0029r771q535p003n802n488o002o475o169n404n125n741o646
52108A618604o836n896m429l524l683m356m742m734m732m849m869m819m864m757
52094A551514m105l280l308m639o595q185q917q710p711o580o222o759p197o611
52080A462695n306m380m414m955n149m670m183m863p081r476r964p998n239l536
52066A381481k910k245j412j538l112n000n877n840n865o141n964n215m775n063
$$ plain form
52052 1320524 1315547 1312344 1312210 1314689 1318344 1322370 1326787 1331536 1336398 1341787 1348673 1357378 1367314 1378312
52038 1378312 1391432 1407752 1426954 1447980 1470708 1495843 1523163 1550987 1578011 1604946 1633703
52027 1633703 1665352 1699569 1735661 1773089 1810858 1847599 1883086 1919071 1957463 1997667 2036630
52016 2036630 2071758 2103001 2131782 2158812 2183802 2206661 2227806 2247427 2265273 2281150 2294825
52005 2294825 2305420 2311890 2314360 2314221 2312574 2309238 2303589 2295548 2285268 2272663 2258043 2242661 2227781
51992 2227781 2213482 2199123 2184796 2171533 2160138 2150453 2141840 2133756 2125774 2117643 2109637 2102544 2097122
51979 2097122 2093765 2092593 2093412 2095417 2097505 2099368 2102108 2107280 2115263 2124772 2134043 2142283 2149818 2157080
51965 2157080 2163874 2169778 2174904 2179823 2184722 2188915 2191286 2191211 2189148 2186427 2184244 2182498 2179710 2174443
$$ packed form
52052A320524m977l203j34K479L655M026M417M749M862N389O886Q705R936J0998
52038A378312J3120J6320J9202K1026K2728K5135K7320K7824K7024K6935K8757
52027A633703L1649L4217L6092L7428L7769L6741L5487L5985L8392M0204L8963
52016B036630L5128L1243K8781K7030K4990K2859K1145J9621J7846J5877J3675
52005B294825J0595O470K470j39j647l336n649q041j0280j2605j4620j5382j4880
51992B227781j4299j4359j4327j3263j1395r685q613q084p982q131q006p093n422
51979B097122l357j172Q19K005K088J863K740N172P983R509R271Q240P535P262
51965B157080O794N904N126M919M899M193K371p5k063k721k183j746k788n267
$$ plain form
51951 2174443 2166741 2157695 2147715 2135955 2121614 2105078 2087126 2067435 2044666 2018113 1988790 1958624
51939 1958624 1928662 1898209 1865775 1830783 1794113 1756810 1718710 1678963 1637608 1595697 1553697
51928 1553697 1510816 1466542 1422022 1379002 1337885 1297789 1258272 1219890 1182987 1146882 1110755
51917 1110755 1074673 1039248 1004691 970745 937371 905065 874451 845819 819128 794314 771442
51906 771442 750459 730832 711673 692457 673575 655891 639701 624427 609514 595402 583101
51895 583101 572781 563240 553115 542359 531995 522684 514270 506744 500636 495850 490969 484696 477572
51882 477572 471266 466430 462305 458256 454504 451177 447877 444533 441579 438851 435432 431229 427546 425230
51868 425230 423239 420124 416006 411802 407311 401661 395330 390078 386651 383918 380690 377197 374223 371704
$$ packed form
51951B174443p702r046r980j1760j4341j6536j7952j9691k2769k6553k9323l0166
51939A958624k9962l0453l2434l4992l6670l7303l8100l9747m1355m1911m2000
51928A553697m2881m4274m4520m3020m1117m0096l9517l8382l6903l6105l6127
51917A110755l6082l5425l4557l3946l3374l2306l0614k8632k6691k4814k2872
51906G71442k0983j9627j9159j9216j8882j7684j6190j5274j4913j4112j2301
51895E83101j0320r541j0125j0756j0364r311q414p526o108m786m881o273p124
51882D77572o306m836m125m049l752l327l300l344k954k728l419m203l683k316
51868D25230j991l115m118m204m491n650o331n252l427k733l228l493k974k519
$$ plain form
51854 371704 368905 365434 361518 357664 354398 351998 350150 348228 346071 344110 342515 340798 338658 336729
51840 336729 335876 335849 335176 332631 328635 325062 323561 324051 324892 324533 322769 320310 317495 313988 309691 305497
51824 305497 302826 302430 303613 304641 304121 302128 299803 297829 295752 293096 290527 289204 289307 289950 290454
51809 290454 290951 291721 292722 293977 295713 297710 299024 298902 297733 296759 296948 298325 300186 301749 302783
51794 302783 303873 305949 309333 313211 316224 317644 317924 317981 318065 317703 316975 317310 320164 324867 328739 329723
51778 329723 328276 326244 324747 323883 323659 324015 324307 324025 323952 325566 329158 333532 337642 341455 344957 347354
51762 347354 347939 347185 346429 346730 348172 349860 350658 350475 350746 352859 356199 358748 359614 359716 359727 358890 356717
51745 356717 354509 353881 354680 355739 357034 359561 363265 366553 368136 368298 367987 367515 366646 365396 364335 364304
$$ packed form
51854C71704k799l471l916l854l266k400j848j922k157j961j595j717k140j929
51840C36729q53k7o73k545l996l573j501M90Q41l59j764k459k815l507m297m194
51824C05497k671l96J183J028n20j993k325j974k077k656k569j323J03O43N04
51809B90454M97P70J001J255J736J997J314j22j169r74J89J377J861J563J034
51794C02783J090K076L384L878L013J420K80N7Q4l62p28L35K854M703L872R84
51778C29723j447k032j497q64k24L56K92k82p3J614L592M374M110L813L502K397
51762C47354N85p54p56L01J442J688P98j83K71K113L340K549Q66J02J1q37k173
51745C56717k208o28P99J059J295K527L704L288J583J62l11m72q69j250j061l1
$$ plain form
51729 364304 365947 369263 373609 378311 383045 387356 390350 391582 391911 392542 393353 393203 392032 391495 392978
51714 392978 395892 398712 401036 403740 407420 411547 415096 417388 418451 419240 421421 426131 432644 438858
51700 438858 443416 446968 451025 456145 461855 468029 475420 484540 494465 503213 509318 513103 516625 522381
51686 522381 531584 543218 554802 564400 571968 578698 585145 590329 592791 592325 590296 588205 586158 583111
51672 583111 578618 573907 570827 569905 569907 569386 568202 567325 567529 568564 569398 568874 566316 561937 556763 552042
51656 552042 548623 546740 546065 545817 545204 544115 543239 543219 543806 544072 543326 541615 539429 537113 534485 530963
51640 530963 526423 521955 519184 518442 518176 516727 514263 512235 511338 510884 509990 508408 506236 503802 502105
51625 502105 502373 504620 507333 509168 510495 512736 516544 521208 525647 529452 532883 536093 538422 538545 535599
$$ packed form
51729C64304J643L316M346M702M734M311K994J232L29O31Q11j50j171n37J483
51714C92978K914K820K324K704L680M127L549K292J063P89K181M710O513O214
51700D38858M558L552M057N120N710O174P391R120R925Q748O105L785L522N756
51686E22381R203J1634J1584R598P568O730O447N184K462m66k029k091k047l047
51672E83111m493m711l080r22Kn21j184q77K04J035Q34n24k558m379n174m721
51656E52042l419j883o75k48o13j089q76k0N87K66p46j711k186k316k628l522
51640E30963m540m468k771p42k66j449k464k028q97m54q94j582k172k434j697
51625E02105K68K247K713J835J327K241L808M664M439L805L431L210K329J23k946
$$ plain form
51610 535599 530305 524718 520668 518516 517376 516186 514343 511619 507855 502966 497360 492252 489084 488130
51596 488130 487824 485970 481626 475515 468851 462367 456262 450260 443618 435907 428101 422083 418537 415923
51582 415923 412180 407146 402663 400457 400422 401010 400863 399801 398293 396347 393420 389550 385997 384111 383844
51567 383844 383973 383458 381857 378775 374132 369094 365468 363710 362542 361053 360085 360778 362653 364164 364514
51552 364514 363949 362762 361074 359413 358478 358242 358035 357625 357637 358732 360745 362763 363853 363757 363052 362550 362592
51535 362592 363161 364522 367028 370135 372427 373139 373043 373441 374965 377832 382455 388907 396329 403604 410133
51520 410133 415437 418845 420584 422373 425582 429298 431500 431823 431671 431809 431510 430313 428974 428090 427081
51505 427081 425383 423562 422417 421884 421681 422293 424290 427055 429184 430016 430122 430437 431471 433279 435698 438584
$$ packed form
51610E35599n294n587m050k152j140j190j843k724l764m889n606n108l168r54
51596D88130l06j854m344o111o664o484o105o002o642p711p806o018l546k614
51582D15923l743n034m483k206l5N88j47j062j508j946k927l870l553j886k67
51567C83844J29n15j601l082m643n038l626j758j168j489r68O93J875J511L50
51552C64514n65j187j688j661r35k36k07m10J2J095K013K018J090r6p05n02M2
51535C62592N69J361K506L107K292P12r6L98J524K867M623O452P422P275O529
51520D10133N304L408J739J789L209L716K202L23j52J38k99j197j339q84j009
51505D27081j698j821j145n33k03O12J997K765K129Q32J06L15J034J808K419K886
$$ plain form
51489 438584 442168 447026 453334 460194 466099 470098 472370 473744 474932 476243 477757 479492 481183 481970
51475 481970 480792 477618 474170 472816 474481 477946 481338 483850 485800 487570 489123 490422 491722 493225
51461 493225 494660 495349 494645 492459 489576 487408 487025 488085 488925 488120 485996 484132 483249 482204 479686 476309
51445 476309 473899 472734 470874 466815 461714 457978 456496 456436 457169 458746 460532 460927 459144 456293 454111
51430 454111 453383 454025 455812 458201 460094 460737 460719 461413 463524 466618 469847 472596 474569 475920 477440 480165
51414 480165 484557 490206 496320 502265 507708 512658 517534 522908 528941 535273 541741 548945 557615 567390
51400 567390 576810 584897 592254 599962 607763 614223 618709 622195 625681 628663 629840 628736 626014 622782
51386 622782 620331 619783 620911 621697 620264 617113 614403 613156 612420 611112 609214 606749 603038 597822 592106
$$ packed form
51489D38584L584M858O308O860N905L999K272J374J188J311J514J735J691P87
51475D81970j178l174l448j354J665L465L392K512J950J770J553J299J300J503
51461D93225J435O89p04k186k883k168l83J060Q40q05k124j864q83j045k518l377
51445D76309k410j165j860m059n101l736j482o0P33J577J786L95j783k851k182
51430D54111p28O42J787K389J893O43j8O94K111L094L229K749J973J351J520K725
51414D80165M392N649O114N945N443M950M876N374O033O332O468P204Q670R775
51400E67390R420Q087P357P708P801O460M486L486L486K982J177j104k722l232
51386F22782k451n48J128P86j433l151k710j247p36j308j898k465l711n216n716
$$ plain form
51371 592106 586947 582151 576979 571411 565869 560249 554226 548084 542319 536666 530429 523664 517227 511714
51357 511714 507090 503329 500594 498563 496263 492999 489117 485647 483399 482573 482979 484364 486531 489169 491677
51342 491677 493319 493737 493169 492006 490251 487584 483906 479730 476001 473383 471450 468705 463763 456607 448379
51327 448379 440118 432234 425038 418744 412640 405239 395956 385964 376740 368400 360370 352990 347216 343001
51313 343001 339227 335410 332334 330537 329046 326245 321620 316135 311113 307102 303665 300036 295954 291810
51299 291810 287952 284205 280419 277259 275714 275733 275870 274586 271671 268254 265681 264496 264330 264629 265357 266802
51283 266802 268707 270119 270430 270033 269429 268268 266087 263616 262256 262417 263359 264628 266400 268351 269605
51268 269605 270376 272349 276499 281545 285594 288507 291527 295226 299070 302625 305989 309199 312302 315885
$$ packed form
51371E92106n159m796n172n568n542n620o023o142n765n653o237o765o437n513
51357E11714m624l761k735k031k300l264l882l470k248q26M06J385K167K638K508
51342D91677J642M18n68j163j755k667l678m176l729k618j933k745m942p156q228
51327D48379q261p884p196o294o104p401r283r992r224q340q030p380n774m215
51313C43001l774l817l076j797j491k801m625n485n022m011l437l629m082m144
51299B91810l858l747l786l160j545J9J37j284k915l417k573j185j66K99P28J445
51283B66802J905J412L11l97o04j161k181k471j360J61R42J269J772J951J254
51268B69605P71J973M150N046M049K913L020L699L844L555L364L210L103L583
$$ plain form
51254 315885 320432 325150 328504 329951 330128 329397 327437 324440 321260 317797 312688 305591 298556 293755 290601
51239 290601 286613 280740 274355 269023 264814 261231 258455 256809 255732 254125 251381 247599 243175 238755
51225 238755 235275 233432 233155 233914 235292 236776 237288 235673 231892 227195 222865 219198 216041 213833 213364
51210 213364 214418 215373 214733 212812 211336 211360 212214 212742 212881 213332 214105 214431 214239 214722 216810 219745 221887
51193 221887 222534 222216 221388 219812 217431 215103 213964 214355 215610 216554 215919 212874 207905 203139 201074 202516
51177 202516 205847 208501 209115 208291 207626 208219 209966 211969 213515 214739 216332 218621 221049 222622 222660 221009
51161 221009 217982 214628 212788 213948 217675 221835 224813 227001 229621 232628 234654 234803 233699 232809 233326
51146 233326 235614 238958 241869 243413 244262 245707 247761 249307 250123 251232 252745 252902 250505 247199 245863
$$ packed form
51254C15885M547M718L354J447J77p31j960k997l180l463n109p097p035m801l154
51239B90601l988n873o385n332m209l583k776j646j077j607k744l782m424m420
51225B38755l480j843k77P59J378J484N12j615l781m697m330l667l157k208m69
51210B13364J054R55o40j921j476K4Q54N28J39M51P73L26j92M83K088K935K142
51193B21887O47l18q28j576k381k328j139L91J255R44o35l045m969m766k065J442
51177B02516L331K654O14q24o65N93J747K003J546J224J593K289K428J573L8j651
51161B21009l027l354j840J160L727M160K978K188K620L007K026J49j104q90N17
51146B33326K288L344K911J544Q49J445K054J546Q16J109J513J57k397l306j336
$$ plain form
51131 245863 247312 249942 252056 253058 252662 250674 247919 245995 245541 245699 245602 245422 245546 245757 245826 246036 246443
51114 246443 246354 245295 243969 243574 244426 245698 246207 245252 243265 241965 243060 246099 248258 247124 243364 239804
51098 239804 238138 237479 236141 233839 231683 230591 230343 230138 229688 229382 229391 229025 227513 225190 223200 221863
51082 221863 220218 217670 215377 215227 217805 221987 226223 229577 231852 233478 235246 237497 239535 240357 239889
51067 239889 239034 238605 238699 238898 238496 236710 233462 230030 228206 228606 230244 231684 231987 230705 227951 224749
51051 224749 222398 221053 219708 218022 217311 218840 221793 223990 224463 224396 225475 228077 231304 234124 236093
51036 236093 237316 238145 238935 239917 241280 243199 245664 248385 251156 254169 257667 261356 264567 266996 268918
51021 268918 270637 272110 273194 273840 274011 273893 274166 275335 276590 276327 274551 273797 276472 281710 286257 288254
$$ packed form
51131B45863J449K630K114J002l96j988k755j924m54J58r7j80J24K11O9K10M07
51114B46443q9j059j326l95Q52J272N09r55j987j300J095L039K159j134l760l560
51098B39804j666o59j338k302k156j092k48k05m50l06Rl66j512k323j990j337
51082B21863j645k548k293j50K578M182M236L354K275J626J768K251K038Q22m68
51067B39889q55m29R4J99m02j786l248l432j824M00J638J440L03j282k754l202
51051B24749k351j345j345j686p11J529K953K197M73o7J079K602L227K820J969
51036B36093J223Q29P90R82J363J919K465K721K771L013L498L689L211K429J922
51021B68918J719J473J084O46J71j18K73J169J255k63j776p54K675N238M547J997
$$ plain form
51005 288254 288630 288651 287956 286006 283902 283184 283652 283926 283730 283996 284916 285540 285625 286344 288438 290786 291656 290630
50987 290630 288582 286405 284558 283430 283345 284256 285801 287454 288562 288817 288973 290396 293378 296510 298309
50972 298309 298915 299609 301255 303919 307343 310808 313024 313329 312857 313472 315585 317988 319754 321171 322642
50957 322642 323846 324631 325814 328358 332202 336462 340512 344442 348707 353606 358884 363716 367527 370954
50943 370954 375590 382560 391671 401901 412021 420741 427309 432698 439415 449237 461483 474249 486819
50930 486819 499956 514092 528491 542462 556444 571398 587664 605001 623487 643874 666997
50919 666997 692903 720556 748602 776755 806304 838844 874630 912789 953103 996809 1045303
50908 1045303 1098813 1156778 1218888 1285073 1355083 1429003 1507933 1593115 1684271 1779527 1877094
$$ packed form
51005B88254L76K1o95j950k104p18M68K74j96K66R20O24Q5P19K094K348Q70j026
50987B90630k048k177j847j128q5R11J545J653J108K55J56J423K982L132J799
50972B98309O06O94J646K664L424L465K216L05m72O15K113K403J766J417J471
50957C22642J204P85J183K544L844M260M050L930M265M899N278M832L811L427
50943C70954M636O970R111J0230J0120Q720O568N389O717R822J2246J2766J2570
50930D86819J3137J4136J4399J3971J3982J4954J6266J7337J8486K0387K3123
50919F66997K5906K7653K8046K8153K9549L2540L5786L8159M0314M3706M8494
50908A045303N3510N7965O2110O6185P0010P3920P8930Q5182R1156R5256R7567
$$ plain form
50897 1877094 1976362 2077219 2179173 2281476 2383319 2483256 2578971 2668271 2750119 2824227
50887 2824227 2890003 2946366 2992323 3027321 3051358 3065270 3070607 3068664 3059868 3044686 3024809 3002612
50875 3002612 2979593 2956090 2932404 2909199 2886477 2862941 2836915 2807552 2774931 2739340 2700671
50864 2700671 2658228 2610965 2558071 2499188 2433890 2361579 2282729 2199859 2116069 2032611 1949070
50853 1949070 1865995 1785828 1710580 1639975 1572883 1509432 1450369 1395255 1342917 1293452 1248264
50842 1248264 1207970 1171538 1137917 1107608 1081968 1061393 1044600 1029625 1015501 1003039 993842
50831 993842 988392 985477 983745 983197 984542 987560 991063 994342 997798 1002124 1007627 1014434 1022632 1032055
50817 1032055 1042551 1054653 1069397 1087223 1107440 1128922 1150944 1173236 1195790 1219040 1244000
$$ packed form
50897A877094R9268J00857J01954J02303J01843R9937R5715Q9300Q1848P4108
50887B824227O5776N6363M5957L4998K4037J3912N337j943q796j5182j9877k2197
50875C002612k3019k3503k3686k3205k2722k3536k6026k9363l2621l5591l8669
50864B700671m2443m7263n2894n8883o5298p2311p8850q2870q3790q3458q3541
50853A949070q3075q0167p5248p0605o7092o3451n9063n5114n2338m9465m5188
50842A248264m0294l6432l3621l0309k5640k0575j6793j4975j4124j2462r197
50831I93842n450k915j732n48J345L018L503L279L456M326N503O807Q198R423
50817A032055J0496J2102J4744J7826K0217K1482K2022K2292K2554K3250K4960
$$ plain form
50806 1244000 1271934 1303767 1339646 1378899 1420616 1464614 1511734 1563065 1619147 1680236 1746917
50795 1746917 1819904 1899489 1985853 2079813 2182705 2295523 2418608 2552054 2695996 2850726
50785 2850726 3017063 3196258 3388762 3593074 3806401 4026400 4251736 4481187 4712941
50776 4712941 4944490 5172242 5391119 5595477 5780658 5943265 6080408 6189961 6271670 6326823
50766 6326823 6356581 6361774 6344644 6309550 6261262 6203602 6140342 6076120 6015129 5959401 5909246
50755 5909246 5864535 5824310 5785604 5744171 5696574 5640737 5574577 5495430 5401371 5292232 5168673
50744 5168673 5030796 4878520 4713197 4538064 4356745 4171670 3984385 3797254 3614206
50735 3614206 3439464 3275713 3123659 2982906 2852935 2733727 2626243 2532215 2452783 2387180
$$ packed form
50806A244000K7934L1833L5879L9253M1717M3998M7120N1331N6082O1089O6681
50795A746917P2987P9585Q6364R3960J02892J12818J23085J33446J43942J54730
50785B850726J66337J79195J92504K04312K13327K19999K25336K29451K31754
50776D712941K31549K27752K18877K04358J85181J62607J37143J09553Q1709N5153
50766F326823K9758N193j7130l5094m8288n7660o3260o4222o0991n5728n0155
50755E909246m4711m0225l8706m1433m7597n5837o6160p9147r4059j09139j23559
50744E168673j37877j52276j65323j75133j81319j85075j87285j87131j83048
50735C614206j74742j63751j52054j40753j29971j19208j07484r4028p9432o5603
$$ plain form
50725 2387180 2333281 2289412 2255054 2229795 2212361 2201042 2194526 2191988 2192665 2195638 2199810 2204057 2207538
50712 2207538 2209664 2209455 2205358 2196497 2183846 2169267 2153459 2135751 2115764 2094053 2071015 2046605
50700 2046605 2021577 1997617 1975369 1953506 1930793 1908254 1888195 1871793 1858709 1848568 1841687
50689 1841687 1838572 1839601 1845070 1854941 1868736 1886235 1907826 1933658 1963009 1995218 2030618 2069730
50677 2069730 2112157 2157441 2206664 2262042 2325052 2395962 2475042 2563018 2660100 2765543 2878541
50666 2878541 2998899 3126510 3260663 3399905 3542037 3684234 3823772 3958642 4086869
50657 4086869 4205378 4310424 4399324 4470978 4524450 4557954 4569898 4560443 4531604 4486310 4428026
50646 4428026 4360974 4289837 4218734 4150512 4086935 4029223 3978045 3933064 3892981 3856428 3822647
$$ packed form
50725B387180n3899m3869l4358k5259j7434j1319o516k538O77K973M172M247L481
50712B207538K126k09m097q861j2651j4579j5808j7708j9987k1711k3038k4410
50700B046605k5028k3960k2248k1863k2713k2539k0059j6402j3084j0141o881
50689A841687l115J029N469R871J3795J7499K1591K5832K9351L2209L5400L9112
50677B069730M2427M5284M9223N5378O3010P0910P9080Q7976R7082J05443J12998
50666B878541J20358J27611J34153J39242J42132J42197J39538J34870J28227
50657D086869J18509J05046Q8900P1654N3472L3504J1944r455k8839m5294n8284
50646D428026o7052p1137p1103o8222o3577n7712n1178m4981m0083l6553l3781
$$ plain form
50635 3822647 3790829 3758910 3723767 3682776 3634644 3578483 3512925 3436918 3351104 3257853 3160135
50624 3160135 3060567 2961019 2862526 2765835 2672460 2584863 2505214 2434512 2373350 2322885 2284107
50613 2284107 2256621 2239127 2231111 2233255 2246174 2269321 2301159 2340070 2385309 2437492 2497842 2566391
50601 2566391 2641096 2718997 2797679 2875278 2949983 3020533 3086535 3147339 3201292 3247349 3286917
50590 3286917 3322762 3356461 3388060 3417631 3445441 3470853 3492903 3512059 3529657 3545568 3558453
50579 3558453 3568796 3579641 3593333 3609450 3627093 3647376 3671910 3700237 3730835 3763800 3800312
50568 3800312 3839574 3878298 3913774 3946059 3976441 4004642 4028353 4045226 4054716 4058063 4056755 4051297
50556 4051297 4041435 4027340 4010214 3992042 3975273 3962516 3955514 3954141 3957076 3963665 3974307 3988676
$$ packed form
50635C822647l1818l1919l5143m0991m8132n6161o5558p6007q5814r3251r7718
50624C160135r9568r9548r8493r6691r3375q7597p9649p0702o1162n0465l8778
50613B284107k7486j7494q016K144J2919K3147L1838L8911M5239N2183O0350O8549
50601B566391P4705P7901P8682P7599P4705P0550O6002O0804N3953M6057L9568
50590C286917L5845L3699L1599K9571K7810K5412K2050J9156J7598J5911J2885
50579C558453J0343J0845J3692J6117J7643K0283K4534K8327L0598L2965L6512
50568C800312L9262L8724L5476L2285L0382K8201K3711J6873R490L347j308n458
50556D051297r862j4095j7126j8172j6769j2757p002j373K935O589J0642J4369
$$ plain form
50544 3988676 4004586 4019281 4031141 4039528 4043711 4042736 4035725 4021541 3998586 3965562 3921967 3867381
50532 3867381 3801123 3723388 3635926 3540676 3438423 3329982 3218088 3106642 2998102 2892647
50522 2892647 2789787 2689737 2593316 2501567 2415534 2335500 2260679 2190617 2126637 2070531 2021918
50511 2021918 1978464 1939041 1905094 1878212 1857833 1842380 1831455 1825583 1824644 1828052 1836169 1850193
50499 1850193 1870523 1896162 1925862 1959130 1996126 2037333 2083557 2135551 2193213 2255498 2321460
50488 2321460 2391313 2466455 2548417 2637536 2732211 2829677 2928049 3027559 3129244 3232399 3334023
50477 3334023 3431091 3522835 3610460 3695318 3778210 3860199 3942980 4027785 4114169 4200348 4284814
50466 4284814 4367618 4450169 4534036 4620090 4708794 4801072 4898423 5001968 5111559 5225988 5343803
$$ packed form
50544C988676J5910J4695J1860Q387M183r75p011j4184k2955l3024m3595n4586
50532C867381o6258p7735q7462r5250j02253j08441j11894j11446j08540j05455
50522B892647j02860j00050r6421r1749q6033q0034p4821p0062o3980n6106m8613
50511B021918m3454l9423l3947k6882k0379j5453j0925n872r39L408Q117J4024
50499A850193K0330K5639K9700L3268L6996M1207M6224N1994N7662O2285O5962
50488B321460O9853P5142Q1962Q9119R4675R7466R8372R9510J01685J03155J01624
50477C334023R7068R1744Q7625Q4858Q2892Q1989Q2781Q4805Q6384Q6179Q4466
50466D284814Q2804Q2551Q3867Q6054Q8704R2278R7351J03545J09591J14429J17815
$$ plain form
50455 5343803 5463620 5583879 5702712 5818022 5927382 6028091 6117786 6194875 6257777 6303832
50445 6303832 6329758 6333475 6314948 6275155 6215119 6136341 6041309 5932774 5813186 5685589 5554526
50434 5554526 5425022 5300990 5185470 5081943 4993930 4923055 4868587 4829220 4804313 4792947
50424 4792947 4792880 4801338 4816197 4835250 4854290 4866703 4865481 4845744 4805543 4744710 4663347 4561670
50412 4561670 4441108 4304929 4157390 4002502 3843766 3684380 3526789 3372302 3221912
50403 3221912 3077391 2940799 2813153 2694466 2584933 2484941 2393909 2310460 2234230 2166429
50393 2166429 2108035 2058361 2015906 1979742 1949496 1924956 1906294 1893722 1886226 1881757 1879592 1881473
50381 1881473 1889260 1902367 1918851 1938157 1961158 1988025 2017888 2050500 2086412 2125214 2165316
$$ packed form
50455E343803J19817J20259J18833J15310J09360J00709Q9695P7089O2902M6055
50445F303832K5926L717j8527l9793o0036p8778r5032j08535j19588j27597j31063
50434E554526j29504j24032j15520j03527q8013p0875n4468l9367k4907j1366
50424D792947o7Q458J4859J9053J9040J2413j222j9737m0201o0833q1363j01677
50412D561670j20562j36179j47539j54888j58736j59386j57591j54487j50390
50403C221912j44521j36592j27646j18687j09533r9992r1032q3449p6230o7801
50393B166429n8394m9674m2455l6164l0246k4540j8662j2572p496m469k165J881
50381A881473P787J3107J6484J9306K3001K6867K9863L2612L5912L8802M0102
$$ plain form
50370 2165316 2206151 2249166 2295684 2344866 2394846 2445156 2496860 2550587 2605402 2659766 2712946
50359 2712946 2765339 2817746 2870481 2922988 2974280 3023915 3072546 3121419 3171266 3221781 3272347
50348 3272347 3323244 3375854 3431405 3489755 3549779 3610661 3672102 3733388 3793310 3851395 3908204
50337 3908204 3963591 4015327 4060220 4096111 4122133 4137735 4142517 4136537 4119496 4089854 4046034 3988536
50325 3988536 3919695 3841166 3752854 3654719 3548601 3437661 3324834 3212475 3102857 2998292
50315 2998292 2901034 2813380 2737392 2674042 2622901 2583016 2553723 2534448 2524121 2521139 2523592 2529286
50303 2529286 2535863 2541204 2543576 2541423 2533345 2518233 2494952 2462046 2418670 2366034 2307198 2244979
50291 2244979 2180574 2114465 2047832 1982432 1919609 1860014 1803871 1750910 1700471 1652311 1607070
$$ packed form
50370B165316M0835M3015M6518M9182M9980N0310N1704N3727N4815N4364N3180
50359B712946N2393N2407N2735N2507N1292M9635M8631M8873M9847N0515N0566
50348C272347N0897N2610N5551N8350O0024O0882O1441O1286N9922N8085N6809
50337C908204N5387N1736M4893L5891K6022J5602M782n980j7041k9642m3820n7498
50325C988536o8841p8529q8312r8135j06118j10940j12827j12359j09618j04565
50315B998292r7258q7654p5988o3350n1141l9885k9293j9275j0327k982K453N694
50303B529286O577N341K372k153q078j5112k3281l2906m3376n2636n8836o2219
50291B244979o4405o6109o6633o5400o2823n9595n6143n2961n0439m8160m5241
$$ plain form
50280 1607070 1565387 1526991 1491373 1458986 1430857 1406989 1386070 1367090 1350650 1338236 1330528
50269 1330528 1326795 1325784 1326752 1329598 1334260 1340329 1347414 1355720 1365969 1378727 1394111 1412208 1433369
50256 1433369 1457667 1484209 1511469 1538456 1565439 1593495 1623469 1655391 1688663 1722577 1756582
50245 1756582 1790245 1823203 1855202 1885960 1914968 1941748 1966534 1990238 2013222 2034302 2051564
50234 2051564 2064132 2072490 2077076 2077394 2073061 2065246 2056331 2048012 2039807 2029405 2014523 1994785 1971946
50221 1971946 1948060 1923421 1896617 1866649 1834494 1802279 1771286 1741126 1710667 1679287 1647240
50210 1647240 1615090 1583066 1551133 1519635 1489535 1461728 1436376 1413251 1392381 1373720 1356389
50199 1356389 1339213 1322163 1306453 1292925 1281144 1270513 1261471 1254835 1250531 1247693 1245745 1244777 1245134
$$ packed form
50280A607070m1683l8396l5618l2387k8129k3868k0919j8980j6440j2414p708
50269A330528l733j011R68K846M662O069P085Q306J0249J2758J5384J8097K1161
50256A433369K4298K6542K7260K6987K6983K8056K9974L1922L3272L3914L4005
50245A756582L3663L2958L1999L0758K9008K6780K4786K3704K2984K1080J7262
50234B051564J2568Q358M586L18m333p815q915q319q205j0402j4882j9738k2839
50221A971946k3886k4639k6804k9968l2155l2215l0993l0160l0459l1380l2047
50210A647240l2150l2024l1933l1498l0100k7807k5352k3125k0870j8661j7331
50199A356389j7176j7050j5710j3528j1781j0631r042o636m304k838j948r68L57
$$ plain form
50186 1245134 1247246 1251518 1257686 1264366 1269931 1273922 1277136 1280385 1283697 1286766 1289527 1291921 1293414 1293140
50172 1293140 1290647 1286345 1281105 1275348 1268665 1260541 1251285 1241920 1233197 1225212 1217939 1211525 1205855 1200415
50158 1200415 1194938 1189704 1185002 1180898 1177794 1176399 1176586 1177086 1177134 1177681 1180104 1184267 1189065 1194395 1201176
50143 1201176 1209392 1217468 1223969 1228807 1232365 1234523 1235261 1235345 1235503 1235391 1234226 1232158 1230178 1228647 1226537
50128 1226537 1222363 1215574 1206935 1197791 1189045 1180772 1172641 1164529 1156536 1148442 1139493 1128910 1116474
50115 1116474 1102607 1088190 1074427 1062476 1052726 1044433 1036448 1028357 1020742 1014286 1008996 1004478 1000636
50102 1000636 997605 995119 992608 990119 988440 987793 986854 983961 979087 973729 968759 963369 956488 948388
50088 948388 940212 932603 925507 918885 912807 907127 901709 896747 892304 887811 882714 877380 872719 869101
$$ packed form
50186A245134K112M272O168O680N565L991L214L249L312L069K761K394J493k74
50172A293140k493m302n240n757o683q124r256r365q723p985p273o414n670n440
50158A200415n477n234m702m104l104j395J87N00M8N47K423M163M798N330O781
50143A201176Q216Q076O501M838L558K158P38Q4J58j12j165k068j980j531k110
50128A226537m174o789q639r144q746q273q131q112p993q094q949j0583j2436
50115A116474j3867j4417j3763j1951r750q293p985q091p615o456n290m518l842
50102A000636l031k486k511k489j679o47r39k893m874n358m970n390o881q100
50088I48388q176p609p096o622o078n680n418m962m443m493n097n334m661l618
$$ plain form
50074 869101 866289 864214 862974 862180 861147 859877 859228 860046 862698 867363 874000 881918 890027 897688 904873
50059 904873 911621 918074 924866 932547 940497 947446 953200 958903 965331 972065 978720 985681 992865 998977
50045 998977 1003213 1006728 1011047 1015596 1018269 1018301 1017194 1016761 1017582 1019685 1023470 1029125 1035858 1042548 1048850
50030 1048850 1055218 1062152 1069914 1078693 1088569 1099436 1111269 1124265 1138355 1152857 1167242 1182243
50018 1182243 1199552 1219942 1241973 1262997 1281433 1297988 1314896 1334289 1357006 1382264 1408254
50007 1408254 1433536 1458152 1483080 1508549 1533510 1557111 1580037 1603636 1628105 1652311 1675228
49996 1675228 1696727 1717059 1736472 1755529 1774963 1794904 1814766 1834271 1854104 1875430 1899131
49985 1899131 1925343 1952949 1979558 2003390 2025716 2050403 2080186 2114179 2149760 2185816 2223049
$$ packed form
50074H69101k812k075j240p94j033j270o49Q18K652M665O637P918Q109P661P185
50059I04873O748O453O792P681P950O949N754N703O428O734O655O961P184O112
50045I98977M236L515M319M549K673L2j107m33Q21K103L785N655O733O690O302
50030A048850O368O934P762Q779R876J0867J1833J2996J4090J4502J4385J5001
50018A182243J7309K0390K2031K1024J8436J6555J6908J9393K2717K5258K5990
50007A408254K5282K4616K4928K5469K4961K3601K2926K3599K4469K4206K2917
49996A675228K1499K0332J9413J9057J9434J9941J9862J9505J9833K1326K3701
49985A899131K6212K7606K6609K3832K2326K4687K9783L3993L5581L6056L7233
$$ plain form
49974 2223049 2262220 2303938 2349808 2401712 2459460 2520547 2582683 2645200 2707316 2766472 2819674
49963 2819674 2865679 2904545 2935680 2957895 2971368 2978135 2980152 2978024 2972316 2965147 2959199 2955138 2950767
49950 2950767 2942703 2928301 2905959 2874483 2832934 2781066 2719784 2651321 2578833 2505183 2431766
49939 2431766 2358906 2287469 2219273 2155387 2094874 2036240 1979634 1926454 1877031 1830008 1784193
49928 1784193 1739788 1697446 1657248 1619131 1583177 1548718 1514237 1479150 1444939 1413371 1384197
49917 1384197 1355709 1327243 1300003 1275568 1254589 1236826 1221439 1207182 1193284 1180324 1169611
49906 1169611 1161618 1155611 1150656 1146145 1141429 1136032 1130468 1125943 1122899 1120655 1118744 1117658 1117761 1118357
49892 1118357 1118580 1118614 1119297 1120986 1123479 1126652 1130466 1134611 1138862 1143525 1148872 1154332 1159186 1164140 1171322
$$ packed form
49974B223049L9171M1718M5870N1904N7748O1087O2136O2517O2116N9156N3202
49963B819674M6005L8866L1135K2215J3473O767K017k128n708p169n948m061m371
49950B950767q064j4402k2342l1476m1549n1868o1282o8463p2488p3650p3417
49939B431766p2860p1437o8196o3886o0513n8634n6606n3180m9423m7023m5815
49928A784193m4405m2342m0198l8117l5954l4459l4481l5087l4211l1568k9174
49917A384197k8488k8466k7240k4435k0979j7763j5387j4257j3898j2960j0713
49906A169611p993o007m955m511m716n397n564m525l044k244j911j086J03N96
49892A118357K23L4O83J689K493L173L814M145M251M663N347N460M854M954P182
$$ plain form
49877 1171322 1182237 1196349 1212214 1229492 1248998 1270954 1294222 1317758 1342095 1368606 1397696
$$ packed form
49877A171322J0915J4112J5865J7278J9506K1956K3268K3536K4337K6511K9090
$$ [...]
##END NTUPLES=NMR SPECTRUM
##END=
