
##TITLE=AC1042_TOFR03_5906366_oWyQIBeReI
##JCAMPDX= 6.0         $$ Bruker NMR JCAMP-DX V2.0
##DATA TYPE= NMR SPECTRUM
##DATA CLASS= NTUPLES
##ORIGIN= BRUKER
##OWNER= Administrator
$$ 1.72 TOPSPIN		Version 2.1
$$ 2012-04-10 10:29:50.921 -0500  Administrator@TOPSPIN
$$ Compression mode = diff/dup
##.OBSERVE FREQUENCY= 400.13188235
##.OBSERVE NUCLEUS= ^1H
##.ACQUISITION MODE= SIMULTANEOUS (DQD)
##.ACQUISITION SCHEME= undefined
##.AVERAGES= 8
##.DIGITISER RES= 22
##SPECTROMETER/DATA SYSTEM= spect
##.PULSE SEQUENCE= zg30
##.SOLVENT NAME= COFFEE_meoh
##.SHIFT REFERENCE= INTERNAL, COFFEE_meoh, 1, 14.98061
##AUDIT TRAIL= $$ (NUMBER, WHEN, WHO, WHERE, PROCESS, VERSION, WHAT)
$$ ##TITLE= Audit trail, TOPSPIN		Version 2.1
$$ ##JCAMPDX= 5.01
$$ ##ORIGIN= Bruker BioSpin GmbH
$$ ##OWNER= Administrator
$$ $$ C:\Bruker\TOPSPIN/data/COFFEE/nmr/AC1042_TOFR03_5906366_oWyQIBeReI/10/pdata/1/auditp.txt
$$ ##AUDIT TRAIL=  $$ (NUMBER, WHEN, WHO, WHERE, PROCESS, VERSION, WHAT)
(   1,<2012-04-04 11:12:34.375 -0500>,<Administrator>,<TOPSPIN>,<go>,<TOPSPIN 2.1>,
      <created by zg
	started at 2012-04-04 11:11:27.515 -0500,
	POWCHK enabled, PULCHK disabled,
       configuration hash MD5:
       1A 1E CE 29 27 FD 77 03 67 4E F0 E3 C4 B2 CB 90
       data hash MD5: 64K
       77 B7 9F 6E F9 54 16 EE FC A2 5D 37 BB F7 7B A0>)
(   2,<2012-04-04 11:12:37.812 -0500>,<Administrator>,<TOPSPIN>,<proc1d>,<TOPSPIN 2.1>,
      <Start of raw data processing
       efp LB = 0 FT_mod = 6 PKNL = 1 PHC0 = 0 PHC1 = 0 SI = 32K 
       data hash MD5: 32K
       29 17 C8 20 6F 31 EE 45 4A 76 7D F6 0C 6D C8 34>)
(   3,<2012-04-04 11:12:38.312 -0500>,<Administrator>,<TOPSPIN>,<proc1d>,<TOPSPIN 2.1>,
      <pk PHC0 = 212.2339 PHC1 = 0 
       data hash MD5: 32K
       AB FD 65 C6 F7 35 4D F8 50 94 C3 8A 68 CC 64 29>)
(   4,<2012-04-04 11:12:38.406 -0500>,<Administrator>,<TOPSPIN>,<proc1d>,<TOPSPIN 2.1>,
      <abs ABSG = 1 
       data hash MD5: 32K
       84 12 83 00 D1 02 D1 D7 E6 83 2E 2A AB 6D 52 33>)
(   5,<2012-04-04 11:12:38.437 -0500>,<Administrator>,<TOPSPIN>,<proc1d>,<TOPSPIN 2.1>,
      <abs ABSG = 2 
       data hash MD5: 32K
       59 81 AF 32 02 88 4A 94 B7 1E FA 61 B9 FB 58 1E>)
(   6,<2012-04-04 11:12:38.468 -0500>,<Administrator>,<TOPSPIN>,<proc1d>,<TOPSPIN 2.1>,
      <abs ABSG = 3 
       data hash MD5: 32K
       6D 69 51 A9 FF 84 13 32 6F 47 6A FA B3 95 1C 09>)
(   7,<2012-04-04 11:12:38.500 -0500>,<Administrator>,<TOPSPIN>,<proc1d>,<TOPSPIN 2.1>,
      <abs ABSG = 4 
       data hash MD5: 32K
       EB 76 80 14 D9 5A 21 45 CF 04 FA 61 6F 78 08 5F>)
(   8,<2012-04-04 11:12:38.531 -0500>,<Administrator>,<TOPSPIN>,<proc1d>,<TOPSPIN 2.1>,
      <abs ABSG = 5 
       data hash MD5: 32K
       D4 AD C4 9A EC B3 D0 ED 9F 3E 68 D1 57 3D 5A E0>)
(   9,<2012-04-04 11:12:42.812 -0500>,<Administrator>,<TOPSPIN>,<audit>,<TOPSPIN 2.1>,
      <user comment:
       ICON-NMR User ID: COFFEE
       data hash MD5: 32K
       D4 AD C4 9A EC B3 D0 ED 9F 3E 68 D1 57 3D 5A E0>)
$$ ##END=
$$ 
$$ [...]
150 150 150 150 150 150 150 150
##$TP07= 0
##$TPNAME0= <>
##$TPNAME1= <>
##$TPNAME2= <>
##$TPNAME3= <>
##$TPNAME4= <>
##$TPNAME5= <>
##$TPNAME6= <>
##$TPNAME7= <>
##$TPOAL= (0..7)
0.5 0.5 0.5 0.5 0.5 0.5 0.5 0.5
##$TPOFFS= (0..7)
0 0 0 0 0 0 0 0
##$TUNHIN= 0
##$TUNHOUT= 0
##$TUNXOUT= 0
##$USERA1= <user>
##$USERA2= <user>
##$USERA3= <user>
##$USERA4= <user>
##$USERA5= <user>
##$V9= 5
##$VALIST= <valist>
##$VCLIST= <CCCCCCCCCCCCCCC>
##$VD= 0
##$VDLIST= <DDDDDDDDDDDDDDD>
##$VPLIST= <PPPPPPPPPPPPPPP>
##$VTLIST= <TTTTTTTTTTTTTTT>
##$WBST= 2048
##$WBSW= 25
##$XGAIN= (0..3)
0 0 0 0
##$XL= 0
##$YL= 0
##$YMAX_a= 526634
##$YMIN_a= -647696
##$ZGOPTNS= <>
##$ZL1= 120
##$ZL2= 120
##$ZL3= 120
##$ZL4= 120
##$ABSF1= 14.98061
##$ABSF2= -5.57192
##$ABSG= 5
##$ABSL= 3
##$ALPHA= 0
##$AQORDER= 0
##$ASSFAC= 0
##$ASSFACI= 0
##$ASSFACX= 0
##$ASSWID= 0
##$AUNMP= <proc_prof1d_extract_pilot.lims>
##$AXLEFT= 0
##$AXNAME= <>
##$AXNUC= <1H>
##$AXRIGHT= 0
##$AXTYPE= 0
##$AXUNIT= <>
##$AZFE= 0.1
##$AZFW= 0.1
##$BCFW= 0
##$BC_mod= 0
##$BYTORDP= 0
##$COROFFS= 0
##$CY= 15
##$DATMOD= 1
##$DC= 0
##$DFILT= <>
##$DTYPP= 0
##$F1P= 0
##$F2P= 0
##$FCOR= 0.5
##$FTSIZE= 32768
##$FT_mod= 6
##$GAMMA= 0
##$GB= 0
##$INTBC= 1
##$INTSCL= 1
##$ISEN= 128
##$LB= 0
##$LEV0= 0
##$LPBIN= 0
##$MAXI= 10000
##$MC2= 0
##$MEAN= 0
##$ME_mod= 0
##$MI= 0
##$NCOEF= 0
##$NC_proc= -8
##$NLEV= 6
##$NOISF1= 0
##$NOISF2= 0
##$NSP= 0
##$NTH_PI= 0
##$NZP= 0
##$OFFSET= 14.98061
##$PC= 1
##$PHC0= 212.2339
##$PHC1= 0
##$PH_mod= 1
##$PKNL= yes
##$PPARMOD= 0
##$PPDIAG= 0
##$PPIPTYP= 0
##$PPMPNUM= 2147483647
##$PPRESOL= 1
##$PSCAL= 4
##$PSIGN= 0
##$PYNMP= <proc.py>
##$REVERSE= no
##$SF= 400.13
##$SI= 32768
##$SIGF1= 0
##$SIGF2= 0
##$SINO= 400
##$SIOLD= 32768
##$SPECTYP= <>
##$SREGLST= <1H.CDCl3>
##$SSB= 0
##$STSI= 32768
##$STSR= 0
##$SW_p= 8223.68421052632
##$SYMM= 0
##$S_DEV= 0
##$TDeff= 65536
##$TDoff= 0
##$TI= <>
##$TILT= no
##$TM1= 0
##$TM2= 0
##$TOPLEV= 0
##$USERP1= <user>
##$USERP2= <user>
##$USERP3= <user>
##$USERP4= <user>
##$USERP5= <user>
##$WDW= 1
##$XDIM= 32768
##$YMAX_p= 469929647
##$YMIN_p= -660866
##$CURPLOT= <Network HP LaserJet P1505>
##$CURPRIN= <$Network HP LaserJet P1505>
##$DFORMAT= <normdp>
##$LAYOUT= <+/1D_H.xwp>
##$LFORMAT= <normlp>
##$PFORMAT= <normpl>
##$SURQMSG= 1
$$ End of Bruker specific parameters
$$ ---------------------------------
##NTUPLES= NMR SPECTRUM
##VAR_NAME=  FREQUENCY,     SPECTRUM/REAL,   SPECTRUM/IMAG
##SYMBOL=    X,             R,               I
##VAR_TYPE=  INDEPENDENT,   DEPENDENT,       DEPENDENT
##VAR_FORM=  AFFN,          ASDF,            ASDF
##VAR_DIM=   32768,         32768,           32768
##UNITS=     HZ,            ARBITRARY UNITS, ARBITRARY UNITS
##FACTOR=    0.250966925370066, 1,           1
##FIRST=     8223.43324360095, 59492,        -141071
##LAST=      0,             83450,           -283926
##MIN=       0,             -660866,         0
##MAX=       8223.43324360095, 469929647,    0
$$ Real data points
##PAGE= N=1
##DATA TABLE= (X++(R..R)), XYDATA
$$ [...]
$$ plain form
19457 57947 -67932 -27887 -448193 -218942 70735 112017 -221902 -109462 -241421 -147107 -15948
19445 61827 -142740 -324235 -4255 -200030 -275080 -222460 26671 -121138 310483 37356 -49405
19433 -12034 37986 -92550 151096 -91013 -69973 74055 -258078 290396 -337324 -49380 -87535
19422 -87535 20614 130786 -237780 -86269 107228 71550 32333 -151300 -154495 -51765 -60133
19411 -60133 14095 -72520 12084 81816 -63694 -212898 -237705 50141 169192 58354 -19270
19399 -267933 -23362 108099 -22459 -161117 -103645 76602 -290288 79171 106289 -138147 321986
19387 -229829 -87189 104800 -1916 215853 -139735 -15365 -203190 39908 124547 -236138 -294475
19376 -294475 -142324 19574 -378197 -238321 -17215 -91729 -67201 -51966 -19968 175294 -250798
$$ packed form
19457E7947f7932b7887m20306b18942G0735M1282b21902a09462j31959R4314a5948
19445F1827a42740j81495d255j95775p5050N2620B6671a21138C10483C7356d9405
19433a2034C7986i2550A51096i1013K1040G4055b58078B90396c37324d9380l8155
19422h7535B0614J10172b37780h6269A07228l5678C2333a51300l195e1765q368
19411f0133A4095g2520A2084O9732f3694j49204k4807E0141J19051E8354a9270
19399b67933b3362A08099b2459j38658N7472G6602b90288G9171K7118a38147C21986
19387b29829h7189A04800a916B15853a39735a5365j87825C9908Q4639b36138n8337
19376b94475a42324A9574c78197J39876a7215p4514K4528J5235a9968A75294b50798
$$ plain form
19364 124720 -291543 152387 -275247 -200916 -316941 -376688 -21427 260979 271257 180554
19354 180554 29033 32642 -30797 -199521 -106345 -166446 -252636 -193919 -258497 -118363 -83602
19343 -83602 129764 -133542 2670 -3124 -5604 336331 -525269 -75249 -471321 1433 -133469
19331 158142 -9806 -157810 7003 -76230 172580 -206614 -303674 228711 -201295 -147723 -296315
19320 -296315 -202210 -13742 -87508 -149116 40607 -69512 -438858 -246948 -273285 -195591 9813
19308 -224964 -215869 6105 -157571 423326 -77558 398036 -97507 -90937 -93152 -158129 -12902 -242428
19296 -242428 155274 14975 -240117 122407 162301 -42110 14851 -464592 8672 -177584 -27559
19284 -291657 -258299 -433850 -37975 -103982 63726 193047 -24559 343555 222064 -133839
$$ packed form
19364A24720b91543A52387b75247P4331j16025n9747b1427B60979J0278r0703
19354A80554B9033L609c0797j68724R3176o0101q6190N8717o4578a18363L4761
19343h3602A29764a33542B670c124k480C36331e25269g5249l96072A433a33469
19331A58142i806j48004G003g6230A72580b06614r7060B28711b01295N3572j48592
19320b96315R4105a3742p3766o1608D0607f9512l69346J91910k6337P7694I813
19308b24964R095F105a57571D23326g7558C98036i7507O570k215o4977a2902k29526
19296b42428A55274A4975b40117A22407L9894d2110A4851d64592H672a77584b7559
19284b91657L3358j75551c7975o6007F3726J29321b4559C43555j21491a33839
$$ plain form
19273 -133036 201973 -117041 -213750 61895 -240307 24420 105506 -169427 -204786 -45386 -91208
19262 -91208 89733 -21044 82083 -141955 172172 -282272 -190018 -174415 202014 -334192 57531
19250 -6264 -311088 162638 -86219 -104382 115707 40261 63396 -34773 -48646 -290932 -155716
19239 -155716 -376918 3536 87607 -31387 22300 -406712 128708 200346 -232759 115494 69021
19228 69021 -149976 143002 -225002 267632 13867 -398353 -6421 -314167 240582 251756
19218 251756 212731 79321 -149060 -230072 -60754 -197992 -72268 26567 -26781 -17961 76933
19206 -54017 -220749 -130604 21640 -285774 117845 129453 119676 -92832 236994 -116985 155380
19194 -242428 -238895 286397 -273662 -25889 17339 -127822 -138030 -274742 -287549 -55266 -308098
$$ packed form
19273a33036B01973a17041r6709F1895b40307B4420Q1086a69427l5359d5386m5822
19262i1208H9733b1044H2083a41955A72172b82272R2254J5603B02014c34192E7531
19250f264l04824A62638h6219j8163A15707D0261K3135c4773j3873k42286J35216
19239a55716k21202C536Q4071c1387B2300d06712A28708P1638b32759A15494m6473
19228F9021a49976A43002b25002B67632A3867c98353f421l07746B40582J1174
19218B51756l9025G9321a49060q1012f0754j37238g2268B6567b6781Q820G6933
19206e4017j66732R0145B1640b85774A17845J1608r777i2832B36994a16985A55380
19194b42428L533B86397b73662b5889A7339a27822j0208j36712j2807e5266k52832
$$ plain form
19183 -308098 -183057 69527 4298 -80938 -120426 -121464 125417 -226969 383686 -148775 -99267
19172 -99267 99512 -360074 60628 -94691 -114258 -156497 24392 138609 -155023 -80285 -111891
19161 -111891 -290737 325660 -52818 -85538 -241284 -241533 95342 -130701 -162620 -144318 -248197
19150 -248197 -146235 -132962 -222065 -353685 -219177 -173065 140417 -40913 58916 -47356 -405106
19139 -405106 21303 -5708 60365 -58043 -280762 -202265 -161446 -16917 -240062 -138647 40337
19127 116791 79733 -172560 -468168 -3044 193794 -42035 -272270 -282963 -114954 44739 -279615
19115 77419 -137222 -72095 -36526 93446 -117084 238815 -186861 -106997 -107072 -415344 277461
19103 -107310 -224008 -111293 -60992 -376624 -180951 10468 -136348 -225947 36422 -48995
$$ packed form
19183c08098J25041F9527D298h0938l9488j038A25417b26969C83686a48775M9508
19172i9267I9512c60074F0628i4691j9567m2239B4392J14217a55023P4738l1606
19161a11891j78846C25660e2818l2720j55746k49I5342a30701l1919J8302j03879
19150b48197J01962J3273q9103j31620J34508M6112A40417d0913E8916d7356l57750
19139d05106B1303e708F0365e8043k22719P8497M0819a6917k23145J01415D0337
19127A16791l7058a72560k95608c044A93794d2035k30235j0693a14954D4739b79615
19115G7419a37222O5127L5569I3446a17084B38815a86861P9864p5l08272B77461
19103a07310j16698a11293N0301l15632a80951A0468a36348q9599C6422d8995
$$ plain form
19092 3052 -231841 -308327 38409 -126242 -66703 -70414 -55817 -18626 -203445 -306528 9670
19080 136901 -250965 -183931 36562 179098 104303 -320844 -59570 -69359 -33069 62286 150516
19069 150516 -285299 -3825 37335 -262764 -62932 -293462 -182897 -160230 178572 32791 -59825
19057 262797 399893 -3316 61875 -68389 63940 -130510 46040 -257638 271378 45308 216065
19046 216065 -36511 -218808 -49408 60524 -301065 27687 24129 40085 -366851 -288621 -101259
19034 161924 -16402 -69545 -77026 -115331 78037 122948 87845 -198672 -52416 -22426 251670
19022 395847 -41175 281354 -522058 19043 92175 -382461 -121248 -57707 -4667 -52761 4315
19010 -136187 -178084 -95376 176720 190208 172119 151246 -69350 -75860 -77649 -173602 -37594 -236130
$$ packed form
19092C052b31841p6486C8409a26242N9539l711J4597a8626j84819j03083I670
19080A36901b50965O7034C6562J42536p4795c20844e9570r789c3069F2286Q8230
19069A50516b85299c825C7335b62764f2932k30530J10565K2667A78572C2791e9825
19057B62797J37096c316F1875f8389F3940a30510D6040b57638B71378D5308J70757
19046B16065c6511j82297d9408F0524c01065B7687l558J5956c66851P8230a01259
19034A61924a6402n3143p481l8305G8037M4911l5103a98672e2416b2426B51670
19022C95847d1175B81354e22058A9043P3132c82461a21248e7707d667m8094D315
19010a36187m1897Q2708A76720J3488j8089k0873f9350o510j789r5953c7594j98536
$$ plain form
18998 -236130 -7892 165631 70869 159972 -76727 -129573 -248000 127528 -130105 -111521 -137582
18987 -137582 -37602 -31278 242000 308737 -90589 139190 -198958 142169 148779 3609 -167303
18975 -57376 -63257 -88545 6994 -286053 -228386 -132426 -131396 186830 92762 118515 274214 115417
18962 -53044 34565 4533 72173 360425 782184 356818 96064 -317490 -171632 161051 352131
18951 352131 107916 -94942 125772 -304605 -281613 -8092 -120144 -182571 -212113 -285238 51016
18939 145573 -146054 -42031 85288 -21852 -125225 22344 128548 -121680 -108168 203146
18928 96950 -182417 -58546 -209693 111616 32815 -116069 109126 -195734 97361 -14643
18917 21931 54313 111410 -233998 -134726 29214 161265 245458 7601 -27064 -219666 -88363
$$ packed form
18998b36130g892A65631G0869Q9103g6727n2846j18427A27528a30105J8584k6061
18987a37582c7602O324B42000O6737i0589A39190a98958A42169O610C609a67303
18975e7376n881k5288F994b86053N7667R5960J030A86830I2762K5753J55699A15417
18962e3044C4565D533O7640K88252M21759C56818I6064c17490J45858A61051J91080
18951C52131A07916i4942A25772c04605K2992h092j12052o2427k9542p3125E1016
18939A45573a46054d2031H5288b1852j03373B2344J06204a21680J3512B03146
18928I6950a82417e8546j51147A11616C2815a16069A09126a95734I7361a4643
18917B1931L2382N7097b33998R9272B9214J32051Q4193G601b7064j92602h8363
$$ plain form
18905 -44713 -125405 -75924 -319575 114429 -87456 -12254 -253810 96141 46777 189303 250455
18894 250455 62351 157811 202317 134884 153987 -338585 82594 14696 9941 39759 116615
18883 116615 -33193 -70941 -112040 212489 -248208 180200 304067 -61591 325015 -98089
18872 218114 -370956 -188624 209940 5389 -8301 -159264 -145068 -186169 8577 -14302 -319390
18861 -319390 -429625 -51821 -71052 204646 -326266 4667 239345 114854 -138858 224873
18850 58859 18661 -41855 21299 -11759 -290610 -338037 43432 -1382 425132 -9695 17675 150087
18838 150087 -152198 -82047 -119955 148543 11010 -33219 204824 195302 -94351 38215 -134127
18826 43242 190670 -28139 197975 -221242 -95544 91491 -95132 153429 -257884 107707
$$ packed form
18905d4713q0692M9481k43651A14429h7456a2254k41556I6141D6777J42526O1152
18894B50455F2351R5460M4506o7433J9103c38585H2594A4696m755K9818P6856
18883A16615c3193l7748m1099B12489b48208A80200J23867f1591C25015i8089
18872B18114c70956J82332B09940E389h301j50963J4196m1101H577a4302l05088
18861c19390j10235e1821j9231B04646c26266D667K34678A14854a38858B24873
18850E8859A8661d1855B1299a1759k78851m7427D3432a382D25132i695A7675J32412
18838A50087a52198P0151l7908A48543A1010c3219B04824r522i4351C8215a34127
18826D3242J47428b8139A97975b21242i5544I1491i5132A53429b57884A07707
$$ plain form
18815 -185857 -225511 -48407 -34620 -8110 11843 83871 51688 -97162 -220523 43719 -283425
18803 85759 256850 -361538 275203 166905 70802 251965 126320 275678 -87297 407263
18792 324512 -106197 246840 100232 93795 -31528 -108400 -505193 -22083 126438 15331 -95986
18780 2236 -74449 27764 8219 -226469 -45463 -127266 -259161 -34052 82793 -191813 162899
18768 -528122 -419242 -67310 -74899 -414913 -11063 207707 -65216 -62128 37145 -324368 -132137
18756 -451727 -16313 43710 39347 205327 -132864 -144328 -309212 -410911 213309 -106903
18745 -211796 -53963 -52827 -66715 33260 67428 -240635 55607 -70150 -343321 -117618 -102020
18734 -102020 -57433 -82863 26734 -284520 -236003 -240476 -252762 -484516 -264365 -380681 204572
$$ packed form
18815a85857l9654d8407J3787h110A1843P2028l2183i7162j23361D3719b83425
18803H5759J71091c61538B75203j08298G0802J81163j25645J49358h7297D07263
18792C24512a06197B46840A00232o437c1528p6872l96793b2083A26438A5331i5986
18780B236g4449B7764H219b26469d5463q1803j31895c4052H2793a91813A62899
18768e28122J08880f7310p589l40014a1063B07707f5216L088C7145c24368a32137
18756d51727a6313D3710m363J65980a32864j1464j64884j01699B13309a06903
18745b11796e3963J136j3888C3260L4168b40635E5607g0150k73171a17618J5598
18734a02020M4587k5430B6734b84520M8517m473j2286k31754K20151j16316B04572
$$ plain form
18722 119836 -125503 -255887 -253193 108583 51516 -148949 -115967 -33322 -16436 -165787 -331936
18711 -331936 -95776 -278587 664 -140571 -39763 91791 -225656 135414 -129316 19590 52545
18700 52545 164422 17428 -7947 -70173 -251742 -42673 -3039 191215 -42238 -227724 -4974
18688 -31176 -362019 -239991 -105703 -45536 -282666 -221901 135943 -55937 -66072 44281 -325969
18676 48452 123326 152049 84917 -250247 -92988 -237225 151999 131852 -145104 -44369 166233
18664 -47383 206633 -119173 -158922 147266 -162285 -414893 49155 42302 -98665 71728 -118100
18652 -127421 -244354 -362883 -162136 -230351 -77358 -165804 45237 76445 -219713 140609
18641 75110 -136296 120122 185161 347027 -182098 -129445 261022 -292689 -97571 -189937
$$ packed form
18722A19836a25503j30384K694A08583E1516a48949L2982c3322a6436j49351j66149
18711c31936i5776j82811F64a40571c9763I1791b25656A35414a29316A9590L2955
18700E2545J11877A7428g947o2226j81569d2673c039A91215d2238j85486d974
18688c1176l30843J22028a05703d5536k37130O0765A35943e5937j0135D4281c25969
18676D8452P4874K8723o7132b50247i2988j44237A51999k0147a45104d4369A66233
18664d7383B06633a19173l9749A47266a62285k52608D9155o853i8665G1728a18100
18652a27421j16933j18529a62136o8215g7358q8446D5237L1208b19713A40609
18641G5110a36296A20122O5039J61866a82098N2653B61022b92689i7571r2366
$$ plain form
18631 -189937 -172428 -264842 -68200 -47007 -120253 -278326 249982 -70241 85058 21102 -321332
18619 -35525 -97088 -180258 -348544 -52963 158181 -214811 123703 58034 167033 -168672
18608 -21168 -221804 264678 49642 -33197 176982 131169 -11431 -6030 279718 -412559 -131590
18596 -76338 143378 -143507 413506 -365966 -179600 39100 53899 -250250 -53424 -304561
18586 -304561 337415 -236623 -237290 -76849 270268 -223472 -82490 205901 114681 -136946 -110488
18575 -110488 -12349 -15904 34136 -175515 -30384 254808 96242 -252235 -188378 35035 -310978
18563 -122117 130169 -312143 -200163 -161213 80971 110407 -89102 -157115 -9832 44258 156992
18552 156992 -87718 -326421 -40106 -374777 -261010 -55398 245466 -170826 57075 -111553
$$ packed form
18631a89937J7509r2414f8200K1193p3246j58073B49982g0241H5058B1102c21332
18619c5525o1563q3170j68286e2963A58181b14811A23703E8034J08999a68672
18608b1168k00636B64678D9642c3197A76982m5813a1431N401B79718d12559a31590
18596g6338A43378a43507D13506c65966a79600C9100J4799b50250e3424k51137
18586c04561C37415b36623o67g6849B70268b23472h2490B05901r1220a36946K6458
18575a10488a2349l555C4136a75515c0384B54808I6242b52235O3857C5035c10978
18563a22117A30169c12143J11980L8950H0971K9436h9102o8013i832D4258J12734
18552A56992h7718k38703d0106l34671J13767e5398B45466a70826E7075a11553
$$ plain form
18541 102525 -133609 163522 33960 371535 8868 -24229 -220032 -148060 -99702 -214495 25844
18529 -11265 -5352 -118146 71039 90806 -74203 11413 -85205 -22508 -162816 336100 105289
18517 -25222 202932 28878 112903 -232517 -116691 -66274 -356203 -257456 225913 178583 3419
18505 -17232 70669 109624 -141407 139593 -167649 -36017 202860 218938 367732 42736 82090
18494 82090 -42013 -175592 -153240 92619 -86285 220247 3422 139451 47110 108820 -147327
18482 212547 -37267 -192626 -194279 -207418 75101 -85699 243835 -48931 70507 -246215 317693
18470 -431636 -68349 13282 -65408 -187063 11850 -100327 165113 -8465 110001 102800 174051
18459 174051 98985 61567 -35339 283384 -134139 42843 63407 126604 -13182 -108828 241332
$$ packed form
18541A02525a33609A63522C3960L37575H868b4229j95803P1972M8358j14793B5844
18529a1265e352j12794G1039J9767g4203A1413h5205b2508j40308C36100A05289
18517b5222B02932B8878Q4025b32517J15826N0417k89929R8747B25913m7330C419
18505a7232G0669L8955a41407A39593a67649c6017B02860J6078J48794D2736L9354
18494H2090d2013j33579K2352I2619h6285B20247C422J36029D7110O1710a47327
18482B12547c7267j55359j653j3139G5101h5699B43835d8931G0507b46215C17693
18470d31636f8349A3282f5408j21655A1850a00327A65113h465A10001p201P1251
18459A74051p5066l7418c5339B83384a34139D2843K0564O3197a3182r5646B41332
$$ plain form
18447 52842 -1822 -339966 152644 -212035 -79394 -78317 1587 -90441 139254 190494 -298498
18435 -29899 536767 -168347 -224383 -195687 71410 188865 -169295 -129120 -223500 27081 -143764
18423 -155868 -113654 -75382 153535 -271768 303470 219754 -115489 -209773 133317 -155001
18412 -214 -208721 -170677 -222145 -98405 41549 -194928 346739 67010 -97186 -78969 -27503
18400 -153766 492718 132124 -277303 -218548 9581 -69532 -194360 -158665 -26997 5435 -151307
18388 -231381 183457 -43527 -62639 -13072 -96769 -46390 -70281 -44137 74255 -162310 83880
18376 95874 -144694 -230435 353103 -421324 -23043 -248349 28196 30509 -184696 -144100 -401615
18365 -401615 285211 -145694 203185 -355498 248116 -154475 44686 -151030 -449642 -14014
$$ packed form
18447E2842a822l38144A52644b12035g9394J077A587i0441A39254N1240b98498
18435b9899E36767a68347n6036K8696G1410J17455a69295M0175r4380B7081a43764
18423a55868M2214L8272A53535b71768C03470q3716a15489r4284A33317a55001
18412b14k08507L8044n1468i8405D1549a94928C46739F7010i7186J8217b7503
18400a53766D92718A32124b77303N8755I581f9532j24828L5695b6997E435a51307
18388b31381A83457d3527j9112a3072q3697d6390k3891K6144G4255a62310H3880
18376I5874a44694q5741C53103d21324b3043k25306B8196K313a84696M0596k57515
18365d01615B85211a45694B03185c55498B48116a54475D4686a51030k98612a4014
$$ plain form
18354 258137 -266884 -50046 -174347 -64532 -33608 309750 312052 186262 263067 168285 -211142
18342 -195141 145893 -30985 256280 -89348 402599 255285 68420 -264748 -239704 130872
18331 -75763 190080 -166895 -179055 223840 -60712 195459 -51365 -429390 291896 -95452
18320 -3103 -71714 -240989 94023 -162093 156381 106582 93206 -79727 61569 52682 -2013 -200378
18308 -200378 143794 -141943 -260119 -369035 85363 178317 -170570 181107 162063 -362618
18297 51704 88748 66845 -237150 -48625 -166480 -197006 366440 -278259 -228745 -86314 -164931
18286 -164931 -205422 -355568 234413 117221 -68366 65789 -88274 -102345 -68528 123239 -3731
18274 -127189 -31410 -402266 -551145 -73688 -69661 117112 -142810 186595 348573 -270726
$$ packed form
18354B58137b66884e0046j24301f4532L0924C09750K302j25790P6805r4782b11142
18342a95141A45893c0985B56280h9348D02599j47314F8420b64748K5044A30872
18331g5763A90080a66895j2160B23840f0712A95459e1365l78025B91896i5452
18320c103o8611j69275I4023a62093A56381m9799j3376g9727F1569q887b013j98365
18308b00378A43794a41943j18176j08916H5363R2954a70570A81107j9044c62618
18297E1704L7044k1903b37150d8625j17855l0526C66440b78259M9514h6314p8617
18286a64931m0491j50146B34413j17192f8366F5789h8274j4071L3817A23239c731
18274a27189c1410l70856j48879g3688M027A17112a42810A86595J61978b70726
$$ plain form
18263 -109040 27643 220118 -474075 126848 -57213 42084 202055 107689 -149545 86478
18252 181684 -105470 -112803 -382632 -41069 -248556 434044 167371 61306 -35481 126844
18241 9626 182856 -198233 -142190 -281652 216378 -156316 203149 120731 81119 -328916
18230 -209430 -275865 -61699 -70523 -79748 113257 -245872 -181986 -16109 35389 -113368 192229
18218 -150661 1376 -24791 -227593 -118889 406332 69711 -78554 -57869 -87292 178551 -406672
18206 -49586 56828 -181652 118857 -40313 -142748 114913 11652 -125879 -208601 5249 -37913
18194 -3779 -168219 -140207 182993 193605 -136265 -174369 216164 -173147 94410 138721 102313
18183 102313 -343064 46317 -55135 183260 -206300 -24633 141605 -162823 -71691 155288
$$ packed form
18263a09040B7643J92475d74075A26848e7213D2084J59971r4366a49545H6478
18252A81684a05470p333k69829d1069k07487D34044A67371F1306c5481A26844
18241I626J73230a98233N6043j39462B16378a56316B03149q2418l9612c28916
18230b09430o6435f1699q824r225A13257b45872O3886a6109C5389a13368A92229
18218a50661A376b4791k02802J08704D06332F9711g8554K0685k9423A78551d06672
18206d9586E6828a81652A18857d0313j02435A14913A1652a25879q2722E249c7913
18194c779j64440K8012A82993J0612a36265l8104B16164a73147I4410M4311l6408
18183A02313c43064D6317e5135A83260b06300b4633A41605a62823g1691A55288
$$ plain form
18172 206451 -56686 32253 365435 -107296 -233759 -63556 -231619 -200927 -2041 18609 -219553
18160 -57081 114300 19225 29658 77267 -221164 -93912 -5868 199811 214938 55434 92051
18149 92051 249320 -115089 -201502 -8624 278040 -7519 -30340 192674 -21791 -118063 323767
18137 10962 62799 -257116 -500232 -1070 -21078 236057 -174618 -83037 81994 7090 -86616
18125 -204446 17506 167553 -198704 16011 79326 -62913 -17143 -108977 -179370 -148496 123220
18113 -189019 -1613 104093 -129569 -79348 23852 -25416 272334 -172479 226996 91135 186416
18102 186416 18969 309737 -211359 362239 -132280 -34708 87904 -111234 -118087 -239337
18092 -239337 282690 123585 -307118 283418 38253 25 14305 -19075 186508 -120199 18626
$$ packed form
18172B06451e6686C2253L33182a07296j26463f3556j68063L0692b041A8609b19553
18160e7081A14300A9225J0433M7609b21164i3912e868A99811J5127E5434L6617
18149I2051J57269a15089q6413h624B78040g519k2821A92674b1791r6272C23767
18137A0962N1837b57116k43116a070k0008B36057a74618h3037H1994G090h6616
18125b04446A7506J50047a98704A6011O3315f2913a7143r1834p0393L0874A23220
18113a89019a613A04093a29569N0221B3852b5416B72334a72479B26996I1135R5281
18102A86416A8969K90768b11359C62239a32280c4708H7904a11234o853j21250
18092b39337B82690A23585c07118B83418C8253B5J4280a9075A86508a20199A8626
$$ plain form
18080 108924 126601 -67867 -59298 239641 23248 121621 101050 -104099 -30738 -20527 132009
18068 -131126 -11896 55260 369634 104555 -121130 -124268 -161235 147804 57061 -46148 -232262
18057 -232262 45187 227749 197917 133062 -205379 47287 47180 11059 55644 -193222 39908
18045 106664 63713 174070 193874 210807 -183817 238223 -277302 -25184 -6265 -291429 121515
18033 -386489 -271465 250566 114423 -131823 -160713 -204841 150957 73896 15425 -197976
18022 -289394 -172731 -116466 91393 259600 -229111 224470 236726 44090 318359 -7509 -2887
18010 -28944 263482 -12413 -84328 -150270 201958 -67724 -26815 203677 -168735 -58559 -111828
17999 -111828 -116868 98348 -93682 -154940 -98960 68420 -187932 145084 22581 204428 -121560
$$ packed form
18080A08924J7677f7867Q569B39641B3248R8373k0571a04099c0738J0211A32009
18068a31126a1896E5260L14374A04555a21130l138l6967A47804E7061d6148j86114
18057b32262D5187J82562k9832o4855b05379D7287j07A1059M4585a93222C9908
18045A06664m2951J10357J9804J6933a83817B38223b77302b5184f265k85164A21515
18033c86489J15024B50566A14423a31823k8890m4128A50957G3896A5425a97976
18022b89394J16663N6265I1393J68207b29111B24470J2256D4090K74269g509b887
18010b8944B63482a2413p1915o5942B01958f7724b6815B03677a68735e8559n3269
17999a11828n040I8348i3682o1258N5980F8420a87932A45084B2581J81847a21560
$$ plain form
17987 57174 -94597 -25684 -274092 64609 41529 -292420 83962 -1038 6487 77332 322342
17976 322342 340858 -52061 127003 262904 -120219 -130798 329511 31934 -212243 37502
17965 -37939 302529 -38206 214651 2336 10129 175345 200433 116787 37929 -68993 -25373
17953 -59905 155347 45028 -69409 62946 288765 206809 -171421 -107643 -84437 -101220 -154433
17942 -154433 298734 -145551 -138137 -55262 181124 -66742 213667 -21850 -72219 22705 -63604
17930 -21874 -241731 -19567 146262 229070 -179495 65812 -73766 206748 218583 391482 311956
17919 311956 -80456 109338 364050 -213497 193793 -150088 281869 -63295 230510 -292037
17908 355462 256812 -111145 156243 -10355 85804 -28215 427271 103036 49635 7895 -247002
$$ packed form
17987E7174i4597b5684k48408F4609k3080b92420H3962a038F487P0845K45010
17976C22342J8516e2061A27003J35901a20219j0579C29511C1934b12243C7502
17965c7939C02529c8206B14651B336P793J65216K5088q3646C7929f8993b5373
17953e9905A55347D5028f9409F2946K25819q1956a71421O3778K3206j6783n3213
17942a54433B98734a45551P414e5262A81124f6742B13667b1850n0369B2705f3604
17930b1874k19857a9567A46262Q2808a79495F5812g3766B06748J1835J72899p9526
17919C11956h0456A09338K54712b13497A93793a50088B81869f3295B30510b92037
17908C55462r8650a11145A56243a0355H5804b8215D27271A03036D9635G895b47002
$$ plain form
17896 305228 160230 175883 83082 -66636 187612 -217640 -34707 -17717 7571 128402 214628
17885 214628 -327079 -122423 357851 78806 168498 -49307 344863 -97016 15833 -190463
17874 -236324 189543 -244373 254840 259429 -185452 -62203 105923 -51062 -23019 -67450 141710
17862 -148976 220069 295486 203808 -87355 99564 242364 249094 216633 -27665 -73656 -14591
17850 -150217 -172780 -71015 172530 -109413 179032 15797 35883 -124484 22298 105684 -228194
17838 -184456 -231607 45598 -12435 35837 96788 -336495 259113 19446 -72880 -11902 -186914
17827 -186914 -202635 325350 49351 165059 51203 -123241 -338169 -380297 -253600 -258315 245014
17815 257609 122892 -300556 31858 -58528 31392 27207 203674 14316 -374668 -146760 84832
$$ packed form
17896C05228j44998J5653H3082f6636A87612b17640c4707J6990G571J20831Q6226
17885B14628c27079a22423C57851G8806Q9692d9307C44863i7016A5833a90463
17874b36324A89543b44373B54840M589a85452f2203A05923e1062b3019m4431A41710
17862a48976B20069P5417r1678h7355I9564J42800O730l2461b7665m5991a4591
17850a50217k2563g1015A72530a09413A79032A5797K0086a24484B2298Q3386b28194
17838a84456m7151D5598a2435C5837O0951c36495B59113A9446g2880a1902j75012
17827a86914j5721C25350D9351J15708E1203a23241k14928m2128J26697m715B45014
17815B57609A22892c00556C1858e8528C1392m185J76467A4316c74668a46760H4832
$$ plain form
17803 280465 52768 -27500 185792 8209 129028 -160076 9590 -86773 185345 4355 -154151
17791 1242 -86309 129834 134007 -160202 89406 280205 128639 40128 -151744 172033 -5909
17779 103271 254016 159798 -77661 176181 70924 -15554 23182 307921 141691 9923 90043
17768 90043 -134471 191496 164921 -12093 -51375 70017 -107166 78891 117260 432234 -132814
17756 -75674 56890 87003 43267 115672 121401 -120586 -190058 65568 -199186 83101 211155
17745 211155 -7404 153354 -72515 44002 257583 -160765 51761 -89162 129679 107878 267815
17734 267815 98261 58862 108077 188502 83559 221883 110054 343958 -185558 66132 -34404
17722 38618 541386 210681 90094 36755 131740 175356 431273 108802 -109949 -439541
$$ packed form
17803B80465E2768b7500A85792H209J20819a60076I590h6773A85345D355a54151
17791A242h6309A29834M173a60202H9406J90799A28639D0128a51744A72033e909
17779A03271J50745r4218g7661A76181G0924a5554B3182K84739A41691I923Q0120
17768I0043a34471A91496k6575a2093l9282G0017a07166G8891L8369L14974a32814
17756g5674E6890L0113D3267P2405N729a20586o9472F5568a99186H3101J28054
17745B11155g404A53354g2515D4002K13581a60765E1761h9162A29679k1801J59937
17734B67815I8261l9399M9215Q0425H3559J38324A10054K33904a85558F6132c4404
17722C8618N02768B10681I0094C6755R4985M3616K55917A08802a09949l29592
$$ plain form
17712 -439541 -216128 259294 -194848 -17873 -283279 -599 211844 45521 290456 280076 3514
17700 197417 204519 174755 230111 231704 -103720 56584 182101 278737 213249 31761 -5408 -37950
17688 -37950 -294890 34116 195511 117912 510354 -48628 60563 -150897 -174107 -45834 -154382
17677 -154382 -53138 352178 325119 214931 144324 188095 79800 71747 9953 -79532 159861
17665 120992 103272 137936 102443 144090 194241 -187015 -303674 126830 -58876 134359 -247458
17653 52402 189466 62603 -21733 31199 -171669 57768 -226522 -253564 10290 -143865 -346725
17642 -346725 121265 -57833 -32866 -190874 46665 44608 -130674 197334 25608 205003 201138
17631 201138 35014 -36966 432052 -22392 -66732 -295686 206087 27743 161661 -96110 223916
$$ packed form
17712d39541b16128B59294a94848a7873k65406e99B11844D5521K44935j0380C514
17700A97417P102k9764N5356J593a03720E6584J25517R6636o5488C1761e408l2542
17688c7950k56940C4116J61395p7599L92442d8628F0563a50897k3210d5834j08548
17677a54382e3138C52178k7059j10188p0607M3771G9800q053I953g9532A59861
17665A20992j7720L4664l5493M1647N0151a87015j16659A26830e8876A34359b47458
17653E2402J37064F2603b1733C1199a71669E7768b26522k7042A0290a43865k02860
17642c46725A21265e7833K4967j58008D6665k057a30674A97334B5608J79395l865
17631B01138C5014c6966D32052b2392m4340k28954B06087B7743J33918i6110B23916
$$ plain form
17619 267326 -37771 601133 29536 141311 98129 -45065 241993 120970 210998 331518
17609 331518 120750 307811 -9984 484727 -44538 -94971 383472 -20597 85596 260458 127447
17597 248699 185328 -31311 512772 194726 175901 255932 91747 72574 258432 118900 -103333
17585 71056 95755 111567 -25250 66545 82872 171691 -120839 -197552 158378 174763 369419
17574 369419 266486 428827 40864 -52878 178260 296040 506692 -25025 -1235 270279
17563 360248 329180 319060 -121800 -4467 194340 81150 -151281 43924 216775 76167 199337
17552 199337 92563 254662 484418 387677 175909 154084 132188 232034 37243 148477 112520
17541 112520 -54909 303525 156998 -206594 200463 380610 390343 286943 353359 31069
$$ packed form
17619B67326c7771F01133B9536J11775m3182d5065B41993A20970R0028J20520
17609C31518A20750J87061i984D84727d4538n0433C83472b0597H5596J74862A27447
17597B48699o3371c1311E12772A94726j8825Q0031I1747j9173J85858A18900a03333
17585G1056K4699J5812b5250F6545J6327Q8819a20839p6713A58378J6385J94656
17574C69419j02933J62341D0864e2878A78260J17780K10652b5025a235B70279
17563C60248l1068j0120a21800d467A94340H1150a51281D3924J72851G6167J23170
17552A99337I2563J62099K29756r6741A75909k1825k1896R9846C7243J11234l5957
17541A12520e4909C03525j46527b06594B00463J80147R733j03400O6416C1069
$$ plain form
17530 184289 377291 8461 120546 169194 480371 303192 277094 65873 92677 218434 81871
17518 290330 138120 225006 529052 474944 617934 376093 723268 897401 955503 1153170
17508 1153170 682691 694975 569760 449445 490260 254459 340974 238221 593044 651433
17498 651433 809182 1141754 1109473 1011798 1015836 704369 994240 701504 482578 139156
17487 648666 551145 279582 174121 323985 247625 526765 625389 126979 176954 228869
17477 228869 -56869 267533 293179 253571 195267 446245 385641 347749 410838 205465 286102
17466 286102 493973 112821 332137 408636 522296 351643 210957 742139 446796 371459
17456 371459 687769 413546 291573 444798 115326 77494 83892 147284 118911 272473
$$ packed form
17530A84289J93002H461J12085M8648L11177j77179k6098F5873K6804J25757H1871
17518B90330A38120Q6886L04046n4108J42990k41841L47175J74133N8102J97667
17508A153170m70479J2284j25215j20315M0815k35801Q6515j02753L54823N8389
17498F51433J57749L32572l2281r7675M038l11467K89871k92736k18926A39156
17487F48666r7521k71563j05461J49864p6360K79140R8624A26979M9975N1915
17477B28869e6869B67533K5646l9608n8304K50978o0604l7892O3089k05373Q0637
17466B86102K07871A12821K19316P6499J13660j70653j40686N31182k95343p5337
17456C71459L16310k74223j21973J53225A15326l7832O398O3392k8373J53562
$$ plain form
17446 272473 250688 -60981 318162 223829 739219 130549 412070 364048 333126 199823
17436 199823 412488 360898 124339 595560 321270 386788 99420 698141 295554 377178
17426 377178 200276 235385 428849 393716 557737 375235 335449 -106291 302820 392168
17416 392168 51337 469610 326344 332532 497507 336072 413776 123105 221118 190746 124585
17405 124585 372219 454446 374294 193405 62116 602717 168172 587412 336349 587311
17395 587311 172731 449249 162884 403808 123065 433358 305096 209227 -105602 165592
17384 48476 281362 137298 92615 203837 552794 181431 539670 410137 493241 396327
17374 396327 83215 188770 -8937 229503 191608 1975 472835 181667 71404 380382 547389
$$ packed form
17446B72473k1785f0981C18162r4333N15390A30549K81521m8022l0922j33303
17436A99823K12665n1590A24339M71221k74290O5518I9420N98721B95554Q1624
17426C77178j76902L5109J93464l5133J64021j82502l9786a06291C02820Q9348
17416C92168E1337M18273j43266O188J64975j61435P7704A23105R8013l0372o6161
17405A24585K47634Q2227q0152j80889F2116N40601A68172M19240k51063K50962
17395E87311A72731K76518A62884K40924A23065L10293j28262r5869a05602A65592
17384D8476K32886A37298m4683J11222L48957A81431L58239j29533Q3104r6914
17374C96327H3215J05555h937B29503l7895A975M70860A81667G1404L08978J67007
$$ plain form
17363 547389 106327 83055 231336 181654 538366 631400 287111 117007 343402 264220
17353 264220 20601 254103 109406 415484 472177 127269 333816 75921 35154 764299
17343 764299 311740 284518 -13785 375887 278731 88284 478973 322776 454677 574960
17333 574960 39614 183296 419082 110439 449647 293658 -222812 216816 324878 54195
17322 225523 451737 209391 247208 315926 568296 348124 409812 330784 427577 142974
17311 264164 398092 261545 508033 327145 554705 493167 119437 317695 333944 530712
17301 530712 236420 351035 362233 221070 384183 239797 572464 572513 346032 160701
17290 440527 264720 357532 231118 327522 496465 440497 202301 284471 264690 90766 481015
$$ packed form
17363E47389A06327k3272J48281m9682L56712R3034B87111A17007K26395p9182
17353B64220B0601K33502A09406L06078N6693A27269K06547G5921C5154P29145
17343G64299C11740k7222a3785C75887r7156H8284L90689j56197J31901J20283
17333E74960C9614J43682K35786A10439L39208j55989b22812B16816J08062E4195
17322B25523K26214B09391L7817O8718K52370k20172O1688p9028R6793A42974
17311B64164J33928j36547K46488j80888K27560o1538A19437J98258J6249J96768
17301E30712B36420J14615J1198j41163J63113j44386L32667M9k26481A60701
17290D40527j75807R2812j26414R6404J68943n5968B02301Q2170j9781I0766L90249
$$ plain form
17279 481015 188419 270205 576287 103734 258139 236288 529921 563308 593975 -20969
17268 312826 253921 27818 445918 260101 197628 358591 216936 492181 459126 -87059
17257 474908 456672 217490 246012 209927 298618 235274 125278 35679 451458 170419 189683
17246 189683 214754 325832 365202 706992 496126 604242 665393 657117 559314 428227 288399
17235 288399 324560 375663 671171 337408 177846 352154 299824 521481 382353 367658
17225 367658 131648 119360 412443 512225 363938 107477 250621 356854 139302 632474
17215 632474 512125 630464 273746 359387 395250 421253 240347 520429 541129 750086
17205 750086 320817 499034 508050 512762 356279 648333 483912 395290 553595 311625
$$ packed form
17279D81015A88419Q1786L06082A03734J54405k1851K93633L3387L0667b0969
17268C12826n8905B7818M18100j85817o2473J60963j41655K75245l3055h7059
17257D74908j8236B17490K8522l6085Q8691o3344j09996C5679M15779A70419J9264
17246A89683K5071J11078L9370L41790k10866J08116O1151q276r7803j31087j39828
17235B88399L6161N1103K95508l33763j59562J74308n2330K21657j39128j4695
17225C67658A31648j2288K93083R9782j48287A07477J43144J06233A39302M93172
17215F32474j20349J18339B73746Q5641L5863K6003j80906K80082K0700K08957
17205G50086C20817J78217R016M712j56483K92054j64421q8622J58305k41970
$$ plain form
17195 311625 404138 510009 663549 328691 173223 823061 399238 325270 614906 364701
17185 364701 691868 171968 377972 654310 558836 523362 542851 344823 661801 251329
17174 341211 277052 840556 333283 641861 858213 588013 572087 480042 358613 435451
17164 435451 614623 379294 375303 536985 521384 649729 728535 351035 548589 631820
17154 631820 690928 687780 366081 826523 739706 457455 549900 404274 606069 496244
17144 496244 748970 609652 552592 453141 540556 320030 409784 513008 494996 802649
17134 802649 555625 714162 341713 694245 441565 482245 752876 601814 506293 624326
17124 624326 772695 566858 836688 626371 586596 725940 843868 852151 415903 702118
$$ packed form
17195C11625R2513J05871J53540C28691j55468O49838C99238p3968K89636k50205
17185C64701L27167A71968K06004K76338r5474l5474J9489j98028L16978B51329
17174C41211o4159N63504C33283L08578K16352k70200j5926r2045j21429P6838
17164D35451J79172k35329l991J61682j5601J28345P8806C51035J97554Q3231
17154F31820N9108l148l21699M60442q6817k82251R2445j45626K01795j09825
17144D96244K52726j39318n7060r9451Q7415k20526Q9754J03224j8012L07653
17134H02649k47024J58537C41713L52532k52680M0680K70631j51062r5521J18033
17124F24326J48369k05837K69830k10317l9775J39344J17928Q283D15903K86215
$$ plain form
17114 702118 610606 504968 407388 461638 327478 428784 585334 1014499 864058 422753
17103 881707 692436 813436 730481 833742 446353 742433 659016 400434 865093 826731
17093 826731 835634 577565 652686 733776 634529 645624 755172 853021 675834 584804 665727
17082 665727 580258 764296 959268 798502 966143 668836 828915 942607 924806 638155
17072 638155 679405 655580 852619 883391 764983 668182 772671 772536 925661 616202 574203
17061 574203 854737 779145 537506 817601 1120095 961115 583017 917581 670062 907054
17051 907054 1114213 824866 1240003 1294785 800463 821754 903182 820154 778788 1031562
17041 1031562 858727 823676 1040858 1016960 786970 824707 1020660 947697 874564 1023768
$$ packed form
17114G02118r1512j05638r7580N4250j34160J01306J56550M29165j50441D22753
17103H81707j89271J21000q2955J03261l87389K96080q3417k58582M64659l8362
17093H26731Q903k58069P5121Q1090r9247J1095J09548R7849j77187r1030Q0923
17082F65727q5469J84038J94972j60766J67641k97307J60079J13692j7801k86651
17072F38155M1250k3825J97039L0772j18408r6801J04489j35J53125l09459m1999
17061E74203K80534p5592k41639K80095L02494j58980l78098L34564k47519K36992
17051I07054K07159k89347M15137N4782m94322K1291Q1428q3028m1366K52774
17041A031562j72835l5051K17182k3898k29990L7737J95953p2963p3133J49204
$$ plain form
17031 1023768 1125085 866083 892242 776838 1228612 1044595 1420334 837666 1013154 738473
17021 738473 984370 916553 1113216 946682 1209866 834288 1111126 1212362 1300786 982180
17011 982180 1007508 1061209 1005673 1105147 1112013 1164779 979867 1062106 1290478 1177611 916187
17000 916187 996102 1296152 1351507 1326070 1422969 1509945 1295413 1422830 1180743 1285347
16990 1285347 1161217 1394258 1224435 1264672 1396043 1395368 1199941 1407575 1290829 1068784
16980 1068784 1455589 1555487 1535056 1563970 1365394 1718551 1060054 1160714 1394028 1451576
16970 1451576 1262080 1605791 1375509 1530509 1253586 1685397 1415915 1435751 1477279 1594559
16960 1594559 1832941 1645465 1983375 1677853 1765966 1543204 1901710 1176345 1947692 1747352
$$ packed form
17031A023768J01317k59002K6159j15404M51774j84017L75739n82668J75488k74681
17021G38473K45897o7817J96663j66534K63184l75578K76838J01236Q8424l18606
17011I82180K5328N3701n5536R9474O866N2766j84912Q2239K28372j12867k61424
17000I16187P9915L00050N5355k5437R6899Q6976k14532J27417k42087J04604
16990A285347j24130K33041j69823M0237J31371o75j95427K07634j16746k22045
16980A068784L86805R9898k0431K8914j98576L53157o58497J00660K33314N7548
16970A451576j89496L43711k30282J55000k76923M31811k69482J9836M1528J17280
16960A594559K38382j87476L37910l05522Q8113k22762L58506p25365P71347k00340
$$ plain form
16950 1747352 1626754 1750704 1697931 1688110 1801017 1887603 1850711 1757921 1555753 1777472
16940 1777472 1632745 2025757 2213721 1643352 1790128 2047199 2008012 1800094 1827842 1907312
16930 1907312 2007324 2192494 2176527 2236344 1830365 2183068 2120271 1983051 2097727 2106506
16920 2106506 2397686 2218033 2173560 2067384 2225813 2254244 2305557 2250693 2468804 2467566
16910 2467566 2172961 2384935 2241283 2570747 2024784 2310239 2594856 2660490 2562043 2391696
16900 2391696 2640971 2561862 2807856 2657332 2784964 2813379 2697489 2904399 2952561 2808753
16890 2808753 3126996 2993134 3148236 3184165 2731210 3081511 3105801 2902980 3236765 3176997
16880 3176997 3231988 3580852 3094501 3332733 3074262 3442378 3639723 3782786 3834363 3635011
$$ packed form
16950A747352j20598J23950n2773r821J12907Q6586l6892r2790k02168K21719
16940A777472j44727L93012J87964n70369J46776K57071l9187k07918K7748P9470
16930A907312J00012J85170j5967N9817m05979L52703o2797j37220J14676Q779
16920B106506K91180j79653m4473j06176J58429K8431N1313n4864K18111j238
16910B467566k94605K11974j43652L29464n45963K85455K84617O5634r8447j70347
16900B391696K49275p9109K45994j50524J27632K8415j15890K06910M8162j43808
16890B808753L18243j33862J55102L5929m52955L50301K4290k02821L33785n9768
16880C176997N4991L48864m86351K38232k58471L68116J97345J43063N1577j99352
$$ plain form
16870 3635011 3531514 3549527 3936633 3737442 3974952 3676033 3928789 4080706 3794725 4194841
16860 4194841 4255149 4253791 4331400 4033900 4254885 4536793 4639684 4561536 4454226 4798293
16850 4798293 4807744 4617958 5062482 5064976 4944682 5079163 5091846 4978758 5294707 5173838
16840 5173838 5551714 5465873 5459298 5542408 5542046 5705772 5930298 5993594 5940014 6068644 6095751
16829 6095751 6434728 6356302 6704039 6691499 7035394 6929644 7123596 6879641 7043444 7174757
16819 7174757 7323415 7425210 7561019 8043702 8098298 7773291 7935612 8143728 8561317 8640559
16809 8640559 8856546 8612100 9121972 9101092 9548396 9863910 9973125 9872075 10063194 10350199
16799 10350199 10753844 11148521 10796748 10762730 11696421 12111694 11938993 12515749 12525321 13076839
$$ packed form
16870C635011j03497J8013L87106j99191K37510k98919K52756J51917k85981M00116
16860D194841O0308j358P7609k97500K20985K81908J02891p8148j07310L44067
16850D798293R451j89786M44524K494j20294J34481J2683j13088L15949j20869
16840E173838L77876q5841o575Q3110l62J63726K24526O3296n3580J28630K7107
16829F095751L38977p8426L47737j2540L43895j05750J93952k43955J63803J31313
16819G174757J48658J01795J35809M82683N4596l25007J62321K08116M17589P9242
16809H640559K15987k44446N09872k0880M47304L15514J09215j01050J91119K87005
16799A0350199M03645L94677l51773l4018R33691M15273j72701N76756R572N51518
$$ plain form
16789 13076839 13029249 13289773 13827267 14229201 14079169 14633309 15123591 15145176 15839920 15878546
16779 15878546 16421544 16671219 17227361 17582556 18179240 18340219 18949975 19684785 19820725
16770 19820725 20177917 20955455 21776519 22211043 22925353 23615399 24312075 24726457 25933663
16761 25933663 26345963 27079426 27889381 28725030 29936356 30368350 31605874 32686845 33469241
16752 33469241 34702303 36178049 37120224 38177270 39631255 40802551 42310095 43714120
16744 43714120 45122320 46672251 48248953 49948868 52313268 53863430 55835548 57965611
16736 57965611 59740214 61841360 63998277 66768765 68728300 71298254 73995211 76473189
16728 76473189 79161306 81842659 84489859 87342357 89863760 92626631 95506350 97980043
$$ packed form
16789A3076839m7590K60524N37494M01934j50032N54140M90282K1585O94744L8626
16779A5878546N42998K49675N56142L55195N96684J60979O09756P34810J35940
16770A9820725L57192P77538Q21064M34524P14310O90046O96676M14382J207206
16761B5933663M12300P33463Q09955Q35649J211326M31994J237524J080971P82396
16752C3469241J233062J475746R42175J057046J453985J171296J507544J404025
16744D3714120J408200J549931J576702J699915K364400J550162J972118K130063
16736E7965611J774603K101146K156917K770488J959535K569954K696957K477978
16728G6473189K688117K681353K647200K852498K521403K762871K879719K473693
$$ plain form
16720 97980043 100776105 103461955 106023367 108512918 110820066 112770535 114905514 116757411
16712 116757411 118261855 119311279 120097005 120739213 121811808 121642646 121535051 120706556 120155968
16703 120155968 119194804 118153985 116579314 114640631 113080167 110711772 108214732 105821463
16695 105821463 103558272 101123418 97885501 95361646 92310073 89306833 86834433 83834996
16687 83834996 81268358 78506924 75749059 73226278 70489189 68279895 66073382 63304701
16679 63304701 61183410 58913373 57027962 54643155 52840762 51196859 49451613 47514229
16671 47514229 45769100 44424984 43019391 41271114 39867789 38420402 37220930 35952144
16663 35952144 34672180 33849740 32456106 31326207 30555078 29390168 28531031 27824564 27128619
$$ packed form
16720I7980043K796062K685850K561412K489551K307148J950469K134979J851897
16712A16757411J504444J049424P85726O42208J072595j69162j07595q28495n50588
16703A20155968r61164j040819j574671j938683j560464k368395k497040k393269
16695A05821463k263191k434854l237917k523855l051573l003240k472400k999437
16687H3834996k566638k761434k757865k522781k737089k209294k206513k768681
16679F3304701k121291k270037j885411k384807j802393j643903j745246j937384
16671D7514229j745129j344116j405593j748277j403325j447387j199472j268786
16663C5952144j279964q22440j393634j129899p71129j164910q59137p06467o95945
$$ plain form
16654 27128619 26122904 25276879 24250312 23950015 23545247 22574037 21894902 21303302 20798560
16645 20798560 20175201 19632006 19077384 18192002 18393395 17804727 17131411 16971744 16525547
16636 16525547 16197505 15730522 15158131 14726427 14531014 13657701 14090094 13247739 13112001
16627 13112001 12920997 12710170 12410466 11948783 11835813 11364664 10878070 10687739 10797127
16618 10797127 10508275 10491264 10146364 9843885 9391074 9430821 9409772 9214886 9072500 9078343
16608 9078343 8869456 8611223 8335903 8106992 7390743 7898651 7639241 7517602 7353946
16599 7353946 7191502 7051368 6981162 6949329 6711867 6612481 6113691 6735556 6271724 6134868
16589 6134868 6167036 5881101 6027566 6062151 5844352 5391155 5788079 5625942 5498514 5348888
$$ packed form
16654B7128619j005715q46025j026567l00297m04768r71210o79135n91600n04742
16645B0798560o23359n43195n54622q85382K01393n88668o73316j59667m46197
16636A6525547l28042m66983n72391m31704j95413q73313M32393q42355j35738
16627A3112001j91004k10827k99704m61683j12970m71149m86594j90331J09388
16618A0797127k88852j7011l44900l02479m52811L9747k1049j94886j42386N843
16608I078343k08887k58233k75320k28911p16249N07908k59410j21639j63656
16599G353946j62444j40134p0206l1833k37462r9386m98790O21865m63832j36856
16589F134868L2168k85935J46465L4585k17799m53197L96924j62137j27428j49626
$$ plain form
16579 5348888 5133693 5540985 5014325 4795441 4816087 4887477 4773384 4630277 4620066 4567939
16569 4567939 4529117 4420070 4352098 3968694 4220105 4158741 4166904 3989789 3827936 3770132
16559 3770132 3949453 4012604 4150786 3642060 3641923 3472140 3552361 3567654 3456995 3343934
16549 3343934 3547013 3367025 3506869 3427535 3142469 3268814 3317700 3333626 3088340 3157314
16539 3157314 2623117 2922386 3228740 2930230 2863296 2864369 2664093 2761797 2582911 2657771
16529 2657771 2718139 2496119 2188048 2626662 2563807 2856560 2790525 2561671 2544256 2656148
16519 2656148 2106389 2402276 2326791 2436150 2044409 2101728 2035452 2286614 2260171 2185365
16509 2185365 2123329 2086787 2216670 2297126 2079770 2263662 2104674 2294072 1740279 2209971
$$ packed form
16579E348888k15195M07292n26660k18884K0646P1390j14093j43107j0211n2127
16569D567939l8822j09047o7972l83404K51411o1364Q163j77115j61853n7804
16559C770132J79321O3151J38182n08726j37j69783Q0221J5293j10659j13061
16549C343934K03079j79988J39844p9334k85066J26345M8886J5926k45286O8974
16539C157314n34197K99269L06354k98510o6934J073k00276R7704j78886P4860
16529B657771O0368k22020l08071M38614o2855K92753o6035k28854j7415J11892
16519B656148n49759K95887p5485J09359l91741N7319o6276K51162k6443p4806
16509B185365o2036l6542J29883Q0456k17356J83892j58988J89398n53793M69692
$$ plain form
16499 2209971 1865000 2118510 1759496 2008977 1472476 1714038 1702906 1879912 1905192 1937060
16489 1937060 2044077 1503671 1587273 1955002 1773530 1574802 2119279 1791452 1747327 1624688
16479 1624688 1435117 1470455 1750676 1616827 1736030 1603750 1436455 1484413 1492490 1376959
16469 1376959 1368379 1646825 1502135 1662360 1450356 1464023 1505938 1366042 1312324 1400439
16459 1400439 1519175 1499410 1027291 1126728 1348759 1355302 1236230 1654411 1246781 1190141
16449 1190141 1458017 1383756 918743 1275795 1318153 1364234 1088830 1243726 1328032 1321333
16439 1321333 868651 1121009 1456789 1257513 1209919 1006716 1318210 963049 1085158 778608
16429 778608 1139416 1048469 1140003 873205 956651 1165863 709742 1126228 1019774 1350130
$$ packed form
16499B209971l44971K53510l59014K49481n36501K41562j1132J77006K5280L1868
16489A937060J07017n40406Q3602L67729j81472j98728N44477l27827m4125j22639
16479A624688j89571L5338K80221j33849J19203j32280j67295M7958Q077j15531
16469A376959q580K78446j44690J60225k12004J3667M1915j39896n3718Q8115
16459A400439J18736j9765m72119R9437K22031O543j19072M18181m07630n6640
16449A190141K67876p4261m65013L57052M2358M6081k75404J54896Q4306o699
16439A321333m52682K52358L35780j99276m7594k03203L11494l55161J22109l06550
16429G78608L60808r0947R1534k66798Q3446K09212m56121M16486j06454L30356
$$ plain form
16419 1350130 639819 981555 1097756 963391 1053139 994250 1127929 879159 879841 559518
16409 559518 1095154 819722 691846 925422 962432 828468 1011757 849420 900478 896772
16399 896772 734534 788549 927678 856127 827018 662978 552778 669645 1137862 678762
16389 678762 895141 562900 1172855 778702 915887 768634 764882 848356 747692 926064
16379 926064 932240 782458 496388 676629 537804 710949 937083 600068 577455 990886
16369 990886 661111 388219 754032 759847 642444 878701 385967 350115 708816 627321
16359 627321 759294 366282 748322 593717 644050 673234 644259 784146 808548 612466
16349 612466 313695 447322 747422 749681 486634 473788 539425 628074 348193 344594 665149
$$ packed form
16419A350130F39819L41736J16201j34365Q9748n8889J33679k48770O82l20323
16409E59518N35636k75432j27876K33576L7010j33964J83289j62337N1058l706
16399H96772j62238N4015J39129p1551k9109j64040j10200J16867M68217m59100
16389F78762K16379l32241O09955l94153J37185j47253l752Q3474j00664J78372
16379I26064O176j49782k86070J80241j38825J73145K26134l37015k2613M13431
16369I90886l29775k72892L65813N815j17403K36257C85967l5852L58701q1495
16359F27321J31973C66282L82040j54605N0333K9184k8975J39887K4402j96082
16349F12466k98771J33627L00100K259k63047j2846O5637Q8649k79881l599L20555
$$ plain form
16338 665149 384210 783865 485021 560018 160515 579509 567116 465413 515454 714846
16328 714846 589669 610267 235654 312660 340276 352008 555205 615689 449891 742520
16318 742520 569887 620244 458557 724899 677511 755894 196089 665596 414135 478100
16308 478100 362035 931180 789316 472965 324082 549396 279490 317359 450315 310572
16298 310572 551766 97648 496910 254905 199854 434272 463342 544657 591578 334421
16288 334421 270402 274978 259858 607157 413990 424259 839389 404666 471048 304233 358406
16277 358406 276388 369420 347406 223192 829250 627590 389478 119260 315121 643825
16267 643825 305633 -39227 478062 575405 459438 310069 561499 246910 196043 375887
$$ packed form
16338F65149k80939L99655k98844P4997A60515M18994j2393j01703N0041J99392
16328G14846j25177K0598B35654P7006K7616J1732K03197O0484j65798K92629
16318G42520j72633N0357j61687K66342m7388P8383A96089M69507k51461O3965
16308D78100j16065N69145j41864l16351j48883K25314k69906L7869J32956j39743
16298C10572K41194I7648L99262k42005n5051K34418K9070Q1315M6921k57157
16288C34421o4019M576j5120L47299j93167J0269M15130D04666O6382j66815N4173
16277C58406q2018R3032k2014j24214O06058k01660k38112A19260J95861L28704
16267F43825C05633c9227D78062R7343j15967j49369K51430B46910n0867J79844
$$ plain form
16257 375887 375598 609482 355008 405235 371173 548238 310494 377837 89521 157925 453920
16246 453920 282251 266823 363945 808150 444625 175063 207458 373809 364160 439829 153361
16234 291665 105213 432009 342851 165316 289724 441969 522008 481923 136101 328238
16224 328238 176384 272843 417447 246491 198620 280454 373067 181237 145258 271788
16214 271788 136562 114161 271150 86050 496799 38853 -20436 268692 146018 555118
16204 555118 536320 -79810 284429 241098 88425 435800 259820 291514 184494 90415 -185495
16192 268591 538688 311571 49803 358846 349905 -61669 120574 214954 168299 386804 369365
16181 369365 187227 -103583 193885 -65925 294614 297619 198182 121597 365812 131765
$$ packed form
16257C75887k89K33884k54474N0227l4062J77065k37744O7343H9521O8404K95995
16246D53920j71669j5428R7122M44205l63525A75063L2395J66351r649P5669A53361
16234B91665A05213L26796q9158A65316J24408J52245Q0039m0085A36101J92137
16224C28238j51854R6459J44604j70956m7871Q1834R2613A81237l5979J26530
16214B71788j35226k2401J56989H6050M10749C8853b0436B68692j22674M09100
16204E55118j8798g9810B84429m3331H8425L47375j75980L1694j07020I0415a85495
16192B68591K70097k27117D9803L09043q941f1669A20574R4380m6655K18505j7439
16181C69365j82138a03583A93885f5925B94614L005r9437p6585K44215A31765
$$ plain form
16170 385570 142993 -31446 466227 364497 334986 428082 515185 -76312 -95725 261118 -57689
16158 426898 -33971 47086 358737 250391 222291 124633 94928 312489 -51689 285531 103941
16146 -233842 326544 138190 -128789 -133308 190061 170257 409560 138002 304279 -66985
16135 404195 162609 344759 38618 258781 150427 93014 -7949 225846 90998 365147
16125 365147 -46291 106720 -154379 -84357 371815 80235 254655 -28753 249553 158252
16115 158252 -447 -70675 -80473 175984 301061 -22043 408207 447115 -102087 -193503 45264
16103 124866 -37511 313932 -97497 300291 311553 138247 70384 213171 125126 7993 388862
16092 388862 282262 -8688 361118 191480 -72196 142635 -130076 308552 338276 69674
$$ packed form
16170C85570A42993c1446D66227j01730k9511R3096Q7103g6312j9413B61118e7689
16158D26898c3971D7086L11651j08346k8100r7658k9705K17561e1689B85531A03941
16146b33842C26544A38190a28789m519A90061j9804K39303A38002J66277f6985
16135D04195A62609J82150C8618K20163j08354n7413g949B25846I0998K74149
16125C65147d6291A06720a54379P0022C71815H0235J74420b8753B49553r1301
16115A58252d47p0228r798A75984J25077b2043D08207L8908a02087r1416D5264
16103A24866c7511C13932i7497C00291J1262A38247o7863J42787q8045G993L80869
16092C88862j06600h688C61118j69638g2196A42635a30076C08552K9724F9674
$$ plain form
16081 22281 266712 -96135 -133396 142757 -54916 9522 93421 142074 -39334 273583 -163473
16069 185132 110924 -32374 295353 51663 59526 -160321 -80527 211103 -227336 63057 61480
16058 61480 258024 33400 76175 -164882 -98123 226766 -8786 362611 -98579 221068 147768
16047 147768 -34247 93851 49331 -251190 24435 -30922 244294 -349650 214321 299708 -90193
16035 117272 300614 -7592 -719 -408015 88644 18603 -156953 -13287 117838 -50288 -109523
16024 -109523 -201616 316975 -143145 298046 -75071 -181581 -14382 -85769 -84181 -2989 30682
16012 328414 -130969 -212242 -102605 -159126 258992 -221787 141322 297397 -144976 -63334
16001 -141946 208150 58176 302403 -71949 52306 48963 325727 80977 24585 -214589 57447
$$ packed form
16081B2281K44431i6135l7261A42757e4916I522Q3899M8653c9334B73583a63473
16069A85132p4208c2374B95353E1663P863a60321P9794B11103b27336F3057j577
16058F1480J96544C3400M2775a64882O6759B26766h786C62611i8579B21068p3300
16047A47768c4247I3851m4520b51190B4435c0922B44294c49650B14321Q5387i0193
16035A17272J83342g592g19m07296H8644A8603a56953a3287A17838e0288n9235
16024a09523r2093C16975a43145B98046g5071j06510a4382p1387J588b989C0682
16012C28414a30969q1273a02605n6521B58992b21787A41322J56075a44976f3334
16001a41946B08150E8176K44227g1949E2306l343K76764H0977B4585b14589E7447
$$ plain form
15989 294040 12722 -101249 51258 -75312 247557 95186 11699 122611 139965 300564 42861
15977 -254918 343840 274754 170390 197479 744373 618348 946318 744668 636295 887984
15967 887984 717213 788034 456628 500955 114543 -23060 207930 -63267 -44485 16951 -71922
15955 127074 -276437 29769 -192874 18309 -129653 107741 218639 205380 -151827 -127158
15945 -127158 -58931 12992 -85721 119097 -191895 195086 -89601 44668 252634 147367
15935 147367 62289 -92414 351830 -36621 194128 232590 118076 304977 79486 -94251 -155678
15924 -155678 67360 -38918 -120055 81001 99849 45666 -127710 -33612 8476 -151311 204853
15912 3991 -95764 -6832 73469 -25445 -133023 305950 -33461 -202001 -113277 55708 183026
$$ packed form
15989B94040A2722a01249E1258g5312B47557I5186A1699J10912J7354J60599D2861
15977b54918C43840o9086j04364K7089N46894j26025L27970k01650j08373K51689
15967H87984j70771P0821l31406M4327A14543b3060B07930f3267J8782A6951g1922
15955A27074b76437B9769a92874A8309a29653A07741J10898j3259a51827K4669
15945a27158e8931A2992h5721A19097a91895A95086h9601D4668K07966j05267
15935A47367F2289i2414C51830c6621A94128L8462j14514J86901G9486i4251o1427
15924a55678F7360c8918q1137H1001J8848D5666a27710c3612H476a51311B04853
15912C991i5764f832G3469b5445j07578C05950c3461j68540Q8724E5708J27318
$$ plain form
15901 183026 100688 -31678 -66751 -141361 -10481 72279 45220 -8432 -101907 -143142 -151119 -157046
15889 -157046 81016 26440 133704 174889 447819 79216 -111782 107620 47832 32888 -100629
15877 108790 159517 -73361 -93706 -35 54027 389315 249957 122326 -166059 51132 66853
15866 66853 77848 84651 -228955 93012 -3584 -74058 -569385 397430 159470 32765 -73870
15854 11540 196414 270084 -162919 44979 -162250 169322 93850 -73351 14196 -63714 -143753
15843 -143753 21620 -84011 154970 126438 -262651 84616 139888 -10972 155481 -150438 -69322
15831 120499 77843 -86600 60750 -145038 33896 -231690 -214403 153678 42814 43992 -87471
15819 174139 -189617 145888 -73657 181115 164538 72378 -36416 147955 -105833 161343
$$ packed form
15901A83026q2338c1678l5073p4610a0481G2279k7059h432r3475m1235p977n927
15889a57046H1016B6440J07264M1185K72930G9216a11782A07620D7832j4944a00629
15877A08790N0727g3361k0345c5E4027L35288j39358A22326a66059E1132J5721
15866F6853J0995O803b28955I3012c584p0474m95327C97430A59470C2765g3870
15854A1540J84874P3670a62919D4979a62250A69322p5472g3351A4196f3714q0039
15843a43753B1620h4011A54970k8532b62651H4616N5272a0972A55481a50438f9322
15831A20499m2656h6600F0750a45038C3896b31690J7287A53678D2814J178h7471
15819A74139a89617A45888g3657A81115j6577G2378c6416A47955a05833A61343
$$ plain form
15808 -232281 282448 -189069 227130 206705 -360121 101258 69764 226139 166902 134435
15798 134435 -45116 171643 -91362 168770 -130010 117663 -4890 -5766 -221339 136529 -130535
15786 18117 -396914 -131318 99554 118753 -211110 -206715 -4532 -65512 65040 -12683 -37097
15775 -37097 -264787 14786 -210893 77746 69440 239607 -252585 -265403 -66029 111603 -220308
15763 45630 -49765 -73486 11696 -99278 -154444 -254287 87683 -41706 -117601 100999 -132713
15751 264017 -193256 99606 110118 -306821 139841 -26333 62202 140495 207999 45972 67608
15740 67608 340027 -111871 -238366 140021 -107741 44120 164116 -70652 -19050 5157 189454
15729 189454 70883 76480 397111 -144801 82049 94708 -278615 -1009 27380 -48232 -90975
$$ packed form
15808b32281B82448a89069B27130k0425c60121A01258l1494J56375n9237l2467
15798A34435d5116A71643i1362A68770a30010A17663d890q76k15573A36529a30535
15786A8117c96914a31318I9554J9199b11110M395d532o0980F5040a2683k4414
15775c7097k27690A4786b10893G7746q306J70167b52585j2818f6029A11603b20308
15763D5630d9765k3721A1696i9278n5166r9843H7683d1706p5895A00999a32713
15751B64017a93256I9606J0512c06821A39841b6333F2202P8293O7504D5972K1636
15740F7608K72419a11871j26495A40021a07741D4120J19996g0652a9050E157J84297
15729A89454G0883N597L20631a44801H2049J2659b78615a009B7380d8232m2743
$$ plain form
15718 -90975 64189 85884 -114133 -86847 -92005 436861 -135451 -81138 73804 -36237 47523
15706 -163416 -1463 43870 83936 -17587 296405 -115465 -9772 -427690 -140353 17757 -76019
15694 44945 18342 -216818 7961 -112725 74408 -148643 -153840 -55599 -166166 -178000 118780
15682 36402 -209129 -74289 -267228 12281 273975 -170365 150486 -83897 378522 1621 -68596
15670 -70371 50178 34357 162312 18660 -158135 100744 141223 9791 48709 66871 -252543
15658 -238119 -26527 -14290 317604 -131825 42458 192795 -13747 296600 55998 -155486
15647 189995 -77538 66638 -213269 -301701 127724 65139 98337 -3348 -8782 -265904 -251971
15636 -251971 146864 -185259 -127683 -309727 304176 192762 30455 -193377 -102811 -77505
$$ packed form
15718i0975F4189K1695a14133K7286n158D36861a35451N4313G3804c6237D7523
15706a63416a463D3870M0066a7587B96405a15465i772m17918a40353A7757g6019
15694D4945A8342b16818G961a12725G4408a48643n197e5599j10567j1834A18780
15682C6402b09129g4289j92939A2281K61694a70365A50486h3897C78522A621f8596
15670g0371E0178j5821J27955A8660a58135A00744M0479I791L8918J8162b52543
15658b38119b6527J2237C17604a31825D2458J50337a3747B96600E5998a55486
15647A89995g7538F6638b13269q8432A27724o2585L3198c348n434k57122J3933
15636b51971A46864a85259N7576j82044C04176j11414C0455a93377R0566K5306
$$ plain form
15626 -77505 48632 88005 284243 183098 59106 58390 69194 -120120 -249049 33964 99070
15615 99070 -45709 -63344 -237630 93659 83526 -4277 -52049 -106693 294337 118179 283457
15604 283457 -91473 298171 203899 -82573 -190610 55359 20483 178529 -45122 -244424 -166369
15593 -166369 15875 -136856 -64903 -13116 -139485 -89409 -166489 148711 23263 289170 155988
15582 155988 -77408 -245646 -108452 186143 -422250 -171650 29774 -72245 -71863 -124580 -352401
15571 -352401 126420 -44297 -176707 59159 -20351 240659 119596 -154037 -85547 285793
15560 -6096 162021 24248 102058 -250675 -109303 78598 178345 -39658 -176397 -68318 83839
15548 86472 -75846 -36998 275305 112890 64438 126977 147150 -55740 28974 -36780 224904
$$ packed form
15626g7505D8632L9373J96238j01145E9106p16J0804a20120j28929C3964O5106
15615I9070d5709j7635j74286I3659j0133d277m7772n4644B94337A18179J65278
15604B83457i1473B98171r4272h2573j08037E5359B0483J58046d5122j99302P8055
15593a66369A5875a36856f4903a3116j26369N0076p7080A48711B3263K65907j33182
15582A55988g7408j68238a08452A86143d22250a71650B9774g2245L82n2717k27821
15571c52401A26420d4297j32410E9159b0351B40659A19596a54037O8490B85793
15560f096A62021B4248P7810b50675a09303G8598R9747c9658j36739f8318H3839
15548H6472g5846c6998B75305A12890m8452O2539K0173e5740B8974c6780B24904
$$ plain form
15536 -136718 -23104 5896 -383409 66681 -46740 360828 313854 61465 -127017 212257 -280700
15524 106140 29884 123045 -1591 -171001 -5367 243266 -161218 -142766 -218712 203953 -111688
15512 -17023 120886 12333 -194402 69445 167475 -74379 80421 193956 45256 472326 3316
15500 -91344 178659 -58305 177083 -63720 258585 3493 -73509 -64384 426986 390318 342926
15489 342926 166858 314045 228482 94885 12694 295766 248731 -90567 118380 476495
15479 476495 257609 366636 223080 40711 61282 95457 -364273 -43079 129794 196592
15469 196592 -197846 263827 213088 265836 274048 211834 468063 501823 127124 25489 849998
15458 849998 530458 553651 700789 324120 642604 365859 -138956 321905 -15763 421880
$$ packed form
15536a36718b3104E896c83409F6681d6740C60828m6974F1465a27017B12257b80700
15524A06140B9884R3161a591j69410e367B43266a61218J8452p5946B03953a11688
15512a7023A20886A2333a94402F9445R8030g4379H0421J13535D5256M27070C316
15500i1344A78659e8305A77083f3720B58585C493g3509R125D26986l6668m7392
15489C42926A66858J47187q5563I4885A2694K83072m7035i0567A18380L58115
15479D76495k18886J09027j43556D0711K0571L4175c64273d3079A29794O6798
15469A96592a97846B63827n0739N2748Q212o2214K56229L3760A27124B5489Q24509
15458H49998l19540K3193J47138C24120L18484k76745a38956C21905a5763D21880
$$ plain form
15447 144074 -84521 -59746 -249279 23618 -17726 206206 8991 19139 -256342 88627 -246159
15435 -265092 206008 90756 159650 76590 100757 170811 419535 303022 536262 924263
15425 924263 1291320 1113777 685639 555268 96909 390535 -164005 86499 -140268 -203932
15415 -203932 249764 -105292 -235444 301975 146927 -252655 372269 266432 -51809 64636
15404 55873 -268204 -18744 -229918 9509 85675 60435 200365 49013 104230 17734 118355
15393 118355 244951 121214 101683 -189215 115798 -24370 -41663 -119457 387039 85935
15382 -46027 25281 -153986 96298 -13142 -125908 195089 -7394 123500 108720 255639 -80254
15370 -302367 -142200 22179 -72669 -47992 26485 238741 118723 41115 -44958 50953 -32124
$$ packed form
15447A44074h4521K4775j89533B3618a7726B06206H991J0148b56342H8627b46159
15435b65092B06008I0756O8894G6590K4167P0054K48724j16513K33240L88001
15425I24263L67057j77543m28138j30371I6909K93626a64005H6499a40268o3664
15415b03932B49764a05292j30152C01975A46927b52655C72269j05837e1809F4636
15404E5873b68204a8744k11174I509P6166k5240J39930D9013N5217A7734J00621
15393A18355J26596A21214j9531a89215A15798b4370j7293p7794C87039H5935
15382d6027B5281a53986I6298a3142j12766A95089g394A23500j4780J46919h0254
15370c02367a42200B2179g2669K4677B6485K12256A18723D1115d4958E0953c2124
$$ plain form
15358 216900 493389 69417 294801 479588 -50301 80216 55374 129264 159112 38156 177689
15347 177689 302337 171382 164763 150343 -118586 3478 123691 315300 186170 392945
15337 392945 572652 147770 229099 -33573 329937 44612 306475 456233 250431 257566
15327 257566 292537 173006 540691 121669 -178660 103567 7441 308235 362985 98033
15316 9671 133385 -100449 106670 298640 37162 291201 135951 79213 527389 480906
15306 480906 284408 443753 -7916 20029 222839 173515 286445 159167 311569 267 323497
15295 323497 208650 354649 473658 301099 159010 25288 -73712 70748 60167 262121
15285 262121 -94394 356394 238853 -3494 244170 -7227 20041 194628 325089 30167 115415
$$ packed form
15358B16900K76489F9417K25384J84787e0301H0216k4842P3890K9848C8156J39533
15347A77689J24648j30955o619j4420a18586C478J20213J91609j29130K06775
15337C92945J79707A47770Q1329c3573C29937D4612K61863J49758k05802P135
15327B57566L4971j19531L67685A21669a78660A03567G441L00794N4750I8033
15316I671J23714a00449A06670J91970C7162K54039A35951n6738M48176m6483
15306D80906j96498J59345g916B0029K02810m9324J12930j27278J52402B67L23230
15295C23497j14847J45999J19009j72559j42089B5288g3712G0748j0581K01954
15285B62121i4394C56394j17541c494B44170g227B0041J74587J30461C0167Q5248
$$ plain form
15274 115415 -10455 -20963 -177553 -657498 132174 259138 162896 87647 16815 50426 308342
15263 308342 -12327 -140020 69348 -21643 -85149 -326089 -14221 52169 146583 192596 46778
15251 319779 178715 -283585 66672 -177175 190399 -191558 225343 203090 219374 -133370
15240 3429 -11785 -155566 -245448 -6804 220002 -163927 -137985 114192 390834 213005 329405
15229 329405 277483 449308 788943 1736222 1311487 1355550 1506376 485700 198583 510226
15219 510226 142068 -84798 36629 335627 118114 28882 153209 353124 60691 -80869
15208 72864 -174219 59839 274123 148533 -91953 -19729 -101183 -51217 75669 148047 141714
15197 141714 -44862 272808 -201072 -7568 115421 213179 157032 293078 179370 -38604 23840
$$ packed form
15274A15415a0455j0508j56590m79945A32174J26964r6242p5249A6815L3611K57916
15263C08342a2327j27693F9348b1643o3506k40940a4221E2169R4414M6013D6778
15251C19779j41064b83585F6672a77175A90399a91558B25343k2253J6284a33370
15240C429a1785j43781q9882f804B20002a63927K5942A14192K76642j77829J16400
15229C29405n1922J71825L39635R47279m24735M4063J50826D85700A98583L11643
15219E10226A42068h4798C6629K98998A18114B8882J24327J99915F0691h0869
15208G2864a74219E9839K14284j25590i1953a9729q1454M9966G5669P2378o333
15197A41714d4862B72808b01072g568A15421R7758n6147J36046j13708c8604B3840
$$ plain form
15185 -69404 25107 -3920 -187083 120901 -167100 -91603 243415 36638 156040 93418 461673
15174 461673 -50090 72320 36235 -97644 200895 329789 -90471 281216 110487 607 181778
15163 181778 -132528 15131 292650 204626 -79196 295814 170037 -75690 5591 102383 -240775
15151 -11099 -14602 147805 304455 103481 226770 -55127 159398 -92364 -57446 298074 -28165
15139 398612 97092 329999 259523 32178 -22190 -57585 86495 -140220 -21025 -195825 361519
15127 97466 42092 150668 70565 -17055 326315 568410 216547 160901 8403 -37433 -79550
15116 -79550 61956 30708 137154 284715 218441 302942 -91245 315562 586021 445685 93569
15104 605982 557375 316103 155826 136152 91165 -62562 225840 -182722 201034 246931
$$ packed form
15185f9404B5107c920j83163A20901a67100P5497B43415C6638J19402o2622L68255
15174D61673e0090G2320l6085i7644B00895J28894i0471B81216A10487F07J81171
15163A81778a32528A5131K77519q8024g9196B95814j25777g5690E591R6792b40775
15151a1099l503A47805J56650A03481J23289e5127A59398i2364L4918B98074b8165
15139C98612I7092K32907p0476C2178b2190l5395H6495a40220b1025j74800C61519
15127I7466D2092J08576G0565a7055C26315K42095B16547n5646H403c7433m2117
15116g9550F1956C0708J06446J47561o6274Q4501i1245C15562K70459j40336I3569
15104F05982m8607k41272A55826j9674m4987f2562B25840a82722B01034M5897
$$ plain form
15094 246931 35050 313243 13218 354623 18256 303628 -301270 191709 100226 1034 324423
15083 324423 -29147 -195699 -216881 -59051 206141 -1982 151602 -27041 -38342 152673 -28995
15071 329636 -20535 466593 129565 278959 244430 258816 -29800 685703 -88055 137128
15060 90626 406315 -200060 153283 -72661 -21816 148507 446225 420532 191421 332034
15050 332034 149171 163600 449243 53148 223788 175698 256184 392502 466517 348930
15040 348930 336121 415372 237316 418230 377226 327994 400322 463288 454656 446810 244354
15029 244354 352024 469303 124121 338086 365698 468102 460783 512292 386454 391193 520795
15018 520795 597135 488543 609060 532917 717981 896422 722446 554565 606892 564235
$$ packed form
15094B46931C5050K78193A3218L41405A8256K85372c01270A91709r1483A034L23389
15083C24423b9147j66552k1182e9051B06141a982A51602b7041j1301A52673b8995
15071C29636b0535D66593A29565J49394l4529J4386b9800F85703h8055A37128
15060I0626L15689b00060A53283g2661b1816A48507K97718k5693A91421J40613
15050C32034A49171J4429K85643E3148J70640m8090Q0486J36318P4015j17587
15040C48930j2809P9251j78056J80914m1004m9232P2328O2966q632p846k02456
15029B44354J07670J17279A24121K13965K7612J02404p319N1509j25838M739J29602
15018E20795P6340j08592J20517p6143J85064J78441j73976j67881N2327m2657
$$ plain form
15008 564235 513332 484533 698936 460095 836485 598956 616404 270905 355376 577678
14998 577678 133432 547346 508123 467515 166922 494008 252320 414949 243747 323017
14988 323017 568242 435172 452786 618879 1034675 499050 419680 443972 386372 244007
14978 244007 310703 478582 769207 97165 602377 738677 456498 609683 765274 629757
14968 629757 732757 705562 925765 826501 726752 614863 638622 632782 548686 702795 503287
14957 503287 709636 883098 156739 598260 474216 531012 365848 514169 567290 90838
14946 703697 520273 685951 321072 258297 467751 191497 323867 344840 435388 123661
14935 424912 559613 487567 221295 560758 340124 727408 348985 573715 878563 715013
$$ packed form
15008E64235n0903k8799K14403k38841L76390k37529J7448B70905Q4471K22302
14998E77678A33432M13914l9223m0608A66922L27086k41688J62629j71202P9270
14988C23017K45225j33070J7614J66093M15796D99050p9370K4292n7600j42365
14978B44007O6696J67879K90625I7165N05212J36300k82179J53185J55591j35517
14968F29757J03000k7195K20203r9264r9749j11889K3759n840q4096J54109j99508
14957E03287K06349J73462A56739M41521j24044N6796j65164J48321N3121I0838
14946G03697j83424J65678C21072o2775K09454A91497J32370K0973R0548A23661
14935D24912J34701p2046B21295L39463k20634L87284C48985K24730L04848j63550
$$ plain form
14925 715013 676832 757922 665563 421537 597585 371439 933620 368721 720023 999152
14915 999152 1069308 1261140 1451731 1675336 1843537 1455352 1974439 1874959 1896091 1521260
14905 1521260 1524291 1629517 1955120 2172392 2352095 2176747 1837734 1917591 1493482 844771
14895 844771 1075301 910366 505861 796652 583057 484205 153105 633900 629800 510838
14885 510838 237519 666309 375010 467673 128576 441571 442415 615481 286671 158904
14875 158904 511590 524361 616919 633345 833845 688570 812437 1111473 1122518 788495
14865 788495 959783 934873 1013082 627505 573814 833443 664178 741863 75703 349006
14855 349006 584150 684406 519708 595262 597244 753667 467246 799775 517354 419699
$$ packed form
14925G15013l8181Q1090r2359k44026J76048k26146N62181C68721L51302K79129
14915I99152P0156J91832J90591K23605J68201l88185N19087r9480K1132l74831
14905A521260L031J05226L25603K17272J79703j75348l39013P9857m24109o48711
14895H44771K30530j64935m04505K90791k13595r8852A53105M80795m100j18962
14885E10838B37519M28790k91299R2663A28576L12995Q44J73066B86671j27767
14875A58904L52686J2771R2558J6426K00500j45275J23867K99036J1045l34023
14865G88495J71288k4910P8209l85577n3691K59629j69265P7685G5703K73303
14855C49006K35144J00256j64698P5554J982J56423k86421L32529k82421r7655
$$ plain form
14845 419699 439678 506546 164921 665392 615813 534285 435900 496914 247198 920925 637973
14834 637973 584347 819215 539797 590626 989782 963530 1028612 1298995 855949 1218090
14824 1218090 1138294 1271943 1297219 1000344 624634 849614 895453 863639 587918 628367
14814 628367 418751 664902 657675 582423 326639 641460 466376 468511 824755 599924
14804 599924 832862 753430 919595 960299 870002 1060569 730194 701867 849098 781795
14794 781795 927567 606373 978735 889389 1001123 1283774 958323 960844 703679 589843
14784 589843 845098 291641 576002 830302 550342 308295 618438 621603 394583 647158
14774 647158 340875 866509 503083 561881 787558 364431 834870 663560 619553 759583
$$ packed form
14845D19699J9979O6868A64921N00471m9579q1528r8385O1014B47198O73727k82952
14834F37973n3626K34868k79418N0829L99156k6252O5082K70383m43046L62141
14824A218090p9796J33649K5276k96875l75710K24980M5839l1814k75721M0449
14814F28367k09616K46151p227p5252k55784L14821j75084K135L56244k24831
14804E99924K32938p9432J66165M0704r0297J90567l30375k8327J47231o7303
14794G81795J45772l21194L72362q9346J11734K82651l25451K521k57165j13836
14784E89843K55255B91641K84361K54300k79960k42047L10143L165k27020K52575
14774F47158l06283N25634l63426N8798K25677C64431M70439j71310m4007J40030
$$ plain form
14764 759583 909978 962835 945881 1212316 1049320 917779 606745 484197 696395 536176
14754 536176 423884 884335 685480 804036 294510 1077385 747337 639222 783180 653958
14744 653958 890837 788299 572702 504894 828926 1019327 932576 771759 839647 787707
14734 787707 632393 711604 762115 864990 931249 648805 956941 968715 1004383 1348907
14724 1348907 638815 481808 832408 868331 825868 989756 871237 1501142 1308228 1565177
14714 1565177 1906129 1517244 1747398 1859962 1360525 1119956 936614 990138 986305 1066471
14704 1066471 1240657 1113318 956507 901556 920490 1139610 545171 859505 659111 976847
14694 976847 1247864 1288134 1305619 1236321 1189540 1458745 1819030 1977088 1673475 1608208
$$ packed form
14764G59583J50395N2857j6954K66435j62996j31541l11034j22548K12198j60219
14754E36176j12292M60451j98855J18556B94510P82875l30048j08115J43958j29222
14744F53958K36879j02538k15597o7808L24032J90401q6751j60817O7888n1940
14734G87707j55314P9211N0511J02875O6259k82444L08136J1774L5668L44524
14724A348907F38815j57007L50600L5923m2463J63888j18519O29905j92914K56949
14714A565177L40952l88885K30154J12564m99437k40569j83342N3524l833Q0166
14704A066471J74186j27339j56811n4951J8934K19120E45171L14334k00394L17736
14694I76847K71017M0270J7485o9298m6781K69205L60285J58058l03613o5267
$$ plain form
14684 1608208 1895975 1379987 1176831 1317508 980219 1121267 727424 1001326 769340
14675 769340 1226565 1247179 855706 881797 1154421 815058 1016440 981284 879825 1014553
14665 1014553 1044966 710611 1431830 885066 1060499 1024228 1235397 1081719 556464 1123826
14655 1123826 1080697 908084 1235121 991330 879699 1050217 817689 1073910 1243114 948565
14645 948565 1257766 1277835 1129056 1114913 1018193 1438263 1341306 1119993 1313976 1195519
14635 1195519 1508745 1506360 1471719 1188255 1397468 1123426 1154242 1295747 1103146 1358440
14625 1358440 1417815 1281916 1338237 1318749 1049322 1176474 1197673 1112522 1519774 1508733
14615 1508733 1300322 1338045 1607243 1301218 1001835 1413523 1278836 1262832 1276046 1329378
$$ packed form
14684A608208K87767n15988k03156J40677l37289J41048l93843K73902k31986
14675G69340M57225K0614l91473K6091K72624l39363K01382l5156j01459J34728
14665A014553L0413l34355P21219n46764J75433l6271K11169j53678n25255N67362
14655A123826m3129j72613L27037k43791j11631J70518k32528K56221J69204k94549
14645I48565L09201K0069j48779j4143r6720M20070r6957k21313J93983j18457
14635A195519L13226k385l4641k83464K09213k74042L0816J41505j92601K55294
14625A358440N9375j35899N6321j9488k69427J27152K1199q5151M07252j1041
14615A508733k08411L7723K69198l06025k99383M11688j34687j6004J3214N3332
$$ plain form
14605 1329378 1454198 1376535 1516680 1363870 1793942 1368085 1502621 1240703 1775852 1368267
14595 1368267 1428791 1514476 1644462 1429856 1636073 1624053 1475652 1251961 1368684 1564359
14585 1564359 1429306 1675996 1543279 1474273 1294809 1583085 1565540 1556866 1743036 1697435
14575 1697435 1810078 1841622 1900102 1961275 1884693 1631039 1985038 1809490 1800655 2149900
14565 2149900 1929686 1986280 1849635 2277958 1582746 1928999 2077220 2014468 1896517 2126240
14555 2126240 2149332 2255217 2254254 2542695 2385921 2397930 2370000 2219312 2645125 2630200 2393619
14544 2393619 3041635 2694138 3400932 3622818 3827191 4110948 4580936 4931008 5886508
14535 5886508 7107588 9156871 12772041 18800287 30082725 36678518 20730670 12089763
$$ packed form
14605A329378J24820p7663J40145j52810M30072m25857J34536k61918N35149m07585
14595A368267O0524Q5685J29986k14606K06217j2020j48401k23691J16723J95675
14585A564359j35053K46690j32717o9006j79464K88276j7545q674J86170m5601
14575A697435J12643L1544N8480O1173p6582k53654L53999j75548q835L49245
14565B149900k20214N6594j36645M28323o95212L46253J48221o2752j17951K29723
14555B126240K3092J05885r63K88441j56774J2009k7930j50688M25813j4925k36581
14544B393619O48016l47497P06794K21886K04373K83757M69988L50072R55500
14535E886508J221080K049283L615170O028246J1282438O595793j5947848q640907
$$ plain form
14527 12089763 7318626 4869791 4212055 3921701 4065469 4354775 4610842 3276061 2748996
14518 2748996 2381198 2267607 2436937 2215295 2426053 2146573 2531699 2422125 2275182
14509 2275182 2353472 2667143 2700564 2276948 2397260 2468676 2347923 2693741 2869262 2474616
14499 2474616 2679056 2502322 2866820 2890203 2930231 2437023 2758554 2934810 2863569 3019424
14489 3019424 3054765 3064288 3261803 2718035 3254146 2921780 3156162 3582143 2999118 3495817
14479 3495817 3553408 3384433 3444816 3342893 3640405 3463188 3283340 3837859 3854258 3899454
14469 3899454 3706293 3592052 3918558 3934503 4054627 3915220 3978901 4252097 4035866 3961256
14459 3961256 4200347 4337585 4450419 4062698 4334781 4233797 4398666 4421991 4158149 4644767
$$ packed form
14527A2089763m771137k448835o57736k90354J43768K89306K56067j334781n27065
14518B748996l67798j13591J69330k21642K10758k79480L85126j09574j46943
14509B275182P8290L13671L3421m23616J20312P1416j20753L45818J75521l94646
14499B474616K04440j76734L64498K3383M0028m93208L21531J76256p1241J55855
14489C019424L5341R523J97515n43768N36111l32366K34382M25981n83025M96699
14479C495817N7591j68975O0383j01923K97512j77217j79848N54519J6399M5196
14469C899454j93161j14241L26506J5945J20124j39407O3681K73196k16231p4610
14459C961256K39091J37238J12834l87721K72083j00984J64869K3325k63842M86618
$$ plain form
14449 4644767 4757479 4872806 4823497 4762964 4718578 4817676 5020253 5013295 5180977 5239037 5063694
14438 5063694 5333031 5400651 5554947 5453721 5414619 5573863 5544597 5651472 5875190 5815507
14428 5815507 6051273 6174116 5962923 6274441 6107680 6517961 6393964 6586169 6739433
14419 6739433 6730349 6650761 6905750 7092538 7024166 7065262 7412266 7304401 7613633 7724743
14409 7724743 7769234 8102175 8190675 8586024 8159884 8576901 8486243 9098967 8951370 8878190
14399 8878190 8935553 8900614 8843985 9376370 9556656 9787431 10281093 9837016 10214526 10539394
14389 10539394 10723185 10734026 10756025 11100124 10827618 11290982 11027150 11125483 11611492 11755538
14379 11755538 11795116 12158322 11956704 12347796 12639448 12934726 13019846 13535734 13799328 13963035
$$ packed form
14449D644767J12712J15327m9309o0533m4386R9098K02577o958J67682N8060j75343
14438E063694K69337O7620J54296j01226l9102J59244k9266J06875K23718n9683
14428E815507K35766J22843k11193L11518j66761M10281j23997J92205J53264
14419F739433r084p9588K54989J86788o8372M1096L47004j07865L09232J11110
14409G724743M4491L32941Q8500L95349m26140M17017r0658O12724j47597p3180
14399H878190N7363l4939n6629N32385J80286K30775M93662m44077L77510L24868
14389A0539394J83791J0841K1999L44099k72506M63364k63832R8333M86009J44046
14379A1755538L9578L63206k01618L91092K91652K95278Q5120N15888K63594J63707
$$ plain form
14369 13963035 14267761 14654842 14825412 14968354 15403496 15796256 15658588 16025829 16475829
14360 16475829 16513085 16818729 17139059 17703091 17622661 17975868 18724164 18920541 19465689 20004934
14350 20004934 20249625 20691426 21261823 21545075 22207963 22274724 23020179 23170958 23871162
14341 23871162 24133957 25280849 25477235 26141866 26814128 27439448 28225628 28624047 29439336
14332 29439336 30266673 31276937 31929656 32564767 33497408 34471072 35710842 36300814 37228915
14323 37228915 38317207 39666653 40649115 42024011 42890560 44384954 45676073 47211791
14315 47211791 48448946 50271458 52244687 53961174 54918815 57419937 59442957 61177375
14307 61177375 63607004 66129835 68544571 71047399 73872779 76358062 79548520 82960181
$$ packed form
14369A3963035L04726L87081J70570J42942M35142L92760j37668L67241M50000
14360A6475829L7256L05644L20330N64032q0430L53207P48296J96377N45148N39245
14350B0004934K44691M41801N70397K83252O62888O6761P45455J50779P00204
14341B3871162K62795J146892J96386O64631O72262O25320P86180L98419Q15289
14332B9439336Q27337J010264O52719O35111R32641R73664J239770N89972R28101
14323C7228915J088292J349446R82462J374896Q66549J494394J291119J535718
14315D7211791J237155J822512J973229J716487R57641K501122K023020J734418
14307F1177375K429629K522831K414736K502828K825380K485283L190458L411661
$$ plain form
14299 82960181 85748949 89340180 92851663 96775629 100767012 105222135 110035415 114435498
14291 114435498 119691970 125161729 131143472 137372593 144250349 151257010 158491585 166068536
14283 166068536 174208889 183280359 192657126 202516248 213010230 224255930 235684335
14276 235684335 247985545 261211178 274630712 288617954 303288024 318493547 333492174
14269 333492174 348404845 363066804 378029556 392282891 405606862 417446546 427975786
14262 427975786 437864138 447193005 455042253 461862107 465824168 467306166 468849544 469929647
14254 469929647 469204485 461323688 454882800 448377945 438274170 424794428 411431156 398277187
14246 398277187 385027906 370440062 355656596 340809795 325712217 311378523 297005426
$$ packed form
14299H2960181K788768L591231L511483L923966L991383M455123M813280M400083
14291A14435498N256472N469759N981743O229121O877756P006661P234575P576951
14283A66068536Q140353R071470R376767R859122J0493982J1245700J1428405
14276B35684335J2301210J3225633J3419534J3987242J4670070J5205523J4998627
14269C33492174J4912671J4661959J4962752J4253335J3323971J1839684J0529240
14262D27975786R888352R328867P849248O819854L962061J481998J543378J080103
14254D69929647p25162p880797o440888o504855j0103775j3479742j3363272j3153969
14246C98277187j3249281j4587844j4783466j4846801j5097578j4333694j4373097
$$ plain form
14239 297005426 283354979 270984380 258525122 246540964 234760956 223562266 213164378
14232 213164378 203360934 192884463 183424565 174110193 165347543 157572582 149815019 142772277
14224 142772277 136171516 129536643 123873827 118326874 113226653 108746129 103831068 99136401
14216 99136401 95826822 91849372 88304214 84525406 81372808 78506779 75323598 72716271
14208 72716271 69819181 67227648 64755575 62868955 61079507 58804455 56809304 54812842
14200 54812842 53125116 52005450 50158087 48894452 46934052 45511011 44187061 43190201
14192 43190201 42255474 40907034 40069533 38665512 37414591 36354147 35628667 34877904 33599260
14183 33599260 32734292 31913097 31012896 30509788 29799799 29134699 28161100 27474634 27000220
$$ packed form
14239B97005426j3650447j2370599j2459258j1984158j1780008j1198690j0397888
14232B13164378r803444j0476471r459898r314372q762650p774961p757563p042742
14224A42772277o600761o634873n662816n546953n100221m480524m915061m694667
14216I9136401l309579l977450l545158l778808l152598k866029l183181k607327
14208G2716271k897090k591533k472073j886620j789448k275052j995151j996462
14200E4812842j687726j119666j847363j263635j960400j423041j323950r96860
14192D3190201r34727j348440q37501j404021j250921j060444p25480p50763j278644
14183C3599260q64968q21195r00201n03108p09989o65100r73599o86466m74414
$$ plain form
14174 27000220 26151229 25866074 25054159 24724951 23913313 23255731 22588197 22081364 21821481
14165 21821481 21390548 20987953 20595202 20217023 19834991 19083926 19010693 18332711 18353889 17593773
14155 17593773 17227963 16828723 16819058 16275402 16183597 15513050 15400915 15277559 14920713 14656002
14145 14656002 14259339 14122841 13712746 14037092 13730242 13215287 13016053 12509771 12389381
14136 12389381 12393444 12284718 12009617 11959459 11715946 11574932 11225872 10936586 10794126 10715169
14126 10715169 10518945 10011977 10024642 9951110 9909503 9941428 9678870 9772966 9515314 9207911
14116 9207911 8980455 9076022 8487105 8825349 8493811 8299563 8780637 8620897 7996336 7898887
14106 7898887 7829852 7654541 7777792 7434629 7613958 7610583 7343182 7412740 7052655 6725410
$$ packed form
14174B7000220q48991k85155q11915l29208q11638o57582o67534n06833k59883
14165B1821481m30933m02595l92751l78179l82032p51065p3233o77982K1178p60116
14155A7593773l65810l99240r665n43656r1805o70547j12135j23356l56846k64711
14145A4656002l96663j36498m10095L24346l06850n14955j99234n06282j20390
14136A2389381M063j08726k75101n0158k43513j41014l49060k89286j42460p8957
14126A0715169j96224n06968J2665p3532m1607L1925k62558R4096k57652l07403
14116I207911k27456R5567n88917L38244l31538j94248M81074j59740o24561r7449
14106G898887o9035j75311J23251l43163J79329l375k67401O9558l60085l27245
$$ plain form
14096 6725410 6709279 7050325 6904159 6751305 6327246 6397493 6539856 6355829 6395850 6180940
14086 6180940 6283813 6345108 6178229 5919360 6020637 5681724 5604607 5434604 5838435 5522599
14076 5522599 5521251 5281562 5269238 5273623 5134441 5316016 5117766 5046336 4985141 4844957 4615576
14065 4615576 4824606 5043670 4488359 4737897 4782098 4500401 4629568 4692860 4395007 4360965
14055 4360965 4415984 4267824 4208719 3955423 4164580 4314424 4364767 4124911 4375869 4660558
14045 4660558 4253401 3834714 3962717 3854561 4061793 4003106 3621813 3641944 3816006 3776013
14035 3776013 3806798 3337462 3394251 3395416 3451354 3352274 3225750 3792960 3046923 3366249
14025 3366249 3271610 3435215 3282201 3326738 3097315 3066319 3150630 3285956 3192046 3137252
$$ packed form
14096F725410j6131L41046j46166j52854m24059P0247J42363j84027M0021k14910
14086F180940J02873O1295j66879k58869J01277l38913p7117j70003M03831l15836
14076E522599j348k39689j2324M385j39182J81575j98250p1430o1195j40184k29381
14065D615576K09030K19064n55311K49538M4201k81697J29167O3292k97853l4042
14055D360965N5019j48160n9105k53296K09157J49844N0343k39856K50958K84689
14045D660558m07157m18687J28003j08156K07232n8687l81293K0131J74062l9993
14035C776013L0785m69336N6789J165N5938r9080j26524N67210p46037L19326
14025C366249r4639J63605j53014M4537k29423l0996Q4311J35326r3910n4794
$$ plain form
14015 3137252 2809076 2976956 2979815 2993415 2923734 2991964 3001301 2807547 2867936 2597187 2713593
14004 2713593 2703991 2541022 2760985 2654592 2469197 2486226 2526742 2218430 2666492 2451793
13994 2451793 2616852 2566744 2478796 2633272 2434054 2336713 2256801 2298183 2312004 2312520 2168662
13983 2168662 2491092 2270846 2650314 2541594 2729249 2642839 3198047 3477790 4138971 5622265
13973 5622265 8459653 13439831 23755880 37554383 25257847 16230002 10646173 7696474
13965 7696474 5927639 4967003 4464191 3625526 3784263 3386845 3548502 3014244 2813661
13956 2813661 2843630 2791394 2990867 2650396 2348530 2361392 2509518 2505988 2425543 2347520 2154868
13945 2154868 2428059 2183563 1824265 2251249 1983120 1971207 1949169 2146600 1972265 1976543
$$ packed form
14015C137252l28176J67880K859J3600o9681O8230R337j93754O0389k70749J16406
14004B713593r602j62969K19963j06393j85395J7029M0516l08312M48062k14699
13994B451793J65059n0108q7948J54476j99218r7341p9912M1382J3821N16j43858
13983B168662L22430k20246L79468j08720J87655q6410N55208K79743O61181J483294
13973E622265K837388M980178J0316049J3798503j2296536r027845n583829k949699
13965G696474j768835r60636n02812q38665J58737l97418J61657n34258k00583
13956B813661K9969n2236J99473l40471l01866J2862J48126l530q0445p8023j92652
13945B154868K73191k44496l59298M26984k68129j1913k2038J97431j74335M278
$$ plain form
13935 1976543 1741300 2041556 1723645 1892777 2337012 1618615 1908503 1705154 2159083
13926 2159083 1877241 1627361 2199380 1657392 1888222 1733741 1704059 2109113 1583209 1372626
13916 1372626 1505836 1911429 1634820 1958131 1291803 1233285 1453639 1941920 1803778 1658205
13906 1658205 1482056 1473358 1665806 1467429 1635355 1346602 1669404 1325855 1292649 1633873
13896 1633873 1493199 1595422 1598987 1441700 1281356 1340246 1316737 1425029 1300154 1488036
13886 1488036 1434910 1192184 1580107 1230559 1075592 1330832 1272113 1233694 1612916 1480893
13876 1480893 1361992 1451351 1593133 1674359 1225262 1004914 1495888 1102712 1213393 1221321
13866 1221321 1033012 1072320 994012 1051074 1023484 885426 1080842 1144104 1221594 1175177 1216006
$$ packed form
13935A976543k35243L00256l17911J69132M44235p18397K89888k03349M53929
13926B159083k81842k49880N72019n41988K30830j54481k9682M05054n25904k10583
13916A372626J33210M05593k76609L23311o66328n8518K20354M88281j38142j45573
13906A658205j76149q698J92448j98377J67926k88753L22802l43549l3206L41224
13896A633873j40674J02223L565j57287j60344N8890k3509J08292j24875J87882
13886A488036n3126k42726L87923l49548j54967K55240n8719l8419L79222j32023
13876A480893j18901Q9359J41782Q1226m49097k20348M90974l93176J10681P928
13866A221321j88309L9308p8308N7062k7590j38058J95416O3262P7490m6417M0829
$$ plain form
13855 1216006 1391653 1134568 1130876 1251133 1250019 903606 1043801 1121536 921701 833913
13845 833913 1080463 1122418 1384541 1187897 1183518 925010 1437815 1079750 1110145 1001943
13835 1001943 1089234 1032447 1293013 849228 1025475 1211784 1422418 1163938 1016150 1053849
13825 1053849 1049958 1166538 952719 928403 1013094 823067 969553 555203 827606 949697
13815 949697 814518 975949 834713 914512 790461 460151 1122859 778047 536429 633244
13805 633244 950111 929740 905758 840963 766794 664379 846964 749095 851049 1237665
13795 1237665 822181 628220 839378 858436 777585 904773 676532 1235565 973379 822589
13785 822589 1031618 620106 894554 897648 792474 861512 927593 992106 642494 633127 777987
$$ packed form
13855A216006J75647k57085l692J20257j114l46413J40195P7735j99835q7788
13845H33913K46550M1955K62123j96644m379k58508N12805l58065L0395j08202
13835A001943Q7291n6787K60566m43785J76247J86309K10634k58480j47788L7699
13825A053849l891J16580k13819k4316Q4691j90027J46486m14350K72403J22091
13815I49697j35179J61431j41236P9799j24051l30310O62708l44812k41618R6815
13805F33244L16867k0371k3982o4795p4169j02415J82585r7869J01954L86616
13795A237665m15484j93961K11158J9058q0851J27188k28241N59033k62186j50790
13785H22589K09029m11512K74448L094j05174O9038O6081O4513l49612r367J44860
$$ plain form
13774 777987 1006561 621605 656193 1145211 561438 560797 691090 468365 461234 965525 740460
13763 740460 604449 643017 659641 734390 597820 598491 720196 774844 363026 822976 793132
13752 793132 756398 369241 692062 989485 429589 315309 520100 495229 526415 685992
13742 685992 878285 738618 435753 841562 535190 739815 540600 590165 418885 638746
13732 638746 405602 350253 518673 693861 593976 668730 730894 302295 667290 832334
13722 832334 565938 760217 773224 369853 547406 654840 562751 789364 749189 498358
13712 498358 683056 528430 531981 397942 380168 498220 701018 592925 1010709 675128
13702 675128 402461 695210 445204 401603 780023 1048087 433544 598648 236367 611333
$$ packed form
13774G77987K28574l84956L4588M89018E61438o41J30293k22725p131N04291k25065
13763G40460j36011L8568J6624P4749j36570O71J21705N4648C63026M59950k9844
13752G93132l6734C69241L22821K97423D29589j14280K04791k4871L1186J59577
13742F85992J92293j39667l02865M05809l06372K04625j99215M9565j71280K19861
13732F38746k33144n5349J68420J75188r9885P4754O2164C02295L64995J65044
13722H32334k66396J94279J3007C69853J77553J07434r2089K26613m0175k50831
13712D98358J84698j54626L551j34039j7774J18052K02798j08093M17784l35581
13702F75128k72667K92749k50006m3601L78420K68064D33544J65104B36367L74966
$$ plain form
13692 611333 135371 365770 466800 648903 400261 629783 469916 518203 418010 526787
13682 526787 437633 351645 322865 503243 568273 407839 494406 478025 459594 499567 690376
13671 690376 751900 419228 389846 498773 249192 547232 665191 806594 206520 421920
13661 421920 582036 463122 312042 321599 704839 258276 543122 226065 318659 377422
13651 377422 625378 331298 838183 632279 390128 101960 573595 432483 456689 485417
13641 485417 408377 398508 417941 559419 199466 128202 174493 246778 546472 316057 372372
13630 372372 211305 380596 489240 512063 454963 881501 218413 481742 373325 235622
13620 235622 359415 418977 347180 387142 183531 271116 578095 611628 540540 665552 548470
$$ packed form
13692F11333A35371K30399J01030J82103k48642K29522j59867M8287j00193J08777
13682E26787q9154q5988k8780J80378O5030j60434Q6567j6381j8431L9973J90809
13671F90376O1524l32672k9382J08927B49192K98040J17959J41403B06520K15400
13661D21920J60116j18914j51080R557L83240B58276K84846B26065R2594N8763
13651C77422K47956k94080N06885k05904k42151A01960M71635j41112K4206K8728
13641D85417p7040r869J9433J41478A99466p1264M6291P2285K99694k30415N6315
13630C72372j61067J69291J08644K2823n7100M26538B18413K63329j08417j37703
13620B35622J23793N9562p1797L9962A83531Q7585L06979L3533p1088J25012j17082
$$ plain form
13609 548470 304166 494067 319475 350152 587588 319056 277434 452395 409079 447510
13599 447510 456557 374408 250201 320884 363232 290761 324861 483346 154292 622361 198686
13587 344998 4445 48316 -69871 220582 429559 158559 121816 501631 305698 237651 786410
13576 786410 467017 621947 249945 169476 404070 191920 377168 327212 240134 269428
13566 269428 333285 148383 545814 180651 186313 317497 276315 329118 432793 189765
13555 275198 -172027 107242 98892 283903 328397 480455 -6228 463655 253645 177191 343500
13544 343500 628657 181534 402206 325340 304138 158802 203010 551753 379815 376925
13534 376925 211066 645502 271532 315986 290692 466384 380720 310155 289691 200700 148847
$$ packed form
13609E48470k44304J89901j74592L0677K37436k68532m1622J74961m3316L8431
13599D47510R047q2149j24207P0683M2348p2471L4100J58485A54292M68069A98686
13587C44998D445M3871f9871B20582K08977A58559l6743L79815j95933o8047N48759
13576G86410l19393J54930B49945q0469K34594A91920J85248m9956q7078K9294
13566B69428O3857A48383L97431A80651N662J31184m1182N2803J03675A89765
13555B75198a72027A07242q350J85011M4494J52058f228D63655k10010p6454J66309
13544C43500K85157A81534K20672p6866k1202j45336M4208L48743j71938k890
13534C76925j65859M34436B71532M4454k5294J75692q5664p0565k0464q8991n1853
$$ plain form
13523 148847 134844 425138 254186 88151 384016 446563 635542 -39422 116678 573054
13513 573054 1402 162575 486461 48000 201620 80045 80716 187756 -66284 397449 409932
13502 409932 50847 523531 480510 226042 215049 53548 368379 141337 469120 379318
13492 379318 365011 287531 251969 448945 251754 621960 325166 164797 295754 253235
13482 253235 265322 224703 92467 217295 198087 327945 286276 228906 62824 221954 15935
13470 184009 131028 952 525022 196906 145769 674427 397389 434311 27088 316681 237643
13459 237643 241396 395814 81968 99518 287515 138551 25362 147509 436209 139935
13448 197347 113960 362454 107461 464842 357527 405798 96148 582426 229283 209572
$$ packed form
13523A48847j4003K90294j70952H8151K95865O2547J88979c9422A16678M56376
13513E73054A402J61173L23886D8000J53620H0045O71J07040f6284C97449J2483
13502D09932E0847M72684m3021B26042j0993E3548L14831A41337L27783q9802
13492C79318j4307p7480l5562J96976j97191L70206k96794j60369J30957m2519
13482B53235J2087m0619I2467J24828j9208J29858m1669n7370F2824J59130A5935
13470A84009n2981I52N24070A96906n1137N28658k77038L6922B7088K89593p9038
13459B37643L753J54418H1968J7550J87997A38551B5362J22147K88700A39935
13448A97347q3387K48494A07461L57381j07315M8271I6148M86278B29283j9711
$$ plain form
13438 209572 177263 110564 209744 320601 316833 -164222 328172 260674 216174 171080 118763
13427 118763 267444 -56548 380019 372472 55592 435962 149778 72911 -46975 92524 54994
13416 54994 220687 264265 277564 -268412 88200 191149 247064 351536 851 135086 -78045
13404 231125 331351 243329 193280 119944 577902 164366 -91679 214322 206131 526408 90414
13392 67677 303315 506816 187883 462449 252346 -19036 -8858 -109341 288304 337284
13382 337284 316436 198755 139537 -102660 21284 226193 -132353 363309 75678 -281074
13371 145545 -20964 66150 203753 439142 120165 49570 288042 136474 114462 284043
13361 284043 237514 149247 222311 -43841 -35730 281661 122292 456260 17192 199198 174590
$$ packed form
13438B09572l2309o6699R9180J10857l768a64222C28172o7498m4500m5094n2317
13427A18763J48681e6548C80019p547E5592L80370A49778G2911d6975I2524l7530
13416E4994J65693M3578J3299b68412H8200J02949N5915J04472H51J34235g8045
13404B31125J00226q8022n0049p3336M57958A64366i1679B14322q191L20277I0414
13392F7677K35638K03501A87883K74566k10103a9036h858j00483B88304M8980
13382C37284k0848j17681n9218a02660B1284K04909a32353C63309G5678b81074
13371A45545b0964F6150J37603K35389A20165D9570K38472A36474k2012J69581
13361B84043m6529q8267P3064d3841Q111B81661A22292L33968A7192J82006k4608
$$ plain form
13350 174590 161691 129632 172689 172928 114486 186060 159150 158825 192031 296486 311300 344591
13338 344591 147794 189854 6004 68246 290303 156549 258428 491991 77560 33026 69288
13327 69288 209181 -120199 263766 305765 410478 266859 218206 433167 153265 189650
13317 189650 189196 202509 342650 398796 204390 181733 173141 -208097 50071 46376 218393
13306 218393 -13416 316385 423870 293087 -51268 -260739 -33085 59138 315284 228989
13296 228989 269457 328681 67788 205347 -306669 91381 -255017 118604 353233 87589
13285 146793 13371 222606 -103361 158124 357302 24555 39669 -49276 165636 360392
13275 360392 106221 42829 173984 27937 322611 -68499 -135675 89721 113191 -28127 232672
$$ packed form
13350A74590j2899l2059M3057K39n8442P1574k6910l25L3206J04455J4814L3291
13338C44591A47794M2060F004O2242K22057j33754J01879K33563G7560C3026L6262
13327F9288J39893a20199B63766M1999J04713j43619m8653K14961A53265L6385
13317A89650m54J3313J40141N6146j94406k2657q592b08097E0071l695J72017
13306B18393a3416C16385J07485j30783e1268k09471c3085E9138K56146q6295
13296B28989M0468N9224F7788J37559c06669I1381b55017A18604K34629H7589
13285A46793A3371K09235a03361A58124J99178B4555J5114d9276A65636J94756
13275C60392A06221D2829J31155B7937K94674f8499o7176H9721K3470b8127B32672
$$ plain form
13263 194592 176375 105110 365029 534109 47634 83656 238444 -74931 114015 239967
13253 239967 242943 81855 58115 46980 -490 -110464 -173293 74651 104486 188573 137209 -162365
13240 134216 1828 171170 24881 -74161 189890 343627 32683 -234181 129182 288005
13230 288005 28207 15159 469227 88508 110381 11712 76491 174459 110990 192576 8853
13218 266297 331589 89270 278181 5798 -152254 155896 7483 -15483 -56769 193608 -8620
13206 -64414 25752 222494 72211 -142997 517 -101850 -237850 205343 -96875 -71141 159539
13194 247459 358409 121710 265036 33509 93548 406652 78539 48081 -30801 -164173
13184 -164173 -17188 33898 192520 239527 14855 28482 -71336 31760 -85869 320614 91109
$$ packed form
13263A94592j8217p1265K59919J69080D7634L6022J54788g4931A14015J25952
13253B39967K976H1855k3740j1135d90j09974o2829G4651K9835Q4087n1364a62365
13240A34216A828J69342B4881g4161A89890J53737C2683b34181A29182J58823
13230B88005B8207j3048M54068H8508K1873A1712O4779R7968o3469Q1586H853
13218B66297O5292H9270J88911E798a52254A55896G483a5483m1286A93608h620
13206f4414B5752J96742G2211a42997E17a01850j36000B05343i6875K5734A59539
13194B47459J10950A21710J43326C3509O0039L13104G8539l0458c0801j33372
13184a64173a7188C3898J58622M7007A4855J3627g1336C1760h5869C20614I1109
$$ plain form
13172 174106 -63235 -381781 48739 256748 -85563 66977 37991 70095 -80830 31889 243266
13161 243266 -7775 106078 193585 166375 -146817 -208246 264844 68431 99742 -340271 166884
13149 139608 24173 250725 -47075 177759 -276471 -27827 96037 1595 108663 138438 111295
13138 111295 293025 227462 153512 67596 206669 162290 91608 153272 62846 355951 -58863
13126 -13825 330873 30616 -125986 245134 -120924 273169 111892 -115971 -207490 105849
13115 244731 59495 108272 497857 100921 75222 55271 -100349 -73159 -24098 -125366 274140
13103 103959 28525 224473 201863 58581 -232431 -95884 315899 -195743 87965 35870 49220
13092 49220 -58632 -100930 -71133 303369 -76135 1123 -53361 -168499 203799 245958 3294
$$ packed form
13172A74106f3235l18546D8739K08009h5563F6977k8986L2104h0830C1889K11377
13161B43266g775A06078Q7507k7210a46817o1429B64844F8431L1311c40271A66884
13149A39608B4173K26552d7075A77759b76471b7827I6037A595J07068K9775k7143
13138A11295J81730o5563p3950F7596J39073m4379p0682O1664F2846K93105e8863
13126a3825C30873C0616a25986B45134a20924B73169A11892a15971r1519A05849
13115B44731E9495M8777L89585A00921k5699j9951a00349K7190b4098j01268B74140
13103A03959B8525J95948k2610E8581b32431i5884C15899a95743H7965C5870J3350
13092D9220e8632m2298K9797C03369g6135A123e3361j15138B03799M2159C294
$$ plain form
13080 165714 118951 264017 176082 300202 70182 -96 114522 -82546 310822 204105 -155057
13068 -15797 -22819 -56624 -350544 -892 161541 266945 244419 278731 -63553 -366927 -189652
13057 -189652 -97054 -182693 -43063 -109494 -6244 248778 223165 67486 240374 -179487 117093
13045 229400 -123202 161260 172890 5979 175892 23573 459375 120620 300702 -133034
13034 180668 198474 -126251 145888 263230 54677 504581 230272 -218858 -122570 123746
13023 192149 433976 -8372 460682 -283716 13593 213514 221576 135404 -98432 -1662 410500
13011 212163 -31416 -92015 278200 84508 293135 59489 502239 211206 -39867 93128 10543
12999 115532 -209171 10618 198015 320124 56647 131540 233450 109776 357644 295225
$$ packed form
13080A65714m6763J45066q7935J24120G0182i6A14522h2546C10822j06717a55057
13068a5797p022l3805k93920h92A61541J05404k2526L4312f3553l03374J77275
13057a89652R2598q5639d3063o6431f244B48778k5613F7486J72888a79487A17093
13045B29400a23202A61260J1630E979J69913B3573M35802A20620J80082a33034
13034A80668J7806a26251A45888J17342E4677M49904B30272b18858R6288A23746
13023A92149K41827h372D60682b83716A3593J99921Q062q6172i8432a662D10500
13011B12163c1416o0599B78200H4508K08627E9489M42750B11206c9867I3128A0543
12999A15532b09171A0618J87397J22109E6647P4893J01910A09776K47868o2419
$$ plain form
12989 295225 -136747 136004 341293 28974 227220 -2900 -47432 14859 -478652 330063
12978 189231 64709 167536 176265 -143253 -466284 84624 -152466 109689 38324 152018
12968 152018 -120992 -27932 143494 92230 163327 95035 -141714 84514 -148613 -81517 20919
12956 -95986 19575 -194430 137206 224520 180087 -212218 -39366 -80554 -113838 13318 38801
12945 38801 -101725 91421 171884 119527 -27042 -35928 -168839 158588 -172843 102782 257899
12934 257899 -286029 28953 -2316 825 163177 35464 69972 -154383 -98810 301542 126314
12922 124152 -82625 64507 341481 203660 -388049 95789 143883 168621 195260 -174341 -277882
12911 -277882 66829 -12267 -66157 -129605 38461 87872 117961 -113410 118757 163994 -113830
$$ packed form
12989B95225a36747A36004K05289B8974J98246b900m4532A4859d78652C30063
12978A89231F4709J02827Q729a43253l23031H4624a52466A09689C8324J13694
12968A52018a20992b7932A43494n1264P1097o8292a41714H4514a48613O7096B0919
12956i5986A9575a94430A37206Q7314m4433b12218c9366m1188l3284A3318K5483
12945C8801a01725I1421Q0463n2357b7042q886j32911A58588a72843A02782J55117
12934B57899b86029B8953b316H25J62352C5464L4508a54383N5573C01542A26314
12922A24152h2625F4507K76974j37821c88049I5789M8094K4738K6639a74341j03541
12911b77882F6829a2267n3890o3448C8461M9411L0089a13410A18757M5237a13830
$$ plain form
12899 144978 -4627 145584 -261947 -47977 156791 -166437 57220 189784 21697 315473
12889 315473 -78304 -469940 -129595 -129706 124562 -236858 -78192 81578 -220867 -211534 -48364
12877 -108137 251721 -44865 -237175 64514 -271987 -147988 31244 -417060 219577 119536
12867 119536 170408 38838 -153428 138369 319069 -146876 -268076 -223191 28717 -140359
12856 324690 -81866 -123286 -23426 -137064 -93386 3742 75937 260652 -127208 -230947 52852
12844 -101126 244198 77809 -41839 -166544 5487 -132455 79315 76467 277730 -237725 -59631
12832 -51448 -90525 155091 88651 -43000 59811 -41044 -29379 480416 -163255 129104 207009
12821 207009 199684 -108588 -334487 280537 -232964 -49234 966 -131988 -250619 67984 40630
$$ packed form
12899A44978d627A45584b61947d7977A56791a66437E7220J32564B1697K93776
12889C15473g8304l91636a29595j11A24562b36858g8192H1578b20867R333d8364
12877a08137B51721d4865j92310F4514b71987J23999C1244d17060B19577j00041
12867A19536N0872C8838a53428A38369J80700a46876j21200M4885B8717a40359
12856C24690h1866m1420b3426j13638M3678C742P2195J84715a27208j03739E2852
12844a01126B44198G7809d1839j24705E487a32455G9315k848K01263b37725e9631
12832e1448l9077A55091o6440d3000E9811d1044J1665D80416a63255A29104P7905
12821B07009p325a08588k25899B80537b32964d9234I66a31988j18631F7984k7354
$$ plain form
12810 40630 -189189 -210612 46088 -56168 -200808 -38250 -181966 204874 27004 196600 -228406
12798 -134808 -65329 38739 -76809 36212 -35604 -212181 -64952 43587 89773 -8219 -67499
12787 -67499 92795 -173277 -8121 61028 29831 7473 -29184 -34792 3665 138931 114655 171267
12775 171267 29772 131348 -56308 137953 -196666 -210340 9980 -110951 150461 160597 100554
12764 100554 90901 7994 67196 -156329 192219 11242 -79636 37362 155057 26129 -65660
12752 137201 37705 16302 -72689 -178040 136292 9364 59257 222749 183645 177651 -100679
12740 29155 39277 77473 42686 -132609 -102972 -184062 265974 -76814 8958 -322010 -213464
12729 -213464 105829 255682 41651 80098 -3378 74727 -77553 236042 326999 371293 80909
$$ packed form
12810D0630a89189k1423D6088e6168j44640c8250j43716B04874B7004J69596b28406
12798a34808f5329C8739g6809C6212c5604j76577f4952D3587M6186h219n9280
12787f7499I2795a73277h121F1028B9831G473b9184n608C665J35266k4276N6612
12775A71267B9772J01576e6308A37953a96666j3674I980a10951A50461J0136o0043
12764A00554r653G994N9202a56329A92219A1242g9636C7362J17695B6129f5660
12752A37201C7705A6302g2689j05351A36292I364M9893J63492l9104n994a00679
12740B9155J0122L8196l4787a32609K9637q1090B65974g6814H958c22010J08546
12729b13464A05829J49853D1651L8447c378G4727g7553B36042R0957M4294H0909
$$ plain form
12717 40542 -14699 -135440 153244 185839 19881 -89412 108703 78630 -143577 39680 -163686
12705 -325557 66844 -158163 118886 188183 -127620 -126964 -20221 202373 -188557 -118886 -108110
12694 -108110 -168698 24057 464791 353625 262178 -29214 98007 2833 229440 191472 52440
12682 -4813 -96595 -58830 270838 132224 102929 53992 -18795 77816 -263400 10079 174341
12671 174341 -189356 -188348 147356 -80195 -59757 277713 -15357 126508 146132 -89774 -10540
12659 226774 447343 -209100 489129 -30585 17821 -191956 -370677 154876 -28213 -216327
12649 -216327 -55363 -154356 3278 63623 -231878 8895 -109055 484938 -52650 2757 121854
12638 121854 -352 91195 -65711 52537 318654 -180487 101788 48205 127901 -60292 179799
$$ packed form
12717D0542a4699j20741A53244L2595A9881h9412A08703l0073a43577C9680a63686
12705c25557F6844a58163A18886O9297a27620O56b0221B02373a88557O9671J0776
12694a08110o0588B4057M40734j11166r1447b9214I8007B833K26607l7968E2440
12682d813r1782L7765B70838A32224k9295m8937a8795G7816b63400A0079J64262
12671A74341a89356J008A47356h0195K0438B77713a5357A26508J9624h9774a0540
12659B26774K20569b09100D89129c0585A7821a91956j78721A54876b8213j88114
12649b16327e5363r8993C278O0345b31878H895a09055D84938e2650B757J19097
12638A21854c52I1195f5711E2537K66117a80487A01788D8205P9696f0292A79799
$$ plain form
12626 102857 -139865 120682 137765 -65173 -75799 119088 -158710 131768 204330 -85755
12615 160481 274341 345486 243709 160732 -304602 -53131 200560 62991 -234970 215797
12604 32418 -188031 103139 69067 263307 16027 159565 -36231 -209358 -253628 329369
12593 354648 35512 84157 -178874 -103381 109926 160141 -42742 237375 -20506 305420 35761
12581 -200690 -63280 3994 -395285 67285 232540 -20019 176297 -211990 91285 -201194 -207793
12570 -207793 -139182 -2975 153240 -183450 141060 -352896 213229 -75429 46600 -238548
12559 -131383 -105709 107466 133888 249 173111 -167316 464521 -188486 -64360 -203753 247008
12547 57340 131642 -166291 298428 -353984 -76999 31538 -244214 108836 -102214 535 48727
$$ packed form
12626A02857a39865A20682J7083f5173j0626A19088a58710A31768P2562h5755
12615A60481J13860P1145j01777q2977c04602e3131B00560F2991b34970B15797
12604C2418a88031A03139l4072J94240A6027J43538c6231j73127m4270C29369
12593C54648C5512M8645a78874P5493A09926N0215d2742B37375b0506C05420C5761
12581b00690f3280C994c95285F7285J65255b0019A76297b11990I1285b01194o599
12570b07793O8611b975A53240a83450A41060c52896B13229g5429D6600b38548
12559a31383K5674A07466K6422B49J72862a67316D64521a88486f4360j39393B47008
12547E7340P4302a66291B98428c53984g6999C1538b44214A08836a02214E35M8192
$$ plain form
12536 48727 230946 -53886 -129550 -21020 -172870 -491452 -26553 -331546 -183170 -260583 374382
12524 -187752 -154296 86136 -412411 -124278 83485 -89329 -243307 41932 285820 46087 50381
12513 50381 73815 69876 -180002 132041 -91613 406291 -36225 -202817 61779 266453 -85045
12501 -152278 -104227 -2500 -334233 174707 -191744 108787 173995 -108134 -166924 -38077 -6682
12489 -186083 -118169 179346 -83931 28554 118284 128946 -163360 -24857 86105 -77228 89205
12477 -1961 45039 89658 126125 -47362 -319273 -276197 35679 158486 85291 -110254 386293
12465 -276000 106795 142534 -175244 293643 -113041 -216584 104907 273797 -194994 -66219
12454 -77195 187427 -25238 -76893 450931 -203139 -38403 -307980 -88486 105020 -103277
$$ packed form
12536D8727J82219e3886p5664b1020j51850l18582b6553l04993J48376p7413C74382
12524a87752L3456H6136d12411a24278H3485h9329j53978D1932K43888D6087M294
12513E0381K3434l939a80002A32041i1613D06291c6225j66592F1779K04674h5045
12501a52278M8051b500l31733A74707a91744A08787O5208a08134n8790c8077f682
12489a86083O7914A79346h3931B8554Q9730J0662a63360b4857H6105g7228H9205
12477a961D5039M4619L6467d7362k71911M3076C5679J22807p3195a10254C86293
12465b76000A06795L5739a75244B93643a13041j03543A04907J68890a94994f6219
12454g7195A87427b5238n1655D50931b03139c8403k69577h8486A05020a03277
$$ plain form
12443 -350922 137569 -53689 -104437 -109010 290353 -187159 -157567 26694 62143 -358146 273497
12431 -47713 -192850 -138402 191824 -390901 46629 382522 -6161 -166303 326461 363843 147596
12419 -177086 -50824 62924 -272500 -255149 -96221 -77468 -222743 146085 -71910 -34794 -170706
12408 -170706 -4966 -10525 -241762 -184901 -330162 -85746 -159709 -381323 119295 60187 110731
12397 110731 -276245 193252 180405 139306 -45551 -176990 137158 -146647 -52471 279140
12386 -59951 -64559 -222222 -149382 -30839 -238 181606 132636 203909 -95722 25681 -66165 320845
12373 211583 -100612 198871 7505 114490 56252 -171458 318267 -106886 87191 126569
12363 126569 -71124 180238 113315 300005 50781 111733 -103510 -25700 79276 -49281 -101413
$$ packed form
12443c50922A37569e3689n0748m573B90353a87159K9592B6694L5449c58146B73497
12431d7713j45137N4448A91824c90901D6629L35893f161j60142C26461L7382A47596
12419a77086e0824F2924b72500J7351i6221J8753j45275A46085g1910c4794j35912
12408a70706d966n559k31237N6861j45261h5746p3963k21614A19295n9108N0544
12397A10731b76245A93252j2847m1099d5551j31439A37158a46647e2471B79140
12386e9951m608j57663P2840c0839b38A81606m8970P1273i5722B5681f6165C20845
12373B11583a00612A98871G505J06985E6252a71458C18267a06886H7191L9378
12363A26569g1124A80238o6923J86690E0781O0952a03510b5700G9276d9281n2132
$$ plain form
12352 -101413 -120763 -338877 177508 282878 111984 -52304 -108241 130571 121824 -170414
12341 -283491 28285 -18439 -12710 -36180 -129208 -87215 -146987 -86622 93439 186141 -315457
12329 -151502 68680 -222505 -247973 51327 -132424 -6276 -388400 155689 -128823 17700 -112591
12317 99097 367707 -65847 208199 564966 151828 -186653 314284 48997 5743 85641 127755
12306 127755 258392 -16249 221845 147112 114726 101229 -25830 -163974 64309 294816 -23550
12294 24547 234280 200986 -311419 60273 123901 -43680 -17091 266148 120790 50586 -64259
12282 81841 217519 2516 44896 87867 93612 -75593 26901 -236310 29408 168721 -51130
12270 -257447 17284 130961 163829 200631 206873 166910 -45698 -31823 399940 183212 110336
$$ packed form
12352a01413j9350k18114A77508J05370A11984e2304n5937A30571q747a70414
12341b83491B8285a8439N729k3470r3028M1993n9772O0365I3439R2702c15457
12329a51502F8680b22505k5468E1327a32424f276l82124A55689a28823A7700a12591
12317I9097K68610f5847B08199L56767A51828a86653C14284D8997E743P9898M2114
12306A27755J30637a6249B21845p4733l2386j3497b5830j38144F4309K30507b3550
12294B4547K09733l3294c11419F0273O3628d3680a7091B66148A20790E0586f4259
12282H1841J35678B516M2380M2971N745g5593B6901b36310B9408J39313e1130
12270b57447A7284J13677L2868L6802O242l9963d5698J3875C99940A83212p2876
$$ plain form
12259 110336 35043 2669 250066 377713 -238339 -45152 -35252 503855 154952 76511 17505
12247 -121789 68032 -49875 155235 187338 77602 178115 142050 -14073 150828 -32119 -94796
12236 -94796 101003 233581 154181 201171 205285 72932 45070 309549 -26304 353436 -129913
12224 118392 108493 299399 162736 345677 -54315 42118 83072 110456 117404 331593 218638
12213 218638 165572 228555 432012 84075 376493 125450 -67837 -60365 545313 21898 437864
12202 437864 335188 118481 194346 210348 370518 346588 50575 406851 94963 310260
12192 310260 -146703 60563 80908 218844 -57180 28065 101254 25811 -9345 106549 66201
12181 66201 328142 130431 261257 -40169 126180 -262956 132308 264479 302867 310969
$$ packed form
12259A10336C5043B669K47397J27647b38339d5152R900E03855A54952G6511A7505
12247a21789F8032d9875A55235L2103G7602J00513l6065a4073A50828c2119o2677
12236i4796A01003J32578p9400M6990M114G2932k7862K64479b6304C53436a29913
12224A18392r899J90906j36663J82941e4315D2118M0954K7384O948K14189j12955
12213B18638n3066O2983K03457H4075K92418A25450f7837P472E45313B1898M15966
12202D37864j02676A18481P5865J6002J60170k3930E0575L56276I4963K15297
12192C10260a46703F0563K0345J37936e7180B8065P3189B5811i345A06549m0348
12181F6201K61941A30431J30826d0169A26180b62956A32308J32171L8388Q102
$$ plain form
12171 310969 285040 213187 374560 332302 94447 -131505 35422 60523 154565 374186 107610
12159 -352516 210796 118335 22621 522534 -23559 -299351 -44875 396864 299554 335910 320498
12148 320498 199454 349392 360375 403312 239239 222978 256463 44859 -171257 42827 164148
12137 164148 247997 247505 -302983 102225 -12251 -211841 -28924 135411 120812 377034 75088
12125 134218 -200222 55881 189634 76386 41810 -179380 -87355 487712 115992 22399
12114 429350 43645 -152832 -31302 -26799 10397 36914 304376 148197 66242 -185629 26237
12102 476425 109563 -11294 307674 -21316 366979 136847 243834 -27339 224198 487024
12092 487024 89587 264880 192207 -63040 -136631 -380525 94597 241606 -137851 276376
$$ packed form
12171C10969k5929p1853J61373m2258I4447a31505C5422K5101R4042K19621A07610
12159c52516B10796r2461B2621M99913b3559k75792d4875C96864r7310L6356j5412
12148C20498j21044J49938J0983M2937j64073j6261L3485D4859a71257D2827J21321
12137A64148Q3849m92c02983A02225a2251j99590b8924A35411j4599K56222G5088
12125A34218b00222E5881J33753G6386l4576a79380h7355D87712A15992B2399
12114D29350D3645a52832c1302M503A0397K6517K67462A48197F6242a85629B6237
12102D76425A09563a1294C07674b1316C66979A36847J06987b7339B24198K62826
12092D87024H9587J75293p2673f3040p3591k43894I4597J47009a37851B76376
$$ plain form
12081 122503 -185146 381718 -91107 -40568 136807 166200 -168073 252094 -102223 -27197
12070 7100 -39815 30446 -42677 43596 150759 -200265 226281 329165 363592 131399 -50109
12058 296123 256182 131479 330745 205883 231788 265642 105749 170669 177662 199595 -72438
12046 81335 485262 285564 223776 140683 331375 235465 134478 198902 -31950 132603 289661
12035 289661 -65180 191633 60296 16508 223340 -53828 429778 -151640 -152306 75774 111445
12024 111445 188824 95731 -50792 66877 241276 36690 66904 -170453 -49248 -81610 -335262
12013 -335262 -25087 242759 39412 128800 -277060 -162551 72830 198093 -8610 -36780 85526
12001 -12007 -96181 -44658 113780 74348 -157200 -150388 310667 42827 326619 237710 -13868
$$ packed form
12081A22503a85146C81718i1107d0568A36807K9393a68073B52094a02223b7197
12070G100c9815C0446d2677D3596J07163b00265B26281J02884L4427A31399e0109
12058B96123l9941j24703J99266j24862K5905L3854A05749O4920O993K1933g2438
12046H1335M03927j99698o1788q3093J90692r5910j00987O4424c1950A32603J57058
12035B89661f5180A91633F0296A6508K06832e3828D29778a51640o66G5774L5671
12024A11445P7379r3093e0792F6877J74399C6690L0214a70453d9248l2362k53652
12013c35262b5087B42759C9412Q9388b77060J14509G2830J25263h610k8170H5526
12001a2007q4174d4658A13780l9432a57200O812C10667D2827K83792q8909a3868
$$ plain form
11989 -18572 442502 262801 58590 220492 277946 262495 100417 21471 206989 75945 59504
11978 59504 -215958 210902 31153 110235 -99543 34780 -258034 -98605 48979 353396 25974
11966 -196490 232153 -193764 139950 54320 199415 -79034 -11575 206331 -10242 120235
11955 -266675 47120 93521 -8979 -4707 41295 -147906 -219181 -6398 46810 -5411 204799 173114
11943 173114 179058 -446886 38018 -110763 59453 -142780 51443 -277837 69358 -213299 -163082
11932 -163082 -264260 41822 -40702 -425335 -235304 -89544 88100 -54058 -102669 63421 -304209
11920 84928 53730 -17726 38857 -295533 84367 -73449 206483 -178404 -63590 -190077 37211
11908 151219 167925 -252635 42401 143714 -228851 -127579 32568 119051 -185394 24548
$$ packed form
11989a8572D42502j79701E8590J61902N7454j5451A00417B1471J85518G5945j6441
11978E9504b15958B10902C1153P9082i9543C4780b58034i8605D8979L04417B5974
11966a96490B32153a93764A39950E4320J45095g9034a1575B06331a0242A20235
11955b66675D7120M6401h979M272D1295a47906p1275f398D6810e411B04799l1685
11943A73114N944d46886C8018a10763E9453a42780E1443b77837F9358b13299N0217
11932a63082j01178D1822d0702l84633J90031h9544H8100e4058m8611F3421c04209
11920H4928l1198a7726C8857b95533H4367g3449B06483a78404f3590j26487C7211
11908A51219J6706b52635D2401J01313b28851J01272C2568Q6483a85394B4548
$$ plain form
11897 65726 -43495 -52665 55621 182625 208093 44856 -176938 -65943 79688 163722 41216
11885 164662 -137523 -30938 -123382 -126929 -302244 314705 -316776 -223537 -158401 89204 135084
11874 135084 -27575 -185278 146316 56466 6662 -85021 -46880 -143914 56329 -255635 -107984
11862 -114614 -92775 137224 -276703 -208015 123949 316042 103538 132225 -302400 -219554
11852 -219554 -328013 292117 -63382 -166636 55442 23625 190021 -247654 -142448 -55137
11841 -27345 -479326 115655 -204131 141246 -72522 119733 -34754 51953 -18916 356359
11830 49707 274040 2613 -143959 47425 -32316 -252531 -255788 59731 -159684 145186 125537
11819 125537 -282281 133006 -275501 144852 -109027 287778 -178037 -288666 -222078 40947
$$ packed form
11897F5726d3495r170E5621J27004K5468D4856a76938f5943G9688Q4034D1216
11885A64662a37523c0938r2444l547j75315C14705c16776R3239O5136H9204M5880
11874A35084b7575j57703A46316E6466F662h5021L8141r7034E6329b55635a07984
11862a14614K1839A37224b76703O8688A23949J92093A03538K8687c02400Q2846
11852b19554j08459B92117f3382j03254E5442B3625J66396b47654J05206e5137
11841b7345m51981A15655b04131A41246g2522A19733c4754E1953a8916C56359
11830D9707K24333B613a43959D7425c2316k20215l257E9731a59684A45186j9649
11819A25537b82281A33006b75501A44852a09027B87778a78037j10629O6588D0947
$$ plain form
11808 -310389 226323 11395 -172702 -113015 335497 -24197 84832 -22998 3337 -7748 -47613
11797 -47613 231633 -63322 31720 -64479 -278578 -214153 56960 233500 44217 -107754 187953
11785 18728 -91702 -93574 -77558 -419539 -35710 -73506 18721 -193600 96288 -168908 -24746
11773 270282 115430 -49048 58975 -306917 86569 4697 -325158 32010 -146058 117633 -259242
11761 257633 -55629 -186765 -104789 20960 -103258 -56362 220621 -50258 -117737 -98211 -50544
11750 -50544 80641 197174 -368207 198032 -248535 83794 -283313 -186943 90661 -210775
11739 -232307 325640 -280643 -51492 -346283 108481 108294 -223027 202148 -125621 279324
11728 -93154 139711 56282 218348 38845 -133322 -218367 -381058 69929 -235563 -142233 -35636
$$ packed form
11808c10389B26323A1395a72702N9687C35497b4197H4832b2998C337g748l9865
11797d7613B31633f3322C1720f4479k14099O4425E6960J76540D4217a07754A87953
11785A8728i1702j872J6016l41981c5710l7796A8721a93600I6288a68908b4746
11773B70282A15430d9048E8975c06917H6569D697c25158C2010a46058A17633b59242
11761B57633e5629j31136Q1976B0960a03258M6896B20621e0258o7479J9526M7667
11750e0544H0641J16533c68207A98032b48535H3794b83313R6370I0661b10775
11739b32307C25640b80643e1492k94791A08481j87b23027B02148a25621B79324
11728i3154A39711E6282J62066C8845a33322q5045j62691F9929b35563R3330c5636
$$ plain form
11716 93295 89127 40760 511499 -34912 -14044 -75875 189844 -212270 177792 -135430 154600
11704 -344291 -264385 -12107 -79131 -80995 -28539 223080 123054 -113246 11143 412172 18806
11692 174141 510275 136242 -64214 -61085 311908 -19694 91331 -28078 -19546 69516 -106202
11680 566 -47564 279198 92313 196457 312275 83178 15214 143235 -103219 226350 -203107
11668 -75174 292152 123315 -313368 -65317 -157118 -35449 -53096 5755 -53091 -183989 292817
11656 -74044 6277 323241 246240 52174 -51911 -125944 335895 -72704 74550 -116093 -1445
11644 -69782 32981 -60490 10088 -71381 -85554 -46174 85912 -181259 -210434 -128415 15001
11632 -448085 -17123 2663 77768 253425 -334528 -168 -51317 -204350 -186188 -142706 140123
$$ packed form
11716I3295m168D0760M70739c4912a4044o1831A89844b12270A77792a35430A54600
11704c44291P9906a2107o7024j864b8539B23080j00026a13246A1143M01029A8806
11692A74141L36134A36242f4214L129C11908a9694I1331b8078Q532F9516a06202
11680E66d7564B79198I2313J04144J15818H3178A5214J28021a03219B26350b03107
11668g5174B92152A23315c13368f5317r1801c5449j7647E755e3091j30898B92817
11656g4044F277L16964p7001E2174e1911p4033C35895g2704G4550a16093a445
11644f9782C2981f0490A0088g1381j4173L9380H5912a81259k9175Q2019A5001
11632d48085a7123B663P5105J75657c34528a68n1149j53033J8162M3482A40123
$$ plain form
11620 -172459 -212794 -44481 4150 -173948 31055 -109466 -32116 -98975 -150507 -188532 -96189
11609 -96189 39243 11205 -201979 -236624 250094 245172 53328 -216492 -65655 -13882 279971
11597 97191 20691 -109607 199657 260453 84499 -109653 -73763 -55807 -205778 -175417 -18781
11585 221837 -228156 293281 -40421 -11241 127665 88951 99909 143792 -203134 -28639 284832
11573 -67679 51746 -22074 -186232 89178 189852 -67506 173136 166054 153549 315708 132961
11561 170384 239961 145884 76858 -27872 73617 134626 75848 5208 93941 294721 58660
11549 264908 159655 106291 152981 123593 -91599 123743 22167 216962 85922 -488359 -36488
11537 64780 112460 292373 124716 196281 308200 -355741 110144 241250 -64254 81936
$$ packed form
11620a72459m0335d4481D150a73948C1055a09466c2116o6859n1532l8025R2343
11609i6189C9243A1205b01979l4645B50094m922E3328b16492f5655a3882B79971
11597I7191B0691a09607A99657O0796H4499a09653L5890J7956j49971L0361a8781
11585B21837b28156B93281d0421a1241A27665l8714J0958M3883b03134b8639B84832
11573f7679E1746b2074j64158H9178J00674f7506A73136p082j2505J62159A32961
11561A70384O9577r4077o9026b7872G3617O1009n8778E208Q8733K00780E8660
11549B64908j05253n3364M6690k9388i1599A23743B2167J94795H5922d88359c6488
11537F4780M7680J79913A24716P1565J11919c55741A10144J31106f4254H1936
$$ plain form
11526 213692 208662 14735 -20013 -67842 75925 121206 -292409 213897 193300 6651 264363
11515 264363 242344 225734 114567 -183468 71543 -329917 196259 -20649 -88245 -229379
11505 -229379 -147206 -8822 160665 232772 140109 83727 37175 2318 -104059 -40065 -84307
11494 -84307 171490 -3695 -45471 -9276 -134563 127903 262050 144070 224467 138249 202603
11483 202603 -270193 -103918 56251 -108011 -182 -95014 167716 -98907 -251178 40502 287080
11472 287080 129321 48317 92911 235095 244313 34254 280663 465601 -40922 12945 163574
11461 163574 309060 296240 -329525 76300 361662 -134607 335216 -45133 -46082 -203452 399053
11449 362178 376361 283423 49782 -15429 -77335 121828 -40936 333868 251311 -37056 -148993
$$ packed form
11526B13692n030A4735b0013m7829G5925M5281b92409B13897k0597F651K57712
11515B64363k2019j6610j11167a83468G1543c29917A96259b0649o7596j41134
11505b29379Q2173h822A60665P2107r2663n6382C7175B318a04059d0065m4242
11494h4307A71490c695m1776i276j25287A27903J34147j17980Q0397q6218O4354
11483B02603b70193a03918E6251a08011a82r4832A67716i8907j52271D0502K46578
11472B87080A29321D8317M4594J42184R218C4254K46409J84938d0922A2945J50629
11461A63574J45486j2820c29525G6300K85362a34607C35216d5133r49j57370C99053
11449C62178J4183r2938D9782a5429o1906A21828d0936C33868q2557c7056j11937
$$ plain form
11438 -148993 -129060 123965 119123 -34653 243157 155028 -203869 -90973 220139 -112585 -178424
11427 -178424 128152 432233 159144 -43046 -128950 8879 -42578 -181317 183375 122921 -121842
11415 145819 -4915 -260525 30364 258885 300765 -97339 77472 237542 -214683 -50578 156136
11403 168790 -68759 -197530 -93602 -144632 319168 49153 -64340 -256301 -193843 103972 89093
11392 89093 -68044 -9295 -80473 155099 -92608 -111270 -235081 1983 -486158 253433 -21656
11380 133542 -171210 -32964 106577 295174 -352079 -31519 -72394 -19178 -180667 144037
11369 118458 21746 389 -275696 -4282 -41181 278284 112487 363583 -56305 162413 124253
11358 124253 -75396 23854 180709 -183726 -164380 -143468 213337 -101388 20245 -131132
$$ packed form
11438a48993J9933A23965m842c4653B43157q8129b03869i0973B20139a12585o5839
11427a78424A28152L04081A59144d3046q5904H879d2578j38739A83375o0454a21842
11415A45819d915k55610C0364K28521M1880i7339G7472J60070b14683e0578A56136
11403A68790f8759j28771i3602n1030C19168D9153f4340j91961O2458A03972j4879
11392H9093f8044i295p1178A55099i2608j8662j23811A983d86158B53433b1656
11380A33542a71210c2964A06577J88597c52079c1519m0875a9178j61489A44037
11369A18458B1746C89b75696d282l6899B78284A12487K51096e6305A62413l8160
11358A24253g5396B3854J56855a83726J9346K0912B13337a01388B0245a31132
$$ plain form
11347 187611 308891 -110192 -139282 -70071 254961 91542 -247952 220191 10704 283174
11337 283174 -176768 -48557 -86660 31735 67542 -32242 3132 -102282 -197167 59891 -249904
11325 301976 86838 183138 -214206 -71358 -121817 58798 -1899 109220 29950 172340 76941
11313 -207955 233886 1909 -94892 -249239 1723 -100908 368074 -77064 -4699 -112150 -162330
11302 -162330 -99259 -61868 41034 -53018 -373111 -195108 -14716 289079 -3840 139568 74963
11291 74963 -48488 -20901 94337 329103 -207652 6903 -108937 -294201 109599 -91732 311917
11279 87090 155562 116466 -303021 -35051 -12086 -217960 -128767 -67060 -340499 -288154 99616
11267 -72054 -30575 -184522 14922 -152199 -250114 20323 16568 -447980 284742 15303 -204103
$$ packed form
11347A87611J21280a10192k9090O9211B54961I1542b47952B20191A0704K72470
11337B83174a76768d8557l8103C1735L5807c2242C132a02282r4885E9891b49904
11325C01976H6838R6300b14206g1358n0459E8798a899A09220B9950J42390G6941
11313b07955B33886A909i4892j54347A723a00908C68074g7064d699j07451n0180
11302a62330O3071L7391D1034e3018l20093J78003a4716B89079c840A39568o4605
11291G4963d8488b0901I4337K34766b07652F903a08937j85264A09599i1732C11917
11279H7090O8472l9096c03021c5051a2086k05874Q9193O1707k73439N2345I9616
11267g2054c0575j53947A4922a52199r7915B0323l755d47980B84742A5303b04103
$$ plain form
11255 -294512 -29339 57980 247579 -239879 -98490 -242234 -349779 -314528 -134270 6289 -177015
11243 -133434 -125514 -26612 -117729 -45875 -222118 -149127 59420 -256576 -168743 207073 -12937
11231 20119 -243264 -53519 105076 214463 129752 -90251 -133694 116771 -229740 47404 227922
11220 227922 248830 -206355 108418 42953 -218803 -23217 202205 24057 -62128 -95548 350373
11208 -105014 -437673 21817 -168986 238080 93294 -87765 -114908 21686 -93912 59887 -6828
11196 -150997 -275883 -110629 -418022 -12346 -13761 49481 -436686 -185029 89204 -132944
11185 -15762 -33791 84328 -47275 -195653 -87239 -122552 -348783 -129232 -42720 -343021 -180333
11174 -180333 -231255 -102223 -315674 -132850 -271399 -144383 -963 13055 -15488 -114472 136773
$$ packed form
11255b94512b9339E7980J89599b39879i8490j43744j07545L5251a34270F289a77015
11243a33434P920b6612r1117d5875j76243P2991E9420b56576Q7833B07073a2937
11231B0119b43264e3519A05076J09387q4711i0251m3443A16771b29740D7404J80518
11220B27922K0908b06355A08418D2953b18803b3217B02205B4057f2128l3420C50373
11208a05014l32659B1817a68986B38080I3294h7765k7143B1686i3912E9887f828
11196a50997j24886a10629l07393a2346j415D9481d36686a85029H9204a32944
11185a5762j8029H4328d7275j48378h7239l5313k26231a29232d2720l00301J62688
11174a80333n0922a02223k13451a32850j38549J27016i63A3055a5488r8984A36773
$$ plain form
11162 18709 239094 -198884 40753 -47006 -412284 -228823 -322652 -230185 -94672 -233296 -263548
11151 -263548 -315083 -218663 -151422 -274690 -127133 -51425 -17910 108488 -226703 30831 -20339
11139 -370882 -105823 -36660 37524 131666 226686 314779 -96441 -50630 46964 -43452 267691
11127 -26609 -376274 -108054 -219273 -153103 -87591 63984 268019 379781 141562 20696
11116 -21278 -208736 -42058 -228882 18380 -249046 -55219 -75091 185166 -121496 309753
11105 210352 295455 -244992 37326 14707 44012 39377 158240 117068 -215286 -126813 -103454
11094 -103454 -17121 292816 35809 -157666 149236 319998 217893 291499 22180 172108
11084 172108 -155460 125165 272939 106018 11441 126403 162747 221869 -58566 -73361
$$ packed form
11162A8709K20385a98884D0753d7006l65278J83461r3829R2467i4672j38624l0252
11151b63548n1535R6420O7241j23268a27133e1425a7910A08488b26703C0831b0339
11139c70882a05823c6660C7524R4142R5020Q8093i6441M5811D6964d3452B67691
11127b6609l49665a08054j11219O6170O5512F3984K04035J11762A41562B0696
11116b1278j87458d2058j86824A8380b49046e5219j9872A85166a21496C09753
11105B10352Q5103b44992C7326A4707K9305m635J18863m1172b15286Q8473K3359
11094a03454a7121B92816C5809a57666A49236J70762j02105P3606B2180J49928
11084A72108a55460A25165J47774A06018A1441J14962L6344N9122e8566j4795
$$ plain form
11074 -73361 213332 2517 98710 108878 183975 146624 309536 49076 296743 84619 186866
11063 186866 393526 212173 344681 282104 -119730 68901 153483 50333 306985 7283 -71216
11051 241938 268878 157664 325650 166144 275221 401453 273157 116124 210695 470639
11041 470639 251136 472545 528512 296077 539639 332070 635340 521394 472933 398848
11031 398848 473615 719257 593498 703623 1179322 842046 596667 599530 444387 596186
11021 596186 473329 498137 919979 533372 809364 375530 363470 410054 743495 423055
11011 423055 579051 561238 644920 477181 684167 714770 506608 639555 798047 415857
11001 415857 228741 791201 911338 798575 348675 713161 247635 431371 289219 445746
$$ packed form
11074g3361B13332B517R6193J0168P5097l7351J62912D9076K47667H4619J02247
11063A86866K06660j81353J32508o2577a19730F8901Q4582E0333K56652G283g1216
11051B41938K6940j11214J67986j59506J09077J26232j28296A16124R4571K59944
11041D70639k19503K21409N5967k32435K43562k07569L03270j13946m8461p4085
11031C98848P4767K45642j25759J10125M75699l37276k45379K863j55143J51799
11021E96186j22857K4808M21842l86607K75992C75530j2060M6584L33441l20440
11011D23055J55996j7813Q3682j67739K06986L0603k08162J32947J58492l82190
11001D15857j87116N62460J20137j12763C48675L64486B47635J83736j42152J56527
$$ plain form
10991 445746 750856 450676 371235 378721 411100 405694 650953 671518 617871 463048 455526
10980 455526 643900 740643 311977 728594 575694 227915 689114 573602 399816 518168
10970 518168 816429 733992 845646 690220 702149 1033962 1057948 1000002 791139 789251 1085044
10959 1085044 747752 1107341 1393591 1530628 1788145 1649125 1772712 1848070 2073951 2137928
10949 2137928 2090851 1856530 1874297 1682738 1504572 1649217 1728305 2004317 1739368 1627611
10939 1627611 1597862 1771163 1868008 2039054 1826250 1727389 1322831 1285023 1137971 952640
10929 952640 678829 653736 260630 199713 506463 188301 165364 319920 144410 82048
10919 82048 336091 413506 253605 -145738 155411 57416 385545 244007 -282 35302 107432
$$ packed form
10991D45746L05110l00180p9441P486L2379n406K45259K0565n3647j54823p522
10980D55526J88374R6743C11977M16617j52900B27915M61199j15512j73786J18352
10970E18168K98261q2437J11654j55426J1929L31813K3986n7946k08863j888K95793
10959A085044l37292L59589K86250J37037K57517j39020J23587P5358K25881O3977
10949B137928m7077k34321J7767j91559j78166J44645P9088K76012k64949j11757
10939A627611k9749J73301R6845J71046k12804r8861m04558l7808j47052j85331
10929I52640k73811k5093B60630o0917L06750A88301k2937J54556A44410o2362
10919H2048K54043P7415j59901a45738A55411E7416L28129j41538b82C5302P2130
$$ plain form
10908 107432 -32936 30255 -68568 86632 225789 -56456 -263870 186001 -104106 51113 203724
10897 203724 -186852 -23231 -174251 -190643 194094 -6141 -84374 -235836 -265444 277096 -141608
10885 329756 251988 -146842 -225474 -135335 -81468 78205 182335 393685 110267 -423017
10874 -59500 -88676 -79350 -253898 -91008 -5009 100716 -127196 -27289 322696 84291 -358286
10862 -37220 -247945 -11901 -53151 146062 74741 -270055 -178972 183874 57028 -36115 28495
10850 95743 -19473 -185781 142039 -98775 2698 40289 235365 -127368 121260 -325085 142614
10838 254563 54645 304823 63527 -250540 14126 443167 -397035 -53517 111324 -77493
10827 117383 85998 112571 -43787 3198 212978 -288488 137680 -363446 75807 25903 -128640
$$ packed form
10908A07432c2936C0255f8568H6632J39157e6456k07414A86001a04106E1113J52611
10897B03724a86852b3231j51020j6392A94094f141p8233j51462k9608B77096a41608
10885C29756p7768a46842p8632R0139N3867G8205J04130K11350A10267d23017
10874e9500k9176R326j74548i1008e009A00716a27196b7289C22696H4291c58286
10862c7220k10725a1901m1250A46062p1321b70055R1083A83874E7028c6115B8495
10850I5743a9473j66308A42039i8775B698L7591J95076a27368A21260c25085A42614
10838B54563E4645K50178F3527b50540A4126M29041c97035e3517A11324g7493
10827A17383l1385K6573d3787C198K09780b88488A37680c63446G5807B5903a28640
$$ plain form
10815 124435 259051 -23433 -225145 -36239 -159964 -266139 -45446 -99882 17824 -297047
10804 -335074 -28990 -94312 -327097 -486207 -41541 -50357 -36073 -154384 -311853 28956 -113496
10792 -147718 -272148 -69071 -128695 28152 -43329 138845 -254131 34043 103445 -321762 298938
10780 -62729 20184 129571 359027 -42063 228827 131446 -187026 -117517 28257 -147440 61830
10768 -62500 -140112 82006 -92311 -581 -294851 -32513 -67288 -187118 -31997 -33710 -76340 16529
10755 -179059 -55733 -187637 58507 -314304 139617 -46499 -253232 -26453 -208285 -145357
10745 -145357 -325069 540101 280970 -52536 -25093 -138102 334505 -55043 60046 -180990
10734 93087 67440 8761 124512 70832 -287105 -100649 -98727 -57335 -234688 -323862 -49287
$$ packed form
10815A24435J34616b3433k01712c6239j23725j06175d5446n4436A7824b97047
10804c35074b8990o5322k32785j59110d1541q816J4284j18311j57469B8956a13496
10792a47718j24430f9071n9624B8152d3329A38845b54131C4043O9402c21762B98938
10780f2729B0184J09387K29456d2063B28827r7381a87026O9509B8257a47440F1830
10768f2500p7612H2006i2311e81k94270c2513l4775j19830c1997j713m2630A6529
10755a79059e5733j31904E8507c14304A39617d6499k06733b6453j81832O2928
10745a45357j79712E40101k59131e2536b5093j13009C34505e5043F0046a80990
10734I3087k5647H761J15751n3680b87105a00649J922M1392j77353q9174d9287
$$ plain form
10722 10650 320535 91097 22691 -201409 -219688 -143874 96805 235789 -226024 144830 32376
10710 218450 61909 -157127 96443 -92061 32416 -13580 -240507 -155752 -51816 120599 -75948
10698 20180 -111303 -16890 -164078 -295167 85989 -236595 -29271 -402752 -259903 -226225
10688 -226225 -217195 236762 -125500 -359659 -134419 21714 -355012 -138315 118920 -57392
10677 -95837 -111327 -132895 -267784 197884 -129054 -145953 251513 -179026 46606 -229368
10666 -113554 2702 106622 59419 87001 -183734 -176841 -2488 -108989 -82853 -145416 122712
10654 -12123 -189992 -288792 -239907 -200441 87580 -281402 125021 26023 519224 -352272 59612
10642 144631 63850 -60162 -331285 -36950 -113874 -156274 107001 -205984 -177238 -24786 -230492
$$ packed form
10722A0650L09885I1097B2691b01409j8279P5814I6805J38984b26024A44830C2376
10710B18450F1909a57127I6443i2061C2416a3580k26927Q4755e1816A20599g5948
10698B0180a11303a6890j47188j31089H5989b36595b9271l73481J42849L3678
10688b26225R030B36762a25500k34159a34419B1714c55012a38315A18920e7392
10677i5837j5490k1568j34889A97884a29054j6899B51513a79026D6606b29368
10666a13554B702J03920m7203K7582a83734O893b488j06501K6136o2563A22712
10654a2123j77869r8800M8885L9466H7580b81402A25021B6023M93201c52272E9612
10642A44631F3850f0162k71123c6950p6924m2400A07001b05984K8746b4786k05706
$$ plain form
10631 -230492 230697 69137 -409935 290411 2107 87979 -96783 -201812 82638 -197455 -20761
10619 175806 -18817 -368385 -27351 -325678 -121345 -111866 -6117 -59788 -59155 -147204 -39802 26632
10606 -169020 -208853 121566 112040 100448 -144171 15312 -242939 -487553 -15236 213410 24707
10594 24124 -385027 -125904 210826 280824 -100812 91857 -101066 -76683 -265924 -245478
10584 -245478 -321766 62258 -100675 341440 122576 -93736 -225358 -258659 394629 191407
10573 -162654 64773 198537 90830 71396 -240262 -180129 96191 -48019 -184738 -165540 -111476
10562 -111476 -149175 -88892 82936 -121461 -333995 215761 -155028 77807 -51800 -88143 90059
10550 -40818 266009 166903 179460 191261 -73588 79217 -70218 -334152 -42668 -133132 -195061
$$ packed form
10631b30492B30697F9137d09935B90411B107Q5872i6783j05029H2638a97455b0761
10619A75806a8817l49568b7351k98327a21345R479f117n3671O33q8049c9802B6632
10606a69020l9833A21566r526j1592a44171A5312b42939k44614a5236B13410B4707
10594B4124c85027a25904B10826O9998a00812I1857a01066K4383j89241K0446
10584b45478p6288F2258a00675C41440A22576i3736j31622l3301C94629A91407
10573a62654F4773J33764I0830j9434b40262O0133I6191d8019j36719J9198N4064
10562a11476l7699O0283H2936a21461k12534B15761a55028G7807e1800l6343I0059
10550d0818B66009r9106J2557J1801g3588G9217g0218k63934d2668r0464o1929
$$ plain form
10539 -195061 31321 -380673 -85576 221838 63288 123074 -195896 -245412 -177023 -24161 53436
10527 146172 -45691 282822 -83399 -131339 -104173 87508 -140208 -43440 -247152 -210939 -202811
10516 -202811 -252142 -95860 -1678 -231096 -19433 45862 -171552 -64113 -311107 -150762 283456
10504 3887 6357 -203184 173925 -136975 27413 -128630 79693 175442 33456 -79044 -154378
10493 -154378 60810 -133272 174710 -249038 -86101 -192458 -56138 -39063 14722 -199923
10482 -192400 -298607 -28388 50429 -144213 -44896 156903 38758 -75875 56753 -157541 -48580
10470 -187730 383380 176899 56661 164879 -65690 -367336 140557 -130368 5771 68628
10460 68628 -74509 225312 340925 460822 317891 219388 19349 -197048 263018 112878
$$ packed form
10539a95061C1321c80673h5576B21838F3288N9786a95896m9516O8389b4161E3436
10527A46172d5691B82822h3399m7940K7166H7508a40208d3440k03712L6213Q128
10516b02811m9331i5860a678k29418a9433D5862a71552f4113k46994a50762B83456
10504C887K470b03184A73925a36975B7413a28630G9693R5749C3456g9044p5334
10493a54378F0810a33272A74710b49038h6101j06357e6138J7075A4722a99923
10482a92400j06207b8388E0429a44213d4896A56903C8758g5875E6753a57541d8580
10470a87730C83380A76899E6661J08218f5690l01646A40557a30368E771O2857
10460F8628g4509B25312J15613J19897j42931r8503A9349a97048B63018A12878
$$ plain form
10449 112175 -8276 -246774 156350 -144876 -448678 5192 -291157 -246344 -261691 243211 -39009
10437 -310885 -124163 27094 -86651 -295223 -43698 -42006 -340374 178222 -295634 -103063
10426 20160 -66431 146361 258276 244802 -94173 -168998 45247 -61669 -51340 148132 99931
10415 99931 -89428 -80935 152061 169835 -283267 -15767 138085 27598 -101608 31285 -69131
10403 -208662 -143521 -198619 21135 -181998 173690 -350434 -135946 -81814 -291740 -206771
10393 -206771 3477 -86863 -237952 -98227 -221406 68203 66133 83258 -141493 134251 95443
10382 95443 93419 145069 -101998 51173 -80350 -215382 194304 125507 80374 -223339 43062
10370 290423 128364 230899 -151679 351651 -351132 304322 6966 -196664 95602 -185043
$$ packed form
10449A12175h276k38498A56350a44876l03802E192b91157M4813j5347B43211c9009
10437c10885a24163B7094h6651k08572d3698J692k98368A78222b95634a03063
10426B0160f6431A46361J11915j3474i4173p4825D5247f1669J0329A48132m8201
10415I9931h9428Q493A52061J7774b83267a5767A38085B7598a01608C1285f9131
10403b08662O5141n5098B1135a81998A73690c50434a35946N4132k09926Q4969
10393b06771C477h6863j51089i8227j23179F8203k070J7125a41493A34251l8808
10382I5443k024N1650a01998E1173h0350j35032A94304o8797m5133b23339D3062
10370B90423A28364J02535a51679C51651c51132C04322F966a96664I5602a85043
$$ plain form
10359 -194991 185188 446401 148467 374495 28775 -166634 316001 -54421 96654 283829
10349 283829 138145 536595 559593 498741 270684 379584 -33309 231058 147207 485591
10339 485591 225062 95215 261043 168420 295189 181244 470429 339516 249893 456651
10329 456651 314504 291740 279465 386781 343530 297285 230488 -145839 216610 203343 70905
10317 140104 121976 -232823 -18050 207201 135780 -14303 170299 387793 -163896 273822
10306 -89468 -14178 216087 107794 -69944 -494493 -149217 -26210 27873 -108195 -80439 646
10294 381300 -194497 -95853 23148 285951 -389310 -100541 -229079 260184 -40444 122337
10283 23686 4959 -118686 -126923 -52794 368130 -7746 87158 -94864 179573 -239877 -101699
$$ packed form
10359a94991A85188K61213A48467K26028B8775a66634C16001e4421I6654J87175
10349B83829A38145L98450K2998o0852k28057J08900c3309B31058q3851L38384
10339D85591B25062I5215J65828r2623J26769j13945K89185j30913q9623K06758
10329D56651j42147k2764j2275J07316m3251m6245o6797a45839B16610j3267G0905
10317A40104j8128b32823a8050B07201p1421a4303A70299K17494a63896B73822
10306h9468a4178B16087A07794f9944m24549a49217b6210B7873a08195K7756F46
10294C81300a94497i5853B3148K62803c89310a00541j28538B60184d0444A22337
10283B3686D959a18686q237e2794C68130g746H7158i4864A79573b39877a01699
$$ plain form
10271 59328 -52976 -68482 -213899 -103464 -90283 8033 -30094 146224 -209801 -362234 -144797
10259 -61628 -161737 -248085 133768 -66180 -310289 -143378 -63466 5748 -18603 -367453 14324
10247 56913 38757 241609 -53911 -125558 174314 -227409 97685 364088 180187 270856 331569
10236 331569 452952 586284 444580 226287 165717 179920 234918 252212 86333 46683 33512
10225 33512 -127337 -16308 17146 139311 60677 -173262 274692 -256807 -416494 -153579
10214 -146665 -123557 10056 244870 311373 -120895 -54287 118934 -100955 -243783 49633
10203 23121 49957 -149327 268420 -90649 -61027 -195623 342099 -59170 -29755 -184263 -82762
10191 -259292 -312339 -71119 -51169 -121744 -2729 -109220 -127188 359921 191064 35552 -188792
$$ packed form
10271E9328e2976j5506j45417a03464J3181H033c0094A46224b09801j52433a44797
10259f1628j00109q6348A33768f6180k44109a43378f3466E748a8603l48850A4324
10247E6913j8156K02852e3911p1647A74314b27409I7685K66403A80187R0669O0713
10236C31569J21383J33332j41704k18293o0570J4203N4998J7294H6333l9650j3171
10225C3512a27337a6308A7146J22165F0677a73262B74692b56807j59687a53579
10214a46665K3108A0056K34814O6503a20895e4287A18934a00955j42828D9633
10203B3121K6836a49327B68420i0649K9622j34596C42099e9170K9415j54508h2762
10191b59292n3047g1119J9950p0575b729j06491j7968C59921j68857C5552a88792
$$ plain form
10179 307767 -165140 3208 14829 -69364 -64261 -312254 -113008 73309 435581 -98184 -114148
10168 -114148 -332049 -339304 -409665 6053 60037 347513 154662 -43618 -228315 27647 161523
10157 161523 -39014 -65681 223012 -95075 -271163 -363649 -40769 13573 -157094 -193353 2797
10145 144655 146140 -7327 -253865 -136916 -178158 -124853 23834 -254383 -124547 -172741 -4606
10133 -323389 -243655 -69608 -316810 -81147 13865 -61822 68402 -147366 -199006 -29426 -181855
10122 -181855 -4720 -66452 117967 -225656 -88142 -227953 -96167 91978 73372 26191 -176225
10110 -204930 -305973 94514 -53336 222088 -191607 -60501 -96142 146237 -307739 -45683
10099 88379 -19760 -70239 54588 -241162 -107455 -261984 -241941 98 57221 5457 23769 11568
$$ packed form
10179C07767a65140C208J1621f9364N103k47993a13008G3309L62272i8184j5964
10168a14148k17901p255p0361F053N3984K87476A54662d3618j84697B7647J33876
10157A61523c9014k6667B23012i5075j76088r2486d0769A3573a57094l6259B797
10145A44655J485g327k46538J16949m1242N3305B3834b54383a24547m8194d606
10133c23389P9734f9608k47202h1147A3865f1822F8402a47366n1640b9426j52429
10122a81855d720o1732A17967b25656h8142j39811i6167I1978j8606B6191a76225
10110b04930j01043I4514e3336B22088a91607f0501l5641A46237c07739d5683
10099H8379a9760n0479E4588b41162a07455j54529K0043I8N7123E457J8312A1568
$$ plain form
10086 -204764 43656 72129 -490207 105258 -146734 -113823 -257523 -117186 27522 108371
10076 108371 81502 18817 -100371 -36044 -130788 -228287 -6950 -487556 -303074 -29328 237734
10064 -286900 -13909 31799 -173195 124537 -282468 68303 -211681 80745 -177556 34075
10053 84400 -607310 -205811 95093 -332052 -147510 -44808 -147240 -150601 -119699 95125 -116266
10041 129511 -88789 339151 109542 -145202 -16868 -58775 -284697 1208 -169573 -3118 -592
10029 -172305 86078 -219554 -219021 -222207 -86488 116012 46333 56487 70855 -123088 30745
10017 92802 -18787 192244 -391231 120066 -108238 -217345 -124125 262073 -286658 46554
10006 -110239 83801 -57623 -159039 103933 219058 -252566 305875 -296326 -422750 -132403
$$ packed form
10086b04764D3656K8473d90207A05258a46734L2911j43700a17186B7522Q0849
10076A08371k6869A8817a00371c6044r4744r7499f950m80606J84482b9328B37734
10064b86900a3909C1799a73195A24537b82468F8303b11681H0745a77556C4075
10053H4400f07310b05811I5093c32052a47510d4808j02432l361L0902I5125a16266
10041A29511h8789C39151A09542a45202a6868m1907k25922A208a69573c118e92
10029a72305H6078b19554N33l186h6488A16012D6333J0154J4368a23088C0745
10017I2802a8787A92244c91231A20066a08238j09107R3220B62073b86658D6554
10006a10239H3801e7623j01416A03933J15125b52566C05875b96326j26424a32403
$$ plain form
9995 -200084 262005 380508 14160 -365648 -194314 -2904 -35954 -88978 100605 137659 -78677
9983 -110590 172251 -142341 39346 -48593 51358 -216782 95960 -191860 108390 110874 -168051
9971 35291 41485 -86166 22683 -70937 206512 -165927 82440 -36745 16114 98925 12698 -62421
9958 -81037 -68727 86531 75133 -113591 -249264 -173022 -301581 -227183 -33250 -168391 83430
9946 161993 35387 131882 -74110 -113235 -78311 -177888 -169691 -258 -70148 -93591 -366197 -157
9933 62269 -18390 163018 -222831 45377 -43812 -124316 31328 157538 -315345 -139551 284834
9921 -55837 101434 -82666 -351383 75693 -138493 -144956 -30997 142632 -31505 9700 -603 66949
9908 -254901 -115237 54709 -142382 -124417 -22713 -30273 -29483 -79890 -63493 -79866 191022 -200141
$$ packed form
9995b00084B62005J18503A4160c65648J71334b904l3050n3024A00605L7054g8677
9983a10590A72251a42341C9346d8593E1358b16782I5960a91860A08390K484a68051
9971C5291O194h6166B2683g0937B06512a65927H2440c6745A6114Q2811A2698f2421
9958h1037J2310H6531j1398a13591j35673P6242j28559P4398c3250j35141H3430
9946A61993C5387R6495g4110l9125L4924r9577Q197b58o9890k3443k72606a57
9933F2269a8390A63018b22831D5377d3812q0504C1328J26210c15345a39551B84834
9921e5837A01434h2666k68717G5693a38493o463c0997A42632c1505I700f03F6949
9908b54901a15237E4709a42382J7965b2713p560P90n0407J6397j6373A91022b00141
$$ plain form
9895 -60025 -78184 -300395 -26586 -173037 -134390 83038 -195152 -100355 -174098 -57322 -115319
9884 -115319 -136583 -252125 186461 -332219 -203017 -347720 228903 -5481 -248351 273360
9873 -25330 33214 -168892 -416008 82340 -317258 -130874 83775 -145680 26499 277774 -293209
9861 -29600 -103169 -148656 9783 -262127 -188463 131770 -196173 54916 -175757 -72452 -28072
9849 220408 -59309 147046 -129053 -38011 59429 382444 -81918 3205 -24133 -80384 20667
9837 -383304 63819 -261647 31842 -155951 84193 26905 138908 -146797 -249749 -189259 -204111
9826 -204111 -161325 -36890 15216 86644 -39041 -296975 -150173 18388 -341776 -253619 14713
9814 -185075 -20651 -74387 -105793 -149317 -147904 -52148 128137 -143366 -153823 -227856 33942
$$ packed form
9895f0025j8159k22211b6586j46451L8647H3038a95152R4797p3743e7322n7997
9884a15319k1264j15542A86461c32219J29202j44703B28903e481k42870B73360
9873b5330C3214a68892k47116H2340c17258a30874H3775a45680B6499K51275b93209
9861b9600p3569m5487I783b62127P3664A31770a96173E4916a75757g2452b8072
9849B20408e9309A47046a29053c8011E9429L23015h1918C205b4133n6251B0667
9837c83304F3819b61647C1842a55951H4193B6905J12003a46797j02952O0490j4852
9826b04111M2786c6890A5216P1428c9041k57934J46802A8388c41776Q8157A4713
9814a85075b0651n3736l1406m3524J413e2148A28137a43366j0457p4033C3942
$$ plain form
9802 -123383 -155714 -234347 -360576 -218955 -210170 -359231 82928 -354682 148983 -210299 -245269
9791 -245269 -286645 141375 -18299 -25994 -10996 -354269 -114435 -190630 176475 101520 -140627
9779 35835 -5269 -167029 -81631 -189749 -266743 -129691 91960 -479310 -216997 -44608 88928
9767 -72840 -147282 3622 36793 -111067 -162860 -179115 177026 282178 142742 -11601 -48622
9756 -48622 165877 -153291 -97149 -113152 -257318 -190738 -128167 -216087 -2154 76289 11593
9744 -219237 105510 20414 108083 -328377 279 -103612 222435 125710 -68484 124597 -292783
9732 -117089 37912 -20678 285742 -413250 105701 -16586 458710 305123 -252542 -213668
9722 -213668 -210484 25318 91578 -33844 134137 -128309 -151625 -107541 45967 -236917 -20977
$$ packed form
9802a23383l2331p8633j26229J41621Q785j49061H2928c54682A48983b10299l4970
9791b45269m1376A41375a8299p695a0996l43273a14435p6195A76475p4955a40627
9779C5835e269j61760h1631j08118p6994a29691I1960d79310b16997d4608H8928
9767g2840p4442C622L3171a11067n1793j6255A77026J05152j39436a1601l7021
9756d8622A65877a53291N6142j6003j44166O6580O2571q7920b154G6289A1593
9744b19237A05510B0414Q7669c28377B79a03612B22435r6725f8484A24597b92783
9732a17089C7912b0678B85742d13250A05701a6586D58710j53587b52542L8874
9722b13668L184B5318O6260c3844A34137a28309k3316M4084D5967b36917b0977
$$ plain form
9710 -241205 -115138 344328 -110677 130694 -178856 -283583 -202661 -15554 -121319 -234885
9700 -234885 -215994 43359 -71140 -3879 -150117 236656 13130 -110912 265343 106941 -391704
9688 -13536 11978 -58433 -177795 -99643 195787 -383401 -14325 181828 -204734 85342 31022
9676 102678 194798 -11340 -59935 -308964 -16105 123678 -192697 39048 -21938 -140257 -249046
9665 -249046 66658 -299256 243880 -69300 -99191 -163501 31135 102520 62371 -90985 -402860
9654 -402860 -164178 -199855 -371276 -229903 -51444 171657 93088 -87641 -76791 107005 -42607
9642 -257306 196331 155640 -88992 -176651 -143517 9410 -102726 131855 15802 230590 -192184
9630 -159587 -188615 -56652 -41572 -234850 -198282 115703 -297309 -111335 -62919 -9054 -203687
$$ packed form
9710b41205a15138C44328a10677A30694a78856j04727Q0922a5554j05765j13566
9700b34885J8891D3359g1140c879j46238B36656A3130a10912B65343A06941c91704
9688a3536A1978e8433j19362P8152A95787c83401a4325A81828b04734H5342C1022
9676A02678R2120a1340m8595k49029a6105A23678a92697C9048b1938j18319j08789
9665b49046F6658b99256B43880f9300k9891o4310C1135P1385m0149i0985l11875
9654d02860a64178l5677j71421J41373e1444A71657p8569h7641J0850A07005d2607
9642b57306A96331m0691h8992q7659L3134I410a02726A31855A5802K14788a92184
9630a59587k9028e6652J5080j93278L6568A15703b97309a11335M8416i054j94633
$$ plain form
9619 -203687 -127664 92078 -127621 33108 -91540 -217646 -243818 75107 103408 27298 -372703
9607 61193 286990 -101689 219074 45995 -195172 -91326 630 11042 -138056 46113 -136811
9595 -139212 183325 187998 -248453 28098 -32551 -191269 -304826 -155396 -120844 136344 52914
9583 -445354 -81170 -286694 -66921 -344775 -118943 -28435 -254971 -68753 -115747 -113106 142589
9571 61621 254665 -48301 -117968 -219778 172096 -215805 312891 -68306 44971 -268343 -98613
9559 135521 79521 -179637 189999 -277715 114625 111497 -304289 -166558 -80980 -128962 10041
9547 -117724 -142994 -111724 -310395 -246842 24323 -115349 -124812 153749 -174636 48494 -422624
9535 -180995 199875 -354913 -410046 -142703 153369 43465 -60182 -246107 -136590 -66955
$$ packed form
9619b03687P6023I2078a27621C3108i1540j26106k6172G5107K8301B7298c72703
9607F1193K25797a01689B19074D5995a95172i1326F30J0412a38056D6113a36811
9595a39212A83325M673b48453B8098c2551j58718j13557J49430L4552A36344E2914
9583d45354h1170k05524f6921k77854a18943b8435k26536f8753m6994K641A42589
9571F1621J93044d8301o9667j01810A72096b15805C12891f8306D4971b68343i8613
9559A35521n6000a79637A89999b77715A14625l128c04289J37731h0980m7982A0041
9547a17724k5270L1270j98671O3553B4323a15349r463A53749a74636D8494d22624
9535a80995A99875c54913n5133a42703A53369D3465f0182j85925J09517f6955
$$ plain form
9524 -242263 -35527 -193777 93190 -116847 -109095 59464 -268975 -163805 -53242 -347217 -322328
9513 -322328 -80492 -41806 -74782 -6526 51843 -413932 -95901 -207133 167588 -155926 28134
9501 177831 118740 -415672 64347 -166066 5791 -223748 -6037 52293 7376 105487 -181435
9489 -45308 -90103 -34878 -53493 -41087 -107945 -161716 425907 -62897 -17325 -58505 58015 74506
9477 74506 55125 -81025 -60878 -305532 8440 -82111 -129733 59424 -226709 30334 -11410 -110590
9465 -110590 152838 -114353 -61474 81896 176671 -177273 -193734 87326 154551 90795 -295877
9453 144690 -4127 44956 -82817 -191619 -65393 -148613 -106004 -394165 -375166 -192466 132497
9441 -209040 -43747 -377573 223527 440744 -66297 -64533 46558 -63116 -111873 -243 -159337
$$ packed form
9524b42263c5527j58250I3190a16847P752E9464b68975J05170e3242k93975K4889
9513c22328h0492L8686l2976f526E1843d13932i5901j11232A67588a55926B8134
9501A77831n9091d15672F4347a66066E791b23748f037E2293G376R8111a81435
9489d5308m4795c4878j8615J2406o6858n3771D25907f2897a7325m1180E8015J6491
9477G4506j9381h1025K0147k44654H440h2111m7622E9424b26709C0334a1410r9180
9465a10590A52838a14353N2879H1896R4775a77273j6461H7326O7225o3756b95877
9453A44690d127D4956h2817j08802f5393q3220M2609k88161J8999J82700A32497
9441b09040d3747l33826B23527K17217f6297J764D6558f3116m8757b43j59094
$$ plain form
9430 -159337 -176289 122156 -225169 -33292 163983 -173691 103047 153467 35443 -220350
9419 175681 -24742 67406 -252869 111929 76956 46899 -211678 -372888 -175364 219626
9408 287621 -293873 -163568 -136395 -14514 -41285 289290 -179803 -11975 -4546 -79948 107979
9396 -173843 -233659 -381010 126557 -185485 37012 -200875 243476 -137438 -97798 71428
9385 -48981 27149 86116 -73671 -64269 23070 -147612 4751 56996 -294561 195647 -11081 60946
9372 -67114 43201 -259294 148295 47003 24370 -234085 -61183 32377 -71486 2998 -71373
9360 -212668 -317603 167056 -278879 -44809 29062 173005 -240232 136867 234287 87669
9349 113106 -11685 135180 -252043 64528 -129161 28426 -112627 -235546 9640 39891 66824
$$ packed form
9430a59337j6952A22156b25169c3292A63983a73691A03047N0420C5443b20350
9419A75681b4742F7406b52869A11929l4973l0057b11678j61210a75364B19626
9408B87621b93873J30305K7173a4514k6771B89290a79803a1975d546p5402A07979
9396a73843n9816j47351A26557a85485C7012b00875B43476a37438L9640G1428
9385d8981B7149N8967g3671R402B3070a47612D751N2245b94561A95647a1081F0946
9372f7114D3201b59294A48295D7003k2633b34085f1183C2377g1486B998g1373
9360b12668j04935A67056b78879d4809B9062J43943b40232A36867R7420H7669
9349A13106a1685A35180b52043F4528a29161B8426a12627j22919I640L0251K6933
$$ plain form
9338 66824 -15300 -29087 218426 -165724 -5000 -47395 -258972 252154 -149616 -210194 -44074
9326 -66418 32015 -202150 -78415 -217710 -214551 -58238 47667 4446 -159010 202484 -17088
9314 23601 204988 -318004 235138 -149315 -164218 230159 -649 94502 52420 -366287 -88020
9302 -186718 397998 -108801 -236767 -145675 -192756 257820 -99514 -58109 -262463 -116288
9291 -261487 -310372 -6204 126936 41513 -174129 -107830 -176481 131791 -213573 6775 -203568
9279 -316196 -176289 -373989 91666 -154303 -32764 -338670 197091 187609 -119103 173348
9268 -252742 -13512 -63024 -94967 40297 -74870 117551 22581 77861 254926 113361 78051
9257 78051 -12953 137789 -13307 25164 248513 -196417 -182366 -271399 -171865 -312064 86941
$$ packed form
9338F6824a5300j3787B18426a65724e000m2395k11577B52154a49616o0578d4074
9326f6418C2015b02150g8415j39295L159e8238D7667D446a59010B02484a7088
9314B3601J81387c18004B35138a49315j4903B30159f49I4502m2082c66287h8020
9302a86718C97998a08801j27966R1092m7081B57820i9514M1405k04354a16288
9291b61487m8885f204A26936D1513a74129O6299o8651A31791b13573F775b03568
9279c16196J39907j97700I1666a54303c2764l05906A97091r482a19103A73348
9268b52742a3512m9512l1943D0297g4870A17551B2581N5280J77065A13361l5310
9257G8051a2953A37789a3307B5164K23349a96417J4051q9033R9534j40199H6941
$$ plain form
9245 -429869 -82963 -67115 -142482 -287793 -38540 -96984 -117748 -12404 52956 -283483 -95822
9233 -60792 -38023 258967 20893 228641 -217717 -416376 261040 -286272 -26594 -285317
9223 -285317 129601 -259236 -315548 -141579 -243750 22363 -87954 -3408 -164339 -143279 7092
9211 -172370 138310 -61753 -380022 -12924 68417 -125960 -379517 129826 20175 52799 -51090
9199 -220200 140635 -114908 -80988 -47938 -115839 11250 -21680 -44794 -64341 -71166 192128
9187 41073 -106507 -28001 37963 -62379 136019 157398 -115325 282577 -115046 -130627 -358605
9176 -358605 -130405 66709 -127783 69936 201574 172029 319397 -245682 -246445 -170921 -387146
9165 -387146 -142455 -224327 39303 -55968 240382 -39545 -24626 -25240 53384 -160765 21846
$$ packed form
9245d29869h2963J5848p5367j45311c8540n8444k0764a2404E2956b83483i5822
9233f0792K2769B58967B0893K07748b17717j98659B61040b86272b6594k58723
9223b85317A29601b59236n6312a41579j02171B2363h7954c408j60931K1060G092
9211a72370A38310f1753l18269a2924F8417a25960k53557A29826B0175L2624e1090
9199b20200A40635a14908L3920L3050o7901A1250b1680k3114j9547o825A92128
9187D1073a06507b8001C7963f2379A36019K1379a15325B82577a15046j5581k27978
9176c58605a30405F6709a27783F9936J31638k9545J47368b45682p63P5524k16225
9165c87146a42455q1872C9303e5968B40382c9545J4919o14E3384a60765B1846
$$ plain form
9153 -21945 22312 21485 31738 -57715 4440 -194170 99407 210759 63793 115282 -250005 86964
9140 -261880 -230895 -77409 -347842 -208598 9800 -59229 -121998 209976 -255754 -49990 227010
9128 173552 45936 -212474 18982 144914 208430 -212921 -38926 1480 -46173 203307 -81110
9116 -147881 -356283 8889 -143677 -43340 -164465 -556361 104006 66149 22079 62725 -87764
9104 -200546 -107214 79602 22972 -15908 -125945 41645 -39020 -165518 -187233 -217809 61734
9092 -66087 -184031 -404811 -304833 -15150 -201663 29457 -187675 71786 -215296 123193 -4240
9080 -272565 -224878 126213 -17060 -48407 290129 -402792 -486735 -50658 -493984 -216307 -267758
9069 -267758 -225725 85008 -132451 165685 310225 -205590 281910 -257206 128857 -237317
$$ packed form
9153b1945B2312q27J0253e7715D440a94170I9407J11352F3793N1489b50005H6964
9140b61880L0985g7409k70433J39244I800e9229o2769B09976b55754d9990B27010
9128A73552D5936b12474A8982J25932O3516b12921c8926A480d6173B03307h1110
9116a47881k08402H889a43677d3340j21125l91896A04006l7857B2079M0646h7764
9104b00546R3332G9602B2972a5908j10037D1645c9020j26498k1715l0576F1734
9092f6087j17944k20780R9978a5150j86513B9457a87675G1786b15296A23193d240
9080b72565M7687A26213a7060l1347B90129d02792q3943e0658m43326b16307n1451
9069b67758M2033H5008a32451A65685J44540b05590B81910b57206A28857b37317
$$ plain form
9058 -180365 84294 -176959 215 53229 -27872 42727 91439 -124910 -240104 56292 -61299
9046 97654 -191284 -88508 -139170 302706 164460 -328092 9942 -416378 -224409 119256 9053
9034 -180869 -239826 -92164 -102293 134472 -162452 15322 -89981 -122892 -211884 -159995 88170
9022 6525 -10345 -13270 -408015 -285823 -264476 -41575 69117 -224601 5518 -158661 8054 -55354
9009 -236479 -84265 101954 -141866 -295458 -244973 36036 -176212 -277983 15011 -254363
8998 -69612 27329 275585 -100798 115689 115667 28696 148713 -198028 -131328 215936 155169
8987 155169 -50201 -338263 -126929 133207 -84586 -422241 148788 -177768 -168446 160802
8976 -119454 33194 -94770 -82505 55930 139442 -87212 -13791 176520 244007 -121249 -82000
$$ packed form
9058a80365H4294a76959B15N3014b7872D2727M8712a24910j15194E6292f1299
9046I7654a91284h8508n0662C02706j38246c28092I942d16378J91969A19256I053
9034a80869n8957i2164j0129A34472a62452A5322h9981l2911q8992N1889H8170
9022F525a0345k925l94745J22192K1347d1575F9117b24601E518a58661H054e5354
9009b36479h4265A01954a41866j53592N0485C6036a76212j01771A5011b54363
8998f9612B7329K48256a00798A15689k2B8696J20017a98028O6700B15936o0767
8987A55169e0201k88062a26929A33207h4586l37655A48788a77768R322A60802
8976a19454C3194i4770J2265E5930Q3512h7212a3791A76520O7487a21249L9249
$$ plain form
8965 -82000 -37380 -189072 118157 -910 -122137 -291326 -16069 -56949 -261775 52942 -147128
8953 30430 -86158 -42446 19063 141911 -20285 186828 -290523 22492 -61293 -8782 88282
8941 -168026 33521 189067 158981 -179614 -70934 -90818 -143002 135793 -160075 -68355 104144
8929 138100 219233 183423 126750 347993 -129242 -323692 -250310 110841 95541 -13265 -98858
8918 -98858 102708 173371 -47643 89517 9061 148350 43623 -66413 49819 57654 261514 536878
8906 536878 578652 1261162 1988803 4599057 6678822 2826935 1282035 823210 468166
8897 468166 188590 428787 -233149 -207160 265318 197650 -8484 157684 -6479 32866 141487
8886 141487 263922 63521 159073 212002 125563 13021 -310941 -115109 8125 109550 -181497
$$ packed form
8965h2000c7380j51692A18157i10j21227j69189a6069m0880k04826E2942a47128
8953C0430h6158d2446A9063J22848b0285A86828b90523B2492f1293h782H8282
8941a68026C3521J55546l0086a79614g0934j9884n2184A35793a60075f8355A04144
8929A38100Q1133l5810n6673K21243a29242j94450P3382A10841j5300a3265q5593
8918i8858A02708P0663d7643H9517I061J39289D3623f6413D9819P835K03860K75364
8906E36878M1774O82510P27641K610254K079765B826935A282035m58825l55044
8897D68166A88590K40197b33149K5989B65318o7668h484A57684f479C2866J08621
8886A41487J22435F3521R5552N2929q6439A3021c10941a15109H125J01425a81497
$$ plain form
8874 -225639 -82474 87482 -275979 -54287 -296044 166287 -74610 70181 -435088 14286 16134
8863 16134 -300319 -82063 -221008 468781 -130013 124153 -154966 268404 -282436 -151204
8853 -151204 42236 -142229 -98312 120191 254401 70183 -53579 -233333 -93948 -336467 -249126
8842 -249126 -241839 -24943 -44115 -184743 -5575 -219424 127562 -136948 -59172 77013 -92110
8830 -328165 -230731 -327213 295257 -200420 146488 161458 -232101 -308694 -325713 313947 -85796
$$ packed form
8874b25639h2474H7482b75979e4287k41757A66287g4610G0181d35088A4286J848
8863A6134c00319h2063j38945D68781a30013A24153a54966B68404b82436J31232
8853a51204D2236a42229M3917A20191J34210G0183e3579j79754i3948k42519Q7341
8842b49126P287b4943j9172j40628e575k13849A27562a36948e9172G7013i2110
8830c28165R7434r6482B95257b00420A46488J4970b32101p6593j7019C13947h5796
$$ [...]
##END NTUPLES=NMR SPECTRUM
##END=
