
##TITLE=AC1042_TOFR03_5906366_oWyQIBeReI
##JCAMPDX= 6.0         $$ Bruker NMR JCAMP-DX V2.0
##DATA TYPE= NMR SPECTRUM
##DATA CLASS= NTUPLES
##ORIGIN= BRUKER
##OWNER= Administrator
$$ 1.72 TOPSPIN		Version 2.1
$$ 2012-04-10 10:29:57.859 -0500  Administrator@TOPSPIN
$$ Compression mode = diff/dup
##.OBSERVE FREQUENCY= 400.13188235
##.OBSERVE NUCLEUS= ^1H
##.ACQUISITION MODE= SIMULTANEOUS (DQD)
##.ACQUISITION SCHEME= undefined
##.AVERAGES= 64
##.DIGITISER RES= 22
##SPECTROMETER/DATA SYSTEM= spect
##.PULSE SEQUENCE= noesygpps1d.comp
##.SOLVENT NAME= COFFEE_meoh
##.SHIFT REFERENCE= INTERNAL, COFFEE_meoh, 1, 14.96878
##AUDIT TRAIL= $$ (NUMBER, WHEN, WHO, WHERE, PROCESS, VERSION, WHAT)
$$ ##TITLE= Audit trail, TOPSPIN		Version 2.1
$$ ##JCAMPDX= 5.01
$$ ##ORIGIN= Bruker BioSpin GmbH
$$ ##OWNER= Administrator
$$ $$ C:\Bruker\TOPSPIN/data/COFFEE/nmr/AC1042_TOFR03_5906366_oWyQIBeReI/12/pdata/1/auditp.txt
$$ ##AUDIT TRAIL=  $$ (NUMBER, WHEN, WHO, WHERE, PROCESS, VERSION, WHAT)
(   1,<2012-04-04 11:26:11.484 -0500>,<Administrator>,<TOPSPIN>,<go>,<TOPSPIN 2.1>,
      <created by zg
	started at 2012-04-04 11:14:39.796 -0500,
	POWCHK enabled, PULCHK disabled,
       configuration hash MD5:
       1A 1E CE 29 27 FD 77 03 67 4E F0 E3 C4 B2 CB 90
       data hash MD5: 64K
       BC 4C FF 16 43 D2 A0 0C AE 1E A9 87 2D 75 A2 FF>)
(   2,<2012-04-04 11:26:14.296 -0500>,<Administrator>,<TOPSPIN>,<proc1d>,<TOPSPIN 2.1>,
      <Start of raw data processing
       efp LB = 0.3 FT_mod = 6 PKNL = 1 PHC0 = 0 PHC1 = 0 SI = 128K 
       data hash MD5: 128K
       B4 82 BE 6D 4A 7E 8C 1D 83 0C 13 C2 46 39 F5 3F>)
(   3,<2012-04-04 11:26:15.546 -0500>,<Administrator>,<TOPSPIN>,<proc1d>,<TOPSPIN 2.1>,
      <pk PHC0 = 34.53552 PHC1 = 0 
       data hash MD5: 128K
       46 D2 05 67 B8 1B D1 BE 8E EB CB 28 B3 4D 67 EB>)
(   4,<2012-04-04 11:26:16.000 -0500>,<Administrator>,<TOPSPIN>,<proc1d>,<TOPSPIN 2.1>,
      <abs ABSG = 1 
       data hash MD5: 128K
       1D 5E D4 97 37 D1 02 F2 FA 44 70 4E 14 3A ED 10>)
(   5,<2012-04-04 11:26:16.062 -0500>,<Administrator>,<TOPSPIN>,<proc1d>,<TOPSPIN 2.1>,
      <abs ABSG = 2 
       data hash MD5: 128K
       90 73 75 86 8F 67 C1 CD 5F 03 2C 87 25 EB FC EB>)
(   6,<2012-04-04 11:26:16.109 -0500>,<Administrator>,<TOPSPIN>,<proc1d>,<TOPSPIN 2.1>,
      <abs ABSG = 3 
       data hash MD5: 128K
       43 04 86 A2 88 D1 2B FB 89 19 FB 9F 44 10 CA 49>)
(   7,<2012-04-04 11:26:16.171 -0500>,<Administrator>,<TOPSPIN>,<proc1d>,<TOPSPIN 2.1>,
      <abs ABSG = 4 
       data hash MD5: 128K
       7F 0A 26 D6 16 84 C4 D2 31 D0 79 37 7C 20 BE C8>)
(   8,<2012-04-04 11:26:16.218 -0500>,<Administrator>,<TOPSPIN>,<proc1d>,<TOPSPIN 2.1>,
      <abs ABSG = 5 
       data hash MD5: 128K
       A2 B2 77 84 3A 7E 34 6B 7A E1 CD 1E 7E B9 8F D5>)
(   9,<2012-04-04 11:26:16.453 -0500>,<Administrator>,<TOPSPIN>,<audit>,<TOPSPIN 2.1>,
      <user comment:
       ICON-NMR User ID: COFFEE
       data hash MD5: 128K
$$ [...]
##$TP07= 0
##$TPNAME0= <>
##$TPNAME1= <>
##$TPNAME2= <>
##$TPNAME3= <>
##$TPNAME4= <>
##$TPNAME5= <>
##$TPNAME6= <>
##$TPNAME7= <>
##$TPOAL= (0..7)
0.5 0.5 0.5 0.5 0.5 0.5 0.5 0.5
##$TPOFFS= (0..7)
0 0 0 0 0 0 0 0
##$TUNHIN= 0
##$TUNHOUT= 0
##$TUNXOUT= 0
##$USERA1= <user>
##$USERA2= <user>
##$USERA3= <user>
##$USERA4= <user>
##$USERA5= <user>
##$V9= 5
##$VALIST= <valist>
##$VCLIST= <CCCCCCCCCCCCCCC>
##$VD= 0
##$VDLIST= <DDDDDDDDDDDDDDD>
##$VPLIST= <PPPPPPPPPPPPPPP>
##$VTLIST= <TTTTTTTTTTTTTTT>
##$WBST= 2048
##$WBSW= 25
##$XGAIN= (0..3)
0 0 0 0
##$XL= 0
##$YL= 0
##$YMAX_a= 11513742
##$YMIN_a= -11199389
##$ZGOPTNS= <>
##$ZL1= 120
##$ZL2= 120
##$ZL3= 120
##$ZL4= 120
##$ABSF1= 14.96878
##$ABSF2= -5.583751
##$ABSG= 5
##$ABSL= 3
##$ALPHA= 0
##$AQORDER= 0
##$ASSFAC= 0
##$ASSFACI= 0
##$ASSFACX= 0
##$ASSWID= 0
##$AUNMP= <proc_prof1d_extract.lims>
##$AXLEFT= 0
##$AXNAME= <>
##$AXNUC= <1H>
##$AXRIGHT= 0
##$AXTYPE= 0
##$AXUNIT= <>
##$AZFE= 0.1
##$AZFW= 0.1
##$BCFW= 0
##$BC_mod= 0
##$BYTORDP= 0
##$COROFFS= 0
##$CY= 15
##$DATMOD= 1
##$DC= 0
##$DFILT= <>
##$DTYPP= 0
##$F1P= 0
##$F2P= 0
##$FCOR= 0.5
##$FTSIZE= 131072
##$FT_mod= 6
##$GAMMA= 0
##$GB= 0
##$INTBC= 1
##$INTSCL= 1
##$ISEN= 128
##$LB= 0.3
##$LEV0= 0
##$LPBIN= 0
##$MAXI= 10000
##$MC2= 0
##$MEAN= 0
##$ME_mod= 0
##$MI= 0
##$NCOEF= 0
##$NC_proc= -1
##$NLEV= 6
##$NOISF1= 0
##$NOISF2= 0
##$NSP= 0
##$NTH_PI= 0
##$NZP= 0
##$OFFSET= 14.96878
##$PC= 1
##$PHC0= 34.53552
##$PHC1= 0
##$PH_mod= 1
##$PKNL= yes
##$PPARMOD= 0
##$PPDIAG= 0
##$PPIPTYP= 0
##$PPMPNUM= 2147483647
##$PPRESOL= 1
##$PSCAL= 4
##$PSIGN= 0
##$PYNMP= <proc.py>
##$REVERSE= no
##$SF= 400.13000473369
##$SI= 131072
##$SIGF1= 0
##$SIGF2= 0
##$SINO= 400
##$SIOLD= 131072
##$SPECTYP= <>
##$SREGLST= <1H.CDCl3>
##$SSB= 0
##$STSI= 131072
##$STSR= 0
##$SW_p= 8223.68421052632
##$SYMM= 0
##$S_DEV= 0
##$TDeff= 65536
##$TDoff= 0
##$TI= <>
##$TILT= no
##$TM1= 0
##$TM2= 0
##$TOPLEV= 0
##$USERP1= <user>
##$USERP2= <user>
##$USERP3= <user>
##$USERP4= <user>
##$USERP5= <user>
##$WDW= 1
##$XDIM= 131072
##$YMAX_p= 125862778
##$YMIN_p= -510745294
##$CURPLOT= <Network HP LaserJet P1505>
##$CURPRIN= <$Network HP LaserJet P1505>
##$DFORMAT= <normdp>
##$LAYOUT= <+/1D_H.xwp>
##$LFORMAT= <normlp>
##$PFORMAT= <normpl>
##$SURQMSG= 1
$$ End of Bruker specific parameters
$$ ---------------------------------
##NTUPLES= NMR SPECTRUM
##VAR_NAME=  FREQUENCY,     SPECTRUM/REAL,   SPECTRUM/IMAG
##SYMBOL=    X,             R,               I
##VAR_TYPE=  INDEPENDENT,   DEPENDENT,       DEPENDENT
##VAR_FORM=  AFFN,          ASDF,            ASDF
##VAR_DIM=   131072,        131072,          131072
##UNITS=     HZ,            ARBITRARY UNITS, ARBITRARY UNITS
##FACTOR=    0.0627417313425165, 1,          1
##FIRST=     8223.62146879498, -181,         -18750
##LAST=      0,             467,             -18981
##MIN=       0,             -510745294,      0
##MAX=       8223.62146879498, 125862778,    0
$$ Real data points
##PAGE= N=1
##DATA TABLE= (X++(R..R)), XYDATA
$$ [...]
62212B52721O747P121P555Q041Q309Q311Q403Q947R932J1094J2263J3444J4682
62199C77570J5932J7026J7744J7982J7917J7858J7815J7320J5893J3570J0805
62188E57432P903M830J609j447m059o276q280j0101j1734j3332j4935j6219j6783
62175D68608j6670j6277j5845j5298j4573j3718j2762j1704j0695r912r219q315
62163C13620p225o322n779n353m850m425m234m118l867l540l251k909k410j883
62149B53454j469j035m17K40O53Q13R52J171J400J602J835K094K374K724L128
62134B69519L405L503L704M288N062N544N602N550N644N776N779N708N705N785
62120C40574N894O038O189O266O298O510P065P841Q621R382J0235J1125J1827
$$ y = [252721, 259468, 266589, 274144, 282185, 290494, 298805, 307208, 316155, 326087, 337181, 349444, 362888, 377570, 393502, 410528, 428272, 446254, 464171, 482029, 499844, 517164, 533057, 546627, 557432, 565335, 570165, 571774, 570327, 566268, 559992, 551712, 541611, 529877, 516545, 501610, 485391, 468608, 451938, 435661, 419816, 404518, 389945, 376227, 363465, 351761, 341066, 331154, 321935, 313620, 306395, 300073, 294294, 288941, 284091, 279666, 275432, 271314, 267447, 263907, 260656, 257747, 255337, 253454, 251985, 250950, 250533, 250773, 251426, 252239, 253191, 254362, 255762, 257364, 259199, 261293, 263667, 266391, 269519, 272924, 276427, 280131, 284419, 289481, 295025, 300627, 306177, 311821, 317597, 323376, 329084, 334789, 340574, 346468, 352506, 358695, 364961, 371259, 377769, 384834, 392675, 401296, 410678, 420913, 432038, 443865]
62107D43865J2287J2775J3495J4217J4470J4069J3252J2231J0891R114P183N541
62095E83390M269L096J951J075N65J02o40j578k358k788k911k841k722k689k723
62080E73198k702k710l034l695m213m166l788l654l946m377m745n133n482n466
62066E16087m960m331m022m003l880l460k967k703k691k671k406j882j188m09
62052D74514L54R21J199J373J715K201K487K400K218K337K830L530M297N059N658
62037E13093O004O252O657P306Q147R183J0392J1554J2390J2837J2976J2816J2361
62024F41968J1885J1780J2193J2973J3928J4888J5588J5769J5516J5205J5058
62013G96751J5003J4988J5186J5822J6926J8385K0020K1593K2882K3823K4462
$$ y = [443865, 456152, 468927, 482422, 496639, 511109, 525178, 538430, 550661, 561552, 570666, 577849, 583390, 587659, 590755, 592706, 593781, 594346, 594448, 593808, 592230, 589872, 587084, 584173, 581332, 578610, 575921, 573198, 570496, 567786, 564752, 561057, 556844, 552678, 548890, 545236, 541290, 536913, 532168, 527035, 521553, 516087, 511127, 506796, 502774, 498771, 494891, 491431, 488464, 485761, 483070, 480399, 477993, 476111, 474923, 474514, 474868, 475789, 476988, 478361, 480076, 482277, 484764, 487164, 489382, 491719, 494549, 498079, 502376, 507435, 513093, 519097, 525349, 532006, 539312, 547459, 556642, 567034, 578588, 590978, 603815, 616791, 629607, 641968, 653853, 665633, 677826, 690799, 704727, 719615, 735203, 750972, 766488, 781693, 796751, 811754, 826742, 841928, 857750, 874676, 893061, 913081, 934674, 957556, 981379, 1005841]
62002A005841K4738K4541K3923K3072K2035K0735J9236J7769J6401J4991J3510
61991A226792J2182J1088R937Q438O721N201M163L641L537L685L862L957M085
61978A307289M379M789N214N772O692P905R002R641R959J0451J1423J2642J3581
61965A418739J4025J4336J4984J5928J6711J7091J7330J7697J8062J8184J8227
61954A601314J8553J9102J9364J9083J8667J8665J8994J9026J8363J7299J6363
61943A804793J5669J4911J3884J2735J1664J0583R271P726O195M857L617K268
61931A918173P48p81k093l101l944m801n653o295o593o653o665o659o530o179
61917A852974n546m614l473k370j468p07Q4R61J895K917M042N127N998O703P429
$$ y = [1005841, 1030579, 1055120, 1079043, 1102115, 1124150, 1144885, 1164121, 1181890, 1198291, 1213282, 1226792, 1238974, 1250062, 1259999, 1268437, 1275158, 1280359, 1284522, 1288163, 1291700, 1295385, 1299247, 1303204, 1307289, 1311668, 1316457, 1321671, 1327443, 1334135, 1342040, 1351042, 1360683, 1370642, 1381093, 1392516, 1405158, 1418739, 1432764, 1447100, 1462084, 1478012, 1494723, 1511814, 1529144, 1546841, 1564903, 1583087, 1601314, 1619867, 1638969, 1658333, 1677416, 1696083, 1714748, 1733742, 1752768, 1771131, 1788430, 1804793, 1820462, 1835373, 1849257, 1861992, 1873656, 1884239, 1893510, 1901236, 1907431, 1912288, 1915905, 1918173, 1918921, 1918140, 1916047, 1912946, 1909002, 1904201, 1898548, 1892253, 1885660, 1879007, 1872342, 1865683, 1859153, 1852974, 1847428, 1842814, 1839341, 1836971, 1835503, 1834796, 1834880, 1835841, 1837736, 1840653, 1844695, 1849822, 1855820, 1862523, 1869952]
61902A869952Q209Q937R583J0180J0629J0740J0571J0390J0307J0156R825R451
61890A988930R061Q379P213N877M852M148L284J974N42m97j083j619k378l105
61876B025578l366l138k861k830k777k203r80N74K122L623N169O832Q745J1144
61862B045632J4144J7577K1188K4899K8868L3310L8413M4290N0887N8024O5570
61851B442802P3682Q2733R3018J04557J17178J30760J45352J61082J77994J95972
61841C725130K14747K33826K52400K69335K83148K91698K91861K79883K52574
61832F094602K08595J49091P7706K09p6471j45929k03824k48256k79172k97722
61822E278829l05886l05917k99728k88721k74188k57483k39740k21674k03752
$$ y = [1869952, 1878161, 1887098, 1896681, 1906861, 1917490, 1928230, 1938801, 1949191, 1959498, 1969654, 1979479, 1988930, 1997991, 2006370, 2013583, 2019460, 2024312, 2028460, 2031744, 2033718, 2034260, 2033763, 2032680, 2031061, 2028683, 2025578, 2022212, 2019074, 2016213, 2013383, 2010606, 2008403, 2007423, 2007997, 2010119, 2013742, 2018911, 2025743, 2034488, 2045632, 2059776, 2077353, 2098541, 2123440, 2152308, 2185618, 2224031, 2268321, 2319208, 2377232, 2442802, 2516484, 2599217, 2692235, 2796792, 2913970, 3044730, 3190082, 3351164, 3529158, 3725130, 3939877, 4173703, 4426103, 4695438, 4978586, 5270284, 5562145, 5842028, 6094602, 6303197, 6452288, 6529994, 6530203, 6453732, 6307803, 6103979, 5855723, 5576551, 5278829, 4972943, 4667026, 4367298, 4078577, 3804389, 3546906, 3307166, 3085492, 2881740]
61813B881740j86400j69930j54513j40339j27571j16142j05788r6414q8150q0970
61803A615523p4552o8653o3333n8606n4174m9785m5622m2015l8892l5914l3005
61792A050972l0414k8221k6126k3839k1457j9311j7581j6148j4775j3357j2008
61781H27735j0905j0035r116p903o499n244m325l601k856k126j640j456j262o83
61767G60084K78J213J784K097K492L060L615M043M507N208O218P496Q938J0343
61753H21376J1520J2557J3779J5326J7010J8651K0358K2264K4181K5870K7527
61742A030419K9663L2434L5368L7943M0264M2937M6347N0304N4387N8455O2681
61731A521202O7218P2136P7597Q3814R0743R8111J05941J14768J25081J36763
$$ y = [2881740, 2695340, 2525410, 2370897, 2230558, 2102987, 1986845, 1881057, 1784643, 1696493, 1615523, 1540971, 1472318, 1408985, 1350379, 1296205, 1246420, 1200798, 1158783, 1119891, 1083977, 1050972, 1020558, 992337, 966211, 942372, 920915, 901604, 884023, 867875, 853100, 839743, 827735, 816830, 806795, 797679, 789776, 783277, 778033, 773708, 770107, 767251, 765125, 763485, 762029, 760767, 760084, 760362, 761575, 763359, 765456, 767948, 771008, 774623, 778666, 783173, 788381, 794599, 802095, 811033, 821376, 832896, 845453, 859232, 874558, 891568, 910219, 930577, 952841, 977022, 1002892, 1030419, 1060082, 1092516, 1127884, 1165827, 1206091, 1249028, 1295375, 1345679, 1400066, 1458521, 1521202, 1588420, 1660556, 1738153, 1821967, 1912710, 2010821, 2116762, 2231530, 2356611, 2493374]
61721B493374J49448J63249J78782J96465K16207K37803K61254K86631L13927
61712D497140L43121L74059M06177M38570M70157M99278N22856N36277N34239
61703H621874N11549M63548L87271K83573J58467K2113j13768k38309l43230m24054
61693I329034m80346n14483n29889n30096n18589m98558m72561m42657m10739
61684D931116l78349l46315l15073k85308k57864k33081k10704j90493j72479
61675B541450j56529j42199j29231j17786j07937r9290r1355q4035p7422p1397
61665A464269o5754o0573n6121n2393m9004m5584m2088l8697l5559l2659k9930
61654I55907k7393k5193k3422k1969k0553j8969j7215j5410j3666j2097j0834
$$ y = [2493374, 2642822, 2806071, 2984853, 3181318, 3397525, 3635328, 3896582, 4183213, 4497140, 4840261, 5214320, 5620497, 6059067, 6529224, 7028502, 7551358, 8087635, 8621874, 9133423, 9596971, 9984242, 10267815, 10426282, 10448395, 10334627, 10096318, 9753088, 9329034, 8848688, 8334205, 7804316, 7274220, 6755631, 6257073, 5784512, 5341855, 4931116, 4552767, 4206452, 3891379, 3606071, 3348207, 3115126, 2904422, 2713929, 2541450, 2384921, 2242722, 2113491, 1995705, 1887768, 1788478, 1697123, 1613088, 1535666, 1464269, 1398515, 1337942, 1281821, 1229428, 1180424, 1134840, 1092752, 1054055, 1018496, 985837, 955907, 928514, 903321, 879899, 857930, 837377, 818408, 801193, 785783, 772117, 760020, 749186]
61643G49186r947r383q983q566q000p292o589o054n729n477n090m450l630k843
61629F57153k287k009j971k157k506k819k904k846k922l207l443l406l213l148
61615F18315l379l946m739n399n488n001m521m595n118n599n784n769n689n641
61601E47647n777o089o206n786n034m462m171l773l002k038j169m92rL26P17J388
61585E02070K254K977L421L754M117M465M769N056N168M890M347L912L638L248
61571E58086K705K359K301K145J640J109Q36N56p9q69j412j774k299k936l316
61556E59052l420l625m039m305m141l728l370l079k683k121j517j029p39n85l77
61541E20294K4N77J164J727K220K559K791L162L801M426M660M599M750N364O117
$$ y = [749186, 739239, 729856, 720873, 712307, 704307, 697015, 690426, 684372, 678643, 673166, 668076, 663626, 659996, 657153, 654866, 652857, 650886, 648729, 646223, 643404, 640500, 637654, 634732, 631525, 628082, 624676, 621463, 618315, 614936, 610990, 606251, 600852, 595364, 590363, 585842, 581247, 576129, 570530, 564746, 558977, 553288, 547647, 541870, 535781, 529575, 523789, 518755, 514293, 510122, 506349, 503347, 501309, 500140, 499648, 499639, 499965, 500682, 502070, 504324, 507301, 510722, 514476, 518593, 523058, 527827, 532883, 538051, 542941, 547288, 551200, 554838, 558086, 560791, 563150, 565451, 567596, 569236, 570345, 571181, 571737, 571658, 570789, 569377, 567603, 565304, 562368, 559052, 555632, 552007, 547968, 543663, 539522, 535794, 532424, 529345, 526662, 524541, 523024, 521995, 521256, 520671, 520294, 520318, 520895, 522059, 523786, 526006, 528565, 531356, 534518, 538319, 542745, 547405, 552004, 556754, 562118, 568235]
61526E68235O538O527O303O033N681N180M628M266M275M557M883N182N590O101
61512F43979O461O575O786P450Q348Q952R177R519J0311J1247J1767J1630J0997
61499G63199J0212R634R472R563R488R073Q547Q130P721P184O688O419O168N541
61485H77039M502L412K504J662P30k48j192k121k964l435l299k691k005j464r40
61470H69490k05P18J534K003K207K502L153M176N432O816Q253R646J0987J2460
61456I39172J4289J6496J8988K1810K5147K8995L3064L7092M1178M5637N0621
61445A272489N6032O1772O7878P4371Q1060Q7594R3654R9033J03539J06765J07898
61434B212085J05877R9837Q9587P5632N8818M0064K0414J097j6797l2675m6367
$$ y = [568235, 574773, 581300, 587603, 593636, 599317, 604497, 609125, 613391, 617666, 622223, 627106, 632288, 637878, 643979, 650440, 657015, 663801, 671251, 679599, 688551, 697728, 707247, 717558, 728805, 740572, 752202, 763199, 773411, 783045, 792517, 802080, 811568, 820641, 829188, 837318, 845039, 852223, 858911, 865330, 871498, 877039, 881541, 884953, 887457, 889119, 889849, 889601, 888409, 886288, 883324, 879889, 876590, 873899, 871894, 870430, 869490, 869285, 870003, 871537, 873540, 875747, 878249, 881402, 885578, 891010, 897826, 906079, 915725, 926712, 939172, 953461, 969957, 988945, 1010755, 1035902, 1064897, 1097961, 1135053, 1176231, 1221868, 1272489, 1328521, 1390293, 1458171, 1532542, 1613602, 1701196, 1794850, 1893883, 1997422, 2104187, 2212085, 2317962, 2417799, 2507386, 2583018, 2641836, 2681900, 2702314, 2703411, 2686614, 2653939, 2607572]
61423B607572n7692o6306p2036p5149p6101p5216p2759o9205o5085o0590n5520
61412A861913m9753m3506l7131l0847k4797j9147j3938q987m128N88M992R030
61400A644289J2677J5816J8386K0543K2378K3658K4116K3947K3585K3093K2174
61389A874662K0853J9712J9190J9070J8913J8689J8660J8871J9150J9486K0012
61378B087268K0618K0895K0506J9432J7837J5895J3770J1561R186O455L318J4
61366B246755l070n666p834r913j2133j4241j5672j6207j6240j6217j6054j5307
61354B098201j3786j1717r458p328n567m156k757j055Q01K359L312L569L056J875
61340B057349N14n01j185j906k633k829k154p99R53L148O018R706J4300J9785
$$ y = [2607572, 2549880, 2483574, 2411538, 2336389, 2260288, 2185072, 2112313, 2043108, 1978023, 1917433, 1861913, 1812160, 1768654, 1731523, 1700676, 1675879, 1656732, 1642794, 1633807, 1629679, 1630267, 1635259, 1644289, 1656966, 1672782, 1691168, 1711711, 1734089, 1757747, 1781863, 1805810, 1829395, 1852488, 1874662, 1895515, 1915227, 1934417, 1953487, 1972400, 1991089, 2009749, 2028620, 2047770, 2067256, 2087268, 2107886, 2128781, 2149287, 2168719, 2186556, 2202451, 2216221, 2227782, 2236968, 2243423, 2246741, 2246755, 2243685, 2238019, 2230185, 2220272, 2208139, 2193898, 2178226, 2162019, 2145779, 2129562, 2113508, 2098201, 2084415, 2072698, 2063240, 2055912, 2050345, 2046189, 2043432, 2042377, 2043178, 2045537, 2048849, 2052418, 2055474, 2057349, 2057863, 2057362, 2056177, 2054271, 2051638, 2048809, 2046655, 2045856, 2046809, 2049957, 2055975, 2065681, 2079981, 2099766]
61326B099766K5903L2399L9430M7291N5741O4077P2034P9986Q8089R5815J02630
61315B803161J08527J13340J16114J15723J11724J04065R2463P6854N8155L7882
61305C738008J7103l500k2866l9830n4308o7391p9853r1178j00324j06925j11365
61294C077571j14065j15189j14824j13064j10021j05899j00989r5459q9339q2791
61284B035931p6162o9654o3142n6509m9936m3667l7686l1807k6000k0421j5223
61273A545724j0443o071k087J516M746P688J0534J3422J6234J8668K0475K1576
61261A641982K1956K1687K1034K0314J9594J8661J7345J5759J4174J2783J1603
61250A836892J0465R122P490N751M115K512P16j303l378n485p747j0136j2432
$$ y = [2099766, 2125669, 2158068, 2197498, 2244789, 2300530, 2364607, 2436641, 2516627, 2604716, 2700531, 2803161, 2911688, 3025028, 3141142, 3256865, 3368589, 3472654, 3565117, 3641971, 3700126, 3738008, 3755111, 3751611, 3728745, 3688915, 3634607, 3567216, 3487363, 3396185, 3295861, 3188936, 3077571, 2963506, 2848317, 2733493, 2620429, 2510408, 2404509, 2303520, 2208061, 2118722, 2035931, 1959769, 1890115, 1826973, 1770464, 1720528, 1676861, 1639175, 1607368, 1581368, 1560947, 1545724, 1535281, 1529210, 1527123, 1528639, 1533385, 1541073, 1551607, 1565029, 1581263, 1599931, 1620406, 1641982, 1663938, 1685625, 1706659, 1726973, 1746567, 1765228, 1782573, 1798332, 1812506, 1825289, 1836892, 1847357, 1856479, 1863969, 1869720, 1873835, 1876347, 1877063, 1875760, 1872382, 1866897, 1859150, 1849014, 1836582]
61237A836582j4531j6562j8569k0395k1921k3248k4460k5477k6179k6521k6413
61226A592306k5704k4428k2859k1177j9356j7403j5527j3832j2078j0055p995
61215A401892o400n479n020m785m789n137n722o202o300o073n815n625n203m230
61201A325112k835j457j97J355L529O179R041J2233J6019K0245K4417K8297L2126
61188A474064L6115M0019M3384M6045M8117M9525M9743M8094M4150L7796K9022
61177A946074J7920M933r044k2915l5708m6673n5328o1550o5527o7502o7630o6168
61165A470882o3596o0361n6651n2587m8433m4440m0603l6875l3437l0438k7626
61154I75835k4633k1578j8960j6945j5181j3371j1610j0006q400o645m872l209
$$ y = [1836582, 1822051, 1805489, 1786920, 1766525, 1744604, 1721356, 1696896, 1671419, 1645240, 1618719, 1592306, 1566602, 1542174, 1519315, 1498138, 1478782, 1461379, 1445852, 1432020, 1419942, 1409887, 1401892, 1395492, 1390013, 1384993, 1380208, 1375419, 1370282, 1364560, 1358358, 1352058, 1345985, 1340170, 1334545, 1329342, 1325112, 1322277, 1320820, 1320623, 1321978, 1325507, 1331686, 1340727, 1352960, 1368979, 1389224, 1413641, 1441938, 1474064, 1510179, 1550198, 1593582, 1639627, 1687744, 1737269, 1787012, 1835106, 1879256, 1917052, 1946074, 1963994, 1968927, 1959883, 1936968, 1901260, 1854587, 1799259, 1737709, 1672182, 1604680, 1537050, 1470882, 1407286, 1346925, 1290274, 1237687, 1189254, 1144814, 1104211, 1067336, 1033899, 1003461, 975835, 951202, 929624, 910664, 893719, 878538, 865167, 853557, 843551, 835151, 828506, 823634, 820425]
61142H20425j600rJ369K387L174L874M347M354L903L208K441J677R57K59m62j125
61126H49179j579j891k419l423m745o015p003p616p795p618p404p466p772p960
61112G68473p724p105o487o303o700p418q122q684r178r607r926j0229j0661j1184
61098F49145j1674j2167j2697j3029j2921j2648j2759j3277j3634j3510j3244
61087E07585j3163j3061j2641j2030j1467j0828r912q878q007p272o492n710n000
61074C83124m136k930j681r11o91o04l24J33P12J466K374L215L753L971M116M492
61058C96079N098N483N238M647M481N040N800O190O278O365O390O186N889N600
61044D74764M961L679K186J250R80Q20L83k10p95j362j793j896j771j766k013
$$ y = [820425, 818825, 818816, 820185, 822572, 825746, 829620, 833967, 838321, 842224, 845432, 847873, 849550, 850507, 850766, 850304, 849179, 847600, 845709, 843290, 839867, 835122, 829107, 822104, 814488, 806693, 799075, 791671, 784205, 776433, 768473, 760749, 753644, 747157, 740854, 734154, 726736, 718614, 709930, 700752, 691145, 681219, 670990, 660329, 649145, 637471, 625304, 612607, 599578, 586657, 574009, 561250, 547973, 534339, 520829, 507585, 494422, 481361, 468720, 456690, 445223, 434395, 424483, 415605, 407598, 400326, 393834, 388124, 383124, 378988, 376058, 374377, 373466, 372775, 372171, 371847, 371980, 372692, 374158, 376532, 379747, 383500, 387471, 391587, 396079, 401177, 406660, 411898, 416545, 421026, 426066, 431866, 438056, 444334, 450699, 457089, 463275, 469164, 474764, 479725, 483404, 485590, 486840, 487820, 488640, 489023, 488813, 488018, 486656, 484863, 482967, 481196, 479430, 477417]
61029D77417k337k646k985l294l449l558l813m082m071l873l872m088m115l772
61015D27462l355l141l079l027k992k918k684k413k374k517k500k290k288k627
61001C89257k889k764k565k721l129l387l423l441l480l324k818k008j063k70
60987C51975R6J00J99P61J623K348K787L133L589M197M903N553N881N763N441
60972C98349N288N373N473N465N472N591N705N737N859O320P095P903Q543R080
60958D87253R698J0503J1470J2504J3479J4361J5356J6809J8819K1066K3201K5252
60946F79771K7438K9709L1828L3872L6202L8928M1731M4367M6979M9757N2681
60935A113263N5820N9499O3877O8738P3925P9647Q6051R2910J00115J08088J17385
$$ y = [477417, 475080, 472434, 469449, 466155, 462706, 459148, 455335, 451253, 447182, 443309, 439437, 435349, 431234, 427462, 424107, 420966, 417887, 414860, 411868, 408950, 406266, 403853, 401479, 398962, 396462, 394172, 391884, 389257, 386368, 383604, 381039, 378318, 375189, 371802, 368379, 364938, 361458, 358134, 355316, 353308, 352245, 351975, 352071, 352171, 352370, 353131, 354754, 357102, 359889, 363022, 366611, 370808, 375711, 381264, 387145, 392908, 398349, 403637, 409010, 414483, 419948, 425420, 431011, 436716, 442453, 448312, 454632, 461727, 469630, 478173, 487253, 496951, 507454, 518924, 531428, 544907, 559268, 574624, 591433, 610252, 631318, 654519, 679771, 707209, 736918, 768746, 802618, 838820, 877748, 919479, 963846, 1010825, 1060582, 1113263, 1169083, 1228582, 1292459, 1361197, 1435122, 1514769, 1600820, 1693730, 1793845, 1901933, 2019318]
60924B019318J28380J41713J58411J78899K02462K28563K58058K92200L31240
60915C939244L75465M27108M89243N62930O47109P39518Q31042Q95374Q90754
60906I797787P85031N87207L52389J49849K2854k3825p148N0122J15702J41205
60896A1971173P8596q5943l15256n42613p12412q04537q29007q07046p58223o97229
60886F497503o33779n72552n14594m59793m08063l59249l13384k71287k34191
60877B730611k02662j76407j54933j37712j23798j12022j01781r3212q6433q0987
60867A460664p6128p1339o6468o1637n7159n3338n0251m7748m5622m3659m1627
60856H45688l9383l6953l4385l1665k8845k6247k4229k2851k1827k0782j9490
$$ y = [2019318, 2147698, 2289411, 2447822, 2626721, 2829183, 3057746, 3315804, 3608004, 3939244, 4314709, 4741817, 5231060, 5793990, 6441099, 7180617, 8011659, 8907033, 9797787, 10582818, 11170025, 11522414, 11672263, 11695117, 11671292, 11664144, 11714266, 11829968, 11971173, 12049769, 11963826, 11648570, 11105957, 10393545, 9589008, 8760001, 7952955, 7194732, 6497503, 5863724, 5291172, 4776578, 4316785, 3908722, 3549473, 3236089, 2964802, 2730611, 2527949, 2351542, 2196609, 2058897, 1935099, 1823077, 1721296, 1628084, 1541651, 1460664, 1384536, 1313197, 1246729, 1185092, 1127933, 1074595, 1024344, 976596, 930974, 887315, 845688, 806305, 769352, 734967, 703302, 674457, 648210, 623981, 601130, 579303, 558521, 539031]
60845E39031j7972j6463j5201j4182j3223j2285j1525j0970j0408r757r232q938
60833C88875q574p818o820n985n409m860m227l661l260k939k614k299j988j623
60819C26798j213q33n05j91R5L06N20R22J545K172K555K721K949L433M061M635
60803C49970N190N903O650O977O705O249O045N864N176M012K965K295J609N60
60789D16170o44j654k434l058l358l212k829k491k159j681j114n96o8M88P84N03
60773C92647j76o80o37j45M77J015J442J860K324K731K923L013L347M065M882
60758D19088N493N959O533P226P758P865P508O938O553O500O444N927N022M267
60744E09081L921L688L296K910K659K270J496N62k77j229k556l929m767n058n400
$$ y = [539031, 521059, 504596, 489395, 475213, 461990, 449705, 438180, 427210, 416802, 407045, 397813, 388875, 380301, 372483, 365663, 359678, 354269, 349409, 345182, 341521, 338261, 335322, 332708, 330409, 328421, 326798, 325585, 324752, 324247, 324056, 324151, 324457, 324977, 325899, 327444, 329616, 332171, 334892, 337841, 341274, 345335, 349970, 355160, 361063, 367713, 374690, 381395, 387644, 393689, 399553, 404729, 408741, 411706, 414001, 415610, 416170, 415526, 413872, 411438, 408380, 405022, 401810, 398981, 396490, 394331, 392650, 391536, 390940, 390872, 391360, 392144, 392647, 392471, 391791, 391154, 391009, 391486, 392501, 393943, 395803, 398127, 400858, 403781, 406794, 410141, 414206, 419088, 424581, 430540, 437073, 444299, 452057, 459922, 467430, 474368, 480921, 487421, 493865, 499792, 504814, 509081, 513002, 516690, 519986, 522896, 525555, 527825, 529321, 529883, 529606, 528377, 525821, 521892, 517125, 512067, 506667]
60729E06667o224p393q496r192r262q728p903p121o456n878n484n301n015m240
60715D09974l017j722o31K01P61J126J605K444L461M185M352M020L389K755K435
60700D35338K419K264J624P58J48j41l55m64k05M10J089J719K372K974L435M040
60684D57425N172O592P555P754P653P783Q111Q332Q367Q268P981P437O697N809
60670E60936M723L467K248J218L54l63q65j144j307j420j486j597j935k505l103
60655E57221l561l902m243m735n521o537p428p862p944p986p984p675p116o774
60641D67953o873p071o924o474o043n764n524n246m952m611m090l274k192j023
60627C97892J1P92J385J900K400K948L648M460N127N421N358N038M435L552K602
$$ y = [506667, 500443, 493050, 484554, 475362, 466100, 457372, 449469, 442348, 435892, 430014, 424530, 419229, 414214, 409974, 406957, 405235, 404604, 404805, 405566, 406692, 408297, 410741, 414202, 418387, 422739, 426759, 430148, 432903, 435338, 437757, 440021, 441645, 442403, 442551, 442410, 442055, 441591, 441386, 441796, 442885, 444604, 446976, 449950, 453385, 457425, 462597, 469189, 476744, 484498, 492151, 499934, 508045, 516377, 524744, 533012, 540993, 548430, 555127, 560936, 565659, 569126, 571374, 572592, 572946, 572583, 571718, 570574, 569267, 567847, 566361, 564764, 562829, 560324, 557221, 553660, 549758, 545515, 540780, 535259, 528722, 521294, 513432, 505488, 497502, 489518, 481843, 474727, 467953, 461080, 454009, 447085, 440611, 434568, 428804, 423280, 418034, 413082, 408471, 404381, 401107, 398915, 397892, 397903, 398695, 400080, 401980, 404380, 407328, 410976, 415436, 420563, 425984, 431342, 436380, 440815, 444367, 446969]
60612D46969J757Q48l75j797l055m050m976n877o500o659o475o191n970n905o010
60597C85734o189o322o311n977n208m310l898m066m088l360k351j932k137k231
60583C27354j939j729j899k166k311k451k471j938r12j52o3j13K56P50Q28P07
60567C11751R93J697K282K601L052L822M559M933N135N564O311P153P852Q344
60553C76049Q680Q977R426J0239J1470J2830J3831J4257J4289J4123J3641J2645
60541E20457J1259R710P948N842L629J680j11k118m196n689o426p027p980q911
60527E18067r165q669p881p167o651o323o040n650n306n348n680n672n046m376
60513D29093m298m539m321l414k317j490r22m68j04J92N73J195K087L096L905
$$ y = [446969, 448726, 449574, 449199, 447402, 444347, 440297, 435321, 429444, 422944, 416285, 409810, 403619, 397649, 391744, 385734, 379545, 373223, 366912, 360935, 355727, 351417, 347519, 343453, 339365, 336005, 333654, 331722, 329585, 327354, 325415, 323686, 321787, 319621, 317310, 314859, 312388, 310450, 309538, 309386, 309323, 309210, 309466, 310216, 311044, 311751, 312744, 314441, 316723, 319324, 322376, 326198, 330757, 335690, 340825, 346389, 352700, 359853, 367705, 376049, 384729, 393706, 403132, 413371, 424841, 437671, 451502, 465759, 480048, 494171, 507812, 520457, 531716, 541426, 549374, 555216, 558845, 560525, 560414, 558296, 554100, 548411, 541985, 534958, 526978, 518067, 508902, 500233, 492352, 485185, 478534, 472211, 466171, 460521, 455215, 449867, 444187, 438515, 433469, 429093, 424795, 420256, 415935, 412521, 410204, 408714, 407792, 407324, 407220, 407412, 407985, 409180, 411267, 414363, 418268]
60498D18268M297M461M869N651O414O871P330Q254R563J0741J1507J2037J2637
60485E22900J3482J4613J5966J7406J8898K0472K2010K3245K4071K4517K4269
60474G41849K2620J9139J4159Q339K179l746q652j2086j4345j5778j6134j5106
60462G22438j3236j1479j0005q165n604k733m0K478M975P357R431J1132J2473
60449G19022J3575J4750J6291J8198K0436K3290K7012L1301L5693M0450M6334
60438A006352N3452O1089O8856P7267Q6817R7155J07684J18307J28993J38970
60428A944942J47011J52068J52890J47327J33081J09450P7900M0825M38m0898
60418B865034p9928j13046j37710j53292j60675j61425j57209j49549j39722j28781
$$ y = [418268, 422565, 427026, 431895, 437546, 443960, 450831, 458161, 466415, 475978, 486719, 498226, 510263, 522900, 536382, 550995, 566961, 584367, 603265, 623737, 645747, 668992, 693063, 717580, 741849, 764469, 783608, 797767, 806106, 808285, 804539, 795887, 783801, 769456, 753678, 737544, 722438, 709202, 697723, 687718, 679553, 673949, 671216, 671176, 673654, 678629, 685986, 695417, 706549, 719022, 732597, 747347, 763638, 781836, 802272, 825562, 852574, 883875, 919568, 960018, 1006352, 1059804, 1120893, 1189749, 1267016, 1353833, 1450988, 1558672, 1676979, 1805972, 1944942, 2091953, 2244021, 2396911, 2544238, 2677319, 2786769, 2864669, 2905494, 2905932, 2865034, 2785106, 2672060, 2534350, 2381058, 2220383, 2058958, 1901749, 1752200, 1612478, 1483697]
60408A483697j17600j06799r6589q6830p7387o8468o0581n4118m8953m4499m0162
60397F81711l5844l1888k8572k5750k3116k0701j8822j7565j6566j5473j4338
60386D33076j3375j2560j1741j0961j0373r891r287q581p988p520o961o298n750
60373C11790n323m700l787l003k789l062l346l260k700j820r85n78n66n35k31
60358B75105J61M58P84J258J656J768J754J848J980K006K070K303K444K219J863
60343B99677J784J903J842J651J712K001K040J683J375J477J827K139K398K609
60329C26118K583K247J847J616J479J345J328J484J570J320Q10K69k55p67j083
60314C41911j013p16n66o40o29k91K10N49O30O33O90P57P90R18J257J629J758
$$ y = [1483697, 1366097, 1259298, 1162709, 1075879, 998492, 930024, 869443, 815325, 766372, 721873, 681711, 645867, 613979, 585407, 559657, 536541, 515840, 497018, 479453, 462887, 447414, 433076, 419701, 407141, 395400, 384439, 374066, 364175, 354888, 346307, 338319, 330799, 323838, 317540, 311790, 306467, 301767, 297980, 294977, 292188, 289126, 285780, 282520, 279820, 278000, 277015, 276437, 275871, 275336, 275105, 275266, 275724, 276508, 277766, 279422, 281190, 282944, 284792, 286772, 288778, 290848, 293151, 295595, 297814, 299677, 301461, 303364, 305206, 306857, 308569, 310570, 312610, 314293, 315668, 317145, 318972, 321111, 323509, 326118, 328701, 330948, 332795, 334411, 335890, 337235, 338563, 340047, 341617, 342937, 343747, 344016, 343761, 342994, 341911, 340898, 340182, 339616, 338976, 338347, 338056, 338266, 338815, 339445, 340078, 340768, 341525, 342315, 343233, 344490, 346119, 347877]
60297C47877J676J693J894K029K052K362L172L953M046L642L525L946M284M009
60283C90160L393K990K881K771K525K215J864J494J266J283J388J397J391J573
60269D18591J932K302K671L116L567L850L941L897L640L042K209J365N01n82j824
60254D52218k827l343l527l605l531l250k990k999l102k894k332j789j433r88
60240D13608k89K55J58l78o18k14M01O60N67N30P35R95J134J211J291J280J098
60223D22424R18R79J245J388J247J146J592K647L798M550M963N475O297P230Q001
60208D73900Q551Q985R462J0175J1214J2394J3409J4237J5176J6415J7824J9227
60196F30969K0708K2454K4492K6716K8981L1119L3071L5073L7512M0393M3221
$$ y = [347877, 349553, 351246, 353140, 355169, 357221, 359583, 362755, 366708, 370754, 374396, 377921, 381867, 386151, 390160, 393553, 396543, 399424, 402195, 404720, 406935, 408799, 410293, 411559, 412842, 414230, 415627, 417018, 418591, 420523, 422825, 425496, 428612, 432179, 436029, 439970, 443867, 447507, 450549, 452758, 454123, 454624, 454042, 452218, 449391, 446048, 442521, 438916, 435385, 432135, 429145, 426146, 423044, 420150, 417818, 416029, 414596, 413608, 413319, 413574, 413732, 413354, 412736, 412522, 412923, 413583, 414150, 414680, 415415, 416410, 417544, 418755, 420046, 421326, 422424, 423342, 424321, 425566, 426954, 428201, 429347, 430939, 433586, 437384, 441934, 446897, 452372, 458669, 465899, 473900, 482451, 491436, 500898, 511073, 522287, 534681, 548090, 562327, 577503, 593918, 611742, 630969, 651677, 674131, 698623, 725339, 754320, 785439, 818510, 853583, 891095, 931488, 974709]
60185I74709M5638M7833N0141N2408N4135N5018N5078N4369N2929N0835M8012
60174A541105M4125L9058L3418K8055K3096J7908J2177O535J845j772m855p718
60162A732977j0004j1136j0949r799q149o142l565k44L605P532J1299J5068J9137
60149A729630K3552K8104L2620L7106M1557M5671M8886N0793N1404N0914M9279
60138B189516M6267M1853L6361L0092K3111J5501P619p9p338j4131k0463k6279
60126B322030l1415l5552l8332l9591l9341l7563l4303k9946k5059j9807j3907
60115A977214p348o96N589J1689J7883K3818K8848L2838L6101L8647M0016L9847
60103B244446L8211L5382L1607K7081K1902J6114J0023M286n20m245o826p906
$$ y = [974709, 1020347, 1068180, 1118321, 1170729, 1224864, 1279882, 1334960, 1389329, 1442258, 1493093, 1541105, 1585230, 1624288, 1657706, 1685761, 1708857, 1726765, 1738942, 1745477, 1747322, 1745550, 1740695, 1732977, 1722973, 1711837, 1700888, 1691089, 1682940, 1676798, 1673233, 1672989, 1676594, 1684126, 1695425, 1710493, 1729630, 1753182, 1781286, 1813906, 1851012, 1892569, 1938240, 1987126, 2037919, 2089323, 2140237, 2189516, 2235783, 2277636, 2313997, 2344089, 2367200, 2382701, 2390320, 2390241, 2382903, 2368772, 2348309, 2322030, 2290615, 2255063, 2216731, 2177140, 2137799, 2100236, 2065933, 2035987, 2010928, 1991121, 1977214, 1969866, 1969170, 1974759, 1986448, 2004331, 2028149, 2056997, 2089835, 2125936, 2164583, 2204599, 2244446, 2282657, 2318039, 2349646, 2376727, 2398629, 2414743, 2424766, 2429052, 2428532, 2424287, 2417461, 2409555]
60091B409555p198m932j455L298R430J6456K3730L1347L9818M8942N7827O6187
60079B693005P4757Q4140R3971J03618J13080J22637J32150J41228J49742J57633
60069C865961J64399J69258J71707J71576J68680J62809J53997J42487J28428
60060E299302J11870R3082P2658N1180K8879N725j8122m2016o5020q6325j05321
60049E345892j21255j33236j40851j44555j45110j42743j37230j28672j17752
60040D134488j05254r1673p7325o2468m7308l2168j7654m252Q120J9679K9963
60029C754148L7917M2900M5024M4511M1279L5427K7562J8330Q057k828j3530k3422
60017D015375l2553m1216m9277n6304o2206o7356p2158p6574q0108q2191q2702
$$ y = [2409555, 2402357, 2397425, 2395970, 2399268, 2408698, 2425154, 2448884, 2480231, 2520049, 2568991, 2626818, 2693005, 2767762, 2851902, 2945873, 3049491, 3162571, 3285208, 3417358, 3558586, 3708328, 3865961, 4030360, 4199618, 4371325, 4542901, 4711581, 4874390, 5028387, 5170874, 5299302, 5411172, 5504254, 5576912, 5628092, 5656971, 5662696, 5644574, 5602558, 5537538, 5451213, 5345892, 5224637, 5091401, 4950550, 4805995, 4660885, 4518142, 4380912, 4252240, 4134488, 4029234, 3937561, 3860236, 3797768, 3750460, 3718292, 3700638, 3696386, 3704506, 3724185, 3754148, 3792065, 3834965, 3879989, 3924500, 3965779, 4001206, 4028768, 4047098, 4055155, 4052327, 4038797, 4015375, 3982822, 3941606, 3892329, 3836025, 3773819, 3706463, 3634305, 3557731, 3477623, 3395432, 3312730]
60006C312730q2097q0826p8728p5278p0377o4422n7683n0147m2010l3718k5347
59995B652097j6567p462J275R277J7039K4977L2571L8976M4066M8159N1045N1978
59983B947431N0564M7133M2200L6017K8676K0245J0832P38r483j9371k8844l7878
59971C088260m6040n2711n7620o0896o2642o2766o1244n8243n4000m8759m2743
59960B480596l6096k8859k1197j3462n892J570R080J6587K3966L1235L8477M5681
59948B541686N2765N9593O5794P0815P4279P6117P6177P4077O9630O3176N5219
59937C279328M5967L5554K4370J2874J232j0477k1858l2341m1595m9467n5660
59926C187927n9778o1673o1522n9601n6136n1312m5265l8128l0249k2072j3754
$$ y = [3312730, 3230633, 3149807, 3071079, 2995801, 2925424, 2861002, 2803319, 2753172, 2711162, 2677444, 2652097, 2635530, 2628068, 2629343, 2638620, 2655659, 2680636, 2713207, 2752183, 2796249, 2844408, 2895453, 2947431, 2997995, 3045128, 3087328, 3123345, 3152021, 3172266, 3183098, 3183836, 3174353, 3154982, 3126138, 3088260, 3042220, 2989509, 2931889, 2870993, 2808351, 2745585, 2684341, 2626098, 2572098, 2523339, 2480596, 2444500, 2415641, 2394444, 2380982, 2375090, 2376660, 2385740, 2402327, 2426293, 2457528, 2496005, 2541686, 2594451, 2654044, 2719838, 2790653, 2864932, 2941049, 3017226, 3091303, 3160933, 3224109, 3279328, 3325295, 3360849, 3385219, 3398093, 3399325, 3388848, 3366990, 3334649, 3293054, 3243587, 3187927, 3128149, 3066476, 3004954, 2945353, 2889217, 2837905, 2792640, 2754512, 2724263, 2702191, 2688437]
59915B688437n138L683J2178J9967K7240L4262M0731M6010M9844N2369N3612N3420
59903C076615N1827M9151M5760M1965L8038L4038K9798K5340K1175J7860J5473
59892C447040J3861J3274J4294J7160K1573K7249L4266M2807N2779O3859P5790
59881C823952Q8559J02259J16694J31192J44955J57623J69144J79035J86098J89029
59871E288540J86941J79159J65010J44206J17180Q4805M8198R177k9613o5682
59861F127921r7706j25172j47438j63757j74001j78744j78693j74514j67114j57427
59851D563355j45933j32798j18486j03730q8876p3741n8199m2463k6838j1566
59841C760725L008J6516K8910M0336N0611N9089O5150O8493O8931O6109N9582
$$ y = [2688437, 2683299, 2686982, 2699160, 2719127, 2746367, 2780629, 2821360, 2867370, 2917214, 2969583, 3023195, 3076615, 3128442, 3177593, 3223353, 3265318, 3303356, 3337394, 3367192, 3392532, 3413707, 3431567, 3447040, 3460901, 3474175, 3488469, 3505629, 3527202, 3554451, 3588717, 3631524, 3684303, 3748162, 3823952, 3912511, 4014770, 4131464, 4262656, 4407611, 4565234, 4734378, 4913413, 5099511, 5288540, 5475481, 5654640, 5819650, 5963856, 6081036, 6165841, 6214039, 6223216, 6193603, 6127921, 6030215, 5905043, 5757605, 5593848, 5419847, 5241103, 5062410, 4887896, 4720782, 4563355, 4417422, 4284624, 4166138, 4062408, 3973532, 3899791, 3841592, 3799129, 3772291, 3760725, 3763733, 3780249, 3809159, 3849495, 3900106, 3959195, 4024345, 4092838, 4161769, 4227878, 4287460]
59830D287460M9001L4327J6070m729k6892m9408p1239r1202j08390j22533j33614
59819C778851j41361j45535j46456j44800j41005j35332j28303j20523j12150
59810B563386j03072r3598q4401p5808o7671n9928n2819m6427m0551l5156l0579
59799A873376k7142k4867k3631k3245k3342k3512k3580k3491k2993k1782j9946
59788A615845j7867j5709j3365j0885q599o818n766n714o808q778j1139j3572
59776A490825j5810j7419j8191j8460j8529j8006j6371j3977j1671r592p163m232
59764A321404j307J435M477Q022J1583J4770J7734K0507K2703K4259K5749K7489
59752A498825K9002K9817L0181L0434L0276K9187K7124K4279K0637J6366J2202
$$ y = [4287460, 4336461, 4370788, 4386858, 4382129, 4355237, 4305829, 4234590, 4143388, 4034998, 3912465, 3778851, 3637490, 3491955, 3345499, 3200699, 3059694, 2924362, 2796059, 2675536, 2563386, 2460314, 2366716, 2282315, 2206507, 2138836, 2078908, 2026089, 1979662, 1939111, 1903955, 1873376, 1846234, 1821367, 1797736, 1774491, 1751149, 1727637, 1704057, 1680566, 1657573, 1635791, 1615845, 1597978, 1582269, 1568904, 1558019, 1549420, 1542602, 1536836, 1531122, 1524314, 1515536, 1504397, 1490825, 1475015, 1457596, 1439405, 1420945, 1402416, 1384410, 1368039, 1354062, 1342391, 1332799, 1325636, 1321404, 1320097, 1321532, 1326009, 1334031, 1345614, 1360384, 1378118, 1398625, 1421328, 1445587, 1471336, 1498825, 1527827, 1557644, 1587825, 1618259, 1648535, 1677722, 1704846, 1729125, 1749762, 1766128, 1778330]
59741A778330Q917O620N073M325M551N639P424J0030J3518J7529K1766K6553L2383
59728A942658L9136M6311N3782O1827P0564P9918R0003J01006J12755J24799J36861
59717B859620J48694J59551J68008J72209J69883J58510J36380J04031O4581K2661
59707D164128j7099n1118p7419r5659j06576j11258j10932j06974j00619r2518
59697C293956q2861p1978o0498m8988l7623k6360j5258m541N553J5028K4200L3449
59685C024079M2801N1940O0771O9702P9228Q9374R9879J10672J21938J33822J46394
59674D030600J59774J73983J88770K03856K19276K35159K51282K67166K82493
59665F012359K97056L10160L20550L27085L29300L27165L20747L10397K97196
$$ y = [1778330, 1787247, 1793867, 1798940, 1803265, 1807816, 1813455, 1820879, 1830909, 1844427, 1861956, 1883722, 1910275, 1942658, 1981794, 2028105, 2081887, 2143714, 2214278, 2294196, 2384199, 2485205, 2597960, 2722759, 2859620, 3008314, 3167865, 3335873, 3508082, 3677965, 3836475, 3972855, 4076886, 4141467, 4164128, 4147029, 4095911, 4018492, 3922833, 3816257, 3704999, 3594067, 3487093, 3386474, 3293956, 3211095, 3139117, 3078619, 3029631, 2992008, 2965648, 2950390, 2945849, 2951402, 2966430, 2990630, 3024079, 3066880, 3118820, 3179591, 3249293, 3328521, 3417895, 3517774, 3628446, 3750384, 3884206, 4030600, 4190374, 4364357, 4553127, 4756983, 4976259, 5211418, 5462700, 5729866, 6012359, 6309415, 6619575, 6940125, 7267210, 7596510, 7923675, 8244422, 8554819, 8852015]
59656H852015K82866K69228K57760K49567K45372K45458K49660K57526K68284
59647A1177736K80619K92607L02180L07658L07759L01163K86471K62839K30575
59638A3749607J91081J46470R9363N2676R101k9268o0744q3852r7749j02713r9719
59627A3774253q9522p2571m9703k2228Q856M3308Q1018J21321J63199K05821K48538
59616A4412290K90487L30372L66417L96252M16976M25498M18740L93738L48111
59607A7798881K81070J94174R1315k1692j37639k48876l48704m32389m97233n42279
59597A6136628n68183n76983n71397n54314n28809m98350m66524m36704m12061
59588A1523303l95510l88992l92416m03213m17018m29158m36217m36787m31001
$$ y = [8852015, 9134881, 9404109, 9661869, 9911436, 10156808, 10402266, 10651926, 10909452, 11177736, 11458355, 11750962, 12053142, 12360800, 12668559, 12969722, 13256193, 13519032, 13749607, 13940688, 14087158, 14186521, 14239197, 14248298, 14219030, 14158286, 14074434, 13976685, 13873972, 13774253, 13684731, 13612160, 13562457, 13540229, 13549085, 13592393, 13673411, 13794732, 13957931, 14163752, 14412290, 14702777, 15033149, 15399566, 15795818, 16212794, 16638292, 17057032, 17450770, 17798881, 18079951, 18274125, 18365440, 18343748, 18206109, 17957233, 17608529, 17176140, 16678907, 16136628, 15568445, 14991462, 14420065, 13865751, 13336942, 12838592, 12372068, 11935364, 11523303, 11127793, 10738801, 10346385, 9943172, 9526154, 9096996, 8660779, 8223992, 7792991]
59579G792991m19530m03256l83551l62106l40093l17712k94874k72006k49898
59570D749965k29055k09491j91062j73711j57494j42555j29005j16721j05418
59561C295453r4941q5346p6623o8680o1658n5902n1428m7745m4483m1863m0373
59550B626411m0104m0782m2125m3929m5917m7772m9281n0311n0797n0818n0457
59539B114118m9485m7474m4364m0679l7019l3542l0124k6669k3110j9377j5598
59528A746677j2075q902n836k749J45K678N006P226R078J0337J1247J2252J3479
59515A788563J4745J5903J6937J7984J9388K1483K4187K7062K9968L3246L7082
59504B046548M1146M5156M9356N4074N9200O4511P0130P6286Q2870Q9673R6795
$$ y = [7792991, 7373461, 6970205, 6586654, 6224548, 5884455, 5566743, 5271869, 4999863, 4749965, 4520910, 4311419, 4120357, 3946646, 3789152, 3646597, 3517592, 3400871, 3295453, 3200512, 3115166, 3038543, 2969863, 2908205, 2852303, 2800875, 2753130, 2708647, 2666784, 2626411, 2586307, 2545525, 2503400, 2459471, 2413554, 2365782, 2316501, 2266190, 2215393, 2164575, 2114118, 2064633, 2017159, 1972795, 1932116, 1895097, 1861555, 1831431, 1804762, 1781652, 1762275, 1746677, 1734602, 1725700, 1719864, 1717115, 1717260, 1719938, 1724944, 1732170, 1741248, 1751585, 1762832, 1775084, 1788563, 1803308, 1819211, 1836148, 1854132, 1873520, 1895003, 1919190, 1946252, 1976220, 2009466, 2046548, 2087694, 2132850, 2182206, 2236280, 2295480, 2359991, 2430121, 2506407, 2589277, 2678950, 2775745]
59493B775745J04329J11944J19224J26219J33190J39961J45978J50841J54378
59484C961809J56339J56424J54665J51409J47005J41675J35593J28925J21887
59475E255731J14814J07882J00729R2886Q4701P7358P1644O7250O3515O0170N6861
59464F153541N2541M6097L7100K5400J0512p822k8822n1272p4618r8734j22817
59453E941106j45431j65466j82366j95580k04629k09701k11385k09846k05004
59444D211698j97501j88596j78946j68251j56305j43721j31287j19237j07421
59435B820433r5846q4720p4358o5076n6900m9279m1491l3389k5371j7706j0375
59424B265922l456K891Q915J5177K1867K8672L5411M2293M9464N6824O4397P2377
$$ y = [2775745, 2880074, 2992018, 3111242, 3237461, 3370651, 3510612, 3656590, 3807431, 3961809, 4118148, 4274572, 4429237, 4580646, 4727651, 4869326, 5004919, 5133844, 5255731, 5370545, 5478427, 5579156, 5672042, 5756743, 5834101, 5905745, 5972995, 6036510, 6096680, 6153541, 6206082, 6252179, 6289279, 6314679, 6325191, 6317369, 6288547, 6237275, 6162657, 6063923, 5941106, 5795675, 5630209, 5447843, 5252263, 5047634, 4837933, 4626548, 4416702, 4211698, 4014197, 3825601, 3646655, 3478404, 3322099, 3178378, 3047091, 2927854, 2820433, 2724587, 2639867, 2565509, 2500433, 2443533, 2394254, 2352763, 2319374, 2294003, 2276297, 2265922, 2262466, 2265357, 2274272, 2289449, 2311316, 2339988, 2375399, 2417692, 2467156, 2523980, 2588377, 2660754]
59412B660754Q0613Q8504R5636J02071J07843J12504J15309J15547J12628J06200
59402C697609R6308Q3218O7095M8161K7034M527j8750m2132o4363q3995j00359
59391C714353j13587j23699j30361j33601j34113j32585j29304j24566j18927
59382B573610j12744j05979r8668r1133q3574p5942o8437o1595n5582m9931m4209
59371A725816l8584l3400k8663k4226k0100j6262j2526q883n606k777n5K830N713
59358A543277Q312J0629J2800J4931J7214J9848K2710K5464K8064L0626L2717
59347A766592L3492L2945L2408L3316L5955L9820M4711N0791N7950O5726P3751
59336B267457Q1806Q9551R6786J03934J11850J21193J32171J44785J58884J74010
$$ y = [2660754, 2741367, 2829871, 2925507, 3027578, 3135421, 3247925, 3363234, 3478781, 3591409, 3697609, 3793917, 3877135, 3944230, 3992391, 4019425, 4023952, 4005202, 3963070, 3898707, 3814712, 3714353, 3600766, 3477067, 3346706, 3213105, 3078992, 2946407, 2817103, 2692537, 2573610, 2460866, 2354887, 2256219, 2165086, 2081512, 2005570, 1937133, 1875538, 1819956, 1770025, 1725816, 1687232, 1653832, 1625169, 1600943, 1580843, 1564581, 1552055, 1543172, 1537566, 1534789, 1534734, 1537564, 1543277, 1551589, 1562218, 1575018, 1589949, 1607163, 1627011, 1649721, 1675185, 1703249, 1733875, 1766592, 1800084, 1833029, 1865437, 1898753, 1934708, 1974528, 2019239, 2070030, 2127980, 2193706, 2267457, 2349263, 2438814, 2535600, 2639534, 2751384, 2872577, 3004748, 3149533, 3308417, 3482427]
59326C482427J89540K05041K20275K34817K47834K58202K64803K66824K63962
59317E633725K56290K44047K27680K08139J86815J64920J43116J21755J01193
59308G287680Q1635O2893M4533K6170P462j1990l2533n4232p6752r9314j20746
59297G114806j39761j55294j66565j72991j74429j71453j65207j56896j47704
59288E664506j39018j32153j27755j25826j26338j29376j34542j40823j47243
59279D461432j53294j58536j62253j63848j63265j60759j56535j50849j44138
59270C047955j36766j28905j20766j12614j04436r5968q7315p9129p1876o5327
59260B044853n9069n3114m7672m2661l7911l3537k9730k6306k2877j9314j5726
$$ y = [3482427, 3671967, 3877008, 4097283, 4332100, 4579934, 4838136, 5102939, 5369763, 5633725, 5890015, 6134062, 6361742, 6569881, 6756696, 6921616, 7064732, 7186487, 7287680, 7369315, 7432208, 7476741, 7502911, 7510373, 7498383, 7465850, 7411618, 7334866, 7235552, 7114806, 6975045, 6819751, 6653186, 6480195, 6305766, 6134313, 5969106, 5812210, 5664506, 5525488, 5393335, 5265580, 5139754, 5013416, 4884040, 4749498, 4608675, 4461432, 4308138, 4149602, 3987349, 3823501, 3660236, 3499477, 3342942, 3192093, 3047955, 2911189, 2782284, 2661518, 2548904, 2444468, 2348500, 2261185, 2182056, 2110180, 2044853, 1985784, 1932670, 1884998, 1842337, 1804426, 1770889, 1741159, 1714853, 1691976, 1672662, 1656936]
59249A656936j2155q554m946j371K210N754R076J2171J5369J8902K2548K5943
59237A741883K9126L2430L6049L9922M3956M8074N2189N6317O0701O5615P1111
59226B277373P6970Q2779Q8099R2791R7213J01736J06019J09091J10304J09826
59216C252201J08017J04742R9564R2278Q2938P1635N8592M4309K9306J3776k306
59205C955052j8901l5687n1927o6432p8008q6180r1236r3534r3130r0194q5318
59194C164505p9100p1784o3553n4815m5830l6430k6479j6352o589K736J1979K1461
59182B799749L1316M1629N2410O3562P5038Q6889R9048J11305J23657J36350J49429
59171C770382J62481J74921J86177J95445K01687K04075K02039J94738J81046
$$ y = [1656936, 1644781, 1636227, 1631281, 1629910, 1632120, 1637874, 1646950, 1659121, 1674490, 1693392, 1715940, 1741883, 1771009, 1803439, 1839488, 1879410, 1923366, 1971440, 2023629, 2079946, 2140647, 2206262, 2277373, 2354343, 2437122, 2525221, 2618012, 2715225, 2816961, 2922980, 3032071, 3142375, 3252201, 3360218, 3464960, 3564524, 3656802, 3739740, 3811375, 3869967, 3914276, 3943582, 3957358, 3955052, 3936151, 3900464, 3848537, 3782105, 3704097, 3617917, 3526681, 3433147, 3340017, 3249823, 3164505, 3085405, 3013621, 2950068, 2895253, 2849423, 2812993, 2786514, 2770162, 2763573, 2766309, 2778288, 2799749, 2831065, 2872694, 2925104, 2988666, 3063704, 3150593, 3249641, 3360946, 3484603, 3620953, 3770382, 3932863, 4107784, 4293961, 4489406, 4691093, 4895168, 5097207, 5291945, 5472991]
59162E472991J60421J33419J01082O4285K4088j7898n9953j00750j38933j72651
59152E466101k00162k20803k34896k42967k45488k43187k37059k28048k16963
59143C396528k04545j91338j77656j63913j50664j38127j26085j14534j04023
59134B025643r4924q6873p9373p2540o6677o1542n6690n2242m8622m5696m2798
59123A317666l9622l6488l3786l1558k9641k7794k5781k3642k1708k0118j8521
59112A009007j6631j4705j3079j1540r735p866o380n196l875k386j042K33J857
59099I18662L871N815P424Q895J0462J2203J4228J6591J8929K0742K2075K3496
59087A083393K5326K7307K9111L0720L2253L3778L5416L7288L9344M1419M3526
$$ y = [5472991, 5633412, 5766831, 5867913, 5932198, 5956286, 5938388, 5878435, 5777685, 5638752, 5466101, 5265939, 5045136, 4810240, 4567273, 4321785, 4078598, 3841539, 3613491, 3396528, 3191983, 3000645, 2822989, 2659076, 2508412, 2370285, 2244200, 2129666, 2025643, 1930719, 1843846, 1764473, 1691933, 1625256, 1563714, 1507024, 1454782, 1406160, 1360464, 1317666, 1278044, 1241556, 1207770, 1176212, 1146571, 1118777, 1092996, 1069354, 1047646, 1027528, 1009007, 992376, 977671, 964592, 953052, 943317, 935451, 929071, 923875, 920000, 917614, 916572, 916805, 918662, 922533, 928348, 935772, 944667, 955129, 967332, 981560, 998151, 1017080, 1037822, 1059897, 1083393, 1108719, 1136026, 1165137, 1195857, 1228110, 1261888, 1297304, 1334592, 1373936, 1415355, 1458881]
59076A458881M5817M8332N1048N4129N7793O1957O6340P0841P5529Q0333Q5052
59065B156052Q9656R4303R9073J03834J08247J11763J13926J14854J15126J14891
59055C221725J13458J10074J04717R7645Q8593P6971O2518M5158K4658J240k3642
59044C923115m7931p0302r0303j07377j20603j29458j34124j34962j32366j27214
59034B828475j20730j13606j05758r7108q8063p9159p0638o2604n5130m8096m1319
59023A946264l4915k9144k3944j8968j4086r364m665J42M579P886J0006J1673
59011A845464J3293J4360J4164J2583R918O377K097k732q016j3736j9648k5275
58999A848849l0323l4796l8690m1858m4285m6123m7439m8292m8991m9839n0607
$$ y = [1458881, 1504698, 1553030, 1604078, 1658207, 1716000, 1777957, 1844297, 1915138, 1990667, 2071000, 2156052, 2245708, 2340011, 2439084, 2542918, 2651165, 2762928, 2876854, 2991708, 3106834, 3221725, 3335183, 3445257, 3549974, 3647619, 3736212, 3813183, 3875701, 3920859, 3945517, 3946757, 3923115, 3875184, 3804882, 3714579, 3607202, 3486599, 3357141, 3223017, 3088055, 2955689, 2828475, 2707745, 2594139, 2488381, 2391273, 2303210, 2224051, 2153413, 2090809, 2035679, 1987583, 1946264, 1911349, 1882205, 1858261, 1839293, 1825207, 1815843, 1811178, 1811320, 1815899, 1823785, 1833791, 1845464, 1858757, 1873117, 1887281, 1899864, 1909782, 1916159, 1918256, 1915524, 1907508, 1893772, 1874124, 1848849, 1818526, 1783730, 1745040, 1703182, 1658897, 1612774, 1565335, 1517043, 1468052, 1418213, 1367606]
58988A367606n0715m9999m8825m7459m5776m3703m1379l8831l5960l2961l0265
58977I01733k7905k5465k2831k0437j8615j7122j5611j4050j2464j0759r028p663
58965F99783o801o101n274m463l815l136k333j793j920k432k594k045j097k83
58951F55696J63L80O46J081J579J990K303K584K899L410M275N243N702N489N339
58936F98779O008P187P942Q042Q154Q710R395R896J0402J1060J1532J1564J1486
58923H20157J1733J2275J2831J3354J3908J4390J4718J5082J5764J6750J7789
58912I78751J8675J9424K0260K1504K3242K5155K6804K8112K9334L0584L1691
58901A253536L2497L3012L3316L3543L3876L4389L5004L5866L7451L9926M2770
$$ y = [1367606, 1316891, 1266892, 1218067, 1170608, 1124832, 1081129, 1039750, 1000919, 964959, 931998, 901733, 873828, 848363, 825532, 805095, 786480, 769358, 753747, 739697, 727233, 716474, 707446, 699783, 692982, 686881, 681607, 677144, 673329, 670193, 667860, 666067, 664147, 661715, 659121, 657076, 655979, 655696, 655859, 656239, 656885, 657966, 659545, 661535, 663838, 666422, 669321, 672731, 677006, 682249, 687951, 693440, 698779, 704787, 711974, 719916, 727958, 736112, 744822, 754217, 764113, 774515, 785575, 797107, 808671, 820157, 831890, 844165, 856996, 870350, 884258, 898648, 913366, 928448, 944212, 960962, 978751, 997426, 1016850, 1037110, 1058614, 1081856, 1107011, 1133815, 1161927, 1191261, 1221845, 1253536, 1286033, 1319045, 1352361, 1385904, 1419780, 1454169, 1489173, 1525039, 1562490, 1602416, 1645186]
58890A645186M5510M8522N2398N6883O1215O5374P0062P5520Q1272Q7125R3522
58879B382589J00653J08086J15612J23752J32977J43134J53951J65499J77853
58870C604106J90872K04634K19488K35365K51697K68264K85408L02972L19759
58861E882565L34498L46664L55776L60459L58875L49651L31842L04471K66830
58852H891631K19133J62503R8763L0675l8034j03673j63645k16348k60454k95002
58842H325549l19988l36351l45205l47435l43885l35658l24058l10311k95246
58833E367412k79204k62416k45368k28620k12329j96367j80939j66517j53218
58824C442434j40757j29184j19020j10456j03023r6289r0346q5238q0513p5731
$$ y = [1645186, 1690696, 1739218, 1791616, 1848499, 1909714, 1975088, 2045150, 2120670, 2201942, 2289067, 2382589, 2483242, 2591328, 2706940, 2830692, 2963669, 3106803, 3260754, 3426253, 3604106, 3794978, 3999612, 4219100, 4454465, 4706162, 4974426, 5259834, 5562806, 5882565, 6217063, 6563727, 6919503, 7279962, 7638837, 7988488, 8320330, 8624801, 8891631, 9110764, 9273267, 9372030, 9402705, 9364671, 9260998, 9097353, 8881005, 8620551, 8325549, 8005561, 7669210, 7324005, 6976570, 6632685, 6297027, 5972969, 5662658, 5367412, 5088208, 4825792, 4580424, 4351804, 4139475, 3943108, 3762169, 3595652, 3442434, 3301677, 3172493, 3053473, 2943017, 2839994, 2743705, 2653359, 2568121, 2487608, 2411877]
58814B411877p1027o6650o2419n8020n3528m9220m5134m1130l7175l3255k9302
58803A865017k5395k1757j8389j5055j1729q645n758k671O83L881O815J0023J3892
58790A790912J8068K2080K6045L0258L4607L8819M2973M7280N1701N6197O1020
58779B219960O6376P2080P7912Q3942R0211R6526J02911J09867J17798J26558
58769C164141J35883J45884J56697J68142J80103J92964K07155K22553K38651
58760D812173K55027K71342K87184L02238L16180L28120L36528L39948L37363
58751G586103L27595L09021K80414K41727J93702J37318P4237P393n9568j23412
58741H974530j81717k32623k74787l07533l30853l45425l52604l53839l49899
$$ y = [2411877, 2340850, 2274200, 2211781, 2153761, 2100233, 2051013, 2005879, 1964749, 1927574, 1894319, 1865017, 1839622, 1817865, 1799476, 1784421, 1772692, 1764047, 1758289, 1755618, 1756301, 1760182, 1766997, 1777020, 1790912, 1808980, 1831060, 1857105, 1887363, 1921970, 1960789, 2003762, 2051042, 2102743, 2158940, 2219960, 2286336, 2358416, 2436328, 2520270, 2610481, 2707007, 2809918, 2919785, 3037583, 3164141, 3300024, 3445908, 3602605, 3770747, 3950850, 4143814, 4350969, 4573522, 4812173, 5067200, 5338542, 5625726, 5927964, 6244144, 6572264, 6908792, 7248740, 7586103, 7913698, 8222719, 8503133, 8744860, 8938562, 9075880, 9150117, 9157510, 9097942, 8974530, 8792813, 8560190, 8285403, 7977870, 7647017, 7301592, 6948988, 6595149, 6245250]
58732F245250l41131l28542l13910k98492k82361k65420k48352k32080k16878
58723C718084k02561j88980j75922j63090j50737j39734j30507j22424j14700
58714B329429j07254j00228r3421q6851q1159p6700p2806o8679o4432o0506n6695
58703A460698n2558m8313m4517m1219l8189l5469l3032l0365k7166k3989k1455
58692A064426j9325j7098j4969j3389j2178j0979j0123j0050j0338j0270r957
58681I25750r996j0327j0463j0476j0773j1131j1014j0661j0784j1332j1602j1463
58669G95728j1499j1893j2182j2106j1934j1849j1815j1969j2467j2977j3060
58658F61977j2917j3016j3166j2821j2068j1512j1189j0574r584q739q260p862
$$ y = [6245250, 5904119, 5575577, 5261667, 4963175, 4680814, 4415394, 4167042, 3934962, 3718084, 3515523, 3326543, 3150621, 2987531, 2836794, 2697060, 2566553, 2444129, 2329429, 2222175, 2121947, 2028526, 1941675, 1860516, 1783816, 1711010, 1642331, 1577899, 1517393, 1460698, 1408140, 1359827, 1315310, 1274091, 1235902, 1200433, 1167401, 1137036, 1109870, 1085881, 1064426, 1045101, 1028003, 1013034, 999645, 987467, 976488, 966365, 956315, 945977, 935707, 925750, 915754, 905427, 894964, 884488, 873715, 862584, 851570, 840909, 830125, 818793, 807191, 795728, 784229, 772336, 760154, 748048, 736114, 724265, 712450, 700481, 688014, 675037, 661977, 649060, 636044, 622878, 610057, 597989, 586477, 575288, 564714, 555130, 546391, 538131, 530269]
58646E30269p434p144o864o249n445m916m643m195l613l392l627l871l904l889
58632D61083l848l634l396l365l260k666j839j364j177p73k60k43p13r88q73q75
58616D31809j242j587j659j656j645j412j022p82o08j73L50M94M34Q45J788K616
58600D26550L068L524M051M175L821L652M094M804N368N884O576P452Q509R715
58586E01243J0731J1310J1933J3340J5331J6978J8011J9157K0928K2981K4917
58575F86860K6876K9021L1251L3669L6645M0131M3636M7127N1264N6408O2130
58564A145018O7955P3945Q0220Q6513R2520R8122J03023J06613J08355J07754
58554B070038J03870R5539Q2312O4740M3719K0239m207k7714m8783o6591q0563
$$ y = [530269, 522835, 515691, 508827, 502578, 497133, 492217, 487574, 483379, 479766, 476374, 472747, 468876, 464972, 461083, 457235, 453601, 450205, 446840, 443580, 440914, 439075, 437711, 436534, 435761, 435501, 435258, 434545, 433557, 432684, 431809, 430567, 428980, 427321, 425665, 424020, 422608, 421586, 420804, 420196, 420023, 420373, 420867, 421301, 422146, 423934, 426550, 429618, 433142, 437193, 441368, 445189, 448841, 452935, 457739, 463107, 468991, 475567, 483019, 491528, 501243, 511974, 523284, 535217, 548557, 563888, 580866, 598877, 618034, 638962, 661943, 686860, 713736, 742757, 774008, 807677, 844322, 884453, 928089, 975216, 1026480, 1082888, 1145018, 1212973, 1286918, 1367138, 1453651, 1546171, 1644293, 1747316, 1853929, 1962284, 2070038, 2173908, 2269447, 2351759, 2416499, 2460218, 2480457, 2476250, 2448536, 2399753, 2333162, 2252599]
58543B252599r0305r6104r8720r8667r6179r1937q7005q2011p6942p1747o6456
58532A296526o0926n5194n0003m6069m2979l9748l6327l3471l1228k8754k5775
58521H46052k2933k0491j7921j5116j2850j1484j0332q853p488o710o158n358
58509G00358m543m167m195m442m946n705o507p381q592j0011j1110j1774j2380
58496F04605j2969j3113j2767j2405j2140j1543j0561r682r045q270p367o865
58484D77878o729o244n279m595m603m736m521m267m231m096l701l412l332l011
58470D15121k409k137k356k376j843j333j305j382j227j183j460j646j483j311
58456C91670j208o17O01J684K034J934J681R94j48j092j510j963k882l820m303
$$ y = [2252599, 2162294, 2066190, 1967470, 1868803, 1772624, 1680687, 1593682, 1511671, 1434729, 1362982, 1296526, 1235600, 1180406, 1130403, 1084334, 1041355, 1001607, 965280, 931809, 900581, 871827, 846052, 823119, 802628, 784707, 769591, 756741, 745257, 734925, 726072, 718584, 711874, 705716, 700358, 695815, 691648, 687453, 683011, 678065, 672360, 665853, 658472, 649880, 639869, 628759, 616985, 604605, 591636, 578523, 565756, 553351, 541211, 529668, 519107, 509425, 500380, 492110, 484743, 477878, 471149, 464905, 459626, 455031, 450428, 445692, 441171, 436904, 432673, 428577, 424876, 421464, 418132, 415121, 412712, 410575, 408219, 405843, 404000, 402667, 401362, 399980, 398753, 397570, 396110, 394464, 392981, 391670, 390462, 389845, 390446, 392130, 394164, 396098, 397779, 398773, 398625, 397533, 396023, 394060, 391178, 387358, 383055]
58441C83055m587m953n135m937m694m553m229l808l886m422m555l986l514l561
58427C22235l432k625j806j659j805j653j353j172q89m84m51p37m72N57J252Q37
58411C06343km64r24j930k963l269l004k595j900r08l23m63n07J85R56J046R20
58394B90198J306J840J848J655J975K673L201L600M103M390M217M052M249M270
58380C33577L568K453J333o3j849l344m138m842n870o464n972n034m490m108l477
58365B91280l113l400l496k571j322q85j058r19m43j87p8K85O77P49Q33J230J426
58348B79008J066Q68J535K515K978L164L667M236M438M614N075N264M826M596
58334C27850N252O022N961N538N606N825N505N071N222N493N080M247L622K907
$$ y = [383055, 378468, 373515, 368380, 363443, 358749, 354196, 349967, 346159, 342273, 337851, 333296, 329310, 325796, 322235, 318803, 316178, 314372, 312713, 310908, 309255, 307902, 306730, 305841, 305357, 304906, 304169, 303697, 304254, 305506, 306343, 306341, 305877, 304953, 303023, 300060, 296791, 293787, 291192, 289292, 288384, 288061, 287598, 287091, 287276, 288232, 289278, 290198, 291504, 293344, 295192, 296847, 298822, 301495, 304696, 308296, 312399, 316789, 321006, 325058, 329307, 333577, 337145, 339598, 340931, 340868, 339019, 335675, 331537, 326695, 320825, 314361, 308389, 303355, 298865, 294757, 291280, 288167, 284767, 281271, 278700, 277378, 276493, 275435, 274516, 274073, 273886, 273808, 274093, 274770, 275519, 276352, 277582, 279008, 280074, 280942, 282477, 284992, 287970, 291134, 294801, 299037, 303475, 308089, 313164, 318428, 323254, 327850, 333102, 339124, 345085, 350623, 356229, 362054, 367559, 372630, 377852, 383345, 388425, 392672, 396294, 399201]
58320C99201J694N95J89k15j348k546k964l170l965m686m362l557l353l417k854
58305C65242k015j777j801j270n19k99k45K11M22l06j120r71n17q21j261p53M6
58288C52246r7n79RJ305J844J591J530J543R23K93P42J699J855J562K044K955
58272C71465L074K735L171M058M104L536L546L861L374K606K950L957L974L126
58258D19537L024L811M171M020M542N626N884N218M920N262N340N164N599O337
58244D88455O274N663N647O037N837N554O444P952Q461Q111Q351R174R440R449
58230E90849J0386J1701J1877J1306J1525J2200J1830J0904J1163J2223J2231
58219G18195J1435J1775J3239J4034J4091J4968J6517J7111J6926J7570J8752
$$ y = [399201, 400895, 401490, 401679, 401464, 400116, 397570, 394606, 391436, 387471, 382785, 378423, 374866, 371513, 368096, 365242, 363227, 361450, 359649, 358379, 357860, 357561, 357316, 357527, 357949, 357643, 356523, 355552, 355035, 354214, 352953, 352200, 352246, 352149, 351570, 351579, 352884, 354728, 356319, 357849, 359392, 360315, 360608, 361350, 363049, 364904, 366466, 368510, 371465, 374539, 377274, 380445, 384503, 388607, 392143, 395689, 399550, 402924, 405530, 408480, 412437, 416411, 419537, 422561, 426372, 430543, 434563, 439105, 444731, 450615, 455833, 460753, 466015, 471355, 476519, 482118, 488455, 494729, 500392, 506039, 512076, 517913, 523467, 529911, 537863, 546324, 554435, 562786, 571960, 581400, 590849, 601235, 612936, 624813, 636119, 647644, 659844, 671674, 682578, 693741, 705964, 718195, 729630, 741405, 754644, 768678, 782769, 797737, 814254, 831365, 848291, 865861, 884613]
58208H84613J8869J8579K0027K2820K4566K5136K6523K8707K9799L0049L1608
58197A161296L4361L6222L7429M0205M4283M7268M9339N2934N7823O1276O3163
58186A685599O5982O9787P2198P3565P6846Q2119Q6596R0198R5684J02999J09281
58175B610854J14739J22541J32566J41485J49347J59623J72422J84450J96056
58166C984083K11013K28820K44891K58995K75506K94574L11688L27067L46390
58157F483027L70759L95296M19291M47867M81867N16600N52694N96919O49774
58148A0914094P04052P58743Q22193Q98701R85423J085724J210679J363281J536863
58139B0279753J733454J966792K243699K562602K933556L373309L872627M397483
$$ y = [884613, 903482, 922061, 942088, 964908, 989474, 1014610, 1041133, 1069840, 1099639, 1129688, 1161296, 1195657, 1231879, 1269308, 1309513, 1353796, 1401064, 1450403, 1503337, 1561160, 1622436, 1685599, 1751581, 1821368, 1893566, 1967131, 2043977, 2126096, 2212692, 2302890, 2398574, 2501573, 2610854, 2725593, 2848134, 2980700, 3122185, 3271532, 3431155, 3603577, 3788027, 3984083, 4195096, 4423916, 4668807, 4927802, 5203308, 5497882, 5809570, 6136637, 6483027, 6853786, 7249082, 7668373, 8116240, 8598107, 9114707, 9667401, 10264320, 10914094, 11618146, 12376889, 13199082, 14097783, 15083206, 16168930, 17379609, 18742890, 20279753, 22013207, 23979999, 26223698, 28786300, 31719856, 35093165, 38965792, 43363275]
58131D3363275M935344N517483O201594P080750Q284307R808909J1213088J1570829
58123A07975579R988932O350741J547526l076400o529165q530356r313740r274718
58115H9138399q776051q091704p382543o704485o063174n459170m887833m334353
58107C7439086l793797l282387k817239k399413k025863j701461j427083j189114
58099A8802729r73301p79331o11344m63310l24160j87254m1056J39887L68889
58090A5931749O00335P22820O24117K81624k05588o77464j012811j181832j221755
58081A3861195j183060j102745j007309r15550q33525p57303o84287o16512n53989
58072F206915m93358m34451l81401l35840k95264k59077k30049k08405j90369
$$ y = [43363275, 48298619, 53816102, 60017696, 67098446, 75382753, 85191662, 96404750, 107975579, 117964511, 124315252, 125862778, 122786378, 116257213, 107726857, 98413117, 89138399, 80362348, 72270644, 64888101, 58183616, 52120442, 46661272, 41773439, 37439086, 33645289, 30362902, 27545663, 25146250, 23120387, 21418926, 19991843, 18802729, 17829428, 17050097, 16438753, 15975443, 15651283, 15464029, 15422973, 15562860, 15931749, 16532084, 17254904, 17879021, 18160645, 17955057, 17277593, 16264782, 15082950, 13861195, 12678135, 11575390, 10568081, 9652531, 8819006, 8061703, 7377416, 6760904, 6206915, 5713557, 5279106, 4897705, 4561865, 4266601, 4007524, 3777475, 3569070, 3378701]
58063C378701j74071j61357j52386j43835j34185j25604j18994j12057j03910
58054B152302r6809r1544q5775p8689p2853o9580o6714o2913n9939n8728n7164
58043A351594n3852n0445m8234m5929m2728m0236l9344l8397l6275l4273l3209
58032H88672l1704k9054k6836k5955k4984k3068k1606k1375k0829j8969j7221
58021F27071j6716j6300j4945j3600j3025j2198j0548r361r368r244q077p090
58009D86599p275p591p048o478o633o659n938n445n810o004n331m778n005n068
57995D01536m427m150m737m866l759k723k821l059k451j880k256k671k117j270
57981C58349r69n86M61J241J001P12J302J877J375N42N49R57O58k71j165k069
$$ y = [3378701, 3204630, 3043273, 2890887, 2747052, 2612867, 2487263, 2368269, 2256212, 2152302, 2055493, 1963949, 1878174, 1799485, 1726632, 1657052, 1590338, 1527425, 1467486, 1408758, 1351594, 1297742, 1247297, 1199063, 1153134, 1110406, 1070170, 1030826, 992429, 956154, 921881, 888672, 856968, 827914, 801078, 775123, 750139, 727071, 705465, 684090, 663261, 644292, 627071, 610355, 594055, 579110, 565510, 552485, 540287, 529739, 520378, 511010, 501766, 493689, 486599, 479324, 471733, 464685, 458207, 451574, 444915, 438977, 433532, 427722, 421718, 416387, 411609, 406604, 401536, 397109, 392959, 388222, 383356, 379597, 376874, 374053, 370994, 368543, 366663, 364407, 361736, 359619, 358349, 357380, 356794, 357255, 358496, 359497, 360209, 361511, 363388, 364763, 365305, 365854, 366811, 367469, 367198, 366033, 363964]
57965C63964l114l692l541l488m022m373m042l914m602n211m945m543m773m971
57951C04733m444l867l884l722k717j871k290l281l533l131k900k770k341k033
57937B61949k237k280j586r08j020j214n15O11J158J280J613J882J577J223J499
57922B63032J927J753J351J382J419Q10R8J09L88j7q51j236j280j701k339k529
57906B62316k423k618k870k516j806j534j672j585j268j241j493j620j678j950
57892B36042k161j918j546j597j867j787j380j012o65k63j92o50j073r73p57q78
57876B17323r33m79J9J2j00J93L73j94r35q76j96K16K81N78J112J362J333J435
57858B20524J611J520J323J389J605J720J948K400K533K015J497J608J847J514
$$ y = [363964, 360850, 357158, 353617, 350129, 346107, 341734, 337692, 333778, 329176, 323965, 319020, 314477, 309704, 304733, 300289, 296422, 292538, 288816, 286099, 284228, 281938, 278657, 275124, 271993, 269093, 266323, 263982, 261949, 259712, 257432, 255846, 254938, 253918, 252704, 252189, 252800, 253958, 255238, 256851, 258733, 260310, 261533, 263032, 264959, 266712, 268063, 269445, 270864, 271674, 271772, 271881, 272269, 272252, 271401, 270165, 268885, 267184, 264845, 262316, 259893, 257275, 254405, 251889, 250083, 248549, 246877, 245292, 244024, 242783, 241290, 239670, 237992, 236042, 233881, 231963, 230417, 228820, 226953, 225166, 223786, 222774, 222109, 221846, 221654, 221004, 219931, 218958, 218201, 217323, 216390, 215911, 215930, 215942, 215842, 216035, 216408, 216214, 215279, 214403, 214207, 214423, 214704, 215282, 216394, 217756, 219089, 220524, 222135, 223655, 224978, 226367, 227972, 229692, 231640, 234040, 236573, 238588, 240085, 241693, 243540, 245054]
57844B45054J018J100J389R90lp90j229j780k419k820l141l647l925l571l099
57829B23127l131l226k744k199k415k924k667j868j605j831j484m08L97M63L20
57814A97805K10j61n13p8R53J439J083Q99J535K335K526K265K015J810J598J524
57798B17245J514J221O59K09p1m98j032j331j507k052k878l328l216l058l127
57783A98750l081k721k352k210k201k297k565k742k492k053j972k182k161j904
57769A65817j913k230k350k142k049k216k327k355k628k993k805k016j450j642
57755A34701k141k254j902j406r79p22o76o66m68j84p5j10p1K7P9K91Q02J229
57737A25475J174J012J353K027K416K569L004L568L513K734J941J454Q59m7r07
$$ y = [245054, 246072, 247172, 248561, 249551, 249548, 248758, 247529, 245749, 243330, 240510, 237369, 233722, 229797, 226226, 223127, 219996, 216770, 214026, 211827, 209412, 206488, 203821, 201953, 200348, 198517, 197033, 196625, 197022, 197485, 197805, 198015, 197854, 197341, 197263, 198216, 199655, 200738, 201637, 203172, 205507, 208033, 210298, 212313, 214123, 215721, 217245, 218759, 219980, 220639, 220848, 220777, 220279, 219247, 217916, 216409, 214357, 211479, 208151, 204935, 201877, 198750, 195669, 192948, 190596, 188386, 186185, 183888, 181323, 178581, 176089, 174036, 172064, 169882, 167721, 165817, 163904, 161674, 159324, 157182, 155133, 152917, 150590, 148235, 145607, 142614, 139809, 137793, 136343, 134701, 132560, 130306, 128404, 126998, 126019, 125297, 124621, 123955, 123487, 123303, 123228, 123118, 123047, 123074, 123153, 123444, 124246, 125475, 126649, 127661, 129014, 131041, 133457, 136026, 139030, 142598, 146111, 148845, 150786, 152240, 153099, 153052, 152145]
57722A52145j575k280k868k783k043j360j079q23m31k86m82n52l51k99m52k05
57706A34276N79J140J004Q07J293K149K539K293J944J908K131K320K218J863J667
57691A60131J913K207J915J127N79N83P32P64R15J250J449J482J804K527L113
57676A82491L197L085L103L152L200L558M251M771M876M980N414N898O228O802
57662B45006P939R193R898J0006R950J0003J0229J0669J1291J1985J2814J3864
57650C72847J4780J5040J4879J5258J6609J8289J9625K0879K2663K4969K7341
57639E83179K9628L2063L4888L8287M2328M6660N0723N4490N8623O3557O8907
57628A103333P4083P8974Q3559Q7354Q9659R0059Q8218Q3562P5537O4050M9518
$$ y = [152145, 150570, 148290, 145422, 142639, 140596, 139236, 138157, 137334, 136903, 136617, 136135, 135583, 135232, 134933, 134481, 134276, 134855, 135995, 136999, 137806, 139099, 141248, 143787, 146080, 148024, 149932, 152063, 154383, 156601, 158464, 160131, 162044, 164251, 166166, 167293, 167872, 168455, 169187, 169951, 170866, 172116, 173565, 175047, 176851, 179378, 182491, 185688, 188773, 191876, 195028, 198228, 201786, 206037, 210808, 215684, 220664, 226078, 231976, 238204, 245006, 252945, 262138, 272036, 282042, 291992, 301995, 312224, 322893, 334184, 346169, 358983, 372847, 387627, 402667, 417546, 432804, 449413, 467702, 487327, 508206, 530869, 555838, 583179, 612807, 644870, 679758, 718045, 760373, 807033, 857756, 912246, 970869, 1034426, 1103333, 1177416, 1256390, 1339949, 1427303, 1516962, 1607021, 1695239, 1778801, 1854338, 1918388, 1967906]
57617A967906L2870J5728Jj3072k3194l0196l3511l2804k8802k3277j8691j7804
57605A795154k2602l2833m5919n8663o8810p5092p6944p4958p0891o6277o1329
57594A140836n5635m9418m3358l7688l2167k6801k1835j7298j3108r423o356l510
57582H24239l85K985O284R584J3187J6981K0547K3872K7445L1617L6256M1044
57570A053656M5796N0439N4933N9176O2951O6044O8340O9521O8653O4621N7147
57559A721277M6878L4282J9214J982j5766l1961m5556n6578o5163p1272p4994
57548A462343p6540p6012p3775p0756o7766o4714o1011n6681n2409m8608m5032
57537G69039m1345l7600l4071l1003k8522k6555k4765k2833k0787j8841j7087
$$ y = [1967906, 2000776, 2016504, 2016505, 2003433, 1980239, 1950043, 1916532, 1883728, 1854926, 1831649, 1812958, 1795154, 1772552, 1739719, 1693800, 1635137, 1566327, 1491235, 1414291, 1339333, 1268442, 1202165, 1140836, 1085201, 1035783, 992425, 954737, 922570, 895769, 873934, 856636, 843528, 834105, 827749, 824239, 823854, 826839, 833123, 842707, 855894, 872875, 893422, 917294, 944739, 976356, 1012612, 1053656, 1099452, 1149891, 1204824, 1264000, 1326951, 1392995, 1461335, 1530856, 1599509, 1664130, 1721277, 1768155, 1802437, 1821651, 1823633, 1807867, 1775906, 1730350, 1673772, 1608609, 1537337, 1462343, 1385803, 1309791, 1236016, 1165260, 1097494, 1032780, 971769, 915088, 862679, 814071, 769039, 727694, 690094, 656023, 625020, 596498, 569943, 545178, 522345, 501558, 482717, 465630]
57526D65630j5542j4309j3402j2587j1677j0772r978r165q260p475o907o229n192
57513C34135m130l482l125k628j970j433r97l71M56J256K039L003M032M796N320
57498C36901O005O974P869Q410Q761R241R949J0812J1734J2678J3655J4753J5979
57485D73721J7218J8423J9765K1382K3175K5084K7349L0223L3525L6785L9781
57474G66431M2657M5583M8520N1283N3598N5110N5401N4015N0443M4307L5656
57463A303004K4963J2825q4j2840k4481l4501m2765m8928n2565n3980n4246n4031
57451I62371n2942n0532m7283m4101m1201l8276l5299l2558l0039k7439k4720
57440E37981k2136j9823j7733j5827j3943j1785r361p195n574m027j981L58K460
$$ y = [465630, 450088, 435779, 422377, 409790, 398113, 387341, 377363, 368198, 359938, 352463, 345556, 339327, 334135, 330005, 326523, 323398, 320770, 318800, 317367, 316370, 315999, 316455, 317711, 319750, 322753, 326785, 331581, 336901, 342906, 349880, 357749, 366159, 374920, 384161, 394110, 404922, 416656, 429334, 442989, 457742, 473721, 490939, 509362, 529127, 550509, 573684, 598768, 626117, 656340, 689865, 726650, 766431, 809088, 854671, 903191, 954474, 1008072, 1063182, 1118583, 1172598, 1223041, 1267348, 1303004, 1327967, 1340792, 1340708, 1327868, 1303387, 1268886, 1226121, 1177193, 1124628, 1070648, 1016402, 962371, 909429, 858897, 811614, 767513, 726312, 688036, 652737, 620179, 590140, 562701, 537981, 515845, 496022, 478289, 462462, 448519, 436734, 427373, 420178, 414604, 410577, 408596, 408954, 411414]
57427D11414M436O828R641J2319J4652J7068J9936K3147K6407K9525L2420L5232
57415F43025L8319M1753M5001M7578M9708N1800N3484N3839N2416M9355M4536
57404A170814L7406K7786J6231L518r689k2624l4356m4193n1807n7061o0061o1306
57392I14658o1287o0054n7594n4419n1194m7950m4373m0650l7332l4416l1410
57381C93979k8337k5806k3993k2352k0563j8935j7632j6236j4516j2932j1915
57370A80762j1241j0553r973r722r555r077q327p619p092o694o399o125n700n141
57356F7544m751m692m719m508m046l535l164l074l277l518l506l362l472l859
57342A4061m120m034B067a659l536l115k636k271j993j809j849k017j955j580
$$ y = [411414, 415850, 422678, 432319, 444638, 459290, 476358, 496294, 519441, 545848, 575373, 607793, 643025, 681344, 723097, 768098, 815676, 865384, 917184, 970668, 1024507, 1076923, 1126278, 1170814, 1208220, 1236006, 1252237, 1255755, 1246066, 1223442, 1189086, 1144893, 1093086, 1036025, 975964, 914658, 853371, 793317, 735723, 681304, 630110, 582160, 537787, 497137, 459805, 425389, 393979, 365642, 339836, 315843, 293491, 272928, 253993, 236361, 220125, 205609, 192677, 180762, 169521, 158968, 148995, 139273, 129718, 120641, 112314, 104695, 97603, 90909, 84510, 78385, 72685, 67544, 62793, 58101, 53382, 48874, 44828, 41293, 38129, 35055, 31778, 28260, 24754, 21392, 17920, 14061, 9941, 5907, 2067, -1659, -5195, -8310, -10946, -13217, -15210, -17019, -18868, -20885, -22840, -24420]
57328b4420j277j339j591j724j710j640j527j440j501j627j590j486j655k041
57314d6568k123j765j557j931k445k413j870j396j249j145p91k06L84P17O49L49
57298f3360J71J98J39j44l60k60q6j84m86o60o28n52m91l63j90j02j42k79m83
57279f8262o46n88k69R7K75K46J02q1j82q0J27J89M9n0N6K58M06M77M12Q4l99
57258f7779o71n53k63m1J10K42L18L75N24O06L09k35l96J11Q09J134J173J307
57240f2920J524J555J455J570K028K629L168L560L824M157M872O010P203Q122
57226a1243b398G154J0091J0198R974R725R462Q872P675N814L369N18k477n365
57212G5010p957j0045j1487j2399j3047F604f883j3201j2988j3014j3008j2790
$$ y = [-24420, -25697, -27036, -28627, -30351, -32061, -33701, -35228, -36668, -38169, -39796, -41386, -42872, -44527, -46568, -48691, -50456, -52013, -53944, -56389, -58802, -60672, -62068, -63317, -64462, -65253, -65459, -65075, -64358, -63709, -63360, -63189, -62991, -62852, -62996, -63356, -63616, -63702, -63886, -64372, -65032, -65660, -66212, -66703, -67066, -67256, -67358, -67500, -67779, -68262, -68908, -69496, -69765, -69668, -69393, -69147, -69045, -69126, -69308, -69388, -69261, -69072, -69023, -69073, -69017, -68759, -68353, -67876, -67464, -67380, -67779, -68450, -69003, -69266, -69307, -69197, -68955, -68637, -68262, -67738, -67132, -66823, -67058, -67454, -67343, -66534, -65400, -64227, -62920, -61396, -59841, -58386, -56816, -54788, -52159, -48991, -45431, -41607, -37450, -32578, -26568, -19365, -11243, -2398, 7154, 17245, 27443, 37417, 47142, 56604, 65476, 73151, 78965, 82334, 82852, 80375, 75010, 67053, 57008, 45521, 33122, 20075, 6604, -6883, -20084, -33072, -46086, -59094, -71884]
57200g1884j2573j2455j2083j1179j0026r061q277p448o606n894n228m474l760
57187a80948l215k628j788q72j19O43J667K731L415L778M267M992N539N502M820
57172a52216L689K424J394P28J40o76j631k422k939l216l108k470j492n53J62
57157a62186O17O84L10k60q04j459k400l360l938m213m529m789m483l434k052
57142a96296p73L28J306K125K738L099L024K356J216j36j654l409n224o788q138
57127b06226r646j1477j3372j4997j6235j7129j7809j8500j9319k0041k0324k0187
57115d05262j9965j9876j9910k0172k0946k2368k4271k6405k8555l0430l1755
57104f69915l2594l3385l4563l6301l8565m1187m3825m6108m7872m9186n0190
$$ y = [-71884, -84457, -96912, -108995, -120174, -130200, -139261, -147538, -154986, -161592, -167486, -172714, -177188, -180948, -184163, -186791, -188579, -189451, -189570, -188927, -187260, -184529, -181114, -177336, -173069, -168077, -162538, -157036, -152216, -148527, -146103, -144709, -143981, -143841, -144517, -146148, -148570, -151509, -154725, -157833, -160303, -161795, -162348, -162186, -161569, -160885, -160575, -160835, -161639, -163098, -165498, -168858, -172796, -177009, -181538, -186327, -190810, -194244, -196296, -197069, -196741, -195435, -193310, -190572, -187473, -184449, -182093, -180877, -181013, -182667, -186076, -191300, -198088, -206226, -215872, -227349, -240721, -255718, -271953, -289082, -306891, -325391, -344710, -364751, -385075, -405262, -425227, -445103, -465013, -485185, -506131, -528499, -552770, -579175, -607730, -638160, -669915, -702509, -735894, -770457, -806758, -845323, -886510, -930335, -976443, -1024315, -1073501, -1123691]
57093a123691n1109n2343n4250n6777n9508o2196o5064o8539p2867p8050q4046
57082a828440r0863r8452j06651j15336j24612j34756j45919j58046j71178j85540
57072c159793k01088k17197k33199k49161k65668k83000l00999l19821l40265
57063e570191l63252l89471m19607m54346m93866n37767n85735o38042o95458
57054a0147735p59247q31273r13570j007698j115061j237737j378373j539591
57046a8930285j724600j938435k187582k478567k818841l219852l698704m276972
57038d1273838m979547n834260o869574q110347r575341j1276277j3214122j5375125
57030a16508431j7734532k0262896k2914985k5599154k8164250l0440095l2303666
$$ y = [-1123691, -1174800, -1227143, -1281393, -1338170, -1397678, -1459874, -1524938, -1593477, -1666344, -1744394, -1828440, -1919303, -2017755, -2124406, -2239742, -2364354, -2499110, -2645029, -2803075, -2974253, -3159793, -3360881, -3578078, -3811277, -4060438, -4326106, -4609106, -4910105, -5229926, -5570191, -5933443, -6322914, -6742521, -7196867, -7690733, -8228500, -8814235, -9452277, -10147735, -10906982, -11738255, -12651825, -13659523, -14774584, -16012321, -17390694, -18930285, -20654885, -22593320, -24780902, -27259469, -30078310, -33298162, -36996866, -41273838, -46253385, -52087645, -58957219, -67067566, -76642907, -87919184, -101133306, -116508431, -134242963, -154505859, -177420844, -203019998, -231184248, -261624343, -293928009]
57023b93928009l3687410l4484500l4420155l3029118k9818083k4540161j7401277
57016e01308713r053761l82820P772480J4810503K0418736K4535023K7282622
57009d15925930K8898863K9654030K9777111K9419645K8665272K7560580K6140948
57002b15809481K4445794K2528393K0460078J8325147J6208813J4185158J2309684
56995h7346414J0616770R121092P821665O706612N757499M953254M273414L699749
56987c4396359L216395K809612K467566K179699J936062J727731J547811J391551
56979a7119932J255390J136290J031812R40054Q59203P87479P23538O66482O15402
56970i104282N69243N27208M88920M54124M22477L93626L67195L42781L20106
$$ y = [-293928009, -327615419, -362099919, -396520074, -429549192, -459367275, -483907436, -501308713, -510362474, -510745294, -502972814, -488162311, -467743575, -443208552, -415925930, -387027067, -357373037, -327595926, -298176281, -269511009, -241950429, -215809481, -191363687, -168835294, -148375216, -130050069, -113841256, -99656098, -87346414, -76729644, -67608552, -59786887, -53080275, -47322776, -42369522, -38096108, -34396359, -31179964, -28370352, -25902786, -23723087, -21787025, -20059294, -18511483, -17119932, -15864542, -14728252, -13696440, -12756386, -11897183, -11109704, -10386166, -9719684, -9104282, -8535039, -8007831, -7518911, -7064787, -6642310, -6248684, -5881489, -5538708, -5218602]
56961e218602K99043K79365K60678K42851K26131K10601J95872J81678J68269
56952c154114J55823J43849J31800J19860J08644R8391Q9075Q0843P3712O7134
56942b084983O0526N4007M7912M1887L5261K8101K1137J4914R861P059P814J2173
56930a744331J8530K4846K9725L2481L3010L1972L0364K8646K6664K4480K2616
56919a440997K1303K0099J8485J6379J3963J1470R312P916P252O963O972P520
56907a293363Q559R696J0818J2232J3959J5538J6678J7603J8533J9323J9884K0431
56895a110109K1032K1351K1091K0382J9474J8443J7337J6275J5213J4005J2832
56884i12674J2108J1788J1287J0334R464R265R614R972J0145J0289J0459J0550
$$ y = [-5218602, -4919559, -4640194, -4379516, -4136665, -3910534, -3699933, -3504061, -3322383, -3154114, -2998291, -2854442, -2722642, -2602782, -2494138, -2395747, -2306672, -2225829, -2152117, -2084983, -2024457, -1970450, -1922538, -1880651, -1845390, -1817289, -1796152, -1781238, -1771377, -1764318, -1756504, -1744331, -1725801, -1700955, -1671230, -1638749, -1605739, -1573767, -1543403, -1514757, -1488093, -1463613, -1440997, -1419694, -1399595, -1381110, -1364731, -1350768, -1339298, -1329986, -1322070, -1314818, -1307855, -1300883, -1293363, -1284804, -1275108, -1264290, -1252058, -1238099, -1222561, -1205883, -1188280, -1169747, -1150424, -1130540, -1110109, -1089077, -1067726, -1046635, -1026253, -1006779, -988336, -970999, -954724, -939511, -925506, -912674, -900566, -888778, -877491, -867157, -857693, -848428, -838814, -828842, -818697, -808408, -797949, -787399]
56872g87399J0599J0812J1313J2021J2672J2888J2348J1086R489P991O868O282
56860f63030O214O360O385O319O445O779P013O975O833O718O527O250O089O145
56846e71978O248O249O205O194O216O392O928P763Q595R320J0165J1287J2578
56833d67838J3928J5324J6627J7646J8576J9893K1669K3312K4268K4541K4306
56822b47748K3419K1622J8989J5878J2622R500O731M337K153J67j371k298k761
56809a38760k939k854k613k496k596k551j925o83Q33K280L454M260M595M252K988
56794a34755Q90j398l180m333n140n563n255m249l094k132j190j44P55J438K358
56779a64992L859N659P309Q842J0543J2440J4312J5905J6744J6068J3450R312
$$ y = [-787399, -776800, -765988, -754675, -742654, -729982, -717094, -704746, -693660, -684171, -676180, -669312, -663030, -656816, -650456, -644071, -637752, -631307, -624528, -617515, -610540, -603707, -596989, -590462, -584212, -578123, -571978, -565730, -559481, -553276, -547082, -540866, -534474, -527546, -519783, -511188, -501868, -491703, -480416, -467838, -453910, -438586, -421959, -404313, -385737, -365844, -344175, -320863, -296595, -272054, -247748, -224329, -202707, -183718, -167840, -155218, -145718, -138987, -134650, -132497, -132330, -133701, -135999, -138760, -141699, -144553, -147166, -149662, -152258, -154809, -156734, -157417, -156584, -154304, -150850, -146590, -141995, -137743, -134755, -133865, -135263, -138443, -142776, -147916, -153479, -158734, -162983, -166077, -168209, -169399, -169543, -168788, -167350, -164992, -161133, -155474, -148165, -139323, -128780, -116340, -102028, -86123, -69379, -53311, -39861, -30549]
56767c0549M547j49m254p116q278q006p128o304n656n037m284l323k197j032J71
56752h8595J576L236M966O586Q130R624J0904J1730J1786i532b070H67h70n279
56738f149p304q160q216p734p031o293n350m056k740j847j302o31L54J382K234
56723f2843L024L945N019O123P022P297O527M596J868r92l326m783n462n703n703
56708d3391n478n178n112n270n197m570l671l032k770k571k218j805j532j463
56694i3258j518j519j342j049p93n65k25J79M19N00P21J165J544J656J692J745
56678i0648J475O62k39n43k13J80K09k2k74n09p83j031j083q57m85k69l42m37
56660i5209j80L76P76P62N16K54l4k83k82o3M1o7q7O0j6m33o33k26K29n6q77j263
$$ y = [-30549, -26002, -26151, -30405, -37521, -45799, -53805, -60933, -67237, -72893, -77930, -82214, -85537, -87734, -88766, -88595, -87019, -83783, -78817, -72231, -64101, -54477, -43573, -31843, -20057, -9532, -2070, 867, -870, -6149, -13453, -21613, -29829, -37563, -44594, -50887, -56237, -60293, -63033, -64880, -66182, -66813, -66459, -65077, -62843, -59819, -55874, -50855, -44732, -37710, -30413, -23886, -19290, -17422, -18414, -21740, -26523, -31985, -37688, -43391, -48869, -54047, -59159, -64429, -69626, -74196, -77867, -80899, -83669, -86240, -88458, -90263, -91795, -93258, -94776, -96295, -97637, -98686, -99479, -100044, -100269, -100090, -99671, -99171, -98450, -97285, -95741, -94085, -92393, -90648, -89173, -88511, -88750, -89293, -89506, -89326, -89117, -89139, -89413, -89922, -90705, -91736, -92819, -93676, -94161, -94430, -94772, -95209, -95389, -95013, -94237, -93475, -92959, -92705, -92739, -93022, -93304, -93367, -93326, -93393, -93480, -93420, -93436, -93869, -94502, -94728, -94499, -94555, -95432, -96695]
56638i6695p90k6L14J14l06o53q16q27p97p44n80l13j30q4K2L33P59J342K369
56619i7508L836N182N955O439P129P882Q094P562O665N846N250M788M215L300
56605a5365K174J293P62J10r16j828k166k363l115m173m635m262l712l469l320
56590d4985l019k785k882l216l533l679l466k803j974j487j544j880k149k120
56576h1522j643q25j60m3j77N9P15J241J383J493J868K286K411K261K067J970
56560f6616K021K218K437K553K614K697K671K368J950J731J713J640J460J342
56546c7201J288J119Q47P08Q04J019J217J253R02K15k77j09M76Q50Q55P94P49
56529b4491M89L6k39j82l2Rk5j14k81l89k75n9J06L86R05J249R34K40j11QJ18
$$ y = [-96695, -97485, -97511, -97197, -97083, -97389, -98042, -98858, -99685, -100482, -101226, -101806, -102119, -102249, -102333, -102311, -101978, -101219, -99877, -97508, -93672, -88490, -82535, -76096, -68967, -61085, -52991, -45429, -38764, -32918, -27668, -22880, -18665, -15365, -13191, -11898, -11136, -11026, -11942, -13770, -15936, -18299, -21414, -25587, -30222, -34484, -38196, -41665, -44985, -48004, -50789, -53671, -56887, -60420, -64099, -67565, -70368, -72342, -73829, -75373, -77253, -79402, -81522, -83165, -83990, -84150, -84193, -84370, -84311, -83596, -82355, -80972, -79479, -77611, -75325, -72914, -70653, -68586, -66616, -64595, -62377, -59940, -57387, -54773, -52076, -49405, -47037, -45087, -43356, -41643, -40003, -38543, -37201, -35913, -34794, -33947, -33239, -32435, -31416, -30199, -28946, -28044, -27829, -28106, -28215, -27739, -26889, -26034, -25240, -24491, -24002, -23966, -24205, -24387, -24419, -24410, -24435, -24549, -24830, -25219, -25494, -25553, -25447, -25061, -24156, -22907, -21973, -21733, -21844, -21836, -21718]
56508b1718J57O17J554K292K418K310K398K510K382K177g74A368K093K090K134
56493G685J935J406R36Q50R64R32O91L52j7k79k52p6j47n37q05o52l48l09n49
56474A1780q17r72r97q96p34o38o19o15o42p41p72o61o44r35a72j301j235j486
56456d194j881j841j410j183j253j018k81L36L97K89M38O09M92L21M06N52M69
56439h752K90K36J38j92m86l54J22N36O76O31N96P12R24R52O56M15O54J059b55
56419B8a05j1C8O0J52P33J321J393J148R64P29K81j9K02O96R75J001R70Q50N95
56399A2089M75P34J173J480J612J585J271P60M70N92Q26R19R94J071Q88M79L09
56382B7727M38K90k87n57o6M78K43l99n12J2M91N64M03J25k43m48l66m04r46j627
$$ y = [-21718, -21561, -20944, -19390, -17098, -14680, -12370, -9972, -7462, -5080, -2903, -774, 1368, 3461, 5551, 7685, 9620, 11026, 11962, 12812, 13776, 14708, 15399, 15751, 15734, 15455, 15203, 15127, 14980, 14443, 13638, 12986, 12638, 12329, 11780, 10963, 9991, 8994, 8098, 7364, 6726, 6107, 5492, 4850, 4109, 3337, 2676, 2032, 1097, -172, -1473, -2708, -4194, -6075, -7916, -9326, -10509, -11762, -12780, -13061, -12725, -12328, -12039, -11601, -10992, -10500, -10179, -9773, -9221, -8752, -8462, -8226, -8088, -8280, -8766, -9120, -8998, -8462, -7786, -7155, -6559, -5847, -4923, -3971, -3315, -2900, -2246, -1187, -255, 28, -105, -116, 38, 98, 250, 983, 2304, 3697, 4845, 5809, 6538, 6819, 6800, 7002, 7698, 8673, 9674, 10644, 11494, 12089, 12564, 13298, 14471, 15951, 17563, 19148, 20419, 21179, 21649, 22241, 23067, 23986, 24980, 26051, 26939, 27418, 27727, 28165, 28455, 28168, 27611, 27545, 28023, 28266, 27867, 27355, 27367, 27858, 28422, 28825, 28950, 28707, 28259, 27893, 27489, 26543, 24916]
56362B4916j834j642j541j547j292q28n86o45o70n64n07m63k19J52L30K88K87
56345A3635M22N58O27O20M53J88J86O24J100J104O89K91P0j02k24j79K4L14P34
56326B1134J208J433J285J039R17P93O23O87J025J181R38P94J153J597J593J396
56310C8796J549J877J775J240Q51Q81J058J088R10O11M17N39P61N91J65L11J255
56293E4675J970J572O57L98Q25J065P61K71k80j065j793j864j276o06j45K91P72
56276E6228J200J710K406K940K959K794K952L217L037K549K372K556K625K514
56262I2059K613K940L101L044L062L110K869K440K258K326K316K249K417K639
56248A29443K440J904J595J700J909K072K248K296K080J990K425K993L037K735
$$ y = [24916, 23082, 21440, 19899, 18352, 17060, 16232, 15646, 15001, 14331, 13767, 13260, 12797, 12578, 12730, 13060, 13348, 13635, 14057, 14615, 15242, 15862, 16315, 16503, 16689, 17313, 18413, 19517, 20206, 20497, 20567, 20465, 20241, 20062, 20086, 20400, 21134, 22342, 23775, 25060, 26099, 27016, 27809, 28432, 29119, 30144, 31325, 32263, 33057, 34210, 35807, 37400, 38796, 40345, 42222, 43997, 45237, 46088, 46969, 48027, 49115, 50025, 50636, 51053, 51592, 52353, 52944, 53109, 53420, 54675, 56645, 58217, 58874, 59272, 60097, 61162, 61923, 62194, 61914, 60849, 59056, 57192, 55916, 55310, 55165, 55456, 56228, 57428, 59138, 61544, 64484, 67443, 70237, 73189, 76406, 79443, 81992, 84364, 86920, 89545, 92059, 94672, 97612, 100713, 103757, 106819, 109929, 112798, 115238, 117496, 119822, 122138, 124387, 126804, 129443, 131883, 133787, 135382, 137082, 138991, 141063, 143311, 145607, 147687, 149677, 152102, 155095, 158132, 160867]
56234A60867K856L496M053M333M703N157N265N113N372O277P314Q128Q883R628
56220B41445J0107J0384J0920J1897J3080J4367J5827J7229J8243J9127K0478
56209D03104K2344K4290K6262K8564L1080L3366L5537L8198M1487M5007M8702
56198G77941N2885N7435O1797O5814O9722P3337P6136P8146P9799Q0846Q0423
56187A554281P8255P4779P0053O3542N5225M5877L6026K5572J4737M421m740j2877
56175B005151k0190k6540l1884l6397l9922m2119m3315m4386m5698m6932m8028
56164A579740m9334n0770n1783n2351n3095n4176n4976n5118n4901n4532n3778
56153I94926n2634n1454n0164m8269m5748m3155m0659l7864l4760l1883k9384
$$ y = [160867, 163723, 167219, 171272, 175605, 180308, 185465, 190730, 195843, 201215, 207492, 214806, 222934, 231817, 241445, 251552, 261936, 272856, 284753, 297833, 312200, 328027, 345256, 363499, 382626, 403104, 425448, 449738, 476000, 504564, 535644, 569010, 604547, 642745, 684232, 729239, 777941, 830826, 888261, 950058, 1015872, 1085594, 1158931, 1235067, 1313213, 1393012, 1473858, 1554281, 1632536, 1707315, 1777368, 1840910, 1896135, 1942012, 1978038, 2003610, 2018347, 2022768, 2018028, 2005151, 1984961, 1958421, 1926537, 1890140, 1850218, 1808099, 1764784, 1720398, 1674700, 1627768, 1579740, 1530406, 1479636, 1427853, 1375502, 1322407, 1268231, 1213255, 1158137, 1103236, 1048704, 994926, 942292, 890838, 840674, 792405, 746657, 703502, 662843, 624979, 590219, 558336, 528952]
56142E28952k6862k4327k2293k0772j9150j7293j5805j4850j3795j2302j0867
56131C30636r902r189q496p899p250o207m994m262m051l763l236k876k668k168
56117B53675j522j351j538j263m68rj90l12R0P16J407K293K929K598J752J660
56101B60467K409K661J822Q88O67O74M51N08J168J817K014K200K655K935K931
56086B86267L280M182N022N717P060R163J0969J1945J2922J4537J6241J7570J9036
56073D23911K0941K2571K3425K3974K4477K4285K3100K1636K0340J8745J6760
56062F64165J5255J4480J3359J1063Q092N012J602j943m508n667o498p918r588
56049F96906j1216j3398j6241j8632j9870k0539k0956k0333j8534j6930j6415
$$ y = [528952, 502090, 477763, 455470, 434698, 415548, 398255, 382450, 367600, 353805, 341503, 330636, 320734, 311545, 303049, 295150, 287900, 281693, 276699, 272437, 268386, 264623, 261387, 258511, 255843, 253675, 252153, 250802, 249264, 248001, 247533, 247524, 247334, 247022, 247112, 247828, 249235, 251528, 254457, 257055, 258807, 260467, 262876, 265537, 267359, 268247, 268914, 269588, 270039, 270547, 271715, 273532, 275546, 277746, 280401, 283336, 286267, 289547, 293729, 298751, 304468, 311528, 320691, 331660, 343605, 356527, 371064, 387305, 404875, 423911, 444852, 467423, 490848, 514822, 539299, 563584, 586684, 608320, 628660, 647405, 664165, 679420, 693900, 707259, 718322, 726414, 731426, 733028, 731085, 726577, 720910, 714412, 706494, 696906, 685690, 672292, 656051, 637419, 617549, 597010, 576054, 555721, 537187, 520257, 503842]
56038E03842j6054j4938j3747j3269j2883j1843j0640r848q984p688o680o336
56026C70932n777m482l339k970k582j569p42o50l75P27J757J955K060K716L214
56011C60875L105L290M155M531L835L357L945M399L778L249L891M678M523M382
55997D15993N375O602O895O905P568Q257Q386Q973J0625J1887J1583J0935J1316
55984E31300J1867J1455J0962J1454J2061J1881J1995J3269J4326J4017J3733
55973F68320J4863J6186J6297J6356J7758J9361J9840K0457K2586K4803K5434
55962H82261K5745K7463K9437K9947L0094L1593L3509L4482L5846L9133M2858
55951A242368M5235M7584N1498N5295N7105N8714O2315O6190O7978O9413P3292
$$ y = [503842, 487788, 472850, 459103, 445834, 432951, 421108, 410468, 400620, 391636, 383948, 377268, 370932, 365155, 360673, 357334, 354364, 351782, 350213, 349471, 348821, 348446, 349173, 350930, 352885, 354945, 357661, 360875, 363980, 367270, 371425, 375956, 379791, 383148, 387093, 391492, 395270, 398519, 402410, 407088, 411611, 415993, 421368, 427970, 434865, 441770, 449338, 457595, 465981, 474954, 485579, 497466, 509049, 519984, 531300, 543167, 554622, 565584, 577038, 589099, 600980, 612975, 626244, 640570, 654587, 668320, 683183, 699369, 715666, 732022, 749780, 769141, 788981, 809438, 832024, 856827, 882261, 908006, 935469, 964906, 994853, 1024947, 1056540, 1090049, 1124531, 1160377, 1199510, 1242368, 1287603, 1335187, 1386685, 1441980, 1499085, 1557799, 1620114, 1686304, 1754282, 1823695, 1896987]
55940A896987P8377Q2119Q5785R1955R9422J05591J11555J19711J28877J36804
55930B937183J45037J55993J68055J78778J89994K04216K19256K32168K45056
55921D675736K60816K77095K91126L06409L27278L51063L73423L97035M26604
55912G686585M60077M94036N32853N82113O37794O93054P51153Q20221R00683
55903A3558569R90740J098700J235457J399819J585983J799118K047606K328578
55895B6044570K641237L005710L446051L965687M567739N286015O158546P182303
55887F2297858Q329559R554515J0651267J1079294J0106881P345924L203403j268341
55879A21300360n018617p528642q835225r235555r047647q534124p881717p187092
$$ y = [1896987, 1975364, 2057483, 2143268, 2235223, 2334645, 2440236, 2551791, 2671502, 2800379, 2937183, 3082220, 3238213, 3406268, 3585046, 3775040, 3979256, 4198512, 4430680, 4675736, 4936552, 5213647, 5504773, 5811182, 6138460, 6489523, 6862946, 7259981, 7686585, 8146662, 8640698, 9173551, 9755664, 10393458, 11086512, 11837665, 12657886, 13558569, 14549309, 15648009, 16883466, 18283285, 19869268, 21668386, 23715992, 26044570, 28685807, 31691517, 35137568, 39103255, 43670994, 48957009, 55115555, 62297858, 70627417, 80181932, 90833199, 101912493, 112019374, 119365298, 122568701, 121300360, 116281743, 108753101, 99917876, 90682321, 81634674, 73100550, 65218833, 58031741]
55871E8031741o483568n791481n133031m516784l940848l412378k945041k540643
55863B3267967k190757j892908j648915j450606j282817j138945j020493r23763
55855A1718763q39592p64467p00247o44275n90461n38850m94139m55888m19193
55846F271651l83692l53119l27065l01563k76766k56127k38901k21093k02881
55837C710444j87867j75821j63178j50015j39606j31733j23062j13653j06663
55828B418846j01898r5946q8573q2998p9784p6161p1496o8027o5945o2926n8807
55817A566285n5899n4404n2135m8947m6936m6119m4301m1377l9522l8938l7569
55806A060138l5131l3483l2777l1248k8899k7600k7389k6401k4606k3811k3860
$$ y = [58031741, 51548173, 45756692, 40623661, 36106877, 32166029, 28753651, 25808610, 23267967, 21077210, 19184302, 17535387, 16084781, 14801964, 13663019, 12642526, 11718763, 10879171, 10114704, 9414457, 8770182, 8179721, 7640871, 7146732, 6690844, 6271651, 5887959, 5534840, 5207775, 4906212, 4629446, 4373319, 4134418, 3913325, 3710444, 3522577, 3346756, 3183578, 3033563, 2893957, 2762224, 2639162, 2525509, 2418846, 2316948, 2221002, 2132429, 2049431, 1969647, 1893486, 1821990, 1753963, 1688018, 1625092, 1566285, 1510386, 1455982, 1403847, 1354900, 1307964, 1261845, 1217544, 1176167, 1136645, 1097707, 1060138, 1025007, 991524, 958747, 927499, 898600, 871000, 843611, 817210, 792604, 768793, 744933]
55795G44933k2621j9961j8059j7452j6398j4569j3752j4394j4840j4592j4980
55784E63315j6080j6161j4847j3780j3500j2717j1176j0339j0549j0345r292q731
55772D15798r135r331q913q885r305q899p586o882p219p299o634o292o594o444
55758C06380n603n162n280m733l366k621k962l030k069j018n38kP72R15K82q0
55742B71885J08j57j156j848j872k165l042l559l442l718m783n623n675n653n936
55727B23364n880n348n163n449n234m300l714l884l891l294k863k899k579j740
55713A67126j523k462l559m035m425n114n369m745m035l932l991l689l326l151
55699A13770k812k286k196k606k783k533k569l078l232k699k211k162j965j415
$$ y = [744933, 722312, 702351, 684292, 666840, 650442, 635873, 622121, 607727, 592887, 578295, 563315, 547235, 531074, 516227, 502447, 488947, 476230, 465054, 454715, 444166, 433821, 424529, 415798, 406663, 397332, 388419, 379534, 370229, 361330, 353744, 346862, 339643, 332344, 325710, 319418, 312824, 306380, 300777, 295615, 290335, 285602, 282236, 279615, 276653, 273623, 271554, 270536, 269998, 269996, 270768, 271683, 271965, 271885, 271993, 271836, 270680, 268832, 266960, 264795, 261753, 258194, 254752, 251034, 246251, 240628, 234953, 229300, 223364, 217484, 212136, 206973, 201524, 196290, 191990, 188276, 184392, 180501, 177207, 174344, 171445, 168866, 167126, 165603, 163141, 159582, 155547, 151122, 146008, 140639, 135894, 131859, 127927, 123936, 120247, 116921, 113770, 110958, 108672, 106476, 103870, 101087, 98554, 95985, 92907, 89675, 86976, 84765, 82603, 80638, 79223]
55685G9223j239j721k043j695j267j254j258j006r35j188j229q99p32p74m05L37
55669F1915N68J91J49O27N26n34j313r19k12k81p94r53q68r56r55n28l0K03M61
55650E6297R27J165R61Q05R50R93Q42J053J656J829J329J070J540J891J386O29
55634G5323M21M67J60k90m36m59o25o65m75n40r49r10p0O64N00N9L21J043J294
55615G4833R36N97O12Q31J093J207R06L50J99O73J123R90N56L13K04L0j14k18
55597H5121n19q85p94l37l19r28j306r72o70j064j644j707j549j751k111k175
55581F6390k163k458k752k642k455k669k971k788k248j931j973k099k160k070
55567C3011j608q69m48o80j160j395j426j370r99k70L30M95N35O48M36l33j112
$$ y = [79223, 77984, 76263, 74220, 72525, 71258, 70004, 68746, 67740, 66805, 65617, 64388, 63489, 62757, 61983, 61578, 61915, 62483, 62674, 62823, 63450, 63976, 63442, 62129, 61210, 60998, 60717, 59923, 58970, 58102, 57146, 56191, 55663, 55633, 55836, 56297, 57224, 58389, 59350, 60155, 61105, 62098, 62940, 63993, 65649, 67478, 68807, 69877, 71417, 73308, 74694, 75323, 75744, 76211, 76371, 76081, 75645, 75186, 74561, 73896, 73421, 72881, 71932, 71022, 70952, 71616, 72116, 72175, 72496, 73539, 74833, 75769, 76366, 76978, 77809, 78902, 80109, 81015, 81365, 81564, 82237, 83360, 84350, 84906, 85219, 85423, 85453, 85339, 85121, 84602, 83717, 82923, 82586, 82267, 81339, 80033, 79061, 78391, 77327, 75683, 73976, 72427, 70676, 68565, 66390, 64227, 61769, 59017, 56375, 53920, 51251, 48280, 45492, 43244, 41313, 39340, 37241, 35081, 33011, 31403, 30534, 30086, 29406, 28246, 26851, 25425, 24055, 23056, 22786, 23116, 23611, 24146, 24794, 25230, 24897, 23785]
55550B3785j286r30m12J32M87K36n01r45p93o99j138j584j443r83o90m49m2K34
55532A2979J64J38L97M66K2l95k44J08Q7j62k58l11m43l13J70L57r0m32OO55O45
55511A3546K71M48J188J731J788J726J752J794J925K169K160J647R97O17K82l02
55495C3739p63o56k92k24l58l21k47m48p02o44n10p36j189j517j804k186k271
55478A8871j720r76n97l80J26O20M91o8l00K2M44O13N08J86j46j11K62L93N0j88
55458A8100K1O4n77j314j401j228j558k110k052j478j176j286j284j105D89g76
55441a856o59m71m70k93j15l15o02m68k62o82j393j318l20N83P19L97j4n53j002
55422i094q63k57O2j21j44L40P33M37k27n37l21RL8k42m68k93J11J75k39n10j75
$$ y = [23785, 22499, 21569, 21157, 21289, 21776, 22012, 21511, 20566, 19773, 19074, 17936, 16352, 14909, 13926, 13236, 12787, 12745, 12979, 13143, 13281, 13678, 14144, 14166, 13771, 13527, 13635, 13722, 13560, 13302, 12991, 12548, 12235, 12405, 12762, 12672, 12240, 12246, 12901, 13546, 13817, 14265, 15453, 17184, 18972, 20698, 22450, 24244, 26169, 28338, 30498, 32145, 33142, 33759, 34041, 33739, 32976, 32320, 32028, 31804, 31446, 31125, 30878, 30430, 29728, 29084, 28574, 27838, 26649, 25132, 23328, 21142, 18871, 17151, 16175, 15578, 15198, 15324, 15944, 16435, 16367, 16067, 16089, 16533, 17146, 17654, 17840, 17694, 17583, 17845, 18238, 18288, 18100, 18121, 18185, 17608, 16294, 14893, 13665, 12107, 9997, 7945, 6467, 5291, 4005, 2721, 1616, 489, -776, -1856, -2515, -2986, -3456, -3749, -3864, -4179, -4781, -5249, -5511, -6193, -7586, -8904, -9224, -8641, -7922, -7525, -7539, -8092, -9094, -9957, -10214, -10152, -10273, -10417, -10077, -9344, -8907, -9134, -9671, -9992, -9983, -9945, -10187, -10655, -10948, -10837, -10662, -10901, -11411, -11586]
55401a1586L04K94K8P1K17j35p90r15l40K50M01L03J24k22n96o70n37n77p28n87
55381a5691k40j54l13j94K81N97M91K56J23J7k1J50L02Q3k84k31J99M16K54J31
55361a3828J87Q7j99k32J18M15L61J81J07J17K48N79R01Q96P11O89P06M50K17
55342g289N91J315J441O69k59o82p18o24l58NJ39L5M3J58m4n73q54o07k30n7N3
55321g846J75N1l14m77k35L3Lj84l49n57p65o84k71J49L68M35K87j94p03p61m87
55300a2326m54p34p79l79K7J18P5J2j73l08n5L20J47m80o37J6O76O74L97L88M25
55279a3050J17k59k43K6J32O6L1k2k09l85m04l47k34J03N46O61L42M0J9j4k57
55258a3341l98k69k53o10r05o46m5L70M94N08L94Q4j82j19J94M78N61L62j12n17
$$ y = [-11586, -11282, -10988, -10960, -10889, -10672, -10807, -11597, -12512, -12852, -12602, -12201, -11898, -11774, -11996, -12592, -13262, -13799, -14376, -15104, -15691, -15931, -16085, -16398, -16592, -16311, -15714, -15223, -14967, -14844, -14827, -14848, -14698, -14396, -14313, -14597, -14828, -14629, -14213, -13959, -13828, -13641, -13554, -13753, -13985, -13867, -13452, -13091, -12910, -12803, -12686, -12438, -11859, -10958, -10062, -9351, -8662, -7956, -7506, -7289, -6698, -5383, -3942, -3273, -3532, -4214, -4932, -5556, -5914, -5909, -5770, -5735, -5692, -5534, -5578, -6151, -7005, -7612, -7842, -7899, -7846, -7671, -7620, -7934, -8411, -8646, -8613, -8610, -8794, -9143, -9700, -10465, -11149, -11420, -11271, -10903, -10468, -10181, -10375, -11078, -11839, -12326, -12780, -13514, -14293, -14672, -14645, -14527, -14452, -14440, -14613, -14921, -14976, -14656, -14509, -14989, -15626, -15610, -14934, -14260, -13863, -13475, -13050, -12933, -13192, -13435, -13409, -13277, -13211, -13180, -13202, -13411, -13796, -14200, -14547, -14781, -14678, -14132, -13471, -13129, -13089, -13070, -13084, -13341, -13739, -14008, -14261, -14871, -15776, -16422, -16467, -16097, -15603, -15095, -14701, -14617, -14799, -14918, -14724, -14246, -13685, -13323, -13435, -13952]
55238a3952l75K64P50O55K57j0j14j91k00j25q2k8K04M43K67k77n74l50j6P6J17
55217a3261K60K35p3k73j47l2j27n7L77O80M39J4j15j18k59k23K98P81N00l24
55197a1425p72n06m1J37R2P1J21J84K33K51K33J51j26o27r96p51ON85N54J87j30
55176a2569l59m74k62J93L83J20j00R1L40K19m1j4J63J13j42l02k75j03K72P31
55156a2016R05O87M48M03K83j8q2K46M25P5l32k73l8r4j91P1L58J57j97p5K61
55135h997K7p45j219j055p33n64l09J33M38M59M65O02O56M89K44j9l66o62o41
55116a1797l67j93k53l47l36k59r1K19M98N23L73K92K80J64j2o4k0k8o4l3l5j54
55094a1704j72J19N08O18M48K64J71R3Kj27l60n36l01K65N15J55k32o5L07K69
$$ y = [-13952, -14327, -14063, -13313, -12658, -12401, -12411, -12525, -12716, -12916, -13041, -13123, -13151, -12947, -12504, -12237, -12514, -13088, -13438, -13454, -13378, -13261, -13001, -12766, -12839, -13112, -13259, -13291, -13418, -13475, -13098, -12418, -11979, -11965, -12080, -12198, -12457, -12680, -12382, -11601, -11101, -11425, -12197, -12703, -12744, -12607, -12515, -12444, -12323, -12139, -11906, -11655, -11422, -11271, -11397, -12024, -13020, -13771, -13765, -13180, -12626, -12439, -12569, -12928, -13402, -13664, -13471, -13088, -12968, -13068, -12977, -12637, -12418, -12459, -12473, -12310, -12197, -12339, -12641, -12916, -13019, -12747, -12016, -11111, -10424, -9976, -9573, -9290, -9308, -9390, -9144, -8719, -8644, -8976, -9249, -9287, -9381, -9572, -9501, -9143, -8986, -9183, -9258, -8997, -8970, -9715, -10934, -11989, -12722, -13286, -13595, -13462, -13024, -12565, -12100, -11498, -10842, -10353, -10109, -10128, -10494, -11156, -11797, -12164, -12357, -12610, -12957, -13293, -13552, -13643, -13424, -12926, -12403, -12030, -11738, -11458, -11294, -11306, -11370, -11390, -11418, -11482, -11515, -11550, -11704, -11876, -11757, -11249, -10631, -10183, -9919, -9748, -9655, -9653, -9780, -10140, -10676, -10977, -10712, -10197, -10042, -10274, -10339, -10032, -9763]
55074i763k3k9J97K42K63P00J250J144L56l11m51l98l84j76K60N38M98M03L37
55055e347R0k36k09J62L29P2j69q0O3K1OK25M88N93N91M85J57k03j38L48O48M32
55033a672J29J99M45M49a75E9L36L71L22L04K97K50L05N90R13R22N10p7n04o04
55013C994m37j79O9K96L75J08m17p12m91j11n8k02j01J52L9m57p10m04K1O0k04
54992F31B23b24m17l39k39k36l72n37o78q21q44n76j37J42J81J90K34J41o9j19
54972d720Q0K79K68P4k64o88q65m57K85P04O65P21J152a307a45D29K93L83N24
54953A629O31Q19R90R21O64M48L01J19qJ12L86M47R1m90r03q90m92J5L39L92L05
54932E826J98J02Mr4k21l43l18j10M2j00l81m18j14K96O59J015J314J424J414
$$ y = [-9763, -9786, -9815, -9618, -9376, -9113, -8413, -7163, -6019, -5663, -5974, -6425, -6823, -7207, -7383, -7123, -6585, -6087, -5684, -5347, -5257, -5493, -5702, -5540, -5211, -5139, -5308, -5388, -5325, -5304, -5298, -5073, -4585, -3992, -3401, -2916, -2759, -2962, -3100, -2752, -2104, -1672, -1543, -1344, -899, -450, -175, 59, 395, 766, 1088, 1392, 1689, 1939, 2244, 2834, 3747, 4669, 5179, 5102, 4598, 3994, 3557, 3378, 3447, 3743, 4118, 4226, 3809, 3097, 2606, 2495, 2437, 2235, 2134, 2286, 2325, 1868, 1158, 754, 775, 835, 631, 223, -224, -641, -980, -1219, -1455, -1827, -2364, -3042, -3863, -4707, -5283, -5420, -5278, -5097, -4907, -4673, -4532, -4601, -4720, -4640, -4361, -4093, -4019, -4283, -4971, -5836, -6293, -6008, -5304, -4639, -3918, -2766, -1307, -145, 429, 722, 1105, 1629, 2260, 3079, 4069, 4990, 5654, 6102, 6403, 6522, 6514, 6626, 7012, 7459, 7550, 7060, 6157, 5267, 4775, 4790, 5129, 5521, 5826, 6024, 6126, 6130, 6036, 5815, 5472, 5154, 5044, 5086, 4986, 4605, 4187, 4073, 4369, 5028, 6043, 7357, 8781, 10195]
54913A0195J484J531J207N19k5l6L59Q28J217J478J567J608J788K035K087K011
54897B9853K224K859L531L971M419N087N690N908N947O188O482O307N492M407
54883I8365L361K219O65j279l161m463n061n291n502n642n433m899m425m246m169
54868E1039l895l339k595j827j237r70q92p08l20J32N68J016J396J595J781K248
54852D3992K920L408L636L972M570N096N254N203N171N070M724M134L209J674
54838A02033m15k377l570m078m448m945n441n798n998n972n634n035m334l668
54824D0320l177k979k977k875k501j970j409q45m33m35p73r52o83k82j76k95k95
54807A7263j08R7K57L65K76r3n10o49n31m56n94q51j040j053r11q17r39j115r90
$$ y = [10195, 11679, 13210, 14417, 14936, 14911, 14875, 15234, 16062, 17279, 18757, 20324, 21932, 23720, 25755, 27842, 29853, 32077, 34936, 38467, 42438, 46857, 51944, 57634, 63542, 69489, 75677, 82159, 88466, 93958, 98365, 101726, 103945, 104610, 103331, 100170, 95707, 90646, 85355, 79853, 74211, 68778, 63879, 59454, 55208, 51039, 47144, 43805, 41210, 39383, 38146, 37176, 36284, 35576, 35256, 35388, 35956, 36972, 38368, 39963, 41744, 43992, 46912, 50320, 53956, 57928, 62498, 67594, 72848, 78051, 83222, 88292, 93016, 97150, 100359, 102033, 101618, 99241, 95671, 91593, 87145, 82200, 76759, 70961, 64963, 58991, 53357, 48322, 43988, 40320, 37143, 34164, 31187, 28312, 25811, 23841, 22432, 21587, 21154, 20719, 19946, 18994, 18311, 18029, 17853, 17558, 17263, 17155, 17252, 17509, 17874, 18150, 18057, 17547, 16898, 16367, 15911, 15317, 14466, 13426, 12373, 11462, 10645, 9706, 8591, 7601]
54788G601n47j85j06l9K13L61J20k77m30l74l56l11n3K51K66M3r7j11k20m09l70
54767D970qM15O46O47M68K62L31Q27J371J430J040P89R83J280J246R08N61L79
54749A8545M50R02J676K372K608K518K600L061L597L861L958M239M769N227N419
54734F5802N594O053O580O556N643M105K479J107K5r06j871k919l867m472m669
54719H5240m516m015l274k695k640k906k948k649k368k214j811j022l30j28j06
54704E1618K07O88Q82P82Q11J179J715K272K867L483M037M504M887N149N372N728
54688I6181O101N957M972L522K183R98l34j727k730l212l523l925m285m392m224
54673I1562l874l483l337l657m252m601m430l977l636l535l500l305k917k515
$$ y = [7601, 7054, 6869, 6763, 6724, 6937, 7298, 7418, 7141, 6711, 6337, 5981, 5670, 5617, 5868, 6134, 6177, 6080, 5969, 5749, 5340, 4970, 4962, 5377, 6023, 6670, 7138, 7400, 7731, 8558, 9929, 11359, 12399, 13188, 14171, 15451, 16697, 17605, 18166, 18545, 18995, 19897, 21573, 23945, 26553, 29071, 31671, 34732, 38329, 42190, 46148, 50387, 55156, 60383, 65802, 71396, 77449, 84029, 90585, 96228, 100333, 102812, 103919, 103944, 103038, 101167, 98248, 94381, 89909, 85240, 80724, 76709, 73435, 70740, 68100, 65194, 62246, 59597, 57229, 55015, 53204, 52182, 51852, 51724, 51618, 51825, 52513, 53395, 54177, 54988, 56167, 57882, 60154, 63021, 66504, 70541, 75045, 79932, 85081, 90453, 96181, 102282, 108239, 113211, 116733, 118916, 119914, 119580, 117853, 115123, 111911, 108388, 104463, 100178, 95786, 91562, 87688, 84205, 80868, 77211, 72959, 68358, 63928, 59951, 56315, 52780, 49280, 45975, 43058, 40543]
54659D0543k299k192j937j505j213j216j198r04o38q17j225j250p48j91Q2K10
54643B3502L33K93%k84k68k2K21L77M82M53J72k62n26l61J46N85O50M79M79P24
54623B7173Q19N12J41J70N08O20K90j67l67k18K06P35J069R86O70N54P31Q84Q15
54604C6131P55R81J451J949K367K644K697K599K625K956L356L421L041K558K407
54589G1938K673L032L051K641K118J793J598J235O37J07l5K05N31O84O68P06R81
54572I4563J427J850K199K566K900K957K588J913J080M5j182k356l238l850m313
54557I9149m573m553m357m080l640l064k709k789k909k478j532p16m48n16m76
54542F0309j35M09R47J260J334J374J486J429J016N41M11M93K89k89q20j076j315
$$ y = [40543, 38244, 36052, 34115, 32610, 31397, 30181, 28983, 28079, 27441, 26624, 25399, 24149, 23401, 23210, 23292, 23502, 23835, 24128, 24128, 23844, 23576, 23554, 23775, 24152, 24634, 25087, 25259, 24997, 24471, 24110, 24256, 24841, 25491, 25970, 26449, 27173, 27992, 28504, 28645, 28815, 29323, 29943, 30233, 30066, 29699, 29481, 29687, 30422, 31491, 32477, 33147, 33701, 34432, 35316, 36131, 36886, 37867, 39318, 41267, 43634, 46278, 48975, 51574, 54199, 57155, 60511, 63932, 66973, 69531, 71938, 74611, 77643, 80694, 83335, 85453, 87246, 88844, 90079, 90716, 90823, 90788, 90993, 91524, 92208, 92876, 93582, 94563, 95990, 97840, 100039, 102605, 105505, 108462, 111050, 112963, 114043, 114088, 112906, 110550, 107312, 103462, 99149, 94576, 90023, 85666, 81586, 77946, 74882, 72173, 69384, 66475, 63997, 62465, 61749, 61301, 60785, 60309, 60174, 60583, 61530, 62790, 64124, 65498, 66984, 68413, 69429, 69970, 70381, 70874, 71163, 70874, 70054, 68978, 67663]
54525F7663j764k272k635k857k929k739k401k266k403k433k113j762j780k073
54511C5236k217k019j639j305j150j150j109q44n03m76q12j022o90p0K52J12j21
54494B0473j33k3o9l17n63n97m26k30j50j35l3K00M77P10Q66Q71O35K03k26m49
54474B1084l61K4N17Q03P11M73M85Q53J371J854K267K502K400K064J859J948K062
54457D2916J883J438R43M75k1n24r38j250j515j764j957k024j907j633j386j353
54441C1383j511j631j540j274r61p04n90o37o98o24m47l13k20p5M1o5l19l58l4
54422A9423L49M31K59J28J70K70L14L16L58M70N67N11K71Q5K33O59R60Q75N41
54403B7190K61J11j8j90l08k49j4J93R7l51q36r75p41m30k48j38o5j25l53n87
$$ y = [67663, 65899, 63627, 60992, 58135, 55206, 52467, 50066, 47800, 45397, 42964, 40851, 39089, 37309, 35236, 33019, 31000, 29361, 28056, 26906, 25756, 24647, 23803, 23300, 22824, 22012, 20990, 20300, 20230, 20482, 20594, 20473, 20340, 20317, 20248, 19931, 19368, 18771, 18345, 18115, 17965, 17830, 17797, 17997, 18474, 19184, 20050, 20921, 21556, 21759, 21533, 21084, 20723, 20747, 21264, 22067, 22778, 23251, 23736, 24589, 25960, 27814, 30081, 32583, 34983, 37047, 38906, 40854, 42916, 44799, 46237, 47180, 47655, 47634, 47110, 46172, 44922, 43407, 41643, 39686, 37662, 35755, 34122, 32736, 31383, 29872, 28241, 26701, 25427, 24466, 23762, 23172, 22535, 21837, 21213, 20766, 20453, 20233, 20158, 20199, 20134, 19815, 19457, 19423, 19772, 20203, 20462, 20590, 20760, 21030, 21344, 21660, 22018, 22488, 23055, 23566, 23837, 23922, 24155, 24814, 25774, 26649, 27190, 27451, 27562, 27544, 27354, 27046, 26797, 26783, 26976, 27073, 26722, 25886, 24911, 24170, 23740, 23492, 23354, 23289, 23164, 22811, 22224]
54383B2224o84p04p43p31n46k67r8j53l64n68o15m37p8L29N86N35K22J2K92R42
54363A9154J344J066M12J3L1J12j3k07k33k8L52Q10J169J282J196J036P77M37
54345B8710K72M96Q59R43Q01Q63J208J431J336J268J544J985K232K178J900J531
54329D9557J340J597K163K555K627K733L065L262L006K550K268K052J597R84M94
54314H1850M1o68j524k030k002j822j964k495l080l333l111k648k386k511k703
54299D9614k491j807j072p51r36j257j229p11j14N7j77k92KL55K88j48m86m31
54281C8414r4L09P07J147J621K021K229K309K495K869L113K897K462K413K887
54266F7799L294L106K479J878J401Q38J27n81j181j662j991k181k335k464k456
$$ y = [22224, 21540, 20836, 20093, 19362, 18816, 18549, 18451, 18298, 17934, 17366, 16751, 16314, 16236, 16565, 17151, 17686, 17908, 17920, 18212, 19154, 20498, 21564, 21976, 21989, 22020, 22132, 22119, 21912, 21679, 21651, 22003, 22813, 23982, 25264, 26460, 27496, 28273, 28710, 28982, 29478, 30337, 31280, 32081, 32944, 34152, 35583, 36919, 38187, 39731, 41716, 43948, 46126, 48026, 49557, 50897, 52494, 54657, 57212, 59839, 62572, 65637, 68899, 71905, 74455, 76723, 78775, 80372, 81356, 81850, 81891, 81223, 79699, 77669, 75667, 73845, 71881, 69386, 66306, 62973, 59862, 57214, 54828, 52317, 49614, 47123, 45316, 44244, 43493, 42557, 41300, 40071, 39360, 39246, 39303, 39126, 38834, 38836, 39191, 39479, 39331, 38845, 38414, 38320, 38629, 39336, 40483, 42104, 44125, 46354, 48663, 51158, 54027, 57140, 60037, 62499, 64912, 67799, 71093, 74199, 76678, 78556, 79957, 80795, 80922, 80341, 79160, 77498, 75507, 73326, 70991, 68527, 66071]
54251F6071k373k502k933l291l217k858k661k776k995l065k851k320j618j074
54237B9537q80r22j050j280j524j462j001n74o35r96j074o58p3L13L85J84j51
54220A8139l86l98l56m46n47m57l03l42m93m21j05J25R1j9k3J0j5M2L48Q32J192
54199A6468J162P42J85j98l11k56j11J33L98M77L11O2j42l56n33m79k08q2l09
54180A6953o11o75n76m53j36M76R76R06M48J16k9k81n62m84j13J2k47l56O3O23
54160A6050O96J94m97j005j142q94m78k20j81r0J96M15K46k08n61o03m43k49p6
54141A1150R1K26K39R9j13k51k90l13k90m1M49Q42P76L27j10k81k32j34j40l74
54121A1630p93j088r73n38j19J11J87R8k05n04m34J05Q01J226J146N72k29q06
$$ y = [66071, 63698, 61196, 58263, 54972, 51755, 48897, 46236, 43460, 40465, 37400, 34549, 32229, 30611, 29537, 28657, 27735, 26685, 25405, 23881, 22419, 21418, 20844, 20209, 19213, 18139, 17481, 17408, 17721, 18106, 18290, 18139, 17753, 17355, 16999, 16553, 16006, 15549, 15246, 14904, 14411, 13990, 13885, 14010, 14101, 14082, 14059, 14069, 14054, 14096, 14444, 15276, 16468, 17630, 18372, 18557, 18359, 18048, 17792, 17681, 17814, 18212, 18689, 19000, 19062, 18920, 18564, 18031, 17552, 17344, 17262, 16953, 16342, 15667, 15091, 14638, 14502, 14978, 15954, 16860, 17308, 17424, 17395, 17114, 16552, 16068, 15955, 15967, 15720, 15364, 15427, 16050, 16746, 16940, 16443, 15438, 14296, 13402, 12924, 12704, 12523, 12433, 12629, 13044, 13290, 13082, 12521, 11918, 11475, 11226, 11150, 11241, 11467, 11706, 11805, 11692, 11441, 11151, 10838, 10548, 10507, 10956, 11798, 12574, 12901, 12791, 12510, 12278, 12144, 12004, 11630, 10837, 9749, 8776, 8238, 8119, 8230, 8417, 8515, 8310, 7806, 7372, 7477, 8278, 9504, 10650, 11222, 10993, 10187]
54103A0187q44m69o5J18Ql94q86r47k57P48J213Q41J40k91l89m00m44m76m26k55
54083F712j3J35J31K18O09J037J023N85K69L94O54O14K51j97n42o90o10m35l60
54064I785l39j83L7ml21m91k52J16K17M1j88l83n31n40l95k58j93k5L36O48O75
54043G752N39M37K88k1k47l8N02Q57P51M25K53K72K36o3n38q86q67n50j87R6L74
54022I385O49P31N00Q5l40p35j049j053o04Q0N74P32P37P97R06R20P42M32J86
54003A3675K07M73P18P00M47J89J05K38N28Q42J034J089J140J247J246R60N33
53986B5371L47N93J038J280J200J024R98J076J055R09Q34R27J034J020J048J345
53970D1099J806K093K121K186K525K926K990K595K076J844J975K149J999J544
$$ y = [10187, 9343, 8874, 8809, 8927, 8935, 8541, 7655, 6708, 6451, 7199, 8412, 9253, 9393, 9102, 8713, 8313, 7869, 7393, 6967, 6712, 6699, 6834, 6965, 7183, 7792, 8829, 9852, 10437, 10706, 11100, 11754, 12368, 12619, 12422, 11880, 11190, 10580, 10145, 9785, 9446, 9263, 9300, 9296, 8975, 8484, 8232, 8348, 8565, 8606, 8418, 8035, 7504, 6964, 6569, 6311, 6118, 6093, 6429, 7077, 7752, 8291, 8728, 9016, 8995, 8748, 8710, 9212, 10069, 10820, 11245, 11498, 11770, 12006, 11943, 11405, 10519, 9652, 9102, 8915, 9011, 9385, 10034, 10765, 11265, 11350, 11010, 10275, 9226, 8173, 7569, 7649, 8223, 8955, 9692, 10489, 11395, 12315, 13057, 13489, 13675, 13882, 14355, 15073, 15773, 16220, 16409, 16514, 16752, 17280, 18122, 19156, 20245, 21385, 22632, 23878, 24838, 25371, 25718, 26311, 27349, 28629, 29829, 30853, 31851, 32927, 33982, 34891, 35725, 36652, 37686, 38706, 39754, 41099, 42905, 44998, 47119, 49305, 51830, 54756, 57746, 60341, 62417, 64261, 66236, 68385, 70384, 71928]
53956G1928J196J297J690J888J586R23L00pOJ11P7j47m66q07j187j551j782j899
53938G3156k084k359k460k169j609j049o64n54p52j020r66o32n61r74j324j104
53922E2875o82p17j077j082o48l73m98n90l73j08J7J96M80N54L86M41R09J304
53904E1014J202Q68P32P01M88J87K2j23m65q23q61n98k77M6M18O76O29M13L19
53885E4568M15O16R37J356J643J653J622J823K120K201K131K239K602K989L271
53870H2186L561L952M355M576M363L575K448J599J405J553J484J159R91J150J329
53855A19686J215R44R13J357K131K812L043K870K662K640K659K513K238J938J592
53840A51213J217R74Q67N76p3p46j069j179j433j768j841j693j707j959k106k057
$$ y = [71928, 73124, 74421, 76111, 77999, 79585, 80508, 80808, 80801, 80807, 80918, 80995, 80848, 80382, 79575, 78388, 76837, 75055, 73156, 71072, 68713, 66253, 64084, 62475, 61426, 60762, 60208, 59456, 58436, 57470, 56838, 56277, 55303, 53979, 52875, 52193, 51476, 50399, 49317, 48669, 48296, 47798, 47208, 46835, 46727, 46744, 46940, 47420, 47974, 48360, 48801, 49710, 51014, 52216, 53084, 53816, 54517, 55005, 55192, 55214, 55091, 54626, 53803, 52942, 52344, 52067, 52113, 52531, 53207, 53836, 54249, 54568, 54983, 55599, 56536, 57892, 59535, 61188, 62810, 64633, 66753, 68954, 71085, 73324, 75926, 78915, 82186, 85747, 89699, 94054, 98630, 102993, 106568, 109016, 110615, 112020, 113573, 115057, 116216, 117207, 118357, 119686, 120901, 121845, 122758, 124115, 126246, 129058, 132101, 134971, 137633, 140273, 142932, 145445, 147683, 149621, 151213, 152430, 153404, 154271, 154847, 154774, 154028, 152959, 151780, 150347, 148579, 146738, 145045, 143338, 141379, 139273, 137216]
53824A37216k189k723l272l375l146l127l570m188m539m472m160l826l514l157
53810H7958k763k451k301k249k229k240k253k169k004j936k077k253k217j972
53796E6844j743j663j675j653j532j344j187j151j179j163j110j121j152r84n92
53781C7595k70k97n94q82r72q36n36k64k49m53n53l30O4L63M82M34K43N7J20L93
53761C3515N21L48J48J52J69J4r8P2L15K77M4l5J29L77O74J042J285J216R93R31
53741D2089J053J208J392J618J679J503J489J950K471K432J982J855K221K449
53727F7391K151J745J698J831J709J319R55P36N77M54L69K13j47o43j006r90n91
53710G7771j49j31o57j317j686j836k127k546k662k236j583j198j273j637j909
$$ y = [137216, 135027, 132304, 129032, 125657, 122511, 119384, 115814, 111626, 107087, 102615, 98455, 94629, 91115, 87958, 85195, 82744, 80443, 78194, 75965, 73725, 71472, 69303, 67299, 65363, 63286, 61033, 58816, 56844, 55101, 53438, 51763, 50110, 48578, 47234, 46047, 44896, 43717, 42554, 41444, 40323, 39171, 38187, 37595, 37325, 37028, 36434, 35552, 34580, 33744, 33208, 32944, 32695, 32242, 31689, 31359, 31423, 31786, 32268, 32702, 32945, 33002, 33122, 33515, 34036, 34384, 34532, 34684, 34853, 34867, 34769, 34841, 35156, 35433, 35477, 35442, 35571, 35948, 36622, 37664, 38949, 40165, 41158, 42089, 43142, 44350, 45742, 47360, 49039, 50542, 52031, 53981, 56452, 58884, 60866, 62721, 64942, 67391, 69542, 71287, 72985, 74816, 76525, 77844, 78799, 79535, 80112, 80566, 80935, 81148, 81001, 80358, 79352, 78362, 77771, 77622, 77491, 76834, 75517, 73831, 71995, 69868, 67322, 64660, 62424, 60841, 59643, 58370, 56733, 54824]
53695E4824j793j377j121j300j600j526j082o94n67n33n31o96r60r72o18k43k04
53678C9007m67p54q79q04o29n32n49m75j81N8q7m55n87l92j81q9M0K17K71K81
53658C2813N71J095J372J199R48R55J037Q71M66P1r5J41P73J426J589J273R71
53641D7476R59J021J036J232J649J896J783J665J800J870J598J363J627K096K074
53626G1145J483Q99O74N71K91j36n41q32r20p47m59l51n21p54p84o00m28m83p50
53607F6757j010j102j091j065r05m67M0K28O4j13j20j19k04k17j15q9j48kL89
53588F0711O24M71K62K98L60K17K19P61J497J676J189O58N74Q75J330J850K279
53571G5851K354K017J486R04K53l87p80q33p59p75q39p93o06m07l32l98m64l77
$$ y = [54824, 53031, 51654, 50533, 49233, 47633, 46107, 45025, 44331, 43764, 43231, 42700, 42004, 41044, 40072, 39454, 39211, 39007, 38540, 37786, 36907, 36103, 35474, 34942, 34393, 33918, 33737, 33795, 33708, 33253, 32666, 32274, 32093, 32004, 32044, 32261, 32532, 32813, 33384, 34479, 35851, 37050, 37998, 38953, 39990, 40861, 41327, 41398, 41303, 41444, 42217, 43643, 45232, 46505, 47476, 48435, 49456, 50492, 51724, 53373, 55269, 57052, 58717, 60517, 62387, 63985, 65348, 66975, 69071, 71145, 72628, 73527, 74201, 74772, 75063, 74927, 74386, 73554, 72634, 71887, 71428, 71077, 70556, 69802, 69018, 68418, 67990, 67507, 66757, 65747, 64645, 63554, 62489, 61584, 61117, 61157, 61385, 61449, 61336, 61216, 61097, 60893, 60676, 60561, 60472, 60324, 60322, 60711, 61335, 61806, 62068, 62366, 62726, 62943, 63162, 63923, 65420, 67096, 68285, 68943, 69517, 70392, 71722, 73572, 75851, 78205, 80222, 81708, 82612, 82865, 82478, 81698, 80865, 80106, 79331, 78492, 77699, 77093, 76686, 76354, 75956, 75492, 75115]
53553G5115j57J2N2O2J05J05R1K65O31Q34O53M50P43J410J794J524R70P46J030
53534H6435J446J493J044N02L95P99J272J483J564J736J821J523R68N83M98M88
53518A04050M05L09K21J00O1K54N00M43J24J5L14O08M38p2m43m70l47k36k8M06
53498A06652R01J069P42K65K32Q40J618J942J669J153P23M51L81O68J321K044
53482A22671K488K557K366K046J731J646J969K610L207L451L369L250L307L483
53468A60151L619L727L959M334M686M901N077N356N694N971O170O379O603O789
53454B33416O911P020P196P515P968Q367Q458Q234Q010Q077Q359Q556Q514Q349
53440C44950Q233Q226Q271Q294Q319Q470Q773R055R076Q850Q618Q548Q579Q589
$$ y = [75115, 74958, 74970, 75022, 75084, 75189, 75294, 75385, 75650, 76281, 77115, 77768, 78218, 78961, 80371, 82165, 83689, 84659, 85405, 86435, 87881, 89374, 90418, 90920, 91315, 92114, 93386, 94869, 96433, 98169, 99990, 101513, 102481, 103064, 103562, 104050, 104455, 104764, 104985, 105085, 105146, 105400, 105900, 106343, 106467, 106482, 106796, 107404, 107842, 107770, 107327, 106857, 106510, 106274, 106246, 106652, 107553, 108622, 109364, 109629, 109861, 110701, 112319, 114261, 115930, 117083, 117806, 118257, 118638, 119306, 120627, 122671, 125159, 127716, 130082, 132128, 133859, 135505, 137474, 140084, 143291, 146742, 150111, 153361, 156668, 160151, 163770, 167497, 171456, 175790, 180476, 185377, 190454, 195810, 201504, 207475, 213645, 220024, 226627, 233416, 240327, 247347, 254543, 262058, 270026, 278393, 286851, 295085, 303095, 311172, 319531, 328087, 336601, 344950, 353183, 361409, 369680, 377974, 386293, 394763, 403536, 412591, 421667, 430517, 439135, 447683, 456262, 464851]
53426D64851Q512Q240P750P261P035O934O594O077N929O331O722O552O025N642
53412E60455N422N092M724M603M610M373L924L654L585L321K728K125J684J183
53398F11483N33N8n2j19n39j268k057k869l748m517m938n071n161n268n272n157
53382E66038n062n045n014m960n050n378n742n819n564n289n260n362n264m901
53368D92328m558m438m435m400m346m240l833l034k248j938k010j970j647j355
53354D47876j319j359j285j206j246j226q63j61O29J340K014K714L375L890M261
53339D57434M676N309O092O755P215P676Q300Q924R371R815J0527J1368J1930
53326E65392J2174J2517J3224J4053J4631J4933J5141J5332J5497J5716J6052
$$ y = [464851, 473363, 481603, 489353, 496614, 503649, 510583, 517177, 523254, 529183, 535514, 542236, 548788, 554813, 560455, 565877, 570969, 575693, 580296, 584906, 589279, 593203, 596857, 600442, 603763, 606491, 608616, 610300, 611483, 612016, 612074, 612022, 611903, 611364, 610096, 608039, 605170, 601422, 596905, 591967, 586896, 581735, 576467, 571195, 566038, 560976, 555931, 550917, 545957, 540907, 535529, 529787, 523968, 518404, 513115, 507855, 502493, 497229, 492328, 487770, 483332, 478897, 474497, 470151, 465911, 462078, 459044, 456796, 454858, 452848, 450878, 449231, 447876, 446557, 445198, 443913, 442707, 441461, 440235, 439372, 439211, 439840, 441180, 443194, 445908, 449283, 453173, 457434, 462110, 467419, 473511, 480266, 487481, 495157, 503457, 512381, 521752, 531567, 542094, 553462, 565392, 577566, 590083, 603307, 617360, 631991, 646924, 662065, 677397, 692894, 708610, 724662]
53315G24662J6392J6519J6388J6128J5821J5371J4636J3679J2804J2267J1963
53304H86630J1500J0645R549Q447P359O226N081L909K483O28j465l410n032o312
53290I36238p192p762q431r541j0832j1758j2249j2657j3069j3213j3092j3129
53278H03313j3439j3564j3162j2516j2046j1725j1372j1137j1278j1681j2002
53267F69391j2136j2216j2256j2096j1673j1076j0460r989r752r575r117q302
53255E40743p493p044o859o628o287o009n867n781n708n622n403m980m517m232
53241D58313m104l947l664l250k626j750q08q3M06R07J578K288K787L036L290
53226D52373L865M760N554N848N809O025O746P608Q220Q655R073R230Q869Q384
$$ y = [724662, 741054, 757573, 773961, 790089, 805910, 821281, 835917, 849596, 862400, 874667, 886630, 898130, 908775, 918324, 926771, 934130, 940356, 945437, 949346, 951829, 952457, 950992, 947582, 942550, 936238, 929046, 921284, 912853, 903312, 892480, 880722, 868473, 855816, 842747, 829534, 816442, 803313, 789874, 776310, 763148, 750632, 738586, 726861, 715489, 704352, 693074, 681393, 669391, 657255, 645039, 632783, 620687, 609014, 597938, 587478, 577489, 567737, 558162, 549045, 540743, 533250, 526206, 519347, 512719, 506432, 500423, 494556, 488775, 483067, 477445, 472042, 467062, 462545, 458313, 454209, 450262, 446598, 443348, 440722, 438972, 438164, 438081, 438487, 439394, 440972, 443260, 446047, 449083, 452373, 456238, 460998, 466552, 472400, 478209, 484234, 490980, 498588, 506808, 515463, 524536, 533766, 542635, 551019]
53212E51019Q461R122R614R427Q862Q429Q098P532O737O075N721N503N237M889
53198F54726M409L706K894K272J895J393M74o18j390j795k213k831l369l627l872
53183F52054m447n227n794n983n945n820n651n561n629n672n470n170n128n370
53169E75187n611n778o096o553o752o481o038n771n652n550n539n626n530n132
53155D93078m803m920n240n276n078n156n677o237o460o458o535o763p023p226
53141D10226p370p464p493p403p159o846o663o688o745o614o283n872n415m924
53127C17287m556m463m535m513m311m049l833l681l655l770l848l723l512l456
53113B61382l495l334k944k637k581k552k303j950j830k110k729l474m039m165
$$ y = [551019, 559480, 568602, 578216, 587643, 596505, 604934, 613032, 620564, 627301, 633376, 639097, 644600, 649837, 654726, 659135, 662841, 665735, 668007, 669902, 671295, 671769, 671151, 669761, 667966, 665753, 662922, 659553, 655926, 652054, 647607, 642380, 636586, 630603, 624658, 618838, 613187, 607626, 601997, 596325, 590855, 585685, 580557, 575187, 569576, 563798, 557702, 551149, 544397, 537916, 531878, 526107, 520455, 514905, 509366, 503740, 498210, 493078, 488275, 483355, 478115, 472839, 467761, 462605, 456928, 450691, 444231, 437773, 431238, 424475, 417452, 410226, 402856, 395392, 387899, 380496, 373337, 366491, 359828, 353140, 346395, 339781, 333498, 327626, 322211, 317287, 312731, 308268, 303733, 299220, 294909, 290860, 287027, 283346, 279691, 275921, 272073, 268350, 264838, 261382, 257887, 254553, 251609, 248972, 246391, 243839, 241536, 239586, 237756, 235646, 232917, 229443, 225404, 221239]
53099B21239l903l613l571l725l904m081m214m122l754l441l524l829l851l462
53085A68245l105l138l332l254k873k520k337k121j725j277r56p40n17k86r2N3
53069A40025J22M4p0J04P29J502J979K151K338K562K401J626O45J8k40n97j328
53052A54011k163k674k768k760l016l570m075m139l732l235l042l190l424l482
53038A08741l278k855k376k055k049k306k609k743k650k425k200j972j598j041
53024G6584n70n64j049j599j767j549j257j101j035r64r16r48r95r34p50o18o69
53007E9299q11q37p30o75p30o85m48l11n57r77j150j058j025j062q31l07M3n3
52989D7095k81l22l50o40r87j028q14o53n59l35n1N3PK6L3k23o22p01l47j7q4
$$ y = [221239, 217336, 213723, 210152, 206427, 202523, 198442, 194228, 190106, 186352, 182911, 179387, 175558, 171707, 168245, 165140, 162002, 158670, 155416, 152543, 150023, 147686, 145565, 143840, 142563, 141607, 140867, 140350, 140064, 139972, 140025, 140147, 140191, 140121, 140225, 140954, 142456, 144435, 146586, 148924, 151486, 153887, 155513, 156158, 156176, 155936, 155339, 154011, 151848, 149174, 146406, 143646, 140630, 137060, 132985, 128846, 125114, 121879, 118837, 115647, 112223, 108741, 105463, 102608, 100232, 98177, 96128, 93822, 91213, 88470, 85820, 83395, 81195, 79223, 77625, 76584, 76014, 75450, 74401, 72802, 71035, 69486, 68229, 67128, 66093, 65129, 64213, 63265, 62270, 61336, 60586, 59968, 59299, 58488, 57651, 56921, 56246, 55516, 54831, 54383, 54072, 53515, 52538, 51388, 50330, 49305, 48243, 47412, 47105, 47148, 47095, 46814, 46492, 46142, 45502, 44515, 43487, 42673, 42020, 41461, 41126, 41075, 41128, 41135, 41161, 41194, 40971, 40349, 39648, 39301, 39284, 39200]
52968C9200l78n40n09m28l58k92k67k01J06O56J048Q85L12j61k53j42q3o8P1L57
52948C8955O54Q02P21M00n8l62k39K44O72O95M58M21P97J354J725J797J692J545
52930E2273J426J361J359J403J496J617J699J733J844K131K448K561K498K527
52916G8376K782L143L497L813L915L530K742J990J474Q67p3j010j458j470j496
52901A00622j748k077k314k376k193j842j644j796k008j892j497j126q17m56k70
52886G6566o03j234j479j074m97k47k76l20l19l10j88Q8L20L47K78L24M80O14
52868G2470O71P04P62Q75R91R40O01J43o7J05M04M97L26P4n2k2Pj41l62l39k9
52847G8558J67mj36L24J183J701J583J270J095Q25K39l24m16m8M42Q44J069J066
$$ y = [39200, 38822, 38282, 37773, 37345, 36987, 36695, 36428, 36227, 36333, 36989, 38037, 38922, 39234, 39073, 38820, 38678, 38595, 38527, 38598, 38955, 39609, 40411, 41132, 41532, 41474, 41112, 40873, 41117, 41789, 42484, 42942, 43363, 44160, 45514, 47239, 49036, 50728, 52273, 53699, 55060, 56419, 57822, 59318, 60935, 62634, 64367, 66211, 68342, 70790, 73351, 75849, 78376, 81158, 84301, 87798, 91611, 95526, 99056, 101798, 103788, 105262, 106129, 106056, 105046, 103588, 102118, 100622, 98874, 96797, 94483, 92107, 89914, 88072, 86428, 84632, 82624, 80732, 79235, 78109, 77292, 76836, 76566, 75963, 74729, 73250, 72176, 71679, 71432, 71156, 70836, 70517, 70207, 70019, 70107, 70427, 70774, 71052, 71376, 71856, 72470, 73141, 73845, 74607, 75482, 76473, 77413, 78014, 78157, 78090, 78195, 78599, 79096, 79422, 79496, 79444, 79422, 79429, 79288, 78926, 78587, 78558, 78725, 78721, 78585, 78909, 80092, 81793, 83376, 84646, 85741, 86566, 86805, 86481, 86065, 86017, 86459, 87303, 88372, 89438]
52829H9438R46R50J022P68J22k83J05R49J389J122N99L01K98M64P35J030J202
52812A01157J217J172J107R88Q76R20J154J469J783K066K213K101J776J479J422
52797A22900J627J972K320K605K859L112L209K897K200J566J390J514J400Q04
52783A52375K0n79r56j270j537j613j486j375j495j795k008j948j724j594j665
52768A31350j818j877j796j636j513j543j810k254k655k741k394j798j363j408
52754A04744j818k105j921j408r08n52l08k74n53r18r92q16q09j130j438j430
52738H7364j256j188j189j092r24q22q33r77j285j568j445q57l08k48m98n90m56
52721G1828l84m41m34l49l70m70m12j95j32l58o43p69p64o82m95l51n74j148j516
$$ y = [89438, 90384, 91334, 92356, 93124, 93246, 92963, 93068, 94017, 95406, 96528, 97127, 97428, 97726, 98190, 98925, 99955, 101157, 102374, 103546, 104653, 105641, 106517, 107437, 108591, 110060, 111843, 113909, 116122, 118223, 119999, 121478, 122900, 124527, 126499, 128819, 131424, 134283, 137395, 140604, 143501, 145701, 147267, 148657, 150171, 151571, 152375, 152395, 151816, 150860, 149590, 148053, 146440, 144954, 143579, 142084, 140289, 138281, 136333, 134609, 133015, 131350, 129532, 127655, 125859, 124223, 122710, 121167, 119357, 117103, 114448, 111707, 109313, 107515, 106152, 104744, 102926, 100821, 98900, 97492, 96584, 96032, 95724, 95450, 94897, 93979, 92987, 92171, 91362, 90232, 88794, 87364, 86108, 84920, 83731, 82639, 81715, 80893, 80060, 79083, 77798, 76230, 74785, 73928, 73620, 73372, 72874, 72284, 71828, 71444, 71003, 70569, 70220, 69850, 69380, 68968, 68773, 68641, 68283, 67640, 66871, 66107, 65425, 64930, 64579, 64005, 62857, 61341]
52702F1341j243o28l83p08j115j128q14n61n57o75p41p26o93o78o43m91j71J61
52684D9547J84k58q89j201j003o49n99q86j171j178r07m72K9M26N12K49j39l81
52666D1214l79j88O8K35K44J86K54N05Q50J212J566J790J741J506J378J495J689
52649E5366J773J786J854J998K149K235K108J699J216R88R35N82k51j103j520
52634G1815j701k085k553k551j949j300j168j591k219k717k858k602k186j944
52620D2391j919j820j467j018p10n67m99m86n45o39p57r35j107j061p17l34k75
52603B7535n93r75j122j046r18q12o57m13j81q9j64l12m32m54l68k11p7j9j7k
52583A8673P6K59N40P41O12J60j93p3L30M76J67k71n08n62n52m33j88RM4O6J96
$$ y = [61341, 60098, 59470, 59087, 58379, 57264, 56136, 55322, 54761, 54204, 53529, 52788, 52062, 51369, 50691, 50048, 49557, 49386, 49547, 49731, 49473, 48584, 47383, 46380, 45731, 45132, 44246, 43075, 41897, 40990, 40518, 40547, 40973, 41485, 41734, 41595, 41214, 40835, 40647, 40715, 40950, 41194, 41380, 41634, 42139, 42989, 44201, 45767, 47557, 49298, 50804, 52182, 53677, 55366, 57139, 58925, 60779, 62777, 64926, 67161, 69269, 70968, 72184, 73172, 74107, 74689, 74438, 73335, 71815, 70114, 68029, 65476, 62925, 60976, 59676, 58508, 56917, 54698, 51981, 49123, 46521, 44335, 42391, 40472, 38652, 37185, 36167, 35457, 34890, 34391, 33905, 33360, 32721, 31964, 31029, 29922, 28861, 28144, 27810, 27535, 26942, 25967, 24845, 23799, 22881, 22069, 21412, 20999, 20818, 20729, 20565, 20253, 19821, 19367, 18999, 18788, 18711, 18692, 18675, 18673, 18749, 19008, 19548, 20289, 20901, 21061, 20868, 20795, 21125, 21601, 21768, 21497, 20989, 20427, 19875, 19442, 19254, 19263, 19307, 19373, 19569]
52562A9569K59L7l17m48k22J71M85N85M50J89qr2j67k25q8K27L41K4l61l05J19
52541B0223L44J05k63l36o2L47P05Q91Q40O20L96K55J34Om9J1R4O4q3j99r8K37
52519B4182N73O39M31K00J17J01P0R9K27L39L91N22P95J008R64P22M00L3k28r3
52499C1492M11P67O34L20K49K91J11r4R5M98N34J54r7MR6j1K0L63O33M80J32j0
52477C7072P8K36N00R03J199J156Q89O58M84K96K30M65R06J233J234R41N34K59
52459D9273K53L79L93L22M33P40Q36M71j9j28J57M17L55N0k72m44l68p0K27K80
52439E3285O4j72j92j2J23L1j59j30K17N83O46M19J03k38n69o53l38N7Q5j73k36
52418E2741j1R5q5k01m6N8j71m98o13n76n31l37M6K68Q9j41L4M53O38N69N84P17
$$ y = [19569, 19828, 19865, 19548, 19100, 18878, 19049, 19534, 20119, 20569, 20758, 20750, 20658, 20491, 20266, 20178, 20405, 20746, 20770, 20409, 20104, 20223, 20567, 20672, 20409, 20073, 20011, 20358, 21063, 21954, 22794, 23414, 23810, 24065, 24199, 24205, 24156, 24167, 24261, 24325, 24242, 24043, 23945, 24182, 24755, 25394, 25825, 26025, 26142, 26243, 26313, 26412, 26639, 26978, 27369, 27891, 28686, 29694, 30658, 31380, 31780, 31813, 31585, 31492, 31903, 32670, 33304, 33624, 33873, 34164, 34275, 34181, 34276, 34774, 35308, 35462, 35365, 35369, 35465, 35454, 35474, 35837, 36470, 36950, 37082, 37072, 37150, 37386, 37886, 38789, 39988, 41144, 42033, 42691, 43175, 43471, 43701, 44166, 45072, 46305, 47539, 48480, 49014, 49273, 49526, 49905, 50298, 50620, 51053, 51793, 52629, 53100, 53081, 52953, 53110, 53527, 53882, 53932, 53660, 53216, 52848, 52778, 53005, 53285, 53349, 53177, 52985, 52973, 53096, 53127, 52968, 52838, 53055, 53638, 54284, 54703, 54806, 54568, 53999, 53346, 53008, 53065, 53150, 52977, 52741, 52730, 52825, 52740, 52539, 52493, 52551, 52380, 51882, 51269, 50693, 50162, 49825, 49871, 50139, 50228, 50087, 50121, 50574, 51212, 51781, 52365, 53082]
52396E3082O58L57J49K02K67J47k2lK34N66Q32R20Q75R24J161J294R39J55n71
52377F2166q82q12n70k75k6R4J26J88K92L28K79K46K91L40L02J75K8n1oP5J1j97
52355F2122k98j09K16L97L99L97M67N70O91Q16Q19O37M90O36R77J134R67P27O74
52336G2729P65P93P02N99N50M36P2n06r44r06n84n23r52j450j531j256j029r86
52318F5979r56q29o39l78n8Q5j46n66q22q92j013j205j215r34n47j89J87N54P56
52299E7172P26N65L61J96K43N70R00R01P11P33R99J151J100J141J390J542J454
52282G1855J375J437J357J017Q19J109J550J597J297J108J179J215J069R40J040
52267H9964J341J742K164K454K416K048J567J214J131J338J706K000K122K248
$$ y = [53082, 53740, 54097, 54246, 54448, 54715, 54862, 54840, 54837, 55071, 55637, 56469, 57389, 58264, 59188, 60349, 61643, 62582, 62737, 62166, 61284, 60472, 59902, 59627, 59601, 59695, 59821, 60009, 60301, 60629, 60908, 61154, 61445, 61785, 62087, 62262, 62290, 62239, 62233, 62308, 62319, 62122, 61824, 61715, 61931, 62328, 62727, 63124, 63591, 64161, 64852, 65668, 66487, 67124, 67614, 68250, 69227, 70361, 71328, 72055, 72729, 73494, 74287, 74989, 75588, 76138, 76574, 76646, 76140, 75196, 74290, 73706, 73183, 72231, 70781, 69250, 67994, 66965, 65979, 65023, 64194, 63555, 63177, 63119, 63204, 63058, 62492, 61670, 60778, 59765, 58560, 57345, 56411, 55864, 55675, 55862, 56416, 57172, 57898, 58463, 58824, 59020, 59263, 59833, 60733, 61634, 62345, 63078, 64077, 65228, 66328, 67469, 68859, 70401, 71855, 73230, 74667, 76024, 77041, 77860, 78969, 80519, 82116, 83413, 84521, 85700, 86915, 87984, 88924, 89964, 91305, 93047, 95211, 97665, 100081, 102129, 103696, 104910, 106041, 107379, 109085, 111085, 113207, 115455]
52253A15455K550K908L072L040L064L274L578L851M070M257M449M776N295N797
52239A69436N975N808N625N664N837N989O211O668P225P503P330O962O791O943
52225B59967P246P481P550P403P033O560O239O205O325O386O314O163N959N734
52211C52565N587N493N186M491L685L199K976K563J880J463J702K228K417K220
52197C97655K065K163K317K352K292K140J825J487J461J832K247K358K207K145
52183D26546K459L176M071M752M941M787M780N184N722N982N974O070O395O596
52169D97435O324N707N151M774M376L942L811M136M435M080L191K537K498K573
52155E54970K186J560J328J541J616J232O86L03l2m85q95j064j169j457j827k003
$$ y = [115455, 118005, 120913, 123985, 127025, 130089, 133363, 136941, 140792, 144862, 149119, 153568, 158344, 163639, 169436, 175411, 181219, 186844, 192508, 198345, 204334, 210545, 217213, 224438, 231941, 239271, 246233, 253024, 259967, 267213, 274694, 282244, 289647, 296680, 303240, 309479, 315684, 322009, 328395, 334709, 340872, 346831, 352565, 358152, 363645, 368831, 373322, 377007, 380206, 383182, 385745, 387625, 389088, 390790, 393018, 395435, 397655, 399720, 401883, 404200, 406552, 408844, 410984, 412809, 414296, 415757, 417589, 419836, 422194, 424401, 426546, 429005, 432181, 436252, 441004, 445945, 450732, 455512, 460696, 466418, 472400, 478374, 484444, 490839, 497435, 503759, 509466, 514617, 519391, 523767, 527709, 531520, 535656, 540091, 544171, 547362, 549899, 552397, 554970, 557156, 558716, 560044, 561585, 563201, 564433, 565119, 565422, 565390, 564905, 564010, 562946, 561777, 560320, 558493, 556490]
52139E56490k019k089k128j810j163o55n94p59p98o89n79m43j70J60L69M77O04
52122E44204O69M58O1q0K74P92R07M71j29m42l89k31k61n26q34r69r26r29j109
52103E41011j291j236j059j152j628k051j966j512j286j551j944j994j713j423
52089E19205j255j076q65q17j033j314j414j313j169j135j330j791k353k667k520
52074D97153k054j600j352j310j399j470j321r19n50n13p58j020j211j417j564
52059D78695j421j034q04j021j555k089k445k528k237j652j077p03l28L02J051
52044D61154J555J710J790K079K594L188L697M059M392M955N826O713P238P404
52030E18354P579P995Q528Q972R353R814J0304J0541J0280R601Q869Q421Q237
$$ y = [556490, 554471, 552382, 550254, 548444, 547281, 546626, 546032, 545273, 544475, 543786, 543207, 542764, 542594, 542754, 543123, 543600, 544204, 544873, 545331, 545392, 545312, 545586, 546378, 547285, 547756, 547627, 547185, 546796, 546565, 546304, 545778, 544944, 543975, 543049, 542120, 541011, 539720, 538484, 537425, 536273, 534645, 532594, 530628, 529116, 527830, 526279, 524335, 522341, 520628, 519205, 517950, 516874, 516009, 515192, 514159, 512845, 511431, 510118, 508949, 507814, 506484, 504693, 502340, 499673, 497153, 495099, 493499, 492147, 490837, 489438, 487968, 486647, 485728, 485178, 484665, 483907, 482887, 481676, 480259, 478695, 477274, 476240, 475436, 474415, 472860, 470771, 468326, 465798, 463561, 461909, 460832, 460129, 459801, 460103, 461154, 462709, 464419, 466209, 468288, 470882, 474070, 477767, 481826, 486218, 491173, 496999, 503712, 510950, 518354, 525933, 533928, 542456, 551428, 560781, 570595, 580899, 591440, 601720, 611321, 620190, 628611, 636848]
52017F36848Q036P606P005O355N694N035M456L939L332K583J927J565J329Q80
52003F96590J90m52q76j193j509j716j667j433j246j283j495j605j416j090r72
51988F78827j072r59m49Mp6l81k08M81R76Q65N42M79N15L03l8p2K69O63Q43P54
51968F82266M11o6l44k06M1j82r82j830k217k241k382k852l379l630l610l627
51952F55170l876m256m580m869n267n784o241o560o892p396p956q269q166p829
51938E67229p673p996q682r337r736j0017j0348j0618j0640j0565j0743j1216
51926D49658j1642j1769j1696j1620j1589j1569j1487j1186j0569r881r557r655
51914C17438r762r543r105q687q287p799p231o611n914n257m877m726m444l918
$$ y = [636848, 644884, 652490, 659495, 665850, 671544, 676579, 681035, 684974, 688306, 690889, 692816, 694381, 695710, 696590, 696780, 696328, 695452, 694259, 692750, 691034, 689367, 687934, 686688, 685405, 683910, 682305, 680889, 679799, 678827, 677755, 676796, 676347, 676351, 676275, 675894, 675686, 676167, 677143, 678008, 678550, 679029, 679544, 679847, 679809, 679737, 680006, 680669, 681512, 682266, 682677, 682611, 682267, 682061, 682102, 681920, 680938, 679108, 676891, 674650, 672268, 669416, 666037, 662407, 658797, 655170, 651294, 647038, 642458, 637589, 632322, 626538, 620297, 613737, 606845, 599449, 591493, 583224, 575058, 567229, 559556, 551560, 542878, 533541, 523805, 513788, 503440, 492822, 482182, 471617, 460874, 449658, 438016, 426247, 414551, 402931, 391342, 379773, 368286, 357100, 346531, 336650, 327093, 317438, 307676, 298133, 289028, 280341, 272054, 264255, 257024, 250413, 244499, 239242, 234365, 229639, 225195, 221277]
51900B21277l546l647l945l986l770l597l522l400l260l214l167l020k993l306
51886A72904l664l557l008k552k453k451k307k113j968j765j497j352j357j251
51872A41609r26o64p36j031j276j374j339j118o86j93K01M59N54L80k4l60l41
51855A33135j4L52N85P00P60P29N36J95n6J01O84J232J235P75M12M62N88L24k79
51836A42456p45p99o77q01j303j893k149j962j595j358j249j095q93p80p51o62
51820A23744n43o15r12j150j097q28n60m31m79o23n76o5P09J158R98O04M27L88
51802A20149J31l44p03p46n53k35P2J47o7k29M3O04R44R14Q58R98J091R22P46
51783A24742Q80J168J187R09P27Q69J095J128J038J084J286J425J407J346J350
$$ y = [221277, 217731, 214084, 210139, 206153, 202383, 198786, 195264, 191864, 188604, 185390, 182223, 179203, 176210, 172904, 169240, 165683, 162675, 160123, 157670, 155219, 152912, 150799, 148831, 147066, 145569, 144217, 142860, 141609, 140683, 140019, 139283, 138252, 136976, 135602, 134263, 133145, 132459, 132266, 132467, 132926, 133480, 133860, 133836, 133476, 133135, 133121, 133473, 134058, 134758, 135518, 136247, 136783, 136978, 136922, 137023, 137707, 138939, 140174, 140949, 141361, 141823, 142411, 142735, 142456, 141711, 140912, 140235, 139434, 138131, 136238, 134089, 132127, 130532, 129174, 127925, 126830, 125937, 125157, 124406, 123744, 123201, 122586, 121674, 120524, 119427, 118599, 118039, 117608, 117129, 116506, 115930, 115865, 116574, 117732, 118730, 119334, 119761, 120149, 120280, 119936, 119233, 118487, 117934, 117699, 117771, 117918, 117851, 117622, 117665, 118269, 119213, 120127, 120985, 121983, 123074, 123996, 124742, 125622, 126790, 127977, 128886, 129613, 130482, 131577, 132705, 133743, 134827, 136113, 137538, 138945, 140291, 141641]
51768A41641J374J366J387J509J677J836K022K224K224J785R87J77l65o00n68
51753A58676l22l5L9j56m03n24n80o64o56m15l0K33K58J05j24k90k04K18P72J119
51733A57017J124R62Q85J019J344J722J921J810J541J422J578J829J946J882J695
51718A79697J367Q71K99j77m96p43r80j132j107r61q36p97p99q23q71q57o42k85
51700A70728q8k09l80k79j7l2m19p95q50p01o04n56m71m61o54q59p44l41l5o3
51680A62170k39k63j11Lo7k51l52k57l8J55K53L14L65L42K14O6l1j00j45q4J04
51659A62048L02M30N41O50O51N61O50J085J604J832J816J940K384K953L428L746
51643A86621L875L793L614L440L060K094N76r72k146l054l970m837n391n509n263
$$ y = [141641, 143015, 144381, 145768, 147277, 148954, 150790, 152812, 155036, 157260, 159045, 160032, 160209, 159844, 159244, 158676, 158354, 158319, 158358, 158202, 157799, 157275, 156695, 156031, 155375, 154960, 154930, 155163, 155421, 155526, 155402, 155112, 154908, 155126, 155898, 157017, 158141, 159103, 159988, 161007, 162351, 164073, 165994, 167804, 169345, 170767, 172345, 174174, 176120, 178002, 179697, 181064, 181935, 182234, 182057, 181561, 180818, 179838, 178706, 177599, 176638, 175802, 175005, 174206, 173383, 172512, 171655, 171013, 170728, 170640, 170431, 170051, 169772, 169755, 169723, 169304, 168509, 167659, 166958, 166354, 165798, 165327, 164866, 164212, 163353, 162609, 162268, 162233, 162170, 161931, 161668, 161557, 161560, 161493, 161242, 160890, 160633, 160595, 160750, 161003, 161317, 161682, 162024, 162238, 162304, 162273, 162173, 162028, 161944, 162048, 162350, 162780, 163321, 163971, 164622, 165183, 165833, 166918, 168522, 170354, 172170, 174110, 176494, 179447, 182875, 186621, 190496, 194289, 197903, 201343, 204403, 206497, 207073, 206101, 203955, 200901, 196931, 192094, 186703, 181194, 175931]
51628A75931m766m182l701l386l098k802k693k879l052k787k063j289q28p45q94
51613A36766j083j116r08o21n30p34j095j410j522j323q03j55K66K42j04m21m52
51596A24997k28K8K02M50R76J664K100J994J506J079J035J417K018K501K621K463
51580A46823K399K656L022L123K876K485K118J751J326Q32K52m36j190j937k648
51565A63452l277l689l804l718l573l344l009k745k763k956l005k781k424k036
51551A20328j643j419j539j767j579r01l40l86p46q30n70l69l99m67n07o95j023
51534A05148j165r21n08k24q8KL1J6J53N34Q31O31J6m23k67L20Q67J107J089R70
51514A08119Q70Q82J027J249J503J846K323K803L088L113K975K776K598K597K901
$$ y = [175931, 171165, 166983, 163282, 159896, 156798, 153996, 151303, 148424, 145372, 142585, 140522, 139233, 138405, 137660, 136766, 135683, 134567, 133659, 133038, 132508, 131774, 130679, 129269, 127747, 126424, 125621, 125466, 125732, 125974, 125870, 125449, 124997, 124769, 124797, 124999, 125449, 126425, 128089, 130189, 132183, 133689, 134768, 135803, 137220, 139238, 141739, 144360, 146823, 149222, 151878, 154900, 158023, 160899, 163384, 165502, 167253, 168579, 169411, 169663, 169227, 168037, 166100, 163452, 160175, 156486, 152682, 148964, 145391, 142047, 139038, 136293, 133530, 130574, 127569, 124788, 122364, 120328, 118685, 117266, 115727, 113960, 112381, 111480, 111140, 110754, 110008, 109178, 108608, 108239, 107840, 107373, 106866, 106171, 105148, 103983, 103062, 102554, 102330, 102242, 102244, 102275, 102291, 102444, 102978, 103809, 104440, 104456, 104033, 103766, 104086, 104953, 106060, 107149, 108119, 108989, 109871, 110898, 112147, 113650, 115496, 117819, 120622, 123710, 126823, 129798, 132574, 135172, 137769, 140670]
51499A40670L355L618L616L670L997M280M043L303K559K089J632Q37j88j024j451
51484A75006j633j872k292k760l038k987k658k169j599j055p15o13m68jO37J047
51468A52830J199J524K231K926L172L085L098L360L709M058M416M643M559M223
51454A99033L829L374K773K127J577R37l8j110j744j855j893k095k189k046k038
51439A98642k430k875k896k575k251j884j254n62k50k78j18M69J099J366J328
51424A85531J256J235J241J333J512J535J177N49l9m55q34j306j811k207k417
51409A86300k454k405k421k648l055l369l242k601j781j220j026r62q62q27r35
51394A56492r54o31j09K03J90J84M73R10J149J121J057J175J448J704J856J967
$$ y = [140670, 144025, 147643, 151259, 154929, 158926, 163206, 167249, 170552, 173111, 175200, 176832, 177669, 177481, 176457, 175006, 173373, 171501, 169209, 166449, 163411, 160424, 157766, 155597, 153998, 152943, 152228, 151615, 151147, 151146, 151783, 152830, 154029, 155553, 157784, 160710, 163882, 166967, 170065, 173425, 177134, 181192, 185608, 190251, 194810, 199033, 202862, 206236, 209009, 211136, 212713, 213650, 213612, 212502, 210758, 208903, 207010, 204915, 202726, 200680, 198642, 196212, 193337, 190441, 187866, 185615, 183731, 182477, 181915, 181665, 181387, 181269, 181738, 182837, 184203, 185531, 186787, 188022, 189263, 190596, 192108, 193643, 194820, 195369, 195330, 194875, 194041, 192735, 190924, 188717, 186300, 183846, 181441, 179020, 176372, 173317, 169948, 166706, 164105, 162324, 161104, 160078, 159116, 158254, 157427, 156492, 155538, 154907, 154798, 155001, 155191, 155375, 155848, 156758, 157907, 159028, 160085, 161260, 162708, 164412, 166268, 168235]
51378A68235K139K355K502K538K582K696K739K524K104J701J371R50L25m23j205
51363A93133k013k753l183l172k877k522k184j866j692j766j961k006j702r91
51349A62445K8R96J420J176Q27J129K147L192L645L538L253K938K436J640O46
51334A91456l88j324k068k684l403m311n071n227m794m298m160m313m471m560
51320A40384m599m417l812k954k309k130k218k254k112j811j390r70o98n49l20
51305A07841R3N58R82J436J880K042J854J752K163K864L244L116K813K536K096
51290A37270J394O70O1o93j795k965l778m210m508m752m828m746m626m444m078
51275I3972l562l046k578k162j878j809j805j672j478j429j471j382j161j005
$$ y = [168235, 170374, 172729, 175231, 177769, 180351, 183047, 185786, 188310, 190414, 192115, 193486, 194436, 194761, 194338, 193133, 191120, 188367, 185184, 182012, 179135, 176613, 174429, 172563, 170871, 169105, 167144, 165138, 163436, 162445, 162473, 163469, 164889, 166065, 166892, 168021, 170168, 173360, 177005, 180543, 183796, 186734, 189170, 190810, 191456, 191068, 189744, 187676, 184992, 181589, 177278, 172207, 166980, 162186, 157888, 153728, 149415, 144944, 140384, 135785, 131368, 127556, 124602, 122293, 120163, 117945, 115691, 113579, 111768, 110378, 109408, 108710, 108161, 107841, 107934, 108492, 109474, 110910, 112790, 114832, 116686, 118438, 120601, 123465, 126709, 129825, 132638, 135174, 137270, 138664, 139334, 139395, 138702, 136907, 133942, 130164, 125954, 121446, 116694, 111866, 107120, 102494, 98050, 93972, 90410, 87364, 84786, 82624, 80746, 78937, 77132, 75460, 73982, 72553, 71082, 69700, 68539, 67534]
51261F7534r06o44k42k2j10k23j89k30n02o91m38N4K59O0j66j45j1M2O1K00M35
51240F4126O23O78O51O69Q57J204J523J659J699J823J993J990J796J713J949K300
51224H7253K441K382K483K932L505L851L903L854L825L691L316K779K266J787
51210A30268J165L65m05r99j607k494l542m317m544m384m163m054m066m120m061
51195H9042l758l320l052l059l062k745k168j640j327j177j144j223j302j236
51181E8829j033q68p85o96n72n03m85l71j30M5qj69k08q1Q6K11L26M25M23K52
51161E4688j3j78l8M67J158J716J908J756J447J123Q25N65L96L69M03L02m8n13
51143F6333q17q76q58q69p32l22J27K19j19o00r68j120r50m56n6k85j024j432
$$ y = [67534, 66628, 65984, 65742, 65720, 65610, 65387, 65198, 64968, 64466, 63775, 63337, 63391, 63650, 63710, 63544, 63399, 63388, 63430, 63491, 63691, 64126, 64749, 65427, 66078, 66747, 67604, 68808, 70331, 71990, 73689, 75512, 77505, 79495, 81291, 83004, 84953, 87253, 89694, 92076, 94559, 97491, 100996, 104847, 108750, 112604, 116429, 120120, 123436, 126215, 128481, 130268, 131433, 131798, 131393, 130394, 128787, 126293, 122751, 118434, 113890, 109506, 105343, 101289, 97223, 93103, 89042, 85284, 81964, 78912, 75853, 72791, 70046, 67878, 66238, 64911, 63734, 62590, 61367, 60065, 58829, 57796, 56928, 56143, 55447, 54875, 54372, 53887, 53516, 53386, 53431, 53423, 53254, 53046, 52965, 53051, 53262, 53588, 54013, 54436, 54688, 54675, 54497, 54459, 54926, 56084, 57800, 59708, 61464, 62911, 64034, 64859, 65424, 65820, 66189, 66592, 66894, 66846, 66333, 65516, 64640, 63782, 62913, 62181, 61859, 61986, 62205, 62086, 61486, 60518, 59398, 58448, 57992, 57936, 57651, 56627, 55195]
51125E5195r62j17K18j46o59q76q12n74j26M14P02N26J06j82j89n3%j41l34l17
51105E1673q5k9m79j136j355r39l69j61l02m81n72o27o15m10l2L12M37L47K18
51086D5395J88K05Q2j68j80L19J016J224P27J06O1O24J193J268R05N45N30Q45
51068E4885J163J153P47J06n32r37r57o95n43p61j118j209j012q45p56m82j0K68
51050D8465J59l2n9j12l19l36J34P10Q50O61O95J027J188R83P75Q15Q53O58M76
51031E7591O72J152J513J579J489J441J508J694J906J941J633J025L53j50l87
51016G4960m10l69m11n81p92r21r33q48o74l91k7K58L00J36J0N1R6n5k87l94m98
50995F8220r04j464j557r35j68P9j43l26l10l16m09m15l01j83RL96P23N75P4j85
$$ y = [55195, 54233, 54116, 54334, 54188, 53529, 52653, 51841, 51267, 51141, 51555, 52257, 52783, 52889, 52707, 52518, 52465, 52465, 52324, 51990, 51673, 51588, 51559, 51080, 49944, 48589, 47650, 47281, 47120, 46818, 46337, 45765, 45138, 44523, 44113, 44081, 44393, 44830, 45177, 45395, 45583, 45788, 45870, 45702, 45522, 45841, 46857, 48081, 48808, 48914, 48975, 49599, 50792, 52060, 52965, 53510, 54040, 54885, 56048, 57201, 57948, 58054, 57522, 56585, 55628, 54933, 54390, 53629, 52511, 51302, 50290, 49445, 48689, 48207, 48197, 48465, 48624, 48592, 48533, 48421, 48102, 47766, 47900, 48610, 49460, 50121, 50816, 51843, 53031, 54014, 54789, 55604, 56457, 57115, 57591, 58263, 59415, 60928, 62507, 63996, 65437, 66945, 68639, 70545, 72486, 74119, 75144, 75497, 75347, 74960, 74550, 74181, 73770, 73189, 72397, 71476, 70543, 69695, 69021, 68630, 68603, 68861, 69161, 69297, 69307, 69358, 69454, 69399, 69112, 68718, 68220, 67316, 65852, 64295, 63360, 63192, 63271, 63128, 62802, 62492, 62176, 61767, 61352, 61051, 60868, 60877, 61273, 61996, 62571, 62645, 62460]
50975F2460L3L19L39L22N71R07J026R96J049J146J093R34Q43P99P18P58J129J638
50957G7080J822J541J143R96J140J406J657J795J730J518J418J664K183K600K546
50942A02239K008J362R88R17Q96P92P68R98J429J915K405K869L208L363L406L389
50926A32952L242L000K997L524M409N178N579N745N888O086O424P039P899Q779
50912B08741R559J0347J1209J2032J2778J3716J5051J6518J7648J8467J9534K1153
50900C86753K2818K3816K4138K4452K5139K5830K5966K5514K4796K3940K2828
50889F55990K1511K0215J8949J7439J5603J3722J2092J0709R528Q706Q357Q248
50877H21069Q055P780P613P483P044O104M805L302J543n77k994n608q463j1640
$$ y = [62460, 62493, 62812, 63151, 63473, 64044, 64951, 65977, 66973, 68022, 69168, 70261, 71195, 72038, 72837, 73555, 74313, 75442, 77080, 78902, 80443, 81586, 82582, 83722, 85128, 86785, 88580, 90310, 91828, 93246, 94910, 97093, 99693, 102239, 104247, 105609, 106597, 107514, 108410, 109202, 109970, 110968, 112397, 114312, 116717, 119586, 122794, 126157, 129563, 132952, 136194, 139194, 142191, 145715, 150124, 155302, 160881, 166626, 172514, 178600, 185024, 192063, 199962, 208741, 218300, 228647, 239856, 251888, 264666, 278382, 293433, 309951, 327599, 346066, 365600, 386753, 409571, 433387, 457525, 481977, 507116, 532946, 558912, 584426, 609222, 633162, 655990, 677501, 697716, 716665, 734104, 749707, 763429, 775521, 786230, 795758, 804464, 812821, 821069, 829124, 836904, 844517, 852000, 859044, 865148, 869953, 873255, 874798, 874221, 871227, 865619, 857156, 845516]
50863H45516j4989j8172k0959k3418k5694k7721k9254l0172l0616l0704l0292
50852E63525k9183k7531k5833k4393k3041k1426j9497j7580j6033j4930j4009
50841C30069j2861j1305r603q215p284o491n538m594m045l938l860l384k449j340
50827B45162m40%N5R2M45J065J595J769J636J455J485J903K746L848M904N647
50811B73367N974N954N790N753O032O623P424Q384R462J0545J1516J2384J3276
50798C82484J4265J5375J6693J8316K0156K1991K3775K5746K8133L0881L3719
50787F31534L6456L9106M1760M4478M7231M9881N2215N4066N5363N6106N6274
50776A164470N5842N4776N2944N0125M6206M1465L6522L1938K7867K4139K0688
$$ y = [845516, 830527, 812355, 791396, 767978, 742284, 714563, 685309, 655137, 624521, 593817, 563525, 534342, 506811, 480978, 456585, 433544, 412118, 392621, 375041, 359008, 344078, 330069, 317208, 305903, 296300, 288085, 280801, 274310, 268772, 264178, 260133, 256195, 252335, 248951, 246502, 245162, 244722, 244722, 244777, 244869, 245314, 246379, 247974, 249743, 251379, 252834, 254319, 256222, 258968, 262816, 267720, 273367, 279341, 285295, 291085, 296838, 302870, 309493, 316917, 325301, 334763, 345308, 356824, 369208, 382484, 396749, 412124, 428817, 447133, 467289, 489280, 513055, 538801, 566934, 597815, 631534, 667990, 707096, 748856, 793334, 840565, 890446, 942661, 996727, 1052090, 1108196, 1164470, 1220312, 1275088, 1328032, 1378157, 1424363, 1465828, 1502350, 1534288, 1562155, 1586294, 1606982]
50765A606982J7698J5390J3771J2754J2425J2940J4112J5380J6262J6700J6755
50754A771169J6072J3892R647L426m165j2450k0934k9325l7413m5009n1945n8115
50742A554850o3422o7717p0742p2312p2458p1348o9129o5961o2115n7964n3784
50731H27898m9694m5773m2055l8424l4717l0993k7584k4758k2412k0219j8031
50720D73238j5984j4217j2678j1234r885q768p968p403o867o227n500m817m305
50707C57385l976l763l593l406l135k707k119j450p91j96K73N35O48Q50J295J827
50691C37677K208K598L429M724N857O333O483P009P997Q907R493J0172J1307J2610
50677D36804J3613J4370J5308J6609J8122J9696K1284K2839K4384K6100K8065
$$ y = [1606982, 1624680, 1640070, 1653841, 1666595, 1679020, 1691960, 1706072, 1721452, 1737714, 1754414, 1771169, 1787241, 1801133, 1810780, 1814206, 1810041, 1797591, 1776657, 1747332, 1709919, 1664910, 1612965, 1554850, 1491428, 1423711, 1352969, 1280657, 1208199, 1136851, 1067722, 1001761, 939646, 881682, 827898, 778204, 732431, 690376, 651952, 617235, 586242, 558658, 533900, 511488, 491269, 473238, 457254, 443037, 430359, 419125, 409240, 400472, 392504, 385101, 378234, 372007, 366507, 361690, 357385, 353409, 349646, 346053, 342647, 339512, 336805, 334686, 333236, 332445, 332249, 332522, 333057, 333705, 334555, 335850, 337677, 339885, 342483, 345912, 350636, 356493, 362826, 369309, 376318, 384315, 393222, 402715, 412887, 424194, 436804, 450417, 464787, 480095, 496704, 514826, 534522, 555806, 578645, 603029, 629129, 657194]
50666F57194K9944L1278L1994L2402L2706L2825L2651L2070L0807K8592K5571
50655I98034K2263J8948J5447J1667Q001M954K587O83p00j201o73N13J818K992
50641A085333M106N162N855N779M831L242J149j761n918j1243j7059k2658k7754
50628A029064l2361l6453l9876m2398m3697m3553m2176m0234l8312l6461l4372
50617E99171l1896k9166k6381k3705k1338j9414j7769j6020j3998j1932j0183
50606C77369q901p973p182o310n207l883k551j453o52kO83J462K257L003L755
50591C44415M629N601O482P149P737Q500R480J0452J1244J1932J2698J3641J4787
50578D68747J6186J7791J9358K0625K1589K2373K2895K2902K2385K1686K0989
$$ y = [657194, 687138, 718416, 750410, 782812, 815518, 848343, 880994, 913064, 943871, 972463, 998034, 1020297, 1039245, 1054692, 1066359, 1074360, 1079314, 1081901, 1082584, 1081884, 1080683, 1080010, 1080523, 1082341, 1085333, 1089439, 1094601, 1100456, 1106235, 1111066, 1114308, 1115457, 1113696, 1107778, 1096535, 1079476, 1056818, 1029064, 996703, 960250, 920374, 877976, 834279, 790726, 748550, 708316, 670004, 633543, 599171, 567275, 538109, 511728, 488023, 466685, 447271, 429502, 413482, 399484, 387552, 377369, 368468, 360495, 353313, 347003, 341796, 337913, 335362, 333909, 333257, 333255, 333938, 335400, 337657, 340660, 344415, 349044, 354645, 361127, 368276, 376013, 384513, 393993, 404445, 415689, 427621, 440319, 453960, 468747, 484933, 502724, 522082, 542707, 564296, 586669, 609564, 632466, 654851, 676537, 697526]
50567F97526J9999J8385J6356J4433J2742J0925Q824O813N289M120K909J618N90
50554H20529L4j58q3L94J355K521L428L913M263M795N402N598N070L996K798J594
50538H65449J40j817m291p178j0319j3424j6145j8380k0306k2009k3289k3995
50526G04436k4326k4558k4661k4426k3817k2934k1785k0394j9026j7941j6952
50515D63616j5583j3733j1875j0480r477q419p014n352l720k315j145j35P31J418
50501C76517K029K754L604M357M951N632O539P331P611P519P558P953Q540R162
50487D62057R755J0064R822R214Q771Q705Q783Q833Q932Q987Q718Q216Q043Q485
50473E87385R214R873J0601J1633J2864J4171J5771J7845K0129K2323K4551K7003
$$ y = [697526, 717525, 735910, 752266, 766699, 779441, 790366, 799190, 806003, 811292, 815412, 818321, 819939, 820529, 820563, 820405, 820322, 820716, 822071, 824592, 828020, 831933, 836196, 840991, 846393, 851991, 857061, 861057, 863855, 865449, 865589, 863772, 859481, 852303, 841984, 828560, 812415, 794035, 773729, 751720, 728431, 704436, 680110, 655552, 630891, 606465, 582648, 559714, 537929, 517535, 498509, 480568, 463616, 448033, 434300, 422425, 411945, 402468, 394049, 387035, 381683, 377963, 375648, 374503, 374368, 375099, 376517, 378546, 381300, 384904, 389261, 394212, 399844, 406383, 413714, 421325, 428844, 436402, 444355, 452895, 462057, 471812, 481876, 491698, 500912, 509683, 518388, 527171, 536004, 544936, 553923, 562641, 570857, 578900, 587385, 596599, 606472, 617073, 628706, 641570, 655741, 671512, 689357, 709486, 731809, 756360, 783363]
50461G83363K9412L1438L3217L5096L6869L7950L8119L7672L6829L5459L3406
50450A168830L0686K7340K3417J9089J4466R413L859j761o833j1209j5160j8727
50438A243410k1607k3632k4843k5071k3996k1735j8885j5837j2515q983n718k992
50426A037596m60K184M504N728N635M536K599l42m259q677j3087j7394k1743k6039
50412I70781k9768l2343l3646l4140l4387l4481l4088l2998l1405k9628k7746
50401F16151k5674k3393k0999j8637j6469j4579j2819j0969r059p352n903m403
50389D45895k645q51O39J807K843L807M672N567O628P700Q459Q800Q921R075R432
50374E20749J0104J0987J1655J1691J1217J0774J0630J0448R753Q523P161O001
$$ y = [783363, 812775, 844213, 877430, 912526, 949395, 987345, 1025464, 1063136, 1099965, 1135424, 1168830, 1199516, 1226856, 1250273, 1269362, 1283828, 1293241, 1297100, 1295339, 1288506, 1277297, 1262137, 1243410, 1221803, 1198171, 1173328, 1148257, 1124261, 1102526, 1083641, 1067804, 1055289, 1046306, 1040588, 1037596, 1037136, 1039320, 1043824, 1049552, 1055187, 1059723, 1062322, 1061980, 1057721, 1049044, 1035957, 1018563, 996820, 970781, 941013, 908670, 875024, 840884, 806497, 772016, 737928, 704930, 673525, 643897, 616151, 590477, 567084, 546085, 527448, 510979, 496400, 483581, 472612, 463553, 456201, 450298, 445895, 443250, 442399, 443038, 444845, 447688, 451495, 456167, 461734, 468362, 476062, 484521, 493321, 502242, 511317, 520749, 530853, 541840, 553495, 565186, 576403, 587177, 597807, 608255, 618008, 626531, 633692, 639693]
50362F39693N015L979K823J710P99J1q58j743k292k333k165k072j790q24P34K212
50346F42899L220M145N506P242Q920J0357J1599J2444J2532J1928J1177J0613
50334G52582R901Q522O459M133J757r14m135p725j1183j4141j6584j8662k0409
$$ y = [639693, 644708, 648687, 651510, 653220, 654019, 654030, 653172, 651429, 649137, 646804, 644639, 642567, 640777, 639953, 640687, 642899, 646119, 650264, 655770, 663012, 671932, 682289, 693888, 706332, 718864, 730792, 741969, 752582, 762483, 771005, 777464, 781597, 783354, 782440, 778305, 770580, 759397, 745256, 728672, 710010, 689601]
$$ [...]
##END NTUPLES=NMR SPECTRUM
##END=
