
##TITLE=AC1043_TOIB01_5906321_z91VEWADNX
##JCAMPDX= 6.0         $$ Bruker NMR JCAMP-DX V2.0
##DATA TYPE= NMR SPECTRUM
##DATA CLASS= NTUPLES
##ORIGIN= BRUKER
##OWNER= Administrator
$$ 1.72 TOPSPIN		Version 2.1
$$ 2012-04-10 10:11:03.484 -0500  Administrator@TOPSPIN
$$ Compression mode = diff/dup
##.OBSERVE FREQUENCY= 400.13188235
##.OBSERVE NUCLEUS= ^1H
##.ACQUISITION MODE= SIMULTANEOUS (DQD)
##.ACQUISITION SCHEME= undefined
##.AVERAGES= 64
##.DIGITISER RES= 22
##SPECTROMETER/DATA SYSTEM= spect
##.PULSE SEQUENCE= noesygpps1d.comp
##.SOLVENT NAME= COFFEE_meoh
##.SHIFT REFERENCE= INTERNAL, COFFEE_meoh, 1, 14.96842
##AUDIT TRAIL= $$ (NUMBER, WHEN, WHO, WHERE, PROCESS, VERSION, WHAT)
$$ ##TITLE= Audit trail, TOPSPIN		Version 2.1
$$ ##JCAMPDX= 5.01
$$ ##ORIGIN= Bruker BioSpin GmbH
$$ ##OWNER= Administrator
$$ $$ C:\Bruker\TOPSPIN/data/COFFEE/nmr/AC1043_TOIB01_5906321_z91VEWADNX/12/pdata/1/auditp.txt
$$ ##AUDIT TRAIL=  $$ (NUMBER, WHEN, WHO, WHERE, PROCESS, VERSION, WHAT)
(   1,<2012-04-04 12:05:26.734 -0500>,<Administrator>,<TOPSPIN>,<go>,<TOPSPIN 2.1>,
      <created by zg
	started at 2012-04-04 11:53:55.078 -0500,
	POWCHK enabled, PULCHK disabled,
       configuration hash MD5:
       1A 1E CE 29 27 FD 77 03 67 4E F0 E3 C4 B2 CB 90
       data hash MD5: 64K
       6B 3D E5 78 02 3D 70 C0 18 6F 77 D9 C2 E5 7B A3>)
(   2,<2012-04-04 12:05:29.765 -0500>,<Administrator>,<TOPSPIN>,<proc1d>,<TOPSPIN 2.1>,
      <Start of raw data processing
       efp LB = 0.3 FT_mod = 6 PKNL = 1 PHC0 = 0 PHC1 = 0 SI = 128K 
       data hash MD5: 128K
       99 F4 CF 5B 0C A0 D1 61 16 F6 55 EE E1 63 6B 51>)
(   3,<2012-04-04 12:05:30.953 -0500>,<Administrator>,<TOPSPIN>,<proc1d>,<TOPSPIN 2.1>,
      <pk PHC0 = 35.10681 PHC1 = 0 
       data hash MD5: 128K
       B2 BC A8 9A 13 B5 09 83 9A E9 2A AB D8 4E 62 6C>)
(   4,<2012-04-04 12:05:31.421 -0500>,<Administrator>,<TOPSPIN>,<proc1d>,<TOPSPIN 2.1>,
      <abs ABSG = 1 
       data hash MD5: 128K
       4C 9D 92 EC 75 7A 8F 04 FA A8 18 F7 02 E0 50 23>)
(   5,<2012-04-04 12:05:31.500 -0500>,<Administrator>,<TOPSPIN>,<proc1d>,<TOPSPIN 2.1>,
      <abs ABSG = 2 
       data hash MD5: 128K
       F3 40 F8 25 31 3A D4 4D 42 EB 27 40 A2 5E 43 61>)
(   6,<2012-04-04 12:05:31.546 -0500>,<Administrator>,<TOPSPIN>,<proc1d>,<TOPSPIN 2.1>,
      <abs ABSG = 3 
       data hash MD5: 128K
       1F 5A BB 87 80 A8 88 40 38 16 84 7D E6 13 C3 CA>)
(   7,<2012-04-04 12:05:31.609 -0500>,<Administrator>,<TOPSPIN>,<proc1d>,<TOPSPIN 2.1>,
      <abs ABSG = 4 
       data hash MD5: 128K
       34 BA AD B2 7D DC 00 23 21 AC D0 98 6F 02 F2 2C>)
(   8,<2012-04-04 12:05:31.671 -0500>,<Administrator>,<TOPSPIN>,<proc1d>,<TOPSPIN 2.1>,
      <abs ABSG = 5 
       data hash MD5: 128K
       3F 4E CB A3 A9 ED 67 E8 70 1A 61 62 F2 87 09 F9>)
(   9,<2012-04-04 12:05:31.890 -0500>,<Administrator>,<TOPSPIN>,<audit>,<TOPSPIN 2.1>,
      <user comment:
       ICON-NMR User ID: COFFEE
       data hash MD5: 128K
$$ [...]
##$TP07= 0
##$TPNAME0= <>
##$TPNAME1= <>
##$TPNAME2= <>
##$TPNAME3= <>
##$TPNAME4= <>
##$TPNAME5= <>
##$TPNAME6= <>
##$TPNAME7= <>
##$TPOAL= (0..7)
0.5 0.5 0.5 0.5 0.5 0.5 0.5 0.5
##$TPOFFS= (0..7)
0 0 0 0 0 0 0 0
##$TUNHIN= 0
##$TUNHOUT= 0
##$TUNXOUT= 0
##$USERA1= <user>
##$USERA2= <user>
##$USERA3= <user>
##$USERA4= <user>
##$USERA5= <user>
##$V9= 5
##$VALIST= <valist>
##$VCLIST= <CCCCCCCCCCCCCCC>
##$VD= 0
##$VDLIST= <DDDDDDDDDDDDDDD>
##$VPLIST= <PPPPPPPPPPPPPPP>
##$VTLIST= <TTTTTTTTTTTTTTT>
##$WBST= 2048
##$WBSW= 25
##$XGAIN= (0..3)
0 0 0 0
##$XL= 0
##$YL= 0
##$YMAX_a= 13994422
##$YMIN_a= -6405398
##$ZGOPTNS= <>
##$ZL1= 120
##$ZL2= 120
##$ZL3= 120
##$ZL4= 120
##$ABSF1= 14.96842
##$ABSF2= -5.58411
##$ABSG= 5
##$ABSL= 3
##$ALPHA= 0
##$AQORDER= 0
##$ASSFAC= 0
##$ASSFACI= 0
##$ASSFACX= 0
##$ASSWID= 0
##$AUNMP= <proc_prof1d_extract.lims>
##$AXLEFT= 0
##$AXNAME= <>
##$AXNUC= <1H>
##$AXRIGHT= 0
##$AXTYPE= 0
##$AXUNIT= <>
##$AZFE= 0.1
##$AZFW= 0.1
##$BCFW= 0
##$BC_mod= 0
##$BYTORDP= 0
##$COROFFS= 0
##$CY= 15
##$DATMOD= 1
##$DC= 0
##$DFILT= <>
##$DTYPP= 0
##$F1P= 0
##$F2P= 0
##$FCOR= 0.5
##$FTSIZE= 131072
##$FT_mod= 6
##$GAMMA= 0
##$GB= 0
##$INTBC= 1
##$INTSCL= 1
##$ISEN= 128
##$LB= 0.3
##$LEV0= 0
##$LPBIN= 0
##$MAXI= 10000
##$MC2= 0
##$MEAN= 0
##$ME_mod= 0
##$MI= 0
##$NCOEF= 0
##$NC_proc= -3
##$NLEV= 6
##$NOISF1= 0
##$NOISF2= 0
##$NSP= 0
##$NTH_PI= 0
##$NZP= 0
##$OFFSET= 14.96842
##$PC= 1
##$PHC0= 35.10681
##$PHC1= 0
##$PH_mod= 1
##$PKNL= yes
##$PPARMOD= 0
##$PPDIAG= 0
##$PPIPTYP= 0
##$PPMPNUM= 2147483647
##$PPRESOL= 1
##$PSCAL= 4
##$PSIGN= 0
##$PYNMP= <proc.py>
##$REVERSE= no
##$SF= 400.13000487878
##$SI= 131072
##$SIGF1= 0
##$SIGF2= 0
##$SINO= 400
##$SIOLD= 131072
##$SPECTYP= <>
##$SREGLST= <1H.CDCl3>
##$SSB= 0
##$STSI= 131072
##$STSR= 0
##$SW_p= 8223.68421052632
##$SYMM= 0
##$S_DEV= 0
##$TDeff= 65536
##$TDoff= 0
##$TI= <>
##$TILT= no
##$TM1= 0
##$TM2= 0
##$TOPLEV= 0
##$USERP1= <user>
##$USERP2= <user>
##$USERP3= <user>
##$USERP4= <user>
##$USERP5= <user>
##$WDW= 1
##$XDIM= 131072
##$YMAX_p= 502688828
##$YMIN_p= -444716980
##$CURPLOT= <Network HP LaserJet P1505>
##$CURPRIN= <$Network HP LaserJet P1505>
##$DFORMAT= <normdp>
##$LAYOUT= <+/1D_H.xwp>
##$LFORMAT= <normlp>
##$PFORMAT= <normpl>
##$SURQMSG= 1
$$ End of Bruker specific parameters
$$ ---------------------------------
##NTUPLES= NMR SPECTRUM
##VAR_NAME=  FREQUENCY,     SPECTRUM/REAL,   SPECTRUM/IMAG
##SYMBOL=    X,             R,               I
##VAR_TYPE=  INDEPENDENT,   DEPENDENT,       DEPENDENT
##VAR_FORM=  AFFN,          ASDF,            ASDF
##VAR_DIM=   131072,        131072,          131072
##UNITS=     HZ,            ARBITRARY UNITS, ARBITRARY UNITS
##FACTOR=    0.0627417313425165, 1,          1
##FIRST=     8223.62146879498, -969,         -91741
##LAST=      0,             1696,            -92043
##MIN=       0,             -444716980,      0
##MAX=       8223.62146879498, 502688828,    0
$$ Real data points
##PAGE= N=1
##DATA TABLE= (X++(R..R)), XYDATA
$$ [...]
62885A367381j5464j4452j3560j3110j2709j2228j2282j3213j4429j5157j5156
62874A215621j4507j3509j2908j3232j3747j3212j1797j1008j1383j1647j0765
62863A077906r335q188p060n728n113n889o935o733n551m770m486l437j304N34
62849A003911R21M02J90M28K83o86j913k521k243j436m31P66K047K868K752J992
62833A007330J303P41l59k244m099n013n076n012n010m596l593k600k207k180
62819I67385j940j694k364m057n281m571k513j115j200j609j301p89q18r37o49
62804I36547q41k517m763n576m435k677j543j200j495k232k737k482k055k345
62790H99649k889k429r18M88J357K232K943K541J274P98J785K848K696J938J924
$$ y = [1367381, 1351917, 1337465, 1323905, 1310795, 1298086, 1285858, 1273576, 1260363, 1245934, 1230777, 1215621, 1201114, 1187605, 1174697, 1161465, 1147718, 1134506, 1122709, 1111701, 1100318, 1088671, 1077906, 1068571, 1060383, 1053323, 1047595, 1042482, 1036593, 1029658, 1022925, 1017374, 1012604, 1008118, 1004681, 1003377, 1003911, 1004832, 1005234, 1005424, 1005852, 1006135, 1005449, 1003536, 1001015, 998772, 997336, 996905, 997671, 999718, 1002586, 1005338, 1007330, 1008633, 1009374, 1009015, 1006771, 1002672, 997659, 992583, 987571, 982561, 977965, 974372, 971772, 969565, 967385, 965445, 963751, 961387, 957330, 952049, 947478, 944965, 943850, 942650, 941041, 939740, 938951, 938133, 937196, 936547, 935706, 933189, 928426, 922850, 918415, 915738, 914195, 912995, 911500, 909268, 906531, 904049, 901994, 899649, 896760, 894331, 893413, 893901, 895258, 897490, 900433, 902974, 904248, 905046, 906831, 909679, 912375, 914313, 916237]
62775I16237K929M257N146N087M146L342L652M520M612M097M485O032P158P008
62761I82708O626O776O588N299L666K538J782J615L044N745P427O843N795O520
62747A052972Q734J0895J2562J3642J3139J0921R414J0896J4178J6302J6674J7173
62735A207502J8870K1113K3418K6008K8635L0895L3509L7281M1297M4148M6449
62724A559125M9996N4796N9263O3151O7876P3857P9946Q5727R2069R8991J05150
62713B389947J09941J14089J17740J19970J20639J20497J18812J13131J02333
62704C427099Q8112P2384N5163L6043J5932m047k3909m3731o2520p9276r4092
62693C387158j07011j16988j23179j26310j27710j27773j26275j23230j18596
$$ y = [916237, 919166, 923423, 928569, 933656, 937802, 941144, 944796, 949316, 953928, 958025, 962510, 968542, 975700, 982708, 989334, 996110, 1002698, 1007997, 1011663, 1014201, 1015983, 1017598, 1020642, 1026387, 1033814, 1040657, 1046452, 1052972, 1061706, 1072601, 1085163, 1098805, 1111944, 1122865, 1132279, 1143175, 1157353, 1173655, 1190329, 1207502, 1226372, 1247485, 1270903, 1296911, 1325546, 1356441, 1389950, 1427231, 1468528, 1512676, 1559125, 1609121, 1663917, 1723180, 1786331, 1854207, 1928064, 2008010, 2093737, 2185806, 2284797, 2389947, 2499888, 2613977, 2731717, 2851687, 2972326, 3092823, 3211635, 3324766, 3427099, 3515211, 3587595, 3642758, 3678801, 3694733, 3690686, 3666777, 3623046, 3560526, 3481250, 3387158, 3280147, 3163159, 3039980, 2913670, 2785960, 2658187, 2531912, 2408682, 2290086]
62684B290086j12181j04701r7841r2364q7227q1539p6040p1386o6339n9404n1448
62673A389616m4798m0233l6576l3072l0325k8622k6905k4181k0946j8437j6955
62662A068566j5603j3513j0876q489o548m330j432J234K391K234K345L620N301
62649A024900O553P964J0700J4745J8818K1868K4036K6233K9091L2310L5102L7501
62637A289821M0842M6145N2301N7048N9774O2092O5227O8223O9523O9018O7537
62626A947551O5210O1541N6363M9645M0786K9315J6082K832r238j9966k9579l8413
62614B172129m6951n5393o3130o9230p3270p5408p5878p4875p2719o9727o6179
62603A429369o2600n9603n7053n4036n0060m5799m2071l8726l5169l1494k8350
$$ y = [2290086, 2177905, 2073204, 1975363, 1882999, 1795772, 1714233, 1638193, 1566807, 1500468, 1441064, 1389616, 1344818, 1304585, 1268009, 1234937, 1204612, 1175990, 1149085, 1124904, 1103958, 1085521, 1068566, 1052963, 1039450, 1028574, 1020085, 1013537, 1009207, 1007775, 1009009, 1011400, 1013634, 1015979, 1019599, 1024900, 1031453, 1039417, 1050117, 1064862, 1083680, 1105548, 1129584, 1155817, 1184908, 1217218, 1252320, 1289821, 1330663, 1376808, 1429109, 1486157, 1545931, 1608023, 1673250, 1741473, 1810996, 1880014, 1947551, 2012761, 2074302, 2130665, 2180310, 2221096, 2250411, 2266493, 2269325, 2260087, 2240121, 2210542, 2172129, 2125178, 2069785, 2006655, 1937425, 1864155, 1788747, 1712869, 1637994, 1565275, 1495548, 1429369, 1366769, 1307166, 1250113, 1196077, 1146017, 1100218, 1058147, 1019421, 984252, 952758, 924408]
62592I24408k5934k3802k1616j9580j8214j7789j7769j6920j4553j1687j0160
62581G26384j0442j1239j1380j0941j0089q302n686l764l665m379m099k647j394
62568F38357j298k185l493m483m173k346l08M93L26O08J707K718L247M063N704
62553F38937P532Q641Q962R143R858J1324J3154J4634J5565J6611J8472K1072
62541G93905K3883K6569K8839L0376L1527L3299L6029L8868M1434M4761M9375
62530A178865N3596N5585N6320N8484O2631O6350O7181O4582N9067N1375M2741
62519A816777L4166K4977J3853J582r049j6865k3791l1839m0310m7292n2315n5932
62507A613962n7875n7399n5028n2527n1166n0778n0261m8411m4762m0235l6429
$$ y = [924408, 898474, 874672, 853056, 833476, 815262, 797473, 779704, 762784, 748231, 736544, 726384, 715942, 704703, 693323, 682382, 672293, 663991, 658305, 654541, 650876, 646497, 642398, 639751, 638357, 637059, 634874, 631381, 626898, 622725, 620379, 620071, 620564, 620890, 621498, 623205, 625923, 629170, 633233, 638937, 646469, 655110, 664072, 673215, 683073, 694397, 707551, 722185, 737750, 754361, 772833, 793905, 817788, 844357, 873196, 903572, 935099, 968398, 1004427, 1043295, 1084729, 1129490, 1178865, 1232461, 1288046, 1344366, 1402850, 1465481, 1531831, 1599012, 1663594, 1722661, 1774036, 1816777, 1850943, 1875920, 1889773, 1891355, 1882306, 1865441, 1841650, 1809811, 1769501, 1722209, 1669894, 1613962, 1556087, 1498688, 1443660, 1391133, 1339967, 1289189, 1238928, 1190517, 1145755, 1105520, 1069091]
62496A069091l3872l1570k8720k5878k3769k1995j9919j8040j7323j7653j8048
62485H12304j8056j8046j8255j8276j7372j4947j1251p873o604p089o715l862
62473F63958l26R21l39j525p50J357L404N035O470P647Q576R626J0830J1643J1927
62458G38454J2519J4278J7115K0395K3681K6507K8161K8495K8677L0280L3514
62447A002076L6911L8855L9079L8510L7950L7176L5335L1981K7510K2561J7269
62436A365213J1359M802k005q675j5025k0725k5197k8114k9797l0879l1737l2477
62424A156743l3152l3590l3121l1075k7694k4183k1477j9310j6866j4169j2203
62413H89903j1590j1660j1100r209o321l300j043j33m36r52m44J596M500O968
$$ y = [1069091, 1035219, 1003649, 974929, 949051, 925282, 903287, 883368, 865328, 848005, 830352, 812304, 794248, 776202, 757947, 739671, 722299, 707352, 696101, 688228, 681624, 674535, 667820, 663958, 663632, 664553, 664214, 662689, 661939, 663296, 666700, 671735, 678205, 685852, 694428, 704054, 714884, 726527, 738454, 750973, 765251, 782366, 802761, 826442, 852949, 881110, 909605, 938282, 968562, 1002076, 1038987, 1077842, 1116921, 1155431, 1193381, 1230557, 1265892, 1297873, 1325383, 1347944, 1365213, 1376572, 1381374, 1379369, 1370694, 1355669, 1334944, 1309747, 1281633, 1251836, 1220957, 1189220, 1156743, 1123591, 1090001, 1056880, 1025805, 998111, 973928, 952451, 933141, 916275, 902106, 889903, 878313, 866653, 855553, 846344, 840023, 836723, 835680, 835547, 835111, 834159, 833715, 835311, 839811, 846779]
62399H46779Q133Q355Q874J0365J2014J2554J2079J1891J2506J2993J2826J2989
62387I82358J4256J5521J5259J3655J1755R354N690J579j429l839p591j2430j5559
62374A028579j5827j5687j7506k0198k1446k1310k1425k1906k1454j9663j7213
62363H14944j4373j1317r201q814q656o559k922j26J024J899K994L027J740J157
62349G64817K708N100O458O904P598Q573R137R459J0156J0875J0691R510Q120
62336H70106P217P169Q051Q977Q199N113J628K57J135K095J467l98k252l299l233
62321I12232k058k85J380K833M528O599Q749J1052J4030J7596K0806K3206K5815
62308A046483L0026L5699M1153M5126M8310N2492N8348O4539O9184P1886P3772
$$ y = [846779, 854912, 863267, 872141, 882506, 894520, 907074, 919153, 931044, 943550, 956543, 969369, 982358, 996614, 1012135, 1027394, 1041049, 1052804, 1062158, 1067848, 1069427, 1067998, 1064159, 1056568, 1044138, 1028579, 1012752, 997065, 979559, 959361, 937915, 916605, 895180, 873274, 851820, 832157, 814944, 800571, 789254, 780053, 771239, 762583, 756024, 753102, 752976, 754000, 755899, 758893, 761920, 763660, 764817, 767525, 772625, 779083, 785987, 793585, 802158, 811295, 820754, 830910, 841785, 852476, 861986, 870106, 877323, 884492, 892543, 901520, 909719, 914832, 916460, 916717, 917852, 919947, 921414, 921016, 918764, 915465, 912232, 910174, 909889, 911269, 914102, 918630, 925229, 933978, 945030, 959060, 976656, 997462, 1020668, 1046483, 1076509, 1112208, 1153361, 1198487, 1246797, 1299289, 1357637, 1422176, 1491360, 1563246, 1637018]
62297A637018P5694P7257P7753P7148P5341P1249O3765N3466M2245L1141J9594
62286B301671P212m752j4633k2404k9576l7094m4158m9479n3118n6543o0836o5171
62274A871119o7368o5962o1576n6162n1178m6905m3238m0460l8779l7629l6168
62263A325694l4455l3443l3444l3129l0732k6201k1444j8167j6078j3737j0638
62252A054226p648n555m214l270k752k425j472L60J847J556k33j903k587k886
62238A023044l340l386k417r80j17l8k35m80q12p44M71K637M486N212N533O693
62222A035527Q749J0464J0876J0476J0642J2146J4427J6341J7470J8500K0171
62211A185789K2187K3666K4669K6538L0149L4458L7641L9539M1922M6099N1273
$$ y = [1637018, 1712712, 1789969, 1867722, 1944870, 2020211, 2091460, 2155225, 2208691, 2250936, 2282077, 2301671, 2308883, 2304131, 2289498, 2267094, 2237518, 2200424, 2156266, 2106787, 2053669, 1997126, 1936290, 1871119, 1803751, 1737789, 1676213, 1620051, 1568873, 1521968, 1478730, 1438270, 1399491, 1361862, 1325694, 1291239, 1257796, 1224352, 1191223, 1160491, 1134290, 1112846, 1094679, 1078601, 1064864, 1054226, 1046578, 1041023, 1036809, 1033539, 1030787, 1028362, 1026890, 1027250, 1029097, 1030653, 1030420, 1028517, 1025930, 1023044, 1019704, 1016318, 1013901, 1012921, 1012804, 1012766, 1012531, 1012051, 1011239, 1010495, 1010966, 1013603, 1018089, 1023301, 1028834, 1035527, 1044276, 1054740, 1065616, 1076092, 1086734, 1098880, 1113307, 1129648, 1147118, 1165618, 1185789, 1207976, 1231642, 1256311, 1282849, 1312998, 1347456, 1385097, 1424636, 1466558, 1512657, 1563930]
62200A563930N5909N9933O4558P0210P5653P9288Q0536P9699P7011P2203O4742
62189B343672N4381M1777K8504J6017M441p182j9291l1034m1217m9420n5796o0366
62177B224486o3211o4948o6258o7027o6482o4179o0417n5728n0462m4925l9406
62166A581443l3975k8602k3682j9948j7628j5870j3457j0037o476l873k449j470
62154A403976j67J541L208M409M912M618L870L618M660O569P995Q380Q741J0382
62140A476712J3210J5927J7602J8431J9112K0123K1654K3793K6495K9511L2366
62129A714936L4454L5534L6258L7651L9698M0941M0184L8111L6372L5351L3876
62118B123366L1146K7941K5597K4649K4860K5802K6995K8134K9690L2756L7698
$$ y = [1563930, 1619839, 1679772, 1744330, 1814540, 1890193, 1969481, 2050017, 2129716, 2206727, 2278930, 2343672, 2398053, 2439830, 2468334, 2484351, 2488792, 2481610, 2462319, 2431285, 2390068, 2340648, 2284852, 2224486, 2161275, 2096327, 2030069, 1963042, 1896560, 1832381, 1771964, 1716236, 1665774, 1620849, 1581443, 1547468, 1518866, 1495184, 1475236, 1457608, 1441738, 1428281, 1418244, 1411768, 1407895, 1405446, 1403976, 1403809, 1405350, 1408558, 1412967, 1417879, 1422497, 1426367, 1429985, 1434645, 1441214, 1449209, 1457589, 1466330, 1476712, 1489922, 1505849, 1523451, 1541882, 1560994, 1581117, 1602771, 1626564, 1653059, 1682570, 1714936, 1749390, 1784924, 1821182, 1858833, 1898531, 1939472, 1979656, 2017767, 2054139, 2089490, 2123366, 2154512, 2182453, 2208050, 2232699, 2257559, 2283361, 2310356, 2338490, 2368180, 2400936, 2438634]
62107B438634M3406M8345N1915N4283N5405N5026N3265N0430M6304M0411L3053
62096B970477K5279J7719J0142K571l817p651r142j0229j2734j6545j9844k0995
62084B925231k0039j8304j6790j5154j2439q532m552j653L11K518N659R105J1745
62071B857106J3201J3873J4268J4932J6654J9770K3231K5381K5993K6615K8454
62060C079478L1020L3514L6336L9921M3070M4277M4247M5178M7459M9040M8678
62049C542218M7925M8871N1286N3296N3868N3383N2611N2448N3988N7463O1357
62038D128714O3824O4852O6026O8480P2019P5853P8862P9457P6821P2497O9380
62027D916785O8807O9833P1577P4491P8535Q1730Q2083Q0028P7572P5729P4262
$$ y = [2438634, 2482040, 2530385, 2582300, 2636583, 2691988, 2747014, 2800279, 2850709, 2897013, 2937424, 2970477, 2995756, 3013475, 3023617, 3026188, 3022371, 3014720, 3005578, 2995349, 2982615, 2966070, 2946226, 2925231, 2905192, 2886888, 2870098, 2854944, 2842505, 2833973, 2829421, 2827768, 2828079, 2830597, 2836256, 2845361, 2857106, 2870307, 2884180, 2898448, 2913380, 2930034, 2949804, 2973035, 2998416, 3024409, 3051024, 3079478, 3110498, 3144012, 3180348, 3220269, 3263339, 3307616, 3351863, 3397041, 3444500, 3493540, 3542218, 3590143, 3639014, 3690300, 3743596, 3797464, 3850847, 3903458, 3955906, 4009894, 4067357, 4128714, 4192538, 4257390, 4323416, 4391896, 4463915, 4539768, 4618630, 4698087, 4774908, 4847405, 4916785, 4985592, 5055425, 5127002, 5201493, 5280028, 5361758, 5443841, 5523869, 5601441, 5677170, 5751432]
62016E751432P3327P3566P4428P4219P2448P0834P1217P3416P5923P7716P8458
62005F566984P7816P5965P4177P3401P2317O8293O0608N1404M2963L5231K6896
61994G226055J7801R040J315n619j2185j8622k5261l2097l8215m2544m5136m6942
61982F987590m8406m9154m8902m7682m5263m1551l7532l4618l2792l0627k7478
61971F543585k4401k2368k0836j8815j6259j3754j1879j1489j3227j5923j6865
61960F357769j4956j2228j0982j0767j0041r282j0015j1500j1284r155p827r027
61948F230705j1117j1692j0682r690r647j0390j1516j2605j3388j4452j6906k0694
61936F077926k4318k6989k9854l4132l9233m3943m8473n3704n9171o3422o6086
$$ y = [5751432, 5824759, 5898325, 5972753, 6046972, 6119420, 6190254, 6261471, 6334887, 6410810, 6488526, 6566984, 6644800, 6720765, 6794942, 6868343, 6940660, 7008953, 7069561, 7120965, 7163928, 7199159, 7226055, 7243856, 7252896, 7254211, 7248592, 7236407, 7217785, 7192524, 7160427, 7122212, 7079668, 7034532, 6987590, 6939184, 6890030, 6841128, 6793446, 6748183, 6706632, 6669100, 6634482, 6601690, 6571063, 6543585, 6519184, 6496816, 6475980, 6457165, 6440906, 6427152, 6415273, 6403784, 6390557, 6374634, 6357769, 6342813, 6330585, 6319603, 6308836, 6298795, 6289513, 6279498, 6267998, 6256714, 6247559, 6239732, 6230705, 6219588, 6207896, 6197214, 6187524, 6177877, 6167487, 6155971, 6143366, 6129978, 6115526, 6098620, 6077926, 6053608, 6026619, 5996765, 5962633, 5923400, 5879457, 5830984, 5777280, 5718109, 5654687, 5588601]
61925E588601o7955o9174o8948o7214o5117o3326o1210n8318n5575n4060n3368
61914D904336n2158m9839m6812m3386l9516l5700l3048l1937l1151k9038k5414
61903D486337k1747j9490j8670j8281j7658j7097j7181j7749j7630j5482j1098
61892D294254n860j643Q57K500M556P558J1249J5024J8245K0722K3220K6846L1640
61879D449168L6472M0728M5101M9935N3953N5930N6929N9233O3503O8519P3474
61868E052945P8701Q4037Q8453R1951R6243J02764J11289J21192J32708J46060
61858F106343J60660J76246J93805K14311K37552K63174K91793L23962L59071
61849H326917L96579M37402M82496N30846N80508O31130O83708P37983P91753
$$ y = [5588601, 5520646, 5451472, 5382524, 5315310, 5250193, 5186867, 5125657, 5067339, 5011764, 4957704, 4904336, 4852178, 4802339, 4755527, 4712141, 4672625, 4636925, 4603877, 4571940, 4540789, 4511751, 4486337, 4464590, 4445100, 4426430, 4408149, 4390491, 4373394, 4356213, 4338464, 4320834, 4305352, 4294254, 4288394, 4286751, 4287608, 4290108, 4294664, 4302222, 4313471, 4328495, 4346740, 4367462, 4390682, 4417528, 4449168, 4485640, 4526368, 4571469, 4621404, 4675357, 4731287, 4788216, 4847449, 4910952, 4979471, 5052945, 5131646, 5215683, 5304136, 5396087, 5492330, 5595094, 5706383, 5827575, 5960283, 6106343, 6267003, 6443249, 6637054, 6851365, 7088917, 7352091, 7643884, 7967846, 8326917, 8723496, 9160898, 9643394, 10174240, 10754748, 11385878, 12069586, 12807569, 13599322]
61840A3599322Q42670Q88883R27298R52506R57937R37160Q83794P91836O57717
61831B1439123M82718K74013M4354j89521m10278o04157p63195q84431r67978
61822A8420648j016006j032528j023040r93805r50902q99086q41257p79375p15922
61813A0168727o53985n95810n41951m92050m46046m04239l66498l31874k99169
61804F037105k67961k39034k13465j91164j70673j50780j31839j14992j00478
61795D456719q7420p4992o3033n1669m1028l1462k3305j6450j0675o332m068l909
61783D042376n156p137r439j1490j2672j2950j2788j2400j1525r918p409l639
61771C925853J463P030J1820J5478J8553K1301K3216K3826K3162K1423J8906J6308
$$ y = [13599322, 14441992, 15330875, 16258173, 17210679, 18168616, 19105776, 19989570, 20781406, 21439123, 21921841, 22195854, 22240208, 22050687, 21640409, 21036252, 20273057, 19388626, 18420648, 17404642, 16372114, 15349074, 14355269, 13404367, 12505281, 11664024, 10884649, 10168727, 9514742, 8918932, 8376981, 7884931, 7438885, 7034646, 6668148, 6336274, 6037105, 5769144, 5530110, 5316645, 5125481, 4954808, 4804028, 4672189, 4557197, 4456719, 4369299, 4294307, 4231274, 4179605, 4138577, 4107115, 4083810, 4067360, 4056685, 4050353, 4046285, 4042376, 4037220, 4030083, 4020644, 4009154, 3996482, 3983532, 3970744, 3958344, 3946819, 3936901, 3929492, 3925853, 3927316, 3934346, 3946166, 3961644, 3980197, 4001498, 4024714, 4048540, 4071702, 4093125, 4112031, 4128339]
61759D128339J4252J2513J0534Q715Q145R097J0993J3990J9210K6897L5617M3982
61747D342284N2099O0635O9627P9130Q9947J02509J15726J28165J39941J52327
61737E332390J65894J80054J94288K08780K23909K39934K57282K76541K98079
61728G377151L21921L47872L75533M04734M36508M73154N16486N66146O20234
61719A1439739O77662P39534Q08454Q86699R74497J069420J167786J267132J366867
61710B0397790J465814J559695J641934J706145J746114J752956J713764J614376
61702C3598588J443880J197659Q78949N00357Q4453l38862p38588j089504j376134
61693C4160798j592473j739375j822156j849274j831088j778152j699874j604182
$$ y = [4128339, 4142591, 4155104, 4165638, 4174353, 4182498, 4191595, 4202588, 4216578, 4235788, 4262685, 4298302, 4342284, 4394383, 4455018, 4524645, 4603775, 4693722, 4796231, 4911957, 5040122, 5180063, 5332390, 5498284, 5678338, 5872626, 6081406, 6305315, 6545249, 6802531, 7079072, 7377151, 7699072, 8046944, 8422477, 8827211, 9263719, 9736873, 10253359, 10819505, 11439739, 12117401, 12856935, 13665389, 14552088, 15526585, 16596005, 17763791, 19030923, 20397790, 21863604, 23423299, 25065233, 26771378, 28517492, 30270448, 31984212, 33598588, 35042468, 36240127, 37119076, 37619433, 37703886, 37365024, 36626436, 35536932, 34160798, 32568325, 30828950, 29006794, 27157520, 25326432, 23548280, 21848406, 20244224]
61685B0244224j497751j386103j273863j165071j062872r68569q81580q00825
61677A1207590p26030o57580n95725n40420m91371m47662m07927l71557l39284
61668F630034l11686k87613k65077k43444k23590k05965j89801j74633j61402
61659D566823j51267j43941j37978j32227j26337j20090j13146j05670r8674r3095
61649C344398q8606q3811p7810p1165o4974n9497n4449n0271m7787m6483m4630
61638B654915m1781l9807m0258m1856m2076m0384l8127l5891l3171l0529k9697
61627B241338l0832l1682l0554k8525k7520k7625k7719k7539k7546k7385k6143
61616A928268k3821k1288j9031j7104j6011j6270j7192j7386j6587j5816j5568
$$ y = [20244224, 18746473, 17360370, 16086507, 14921436, 13858564, 12889995, 12008415, 11207590, 10481560, 9823980, 9228255, 8687835, 8196464, 7748802, 7340875, 6969318, 6630034, 6318348, 6030735, 5765658, 5522214, 5298624, 5092659, 4902858, 4728225, 4566823, 4415556, 4271615, 4133637, 4001410, 3875073, 3754983, 3641837, 3536167, 3437493, 3344398, 3255792, 3171981, 3094171, 3023006, 2958032, 2898535, 2844086, 2793815, 2746028, 2699545, 2654915, 2613134, 2573327, 2533069, 2491213, 2449137, 2408753, 2370626, 2334735, 2301564, 2271035, 2241338, 2210506, 2178824, 2148270, 2119745, 2092225, 2064600, 2036881, 2009342, 1981796, 1954411, 1928268, 1904447, 1883159, 1864128, 1847024, 1831013, 1814743, 1797551, 1780165, 1763578, 1747762, 1732194]
61605A732194j5098j3877j2657j2268j2274j1570r951q352p615p446o660m417
61593A610009j299J028J625J454K100L555M370M047L902M981O302O321N234M469
61579A658098M369L915K732J925K359L286L482K992K798L101K934J649M6m57M24
61564A693653J379Q88j177l597n334o512p751r012r775j0124j0893j2521j4264
61551A604960j4968j4396j3532j3514j4395j5012j4218j2257j0496r634q812p085
61539A456641n152m417m690m212k229L5J496K841M974P182Q341Q987J0422J2339
61525A492558J3288J3316J4132J6239J8030J8527J9317K2245K6517K9769L1269
61514A715207L2363L4065L5926L7512L9419M2104M4875M6954M8810N1339N4136
$$ y = [1732194, 1717096, 1703219, 1690562, 1678294, 1666020, 1654450, 1644499, 1636147, 1628532, 1621086, 1614426, 1610009, 1608710, 1609738, 1611363, 1612817, 1614917, 1618472, 1622842, 1626889, 1630791, 1635772, 1642074, 1648395, 1653629, 1658098, 1662467, 1666382, 1669114, 1671039, 1673398, 1676684, 1680166, 1683158, 1685956, 1689057, 1691991, 1693640, 1693686, 1693229, 1693653, 1695032, 1695920, 1694743, 1691146, 1685812, 1679300, 1671549, 1662537, 1652762, 1642638, 1631745, 1619224, 1604960, 1589992, 1575596, 1562064, 1548550, 1534155, 1519143, 1504925, 1492668, 1482172, 1472538, 1463726, 1456641, 1451489, 1447072, 1442382, 1438170, 1435941, 1435976, 1437472, 1440313, 1445287, 1452469, 1460810, 1469797, 1480219, 1492558, 1505846, 1519162, 1533294, 1549533, 1567563, 1586090, 1605407, 1627652, 1654169, 1683938, 1715207, 1747570, 1781635, 1817561, 1855073, 1894492, 1936596, 1981471, 2028425, 2077235, 2128574, 2182710]
61503B182710N5717N5543N4781N4575N4469N3221N0674M7838M5448M3500M2139
61492B740615M1634M1090L8547L3425K7837K4155K1961J8895J4104R181N568K663
61480C019675r46n568j0348j4110j5752j4913j2804j1389j1065j0123p141k781
61468B902735J681O390J2142J8554K4599L0481L7299M5044N2532N9491O7209P6671
61456C334828Q7288R8212J09897J23448J38883J54877J70335J85728K02695K22264
61446D828455K43602K64839K85068L04868L24572L42909L58182L69903L77843
61437G700241L79804L71943L51572L18499K73556K17590J52789Q3682J5402m8626
61427I816452j06550j56602j97120k27789k49609k63416k69394k68190k61570
$$ y = [2182710, 2238427, 2293970, 2348751, 2403326, 2457795, 2511016, 2561690, 2609528, 2654976, 2698476, 2740615, 2782249, 2823339, 2861886, 2895311, 2923148, 2947303, 2969264, 2988159, 3002263, 3011444, 3017012, 3019675, 3018729, 3013161, 3002813, 2988703, 2972951, 2958038, 2945234, 2933845, 2922780, 2912657, 2905516, 2902735, 2904416, 2910806, 2922948, 2941502, 2966101, 2996582, 3033881, 3078925, 3131457, 3190948, 3258157, 3334828, 3422116, 3520328, 3630225, 3753673, 3892556, 4047433, 4217768, 4403496, 4606191, 4828455, 5072057, 5336896, 5621964, 5926832, 6251404, 6594313, 6952495, 7322398, 7700241, 8080045, 8451988, 8803560, 9122059, 9395615, 9613205, 9765994, 9849676, 9865078, 9816452, 9709902, 9553300, 9356180, 9128391, 8878782, 8615366, 8345972, 8077782, 7816212]
61418G816212k51324k38070k21693k02693j82362j61593j40137j17460r4094p1604
61408F135182n1111l2296j4201L370J9656L4064M6826N8429O8804P7530Q4561
61397F430814R0387R5354R9127J01036J00973R9693R8067R6164R3382Q9535Q5464
61386G479996Q2380Q0930Q0930Q1607Q1835Q0693P8238P5285P1980O7224O0144
61375H321242N1616M3286L5524K7587J9505J2323O076q63r601j9024k7292l4064
61363H426315m0120m5427m9035n0633n0984n0660m9282m6298m1782l6374l1010
61352G934710k6720k3883k1514j8134j3682r872q278q769j0279j2337j5068j8195
61340G747979k0920k2582k2665k0380j5151p446J809J2757K6649M3961O3555Q4318
$$ y = [7816212, 7564888, 7326818, 7105125, 6902432, 6720070, 6558477, 6418340, 6300880, 6206786, 6135182, 6084071, 6051775, 6037574, 6040944, 6060600, 6094664, 6141490, 6199919, 6268723, 6346253, 6430814, 6521201, 6616555, 6715682, 6816718, 6917691, 7017384, 7115451, 7211615, 7304997, 7394532, 7479996, 7562376, 7643306, 7724236, 7805843, 7887678, 7968371, 8046609, 8121894, 8193874, 8261098, 8321242, 8372858, 8416144, 8451668, 8479255, 8498760, 8511083, 8517159, 8516296, 8506695, 8487671, 8460379, 8426315, 8386195, 8340768, 8291733, 8241100, 8190116, 8139456, 8090174, 8043876, 8002094, 7965720, 7934710, 7907990, 7884107, 7862593, 7844459, 7830777, 7820905, 7812627, 7803858, 7793579, 7781242, 7766174, 7747979, 7727059, 7704477, 7681812, 7661432, 7646281, 7638835, 7640644, 7653401, 7680050, 7724011, 7787566, 7871884]
61328G871884J06814J32207J60005J88087K15103K41792K69549K98362L26551
61319I810354L52185L74114L91687M03764M08255M02832L86118L57871L17970
61310A3205150K66054K03047J32625O0063j0549p7294j39045j94629k43726k87249
61300A2914447l25694l57823l81849l97339m05187m06413m02018l93492l82237
61291I462395l68402l51316l31148l09443k87862k67001k46436k25480k03784
61282F871523j81746j60438j40773j22730j05545q8389p0658n2180l3724j6807
61272E898533k284J0549K2691L3860M3168N0935N8475O6029P2238P5891P7171
61261F407256P6781P4820P1068O5639N8868N1268M3850L7783L3293K9489K5595
$$ y = [7871884, 7978698, 8110905, 8270910, 8458997, 8674100, 8915892, 9185441, 9483803, 9810354, 10162539, 10536653, 10928340, 11332104, 11740359, 12143191, 12529309, 12887180, 13205150, 13471204, 13674251, 13806876, 13866939, 13856390, 13779096, 13640051, 13445422, 13201696, 12914447, 12588753, 12230930, 11849081, 11451742, 11046555, 10640142, 10238124, 9844632, 9462395, 9093993, 8742677, 8411529, 8102086, 7814224, 7547223, 7300787, 7075307, 6871523, 6689777, 6529339, 6388566, 6265836, 6160291, 6071902, 6001244, 5949064, 5915340, 5898533, 5896249, 5906798, 5929489, 5963349, 6006517, 6057452, 6115927, 6181956, 6254194, 6330085, 6407256, 6484037, 6558857, 6629925, 6695564, 6754432, 6805700, 6849550, 6887333, 6920626, 6950115, 6975710]
61250F975710K1597J7511J2860P389J453m902j2331k1004k9836l7777m5197n3025
61238F832448o0965o7780p3141p8033q3054q7320q9556q9707q8836q7649q5705
61227E940702q2209p7261p1964o7166o2478n6834m9836m2261l5350l0020k6549
61216E338774k4424k2503k0119j8076j7807j9222k0280j9342j7232j6058j6267
61205E127444j5752j1974m434N082J4280K2153K9279L6706M4835N3518O2786P2883
61193E436806Q3581R4230J04789J16131J28824J41862J53035J60288J62490J59221
61183F741257J50324J35526J14176Q5544M9641P804l7503q3233j26238j63982
61173F873316j95177k19443k36262k44842k45434k40079k31435k21135k09717
$$ y = [6975710, 6997307, 7014818, 7027678, 7035067, 7036520, 7031618, 7019287, 6998283, 6968447, 6930670, 6885473, 6832448, 6771483, 6703703, 6630562, 6552529, 6469475, 6382155, 6292599, 6202892, 6114056, 6026407, 5940702, 5858493, 5781232, 5709268, 5642102, 5579624, 5522790, 5472954, 5430693, 5395343, 5365323, 5338774, 5314350, 5291847, 5271728, 5253652, 5235845, 5216623, 5196343, 5177001, 5159769, 5143711, 5127444, 5111692, 5099718, 5095284, 5100366, 5114646, 5136799, 5166078, 5202784, 5247619, 5301137, 5363923, 5436806, 5520387, 5614617, 5719406, 5835537, 5964361, 6106223, 6259258, 6419546, 6582036, 6741257, 6891581, 7027107, 7141283, 7226827, 7276468, 7284272, 7246769, 7163536, 7037298, 6873316, 6678139, 6458696, 6222434, 5977592, 5732158, 5492079, 5260644, 5039509, 4829792]
61164D829792j97521j84915j71767j57738j43223j29450j17304j06394r5623q4555
61154C441302p3934o4777n7145n0114m2922l5692k8821k2233j5843j0259o068
61143C033494k592J634P000J2405J6809K0145K2469K3397K3028K2365K1911K0705
61131C222770J7593J2790P395K127k739o924j0623j4716j9438k3518k5796k7065
61119C131856k9025l1927l4780l7357m0334m3427m5328m5828m6449m8250n0401
61108B678750n1706n2331n3124n4260n5455n6664n7480n6747n3970n0608m8570
61097B087835m7767m6426m3807m1124l9362l7690l5078l2431l1569l2389l2732
61086A667460l1389k9853l0021l1263l1213k9024k6175k3912k1551j8123j4371
$$ y = [4829792, 4632271, 4447356, 4275589, 4117851, 3974628, 3845178, 3727874, 3621480, 3525857, 3441302, 3367368, 3302591, 3245446, 3195332, 3152410, 3116718, 3087897, 3065664, 3049821, 3039562, 3033494, 3030902, 3032536, 3039536, 3051941, 3068750, 3088895, 3111364, 3134761, 3157789, 3180154, 3202065, 3222770, 3240363, 3253153, 3260548, 3262675, 3259936, 3253012, 3242389, 3227673, 3208235, 3184717, 3158921, 3131856, 3102831, 3070904, 3036124, 2998767, 2958433, 2915006, 2869678, 2823850, 2777401, 2729151, 2678750, 2627044, 2574713, 2521589, 2467329, 2411874, 2355210, 2297730, 2240983, 2187013, 2136405, 2087835, 2040068, 1993642, 1949835, 1908711, 1869349, 1831659, 1796581, 1764150, 1732581, 1700192, 1667460, 1636071, 1606218, 1576197, 1544934, 1513721, 1484697, 1458522, 1434610, 1413059, 1394936, 1380565]
61075A380565j1837j0628r289o713l249n6J950K759L539N795R597J3102J4729
61062A390264J5201J6218J7706J8087J7121J6542J7377J8491J8734J8935K0249
61051A584925K1805K1681J9679J7454J6042J4773J2832J0580Q669O831M205N40
61039A740016l453o731q667r322r268r096r107r399r919j0298j0065r434r392
61026A625865j0445j1698j2117j2277j3645j6076j7534j6877j5562j5584j6639
61015A467411j6765j5193j3129j1799j1136j0692j0598j0948j1092j0212q192
61004A337655n522k710k00J575K400K430K023J728K261L766N239N627N539O657
60990A368468R132J1086J1462J1846J4145J7582J9780K0066J9867K0225K0767
$$ y = [1380565, 1368728, 1358100, 1348811, 1342098, 1338849, 1338793, 1340743, 1343502, 1347041, 1352836, 1362433, 1375535, 1390264, 1405465, 1421683, 1439389, 1457476, 1474597, 1491139, 1508516, 1527007, 1545741, 1564676, 1584925, 1606730, 1628411, 1648090, 1665544, 1681586, 1696359, 1709191, 1719771, 1728440, 1735271, 1739476, 1740016, 1736563, 1729832, 1721165, 1711843, 1702575, 1693479, 1684372, 1674973, 1665054, 1654756, 1644691, 1635257, 1625865, 1615420, 1603722, 1591605, 1579328, 1565683, 1549607, 1532073, 1515196, 1499634, 1484050, 1467411, 1450646, 1435453, 1422324, 1410525, 1399389, 1388697, 1378099, 1367151, 1356059, 1345847, 1337655, 1332133, 1329423, 1329223, 1330798, 1333198, 1335628, 1337651, 1339379, 1341640, 1345406, 1350645, 1356272, 1361811, 1368468, 1377600, 1388686, 1400148, 1411994, 1426139, 1443721, 1463501, 1483567, 1503434, 1523659, 1544426]
60979A544426K1215K2061K3397K4535K5408K6997K9788L2915L5465L7634M0004
60968A863845M2590M5335M8718N3094N7914O2186O5394O7663O9460P1356P3683
60957B521238P6259P8865Q1850Q5638Q9888R4000R8356J03981J11021J18640J26511
60946C586247J35249J45221J56005J67085J78078J88372J98035K08937K23464
60937E186693K41971K63098K86499L13316L43951L77522M13953M54534N00612
60928H382149N54546O21930P08968Q16515R40096J076561J226205J387368J555941
60919A7270279J734435J935322K169982K440450K745467L075487L373558L503624
60911C8248604L301720K705412J842012R68160L06175o5162j81645j08114P8763
$$ y = [1544426, 1565641, 1587702, 1611099, 1635634, 1661042, 1688039, 1717827, 1750742, 1786207, 1823841, 1863845, 1906435, 1951770, 2000488, 2053582, 2111496, 2173682, 2239076, 2306739, 2376199, 2447555, 2521238, 2597497, 2676362, 2758212, 2843850, 2933738, 3027738, 3126094, 3230075, 3341096, 3459736, 3586247, 3721496, 3866717, 4022722, 4189807, 4367885, 4556257, 4754292, 4963229, 5186693, 5428664, 5691762, 5978261, 6291577, 6635528, 7013050, 7427003, 7881537, 8382149, 8936695, 9558625, 10267593, 11084108, 12024204, 13100765, 14326970, 15714338, 17270279, 19004714, 20940036, 23110018, 25550468, 28295935, 31371422, 34744980, 38248604, 41550324, 44255736, 46097748, 47065908, 47372083, 47306921, 47125276, 47017162, 47095925]
60902D7095925K41679J85304k31546r72762j830338k563911l039891l256600l276767
60893C2351093l163125k963489k718161k458290k200710j952567j719109j504204
60885A3671438j308311j131363r75881q44300p35308o45347n71551n10942m59189
60876F489246m13033l72340l37646l07406k79800k55245k34692k16990k00390
60867C871704j85300j73112j63373j54510j46405j39956j34725j29159j22680
60858B522484j15745j08403j00449r2441q4978p7603o9971o3157n8190n4162m9687
60847A647698m5296m2372m0429l7754l4207l1102k8490k5053k0930j8273j8192
60836A305600j8941j8165j5578j2527r902p496m927k438p28q4L04J598L660M801
$$ y = [47095925, 47337604, 47522908, 47291362, 46318600, 44488262, 41924351, 38884460, 35627860, 32351093, 29187968, 26224479, 23506318, 21048028, 18847318, 16894751, 15175642, 13671438, 12363127, 11231764, 10255883, 9411583, 8676275, 8030928, 7459377, 6948435, 6489246, 6076213, 5703873, 5366227, 5058821, 4779021, 4523776, 4289084, 4072094, 3871704, 3686404, 3513292, 3349919, 3195409, 3049004, 2909048, 2774323, 2645164, 2522484, 2406739, 2298336, 2197887, 2105446, 2020468, 1942865, 1872894, 1809737, 1751547, 1697385, 1647698, 1602402, 1560030, 1519601, 1481847, 1447640, 1416538, 1388048, 1362995, 1342065, 1323792, 1305600, 1286659, 1268494, 1252916, 1240389, 1230487, 1222991, 1218064, 1215626, 1214898, 1214814, 1215118, 1216716, 1220376, 1225177]
60822A225177L907K046J102J445J968J777P05j319m155o939q848j0197j1853j3900
60808A180916j5663j6575j6122j3750j0000p039o459p052o294l721j249k41R1
60795A076842J209L492O207Q247Q927Q888R927J2887J6276J8161J8861K0219K2702
60782A232845K4981K6123K6262K5276K2790J9723J7817J7226J6362J4529J2727
60771A456661J1370R247N793K492O98k83j662k989l085k218j770k318l190l688
60757A465058l825m172n449p876j0524j2098j2717j3950j6494j8968j9825j9396
60745A319764j8990j8809j8001j6197j3929j1874j0591j0503j1220j1272r542
60734A168836o629m078k613j911j575j251k47J835M201N743O719Q454J1265J3792
$$ y = [1225177, 1229084, 1231130, 1232232, 1233677, 1235645, 1237422, 1238127, 1236808, 1232653, 1225714, 1216866, 1206669, 1194816, 1180916, 1165253, 1148678, 1132556, 1118806, 1108806, 1101767, 1095308, 1088256, 1081962, 1078241, 1076992, 1076751, 1076842, 1078051, 1081543, 1087750, 1095997, 1104924, 1113812, 1123739, 1136626, 1152902, 1171063, 1189924, 1210143, 1232845, 1257826, 1283949, 1310211, 1335487, 1358277, 1378000, 1395817, 1413043, 1429405, 1443934, 1456661, 1468031, 1477278, 1483071, 1485563, 1486261, 1485978, 1484316, 1481327, 1478242, 1476024, 1474254, 1471936, 1468746, 1465058, 1461233, 1457061, 1451612, 1443736, 1433212, 1421114, 1408397, 1394447, 1377953, 1358985, 1339160, 1319764, 1300774, 1281965, 1263964, 1247767, 1233838, 1221964, 1211373, 1200870, 1189650, 1178378, 1168836, 1162207, 1158129, 1155516, 1153605, 1152030, 1150779, 1150532, 1152367, 1156568, 1162311, 1169030, 1177484, 1188749, 1202541]
60720A202541J4777J4643J4732J5646J6842J7605J7958J8630K0164K2074K3107
60709A398719K2616K1275K0080J9100J7951J7012J7013J7457J6797J4615J2391
60698A595026J1349J0621Q668N740L498K568J951R18p3p43j788l432m395l624
60684A626284k292k563m730p018q227r114j0795j3083j5006j6134j6623j6682
60672A504017j6607j6781j7100j6891j5833j4477j3436j2592j1505j0021q082
60661A350692n620l009r04Q14K940N310O369N273L344K365K338K259K098K363
60647A376632K323O37k213l874k818J00K917M194L323O90k082l218k710k355l705
60632A367841o680j0242j3311j5056j5392j5511j6774j8910k0384k0638k0610
$$ y = [1202541, 1217318, 1231961, 1246693, 1262339, 1279181, 1296786, 1314744, 1333374, 1353538, 1375612, 1398719, 1421335, 1442610, 1462690, 1481790, 1499741, 1516753, 1533766, 1551223, 1568020, 1582635, 1595026, 1606375, 1616996, 1625664, 1631404, 1634902, 1637470, 1639421, 1640339, 1640266, 1639523, 1637735, 1634303, 1629908, 1626284, 1623992, 1621429, 1616699, 1609681, 1601454, 1592340, 1581545, 1568462, 1553456, 1537322, 1520699, 1504017, 1487410, 1470629, 1453529, 1436638, 1420805, 1406328, 1392892, 1380300, 1368795, 1358774, 1350692, 1345072, 1342063, 1341159, 1341973, 1344913, 1350223, 1356592, 1361865, 1365209, 1367574, 1369912, 1372171, 1374269, 1376632, 1378955, 1379592, 1377379, 1373505, 1370687, 1370787, 1373704, 1377898, 1381221, 1381911, 1379829, 1376611, 1373901, 1371546, 1367841, 1361161, 1350919, 1337608, 1322552, 1307160, 1291649, 1274875, 1255965, 1235581, 1214943, 1194333]
60621A194333k0800k0350j8610j6325j4468j3087j1967j1271j0771r614p652n917
60609A033501m898l525q95K169M433O065P709Q761Q196O611N708N977O383O292
60595A092487O186O362O345O065O419P960R863J0734J0000Q117N961M438M144
60582A185081M887N785O168O233O525P117P694Q215R016J0143J1098J1626J2396
60569A291984J4219J6573J7704J6742J5016J4501J5422J6398J6661J6638J6277
60558A468135J4367J0583O988O068P682R163Q362N617K633M41j090k334l258l758
60544A529599m318n900q878j2245j4364j4654j4024j3594j3541j3492j3290j2785
60532A388514j1474r152o621m919l915k514k34K076L336L456L233L404M152N202
$$ y = [1194333, 1173533, 1153183, 1134573, 1118248, 1103780, 1090693, 1078726, 1067455, 1056684, 1047070, 1039418, 1033501, 1028603, 1025078, 1024183, 1026352, 1030785, 1036850, 1044559, 1053320, 1061516, 1068127, 1073835, 1079812, 1086195, 1092487, 1098673, 1105035, 1111380, 1117445, 1123864, 1131824, 1141687, 1152421, 1162421, 1170538, 1176499, 1180937, 1185081, 1189968, 1195753, 1201921, 1208154, 1214679, 1221796, 1229490, 1237705, 1246721, 1256864, 1267962, 1279588, 1291984, 1306203, 1322776, 1340480, 1357222, 1372238, 1386739, 1402161, 1418559, 1435220, 1451858, 1468135, 1482502, 1493085, 1500073, 1506141, 1513823, 1522986, 1531348, 1536965, 1539598, 1540039, 1538949, 1536615, 1533357, 1529599, 1525281, 1519381, 1510503, 1498258, 1483894, 1469240, 1455216, 1441622, 1428081, 1414589, 1401299, 1388514, 1377040, 1367888, 1361267, 1356348, 1352433, 1349919, 1349685, 1351761, 1355097, 1358553, 1361786, 1365190, 1369342, 1374544]
60518A374544N989N918M960L957L914M675M698K788j3j047R77M236N732M705L257
60503A429290L587N603P544Q257Q174Q392R267R907Q956O078K729J115K171M878
60489A515948P629R818J1898J4246J6545J8352K0054K2901K7777L3930L9445M3298
60477A781841M6468N0509N5476N9926O2490O2444N9093N1822M1043K8200J4564
60466B313876P23j2664k4407l3237l8156l8595l5267l0674k7245k4700k0531j3560
60454B015563n629Q31N554R826J4382J9079K3752K8274L2300L5869L9626M3858
60442B263285M8054N2313N8054O6208P5591Q4442R2936J02662J14090J26076J37809
60431C221520J49657J61872J73805J84897J95614K06953K19761K34757K52494
$$ y = [1374544, 1380533, 1386451, 1391411, 1395368, 1399282, 1403957, 1408655, 1411443, 1411430, 1410383, 1411360, 1415596, 1421328, 1426033, 1429290, 1432877, 1438480, 1446024, 1454281, 1462455, 1470847, 1480114, 1490021, 1498977, 1505055, 1507784, 1508899, 1511070, 1515948, 1523577, 1533395, 1545293, 1559539, 1576084, 1594436, 1614490, 1637391, 1665168, 1699098, 1738543, 1781841, 1828309, 1878818, 1934294, 1994220, 2056710, 2119154, 2178247, 2230069, 2271112, 2299312, 2313876, 2314599, 2301935, 2277528, 2244291, 2206135, 2167540, 2132273, 2101599, 2074354, 2049654, 2029123, 2015563, 2009934, 2010765, 2016319, 2026145, 2040527, 2059606, 2083358, 2111632, 2143932, 2179801, 2219427, 2263285, 2311339, 2363652, 2421706, 2487914, 2563505, 2647947, 2740883, 2843545, 2957635, 3083711, 3221520, 3371177, 3533049, 3706854, 3891751, 4087365, 4294318, 4514079, 4748836, 5001330]
60422E001330K72863K95119L18491L41974L62781L75121L71327L45029K93928
60413G977963K20090J28016K3218q7142j93472k85855l57923m08298m38243m49370
60403F128984m44125m26812m02315l73923l43270l11710k80762k51634k25255
60394C069178k02298j82292j63431j44527j26710j11923j00171q9592p9120o9496
60384A799618o1555n4989m9354m5006m2175l9862l6626l2228k7973k5329k4478
60373A360043k4216k3312k1766k0424j9466j8159j6257j4702j4199j3976j2875
60362A160691j1058r576q672p608n900l751j502M23J326R79L88P97K040K801K442
60347A123820J730J737K785M314N205M531K733J620K395M174N305N558N927O789
$$ y = [5001330, 5274193, 5569312, 5887803, 6229777, 6592558, 6967679, 7339006, 7684035, 7977963, 8198053, 8326069, 8349287, 8262145, 8068673, 7782818, 7424895, 7016597, 6578354, 6128984, 5684859, 5258047, 4855732, 4481809, 4138539, 3826829, 3546067, 3294433, 3069178, 2866880, 2684588, 2521157, 2376630, 2249920, 2137997, 2037826, 1948234, 1869114, 1799618, 1738063, 1683074, 1633720, 1588714, 1546539, 1506677, 1470051, 1437823, 1409850, 1384521, 1360043, 1335827, 1312515, 1290749, 1270325, 1250859, 1232700, 1216443, 1201741, 1187542, 1173566, 1160691, 1149633, 1140057, 1131385, 1123777, 1117877, 1114126, 1112624, 1113047, 1114373, 1115352, 1115740, 1116537, 1118577, 1121378, 1123820, 1125550, 1127287, 1130072, 1134386, 1139591, 1144122, 1146855, 1148475, 1150870, 1155044, 1160349, 1165907, 1171834, 1178623]
60333A178623P582P946P936P503O848O749P312P170N441L579L277L489J961q44
60319A254572k340k219k930n209o479n087l036k559k707j709m01n43j356p03J340
60304A218634K830L240L703M353L986K628K143L742O543R050J0604J1029J0300
60291A292785R096Q575R141J0210J1287J2247J2674J2112J1167J1095J2009J2576
60279A424974J1837J0302Q887P860P282P337P680P392O292N457N819P030Q310
60266A526459R534J0638J0797R317O849M610K671J02l273o411q591j0294j2042
60253A540366j3185j2725j0980r531r364r682q891o463l507j631j435k119k298
60240A448555j260L95J367J124O94J464L190L861K210k95r44Q91L108L801L622
$$ y = [1178623, 1186205, 1194151, 1202087, 1209590, 1216438, 1223187, 1230499, 1237669, 1243110, 1246689, 1249966, 1253455, 1255416, 1254572, 1252232, 1250013, 1247083, 1241874, 1235395, 1230308, 1227272, 1224713, 1222006, 1220297, 1219896, 1219353, 1217997, 1217294, 1218634, 1221464, 1224704, 1228407, 1232760, 1236746, 1239374, 1241517, 1245259, 1251802, 1260852, 1271456, 1282485, 1292785, 1301881, 1310456, 1319597, 1329807, 1341094, 1353341, 1366015, 1378127, 1389294, 1400389, 1412398, 1424974, 1436811, 1447113, 1456000, 1463860, 1471142, 1478479, 1486159, 1493551, 1499843, 1505300, 1511119, 1518149, 1526459, 1535993, 1546631, 1557428, 1566745, 1573594, 1578204, 1580875, 1580977, 1577704, 1571293, 1562702, 1552408, 1540366, 1527181, 1514456, 1503476, 1493945, 1484581, 1474899, 1466008, 1459545, 1456038, 1454407, 1452972, 1450853, 1448555, 1447295, 1447690, 1449057, 1450181, 1450875, 1452339, 1455529, 1459390, 1461600, 1461305, 1460361, 1461252, 1464360, 1468161, 1471783]
60225A471783M366O217P791Q494R253J0794J2574J4022J5603J7684J9332J9496
60213A617409J8882J9304K1260K3313K4046K3554K2861K2795K3883K6359K9654
60202A873320L2536L4402L6034L8650M2571M7177N1613N5297N8346O1877O7136
60191B398959P3870Q0362Q5725R1245R8594J07542J16639J25542J35216J46029
60181C459723J57034J67229J76385J84453J91277J97153K02554K06855K08240
60172E150903K05457J98972J89795J77837J62208J42914J21681J00840Q1482O2574
60162F594663M2159J9807k250k0807l4354m3572m9648n2979n3616n1818m7647
60151F299938m0561k9964j5979N23J8396L6817N5731P5609R6329J16558J34844
$$ y = [1471783, 1476149, 1482366, 1490157, 1498651, 1507904, 1518698, 1531272, 1545294, 1560897, 1578581, 1597913, 1617409, 1636291, 1655595, 1676855, 1700168, 1724214, 1747768, 1770629, 1793424, 1817307, 1843666, 1873320, 1905856, 1940258, 1976292, 2014942, 2057513, 2104690, 2156303, 2211600, 2269946, 2331823, 2398959, 2472829, 2553191, 2638916, 2730161, 2828755, 2936297, 3052936, 3178478, 3313694, 3459723, 3616757, 3783986, 3960371, 4144824, 4336101, 4533254, 4735808, 4942663, 5150903, 5356360, 5555332, 5745127, 5922964, 6085172, 6228086, 6349767, 6450607, 6532089, 6594663, 6636822, 6656629, 6654379, 6633572, 6599218, 6555646, 6505998, 6453019, 6399403, 6347585, 6299938, 6259377, 6229413, 6213434, 6213957, 6232353, 6269170, 6324901, 6400510, 6496839, 6613397, 6748241]
60140F748241J51103J66176J80037J91302J98527K01051J98553J90767J77946
60131H403703J60604J38773J12522Q3399N4009K5679k296l0527n7976q3294j06216
60120H698380j26361j41717j50081j51515j47934j40489j28807j12767r3598p2734
60110G432377n0558k6855j864K3448M7826P0189R0003J07363J22351J34241J41532
60099H090053J42844J37710J26751J11505R3900P5420N6720L8263K1151O944l331
60088H897930r560j1917j0309m565N194J8695L6013N7565Q3392J12428J42812
60077I317678J73221K03787K35487K68865L03707L39725L76942M15289M54340
60068A2089041M93415N31332N65907N94648O16285O31043O38978O38757O28595
$$ y = [6748241, 6899344, 7065520, 7245557, 7436859, 7635386, 7836437, 8034990, 8225757, 8403703, 8564307, 8703080, 8815602, 8899001, 8953010, 8978689, 8976393, 8945866, 8887890, 8804596, 8698380, 8572019, 8430302, 8280221, 8128706, 7980772, 7840283, 7711476, 7598709, 7505111, 7432377, 7381819, 7354964, 7353100, 7376548, 7424374, 7494563, 7584566, 7691929, 7814280, 7948521, 8090053, 8232897, 8370607, 8497358, 8608863, 8702763, 8778183, 8834903, 8873166, 8894317, 8901261, 8897930, 8888370, 8876453, 8866144, 8861579, 8866773, 8885468, 8921481, 8979046, 9062438, 9174866, 9317678, 9490899, 9694686, 9930173, 10199038, 10502745, 10842470, 11219412, 11634701, 12089041, 12582456, 13113788, 13679695, 14274343, 14890628, 15521671, 16160649, 16799406, 17428001]
60059A7428001O07752N76403N34592M82308M20358L50365K73842J91930J06034
60050B0971585J7992p0482j57956k42708l22391l94375m56037n04757n38450n56623
60040A7745798n60521n51772n31254m99836m59803m14399l65623l13373k57527
60031A3791690k00220j44941r3624m5833r64L9950P5217J03907J25308J37839
60021A3788329J39973J32046J16094R3980O6645L5056P96l4518o9578j03101j34057
60010A4031665j62321j88434k12605k34500k53838k70364k83292k91726k95646
60001A1838939k95577k91310k81913k67096k47715k24895j99644j73115j45975
59992I711699j17432q6179n2645j9039J2980M3334P2064R8521J22568J44902J65305
$$ y = [17428001, 18035753, 18612156, 19146748, 19629056, 20049414, 20399779, 20673621, 20865551, 20971585, 20989577, 20919095, 20761139, 20518431, 20196040, 19801665, 19345628, 18840871, 18302421, 17745798, 17185277, 16633505, 16102251, 15602415, 15142612, 14728213, 14362590, 14049217, 13791690, 13591470, 13446529, 13352905, 13307072, 13306108, 13346058, 13421275, 13525182, 13650490, 13788329, 13928302, 14060348, 14176442, 14270422, 14337067, 14372123, 14372919, 14338401, 14268823, 14165722, 14031665, 13869344, 13680910, 13468305, 13233805, 12979967, 12709603, 12426311, 12134585, 11838939, 11543362, 11252052, 10970139, 10703043, 10455328, 10230433, 10030789, 9857674, 9711699, 9594267, 9508088, 9455443, 9436404, 9449384, 9492718, 9564782, 9663303, 9785871, 9930773, 10096078]
59981A0096078J81968J93415J99448J99352J90992J73423J49071J21495R1884
59972A1597126N9375K3978j2809m9820q6762j22903j56582j86176k10436k28017
59962A0626974k37843k40119k36140k27122k13781j96676j76212j52652j26839
59953H819590j00269p3664m6121j6763J3521M3205P2292J01797J31559J60259
59943I105406J87553K14289K40256K63165K80519K91363K95628K92845K82182
59934A1453206K63263K36454K02887J64464J23207Q0234L5625j0465n6764j00945
59924A2391166j40498j73761k00364k20400k33083k37014k32189k20786k04941
59915A0528130j84590j58810j28718r7303o6374l5223k756L0224O1544Q9709J14823
$$ y = [10096078, 10278046, 10471461, 10670909, 10870261, 11061253, 11234676, 11383747, 11505242, 11597126, 11656501, 11680479, 11667670, 11617850, 11531088, 11408185, 11251603, 11065427, 10854991, 10626974, 10389131, 10149012, 9912872, 9685750, 9471969, 9275293, 9099081, 8946429, 8819590, 8719321, 8645657, 8599536, 8582773, 8596294, 8639499, 8711791, 8813588, 8945147, 9105406, 9292959, 9507248, 9747504, 10010669, 10291188, 10582551, 10878179, 11171024, 11453206, 11716469, 11952923, 12155810, 12320274, 12443481, 12523715, 12559340, 12548875, 12492111, 12391166, 12250668, 12076907, 11876543, 11656143, 11423060, 11186046, 10953857, 10733071, 10528130, 10343540, 10184730, 10056012, 9958709, 9892335, 9857112, 9854356, 9884580, 9946124, 10035833, 10150656]
59904A0150656J37862J59269J78019J92180K00687K04312K04416K01203J93931
59895A1822535J82525J68058J51916J35356J19686J05828R3749Q3075P4261O8530
59885A3005519O6991P0699Q1081R9039J23619J52828J85918K23881K67460L15561
59875A4592596L65852M16236M65507N13012N57618N96728O26697O44732O49591
59866A9428569O39679O11500N61444M88577L94492K81635J54013J8997j14345
59857B2464561k39348l52675m51355n31500n90819o30196o51485o55414o42755
59848A7719014o16106n79006n34270m84137m30796l75629l18761k60448k02140
59839A3917721j45420r0836l8603J0715N7083J01181J42476J78175K05454K23789
$$ y = [10150656, 10288518, 10447787, 10625806, 10817986, 11018673, 11222985, 11427401, 11628604, 11822535, 12005060, 12173118, 12325034, 12460390, 12580076, 12685904, 12779653, 12862728, 12936989, 13005519, 13072510, 13143209, 13224290, 13323329, 13446948, 13599776, 13785694, 14009575, 14277035, 14592596, 14958448, 15374684, 15840191, 16353203, 16910821, 17507549, 18134246, 18778978, 19428569, 20068248, 20679748, 21241192, 21729769, 22124261, 22405896, 22559909, 22578906, 22464561, 22225213, 21872538, 21421183, 20889683, 20298864, 19668668, 19017183, 18361769, 17719014, 17102908, 16523902, 15989632, 15505495, 15074699, 14699070, 14380309, 14119861, 13917721, 13772301, 13681465, 13642862, 13653577, 13710660, 13811841, 13954317, 14132492, 14337946, 14561735]
59829A4561735K33577K33332K20085J92378J51343R9054L7276l2015j06174j82209
59819A5408382k56706l25412l84156m30801m65798m90563n05740n11094n06529
59810A1531583m92888m72142m46828m19015l89594l58765l27034k95492k65199
59801H064626k36562k09458j83801j59955j38549j19786j03252q8793p7319p0018
59791F677133o6690o5549o4916o4376o3934o2875o0253n6082n1346m6895m2851
59780F031366l9125l6152l4984l6592m0950m6858n2978n8877o4561o9189p1154
59769E479946o9683o5721o0856n5698m9593m1577l1559k0855j1391l950K545R398
59757E081006J6448K3118L0580M0974N4121O6834P6272Q2663Q7898R2935R7742
$$ y = [14561735, 14795312, 15028644, 15248729, 15441107, 15592450, 15691504, 15728780, 15696765, 15590591, 15408382, 15151676, 14826264, 14442108, 14011307, 13545509, 13054946, 12549206, 12038112, 11531583, 11038695, 10566553, 10119725, 9700710, 9311116, 8952351, 8625317, 8329825, 8064626, 7828064, 7618606, 7434805, 7274850, 7136301, 7016515, 6913263, 6824470, 6747151, 6677133, 6610443, 6544894, 6479978, 6415602, 6351668, 6288793, 6228540, 6172458, 6121112, 6074217, 6031366, 5992241, 5956089, 5921105, 5884513, 5843563, 5796705, 5743727, 5684850, 5620289, 5551100, 5479946, 5410263, 5344542, 5283686, 5227988, 5178395, 5136818, 5105259, 5084404, 5073013, 5069063, 5071608, 5081006, 5097454, 5120572, 5151152, 5192126, 5246247, 5313081, 5389353, 5472016, 5559914, 5652849, 5750591]
59746E750591J02397J06605J08895J07867J04013R8970R3225Q5816P6297O5885
59736F700561N6410M8858M3248L9474L8096M0172M6178N5247O6185P9256R5945
59725G309630J16634J39798J64226J90827K21049K54495K89468L25185L62049
59716I373361M00106M38737M77556N16072N52172N81898O00525O02632N81231
59707A4124290N28899M41621L22240J80822L2166j08128k27811l20399l84300
59698A4589400m20384m31128m21351l97542l65109l26794k84038k38777j93061
59689A1511216j47805j03154n9795j8821J9726N7120R4351J30902J65720J99107
59679A1848567K32880K68466L05346L41942L77966M15372M56584N02146N50513
$$ y = [5750591, 5852988, 5959593, 6068488, 6176355, 6280368, 6379338, 6472563, 6558379, 6634676, 6700561, 6756971, 6805829, 6849077, 6888551, 6926647, 6966819, 7012997, 7068244, 7134429, 7213685, 7309630, 7426264, 7566062, 7730288, 7921115, 8142164, 8396659, 8686127, 9011312, 9373361, 9773467, 10212204, 10689760, 11205832, 11758004, 12339902, 12940427, 13543059, 14124290, 14653189, 15094810, 15417050, 15597872, 15630038, 15521910, 15294099, 14973700, 14589400, 14169016, 13737888, 13316537, 12918995, 12553886, 12227092, 11943054, 11704277, 11511216, 11363411, 11260257, 11200462, 11181641, 11201367, 11258487, 11352838, 11483740, 11649460, 11848567, 12081447, 12349913, 12655259, 12997201, 13375167, 13790539, 14247123, 14749269, 15299782]
59670A5299782O00031O50503P02640P56626Q11943Q68545R27266R88299J049591
59661B2655226J107541J159472J204597J242273J269986J283880J281157J261636
59653C2465768J227598J182982J132648J081675J034952R97088R71518R58822
59645D1053051R56491R61198R70502R81156R86793R79540R54214R09280Q43910
59636D9596135P56548O47469N21043L84206K43950J07154j8818j27339k14112
59627E1896236k76770l13709l24221l08886k68850k05519j21679k1750R0401K13166
59617E0358419L45598M85061O27692P70183R09489J041290J160196J260990J338047
59608E8296965J383848J389613J347444J250914J094605Q75828N98077K72222
$$ y = [15299782, 15899813, 16550316, 17252956, 18009582, 18821525, 19690070, 20617336, 21605635, 22655226, 23762767, 24922239, 26126836, 27369109, 28639095, 29922975, 31204132, 32465768, 33693366, 34876348, 36008996, 37090671, 38125623, 39122711, 40094229, 41053051, 42009542, 42970740, 43941242, 44922398, 45909191, 46888731, 47842945, 48752225, 49596135, 50352683, 51000152, 51521195, 51905401, 52149351, 52256505, 52237687, 52110348, 51896236, 51619466, 51305757, 50981536, 50672650, 50403800, 50198281, 50076602, 50054852, 50145253, 50358419, 50704017, 51189078, 51816770, 52586953, 53496442, 54537732, 55697928, 56958918, 58296965, 59680813, 61070426, 62417870, 63668784, 64763389, 65639217, 66237294, 66509516]
59600F6509516q5713m57102q21847j159754j453347j690579j865752j978872k034130
59591E4962420k038173j999421j928274j836323j733980j629682j532546j454533
59583D0809488j407223j395502j414896j454464j500913j540989j563482j561795
59575B8970224j535061j486799j422634j348253j267631j182636j094962j007944
59567A8624304r25091q47302p73331p03001o38028n79431n26159m76984m31933
59558A2723044l91007l53151l17651k85168k56366k30850k08449j90116j76323
59549A0313963j65803j57367j51910j50994j54101j58759j63037j66663j70091
59540H875238j73633j77153j79555j78913j74180j66465j57761j48774j38946
$$ y = [66509516, 66423803, 65966701, 65144854, 63985100, 62531753, 60841174, 58975422, 56996550, 54962420, 52924247, 50924826, 48996552, 47160229, 45426249, 43796567, 42264021, 40809488, 39402265, 38006763, 36591867, 35137403, 33636490, 32095501, 30532019, 28970224, 27435163, 25948364, 24525730, 23177477, 21909846, 20727210, 19632248, 18624304, 17699213, 16851911, 16078580, 15375579, 14737551, 14158120, 13631961, 13154977, 12723044, 12332037, 11978886, 11661235, 11376067, 11119701, 10888851, 10680402, 10490286, 10313963, 10148160, 9990793, 9838883, 9687889, 9533788, 9375029, 9211992, 9045329, 8875238, 8701605, 8524452, 8344897, 8165984, 7991804, 7825339, 7667578, 7518804, 7379858]
59531G379858j27931j15901j02773q8591p4388o1372m9234l6645k3449j0939K61
59520F688896J1089K2205L2541M0600M6473N1652N7235O3102O8484P2851P6349
59509G231477P9775Q3950Q8983R4596J01265J10312J22291J35965J49689J63465
59499H361768J78768J96400K15432K34486K53380K73074K94467L17720L42495
59490A0667990L68272L94292M19426M42338M61997M78174M91258N01203N06622
59481A4731572N05454M96689M81020M59607M32881M01271L66379L30131K92673
59472A8497677K52477K09283J66047J26969R4132O7049M5232K9799K2209K2538
59462A9533412K9968M4280O5740R3368J24238J54764J82086K03753K16637K17051
$$ y = [7379858, 7251927, 7136026, 7033253, 6944662, 6870274, 6808902, 6759668, 6723023, 6699574, 6688635, 6688896, 6699985, 6722190, 6754731, 6795331, 6841804, 6893456, 6950691, 7013793, 7082277, 7155128, 7231477, 7311252, 7395202, 7484185, 7578781, 7680046, 7790358, 7912649, 8048614, 8198303, 8361768, 8540536, 8736936, 8952368, 9186854, 9440234, 9713308, 10007775, 10325495, 10667990, 11036262, 11430554, 11849980, 12292318, 12754315, 13232489, 13723747, 14224950, 14731572, 15237026, 15733715, 16214735, 16674342, 17107223, 17508494, 17874873, 18205004, 18497677, 18750154, 18959437, 19125484, 19252453, 19346585, 19413634, 19458866, 19488665, 19510874, 19533412, 19563380, 19607660, 19673400, 19766768, 19891006, 20045770, 20227856, 20431609, 20648246, 20865297]
59452B0865297K01989J69913J20660N5481k2763j10312k03824l00427l96160m85451
59442A9894403n63058o26104o73516p04318p17869p15392o99739o73448o38169
59433A3882790n96091n50409n03675m56642m09319l62337l16738k73224k32175
59424A0182180j93622j56686j20075q3751m9217j7342J3201M4457P6843J09297
59414I805285J41033J72089K02514K32001K60173K86603L10849L32813L52183
59405A2095543L66874L73135L68468L53723L30917K99662K57341K02609J37233
59396A4785505O4507j2568r1146j67949k39714l03934l59062m04489m40202m65967
59386A2364981m81032m85389m80914m70405m55576m36865m14847l90797l65880
$$ y = [20865297, 21067286, 21237199, 21357859, 21413340, 21390577, 21280265, 21076441, 20776014, 20379854, 19894403, 19331345, 18705241, 18031725, 17327407, 16609538, 15894146, 15194407, 14520959, 13882790, 13286699, 12736290, 12232615, 11775973, 11366654, 11004317, 10687579, 10414355, 10182180, 9988558, 9831872, 9711797, 9628046, 9578829, 9561487, 9574688, 9619145, 9695988, 9805285, 9946318, 10118407, 10320921, 10552922, 10813095, 11099698, 11410547, 11743360, 12095543, 12462417, 12835552, 13204020, 13557743, 13888660, 14188322, 14445663, 14648272, 14785505, 14850012, 14837444, 14746298, 14578349, 14338635, 14034701, 13675639, 13271150, 12830948, 12364981, 11883949, 11398560, 10917646, 10447241, 9991665, 9554800, 9139953, 8749156, 8383276]
59377H383276l40702l15643k90855k66090k41422k17830j96131j75704j55395
59368F183504j35469j17290j01294q6626p2786o0063m8111l5676k2446r981L1
59357E493793P703J4610K2114L0360L8514M5891N3083O1436P0535P7118P8038
59346E993195P4071O9235O6666O7023P0548P8030Q9070J01900J16025J32770J51674
59335G010207J68581J79653J86165J93267K04912K21920K43972K70916L01816
59326H981409L34835L69015M05295M45275M89720N38229N89622O42485O95970
59317A3491855P50264Q05712Q61370R14604R61983J000172J026276J037861J032888
59308B1882985J009873R68822R12375Q45388P72669O97138O20241N43322M67954
$$ y = [8383276, 8042574, 7726931, 7436076, 7169986, 6928564, 6710734, 6514603, 6338899, 6183504, 6048035, 5930745, 5829451, 5742825, 5670039, 5609976, 5561865, 5526189, 5503743, 5493762, 5493793, 5501496, 5516106, 5538220, 5568580, 5607094, 5652985, 5706068, 5767504, 5838039, 5915157, 5993195, 6067266, 6136501, 6203167, 6270190, 6340738, 6418768, 6507838, 6609738, 6725763, 6858533, 7010207, 7178788, 7358441, 7544606, 7737873, 7942785, 8164705, 8408677, 8679593, 8981409, 9316244, 9685259, 10090554, 10535829, 11025549, 11563778, 12153400, 12795885, 13491855, 14242119, 15047831, 15909201, 16823805, 17785788, 18785960, 19812236, 20850097, 21882985, 22892858, 23861680, 24774055, 25619443, 26392112, 27089250, 27709491, 28252813, 28720767]
59299B8720767L95450L26572K61198J97565J32407O2622j3121r4606j80902k70200
59289B9537752l59553m46034n27997o04276o72423p29208p73295q06638q32593
59280B3785735q53017q67458q74710q74411q67117q53287q32747q05427p72284
59271A6185277p35030o94909o52325o07724n62288n17269m73067m29573l87190
59262A1125902l47034l09927k75468k42378k09946j79102j51653j28139j06785
59253I175470q5208o2992m1987k4105r547K749J3651K3166L0754L5978L8997M0259
59241I137185L9534L5817K8911K0570J2968O370l88p339j2964j6417j8354j8991
59229I206902j6985j1231k338Q715K2057L7929N5476P3946R4002J16211J39079
$$ y = [28720767, 29116217, 29442789, 29703987, 29901552, 30033959, 30096581, 30083460, 29988854, 29807952, 29537752, 29178199, 28732165, 28204168, 27599892, 26927469, 26198261, 25424966, 24618328, 23785735, 22932718, 22065260, 21190550, 20316139, 19449022, 18595735, 17762988, 16957561, 16185277, 15450247, 14755338, 14103013, 13495289, 12933001, 12415732, 11942665, 11513092, 11125902, 10778868, 10468941, 10193473, 9951095, 9741149, 9562047, 9410394, 9282255, 9175470, 9090262, 9027270, 8985283, 8961178, 8951631, 8954380, 8968031, 8991197, 9021951, 9057929, 9096926, 9137185, 9176719, 9212536, 9241447, 9262017, 9274985, 9281355, 9280967, 9273628, 9260664, 9244247, 9225893, 9206902, 9189917, 9178686, 9176348, 9185063, 9207120, 9245049, 9300525, 9374471, 9468473, 9584684, 9723763]
59218I723763J60306J79432J97560K14755K29528K40760K48171K50376K44349
59209A1689000K28051K02727J71562J36778R9119N9760K1284j3836m5082p3463
59199A2475900r9355j21448j38028j48651j54115j55418j53696j50759j48341
59190A1206089j46447j43445j38285j31917j26060j21280j16914j12191j06691
59181A0062859j00093r2126q2697p1697n8874m3925k6387n577J8722M5587P3904
59170I719696J04132J38019J76262K17456K59924L03451L48527L94798M41105
59161A2103370M86112N27961N63997N91782O09720O15827O06529N77906N28029
59152A7211233M57530L68405K63119J44525J5984j18219k52144l78602m91235
$$ y = [9723763, 9884069, 10063501, 10261061, 10475816, 10705344, 10946104, 11194275, 11444651, 11689000, 11917051, 12119778, 12291340, 12428118, 12527237, 12586997, 12608281, 12594445, 12549363, 12475900, 12376545, 12255097, 12117069, 11968418, 11814303, 11658885, 11505189, 11354430, 11206089, 11059642, 10916197, 10777912, 10645995, 10519935, 10398655, 10281741, 10169550, 10062859, 9962766, 9870640, 9787943, 9716246, 9657372, 9613447, 9587060, 9581483, 9600205, 9645792, 9719696, 9823828, 9961847, 10138109, 10355565, 10615489, 10918940, 11267467, 11662265, 12103370, 12589482, 13117443, 13681440, 14273222, 14882942, 15498769, 16105298, 16683204, 17211233, 17668763, 18037168, 18300287, 18444812, 18460796, 18342577, 18090433, 17711831, 17220596]
59143A7220596n86125o61195p14991p46993p58638p53117p34172p05220o68974
59134A0891171o27235n81515n34062m87587m43582m01906l62474l26244k93900
59125F832666k64746k37846k13220j90926j70142j50321j32231j16552j02393
59116E254289q8563p5408o3911n3733m3741l3814k4587j5952p438N20P384J4158
59104D869204K2425L1875M0625M7901N4728O1912O9025P5644Q1991Q7914R2667
59093E535911R6265R9826J03998J07950J10260J10058J07233J02522R7318R2263
59083F563604Q5927P6118O2746M8233L4789K2481J0353j750j3051k2635k9699
59072F837116l3697l4696l3219k9543k3710j6201p766J599J2858K6764M2931O0111
$$ y = [17220596, 16634471, 15973276, 15258285, 14511292, 13752654, 12999537, 12265365, 11560145, 10891171, 10263936, 9682421, 9148359, 8660772, 8217190, 7815284, 7452810, 7126566, 6832666, 6567920, 6330074, 6116854, 5925928, 5755786, 5605465, 5473234, 5356682, 5254289, 5165726, 5090318, 5026407, 4972674, 4928933, 4895119, 4870532, 4854580, 4847142, 4847662, 4855046, 4869204, 4891629, 4923504, 4964129, 5012030, 5066758, 5128670, 5197695, 5273339, 5355330, 5443244, 5535911, 5632176, 5732002, 5836000, 5943950, 6054210, 6164268, 6271501, 6374023, 6471341, 6563604, 6649531, 6725649, 6788395, 6836628, 6871417, 6893898, 6904251, 6902501, 6889450, 6866815, 6837116, 6803419, 6768723, 6735504, 6705961, 6682251, 6666050, 6658284, 6659883, 6672741, 6699505, 6742436, 6802547]
59060F802547P7033R3076J08662J24901J42363J60460J78488J96734K15772K35241
59050H335277K54249K72610K90691L08436L25519L41881L56965L68787L75012
59041A1229427L74652L67541L52823L29285K96667K54903K02779J39510O7553
59032A3615140q292q4613j59972k31822k95728l48914l92241m27150m52609m66907
59022A0746892m71035m68211m60793m49279m33790m15073l94185l72269l50490
59013F931767l29390l08670k88176k68633k50670k33703k16668j99583j83599
59004D652675j69688j57829j47271j37095j26744j16460j07113r9287r2696q6601
58994C411891q0476p4102o7501o1004n5120n0120m5992m2704m0167l8043l6181
$$ y = [6802547, 6879580, 6972656, 7081318, 7206219, 7348582, 7509042, 7687530, 7884264, 8100036, 8335277, 8589526, 8862136, 9152827, 9461263, 9786782, 10128663, 10485628, 10854415, 11229427, 11604079, 11971620, 12324443, 12653728, 12950395, 13205298, 13408077, 13547587, 13615140, 13606848, 13522235, 13362263, 13130441, 12834713, 12485799, 12093558, 11666408, 11213799, 10746892, 10275857, 9807646, 9346853, 8897574, 8463784, 8048711, 7654526, 7282257, 6931767, 6602377, 6293707, 6005531, 5736898, 5486228, 5252525, 5035857, 4836274, 4652675, 4482987, 4325158, 4177887, 4040792, 3914048, 3797588, 3690475, 3591188, 3498492, 3411891, 3331415, 3257313, 3189812, 3128808, 3073688, 3023568, 2977576, 2934872, 2894705, 2856662, 2820481]
58983B820481l5093l5345l6420l6875l5748l3320l0480k7865k5559k3133k0131
58972B480512j6795j3838j1084p309k380J639L179L982P032J2047J5582J5725
58960B488292J4134J2738J1126Q551O154N168M621L086J599K487N733Q573Q998
58947B581260Q034Q112J0163J2910J4465J4157J2843J1637J0640R373Q028P482
58935B709104P763P654O312M585M062N225P048Q136Q042P679Q515J1062J4333
58922B809520J7215J9775K2445K4748K6148K7560L0115L2754L3302L2110L2262
58911C107954L5484M0144M4273M8207N2647N6340N7877N8305N9745O2414O5004
58900C688394O7114O9308P1447P3051P4943P8583Q3829Q9007R3169R6857J00782
$$ y = [2820481, 2785388, 2750043, 2713623, 2676748, 2641000, 2607680, 2577200, 2549335, 2523776, 2500643, 2480512, 2463717, 2449879, 2438795, 2431486, 2429106, 2430745, 2433924, 2437906, 2444938, 2456985, 2472567, 2488292, 2502426, 2515164, 2526290, 2534841, 2540995, 2546163, 2550784, 2553870, 2555469, 2557956, 2563689, 2572262, 2581260, 2589294, 2597406, 2607569, 2620479, 2634944, 2649101, 2661944, 2673581, 2684221, 2693594, 2701622, 2709104, 2716867, 2724521, 2730833, 2735418, 2739480, 2744705, 2751753, 2759889, 2767931, 2775610, 2784125, 2795187, 2809520, 2826735, 2846510, 2868955, 2893703, 2919851, 2947411, 2977526, 3010280, 3043582, 3075692, 3107954, 3143438, 3183582, 3227855, 3276062, 3328709, 3385049, 3442926, 3501231, 3560976, 3623390, 3688394, 3755508, 3824816, 3896263, 3969314, 4044257, 4122840, 4206669, 4295676, 4388845, 4485702, 4586484]
58889D586484J05223J10617J17234J24285J30772J37214J45114J54633J64441
58880E776017J74044J84528J96458K08730K20509K32987K47799K64544K81420
58871G787036K98019L16148L37565L61925L87638M14159M42572M73957N07926
58862A1326945N43319N79931O18920O61433P07421P55938Q06141Q57693R10361
58853A7768102R63374J015050J063155J105807J141769J169264J184836J184083
58845B6595440J163496J120800J053656R59341Q36287O85354N09562L13683J04675
58836C3342294j08473l16395n11025o85951q36450r59982j056070j125117j167860
58827B6574971j186214j183689j164155j130754j086419j034673r78974r21555
$$ y = [4586484, 4691707, 4802324, 4919558, 5043843, 5174615, 5311829, 5456943, 5611576, 5776017, 5950061, 6134589, 6331047, 6539777, 6760286, 6993273, 7241072, 7505616, 7787036, 8085055, 8401203, 8738768, 9100693, 9488331, 9902490, 10345062, 10819019, 11326945, 11870264, 12450195, 13069115, 13730548, 14437969, 15193907, 16000048, 16857741, 17768102, 18731476, 19746526, 20809681, 21915488, 23057257, 24226521, 25411357, 26595440, 27758936, 28879736, 29933392, 30892733, 31729020, 32414374, 32923936, 33237619, 33342294, 33233821, 32917426, 32406401, 31720450, 30884000, 29924018, 28867948, 27742831, 26574971, 25388757, 24205068, 23040913, 21910159, 20823740, 19789067, 18810093, 17888538]
58819A7888538q63487q05593p49010o95222o45718o01059n60211n21723m85704
58810A1960811m53608m25686l99933l74282l48812l24841l02766k81837k61412
58801H787634k41399k21833k02907j85160j68917j53725j38726j23466j08205
58792G243296r3803q1069o9507n6949m1742k5203j0445J502J2744K5380L9233
58781F943437N3323O7629Q2191R6294J09939J24437J40105J55124J68408J81853
58771H122740J97697K15197K32275K49142K67685K88227L09709L32471L58093
58762A0573236L86477M15831M45671M77486N12201N49349N89211O33251O81548
58753A5264261P31884P82455Q33682Q86280R39237R90681J039099J082201J115792
$$ y = [17888538, 17025051, 16219458, 15470448, 14775226, 14129508, 13528449, 12968238, 12446515, 11960811, 11507203, 11081517, 10681584, 10307302, 9958490, 9633649, 9330883, 9049046, 8787634, 8546235, 8324402, 8121495, 7936335, 7767418, 7613693, 7474967, 7351501, 7243296, 7149493, 7068424, 6998917, 6941968, 6900226, 6875023, 6864578, 6866080, 6878824, 6904204, 6943437, 6996760, 7064389, 7146580, 7242874, 7352813, 7477250, 7617355, 7772479, 7940887, 8122740, 8320437, 8535634, 8767909, 9017051, 9284736, 9572963, 9882672, 10215143, 10573236, 10959713, 11375544, 11821215, 12298701, 12810902, 13360251, 13949462, 14582713, 15264261, 15996145, 16778600, 17612282, 18498562, 19437799, 20428480, 21467579, 22549780, 23665572]
58744B3665572J135369J138136J122329J085266J023305R33642Q15422O69693
58736C1588734M99277L08808J04462j06375l15281n13505o93299q48968r77108
58727B9046745j076639j148507j194565j216530j216614j198866j168408j128789
58719A9697827j081219j027012r69513r12350q56674q01685p47667o96923o51268
58710A1953516o09922n70825n33340m98574m67159m37921m09244l80970l54299
58701G691262l30147l08413k88603k70284k52858k35755k19214k04098j90585
58692E391305j77767j64960j52655j41518j31204j21059j11532j03784r7883r2360
58682D096583q5804p8435p1712o6570o2345n7651n2251m7617m5130m4053m2249
$$ y = [23665572, 24800941, 25939077, 27061406, 28146672, 29169977, 30103619, 30919041, 31588734, 32088011, 32396819, 32501281, 32394906, 32079625, 31566120, 30872821, 30023853, 29046745, 27970106, 26821599, 25627034, 24410504, 23193890, 21995024, 20826616, 19697827, 18616608, 17589596, 16620083, 15707733, 14851059, 14049374, 13301707, 12604784, 11953516, 11343594, 10772769, 10239429, 9740855, 9273696, 8835775, 8426531, 8045561, 7691262, 7361115, 7052702, 6764099, 6493815, 6240957, 6005202, 5785988, 5581890, 5391305, 5213538, 5048578, 4895923, 4754405, 4623201, 4502142, 4390610, 4286826, 4188943, 4096583, 4010779, 3932344, 3860632, 3794062, 3731717, 3674066, 3621815, 3574198, 3529068, 3485015, 3442766]
58671C442766l8952l5842l4965l6373l8364l9375l9117l8425l8598m0469m3668
58660C018618m6974m9534n1349n2614n3492n4550n6333n8102n8081n5607n2153
58649B429829m9687m8890m9264m9832m9194m6274m1963l8836l8143l8127l6490
58638A943129l3487l1253l0770l0907l0165k8225k5906k4280k3646k3065k1462
58627A639963j9224j7582j6164j2917p280j727J221K071K951M468N712O345O763
58614A594600O857O142M738K813j00l893o875p552o718o245o535o702o381n654
58600A558495m003j237J143J484L82k76j34j88k56J208M672Q796J2334J5219J7755
58585A615394K0246K3271K6913K9927L1219L1859L4066L8308M2939M6441M8572
$$ y = [3442766, 3403814, 3367972, 3333007, 3296634, 3258270, 3218895, 3179778, 3141353, 3102755, 3062286, 3018618, 2971644, 2922110, 2870761, 2818147, 2764655, 2710105, 2653772, 2595670, 2537589, 2481982, 2429829, 2380142, 2331252, 2281988, 2232156, 2182962, 2136688, 2094725, 2055889, 2017746, 1979619, 1943129, 1909642, 1878389, 1847619, 1816712, 1786547, 1758322, 1732416, 1708136, 1684490, 1661425, 1639963, 1620739, 1603157, 1586993, 1574076, 1566796, 1565069, 1566290, 1568361, 1571312, 1575780, 1581492, 1587837, 1594600, 1601457, 1607599, 1612337, 1615150, 1615050, 1611157, 1604282, 1596730, 1590012, 1583767, 1577232, 1570530, 1564149, 1558495, 1554492, 1553255, 1554398, 1555882, 1556264, 1555988, 1555854, 1555666, 1555410, 1556618, 1561290, 1570086, 1582420, 1597639, 1615394, 1635640, 1658911, 1685824, 1715751, 1746970, 1778829, 1812895, 1851203, 1894142, 1940583, 1989155]
58574A989155M9825N1364N5002O1341O8355P3674P7894Q3529R1199R9209J06778
58563B807325J15167J25244J36307J47811J60288J74047J88784K04837K22777
58554D282587K41489K58686K73930K89138L05368L20875L32958L39861L40247
58545F985139L32710L16647K91998K57471K10909J52490Q6128J6808n1966j17465
58535H480869j76445k26089k65293k94065l12653l22005l23858l19504l09545
58526E931412k95480k80070k64921k48831k29941k08871j88473j70697j54922
58517C889206j39513j24314j11021j01040r3610q6652p9349p2706o7308o2200
58507B951493n6931n3049n1732n1218m8857m4953m2252m2010m2929m3962m5655
$$ y = [1989155, 2038980, 2090344, 2145346, 2206687, 2275042, 2348716, 2426610, 2510139, 2601338, 2700547, 2807325, 2922492, 3047736, 3184043, 3331854, 3492142, 3666189, 3854973, 4059810, 4282587, 4524076, 4782762, 5056692, 5345830, 5651198, 5972073, 6305031, 6644892, 6985139, 7317849, 7634496, 7926494, 8183965, 8394874, 8547364, 8633492, 8650300, 8598334, 8480869, 8304424, 8078335, 7813042, 7518977, 7206324, 6884319, 6560461, 6240957, 5931412, 5635932, 5355862, 5090941, 4842110, 4612169, 4403298, 4214825, 4044128, 3889206, 3749693, 3625379, 3514358, 3413318, 3319708, 3233056, 3153707, 3081001, 3013693, 2951493, 2894562, 2841513, 2789781, 2738563, 2689706, 2644753, 2602501, 2560491, 2517562, 2473600, 2427945]
58496B427945m8331n1038n3000n4459n5480n5431n4066n1920m9356m6420m3549
58485A864895m1017l7919l3299k8140k4549k3003k2070k0768j9426j8241j6798
58474A579665j5168j3918j3028j2151j1685j2014j2318j1846j1643j2884j4441
58463A438569j4603j4416j6326j9991k2642k3468k4311k5753k5940k3947k1184
58452A205988j8660j5755j2528j0365r409q095o067m951n331n687n183m735m486
58439A094736l078m62J385J632J787K736L361L095L005L290K658J168P25J599
58425A117637J721N73L81K021L191K451J537J801J793N52k82J3q49l896o012m504
58409A118128j525n20r59k74J238J323j88j690k890m379n363m829l947m524o119
$$ y = [2427945, 2379614, 2328576, 2275576, 2221117, 2165637, 2110206, 2056140, 2004220, 1954864, 1908444, 1864895, 1823878, 1785959, 1752660, 1724520, 1699971, 1676968, 1654898, 1634130, 1614704, 1596463, 1579665, 1564497, 1550579, 1537551, 1525400, 1513715, 1501701, 1489383, 1477537, 1465894, 1453010, 1438569, 1423966, 1409550, 1393224, 1373233, 1350591, 1327123, 1302812, 1277059, 1251119, 1227172, 1205988, 1187328, 1171573, 1159045, 1148680, 1139271, 1131176, 1125109, 1120158, 1114827, 1109140, 1103957, 1099222, 1094736, 1091658, 1091196, 1092581, 1094213, 1096000, 1098736, 1102097, 1105192, 1108197, 1111487, 1114145, 1115313, 1116038, 1117637, 1119358, 1119931, 1120312, 1122333, 1125524, 1127975, 1129512, 1131313, 1133106, 1133658, 1133376, 1133389, 1132540, 1128644, 1122632, 1118128, 1116603, 1116083, 1115124, 1114850, 1116088, 1117411, 1117223, 1115533, 1112643, 1108264, 1102901, 1098072, 1094125, 1089601, 1083482]
58394A083482p045p128p061o355m375k180j022j89J399K864K879K152K068K135
58380A061624J255K96Q75K475L228K870K825L957N815P413P523N380K231N39O62
58365A108968K90j578k688j355N22O15r5M83J915K668L328N324P999R756J0797
58350A146949J2162J3423J3814J4157J5299J6125J5582J4982J5695J6245J4389
58339A308822J0628P028L959O57k485m823p176j0066j1717j0510p954o654o725
58326A262984o803p000q004q716p668n574l945k546o06J007J413J891L791N931
58312A226155O715P156Q995J1524J3010J3663J4472J4827J4016J3318J3911J4578
58300A372340J4129J3975J5463J6968J6605J5601J5813J6280J5569J5019J6168
$$ y = [1083482, 1076437, 1069309, 1062248, 1055893, 1051518, 1049338, 1048316, 1048127, 1049526, 1052390, 1055269, 1057421, 1059489, 1061624, 1062879, 1063175, 1064050, 1066525, 1069753, 1072623, 1075448, 1079405, 1085220, 1092633, 1100156, 1105536, 1107767, 1108306, 1108968, 1109258, 1107680, 1104992, 1103637, 1104159, 1104774, 1104679, 1105162, 1107077, 1109745, 1113073, 1118397, 1126396, 1136152, 1146949, 1159111, 1172534, 1186348, 1200505, 1215804, 1231929, 1247511, 1262493, 1278188, 1294433, 1308822, 1319450, 1326478, 1330437, 1331094, 1328609, 1323786, 1316610, 1306544, 1294827, 1284317, 1276363, 1269709, 1262984, 1256181, 1249181, 1241177, 1232461, 1224793, 1219219, 1215274, 1212728, 1212122, 1213129, 1214542, 1216433, 1220224, 1226155, 1232870, 1240026, 1249021, 1260545, 1273555, 1287218, 1301690, 1316517, 1330533, 1343851, 1357762, 1372340, 1386469, 1400444, 1415907, 1432875, 1449480, 1465081, 1480894, 1497174, 1512743, 1527762, 1543930]
58289A543930J7397J6799J5803J6197J6150J3451J0142R389J0065R220P734Q496
58277A694773J0695J1088R725R642J1797J4620J7393J9997K0901J9583J9127K1948
58265A881289K5123K4727K2580K3336K6772K8803K8702K9405L1518L2810L3072
58254B188137L4047L5036L3815L1437L1064L2643L3534L3540L4337L4987L3251
58243B555828L0350K9183K8959K6853K3948K3941K6908K9841L2249L5727L9216
58232B883003M0459M0934M3608M7212M8647M9239N2158N5511N5145N2830N4070
58221C422816N8937O2743O5004O9699P6989Q2694Q6123R0713R6855J01647J05800
58210D320020J12858J21506J26571J28072J31272J37422J42521J45820J51357
$$ y = [1543930, 1561327, 1578126, 1593929, 1610126, 1626276, 1639727, 1649869, 1659258, 1669323, 1678543, 1686277, 1694773, 1705468, 1716556, 1726281, 1735923, 1747720, 1762340, 1779733, 1799730, 1820631, 1840214, 1859341, 1881289, 1906412, 1931139, 1953719, 1977055, 2003827, 2032630, 2061332, 2090737, 2122255, 2155065, 2188137, 2222184, 2257220, 2291035, 2322472, 2353536, 2386179, 2419713, 2453253, 2487590, 2522577, 2555828, 2586178, 2615361, 2644320, 2671173, 2695121, 2719062, 2745970, 2775811, 2808060, 2843787, 2883003, 2923462, 2964396, 3008004, 3055216, 3103863, 3153102, 3205260, 3260771, 3315916, 3368746, 3422816, 3481753, 3544496, 3609500, 3679199, 3756188, 3838882, 3925005, 4015718, 4112573, 4214220, 4320020, 4432878, 4554384, 4680955, 4809027, 4940299, 5077721, 5220242, 5366062, 5517419]
58201E517419J60140J68783J76818J87581K01130K13879K25817K40378K56847
58192G348792K70703K81580K93159L05755L17121L29480L46780L66273L82341
58183A0241984L97180M17274M41120M61930M81107N06385N37420N66505N93367
58174A4644272O25569O63930P01665P38646P81970Q31665Q80847R31016R91181
58165B1790761J060176J126386J187126J251551J322388J392702J463579J546557
58157C2141226J645348J753590J873018K013585K173017K338549K512477K712842
58149D9163652K945083L198101L472618L786730M149169M557294N028254N601313
58141H1902214O303123P143731Q150701R365895J0799416J2426588J4231705J6201515
$$ y = [5517419, 5677559, 5846342, 6023160, 6210741, 6411871, 6625750, 6851567, 7091945, 7348792, 7619495, 7901075, 8194234, 8499989, 8817110, 9146590, 9493370, 9859643, 10241984, 10639164, 11056438, 11497558, 11959488, 12440595, 12946980, 13484400, 14050905, 14644272, 15269841, 15933771, 16635436, 17374082, 18156052, 18987717, 19868564, 20799580, 21790761, 22850937, 23977323, 25164449, 26416000, 27738388, 29131090, 30594669, 32141226, 33786574, 35540164, 37413182, 39426767, 41599784, 43938333, 46450810, 49163652, 52108735, 55306836, 58779454, 62566184, 66715353, 71272647, 76300901, 81902214, 88205337, 95349068, 103499769, 112865664, 123665080, 136091668, 150323373, 166524888]
58133A66524888J8275490K0378226K2521994K4813682K7367599L0297708L3682430
58126C43862017L7130566L9128604L7179443K9324987J5966718R6493j4486635
58119D88202193k5310809l1916227l5062479l5730475l4734065l2724854l0184097
58112B62539187k7403552k4559154k1780851j9138376j6640600j4303312j2178163
58105A26535179j0293473q620941p127248n806940m640956l581383k610060j754918
58097H2099260j012118l26363K71016N49192K15835p92245k193477l549211m541310
58088G0720579n083722n247283n144605m874656m515467m124142l734069l358038
58080C4638597k999142k661089k350270k071576j826321j614193j433526j279392
$$ y = [166524888, 184800378, 205178604, 227700598, 252514280, 279881879, 310179587, 343862017, 380992583, 420121187, 457300630, 486625617, 502592335, 502688828, 488202193, 462891384, 430975157, 395912678, 360182203, 325448138, 292723284, 262539187, 235135635, 210576481, 188795630, 169657254, 153016654, 138713342, 126535179, 116241706, 107620765, 100493517, 94686577, 90045621, 86464238, 83854178, 82099260, 81087142, 80760779, 81031795, 81580987, 81796822, 81004577, 78811100, 75261889, 70720579, 65636857, 60389574, 55244969, 50370313, 45854846, 41730704, 37996635, 34638597, 31639455, 28978366, 26628096, 24556520, 22730199, 21116006, 19682480, 18403088]
58072A8403088j145803j030842r35592q57644p90909p32639o84819o46704o11870
58063A0966266n75277n38122n03164m70105m38162m08497l81354l54901l29052
58054F967632l06545k88577k73453k60697k51723k45063k36181k23829k11681
58045D669883k01770j91499j79183j67346j57787j48202j36666j25139j15757
58036C246534j07462r9013r1654q6370q1860p7407p4397p3134p1559o8897o7058
58025B347723o6733o5736o2922o0259n9233n8593n7128n5264n2595m7565m0988
58014A720707l6161l4040l2140k9545k8761l0761l2388l0925k7608k4555k1802
58003A392021j9310j8332j8664j7943j5556j3803j3614j3026j1671j2491j6533
$$ y = [18403088, 17257285, 16226443, 15290851, 14433207, 13642298, 12909659, 12224840, 11578136, 10966266, 10390989, 9852867, 9349703, 8879598, 8441436, 8032939, 7651585, 7296684, 6967632, 6661087, 6372510, 6099057, 5838360, 5586637, 5341574, 5105393, 4881564, 4669883, 4468113, 4276614, 4097431, 3930085, 3772298, 3624096, 3487430, 3362291, 3246534, 3139072, 3040059, 2948405, 2862035, 2780175, 2702768, 2628371, 2555237, 2483678, 2414781, 2347723, 2280990, 2215254, 2152332, 2092073, 2032840, 1974247, 1917119, 1861855, 1809260, 1761695, 1720707, 1684546, 1650506, 1618366, 1588821, 1560060, 1529299, 1496911, 1465986, 1438378, 1413823, 1392021, 1372711, 1354379, 1335715, 1317772, 1302216, 1288413, 1274799, 1261773, 1250102, 1237611, 1221078]
57992A221078k0198k0505j9286j9043j8511j5788j2577j1425j1305r758p356o550
57980A048776p576q556q372p056m727k377j957l625m671l272j272j093j933j548
57966I90741m7Q10O50L62P9n53j169j620k799m807n711m107j555m98j052j785
57950I66939k486l924n848p231q093r309j0973j2209j2264j0896q377n832m690
57937H64807n125n979o586p314p934p315n655n147p175j0269j1974j1407r056
57924G63871n658k456r58j176j245P9J754K297J944J893K515L380M096M312L762
57909G78410K783J892Q10q15k008j623p71j710m238n669m959m049m404n063n260
57894G43326o077p900q881p896o725p264q566q553o951m752k482p16m53j316j082
$$ y = [1221078, 1200880, 1180375, 1161089, 1142046, 1123535, 1107747, 1095170, 1083745, 1072440, 1062682, 1055326, 1048776, 1041200, 1032644, 1024272, 1017216, 1012489, 1010112, 1008155, 1004530, 999859, 996587, 995315, 994222, 992289, 990741, 990694, 991504, 992154, 992516, 992595, 992042, 990873, 989253, 986454, 981647, 975936, 971829, 970274, 969776, 968724, 966939, 964453, 960529, 954681, 947450, 939357, 930048, 919075, 906866, 894602, 883706, 875329, 869497, 864807, 859682, 853703, 847117, 839803, 831869, 824554, 818899, 813752, 806577, 796308, 784334, 772927, 763871, 758213, 755757, 754799, 753623, 752378, 752457, 754211, 756508, 758452, 760345, 762860, 766240, 770336, 774648, 778410, 781193, 783085, 783895, 783080, 781072, 779449, 778678, 776968, 772730, 767061, 762102, 758053, 753649, 748586, 743326, 737249, 729349, 720468, 712572, 705847, 698583, 690017, 681464, 674513, 669761, 667279, 666563, 666110, 664794, 663712]
57879F63712J191L351L235J755J019J083P17q1n63j154k896n707q703j1297j2875
57864F32787j2704j1414j0971j1827j1855r546o390m360l022j232L55P89J184
57851E51794K986N270O332O648P698Q969Q951Q242Q802J0535J1289J0064P957
57838F55537O004M297L109K864L011K642J968J587P33j618m394n308m177l300
57824F62955m323o533q556r954j0714j0649r888q946p968o687n179l889k998k549
57810E64122k725l194k740o53K048L915N083O613Q344Q937P891O214N062M816
57796F13733N298N868N456L617J366J06j08l00j015j892k584l079l467m004n045
57781F13950o271o723o287o248p363q512q425p727p781q314p998o823o194o810
$$ y = [663712, 664903, 668254, 671489, 673244, 674263, 675346, 676063, 675982, 675419, 674265, 671369, 665662, 656959, 645662, 632787, 620083, 608669, 597698, 585871, 574016, 564470, 558080, 553720, 550698, 549466, 549821, 550610, 551794, 554780, 560050, 566382, 573030, 580728, 589697, 598648, 606890, 615692, 626227, 637516, 647580, 655537, 661541, 665838, 668947, 671811, 674822, 677464, 679432, 681019, 681752, 680134, 675740, 670432, 666255, 662955, 658632, 652099, 643543, 633589, 622875, 612226, 602338, 593392, 585424, 578737, 573558, 569669, 566671, 564122, 561397, 558203, 555463, 554810, 556858, 560773, 565856, 572469, 580813, 589750, 597641, 603855, 608917, 613733, 619031, 624899, 630355, 633972, 635338, 635444, 635336, 635036, 634021, 632129, 629545, 626466, 622999, 618995, 613950, 607679, 600956, 594669, 588421, 581058, 572546, 564121, 556394, 548613, 540299, 532301, 525478, 519284, 512474]
57767E12474p890q492q454q192q455r776j1398j1624j0220r298j0363j1736j0986
57754C85590q856q225r653j0566r121o472m525l494k528j212M01K176L643M291
57740C31449M344M315L852K367Q24J209L720N996N968M231K801K523K784L031
57726C79414L548M636N805O047M996L633L378M228M572L304J407N34P03N37o77
57711D26065k408l973n006n058m082l144l374m193l879j937L66J849K487K473
57697C96186J699P20Q33K432M278N147N444O338P950R220R386Q884Q654Q885Q721
57682D84777P382N474M592N436O965P917Q363R003R693R788R497R651J0321J0771
57668E99630J0716J0621J0830J1367J2395J3928J5272J5790J6071J7227J9202
$$ y = [512474, 504584, 496092, 487638, 479446, 470991, 461215, 449817, 438193, 427973, 418675, 408312, 396576, 385590, 376734, 368509, 358856, 348290, 339169, 332697, 328172, 324678, 322150, 320938, 321339, 323515, 327158, 331449, 335793, 340108, 343960, 346327, 347151, 348360, 352080, 358076, 364044, 368275, 371076, 373599, 376383, 379414, 382962, 387598, 393403, 399450, 404446, 408079, 411457, 415685, 420257, 423561, 424968, 425502, 426205, 426742, 426065, 423657, 419684, 414678, 409620, 405538, 402394, 399020, 394827, 390948, 389011, 389377, 391226, 393713, 396186, 397885, 398605, 399438, 401870, 406148, 411295, 416739, 423077, 431027, 440247, 449633, 458517, 467171, 476056, 484777, 492159, 497633, 502225, 507661, 514626, 522543, 530906, 539909, 549602, 559390, 568887, 578538, 588859, 599630, 610346, 620967, 631797, 643164, 655559, 669487, 684759, 700549, 716620, 733847, 753049]
57657G53049K0965K2258K3806K5699K6982K7149K6933K7277K8458L0503L3388
57646A046467L6513L8954M0582M2158M4212M6746N0041N4558N9753O4262O7712
57635A591958P1306P6150Q2063Q8431R5126J02021J08736J15743J24808J37272
57625B593614J52473J68517J84211J99721K15871K33352K52094K70869K87908
57616D558630L02161L13316L20241L20357L11290K92610K65316K30260J87841
57607G102022J38719Q3703K3140m2489j10843j76908k34456k78713l07971l23111
57597E873093l25958l18450l03211k83732k62886k41485k19167j96478j74953
57588C546773j55263j36771j19249j03622r0253p7851o5198n2900m2139l2452
$$ y = [753049, 774014, 796272, 820078, 845777, 872759, 899908, 926841, 954118, 982576, 1013079, 1046467, 1082980, 1121934, 1162516, 1204674, 1248886, 1295632, 1345673, 1400231, 1459984, 1524246, 1591958, 1663264, 1739414, 1821477, 1909908, 2005034, 2107055, 2215791, 2331534, 2456342, 2593614, 2746087, 2914604, 3098815, 3298536, 3514407, 3747759, 3999853, 4270722, 4558630, 4860791, 5174107, 5494348, 5814705, 6125995, 6418605, 6683921, 6914181, 7102022, 7240741, 7324444, 7347584, 7305095, 7194252, 7017344, 6782888, 6504175, 6196204, 5873093, 5547135, 5228685, 4925474, 4641742, 4378856, 4137371, 3918204, 3721726, 3546773, 3391510, 3254739, 3135490, 3031868, 2941615, 2863764, 2798566, 2745666, 2703527, 2671075]
57578B671075k2358j1756k072O063J3701K1823L0161L8435M7520N8187O9542Q0043
57566C000364Q9713J00108J12145J25211J38731J53163J68587J83340J95425K04880
57556D471667K13366K21252K26272K25374K16796J99942J74388J40118R8276N0766
57546F238217n22n3280j04063j49146j86292k15120k35993k49429k56481k58451
57536D529440k55875k48725k38043k26170k14512k01930j86780j70070j55008
57527B632327j43190j32880j21896j10806j01725r4730q7594p9158p0902o4331
57517A625115n8617n2387m6434m2613m0666l8251l4115k9272k4886k0903j7408
57506A219563j5421j5253j5429j4433j2430j0252p886n136k728j196N33L896Q496
$$ y = [2671075, 2648717, 2636961, 2634889, 2640952, 2654653, 2676476, 2706637, 2745072, 2792592, 2850779, 2920321, 3000364, 3090077, 3190185, 3302330, 3427541, 3566272, 3719435, 3888022, 4071362, 4266787, 4471667, 4685033, 4906285, 5132557, 5357931, 5574727, 5774669, 5949057, 6089175, 6187451, 6238217, 6237695, 6184415, 6080352, 5931206, 5744914, 5529794, 5293801, 5044372, 4787891, 4529440, 4273565, 4024840, 3786797, 3560627, 3346115, 3144185, 2957405, 2787335, 2632327, 2489137, 2356257, 2234361, 2123555, 2021830, 1927100, 1839506, 1760348, 1689446, 1625115, 1566498, 1514111, 1467677, 1425064, 1384398, 1346147, 1312032, 1282760, 1257874, 1236971, 1219563, 1204142, 1188889, 1173460, 1159027, 1146597, 1136345, 1128459, 1123323, 1120595, 1119399, 1119932, 1123828, 1132324]
57493A132324J2543J5269J7463J9743K1651K2695K3296K4292K6236K9252L2991
57482A377755L6733M0067M3453M7590N2436N7463O2583O8144P4126Q0125Q6035
57471B026510R2241R9244J07526J17506J28882J40277J50222J58458J65743J72515
57461C359124J78240J81790J81845J77065J66469J49671J26609R7519O3559K6782
57451D708673j1052m9074q6149j19798j47282j67368j80335j86832j87638j84144
57441C389001j77909j69802j60166j49477j38092j25841j12829j00208q9196p9589
57431B085892p0221o0555n0955m1748l3056k5365j9158j4089r323m486M76N979
57419A763391J2285J8585K3649K7469L1434L6980M4636N3920O3450P1654P8399
$$ y = [1132324, 1144867, 1160136, 1177599, 1197342, 1218993, 1241688, 1264984, 1289276, 1315512, 1344764, 1377755, 1414488, 1454555, 1498008, 1545598, 1598034, 1655497, 1718080, 1786224, 1860350, 1940475, 2026510, 2118751, 2217995, 2325521, 2443027, 2571909, 2712186, 2862408, 3020866, 3186609, 3359124, 3537364, 3719154, 3900999, 4078064, 4244533, 4394204, 4520813, 4618332, 4681891, 4708673, 4697621, 4648547, 4562398, 4442600, 4295318, 4127950, 3947615, 3760783, 3573145, 3389001, 3211092, 3041290, 2881124, 2731647, 2593555, 2467714, 2354885, 2254677, 2165481, 2085892, 2015671, 1955116, 1904161, 1862413, 1829357, 1803992, 1784834, 1770745, 1761422, 1756936, 1757412, 1763391, 1775676, 1794261, 1817910, 1845379, 1876813, 1913793, 1958429, 2012349, 2075799, 2147453, 2225852]
57408B225852Q5430R4423J05030J15785J26002J35704J44441J51621J57341J61352
57398C502981J61822J56670J45583J29046J06128P5479L8279j899m2180q1164
57388D190745j16760j45959j67649j83578j95530k03169k05554k03008j96583
57379B572955j87100j75720j64091j52908j41477j29394j17491j06455r6001q6282
57369A216036p8534p3091o8050o1448n3870m7479m3029l9213l4712k9702k5326
57358F61582k2408k0735j9319j7510j5793j5064j5095j4642j3153j1431j0281
57347D86151r524q798q268p986p367o107m815m113l670k709j062P11J852J909
57333D26204J220Q94J596K534K545J972K204L347L939L226K183J720J547J447
$$ y = [2225852, 2311282, 2405705, 2510735, 2626520, 2752522, 2888226, 3032667, 3184288, 3341629, 3502981, 3664803, 3821473, 3967056, 4096102, 4202230, 4277709, 4315988, 4314089, 4271909, 4190745, 4073985, 3928026, 3760377, 3576799, 3381269, 3178100, 2972546, 2769538, 2572955, 2385855, 2210135, 2046044, 1893136, 1751659, 1622265, 1504774, 1398319, 1302318, 1216036, 1137502, 1064411, 996361, 934913, 881043, 833564, 790535, 751322, 716610, 686908, 661582, 639174, 618439, 599120, 581610, 565817, 550753, 535658, 521016, 507863, 496432, 486151, 476627, 467829, 459561, 451575, 444208, 438101, 433286, 429173, 425503, 422794, 421732, 422443, 424295, 426204, 427424, 428318, 429914, 432448, 434993, 436965, 439169, 442516, 446455, 449681, 451864, 453584, 455131, 456578]
57319D56578K103L641M758M502L756L815M563N132N330N167M060J969M97J284
57305E07155L752N785O315O032N852N965O255O585O592O073N506N553O248P277
57291E90945Q563R787R813P874N111L716M315N373N556N574O865R246J1047J1473
57277F95258J1649J2720J3894J3603J2300J2494J5419J9082K0853K0899K1342
57266H69513K2694K3162K1704J9752J9268K0564K2778K5060K6478K5995K3829
57255A120797K1871K1591K2299K2512K2280K2796K4077K4521K3036K0602J9273
57244A365655K0098K2330K4488K5941K7331K9559L2718L6312M0039M3556M5881
57233A713908M6089M4848M4165M5160M6815M7530M7161M6957M7954N0137N2984
$$ y = [456578, 458681, 462322, 467080, 471582, 475338, 479153, 483716, 488848, 494178, 499345, 503405, 505374, 505871, 507155, 510907, 516692, 523007, 529039, 534891, 540856, 547111, 553696, 560288, 566361, 571867, 577420, 583668, 590945, 599508, 609295, 619108, 626982, 632093, 635809, 640124, 645497, 651053, 656627, 663492, 672738, 683785, 695258, 706907, 719627, 733521, 747124, 759424, 771918, 787337, 806419, 827272, 848171, 869513, 892207, 915369, 937073, 956825, 976093, 996657, 1019435, 1044495, 1070973, 1096968, 1120797, 1142668, 1164259, 1186558, 1209070, 1231350, 1254146, 1278223, 1302744, 1325780, 1346382, 1365655, 1385753, 1408083, 1432571, 1458512, 1485843, 1515402, 1548120, 1584432, 1624471, 1668027, 1713908, 1759997, 1804845, 1849010, 1894170, 1940985, 1988515, 2035676, 2082633, 2130587, 2180724, 2233708]
57222B233708N6212N9825O3641O7087O9742P1913P4130P5981P6280P4745P2344
57211B995608O9264O3824N4778M3756L3649K5221J7157R013K103k518m898m914
57199C302043k169K522P521J2700J9380K7423L4489L9147M2771M7162N1967N5727
57187C640683N7901N8405N6585N2257M6967M2759M0323L9228L9032L9215L9058
57176D152413L8918M0660M5453N1710N6633N9422O1636O4471O7053O7739O6127
57165D772235O3148N9619N5488N0897M7344M6788M9199N2092N3331N3594N5019
57154E358754N8210O2036O5734O9490P3024P5299P5849P5252P4205P3214P2780
57143F133847P2542P0706O5941N9496N3747M9000M3648L7183L0984K6132K2535
$$ y = [2233708, 2289920, 2349745, 2413386, 2480473, 2550215, 2622128, 2696258, 2772239, 2848519, 2923264, 2995608, 3064872, 3128696, 3183474, 3227230, 3260879, 3286100, 3303257, 3312270, 3314373, 3311855, 3306957, 3302043, 3299874, 3302396, 3309917, 3322617, 3341997, 3369420, 3403909, 3443056, 3485827, 3532989, 3584956, 3640683, 3698584, 3756989, 3813574, 3865831, 3912798, 3955557, 3995880, 4035108, 4074140, 4113355, 4152413, 4191331, 4231991, 4277444, 4329154, 4385787, 4445209, 4506845, 4571316, 4638369, 4706108, 4772235, 4835383, 4895002, 4950490, 5001387, 5048731, 5095519, 5144718, 5196810, 5250141, 5303735, 5358754, 5416964, 5479000, 5544734, 5614224, 5687248, 5762547, 5838396, 5913648, 5987853, 6061067, 6133847, 6206389, 6277095, 6343036, 6402532, 6456279, 6505279, 6548927, 6586110, 6617094, 6643226, 6665761]
57132F665761K0230J9452J9225J8033J6135J5274J5819J6019J4233J0227M428
57121F834836k121p311r651j0167j0725j1121j0296r353j0309j2635j4524j6812
57109F709811k1511k6957k9169k8348k9133l3561l8622m2279m6841n4115o1641
57098F297634o6622o9858p3014p5183p4885p2731o9885o6454o3273o2628o5539
57087E537562p0998p8857r0237j03944j16328j26298j36799j50021j65070j81722
57077D317288k01851k25165k48036k68831k90173l13812l37601l59763l81609
57068A690447m03853m24824D17186d8981m90660n15915n42303n74325o14550o61542
57058c448276p15737p81107q58659r44712j037877j140955j254031j374157j504755
$$ y = [6665761, 6685991, 6705443, 6724668, 6742701, 6758836, 6774110, 6789929, 6805948, 6820181, 6830408, 6834836, 6832715, 6825404, 6815753, 6805586, 6794861, 6783740, 6773444, 6764091, 6753782, 6741147, 6726623, 6709811, 6688300, 6661343, 6632174, 6603826, 6574693, 6541132, 6502510, 6460231, 6413390, 6359275, 6297634, 6231012, 6161154, 6088140, 6012957, 5938072, 5865341, 5795456, 5729002, 5665729, 5603101, 5537562, 5466564, 5387707, 5297470, 5193526, 5077198, 4950900, 4814101, 4664080, 4499010, 4317288, 4115437, 3890272, 3642236, 3373405, 3083232, 2769420, 2431819, 2072056, 1690447, 1286594, 861770, 417186, -48981, -539641, -1055556, -1597859, -2172184, -2786734, -3448276, -4164013, -4945120, -5803779, -6748491, -7786368, -8927323, -10181354, -11555511, -13060266]
57049a3060266j656820j837578k047024k288893k574552k911398l298065l736510
57041c3411106m238415m815103n473644o229032p107328q129735r305829j0645784
57033h9355976j2159178j3830832j5613999j7455018j9303759k1090992k2721971
57026b11531725k4106667k5174347k5862540k6147295k6084833k5693843k4674747
57019c89275997k2322100j7938485j1470688l709710M172151J1249356J7065413
57012d12230060K1464007K4425551K6073001K6676531K6545032K5917368K4954519
57005b36174051K3771832K2439135K0982216J9420687J7796371J6156268J4531923
56998a01075619J2951336J1451577J0063403Q797396P656898O649750N775918
$$ y = [-13060266, -14717086, -16554664, -18601688, -20890581, -23465133, -26376531, -29674596, -33411106, -37649521, -42464624, -47938268, -54167300, -61274628, -69404363, -78710192, -89355976, -101515154, -115345986, -130959985, -148415003, -167718762, -188809754, -211531725, -235638392, -260812739, -286675279, -312822574, -338907407, -364601250, -389275997, -411598097, -429536582, -441007270, -444716980, -440544829, -429295473, -412230060, -390766053, -366340502, -340267501, -313590970, -287045938, -261128570, -236174051, -212402219, -189963084, -168980868, -149560181, -131763810, -115607542, -101075619, -88124283, -76672706, -66609303, -57811907, -50155009, -43505259, -37729341]
56991c7729341N017720M354918L779398L286349K863109K496810K182883J916872
56983a1831282J687117J483903J306829J155307J020726Q95895P83654O88182
56975b809669O05581N30672M65426M12541L67357a04299A78156K45897K11631
56966F35684J77092J46097J23480J07611R4089Q2295P2754O2840N0868L9958L2473
56955A625241K5009J4054J947p942j7368k9083m1137n0816n9913p0207p7853p8259
56943A233673p2731o3903m8498k2531P480K5548J9613r395n0377q9833j18230
56932H10816j33471j39099j38024j29770j14916E7291b6888p2125n9696m7756
56922b06465l8555l1650k5625k1616k1198k2616k2658k0833j8669j6598j4292
$$ y = [-37729341, -32711621, -28356703, -24577305, -21290956, -18427847, -15931037, -13748154, -11831282, -10144165, -8660262, -7353433, -6198126, -5177400, -4281505, -3497851, -2809669, -2204088, -1673416, -1207990, -795449, -428092, -104299, 178156, 424053, 635684, 812776, 958873, 1082353, 1189964, 1284053, 1366348, 1439102, 1501942, 1552810, 1592768, 1625241, 1650250, 1664304, 1666251, 1658309, 1640941, 1611858, 1570721, 1519905, 1459992, 1389785, 1311932, 1233673, 1160942, 1097039, 1048541, 1026010, 1033490, 1059038, 1078651, 1069256, 1018879, 929046, 810816, 677345, 538246, 400222, 270452, 155536, 57291, -26888, -99013, -158709, -206465, -245020, -276670, -302295, -323911, -345109, -367725, -390383, -411216, -429885, -446483, -460775]
56911d60775j2224j0229o458j99O483J2195J8543K6527L3682L7866M0913M5200
56899b68476M9419N1295N1769N2774a0054D0581M5619L9769L2791K4273J6479
56888A99512J1605Q302M471J349J017K078K021J870M192Q073J0507J1562J3760
56875B80319J7250J9872K1450K3880K7208K9239K8851K6405K1433J3303L868l879
56863E09199r534j4740j9444k1821k1413j9451j6448j2554r612r619j1386j1696
56851C31481r618o909m660k633j521k585m902n880m834l398k542j728j145k040
56837B77086m360o387o970o331m780k642j179j396k099j169J485M183O245Q312
56823B59998J0275J1040J0254Q443N885L035J477K432N011P695J0586J4157J7113
$$ y = [-460775, -472999, -483228, -489686, -489885, -483402, -471207, -452664, -426137, -392455, -354589, -313676, -268476, -219057, -167762, -115993, -63219, -10054, 40581, 86200, 125969, 158760, 183033, 199512, 211117, 219419, 223890, 225239, 226256, 228334, 230355, 232225, 236417, 244490, 254997, 266559, 280319, 297569, 317441, 338891, 362771, 389979, 419218, 448069, 474474, 495907, 509210, 513078, 509199, 499665, 484925, 465481, 443660, 422247, 402796, 386348, 373794, 364182, 354563, 343177, 331481, 321863, 314954, 310294, 307661, 306140, 303555, 298653, 292773, 287939, 284541, 281999, 280271, 279126, 277086, 272726, 266339, 259369, 253038, 248258, 245616, 244437, 243041, 240942, 239773, 241258, 245441, 251686, 259998, 270273, 281313, 291567, 300010, 305895, 308930, 310407, 312839, 317850, 325545, 336131, 350288, 367401]
56810C67401J8069J8367K0432K4051K7030K8826L0780L3238L5415L7663M1075
56799F82347M4814M6501M4991M0464L2415K0523P248l422j0017j4014j6533j7313
56787H58004j6625j5331j2906q131j772M010Q853J4230K0454K6389L1975L8123
56775I47273M4216M8625N1611N4407N5211M9580L5700J6580l451k1543l5428m3300
56763A199481m6049m6807m7091m5609m1509l6028l0051k2894j4709p390j802L534
56751H63076R722J5786K0796K5399K9830L2491L1773K7373J9068O490q583k2050
56739A051171l1155l6636m0245m2220m2336m1201l8937l4532k8040k1723j7391
56728F76755j4195j0357n673r10L711Q208J2243J5859J9389K1716K0385J4580
$$ y = [367401, 385470, 403837, 424269, 448320, 475350, 504176, 534956, 568194, 603609, 641272, 682347, 727161, 773662, 818653, 859117, 891532, 912055, 919303, 915881, 905864, 891850, 875317, 858004, 841379, 826048, 813142, 805011, 803239, 807249, 816102, 830332, 850786, 877175, 909150, 947273, 991489, 1040114, 1091725, 1146132, 1201343, 1250923, 1286623, 1303203, 1299752, 1278209, 1242781, 1199481, 1153432, 1106625, 1059534, 1013925, 972416, 936388, 906337, 883443, 868734, 861344, 859542, 863076, 872798, 888584, 909380, 934779, 964609, 997100, 1028873, 1056246, 1075314, 1081804, 1073221, 1051171, 1020016, 983380, 943135, 900915, 858579, 817378, 778441, 743909, 715869, 694146, 676755, 662560, 652203, 646530, 645620, 649331, 657539, 669782, 685641, 705030, 726746, 747131, 761711]
56716G61711O392j922j0082j8005k3990k6524k6510k5914k5278k4081k2395k0647
56704E42755j8621j6101j3696j1937j0390q753p722p618p136m901j555Q73J251
56691D36449Q3j446k340k272j840j937k426k206r02M74R22N72lo02j058j098r79
56674D19391j388k344l040l021k620k296k309k895l620l138j008Q28K42j890l011
56659C87881k846l308m540m286j962j18n67j826k022j736k217l006l306l671m513
56644C47957m695l490k212k055k049j028p0p42k282k693j656l50O70J477J447
56629C28229L3j546j221J350M410O177O384N928N867O483O952O352N084M454M885
56614C89821N765O847Q058P916M588q16m362l826r91J452K896L489K571L75r54
$$ y = [761711, 768103, 766181, 756099, 738094, 714104, 687580, 661070, 635156, 609878, 585797, 563402, 542755, 524134, 508033, 494337, 482400, 472010, 463257, 455535, 447917, 440781, 435880, 434325, 435198, 436449, 436532, 435086, 432746, 430474, 428634, 426697, 424271, 422065, 421163, 421637, 422559, 423131, 423128, 422526, 421468, 420370, 419391, 418003, 415659, 412619, 409598, 406978, 404682, 402373, 399478, 395858, 392720, 391712, 392540, 392782, 390892, 387881, 385035, 381727, 377187, 372901, 370939, 370821, 370254, 368428, 366406, 364670, 362453, 359447, 356141, 352470, 347957, 343262, 339772, 337560, 335505, 333456, 332428, 332358, 331616, 329334, 326641, 324985, 324635, 325305, 326782, 328229, 328262, 326716, 325495, 326845, 331255, 337432, 343816, 349744, 355611, 362094, 369046, 375398, 380482, 384936, 389821, 395586, 402433, 410491, 418407, 422995, 422179, 417817, 413991, 413000, 414452, 417348, 420837, 423408, 423783, 422829]
56599D22829k68O16j34j379j157K2N02L87O29O86l50j568j791k000l522n001m149
56582D04352j674m03r68j370q15r37k767m937n739n080l764k452j712j915k648
56567C67171l231l563l697l148j811q45j171j838j389k05K38k60p40r66j390j725
56551C41430j454j252j943k521j309J139K554K291K005K694L341L112K985M077
56537C57149N706O196M992L170K078J795J143m71j597l23K583L958K475M89K90
56522C89633O51o30k642k709o10J515K740L741M132K756P32J020M129P088P550
56507D19096O534N964N857N367M752M705M992N044N035N396O053O770P566Q311
56493E01442Q609Q352P710O593M908L204K126J434N84pL95J231J102k51j760k661
$$ y = [422829, 422561, 423177, 423043, 421664, 420507, 420529, 421031, 421418, 422047, 422733, 422383, 420815, 419024, 417024, 413502, 408501, 404352, 402678, 402275, 401307, 399937, 399122, 398185, 395418, 390481, 384742, 379662, 375898, 373446, 371734, 369819, 367171, 363940, 360377, 356680, 353532, 351721, 350876, 349705, 347867, 346478, 346273, 346511, 346251, 345511, 344545, 343155, 341430, 339976, 338724, 336781, 334260, 332951, 334090, 336644, 338935, 340940, 343634, 346975, 350087, 353072, 357149, 362855, 369051, 374043, 377213, 379291, 381086, 382229, 381758, 380161, 379838, 382421, 386379, 388854, 389343, 389633, 390284, 389654, 387012, 384303, 383693, 385208, 387948, 391689, 395821, 398577, 399309, 400329, 404458, 411546, 419096, 425630, 431594, 437451, 442818, 447570, 452275, 457267, 462311, 467346, 472742, 478795, 485565, 493131, 501442, 510051, 518403, 526113, 532706, 537614, 540818, 542944, 544378, 544962, 544955, 545350, 546581, 547683, 547432, 545672, 543011]
56477E43011l035l004k850l532n392o780n864l624k804l952m899m530m422n755
56463D82568o997o222l971k229j805k256l201m211m085k012Q58K249J396j33n49
56448D49400j34p58l113n323n096k889j445j998k654j523L23O66m15j030m90K63
56432D23784P83J365J481J77j752k137l71J691K195J231Q7k7J515M123N862N414
56416D45421L975L715M768N530N508N652N995N564M748N295P253Q337P259N557
56402E24577N156O063P354Q562R109Q112N930M350M267M676M697M905N662N888
56388F09308M712K857J176p20l073m609m086k283j081j210k026k895l695m377
56374E87998m864n151n167m985n213o423q051q664p437m789j799lr96m686q194
$$ y = [543011, 539976, 536972, 534122, 530590, 525198, 518418, 512554, 508930, 506126, 502174, 497275, 492745, 488323, 482568, 475571, 469349, 465378, 463149, 461344, 459088, 455887, 451676, 447591, 445579, 446437, 448686, 450082, 449949, 449400, 449266, 448508, 445395, 440072, 434976, 432087, 430642, 428644, 425990, 424467, 424790, 425456, 425041, 424011, 423521, 423784, 424567, 425932, 427413, 427590, 425838, 423701, 423330, 425021, 427216, 428447, 428534, 428507, 430022, 434145, 440007, 445421, 449396, 453111, 457879, 463409, 468917, 474569, 480564, 486128, 490876, 496171, 503424, 511761, 519020, 524577, 529733, 535796, 543150, 551712, 560821, 568933, 574863, 579213, 583480, 588156, 592853, 597758, 603420, 609308, 614020, 616877, 618053, 617333, 614260, 609651, 605565, 603282, 602201, 600991, 598965, 596070, 592375, 587998, 583134, 577983, 572816, 567831, 562618, 556195, 548144, 539480, 532043, 527254, 525455, 525452, 524456, 519770, 511576]
56359E11576q454n822l385k717k583j940j685k525l415l315k824k874l293l596
56345D63148l764l538k401q96m34j068j207j96O43M08J40Q38J710J637Q56Q6o25
56328D55337j178r12J71J083J466K074L024L382L144L542M511M202K226R26J682
56313D84680K393Q95j200o98K371M868M779L069J637J349K003K835L090K907L237
56298E18215M354N277N272M734L942K428N48N7J749L846M171K823J464J067J530
56283E61477K554L598L952L812M297N595O430O077N498N575N914O235P090Q181
56269F36285Q122P087P401R902J2159J2191J1512J2071J2680J1534J0205J1543
56257G62692J4842J6736J6324J5959J6966J7771J6799J4712J3066J2579J3144
$$ y = [511576, 503122, 497300, 493915, 491198, 488615, 486675, 484990, 482465, 479050, 475735, 472911, 470037, 466744, 463148, 459384, 455846, 453445, 452549, 452115, 451047, 449840, 449644, 450287, 450695, 450835, 451673, 453383, 455020, 455876, 455962, 455337, 454159, 453247, 453418, 454501, 455967, 458041, 461065, 464447, 467591, 471133, 475644, 479846, 482072, 482998, 484680, 487073, 487968, 486768, 486070, 488441, 493309, 498088, 501157, 502794, 504143, 506146, 508981, 512071, 514978, 518215, 522569, 527846, 533118, 537852, 541794, 544222, 544770, 544827, 546576, 550422, 554593, 557416, 558880, 559947, 561477, 564031, 567629, 571581, 575393, 579690, 585285, 591715, 597792, 603290, 608865, 614779, 621014, 628104, 636285, 644407, 651494, 658895, 668797, 680956, 693147, 704659, 716730, 729410, 740944, 751149, 762692, 777534, 794270, 810594, 826553, 843519, 861290, 878089, 892801, 905867, 918446, 931590]
56246I31590J3881J3236J0623P876P413R044J0279R706Q183O699M997K932J509
56233A037968J759L411N335O833Q268J0594J4076J7435J9031J9125J9944K2828
56221A186607K6560K9364L1346L3720L6693L9462M1617M3394M5241M8032N2786
56210A614822N9317O6089P2211P8375Q4953R0939R5980J01788J09963J19810J30006
56199B624253J40947J53566J66999J79465J90609K01247K11546K21043K29546
56190D319221K36435K40050K39275K34713K26857K14374J95848J72032J44603
56181F223408J14044Q0662M6376J3409j7849m7617p4585r7143j15782j31973j45384
56170E847566j54538j59607j62385j63780j63436j61600j59555j58173j57375
$$ y = [931590, 945471, 958707, 969330, 977206, 984619, 993663, 1003942, 1013648, 1021831, 1028530, 1033527, 1036459, 1037968, 1039727, 1043138, 1048473, 1055306, 1063574, 1074168, 1088244, 1105679, 1124710, 1143835, 1163779, 1186607, 1213167, 1242531, 1273877, 1307597, 1344290, 1383752, 1425369, 1468763, 1514004, 1562036, 1614822, 1674139, 1740228, 1812439, 1890814, 1975767, 2066706, 2162686, 2264474, 2374437, 2494247, 2624253, 2765200, 2918766, 3085765, 3265230, 3455839, 3657086, 3868632, 4089675, 4319221, 4555656, 4795706, 5034981, 5269694, 5496551, 5710925, 5906773, 6078805, 6223408, 6337452, 6418114, 6464490, 6477899, 6460050, 6412433, 6337848, 6240705, 6124923, 5992950, 5847566, 5693028, 5533421, 5371036, 5207256, 5043820, 4882220, 4722665, 4564492, 4407117]
56161D407117j56780j55833j53947j51445j49618j48827j47578j44483j39872
56152C058734j34592j28825j22996j18048j13493j07244r8788r0390q3718p7816
56142A982824p2055o8127o6496o3777n7005m8418m2566m0236l8460l5194l0907
56131A419583k6594k2997k0779j9396j7147j4156j2930j3993j3929j0613p020
56120A240029o234n977k616K335M789M967O238Q826J0124J0275J1989J5337J7771
56107A317853J8926K0575K2351K2417K1983K3904K7022K7022K3256J9643J8404
56096A563356J7862J7010J7268J8608J8646J6873J5731J6433J7511J8321K0233
56085A757852K3683K7690L2590L9413M6559N1354N5046O1710P2031Q2840R3196
$$ y = [4407117, 4250337, 4094504, 3940557, 3789112, 3639494, 3490667, 3343089, 3198606, 3058734, 2924142, 2795317, 2672321, 2554273, 2440780, 2333536, 2234748, 2144358, 2060640, 1982824, 1910769, 1842642, 1776146, 1712369, 1655364, 1606946, 1564380, 1524144, 1485684, 1450490, 1419583, 1392989, 1369992, 1349213, 1329817, 1312670, 1298514, 1285584, 1271591, 1257662, 1247049, 1240029, 1233795, 1227818, 1225202, 1227537, 1232326, 1237293, 1243531, 1252357, 1262481, 1272756, 1284745, 1300082, 1317853, 1336779, 1357354, 1379705, 1402122, 1424105, 1448009, 1475031, 1502053, 1525309, 1544952, 1563356, 1581218, 1598228, 1615496, 1634104, 1652750, 1669623, 1685354, 1701787, 1719298, 1737619, 1757852, 1781535, 1809225, 1841815, 1881228, 1927787, 1979141, 2034187, 2095897, 2167928, 2250768, 2343964]
56074B343964J05600J20312J33697J43677J51899J58780J61139J56871J47933
56065C623872J37006J25078J13817J05925J00959R4351Q2384O5126M3718J8816
56055D511052p032k9563m7098o1471p3945q3927r2330j01788j12444j21678j28857
56044C650919j35831j41865j42979j37759j29201j19486j07740r4391q2513p2854
56034B486300o2483n0462m0129l3529k8297k2396j7341j4427j2135r623q506r006
56022B177966q585o401m779m482l107J4K291L157N573J0044J2607J1526J0676
56009B206500J3218J6917J8904K0209K2347K3948K4096K4666K6507K7591K7461
55998B452364K8856L2389L4688L4430L5003L8245M0953M0911M1013M3793M6939
$$ y = [2343964, 2449564, 2569876, 2703573, 2847250, 2999149, 3157929, 3319068, 3475939, 3623872, 3760878, 3885956, 3999773, 4105698, 4206657, 4301008, 4383392, 4448518, 4492236, 4511052, 4504020, 4474457, 4427359, 4365888, 4291943, 4208016, 4115686, 4013898, 3901454, 3779776, 3650919, 3515088, 3373223, 3230244, 3092485, 2963284, 2843798, 2736058, 2641667, 2559154, 2486300, 2423817, 2373355, 2333226, 2299697, 2271400, 2249004, 2231663, 2217236, 2205101, 2195478, 2186972, 2177966, 2169381, 2162980, 2158201, 2153719, 2150612, 2150626, 2152917, 2156074, 2161647, 2171691, 2184298, 2195824, 2206500, 2219718, 2236635, 2255539, 2275748, 2298095, 2322043, 2346139, 2370805, 2397312, 2424903, 2452364, 2481220, 2513609, 2548297, 2582727, 2617730, 2655975, 2696928, 2737839, 2778852, 2822645, 2869584]
55987B869584M7872M8038M9076M9452M8306M8118N0380N3076N5173N8784O4379
55976C442238O9151P2477P7362Q4183Q9244R1935R6542J04181J10169J12661J16328
55965D466471J23809J31145J35748J41199J49743J57812J63693J71761J84165
55956E825546J96230K05312K16116K31699K47207K58371K68217K79653K89650
55947H018001K96878L06585L21548L36545L48122L61271L79953L99985M17993
55938A1186881M38237M63710M89976N14725N43389N78217O12344O42248O74959
55929A6144686P15270P57700P99191Q46713R03244R59712J010936J065554J129542
55920B4332548J194911J256497J324553J407926J500630J598356J711020J844164
$$ y = [2869584, 2917456, 2965494, 3014570, 3064022, 3112328, 3160446, 3210826, 3263902, 3319075, 3377859, 3442238, 3511389, 3583866, 3661228, 3745411, 3834655, 3926590, 4023132, 4127313, 4237482, 4350143, 4466471, 4590280, 4721425, 4857173, 4998372, 5148115, 5305927, 5469620, 5641381, 5825546, 6021776, 6227088, 6443204, 6674903, 6922110, 7180481, 7448698, 7728351, 8018001, 8314879, 8621464, 8943012, 9279557, 9627679, 9988950, 10368903, 10768888, 11186881, 11625118, 12088828, 12578804, 13093529, 13636918, 14215135, 14827479, 15469727, 16144686, 16859956, 17617656, 18416847, 19263560, 20166804, 21126516, 22137452, 23203006, 24332548, 25527459, 26783956, 28108509, 29516435, 31017065, 32615421, 34326441, 36170605]
55912C6170605J986140K130578K293049K487962K708427K948106L222085L545313
55904E7492265L913155M327296M818544N419631O140436O995568Q025575R257788
55896A06390258J0674987J2254246J4001185J5915021J7974590K0208690K2719115
55889B20138092K5569578K8711976L2041657L5274554L7457337L6719977L1112923
55882D47026094K0212760N940094q424443k0154747k8182381l2774881l4658346
55875C48984150l4534672l3036196l0717789k7987183k5109919k2274824j9607214
55868A55716353j7154504j4926166j2944712j1229875r761303q497893p417595
55861G3784305o507875n737206n069033m490304l999635l581283l215216k898942
$$ y = [36170605, 38156745, 40287323, 42580372, 45068334, 47776761, 50724867, 53946952, 57492265, 61405420, 65732716, 70551260, 75970891, 82111327, 89106895, 97132470, 106390258, 117065245, 129319491, 143320676, 159235697, 177210287, 197418977, 220138092, 245707670, 274419646, 306461303, 341735857, 379193194, 415913171, 447026094, 467238854, 473178948, 464754505, 444599758, 416417377, 383642496, 348984150, 314449478, 281413282, 250695493, 222708310, 197598391, 175323567, 155716353, 138561849, 123635683, 110690971, 99461096, 89699793, 81201900, 73784305, 67276430, 61539224, 56470191, 51979887, 47980252, 44398969, 41183753, 38284811]
55853C8284811k635470k411115k206440k018015j849974j695678j546893j410427
55845B2510799j296858j201870j115260j038609r77087r23042q64723q03907p49454
55836A3539989p00697o51913o06020n69119n37611n04327m71686m45950m24358
55827H628308m00324l75700l55798l37941l16732k95288k79745k67800k53794
55818E745186k39751k30227k21545k07724j92251j82543j76935j68437j57391
55809C968382j49167j42762j32981j21289j13632j09495j03213r4339q7025q0881
55799B833598p1841o0876n3102m9358m6760m5903m9408n4757n6608n5154n4798
55788B235033n5998n5670n4082n3909n3819n0358m4976m2098m1255l8101l2132
$$ y = [38284811, 35649341, 33238226, 31031786, 29013771, 27163797, 25468119, 23921226, 22510799, 21213941, 20012071, 18896811, 17858202, 16881115, 15958073, 15093350, 14289443, 13539989, 12839292, 12187379, 11581359, 11012240, 10474629, 9970302, 9498616, 9052666, 8628308, 8227984, 7852284, 7496486, 7158545, 6841813, 6546525, 6266780, 5998980, 5745186, 5505435, 5275208, 5053663, 4845939, 4653688, 4471145, 4294210, 4125773, 3968382, 3819215, 3676453, 3543472, 3422183, 3308551, 3199056, 3095843, 3001504, 2914479, 2833598, 2761757, 2700881, 2647779, 2598421, 2551661, 2505758, 2456350, 2401593, 2344985, 2289831, 2235033, 2179035, 2123365, 2069283, 2015374, 1961555, 1911197, 1866221, 1824123, 1782868, 1744767, 1712635]
55777A712635k6728k2588j7732j3134j1746j2793j3087j2989j5007j7841j8242
55766A530748j7591k0138k5427k8933k9739l1198l4286l6315l6385l6415l6675
55755A197646l5437l3035l1398k9997k6930k3371k1958k1574j8907j4499j1922
55744I28618j1487j0068o947m674m069l314j994j571j794r86L35K23r01j387k291
55729H77693n662r768j0869r204q319q987q690o877n750n744m891k934j765j818
55715G86415j938k664n436r061j1132j2352j5022j8006j8092j5895j5186j6397
55703F45234j6010j2776r629q615q570q510q996r414q117n931n488o651o790n811
55689E23926o494r203j0856j0136r414j0354j1565j1722j1317j0410q171n514
$$ y = [1712635, 1685907, 1663319, 1645587, 1632453, 1620707, 1607914, 1594827, 1581838, 1566831, 1548990, 1530748, 1513157, 1493019, 1467592, 1438659, 1408920, 1377722, 1343436, 1307121, 1270736, 1234321, 1197646, 1162209, 1129174, 1097776, 1067779, 1040849, 1017478, 995520, 973946, 955039, 940540, 928618, 917131, 907063, 900116, 895442, 891373, 888059, 886065, 884494, 882700, 881714, 882049, 882272, 881371, 879984, 877693, 872031, 862263, 851394, 842190, 833871, 824884, 816194, 809317, 803567, 797823, 792932, 789998, 788233, 786415, 784477, 781813, 776377, 767316, 756184, 743832, 728810, 710804, 692712, 676817, 661631, 645234, 629224, 616448, 606819, 598204, 589634, 581124, 572128, 562714, 554597, 548666, 543178, 536527, 529737, 523926, 517432, 508229, 497373, 487237, 477823, 467469, 455904, 444182, 432865, 422455, 414284, 408770]
55677D08770m695n608n926n158m916m955l169P3J834J505J416J865J34m287p972
55662C68911q646p928p388o034l530k018k541l073k167j396k234l459l494k645
55648C12358j526O9J580J762J356K562M990N552L389J254Q19M23r39j513o10m99
55632C31027k120k624j7L264M318M266N600P740Q457P662O702N729M458L914M778
55617C93154N470M244J738n65k783n424p412p614o946o823o761n580l660k072
55603C48966o38J099K130J208r71k559k914k681k294j713j062m12M22J201J283
55588C41065P87N63N78j99j778k733k522k405l216m145m598n363o824p913p956
55573B93341p761p755p121n877n740p289q382p126m696l429l690m370n058n834
$$ y = [408770, 404075, 398467, 392541, 387383, 382467, 377512, 374343, 374416, 376250, 377755, 379171, 381036, 381170, 376883, 368911, 360265, 352337, 344949, 338915, 335385, 333367, 330826, 327753, 325586, 324190, 321956, 318497, 315003, 312358, 310832, 310901, 312481, 314243, 315599, 318161, 323151, 328703, 332092, 333346, 334165, 334588, 333649, 332136, 331526, 331027, 328907, 326283, 326266, 329530, 333848, 338114, 343714, 351454, 359911, 367573, 374275, 380004, 384462, 388376, 393154, 398624, 402868, 404606, 404041, 401258, 395834, 388422, 380808, 373862, 367039, 360278, 354698, 351038, 348966, 348328, 349427, 351557, 352765, 351794, 349235, 346321, 343640, 341346, 339633, 338571, 338159, 338581, 339782, 341065, 341852, 342415, 342993, 342794, 341016, 338283, 335761, 333356, 330140, 325995, 321397, 316034, 309210, 301297, 293341, 285580, 277825, 270704, 264827, 259087, 251798, 243416, 236290, 231594, 228165, 224475, 220105, 215047, 209213]
55559B09213o118n431m434l886l503k858k280j977j590j427k364l690l150l80
55545A66125J817J310l64o91J08K61l31n29m20r65j886k043j357p11m41m95j247
55528A58141k687l485k432j70J767K826L224K869J876J143J063O98m71j117RJ884
55512A65138K700K461K370K518K285K299L839O555Q679R403R325Q696O876L767
55498B36911K84k830n506p521q267p723o797o394o571o729o361n621n219n504
55484A56152n730m884l273k327k630l224l154k583j788l90J650L213L266K239
55470A36537J409J481K188K654J899j79k135k292q56M83J054J674K492K234L56
55455A48999j800k847k861k381j534q77j259k155j941o64l97j907l191k715j763
$$ y = [209213, 203095, 197664, 193230, 189344, 185841, 182983, 180703, 178726, 177136, 175709, 173345, 169655, 166505, 166125, 167942, 169252, 168888, 168197, 168305, 168566, 168235, 167706, 167286, 166321, 164435, 162392, 161035, 160324, 159883, 159388, 158141, 155454, 151969, 149537, 149367, 151134, 153960, 157184, 160053, 161929, 163072, 164135, 164833, 164362, 163245, 163254, 165138, 167838, 170299, 172669, 175187, 177472, 179771, 183610, 190165, 198844, 208247, 217572, 226268, 233144, 236911, 237195, 234365, 228859, 221338, 213071, 205348, 198551, 192157, 185586, 178857, 172496, 166875, 161656, 156152, 150422, 145538, 142265, 139938, 137308, 134084, 130930, 128347, 126559, 126169, 127819, 131032, 134298, 136537, 137946, 139427, 141615, 144269, 146168, 145989, 143854, 141562, 140706, 141189, 142243, 143917, 146409, 148643, 148999, 147199, 144352, 141491, 139110, 137576, 136699, 135440, 133285, 131344, 130680, 130283, 128376, 125185, 122470, 120707]
55440A20707j929k475k158j678k121k758k613k615l814m886l877j311P12J459
55426I0643J467O99q48j833j305p35j726k913j943K98P59q59j745p91l25k011
55410G6832l963l624j344O28J247J085O81L2o86j008q07m38k92l82l26J36O22
55393F8393L71o66j561j593j122q39p97o96m51PP71J402J155K71l4O16J142Q38
55375F7207L72K74J8m17P7J519J770m31l019l225j294N34J523K457L131K452P05
55358G3653o14j079j443j692j097n1R0r48k038k325j734j70K213M264M921M619
55342G6569M210L226J064q84o11J318K153N39k167m068m431l469k219k190l423
55327F5617l572j031J958J986m32j698p30q8j109j725m29J036Q16q5j10m3j193
$$ y = [120707, 118778, 116303, 114145, 112467, 110346, 107588, 104975, 102360, 98546, 93660, 89783, 88472, 89184, 90643, 92110, 92809, 91961, 90128, 88823, 88088, 86362, 83449, 81506, 81804, 82563, 81704, 79959, 79168, 78843, 76832, 72869, 69245, 67901, 68529, 69776, 70861, 71542, 71574, 70888, 69880, 69073, 68635, 68343, 67961, 67635, 67771, 68393, 68764, 68098, 66537, 64944, 63822, 62983, 62186, 61490, 61039, 61046, 61817, 63219, 64374, 64645, 64611, 65227, 66369, 67207, 67579, 67853, 67871, 67454, 67531, 69050, 70820, 70389, 67370, 64145, 62851, 63385, 64908, 67365, 70496, 72948, 73653, 73039, 71960, 70517, 68825, 67728, 67677, 67767, 66819, 64781, 62456, 60722, 60552, 62765, 67029, 71950, 76569, 80779, 84005, 85069, 84185, 83574, 84892, 87045, 87584, 85417, 81349, 76918, 73449, 71230, 69040, 65617, 62045, 61014, 62972, 64958, 64526, 62828, 62098, 62010, 60901, 59176, 58747, 59783, 60599, 60514, 60404, 60361, 59168]
55310E9168k549k235n70O29Q60J034J263N99j081k492k519j493o73q55j450j041
55294D6595P95K426J955j02j242k81J258J509M83p73j725k071j274M54J767J922
55278E1696J861K410K579J161q23j166L88J755J408N8q08q07l13O05J822K331
55262F4157J021j598l443l165j725r42r77l98J381L007K978J534J2p83q73n27
55246E9659k40o02j389j502o17l4q41k109k200j015M20J828L464M528L822J810
55230F4982L54K96P77R23P23K21n74j031n85l2n70j628j527k34N86M68Q77K485
55212F6511L865L861L266K921K047j04k323k864j771m92M0j92r52j681j452j36
55196G0544R54N90p07j473j233o68l43k69m36q37j036n57K19J98j036k421k422
$$ y = [59168, 56619, 54384, 53814, 54443, 55303, 56337, 57600, 58199, 57118, 54626, 52107, 50614, 49941, 49086, 47636, 46595, 47390, 49816, 51771, 51669, 50427, 50146, 51404, 52913, 53396, 52623, 50898, 48827, 47553, 48007, 49774, 51696, 53557, 55967, 58546, 59707, 58884, 57718, 58106, 59861, 61269, 61327, 60519, 59712, 59399, 60004, 61826, 64157, 65178, 63580, 60137, 56972, 55247, 54305, 53328, 52930, 54311, 57318, 60296, 61830, 61842, 61059, 60186, 59659, 59419, 58817, 57428, 55926, 55309, 55275, 54434, 52325, 50125, 49110, 49530, 51358, 54822, 59350, 63172, 64982, 65336, 65632, 66409, 67332, 68055, 68276, 67702, 66671, 66086, 66054, 65484, 63856, 62329, 62095, 62681, 63149, 64026, 66511, 70376, 74237, 77503, 80424, 82471, 82367, 80044, 77180, 75409, 74917, 74957, 74765, 73813, 72132, 70680, 70544, 71498, 72088, 71381, 69908, 68675, 68007, 67664, 67395, 66959, 66122, 65086, 64529, 64748, 64946, 63910, 61489, 59067]
55179E9067q64N75J98j525k351j129P29J269N38P0N93J596K667L718M173L448
55163G2772K142J410J207O75R3O75K281L050J916n3j274j370q12j68j59j253k728
55146G8404l218k424j162K16J877K905J689j458l852l527j329P82J992K358J871
55131G5124Q74K84L96M81J67L7K34p4j053j512p62K03L05j88p30j591k745l092
55113F6358k098r81r79j405q24P05J836J773Q87K0j38L74M00j101l073l027m24
55096E8303K177K314M76j209j642r39M89J609R34j460l254k670p32N76J073J615
55080E7660K022J691J342K019L104L151K132J054m1j746l360l242j145J300K548
55065F8489K458J770J296J417J611R61k41l80J102K478K183J184J190J777J322
$$ y = [59067, 58203, 58778, 58976, 57451, 55100, 53971, 54700, 55969, 56507, 56577, 57170, 58766, 61433, 65151, 69324, 72772, 74914, 76324, 77531, 78206, 78299, 78974, 81255, 84305, 86221, 86168, 84894, 83524, 82712, 82544, 82385, 81132, 78404, 75186, 72762, 71600, 71816, 73693, 76598, 78287, 76829, 72977, 69450, 68121, 68903, 70895, 73253, 75124, 75998, 76282, 76678, 77159, 77326, 77363, 77597, 77523, 76470, 74958, 74196, 74399, 74704, 74516, 73786, 72195, 69450, 66358, 64260, 63279, 62300, 60895, 60071, 60776, 62612, 64385, 65272, 65292, 65154, 65528, 65928, 64827, 61754, 58727, 58303, 60480, 62794, 63270, 62061, 60419, 59480, 59969, 61578, 62512, 61052, 57798, 55128, 54396, 54972, 56045, 57660, 59682, 61373, 62715, 64734, 67838, 70989, 73121, 74175, 74134, 72388, 69028, 65786, 64641, 65941, 68489, 70947, 72717, 74013, 75430, 77041, 78002, 77761, 77381, 78483, 80961, 83144, 84328, 85518, 87295, 88617]
55050H8617Lm74L27J146J169P35N8r00j458q83J88O53R76K419M416M936L493J773
55032A07194R83N15k45o82k14O84J446K048K306J713M81m33o46o00l73M12J363
55015A15952J455O74J32K02O9m93m60O19J620J582J074R81R15K8j454k531k772
54998A17593k541k237j961j712j455j114o23J15J078J648Q19j397l331l506k619
54983I8757k403k978k958k032j508j948k250j728j367j864k004l76K371M374M816
54968H6902M127K654O15j010j036L10J396J159L01K53J410K761L113K330J253
54953A06538N75K10q0L2R14K020K313J664J115J499K393K805K368J630J355J778
54937A29129K292J891K57j613k308j478q9P38O73N2o79j277j737k042j928j232
$$ y = [88617, 88620, 88146, 88473, 89619, 90788, 91523, 91581, 90681, 89223, 88340, 88528, 89181, 90157, 92576, 96992, 101928, 105421, 107194, 108177, 108692, 108447, 107765, 107551, 108235, 109681, 111729, 114035, 115748, 116229, 115796, 115150, 114550, 114177, 114589, 115952, 117407, 118081, 118213, 118415, 118484, 117991, 117531, 118150, 119770, 121352, 122426, 123407, 124322, 124350, 122896, 120365, 117593, 115052, 112815, 110854, 109142, 107687, 106573, 105950, 106065, 107143, 108791, 109610, 108213, 104882, 101376, 98757, 96354, 93376, 90418, 88386, 86878, 84930, 82680, 80952, 79585, 77721, 75717, 75341, 77712, 82086, 86902, 91029, 93683, 94298, 93288, 92252, 92562, 93958, 95117, 95418, 95671, 97081, 99842, 102955, 105285, 106538, 107113, 107323, 107243, 107275, 108189, 110209, 112522, 114186, 115301, 116800, 119193, 121998, 124366, 125996, 127351, 129129, 131421, 133312, 133569, 131956, 129648, 128170, 128081, 128819, 129492, 129544, 128865, 127588, 125851, 123809, 121881, 120649]
54921A20649m81m66r28o50O04J320M03r22q04M70J082N20j7J07K47K82J180L097
54903A25693M547M291K882J579Q62P83J583K999L839L224J806J090J956M185O773
54888A68092Q389Q321P440P586R471J1852J3036J2504J0774Q631O981O468O554
54875B86099N650K891p24l542n063o078p542r760j2205j3644j3065j0882q835
54862B03300q233q664q675p313m870k611j873k834m115m151k893j370P9J933L900
54847A51610M845M636M595N434O194O028N715O343P722R178J0738J2243J2359
54834B47640J0094O615L989K542Q99j641m252o080p240q147r011j0181j1886j3300
54820B00041j2836r972o156l454k681l262m396n695o823p143o191m298k325p55
$$ y = [120649, 120168, 119702, 118774, 118124, 118728, 120048, 120451, 119529, 118725, 119195, 120277, 120797, 120780, 120887, 121134, 121416, 122596, 125693, 130240, 134531, 137413, 138992, 139854, 140637, 142220, 145219, 149058, 152282, 154088, 155178, 157134, 161319, 168092, 176481, 184802, 192242, 199828, 209299, 221151, 234187, 246691, 257465, 266096, 273077, 279545, 286099, 291749, 294640, 293916, 290374, 285311, 279233, 271691, 261931, 249726, 236082, 223017, 212135, 203300, 195067, 186403, 177728, 170415, 165545, 162934, 161061, 158227, 154112, 149961, 147068, 145698, 145777, 147710, 151610, 156455, 161091, 165686, 171120, 177314, 183342, 189057, 195400, 203122, 212300, 223038, 235281, 247640, 257734, 264349, 268338, 270880, 271779, 270138, 265886, 259806, 252566, 244419, 235408, 225227, 213341, 200041, 187205, 177233, 171077, 167623, 164942, 161680, 157284, 151589, 144766, 137623, 131432, 127134, 124809, 124054]
54806A24054N09J253O50j381l220l007r62R37J491J284J037N28k90n37K00Q61
54790A23407M03n95r11n42l88o90r79j172j517j738j326o09n91j700l314m402
54774A03336m092k039R33K957K754J025m76q81m39M76J517J898J102j8q1Q97J552
54757A10421J183N22L54O08J089J907K747K895K571L097M899O403N966M136K799
54742A51597K565K283J103j79j96J368L630N537O649P158P484P948Q711R919J1546
54727B27123J3042J3585J3100J2636J3033J3361J1660P379K345j180k590k691
54715C20803k297k094l132n842q710r360p463n204m449m681m514l915l650l506
54701B51986k602j059J35P95J695L090M206M438M122L965M491N976Q065R681J0314
$$ y = [124054, 124563, 125816, 126466, 125085, 121865, 118858, 117896, 118833, 120324, 121608, 122645, 123173, 122883, 122346, 122546, 123407, 123810, 123215, 122304, 121762, 121374, 120684, 119705, 118533, 117016, 115278, 113952, 113343, 112752, 111052, 107738, 103336, 99244, 97205, 98138, 101095, 103849, 104874, 104398, 103517, 103078, 103554, 105071, 106969, 108071, 108053, 107972, 108869, 110421, 111604, 112126, 112480, 113088, 114177, 116084, 118831, 121726, 124297, 127394, 132293, 138696, 144662, 148798, 151597, 154162, 156445, 157548, 157369, 157173, 158541, 162171, 167708, 174357, 181515, 188999, 196947, 205658, 215577, 227123, 240165, 253750, 266850, 279486, 292519, 305880, 317540, 324919, 327264, 326084, 323494, 320803, 318506, 316412, 313280, 307438, 298728, 289368, 281905, 276701, 272252, 267571, 263057, 259142, 255492, 251986, 249384, 248325, 248460, 249255, 250950, 254040, 258246, 262684, 266806, 270771, 275262, 281238, 289303, 298984, 309298]
54686C09298J1097J3295J5918J6584J4842J2862J2237J1930J0269P300L845k87
54674D39190n543j0998j5054j7290j8381j8673j8088j6982j5957j4930j3477j1791
54662B62026j0381r111p510n870m997m921m750l942k938k444k598k916k862k426
54648A94360k218k608k861j976m24J68m70n69Q42K078J379P0P98L291M383K399
54632A98642q03k729l138l035k562j408k95l72j397j727k78K112L518K937J369
54617A90834P48J781L187L366K384J591J780K631L727M945N808N620M599L873
54603B36874L957M144L817L441L605L825L180J744O94R62K113K661J528o28j825
54588B70092r66Q61K034K829M819P924R832R070P200O832Q521J0781J2351J3142
$$ y = [309298, 320395, 333690, 349608, 366192, 381034, 393896, 406133, 418063, 428332, 435632, 439477, 439190, 433647, 422649, 407595, 390305, 371924, 353251, 335163, 318181, 302224, 287294, 273817, 262026, 251645, 242534, 235024, 229154, 224157, 219236, 214486, 210544, 207606, 205162, 202564, 199648, 196786, 194360, 192142, 189534, 186673, 184697, 184273, 184441, 183971, 183402, 184244, 186322, 187701, 187771, 188569, 191860, 196243, 198642, 197839, 195110, 191972, 188937, 186375, 184967, 184672, 184300, 182903, 181176, 180898, 183010, 186528, 189465, 190834, 191582, 193363, 196550, 199916, 202300, 203891, 205671, 208302, 212029, 216974, 222782, 228402, 233001, 236874, 240831, 244975, 248792, 252233, 255838, 259663, 262843, 264587, 265281, 266243, 268356, 271017, 272545, 271917, 270092, 269126, 269987, 272021, 274850, 279669, 287593, 297425, 306495, 313695, 320527, 329048, 339829, 352180, 365322]
54574C65322J3425J3342J3076J2504J0905P846M090O43k654o381r762j1284j1214
54561C99858j1786j4136j6512j6637j4750j2879j1856j0677q694o864o257o455
54549B62355o151m698k472j70J596K265J581k8j685k730l175l523m229n172n727
54534B28037n490m803m274l944l608l688m732n932n500l266j527k111l787m165
54520A71210l284l159m201m500l174k029k774m437m903l752k113q16r9k50j077
54505A30642j398m45Q31J127P45Q05J279J520K090L958N973N506K148j237k161
54490A51383j427j264j977k046o83J230K465K541J716Q03R37K578M751N861N280
54475A72148L650J916P73Q02K223M247N538N725N824O618P341O855N701N656P034
$$ y = [365322, 378747, 392089, 405165, 417669, 428574, 436420, 440510, 441153, 438499, 432118, 422356, 411072, 399858, 388072, 373936, 357424, 340787, 326037, 313158, 301302, 290625, 281931, 275067, 268810, 262355, 256204, 251506, 249034, 248864, 250460, 252725, 254306, 254278, 252593, 249863, 246688, 243165, 238936, 233764, 228037, 222547, 217744, 213470, 209526, 205918, 202230, 197498, 191566, 186066, 182800, 181273, 179162, 175375, 171210, 167926, 164767, 160566, 156066, 152892, 150863, 148089, 143652, 138749, 134997, 132884, 132068, 131969, 131719, 130642, 129244, 128799, 129630, 130757, 131502, 132307, 133586, 135106, 137196, 141154, 147127, 152633, 154781, 153544, 151383, 149956, 148692, 146715, 144669, 143986, 145216, 147681, 150222, 151938, 152741, 153678, 156256, 161007, 166868, 172148, 175798, 177714, 178487, 179289, 181512, 185759, 191297, 197022, 202846, 209464, 216805, 223660, 229361, 235017, 242051]
54460B42051P703N675J783j457l164m805p510j0239j1279j0429q759p033n372
54447A87165l958k930j929o62K53j55j879l944n558o417o115m283j568M82R17
54432A49419K62l69n11m45m84n18j78O02J173O48q99k096j693j6J511J975J551
54415A49932Q44M49R02K115L054K749J585P47O22P62J166K267L510L443J751m
54399A75894l90K08O71R30J523K045J341p50k819l341k341j379j934l880n537
54384A60241n399l644j700n62j63k40r21k144l179l241k280r17Q7K61j85l90L54
54367A35978J730K755K927K419J388j14j552k150j847j184k83J003J963J466j39
54352A44360q74M21K702M399N196N342M626L219K374K872L719L721L419L965M963
$$ y = [242051, 249754, 255429, 257212, 255755, 252591, 247786, 240276, 230037, 218758, 208329, 199570, 192537, 187165, 183207, 180277, 178348, 177686, 177939, 177784, 175905, 171961, 166403, 159986, 153871, 149588, 148020, 148502, 149419, 149681, 149312, 148801, 148356, 147872, 147354, 147176, 147778, 148951, 149599, 148700, 146604, 144911, 144895, 146406, 148381, 149932, 150776, 151225, 152127, 154242, 157296, 160045, 161630, 162377, 162999, 163761, 164927, 167194, 170704, 174147, 175898, 175894, 175504, 175712, 176383, 177313, 178836, 180881, 182222, 181472, 178653, 175312, 172971, 171592, 169658, 165778, 160241, 154842, 151198, 149498, 148936, 148773, 148533, 147612, 145468, 142289, 139048, 136768, 135851, 135938, 136199, 136014, 135624, 135978, 137708, 140463, 143390, 145809, 147197, 147083, 145531, 143381, 141534, 140350, 140067, 141070, 143033, 144499, 144360, 143486, 143907, 146609, 151008, 156204, 161546, 166172, 169391, 171765, 174637, 178356, 182077, 185496, 189461, 194424]
54337A94424N252N164N954P254P206N398L671L453L943L788K948J995R18m19j629
54322B49320k630m082o006p022o152m519l826l885l271k042j906l465n009m806
54308A90699l237j781r15j58M86M26l09q21m25N79J434J646J130J19q49j194p28
54291A86102K44J206J678J514J203J571K657L304K596J396J412K834M046L937
54277B15700L168K659K112J076L47R60K305K648J316p21k370l444m120m402m317
54262B12917l999l545l202l497m464n124m649l706l579m182m249l388k540k255
54248A60538k050j833k453l986m927m154k709k415l461m471m375l126j095J080
54234A20563K264J633j22j277q86M03J375J424N27j223l434n020m635k112P94
$$ y = [194424, 199676, 204840, 210794, 218048, 225254, 230652, 234323, 237776, 241719, 245507, 248455, 250450, 251368, 250949, 249320, 246690, 242608, 236602, 229580, 223428, 218909, 215083, 211198, 207927, 205885, 203979, 200514, 195505, 190699, 187462, 185681, 184766, 184608, 185094, 185520, 185211, 184390, 183965, 184544, 185978, 187624, 188754, 188873, 188024, 186830, 186102, 186346, 187552, 189230, 190744, 191947, 193518, 196175, 199479, 202075, 203471, 204883, 207717, 211763, 215700, 218868, 221527, 223639, 224715, 225062, 226022, 228327, 230975, 232291, 231570, 229200, 225756, 221636, 217234, 212917, 208918, 205373, 202171, 198674, 194210, 189086, 184437, 180731, 177152, 172970, 168721, 165333, 162793, 160538, 158488, 156655, 154202, 150216, 145289, 141135, 138426, 136011, 132550, 128079, 123704, 120578, 119483, 120563, 122827, 124460, 124338, 123061, 122175, 122578, 123953, 125377, 125904, 124681, 121247, 116227, 111592, 109480, 110274]
54219A10274J708K08j522j194Q86K525K616K085J907J671P05n73j220q92K01J615
54203A21000K477J948N24j76L79Q10J21m83N31K372K871J529j12q41p71j21J249
54186A33307K644K592Q08r90j128N8J014R86N19L65O20P71K08j083k206k094q63
54169A35528P4l31j342j293K66J991K543K220K193K518K141J000Q08K579M433
54154A55328L622L46k316k535j786j955k454j743k31L65k85r71j105j235j652
54139A41393k048k495l228l535k465o91lq07j650j610j318j197m81J011J827R19
54123A23622n55q98l37l17j055j443j052p33j140j846k131j798j013j79M2o07
54107A08560j231n31J509L413M051L774L360K639J071q49j851j495p19n84j219
$$ y = [110274, 111982, 112190, 110668, 109474, 110360, 112885, 115501, 117586, 119493, 121164, 121869, 121296, 120076, 119184, 119385, 121000, 123477, 125425, 125949, 125773, 126152, 126962, 127083, 126600, 127131, 129503, 132374, 133903, 133791, 132950, 132179, 132058, 133307, 135951, 138543, 139351, 138361, 137233, 137291, 138305, 139291, 139810, 140175, 140795, 141566, 141774, 140691, 138485, 136391, 135528, 135602, 135271, 133929, 132636, 132902, 134893, 137436, 139656, 141849, 144367, 146508, 147508, 148316, 150895, 155328, 158950, 159296, 156980, 154445, 152659, 150704, 148250, 146507, 146276, 146641, 146356, 145385, 144280, 143045, 141393, 139345, 136850, 133622, 130087, 127622, 126931, 126928, 126121, 124471, 122861, 121543, 120346, 119865, 120876, 122703, 123622, 123067, 122169, 121832, 121515, 120460, 119017, 117965, 117232, 116092, 114246, 112115, 110317, 109304, 109125, 109167, 108560, 107329, 106798, 108307, 111720, 115771, 119545, 122905, 125544, 126615, 125766, 123915, 122420, 121701, 121117, 119898]
54092A19898k166k985l157k104l7J749K240J929J767J438n7k251l191k000RJ284
54076A12366J662J365j07k614m317l748k078j411j539n76J465K324J117q0O00
54061A04429K004J902L03p64l2J848L438L596J872r89l141l184j567J26Q85O87
54045A11413k40j496k200j623k13R20J453K030K970L601L058J208j290l263l527
54030A12801j892K30J061M43j89L1K72l63j102n03J380K949L046J951M95o74p69
54013A19167Q88L468M605K972J42j335j224j298k029j724L94K336K090P47Q90
53998A30089K715L990L575K782K804K830J688n9r33m93N03J253J397J023R00J986
53982A56050L956N051M299L051L121M205M630M231M587O309P844P727O652O335
$$ y = [119898, 117732, 114747, 111590, 109486, 109449, 111198, 113438, 115367, 117134, 118572, 118515, 116264, 113073, 111073, 111082, 112366, 114028, 115393, 115286, 112672, 108355, 104607, 102529, 101118, 99579, 99003, 100468, 102792, 103909, 103829, 104429, 106433, 108335, 108638, 107874, 107842, 109690, 113128, 116724, 118596, 117607, 114466, 111282, 109715, 109841, 110726, 111413, 111173, 109677, 107477, 105854, 105641, 106561, 108014, 110044, 113014, 116615, 119673, 120881, 119591, 116328, 112801, 110909, 111139, 112200, 112643, 112454, 112485, 112757, 112394, 111292, 110789, 112169, 115118, 118164, 120115, 120610, 119936, 119167, 120055, 123523, 128128, 131100, 131242, 129907, 128683, 127385, 125356, 123632, 124026, 126362, 128452, 129199, 130089, 132804, 136794, 140369, 143151, 145955, 148785, 150473, 150414, 149481, 148988, 149491, 150744, 152141, 153164, 154064, 156050, 160006, 165057, 169356, 172407, 175528, 179733, 184363, 188594, 193181, 199490, 207334, 215061, 221713, 228048]
53968B28048P206Q286Q737Q563Q021P291O791P020P876Q522Q189O816M974L420
53954C29760K770L120L698L273J310j310l028l168k470k112k449l033l520m107
53940C18734n031o056o708o778o437o055o043o466o619n435k923q30r72k882m111
53925B45388l270j810j916l425m205l169j439k99N08J614K542K505J834J325P79
53910B36962l81j511j359j81M23L3J10J567L156L182J655j73j326j311P7K006
53894B42929K742J652K03j04K91L89N93J484J810J40k146k122N25L101L862L789
53878B59138L929L675K758K496L526M357L865L394M494O155O353N069L694K521
53864C15424J021j86J20J480K267K315L104N286P741R310R761R043P337O015O670
$$ y = [228048, 235254, 243540, 252277, 260840, 268861, 276152, 282943, 289963, 297839, 306361, 314550, 321366, 326340, 329760, 332530, 335650, 339348, 342621, 343931, 342621, 339593, 336425, 333955, 331843, 329394, 326361, 322841, 318734, 313703, 307647, 300939, 294161, 287724, 281669, 275626, 269160, 262541, 257106, 254183, 253353, 252381, 249499, 245388, 242118, 240308, 238392, 234967, 230762, 227593, 226154, 225855, 226363, 227977, 230519, 233024, 234858, 236183, 236962, 236581, 235070, 233711, 233530, 233953, 233986, 234096, 235663, 238819, 242001, 243656, 243483, 242157, 240846, 240923, 242929, 245671, 247323, 247526, 247422, 247713, 248102, 248695, 250179, 251989, 252129, 249983, 247861, 248386, 251487, 255349, 259138, 263067, 266742, 269500, 271996, 275522, 279879, 283744, 287138, 291632, 297787, 304140, 309209, 312903, 315424, 316445, 316259, 316379, 317859, 320126, 322441, 325545, 330831, 338572, 347882, 357643, 366686, 374023, 380038, 386708]
53849C86708Q762R954R230P950P286O578N265M470N132N905M766J841r24k352
53835D60571k778k730k340j985k190k864l594m577o201p857q401p889p674q403
53821C91088r069q649p752p718q658r350q902p722o691o036n372m561m076m465
53807B92067n673p027p773p490o190m438l350l812n398o470n947m637m170m797
53793B14895n042l728j528NL26J82K19J42n84j683k168j464k42O1j306l493m821
53776A89771m463l070j691n67N15J223R25p5m97K96J294J095k89j602k021j820
53760A79024j394n46Q87K408L398L860M068L902L192K437K397L013L357K899K107
53745B15009J632J522J638K271L697N557P137Q036Q098P183N631M519M538M839
$$ y = [386708, 395470, 405424, 414654, 422604, 429890, 436468, 441733, 446203, 451335, 457240, 462006, 463847, 462923, 460571, 457793, 455063, 452723, 450738, 448548, 445684, 442090, 437513, 431312, 423455, 415054, 407165, 399491, 391088, 382019, 373370, 365618, 357900, 349242, 339892, 330990, 323268, 316577, 310541, 305169, 300608, 296532, 292067, 286394, 279367, 271594, 264104, 257914, 253476, 250126, 246314, 240916, 234446, 228499, 223862, 219692, 214895, 209853, 206125, 204597, 204602, 204928, 205110, 205329, 205471, 204887, 203204, 201036, 199572, 199330, 199391, 198085, 194592, 189771, 185308, 182238, 180547, 179980, 180495, 181718, 182643, 182568, 182071, 182367, 183661, 184756, 184467, 182865, 180844, 179024, 177630, 177084, 177971, 180379, 183777, 187637, 191705, 195607, 198799, 201236, 203633, 206646, 210003, 212902, 215009, 216641, 218163, 219801, 222072, 225769, 231326, 238463, 246499, 254597, 261780, 267411, 271930, 276468, 281307]
53731B81307M159K984L272N615Q049Q453P009N270L834K436J555K131L618M039
53717C43731K465K14j025j142j088j358j767k131k351k370k555l581n320o351
53703C15371n392k781n6J450J097j146m231o116n594l907l246l694l136n80J886
53688B79925J615j006k882k000L28J448O06p41j371j684k326k663j904r91j688
53673B64666l732m645l111j023q80k357l059j968m94j86r51j763j907j157K59
53658B37692J638K347K575K855K985K355J221N74P30J178J890L532N950P714P686
53643B82922O198M198K323J265J846L908N930O640O336N971N825N790O121O846
53629C52119P071N950M020K696K618L230L753L819L345K497J777J605J840J977
$$ y = [281307, 285466, 288450, 291722, 297337, 305386, 313839, 320848, 326118, 329952, 332388, 333943, 336074, 339692, 343731, 346196, 346410, 345385, 344243, 343155, 341797, 340030, 337899, 335548, 333178, 330623, 327042, 321722, 315371, 309979, 307198, 307142, 308592, 309689, 308543, 304312, 298196, 292602, 288695, 285449, 281755, 278619, 278039, 279925, 281540, 280534, 277652, 275652, 275980, 277428, 278034, 277293, 275922, 274238, 271912, 269249, 267345, 266354, 264666, 260934, 256289, 253178, 252155, 251275, 248918, 245859, 243891, 243397, 243211, 242260, 240497, 238590, 237433, 237692, 239330, 241677, 244252, 247107, 250092, 252447, 253668, 254242, 254972, 256150, 258040, 261572, 267522, 275236, 282922, 289120, 293318, 295641, 296906, 298752, 302660, 308590, 315230, 321566, 327537, 333362, 339152, 345273, 352119, 359190, 365140, 369160, 371856, 374474, 377704, 381457, 385276, 388621, 391118, 392895, 394500, 396340, 398317]
53615C98317J660Q07m14j477j794j385q89o71n25m20q57k075l558m586m727l598
53599C73808j213J111J418n00k511k777j941j625j883j646q89o30j155j682j723
53584C56162j462q99J59J325J919J970J909J511L26r88j073K80J842K539K353
53569C67873J691J050J285K939N129O267N989N214M426L451K914M023O257P116
53555D25624N286K542J379K048L291M656O362P731P797P134P338Q527R017P846
53541E06578O184N547N794N877N758O331P718Q766Q625P956P973Q695Q941Q043
53527F08786O694N816N294M502L619L501M298N066M987M314L797L638L375K542
53513F70229J187j04o16j61P07J378J875K442K734K161J000L19N91J089R92L93
$$ y = [398317, 399977, 400784, 400370, 398893, 397099, 395714, 394825, 394154, 393629, 393209, 392352, 390277, 386719, 382133, 377406, 373808, 372595, 373706, 375124, 374624, 372113, 369336, 367395, 365770, 363887, 362241, 361352, 360722, 359567, 357885, 356162, 354700, 353801, 353960, 355285, 357204, 359174, 361083, 362594, 362920, 361932, 360859, 361139, 362981, 365520, 367873, 369564, 370614, 371899, 374838, 379967, 386234, 392223, 397437, 401863, 405314, 408228, 412251, 418508, 425624, 430910, 433452, 434831, 436879, 440170, 444826, 451188, 458919, 466716, 473850, 481188, 489715, 498732, 506578, 512762, 518309, 524103, 529980, 535738, 542069, 549787, 558553, 567178, 575134, 583107, 591802, 600743, 608786, 615480, 621296, 626590, 631092, 634711, 638212, 642510, 647576, 652563, 656877, 660674, 664312, 667687, 670229, 671416, 671312, 670696, 670535, 671242, 672620, 674495, 676937, 679671, 681832, 682832, 683151, 683742, 684831, 685823, 686216]
53497F86216q6oQ99K622M336M665L306J753J568K454K983K828L024L960M509L701
53481G28732K377K117L042L712L260K653L304N145O832P629Q176R284J0788J1978
53467H09029J2636J3095J3606J4148J4608J4778J4634J5017J7245K1186K4323
53456I84305K4219K1720K0356K2226K5830K8446K9260K9149K8705K8064K8147
53445A270427L0213L3883L6982L8065L8243L9635M2615M5589M7217M7848M8465
53434A719182M9148M9366M9170M9082M8952M7942M5976M4315M4189M5419M6917
53423B239658M7886M8058M7313M5911M4675M4223M4233M3926M2967M1375L9198
53412B729423L6899L5412L4999L4584L3158L1051K8871K6131K2361J8725J6568
$$ y = [686216, 686130, 686124, 687023, 689645, 693981, 698646, 701952, 703705, 705273, 707727, 710710, 713538, 716562, 720522, 725031, 728732, 731109, 733226, 736268, 739980, 743240, 745893, 749197, 754342, 761174, 768803, 776979, 786263, 797051, 809029, 821665, 834760, 848366, 862514, 877122, 891900, 906534, 921551, 938796, 959982, 984305, 1008524, 1030244, 1050600, 1072826, 1098656, 1127102, 1156362, 1185511, 1214216, 1242280, 1270427, 1300640, 1334523, 1371505, 1409570, 1447813, 1487448, 1530063, 1575652, 1622869, 1670717, 1719182, 1768330, 1817696, 1866866, 1915948, 1964900, 2012842, 2058818, 2103133, 2147322, 2192741, 2239658, 2287544, 2335602, 2382915, 2428826, 2473501, 2517724, 2561957, 2605883, 2648850, 2690225, 2729423, 2766322, 2801734, 2836733, 2871317, 2904475, 2935526, 2964397, 2990528, 3012889, 3031614, 3048182]
53401C048182J5006J2123Q270N659M547K517j712o370r794j3003j7373k1793k4374
53388C001885k5583k7355l0016l2256l3635l5085l7062l8906m0106m0923m1707
53377B619251m2576m3530m4183m3791m2364m0961m0091l8692l5923l2740l0283
53366B184117k7886k4532k1237j9597j8721j6153j1753p979o123m733k348O99
53354B023754L936P830J2045J4823J5662J6766K0128K4608K7796K9508L1492L4508
53342B262856L7607M0071M2286M4716M7301N0045N3208N6705O0004O2681O4841
53331B822321O7134P0565P5559Q0937Q4651Q6185Q7211Q9188R1407R2482R2690
53320C740330R3288R4328R4811R4636R4580R4509R3320R0816Q8099Q5755Q3079
$$ y = [3048182, 3063188, 3075311, 3083581, 3089240, 3093787, 3096304, 3094592, 3088222, 3078428, 3065425, 3048052, 3026259, 3001885, 2976302, 2948947, 2918931, 2886675, 2853040, 2817955, 2780893, 2741987, 2701881, 2660958, 2619251, 2576675, 2533145, 2488962, 2445171, 2402807, 2361846, 2321755, 2283063, 2247140, 2214400, 2184117, 2156231, 2131699, 2110462, 2090865, 2072144, 2055991, 2044238, 2036259, 2030136, 2025403, 2023055, 2023754, 2027690, 2035520, 2047565, 2062388, 2078050, 2094816, 2114944, 2139552, 2167348, 2196856, 2228348, 2262856, 2300463, 2340534, 2382820, 2427536, 2474837, 2524882, 2578090, 2634795, 2694799, 2757480, 2822321, 2889455, 2960020, 3035579, 3116516, 3201167, 3287352, 3374563, 3463751, 3555158, 3647640, 3740330, 3833618, 3927946, 4022757, 4117393, 4211973, 4306482, 4399802, 4490618, 4578717, 4664472, 4747551]
53309D747551P9503P5365P0786O5029N7795N0009M2645L5626K8543K1526J4612
53298E288990P264o17q044j4360k0582k8173l6877m4941n1391n7059o3246p0164
53286D900800p6935q2542q6651q9762r2503r4715r5637r5206r4510r4298r3762
53275C904279r1750q8780q6596q5774q4967q2817p9597p6517p4164p2170o9858
53264C011289o6830o3236n9738n6731n3649m9572m4660m0213l7095l4813l2554
53253B472198l0314k8427k6656k4483k1973j9675j7906j6522j5106j3235j0866
53242B247035q649p132n616k725J436M899O468P568J0139J3709J6249J7349J8706
53229B319436K1453K4773K7517K9671L1611L3215L4397L5583L7044L8650M0597
$$ y = [4747551, 4827054, 4902419, 4973205, 5038234, 5096029, 5146038, 5188683, 5224309, 5252852, 5274378, 5288990, 5296254, 5295637, 5287593, 5273233, 5252651, 5224478, 5187601, 5142660, 5091269, 5034210, 4970964, 4900800, 4823865, 4741323, 4654672, 4564910, 4472407, 4377692, 4282055, 4186849, 4092339, 3998041, 3904279, 3812529, 3723749, 3637153, 3551379, 3466412, 3383595, 3303998, 3227481, 3153317, 3081147, 3011289, 2944459, 2881223, 2821485, 2764754, 2711105, 2661533, 2616873, 2576660, 2539565, 2504752, 2472198, 2441884, 2413457, 2386801, 2362318, 2340345, 2320670, 2302764, 2286242, 2271136, 2257901, 2247035, 2238386, 2231254, 2225638, 2222913, 2224349, 2229248, 2235716, 2243284, 2253423, 2267132, 2283381, 2300730, 2319436, 2340889, 2365662, 2393179, 2422850, 2454461, 2487676, 2522073, 2557656, 2594700, 2633350, 2673947]
53218B673947M3330M6291M7852M7168M5024M2285L8783L4667L1385K9868K8638
53207C109238K5528K0710J6323J3259J0213O132J999o85k094l834p088j1566j6025
53194C162110j9524k2447k6270l1761l7503m1184m2433m3270m5290m7660m8804
53183B755964m9027m9869n1462n2247n1580n0899n1478n2238n1076m7903m4924
53172B203261m3866m3981m3294m0985l8003l5755l4936l5264l5666l4788l2037
53161A784686k8420k5810k5064k5141k4432k2562k0452j8842j7517j6112j5021
53150A545313j4949j5887j7200j8568k0113k1418k1365j9608j7534j6859j7599
53139A344213j8416j8666j8845j9058j8665j7932j8389k0416k1940k1011j8707
$$ y = [2673947, 2717277, 2763568, 2811420, 2858588, 2903612, 2945897, 2984680, 3019347, 3050732, 3080600, 3109238, 3134766, 3155476, 3171799, 3185058, 3195271, 3201403, 3203402, 3202717, 3200623, 3196789, 3189701, 3178135, 3162110, 3142586, 3120139, 3093869, 3062108, 3024605, 2983421, 2940988, 2897718, 2852428, 2804768, 2755964, 2706937, 2657068, 2605606, 2553359, 2501779, 2450880, 2399402, 2347164, 2296088, 2248185, 2203261, 2159395, 2115414, 2072120, 2031135, 1993132, 1957377, 1922441, 1887177, 1851511, 1816723, 1784686, 1756266, 1730456, 1705392, 1680251, 1655819, 1633257, 1612805, 1593963, 1576446, 1560334, 1545313, 1530364, 1514477, 1497277, 1478709, 1458596, 1437178, 1415813, 1396205, 1378671, 1361812, 1344213, 1325797, 1307131, 1288286, 1269228, 1250563, 1232631, 1214242, 1193826, 1171886, 1150875, 1132168]
53128A132168j7720j8779k0354k1489k2700k3877k3625k1550j9408j8871j9433
53117I04362j9696j9442j9230j8922j8060j7046j6634j6637j6255j5399j4639
53106G12402j4079j3284j2206j1395j1212j1542j2083j2404j1992j0891j0014
53095E81300j0090j0668j0828j0541j0323r949q625o529n044n083o046o874p349
53082D73351p752p785o809n071l994m678o382p178o261m848m198l560j424J596
53068D05007K859J232j199j912j054m13n67p77r51j754k949l493l436m026n511
53053C81056o350n298l110j429q77r56j124j123p27J25J107J768J907J544Q51
53038C67364J90l0L08J044J945K641K599J690N81O0J24K42K08P8l81j343k278
$$ y = [1132168, 1114448, 1095669, 1075315, 1053826, 1031126, 1007249, 983624, 962074, 942666, 923795, 904362, 884666, 865224, 845994, 827072, 809012, 791966, 775332, 758695, 742440, 727041, 712402, 698323, 685039, 672833, 661438, 650226, 638684, 626601, 614197, 602205, 591314, 581300, 571210, 560542, 549714, 539173, 528850, 518901, 510276, 503747, 498703, 493620, 487574, 480700, 473351, 465599, 457814, 451005, 445934, 441940, 437262, 430880, 423702, 417441, 412593, 408395, 404835, 403411, 405007, 407866, 409098, 407899, 405987, 404933, 404520, 403953, 403176, 402225, 400471, 397522, 394029, 390593, 386567, 381056, 374706, 369408, 366298, 364869, 363992, 363036, 361912, 360789, 360062, 360187, 361294, 363062, 364969, 366513, 367364, 367554, 367524, 367832, 368876, 370821, 373462, 376061, 377751, 378332, 378392, 378516, 378758, 378966, 379044, 378663, 377320, 375042]
53021C75042k528k358k491k800k636k272k715l946m728m548m432n240o353o763
53007C21232o419n660m320k445j072j230k522l572l658l219l029l366l884l872
52993B72964l028k154k486l963m995m519l448l235l670l338j847m22j76q40j531
52978B33312j846j810j382o58j85m80j217j428p40o7o03k186l268k685r30O52
52962B14479J368J249K63j458k891k800j326L6L47J28J16J81N9K25J107K016J713
52945B14812q2k287l337k352J29K359K847J884J028R41O54o18j997k044o22J166
52929B12481K310K400J426q5j128j266j215j695k208j787m76Q02J461J460P47
52914B13227m29j024j72J469K353K053J581J721K153K342K282K012J379O16L34
$$ y = [375042, 372514, 370156, 367665, 364865, 362229, 359957, 357242, 353296, 348568, 344020, 339588, 334348, 327995, 321232, 314813, 309153, 304833, 302388, 301316, 300086, 297564, 293992, 290334, 287115, 284086, 280720, 276836, 272964, 269936, 267782, 265296, 261333, 256338, 251819, 248371, 245136, 241466, 238128, 236281, 235859, 235683, 234843, 233312, 231466, 229656, 228274, 227616, 227431, 226951, 225734, 224306, 223566, 223499, 222896, 220710, 217442, 214757, 213827, 214479, 215847, 217096, 217359, 215901, 213010, 210210, 208884, 208920, 209267, 209395, 209511, 209692, 209751, 209976, 211083, 213099, 214812, 214730, 212443, 209106, 206754, 206883, 209242, 212089, 213973, 215001, 215942, 216596, 215978, 213981, 211937, 211315, 212481, 214791, 217191, 218617, 218532, 217404, 216138, 214923, 213228, 211020, 209233, 208757, 209559, 211020, 212480, 213227, 212798, 211774, 211602, 213071, 215424, 217477, 219058, 220779, 222932, 225274, 227556, 229568, 230947, 231563, 231897]
52899B31897N38N23J84N87K501N032O476O209N055M068L722M163N499P437R012
52884B92903R210P859N838M254L467K998K338J575J077P68J24j092k385k945k452
52869C23537j415p78j054j880k469k559k602k922l013k143m98P49O46n07j530
52854C01562j701j503j857k795l272k557j306o80p06l11R95K371K820K322J382
52839B94764K61p86j234r94q40j309j754j259j06O27O69P36J195J551J354Q16
52823B93691K87j27k84R2Q96J594J782J436O00n28j198n72J146K685L133K732
52807C07365K025R43n71j660j198O53K320K471J434O41R33J698J763Q81nR2J166
52790C20951K512L496L589K178o67l231l127J16M093N984N525M694M810N117M481
$$ y = [231897, 232435, 232958, 233142, 233729, 236230, 241262, 247738, 253947, 259002, 263070, 266792, 270955, 276454, 283891, 292903, 302113, 309972, 315810, 320064, 323531, 326529, 328867, 330442, 331519, 332287, 332411, 331319, 328934, 325989, 323537, 322122, 321344, 320290, 318410, 315941, 313382, 310780, 307858, 304845, 302702, 302204, 302953, 303599, 303092, 301562, 299861, 298358, 296501, 293706, 290434, 287877, 286571, 285891, 285185, 284874, 285869, 288240, 291060, 293382, 294764, 295025, 294239, 293005, 292011, 291171, 289862, 288108, 286849, 286743, 287370, 288039, 288775, 289970, 291521, 292875, 293691, 293978, 293851, 293567, 293659, 294555, 296149, 297931, 299367, 299967, 299439, 298241, 297669, 298815, 301500, 304633, 307365, 309390, 310333, 309762, 308102, 306904, 307557, 309877, 312348, 313782, 314423, 315356, 317054, 318817, 319698, 319693, 319785, 320951, 323463, 326959, 330548, 332726, 332059, 328828, 325701, 325817, 329910, 335894, 341419, 346113, 350923, 356040, 360521]
52775C60521L203K209J306l04k036j955N77L503M349L157J969J822J753P79m84
52760C80369r33o61o27j121j467j100l59m6n82j595k392k771l243m157m895m525
52744C49895l171k033k006k974m464o078p122o840n530m498m392m473m097l841
52730B88376m357n018m714l404j977j123j155k111l249l308k214j638k615l699
52716B47794l001j172m45j303k175k186k057k194j998j511j704k503k462j183
52702B21900k76q91j943j956j179n67r3M77L77q13j605l04K152K929P57k807n562
52685B10596o588n907l839j452l31j011k177k159q86J73k00j693k875k632j254
52670A77765q3j52j203k257k690k482j685n07K25m13j992k602r42J790L000J588
$$ y = [360521, 363724, 365933, 367239, 366935, 364899, 362944, 363521, 367024, 371373, 374530, 376499, 378321, 380074, 380853, 380369, 379436, 378775, 378148, 377027, 375560, 374460, 374101, 374055, 373473, 371878, 369486, 366715, 363472, 359315, 354420, 349895, 346724, 344691, 342685, 339711, 335247, 329169, 322047, 315207, 309677, 305179, 300787, 296314, 292217, 288376, 284019, 279001, 274287, 270883, 268906, 267783, 266628, 264517, 261268, 257960, 255746, 254108, 251493, 247794, 244793, 243621, 243176, 241873, 239698, 237512, 235455, 233261, 231263, 229752, 228048, 225545, 223083, 221900, 221624, 220733, 218790, 216834, 215655, 215088, 214995, 215472, 215849, 215036, 213431, 213127, 215279, 218208, 218965, 216158, 210596, 204008, 198101, 194262, 192810, 192479, 191468, 189291, 187132, 186246, 186419, 186219, 184526, 181651, 179019, 177765, 177682, 177530, 176327, 174070, 171380, 168898, 167213, 166706, 166931, 166518, 164526, 161924, 160982, 162772, 165772, 167360]
52654A67360r35k371k165j419j206j592k007j915j151j56K51r1n4J432L443L681
52638A61105J482j001j448j99O90M32M1K23L20l36j263j652j390p51L55K110M111
52621A62829N395N321M321L724M493N970O450N279L773L357L602L096J752P59
52607B20121M93p9j667l556m663m735m139l284k588k288k121j720j244j037r88
52592A86505j207k644n578p963p289m039j283n63m13M74J129N22l38l03j91j076
52576A55743k067j800r40j020j736j585m55M35P83J320J899J515J66j036j662
52561A49560k153k292j301L72J088K81q11j120r75q61m00P17J881K358K155J634
52545A50133J002N12L98L69m6n24k15Q58J660J548R62N20M06P77J729K638K587
$$ y = [167360, 166425, 164054, 161889, 160470, 159264, 157672, 155665, 153750, 152599, 152443, 152694, 152603, 152549, 153981, 157424, 161105, 162587, 161586, 160138, 159939, 160629, 161061, 161102, 161325, 161645, 161309, 160046, 158394, 157004, 156253, 156608, 158718, 162829, 168224, 173545, 177866, 181590, 186083, 192053, 198503, 203782, 207555, 210912, 214514, 217610, 219362, 220121, 220614, 220535, 218868, 215312, 210649, 205914, 201775, 198491, 195903, 193615, 191494, 189774, 188530, 187493, 186505, 185298, 182654, 177076, 169113, 161824, 157785, 156502, 155939, 155526, 156000, 157129, 157651, 157313, 157010, 156819, 155743, 153676, 151876, 150936, 149916, 148180, 146595, 146140, 146575, 147358, 148678, 150577, 152092, 152258, 151222, 149560, 147407, 145115, 143814, 144186, 145274, 145555, 144744, 143624, 142649, 141788, 141388, 142105, 143986, 146344, 148499, 150133, 151135, 151647, 152045, 152414, 152368, 151844, 151629, 152487, 154147, 155695, 156657, 157177, 157583, 158360, 160089, 162727, 165314]
52528A65314J686R57P96O83M99P95J467J574R60O41J021J213Q05P14J311J333
52512A81769Q7o95R12L914N387M239K221J274J419J561J133N02M27J382K985M175
52496B12692M200L260J862K16j251j567l85J141J698J496J604K139K348K190K341
52481B33984K660K173Q54Q8Q00K106K485J523K6j003j083m41J66K16Q2M16R56
52464B46008Q15pl65L79J360J379M66l95n36j05L18K14l87o35L36K140L208K596
52446B56789J014l13j108j799k375k377j723q69k22J78M94Q68J120O50p46j984
52430B47597j576J94J203L52o18N24L287N145M919L692K542J246l12j138m51J029
52414B67635K003K103J912K022K659L624M199L512J522q22k517l077k182K10L136
$$ y = [165314, 167000, 167957, 168753, 169436, 169935, 170730, 172197, 173771, 174731, 175372, 176393, 177606, 178411, 179125, 180436, 181769, 181856, 181161, 182073, 185987, 191374, 195613, 197834, 199108, 200527, 202088, 203221, 203723, 204150, 205532, 208517, 212692, 216892, 220152, 222014, 222230, 220979, 219412, 219027, 220168, 221866, 223362, 224966, 227105, 229453, 231643, 233984, 236644, 238817, 239671, 239759, 240559, 242665, 245150, 246673, 246699, 245696, 244613, 244172, 244338, 244554, 244636, 245052, 246008, 246823, 246816, 246451, 246830, 248190, 249569, 250035, 249640, 249104, 248999, 249317, 249531, 249144, 248509, 248845, 250985, 254193, 256789, 257803, 257490, 256382, 254583, 252208, 249831, 248108, 247239, 247017, 247195, 247689, 248557, 249677, 250327, 249581, 247597, 246021, 246215, 247418, 247770, 247152, 247676, 250963, 256108, 261027, 264719, 267261, 268507, 268195, 267057, 266606, 267635, 269638, 271741, 273653, 275675, 278334, 281958, 286157, 289669, 291191, 290369, 287852, 284775, 282593, 282803, 285939]
52399B85939M947M992M138L199J911J53r81n61N02M84p89j802j371K89K337M036
52383C07423M724M076K645J445Q50N32L86O89J249J305N40m49r32p42m2J046K184
52366C26929K678J967K55j480k027q24J388K987K964J927J317J884L186M216M072
52351C51439K491L25r48q55o02j421k824l461l167k876k815k203q22M79J044J140
52335C34924J202J327J631K119K151J082m95j359j380j451j713j471q69r27j501
52320C33270j169K99J235P28J43Q05K044K792L389M236M329L030J906K660M355
$$ y = [285939, 290886, 295878, 300016, 303215, 305126, 305279, 304298, 303737, 304239, 304723, 303934, 302132, 300761, 301050, 303387, 307423, 312147, 316223, 318868, 320313, 321163, 321695, 322081, 322770, 324019, 325324, 325864, 325415, 324483, 323741, 323699, 324745, 326929, 329607, 331574, 331829, 330349, 328322, 327498, 328886, 331873, 334837, 336764, 338081, 339965, 343151, 347367, 351439, 353930, 354255, 353307, 352452, 351850, 350429, 347605, 344144, 340977, 338101, 335286, 333083, 332261, 332740, 333784, 334924, 336126, 337453, 339084, 341203, 343354, 344436, 343941, 342582, 341202, 339751, 338038, 336567, 335698, 334771, 333270, 332101, 332400, 333635, 334363, 334506, 335311, 337355, 340147, 343536, 347772, 352101, 355131, 357037, 359697, 364052]
$$ [...]
##END NTUPLES=NMR SPECTRUM
##END=
