
##TITLE=AC1043_TOIB01_5858525_2lf3t6XJn0
##JCAMPDX= 6.0         $$ Bruker NMR JCAMP-DX V2.0
##DATA TYPE= NMR SPECTRUM
##DATA CLASS= NTUPLES
##ORIGIN= BRUKER
##OWNER= Administrator
$$ 1.72 TOPSPIN		Version 2.1
$$ 2012-03-29 19:00:46.875 -0500  Administrator@TOPSPIN
$$ Compression mode = diff/dup
##.OBSERVE FREQUENCY= 400.13188235
##.OBSERVE NUCLEUS= ^1H
##.ACQUISITION MODE= SIMULTANEOUS (DQD)
##.ACQUISITION SCHEME= undefined
##.AVERAGES= 8
##.DIGITISER RES= 22
##SPECTROMETER/DATA SYSTEM= spect
##.PULSE SEQUENCE= zg30
##.SOLVENT NAME= COFFEE_meoh
##.SHIFT REFERENCE= INTERNAL, COFFEE_meoh, 1, 14.98061
##AUDIT TRAIL= $$ (NUMBER, WHEN, WHO, WHERE, PROCESS, VERSION, WHAT)
$$ ##TITLE= Audit trail, TOPSPIN		Version 2.1
$$ ##JCAMPDX= 5.01
$$ ##ORIGIN= Bruker BioSpin GmbH
$$ ##OWNER= Administrator
$$ $$ C:\Bruker\TOPSPIN/data/COFFEE/nmr/AC1043_TOIB01_5858525_2lf3t6XJn0/10/pdata/1/auditp.txt
$$ ##AUDIT TRAIL=  $$ (NUMBER, WHEN, WHO, WHERE, PROCESS, VERSION, WHAT)
(   1,<2012-03-29 19:00:37.562 -0500>,<Administrator>,<TOPSPIN>,<go>,<TOPSPIN 2.1>,
      <created by zg
	started at 2012-03-29 18:59:30.250 -0500,
	POWCHK enabled, PULCHK disabled,
       configuration hash MD5:
       1A 1E CE 29 27 FD 77 03 67 4E F0 E3 C4 B2 CB 90
       data hash MD5: 64K
       C7 0F 81 AD C1 EF C1 50 6E F2 7D B3 FF 5C 08 B5>)
(   2,<2012-03-29 19:00:42.609 -0500>,<Administrator>,<TOPSPIN>,<proc1d>,<TOPSPIN 2.1>,
      <Start of raw data processing
       efp LB = 0 FT_mod = 6 PKNL = 1 PHC0 = 0 PHC1 = 0 SI = 32K 
       data hash MD5: 32K
       F0 E5 65 FA 11 86 DC 85 FF 9E 93 07 22 9E DC E9>)
(   3,<2012-03-29 19:00:42.906 -0500>,<Administrator>,<TOPSPIN>,<proc1d>,<TOPSPIN 2.1>,
      <pk PHC0 = 212.547 PHC1 = 0 
       data hash MD5: 32K
       15 3C D9 86 AF 26 29 41 7C 4B 12 1D 3F 14 C9 4F>)
(   4,<2012-03-29 19:00:42.984 -0500>,<Administrator>,<TOPSPIN>,<proc1d>,<TOPSPIN 2.1>,
      <abs ABSG = 1 
       data hash MD5: 32K
       1A 5E AF 30 4E E1 81 63 BD F9 3C E2 DA 77 C4 47>)
(   5,<2012-03-29 19:00:43.000 -0500>,<Administrator>,<TOPSPIN>,<proc1d>,<TOPSPIN 2.1>,
      <abs ABSG = 2 
       data hash MD5: 32K
       F0 B7 45 97 31 92 F0 3A CE 82 AD D7 C1 75 C4 02>)
(   6,<2012-03-29 19:00:43.031 -0500>,<Administrator>,<TOPSPIN>,<proc1d>,<TOPSPIN 2.1>,
      <abs ABSG = 3 
       data hash MD5: 32K
       F1 2A E2 9F 4A 1D 42 64 D8 99 2A 9A C4 3A 1C 87>)
(   7,<2012-03-29 19:00:43.062 -0500>,<Administrator>,<TOPSPIN>,<proc1d>,<TOPSPIN 2.1>,
      <abs ABSG = 4 
       data hash MD5: 32K
       49 09 78 93 4F C1 35 B4 D7 50 58 02 87 4F 37 08>)
(   8,<2012-03-29 19:00:43.093 -0500>,<Administrator>,<TOPSPIN>,<proc1d>,<TOPSPIN 2.1>,
      <abs ABSG = 5 
       data hash MD5: 32K
       47 6E 79 8C 1B 82 71 C1 41 FE 0C DC DA B4 99 C4>)
$$ ##END=
$$ 
$$ $$ hash MD5
$$ $$ 87 AF 1D 73 B4 8E F9 9D FA CB CD 68 13 94 15 5A
##$RELAX= 
##$RELAX= 
##$RELAX= 
##$RELAX= 
##$RELAX= 
##$RELAX= 
##$RELAX= 
$$ Bruker specific parameters
$$ --------------------------
$$ [...]
##$TP= (0..7)
150 150 150 150 150 150 150 150
##$TP07= 0
##$TPNAME0= <>
##$TPNAME1= <>
##$TPNAME2= <>
##$TPNAME3= <>
##$TPNAME4= <>
##$TPNAME5= <>
##$TPNAME6= <>
##$TPNAME7= <>
##$TPOAL= (0..7)
0.5 0.5 0.5 0.5 0.5 0.5 0.5 0.5
##$TPOFFS= (0..7)
0 0 0 0 0 0 0 0
##$TUNHIN= 0
##$TUNHOUT= 0
##$TUNXOUT= 0
##$USERA1= <user>
##$USERA2= <user>
##$USERA3= <user>
##$USERA4= <user>
##$USERA5= <user>
##$V9= 5
##$VALIST= <valist>
##$VCLIST= <CCCCCCCCCCCCCCC>
##$VD= 0
##$VDLIST= <DDDDDDDDDDDDDDD>
##$VPLIST= <PPPPPPPPPPPPPPP>
##$VTLIST= <TTTTTTTTTTTTTTT>
##$WBST= 1024
##$WBSW= 4
##$XGAIN= (0..3)
0 0 0 0
##$XL= 0
##$YL= 0
##$YMAX_a= 545713
##$YMIN_a= -650478
##$ZGOPTNS= <>
##$ZL1= 120
##$ZL2= 120
##$ZL3= 120
##$ZL4= 120
##$ABSF1= 14.98061
##$ABSF2= -5.57192
##$ABSG= 5
##$ABSL= 3
##$ALPHA= 0
##$AQORDER= 0
##$ASSFAC= 0
##$ASSFACI= 0
##$ASSFACX= 0
##$ASSWID= 0
##$AUNMP= <proc_prof1d_extract_pilot.lims>
##$AXLEFT= 0
##$AXNAME= <>
##$AXNUC= <1H>
##$AXRIGHT= 0
##$AXTYPE= 0
##$AXUNIT= <>
##$AZFE= 0.1
##$AZFW= 0.1
##$BCFW= 0
##$BC_mod= 0
##$BYTORDP= 0
##$COROFFS= 0
##$CY= 15
##$DATMOD= 1
##$DC= 0
##$DFILT= <>
##$DTYPP= 0
##$F1P= 0
##$F2P= 0
##$FCOR= 0.5
##$FTSIZE= 32768
##$FT_mod= 6
##$GAMMA= 0
##$GB= 0
##$INTBC= 1
##$INTSCL= 1
##$ISEN= 128
##$LB= 0
##$LEV0= 0
##$LPBIN= 0
##$MAXI= 10000
##$MC2= 0
##$MEAN= 0
##$ME_mod= 0
##$MI= 0
##$NCOEF= 0
##$NC_proc= -8
##$NLEV= 6
##$NOISF1= 0
##$NOISF2= 0
##$NSP= 0
##$NTH_PI= 0
##$NZP= 0
##$OFFSET= 14.98061
##$PC= 1
##$PHC0= 212.547
##$PHC1= 0
##$PH_mod= 1
##$PKNL= yes
##$PPARMOD= 0
##$PPDIAG= 0
##$PPIPTYP= 0
##$PPMPNUM= 2147483647
##$PPRESOL= 1
##$PSCAL= 4
##$PSIGN= 0
##$PYNMP= <proc.py>
##$REVERSE= no
##$SF= 400.13
##$SI= 32768
##$SIGF1= 0
##$SIGF2= 0
##$SINO= 400
##$SIOLD= 32768
##$SPECTYP= <>
##$SREGLST= <1H.CDCl3>
##$SSB= 0
##$STSI= 32768
##$STSR= 0
##$SW_p= 8223.68421052632
##$SYMM= 0
##$S_DEV= 0
##$TDeff= 65536
##$TDoff= 0
##$TI= <>
##$TILT= no
##$TM1= 0
##$TM2= 0
##$TOPLEV= 0
##$USERP1= <user>
##$USERP2= <user>
##$USERP3= <user>
##$USERP4= <user>
##$USERP5= <user>
##$WDW= 1
##$XDIM= 32768
##$YMAX_p= 465931664
##$YMIN_p= -684812
##$CURPLOT= <Network HP LaserJet P1505>
##$CURPRIN= <$Network HP LaserJet P1505>
##$DFORMAT= <normdp>
##$LAYOUT= <+/1D_H.xwp>
##$LFORMAT= <normlp>
##$PFORMAT= <normpl>
##$SURQMSG= 1
$$ End of Bruker specific parameters
$$ ---------------------------------
##NTUPLES= NMR SPECTRUM
##VAR_NAME=  FREQUENCY,     SPECTRUM/REAL,   SPECTRUM/IMAG
##SYMBOL=    X,             R,               I
##VAR_TYPE=  INDEPENDENT,   DEPENDENT,       DEPENDENT
##VAR_FORM=  AFFN,          ASDF,            ASDF
##VAR_DIM=   32768,         32768,           32768
##UNITS=     HZ,            ARBITRARY UNITS, ARBITRARY UNITS
##FACTOR=    0.250966925370066, 1,           1
##FIRST=     8223.43324360095, 84303,        -1420
##LAST=      0,             -7568,           -42145
##MIN=       0,             -684812,         0
##MAX=       8223.43324360095, 465931664,    0
$$ Real data points
##PAGE= N=1
##DATA TABLE= (X++(R..R)), XYDATA
$$ [...]
19531a7044l001k00319c2506l43522K9807g7465a6047q9962A3339B660b82646
19519b60046h5615k23356J41565f085j90321B02665I8965b64884h8948j97212
19509b86160J36400D0272b76831B69041E9632f8948D2651b13445Q8519B01635
19498A15646b7863b091B61200d040k18485N7402C5854i3929M0557A4040a11422
19486a49758P1743G8455f9730A19352J41509i3275B21936J5427F6576c36232F7965
19474a09049J7387d2019n9457B55179b4837g313j78843O8367A11364b23348a07959
19462e4182H8551m2431a37954p6331B27R8106a76822C68219a52324r7268D1135
19450a58362a4126j02684c1838j56085r519C4965b44135a6186k18345A1735a44213
$$ plain form
19531 -17044 -20045 -220364 -32506 -376028 -346221 -77465 -16047 -106009 13339 2660 -282646
19519 -260046 -85615 -308971 -167406 -6085 -196406 202665 98965 -264884 -88948 -286160
19509 -286160 -149760 40272 -276831 269041 59632 -68948 42651 -213445 -124926 201635
19498 115646 -27863 -2091 261200 -4040 -222525 -165123 35854 -93929 -53372 14040 -111422
19486 -149758 -78015 78455 -69730 119352 260861 -93275 221936 237363 66576 -336232 67965
19474 -109049 -91662 -42019 -101476 255179 -24837 -7313 -186156 -117789 111364 -223348 -107959
19462 -54182 88551 46120 -137954 -214285 227 98333 -176822 368219 -152324 -249592 41135
19450 -158362 -14126 -116810 -31838 -187923 -197442 34965 -244135 -16186 -234531 11735 -144213
19438B31839A9629L5662J75037a00679A7874L3778a99765j55005A11181b88392
19427A57534n3642D4973i8312A11905i7092l63878J06360I2844b38955A40414
19416a22188b4150j60445A19299J3954q161k3005a34994j38783a4341j03953E2677
19404e2311j4954g298G6847B6038i1688c1255R999m66042F534c4192A95990N4100
19392B50090n4987H0080f7845D687a54996B79374e7636k00891l1195d115q3435
19381h7550B04259b6900A4835a05689A41636j2227a10268A07980c1580A60562
19370b77579A28614J818M3247d26286b04446A49992o908a89648k0231k1447q8982
19359c20308a53410g0438A0447a39031k27065k6874C027Q4165J64569a39717j51646
$$ plain form
19438 231839 19629 55291 230328 -100679 17874 51652 -199765 -354770 111181 -288392
19427 157534 103892 44973 -98312 111905 -97092 -460970 -354610 92844 -238955 140414
19416 -122188 -24150 -184595 119299 133253 125092 102087 -134994 -273777 -14341 -118294 52677
19404 -52311 -67265 -7298 76847 26038 -91688 -31255 -21256 -487298 6534 -34192 195990 250090
19392 250090 195103 80080 -67845 4687 -154996 279374 -57636 -258527 -289722 -4115 -87550
19381 -87550 204259 -26900 14835 -105689 141636 129409 -110268 107980 -31580 160562
19370 -277579 128614 130432 173679 -426286 -204446 149992 143084 -189648 -209879 -231326 -320308
19359 -320308 -153410 -70438 10447 -139031 -366096 -392970 3027 87192 251761 -139717 -291363
19348b91363F0013J97892f6528H1022a5127A08037j8614K07740E0603M030L46140
19337D00773a17562E3433B0587p405P4861J4849l3682b0386j52169j27131A14137
19325a8794q0063A86487a53962B25575D3438j3290c01512G4905c28011J40618
19315a87393J9363A17327a27885m4500K2738i01G9438c40046E5725c80078A16897
19303a64583B46535a06764A34472a15470B29163b00172p7329b3883j71086m0593
19293b35562d1987j51320K3869k04831l4178J87024j26968d9645B452c17149C78999
19281A58088b03186A23831b22383j38381J28713A48840a21658M4725j9940j35102
19271b31975h7553A68360a42482j39776A11224i5732A04870M6002A9882b06087
$$ plain form
19348 -291363 60013 257905 -66528 81022 -15127 108037 89423 297163 50603 54633 400773
19337 400773 -117562 53433 20587 13182 88043 102892 69210 -20386 -172555 -299686 114137
19325 -18794 -98857 186487 -153962 225575 43438 30148 -301512 74905 -328011 -187393
19315 -187393 -168030 117327 -127885 -172385 -149647 -901 79438 -340046 55725 -380078 116897
19303 -164583 246535 -106764 134472 -115470 229163 -200172 -277501 -23883 -194969 -235562
19293 -235562 -41987 -193307 -169438 -374269 -408447 -221423 -348391 -49645 2452 -317149 378999
19281 158088 -203186 123831 -222383 -360764 -232051 148840 -121658 -76933 -96873 -231975
19271 -231975 -87553 168360 -142482 -282258 111224 -95732 104870 150872 19882 -206087
19260B55906b65788a23681j43315a2852k23845f7318B57249c38404a6145A14208
19249h2569c2134F8655J65641a68684L9018j1719k4791j6603N4797L8092L6072
19238e3818J6966f620I2620a2613J622A60164a55886B70136F6598a30795M5480
19227h5315k37428A04317a85113e2261J7713p0559E4275a2964n8195A1039b15557
19215A84416b42738C5210a21689C518a64056N8832m8215f0347I2630e2846B75414
19203B0716a86562E3805i8700j53629B60450f6942j21276b1138r044A29513D3417
19191b3099k2115a6087P348j69417e6238B08752d4366l68209B30879E4281a28475
19179A95302N6057f7801K5347A30641R305e3249j04418O056A84135b46013R2968
$$ plain form
19260 255906 -265788 -123681 -266996 -12852 -236697 -67318 257249 -338404 -16145 114208
19249 -82569 -32134 68655 234296 -168684 -129666 -141385 -166176 -182779 -127982 -89890 -53818
19238 -53818 -36852 -6620 92620 -12613 -10991 160164 -155886 270136 66598 -130795 -85315
19227 -85315 -322743 104317 -185113 -52261 -34548 -105107 54275 -12964 -71159 11039 -215557
19215 184416 -242738 35210 -121689 3518 -164056 -105224 -153439 -60347 92630 -52846 275414
19203 20716 -186562 53805 -98700 -252329 260450 -66942 -188218 -21138 -30182 129513 43417
19191 -23099 -45214 -16087 -8739 -178156 -56238 208752 -44366 -412575 230879 54281 -128475
19179 195302 251359 -67801 -42454 130641 139946 -53249 -157667 -151611 184135 -246013 -153045
19168a53045B05303a57804A11718a00895C8717e0063B8232m576a61459j5625G0111
19156F6676a22622F6217a79458P3409B20357I1070b56819G4059K57510B0027J21038
19145A41065n7849J77189A9433j809g7746K9623a5013I6464K1191B1051b68632
19133D29817d220k43934J13073p5934g881r4286B3032K23552l0459e6734A43088
19121G7525M1a01270A58373i8524n7975A15127f1254o2993C02972n7280A15791
19109b24260L6747O6109j30442B8763c17770A07645k419h367B35865a98692B01080
19097C6349j1092J21404a94387B81718a84332A26062N1620G859K36591A0099R850
19086A9949c9767j7738B9530h0106B60896p6179d0126F9568c37752d1827J0728
$$ plain form
19168 -153045 205303 -157804 111718 -100895 38717 -50063 28232 23656 -161459 -177084 70111
19156 66676 -122622 66217 -179458 -106049 220357 91070 -256819 74059 331569 20027 141065
19145 141065 83216 260405 19433 17624 -77746 -48123 -15013 96464 117655 21051 -268632
19133 429817 -4220 -248154 -135081 -211015 -7881 -102167 23032 246584 216125 -56734 143088
19121 77525 77566 -101270 158373 -98524 -156499 115127 -61254 -124247 302972 245692 115791
19109 -224260 -187513 -121404 -251846 28763 -317770 107645 105226 -8367 235865 -198692 201080
19097 36349 25257 146661 -194387 281718 -184332 126062 177682 7859 244450 10099 19949
19086 19949 -39767 -57505 29530 -80106 260896 184717 -40126 69568 -337752 -41827 -31099
19075c1099n3747C06643c05195c8111k71098M5665J24535A09119a60991D1205
19064A1395O5919K76446c24040G2311k2022b48628E4020c51295F9403a66991c0129
19052d53704R3484J29895A08969j4664a76805k8639K9183j50943A4688c7511r9691
19041a37202j8753d0294H967b21031G3436f183k79994B570M4826j7315e2731l946
19029e6677B06874P586b16652A56560O4324b53429e2257J8934k66354e3442D1606
19017H4474a04421k36053D0031L5065a35354b7695F9346R7913l5341A1360L57302
19006C68662a25898L5200M3290D1686a25535B8867a27929j43809a20858A76308
18995a50226L3093d1275l54417J16763m7012C43006e6792B32160A11890R1487
$$ plain form
19075 -31099 -84846 306643 -305195 -38111 -309209 -263544 -139009 109119 -160991 41205
19064 11395 77314 353760 -324040 72311 50289 -248628 54020 -351295 69403 -166991 -30129
19052 -453704 -360220 -230325 108969 94305 -176805 -205444 -176261 -327204 14688 -37511 -137202
19041 -137202 -155955 -40294 8967 -221031 73436 -6183 -286177 2570 47396 30081 -52731 -56677
19029 -56677 206874 214460 -216652 156560 220884 -253429 -52257 -33323 -299677 -53442 41606
19017 84474 -104421 -340474 40031 75096 -135354 -27695 69346 167259 131918 11360 368662
19006 368662 -125898 -90698 -47408 41686 -125535 28867 -127929 -271738 -120858 176308
18995 -150226 -117133 -41275 -395692 -278929 -325941 343006 -56792 232160 111890 203377
18985B03377f5761k13621J24377e0910E2416J7275a24003N6733D58083d9384m1134
18974i0518j48730a14876C1461K8836a03514b9820j15965m9226I4595l500c43800
18962c3563l46377a73512B55905f7459o0409N4016C5468O3851c56646i830C76364
18950C384L8202g3188n1470o889c9002k4769j08362B4442K42856p9079k1561N5305
18938B21963g5848b7263A79665c35521h2462A24613J9729B9678a90832A09815
18927A17677K5609A2537a27742k51271k5591b02160b069m9399C49578a54652A5544
18915a63766k1377H4553M2579f84812b01454o1711a9634l0477B22971a80840g7161
18903b50905J18291k86196O1637E4693K92203d4137J8869j97500A36280a15088
$$ plain form
18985 203377 -65761 -279382 -155005 -50910 52416 69691 -124003 -67270 458083 -49384 -90518
18974 -90518 -239248 -114876 31461 60297 -103514 -29820 -145785 -195011 94595 91095 -343800
18962 -33563 -379940 -173512 255905 -67459 -127868 -73852 35468 99319 -356646 -9830 376364
18950 3384 41586 -73188 -124658 -131547 -39002 -63771 -172133 24442 267298 188219 166658 221963
18938 221963 -75848 -27263 179665 -335521 -82462 124613 144342 29678 -190832 109815
18927 117677 143286 12537 -127742 -379013 -404604 -202160 -2069 -51468 349578 -154652 15544
18915 -163766 -185143 84553 127132 -684812 -201454 -263165 -19634 -50111 222971 -180840 -77161
18903 -250905 -132614 -418810 -357173 54693 346896 -44137 -25268 -222768 136280 -115088
18892b7849r559j19775N6351B1102a39447A0463e4099A67235a20872E9957a0909
18880c15151a21454A53860a39897r7409n1636R7583A43077o66g2737A53346b90241
18868a02790b8573H7273e2321b0016K017M488D31760a67434A37406P6909a17392
18856b45246E5047M0316a44266k2750f7793a95G6000L54058j70669a08045G1339
18844a38903G904d5961j72889q6672a17112c9703A66372P2310b70946C4422L87215
18833D21637A76559J25129A1990b61348f1144J9507C21949a77141o9916a03428
18822a16303F3711R9408b71720A11441k9898N918a49059m5713R34A02158J95307
18811B97465H8661d5248l21806d3659B6380J10417h9371k1101D17551e0267F8406
$$ plain form
18892 -27849 -37408 -157183 -100832 21102 -139447 10463 -54099 167235 -120872 59957 -10909
18880 -315151 -121454 153860 -139897 -237306 -288942 -191359 143077 142411 -72737 153346 -290241
18868 -102790 -28573 87273 -52321 -20016 -17999 -13511 431760 -167434 137406 214315 -117392
18856 -245246 55047 95363 -144266 -167016 -67793 -195 76000 430058 259389 -108045 71339
18844 -138903 7904 -45961 -218850 -305522 -117112 -39703 166372 238682 -270946 34422 421637
18833 421637 176559 301688 11990 -261348 -61144 -41637 321949 -177141 -247057 -103428
18822 -116303 63711 163119 -271720 111441 81543 87461 -149059 -194772 -193838 102158 297465
18811 297465 88661 -45248 -367054 -43659 26380 136797 -89371 -110472 417551 -50267 68406
18799h3069B69800b5692A96019b48752C48176j47598B0203g1905A51521b82474
18788A06853h3930a6634j09487l3446A19289d5454g570C19499B9072a9568k97522
18777c17090a6248j14543k5195e2006F2507b54589A6707g0538k1488K1394j13158
18766a83790E1775R9861i7911F9093a19814G7891A0322e1734p203r8899j47870
18755c05706a3306B7217D959J92729n1104n9535J09493D8483H491M3667d6946
18743a41347A11670d58089a2962q2193m3094l4199a1027A38405l263a49617g0702
18731c65776F9613A7125a1491E6520b14100N2627E4991a22497A52960c19496A51033
18719b08929h4161j51099m0836B0454J93517K1040b2155F1956f2408j72140A82088
$$ plain form
18799 -83069 269800 -25692 196019 -248752 348176 200578 20203 -71905 151521 -282474
18788 106853 -83930 -16634 -126121 -159567 119289 -45454 -7570 319499 29072 -19568 -317090
18777 -317090 -16248 -130791 -155986 -52006 62507 -254589 16707 -70538 -92026 -70632 -183790
18766 -183790 51775 151636 -97911 69093 -119814 77891 10322 -51734 -58937 -157836 -305706
18755 -305706 -13306 27217 4959 197688 146584 87049 196542 48483 8491 52158 -46946
18743 -141347 111670 -458089 -12962 -95155 -138249 -172448 -11027 138405 135142 -149617 -70702
18731 -365776 69613 17125 -11491 56520 -214100 -161473 54991 -122497 152960 -319496 151033
18719 -208929 -84161 -235260 -276096 20454 213971 235011 -22155 61956 -62408 -234548 182088
18707a21577A08610h2760C81659G1370P1900a59862d6918j92235A67627a8662
18696A23827a08740K917b7051j94917d9550D50211k15752L4842g9321B14606b84975
18684B518b56911h7225B18559a3549n2666F4796K55021i1941o1782J4647G8509
18672b9155o4815l21838g40j55531C41822G7548b08663J5486D1573a07356G5968
18660D8340b74039h1618K9215A53474a12571e3979B96651b84708h1364a1775k95988
18649c07763a8469k29812p4602B6124c92739B2118b15890J03141C38250A5144
18638B7761L36818b16969e9549b8345A14626b71433f7004k99157a43910M5199
18628i8711j872A32738c15106J14904A75161b19873J04204r2804A03287g2423
$$ plain form
18707 -121577 108610 -82760 381659 71370 143270 -159862 -46918 -239153 167627 -18662
18696 123827 -108740 -105823 -27051 -221968 -49550 450211 234459 269301 -79321 214606 -284975
18684 2518 -256911 -87225 218559 -13549 -66215 64796 319817 -91941 -153723 -139076 78509
18672 -29155 -93970 -415808 -740 -156271 341822 77548 -208663 -193177 41573 -107356 75968
18660 48340 -274039 -81618 -52403 153474 -112571 -53979 296651 -284708 -81364 -11775 -307763
18649 -307763 -18469 -248281 -322883 26124 -392739 22118 -215890 -112749 338250 15144
18638 27761 364579 -216969 -59549 -28345 114626 -271433 -67004 -366161 -143910 -98711
18628 -98711 -100583 132738 -315106 -200202 175161 -219873 -115669 -208473 103287 -72423
18617d1765C67693a07614j27685g1958K0664p156D8223b28480I7748N1520b5710
18605c21916J35581d0200J3969C2095a38641e2607q9230l131B3188O472M2792
18594G2452L10866G4470k6429g533j40475A13411a1302B4846c33578K1981h7845
18582C77800E1103j8286J50357H9625K5093a7479k67638K1521A54104c69685e4372
18570a6885k94098a1640k04315o3985i2358a7524k30220A17835a67976i26l11851
18559c12777A03741P1387c5864j54964g3857b6185n6819p387A14940e5455l00233
18548c55688a14345B03013c50399C38547C9167b79300C0385h448o7158A31422
18537a65218k54745a24475j47799a18025G4150a36180N8554C45647A58837a12918
$$ plain form
18617 -41765 367693 -107614 -235299 -71958 -51294 -58450 48223 -228480 97748 149268 -25710
18605 -321916 -186335 -40200 -26231 32095 -138641 -52607 -141837 -144968 23188 29660 72452
18594 72452 383318 74470 48041 -7533 -148008 113411 -11302 24846 -333578 -311597 -87845
18582 377800 51103 32817 183174 89625 114718 -17479 -285117 -263596 154104 -369685 -54372
18570 -16885 -310983 -11640 -215955 -279940 -92358 -17524 -247744 117835 -167976 -926 -312777
18559 -312777 103741 175128 -35864 -190828 -73857 -26185 -83004 -90391 114940 -55455 -355688
18548 -355688 -114345 203013 -350399 338547 39167 -279300 30385 -8448 -75606 131422
18537 -165218 -419963 -124475 -272274 -118025 74150 -136180 -77626 345647 158837 -112918
18526A62212a31467A73020e8643n3051F1973K2409G435d4194k15734j07070A12651
18514E5538c5158D3180c21532k0317C9430Q5645E0247a31327j02897d9461A39452
18502b1954l8257B6190c2148j4538m8193A5866a87645b4728n5728a8074D5054
18490a9084j04891P60A33370L1158B8038g6628A31840C756c53835B26545d1375
18478B36252b02495B37509a75382P6290A84756n4775c46305A62449a0072j41836
18468a51908A37439a41200B57000M1523b23154B81551d2163j82914M3948m9782
18458b30911A71376q2389c50469H1240a7912m4352C83373B0019N2187b64938J08030
18447a56908C4681a18032B3341O8810l5493L18785b0793B00125h7433q7393g0641
$$ plain form
18526 162212 -131467 173020 -58643 -111694 61973 84382 7435 -44194 -259928 -366998 112651
18514 55538 -35158 43180 -321532 -341849 39430 125075 50247 -131327 -234224 -49461 139452
18502 -21954 -60211 26190 -32148 -46686 -94879 15866 -187645 -24728 -80456 -18074 45054
18490 -19084 -123975 -123215 133370 164528 28038 -76628 131840 3756 -353835 226545 -41375
18478 236252 -202495 237509 -175382 -99092 184756 129981 -346305 162449 -10072 -151908
18468 -151908 137439 -141200 257000 298523 -223154 281551 -42163 -225077 -181129 -230911
18458 -230911 171376 88987 -350469 81240 -17912 -62264 383373 20019 72206 -264938 -156908
18447 -156908 34681 -118032 23341 92151 56658 375443 -20793 200125 -87433 -174826 -70641
18435I32J41060c75292J74764i4374l44688a05656R710D5046b17613M8192B61253
18423E6027N1187g3574k70561j14707d0250F4078a17910A2164n387e5863B76874
18411B3063a0750K243D5582h4510B10760J4037M3786I9120b70512o0361A16593
18399b06864A1667f5531Q418H161J7219a41461F0957P408a31405j44193J20877
18388a54721K9062J551r1307K737o2972J16342A4109e3960j32478l0626m207A5446
18375b48835J10781E1796c31213e8490A44097e3584j40636A08923e3050A66162
18364b88116a17148d2112r5480M6338n1794B07974I1449C888a04435c1101H6573
18352c11687B26532F2364J27027a04367B89272G5843K95214D2626J23903E6668
$$ plain form
18435 932 141992 -375292 -200528 -94374 -439062 -105656 -95946 45046 -217613 -169421 261253
18423 56027 107214 -73574 -344135 -458842 -40250 64078 -117910 12164 6777 -55863 276874
18411 23063 -10750 -8507 45582 -84510 210760 224797 268583 99120 -270512 -330873 116593
18399 -206864 11667 -65531 -57113 8161 25380 -141461 60957 68365 -131405 -275598 -154721
18388 -154721 -125659 -124108 -215415 -212678 -275650 -159308 14109 -53960 -186438 -217064 -221271 15446
18375 -248835 -138054 51796 -331213 -58490 144097 -53584 -194220 108923 -53050 166162
18364 -288116 -117148 -42112 -137592 -91254 -143048 207974 91449 3888 -104435 -31101 86573
18352 -311687 226532 62364 189391 -104367 289272 75843 371057 42626 166529 56668
18341C37879B3285c96147B78561a03467B5133J60356D2975L4132b8005l45540
18331c73545f8425J6918k77457J03105K7263C1798K1476K56418I4422a79669A18688
18319I5515c09453B9004c34351H0498b8664B11114a56037B61826a19149A24114
18308b26131J5006m9123A6463b01128C28070G806J05590g6852n2722p4468F1195
18296d42520B45778b4083j86064c3740B09208g3843B25632a59265c4722A2746
18285a41676K6430A68053d67769a66505b3330j76674o5811B2003a36537c4353
18274A33799B8458a0442C21024j29107c0988l47321a76010I252L1653K8583k2026
18263D7462h9124o9123A62025p1173b47685G0784c39032a56210d050j4424B974
$$ plain form
18341 337879 23285 -396147 278561 -103467 25133 185489 42975 77107 -28005 -373545
18331 -373545 -68425 -51507 -328964 -225859 -198596 31798 53274 309692 94422 -179669 118688
18319 95515 -309453 29004 -334351 80498 -28664 211114 -156037 261826 -119149 124114
18308 -226131 -211125 -260248 16463 -201128 328070 7806 113396 -76852 -129574 -204042 61195
18296 -442520 245778 -24083 -210147 -33740 209208 -73843 225632 -159265 -34722 12746
18285 -141676 -115246 168053 -467769 -166505 -23330 -200004 -265815 22003 -136537 -34353
18274 133799 28458 -10442 321024 191917 -30988 -378309 -176010 9252 40905 69488 47462
18263 47462 -89124 -158247 162025 90852 -247685 70784 -339032 -156210 -4050 -18474 2974
18251f264B14830A6414R2910f1633m1197A90461F5978a8118k97162R41d8307B2469
18238E3272c17029H6988f3025a1541B84806J96973c377m1126D8595A5937g380
18226a72271P9490M2062j7324B8078R7941b66488J05180j4176f9676j15464B20842
18214b48978B58741b26894B53174j00666b85980a473A66537a72223E2748L39060
18204C91808a3517j37635e5449j24682L2050e8868j73482l801D1924a1137F3554
18192a67127F2515b01267B0069a02131a6920j28331J8150K2009d4892A10253k3185
18181H7068J95193a12689m7371D23323a43418g1435q9597q1176e0054A23726n2117
18170G1609e3866n8075d5123r0667j01389A37199l3507j570c20566Q9336A28955
$$ plain form
18251 -6264 214830 16414 109324 -61633 -102830 190461 65978 -18118 -315280 -314339 -48307 22469
18238 53272 -317029 86988 -63025 -11541 284806 481779 -3377 -44503 48595 15937 -7380
18226 -172271 -92781 -50719 -68043 28078 126019 -266488 -161308 -175484 -69676 -185140 220842
18214 -248978 258741 -226894 253174 152508 -285980 -1473 166537 -172223 52748 391808
18204 391808 -13517 -151152 -55449 -180131 -148081 -58868 -232350 -236151 41924 -11137 63554
18192 -167127 62515 -201267 20069 -102131 -16920 -145251 -127101 -105092 -44892 110253 87068
18181 87068 282261 -112689 -160060 423323 -143418 -71435 -161032 -242208 -50054 123726 71609
18170 71609 -53866 -111941 -45123 -135790 -237179 137199 103692 102122 -320566 -231230 128955
18158B00583a6439D2022O1328a92534N7477L9868I7497M5742n9117a77431I7856
18146G2900P7566M816l0197c92234d1013A77109M0966D2991a16561c6661m5837
18135h2498K0233H7493b02111j35750e8748b7374j28095A21008a97995A21107
18124c7831H532N5682a0260q7441p5580I9832J59296a31822F4850k5000g0211
18112H5233b04936B2796b81078D6999a17458d8758E0638a09784m88724A14803
18101A07050D9499J90423b2127r5096C26945a51719L7994C37097b16319a01634
18090E7285G786c41214i425A21323b9296n6146I0109a776j99864g0334A18391
18078a07049b028m7046j13339N3828h643B68588e5554B27673a5748k21092b3399
$$ plain form
18158 200583 -16439 42022 103350 -192534 -135057 -95189 97497 143239 84122 -177431 97856
18146 72900 150466 155282 125085 -392234 -41013 177109 218075 42991 -116561 -36661 -82498
18135 -82498 -62265 87493 -202111 -337861 -58748 -27374 -155469 121008 -197995 121107
18124 -37831 8532 64214 -10260 -97701 -173281 99832 259128 -131822 64850 39850 -70211
18112 85233 -204936 22796 -281078 46999 -117458 -48758 50638 -109784 -598508 114803
18101 107050 49499 239922 -22127 -117223 326945 -151719 -113725 337097 -216319 -101634
18090 57285 7786 -341214 -9425 121323 -29296 -85442 90109 -1776 -201640 -70334 118391
18078 -107049 -2028 -49074 -162413 -108585 -8643 268588 -55554 227673 -15748 -236840 -23399
18066A7593f8574D970a51947q19D6491l790J78641b28443A52711F7278h2255m6397
18054a28652k37047A60035g2356k0458l7635o4804g2950C44589N631a73926j6558
18043a90484Q5854I4776a586H1144A8068a5949j75439b9159k23788C88167g3800
18031a3186B34089b36077B56821A05147C7638J90391l3806E1818K11475K33380
18021D96673A29977b8677A2987J15354J12987I5539b36862A08428a92103J2811
18011a79292p6245J04856b2412A53975b35712c4589A38997a56248C1219a3575
18000A42131k5785J64775C3967e1840B55908h2810j58655F6391K15437E3498f7709
17988a8190l76576J76173D6308J85115b13612C33308c3932C6058o190Q0341l9641
$$ plain form
18066 17593 -68574 4970 -151947 -152766 46491 42701 221342 -228443 152711 67278 -82255 -128652
18054 -128652 -365699 160035 -72356 -92814 -130449 -195253 -72950 344589 350220 -173926 -190484
18043 -190484 -104630 94776 -1586 81144 18068 -15949 -191388 -29159 -252947 388167 -73800
18031 -13186 234089 -236077 256821 105147 37638 228029 194223 51818 263293 496673
18021 496673 129977 -28677 12987 128341 241328 95539 -236862 108428 -192103 -179292
18011 -179292 -255537 -150681 -22412 153975 -235712 -34589 138997 -156248 31219 -13575
18000 142131 116346 281121 33967 -51840 255908 -82810 -241465 66391 281828 53498 -67709
17988 -18190 -394766 -218593 46308 231423 -213612 333308 -33932 36058 29868 110209 70568
17977G0568R0124b0064j11382a8172A60892n4385j5812J21175H8254L3297f4517
17965B27395a08791b0521A06906a82370A50948g5979g627l3273B48894B6222c30458
17953H7072b77148A0148a17451l1632L8847L2929j51252j22482a00665m9791d9637
17941A08362R999c7472B5961e2317E7894H089a6811B7357i138A06326K23647b24974
17928a89674a0221D6237h2209b0199A89575a8786A27691a33817I0217b80204a25812
17916b80058B7999J19643a35494A85436b17435M2674A67692a54485K3843e2097
17905a18939B29226M1436c82549G4085c46577D4396i7741A91335a14172J118a1121
17893H5732K3601l2564a10347D4031b27422B48459a81124P7727E5503k148J53477
$$ plain form
17977 70568 160692 -20064 -131446 -18172 160892 106507 90695 211870 88254 121551 -64517
17965 227395 -108791 -20521 106906 -182370 150948 -75979 -7627 -40900 248894 26222 -330458
17953 87072 -277148 10148 -117451 -149083 -110236 -77307 -228559 -351041 -100665 -150456 -49637
17941 108362 118361 -37472 25961 -52317 57894 8089 -16811 27357 -9138 106326 329973 -224974
17928 -189674 -10221 46237 -82209 -20199 189575 -18786 127691 -133817 90217 -280204 -125812
17916 -280058 27999 147642 -135494 185436 -217435 -174761 167692 -154485 -130642 -52097
17905 -118939 229226 270662 -382549 74085 -346577 44396 -97741 191335 -114172 -113054 -11121
17893 85732 109333 76769 -110347 44031 -227422 248459 -181124 -103397 55503 53355 206832
17882B06832b53443J06311b0349A92694E5163f5983j89446a1379a120j06362B6794
17870e3912j50567J2226A92340a33202A4210a62054G1257i9962B93818H7558c9113
17858c78510J63396P0360D68931a83431o6253A1313R1075f3575j58109F4336a32184
17846C31510D2840a4571A13428c22361A2771a44535D3248a27122B21868e0798
17835C3230K87464r187b27873B46654a11706B04465a05555B57456G1539e2611
17824D6465J56483g2642B14615e5786j53441C22899a55150k75256C7561a43686
17813I4283K74624g5787j62381A51871a66562A88569A6437A950K78855A30716
17802g9553L3835B65809p3304g4698A47153i794A34605m0967b34258h0537j45488
$$ plain form
17882 206832 -253443 -147132 -20349 192694 55163 -65983 -255429 -11379 -1120 -107482 26794
17870 -53912 -204479 -192253 192340 -133202 14210 -162054 71257 -99962 293818 87558 -39113
17858 -378510 -215114 -144754 468931 -183431 -249684 11313 102388 -63575 -221684 64336 -132184
17846 331510 42840 -14571 113428 -322361 12771 -144535 43248 -127122 221868 -50798
17835 33230 320694 311507 -227873 246654 -111706 204465 -105555 257456 71539 -52611
17824 46465 202948 -72642 214615 -55786 -209227 322899 -155150 -430406 37561 -143686
17813 94283 368907 -75787 -238168 151871 -166562 188569 16437 1950 280805 130716
17802 -79553 -45718 265809 192505 -74698 147153 -9794 134605 93638 -234258 -80537 -226025
17791b26025E2410a0594C29543C0138b16965c7557J6271A87160G6999g1434D8467
17779h5306r0655A69076I624J94505p268a70313A42711c39059O4590B23913k2283
17768B01630H6239A9209J71496B6511N7395a85394P8626A88883p6363K5521J23388
17757B61429B0444K73877H831J24073e093j9091A532e2854A65934p4480B1778
17745B57939A9024K25780p8729G2931J64707A320b09705g1876C0985b61103j9534
17734b80637B10828D2179a86677o7932A59735b20665k03889a82379f6866A03543
17723A20698n6957K54115a76574A88477I1678D1910L37991K3222a27915c0960
17712B35041G464g7976C2174a51250m2579F8473K94189A3897L992a84888Q9739
$$ plain form
17791 -226025 52410 -10594 329543 30138 -216965 -37557 -21286 187160 76999 -71434 48467
17779 -85306 -175961 169076 9624 204129 196861 -170313 142711 -339059 -274469 223913 201630
17768 201630 86239 19209 190705 26511 83906 -185394 -106768 188883 112520 138041 261429
17757 261429 20444 294321 8831 132904 -5093 -24184 1532 -52854 165934 91454 21778
17745 257939 19024 244804 166075 72931 237638 1320 -209705 -71876 30985 -261103 -280637
17734 -280637 210828 42179 -186677 -254609 159735 -220665 -424554 -182379 -66866 103543
17723 120698 63741 317856 -176574 188477 91678 41910 379901 403123 -127915 -30960
17712 235041 7464 -77976 32174 -151250 -193829 68473 362662 13897 17889 -184888 -95149
17701i5149L9680A52703f2464j25465G0149b8625j73359I2447e4355l3589L8940
17690d9004B4628K50310d4632I1649a84578D46074b1522B29130b18197A24322
17679H2102d09219a96262B1624d7739n8392J7537C63432a6072D7361D267J61590
17668A65857b95515D73003f030o2987p418B77711q0422G5670h261a033A04219
17656B91437L3187a11481M5116j41189A49531b71612a02490A16966J50216c04970
17645B43643a40191C6140J60778p7926E6429a66453B05899b9680A11010d5720
17634A95746c7755A78726C4623K00001J30308A47105m5810h3972C0744J06318
17624A37062e9648l9834G8579b9874k86848B4016J28586F7980a8716j10675A79904
$$ plain form
17701 -95149 -55469 152703 -62464 -187929 70149 -28625 -201984 92447 -54355 -87944 -49004
17690 -49004 24628 274938 -44632 91649 -184578 446074 -21522 229130 -218197 124322
17679 82102 -409219 -196262 21624 -47739 -106131 -88594 363432 -16072 47361 4267 165857
17668 165857 -295515 473003 -6030 -69017 -76435 277711 197289 75670 -8261 -1033 104219
17656 291437 324624 -111481 -66365 -207554 149531 -271612 -102490 116966 267182 -304970
17645 243643 -140191 36140 196918 118992 56429 -166453 205899 -29680 111010 -45720
17634 195746 -37755 178726 34623 234624 364932 147105 101295 -83972 30744 137062
17624 137062 -59648 -99482 78579 -29874 -316722 24016 152602 67980 -18716 -129391 179904
17612B45593G3010L819b11661o6559a36411m1118j43414A40045e1392j33648B1255
17600h7568I6554b26237A80428q9979a23732C10559a08827D0815J49099J2162
17590B02076K1618b7895p0188E0958B4773K38557b60430B3482c06583b0398k70417
17579b90815a22901E6214b7133k38417B55860G9875R6090g1539j8704L4666k60216
17568c15793H6724K03045C8497J45000D0185A0530J32050c03803A94309f3530
17557a8695H8650f361D8426a10411B38491K80717H4475M00697b90999a0244G2929
17545A24343o1190L12587d017j36480L1554m8265A01232h115l4627C8672J44863
17534A83535a76677A71923d0064B3272L34171b19222g5512k9472j58067C42604
$$ plain form
17612 245593 73010 76829 -211661 -278220 -136411 -177529 -320943 140045 -51392 -185040 21255
17600 -87568 96554 -226237 180428 90449 -123732 310559 -108827 40815 189914 202076
17590 202076 223694 -27895 -98083 50958 24773 263330 -260430 23482 -306583 -20398 -290815
17579 -290815 -122901 56214 -27133 -265550 255860 79875 175965 -71539 -90243 -55577 -315793
17568 -315793 86724 289769 38497 183497 40185 10530 142580 -303803 194309 -63530
17557 -18695 88650 -6361 48426 -110411 238491 519208 84475 485172 -290999 -10244 72929
17545 124343 63153 375740 -4017 -140497 -108943 -157208 101232 -8115 -42742 38672 183535
17534 183535 -176677 171923 -40064 23272 357443 -219222 -75512 -104984 -263051 342604
17523d2835C986J05337a25020B03609Q0784a88762A79867H7852c8227k3645K8223
17512c3649l77431F9149N05e6276A00674g685m2677l1685A20715c12002A62380
17500C22263o0245b9663D04314B2597i3850C57133b42874B69248D5281O99a80716
17488e5366A70655L50721A10099d7875A6331J14643F0775B7463J28703b08266
17477E3400N8190K04017j19918F2652P0566l4937l3561J76198c6108A16917J96810
17466C13727j19168d2103I2968J81372j20611h101G132a23310e8842B95198b1736
17454B47338a843B71905n323r8161A4325i0721j867b4380B58424j22214n7683
17443G8527Q1592J32745b15607E54633G6115P1892L69716A83467E6001a16614
$$ plain form
17523 -42835 3986 109323 -125020 203609 284393 -188762 179867 87852 -38227 -61872 -33649
17512 -33649 -411080 69149 69654 -56276 100674 -7685 -50362 -82047 120715 -312002 162380
17500 322263 262018 -29663 404314 22597 -93850 357133 -242874 269248 45281 45980 -180716
17488 -55366 170655 521376 110099 -47875 16331 130974 60775 27463 156166 -208266
17477 53400 111590 315607 195689 62652 133218 98281 64720 240918 -36108 116917 313727
17466 313727 194559 -42103 92968 274340 153729 -8101 7132 -123310 -58842 295198 -21736
17454 247338 -1843 271905 266582 168421 14325 -90721 -92588 -24380 258424 136210 78527
17443 78527 160119 292864 -215607 554633 76115 148007 517723 183467 56001 -116614
17432B26433G9249K26594P1038j36883D422L44599A71099M4031e2213H0300P6987
17421A57287l0158a4782C87029j82925P2950I6079J96249j22928J49370b43884
17410B22791A08205A9189P6442O9176L3209K99641B35396J93472F0623b0216k25703
17399b45919e0816D68729I6313Q6744J02049N6835e7728A73523A1857K28095D6622
17387A19078R564n5481i356A71059a5874B55310j20956E3844K12328A08369a04618
17375a03681B72497p5296C0620b4195l9487A80357J31327a92500C47050A06339
17364A23868K03740E3209J10147K22604n5286H8339a17572B06718N0568A9682
17353D64864A17800J04171E3541A5173K33422J57705m9406F7767m883J53339n9687
$$ plain form
17432 226433 79249 305843 376881 239998 4422 349021 171099 215130 -52213 80300 157287
17421 157287 127129 -14782 387029 204104 277054 96079 292328 169400 318770 -243884
17410 222791 108205 19189 95631 164807 198016 497657 235396 428868 60623 -20216 -245919
17399 -245919 -50816 468729 96313 183057 285106 341941 -57728 173523 11857 239952 46622
17387 119078 128642 73161 -9356 171059 -15874 255310 134354 53844 266172 108369 -104618
17375 -103681 272497 197201 30620 -24195 -63682 180357 311684 -192500 347050 106339
17364 123868 327608 53209 163356 385960 330674 88339 -117572 206718 257286 19682
17353 464864 117800 221971 53541 15173 248595 406300 356894 67767 62884 216223 156536
17342A56536m6324M0918A7218L16716B3982c3412A33070K60011G0411d2987A28392
17330A98372c4659I7183M73187A26904e3231C4877K95626A52152d1654C20978
17319f8529B83502I2142K44765k4875A42095D044L16321b98431a18594B10901
17308f0946K4024j2536A06985P9614m1990G754K3899c3016j32011B63763n9511
17297B04252i9340A33316g5834C1878b9052A94797e6732A91846j4093H5264J85414
17286B70678a3813C85187j38642J68871n4438a24708C52985A17437J61736A23124
17275B30832j3692K00904j96942n1050b0872o6636A63284F5708L4697J32045q4655
17264A47795K13065j19512K59356k34521e162D49502g1185C5110M50562A13758
$$ plain form
17342 156536 110212 151130 17218 333934 23982 -33412 133070 393081 70411 -42987 128392
17330 198372 -34659 97183 570370 126904 -53231 34877 330503 152152 -41654 320978
17319 -68529 283502 92142 336907 312032 142095 4044 320365 -298431 -118594 210901
17308 -60946 -36922 -49458 106985 186599 144609 7754 31653 -33016 -165027 263763 204252
17297 204252 -99340 133316 -75834 31878 -29052 194797 -56732 191846 177753 85264 270678
17286 270678 -13813 385187 246545 415416 360978 -124708 352985 117437 279173 123124
17275 230832 217140 418044 221102 170052 -20872 -87508 163284 65708 100405 232450 147795
17264 147795 360860 241348 500704 266183 -5162 449502 -71185 35110 485672 113758
17253D31556b50332B44931A18994r531O7761F2263a03866C52458H8729l6033K52580
17242C05276A15374j5990K29539A64105b14264I3666L30402A14498K9498D309
17231C29893j28860J29290C1540K20980I6901a9539C95588r0427J080j0547A46707
17219B54557b64762C2059M5041J30209R8060G8781K28854A04299e7584B14413
17208d8841I1284f3211B21220n5785K79807M5150A26752J27016J34615r0129O6381
17197C64635j04526A15959J97861D4962D265K85998J07215j10278J29213A18519
17186C0283M20961B02968M4571L20047B28555j05526K22819p2210J84714k17951
17176B40401p3590a6534n8132D23762K19364k50621d5890D39377A37180K06169
$$ plain form
17253 431556 -250332 244931 118994 109463 177224 62263 -103866 352458 88729 52696 305276
17242 305276 115374 99384 328923 164105 -214264 93666 424068 114498 143996 4309
17231 329893 201033 330323 31540 252520 96901 -19539 395588 305161 306241 295694 146707
17219 254557 -264762 32059 77100 207309 305369 78781 307635 104299 -57584 214413
17208 -48841 91284 -63211 221220 165435 445242 490392 126752 253768 388383 298254 364635
17197 364635 260109 115959 313820 44962 4265 290263 397478 287200 416413 118519
17186 30283 451244 202968 247539 567586 228555 123029 345848 273638 458352 240401
17176 240401 166811 -16534 -74666 423762 643126 392505 -45890 439377 137180 343349
17166C43349J06846J13018j66764A00656N51355k70093m9738R701j4079F1698
17155B85552M3765E306L98240j27352J43533j10200a37482c9504C93468o2465
17145C31003j43389o2774K52953H5756L04036j22618C8086P1043J00838r6528
17135A13439L86624A0154J52215p6612J3677K04295J6436J19912J5936A33616
17124B49100K12926b6519C96056j19945K43341C1107K86605R7456A66802J89759
17114C56561j06608j10807K26184n5666l6669p5750J85418L10012j73939B51500
17103B91122K52069B42774M05355m6081A30793F1076L49879A79212K38049j3335
17093D03926j31369L22589k40573q57L87440A81733K81131j5404j35655J40006
$$ plain form
17166 343349 450195 563213 396449 100656 652011 381918 332180 341881 327802 61698
17155 285552 329317 5306 403546 276194 419727 309527 -137482 -39504 393468 331003
17145 331003 187614 124840 377793 85756 389792 267174 38086 109129 209967 113439
17135 113439 500063 10154 162369 85757 99434 303729 320165 440077 456013 133616
17124 249100 462026 -26519 396056 276111 519452 31107 317712 415168 166802 356561
17114 356561 249953 139146 365330 309664 272995 197245 382663 692675 518736 251500
17103 291122 543191 242774 648129 602048 130793 61076 410955 179212 417261 403926
17093 403926 272557 595146 354573 353716 741156 181733 462864 447460 311805 451811
17083D51811r2028j73502N4785R6390K63922B2143K63349K35440m7204j3903J2780
17072D72605j23304K4420K00237k1208N1021k59769m8152L64328B41187K14700
17062D55887j25573J01457K4853j32720A01363J45809L10211k9174A64066L50207
17052E14273M8653J16221k72293j57645K88027k37446I716O09856k0632B80444
17041E65154k72299J73213j48253p7826J63171j21677I9931N6910K74368L4443
17031D65652j73852L09602j23445R7258m6064k9814Q2567B53256J65577J34846
17021E53679j35607K94310C20227L5039K167L58811k02218N725J11380R7545K68836
17010I97512D19239r7237O8561p6457J02586A93873M78105r0326P075r3423K59501
$$ plain form
17083 451811 359783 186281 241066 337456 601378 22143 285492 520932 473728 459825 472605
17072 472605 349301 373721 573958 552750 603771 344002 295850 660178 241187 455887
17062 455887 330314 431771 456624 323904 101363 247172 557383 528209 164066 514273
17052 514273 562926 679147 406854 249209 537236 299790 9716 619572 598940 280444
17041 565154 292855 466068 317815 239989 403160 281483 99931 156841 431209 465652
17031 465652 291800 601402 477957 575215 529151 499337 581904 253256 418833 553679
17021 553679 418072 712382 320227 355266 357433 716244 514026 519751 631131 728676 997512
17010 997512 419239 322002 390563 314106 416692 193873 671978 581652 588727 495304 754805
16999G54805J06461C95349J35778L3390J47401m536K1728o7943J08237J27615
16989H97019k92269K92896j58454J42032k29592J62393k31635K0733k99799M79900
16979G83224j21307K75466j043C84497J51415L28939m5833k57703Q4771K15728
16969H61814J04123m67933L46407Q2436k87303J48565k63472o0289L23096R9131
16959H86575J6555l7092j70910K03123o0301L2061Q6801j14888j6417k48573K68376
16948H45310K14128k44107K87929O071m8942p9505M71888m76393K26499m02071
16938H00807J9316k225L66202k62220K35331l81237K93596l58866K08822J51357
16928A070883J2962J50891l2837k60090l5461L59031J3994j22051j45277J24632
$$ plain form
16999 754805 861266 395349 531127 564517 711918 707382 729110 661167 769404 897019
16989 897019 604750 897646 739192 881224 651632 814025 582390 603123 303324 783224
16979 783224 661917 937383 936340 384497 535912 864851 819018 561315 646086 861814
16969 861814 965937 498004 844411 926847 639544 788109 524637 464348 787444 886575
16959 886575 903130 866038 695128 898251 837950 870011 956812 841924 825507 576934 845310
16948 845310 1059438 815331 1103260 1109331 1060389 980884 1452772 976379 1202878 800807
16938 800807 820123 817898 1184100 921880 1157211 775974 1069570 710704 919526 1070883
16928 1070883 1083845 1234736 1201899 941809 906348 1265379 1279373 1157322 1012045 1136677
16918A136677r1171p4539M81039j81459m6159j52125J36771J73113k60424M18143
16908A539866m35411K75910K30284k11749o0383j05445q4659J91876j4295j21428
16898A204566J70618K71577j22423m51154M22889R1100j83271K52299J96332m67334
16888A385199q4104L01275n2970L79459p8880p4864j44940n661j46621L57477
16878A835370M5077R5657q0042k20794L96683j57801O8058j16985O4483K86700
16868B216406k70726K49462j29236k21843N27600k84596L40040j07803l586j4435
16858B301283J90899m2380k05819j9260M190L06577k82982J58531L61927J12971
16848B885937k95170O9702J60397J6799k30805M31218k56508L19653J90421k88859
$$ plain form
16918 1136677 1045506 970967 1452006 1270547 1224388 1072263 1209034 1382147 1121723 1539866
16908 1539866 1104455 1380365 1610649 1398900 1338517 1233072 1148413 1340289 1325994 1204566
16898 1204566 1375184 1646761 1524338 1073184 1496073 1587173 1403902 1656201 1852533 1385199
16888 1385199 1301095 1602370 1549400 1928859 1849979 1775115 1630175 1624514 1477893 1835370
16878 1835370 1880447 1976104 1896062 1675268 2071951 1914150 1982208 1865223 1929706 2216406
16868 2216406 1945680 2195142 2065906 1844063 2371663 2087067 2427107 2319304 2315718 2301283
16858 2301283 2492182 2449802 2243983 2224723 2228913 2535490 2252508 2411039 2772966 2885937
16848 2885937 2590767 2660469 2820866 2837665 2606860 3038078 2781570 3101223 3291644 3002785
16838C002785J05596k05913k02785M16260K05645J50727N947m1653l9938K63269
16828C659940q510J39067M0426R6530J13375j67327N59074k17727N1550l5867
16818D230531R7585Q917K67376j0569K94761J9444J12796L64152N5635l24972
16808E115656L90689j33336M39729j82553J6617M83301M12531l67379K08103r3223
16798F290135M88103K25502j02693N96997k02914L15663q2290K42572J31198N70926
16788H473199J78138K1802K20121K72167L54532J00959O00367k03636J31293M34416
16778A0583358L35066N25655M79779K50370Q5924M22325M83313O41958N8842O05497
16768A4472087M00641O24586O71553K46428L57695J225766L40466N04706R14543
$$ plain form
16838 3002785 3108381 2902468 2699683 3115943 3321588 3472315 3478262 3436609 3396671 3659940
16828 3659940 3651430 3790497 3830923 3927453 4040828 3873501 4432575 4214848 4266398 4230531
16818 4230531 4328116 4337033 4604409 4593840 4888601 4908045 5020841 5384993 5440628 5115656
16808 5115656 5506345 5373009 5812738 5630185 5646802 6130103 6542634 6175255 6383358 6290135
16798 6290135 6778238 7003740 6901047 7498044 7295130 7610793 7528503 7771075 7902273 8473199
16788 8473199 8651337 8673139 8893260 9165427 9519959 9620918 10221285 10017649 10148942 10583358
16778 10583358 10918424 11444079 11923858 12174228 12260152 12682477 13165790 13807748 13866590 14472087
16768 14472087 14872728 15497314 16168867 16415295 16772990 17998756 18339222 18843928 19758471
16759A9758471M94958P92167R57576Q68296O42954J133018P61432J083846J351716
16750B7844434P55047J333134J034654J619199J318328J378952J877882J711472
16742C8873102J894425K296212J321868K918079K181102K203764K930490K932236
16734E7551278L054144L435246L498236L547006M038858M002405M477817N122003
16726H8726993M699897M877442N948909N870750N864544O526681O070750O623237
16718A35209203O674304O900338N656930O748334N325177N785412M822555M165826
16710A81288079L484876K578732J378448M92678q17018j609882k502830l417521
16702A80875562m138146n395955n408865o051957n977129o638514o390095o683019
$$ plain form
16759 19758471 20253429 21045596 22003172 22871468 23514422 24647440 25408872 26492718 27844434
16750 27844434 28599481 29932615 30967269 32586468 33904796 35283748 37161630 38873102
16742 38873102 40767527 43063739 44385607 47303686 49484788 51688552 54619042 57551278
16734 57551278 60605422 64040668 67538904 71085910 75124768 79127173 83604990 88726993
16726 88726993 93426890 98304332 104253241 110123991 115988535 122515216 128585966 135209203
16718 135209203 141883507 148783845 154440775 161189109 166514286 172299698 177122253 181288079
16710 181288079 184772955 187351687 188730135 189222813 188405795 186795913 184293083 180875562
16702 180875562 176737416 171341461 165932596 159880639 153903510 147264996 140874901 134191882
16694A34191882o504712o220028o153271o082757n694135n540692n098672n138267
16686H7759348m705637m158528m312506m279616l442938l443398l209064l160699
16678E7046962k781271k893351k465325k079865k497512k360236j614522j980723
16670C8374157j473353j515173j743000j006719k061608j111020j105361j281935
16662B7075988r20986q49853q80009j034283r24622j254659m27633p20277r75901
16653A9087765k23726n67984r08719l15222p08879m33811o03544l16496n96889
16644A4412495l41155m50887q01057k4045l87741j82815p49821L4276n77663l9528
16634A0892059n62068o4068k98425k72645j82767o63067J0468j94641k55625k5029
$$ plain form
16694 134191882 127687170 121467142 115313871 109231114 103536979 97996287 92897615 87759348
16686 87759348 83053711 78895183 74582677 70303061 66860123 63416725 60207661 57046962
16678 57046962 54265691 51372340 48907015 46827150 44329638 41969402 40354880 38374157
16670 38374157 36900804 35385631 33642631 32635912 30574304 29463284 28357923 27075988
16662 27075988 26155002 25305149 24425140 23390857 22466235 21211576 20783943 20063666 19087765
16653 19087765 18864039 18296055 17387336 17072114 16363235 15929424 15325880 15009384 14412495
16644 14412495 14071340 13620453 12819396 12795351 12407610 12224795 11474974 11509250 10931587 10892059
16634 10892059 10329991 10265923 9967498 9694853 9512086 8849019 8859487 8664846 8409221 8384192
16624H384192m37630k19538l43622o1593l7538m04291K54065m29812j68887j20428
16614F414918M6375n08174L1161K53492p39796L25696Q9177j57944l92641j59081
16604E203183r5361J44603k64194l18818M41417m07038l63940M13413n30425M32926
16594D655766l24843j30094q2378n2992K7317j01629m8759l56063L49877k23128
16584C713074k49059p5456J43797k29458k33405J50095J33793l64207M69259m68069
16574B990364K45456j86092j44342o0771l24777R8535J91876m8759m07468L58303
16564B712325k47613L6744j81563J13370l58602J48454J34467j46881K14230l53413
16554B071518J07655m27110M57965k82901K3996R3591l0629P2452n06368L36562
$$ plain form
16624 8384192 7946562 7727024 7383402 7321809 7284271 6879980 7134045 6704233 6535346 6414918
16614 6414918 6461293 5953119 5984280 6237772 5497976 5823672 5912849 5754905 5362264 5203183
16604 5203183 5107822 5252425 4988231 4669413 5110830 4703792 4339852 4753265 4222840 4655766
16594 4655766 4330923 4200829 4118451 4065459 4092776 3991147 3942388 3586325 3936202 3713074
16584 3713074 3464015 3388559 3532356 3302898 3069493 3219588 3353381 2989174 3458433 2990364
16574 2990364 3235820 3049728 2905386 2844615 2519838 2618373 2810249 2761490 2354022 2712325
16564 2712325 2464712 2501456 2319893 2433263 2074661 2223115 2357582 2210701 2424931 2071518
16554 2071518 2179173 1752063 2210028 1927127 1951123 2044714 2014085 2086537 1580169 1916731
16544A916731j26866j92592J84217l43457L37600k09703J4172J17871k16586K08581
16534A689968J39702r8230k97346J25205m33183M81183o6500K8924j30095j48238
16524A291390N06984k52394M0891l3529l26376j58574K72756p8282K33042J21045
16514A616953l89262j12651K20459K11397m37614O7592n2798K43481N6846l12155
16504A112248j36273j2997N6363J49532L20876m25891k15887O9410P4385l39387
16494F52379L42772J03731k42926J70841K53402m60968K40881L06532k37977m12670
16484G15997L16280j75957K27747Q4042l34831j39282K84996J23998q2525m2091
16474I78374l17654M41550r1460l22463L5774K94493m81048K99075k28826L40336
$$ plain form
16544 1916731 1789865 1597273 1781490 1438033 1775633 1565930 1580102 1697973 1481387 1689968
16534 1689968 1829670 1731440 1434094 1559299 1126116 1607299 1540799 1569723 1439628 1291390
16524 1291390 1798374 1545980 1586871 1553342 1226966 1068392 1341148 1262866 1495908 1616953
16514 1616953 1227691 1115040 1335499 1546896 1109282 1176874 1124076 1367557 1424403 1112248
16504 1112248 975975 962978 1019341 1168873 1489749 1063858 847971 917381 991766 652379
16494 652379 995151 1098882 855956 1026797 1280199 819231 1060112 1366644 1128667 715997
16484 715997 1032277 856320 1084067 1168109 833278 693996 978992 1102990 1020465 978374
16474 978374 660720 1102270 1010810 688347 724121 1018614 537566 836641 607815 948151
16464I48151k99667K55927l44758k16760K03547N43948j62782j00705j78790n0853
16454E97258r2791K50153M3294M65016n36139k52554K85696j00468j70331K89816
16444G78950J18919p7965k62365J83262C38487L23735l03032L60070j77898B43157
16433G71435l79213J22324J63209l02179L51744M3541J5964l87839r627L750M31546
16422H24655r7158n7398k68730K18273K05798l56709J58953k36419J40101A62435
16411F63090K31223k49762L0256J65827j17909C08896J1660J15587K2283J89877
16401F48303n8329m7418j2206q8344P3459J12927k60291K61282H7297M13008J36254
16390F36559j65959B01188L96470K9864l2516o3174N574J12978j88046J38117
$$ plain form
16464 948151 648484 904411 559653 342893 546440 1090388 927606 826901 648111 597258
16454 597258 504467 754620 797914 1262930 726791 474237 759933 659465 489134 778950
16444 778950 897869 819904 557539 740801 338487 662222 359190 719260 541362 243157
16433 771435 392222 514546 677755 375576 727320 770861 786825 398986 389359 393109 824655
16422 824655 727497 670099 401369 619642 825440 468731 627684 391265 531366 162435
16411 663090 894313 644551 674807 840634 722725 308896 320556 436143 458426 648303
16401 648303 589974 542556 530350 442006 515465 628392 368101 629383 87297 500305 636559
16390 636559 470600 201188 597658 627522 595006 531832 537406 650384 462338 600455
16380F00455B94967L52619q4302p5922P4317j68693J33381L46651D29393J8427
16370D47820j7305j18135R0996q5644K80468N3692C09077J05370B3871L20398
16360C44269K03210B63238J0131J75828P0739q1021R9063K71313C82812O0647
16350D43459K26101j97044O6785m5842b8843E13260k1112J72357j03443A61866
16339F79958B36302J44699O8865R2277k0022k53173K37184B36329M45864B86081
16328B76215K06145j21380L4169L23589n4790j92206j26107R3127j49825O37K58969
16317E48543J33083j92143N3984j30114j23074L71914k17210j79915L336J43613
16307D12017J98858p9321k51276L9359i644E67103A23229M92600B21459K78704
$$ plain form
16380 600455 294967 647586 563284 487362 561679 392986 526367 873018 429393 447820
16370 447820 430515 312380 403376 317732 598200 651892 309077 414447 23871 344269
16360 344269 547479 263238 273369 449197 519936 438915 537978 809291 382812 443459
16350 443459 669560 472516 539301 493459 -28843 513260 492148 664505 561062 161866
16339 679958 236302 381001 449866 542143 522121 268948 506132 236329 682193 286081
16328 276215 482360 360980 395149 718738 663948 471742 345635 438762 288937 289574 548543
16317 548543 681626 489483 543467 413353 290279 662193 444983 265068 268404 412017
16307 412017 610875 531554 280278 319637 -9644 567103 123229 615829 221459 500163
16297E00163j47767K7358j12792K32472q7880G2698K69123J26684A40478M48265
16287E88743A91971Q9991J31903l5708j10511N45568A72365M9629r7501M34475
16277E58968j31874J75135k73677o610Q6417L0816A08616J73389p4260A1102Q48758
16266H59860h247A15034K62262j0734L8202m3556K08908I6323N79422j07989B43711
16254A03365K67286A80611P915G0115R0177J85260K24863r6471q0338j17647J99206
16243D75165j5906B04876K75523j35355L05051k84913M3427J52156j9670j02205
16233D38890J25113j75497n9253q7353G8154J42934G6733K66969k8117B9250K55931
16222B85181o9163k1906L7955J95214A92353J05171L11989A13292B5234o448K08476
$$ plain form
16297 500163 352396 379754 266962 499434 411554 72698 341821 468505 140478 588743
16287 588743 191971 281962 413865 378157 267646 813214 172365 221994 124493 558968
16277 558968 427094 602229 328552 321942 408359 439175 108616 282005 207745 11102 859860
16266 859860 -8247 115034 377296 366562 404764 361208 570116 96323 675745 567756 243711
16254 103365 370651 180611 188526 70115 160292 345552 570415 473944 393606 275959 475165
16243 475165 459259 204876 480399 345044 650095 365182 408609 560765 541095 438890
16233 438890 564003 388506 329253 241900 78154 221088 76733 343702 315585 29250 285181
16222 285181 216018 194112 232067 427281 192353 297524 609513 113292 25234 18786 227262
16211B27262L0868H8702k5643K25373J14164L9102G8758K71014j35258L7566J25855
16200C77935I1602a22004A75228K4059J52817k072P6744C4266d2710A25297L0964
16189A56261f1546D85170g8328I0945M00376o8955a0533I0775J7539J17433A1812
16177a1922D17835k03168K59993r328A82229P4097b87348d3754A0610L80389A36491
16165B74156J76661A19659c3341k8378A33648L4295o7825R3208J54471f5415A34920
16153A3136K29430b32849A4851K00044r4330J00285K80359B06540p7082L38225
16143D67683A83870G8531M5577a65610A68653o795Q4780C5162L51958A18843K77430
16132C96273j4963E889e3414a2979C17837a26102B79957p0841l1762L42103i8033
$$ plain form
16211 227262 258130 88702 63059 288432 402596 441698 78758 349772 214514 252080 377935
16200 377935 91602 -122004 175228 199287 352104 350032 426776 34266 -42710 125297 156261
16189 156261 -61546 485170 -78328 90945 491321 422366 -10533 90775 108314 225747 11812
16177 -11922 417835 214667 474660 465332 182229 256326 -287348 -43754 10610 390999 136491
16165 274156 450817 119659 -33341 -61719 133648 167943 100118 193326 347797 -65415 134920
16153 13136 242566 -232849 14851 214895 120565 220850 501209 206540 129458 467683
16143 467683 183870 78531 124108 -165610 168653 161858 246638 35162 387120 118843 396273
16132 396273 381310 5889 -53414 -12979 317837 -126102 279957 209116 177354 519457 -98033
16120A60518J55404A9194J58037C8286J23721J5190J67246P6728k00123B9201
16109d87141I3027a95843A67869O3814D2669K58385k5955q6722e7382E7686c3416
16097A9769J23080P4049q9059J59195I7226a13068A52187b52985O2827D03135
16086d503j9968g669I651a65057j46660C46774G8940K04800o9477j1639e2482
16074A62168d2073k50774g3919B82186B6521J30502F6841a34710K2420B32631
16063B32395m6381n1986K7172p8117a08507j5160p7766C1309c43791e9243B61132
16051C9770K5048b01804C8675a15631A64980B28J19076a01633A53037o617L999
16040A50419E4204J30680E0571a62867P6317k1218M7185I7166a87574A91017i5885
$$ plain form
16120 160518 315922 19194 177231 38286 162007 177197 344443 421171 221048 29201
16109 -487141 93027 -195843 167869 231683 42669 301054 275099 188377 -57382 57686 -33416
16097 19769 142849 216898 127839 287034 97226 -113068 152187 -252985 -190158 403135
16086 -4503 -24471 -7669 9651 -165057 -311717 346774 78940 283740 214263 202624 -52482
16074 162168 -42073 -292847 -73919 282186 26521 157023 66841 -134710 -112290 232631
16063 232395 186014 134028 161200 83083 -108507 -123667 -201433 31309 -343791 -59243 261132
16051 39770 64818 -201804 38675 -115631 164980 228 119304 -101633 153037 146420 150419
16040 150419 54204 184884 50571 -162867 -86550 -107768 -60583 97166 -187574 191017 -95885
16028c3545m8827n5606H8098G429c4590j34792A38365M4827B0546J68620e216
16016C50236a20671l2392N9584L275J5021p1407c1843m4690l2878C55762A35631
16004I3954K9262i8045K8273C2709b03782a0613K682H8511p359j6895g0370A67006
15991b68136L3698f7622F4177O6081K69392A97199b20372Q2194f385H6483a75507
15979d1009B23970f1828I1906a75969a9702D0515J69783A8660P6049K00648G0998
15967A18635K0137L2672B6369a38727B96686c86832A19121c4475r8091J4535b4579
15955d2880j46778D0082A9851K81663i1627F1566k1406J09988E8186R6131a26214
15943a65792I610a35554E27698G9776c54525h3835B1291M8198a07532j97745i3985
$$ plain form
16028 -33545 -82372 -137978 88098 7429 -34590 -169382 138365 183192 20546 189166 -5216
16016 350236 -120671 -153063 -93479 -90204 -75183 -146590 -31843 -76533 -109411 355762 135631
16004 93954 123216 -98045 -69772 32709 -203782 -10613 -7931 88511 81152 64257 -70370 167006
15991 -268136 -234438 -67622 64177 130258 399650 197199 -220372 -138178 -6385 86483 -175507
15979 -41009 223970 -61828 91906 -175969 -19702 40515 210298 18660 94709 295357 70998
15967 118635 138772 171444 26369 -138727 296686 -386832 119121 -34475 -132566 -118031 -24579
15955 -42880 -189658 40082 19851 301514 -91627 61566 40160 150148 58186 154317 -126214
15943 -165792 9610 -135554 527698 79776 -354525 -83835 21291 69489 -107532 -305277 -93985
15931B1623a02922I1278l9515c98850a06448o2250F5076j9149a20459j30135C24747
15919b07181B62920r8559M4576b17302A24864a01306n572l62374A92880b89924
15908a02398B11522A6455a17564N0168A64741f5341m85296A29292a44333H9227
15897B8106g8054a6712k3188k20222N8937k3683F6698A3768C16J40623f7858I003
15884c19095A88524H4469i7538E1762b14111L1059g3235A27800h0504A64129K3612
15873A87741R9868D4747b54901E9530a47227o0061e0996l37070A41205E4461i5231
15861A6934f691r8372l51459A20509a08703D9025a06517L2230k01899E4173f8496
15849e7161m9524a6768C03304A33585b77583A03381l4075h2479A24191A9788c67117
$$ plain form
15931 21623 -102922 91278 51763 -398850 -106448 -168698 65076 45927 -120459 -250594 324747
15919 -207181 262920 164361 208937 -217302 124864 -101306 -106878 -469252 192880 -289924
15908 -102398 211522 16455 -117564 -67396 164741 -65341 -550637 129292 -144333 89227
15897 28106 -78054 -16712 -39900 -260122 -201185 -224868 66698 13768 316 140939 -67858 9003
15884 -319095 188524 84469 -97538 51762 -214111 -183052 -73235 127800 -80504 164129 187741
15873 187741 287609 44747 -254901 59530 -147227 -207288 -50996 -388066 141205 54461 -95231
15861 16934 -6691 -105063 -456522 120509 -108703 49025 -106517 -74287 -276186 54173 -68496
15849 -57161 -106685 -16768 303304 133585 -277583 103381 69306 -82479 124191 19788 -367117
15837d72868B96593j33146E4954K3514b88631A46323A0329a13605k9869a2523
15826h1750A34321b82533B1379b48355B05284I993a23323e5332A277M3269J26836
15815A71382c69064B00002K1044c278r6714M0752k3931k10520b4446k10561q8991
15804c23998A42064c1387F0208O1720a08028n4883A82356H7961J53949a093j16191
15793a17284j80927A79880a68676D7616b08682m396P5584B38012b4366G3459a71150
15781c9294j03638O1127l6880H0477a93299A48307a88087A54841g2863k15061
15771b87924k0371A21664g5117B17376h7377j27622a7405j05706c6705j49670
15761a86375G6114K78525a73855M519A30307O7045A0500K6958j6159c8880j44001
$$ plain form
15837 -472868 296593 163447 54954 78468 -288631 146323 10329 -113605 -143474 -12523
15826 -81750 134321 -282533 21379 -248355 205284 9993 -123323 -55332 1277 44546 171382
15815 171382 -369064 200002 221046 -3278 -99992 -59240 -83171 -293691 -24446 -235007 -323998
15804 -323998 142064 -31387 60208 121928 -108028 -162911 182356 87961 241910 -1093 -117284
15793 -117284 -298211 179880 -168676 47616 -208682 -213078 -137494 238012 -24366 73459 -171150
15781 -39294 -142932 -81805 -118685 80477 -193299 148307 -188087 154841 -72863 -287924
15771 -287924 -308295 121664 -75117 217376 -87377 -214999 -17405 -123111 -36705 -186375
15761 -186375 76114 354639 -173855 -169336 130307 197352 10500 37458 21299 -38880 -182881
15750a82881g7169j07963b7834F5296g3205B2643R511J53464L6685r7204c14085
15738A12835O4437a29627c4278G6352e1369a9583k20228B97983b02597J2747n1660
15727b41510B1860L2766b46222i6507E5591g5712l53095A11026C2751J32180F0763
15715a63220I3316b86566c1448l1200j06797d9048o8650j43173j2235O7122D6726
15703c98283f6163n8663L0044b5679l16655G5287h474I8095m3402d49894h0639
15691g3371j3227B07985h7023A47420a91440R2833k1791A38289b85571k8340I2188
15679D2513i3925n1118j24392j7726I4362a37732O5957A65564A2130b64667A27343
15667c891A95110a23577H1778J70570a97309c8060D432Q4208b730j34620j8866
$$ plain form
15750 -182881 -77169 -185132 -27834 65296 -73205 22643 32154 185618 222303 125099 -314085
15738 112835 177272 -129627 -34278 76352 -51369 -19583 -239811 297983 -202597 -189850 -241510
15727 -241510 21860 54626 -246222 -96507 55591 -75712 -428807 111026 32751 164931 60763
15715 -163220 93316 -286566 -31448 -62648 -169445 -49048 -117698 -260871 -273106 -205984 46726
15703 -398283 -66163 -124826 -94782 -25679 -342334 75287 -8474 98095 54693 -449894 -80639
15691 -73371 -86598 207985 -87023 147420 -191440 -98607 -120398 138289 -285571 -313911 92188
15679 42513 -93925 -145043 -269435 -287161 94362 -137732 -71775 165564 12130 -264667 127343
15667 -3891 195110 -123577 81778 252348 -197309 -38060 4432 88640 -2730 -137350 -156216
15656a56216G0704a95500A24699a47294k01922a32497E864b68997a12588I297
15645a15742A31276l6757a55975a8723B81650k7455a48536E355i7595B17360B0336
15633a07849D318a1369j69823D7095a31144C69994A8092f8315k44581h9612j17239
15622b06851C8579Q5992a5706G5961J54289a80635N4980J5272J6521j07804k0255
15611b21921A96843a47270r0227d301C2715L7001M4165K6715c00890J47316j21569
15600b75143A48839C3348h1814A9338J92340a88107k18958a56041o1506j45216
15590c62763C13849c75277a85185a6644k01248D0000b28665C50777c5064j64259
15580a99323N6035j35471c8884B0467a2611B40177B4753J17638n8196a61918A38762
$$ plain form
15656 -156216 70704 -195500 124699 -147294 -349216 -132497 5864 -268997 -112588 9297
15645 -115742 131276 94519 -155975 -18723 281650 254195 -148536 5355 -97595 217360 20336
15633 -107849 4318 -11369 -181192 47095 -131144 369994 18092 -68315 -312896 -89612 -206851
15622 -206851 38579 124571 -15706 75961 230250 -180635 -125655 -110383 -93862 -201666 -221921
15611 -221921 196843 -147270 -237497 -4301 32715 69716 113881 140596 -300890 -153574 -275143
15600 -275143 148839 33348 -81814 19338 211678 -188107 -407065 -156041 -217547 -362763
15590 -362763 313849 -375277 -185185 -16644 -217892 40000 -228665 350777 -35064 -199323
15580 -199323 -143288 -278759 -38884 20467 -12611 240177 24753 142391 84195 -161918 138762
15568b78924a7657j0100k8755j66791O8961f7295m9140B775K86274a57808A18964
15556C874b8755n56420K80148A12743l4931B6504A2831b78651C71805A19485a69200
15544B48258e205C3086a07351G4792i3977k05644D899K4504M92g7992I8653a49784
15531B48507B7622R1849J69341P6030d69943C9039a19878b2541j21030A55560
15520B69065H3098B1389a8061j3561n2744A0128b13340d881B54965a00778K1920
15509g8858L3385A94308c7861A37221L827C0569J07883b35730B91800i9395E6867
15497d9667B74296i9164A71580m6209Q7247b60880B28110G3746L9070C1912a63906
15485E2864j1613K70135h6604F2654A9078f9392e868j02129L2502L1732r0699
$$ plain form
15568 -278924 -17657 -27757 -56512 -223303 -154342 -67295 -116435 2775 289049 -157808 118964
15556 3874 -28755 -585175 -305027 112743 77812 26504 12831 -278651 371805 119485 -169200
15544 248258 -5205 33086 -107351 74792 -93977 -299621 4899 29403 29895 -77992 98653 -149784
15531 248507 27622 119471 288812 364842 -469943 39039 -119878 -22541 -143571 155560
15520 269065 83098 21389 -18061 -31622 -84366 10128 -213340 -4881 254965 -100778 -78858
15509 -78858 -45473 194308 -37861 137221 141048 30569 138452 -235730 291800 -99395 56867
15497 -49667 274296 -99164 171580 125371 212618 -260880 228110 73746 112816 31912 -163906
15485 52864 41251 311386 -86604 62654 19078 -69392 -5868 -107997 -75495 -43763 -134462
15474a34462p5494b9334E0567K2649L0126b9199j7583D341K90640d9776c062F0150
15461a81897N9914N1771q3035A12977c51928A35391e25403b51433B89760A30699
15450B41724h9336p4930m8805F4296B7660P9149l1665d1670j05574c79j4729C0545
15437a83641A49194B0138a23254A19080j1638a49017F8250a66907m8099B58088
15426E3220g8305j53594E8957a5364k23007a9224n7538f629k3433D16449f2878
15414a04070B67947E7592a15476p0641N1211B60491G5435q637J26265i1328B15390
15402a63358f4998B16500E4837c03635I1127J28415H1547a9796H6212e5540p5382
15391a30922A23997g4537A11772c07974H925a5663C47234a44734a5035H2715k4233
$$ plain form
15474 -134462 -209956 -29334 50567 73216 103342 -29199 -46782 4341 294981 -49776 -3062 60150
15461 -181897 -121983 -70212 -153247 112977 -351928 135391 -525403 -251433 289760 130699
15450 241724 -89336 -164266 -213071 64296 27660 106809 75144 -41670 -147244 -379 -15108 30545
15437 -183641 149194 20138 -123254 119080 107442 -149017 68250 -166907 -215006 258088
15426 53220 -78305 -231899 58957 -15364 -238371 -19224 -76762 -6629 -30062 416449 -62878
15414 -104070 267947 57592 -115476 -186117 -134906 260491 75435 66798 193063 -91328 215390
15402 -163358 -64998 216500 54837 -303635 91127 219542 81547 -19796 86212 -55540 -130922
15391 -130922 123997 -74537 111772 -307974 8925 -15663 347234 -144734 -15035 82715 58482
15380E8482M3341J4549K23754A04774b54985B49892c0863P696j53374q4867D11160
15368a07378G6774a76563A3122Q0986K5809F474a80717g8836q7162E3805b20192
15356a14601j79356q871B15030J7398G7315P8403J6029a50717M3689B10733D093
15344I2256a90736A53673b0422j21173L0109j22475N2040B34911a49780I4856
15333C6659K0755a61721b4782q3937j08944e4353H9180G651J36287D8751K0626
15322F9377O986m444e6385j58246e6482C52938a9699d230j40797A54534L1099
15311A85633m1537J93914j60836a48865F777a05501c9998H8947J8376C5088i5024
15299a16566j9444E0190N549b53095h243E4955J21777H2748a24510e7101k6120
$$ plain form
15380 58482 101823 116372 340126 104774 -254985 249892 -30863 -23167 -176541 -261408 411160
15368 -107378 76774 -176563 13122 94108 119917 6474 -180717 -78836 -165998 53805 -220192
15356 -114601 -293957 -302828 215030 232428 77315 155718 171747 -150717 -107028 210733 4093
15344 92256 -190736 153673 -20422 -141595 -111486 -233961 -181921 234911 -149780 94856
15333 36659 57414 -161721 -24782 -108719 -217663 -54353 89180 7651 143938 48751 69377
15322 69377 76363 71919 -56385 -214631 -56482 352938 -19699 -4230 -145027 154534 185633
15311 185633 144096 338010 177174 -148865 6777 -105501 -39998 88947 107323 35088 -95024
15299 -116566 -136010 50190 55739 -253095 -8243 54955 176732 82748 -124510 -57101 -83221
15288h3221A1036L5678J23383c63295J66096h262k58437A02623c5001A21354K17577
15277C38931j37667D0377a27772q9170A13872A822R0492K82767g4642c2683E8658
15265C1440J34274l9421J58480I1741b22513c1592B452K07166b51148A05154b80702
15253i4125G811e5559C55952j16885K29590G9314e1175j6391C88345e8891A01423
15241C33500j46855K048J9052O30068k5048C57635K94258O6414l21974K05762
15231F02095F7877K78736a20353A46906d6787c152G6555l281g5495A41704a58691
15219a1812E10887j01767A83860g593j34846b7665B14740A05987B2499K60615
15209B83114b30201d6483I0126b5784F0425c2481g363B9875h3364D02555a56742
$$ plain form
15288 -83221 11036 46714 170097 -363295 -197199 -8262 -266699 102623 -35001 121354 338931
15277 338931 201264 40377 -127772 -216942 113872 1822 92314 375081 -74642 -32683 58658
15265 31440 165714 126293 284773 91741 -222513 -31592 2452 209618 -251148 105154 -280702
15253 -94125 7811 -55559 355952 239067 468657 79314 -51175 -67566 388345 -58891 101423
15241 333500 186645 188693 207745 837813 812765 357635 651893 718307 396333 602095
15231 602095 67877 346613 -120353 146906 -46787 -3152 76555 73274 -75495 141704 -158691
15219 -11812 510887 409120 183860 -7593 -142439 -27665 214740 105987 22499 283114
15209 283114 -230201 -46483 90126 -25784 60425 -32481 -7363 29875 -83364 402555 -156742
15197H7171i4793M5501r104n9035E5891K85161b23916B63579H8414J21189a55344
15185A66351n7008J38852E6867j6944M77849D326K04256b07854A43729K67892
15175D11621e8925B39497a61B03679J31778A14477j3167O1949b858B67732d9252
15163B46021J21978j51181o6292J47464d9114P449j2017q7735C39508A45026n5142
15152H9884B4520L9322A5020P7213a54051B74236F9633K75749g3086C17009G7585
15140C03973J65767E7036J88567F0024h4500C21241L3382d8822j9073E7548d6735
15128C95170j68515A12917M43224a79434p131A88361R5669M0981o3271c5579A34207
15116a22974I4089l5064j5631d9418a6149D72416A12069J30418r6233J51361r6573
$$ plain form
15197 87171 -94793 -49292 -58396 -117431 55891 341052 -223916 263579 88414 209603 -155344
15185 166351 109343 248195 56867 39923 517772 4326 208582 -207854 143729 411621
15175 411621 -58925 239497 -161 203679 335457 114477 101310 163259 -2858 267732 -49252
15163 246021 367999 216818 150526 297990 -49114 -41665 -53682 -141417 339508 145026 89884
15152 89884 24520 63842 15020 92233 -154051 274236 69633 345382 -73086 317009 77585
15140 303973 469740 57036 245603 60024 -84500 321241 354623 -48822 -67895 57548 -46735
15128 395170 226655 112917 556141 -179434 -186565 188361 284030 325011 261740 -35579 134207
15116 -122974 94089 59025 43394 -49418 -16149 472416 112069 242487 146254 297615 201042
15105B01042O2321j8653I6292b07616G3388J8924O5374B0025M7814J75430a54627
15093A49813L4314j4600f4016j31157E73857f3832A2861h420A97727e0919J5906
15082c5013E06653C7626K21578a9763A68000Q0324m3955A1152M25803a12749j6878
15071a29627M0196A81668K5744a37532A22921K16516R8029b32B99486N6377a50385
15059C86600j28274H942K28187J86535I311L55691F3693k1343L3907a09297D65853
15047B55156j22324K80666j66858H9326K619a09791B2656N40656k29389C0338
15036A65531K97861C5862J08946n7909J21065m9086f1226A66556L04619A02163
15025B39335l5245n122J8705L4207m7303L4046l4392B264J57403K45075A73869
$$ plain form
15105 201042 263363 244710 96292 -207616 73388 92312 157686 20025 67839 243269 -154627
15093 149813 184127 169527 -64016 -195173 573857 -63832 12861 -8420 197727 -50919 -35013
15082 -35013 506653 37626 259204 -19763 168000 248324 204369 11152 436955 -112749 -129627
15071 -129627 -89431 181668 207412 -137532 122921 339437 437466 -232 299486 355863 -150385
15059 386600 258326 8942 237129 423664 9311 365002 63693 42350 76257 -109297 465853
15047 255156 132832 413498 246640 89326 91945 -109791 22656 563312 333923 30338
15036 165531 463392 35862 144808 86899 207964 158878 -61226 166556 471175 102163
15025 239335 204090 198968 217673 251880 204577 238623 204231 2264 159667 404742 173869
15013B60591r1484b23541B60786j13772K77375A16233J87400B1652J84023p0508
15003A35167O3095q7705L68150b7623H3085Q0367N0769J50394j11535n9910M788
14992A97958J68149R2708B21884K70882A14656J61338a42302m3995A08919A5501
14981B78549K27264J13493B87526L76145B1332b85638B48138K3109E2684J11433
14971A64117J35239K0833j49541J82345d5398B91906j27023k7664P1043j03398
14961A04864K11207J14585C6909K58230J24739n6453J68994I8910J43113O2653
14951C04676q287M5187A41256n2592O5545a1250B40177L24904k22848p4079J0048
14940B78202N1479P557A31635K55160j22011J51057K2645g8102D13047E0219J4246
$$ plain form
15013 260591 169107 -223541 260786 147014 424389 116233 303633 21652 205675 135167
15003 135167 198262 110557 478707 -27623 83085 163452 214221 364615 253080 193170 197958
14992 197958 366107 458815 221884 492766 114656 275994 -142302 -186297 108919 15501
14981 278549 505813 619306 287526 663671 21332 -285638 248138 271247 52684 164117
14971 164117 299356 320189 170648 352993 -45398 291906 164883 137219 208262 104864
14961 104864 316071 430656 36909 295139 419878 363425 532419 98910 242023 304676
14951 304676 296389 341576 141256 88664 154209 -11250 240177 565081 342233 268154 278202
14940 278202 329681 337238 131635 386795 264784 415841 438486 -78102 413047 50219 64465
14929F4465L9861K34076m2289r7216j0152k0871L66169B01541K34839A93158L67899
14918E61057A15423N38060A41568J86778P5053K0339A74260G7064L97164j44060
14908C30168J00492a46504E02215o4461r5032l6110k3167Q7361K74704j83239
14898D62271j88764f1783D55424j26499L21354j22861O6966B62050N03921A90613
14887G15091l44479K1487j92380J59597o8972O0413K9074j37950J42785J68301
14877E52967k20199p9186L34616k89263n4660J25361J46400A75001K18744l597
14867C90148M4991j2382m8497N0513K27250j17019J53021q1564p9543j48816k0222
14856C57880P7346P3830k29643Q5511L4614K6329J29864K3253P7957k96199J67449
$$ plain form
14929 64465 104326 338402 296113 198897 188745 167874 534043 201541 436380 193158 561057
14918 561057 115423 653483 141568 328346 403399 423738 174260 77064 474228 330168
14908 330168 430660 -146504 502215 437754 342722 306612 283445 370806 645510 462271
14898 462271 273507 -61783 455424 328925 650279 527418 594384 262050 765971 190613
14887 715091 370612 392099 199719 359316 290344 350757 379831 241881 384666 552967
14877 552967 332768 253582 588198 298935 244275 369636 516036 175001 393745 390148
14867 390148 435139 422757 374260 424773 652023 535004 688025 606461 526918 378102 357880
14856 357880 435226 509056 279413 364924 399538 425867 555731 578984 656941 360742 528191
14845E28191k20731M8529o5229Q6904j32323K10029K36561j77921K16251B30083
14834E66082J56925I3176L86899J61037B38425L62855l348j92683J15519L06869
14824H27637l91623j68438M88146k71054M3956j18687j58918L88368o4004B87268
14813E06509K9928l8427J73631j80051A47381Q0412K50146J270m7699p3966K77449
14802F34993l7123k53242M21880j05527r7738k7210n7099m210p5194R3482J67106
14791F60118j1727j31780k27186L02258Q6800j51706P2004k79541K09539n238
14781E23541K14939j93517k0845o6415k0078J14115k23632K53297K76883l75770
14771D82518l2288j79017L05742r1768q0900J08394K24648j09755r9397J46367
$$ plain form
14845 528191 307460 355989 290760 377664 245341 455370 691931 514010 730261 230083
14834 566082 723007 93176 480075 641112 238425 601280 597932 405249 520768 827637
14824 827637 436014 267576 755722 484668 528624 409937 251019 639387 575383 287268
14813 506509 536437 498010 671641 491590 147381 227793 477939 479209 431510 357544 634993
14802 634993 597870 344628 766508 660981 563243 536033 478934 474724 399530 493012 660118
14791 660118 648391 516611 289425 591683 678483 526777 598781 319240 528779 523541
14781 523541 738480 544963 524118 457703 437625 551740 328108 581405 858288 482518
14771 482518 450230 271213 576955 485187 404287 512681 737329 627574 528177 674544
14761F74544j37496J06471k6666J38730J21687l04807R152J14170k46292K65756
14751G15249k86186J67462q4146O6614r7023J21998L13421m55286M9681N23544
14741A035328C67173N72711j61985j13141J24886k62079L41713j08803l8097K14302
14731I36680l95636J65228M4864k82439O07064l09519R954J12668l35343M19799
14721I73320m3234k66862l7599L92920m08546M7009J1400J23734O0623n7265K33785
14710A029285r7594m11356L90085q3064j7564J27677K1391l18843Q0389L49761
14700A070167k4877l65037q0497J19622K29975k28766J93997N5103k64735K46376
14690I51328J50016k97293O21654n62623m2701K9337J83225k41697M73984l71301
$$ plain form
14761 674544 537048 643519 616853 755583 877270 572463 581615 695785 449493 715249
14751 715249 429063 596525 512379 578993 481970 603968 917389 462103 511784 1035328
14741 1035328 367173 939884 777899 664758 789644 527565 869278 760475 722378 936680
14731 936680 541044 706272 751136 468697 1075761 766242 776196 888864 553521 973320
14721 973320 930086 663224 625625 1018545 609999 657008 668408 792142 852765 795500 1029285
14710 1029285 931691 520335 910420 827356 809792 937469 958860 640017 720406 1070167
14700 1070167 1045290 680253 599756 719378 949353 720587 914584 969687 704952 951328
14690 951328 1101344 804051 1425705 863082 820381 849718 1032943 791246 1265230 893929
14680H93929j25163J39591L9607m2693J33158k5158j48291K17926j99640K70147
14670A153413l21706L68489k31312j46145J70786K23916j67778J72893j21157
14661A101399j47770J13969j48222K76736O54j79568M8285m7103J58969L3686
14651A211035j69167j18418J47587p0552K68186l96970J14617L01053m4183j70728
14641A072460r8071N68895l40511k95450K91249q2318R2791P4699o8957J59982
14631A374769R6973n3384j7875J75176k14261m16283K177O0953J53822q0017K39978
14620A322028j93668K46052K3688P6835n4243R6995k64839l8878K2435M96325
14610A732730j35218m63506K15807L8949J8767K74827n07285L31024k70652L84422
$$ plain form
14680 893929 768766 908357 947964 905271 1038429 1013271 864980 1082906 883266 1153413
14670 1153413 831707 1200196 968884 822739 993525 1217441 1049663 1222556 1101399
14661 1101399 953629 1067598 919376 1196112 1196766 1017198 1065483 1018380 1177349 1211035
14651 1211035 1041868 923450 1071037 1000485 1268671 871701 986318 1287371 1243188 1072460
14641 1072460 974389 1543284 1202773 907323 1198572 1116254 1209045 1283744 1214787 1374769
14631 1374769 1471742 1418358 1400483 1575659 1361398 945115 947292 1008245 1162067 1082050 1322028
14620 1322028 1128360 1374412 1398100 1474935 1420692 1517687 1252848 1213970 1236405 1732730
14610 1732730 1597512 1134006 1349813 1388762 1407529 1682356 1175071 1506095 1235443 1619865
14600A619865j06198J84536l81300O14744l82212R5362n2678K52887k01090p1430
14590A572486m3459L98033k89975j44407L66091l64536M06828n9496M6441j60950
14580A727056K37566j18460K14269j79017J66046M2188m88299L25019J03996k2234
14570B008130l22035M01335k4667p321J84554k57619J13398J92185k09536K05254
14560B283678l58702M18461j05329k90349M30637J43799n3701p260q6260k08731
14550B166243P55149p9520K34012k66785j23535P67730J02224k93813M01808J90538
14540C854051L45363N24036P88163J114723P70896J600850K999262L577651M592472
14531B0167467N989961p93500p072615o496069l763712k279790j417284m42229
$$ plain form
14600 1619865 1513667 1698203 1316903 1931647 1549435 1644797 1592119 1845006 1643916 1572486
14590 1572486 1529027 1927060 1637085 1492678 1858769 1494233 1901061 1841565 1888006 1727056
14580 1727056 1964622 1846162 2060431 1881414 2047460 2089648 1601349 1926368 2030364 2008130
14570 2008130 1686095 2087430 2062763 2055442 2239996 1982377 2095775 2287960 2078424 2283678
14560 2283678 1924976 2343437 2238108 1947759 2378396 2522195 2468494 2461234 2374974 2166243
14550 2166243 2921392 2841872 3075884 2809099 2685564 3453294 3555518 3261705 3663513 3854051
14540 3854051 4199414 4723450 5511613 6626336 7397232 8998082 11997344 15574995 20167467
14531 20167467 26157428 25363928 18291313 11795244 8031532 5751742 4334458 3892229
14523C892229m78008m20522K3852m66012k7557J50132p1529k70121M17876p0583
14513B679757j99490K83632k49345Q0755o5658j29084M32578J0013k73910K70411
14503B839659M6148j60188K12515J40375M9772j32718K45067m14030J58267j22028
14493B862839J33570K14050l21974N70867j34957j25445j36067J69604J14290
14484C346777J62326k7412R4846j00013R239N569L59813k27346N8007m5604K30482
14473C866684n006l7558M3153P3675k30083K23306J26949J42946J48727R6446
14463D449239n72592L68686M0591P5913R7824L638q9868L60779j55781r3504K74174
14452D759099k05343J66894o8869K72091K7054j21886Q6466J92719K36293k7933
$$ plain form
14523 3892229 3414221 2993699 3017551 2551539 2523982 2674114 2602585 2332464 2750340 2679757
14513 2679757 2480267 2763899 2514554 2595309 2529651 2400567 2833145 2843158 2569248 2839659
14503 2839659 2885807 2725619 2938134 3078509 3128281 2995563 3240630 2826600 2984867 2862839
14493 2862839 2996409 3210459 2888485 3459352 3324395 3198950 3062883 3232487 3346777
14484 3346777 3509103 3481691 3576537 3476524 3485763 3491332 3851145 3623799 3681806 3636202 3866684
14473 3866684 3861678 3824120 3867273 3940948 3710865 3934171 4061120 4204066 4352793 4449239
14463 4449239 3876647 4245333 4285924 4361837 4459661 4463299 4373431 4734210 4578429 4484925 4759099
14452 4759099 4553756 4720650 4651781 4923872 4950926 4829040 4915506 5108225 5344518 5316585
14442E316585j15851j09122P2902K03277K3714L08503J25820j68452J31449P0292
14432E859117j20068M28313k04733j73784M59100j54868J16390K41913j26652
14423F324728M1383M24320l07742L01676J66390J27623L99339J316l9665p0827
14413G368541J34413k78551K26762L97219O9240O3101K08028J35665j11954K84441
14403H496905J21084L9310p7837L34639K62884R2458l082R6167M19108J13630
14393I895266K02560J05066J32443j86351N95799j52107J24856K03398P56078
14384A1677008p73109P47631M4755K29367J54573K01720N31623l8406K08952K57730
14374A3241844K03745N97233k8272M44854K36047j61368Q57893k15957N12758
$$ plain form
14442 5316585 5200734 5091612 5164514 5367791 5391505 5700008 5825828 5657376 5788825 5859117
14432 5859117 5739049 6167362 5962629 5788845 6247945 6093077 6209467 6451380 6324728
14423 6324728 6366111 6790431 6482689 6784365 6950755 7078378 7477717 7479033 7439368 7368541
14413 7368541 7502954 7224403 7451165 7848384 7917624 7980725 8188753 8324418 8212464 8496905
14403 8496905 8617989 8657299 8579462 8914101 9176985 9269443 9266361 9362528 9781636 9895266
14393 9895266 10097826 10202892 10335335 10148984 10744783 10592676 10717532 10920930 11677008
14384 11677008 10903899 11651530 11696285 11925652 12080225 12281945 12813568 12775162 12984114 13241844
14374 13241844 13445589 14042822 14014550 14459404 14695451 14534083 15391976 15176019 15688777
14365A5688777P19446m95529P77746K35695J91496M92520J52634N39629J56002
14356A8458416M15990L08609K40313Q58368K16339J63013P89493L01953O14187
14347B2366681Q64784R1347P8960O21772J010535M60820O48149L55104P03736
14338B7201888Q90242O01311M02045R37192P28724J262416M75736J149481L71091
14329C4020126R22977J373328O79884R27524J202608J129733J095615J133106
14321D2484901J367166J108266J561693J154877J491644J606467J520126J927748
14313E4222888J689210J792656J996975K176257K027005K117687K327195K456454
14305G0806327K699849K671774K789389L093559L360039L162618L534289L646494
$$ plain form
14365 15688777 16408223 15912694 16690440 16926135 17117631 17610151 17762785 18302414 18458416
14356 18458416 18874406 19183015 19423328 20281696 20498035 20661048 21450541 21752494 22366681
14347 22366681 23231465 23322812 23401772 24023544 25034079 25494899 26143048 26498152 27201888
14338 27201888 28092130 28693441 29095486 30032678 30761402 32023818 32499554 33649035 34020126
14329 34020126 34943103 36316431 36996315 37923839 39126447 40256180 41351795 42484901
14321 42484901 43852067 44960333 46522026 47676903 49168547 50775014 52295140 54222888
14313 54222888 55912098 57704754 59701729 61877986 63904991 66022678 68349873 70806327
14305 70806327 73506176 76177950 78967339 82060898 85420937 88583555 92117844 95764338
14297I5764338M039577M017615M607344M583139N040748N269559N232198O016182
14289A34570700O137607O518705P089803P453431P823726Q415340Q348394R261417
14281A95619123R261990J0606767J0637493J1247110J2682139J2005321J3009491
14274B75069434J3532803J3613708J4198101J4066964J4415757J3859177J4079725
14267C72835669J3734599J3309436J2114762J1709432J0136356R543789Q103856
14260D51487899O706827M735331K174010Q27597q9251p15592m082704n585972
14252D55458145o514870q365821j0699469j1673973j2142310j2945918j3891358
14245C79224426j3830309j4075017j3630010j3804526j3558399j3552467j2919223
$$ plain form
14297 95764338 99803915 103821530 108428874 113012013 118052761 123322320 128554518 134570700
14289 134570700 140708307 147227012 154316815 161770246 169593972 178009312 186357706 195619123
14281 195619123 204881113 215487880 226125373 237372483 250054622 262059943 275069434
14274 275069434 288602237 302215945 316414046 330481010 344896767 358755944 372835669
14267 372835669 386570268 399879704 411994466 423703898 433840254 443384043 451487899
14260 451487899 458194726 462930057 465104067 465931664 465842413 465126821 461044117 455458145
14252 455458145 448943275 440577454 429877985 418204012 406061702 393115784 379224426
14245 379224426 365394117 351319100 337689090 323884564 310326165 296773698 283854475
14238B83854475j2398103j2145625j2059568j1810518j1909413j1161458j0913366
14231B01456424j0170483r393251q622894q078657q091223p115278o939565o506937
14223A36538136o022464n915481m937636n750880m691876m697896l881022l856931
14215I6783950l740423l718313l536072l292727l164772k695394k795779l016585
14207G0823885k494824k466893j451429k380634k298371j617286k335700j144504
14199E4634244j609932k066277j315981k049147r37025r91557j397385j202972
14191D3063968r97962j582296j149418q36827j214516q29794p84374j009926j020683
14182C3638172o90577r22115r12852r40009m93129r30344q43617o46874l73575
$$ plain form
14238 283854475 271456372 259310747 247251179 235440661 223531248 212369790 201456424
14231 201456424 191285941 181892690 173269796 165191139 157099916 149984638 143045073 136538136
14223 136538136 130515672 124600191 119662555 113911675 109219799 104521903 100640881 96783950
14215 96783950 93043527 89325214 85789142 82496415 79331643 76636249 73840470 70823885
14207 70823885 68329061 65862168 64410739 62030105 59731734 58114448 55778748 54634244
14199 54634244 53024312 50958035 49642054 47592907 46655882 45664325 44266940 43063968
14191 43063968 42066006 40483710 39334292 38497465 37282949 36453155 35668781 34658855 33638172
14182 33638172 32947595 32025480 31112628 30172619 29679490 28749146 27905529 27258655 26885080
14173B6885080n23500p91611n05944l95765r13555m35658l45595p04516l44211
14164B1924725l82611p40519k79017o92863M1244n74952o94404j46413l75669
14155A8079521j0066o79495j15036k15299n15672l64139k77596j22430m24435
14146A5355353n5835m82820m28538k49952N1145j92330l77265K08065o08463o06149
14136A2613211J55192o17525J65186l30799o2513l01031l57192K65909n45075
14127A0985363J2053k32663J63816n21643J2240k92577k77773J85316j46297l50453
14117I537382J20657n26743K31919m55105L58078m20925j77405M3976m29554k9483
14107H252797l8372k35738J62167j99239l43913M65237k35235k25345l22046k6782
$$ plain form
14173 26885080 26361580 25569969 25064025 24668260 23754705 23319047 22973452 22268936 21924725
14164 21924725 21542114 20801595 20522578 19829715 19870959 19296007 18601603 18455190 18079521
14155 18079521 18069455 17389960 17274924 17059625 16543953 16179814 15902218 15779788 15355353
14146 15355353 15299518 14816698 14388160 14138208 14189353 13997023 13619758 13827823 13219360 12613211
14136 12613211 12768403 12150878 12316064 11985265 11922752 11621721 11264529 11530438 10985363
14127 10985363 10997416 10764753 10928569 10406926 10419166 10126589 9848816 10034132 9887835 9537382
14117 9537382 9658039 9131296 9363215 8908110 9266188 8845263 8667858 8711834 8282280 8252797
14107 8252797 8214425 7978687 8140854 7941615 7597702 8062939 7827704 7602359 7280313 7253531
14097G253531p703j9604k14095j53055L45442n26571J72975J99133l14681k52064
14087F483308j55877K04911k27365l43383j0654o8318K9296Q7413j58331j95723
14077E645277K48966n57878m0843L62447m48921j06412L56706j97376k44856r7010
14067D920100P4952M76477n44225O9756k01430M98049m74194n6210L3366J7460
14057D814101p54535M06545r4111n3987O1853k19877j28316m2006M11274o1534
14047D339407n61021K94735k09885M89372l68110R3169k92833n1182l6694J20955
14037C817913K41752n12473o6570J15184K1671J8709Q2066N1428k76076m21398
14027C072206N37826j00187m29206R4811J9193J58126m4063l01575j59723K91450
$$ plain form
14097 7253531 7245828 7226224 7012129 6859074 7204516 6677945 6850920 7050053 6735372 6483308
14087 6483308 6327431 6532342 6304977 5961594 5950940 5882622 5911918 5999331 5841000 5645277
14077 5645277 5894243 5336365 5295522 5657969 5209048 5102636 5459342 5261966 5017110 4920100
14067 4920100 4995052 5471529 4927304 4997060 4795630 5293679 4819485 4763275 4796641 4814101
14057 4814101 4059566 4466111 4372000 4318013 4379866 4159989 4031673 3989667 4400941 4339407
14047 4339407 3778386 4073121 3863236 4352608 3984498 4077667 3784834 3733652 3696958 3817913
14037 3817913 4059665 3547192 3480622 3595806 3617477 3636186 3718252 3769680 3493604 3072206
14027 3072206 3610032 3509845 3080639 3175450 3194643 3352769 3308706 3007131 2847408 3138858
14017C138858K78947k90179j59653m6089R7718J86815l95383L50131k95456j36946
14007B728763M2788k91870L73473O530m1721k94620l68938L20536J38064J9625
13997B632630k76253L46796l46508J20565J79316l37620L56057m03959K95255
13988B566279l71294L43914l62K7127k92987K6785K99177K76901j71004K34496
13978B939032L74797N74181P09006J170570K178497L117110N375570O757709K999853
13969B6196325n614258n927721l890720k882772j432305j210525m76787o70486
13961D090751r7813n76476K63951k41669n98138J24513K38356p48603o1672K86242
13951B679442l21919K23650k4973l83406O1093j98483K09850M6502j17922l12736
$$ plain form
14017 3138858 3417805 3127626 2967973 2921884 3019602 3206417 2811034 3161165 2865709 2728763
14007 2728763 2771551 2479681 2853154 2859684 2817963 2523343 2154405 2474941 2613005 2632630
13997 2632630 2356377 2703173 2356665 2477230 2656546 2318926 2674983 2271024 2566279
13988 2566279 2194985 2538899 2538537 2565664 2272677 2299462 2598639 2875540 2704536 2939032
13978 2939032 3313829 3888010 4597016 5767586 7946083 11063193 16438763 23196472 26196325
13969 26196325 20582067 14654346 10763626 7880854 6448549 5238024 4761237 4090751
13961 4090751 3992938 3416462 3680413 3438744 2840606 2965119 3203475 2454872 2393200 2679442
13951 2679442 2357523 2581173 2556200 2172794 2233887 2035404 2245254 2291756 2173834 1861098
13941A861098L74377j1148l65588J75631j36371j45759N18696m41059K46905k92593
13931A784189J39594M8457P5577m59378N55751k94773n7647m1093j78471J91166
13921A763372J24689m85432N7783K30113J70771l62914J2818J15915l49442N50313
13911A827986l04561J82365j27186K85264l89452J05683N0349n6482k71250O6275
13901A368991N6850K14922J7506J89385k14930K5550j16831l34236J42297K2276
13891A371780M30817k79310L6352J26783k68460J35998k50889O1343k0785L37322
13881A680951l18248L38671m3172l05822k33408J49696m4988L94780j73454P5309
13871A520315k90753O4983j45518J09495j58923K60780M3191j4921k74213J60132
$$ plain form
13941 1861098 2235475 2224327 1858739 2034370 1897999 1752240 2270936 1829877 2076782 1784189
13931 1784189 1923783 1972240 2047817 1588439 2144190 1849417 1791770 1750677 1572206 1763372
13921 1763372 1888061 1402629 1460412 1690525 1861296 1498382 1511200 1627115 1277673 1827986
13911 1827986 1523425 1705790 1578604 1863868 1474416 1580099 1630448 1573966 1302716 1368991
13901 1368991 1425841 1640763 1658269 1847654 1632724 1658274 1541443 1207207 1349504 1371780
13891 1371780 1802597 1523287 1559639 1686422 1417962 1553960 1303071 1364414 1343629 1680951
13881 1680951 1362703 1701374 1658202 1352380 1118972 1268668 1223680 1618460 1445006 1520315
13871 1520315 1229562 1294545 1149027 1258522 1099599 1360379 1403570 1388649 1114436 1274568
13861A274568o9960J4323N6553k30599O7333j77542m2892Q1602J62812j41782
13851I94416m8317K69681P4553j68068J9009K30437m0757k94997n8819K63186
13841A240324m52120M72845l29222J1756J25550j96621M719K75911k1914j5644
13831A115584M0412j8418j95425K85905l98823K22688J7425O6909k85960k3643
13821H26654K93160r7626k15463J00495J53485m04106M28108k52309N7644k48228
13811F41814l0066N26354p799m50406N46876n10549L49138K7107m41127K22803
13801H74145J55587j32427j26914L68564m09231j44659R2440P1020J47121J80006
13791A075652j41051l19321K51317j38336J10249j66283Q5382j09618j09753M13328
$$ plain form
13861 1274568 1204608 1218931 1275484 1044885 1112218 934676 891784 973386 1136198 994416
13851 994416 946099 1215780 1290333 1122265 1141274 1371711 1330954 1035957 977138 1240324
13841 1240324 788204 1261049 931827 943583 1069133 872512 877231 1153142 1131228 1115584
13831 1115584 1155996 1137578 942153 1228058 829235 1051923 1069348 1136257 850297 826654
13821 826654 1119814 1022188 806725 907220 1060705 656599 1084707 832398 890042 641814
13811 641814 611748 1138102 1130303 679897 1226773 716224 1065362 1092469 651342 874145
13801 874145 1029732 897305 770391 1138955 729724 585065 677505 748525 895646 1075652
13791 1075652 934601 615280 866597 728261 838510 672227 757609 647991 538238 951566
13781I51566j61843K30641k78702k29689J03484K20877r6719j6267M7232l23533
13771D47047N69730m07366M9692P6728J49943k53026r241j94778J88415J12677
13761G29821M5219j28304J07563K06018k68055L4843p4509l771o0528N0007J26419
13750G64723L4879k3691l37985L81111J10962l75350R3201K9256r5955K32408
13740H13559k01731O5548K3794J22899K77418m71701j59008J32525l5721O7024
13730F34606j8079k04747K39001j24330L4412O9518R5589r4683n172n3708o2771
13719E09636l6122J50622P6159k42769K14350j2964N0457J68920k61056j59856
13709D57377L7781j39822J93138j7645j4655j06782K87336j31468o9330N88564
$$ plain form
13781 951566 789723 1020364 741662 511973 615457 836334 739615 723348 770580 447047
13771 447047 1016777 609411 659103 735831 885774 632748 623507 428729 617144 729821
13761 729821 775040 646736 754299 960317 692262 727105 652596 648825 588297 638304 764723
13750 764723 799602 775911 437926 819037 929999 554649 647850 677106 581151 813559
13740 813559 611828 677376 701170 824069 1101487 629786 470778 603303 567582 634606
13730 634606 616527 411780 650781 526451 560863 630381 725970 631287 626115 572407 509636
13719 509636 473514 624136 700295 457526 671876 658912 709369 878289 617233 457377
13709 457377 495158 355336 548474 530829 516174 409392 696728 565260 495930 1084494
13699A084494D18672L47074j46980r9970p580K3622j12548J81664A76763M88963
13689F65726j23254j29432l4195M26103C83354K34104A88834O18076q1444C05238
13678C93429j40548M15128j89788k13189K73132J60409j13855j36802A87861L03844
13668D91705J11759k12188K56610j68524L09370C71701J69521J4599j30818m1029
13658C83974j12669M38384n3663o9K22460B72248P9990M2195N0737L28355k10726
13647E62799j46621K2358J82237k24243j14697L06258B61221K15578N749j91033
13637B91515k8615M19942j92401M5019j06968L0885A55479P0868J25580n1238
13627C00689K13528K0381M0825k747A81890K9895Q6491L08728k81770L59453C37398
$$ plain form
13699 1084494 418672 765746 618766 518796 511216 534838 422290 603954 176763 665726
13689 665726 542472 413040 378845 804948 383354 617458 188834 806910 725466 305238
13678 393429 252881 668009 478221 265032 538164 698573 584718 447916 187861 491705
13668 491705 603464 391276 647886 479362 788732 371701 541222 555821 425003 383974
13658 383974 271305 709689 656026 655957 878417 272248 352238 394433 445170 773525 562799
13647 562799 416178 438536 620773 396530 281833 588091 261221 476799 482548 291515
13637 291515 262900 682842 490441 535460 428492 459377 155479 226347 351927 300689
13627 300689 514217 534598 575423 572676 181890 211785 298276 607004 325234 684687 337398
13615E24150Q2338B19256M35758j38574j1768B38968K52230A97317R9162K40862
13605E37341q0747N353n4314j62177K97356J37352j51792K53751j40203j03391
13595E38529A99262K65737H7813K39917J8470F5517L57271N9730A82058K31593
13585D13651J52033p6903B9449L08606l2826I8812J06758L39365A48372L7461
13575A85833Q9310O5783J91505j51536A6911L97772A55145K35378J74405j47972
13565D16956A87829K65266j11555p0406P304K81873j01075k01924k0822A06160
13554E35413A22411L33921m0738A44682L3484c90A34021M0089J08207K3933j34113
13543A72137J02450K70289k04016p2840M60430F2186L40104r9076J95749M4284
$$ plain form
13615 524150 606488 219256 655014 516440 504672 238968 491198 197317 296479 537341
13605 537341 456594 461947 407633 245456 542812 680164 528372 782123 641920 538529
13595 538529 199262 464999 87813 327730 346200 65517 422788 482518 182058 413651
13585 413651 565684 488781 29449 338055 305229 98812 205570 544935 148372 185833
13575 185833 275143 340926 532431 380895 16911 414683 155145 390523 564928 416956
13565 416956 187829 453095 341540 271134 278438 560311 459236 257312 236490 106160
13554 535413 122411 456332 415594 144682 178166 -390 134021 174110 282317 306250 172137
13543 172137 274587 544876 340860 268020 728450 62186 402290 303214 498963 543247
13533E43247j32426j26813j33173a387A68536M1024R775R9243J843j4564I5876
13521A76253J31180F3043L39567j58041A3986L55474j42576J18848Q2990p9557
13511C49165F4549N2845L26093H1856O9797L21858j58310M6849A05679J27346
13501B33025L6558N3122p4404r3176N06038A91227R6055A37458L64975j14228
13491C88205J65757A67044R6584A00970J87463P6505j42083J50200L9085j28089
13481B84051l2025E7408L18621A34004K02976l2300m84r674j29805m1750J59358
13470B82325j1122J10874J12595j36254f6000A42347O1342F2754K85164A03893
13459E16194A01449K28434J89871B3802L46398j5529A19116J70965K9303L3451
$$ plain form
13533 543247 410821 284008 150835 -1387 168536 209560 219335 318578 320421 305857 95876
13521 176253 307433 63043 402610 244569 13986 369460 226884 345732 428722 349165
13511 349165 64549 117394 443487 81856 151653 473511 315201 362050 105679 233025
13501 233025 269583 322705 248301 155125 661163 191227 287282 137458 502433 388205
13491 388205 553962 167044 263628 100970 288433 364938 222855 373055 412140 284051
13481 284051 252026 57408 376029 134004 336980 304680 304196 294522 164717 122967 282325
13470 282325 271203 382077 494672 358418 -66000 142347 203689 62754 347918 103893
13459 516194 101449 329883 519754 23802 370200 354671 119116 290081 319384 352835
13449C52835g2227D02541A57680L2113L2305J47174A69806K51592j38376L1363
13439C14385a24564e451A22875a20391A99671L5409J34798j71796M78406k80441
13429C96047A18836c350A34997J96886A65348J6107m882J96233A49165J87244
13419C36409C5162L16636o9594j16416K58471b66291a02230A18713j9019O3686
13409A63380J87867P3376r1173j13345J8869r6173J63447m2662a38544A61445
13398B43905J7342b9248F9833J8051K19088L08424a9350B20117m3609R5656G0636
13386G3848K71469e1953d105F2726d2227B90567K68799j93608c45046B24454O727
13375B31181A00695C4185a60094C00394j47891J7188L442J1344L73958k74951
$$ plain form
13449 352835 -72227 402541 157680 189793 222098 369272 169806 421398 283022 314385
13439 314385 -124564 -5451 122875 -120391 199671 235080 369878 198082 676488 396047
13429 396047 118836 -3350 134997 331883 165348 181455 176573 372806 149165 336409
13419 336409 35162 351798 282204 165788 424259 -266291 -102230 118713 99694 163380
13409 163380 351247 424623 333450 220105 238974 142801 306248 263586 -138544 161445
13398 243905 261247 -29248 69833 87884 306972 615396 -19350 220117 176508 272164 70636
13386 73848 345317 -51953 -4105 62726 -42227 290567 559366 365758 -345046 224454 231181
13375 231181 100695 34185 -160094 300394 152503 169691 173133 184477 558435 283484
13365B83484m0569R7433J73286B07217B2590K18000A04155K57312I0346M47453
13355E37799A73416C9644M13347A5616L11755R136A49547J92266I8429M4884K19895
13344C63208J02621G6050K95947f0615B29912K71192j80126A24216o756k2022
13334I5438d4871C28779M8345J55053k59188j25384J16859A9374M15525R5387
13324E30286G1718a18501M4070j80317B37458q864M5798A00822m9603L15895G5829
13312C63278j24258j17899A916J92342J23594K5305j5367A18480K16141l7474
13302B97147A3151a77114C07866j50619h8486m8404e6916D0891K51163K77085
13292E69139i4452B4867K79139C1303L62575I523J74646f3595C75712a35871N3631
$$ plain form
13365 283484 242915 340348 513634 207217 22590 240590 104155 361467 90346 537799
13355 537799 173416 39644 452991 15616 327371 336507 149547 341813 98429 143313 363208
13344 363208 465829 76050 371997 -60615 229912 501104 320978 124216 117460 95438
13334 95438 -44871 328779 377124 532177 272989 147605 264464 19374 434899 530286
13324 530286 71718 -118501 -74431 -254748 237458 228594 274392 100822 51219 367114 75829
13312 363278 239020 121121 1916 194258 317852 343157 327790 118480 334621 297147
13302 297147 13151 -177114 307866 157247 -88486 -136890 -56916 40891 292054 569139
13292 569139 -94452 24867 304006 31303 393878 9523 184169 -63595 375712 -135871 -82240
13281h2240A94376o9919m0554L6045K5672c681B8934a16939G8339J22869J12856
13270C14064a76550A3809C754J75579K95486j44017i0180B42560E7718J45633
13260B03351N7170A09241K33909A07824M12838k18604j00928D1694Q2202b25343
13249C65452A60239D914R3483L09657a11993b0398B31614n0057h5723H3264Q909
13238I2173K04410Q5880A45624a3407B36989c1445E2142K15527b71120D73728
13227f9402b2503I1559g4905k38200B72922H2437C769R3191g5079B50124a47418
13215D65108b204E8967i0660o3072c5107A39535n998L6100G826b49137B05671
13203A45014B1445a19489B11660k9490E4025j9294J31718g9075o9815C16950J6115
$$ plain form
13281 -82240 194376 124457 83903 119948 145620 -3681 28934 -116939 78339 201208 314064
13270 314064 -176550 13809 3754 179333 474819 330802 -90180 242560 57718 203351
13260 203351 260521 109241 343150 107824 520662 302058 201130 41694 123896 -225343
13249 365452 160239 4914 98397 408054 -111993 -20398 231614 181557 -85723 83264 92173
13238 92173 296583 382463 145624 -13407 236989 -31445 52142 267669 -271120 473728
13227 -69402 -22503 91559 -74905 -313105 272922 82437 3769 96960 -75079 250124 -147418
13215 465108 -2204 58967 -90660 -153732 -35107 139535 133537 169637 7826 -249137 205671
13203 145014 21445 -119489 211660 182170 54025 34731 166449 -79075 -148890 316950 333065
13192C33065A6939n681K07050I7544J46862A03184j4692h1751e74B66980a8082
13180E1867K22612E5977a52084B63755d1635k17682a26137f0506C01998I4276
13169D10578G8694l344A5175J70207a7273A20788R1137q7166F1083b82633J02310
13158a80323C40896E3256M4635J51433L8691A01687N1788B8246Q1353k209a02659
13146c19903A47219O2026K0319r2181j6973J129P6778j7645c8586C18109D4501
13134A0884i2143B68973L95553b15334O4349A48893g919C70967j0026a59934A81664
13122a35938a4529o7292A48843O0551l9985G0351a50182D8370J90374A00060O040
13111A06100K34687J7671F4403c187A46343f651j8162l08859A25454J61031b01063
$$ plain form
13192 333065 16939 11258 218308 97544 244406 103184 88492 -81751 -574 266980 -18082
13180 51867 274479 55977 -152084 263755 -41635 -259317 -126137 -60506 301998 94276
13169 410578 78694 75350 15175 185382 -17273 120788 211925 124759 61083 -282633 -180323
13158 -180323 340896 53256 97891 249324 288015 101687 153475 28246 109599 107390 -102659
13146 -319903 147219 209245 229564 137383 120410 121539 198317 180672 -38586 318109 44501
13134 10884 -92143 268973 664526 -215334 -150985 148893 -7919 370967 360941 -159934 181664
13122 -135938 -14529 -81821 148843 209394 169409 70351 -150182 48370 238744 100060 106100
13111 106100 340787 358458 64403 -3187 146343 -6651 -24813 -333672 125454 286485 -201063
13099b30902A98542a4495j62971a0590B7674K08078n3377J36908p5751p1495J05179
13088B77216C7019a07217D10475a31960I3047J066O8852K61933a42902m002A65362
13076c04281B5202J04420R1768a8465j04530q7099B0763L86106q5075M0905b60827
13064a03884k8944A53165a23980E6520N636J43366d5504I3709J73699j5515j8214
13053B33679e4911F2933b40991A30945R7466j568h5786c5624E4125K00994j15840
13042A39279a06631c2363E427N3910O58R2427J05118I9383J61563q8846A0380
13030a16758D3479L96465E0065a88541h9830B54143F0734N2038K04878F7787J9546
13019H7333M60201I456K55625J4818j11013K06135j21667a69883C48165e2685
$$ plain form
13099 -230902 198542 -14495 -177466 -10590 27674 235752 182375 319283 243532 172037 277216
13088 277216 37019 -107217 410475 -131960 93047 94113 162965 424898 -142902 -146904 165362
13076 -304281 25202 129622 221390 -18465 -122995 -210094 20763 406869 321794 362699 -260827
13064 -103884 -132828 153165 -123980 56520 62156 205522 -45504 93709 267408 251893 233679
13053 233679 -54911 62933 -240991 130945 228411 226843 -85786 -35624 54125 255119 139279
13042 139279 -106631 -32363 5427 59337 59995 152422 257540 99383 260946 172100 10380
13030 -116758 43479 439944 50065 -188541 -89830 254143 60734 112772 317650 67787 87333
13019 87333 547534 9456 265081 279899 168886 375021 253354 -169883 348165 -52685
13008B11169a68868H837e5248K2367I8634a57220j3780B67924b28009A7115a4893
12996b30331A23386E7997K8689L43522F8991J7344f6482F8283F238b74618R9026
12985a75592A9044J10254l7763A3424J90121h6698C2859L82863H4087B2682e3304
12973B55190b08264P1581l4360a3233j69970G0585c7058m4983J9743D15544a52198
12961c2807A01218J93787i1265I9903o994M7902N7521a27636c9677k30463D6708
12949a47292d7944h73l0567C36026a54982F9721i6090r186B75786p3421G5526
12937a48521H0336a77317M2958o4182J8335B60311b3695k0442A94531C5598B269
12925H1136j8376d3541b0966j1677B4362J81036B1301L8164B6433n98J82058b5578
$$ plain form
13008 211169 -168868 8837 -55248 -32881 98634 -157220 -171000 267924 -228009 17115 -14893
12996 -230331 123386 57997 86686 430208 68991 86335 -66482 68283 6238 -274618 -175592
12985 -175592 19044 129298 91535 13424 203545 -86698 32859 415722 84087 22682 -53304
12973 255190 -208264 -136683 -171043 -13233 -183203 70585 -37058 -82041 -62298 415544 -152198
12961 -32807 101218 295005 -91265 99903 92909 140811 198332 -127636 -39677 -270140 46708
12949 -147292 -47944 -873 -31440 336026 -154982 69721 -96090 -105276 275786 202365 75526
12937 -148521 80336 -177317 -134359 -198541 -180206 260311 -23695 -44137 194531 35598 2269
12925 81136 62760 -43541 -20966 -32643 24362 205398 21301 59465 26433 25835 207893 -25578
12912A96746j6509m0002b36735C7094e1707A96318e7519B40918m7636o8569g0937
12900D00072a1793B82363K2570A09177e2494F7430K84872f0136A06039b13584
12889b02491h0562A57345b22597B700g2434j75853C03826q7617o9402g513C301
12877b9784l2433l6842a3795k88098B40144O1792D2554a08650k2103F885Q4025
12866I0910a65222m8782a04069D0901a67006e8538E3606J41867a33981B8405J67526
12855A95931N4607i1391c977k31947j27306A72860a28408A2327K56391o9526k7091
12844A72101o0408L4867a05506A05559K3947b36075B7135d8698D3272h472n0192
12833e8664E0335d7989A46534a14688E15207A15999L82780B07073h5218j3821
$$ plain form
12912 196746 180237 140235 -236735 37094 -51707 196318 -57519 240918 193282 124713 -70937
12900 400072 -11793 282363 304933 109177 -52494 67430 352302 -60136 106039 -213584
12889 -202491 -80562 157345 -222597 2700 -72434 -248287 303826 216209 146807 -7513 3301
12877 -29784 -62217 -99059 -13795 -301893 240144 301936 42554 -108650 -130753 6885 90910
12866 90910 -165222 -214004 -104069 40901 -167006 -58538 53606 195473 -133981 28405 195931
12855 195931 250538 -91391 -3977 -235924 -363230 172860 -128408 12327 268718 199192 172101
12844 172101 111693 146560 -105506 105559 129506 -236075 27135 -48698 43272 -8472 -58664
12833 -58664 50335 -47989 146534 -114688 515207 115999 498779 207073 -85218 -99039
12823i9039B44236E7075M8822O1952a38407K0251I7641K8617L2830m7937i951
12811B64411j22965i252I0425d19165C125b38454B13418b5978j2466n9441D528
12799b27394B88141A09444L32472A19481C222a16228A85267Q3956D8875N9510
12789A08385P1122b6269r2997B84294a2529k0572D4831J09435E0449a20380k23603
12778c43983C42870j55455a55010J6792a2419B6792b62562d4503j28233B04776
12767C68487A46307M2819a4605A91951A4250a43620A86996c19761a08594j09256
12757b17850M4379C15744a72224B80319A08469L5174r307C5930J42638k2277f5509
12745a75590C56534a13384G8093i3811l7660A41018C4865a2270B15174J0206J88796
$$ plain form
12823 -99039 244236 57075 105897 167849 -138407 -118156 97641 126258 159088 111151 -9951
12811 264411 141446 -9252 90425 -419165 3125 -238454 213418 -25978 -38444 -97885 4528
12799 -227394 288141 109444 441916 119481 3222 -116228 185267 269223 48875 108385
12789 108385 179507 -26269 -119266 284294 -12529 -33101 44831 154266 50449 -120380 -343983
12778 -343983 342870 187415 -155010 -138218 -12419 26792 -262562 -44503 -172736 204776
12767 368487 146307 189126 -14605 191951 14250 -143620 186996 -319761 -108594 -217850
12757 -217850 -173471 315744 -172224 280319 108469 143643 134336 35930 178568 156291 -65509
12745 -175590 356534 -113384 78093 -93811 -131471 141018 34865 -12270 215174 225380 414176
12734D14176i8731J8569l7897l9289A91880p8507j2503a8055m10780C03192G079
12722A07165J73707B217J47965a00243B41478a89954c8486C83219E125a94368
12711g5211B06030D4059c35051e5177A13991H175R6595J47823b8775B0481J13792
12700A34273f4366B71489b7696A16270K29610F9807c6792F2275L11495j83339
12690A90431d2087H9950A6135j254h766E2753Q0906K7605m5135e6901j34102F5638
12677A32132O9560c4830j59306B13802a21506A5900b11905f9160c0810A12306
12666b0575D1611J9875J18309c1532B22637F3347P7023m6725c3297B50477j06397
12655A44080O740J5213B3408a97983K4860B08275j02223a4056j13935j37057B40573
$$ plain form
12734 414176 -98731 -80162 -118059 -157348 191880 113373 100870 -18055 -428835 303192 7079
12722 107165 280872 2217 150182 -100243 241478 -189954 -38486 383219 5125 -194368
12711 -75211 206030 44059 -335051 -55177 113991 8175 104770 252593 -28775 20481 134273
12700 134273 -64366 271489 -27696 116270 345880 69807 -36792 62275 373770 190431
12690 190431 -42087 89950 16135 14881 -8766 52753 133659 161264 116129 -56901 -191003 65638
12677 132132 201692 -34830 -194136 213802 -121506 15900 -211905 -69160 -30810 112306
12666 -20575 41611 61486 179795 -31532 222637 63347 140370 93645 -33297 250477 144080
12655 144080 150820 166033 23408 -197983 -173123 208275 106052 -14056 -127991 -265048 240573
12643b01240O1625k9148I3186D6118a86486a4397j01286A12327J46870G1677K94452
12632C66129a08109A52199o8783M96247d511m30941F6633a61421l3327B78265
12621c3383J145j74814b2104l8559H5469B5288R176P3634n1170k4185Q512L0250
12609G1505J27601b82278F0498K02999c5786A8757a16499e3135E0735l078J57097
12598B04754n074a15897C113J32822d1673i645B64826R1259j62532R5440p7949
12587B11044H0925k9752e3321J8069B299J4595J36903E3696N649O812J54745F6087
12574B42496a8304j19082I1178l2236h7000m465j74098A83588a62706B10867b5868
12562A56201Q670p4711f9192i196B65732A7473O662h1866K8641p9999A40198R2165
$$ plain form
12643 -201240 -139615 -168763 93186 46118 -186486 -14397 -115683 112327 259197 71677 366129
12632 366129 -108109 152199 83416 579663 -4511 -435452 66633 -161421 -194748 278265
12621 -33383 -32238 -207052 -22104 -60663 85469 25288 34464 108098 56928 32743 41255 71505
12609 71505 199106 -282278 60498 263497 -35786 18757 -116499 -53135 50735 47657 204754
12598 204754 199680 -115897 3113 135935 -41673 -9645 264826 356085 193553 288993 211044
12587 211044 80925 51173 -53321 -35252 2299 16894 153797 53696 59345 66157 220902 66087
12574 242496 -18304 -137386 91178 58942 -87000 -91465 -265563 183588 -162706 210867 -25868
12562 156201 164871 90160 -69192 -9196 265732 17473 24135 -81866 -53225 -133224 140198 232363
12550B32363a6555D7835b71379a04245C35193d1795A88325F1122B8247K13899
12540B42146j11971n3114C6284a0171C3780K91842F6819O0277n0601b64646e3095
12528G1310b8021B59454a79737G9856C477Q3685h1469j11750d6942J4315B44711
12516h2570a2387A20479K98177b85413g5904D86496G6466A9469o472K11202f5807
12504B42170h2958E7371h264A58825J11258i4493j22941L0148B99690b3068B47102
12492i3435i219I2753L28667a27304B00365E8583J5503J47935a4091j61724G938
12480A52760D4523i9253B51060j11727b59807i754F4418a18764A48864K9515a52226
12468a53367k15329g332I9185a41717A96883I0314d291n7545k6902I9854P8104
$$ plain form
12550 232363 -16555 47835 -271379 -104245 335193 -41795 188325 61122 28247 242146
12540 242146 130175 77061 36284 -10171 33780 325622 66819 127096 76495 -264646 -53095
12528 71310 -28021 259454 -179737 79856 3477 87162 -81469 -193219 -46942 -32627 244711
12516 -82570 -12387 120479 418656 -285413 -75904 486496 76466 19469 12997 224199 -65807
12504 242170 -82958 57371 -8264 158825 270083 -94493 -217434 -187286 299690 -23068 247102
12492 -93435 -9219 92753 421420 -127304 200365 58583 74086 222021 -14091 -175815 7938
12480 152760 44523 -99253 251060 139333 -259807 -9754 64418 -118764 148864 178379 -152226
12468 -153367 -368696 -7332 99185 -141717 196883 90314 -4291 -61836 -88738 99854 177958
12457A77958b8801o5409A9306d3328A44608g4317A91966g8728L4891A39058L55908
12446D94966E6492i0428j4101c3562k24375A74009a53011P5637E292K28214a1376
12434B5827P5748Q6179l8411m8907e85232A44374J60835c20775b2731C80857c31310
12422a53062F6665B1944k451L58210A81361a4187A9217O7910a23404n592A6015
12410C12856a29603F739f5892q9915g3206k02247g6929a5797p0108E436K33111
12399B38547a69591D60683b86682e4792A92741r3089P7319a51614O8010A92632
12388A17079l9664a65497H9707L18a80511G7653K7661B7712j217J27872d2269
12376B53922c24178b8444A53230c2131n9414l22915a87498b796m25209b07896
$$ plain form
12457 177958 -28801 -94210 19306 -43328 144608 -74317 191966 -78728 -43837 139058 494966
12446 494966 56492 -90428 -104529 -33562 -257937 174009 -153011 -77374 5292 233506 -11376
12434 25827 101575 187754 149343 100436 -585232 144374 305209 -320775 -22731 380857 -331310
12422 -153062 66665 21944 19493 377703 181361 -14187 19217 87127 -123404 -128996 16015
12410 312856 -129603 6739 -65892 -155807 -73206 -275453 -76929 -15797 -85905 5436 238547
12399 238547 -169591 460683 -286682 -54792 192741 99652 176971 -151614 -83604 192632
12388 117079 77415 -165497 89707 90025 -180511 77653 105314 27712 26495 154367 -42269
12376 253922 -324178 -28444 153230 -32131 -91545 -414460 -187498 -2796 -428005 -207896
12365E5850R3799L3005f2840j26194J8918c5272A8537J27495a30768E187K2413
12354B7600G794R488E100b1003k3262D3527b14773I389P1899b89833a30730C69388
12341e943n6435H3204a6048N602n8072b5335k92457B9407L4507a73671g4110A11935
12328a86411h5990B79512a28542A36008M8319b51422e7065C71194e36683a32506
12317H3121c56095A07667L9337J3153D3261e9607I3080b15339a481C257M4371
12306D7628b65573a5428j49467q7096D04346A76208b59954d9649j92652L0333
12296b11968e0060j32576A8947L50578A41300e9743C29862j63101O4990r4872
12286A36879E454M4939J67531c3445j51343j04359A36681R1808a53462B02738
$$ plain form
12365 55850 149649 182654 -62840 -189034 -170116 -35272 18537 146032 -130768 5187 27600
12354 27600 7794 17282 5100 -21003 -44265 43527 -214773 9389 81288 -289833 -130730 369388
12341 -5943 -62378 83204 -16048 -10446 -68518 -25335 -317792 29407 63914 -173671 -74110 111935
12328 -186411 -85990 279512 -128542 136008 184327 -251422 -57065 371194 -536683 -132506
12317 83121 -356095 107667 147004 160157 43261 -59607 93080 -215339 -1481 3257 47628
12306 47628 -265573 -15428 -164895 -251991 404346 176208 -259954 -49649 -242301 -211968
12296 -211968 -50060 -182636 18947 369525 141300 -59743 329862 166761 231751 136879
12286 136879 5454 50393 217924 -33445 -184788 -289147 136681 228489 -153462 202738
12275i8463M278n2599k08778B79333h2928j43772c3569C9572a18476k7844B05372
12263h0945B80470j07976K38662C2156a00168J9337f493G5930a99185j82135J40336
12252b40984Q5251j271B55946J2974b3798q9242G9721g3402B87869j20429P8174
12241B45614c50057I3621M4328N7289k4211c3383A39160A2649j532O7211J08727
12230A87055K44454A50092a35558c6676E93539B64658f8314j43099a2113A29195
12219A39555J65287j02585Q7577A02169K6032J42279l7114J19062D9660M0531
12209I0191a26973D04970A35651r63J2646l4497g5905A28825P3793a43242H0593
12197a32521C40172a2726A01463J34214d6410j22756C8052b4941A58528Q2613
$$ plain form
12275 -98463 -94185 -146784 -355562 279333 -82928 -226700 -33569 39572 -118476 -146320 205372
12263 -80945 280470 172494 411156 32156 -100168 -80831 -6493 75930 -199185 -381320 -240984
12252 -240984 -155733 -157004 255946 268920 -23798 -113040 79721 -73402 287869 167440 245614
12241 245614 -350057 93621 137949 195238 171027 -33383 139160 12649 11117 78328 187055
12230 187055 431509 150092 -135558 -36676 593539 264658 -68314 -211413 -12113 129195
12219 139555 304842 202257 289834 102169 128201 270480 233366 352428 49660 90191
12209 90191 -126973 404970 135651 134688 147334 112837 -75905 128825 202618 -143242 80593
12197 -132521 340172 -12726 101463 235677 -46410 -169166 38052 -24941 158528 241141
12187B41141G3150a27886N8687h236G7144a91673B0020N5322O6406A8234K6283
12176D4517c0722A02631L9518A1273L92461E0267P8010l9435l8749P7576d8593
12164c1781j27902A24796B5767J74138N1110a20152k29238d0111D7912a95925
12153A69254p3342G679a20365B06206q0847c0066D8902g1164j14093P9348M6682
12142e9227q5079L2021N0129A29065j4164g6592A95902k1262K5053d8300B9600
12130B7644a14788A47647a48876A91524a26130j21837A58094K8051R8830D2186
12119F6624b6433A70894G4387J7005a28887k0424j86507H4802l1866a24208e1380
12107a7552A36930O7147j369m1035j7508d768D4137b01717Q3922D79046C6221
$$ plain form
12187 241141 73150 -127886 -69199 -8236 77144 -191673 20020 75342 141748 18234 44517
12176 44517 -30722 102631 142149 11273 403734 50267 128277 88842 50093 127669 -48593
12164 -31781 -159683 124796 25767 199905 251015 -120152 -349390 -40111 47912 -195925
12153 169254 95912 7679 -120365 206206 125359 -30066 48902 -71164 -185257 -105909 -59227
12142 -59227 -144306 -112285 -62156 129065 114901 -76592 195902 174640 199693 -48300 29600
12130 27644 -114788 147647 -148876 191524 -126130 -247967 158094 186145 284975 42186
12119 66624 -26433 170894 74387 91392 -128887 -149311 -335818 84802 52936 -124208 -51380
12107 -17552 136930 204077 202708 161673 144165 -4768 44137 -201717 -117795 479046 36221
12095I2339B8778a84296l24580A71985a60071C23817A33115a54931j0574F3016
12084h7692K8176A56005a33473N0672o9450A30898a85220B54688b16362A90054
12073a80414A7947c69141a19684B2767J09617b02048K8602a9259A76011k2900
12063A53111o2413c356C6869a43074A22193o0116L41721J66423N66671D96817
12052A44226L9143b20558C30885m3306a42189o4937A22129a21934m4450C38483
12041C738J51229J2496B9275b77672a11426H3039C691J7373K3741K1231b80411
12029E2381a39227c0438D0519J31810h6338J5394m2413A7085a25369e3378j70744
12018b24122B27578c60803B25301a16198N4895C8964a85537N0618e8482j97209
$$ plain form
12095 92339 28778 -184296 -508876 171985 -160071 323817 133115 -154931 -165505 63016
12084 -87692 -59516 156005 -133473 -82801 -152251 130898 -185220 254688 -216362 190054
12073 -180414 17947 -369141 -119684 22767 132384 -202048 -173446 -19259 176011 153111
12063 153111 90698 -3356 36869 -143074 122193 62077 403798 570221 1136892 496817
12052 144226 183369 -220558 330885 287579 -142189 -207126 122129 -121934 -166384 338483
12041 3738 154967 167463 29275 -277672 -111426 83039 3691 21064 44805 66036 -280411
12029 52381 -139227 -30438 40519 172329 -86338 -70944 -113357 17085 -125369 -53378 -224122
12018 -224122 227578 -360803 225301 -116198 -61303 38964 -185537 -134919 -58482 -255691
12008b55691D3826i9140m9782j78656A88404K16815e858m8280q6511D0609A0185
11996I9885A6500b56809M4643A24956R4743b90748D1660f0262j0942G3978N7840
11985A31818c1035r089m7598D3015g3509B90833a50536b143C23562a46179I3456
11973b96016e2784B07789b22620B2706J29584K2985i595j79947r3147c962l08891
11962c12853e6284I0028b84659n6440g2328B05474L3980A04584D2542a4011j24860
11951a38871A28797i3573D24010a89016F0177a41331c9822k2691D8118b1550B09330
11939b40445i8236A67094K68325b6532j42949B4669a09450m8079d9091A45745
11928a766E4555J43519a01196B94739G1288K78515a0563j60936A57553c68622
$$ plain form
12008 -255691 43826 -99140 -148922 -327578 188404 405219 -5858 -54138 -140649 40609 10185
11996 99885 16500 -256809 -212166 124956 219699 -290748 41660 -60262 -71204 73978 131818
11985 131818 -31035 -40124 -87722 43015 -73509 290833 -150536 -2143 323562 -146179 93456
11973 -296016 -52784 207789 -222620 22706 152290 175275 -9595 -189542 -282689 -3962 -312853
11962 -312853 -56284 90028 -284659 -341099 -72328 205474 239454 104584 42542 -14011 -138871
11951 -138871 128797 -93573 424010 -189016 60177 -141331 -39822 -62513 48118 -21550 209330
11939 -240445 -98236 167094 435419 -26532 -169481 24669 -109450 -157529 -49091 145745
11928 -1766 54555 198074 -101196 294739 71288 349803 -10563 -171499 157553 -368622
11917g5891b0815D9260e761B24888a0857F9052i5572E4518e4486e834l3191A62319
11904d6492q0858o1026Q7500A82477g2243q6740B6868O8190k3192d57009C8437
11892H2845a7667j05813A58655J8227J74116F1995M5141C2804a26031i963j52399
11881a62362A42330j6906m0903j8151b11857d6494k2181E11866b77786M3728B72808
11869d22877a42404A1015a50686A89459c1527o0655I5631a95890M8980A29014
11858a06089q775E2138N8697e45k69090J29148N3405B66015e2472p3809b0062
11846b43354f9655j07021A17316a81872j21461D27112b87017A08421b68135c7040
11835c09174I2000C7549f7152l21529B71692i1495j26252R8804D5883a41598d3537
$$ plain form
11917 -75891 -20815 49260 -5761 224888 -10857 69052 -95572 54518 -54486 -5834 -39025 162319
11904 -46492 -127350 -188376 -100876 182477 -72243 -158983 26868 95058 71866 -457009 38437
11892 82845 -17667 -123480 158655 176882 350998 61995 107136 32804 -126031 -9963 -162362
11881 -162362 142330 125424 84521 66370 -211857 -46494 -68675 511866 -277786 -234058 272808
11869 -422877 -142404 11015 -150686 189459 -31527 -92182 95631 -195890 -146910 129014
11858 -106089 -114864 52138 110835 -545 -269635 -140487 -87082 266015 -52472 -126281 -20062
11846 -243354 -69655 -176676 117316 -181872 -303333 427112 -287017 108421 -268135 -37040
11835 -309174 92000 37549 -67152 -388681 271692 -91495 -217747 -118943 45883 -141598 -43537
11823H8351a04884A09720H104a79268k36007B5400f3183j43455F9941b08838a7109
11811b51715c3332H0372A94a97955Q0746F0985A0524c3763I1857J72673a2769
11799A5812L6066L6169c57249J28104R3458B34032c44484j43578a4434j60229
11789a74663B11027K9530b58117Q0789k62562C0652a35608B06431J8614a88747
11778c9875n1093A9634J35500F4245J09716k8572a27331O0660j50586k3644D040
11766A69579p9985b7272j51431p7512B17155O5685A24515J1489b68993a2719m7843
11755f0562j66632a5896D8190e996A83591a35024d6k19024C670K4806K11539r8400
11743A41615i9610B5958K6444J03475b7702j7936j51178A1900K77402i3560j98700
$$ plain form
11823 88351 -104884 109720 8104 -179268 -415275 25400 -63183 -206638 69941 -208838 -17109
11811 -251715 -33332 80372 194 -197955 -117209 60985 10524 -33763 91857 264530 -12769
11799 15812 51878 88047 -357249 -229145 -135687 234032 -344484 -488062 -14434 -174663
11789 -174663 211027 240557 -258117 -177328 -439890 30652 -135608 206431 225045 -188747
11778 -39875 -90968 19634 155134 64245 173961 145389 -127331 -66671 -217257 -240901 4040
11766 169579 89594 -27272 -178703 -256215 217155 282840 124515 136004 -268993 -12719 -60562
11755 -60562 -227194 -15896 48190 -5996 183591 -135024 -46 -219070 3670 28476 240015 141615
11743 141615 -99610 25958 52402 155877 -27702 -45638 -196816 11900 289302 -93560 -292260
11732b92260a39255B58863I4121b00280Q2589c0537j67808o2056A6417a35473
11721b92943A18453i0904B07501o8563R0715e8530I6078a2465l4662k46575A51694
11709d18334B4599a2341j1555j91638Q6319m4523h5852m5954B719c15502C8103
11697C10705g8133F7443F756R3085J34831F7717a74252G4310a44049D3265a62421
11685b88646H7319b5277k2272H7199c20710A3376b26354h8885I2596m662a91784
11673C59286b53264f6968n6730E0244K25265r9591F4411J62302H470i3171D1019
11661A11964f2490F0740a15722B01950H6221b56812a07948a9111A65195b49722
11650a56250A2229a14683B06702a48620a0656B961O8705J9389a58158A72585b76202
$$ plain form
11732 -292260 -139255 258863 94121 -200280 -117691 -30537 -198345 -260401 16417 -135473
11721 -292943 118453 -90904 207501 138938 229653 -58530 96078 -12465 -47127 -293702 151694
11709 -418334 24599 -12341 -23896 -215534 -129215 -173738 -85852 -131806 2719 -315502 38103
11697 310705 -78133 67443 6756 99841 234672 67717 -174252 74310 -144049 43265 -162421
11685 -288646 87319 -25277 -47549 87199 -320710 13376 -226354 -88885 92596 87934 -191784
11673 359286 -253264 -66968 -123698 50244 275509 175918 64411 226713 8470 -93171 41019
11661 111964 -62490 60740 -115722 201950 86221 -256812 -107948 -19111 165195 -249722
11650 -156250 12229 -114683 206702 -148620 -10656 2961 71666 91055 -158158 172585 -276202
11638B43143R157F6517a72544N2305A75132R6345j19354Q6943d55874a07379l1157
11627a38536B01377c79144F3545b49835a18866B09910f2115B22586A04629D4248
11616a78948M3398M2026A21471a67422B09059g1756A2798c3650k5186B22422r6887
11605A25535a62248C6646R7709j4239A3229a42807A50272F2761J72437A4283J31623
11594A45906a31812j39944e6734A56232J6375C1408a16961k69103i4227j08496
11584b02723E33942A2004J18751L8741b55241J26850r3624M1424D4249K23715
11574B67964c6482A92917A6407K07454k0306J4986a71270i449k889A00951a05485
11562B21363g5602L6728B79642a2230D3422L37792f0083E3558P3652l7692b70095
$$ plain form
11638 243143 252300 66517 -172544 -120239 175132 271477 152123 239066 -455874 -107379 -138536
11627 -138536 201377 -379144 63545 -249835 -118866 209910 -62115 222586 104629 44248
11616 -178948 -135550 -93524 121471 -167422 209059 -71756 12798 -33650 -58836 222422 125535
11605 125535 -162248 36646 134355 120116 13229 -142807 150272 62761 235198 14283 145906
11594 145906 -131812 -271756 -56734 156232 172607 31408 -116961 -386064 -94227 -202723
11584 -202723 533942 12004 130755 169496 -255241 -128391 -222015 -180591 44249 267964
11574 267964 -36482 192917 16407 223861 203555 218541 -171270 -9449 -12338 100951 -105485
11562 221363 -75602 -38874 279642 -12230 43422 381214 -60083 53558 127210 89518 -270095
11550H8216J67319a30142A99541j3334G1155O6514b4418B48646b4530o2193A15007
11538E5070b16998A87865L4292i2079L0476B04059b04172A67348l2896H712K180
11527A0892R3599D2614j1023c01155A7099O4934R7377J7551m921d8133G9326J02055
11515A81381c18059B81424b3295q3270A63620d8110A13120l0216a55732E829J93495
11504A99324h2414I9051J0611J9195p705D3155J50154E720K37219b48927J07070
11493a41857B24211q3750O9985l4456G0923I768b30765A25224K06730F7285J27897
11482A95182H3285K6230m5439f6094C30461j20530a7156G8285a3002A7461O6015
11471H3476J58263C904K00245b73812B02341C1001L52312j6373C0006R5541E1983
$$ plain form
11550 88216 255535 -130142 199541 186207 71155 137669 -24418 248646 -24530 -86723 115007
11538 55070 -216998 187865 222157 -92079 -61603 204059 -204172 167348 134452 8712 10892
11527 10892 104491 42614 31591 -301155 17099 82033 179410 196961 192040 -48133 79326 181381
11515 181381 -318059 281424 -23295 -106565 163620 -48110 113120 82904 -155732 5829 199324
11504 199324 -82414 99051 109662 128857 121152 43155 193309 5720 242939 -248927 -141857
11493 -141857 224211 140461 210446 175990 70923 9768 -230765 125224 331954 67285 195182
11482 195182 83285 109515 64076 -66094 330461 209931 -17156 78285 -13002 17461 83476
11471 83476 241739 3904 204149 -273812 202341 31001 383313 366940 30006 125547 51983
11459C8235j3141K00491b0535A83498J38666n6639a07383o281k2614L0793A04252
11447a25090A95470b6230l20100a06668e1857A85960P3147A5066R4577J30679
11437B40322L3505a77853d5511j68277A8821K62732c12156I6501g4656B11610
11426A65615g8174A67086b03786B57996a52496j42602P1838A51888J70104F0881
11415b59152N8825g7157I6383J00911d5050j0135B63635c4356j63760A46045h5062
11403A53072C0816e0318F6621a3376j80667E648a34657H8851a40557B76154A28623
11391d9439F6762a86886C33076g5997a9637B3001O9460R2656p2045a45999C10948
11379a39843L8327d1008p0506A48939a29874C8227e8563o3665H6149b68034A32343
$$ plain form
11459 38235 25094 225585 -20535 183498 322164 265525 -107383 -113664 -136278 -105485 104252
11447 -125090 195470 -26230 -346330 -106668 -51857 185960 259107 15066 109643 240322
11437 240322 273827 -177853 -45511 -213788 18821 281553 -312156 96501 -74656 211610
11426 165615 -78174 167086 -203786 257996 -152496 -295098 -223260 151888 321992 60881
11415 -259152 -200327 -77157 96383 197294 -45050 -55185 263635 -34356 -198116 146045 -85062
11403 153072 30816 -50318 66621 -13376 -194043 5648 -134657 88851 -140557 276154 128623
11391 -49439 66762 -186886 333076 -75997 -19637 23001 92461 185117 113072 -145999 310948
11379 -139843 -101516 -41008 -111514 148939 -129874 38227 -58563 -122228 86149 -268034 132343
11367b6482B8949c147B22133J66161b62002A83924E4371i2173A30929c6603a502
11355g1531c269C07054a2694k240E4544Q6919K21169A30193o4853a93973N4112
11344a39861a7009j39578A85304f3863n5202K1988A51576i8816H1540f1012j57278
11333b18290N1072A0757b33767B83145f9730j34620R5901a9423m9746j67547D3959
11321A16881i8378A33235e574j18949j5834C05009q2413B9641C53a25588K804
11310a22784j50897K2641a08472A69657F8131h8093j17975A54073c61774a29157
11299f8076l16060A24960Q0692b60820D7108a27077G5252i2852j46311n0982n9645
11288c49790E1466a36571A2896J32902M9729e2228r6711M1070L7452I5844a29309
$$ plain form
11367 -26482 28949 -3147 222133 388294 -262002 183924 54371 -92173 130929 -36603 -1502
11355 -71531 -3269 307054 -12694 -14934 54544 141463 362632 130193 65340 -193973 -139861
11344 -139861 -17009 -156587 185304 -63863 -119065 -97077 151576 -98816 81540 -61012 -218290
11333 -218290 -167218 10757 -233767 283145 -69730 -204350 -108449 -19423 -69169 -236716 43959
11321 116881 -98378 133235 -5574 -124523 -140357 305009 222596 29641 353 -125588 -122784
11310 -122784 -273681 -251040 -108472 169657 68131 -88093 -206068 154073 -361774 -129157
11299 -68076 -384136 124960 205652 -260820 47108 -127077 75252 -92852 -239163 -290145 -349790
11288 -349790 51466 -136571 12896 145798 195527 -52228 -148939 -107869 -70417 95844 -129309
11276b07882g7856l88396a84920A21979J9859e3100B12063a557j02363R971n9274
11265a53223A70306E3961K50745j01043I2375f0616H1028A1323n54a86410B68882
11253a98875c8383l42990A50943e6904n6340j8553B49648a55483n5676F3488b53863
11241d4813B17178b9599l28312J78819e467B13035a19578A10767b6626B57854
11230g2920j62374R2185m1568C0958A1245a23215k06086I2160K35329A26059b8999
11218b29388O8633K9046k32662a23248F8011J30451a16150C4024K41917K5127
11208C01068B7916a86248P0551R540B09983a72974H5032b4591A04969J61014a8159
11196B35140F0888G743i7702A68857a33068o924D5410a16394j78965j47004J62754
$$ plain form
11276 -207882 -77856 -466252 -184920 121979 141838 -53100 212063 -1557 -103920 -93949 -153223
11265 -153223 170306 53961 304706 203663 92375 -60616 81028 11323 10769 -186410 268882
11253 -198875 -38383 -381373 150943 -56904 -113244 -131797 249648 -155483 -211159 63488 -253863
11241 -44813 217178 -29599 -357911 -179092 -5467 213035 -119578 110767 -26626 257854
11230 -72920 -235294 -143109 -184677 30958 11245 -123215 -329301 92160 327489 126059 -28999
11218 -229388 -160755 -131709 -364371 -123248 68011 198462 -116150 34024 275941 301068
11208 301068 27916 -186248 -115697 -106157 209983 -172974 85032 -24591 104969 265983 -18159
11196 235140 60888 7743 -97702 168857 -133068 -139992 45410 -116394 -295359 -442363 -279609
11185b79609A74786b84004i9886j01307b2433j02637M8534a835C06577b04943
11174B404P2873e879B3961c1579k53925A7437a95194M2374j08257g8583K3118
11163e5465n6246B1191a83355q8342a59j13721H1056P399b8734o9089c5471j87483
11151b22954B28607A10579A2681d8303B86388A43160i1865n3077m6281C00900
11140A99635a01461A16236a6790k51171A19919J08799a53062b02D2533c13291
11129C9936j327A071L30564A62963G1903C1418h5634C0290K22456H8896a22966
11117a70005A02677d7308o3538a5647j3530D8683J00824A4176J01733c37183A97223
11105g536D5837N18581g9433i288B72960i1001L2058A36692h470j02348F1584
$$ plain form
11185 -279609 174786 -284004 -99886 -201193 -22433 -125070 -76536 -1835 306577 -204943
11174 2404 75277 -5879 23961 -31579 -285504 17437 -195194 -152820 -261077 -78583 -55465
11163 -55465 -111711 21191 -183355 -271697 -159 -113880 81056 88455 -28734 -97823 -35471 -222954
11151 -222954 228607 110579 12681 -48303 286388 143160 -91865 -144942 -191223 300900
11140 199635 -101461 116236 -16790 -267961 119919 228718 -153062 -202 42533 -313291
11129 39936 38609 1071 331635 162963 71903 31418 -85634 30290 252746 88896 -122966
11117 -170005 102677 -47308 -110846 -15647 -29177 48683 149507 14176 115909 -337183 197223
11105 -7536 45837 564418 -79433 -9288 272960 -91001 -58943 136692 -8470 -110818 61584
11093D8990a9685A2820J18777K12564a63969H0501j8679b21190B0396K95868E3044
11081I2638J67740A05082c0552a2314j16561L5416B02836J32106C9258K0825J81962
11070B42045d9685m6795I9963C6520L6606J16801J58503j33593L15443b5067C35092
11058C74262G699R5357a3166D78699n9895q6224j52526m0101P4538L243a4080
11046B55747M9507q8394J96689H5371O295M24336j30673l0592M80570p4747k50426
11035E10134O3745k45531K45558k51485J53017j8443R0559K29357l01080J47042
11025F22873k14889N2897K15710j49636p5929K68380k47157N1020N1456j47472
11015D27253J31969R5502j43064J70037A61989L15843k38018M13099A91314q4211
$$ plain form
11093 48990 -19685 12820 131597 344161 -163969 80501 61822 -221190 20396 316264 53044
11081 92638 260378 105082 -30552 -12314 -128875 -93459 202836 334942 39258 60083 242045
11070 242045 -49685 -96480 99963 36520 73126 189927 348430 214837 530280 -25067 335092
11058 374262 7699 103056 -13166 478699 418804 332580 180054 139953 214491 217734 -14080
11046 255747 305254 216860 413549 85371 91666 516002 385329 354737 835307 760560 510134
11035 510134 573879 328348 573906 322421 475438 456995 547554 776911 475831 622873
11025 622873 407984 460881 676591 526955 451026 719406 472249 523269 574725 427253
11015 427253 559222 654724 511660 681697 161989 477832 239814 652913 191314 107103
11005A07103M60202J40703C46376o003K22115o0148R8197k22323j63328K92766
10995E07652L19901A65097K78637p5132n884K19652n8195J89450l13983J73866
10985E73508B59997L33652B54416J20709R7903J20878J66181C06451l855M30675
10975G33271q7185l7991L40074m53024O8246M23312k49438J64252n9724N00044
10965A341837Q0861k92753K75676j55833M34485P2943L58505J08196k19817J9490
10955B023590j55339m0769J13775m19101K43757m57172r4119j83290K90415k22048
10945A099699K1335j63280J03984M47020j60558k96345J35569l25242k0216P0527
10935I12493l15734k52269k971j20137L7133l5633J41199K5987A53561P9338b4346
$$ plain form
11005 107103 567305 708008 346376 340373 562488 502340 600537 378214 214886 507652
10995 507652 827553 165097 443734 368602 362718 582370 524175 713625 399642 573508
10985 573508 259997 593649 254416 375125 473028 593906 760087 306451 302596 733271
10975 733271 646086 608095 948169 495145 563391 986703 737265 901517 841793 1341837
10965 1341837 1422698 1129945 1405621 1249788 1684273 1757216 2115721 2223917 2004100 2023590
10955 2023590 1868251 1827482 1941257 1522156 1765913 1308741 1214622 1031332 1321747 1099699
10945 1099699 1121034 957754 1061738 1508758 1348200 1051855 1187424 862182 841966 912493
10935 912493 596759 344490 341519 221382 258515 222882 364081 390068 153561 232899 -24346
10923A53490e6649G4056k8573J34114b03905B22646B1458J16268c10062a09784
10912a56356B90014I0242a4691G3511a61946N397B4394J60433e3442C1881P5033
10901A06914B5119J3723g158E7462a15838k97979F2109a13066M2158j30236j9812
10890b20956I044a55192B20888a27075I9655a18071b2119A68967n9753Q4786c6083
10878a51162l468b8487A90050a34082q4750A08097c0453A74719d9809A99239I2636
10866c95025A73929b95890B83782b25039M9408r5949h2196A8564b95443B73882
10855c10837a04381k86544J33757a20221A46529a64625g6567B12321A03329i1519
10844A72684e9583o5691l6555J6417r9704F5624K49624a40957B97J27122m1511
$$ plain form
10923 153490 -56649 74056 45483 179597 -203905 222646 21458 137726 -310062 -109784
10912 -156356 290014 90242 -14691 73511 -161946 -156549 24394 184827 -53442 31881 106914
10901 106914 25119 38842 -7158 57462 -115838 -413817 62109 -113066 -70908 -201144 -220956
10890 -220956 9044 -155192 220888 -127075 99655 -118071 -22119 168967 109214 194000 -36083
10878 -151162 -154630 -28487 190050 -134082 -218832 108097 -30453 174719 -49809 199239 92636
10866 -395025 173929 -295890 283782 -225039 -175631 -271580 -82196 18564 -295443 273882
10855 -310837 -104381 -390925 -257168 -120221 146529 -164625 -76567 212321 103329 -91519
10844 172684 -59583 -125274 -161829 -145412 -245116 65624 315248 -140957 297 127419 85908
10833H5908j5293a85165a3819j30545O2308E3470a86155j6841f0697B62183B952
10821A06606C5205a61354C53105a48958J1726A93768C472a55941l7751j72051
10811c65743A80706d1772k1876B9734b08468I4830D5955b11205B89942b34119
10800A65048A3464K26699A12848b14804a1647G4118b43263a9044L230m2251l77999
10789d36064G6819a30359j97936a52148J4617C2523d03299f3386l1845l2785B07832
10777A06420c63956C30518B413b01479g7841A59723B2792a43700k19788J51262
10767b12226p1426A45961B5612b36577K5567m7056B60185b69849A13930a59128
10756B08283b49381h8285F6194c57272a08360c2628j56430e4849B899K8243K49945
$$ plain form
10833 85908 70615 -185165 -13819 -144364 -82056 53470 -186155 -202996 -60697 262183 2952
10821 106606 35205 -161354 353105 -148958 -137232 193768 3472 -155941 -193692 -365743
10811 -365743 180706 -41772 -63648 29734 -208468 94830 45955 -211205 289942 -234119
10800 165048 13464 240163 112848 -214804 -11647 74118 -243263 -19044 -15814 -58065 -436064
10789 -436064 76819 -130359 -328295 -152148 -137531 32523 -403299 -63386 -95231 -128016 207832
10777 106420 -363956 330518 2413 -201479 -77841 159723 22792 -143700 -363488 -212226
10767 -212226 -283652 145961 25612 -236577 -211010 -258066 260185 -269849 113930 -159128
10756 208283 -249381 -88285 66194 -357272 -108360 -32628 -189058 -54849 2899 31142 281087
10745B81087m7588j05640M4228c07897a19531C3457A0218J55784N7413I9007b16343
10733a56180B69375B8402a57447c3609k31842E3039h1327c742k97596d3758A42262
10721h5393I7044l7305J5808b97728B4532a353j09474K8597A81322r737b27238
10709A75349h5486q005A0074h4832C0707c18410R1902e7958k47460d520M19j76048
10697a80149K8222I0167m3744b77535A83318p1609a22992D715M5883h5719A36839
10685A32453h0237K8857j01435j40100A15030g7979G1842a54314B44937b04342
10674b56380A10397e72936a78304d6368j17069h0069j18933j03711A22600a40818
10663a66303D1346J09823a65903A27100b4670A59736o4515K245J28321a33398
$$ plain form
10745 281087 233499 127859 172087 -307897 -119531 33457 10218 166002 223415 99007 -216343
10733 -156180 269375 28402 -157447 -33609 -265451 53039 -81327 -3742 -301338 -43758 142262
10721 -85393 97044 59739 75547 -297728 24532 -1353 -110827 -82230 181322 171585 -227238
10709 175349 -85486 -93491 10074 -84832 30707 -318410 -226508 -57958 -305418 -4520 -4101 -180149
10697 -180149 -151927 90167 46423 -277535 183318 111709 -122992 4715 50598 -85719 136839
10685 132453 -80237 -51380 -152815 -292915 115030 -77979 71842 -154314 244937 -204342
10674 -256380 110397 -572936 -178304 -46368 -163437 -80069 -199002 -302713 122600 -140818
10663 -166303 41346 151169 -165903 127100 -24670 159736 95221 97466 225787 -133398
10652g7039j34736A3435J2319K32620c3999A44797g4075G6517M5951i5131F1625
10640a44476A07381A4089c99165B3195b70949i4890A3249R4306C3410i2834K9430
10629f3404p7186d2032R643A30415l9964a54703K1895e358j37405k7799M1040
10618a29522c5894j0280r9635B8766a71496N4251B74375g3187j65731K1305B84954
10606E2275j2000o717d1089k68170g8718o9885J472b3484Q383C09989j03543d4139
10593b86288E342R7300e6219o9558B1409J8621L50240i458n0984j64995D0925
10581A28008b39124N5094F0586a19426N3380J7285a5743j296j20069r8319B4089
10569D2534b48607e1042j3469k77635a16310B04070k7251a42541A417b50917k8594
$$ plain form
10652 -77039 -211775 13435 25754 258374 -33999 144797 -74075 76517 122468 -95131 61625
10640 -144476 107381 14089 -399165 23195 -270949 -94890 13249 107555 33410 -92834 -63404
10629 -63404 -140590 -42032 -32389 130415 90451 -154703 -132808 -5358 -142763 -170562 -129522
10618 -129522 -35894 -46174 -145809 28766 -171496 -117245 274375 -73187 -238918 -217613 284954
10606 52275 40275 33558 -41089 -309259 -78718 -148603 -147131 -23484 -15101 309989 206446 -44139
10593 -286288 5342 102642 -56219 -125777 21409 40030 390270 -9458 -60442 -225437 40925
10581 128008 -239124 -184030 60586 -119426 -66046 -48761 -15743 -17039 -137108 -235427 24089
10569 42534 -248607 -51042 -64511 -342146 -116310 204070 176819 -142541 1417 -250917 -279511
10558b79511e6994q1662k16870M6217F2829a79581F8388c2979k88967A34195a90197
10546b12592D6936a57350F0537a71755M0882f2836J5704l26317a2528B7818N7187
10535H5005R9874a57239E5136K08151j12318a11904D9627a66039j25363H3287
10524a2330F4523b6840D8785a40740B4660a16589A74933b10795D00844e58048
10513e3973l9597H6324f6860m9583L5243A79467D7488g8153C3247b68991A86310
10501E2912a38129p9527a6798j20087E7780N4167a06860l40939a83420B99079
10490a79568A27898a23289A42334P8566q7125a80225g4270F7271a37337I7468
10479a75284F0301e8302j24426B0544a52399A7090K46469J4585L5146e8400A84430
$$ plain form
10558 -279511 -56994 -138656 -355526 -309309 62829 -179581 68388 -32979 -321946 134195 -190197
10546 -212592 46936 -157350 60537 -171755 -130873 -62836 -47132 -373449 -12528 27818 85005
10535 85005 184879 -157239 55136 263287 150969 -111904 49627 -166039 -291402 83287
10524 -12330 64523 -26840 48785 -140740 24660 -116589 174933 -210795 400844 -558048
10513 -53973 -93570 86324 -66860 -116443 -81200 179467 47488 -78153 33247 -268991 186310
10501 52912 -138129 -217656 -16798 -136885 57780 111947 -106860 -447799 -183420 299079
10490 -179568 127898 -123289 142334 220900 133775 -180225 -74270 67271 -137337 97468
10479 -175284 60301 -58302 -182728 20544 -152399 17090 263559 278144 313290 -58400 184430
10467C76501J98309B60055j01861C0720Q3782G96a85580F1142b81257a28884l64302
10456d93186i3595A63036A7596a43991i267B88694c39353J43217M2862j22791
10446b76065a23219q4351f8264b1704F0991h6252B60584H1044C1671b64540e7026
10434H3406b07956B25147i7038E2282j6120J731J94361O1696H794c7326l00874
10423c38200a04830L6215k17A01294B8155b16184E3024J45899d3358B5070b81535
10411I1133b28047J07177E7415M5609f248A63578G5822J32642r112B9296a0641
10399g9656D1167K51557a54212L5151B870a39611j63595P5101e2267b5917o9829
10388i5746q5087B4614a71907p1960K3260a9254n3897n8477B9646R7232b18121
$$ plain form
10467 376501 574810 260055 158194 30720 114502 796 -185580 61142 -281257 -128884 -493186
10456 -493186 -93595 163036 17596 -143991 -9267 288694 -339353 -196136 -153274 -276065
10446 -276065 -123219 -207570 -68264 -21704 60991 -86252 260584 81044 31671 -264540 -57026
10434 83406 -207956 225147 -97038 52282 36162 37893 232254 293950 8794 -37326 -338200
10423 -338200 -104830 -68615 -68832 101294 28155 -216184 53024 198923 -43358 25070 -281535
10411 91133 -228047 -120870 57415 103024 -6248 163578 75822 208464 199352 29296 -10641
10399 -79656 41167 292724 -154212 -119061 2870 -139611 -303206 -228105 -52267 -25917 -95746
10388 -95746 -180833 24614 -171907 -243867 -220607 -19254 -73151 -131628 29646 126878 -218121
10376C4195M01670E5156C590b52655B40220l3793A02039j0894a83663m4972I4355
10364c8371A16528n7111K57255k3246l4323E9838J54939G4966O82810B79988J2008
10353B91996o9324N15322m5934B25447P2513o3972a38017f0323C22538f3681B92068
10341A57144f5004C40419b40488B61131I8501O8134N6412j7297Q930K64100q2636
10330C96144I6699f0595B22519N3570n0166l8175a40660B46102J73076l1102A5240
10318b02234d1096J561d478A71829K72077i1352B24176J32611A23896J31222d4788
10306C33820j01609a40805f187A9934d06861D31120C3355J18412F2122d9819G695
10294a15310B1595g7274k14569A79519a62267k0704C43920d7809j74425A673b53061
$$ plain form
10376 34195 435865 55156 3590 -252655 240220 206427 102039 91145 -183663 -228635 94355
10364 -38371 116528 59417 316672 293426 259103 59838 214777 74966 757776 279988 291996
10353 291996 222672 737994 692060 225447 297960 233988 -138017 -60323 322538 -63681 292068
10341 157144 -65004 340419 -240488 261131 98501 166635 223047 205750 214680 478780 396144
10330 396144 96699 -60595 222519 276089 225923 187748 -140660 246102 419178 388076 15240
10318 -202234 -41096 -39535 -4478 171829 443906 -91352 224176 356787 123896 255118 -44788
10306 333820 232211 -140805 -6187 19934 -406861 431120 33355 151767 62122 -49819 7695
10294 -115310 21595 -77274 -291843 179519 -162267 -182971 343920 -47809 -222234 1673 -253061
10282a59558B4389O1023a46900C0774b5096j2428p1182I4244b43136i1756A70628
10270a97364M0752a5601j78986F7373a2962A60346a24878A18089J00097e5599
10259A88649K43241F9385i325k3752D00133r6231P3954A01186d7845j10384A25494
10247b28801B2924J71766b13723B2864K42364H8818h1150E10446a12463j4109
10237a26572m7122l006A00728K04902a32989c412C62205E3331B1706J18096a89665
10225c15262J06995A56710J4547K3761L034i4167B32533J0773a12008q7734r4029
10214b93771q2500i7601q2431o1146A26977d3358j12397A05245a89862c7170A4686
10202a49014n00739C9407J51695I1671B8572d8504l62120C96136f3729B33851
$$ plain form
10282 -159558 24389 85412 -146900 30774 -25096 -37524 -108706 94244 -243136 -91756 170628
10270 -197364 -156612 -15601 -194587 67373 -12962 160346 -124878 118089 218186 -55599
10259 188649 431890 69385 -9325 -33077 400133 303902 377856 101186 -47845 -158229 125494
10247 -228801 22924 194690 -213723 22864 265228 88818 -81150 510446 -112463 -126572
10237 -126572 -173694 -176700 100728 305630 -132989 -3412 362205 53331 21706 139802 -189665
10225 -315262 -208267 156710 171257 195018 198052 -94167 232533 243306 -112008 -199742 -293771
10214 -293771 -376271 -97601 -180032 -241178 126977 -43358 -155755 105245 -189862 -37170 14686
10202 -149014 -649753 39407 191102 91671 28572 -48504 -410624 396136 -63729 233851
10191b32197J0628O1827B03733f6919k25041L6436j40854A07384a87868N9457
10181a28411l82795J58001J71371p3086b0820n6312l71689i1368A54479b343B12515
10169g703j37448j43546b7776m5445I2023i3826L6395D9109i7568o987j48109
10158b52664A729b85692C14818a27582A26337k9499i3066A32182a09947B15618
10147a33440N1590j90785Q5636E8706a73018C06551j24455a59690G6020b4131
10136a03939J1145o4454c6740C13662a01726A35030M4014b80671a38616n4939
10126a93555G0126e7017j0646j34838L3621E0681g7865K5298A85262J44571A6347
10114F0650a65435l5893D6240b44872j72749A22868B1926b54278l0954a01527
$$ plain form
10191 -232197 -221569 -159742 203733 -66919 -291960 -255524 -396378 107384 -187868 -128411
10181 -128411 -511206 -353205 -181834 -254920 -20820 -77132 -448821 -91368 154479 -2343 212515
10169 -7703 -145151 -288697 -27776 -73221 92023 -93826 -57431 49109 -97568 -104555 -252664
10158 -252664 1729 -285692 314818 -127582 126337 96838 -93066 132182 -109947 215618
10147 -133440 -81850 -272635 -186999 58706 -173018 306551 182096 -159690 76020 -24131
10136 -103939 -92794 -157248 -36740 313662 -101726 135030 179044 -280671 -138616 -193555
10126 -193555 70126 -57017 -67663 -202501 -168880 50681 -77865 -52567 185262 329833 16347
10114 60650 -165435 -201328 46240 -244872 -417621 122868 21926 -254278 -285232 -101527
10103c52739J71096c5371n5210o0401l7730b0138j8908j50337k3766K9340j3181
10092a96990N2595c5698B65003b11601h7108o3832B5769i221o3082j93871h6761
10080G5784C0293b28242F0369M0665K2332a96414H5552e9739p4381b9739D1536
10068b57103M3764b5958l1039G6395J24344K41258f3361B76091c89045g8220B14399
10056C11257A03159a63802B1077c01595J14575B40243a73335j23800d845F2667
10045G9316a46988j20162B19901a19755j20991i0345j38466a6067F3035c452F0809
10033d3341J8508C1962h5428B3411b49688a05046b9643n4831a7098m3764A83874
10021A49127A882J25106N4645b14648i363C9610j5378b21543A88789a77540D5023
$$ plain form
10103 -352739 -181643 -35371 -90581 -150982 -188712 -20138 -39046 -189383 -213149 -183809 -196990
10092 -196990 -144395 -35698 265003 -211601 -87108 -150940 25769 -9221 -72303 -266174 -86761
10080 75784 30293 -228242 60369 101034 123366 -196414 85552 -59739 -134120 -29739 41536
10068 -257103 -213339 -25958 -56997 76395 200739 441997 -63361 276091 -389045 -78220 214399
10056 311257 103159 -163802 21077 -301595 -187020 240243 -173335 -297135 -4845 62667
10045 79316 -146988 -267150 219901 -119755 -240746 -90345 -228811 -16067 63035 -3452 60809
10033 -43341 -24833 31962 -85428 23411 -249688 -105046 -29643 -84474 -17098 -60862 183874
10021 149127 1882 126988 181633 -214648 -9363 39610 24232 -221543 188789 -177540 45023
10009F6757a76641p2598B98851a51714r7801d3959B06714c07797A33269E4687
9998b03361c4767k68995g9508k88279J21029P6712M4903C8177c9078q6269K8328
9987i7019n8832g5479B48138a32557N8198m7270k23805b7503A80016a63909k7493
9976a91402R2499K3760k2870G3303h0660j80709N5827A23447a27102n4353M5288
9965a36167j15632i454k3180A76518F7375c23193A20081b24479C9572b08768B46925
9953C1535b07564I8658b17460B51239q7103C1686K65978c30368a61213o2806A42473
9941B32674b12033A57799J3595d36043K03429l45558b0629j93772h6202k3711
9931a09913K4959B763a02254I5641a07128l538n4824F9761B8555a59606G3303
$$ plain form
10009 66757 -176641 -249239 298851 -151714 -249515 -43959 206714 -307797 133269 54687
9998 -203361 -34767 -303762 -79508 -367787 -246758 -170046 -125143 38177 -39078 -125347 -97019
9987 -97019 -155851 -75479 248138 -132557 -74359 -121629 -345434 -27503 180016 -163909 -191402
9976 -191402 -98903 -75143 -98013 73303 -80660 -261369 -205542 123447 -127102 -181455 -136167
9965 -136167 -251799 -9454 -32634 176518 67375 -323193 120081 -224479 39572 -208768 246925
9953 31535 -207564 98658 -217460 251239 164136 31686 297664 -330368 -161213 -224019 142473
9941 232674 -212033 157799 171394 -436043 -232614 -578172 -20629 -214401 -86202 -109913
9931 -109913 -84954 2763 -102254 95641 -107128 -110666 -165490 69761 28555 -159606 73303
9919a31538e8622k58598c7433A28042J700c8711p5788j25171D3658f5959A3763
9907D3617K36337A16997E1905P6655b36365i9966D4140b35892m3419A67225C2905
9895f3819b3676E5423l94a5870j31391j82937A0796c9145O483A81310i9205A81048
9882b21271N6130P9374l1165H3216b62956a29015b8046A99331b5311j9021j15956
9871a60288n3657A0024d72887B13345i0140k35155B04645G1906c10544C08854
9860a49616F0910R8588p5042P0635a81156Q2241C9496f6969L3272j3108q0134
9849a26939j04257e5608k8950j2137c1091C8987c5569G6824e0525A26662J4903
9838A41565h8460o4623m3575j09357a4072j04817e636C86791i447q0984D4867
$$ plain form
9919 -131538 -58622 -317220 -37433 128042 129742 -38711 -114499 -239670 43658 -65959 13763
9907 43617 279954 116997 51905 128560 -236365 -99966 44140 -235892 -279311 167225 32905
9895 -63819 -23676 55423 55029 -15870 -147261 -330198 10796 -39145 -32662 181310 -99205 181048
9882 -221271 -165141 -85767 -116932 83216 -262956 -129015 -28046 199331 -25311 -44332 -160288
9871 -160288 -213945 10024 -472887 213345 -90140 -325295 204645 71906 -310544 308854
9860 -149616 60910 159498 84456 155091 -181156 -98915 39496 -66969 -33697 -46805 -126939
9849 -126939 -231196 -55608 -84558 -96695 -31091 38987 -35569 76824 -50525 126662 141565
9838 141565 -88460 -153083 -196658 -306015 -14072 -118889 -5636 386791 -9447 -90431 44867
9826c53420c9667m71629P6397J43348L3834Q481R9663j16809J20081A81034g9542
9814A11879m2214d6195q8991E2096K1793c18411a20991j0543A62480F5559N0072
9803A15631D9627J7367b35116a15829j07666B0958e56733A61218b09892i4871
9792a44193a7042p5537m00398a1891n4660A98825q6589a8755G4188h6394C07671
9780b57948B47229b99646A48171f0767E4154N4588q937b32723B24435h311D2862
9768F1793d80280a29963d5337j48668b2933C2765b64667B1490a81393a2411A59095
9756a94602N1829j3407R342A56778a04127j81258m0323A22303f9020c0924C073
9744H9740a21484C16508g5869p6322n6721A1243a48042j1119I3064e6374A489
$$ plain form
9826 -353420 -39667 -511296 -434899 -291551 -257717 -249236 -149573 -266382 -146301 181034 -79542
9814 111879 69665 -46195 -135186 52096 73889 -318411 -120991 -131534 162480 65559 115631
9803 115631 49627 66994 -235116 -115829 -223495 20958 -556733 161218 -209892 -94871
9792 -144193 -17042 -92579 -492977 -11891 -66551 198825 112236 -18755 74188 -86394 307671
9780 -257948 247229 -299646 148171 -60767 54154 108742 99805 -232723 224435 -8311 42862
9768 61793 -480280 -129963 -45337 -194005 -22933 32765 -264667 21490 -181393 -12411 159095
9756 -194602 -142773 -156180 -146838 156778 -104127 -285385 -325708 122303 -69020 -30924 3073
9744 89740 -121484 316508 -75869 -152191 -208912 11243 -148042 -159161 93064 -56374 1489
9732a08544k31191H8895g989F2167q428b31775j06860g4735B52333I3868P4327
9721A68195a9923n7358D145J52146L6596D0024b11950A18609a4191j67840L8246
9710a43785j67247A72692j048o8138b65251R9492n5603e7449l50916a30286k2695
9699a52981F5245J16669A2546a47984j0258j33253P6708j88779a50238j54911
9689c05149a2683j6913I9340c010n1062l9082k65613Q2188a20895p3451C9451
9677b26305j92232a80354b6406B92344b03417k5002C3824d00156c6826H727R0964
9666I9691d5984A30824a49845N3577r5548O1811n2570A79181d6850k03871A68258
9654I5062B7519d42637f2343B1857g1348a5877j66761a7506B36231a30096h37
$$ plain form
9732 -108544 -339735 88895 -7989 62167 53739 -231775 -338635 -74735 252333 93868 168195
9721 168195 -19923 -77281 4145 156291 192887 40024 -211950 118609 -14191 -182031 -143785
9710 -143785 -311032 172692 171644 103506 -265251 -165759 -221362 -57449 -408365 -130286 -152981
9699 -152981 65245 181914 12546 -147984 -158242 -291495 -214787 -403566 -150238 -305149
9689 -305149 -12683 -29596 99340 -3010 -54072 -93154 -358767 -276579 -120895 -194346 39451
9677 -226305 -418537 -180354 -26406 292344 -203417 -228419 33824 -400156 -36826 8727 99691
9666 99691 -45984 130824 -149845 -96268 -191816 -130005 -182575 179181 -46850 -250721 168258
9654 95062 27519 -442637 -62343 21857 -71348 -15877 -182638 -17506 236231 -130096 -837
9642D6234a37748R328n6430a9427j0001r6537G7507j9575e5857j00983r7503l4358
9630b88701A22289d08105g4196F7336A0626c07669f520r2864c5544j92791B3315
9618i534j52262A64449l9048c39384A02438J48649B6903b01176K1389A17505c70945
9606b02280q7195J06336A28851d15730d7014B1969b83113D40025A46923a05075
9595A20733B0813a48684D608c78131f5876j07943P9284r9294A02365b2791A16566
9583D2259J02456f8666H2111i3358j22101A02629f3449p938Q785D5161a39674
9571E0952j4575e9317j15090e9797b1896r7060N8169A06380l7443F247f4573E1903
9558c07360J52737l8745A03678K4685J03457P2290g2433C1269b81196a22545b6643
$$ plain form
9642 46234 -137748 -128420 -184850 -19427 -29428 -125965 77507 57932 -55857 -156840 -254343 -288701
9630 -288701 122289 -408105 -74196 67336 10626 -307669 -6520 -99384 -35544 -228335 23315
9618 -9534 -161796 164449 125401 -339384 102438 251087 26903 -201176 -179787 117505 -370945
9606 -202280 -289475 -183139 128851 -415730 -47014 21969 -283113 440025 146923 -105075
9595 120733 20813 -148684 4608 -378131 -65876 -173819 -94535 -193829 102365 -22791 116566
9583 42259 144715 -68666 82111 -93358 -215459 102629 -63449 -71387 -62602 45161 -139674
9571 50952 36377 -59317 -174407 -59797 -21896 -118956 -60787 106380 68937 6247 -64573 51903
9558 -307360 -154623 -193368 103678 128363 231820 304110 -72433 31269 -281196 -122545 -26643
9546c30925a09800f888l3483k6340m395A18531h4365D5616N4213k2835d3910A46872
9533g5448j9664j44714F2526a91607c8022A63489c2877A8613K19438a55680m1100
9522a96780g1199l55767D2533a05184l487l2120M0263H5098l6281h0706b1156
9510A82942H58O3632a29809l7727P8277C5147J72531G1612f3738o159l590k67562
9498c41049e0162j07424f2213k3291n6579J9446j3627A90983q7937h9306k37607
9487c26913e5353m2719a9491j10230M5825B1791K39833a46515B97585E7104i6336
9475F3783b52363J24850e3175A42574a59662C62261b57394k35998B96757r4129
9465B02628b98729K0843i8683d4252m3652M67A0723a07686l45211d4396j44381
$$ plain form
9546 -330925 -109800 -6888 -40371 -66711 -71106 118531 -84365 45616 99829 76994 -43910 146872
9533 -75448 -95112 -239826 62526 -191607 -38022 163489 -32877 18613 238051 -155680 -196780
9522 -196780 -71199 -426966 42533 -105184 -108671 -140791 -100528 85098 48817 -80706 -21156
9510 182942 858 64490 -129809 -167536 -89259 35147 207678 71612 -63738 -69897 -73487 -341049
9498 -341049 -50162 -157586 -62213 -85504 -142083 -122637 -136264 190983 103046 -89306 -326913
9487 -326913 -55353 -98072 -19491 -129721 -83896 21791 261624 -146515 297585 57104 -96336
9475 63783 -252363 -127513 -53175 142574 -159662 362261 -257394 -493392 296757 202628
9465 202628 -298729 -277886 -98683 -44252 -87904 -87437 10723 -107686 -452897 -44396 -188777
9454a88777b8817j12191k3687k37406A74405d0470k05700N7172J7871A05598L18456
9443D24054B03065e560G1237a70404B00736b86430i7596q5683D1399a79164G2607
9431C7497r192a97104F8686K45595h5711B32360A07858c0271A26016c64219A46490
9419A02709b37104c229l15635A74788a82381j40246a28679B49673A02613c06391
9408B85859A3206K65919a03425d9138b0731B3316c25294B9052c32497N4534A31488
9396a68784k58157a24374L9984k46694C39099A0285a20214I5018K1558b49260
9385b64117k5649B21333k7724C4338a08496k18401h0238D3550b20453R329B93850
9373A26404a95441b6904A00832a04375j2336D1700d11976a07074A25565D2456
$$ plain form
9454 -188777 -28817 -141008 -164695 -402101 174405 -40470 -246170 -188998 -171127 105598 424054
9443 424054 203065 -5560 71237 -170404 200736 -286430 -97596 -183279 41399 -179164 72607
9431 37497 28305 -197104 68686 314281 -85711 232360 107858 -30271 126016 -364219 146490
9419 102709 -237104 -3229 -318864 174788 -182381 -322627 -128679 249673 102613 -306391
9408 285859 13206 279125 -103425 -49138 -20731 23316 -325294 29052 -332497 -277963 131488
9396 -168784 -426941 -124374 -84390 -331084 339099 10285 -120214 95018 116576 -249260
9385 -264117 -289766 221333 193609 34338 -108496 -326897 -80238 43550 -220453 -211124 293850
9373 126404 -195441 -26904 100832 -104375 -116711 41700 -411976 -107074 125565 42456
9362a14189L95m8696P2046q0984M0018B1702a12585G7058b24191d9863j68728
9351b18591E1667i9932L9581E9984b52655A81442E2077e8967J5721j04282O9070
9340g8458j84316k1737G9305c5130J3976k50040b3299k87820N1021a29613m7665
9329a77278B1238c27255B23674j765K7035J3032o615b3464g894A89840b3150k95955
9317c19105B52505F9867L01608j35635h313E8873i8975j50219a3753j57563e7499
9305g895l37505f4611m9342A51083b33269J16623A8409b29360R5539B45237c8111
9293A38073D0634d89568a78413B8506q592J83997c4857k38474a13781C9510c67885
9281a79362N9678A65878a50689B75b61283a3246q8400l60231J4905A33168f5928
$$ plain form
9362 -114189 -113794 -162490 -90444 -171428 -131410 21702 -112585 77058 -224191 -49863 -218591
9351 -218591 51667 -99932 -60351 59984 -252655 181442 52077 -58967 -43246 -147528 -78458
9340 -78458 -262774 -284511 79305 -35130 -21154 -271194 -23299 -311119 -260098 -129613 -177278
9329 -177278 21238 -327255 223674 221909 248944 261976 255361 -23464 -7894 189840 -23150 -319105
9317 -319105 252505 69867 371475 235840 -8313 58873 -98975 -249194 -13753 -171316 -57499
9305 -7895 -345400 -64611 -113953 151083 -233269 -116646 18409 -229360 -133821 245237 -38111
9293 138073 40634 -489568 -178413 28506 19914 203911 -34857 -273331 -113781 39510 -367885
9281 -179362 -119684 165878 -150689 275 -261283 -13246 -101646 -461877 -446972 133168 -65928
9269C5508K0503P8179d01636A04973i8198G7095j1803d67371J73513A5390g1417
9257a25721J6573p1987j77701A8790K18363b56695C34247G0165N706J83939b65610
9245A92690b64435Q6718Q5800C48500d6214B8226g4682A29136N616a46595B77689
9233b69747d0295j38270r946a2870B34650B0290a60011a4702k1504j10855F7211
9221f8883A37597E2882a88321J327h9533a44l38504A10457b79802a19642A33834
9209A28419b53658A29395b67889a9512k84760Q0075i6953J1834A46490a17710
9198B03238J67137a90288B22828h7372m3287e6662k4864B57856c94610A00789
9187g4788D1864c06554l2645g5039B68568b6834n2550m4179j23814E3393a88182
$$ plain form
9269 35508 56011 134190 -401636 104973 -98198 77095 65292 -467371 -293858 15390 -71417
9257 -125721 -109148 -181135 -358836 18790 237153 -256695 334247 70165 75871 259810 -265610
9245 192690 -264435 -177717 -91917 348500 -46214 28226 -74682 129136 134752 -146595 277689
9233 -269747 -40295 -178565 -188511 -12870 234650 20290 -160011 -14702 -36206 -147061 67211
9221 -68883 137597 52882 -188321 -186994 -89533 -144 -338648 110457 -279802 -119642 133834
9209 128419 -253658 129395 -267889 -19512 -304272 -224197 -96953 -85119 146490 -117710
9198 203238 370375 -190288 222828 -87372 -130659 -56662 -81526 257856 -394610 100789
9187 -74788 41864 -306554 -339199 -75039 268568 -26834 -79384 -123563 -247377 53393 -188182
9175B50463a36355j22558A20691a420m5820k28708N4295f3746l5295k05372g3298
9163D8665a86358N2907E122c25854H5203k5520R7516P9499a04635c642B1356a68389
9150a69105A88062a51528J904k42588B43910A11021C1400c13629F9341J28751
9140A98092G8721h1855l4222I4942d60184k7596i050p9257J398r1510A59241b8943
9127B20137c63182a25312j044j45075d8822l13M152A08842a53553A34006b29631
9115b6337k09086A28827e3405j78487q8814A81118a53384F067K7419b00396B58953
9103a59927k15880C5958c5628l8725g631q6065j17397m6324F7266d85736C27548
9091A8646O6692b3988k5894j4735j56459j71568a26791O648G7799a81838P0559
$$ plain form
9175 250463 -136355 -258913 120691 -1420 -47240 -275948 -221653 -63746 -99041 -304413 -73298
9163 48665 -186358 -133451 5122 -325854 85203 59683 157199 236698 -104635 -3642 21356 -168389
9150 -169105 188062 -151528 -149624 -392212 243910 111021 31400 -313629 69341 198092
9140 198092 78721 -81855 -116077 94942 -460184 -487780 -9050 -88307 -86909 -178419 159241 -28943
9127 220137 -363182 -125312 -126356 -271431 -48822 -49135 -44983 108842 -153553 134006 -229631
9115 -26337 -235423 128827 -53405 -231892 -320706 181118 -153384 6067 33486 -200396 258953
9103 -159927 -375807 35958 -35628 -74353 -7631 -93696 -211093 -257417 67266 -485736 327548
9091 18646 85338 -23988 -49882 -64617 -221076 -392644 -126791 -120143 77799 -181838 -111279
9080a11279o152G648b90352B54416F2118a23177O677B37750i7110p0479A37158
9068b32511A4737h380K879j89515g4470p9229A30125d1599n9244m6572d8400j98081
9056b46481r5319J38970K9494e0500I4565b71098f0939A62760a24062n2639a7935
9044f6043B3234b47154j01732I1775Q6019a76726A25146B6138d8589o8203H8400
9032f6942A9497m337a03406k1530a1920D3141d48259J72062E9896b09724F5893
9020d7994G0566P3991l0041a32310A30230A7873e9187l4580K6812C4162C078i741
9007H7124g2084m6603A56110L4937C3810J64695A8785J22621R9554f4938A53639
8995b26074E69256c33055J49573C4853b49419g7422j21296j03842c5538A49968
$$ plain form
9080 -111279 -117431 7648 -290352 254416 62118 -123177 -116500 237750 -97110 -167589 137158
9068 -232511 14737 -8380 -5501 -195016 -74470 -153699 130125 -41599 -100843 -147415 -48400 -246481
9056 -246481 -341800 -202830 -173336 -50500 94565 -271098 -60939 162760 -124062 -176701 -17935
9044 -66043 23234 -247154 -348886 91775 177794 -176726 125146 26138 -48589 -116792 88400
9032 -66942 19497 15160 -103406 -124936 -11920 43141 -448259 -276197 59896 -209724 65893
9020 -47994 70566 144557 114516 -132310 130230 17873 -59187 -93767 -66955 34162 3078 -9741
9007 87124 -72084 -118687 156110 191047 33810 198505 18785 141406 240960 -64938 153639
8995 -226074 569256 -333055 -183482 34853 -249419 -77422 -198718 -302560 -35538 149968
8984a40906c6430C45826b1186C1855K60352r2786E7884a29772a5861E885g4438
8972d4043A05648a00560B152K68682a50061J7486a8435B57028b34338g1050L1900
8961c9150M017j26553A51484c35422E4385b20009a06348E9694d7222k16201e6633
8949i0482n595k21161a08220j96560A64476a28547A18550a33760K7284I6502L8575
8938A35077e521l26387B69399a26523A7680L7689b93382A46146q132f343l5721
8927d2064R577j15941j16232f9273j02077B05597E1181H846K67183o0858D9057
8915E4335J59294M0492j13943K55967j15373N01463J070573Q41556J982041N419789
8905A0096194m301777k576772A562984l30546m31347k72628A4635b6982A18818
$$ plain form
8984 -140906 -36430 345826 -21186 31855 292207 199421 57884 -129772 -15861 5885 -74438
8972 -44043 105648 -100560 2152 270834 -150061 -132575 -18435 257028 -234338 -71050 -39150
8961 -39150 -35133 -161686 151484 -335422 54385 -220009 -106348 59694 -47222 -263423 -56633
8949 -90482 -96077 -317238 -108220 -304780 164476 -128547 118550 -133760 -106476 96502 135077
8938 135077 -5521 -331908 269399 -126523 17680 55369 -293382 146146 138014 -6343 -42064
8927 -42064 -32487 -148428 -264660 -69273 -171350 205597 51181 8846 276029 215171 49057
8915 54335 213629 254121 140178 396145 280772 782235 1852808 2694364 4676405 10096194
8905 10096194 5794417 3217645 1562984 1232438 801091 528463 14635 -26982 118818
8895D44197j50842o1596G6616J8722J00511N3627g4308b0913j53367G4218j3975
8884F0243J9491b00099Q4043B55010a68879j47967F2837P780d13794A73005b9978
8872a82221c8419j06931A44272p424a62429A09282a60661d963A21814e05568B6694
8860B77685a47223E3024a85387E3934e9323A44994e8636B71219a45907A8715a94952
8848F4587a04623j99138N9826e3833o9109F5317b83233A11013k3095F638c4887
8836c06294a24084j78214g7237J3992A56236d40135B40561a98286C92683j45639
$$ plain form
8895 444197 293355 231759 76616 95338 195849 249476 -74308 -20913 -174280 74218 60243
8884 60243 79734 -200099 -116056 255010 -168879 -316846 62837 70617 -413794 173005 -29978
8872 -182221 -38419 -145350 144272 136848 -162429 109282 -160661 -4963 121814 -505568 26694
8860 277685 -147223 53024 -185387 53934 -59323 144994 -58636 271219 -145907 18715 -194952
8848 64587 -104623 -303761 -243935 -53833 -122942 65317 -283233 111013 87918 6638 -34887
8836 -306294 -124084 -302298 -77237 -63245 156236 -440135 240561 -198286 392683 247044
$$ [...]
##END NTUPLES=NMR SPECTRUM
##END=
