
##TITLE=AC1043_TOIB01_5858525_2lf3t6XJn0
##JCAMPDX= 6.0         $$ Bruker NMR JCAMP-DX V2.0
##DATA TYPE= NMR SPECTRUM
##DATA CLASS= NTUPLES
##ORIGIN= BRUKER
##OWNER= Administrator
$$ 1.72 TOPSPIN		Version 2.1
$$ 2012-03-29 19:14:21.484 -0500  Administrator@TOPSPIN
$$ Compression mode = diff/dup
##.OBSERVE FREQUENCY= 400.13188235
##.OBSERVE NUCLEUS= ^1H
##.ACQUISITION MODE= SIMULTANEOUS (DQD)
##.ACQUISITION SCHEME= undefined
##.AVERAGES= 64
##.DIGITISER RES= 22
##SPECTROMETER/DATA SYSTEM= spect
##.PULSE SEQUENCE= noesygpps1d.comp
##.SOLVENT NAME= COFFEE_meoh
##.SHIFT REFERENCE= INTERNAL, COFFEE_meoh, 1, 14.96663
##AUDIT TRAIL= $$ (NUMBER, WHEN, WHO, WHERE, PROCESS, VERSION, WHAT)
$$ ##TITLE= Audit trail, TOPSPIN		Version 2.1
$$ ##JCAMPDX= 5.01
$$ ##ORIGIN= Bruker BioSpin GmbH
$$ ##OWNER= Administrator
$$ $$ C:\Bruker\TOPSPIN/data/COFFEE/nmr/AC1043_TOIB01_5858525_2lf3t6XJn0/12/pdata/1/auditp.txt
$$ ##AUDIT TRAIL=  $$ (NUMBER, WHEN, WHO, WHERE, PROCESS, VERSION, WHAT)
(   1,<2012-03-29 19:14:16.468 -0500>,<Administrator>,<TOPSPIN>,<go>,<TOPSPIN 2.1>,
      <created by zg
	started at 2012-03-29 19:02:44.812 -0500,
	POWCHK enabled, PULCHK disabled,
       configuration hash MD5:
       1A 1E CE 29 27 FD 77 03 67 4E F0 E3 C4 B2 CB 90
       data hash MD5: 64K
       C7 EE 76 0F 65 FA 22 AB DB F9 4E 50 13 75 05 E5>)
(   2,<2012-03-29 19:14:19.234 -0500>,<Administrator>,<TOPSPIN>,<proc1d>,<TOPSPIN 2.1>,
      <Start of raw data processing
       efp LB = 0.3 FT_mod = 6 PKNL = 1 PHC0 = 0 PHC1 = 0 SI = 128K 
       data hash MD5: 128K
       B5 C3 EB D2 26 73 4B EC 15 45 DA 7D 2A 1A 6A F9>)
(   3,<2012-03-29 19:14:20.484 -0500>,<Administrator>,<TOPSPIN>,<proc1d>,<TOPSPIN 2.1>,
      <pk PHC0 = 34.46411 PHC1 = 0 
       data hash MD5: 128K
       F0 2A 66 27 C9 A7 02 75 D3 F7 CD FA AB 25 91 F4>)
(   4,<2012-03-29 19:14:21.140 -0500>,<Administrator>,<TOPSPIN>,<proc1d>,<TOPSPIN 2.1>,
      <abs ABSG = 1 
       data hash MD5: 128K
       C0 51 9F E9 8A 58 9F 15 33 EC 5C DD 65 22 71 18>)
(   5,<2012-03-29 19:14:21.218 -0500>,<Administrator>,<TOPSPIN>,<proc1d>,<TOPSPIN 2.1>,
      <abs ABSG = 2 
       data hash MD5: 128K
       EB 83 2B 1F 04 A7 6A 87 86 34 AA 2D 01 AE 79 19>)
(   6,<2012-03-29 19:14:21.265 -0500>,<Administrator>,<TOPSPIN>,<proc1d>,<TOPSPIN 2.1>,
      <abs ABSG = 3 
       data hash MD5: 128K
       D2 AA C1 88 04 97 CA 08 38 B2 31 7E 55 CD 36 AE>)
(   7,<2012-03-29 19:14:21.328 -0500>,<Administrator>,<TOPSPIN>,<proc1d>,<TOPSPIN 2.1>,
      <abs ABSG = 4 
       data hash MD5: 128K
       A0 A6 0D 1C 2E D9 72 11 40 A0 D0 60 8A 8E D9 07>)
(   8,<2012-03-29 19:14:21.390 -0500>,<Administrator>,<TOPSPIN>,<proc1d>,<TOPSPIN 2.1>,
      <abs ABSG = 5 
       data hash MD5: 128K
       6E 7C 39 88 E9 F2 CF 59 84 74 98 97 02 51 76 CD>)
$$ ##END=
$$ 
$$ $$ hash MD5
$$ $$ 3F 62 B8 B4 3B 6B 61 65 89 7E 00 28 02 BE 96 BD
##$RELAX= 
##$RELAX= 
##$RELAX= 
##$RELAX= 
##$RELAX= 
##$RELAX= 
##$RELAX= 
##$RELAX= 
$$ Bruker specific parameters
$$ [...]
##$TP07= 0
##$TPNAME0= <>
##$TPNAME1= <>
##$TPNAME2= <>
##$TPNAME3= <>
##$TPNAME4= <>
##$TPNAME5= <>
##$TPNAME6= <>
##$TPNAME7= <>
##$TPOAL= (0..7)
0.5 0.5 0.5 0.5 0.5 0.5 0.5 0.5
##$TPOFFS= (0..7)
0 0 0 0 0 0 0 0
##$TUNHIN= 0
##$TUNHOUT= 0
##$TUNXOUT= 0
##$USERA1= <user>
##$USERA2= <user>
##$USERA3= <user>
##$USERA4= <user>
##$USERA5= <user>
##$V9= 5
##$VALIST= <valist>
##$VCLIST= <CCCCCCCCCCCCCCC>
##$VD= 0
##$VDLIST= <DDDDDDDDDDDDDDD>
##$VPLIST= <PPPPPPPPPPPPPPP>
##$VTLIST= <TTTTTTTTTTTTTTT>
##$WBST= 1024
##$WBSW= 4
##$XGAIN= (0..3)
0 0 0 0
##$XL= 0
##$YL= 0
##$YMAX_a= 8981634
##$YMIN_a= -5156522
##$ZGOPTNS= <>
##$ZL1= 120
##$ZL2= 120
##$ZL3= 120
##$ZL4= 120
##$ABSF1= 14.96663
##$ABSF2= -5.5859
##$ABSG= 5
##$ABSL= 3
##$ALPHA= 0
##$AQORDER= 0
##$ASSFAC= 0
##$ASSFACI= 0
##$ASSFACX= 0
##$ASSWID= 0
##$AUNMP= <proc_prof1d_extract.lims>
##$AXLEFT= 0
##$AXNAME= <>
##$AXNUC= <1H>
##$AXRIGHT= 0
##$AXTYPE= 0
##$AXUNIT= <>
##$AZFE= 0.1
##$AZFW= 0.1
##$BCFW= 0
##$BC_mod= 0
##$BYTORDP= 0
##$COROFFS= 0
##$CY= 15
##$DATMOD= 1
##$DC= 0
##$DFILT= <>
##$DTYPP= 0
##$F1P= 0
##$F2P= 0
##$FCOR= 0.5
##$FTSIZE= 131072
##$FT_mod= 6
##$GAMMA= 0
##$GB= 0
##$INTBC= 1
##$INTSCL= 1
##$ISEN= 128
##$LB= 0.3
##$LEV0= 0
##$LPBIN= 0
##$MAXI= 10000
##$MC2= 0
##$MEAN= 0
##$ME_mod= 0
##$MI= 0
##$NCOEF= 0
##$NC_proc= -3
##$NLEV= 6
##$NOISF1= 0
##$NOISF2= 0
##$NSP= 0
##$NTH_PI= 0
##$NZP= 0
##$OFFSET= 14.96663
##$PC= 1
##$PHC0= 34.46411
##$PHC1= 0
##$PH_mod= 1
##$PKNL= yes
##$PPARMOD= 0
##$PPDIAG= 0
##$PPIPTYP= 0
##$PPMPNUM= 2147483647
##$PPRESOL= 1
##$PSCAL= 4
##$PSIGN= 0
##$PYNMP= <proc.py>
##$REVERSE= no
##$SF= 400.130005595408
##$SI= 131072
##$SIGF1= 0
##$SIGF2= 0
##$SINO= 400
##$SIOLD= 131072
##$SPECTYP= <>
##$SREGLST= <1H.CDCl3>
##$SSB= 0
##$STSI= 131072
##$STSR= 0
##$SW_p= 8223.68421052632
##$SYMM= 0
##$S_DEV= 0
##$TDeff= 65536
##$TDoff= 0
##$TI= <>
##$TILT= no
##$TM1= 0
##$TM2= 0
##$TOPLEV= 0
##$USERP1= <user>
##$USERP2= <user>
##$USERP3= <user>
##$USERP4= <user>
##$USERP5= <user>
##$WDW= 1
##$XDIM= 131072
##$YMAX_p= 374009683
##$YMIN_p= -130237332
##$CURPLOT= <Network HP LaserJet P1505>
##$CURPRIN= <$Network HP LaserJet P1505>
##$DFORMAT= <normdp>
##$LAYOUT= <+/1D_H.xwp>
##$LFORMAT= <normlp>
##$PFORMAT= <normpl>
##$SURQMSG= 1
$$ End of Bruker specific parameters
$$ ---------------------------------
##NTUPLES= NMR SPECTRUM
##VAR_NAME=  FREQUENCY,     SPECTRUM/REAL,   SPECTRUM/IMAG
##SYMBOL=    X,             R,               I
##VAR_TYPE=  INDEPENDENT,   DEPENDENT,       DEPENDENT
##VAR_FORM=  AFFN,          ASDF,            ASDF
##VAR_DIM=   131072,        131072,          131072
##UNITS=     HZ,            ARBITRARY UNITS, ARBITRARY UNITS
##FACTOR=    0.0627417313425165, 1,          1
##FIRST=     8223.62146879498, -366,         -89580
##LAST=      0,             3316,            -90227
##MIN=       0,             -130237332,      0
##MAX=       8223.62146879498, 374009683,    0
$$ Real data points
##PAGE= N=1
##DATA TABLE= (X++(R..R)), XYDATA
$$ [...]
61582D52216K990L124K863K498K441K685K775K511K231K063J322n84l010m601
61568D71524m867m476m135m130m803o333p739p427n219k891j953j791r26P15J787
61553D17336J401O1j196j829j971k161k880l977m664m416l678l342l786m773n952
61538C74173o880o858n542l772l143m361o368p437o916n561m334l441k688k112
61524C04760j724r70O02K208K352Q73o42r64p09q49r88m81j61j080k199j516O06
61507B99118J620N54o47l05O40O22j61p56j170j501q90R34K353J938P66P38J635
61490C05488J825J115N92K79o77j748j511m80q99l111m521l189l92J526K049J853
61474B98199R98m83j381m93J468K678K512J775J021N7q80p74Q43K937L802K625
$$ plain form
61582 452216 455206 458330 461193 463691 466132 468817 471592 474103 476334 478397 479719 479135 476125 471524
61568 471524 466657 462181 458046 453916 449113 442780 435041 427614 422395 419504 417551 415760 414834 415549 417336
61553 417336 418737 418798 417602 415773 413802 411641 408761 404784 400120 395704 392026 388684 384898 380125 374173
61538 374173 367293 360435 354893 351121 347978 343617 337249 329812 322896 317335 313001 309560 306872 304760
61524 304760 303036 302066 302668 304876 307228 308101 307459 306495 305786 304937 303949 303468 303307 302227 300028 298512 299118
61507 299118 300738 301292 300645 300340 300980 301602 301441 300685 299515 298014 297124 298058 300411 302349 303115 303853 305488
61490 305488 307313 308428 309020 309299 308622 306874 305363 304883 303984 300873 296352 293163 292771 294297 296346 298199
61474 298199 299197 298714 297333 296840 298308 300986 303498 305273 306294 306351 305471 304697 305540 308477 312279 314904
61458C14904J45j922k268j023M91J122Q22K26l10q87j601k116j822m36J278J780
61442C08383L59j728k546j819r11n09J76J379J590k29k322j905J148L951M133
61427C09150K367R60R68J423R39n67j756j354K76J331O72p36j023K86J883K398
61411C17217J692M23o78r34k7J310J589J63j891k911k401j177j24O05J272J979
61395C16107K496K434J608M59n4N53J480J406J53r92j034o31r16j459o41J853
61379C22822M253N012M683M529M345L220J752J522K483K851K029J630K627L435
61365C67193K365N23L20J994L695M450M924N301M551K363P8j084j436j752k007
61350C91478j936j734j366j97J745L024K385M34j329k530l784n003n232m242l053
$$ plain form
61458 314904 315049 313127 310859 309836 310327 311449 312271 312497 312187 311300 309699 307583 305761 305325 306603 308383
61442 308383 308742 307014 304468 302649 301738 301229 301405 302784 304374 304145 301823 299918 301066 305017 309150
61427 309150 311517 312477 313445 314868 315807 315240 313484 312130 312406 313737 314409 313673 312650 312936 314819 317217
61411 317217 318909 319332 318654 317720 317693 319003 320592 320755 318864 315953 313552 312375 312251 312856 314128 316107
61395 316107 318603 321037 322645 323104 323050 323603 325083 326489 326642 325650 324616 323985 323069 321610 320969 322822
61379 322822 327075 332087 336770 341299 345644 348864 350616 352138 354621 357472 359501 361131 363758 367193
61365 367193 369558 370081 370401 372395 376090 380540 385464 390765 395316 397679 397757 396673 395237 393485 391478
61350 391478 389542 387808 386442 386245 387990 391014 393399 393833 392504 389974 386190 381187 375955 371713 368660
61335C68660k461j952o43J277K625K528J211l32j173j026k92L29L77n5m68m01
61319C68204J72R33J578J982K012J541Q18M75Q50J623K414L234L760L019R07n07
61303C93015J072M723O619M618J069j01J965M711N697M910L812L469L836M089
61289D43504L547K674K738L893M517L484K242K942N030N780M280K801L427N251
61275D96110O095N479M479L605K481J095k1o23p02J70K211M324M847L635K349
61260E35534K363L180L443K785K070K137K968M034M954N637N974N843N507N668
61246E92097O699P938Q372Q015P900Q402Q328O439L318R08L99J288K347K676J851
61231F66977r9k519m551n867o638o893o676o755q065j0095j0805q951n775l512
$$ plain form
61335 368660 366199 364247 363604 364881 367506 370034 371245 370913 369740 368714 368422 368751 369128 369073 368605 368204
61319 368204 368376 369309 370887 372869 374881 376422 377240 377715 378565 380188 382602 385836 389596 392615 393522 393015
61303 393015 394087 398810 405429 410047 411116 411015 412980 417691 423388 428298 432110 435579 439415 443504
61289 443504 447051 449725 452463 456356 460873 464357 466599 469541 474571 480351 484631 487432 490859 496110
61275 496110 502205 507684 512163 515768 518249 519344 519323 518700 517998 518168 520379 524703 529550 533185 535534
61260 535534 537897 541077 544520 547305 549375 551512 554480 558514 563468 569105 575079 580922 586429 592097
61246 592097 598796 606734 615106 623121 631021 639423 647751 654190 657508 658416 658815 660103 662450 665126 666977
61231 666977 666878 664359 659808 653941 647303 640410 633734 626979 618914 608819 598014 589063 583288 579776
61217E79776k772k350j364l38r2n41j067j414j665j773j608j156k61J454L942
61202E68771O203P093O676O269O875P976Q141O631M124J964J007J141J726K323
61188F36920K897L406L363K190K9k112l149k692j054J018K418K220P31m10J5J197
61172F46987J298l9j225r02M86J799K812L864M706M845M628M901N695O277O494
61157F92626O967P770P933O824N261M571N018N766O128O316O947Q159R250R133
61143G88669P387N002L734M407O091P136O853N972N730O777Q779J0667J1277J0086
61129H88567P543M796L000K575K779K257M61j565k384k025j882k701l719m180
61115H93522m576n485o229n903n139n391o700p614p410o984p228p781q040q231
$$ plain form
61217 579776 577004 574654 573290 572952 572860 572319 571252 569838 568173 566400 564792 563636 563375 564829 568771
61202 568771 574974 582067 588743 595012 601887 609863 618004 624635 628759 630723 631730 632871 634597 636920
61188 636920 639817 643223 646586 648776 648805 646693 643544 640852 639798 640816 643234 645454 646185 645775 645790 646987
61172 646987 648285 648246 647021 646119 646605 648404 651216 655080 659786 664631 669259 674160 679855 686132 692626
61157 692626 699593 707363 715296 722120 727381 731952 736970 742736 748864 755180 762127 770286 779536 788669
61143 788669 796056 801058 804792 809199 815290 822426 829279 835251 840981 847758 856537 867204 878481 888567
61129 888567 896110 900906 903906 906481 909260 911517 911978 910413 908029 906004 904122 901421 897702 893522
61115 893522 888946 883461 877232 871329 866190 860799 854099 846485 839075 832091 824863 817082 809042 800811
61101H00811q695r005q625p769o822n600m060l101l563m778n164m227l050k916
61087G23436m208o489q822j0021r536q188p259o942o434n493m701m060k629j42
61073F38512K103K803K234J563J287J306J821L147M903O375P526Q863J0450J1781
61059G04674J2637J3330J4186J5322J6853J8763K0627K1942K2568K2492K1666
61048I05060K0601K0446K1552K2467K1499J8887J6209J4063J1842R607Q262P580
61036A098075O027L273J064M53j52k702o558r585j1152j2179j2936j2870j2460
61023A028298j3151j5004j6184j5435j3675j2392j1579j0319q495o914n962n060
61011H94128l467j211R14K142K603L343N221P919J0351J1987J3261J4807J6710
$$ plain form
61101 800811 792116 783111 774486 766717 759895 754295 750235 747134 743571 738793 733629 729402 726352 723436
61087 723436 719228 712739 703917 693896 684360 676172 668913 661971 655537 650044 645343 641283 638654 638512
61073 638512 640615 643418 645652 647215 648502 649808 651629 654776 659679 666054 673580 682443 692893 704674
61059 704674 717311 730641 744827 760149 777002 795765 816392 838334 860902 883394 905060
61048 905060 925661 946107 967659 990126 1011625 1030512 1046721 1060784 1072626 1082233 1090495 1098075
61036 1098075 1104102 1107375 1108439 1108892 1108740 1106038 1099480 1089895 1078743 1066564 1053628 1040758 1028298
61023 1028298 1015147 1000143 983959 968524 954849 942457 930878 920559 912064 905150 899188 894128
61011 894128 890661 889450 890364 892506 895109 898452 903673 911592 921943 933930 947191 961998 978708
60998I78708J8659K0374K1865K3598K6240K9833L3427L6197L8729M2394M7425
60987A317449N2589N6942O0984O5658P0894P5682P9168Q1402Q3498Q7364R4592
60976B126222J05126J17358J29845J42577J56400J71843J89015K08215K30233
60967C576834K56123K86725L22006L61062M03471M50592N04522N65775O33316
60958G360426P07390P91263Q90111J009458J152506J310757J449976J509474J430392
60949A7611753J198859Q65315N18200K35232N5151j6912L566P7429J35730R9766
60939B0784089p4347l64852o98387r95624j208654j327542j365997j345781j287532
60930A2115373j206441j111857j010037r06237q04119p05493o12480n28736m56995
$$ plain form
60998 978708 997367 1017741 1039606 1063204 1089444 1119277 1152704 1188901 1227630 1270024 1317449
60987 1317449 1370038 1426980 1487964 1553622 1624516 1700198 1779366 1860768 1944266 2031630 2126222
60976 2126222 2231348 2348706 2478551 2621128 2777528 2949371 3138386 3346601 3576834
60967 3576834 3832957 4119682 4441688 4802750 5206221 5656813 6161335 6727110 7360426
60958 7360426 8067816 8859079 9749190 10758648 11911154 13221911 14671887 16181361 17611753
60949 17611753 18810612 19675927 20194127 20429359 20484510 20467598 20471164 20548593 20684323 20784089
60939 20784089 20709742 20344890 19646503 18650879 17442225 16114683 14748686 13402905 12115373
60930 12115373 10908932 9797075 8787038 7880801 7076682 6371189 5758709 5229973 4772978
60921D772978l96619l45266l01930k66498k37359k11813j88729j68879j52558
60912B503327j38573j25639j13354j01758r1274q2893p6906p1625o5132n8113
60902A578060n3047n0408m7926m4123m0222l7469l4696l0350k5285k1626j9765
60891A173143j8278j6150j3422j0185o587l604k225j883j002Q02K300K696K879
60878A108484M177O674R236J0708J0772J0083R753J0267J0885J0552R364Q482
60866A219437Q508Q799Q696Q564Q864Q803P039L646K62k035m098p214j0921j3512
60852A244838j4512j5322j7043j8890j9695j9956k1034k2790k3546k2420k0454
60841A029176j9168j8998j9433j9681j8911j6918j4957j4793j6353j7378j6137
$$ plain form
60921 4772978 4376359 4031093 3729163 3462665 3225306 3013493 2824764 2655885 2503327
60912 2503327 2364754 2239115 2125761 2024003 1932729 1849836 1772930 1701305 1636173 1578060
60902 1578060 1525013 1474605 1426679 1382556 1342334 1304865 1270169 1239819 1214534 1192908 1173143
60891 1173143 1154865 1138715 1125293 1115108 1108521 1104917 1102692 1100809 1099807 1100609 1102909 1105605 1108484
60878 1108484 1112661 1119335 1128571 1139279 1150051 1160134 1169887 1180154 1191039 1201591 1210955 1219437
60866 1219437 1227945 1236744 1245440 1254004 1262868 1271671 1278710 1282356 1282618 1280583 1276485 1269271 1258350 1244838
60852 1244838 1230326 1215004 1197961 1179071 1159376 1139420 1118386 1095596 1072050 1049630 1029176
60841 1029176 1010008 991010 971577 951896 932985 916067 901110 886317 869964 852586 836449
60830H36449j3463j1287j0237r754r571r675r496q586p717p863q452q182p397
60817G14769p877r948j1473j0584q131o457o598p646q193p531n852m177l803n018
60803F11481o484o569n264m123m321n391o138o229o359p080p939q003o925n261
60789E25395l831l046k805k813k809k787k995l543m027m047m077n115p010p895
60775D68595o141k508N42J478P58n21j855k995l505l284k800k272j332o1M25o16
60759D43908k095k147n20J168J558R85N29N87R94J779K945L848L608K182L72j101
60743D58600j996k110j263O9R41J093J229J673J608M41q02o96L58N27r52k998
60727D55722m563n760o608o265m607l267l614m653m479l229k727l446l744k587
$$ plain form
60830 836449 822986 811699 801462 791708 782137 772462 762966 754380 746663 738800 730348 722166 714769
60817 714769 706892 696944 685471 674887 666756 660299 653701 646055 637862 630331 624479 620302 616499 611481
60803 611481 604997 598428 593164 589041 584720 579329 573191 566962 560603 553523 545584 537581 530656 525395
60789 525395 521564 518518 515713 512900 510091 507304 504309 500766 496739 492692 488615 483500 476490 468595
60775 468595 462454 459946 460488 461966 462724 462203 460348 457353 453848 450564 447764 445492 444160 444099 444524 443908
60759 443908 441813 439666 439146 440314 441872 442857 443386 443973 444967 446746 449691 453539 457147 459329 459701 458600
60743 458600 456604 454494 453231 453300 454241 455334 456563 458236 459844 460285 459483 458787 459145 459672 458720 455722
60727 455722 451159 445399 438791 432526 427919 424652 421038 416385 411906 408677 405950 402504 398760 396173
60713C96173j230j292k380k779j851n38P7j61p43j042n31Q64K409K976K107O14
60697C92673o2P87K443L512L369K745K782L731M785N010M245L240L053L932M626
60682D40871L416K79k612l303k438k179l162l934l379k274j988k884m589o707
60668D05117q414q428o442m001k877l083l417l482l863m581m731m034l566m183
60654C40015m975m128j268J845L075K022P7j278j762j824j522m56J310K813K990
60639C36934J709j1p76kJ365J696N51o33l59Q75J349O77K69J125K527L398L750
60622C54444M015M040L694L551L956M160L515K868L524N209O241N633M017K578
60608D11445J961K032K021J071o13j655j369j090k325m105l855r08K470L885L149
$$ plain form
60713 396173 394943 393651 391271 388492 386641 386103 386180 386019 385276 384234 383703 384567 386976 389952 392059 392673
60697 392673 392611 393398 395841 399353 402722 405467 408249 411980 416765 421775 426020 429260 432313 436245 440871
60682 440871 444287 444566 441954 438651 436213 434034 430872 426938 423559 421285 419297 416413 411824 405117
60668 405117 396703 388275 381833 377832 374955 371872 368455 364973 361110 356529 351798 347764 344198 340015
60654 340015 335040 330912 329644 331489 334564 336586 336663 335385 333623 331799 330277 329821 331131 333944 336934
60639 336934 338643 338632 337856 337854 339219 340915 341466 340833 340474 341349 342698 343375 343644 344769 347296 350694 354444
60622 354444 358459 362499 366193 369744 373700 377860 381375 384243 387767 392976 399217 404850 408867 411445
60608 411445 413406 415438 417459 418530 417917 416262 414893 413803 411478 407373 403518 402610 405080 408965 412114
60593D12114J467j85j122p76M66J184N80n13j006j106j621k502l067l099k815
60578C97999k271j660j651k434k992k408j473j640k703k988k010j281j896k760
60564C67832k277q67l05j035j482l42J611K637K264J620J735K300K322J395j4
60549C77394j206j713j365m65Q1n25j903k592j672J4P68L6r39n63J332L347L962
60532C73991K932J299J88j49j21J10Q20J995K925K867J918R53P77J574L018M587
60516C99684N748O195O116O122O811Q248R796J0446R505P164M360K047N87k15
60502D82614p14j133j487j652j633j686j955j954q99J234L402M654N235O029P170
60487D97225Q013Q350Q828R805J0544J0155Q858P593O648N462L759K117J059K58
$$ plain form
60593 412114 413581 413396 412274 411498 411964 413148 413728 413215 412209 411103 409482 406980 403913 400814 397999
60578 397999 395728 394068 392417 389983 386991 384583 383110 381470 378767 375779 373769 372488 370592 367832
60564 367832 365555 364688 364383 363348 361866 361524 363135 365772 368036 369656 371391 373691 376013 377408 377394
60549 377394 376188 374475 373110 372645 372726 372201 370298 367706 366034 366048 366816 366852 365913 365350 366682 370029 373991
60532 373991 376923 378222 378410 378261 378140 378250 379070 381065 383990 386857 388775 389728 390505 392079 395097 399684
60516 399684 405432 411627 417743 423865 430676 438924 448720 459166 468671 475835 480195 482242 482829 482614
60502 482614 481900 480767 479280 477628 475995 474309 472354 470400 469501 470735 474137 478791 484026 490055 497225
60487 497225 505238 513588 522416 532221 542765 552920 561778 569371 576019 581481 585240 587357 588416 588674
60473E88674q80k242l144l236k766k204k031k598l576l732k118M50J997J678P01
60458E64973N59J302K089K652L318M231N582Q009J1683J5293J7212J7635J8392
60445F72930K0524K3201K5202K6361K7112K7616K7880K7864K6919K4028J9165
60434I48802J3630Q359K762m101j1860j9179k5093k9158l0990l0737k9719k9483
60422G63233l0239l0857l0249k8131k4838k1151j8165j6481j5605j4675j3534
60411E19308j2461j1316r769q098o878o121n668o040p709r563r445o693l186j313
60397D15048j606k753l287k753j654p37l38l62q24j851k891k744j155L09J41j000
60381C91543j439j244j955l760m921m410l197k240j187P5M39m61r87J32J608J526
$$ plain form
60473 588674 587794 585552 582408 579172 576406 574202 572171 569573 565997 562265 560147 560597 562594 564272 564973
60458 564973 565532 566834 568923 571575 574893 579124 584706 592715 604398 619691 636903 654538 672930
60445 672930 693454 716655 741857 768218 795330 822946 850826 878690 905609 929637 948802
60434 948802 962432 970791 973553 969452 957592 938413 913320 884162 853172 822435 792716 763233
60422 763233 732994 702137 671888 643757 618919 597768 579603 563122 547517 532842 519308
60411 519308 506847 495531 485762 477664 470786 464665 458997 452957 445248 435685 426240 419547 416361 415048
60397 415048 413442 410689 407402 404649 402995 402258 401920 401558 400734 398883 395992 393248 392093 392402 392543 391543
60381 391543 390104 388860 386905 383145 378224 373814 370617 368377 367190 367265 367704 367243 366256 366388 367996 369522
60365C69522L51l9N71P87L36L51J014J019n3q14l00M22j7j195j635r12J38R45
60347C70491J829L112M299M501L417J690K61m12l65L71J743L169L859L812L705
60332D05482L517K455Q21N06K288L864K570o22k102m52J923K463J538R65J178
60317D26394J361J197J180J797L245N284O754O141L504R01O4M50N83L26N33J207
60301D60921J535J518K055L315M241M085L555L934N568P566Q604P813N093J076
60287E20879k991n481n290l174j643k413m105l793r55J678J829M66j52L09O50
60272D95814N47O19O99K1j059j275m16M91R67J474J983J788J056R72J830K459
60256E07970K232K216L497N530P106P934Q380Q471Q206Q176Q823R475Q975P091
$$ plain form
60365 369522 369873 369834 370405 371192 371528 371879 372893 373912 373859 373045 372745 373167 373150 371955 370320 369408 369546 370491
60347 370491 372320 375432 379731 384232 387649 389339 389600 389188 388823 389194 390937 394106 397965 401777 405482
60332 405482 408999 411454 412275 412781 415069 418933 421503 420881 418779 418327 420250 422713 424251 425216 426394
60317 426394 427755 428952 430132 431929 435174 440458 447212 453353 456857 457758 457822 458272 458855 459181 459714 460921
60301 460921 462456 463974 466029 469344 473585 477670 481225 485159 490727 498293 506897 514710 519803 520879
60287 520879 517888 512407 507117 503943 502300 499887 495782 491989 491034 492712 494541 495007 494855 495164 495814
60272 495814 496361 496980 497679 497700 496641 495366 494950 495441 496408 497882 499865 501653 502709 503681 505511 507970
60256 507970 510202 512418 515915 521445 528551 536485 544865 553336 561542 569718 578541 588016 596991 604082
60242F04082M647K368J40k613o030r299j1157j1164j0194r178p879n851m008l694
60228E30170m370m097k543j560k115k704k003j011r16o26J327L803M440L274K438
60213E23507K602K227M86j455k528l009l069k061j83R54M90l96m39r9k79o40o42
60196E15466j015k456l676k674K54K560K578J206K20K42Q38J512J850J465N57
60181E18927Q5P61K130L180L535L482L013J720j63j381r95K11N52l20q11N09K933
60164E37368M473M301L464L306M054N009N322M427K493P09M12J611L013L771M298
60149E88031M982N175M400L673M392O259P526P212O048N140M725M506M358M264
60135F60691M098L864L762L774L566L005K354J810J169K40p97j628k168k537k940
$$ plain form
60242 604082 608729 611097 611237 608624 602594 593295 582138 570974 560780 551602 543723 537872 533864 530170
60228 530170 525800 521703 519160 517600 515485 512781 510778 509767 508851 508225 509552 513355 517795 521069 523507
60213 523507 526109 528336 528822 527367 524839 521830 518761 516700 516517 517471 517961 517565 517126 517027 516748 516108 515466
60196 515466 514451 511995 508319 505645 505899 508459 511037 512243 512463 512705 513543 515055 516905 518370 518927
60181 518927 519012 519773 521903 525083 528618 532100 535113 536833 536670 535289 534294 534505 535057 534737 533926 534435 537368
60164 537368 541841 546142 549606 552912 556966 561975 567297 571724 574217 574926 575338 576949 579962 583733 588031
60149 588031 593013 598188 602588 606261 610653 616912 624438 631650 637698 642838 647563 652069 656427 660691
60135 660691 664789 668653 672415 676189 679755 682760 685114 686924 688093 688333 687536 685908 683740 681203 678263
60120F78263l600m483n138n152m831m902n444n663m901l407j923j110j540l470
60106F22699n976p085n636k783p79m16m69L20J636K274J788Q53L21L78N76M23
60090F08124p7m47l18K2Pl25k23P06J739J827R82L48O72J336J323Q56J203K753
60072F20508M133L961K849K562L360L536K071M96R17K960M144L123J183K15M49
60057F56467P94N43j21p94j235j290r94n02K67J551K919L200J778n23k510m005
60041F55545n290n771m510j956J33Q25Q49R36M97j173l332m506m353l768l395
60026F20731k970k265j778k076k924l469l097j906m47P85J549J588M55j970m776
60011E97430o385n925m040k072q65p38j944m267o348o510m649k622k261l395m425
$$ plain form
60120 678263 674663 670180 665042 659890 655059 650157 644713 639050 634149 630742 628819 627709 626169 622699
60106 622699 616723 609638 604002 601219 600440 600024 599555 599875 601511 603785 605573 606426 606747 607125 607701 608124
60090 608124 608047 607600 607282 607304 607311 606986 606763 607469 609208 611035 612017 612365 613037 614373 615696 616552 617755 620508
60072 620508 624641 628602 631451 634013 637373 640909 642980 643476 644393 647353 651497 654620 655803 656018 656467
60057 656467 657261 657804 657683 656889 655654 654364 653370 652868 653135 654686 657605 660805 662583 662060 659550 655545
60041 655545 650255 644484 639974 638018 638151 638976 639825 640761 641258 640085 636753 632247 627894 624126 620731
60026 620731 617761 615496 613718 611642 608718 605249 602152 600246 599799 600584 602133 603721 604176 602206 597430
60011 597430 591045 585120 581080 579008 578143 577405 575461 571194 564846 558336 553687 551065 548804 545409 540984
59996E40984m459m196m571n264n064l493j540n94j062k169k739j749J303N628
59982E11015Q791Q365M575N78o84N76J857J599N66K16Q90J763J825O11j400k947
59966E38196l141k517k294k653k621j808j114j248j643j642j750k655l795m216
59952E05099m346n290o551o179l777j778k519n062o320m954k705j780k279k773
59938D48786k442j705j176j074j432k042k126j002P36J586J214J200K778M599
59924D47900M129J203j365j149J052K589K310J354R16N84n84k218k842j926q27
59909D51126j140k507k943j394Q82J992J682J070Q24P90J039J872K639K036R8
59894D58066j275n81J433K882K885J887P10L6J20K45o97k398l026j854p16j323
$$ plain form
59996 540984 536525 532329 527758 522494 517430 513937 512397 511803 510741 508572 505833 504084 505387 511015
59982 511015 519806 528171 532746 533324 532640 533216 535073 536672 537238 537454 538344 540107 541932 542543 541143 538196
59966 538196 535055 532538 530244 527591 524970 523162 522048 520800 519157 517515 515765 513110 509315 505099
59952 505099 500753 495463 488912 482733 478956 477178 474659 469597 463277 458323 455618 453838 451559 448786
59938 448786 446344 444639 443463 442389 440957 438915 436789 435787 436523 438109 439323 440523 443301 447900
59924 447900 452029 453232 451867 450718 451770 454359 456669 458023 458939 459523 458939 456721 453879 451953 451126
59909 451126 449986 447479 444536 443142 444024 446016 447698 448768 449592 450382 451421 453293 455932 457968 458066
59894 458066 456791 456210 457643 460525 463410 465297 466007 466043 466163 466408 465711 463313 460287 458433 457717 456394
59878D56394k379j496Q47J789M45q20j44J269J482P93P44J534K115K106K106K524
59862D69309L269M256N282N781N572N434O096P100P537P389P158O593M919K316
59848E48011O8q05m51K07J08j262l088l429j310J691L108K663K276K909L060J176
59832E54932j796l411k648o49J000J741J911K018K368K961L571M045M366M258
59818E74667L245J439j3N0J387K569K657K129J998K530L222L677L883L813L355
59803F10608K840L013M015M759M017K030L60k8J94n7p22r75o90o49j414k710m059
59786F20532n419p029q967j0938j2180j1794r706p161n607n097m510l359k467
59773E26298k535l037l044k528k069j831j536j156q48m06N66J869K632K081K39
$$ plain form
59878 456394 454015 452519 453366 455155 455600 454780 454636 455905 457387 458180 458924 460458 462573 464679 466785 469309
59862 469309 472578 476834 482116 487897 493469 498903 504999 512099 519636 527025 534183 540776 545695 548011
59848 548011 548079 547274 546823 547030 547138 545876 542788 539359 538049 539740 542848 545511 547787 550696 553756 554932
59832 554932 553136 549725 547077 546428 547428 549169 551080 553098 555466 558427 561998 566043 570409 574667
59818 574667 577912 579351 579338 579388 580775 583344 586001 588130 590128 592658 595880 599557 603440 607253 610608
59803 610608 613448 616461 620476 625235 629252 631282 631642 631614 631808 631751 631029 630054 629364 628715 627301 624591 620532
59786 620532 615113 608084 599117 588179 575999 564205 554499 547338 541731 536634 532124 528765 526298
59773 526298 523763 520726 517682 515154 513085 511254 509718 508562 507714 507308 507874 509743 512375 514456 514695
59758E14695k025l437l117j332O28J616J528R86N20K56K3n97j829l060l190k103
59742D99562j102j240j892j835j134p84r58j018j062j913l348l855k708j117m93
59727D75103p03q28p04o45l90N01J617K041J629J027O91O40R64J692K245J820
59711D86700N15o12o45M45K099L581M156L531K288J378J163J406J883K344K112
59696E12344P99o17o15P09J581J162Q23J902L479L883L436L823N072N307L843
59681E46931K586L332N187N994N330M493M141L536K261J188J267K240K993K619
59667E94098Q34j958m642o011n791m715l394j754R3J246R50l20j376j633j400
59652E64227j256j568k350l038k851j756o18O3P99J768J897M75j139j034M12J039
$$ plain form
59758 514695 512670 509233 506116 504784 505412 507028 508556 509542 510062 510318 510341 509744 507915 504855 501665 499562
59742 499562 498460 497220 495328 493493 492359 491575 490617 489599 488537 486624 483276 479421 476713 475596 475103
59727 475103 474400 473572 472868 472223 471833 472334 473951 475992 477621 478648 479339 479979 480943 482635 484880 486700
59711 486700 487215 486603 485958 486403 488502 492083 496239 499770 502058 503436 504599 506005 507888 510232 512344
59696 512344 513143 512526 511911 512620 514201 515363 516186 518088 521567 525450 528886 532709 537781 543088 546931
59681 546931 549517 552849 558036 564030 569360 573853 577994 581530 583791 584979 586246 588486 591479 594098
59667 594098 594932 592974 588332 582321 576530 571815 568421 566667 566760 568006 568956 568636 567260 565627 564227
59652 564227 562971 561403 559053 556015 553164 551408 550790 550853 551652 553420 555317 555792 554653 553619 554031 555070
59636E55070J22p69l83O82J558K358K982K461O60r08j191j071j435j376oJ314
59620E60068P54j070k136k236k804l847l680j880k32j29r05j422j531j385q82
59605E36683n08j148k451k885k023j064n09P69L034M340L146P11q27j325j726
59590E34217j607P3K440L223J777j53p82P1J630L103L808L554L011K769K239N20
59574E59893j929l612l860l204k187j082n54j159k195k419j783j147m44J047K590
59559E37955K187n17l362m536m598m669m346k804o78P99J570K235K536J870P34
59544E24376J83K11J2m12l40J71L33J82O38J672J854M65j053q53Q25J937J317
59527E31518O6n1J126K062J546J03q56q15n39q28j633k435k843k632j850j138
$$ plain form
59636 555070 555192 554423 554040 554722 556280 558638 561620 564081 564741 563833 562642 561571 560136 558760 558754 560068
59620 560068 560822 559752 557616 555380 552576 548729 545049 543169 542937 542808 541903 540481 538950 537565 536683
59605 536683 536175 535027 532576 529691 527668 526604 526095 526864 529898 534238 537384 538095 537268 535943 534217
59590 534217 532610 532683 535123 538346 540123 539970 539188 539259 540889 543992 547800 551354 554365 557134 559373 559893
59574 559893 557964 554352 550492 547288 545101 544019 543465 542306 540111 537692 535909 534762 534318 535365 537955
59559 537955 540142 539625 536263 531727 527129 522460 518114 515310 514632 515431 517001 519236 521772 523642 524376
59544 524376 524559 524770 524782 524370 524030 524201 524534 524716 525354 527026 528880 529345 528292 527439 528264 530201 531518
59527 531518 531584 531533 532659 534721 536267 536370 535514 534699 534160 533332 531699 529264 526421 523789 521939 520801
59511E20801j209j580o96J912M396M610K866J340R50L44j593l670l803j622J303
59496E24349L424M432M707M514M070L778M077N124O691Q184Q909Q732Q428R038
59482F08457J0804J3177J5788J8668K1161K1436J7984J1340L639l300q700j2021
59470G18433j2793j1660j0380j0109j0314r971q929p412n171k252J48Q79M46J45
59456F31060R3m34j172j163q27j700l709m673l423j549r36j172q59j71l14j356
59440F07695k274k589k459j743n09M7j107k961l550k696j885j554n68J253K208
59425E87308J271j46k02R48J956K428K908L456L595L273K840K346J820J818K671
59410F18290L548L327K243J534J585J582J149R83J469J781J249O77J290K831L839
$$ plain form
59511 520801 519592 518012 517316 519228 523624 528234 531100 532440 533390 533734 532141 528471 524668 523046 524349
59496 524349 527773 532205 536912 541426 545496 549274 553351 558475 565166 573350 582259 590991 599419 608457
59482 608457 619261 632438 648226 666894 688055 709491 727475 738815 742454 739154 730454 718433
59470 718433 705640 693980 683600 673491 663177 653206 644277 636865 631694 629442 629590 630469 630915 631060
59456 631060 631153 630719 629547 628384 627557 625857 622148 617475 614052 612503 611567 610395 609536 609365 609051 607695
59440 607695 605421 602832 600373 598630 598121 598168 597061 594100 590550 587854 585969 584415 583847 585100 587308
59425 587308 588579 588433 588231 589179 591135 593563 596471 599927 603522 606795 609635 611981 613801 615619 618290
59410 618290 621838 625165 627408 628942 630527 632109 633258 634241 635710 637491 638740 639417 640707 643538 647377
59395F47377L641L011K704K479K042K053L289N238O460O185M926L453J984N07
59381F95349p67j613j996j829j032q9J21n72j211j006m08j78P5J436L848N834
59365F95962O207N447M970N606P115Q821J0329J1623J2745J3691J4916J7688K2851
59352H37971K8751L1351K7682J8872Q900P10n232r162j0744r947p444l284L131
59339I11555J0536J4667J1683K369q594j7360k3437k7669k9744k8816k5473k1603
59327G68114j8442j5694j2697r711p598o587n958n030l966l305l015k595j931
59314F71585j387q82L04K338M058M171K895J579R38N25N0Q8R80J876J805J218
59298F92141J457K775L917M049M046N090O696P272O424N463N477O058O504P058
$$ plain form
59395 647377 651018 654029 656733 659212 661254 663307 666596 671834 678294 684479 689405 692858 694842 695349
59381 695349 694582 692969 690973 689144 688112 688023 688144 687572 686361 685355 684947 684769 684844 686280 690128 695962
59365 695962 702169 707616 712586 718192 725307 734128 744457 756080 768825 782516 797432 815120 837971
59352 837971 866722 898073 925755 944627 953527 954237 949005 939843 929099 919152 911708 908424 911555
59339 911555 922091 936758 948441 950810 942216 924856 901419 873750 844006 815190 789717 768114
59327 768114 749672 733978 721281 711570 703972 697385 691427 686397 682431 679126 676111 673516 671585
59314 671585 670198 669316 669620 671958 676016 680187 683082 684661 685599 686124 686174 686262 687242 689118 690923 692141
59298 692141 693598 696373 700290 704339 708385 713475 720171 727443 733867 739330 744807 750865 757369 764427
59284G64427Q041Q635P874O340N483N445N041L980L488M180M750L802J859M29
59270H33774j95q69j871k487k299j710j168p16m86p74j366j487o72Q27K576M198
59254H25275M874L510n1m401p772r493r893r231p663o042n692o919q350q397p187
59239G42568o296o608p133o324m178k344k269l696n104n216l930k088o51l0k9
59224F86672l68r98j752k010j278k6P95J147K058L961N658N710M420L437L568
59209G10994L953L616K949L039M015M845M731M082L758L761L231J739M9p50n05
59194G53507N8L92N43N82L40r4l04k74n39j212j505p60M86J244J489K012L096
59177G59061M166M780N109N321N176M626M158M067L840K789J103k81p87q26j112
$$ plain form
59284 764427 772468 781103 788977 795317 800800 806245 811286 815266 818754 822934 827684 831486 833345 833774
59270 833774 833579 832710 830839 828352 826053 824343 823175 822459 821973 821199 819833 818346 817674 818501 821077 825275
59254 825275 830149 833659 833608 829207 821435 811942 802049 792818 785155 779113 773421 766502 758152 749755 742568
59239 742568 736272 729664 722531 716207 712029 709685 707416 703720 698616 693400 689470 687382 686731 686701 686672
59224 686672 686304 685306 683554 681544 680266 680240 681035 682182 684240 688201 693859 699569 703989 707426 710994
59209 710994 714947 718563 721512 724551 728566 733411 738142 742224 745982 749743 752974 754713 754762 754012 753507
59194 753507 753565 753957 754500 755082 755422 755328 755024 754750 754211 752999 751494 750734 751220 752464 753953 755965 759061
59177 759061 763227 768007 773116 778437 783613 788239 792397 796464 800304 803093 804196 803915 803128 802302 801190
59162H01190j749k233k244k029j947j983k012k231k786l126k371n85R47J075P3
59147G77989q57r85n67k41l52p30q44l68K03k6j122k012j800q59mP17J544J885
59129G71571R31q07j718j076J97R31J008R36R69J153J626K465L567M819N949O334
59113G98855N739N151N834P335P735O335M838M963O124O670O446O458O602N660
59099H84745L638K221K322K607J497n15j722j715j653k340l295l972m744o062
59085H71012p408p938p704p457p271o333m339k420k034l293m966n930o098n931
59071G91890n707n415m927l942k176Q0J866K413K029J735K075K698L151L612M462
59056G93844N336N203L626J666J043K391M680O471P343P849Q441Q959R103Q849
$$ plain form
59162 801190 799441 797208 794964 792935 790988 789005 786993 784762 781976 778850 776479 775894 776841 777916 777989
59147 777989 777132 776147 775580 775339 774987 774257 773413 773045 773248 773222 772100 770088 768288 767429 767425 768142 769686 771571
59129 771571 772502 771695 769977 768901 769098 770029 771037 771973 772942 774095 775721 778186 781753 786572 792521 798855
59113 798855 804594 809745 815579 822914 830649 836984 841822 846785 852909 859579 866025 872483 879085 884745
59099 884745 888383 890604 892926 895533 897030 896515 894793 893078 891425 889085 885790 881818 877074 871012
59085 871012 863604 855666 847962 840505 833234 826901 822562 820142 818108 814815 809849 803919 797821 791890
59071 791890 786183 780768 775841 771899 769723 769803 771669 774082 776111 777846 779921 782619 785770 789382 793844
59056 793844 799180 804383 808009 809675 810718 813109 817789 824260 831603 839452 847893 856852 865955 874804
59042H74804Q292P415O225M968M033L701L851L894L149J597J40k51M13J206J400
59027I24837J059N44q9r62j908k465k250j411p33j172k892m851n776n580n355
59012H90996n964p161q160q446p763o025l852k648l438n655p651q284p610o239
58998H02100m710l582l400m052m448l398r86J241J756P13k50nP13M66o15o67J416
58981G82292M237N402M462L370L972N861P130O666N178M194M596O142P887Q839
58967H60228Q552P455O620O940Q284R569R773Q968Q290Q802J0353J1630J1475
58954I76939J0119Q908Q758R153Q934P719O093M718L856L627L991M303L842L096
58940A064056L548N554P248O602M104K307K892N130P200Q117Q116P900P779P386
$$ plain form
59042 874804 883096 890511 896736 901704 905737 909438 913289 917183 920332 921929 922069 921818 922231 923437 924837
59027 924837 925896 926440 926351 925389 923481 921016 918766 917355 916622 915450 912558 907707 901931 896351 890996
59012 890996 885032 877871 869711 861265 853502 847477 843625 840977 837539 831884 824233 815949 808339 802100
58998 802100 797390 793808 790408 786356 781908 778510 777524 778765 780521 781234 780984 780979 781692 782158 781543 780876 782292
58981 782292 786529 791931 796393 799763 803735 809596 816726 823392 828570 832764 837360 843502 851389 860228
58967 860228 868780 876235 882855 889795 898079 907648 917421 926389 934679 943481 953834 965464 976939
58954 976939 987058 995966 1004724 1013877 1022811 1030530 1036623 1041341 1045197 1048824 1052815 1057118 1060960 1064056
58940 1064056 1067604 1073158 1080406 1087008 1091112 1093419 1096311 1101441 1108641 1116758 1124874 1132774 1140553 1147939
58926A147939O275N052N298P684J0730J2405J2553J2626J3333J4054J4531J5535
58914A278015J7510J9918K2384K5087K7514K8284K7144K5791K5673K6130K5841
58903A549291K5108K5294K6616K7911K8183K7297K5451K2949K0379J8192J6344
58892A813015J4801J3764J2928J1389R060P157O230M962K394J28K52J830J859
58879A899769l97k532k889l013n082q742j1876j3378j3910j4622j6187j8536k0651
58866A767954k1200k0049j8602j7949j7378j5497j2380r640q465q398q072o758
58854A603566m919l459k526j361N28K578M118N615P920J0559J2162J2716J3955
58841A661452J6741J9386J9620J7407J4698J2987J2128J1200R537P074M399K338
$$ plain form
58926 1147939 1154214 1159266 1164564 1172248 1182978 1195383 1207936 1220562 1233895 1247949 1262480 1278015
58914 1278015 1295525 1315443 1337827 1362914 1390428 1418712 1445856 1471647 1497320 1523450 1549291
58903 1549291 1574399 1599693 1626309 1654220 1682403 1709700 1735151 1758100 1778479 1796671 1813015
58892 1813015 1827816 1841580 1854508 1865897 1874957 1882114 1888344 1893306 1895700 1895828 1896080 1897910 1899769
58879 1899769 1899372 1896840 1893951 1890938 1885856 1877114 1865238 1851860 1837950 1823328 1807141 1788605 1767954
58866 1767954 1746754 1726705 1708103 1690154 1672776 1657279 1644899 1635259 1626794 1618396 1610324 1603566
58854 1603566 1598647 1595188 1592662 1591301 1591829 1594407 1598525 1604140 1612060 1622619 1634781 1647497 1661452
58841 1661452 1678193 1697579 1717199 1734606 1749304 1762291 1774419 1785619 1795156 1802230 1806629 1808967
58829A808967R75n05k517m171m543m267m842o535q139q903r655j1577j4617j7567
58815A712104j9275j9533j9095j9027j9678k0273j9906j8916j8582j9330j9974
58804A498515j9256j7523j6168j5774j5703j5353j4924j4670j4309j3683j3239
58793A327913j3078j2293j0362q747r485j2023j3219j1322q405p534q730r502
58781A203213q612p198o324n563m494l842m252n213o051o794p365p039n671m388
58767A120407m089m123l409k031p21L35J095R26l86j551j217L6N13j03o44p04
58751A104334j300k963m664n258m946m700n082o068p286q035p783p027o930p811
58737A024481q738q907q632q489q295p690p051p084p801q524q685q083o631m457
$$ plain form
58829 1808967 1809942 1809437 1806920 1802749 1798206 1793939 1789097 1782562 1774423 1765520 1755865 1744288 1729671 1712104
58815 1712104 1692829 1673296 1654201 1635174 1615496 1595223 1575317 1556401 1537819 1518489 1498515
58804 1498515 1479259 1461736 1445568 1429794 1414091 1398738 1383814 1369144 1354835 1341152 1327913
58793 1327913 1314835 1302542 1292180 1283433 1273948 1261925 1248706 1237384 1228979 1221445 1212715 1203213
58781 1203213 1194601 1187403 1181079 1175516 1171022 1167180 1162928 1157715 1151664 1144870 1137505 1130466 1124795 1120407
58767 1120407 1116318 1112195 1108786 1106755 1106034 1106369 1107464 1108390 1108004 1106453 1105236 1105272 1105785 1105682 1105038 1104334
58751 1104334 1103034 1100071 1095407 1090149 1085203 1080503 1075421 1069353 1062067 1054032 1046249 1039222 1032292 1024481
58737 1024481 1015743 1006836 998204 989715 981420 973730 966679 959595 951794 943270 934585 926502 919871 915414
58723I15414k219q67q99j938k993l237k744k430k895l474l023j665r44j813l298
58708H80975l880l549l458l881l735k470j354k035m331o371o802n985m809l308
58694H25007j161J018J992J501N79J26R3L57J300K748L336K146M14K53J934L667
58678H45310M117L863M037M777N617O436P203P382O398M469K559J667K286M018
58664I10139N516N388L679J953J601K414L181L232L049L673N697Q455J0097R163
58650I77237O296L648K423J867J036K76L7n20k281m248m526l128k269l606o398
58635I65844q785r915j0169j0098r913r699r601r729j0063j0340j0183r482q507
58622H39360p436o083m563l796m500n849o012m238j757l78p00j807k264j260P26
$$ plain form
58723 915414 913195 912328 911429 909491 906498 903261 900517 898087 895192 891718 888695 887030 886086 884273 880975
58708 880975 877095 873546 870088 866207 862472 860002 858648 856613 852282 845911 839109 833124 828315 825007
58694 825007 823846 824864 826856 828357 828936 829062 829155 829512 830812 833560 836896 839042 839456 839709 841643 845310
58678 845310 849427 853290 857327 862104 867721 874157 881360 888742 895140 899609 902168 903835 906121 910139
58664 910139 915655 921043 924722 926675 928276 930690 933871 937103 940152 943825 949522 957977 968074 977237
58650 977237 983533 987181 989604 991471 992507 992783 992820 992300 990019 985771 981245 978117 975848 972242 965844
58635 965844 957059 947144 936975 926877 916964 907265 897664 887935 877872 867532 857349 847867 839360
58622 839360 831924 825841 821278 817482 812982 807133 801121 796883 795126 794748 794048 792241 789977 788717 789443
58607G89443K285K448J717J259J400J620J799K327K770J737j191m283n301l914
58593G94116j861j105k282m514o162o093m753l643l484l461k743j894j952k685
58579G47484k915k171j073j54N68R56P33L46P50K030L080L146K818K917L159K672
58563G64346J391J28m33j31J026K745L996L597J721K44R18L399N606O004M923
58548G99480L621K737K250K323L171M078L646J602m85r89k44J32m64j056p67M8
58532H19083P51J499K666L729L630K238Q28Q23K206L491L380K362K235L824N833
58517H58578O514O007N936O937P867P789P351P479P900Q036Q491J0179J2584J4287
58503I75935J5081J6075J7557J8320J7631J6553J6364J6630J5974J4160J2193
$$ plain form
58607 789443 791728 794176 795893 797152 798552 800172 801971 804298 807068 808805 807614 803331 798030 794116
58593 794116 792255 791150 788868 784354 778192 772099 767346 763703 760219 756758 754015 752121 750169 747484
58579 747484 744569 742398 741325 741171 741739 742695 743428 743774 744524 746554 749634 752780 755598 758515 761674 764346
58563 764346 765737 765865 765432 765301 766327 769072 773068 776665 778386 778630 779548 782947 788553 794557 799480
58548 799480 803101 805838 808088 810411 813582 817660 821306 822908 822423 821434 821190 821322 820858 819802 819035 819083
58532 819083 819834 821333 823999 827728 831358 833596 834424 835247 837453 840944 844324 846686 848921 852745 858578
58517 858578 865092 871099 877035 883972 891839 899628 906979 914458 922358 930394 938885 949064 961648 975935
58503 975935 991016 1007091 1024648 1042968 1060599 1077152 1093516 1110146 1126120 1140280 1152473
58492A152473J0593Q784O490M677M357M939M560K175j218l662m298m006m154n194
58478A176516o612p822q674r195r414r587j0209j1483j2835j3352j2753j1729
58466A052851j1165j1077j0693r635q559q122p574n352j370K131K881J264k59
58453I85321l33j71j459l738m807l465r94L01m26j908k414j685r72j377k531l060
58437I56282k138k75J261J556P25k26k71O41J623K119K795M574O976Q279P600
58422I91521O165N868O999Q054P772O733O566P915R712J0583J0444J0176J0088
58409A098596R533Q231O984O535O412N761M755M144L800K910J586R65J427J845
58395A163484J299N61J056K859M558M811L478J410l29j076q87l61j30m81j230
$$ plain form
58492 1152473 1163066 1171850 1178340 1183017 1187374 1192313 1196873 1199048 1197830 1194168 1189870 1185864 1181710 1176516
58478 1176516 1169904 1162082 1153408 1144213 1134799 1125212 1115003 1103520 1090685 1077333 1064580 1052851
58466 1052851 1041686 1030609 1019916 1010281 1001722 993600 986026 980674 979304 981435 984316 985580 985321
58453 985321 984988 984817 983358 979620 974813 971348 970354 970655 970229 968321 965907 964222 963250 961873 959342 956282
58437 956282 954144 953869 955130 956686 957411 957185 956914 957555 959178 961297 964092 968666 975642 983921 991521
58422 991521 997686 1003554 1010553 1018607 1026379 1033112 1039678 1047593 1057305 1067888 1078332 1088508 1098596
58409 1098596 1108129 1116360 1123344 1129879 1136291 1142052 1146807 1150951 1154751 1157661 1159247 1160212 1161639 1163484
58395 1163484 1164783 1165344 1166400 1169259 1173817 1178628 1182106 1183516 1183187 1182111 1181224 1180863 1180733 1180252 1179022
58380A179022j725j274j32K48j223l655m981m404k969j700m99P54J477J547J975
58365A162461L397M956N785O640Q612J1013J2016J1078R274P492N691M007L115
58352A255537L085K859J437r43l050l657k407k74J021P00j46JJ077J806J776J937
58336A260759K917M162N125O219P898R588J0273R756Q828Q434Q975J0086J0880
58323A363900J0732J0035R791J0285J0624R950Q801Q654R994J1288J0465P468
58311A481987M686M298N820P257Q119R605J1808J2931J2269J1822J3302J5151
58299A599055J4795J2611J1202J1390J1659J1378J1792J3353J4567J4419J3801
58288A740022J3526J2824J0987Q945P953Q003Q630J0046J2376J4792J6418J7244
$$ plain form
58380 1179022 1177297 1176023 1175891 1176139 1174916 1171261 1166280 1161876 1158907 1157207 1156708 1157462 1158939 1160486 1162461
58365 1162461 1165858 1170814 1176599 1183239 1191851 1202864 1214880 1225958 1235232 1242724 1248415 1252422 1255537
58352 1255537 1258622 1261481 1262918 1261975 1258925 1255268 1252861 1252587 1253608 1254308 1254162 1254163 1255240 1257046 1258822 1260759
58336 1260759 1263676 1267838 1272963 1279182 1287080 1296668 1306941 1316697 1325525 1333959 1342934 1353020 1363900
58323 1363900 1374632 1384667 1394458 1404743 1415367 1425317 1434118 1442772 1452766 1464054 1474519 1481987
58311 1481987 1486673 1490971 1496791 1504048 1512167 1521772 1533580 1546511 1558780 1570602 1583904 1599055
58299 1599055 1613850 1626461 1637663 1649053 1660712 1672090 1683882 1697235 1711802 1726221 1740022
58288 1740022 1753548 1766372 1777359 1786304 1794257 1802260 1810890 1820936 1833312 1848104 1864522 1881766
58276A881766J7463J7097J6926J8307K1122K3321K3652K3431K4328K5778K6281
58265B119472K5979K6052K6417K6057K5089K4663K4970K5131K4909K4920K5180
58254B398839K5015K4627K5205K7079K9036L0032L0557L1662L3460L5250L6683
58243B727445L8118L9855M1452M2089M1719M1508M2690M5142M7721M9848N1792
58232C209379N3330N3513N2374N1697N3170N6546O0310O3348O5279O6288O7543
58221C852777P0679P5765Q0730Q4020Q6805R1118R6793J01908J05792J09754J14964
58210D871105J21137J27402J33310J38791J44025J49423J55226J61434J68383
58201F170236J76573J85367J93069J99336K06318K16078K27951K39853K51191
$$ plain form
58276 1881766 1899229 1916326 1933252 1951559 1972681 1996002 2019654 2043085 2067413 2093191 2119472
58265 2119472 2145451 2171503 2197920 2223977 2249066 2273729 2298699 2323830 2348739 2373659 2398839
58254 2398839 2423854 2448481 2473686 2500765 2529801 2559833 2590390 2622052 2655512 2690762 2727445
58243 2727445 2765563 2805418 2846870 2888959 2930678 2972186 3014876 3060018 3107739 3157587 3209379
58232 3209379 3262709 3316222 3368596 3420293 3473463 3530009 3590319 3653667 3718946 3785234 3852777
58221 3852777 3923456 3999221 4079951 4163971 4250776 4341894 4438687 4540595 4646387 4756141 4871105
58210 4871105 4992242 5119644 5252954 5391745 5535770 5685193 5840419 6001853 6170236
58201 6170236 6346809 6532176 6725245 6924581 7130899 7346977 7574928 7814781 8065972
58192H065972K62803K74934K87168K99776L13469L28273L44142L61905L81959
58183A0920401M02844M22976M43108M65219M89722N15698N43166N73022O05345
58174A5381501O39872O77525P19326P64457Q11574Q61316R15314R73619J035671
58165B2780175J102962J177982J261149J351171J447467J549690J656580J768859
58157C4096035J891960K032300K192281K372710K577819K812798L078400L373736
58149E4428039L702264M068276M470316M908044N395999N962241O633896P430100
58141I6999175Q355225R367489J0347555J1137553J1657196J1989453J2334053
58134A72187699J2869808J3661193J4672905J5832326J7060288J8254171J9243054
$$ plain form
58192 8065972 8328775 8603709 8890877 9190653 9504122 9832395 10176537 10538442 10920401
58183 10920401 11323245 11746221 12189329 12654548 13144270 13659968 14203134 14776156 15381501
58174 15381501 16021373 16698898 17418224 18182681 18994255 19855571 20770885 21744504 22780175
58165 22780175 23883137 25061119 26322268 27673439 29120906 30670596 32327176 34096035
58157 34096035 35987995 38020295 40212576 42585286 45163105 47975903 51054303 54428039
58149 54428039 58130303 62198579 66668895 71576939 76972938 82935179 89569075 96999175
58141 96999175 105354400 114721889 125069444 136206997 147864193 159853646 172187699
58134 172187699 185057507 198718700 213391605 229223931 246284219 264538390 283781444
58127B83781444J9737455J9323725J7569946J4233513R439843L689881k313829
58120C65461978p900236j2593953j6167390j8606343k0032717k0624517k0562111
58113B48974711k0006444j9095155j7943651j6648264j5289482j3931277j2618770
58106A33441668j1380934j0237091r199403q270573p444310o710639o059703n481171
58098F8657844m964190m500189m084186l712333l379868l082195k815961k577905
58090C9541017k364263k172164k000207j846702j708619j583063j468627j364607
58082B5032765j270069j184400j107471j038363r75017r16124q62422q14877p72270
58073A6091752p31763o91688o52674o16031n82022n50241n20876m94592m71159
$$ plain form
58127 283781444 303518899 322842624 340412570 354646083 364085926 367775807 365461978
58120 365461978 357561742 344967789 328800399 310194056 290161339 269536822 248974711
58113 248974711 228968267 209873112 191929461 175281197 159991715 146060438 133441668
58106 133441668 122060734 111823643 102624240 94353667 86909357 80198718 74139015 68657844
58098 68657844 63693654 59193465 55109279 51396946 48017078 44934883 42118922 39541017
58090 39541017 37176754 35004590 33004383 31157681 29449062 27865999 26397372 25032765
58082 25032765 23762696 22578296 21470825 20432462 19457445 18541321 17678899 16864022 16091752
58073 16091752 15359989 14668301 14015627 13399596 12817574 12267333 11746457 11251865 10780706
58064A0780706m49049m27049m05622l85931l67964l50816l34568l20376l08402
58055G430929k97175k85711k74822k65252k55834k44862k32500k20303k08931
58046E145539j97587j85503j72941j60962j50861j43341j37495j31296j23780
58037C741773j15948j08896j02427r6445r2063q9604q6941q2065p6287p2493p0831
58026B747773o8739o4902o0673n7437n5080n3392n2641n2140n0461m7739m5789
58015B138780m5258m4676m3069m1333m0040l8107l4972l2153l1035l0784l0059
58004A727294k9305k9433k9634k8406k5935k3647k2091k0989k0719k1919k3839
57993A451377k4738k3937k2222k0464j9012j8307j8729j9809k0544k0482j9799
$$ plain form
58064 10780706 10331657 9904608 9498986 9113055 8745091 8394275 8059707 7739331 7430929
58055 7430929 7133754 6848043 6573221 6307969 6052135 5807273 5574773 5354470 5145539
58046 5145539 4947952 4762449 4589508 4428546 4277685 4134344 3996849 3865553 3741773
58037 3741773 3625825 3516929 3414502 3318057 3225994 3136390 3049449 2967384 2891097 2818604 2747773
58026 2747773 2679034 2614132 2553459 2496022 2440942 2387550 2334909 2282769 2232308 2184569 2138780
58015 2138780 2093522 2048846 2005777 1964444 1924404 1886297 1851325 1819172 1788137 1757353 1727294
58004 1727294 1697989 1668556 1638922 1610516 1584581 1560934 1538843 1517854 1497135 1475216 1451377
57993 1451377 1426639 1402702 1380480 1360016 1341004 1322697 1303968 1284159 1263615 1243133 1223334
57982A223334j8666j7363j6611j6678j6537j5072j2874j1640j1979j3074j4319
57971A058521j5860j7376j7815j6918j5867j5737j6075j5717j4427j3121j2663
57960H86945j2882j2783j1713j0349j0182j1683j3408j3498j1692r217p168o004
57948G56366o129p608r238r341p855o531o584p247p254o610n964n156l645k007
57934F65197j704l273n494o712o399n228m071l401l489m606o583q435r025q296
57920E88481p392p188p224o630n553m895m855m783m431m342m693m705l685k098
57906E16007j071j246k383l663m163l583k715k679l469l859l038j613o92o49j351
57891D79833k799m743o182o071m388j998K94K076L114L468L547L587L254K291
$$ plain form
57982 1223334 1204668 1187305 1170694 1154016 1137479 1122407 1109533 1097893 1085914 1072840 1058521
57971 1058521 1042661 1025285 1007470 990552 974685 958948 942873 927156 912729 899608 886945
57960 886945 874063 861280 849567 839218 829036 817353 803945 790447 778755 769538 762370 756366
57948 756366 750237 742629 733391 724050 716195 709664 703080 695833 688579 681969 676005 670849 667204 665197
57934 665197 663493 660220 654726 648014 641615 636387 632316 628915 625426 620820 614237 605802 596777 588481
57920 588481 581089 573901 566677 560047 554494 549599 544744 539961 535530 531188 526495 521790 518105 516007
57906 516007 514936 513690 511307 507644 503481 499898 497183 494504 491035 487176 484138 482525 481833 481184 479833
57891 479833 477034 472291 466109 460038 455650 453652 453946 456022 459136 462604 466151 469738 472992 475283
57877D75283J167N50M78P02J431K842M101L860J958k04j220j081p63j025j916
57862D86163l097m173m812m748l891k576j712k210l976n822o687o579n936m677
57848D25267k665o73Q7o11j884k983l807m202l746k649j949k288l076l355l027
57833C88439k742k948l536m049l991l132j956j359j585j745q91N39Q56j086m377
57818C56437o586n984l297r15l76r84j195o99l17m42o48p98j355k304k750k067
57802C25720p22M34J099J421J598J841K135J880O15q14q66N27J606J161O6l22
57786C37379j14j59m98r23k086m433o584o480m054j386j45j50m62o30o49p10j178
57769C06738k094k722k489k116k697l826l954k731j642j999l449m718m831l381
$$ plain form
57877 475283 476450 477000 477478 478180 479611 482453 486554 490414 492372 492168 490948 489867 489104 488079 486163
57862 486163 483066 478893 474081 469333 465442 462866 461154 458944 454968 449146 442459 435880 429944 425267
57848 425267 422602 421929 422016 421405 419521 416538 412731 408529 404783 402134 400185 397897 394821 391466 388439
57833 388439 385697 382749 379213 375164 371173 368041 366085 364726 363141 361396 360505 361044 361900 360814 356437
57818 356437 349851 343867 340570 339655 339279 338295 337100 336401 336084 335642 334994 334196 332841 330537 327787 325720
57802 325720 324998 325432 326531 327952 329550 331391 333526 335406 336021 335207 334341 334868 336474 337635 337701 337379
57786 337379 337265 337106 336608 335685 333599 329166 322582 316102 312048 310662 310517 310367 309905 309275 308626 307916 306738
57769 306738 304644 301922 299433 297317 294620 290794 286840 284109 282467 280468 277019 272301 267470 264089
57755B64089q20J243J243l55j462j125o72j490l018l861l728l270k799k188j451
57740B40336o17M23J417J742J407J136J071M64o55q85M23J722J354O2j63R89K013
57723B52239J887R79o1p37k39J954M852O629O565N327L493J128j243k757l501
57708B76515m375n414n519m257k647j679j177p58p83j523k225j937p82K28L58
57693B44025k81r37p76L52J581J881J344J006J519K593L703M397L963K031k35
57678B66166q03Q34K884L410K330P84m29j059j004n80m76p89p61l6O60P40O09
57661B72480O01Q0j390k986l801m101m378m207l486l595n464p365o880m693l936
57646B16879n612p112o037l421j858k126l046l448k945j537K31J266J172R16J351
$$ plain form
57755 264089 263269 264512 265755 265400 263938 262813 262141 260651 257633 253772 250044 246774 243975 241787 240336
57740 240336 239719 240142 241559 243301 244708 245844 246915 247379 246724 245839 246262 247984 249338 249400 249237 250226 252239
57723 252239 254126 255105 255044 254307 254068 256022 260874 267503 274068 279395 282888 284016 282773 280016 276515
57708 276515 272140 266726 261207 256950 254303 252624 251447 250689 249906 248383 246158 244221 243439 243667 244025
57693 244025 243744 242807 242031 242383 243964 245845 247189 248195 249714 252307 256010 260407 264370 266401 266166
57678 266166 265363 266197 269081 272491 274821 275605 275176 274117 273113 272533 272057 271268 270507 270471 271131 271871 272480
57661 272480 273081 273161 271771 268785 264984 260883 256505 252298 248812 245217 239753 232388 225508 220815 216879
57646 216879 211267 204155 198118 194697 192839 190713 187667 184219 181274 179737 179968 181234 182406 183322 184673
57631A84673J698O73j382k829k978k691k662k314j012O41J432J147P86J325K713
57616A79220M272N637O954Q294R324R923J0608J1857J3265J4073J4345J4598J4188
57603C16558J1330N442j434o579r298j0822j2137j3172j3875j4588j5101j4394
57591B21930j1946q641n991m824m878n204m955m185l787m108m020k365L7J215
57577A58278R30R79K196K998K043O19O18J432J052m28r00J71O75q65k928l267
57561A63603k029j162j477j874j329m10m25j744l362m126m092m199m530l731j077
57546A28036J665J980K8j540j457j397k775m109l454j756j425k456k544r11M19
57531A08304k46j928k715k349j957k177k622k721k365j844j516j398j134p15q27
$$ plain form
57631 184673 186371 187044 185662 182833 179855 177164 174502 172188 171176 171817 173249 174396 175182 176507 179220
57616 179220 183492 189129 196083 204377 213701 223624 234232 246089 259354 273427 287772 302370 316558
57603 316558 327888 333330 331896 325317 316019 305197 293060 279888 266013 251425 236324 221930
57591 221930 209984 201343 195352 190528 185650 180446 175491 171306 167519 163411 159391 157026 157063 158278
57577 158278 159208 160187 162383 165381 167424 168043 168661 170093 171145 170717 169817 169988 170663 169798 166870 163603
57561 163603 161574 160412 158935 157061 155732 155322 154897 153153 149791 145665 141573 137374 132844 129113 128036
57546 128036 129701 131681 131709 130169 128712 127315 124540 120431 116977 115221 113796 111340 108796 107885 108304
57531 108304 108058 106130 103415 101066 99109 96932 94310 91589 89224 87380 85864 84466 83332 82617 81790
57516H1790j796k599k051o81j05n99q51l25j65j100k069j954j361j447j999j934
57500F0754j005J80J229J990K096J591J489K499L631L360J942J273K239L463L178
57485H9909J585N64J231K442K123N1j446k51K606L982K533J02j139j230j243j192
57469A00627n93K1j43o36m86P8J44k61m76o64j377k116k062j754k247k812j692
57452H3551P55J943O21j437k190j963k175k938l241k442n53K078M357M739K970
57437H4075Q24K9J53m46k115l505l458k407j719k112k770k143N8J905J206j671
57421F5904l942l622j461N25J165K81j807l975m608l371j845j550k094k118j191
57406C6291Q7J017R12o07k552k851r44J042J008l12r59r87j903l481l661j812
$$ plain form
57516 81790 79994 77395 75344 74663 74558 73959 73108 72783 72618 71518 69449 67495 66134 64687 62688 60754
57500 60754 59749 59929 61158 63148 65244 66835 68324 70823 74454 77814 79756 81029 83268 86731 89909
57485 89909 91494 92058 93289 95731 97854 97905 96459 96208 98814 102796 105329 105431 104292 103062 101819 100627
57469 100627 100034 100055 99912 99276 98790 98868 99012 98751 98275 97611 96234 94118 92056 90302 88055 85243 83551
57452 83551 84306 86249 86870 85433 83243 81280 79105 76167 72926 70484 69931 72009 76366 81105 84075
57437 84075 84899 84928 85081 84635 82520 79015 75557 73150 71431 69319 66549 64406 64464 66369 67575 65904
57421 65904 61962 58340 56879 57404 58569 58850 57043 53068 48460 45089 43244 41694 39600 37482 36291
57406 36291 36378 37395 38307 37700 35148 32297 31353 32395 33403 33091 32132 31145 29242 25761 22100 20288
57390B0288J36N35K13R12K739M136L700J528p47j099R01L208L235P59j977k990
57374C5477k382j349o87p16j570k840l541l011j463M13J899K429K077J707J790
57359B8233J373n80l002l544j821j46k93j149o91J035K281K142J289O06K90J88
57343B6211J09j80o58q34l25N94J310J524J278Q00N11O60O58m22k299l315k428
57326B3194n38Q73J603K214K504J844O13J4L89Q73Q03M84L68L09J21J46P98J847
57308C8459K569K503J832J136P55M69j15r58j640j952k027j806j040KN25K84k4
57291C8972P4k7r27j874j451N75K908M076L682K413J363J145J372J271Q48Q49
57275E5269J323J256J74r81j385j569k008j656L80K641K775Q25q94j123p93p46
$$ plain form
57390 20288 20424 20959 21172 22084 24823 28959 32659 34187 33440 32341 33242 36450 39685 40444 38467 35477
57374 35477 33095 31746 31059 30343 28773 25933 22392 19381 17918 18331 20230 22659 24736 26443 28233
57359 28233 29606 29026 26024 22480 20659 20513 20220 19071 18380 19415 21696 23838 25127 25733 26023 26211
57343 26211 26320 26140 25482 24648 24323 24917 26227 27751 29029 29829 30340 31000 31658 31236 28937 25622 23194
57326 23194 22656 23529 25132 27346 29850 31694 32307 32321 32710 33583 34386 34870 35238 35547 35668 35814 36612 38459
57308 38459 41028 43531 45363 46499 47254 47723 47608 46650 45010 43058 41031 39225 38185 38187 38712 38996 38972
57291 38972 39046 39019 38092 36218 34767 35342 38250 42326 46008 48421 49784 50929 52301 53572 54420 55269
57275 55269 56592 57848 58022 57041 55656 54087 52079 50423 50803 53444 56219 57044 56150 55027 54234 53488
57259E3488l73Q33K107K578K300J524L42m73K69K392M312N356O533Q137Q538O660
57243A04523M023K665K404J936J369J653K323K084J182J091J984K535K428L076
57229A35276N326Q056R664R726Q687P076N645N186N602N922N665N448N965P110
57215B30354Q444R624J0171R678Q634Q223Q929J0107J1057J1530J1041R066O615
57202C53473O198R125J3561J6298J5952J3704J1576J0797J1205J1453J0277Q239
57190D91858P453Q846J0636J0656R206Q109P785P099N857N289N861O541O939Q247
57176F00382J0896J2831J1810Q636O408O801Q494R337Q825Q089Q325R783J1789
57163G22406J3333J4002J4609J6498J9851K3041K4277K3735K3490K5172K8194
$$ plain form
57259 53488 53115 53948 56055 58633 60933 62457 62799 62326 62595 64987 69299 74655 81188 89325 97863 104523
57243 104523 108546 111211 113615 115551 116920 118573 120896 122980 124162 125253 127237 129772 132200 135276
57229 135276 140602 148658 158322 168048 176735 183811 189456 194642 200244 206166 211831 217279 223244 230354
57215 230354 238798 248422 258593 268271 276905 285128 294057 304164 315221 326751 337792 346858 353473
57202 353473 359671 368796 382357 398655 414607 428311 439887 450684 461889 473342 483619 491858
57190 491858 499311 508157 518793 529449 538655 546764 554549 561648 567505 572794 578655 585196 592135 600382
57176 600382 611278 624109 635919 644555 650963 657764 666258 675595 684420 692509 700834 710617 722406
57163 722406 735739 749741 764350 780848 800699 823740 848017 871752 895242 920414 948608
57152I48608L0709L1859L2373L3053L3568L3320L2877L3597L5806L8047L8414
57141A322231L6282L2562K8724K5886K4476K4180K4131K3557K2453K1559K1514
57130A607555K2139K2688K2843K3096K3975K5101K5522K5056K4700K5409K7011
57119A875095K8724L0238L1542L2153L1484L0017K9085K9241K9643K9427K8898
57108B205547K8827K9189K9345K9106K8944K9236K9714K9568K7854K4238J9672
57097B511240J5939J3931J2717J0793P839M585J326k338o315r733j2318j5284
57085B532382k0058k6440l2643l7342m1252m6472n4238o3600p2546q0344q8163
57074A969284r7319j07794j19105j31775j46508j62143j76110j87564j98952k13506
$$ plain form
57152 948608 979317 1011176 1043549 1076602 1110170 1143490 1176367 1209964 1245770 1283817 1322231
57141 1322231 1358513 1391075 1419799 1445685 1470161 1494341 1518472 1542029 1564482 1586041 1607555
57130 1607555 1629694 1652382 1675225 1698321 1722296 1747397 1772919 1797975 1822675 1848084 1875095
57119 1875095 1903819 1934057 1965599 1997752 2029236 2059253 2088338 2117579 2147222 2176649 2205547
57108 2205547 2234374 2263563 2292908 2322014 2350958 2380194 2409908 2439476 2467330 2491568 2511240
57097 2511240 2527179 2541110 2553827 2564620 2572459 2577044 2578370 2576032 2569717 2559984 2547666 2532382
57085 2532382 2512324 2485884 2453241 2415899 2374647 2328175 2273937 2210337 2137791 2057447 1969284
57074 1969284 1871965 1764171 1645066 1513291 1366783 1204640 1028530 840966 642014 428508
57064D28508A96574e5815k73225k94609l17715l43168l70807m00447m32610m68499
57054b956895n09340n55624o07210o64204p27406p97711q75566r61425j056447
57045i711828j162269j280459j412733j561622j730473j922865k142339k392309
57037b3316897k675475k992991l344160l726205m133502m557186m986157n408334
57029e5140907n810621o178865o500018o764215o960849p067805p042305o824044
57021a08289629o352938n592755m548548l269616j837590l46256J117079K482062
57013a26638191L697878M732282N570077O210947O665819O952280P090351P099589
57005g8618968O997865O801639O526653O188324N801793N381994M943504M499796
$$ plain form
57064 428508 196574 -55815 -329040 -623649 -941364 -1284532 -1655339 -2055786 -2488396 -2956895
57054 -2956895 -3466235 -4021859 -4629069 -5293273 -6020679 -6818390 -7693956 -8655381 -9711828
57045 -9711828 -10874097 -12154556 -13567289 -15128911 -16859384 -18782249 -20924588 -23316897
57037 -23316897 -25992372 -28985363 -32329523 -36055728 -40189230 -44746416 -49732573 -55140907
57029 -55140907 -60951528 -67130393 -73630411 -80394626 -87355475 -94423280 -101465585 -108289629
57021 -108289629 -114642567 -120235322 -124783870 -128053486 -129891076 -130237332 -129120253 -126638191
57013 -126638191 -122940313 -118208031 -112637954 -106427007 -99761188 -92808908 -85718557 -78618968
57005 -78618968 -71621103 -64819464 -58292811 -52104487 -46302694 -40920700 -35977196 -31477400
56997c1477400M062404L640696L242169K872524K535453K232520J963346J726122
56989i202166J518485J338224J182947J049042R31770Q27282P34345O53242c83764
56979A37104M63765M10933L63168L20967K83766K50804K21875J96803J74494J53097
56969B976776J31432J10121R0880P4646O0882M8823L8653L0682K3965J6793Q434
56958C612087n34r673j9339k9679m0088n0290o1036p2971q5345r6703j06421j14867
56946B925141j22432j29083j34626j38774j41143j41647j40660j38360j34428
56937A703988j28903j22733j16633j10016j02079r3562q6123q0037p3879o6667
56927G23356n9064n2012m5407l8824l2629k7555k3795k1187j9729j9087j8247
$$ plain form
56997 -31477400 -27414996 -23774300 -20532131 -17659607 -15124154 -12891634 -10928288 -9202166
56989 -9202166 -7683681 -6345457 -5162510 -4113468 -3181698 -2354416 -1620071 -966829 -383764
56979 137104 600869 1011802 1374970 1695937 1979703 2230507 2452382 2649185 2823679 2976776
56969 2976776 3108208 3218329 3309209 3383855 3444737 3493560 3532213 3562895 3586860 3603653 3612087
56958 3612087 3611553 3601880 3582541 3552862 3512774 3462484 3401448 3328477 3243132 3146429 3040008 2925141
56946 2925141 2802709 2673626 2539000 2400226 2259083 2117436 1976776 1838416 1703988
56937 1703988 1575085 1452352 1335719 1225703 1123624 1030062 943939 863902 790023 723356
56927 723356 664292 612280 566873 528049 495420 467865 444070 422883 403154 384067 365820
56916C65820j6579j4955j4735j5744j6163j4633j1725r015p204n660l547r90J039
56903B35909J783J535J318J783K635L131K940K397K102K425L179L616K856O12
56889B68221k455n150o546o546n792n065m669m397m051l583k550r2L846P626R272
56874B38069Q748P972Q283Q983Q693P161M886J929j828n664q496j0157j1279j2040
56860B45260j1985j1320j1265j2594j4356j4748j3027j0172p733o337n476m515
56848A21732l486k759k274j750j447j905k703k379k00K686M536M913M593M235
56834A23792M122M807O798R602J2018J3506J4514J5453J6147J6314J5782J4218
56822B67073J1527Q629O892O513O253N076L308J927J528K222L794N581O925Q032
$$ plain form
56916 365820 349241 334286 319551 303807 287644 273011 261286 252271 245067 239407 235860 234870 235909
56903 235909 237692 239227 240545 242328 244963 248094 251034 253431 255533 257958 261137 264753 267609 268221
56889 268221 265766 260616 254070 247524 241732 236667 231998 227601 223550 219967 217417 217325 221171 228797 238069
56874 238069 246817 254789 263072 272055 280748 287909 292795 294724 292896 287232 278736 268579 257300 245260
56860 245260 233275 221955 210690 198096 183740 168992 155965 145793 138060 131723 126247 121732
56848 121732 118246 115487 113213 111463 110016 108111 105408 103029 102829 105515 110051 114964 119557 123792
56834 123792 127914 132721 139519 149121 161139 174645 189159 204612 220759 237073 252855 267073
56822 267073 278600 287229 294121 300634 306887 311963 315271 317198 318726 320948 324742 330323 337248 345280
56808C45280R651J1683J3108J3613J4243J5787J7586J8673J9195J9684J9671J8078
56796E36252J4544R604M172m96l136l898m618o393p642o136k408P71K164L273
56782E36053N469Q040J0056J2314J5965K0366K3927K6362K8461L0048K9686K6521
56770G73268K1174J4550O949j215q666j4023j6987j8378j9273k0277k1221k1219
56758F74682j9336j5532j0793o174k022J693M806P222R400J1941J4697J6800J7500
56745G04884J6581J4018R906M773o84o357j2496j8442k2476k3663k3102k2465
56733F20477k1789j9934j6927j4340j3026j1853r437o010k670L47L420N977O606
56720E20841M934K297J54j505l628o544r555j1929j3679j5191j6472j7140j7131
$$ plain form
56808 345280 354931 366614 379722 393335 407578 423365 440951 459624 478819 498503 518174 536252
56796 536252 550796 560400 564572 564076 560940 557042 552424 546031 538389 532253 529845 530616 532780 536053
56782 536053 541522 549562 559618 571932 587897 608263 632190 658552 687013 717061 746747 773268
56770 773268 794442 808992 815941 814726 806060 792037 775050 756672 737399 717122 695901 674682
56758 674682 655346 639814 629021 622847 620825 622518 627324 634546 643946 655887 670584 687384 704884
56745 704884 721465 735483 745389 750162 749478 743121 730625 712183 689707 666044 642942 620477
56733 620477 598688 578754 561827 547487 534461 522608 513171 507161 504491 504838 508258 514235 520841
56720 520841 525775 528072 528226 526721 523093 516549 506994 495065 481386 466195 449723 432583 415452
56707D15452j7040j7385j7800j7356j5758j3772j2377j1924j2140j2368j1608
56696B55924r112n576l124l258n120o581o727o376o318o233n567m492l465k630
56682A81345k167k513l557m127l178j239N4q4q54j142q89p74j006r90k08J055
56666A59726J993K131J582O96k04o82l77L06J65j437l321l452j364J116K005J358
56650A60241O91P86J085J074J086J369J318L80q64j342r29m40l33k25J21K52j44
56633A64126m99p6R19J579J469R39M72L39P96J965L264L630K661J186M16P76J739
56616A85701K453K346J429L08k59k0O24J187J434J235N54k17m66k25k99j117j905
56599A92763j556k6J679K729L106L128K909K311J181l65j729k132j477o16m28
$$ plain form
56707 415452 398412 381027 363227 345871 330113 316341 303964 292040 279900 267532 255924
56696 255924 246812 241236 238112 234854 229734 223153 216426 210050 203732 197499 191932 187440 183975 181345
56682 181345 179178 176665 173108 168981 165803 164564 164618 164534 163680 162538 161649 160875 159869 158879 158671 159726
56666 159726 161719 163850 165432 166128 165924 165242 164865 165171 165336 163899 160578 157126 155762 156878 158883 160241
56650 160241 160932 161718 162803 163877 164963 166332 167650 168030 167166 165824 164895 164455 164122 163897 164018 164270 164126
56633 164126 163627 163551 164470 166049 167518 168457 168929 169268 170064 172029 175293 178923 181584 182770 183186 183962 185701
56616 185701 188154 190500 191929 192237 191978 191958 192582 193769 195203 196438 196992 196775 196309 196084 195785 194668 192763
56599 192763 191207 191181 192860 195589 198695 201823 204732 207043 208224 207859 206130 203998 202521 201905 201477
56584B01477q66j274j298r49p9J437K996L412J994p41l444m772m171k406j212
56569A90104j783l505m556l809j825k7O77M83L02P43J321R86k90r80K25K629M310
56552A85005M422L788L481L905N094O741P748O986M752K446O56j168k818k800
56538B28238o18J822K389J348M85M01K93j98o09j082k373m055m251k053Q62K077
56522B22676J265P2m06p66j622j985l27L020N632N582L610K116K391L553M045
56507B48856L373K225J529J736K601L399L694L925M718N631N436L882K367K166
56493B95538K720K396O25j427k198j191O46J646Q30j074k262j804n45J80L9n29
56477B93590j194j600j113K97J432J176M5o41o60p73j060q83m04n68j307j380
$$ plain form
56584 201477 200611 199337 198039 197090 197011 198448 201444 204856 206850 206109 202665 197893 193722 191316 190104
56569 190104 188321 184816 180260 176451 174626 174599 175276 175759 176061 176804 178125 179111 178821 177841 178066 180695 185005
56552 185005 189427 193215 196696 200601 205695 212436 220184 227170 231922 234368 235024 233856 231038 228238
56538 228238 227620 229442 231831 233179 233664 234065 234358 234160 233551 232469 230096 226041 221790 219737 220599 222676
56522 222676 223941 224013 223607 222841 221219 219234 218907 221927 227559 233141 236751 238867 241258 244811 248856
56507 248856 252229 254454 255983 257719 260320 263719 267413 271338 276056 281687 287123 291005 293372 295538
56493 295538 298258 300654 301279 299852 297654 296463 297109 298755 299585 298511 296249 294445 293900 294080 294119 293590
56477 293590 292396 290796 289683 289980 291412 292588 292633 291992 291332 290559 289499 288616 288212 287644 286337 284957
56461B84957n42k53j332k292j324J051K722K761K071J530R48m9j160j836j915
56446B85337j621j417j772k538k682j333R57K716L288L243L029K277P94p03j542
56431B88033j946k236j924n99Q94J257L98p29j759k933l594k273R55L634L592
56416B80770J546r4k95N2K58P50J824K784L013K909L109L329K641O70j793l222
56400B98251k458J22K611L292K428J688J893K218J735P22j0j53L05J411K685L054
56384C19794K135R24M22K87k94j082j206o48j15K43Q44J499J418N38j69lN71O30
56366C25788j39j166j393j52J925L128K484R69Q7j58q32j965k517k409k794l855
56350C17001l980k120L27J200K55j041j692j867j820j394o32Q6O04J174K004L173
$$ plain form
56461 284957 284415 284162 282830 280538 279214 280265 282987 285748 287819 289349 290297 290248 289088 287252 285337
56446 285337 283716 282299 280527 277989 275307 273974 274931 277647 280935 284178 287207 289484 290278 289575 288033
56431 288033 286087 283851 281927 281328 282222 283479 283877 283148 281389 278456 274862 272589 273544 277178 280770
56416 280770 282316 282222 281927 281979 282237 282987 284811 287595 290608 293517 296626 299955 302596 303266 301473 298251
56400 298251 295793 295915 298526 301818 304246 305934 307827 310045 311780 312502 312492 312339 312644 314055 316740 319794
56384 319794 321929 322853 323275 323562 323268 322186 320980 320332 320217 320460 321304 322803 324221 324759 324590 324587 325158 325788
56366 325788 325649 324483 323090 322938 324863 327991 330475 331444 331531 331373 330541 328576 326059 323650 320856 317001
56350 317001 313021 310901 311228 312428 312683 311642 309950 308083 306263 304869 304237 304323 304927 306101 308105 311278
56334C11278M682O122O514N285L308K205K448K858K101J79j778k625j912qK117
56319C42774L502L887L602K850J611M29M67K042L571L115R86l19P40K716L177
56304C75150K007J226J799K266J198m74p66N81J982K297J813J077J12p73o05J039
56288C89929L145M297M095L024J490j46j024k81J699L259L186K084J519K075K765
56273D21116K628K110K272L011L176K592K634L967M888L485Q31J44K550N427N754
56258D66585L642J343Q5n18n46P00L031M841N058M680N350P016P993P163N236
56243E21659L675L170L531M391N276N346M092K334J652K484L607L905L931M925
56229E73978O955R026J0573J1730J2297J1698J0187R026R106J0217J1946J4303
$$ plain form
56334 311278 315960 322082 328596 333881 337189 339394 341842 344700 346801 346980 345202 342577 340665 340657 342774
56319 342774 346276 350163 353765 356615 358226 358655 359122 361164 364735 367850 368836 368517 369257 371973 375150
56304 375150 377157 378383 380182 382448 383646 383172 382406 382987 384969 387266 389079 390156 390268 389495 388890 389929
56288 389929 393074 397371 401466 404490 405980 405834 404810 404529 406228 409487 412673 414757 416276 418351 421116
56273 421116 423744 425854 428126 431137 434313 436905 439539 443506 448394 451879 452710 452854 455404 460831 466585
56258 466585 470227 471570 471655 471137 470591 471291 474322 479163 484221 488901 494251 501267 509260 516423 521659
56243 521659 525334 528504 532035 536426 541702 547048 551140 553474 555126 557610 561217 565122 569053 573978
56229 573978 580933 589959 600532 612262 624559 636257 646444 655470 664576 674793 686739 701042
56217G01042J6930J8598J8319J6609J5107J5255J7562K1494K5602K8347K9480
56206I24345L0236L1756L3799L5530L7031L9217M2545M6468N0231N3710N7489
56195A382357O2330O8515P5484Q2463Q9428R7049J05424J13522J20328J25975
56185B322875J31154J35812J39130J40490J39873J37406J32981J26204J16381
56176C522306J02900Q6023O7021M7035K6146M074j8525m0179n9890p7595r3331
56165C565985j06495j16319j22766j26737j29334j30916j30955j28891j24938
56156B448634j19763j13666j06765r9693r3247q7253q0869p4156o8183o3104n7530
56145A484405n0711m4065l9394l6565l4290l2262l0848k9339k6513k2873k0363
$$ plain form
56217 701042 717972 736570 754889 771498 786605 801860 819422 840916 866518 894865 924345
56206 924345 954581 986337 1020136 1055666 1092697 1131914 1174459 1220927 1271158 1324868 1382357
56195 1382357 1444687 1513202 1588686 1671149 1760577 1857626 1963050 2076572 2196900 2322875
56185 2322875 2454029 2589841 2728971 2869461 3009334 3146740 3279721 3405925 3522306
56176 3522306 3625206 3711229 3778250 3825285 3851431 3855505 3836980 3796801 3736911 3659316 3565985
56165 3565985 3459490 3343171 3220405 3093668 2964334 2833418 2702463 2573572 2448634
56156 2448634 2328871 2215205 2108440 2008747 1915500 1828247 1747378 1673222 1605039 1541935 1484405
56145 1484405 1433694 1389629 1350235 1313670 1279380 1247118 1216270 1186931 1160418 1137545 1117182
56134A117182j9564j8812j6674j3782j1378r430p328n542n187o235p244o946n509
56121I83551m004l099k539j779q00LO55J712L243M248L876K872K913M560O713
56106A002125Q218R144J0057J0858J1044J0750J0833J1868J3449J4649J5003J4845
56094A142843J4780J5139J6209J8540K2286K6405K9567L1989L5306M0039M4587
56083A437690M7593N0123N3785N7558N8382N4841M8558M1949L6308L2371L0847
56072A950005L1309L1784L0558K7758K4416K0819J6691J2424R008O735M652J415
56060B167574l522r523j5446k0686k5408k9759l3240l5323l6104l5744l3814l0204
56048A858801k6258k3652k2182j9927j5801j0780o315k748K15K602M313N433N975
$$ plain form
56134 1117182 1097618 1078806 1062132 1048350 1036972 1027542 1020214 1014672 1009485 1003250 996006 989060 983551
56121 983551 979547 976448 973909 972130 971330 971333 971988 973700 976943 981191 985067 987939 990852 995412 1002125
56106 1002125 1010343 1019487 1029544 1040402 1051446 1062196 1073029 1084897 1098346 1112995 1127998 1142843
56094 1142843 1157623 1172762 1188971 1207511 1229797 1256202 1285769 1317758 1353064 1393103 1437690
56083 1437690 1485283 1535406 1589191 1646749 1705131 1759972 1808530 1850479 1886787 1919158 1950005
56072 1950005 1981314 2013098 2043656 2071414 2095830 2116649 2133340 2145764 2154772 2161507 2166159 2167574
56060 2167574 2164052 2154529 2139083 2118397 2092989 2063230 2029990 1994667 1958563 1922819 1889005 1858801
56048 1858801 1832543 1808891 1786709 1766782 1750981 1740201 1733886 1731138 1731353 1733955 1738268 1743701 1749676
56035A749676O031O317P611R522J0898J1641J2778J4538J5870J6454J7501J9673
56023A898510K1719K2366K2203K2379K2719K2611K2676K3892K5762K6944K7235
56012B159016K7460K7931K8442K9448L1590L4252L6081L6912L7833L9365M0922
56001B529252M2095M3202M4361M5318M6339M8007M9858N0591N0203N0662N3513
55990C053401N7661O0527O0978O0209N9948O0609O1568O2751O5214O9737P5229
55979C747832P9445Q1613Q3513Q7250R2644R7822J01899J05860J10841J16624
55969D705343J22240J27218J31861J36765J42349J48513J54647J60266J65650
55960E994852J71616J78729J87031J96208K05618K14561K23118K32434K43510
$$ plain form
56035 1749676 1755707 1762024 1769635 1779157 1790055 1801696 1814474 1829012 1844882 1861336 1878837 1898510
56023 1898510 1920229 1942595 1964798 1987177 2009896 2032507 2055183 2079075 2104837 2131781 2159016
56012 2159016 2186476 2214407 2242849 2272297 2303887 2338139 2374220 2411132 2448965 2488330 2529252
56001 2529252 2571347 2614549 2658910 2704228 2750567 2798574 2848432 2899023 2949226 2999888 3053401
55990 3053401 3111062 3171589 3232567 3292776 3352724 3413333 3474901 3537652 3602866 3672603 3747832
55979 3747832 3827277 3908890 3992403 4079653 4172297 4270119 4372018 4477878 4588719 4705343
55969 4705343 4827583 4954801 5086662 5223427 5365776 5514289 5668936 5829202 5994852
55960 5994852 6166468 6345197 6532228 6728436 6934054 7148615 7371733 7604167 7847677
55951G847677K56026K68985K82197K96261L11354L27014L43030L59703L77288
55942A0669535L95943M16060M37740M59969M81520N02906N26495N54318N86387
55933A5030873O21489O58875O98893P42384P89780Q40531Q93580R48795J007659
55924B2232859J072045J142686J219589J303208J394061J491670J595418J706531
55916C3158067J827989J962630K112659K280778K470062K682546K919802L185448
55908E2599981L485436L825495M210087M644455N135358N688491O306916O993205
55900I2889424P751177Q584023R492922J0479934J1550757J2711615J3963216
55893A67423068J5297538J6695910J8122728J9513757K0758824K1675413K1982911
$$ plain form
55951 7847677 8103703 8372688 8654885 8951146 9262500 9589514 9932544 10292247 10669535
55942 10669535 11065478 11481538 11919278 12379247 12860767 13363673 13890168 14444486 15030873
55933 15030873 15652362 16311237 17010130 17752514 18542294 19382825 20276405 21225200 22232859
55924 22232859 23304904 24447590 25667179 26970387 28364448 29856118 31451536 33158067
55916 33158067 34986056 36948686 39061345 41342123 43812185 46494731 49414533 52599981
55908 52599981 56085417 59910912 64120999 68765454 73900812 79589303 85896219 92889424
55900 92889424 100640601 109224624 118717546 129197480 140748237 153459852 167423068
55893 167423068 182720606 199416516 217539244 237053001 257811825 279487238 301470149
55886C01470149K1316945J9324887J5825900J0945322N126480r97213o793669
55879C66218801j1785977j5715216j8521163k0280306k1138684k1262181k0811055
55872B36704219j9932344j8758560j7405409j5968498j4522007j3120234j1800644
55865A25196523j0586793r490541q513836p650764o890137o218426n622460n091319
55857F5132247m616811m192423l811896l469260l160208k882516k634342k412504
55849C7952287k213317k034527j875091j732989j604810j488079j382612j288476
55841B4332386j203711j125520j053182r88118r31065q80457q33947p90430p50026
55832A5775930p12680o77392o42666o07731n73498n42001n14318m89373m65349
$$ plain form
55886 301470149 322787094 342111981 357937881 368883203 374009683 373012470 366218801
55879 366218801 354432824 338717608 320196445 299916139 278777455 257515274 236704219
55872 236704219 216771875 198013315 180607906 164639408 150117401 136997167 125196523
55865 125196523 114609730 105119189 96605353 88954589 82064452 75846026 70223566 65132247
55857 65132247 60515436 56323013 52511117 49041857 45881649 42999133 40364791 37952287
55849 37952287 35738970 33704443 31829352 30096363 28491553 27003474 25620862 24332386
55841 24332386 23128675 22003155 20949973 19961855 19030790 18150333 17316386 16525956 15775930
55832 15775930 15063250 14385858 13743192 13135461 12561963 12019962 11505644 11016271 10550922
55823A0550922m41843m19667l99091l79752l62105l47120l34148l20827l06085
55814G240284k91877k80729k72547k64982k56100k45453k33319k20299k07463
55805D967515j95600j84416j73279j62519j53004j44726j36797j28704j20596
55796C567874j12503j04513r7675r3398r1439q9485q5494p9877p4799p1738p0211
55785B596742o8647o6046o2839o0306n9090n8389n6803n3917n0621m7866m5710
55774A966508m3699m1770m0285l9240l7848l5155l1245k7695k6431k7818l0126
55763A585196l1088k9901k7542k5568k4900k5367k5934k5493k3970k2519k2285
55752A300629k3147k4007k3998k2968k1169j9216j8053j8102j8436j7516j5011
$$ plain form
55823 10550922 10109079 9689412 9290321 8910569 8548464 8201344 7867196 7546369 7240284
55814 7240284 6948407 6667678 6395131 6130149 5874049 5628596 5395277 5174978 4967515
55805 4967515 4771915 4587499 4414220 4251701 4098697 3953971 3817174 3688470 3567874
55796 3567874 3455371 3350858 3253183 3159785 3068346 2978861 2893367 2813490 2738691 2666953 2596742
55785 2596742 2528095 2462049 2399210 2338904 2279814 2221425 2164622 2110705 2060084 2012218 1966508
55774 1966508 1922809 1881039 1840754 1801514 1763666 1728511 1697266 1669571 1643140 1615322 1585196
55763 1585196 1554108 1524207 1496665 1471097 1446197 1420830 1394896 1369403 1345433 1322914 1300629
55752 1300629 1277482 1253475 1229477 1206509 1185340 1166124 1148071 1129969 1111533 1094017 1079006
55741A079006j2248j0716j0566j0777j0402r450q713q714q834p931o035m680m824
55728I65116n214m048j881j234l234o279q539j0230j2310j4213j4488j3126j1698
55715H58622j1078j0290q180n424m145n707r341j2957j5033j5550j5337j5002
55703G30578j4683j4347j3829j2819j1319r886q833p538n429l488l606o107q913
55690F09781r736q398o467n327n258n836o459o637o247n431m263l025k757m436
55676E29504p269q859p803n321l620l511m397n526o256o070n570o451q966j0483
55662D39402q616n047l669n156o207m738k843l005m022l157o51P03j72j502j741
55647C89579j384j189o69N69J430N48j843m272n715o167o005n703n864o708p420
$$ plain form
55741 1079006 1066758 1056042 1045476 1034699 1024297 1014847 1006134 997420 988586 980655 974620 969940 965116
55728 965116 959902 955854 953973 952739 949505 943226 934687 924457 912147 897934 883446 870320 858622
55715 858622 847544 837254 829074 823650 819505 813798 804457 791500 776467 760917 745580 730578
55703 730578 715895 701548 687719 674900 663581 653695 644862 637324 631895 628407 624801 618694 609781
55690 609781 600045 591647 585180 579853 574595 568759 562300 555663 549416 543985 539722 536697 533940 529504
55676 529504 522235 513376 505573 500252 496632 493121 488724 483198 476942 470872 465302 458851 449885 439402
55662 439402 430786 425739 422070 416914 410707 405969 403126 400121 396099 392942 392291 392994 392822 391320 389579
55647 389579 388195 387006 386337 386906 388336 388884 387041 382769 377054 370887 364882 359179 353315 346607 339187
55632C39187o705m287j504j49p31j973k219j210k70n49j497j701j038r98k538
55617C11818m472m854l464j951j728k599l625m327m652m407l534k561k176k392
55603B65076k573k256j501n49L72Q33L35j041k463l137l090k817k403j487n5J152
55587B44396J352N75l62o47j20P36J206Q43j56j090j395j136q12q22j256k058
55571B39254k976l493l212k423j956k269k990l562l902m140m060l166j331R00
55557B00674K462K289J92k509l905l608l242m068m937l934j499p7n53j031OJ251
55541A77511P22j035j826j089l30n62j228j831k763m015m561l850k714j949j110
55526A49370L61J744J933J102L81K73L76M44O48Q59O11Op6R89K758M096M088K613
$$ plain form
55632 339187 332482 328195 326691 326542 325811 323838 321619 320409 320139 319590 318093 316392 315354 314356 311818
55617 311818 307346 302492 299028 297077 295349 292750 289125 284798 280146 275739 272205 269644 267468 265076
55603 265076 262503 260247 258746 258197 258569 259402 259737 258696 256233 253096 250006 247189 244786 243299 243244 244396
55587 244396 245748 246323 245961 245314 245194 245930 247136 247979 247823 246733 245338 244202 243390 242568 241312 239254
55571 239254 236278 232785 229573 227150 225194 222925 219935 216373 212471 208331 204271 201105 199774 200674
55557 200674 203136 205425 205617 203108 199203 195595 192353 188285 183348 179414 177915 177838 177285 176254 176260 177511
55541 177511 178233 177198 175372 174283 173953 173391 172163 170332 167569 163554 158993 155143 152429 150480 149370
55526 149370 149731 151475 153408 154510 154891 155164 155540 155984 156632 157491 158102 158108 158032 159021 161779 165875 169963 172576
55508A72576M21j295j793j379r89j217j946k711l071k732j781r22j062k425m139
55493A45535m844l871j949p75j496l480m857m485l074k075j947j929j233J16J404
55478A11040J769Q36p48j692j511j206j823k740k386o31Q02N38q17j775j812j364
55462I6480o69M58J816K605K230R60k47n59qN08J61q25j454j198n18J2M70J050
55444A01272J410J142N94M79P97Q81N25L80Q61J214L21j704l274k947r21J356
55428A02386K862L623L772K796M53k073k965j812j68J96r18k329k955k737k434
55413I7697k762l584l886k914j246k75n53j277j509j232r79j117j794k842l400
55398F8327k470l43J297J313M05j13L8N09J405K773L676L127J636N29J7p32j847
$$ plain form
55508 172576 172997 171702 169909 168530 167541 166324 164378 161667 158596 155864 154083 153161 152099 149674 145535
55493 145535 140691 136820 134871 134096 132600 129120 124263 119778 116704 114629 112682 110753 109520 109636 111040
55478 111040 112809 113645 112897 111205 109694 108488 106665 103925 101539 100908 101710 102248 101431 99656 97844 96480
55462 96480 95811 96269 98085 100690 102920 103880 103633 103074 103066 103574 103735 102910 101456 100258 99740 99752 100222 101272
55444 101272 102682 103824 104418 104897 105694 106575 107100 107480 108341 109555 109876 108172 104898 101951 101030 102386
55428 102386 105248 108871 112643 115439 115892 113819 110854 109042 108874 109070 108152 105823 102868 100131 97697
55413 97697 94935 91351 87465 84551 83305 83030 82477 81200 79691 78459 77480 76363 74569 71727 68327
55398 68327 65857 65514 66811 68124 68529 68416 68454 68963 70368 73141 76817 79944 81580 82109 82126 81394 79547
55381G9547k507k427k199j937j011N30J612J685J482J564J398N58j86Q1J065J761
55365H1016J665Q32n14j777k030j080J83R88J512J878J381l06j996k326j504o67
55349G7255r7N13P09j36j192q85O18J344K93j298k008k085k305k357j621n61j7
55332F6170L55J525L251M078L354K098J417J023j4j502k099j106M33Q78op82j45
55315G8928J450K273J218j106l042l351k115n46J16k62o90k63P81J496J455J103
55299G7445J037J381J768J583L84j448k601k070m75M64j34j406j893j017O28J930
55283G5576K062J199N14Q87J658J431P9j133j570k059l054l303j646Q16J820Q32
55267G4109n78j122j120j259j373j058n53k68J0P20J636J908R71p59k035j684
$$ plain form
55381 79547 77040 74613 72414 70477 69466 69996 71608 73293 74775 76339 77737 78295 78109 78190 79255 81016
55365 81016 82681 83513 82999 81222 79192 78112 78295 79283 80795 82673 84054 83748 81752 79426 77922 77255
55349 77255 77158 77671 78380 78244 77052 76167 76785 78129 78422 77124 75116 73031 70726 68369 66748 66187 66170
55332 66170 66525 68050 71301 75379 78733 80831 82248 83271 83257 81755 79656 78550 78983 79861 79855 79073 78928
55315 78928 80378 82651 83869 82763 79721 76370 74255 73709 73825 73563 72873 72610 73391 74887 76342 77445
55299 77445 78482 79863 81631 83214 83598 82150 79549 77479 77004 77468 77334 75928 74035 73018 73646 75576
55283 75576 77638 78837 79351 80238 81896 83327 83406 82273 80703 78644 75590 72287 70641 71457 73277 74109
55267 74109 73531 72409 71289 70030 68657 67599 67046 66778 66788 67508 69144 71052 72023 71264 69229 67545
55251F7545K38K185K438P85j406k746k887k070n45J129J907J283J80J10J434L018
55235G2598L544K725J178l00j147j158n91m2N0k16l58k8O40J158J082L63n77j087
55217G7834p23L80J417J480N61j70L99J737J977K20k066k737j604m27l69p07m21
55200G6781Q8j49r18j093l94K54J90j49j43P7M3k82n97p05n46k75m66j682l407
55181F6627m051k698m19Q60M90m19n64K17J056J088L84Q6J254L391M676M118K792
55164G8888K117J779O36r56j496r36r89k272k942j363J246K323J284j35m44J57
55148G6897Q66J455J992K214J775P79j96m66K45J446K180J975J254O31R6o20j391
55131I1132j903k242k606k748k292j435o61%P55J301J114L86k04n29r01r56J36
$$ plain form
55251 67545 67783 69968 72406 73191 71785 69039 66152 64082 63537 64666 66573 67856 68036 68146 69580 72598
55235 72598 76142 78867 80045 79745 78598 77440 76849 76807 76857 76641 76283 76255 76895 78053 79135 79498 78921 77834
55217 77834 77111 77491 78908 80388 80949 80779 81178 82915 84892 85112 83046 80309 78705 78278 77909 77202 76781
55200 76781 76869 76720 75802 74709 74315 74569 74759 74610 74467 74544 74587 74305 73708 73003 72457 72182 71716 70034 66627
55181 66627 62576 59878 59459 60319 60809 60390 59826 60043 61099 62187 62571 62657 63911 67302 71978 76096 78888
55164 78888 81005 82784 83420 82464 80968 80032 79043 76771 73829 72466 73712 76035 77319 77184 76740 76897
55148 76897 77763 79218 81210 83424 85199 85978 85782 85316 85561 87007 89187 91162 92416 93047 93143 92523 91132
55131 91132 89229 86987 84381 81633 79341 77906 77245 77245 78000 79301 80415 80801 80597 80068 79167 78211 78347
55114G8347J983K704J205j144k095j299l63m09o78M9J571K513K131J127N87O23
55098H6852M50m61j775k809l131k547j109N35J329R84M99Q37J467J197L32O31
55082H3281K634M233L021m93l204k922n78J274J370N19mO2J45j03m81p12p56o17
55064H6669k75Nl00j234j933j419K03J708K069J439P30M67L48q3p14j020q47o73
55046H5140q62j009n09M42J052J118J203J494J330L50o50p70k91j03k98k35K96
55029H7698Q72J247J452J277N68M4Q09K817M661N163M398K989J270m49j493j429
55013A11894p65n34j151j814j135J299L805L744M51l416m533k542K6J129J034
54998A07492P91O05L77M00O37M60j46k15N34Q13l28j771j893r50m63o97m61P26
$$ plain form
55114 78347 80330 83034 84239 83095 81000 79701 79338 78929 78251 78300 79871 82384 84515 85642 86229 86852
55098 86852 87302 86841 85066 82257 79126 76579 75470 76005 77334 78318 78817 79654 81121 82318 82650 83281
55082 83281 85915 90148 93169 92676 89472 86550 85972 87246 88616 89135 89131 89193 89338 89235 88754 88042 87286 86669
55064 86669 86394 86399 86099 84865 82932 81513 81716 83424 85493 86932 87662 88129 88477 88394 87680 86660 85813 85140
55046 85140 84278 83269 82760 83202 84254 85372 86575 88069 89399 89749 89099 88329 88038 87935 87637 87402 87698
55029 87698 88570 89817 91269 92546 93114 93158 93967 96784 101445 106608 111006 113995 115265 114816 113323 111894
55013 111894 111129 110595 109444 107630 106495 107794 111599 115343 115794 112378 107845 105303 105329 106458 107492
54998 107492 108283 108888 109265 109665 110302 110762 110616 110401 110935 111748 111420 109649 107756 106806 106343 105646 105185 105911
54980A05911J664J165m42j889k430k322k281k594k720j967o20J35j85o03k13L31
54964I0940q2j058j162o4J112J596J807K121K135J649J230J180Q30k73j266j025
54948I9670P9O03M3m77R6J184J435P11K96R75J784J369Q5l60P85K358K812J758
54930A15206l17k722m394m208k371p12n68j108p87L38J087J250J547J877J409
54915A05527M51M78J782K632J524q62k678k958k070r73o11j218j721o37J908L990
54899A04564M157L059K114J644J138M53l08j358k536k751j388J71o7j934l176
54884A03782k472r07R0Q32K323M036M272K585N41l37l73o56r85j30J828K867J530
54867A18826q60j649j90J524J550J57j124j555j415r58j27Q48J469J696K106L162
$$ plain form
54980 105911 107575 108740 108298 106409 103979 101657 99376 96782 94062 92095 91475 91610 91425 90822 90609 90940
54964 90940 90858 89800 88638 88574 89686 91282 93089 95210 97345 98994 100224 101404 102234 101961 100695 99670
54948 99670 99749 100352 100395 99918 100014 101198 102633 103344 103640 104615 106399 107768 107853 107493 108278 110636 113448 115206
54930 115206 114889 112167 107773 103565 101194 100482 99914 98806 98019 98357 99444 100694 102241 104118 105527
54915 105527 105978 106456 108238 110870 112394 111532 108854 105896 103826 102853 102242 101024 99303 98666 100574 104564
54899 104564 108721 111780 113894 115538 116676 117129 116821 115463 112927 110176 108788 108959 108892 106958 103782
54884 103782 101310 100403 100493 101325 103648 107684 111956 114541 115082 114745 114372 113716 112731 112601 114429 117296 118826
54867 118826 117966 116317 116127 117651 119201 119358 118234 116679 115264 114306 114179 115027 116496 118192 120298 123460
54851A23460M581N515N305M119K942K718L324L579K514L91j684k973l531l640
54837A46620l257k310j259j057k222m037n057m592l366k432j808p92O95J825J854
54822A18805P39j105k884l294j471J575L458L018J629J324K291L095K741J568
54808A31489L85k97j95P10J835K276J648M95k41q1N19M78q36k741l785l390k471
54791A25798k146k410k560k418k357k342j770l35J343K137J368n30k248k729k095
54776A06706j177k75P80J472Q39o56r06J031L096K706L14j347j096l88n38q65
54760A09696l89L69M27L0m3no51j706j879n95J146J880J160k01r98o30M36J108
54742A09155O45o44j696j583k47J483K532K496J874J351R75L71m46j000j106j076
$$ plain form
54851 123460 128041 133556 138861 142980 145922 148640 151964 155543 158057 158448 156764 153791 150260 146620
54837 146620 143363 141053 139794 138737 136515 132478 127421 122829 119463 117031 115223 114431 115126 116951 118805
54822 118805 119544 118439 115555 112261 110790 112365 115823 118841 120470 121794 124085 127180 129921 131489
54808 131489 131874 131577 131382 132092 133927 136203 137851 138346 138105 138024 138543 139021 138185 135444 131659 128269 125798
54791 125798 123652 121242 118682 116264 113907 111565 109795 109460 110803 112940 114308 113778 111530 108801 106706
54776 106706 105529 105254 106034 107506 108345 107689 106783 107814 110910 113616 113930 112583 111487 111099 110561 109696
54760 109696 109307 109676 110103 110133 110090 110085 109434 107728 105849 105254 106400 108280 109440 109239 108241 107611 108047 109155
54742 109155 109800 109156 107460 105877 105630 107113 109645 112141 114015 115366 116341 116712 116266 115266 114160 113084
54726A13084j025n58M19J139Q99L27Q84K854M453L783J373j41P16K337K291Q59
54710A33694O33K557M254L292O11q44rJ497J962J209k39j832k565j506P46K423
54694A45883K864L018L253K303n74l789n123m220k249j28J522J624l12k762l549
54679A37761k576j652j692j750j235j230k583m033l644j501M14Q71P40J410K784
54664A22084L552K962J562K37p03j233j048J8J385K278K709L107L179K236O67
54649A42992j15L28Q34O11L92O45J10k151m362l891j102R76Q24L0J39K12j118
54632A35354k892l005j313J81J5j244k235k487k491k710k867k263p81N93P55j27
54616A12483r06j164j561k253k125m66J651K701K636K409K142J165m31j574j667
$$ plain form
54726 113084 112059 111501 111920 113059 113958 114285 115169 118023 122476 126259 127632 127491 128207 130544 132835 133694
54710 133694 134327 136884 141138 144430 145041 144197 144188 145685 147647 148856 148617 146785 144220 142714 143460 145883
54694 145883 148747 151765 155018 157321 156747 152958 147835 143615 141366 141238 142760 144384 144072 141310 137761
54679 137761 135185 133533 131841 130091 128856 127626 125043 121010 117366 115865 116279 117150 117890 119300 122084
54664 122084 125636 128598 130160 130397 129694 128461 127413 127431 128816 131094 133803 136910 140089 142325 142992
54649 142992 142877 143205 144039 144650 145042 145687 145797 143646 139284 135393 134291 135267 136091 136121 136260 136472 135354
54632 135354 132462 129457 128144 128325 128340 127096 124861 122374 119883 117173 114306 112043 111262 111855 112610 112483
54616 112483 111577 110413 108852 106599 104474 104008 105659 108360 110996 113405 115547 116712 116281 114707 113040
54601A13040j210q15n04j12K90N71O03J91n21q39l34L89N60M92Q84J261M52j211
54583A13187j765j34K371L760L394J798l85k304k753j326P82K049K239J950J212
54568A24075k85j971k669k180j623j849k314j871k95J327J617L11j273j438J37
54553A09699K070K962K765K139J185k75j622j738m60J063J613R88j19p59k44J262
54537A20529K607K660J571N84N11R87J188P11l63j675k552k373j324m33n75j516
54521A20537k071j145J248L649M143K228m30j642r80J92P70R57J190J123L37o87
54505A29419j063o38LM12O47Q65J028J037Q75O47N19N99O89L11r30k812m320m165
54487A23123j979R34K575K276J249P21M67j25m11N91K163K409Q86p84j209o64
$$ plain form
54601 113040 111830 111015 110511 110399 110689 111260 111863 112054 111533 110694 110360 110749 111309 111801 112685 113946 114398 113187
54583 113187 111422 111288 113659 117419 120813 122611 122226 119922 117169 115843 116625 118674 120913 122863 124075
54568 124075 123790 121819 119150 116970 115347 113498 111184 109313 109018 110345 111962 112273 111000 109562 109699
54553 109699 111769 114731 117496 119635 120820 120545 118923 117185 116725 117788 119401 120389 120270 119511 119267 120529
54537 120529 123136 125796 127367 127951 128462 129449 130637 131348 130985 129310 126758 124385 123061 122628 122053 120537
54521 120537 118466 117321 118569 122218 126361 128589 128159 126517 125537 125729 126499 127456 128646 129769 130106 129419
54505 129419 128356 127718 127721 128133 128780 129645 130673 131710 132585 133232 133751 134350 135039 135350 134420 131608 127288 123123
54487 123123 121144 122078 124653 126929 128178 128899 129366 129241 128830 129421 131584 133993 134879 134095 132886 132222
54471A32222J10R74J583R41j045k680k402q41J10l09j241j608j089j41K53p00
54455A24137k381k819r02K094L904L721K438J044j53j067j556j554r05M98J972
54440A28471K156O05j486k806l241k932j294J618L996M261L304K907K760J309
54426A39628j038k100j401q06j256j351n7J403J660J296J377J578J220P99R73
54411A41925J082K98p15q18k56j2J28J185K921L732K695O73q06r17J77J629K415
54394A55336K066Q79p38k665m442n019l963k296j333j118r06o10p03r93p27J56
54378A32924R11J096R02M57k77q67o82N9L75j07o28l79N42J373J368J95j540k254
54360A33468q03J808L091J920q6n97P73K488L101K423J062k62r49p90j61M35R43
$$ plain form
54471 132222 132332 133306 134889 135830 134785 132105 129703 128862 128972 128663 127422 125814 124725 124584 124837 124137
54455 124137 121756 118937 118035 120129 124033 127754 130192 131236 131083 130016 128460 126906 126001 126499 128471
54440 128471 130627 131232 129746 126940 123699 120767 119473 121091 125087 129348 132652 135559 138319 139628
54426 139628 138590 136490 135089 134283 133027 131676 131619 133022 134682 135978 137355 138933 140153 140952 141925
54411 141925 143007 143305 142590 141772 141516 141504 141632 142817 145738 149470 152165 152838 152032 151115 151292 152921 155336
54394 155336 157402 158281 157543 154878 150436 145417 141454 139158 137825 136707 135801 135191 134488 133495 132768 132924
54378 132924 133835 134931 135833 136290 136013 135146 134464 134523 134898 134791 134163 133784 134326 135699 137067 137262 135722 133468
54360 133468 132665 134473 137564 139484 139398 138801 139574 142062 145163 147586 148648 148386 147437 146647 146486 146921 147864
54343A47864J527J886J432K82n38l06M30O06J24l5P30J741J926J148J35o36j295
54326A57021j815j595j91J829L254L361K474J455Q03L71j60o44o28j30J75j37
54310A65443n76m92j80m20j075j098r1J033J280Q14M70P96J902L613N146N317
54294A81882L817J911J285K313L857M392L141O63j344j480l03K44o08j516j394
54279A96860j329k770m814n206l595k003j951k852l493l525k990j836o30n10j536
54264A57820k139j174L07L83j126k411j900P6J898K420J860J189P85R1j184k085
54248A54810j509j8N96k92j281j037j63j55j263k315k331j482o23l47m45k9J444
54231A43560L184L693K650J348R31J106J176J259J573J511O41j86j32k5j033k171
$$ plain form
54343 147864 149391 151277 152709 152991 152453 152147 152577 153183 153307 153272 154002 155743 157669 158817 158952 158316 157021
54326 157021 155206 153611 153420 155249 158503 161864 164338 165793 166596 166967 166807 166163 165535 165405 165580 165443
54310 165443 164867 164375 164195 163775 162700 161602 161511 162544 163824 164638 165108 165904 167806 171419 176565 181882
54294 181882 185699 187610 188895 191208 195065 199457 202598 203261 201917 200437 200134 200378 199770 198254 196860
54279 196860 195531 192761 187947 182741 179146 177143 175192 172340 168847 165322 162332 160496 159866 159356 157820
54264 157820 155681 154507 154814 155197 154071 151660 149760 149836 151734 154154 156014 157203 157988 158079 156895 154810
54248 154810 153301 153283 153879 153587 152306 151269 151106 150951 149688 147373 145042 143560 142937 142590 142145 142116 143560
54231 143560 146744 150437 153087 154435 155366 156472 157648 158907 160480 161991 162632 162446 162314 162289 161256 159085
54215A59085j280J422K995J767k81m32R92J474j6j900k296r84Q48J722P45j532
54199A62329l143k587p41J35n60j031K84K526L784L546K748K052J354P54O76R67
54183A73093Q86K99p6N9r2j159k426k708j994j388j580k189k598k642k235j112
54167A52138N48J705J418J17o69l6J295J946J527Q12M61J82n56j483j762j151
54151A56492l30M4J14L48O59M95k87j141j484j334j088q96n31K01J080J618J487
54134A55447P59j36p01o99l43k9J88O47J450K035J849J247J118J569J728J081
54118A67210K53r5k91q57j360j068l19j29p28j549k412l443l895k493O66L740
54102A53230N029M246J995o73k001p83J510J671j052l558l014o78L38m50j032
$$ plain form
54215 159085 157805 159227 162222 163989 163708 163276 164268 165742 165726 163826 161530 160546 161394 163116 163861 162329
54199 162329 159186 156599 155858 155993 155433 154402 154686 157212 160996 164542 167290 169342 170696 171450 172126 173093
54183 173093 173979 174278 174202 174261 174169 173010 170584 167876 165882 164494 162914 160725 158127 155485 153250 152138
54167 152138 152686 154391 155809 155926 155257 155221 156516 158462 159989 160801 161262 161444 160888 159405 157643 156492
54151 156492 156162 156206 156320 156668 157327 157822 157535 156394 154910 153576 152488 151592 151061 151262 152342 153960 155447
54134 155447 156206 156070 155369 154670 154327 154298 154486 155133 156583 158618 160467 161714 162832 164401 166129 167210
54118 167210 167463 167368 167077 166220 164860 163792 163473 163344 162616 161067 158655 155212 151317 148824 149490 153230
54102 153230 158259 162505 164500 163827 161826 161043 162553 164224 163172 159614 156600 155922 156260 155810 154778
54087A54778n96k69m60p6J111J567L56j293j694p55L99R42Q36N87R18J962K781
54070A61094K427J372P70N86j09j100j122j67J78p09j481j192p83j085j173j61
54054A57345R38R10N54J244K233J660l16j536j058k83m62q13p2J280J532N0j771
54037A61435j964m7K527L906L548K181N21j032j629l39K165L579K607P22J51J087
54021A79418J972J836R47k49j320j388N2K017L017K974K928L143L028K728L071
54006B04174L773L513K148J256J780K738L060L193L839M403M007L102K726K816
53992B46528K511J689J084J067J209R77L00k73L78K939O063O845M168P78L45K870
53976B79478M918M415L065L201M303M309L042K219K453K294O83j237j625l43J053
$$ plain form
54087 154778 154182 153913 153453 153377 154488 156055 156411 155118 153424 152669 153068 154010 154846 155433 156351 158313 161094
54070 161094 163521 164893 165663 166249 166140 165040 163918 163751 163929 163220 161739 160547 159764 158679 157506 157345
54054 157345 158283 159193 159747 160991 163224 164884 164568 163032 161974 161691 161229 160416 160344 161624 163156 163206 161435
54037 161435 159471 159424 161951 165857 169405 171586 172107 171075 169446 169107 171272 174851 177458 178180 178331 179418
54021 179418 181390 183226 184173 183924 182604 181216 181268 183285 186302 189276 192204 195347 198375 201103 204174
54006 204174 207947 211460 213608 214864 216644 219382 222442 225635 229474 233877 237884 240986 243712 246528
53992 246528 249039 250728 251812 252879 254088 255065 255365 255092 255470 258409 264472 271317 275485 276263 276608 279478
53976 279478 284396 288811 291876 295077 299380 303689 306731 308950 311403 313697 314380 313143 311518 311175 312228
53961C12228J202L3j613k770k889k264j805k033k516k797l462n375q012r567q974
53946B59386o893m451k003J65R93k69k552l778l234k194j991k366k195j137Q4
53931B27565P05O64K57l91j309k250k587j793JK045L521L912K941P27j782l022
53915B29204k058L90K548L240K722J968J509J049J18j035j371j18K108L702L787
53900B47763L083K762K921K803K220J908K340K856K447J182L22Q10J985K245J116
53885B78763J5L82J668K131J429J068K105L761M938N818P060Q432R437J0338J1399
53870C48744J1906J1331J0673J1161J2140J2055J1016J0465J0498R755Q182P552
53858D75478Q332Q299N667J863n21j281k262m408o945q944r927r247o712l900
$$ plain form
53961 312228 313430 313463 311850 309080 306191 303927 302122 300089 297573 294776 291314 285939 277927 268360 259386
53946 259386 252493 248042 246039 246204 247197 246928 244376 240598 237364 235170 233179 230813 228618 227481 227565
53931 227565 228270 228934 229191 228800 227491 225241 222654 220861 220862 222907 226428 230340 233281 234008 232226 229204
53915 229204 227146 227536 230084 233324 236046 238014 239523 240572 240690 239655 238284 238166 240274 243976 247763
53900 247763 250846 253608 256529 259332 261552 263460 265800 268656 271103 272285 272607 273417 275402 277647 278763
53885 278763 278778 279160 280828 282959 284388 285456 287561 291322 296260 302078 309138 317570 327007 337345 348744
53870 348744 360650 371981 382654 393815 405955 418010 429026 439491 449989 459744 467926 475478
53858 475478 483810 492109 497776 499639 499118 497837 495575 491167 484222 475278 465351 456104 449392 445492
53844D45492l231n110p332p820o852n901n400m758l959l835m673n591n764n665
53830C69601o411q028r062q308o449n407n997o899o282m162k521l057n216o845
53816B84957o570n013l609k813k123j494j655k725l489k811j160O0K74j03q01
53801B50925j839k686k515j523r50j399k204k803l575m606m709k817J89K181K102
53786B23771P44o63j590j888j255K81J828K125Q50q73j443l47J372K293K049J332
53770B28586P80L54j89o33l91Q20K425L156K257O47K20J477K684K239J162J693
53754B47287L849N198M292K525J872K396L061L760N029O492O921N722L472J209
53740C03085j49n8J293L018M289M809M438L051J179%Q1P31J121J259J294O88j067
$$ plain form
53844 445492 442261 437151 429819 421999 415147 409246 403846 399088 395129 391294 386621 381030 375266 369601
53830 369601 363190 355162 346100 337792 331343 325936 319939 313040 306758 302596 300075 297018 291802 284957
53816 284957 278387 273374 269765 266952 264829 263335 261680 258955 255466 252655 251495 251555 251829 251726 250925
53801 250925 249086 246400 243885 242362 241412 240013 237809 235006 231431 226825 222116 219299 219488 221669 223771
53786 223771 224515 223852 222262 220374 219119 219400 221228 223353 224203 223330 221887 221540 222912 225205 227254 228586
53770 228586 229366 229720 229531 228898 228507 229327 231752 234908 237165 237812 238032 239509 242193 244432 245594 247287
53754 247287 251136 256334 260626 263151 265023 267419 270480 274240 279269 285761 292682 298404 301876 303085
53740 303085 302936 302878 304171 307189 311478 316287 320725 323776 324955 324955 325036 325767 326888 328147 329441 330129 329062
53723C29062l433n280n931n305l781k404k251l013l243k622k618l922m834l769
53709B76656j937j520k242k118j061j141l104n024n037l662k592k575l234l837
53695B37572l672k579j344p73m08O88K103K507J867J546J957J951J058N26J252
53680B44251K344K721K660K617J982M31o79O9J848K434J076p02r78P58L447N257
53664B69536M909K885J095Q88J845K927L850M644M768L852K640K002J557N02o56
53649C07244o22O19J680J846J924K612L295L144K557K564L289L887L917M050N012
53634C47018O265O330M590K249R64Q07L33j283l058l493k337n02J179K374K801
53619C64237K128L43k049m220n290m868l475j973m93J385L206L471J622p93j960
$$ plain form
53723 329062 325629 320349 314418 309113 305332 302928 300677 297664 294421 291799 289181 285259 280425 276656
53709 276656 274719 273199 270957 268839 267778 266637 263533 258509 253472 249810 247218 244643 241409 237572
53695 237572 233900 231321 229977 229204 228796 229484 231587 234094 235961 237507 239464 241415 242473 242999 244251
53680 244251 246595 249316 251976 254593 256575 257006 256327 256396 258244 260678 261754 261052 260074 260832 264279 269536
53664 269536 274445 277330 278425 279313 281158 284085 287935 292579 297347 301199 303839 305841 307398 307900 307244
53649 307244 306622 307241 308921 310767 312691 315303 318598 321742 324299 326863 330152 334039 337956 342006 347018
53634 347018 353283 359613 364203 366452 367416 368223 368556 367273 364215 360722 358385 357883 359062 361436 364237
53619 364237 366365 366708 364659 360439 355149 350281 346806 344833 344340 345725 348931 352402 354024 353231 351271
53604C51271k070k503l342l179j420O32J401P91p3j49Q19K279L287L306K772K477
53588C56299K585K731K865L121L061K083P68O64K199L815L847K553J540J734K829
53573C92694M174N277N601M864L687L154L497L828L471K951L203M224N191N624
53559D51440N800O064O389O770P349P824P365N694L755K658K372K207K199K856
53545E20742L670L278J480j17j82N97P96L79L67Q74P99n32k470l891m295l932
53529E17563l474l546m038l883k210K60J621P67j550l723m752m598l668k393j032
53514D81344K79J253J369M68p47j328j190j015j096r49k34O36J171J509J890J894
53498D85254R66l61m88J554M710O747O626N560N309N948O113N318M856N887P649
$$ plain form
53604 351271 349201 346698 343356 340177 338757 339389 340790 341581 341508 341359 342178 344457 347744 351050 353822 356299
53588 356299 358884 361615 364480 367601 370662 372745 373513 374177 376376 380191 384038 386591 388131 389865 392694
53573 392694 396868 402145 407746 412610 416297 419451 422948 426776 430247 433198 436401 440625 445816 451440
53559 451440 457240 463304 469693 476463 483812 491636 499001 504695 508450 511108 513480 515687 517886 520742
53545 520742 524412 527690 529170 529053 528871 529468 530264 530643 531010 531884 532683 532151 529681 525790 521495 517563
53529 517563 514089 510543 506505 502622 500412 500672 502293 503060 501510 497787 493035 488437 484769 482376 481344
53514 481344 481623 482876 484245 484713 483966 482638 481448 480433 479337 478388 478154 478790 479961 481470 483360 485254
53498 485254 486220 485859 485371 486925 491635 498382 505008 510568 515877 521825 527938 533256 538112 543999 551648
53483E51648Q486Q102P755Q487J0172J2105J3711J4621J4858J5017J5637J6514
53471F97113J7280J8331K0159K2027K2476K1388K0269K0214K0760K1318K2454
53460I23789K4752K7322K8689K8804K9018L0161L1568L2234L2227L2476L3493
53449A254533L4713L5290L5147L4913L4733L3860L1825K9472K8037K7596K7280
53438A607399K6786K6517K6372K5638K4429K3876K4394K4842K4177K2893K2043
53427A879366K1698K1357K1043K0943K0417J8539J5458J2313R862P938O074L956
53415B058964J397j537m400o843r082j1518j4140j6691j8974k0703k1605k2184
53403A912684k3592k5974k7655k7121k5286k4499k5456k6525k6301k5488k5561
$$ plain form
53483 551648 560134 568236 575991 584478 594650 606755 620466 635087 649945 664962 680599 697113
53471 697113 714393 732724 752883 774910 797386 818774 839043 859257 880017 901335 923789
53460 923789 948541 975863 1004552 1033356 1062374 1092535 1124103 1156337 1188564 1221040 1254533
53449 1254533 1289246 1324536 1359683 1394596 1429329 1463189 1495014 1524486 1552523 1580119 1607399
53438 1607399 1634185 1660702 1687074 1712712 1737141 1761017 1785411 1810253 1834430 1857323 1879366
53427 1879366 1901064 1922421 1943464 1964407 1984824 2003363 2018821 2031134 2040996 2048934 2055008 2058964
53415 2058964 2060361 2058824 2054424 2047581 2038499 2026981 2012841 1996150 1977176 1956473 1934868 1912684
53403 1912684 1889092 1863118 1835463 1808342 1783056 1758557 1733101 1706576 1680275 1654787 1629226
53392A629226k6515k6862k5511k2922k0352j8350j6360j3878j1534j0307r756
53381A426879q133m775j303N51J330K724M770N996O202P144R959J3445J5803J6897
53367A497489J7880J9397K1209K3051K4974K7055K9323L1730L3878L5268L6186
53356A797440L7816M0870M4611M7735M9889N1656N3349N4612N5315N6160N8098
53345B347551O1243O4658O7307O9152P0983P3077P4486P4179P2530P0953P0293
53334C116412P0384P0990P1919P2157P0256O6350O2600O0596N9136N5714M9728
53323C826242M2941L6980L1593K5593J8559J1151M290j639o998j2595j8982k6110
53311C931025l3736m1895n0552n8932o5729p0063p1997p2308p2165p2776p4622
$$ plain form
53392 1629226 1602711 1575849 1550338 1527416 1507064 1488714 1472354 1458476 1446942 1436635 1426879
53381 1426879 1418746 1413971 1412668 1413219 1414549 1417273 1422043 1428039 1434241 1441385 1451344 1464789 1480592 1497489
53367 1497489 1515369 1534766 1555975 1579026 1604000 1631055 1660378 1692108 1725986 1761254 1797440
53356 1797440 1835256 1876126 1920737 1968472 2018361 2070017 2123366 2177978 2233293 2289453 2347551
53345 2347551 2408794 2473452 2540759 2609911 2680894 2753971 2828457 2902636 2975166 3046119 3116412
53334 3116412 3186796 3257786 3329705 3401862 3472118 3538468 3601068 3661664 3720800 3776514 3826242
53323 3826242 3869183 3906163 3937756 3963349 3981908 3993059 3997349 3995710 3988712 3976117 3957135 3931025
53311 3931025 3897289 3855394 3804842 3745910 3680181 3610118 3538121 3465813 3393648 3320872 3246250
53300C246250p6819p7796p6945p5111p3223p0925o7420o3364o0882o1001o1857
53289B480907o0522n6540n2433n0264m9009m6465m2808m0403m0169l9980l7411
53278A964903l2735k8158k5059k3084k1400j9657j7883j6324j5375j5062j4781
53267A735385j4064j3283j3013j3019j2589j1554j0279q854p092n203l666k469
53255A620300j092P72L028N507P867R411R867J0168J1588J4198J7083J9888K2959
53242A751544K5873K7327K7082K6840K8281L1045L3543L4958L5400L4766L2821
53231B089480L0292K8577K8006K7274K5063K1535J7684J3817R580N232J889k0
53219B298409j832n343j0645j5971j9767k2188k4278k6530k8836l1208l3672l5787
$$ plain form
53300 3246250 3169431 3091635 3014690 2939579 2866356 2795431 2728011 2664647 2603765 2542764 2480907
53289 2480907 2420385 2363845 2311412 2261148 2212139 2165674 2122866 2082463 2042294 2002314 1964903
53278 1964903 1932168 1904010 1878951 1855867 1834467 1814810 1796927 1780603 1765228 1750166 1735385
53267 1735385 1721321 1708038 1695025 1682006 1669417 1657863 1647584 1638730 1631638 1626435 1622769 1620300
53255 1620300 1619208 1619980 1623008 1628515 1636382 1645793 1655660 1665828 1677416 1691614 1708697 1728585 1751544
53242 1751544 1777417 1804744 1831826 1858666 1886947 1917992 1951535 1986493 2021893 2056659 2089480
53231 2089480 2119772 2148349 2176355 2203629 2228692 2250227 2267911 2281728 2291308 2296540 2298429 2298409
53219 2298409 2296577 2291234 2280589 2264618 2244851 2222663 2198385 2171855 2143019 2111811 2078139 2042352
53207B042352l7075l7824l8700l9724m0392m0731m1331m2252m2751m2352m1503
53196A597717m0860m0500m0114l9429l8274l6687l5109l4003l3233l2356l1408
53185A195744l0670k9795k8144k6078k4736k4361k3974k3055k2161k1265j9024
53174I22481j4831j0495q467r158j1184j3451j5543j6719j6341j5168j4817j5746
53162G60561j6985j7757j8126j7969j6780j4846j3374j2932j2794j2264j1670
53151E95064j1406j1072j0328r850j0466j1839j2735j2436j1259j0000r324r498
53139D64851j0186j0610j0254r349q473p943p622p077n871m112k797k951m309
53126C73297n463n641n489n652n474m078k081j092j617k605l088l245l513l512
$$ plain form
53207 2042352 2005277 1967453 1928753 1889029 1848637 1807906 1766575 1724323 1681572 1639220 1597717
53196 1597717 1556857 1516357 1476243 1436814 1398540 1361853 1326744 1292741 1259508 1227152 1195744
53185 1195744 1165074 1135279 1107135 1081057 1056321 1031960 1007986 984931 962770 941505 922481
53174 922481 907650 897155 888688 879530 868346 854895 839352 822633 806292 791124 776307 760561
53162 760561 743576 725819 707693 689724 672944 658098 644724 631792 618998 606734 595064
53151 595064 583658 572586 562258 552408 541942 530103 517368 504932 493673 483673 474349 464851
53139 464851 454665 444055 433801 424452 415979 408036 400414 393337 387466 383354 380557 377606 373297
53126 373297 367834 362193 356704 351052 345578 341500 339419 338327 336710 334105 331017 327772 324259 320747
53112C20747k560q12O72Q92l17k192l549l587k576j509r49m67M90J535J716Q96
53096C08430O8Q3N18K71r60k301k771k252j256j35J073K200K769K434J357nj296
53079C08227k198k168p63J543L277L299K065R81N14k15j742l040k791j267K6K02
53063C05950m86j650l008l689k714o06P89P04M31J108J862J346O1m48n2l9q78
53046B98681j596j503j215j498k189k617k429j661o98k08m48p20k12P22J133J050
53030B84592J289J703J078p79k266k052q57k41m38l83N31J567J434l47k758l936
53014B78137l021j244n36j223j980j823r23M01J867K327N27k541l989k739j060
52999B62180j087j655m28K289M031L619J951J7j814k868k578j745j636j898j220
$$ plain form
53112 320747 318187 317375 318047 318939 318622 316430 312881 309294 306718 305209 304260 303793 304283 305818 307534 308430
53096 308430 308498 308581 309099 309370 308410 306109 303338 301086 299830 299695 300768 302968 305737 308171 309528 309523 308227
53079 308227 306029 303861 303098 304641 307918 311217 313282 314263 314777 314562 312820 309780 306989 305722 305748 305950
53063 305950 305464 303814 300806 297117 294403 293797 294586 295290 295721 296829 298691 300037 300098 299650 299598 299559 298681
53046 298681 297085 295582 294367 292869 290680 288063 285634 283973 283275 283067 282619 281899 281687 282409 283542 284592
53030 284592 285881 287584 288662 287883 285617 283565 282708 282467 282029 281646 282177 283744 285178 284831 282073 278137
53014 278137 275116 273872 273336 272113 270133 268310 267387 267788 269655 271982 272509 269968 265979 263240 262180
52999 262180 261093 259438 259010 261299 265330 268949 270900 270917 269103 266235 263657 261912 260276 258378 257158
52984B57158J31L74r68k294k386j814j317o14L59O88on15L39K026L127L049K096
52967B59433P52l03k95O95J469J139J67n97j041j246p27P31K121K225J239L97
52951B66159K03J2p21j608j936j513p11j2L39L92K64r0o82j184j236r48o91l58
52933B55679M87J627K126J527M41l45p42r19o54K18J162J357P08P5M99K195M192
52916B69633N047M234K449L36k283n011n820l222R19K958K057R84J682K516J350
52901B77829q16j435k44P86N44k17n87m46J51R41R87m38k583m004m231l720k717
52884B59800j500j016j726k306j255P07J615J240J039J301P04r90k081j539n20
52869B53473l00l99J36J006J294O99o75k557l832k946n0K457K573Q91p76j716
$$ plain form
52984 257158 257289 257663 256695 254401 252015 250201 248884 248270 248629 249317 249311 248796 249135 251161 254288 257337 259433
52967 259433 260185 259882 259587 260282 261751 262890 263057 262460 261419 260173 259446 260177 262298 264523 265762 266159
52951 266159 266362 266374 265653 264045 262109 260596 259885 259873 260212 260604 260868 260778 260096 258912 257676 256728 256037 255679
52933 255679 256166 257793 259919 261446 261887 261542 260800 259881 259227 259445 260607 261964 262672 262747 263246 265441 269633
52916 269633 274680 278914 281363 281699 279416 274405 268585 265363 266282 269240 271297 272281 273963 276479 277829
52901 277829 277013 275578 275334 276120 276664 276447 275860 275414 275565 276506 277493 277055 274472 270468 266237 262517 259800
52884 259800 258300 257284 255558 253252 251997 252704 254319 255559 256598 257899 258603 257613 255532 253993 253473
52869 253473 253173 252774 252910 253916 255210 255909 255234 252677 248845 245899 245849 248306 250879 251770 250994 249278
52853B49278k207k153j323k23N25J100J746J846Q84k97n28q7j76q71r76J11J546
52836B48195K213J962J471J478K113K701K440J509R90J328J708J456J128J295
52822B71987J288L86n82k76J081K113K336K246J640k60k941m442l703j770k41
52807B68862L44K07l40p30m01K32pj359k593k651j894j187p09l69m85j160j670
52790B54090j324m15L38Q09J205J344Q72j30j260k241k818k729k171j679j185
52775B42706l5J539J992N45j315j631o19j6l35m74J00N84O44J164K380K681N95
52758B50505k873n195n149l603j820j68J374K497K911K853K714K418J583K31r43
52743B47335j173m17N96J172J307J385J362P30o10k003k879l457m101m366l486
$$ plain form
52853 249278 247071 244918 243595 243372 243897 244997 246743 248589 249473 249176 248648 248561 248385 247514 246538 246649 248195
52836 248195 250408 252370 253841 255319 257432 260133 262573 264082 265072 266400 268108 269564 270692 271987
52822 271987 273275 273661 273079 272803 273884 275997 278333 280579 282219 281959 279018 274576 270873 269103 268862
52807 268862 269206 269413 269073 268343 267942 268174 268167 266808 264215 261564 259670 258483 257774 257405 256920 255760 254090
52790 254090 252766 252351 252689 253498 254703 256047 256919 256789 255529 253288 250470 247741 245570 243891 242706
52775 242706 242671 244210 246202 246747 245432 243801 243182 243166 242831 242357 242457 243041 243685 244849 247229 249910 250505
52758 250505 247632 242437 237288 233685 231865 231697 233071 235568 238479 241332 244046 246464 248047 248278 247335
52743 247335 246162 245745 246341 247513 248820 250205 251567 252297 251687 249684 246805 243348 239247 234881 231395
52728B31395j689k13K38K73O97J333J548J330J044N68l57j106o47P61J468N73
52712B37216q04j096l78O1k50n55l82l53j120k284k784j969j06J835K811K614
52696B32456K175K448K991K422M63j282j165N80K263K683J987R47J36k46k98k55
52680B48305k28j55j14l53p34n94M30J740K419K239J669J181R32Q66O63p5j170
52663B57021j871j893j908k312k309j162K28M20l10k96Q65J636Q43p77j946k424
52647B43805k393j574p4Q90L49r69j580j066O1J554L222M027K870L20j631j686
52631B46125k51J551K766K666J199m32p48J60Q76R08J283K473L153K118K78n56
52615B63569j68N8p70k186l386m001l783k600r57K51P11Q01P46M86M29J293K737
$$ plain form
52728 231395 229706 229493 229731 230004 230701 232034 233582 234912 235956 236524 236167 235061 234414 235175 236643 237216
52712 237216 236412 235316 234938 234999 234749 234194 233812 233459 232339 230055 227271 225302 225196 227031 229842 232456
52696 232456 234631 237079 240070 242492 242955 241673 240508 241088 243351 246034 248021 248968 249104 248858 248560 248305
52680 248305 248077 247922 247808 247455 246721 246127 246557 248297 250716 252955 254624 255805 256737 257603 258266 258191 257021
52663 257021 255150 253257 251349 249037 246728 245566 245794 246214 245904 245608 246473 248109 248952 248175 246229 243805
52647 243805 241412 239838 239764 240654 241003 240034 238454 237388 237449 239003 242225 246252 249122 249442 247811 246125
52631 246125 245874 247425 250191 252857 254056 253624 252876 253036 253912 254820 256103 258576 261729 263847 264125 263569
52615 263569 263401 263459 262689 260503 257117 253116 249333 246733 245776 246027 246738 247539 248285 248771 249200 250493 253230
52598B53230L233K081Q01J272K915L161R88j439j540J73Q46o80k307j744J91P28
52582B61909r38k636k244k86J272J650J493J249P36K39O63K121L354L219K125
52567B73926J388J624K428L234L662L144J231j331k608j403J087K317J191p86
52553B89104j410k55J308K011J771R50m16k178l515l522k226n81M59N89J25l02
52537B81912j31P10J769K565K843K343R25o60q53R30K988K937P27j147p68Q44
52521B97934J268j51j719j784p13j68r72k237k528j502j72K89k69j020j002K10
52505B85464K191L674L312J019j622k924k815k383k041j208J41Q99K93r85j716
52490B81299j491o29M84J236Q22o48j704j102M53J252Q11J46KL8j57m21p44j586
$$ plain form
52598 253230 256463 258544 259345 260617 263532 266693 267681 266242 264702 264875 265721 265041 262734 260990 261181 261909
52582 261909 260971 258335 256091 255805 257077 258727 260220 261469 262205 262444 263107 265228 268582 271801 273926
52567 273926 275314 276938 279366 282600 286262 289406 290637 289306 286698 285295 286382 288699 289890 289104
52553 289104 287694 287439 288747 290758 292529 293479 293063 290885 287370 283848 281622 281041 281500 282089 282214 281912
52537 281912 281781 282491 284260 286825 289668 292011 292936 292276 291423 292353 295341 298278 299005 297858 297090 297934
52521 297934 299202 299051 297332 295548 294835 294667 293695 291458 288930 287428 287256 287545 287276 286256 285254 285464
52505 285464 287655 291329 294641 295660 294038 291114 288299 285916 283875 282667 282808 283707 284000 283015 281299
52490 281299 279808 279179 279663 280899 281721 281073 279369 278267 278720 279972 280783 280929 280931 280969 280812 280391 279647 278061
52472B78061k860l426k386m16Q95Q37J49j42J46M96N09L24L45Q44J814K905L425
52455B81520K830J533Q25J355K131J916J307J926L469L467R97j234l18K594L755
52440C08073J947m09j280j591k761l934l339j135P21Q83k72j555k034j536p53
52425B91025n37p17l30P03J113J54j130j397q01k66R2N87P59J26n01O0J322J577
52407B91839M04q08r50m69j53J09P69J767K816L843M704N019M639L775K536R27
52391C20767o50j573j805j895k214k772l695m888n377m168j937n49n87o63L49
52376B88343J684K095J685J264Q59P2q17j144p83J16J635L377M051K981J509J473
52360C08400K677L327K792K342K879L513L069J962J670K928N130P114Q010P542
$$ plain form
52472 278061 275201 271775 269389 268973 269868 270705 270854 270712 270858 271354 271863 272187 272532 273376 275190 278095 281520
52455 281520 284350 285883 286708 288063 290194 292110 293417 295343 298812 302279 303276 302042 301724 304318 308073
52440 308073 310020 309611 308331 306740 303979 300045 296706 295571 296292 297175 296903 295348 293314 291778 291025
52425 291025 290488 289771 289441 290144 291257 291411 290281 288884 288083 287817 287909 288496 289255 289381 288880 288940 290262 291839
52407 291839 292243 291435 290485 290016 289863 289972 290741 292508 295324 299167 303871 308890 313529 317304 319840 320767
52391 320767 320117 318544 316739 314844 312630 309858 306163 301275 295898 291730 289793 289244 288657 287994 288343
52376 288343 290027 292122 293807 295071 295930 296002 295185 294041 293258 293374 295009 298386 302437 305418 306927 308400
52360 308400 311077 314404 317196 319538 322417 325930 328999 330961 332631 335559 340689 347803 355813 363355
52346C63355N907L514R01j087j642j144j447l920p343q860p256m209j962q80J9
52331C33946J115J896K087K088K295K728L203L411L011K118J580K189L656M821
52317C70144M898M241L835M334N555O712P086O584N646M721M052L868M296M979
52303D40951N270N001M635M486M361M159M187M448M382L858L703M478N489N988
52289E05396O683Q691J1367J2751J2274J1507J1923J3274J4740J6282J8010J9431
52277F62329K0354K1586K3570K5258K5536K5074K5333K6203K6248K5173K4335
52266I30999K4520K4724K3841K2366K1598K1918K2627K2869K2062K0112J7766
52255A175402J6136J5152J3242R411N063K582K388K536J293j044l110m300m972
$$ plain form
52346 363355 369262 372776 373677 372590 370948 369804 368357 364437 357094 348234 340978 336769 334807 333927 333946
52331 333946 335061 336957 339044 341132 343427 346155 349358 352769 355780 357898 359478 361667 365323 370144
52317 370144 375042 379283 383118 387452 393007 399719 406805 413389 419035 423756 427808 431676 435972 440951
52303 440951 446221 451222 455857 460343 464704 468863 473050 477498 481880 485738 489441 493919 499408 505396
52289 505396 512079 520770 532137 544888 557162 568669 580592 593866 608606 624888 642898 662329
52277 662329 682683 704269 727839 753097 778633 803707 829040 855243 881491 906664 930999
52266 930999 955519 980243 1004084 1026450 1048048 1069966 1092593 1115462 1137524 1157636 1175402
52255 1175402 1191538 1206690 1219932 1229343 1234406 1236988 1239376 1241912 1243205 1242161 1239051 1234751 1229779
52242A229779n535n900n729m823l505k675l141m562n416m345j467J833M106M755
52228A193375M179L493L937O060R274J2373J4509J5564J5759J5287J4506J4127
52216A322443J4797J6285J7375J6908J4905J2513J0768R684Q552O766M175J032
52204A456203k024m366o142q269j0989j2823j1992q994o784p886j1921j6328j8952
52191A328733j9340j8144j6225j4320j2944j2231j1957j1794j1555j1361j1556
52180A177306j2182j2587j2029j0692r529q877q026o519n034m253l564j923L07
52167A082398J541R88m42j366j247l71P72J754K439L171M232N106M946L923L317
52152A111161L932N166O068O534O816O583N400L755K557J746M89j115j594p1K083
$$ plain form
52242 1229779 1224244 1218344 1212615 1207792 1204287 1201612 1198471 1193909 1188493 1184148 1182681 1184514 1188620 1193375
52228 1193375 1197554 1201047 1204984 1211044 1220318 1232691 1247200 1262764 1278523 1293810 1308316 1322443
52216 1322443 1337240 1353525 1370900 1387808 1402713 1415226 1425994 1435678 1444230 1450996 1455171 1456203
52204 1456203 1454179 1449813 1443671 1435402 1424413 1411590 1399598 1390604 1383820 1375934 1364013 1347685 1328733
52191 1328733 1309393 1291249 1275024 1260704 1247760 1235529 1223572 1211778 1200223 1188862 1177306
52180 1177306 1165124 1152537 1140508 1129816 1120287 1111410 1103384 1096865 1091831 1087578 1084014 1082091 1082398
52167 1082398 1083939 1084927 1084485 1083119 1081872 1081501 1082273 1084027 1086466 1089637 1093869 1098975 1103921 1107844 1111161
52152 1111161 1115093 1120259 1126327 1132861 1139677 1146260 1151660 1155415 1157972 1159718 1160207 1159092 1157498 1157427 1159510
52137A159510K548Q58j032j150K12J152M92j167k461k507j145J134L097L393J939
52122A164873K81q9N50P21k20j491k144k117j859j616j360r74l73K52M15M7N0
52105A154946J283L047L672K803K109L087N160O782P542Q168Q892R105Q564P881
52091A233041P585P510P479P977R626J2222J4700J6016J5994J5399J5282J6183
52079A379014J7778J9175J9677J9406J9271K0079K1567K2606K2606K2308K2658
52068A606145K3299K3052K1706K0329J9761J9711J9666J9716K0008K0178J9790
52057A833361J8660J6435J2800Q490N025K858Q47j690l840m976o293q848j1336
52044A861493j1940j1493j2438j4905j6349j5294j3154j1686j0763r574q126o357
$$ plain form
52137 1159510 1162058 1162916 1161884 1160734 1160946 1162098 1162590 1161423 1158962 1156455 1155310 1156444 1159541 1162934 1164873
52122 1164873 1165154 1165065 1165615 1166336 1166116 1164625 1162481 1160364 1158505 1156889 1155529 1154555 1154182 1154434 1154849 1154896 1154946
52105 1154946 1156229 1159276 1162948 1165751 1167860 1170947 1176107 1182889 1190431 1198599 1207491 1216596 1225160 1233041
52091 1233041 1240626 1248136 1255615 1263592 1273218 1285440 1300140 1316156 1332150 1347549 1362831 1379014
52079 1379014 1396792 1415967 1435644 1455050 1474321 1494400 1515967 1538573 1561179 1583487 1606145
52068 1606145 1629444 1652496 1674202 1694531 1714292 1734003 1753669 1773385 1793393 1813571 1833361
52057 1833361 1852021 1868456 1881256 1889746 1894771 1897629 1898476 1896786 1892946 1887970 1881677 1872829 1861493
52044 1861493 1849553 1838060 1825622 1810717 1794368 1779074 1765920 1754234 1743471 1733897 1725771 1719414
52032A719414l396Q23M607O488P136P903Q640Q487P943Q383R938J1546J2840J4367
52018A825119J5956J6466J5526J4203J3403J2733J1558J0206R293Q391O371L011
52006A962236m10k519l490m871p686j1223j4186j6576j9440k2795k5189k5838
51994A808013k6032k7231k8756k8776k7048k5205k4517k4785k5405k6070k6138
51983A518050k4802k2559k1223k1707k2705k2460k0883j9017j7228j5172j3152
51972A297142j2070j2008j1863j0769r080p570o383n450n528p790j2110j6378
51960A180143j8255j7474j5877j5204j5628j6547j7703j8696j8392j6276j3982
51949I96109j3842j5849j7543j7327j6202j5557j4985j3666j2443j2586j3292
$$ plain form
52032 1719414 1716018 1716841 1721448 1727936 1735072 1742975 1751615 1760102 1768045 1776428 1786366 1797912 1810752 1825119
52018 1825119 1841075 1857541 1873067 1887270 1900673 1913406 1924964 1935170 1944463 1952854 1959225 1962236
52006 1962236 1961826 1959307 1955817 1950946 1943260 1932037 1917851 1901275 1881835 1859040 1833851 1808013
51994 1808013 1781981 1754750 1725994 1697218 1670170 1644965 1620448 1595663 1570258 1544188 1518050
51983 1518050 1493248 1470689 1449466 1427759 1405054 1382594 1361711 1342694 1325466 1310294 1297142
51972 1297142 1285072 1273064 1261201 1250432 1241352 1233782 1227399 1221949 1216421 1208631 1196521 1180143
51960 1180143 1161888 1144414 1128537 1113333 1097705 1081158 1063455 1044759 1026367 1010091 996109
51949 996109 982267 966418 948875 931548 915346 899789 884804 871138 858695 846109 832817
51938H32817j2577j0444r024r299r711q835p647p725q531q125o054l849k733k269
51924G25994j695j431k458m737p003q101q005p564p613q392r517j0223r893q666
51910F30696p485p151p279o721n135l529k784k324j037Q90K230K707L501N314
51896F01893O982O817M690K137P84J113K363L052K113qj827k744l643n017n583
51881F13122l963r57J473K891M441O349P350O975O502O854P107O179M678L798
51867F72799L412K735J949J611R97j278m964q044r147q916q687q820q881q514
51853F16252p515n694l252r43O17J525K141K296J381p62l333n096n460m828l825
51838E83504k449n96Q10L78j622k786j311J518K661Q02k649n583o881o365m655
$$ plain form
51938 832817 820240 809796 800772 791473 781762 772927 765280 757555 749024 740899 734845 730996 728263 725994
51924 725994 724299 722868 720410 715673 708670 700569 692564 685000 677387 668995 659478 649255 639362 630696
51910 630696 623211 616060 608781 602060 596925 593396 590612 588288 587251 588141 590371 593078 596579 601893
51896 601893 608875 615692 620382 622519 623303 624416 626779 629831 631944 631936 630109 627365 623722 618705 613122
51881 613122 609159 608202 609675 612566 617007 623356 630706 637681 644183 651037 658144 664323 669001 672799
51867 672799 676211 678946 680895 682506 683503 682225 677261 669217 660070 651154 642467 633647 624766 616252
51853 616252 608737 603043 599791 598848 599465 600990 603131 605427 606808 606046 602713 597617 592157 587329 583504
51838 583504 581055 580459 581269 581647 580025 577239 575928 577446 580107 580909 578260 572677 565796 559431 554776
51823E54776l298l617m895n009l285j463j120j504r56N90J775J899J641J991L237
51808E40762M816N579M652K587J028O67K84j331l298l667k094l43j78j720l715
51793E44029m607l547j118J057K077K586L157K758L79k428k742k56J846P91k575
51778E41407n436o516o613o613o469n946n175m334l545l049l016l240l447l724
51764D74284m089l922k558m72P79R2j969l728l932k726j329r28j702k745k911
51749D42144j819j49J070J483J711K447L342L170J342j112k473k129j116j021
51735D46890k543m853o046m752j884k94j821m937o386n016k666j198k76J183K815
51720D08216L477L244L178L422K981J591M93Q36K133K988K899K645L066M016M716
$$ plain form
51823 554776 551478 547861 542966 537957 534672 533209 532089 530585 529629 530219 531994 533893 535534 537525 540762
51808 540762 545578 551157 555809 558396 559424 560091 560375 559044 555746 552079 549985 549642 549464 547744 544029
51793 544029 539422 535875 534757 535814 537891 540477 543634 546392 546771 544343 541601 541345 543191 543982 541407
51778 541407 535971 529455 522842 516229 509760 503814 498639 494305 490760 487711 484695 481455 478008 474284
51764 474284 470195 466273 463715 463243 464022 464114 462145 458417 454485 451759 450430 449502 447800 445055 442144
51749 442144 440325 440176 441246 442729 444440 446887 450229 453399 454741 453629 451156 449027 447911 446890
51735 446890 444347 439494 433448 428696 426812 426518 424697 419760 413374 408358 405692 404494 404218 405401 408216
51720 408216 411693 414937 418115 421537 424518 426109 426602 427438 429571 432559 435458 438103 441169 445185 449901
51705D49901M817M748N038N587N957O135O489O958O832N621L637J411q92l067
51691E09172m400m391l771l928n267o764p384p352p563q082p804n688k104J354
51677D36028L326L758L461L007K472K021J986K272K371K297K746L803M166K554
51663D76268m89l115m325m633m687m364l643l241l623m041l447k042j075j181
51649D32362j773k137k281k305j667J18K375L754L866L538L184J976n61k854k595
51634D35000L48L565M839M119K411J22k467m208m009k382p57L64J371J940J172
51619D41428n19j285l02J058J366J225J980L353L847L023J948J482J526J876K540
51604D64546K938K193O67N3J200K896L621L537L608L674K881J581J158J867K293
$$ plain form
51705 449901 454718 459466 464504 470091 476048 482183 488672 495630 502462 508083 511720 513131 512239 509172
51691 509172 504772 500381 496610 492682 487415 480651 473267 465915 458352 450270 442466 436778 434674 436028
51677 436028 439354 443112 446573 449580 452052 454073 456059 458331 460702 462999 465745 469548 473714 476268
51663 476268 475779 472664 468339 463706 459019 454655 451012 447771 444148 440107 436660 434618 433543 432362
51649 432362 430589 428452 426171 423866 422199 422317 424692 428446 432312 435850 439034 441010 440449 437595 435000
51634 435000 435348 438913 443752 447871 450282 450404 447937 443729 439720 437338 436581 436945 438316 440256 441428
51619 441428 440909 439624 439322 440380 441746 442971 444951 448304 452151 455174 457122 458604 460130 462006 464546
51604 464546 467484 469677 470344 470397 471597 474493 478114 481651 485259 488933 491814 493395 494553 496420 498713
51589D98713J401j49j304k056k697k752j784o60p60k192l781m621m732m441m158
51574D64027m550n813o731n802l461j894k113k636j904p18q20j962k194q94K34
51559D22769k71j560j994j744k312l661l421R1N014P560O363L780K454K171J394
51544D36633O50K019N393P687O708M033K773L774N525O634O641N073J744k027
51530D93260m222m498m480n366o507o699n686l792j155J910M535O032O546O575
51516D76453O384O256O637P482Q143Q409R077J0686J2309J2523J1320J0200J0335
51503E96214J1420J2473J3144J3859J5036J6650J8639K1419K5470L0080L2983
51492H07387L2097K7902K3158J9814J6883J2226N857K54k801m428p115j1769j7177
$$ plain form
51589 498713 500114 499965 498661 496605 493908 491156 489372 488712 487952 485760 481979 477358 472626 468185 464027
51574 464027 459477 453664 446933 441131 437670 435776 433663 431027 429123 428405 427585 425623 423429 422535 422769
51559 422769 422498 420938 418944 417200 414888 411227 407806 407897 412911 420471 426834 430614 433068 435239 436633
51544 436633 437283 439302 444695 452382 459090 463123 465896 469670 475195 481829 488470 493543 495287 493260
51530 493260 489038 484540 480060 474694 468187 461488 455802 452010 450855 452765 457300 463332 469878 476453
51516 476453 482837 489093 495730 503212 511355 519764 528841 539527 551836 564359 575679 585879 596214
51503 596214 607634 620107 633251 647110 662146 678796 697435 718854 744324 774404 807387
51492 807387 839484 867386 890544 910358 927241 939467 945324 945578 942777 938349 931234 919465 902288
51479I02288k1960k5834k8758k9950k8745k6063k3944k3467k3781k3494k2284
51468F24008k0679j8889j6764j4582j3014j2183j1481j0382q919p231n369l649
51456D80866k624k350k223j898j710j745j077J182M185N566L775q9l071l043n57
51441D75187J866K146L07k080l701m501n116n767n924n040l441k242k182k732
51427D36780k857k522k682l684m696n110n387n716n053k779l75K06q04j736k243
51412C91342l142l835k573J96J473j21k172k046m81K83J18L90J113J299J240K046
51396C85130L320L634L056K985L621L824L439L444L679K814J118P87K551M345
51382D27747M540M276M913N259L523P08l53J255L667M813M065J707j465l891m236
$$ plain form
51479 902288 880328 854494 825736 795786 767041 740978 717034 693567 669786 646292 624008
51468 624008 603329 584440 567676 553094 540080 527897 516416 506034 497115 489884 484515 480866
51456 480866 478242 475892 473669 471771 470061 468316 467239 468421 472606 478172 481947 481858 478787 475744 475187
51441 475187 477053 479199 479506 477426 473725 469224 464108 458341 452417 447377 443936 441694 439512 436780
51427 436780 433923 431401 428719 425035 420339 415229 409842 404126 399073 396294 395919 396125 395321 393585 391342
51412 391342 388200 384365 381792 381988 383461 383340 381168 379122 378641 378924 379042 379432 380545 381844 383084 385130
51396 385130 388450 392084 395140 398125 401746 405570 409009 412453 416132 418946 420064 420851 423402 427747
51382 427747 432287 436563 441476 446735 450258 450966 450613 451868 455535 460348 464413 466120 464655 460764 456528
51367D56528l033k298l121m570n050l964j952k95j33j377k380j536O81K249K208
51352D31957J662J938K919L858M688N510N561M027J665M04R84J969J690N34L83
51337D69749J888L340K838R13NJ374L730N256N978P108Q849J0253J0980J1806
51323E44067J3174J4564J5745J7439K0015K2647K4688K6908L0107L3241L4415
51312G97010L3415L1835L0715K9554K7802K5699K3093J8866J2598N545j089p815
51300A027228j5376k2598k7539l0357l3009l5982l7445l6376l4645l4441l4976
51289F84484l3548k9375k4585k1324j9419j7365j4568j1775r855q880q308p667
51277D77815p009o725p002p473p586p106o133m864l629k850k587k327j642q40
$$ plain form
51367 456528 453495 451197 448076 443506 438456 434492 432540 432245 432112 430735 428355 426819 427500 429749 431957
51352 431957 433619 435557 438476 442334 447022 452532 458093 462120 463785 464189 465173 467142 468832 469366 469749
51337 469749 471637 474977 477815 478728 478733 480107 483837 489093 495071 502179 511028 521281 532261 544067
51323 544067 557241 571805 587550 604989 625004 647651 672339 699247 729354 762595 797010
51312 797010 830425 862260 892975 922529 950331 976030 999123 1017989 1030587 1036132 1035043 1027228
51300 1027228 1011852 989254 961715 931358 898349 862367 824922 788546 753901 719460 684484
51289 684484 650936 621561 596976 575652 556233 538868 524300 512525 502670 493790 485482 477815
51277 477815 470806 464081 457079 449606 442020 434914 428781 423917 420288 417438 414851 412524 410882 410042
51263D10042m71m89m54l74n73r21j002r69j311j666r40J018K773K923J620j6j277
51246D07913k066k345k198j924j483l84J351K693K812K127J305J2k114l779l059
51231C98861k25K024J675m27k093k308j454P2K166M296N493N186L664J770L99
51216D19099o1j10n82j413j489l31P68K29j505k368j396J57Q33R23J544K517K487
51199D19302J042m74o86J18O07J97n99j374k381l517l684k024M93J722Q17p41
51183D08818j038k3Q26O33Rj61Q4J32l41j283k451l222k705p41J397K064J000
51166D02998n59j418j493j237q27k85J23J87J25K77P25J533K953M773N882N295
51150D19052L547K231K063K100J164o78k373k990k127J15K761M047K799k26k977
$$ plain form
51263 410042 409571 409082 408628 408254 407681 406760 405758 404789 403478 401812 400872 401890 404663 407586 409206 409190 407913
51246 407913 405847 403502 401304 399380 397897 397513 398864 401557 404369 406496 407801 407813 405699 401920 398861
51231 398861 398636 400660 402335 401908 399815 397507 396053 396125 398291 402587 408080 413266 416930 418700 419099
51216 419099 419038 418928 418346 416933 415444 415113 415881 416110 414605 412237 410841 410998 411831 412754 414298 416815 419302
51199 419302 420344 419870 419184 419302 419909 420106 419507 418133 415752 412235 408551 406527 407020 408742 409559 408818
51183 408818 407780 407757 408583 409216 409225 409064 409148 409280 408939 407656 405205 401983 399278 398537 399934 401998 402998
51166 402998 402439 401021 399528 398291 397464 397179 397302 397489 397614 397891 398616 400149 403102 407875 413757 419052
51150 419052 422599 424830 426893 428993 430157 429479 427106 424116 421989 422104 424865 428912 431711 431485 428508
51135D28508m055l546k206p12K11m2j081j535n90R63J737J395N88k64j202j868
51119D16301j511j55J058J203O45K56J46j81o87o94N9J013J681K395L688N205
51103D30422N756M550K152N3p03l83q3n00j352j990k142j835r93L98J766K256
51087D37372J645N25n69j698k892l593l254k152j028j53O06R36K03j350k384j978
51071D20236q86n22j023j083K12K087L079K794K143J993K243K299J984J575J253
51056D38384R31O00M16M71P22J300K538M306N519M804K006j124k276q63J295K063
51040D61092J574J980M360O786O457L226j19j092J25J768K664K587J588P9q46
51025D92229m65M61N49l01q11k41O79R78P46P72J383K200K680K544J933J391J460
$$ plain form
51135 428508 424453 420907 418701 417989 418200 418158 417077 415542 414952 415915 417652 419047 419635 419371 418169 416301
51119 416301 414790 414635 415693 416896 417541 417797 417943 417762 417075 416381 416440 417453 419134 421529 425217 430422
51103 430422 436178 440728 442880 442933 442230 441847 441764 441264 439912 437922 435780 433945 432952 433350 435116 437372
51087 437372 439017 439542 438973 437275 434383 430790 427536 425384 424356 424203 424809 425745 425948 424598 422214 420236
51071 420236 419350 418828 417805 416722 416934 419021 422100 424894 427037 429030 431273 433572 435556 437131 438384
51056 438384 439315 439915 440331 440802 441524 442824 445362 449668 455187 459991 461997 460873 458597 457734 459029 461092
51040 461092 462666 464646 469006 475792 482249 485475 485356 484264 484389 486157 488821 491408 492996 493075 492229
51025 492229 491764 492225 492774 492473 491662 491421 492100 493078 493824 494596 495979 498179 500859 503403 505336 506727 508187
51008E08187K166L083L876M454M660M403M157M677O021P282P534O685N379M535
50994E77099M940O550Q043Q095P306P786J0169J2207J1487Q698O664O531O528
50981F82103M722J562j073k340k993m027n618p373r034j0648j2173j3048j2429
50968F07631j0137p239n212m415l853k566q32L58P16J085K414M609O513P032O304
50953F02408N605N975P134Q029Q387R073J0684J2356J2647J1381R937R527J0024
50940G23167J0705J1569J3047J4853J6038J6270J6193J6308J6436J6625J7551
50929H88762J9173K0003J9028J7672J8117J9975K0492J8396J5609J4284J3961
50918A085472J3224J2677J4303J8298K2599K5645K8165L1841L7290M3677M9600
$$ plain form
51008 508187 510353 513436 517312 521766 526426 530829 534986 539663 545684 552966 560500 567185 572564 577099
50994 577099 582039 588589 596632 604727 612033 619819 629988 642195 653682 662380 669044 675575 682103
50981 682103 686825 688387 687314 684974 681981 677954 672336 664963 655929 645281 633108 620060 607631
50968 607631 597494 590255 585043 580628 576775 574209 573377 573735 574451 575536 577950 582559 589072 596104 602408
50953 602408 608013 613988 621122 629151 637538 646611 657295 669651 682298 693679 703616 713143 723167
50940 723167 733872 745441 758488 773341 789379 805649 821842 838150 854586 871211 888762
50929 888762 907935 927938 946966 964638 982755 1002730 1023222 1041618 1057227 1071511 1085472
50918 1085472 1098696 1111373 1125676 1143974 1166573 1192218 1220383 1252224 1289514 1333191 1382791
50907A382791N4189N7978O2503O8363P3885P6848P7347P7680P9309Q1152Q1249
50896B173294P8877P4556O9121O3494N8236N2644M5118L5229K4591J5033O766
50885B696959q54p731j3347j7854k1624k4337k5800k7144k9723l2967l4923l5023
50873B425632l4892l6041l8082l9844m1020m1873m2274m2162m2417m4159m7405
50862A975463n1121n4439n6993n8269n7601n5082n1814m8752m5781m2442l9069
50851A414100l6487l4626l2254k8554k4430k1515k0103j8891j6952j5062j4378
50840A150848j4427j3500j0969q258p111p601q241p636n584k871n27R18J770K728
50826A069539L963N013N669O384P304P632O905O438Q187J2083J5679J6982J6628
$$ plain form
50907 1382791 1436980 1494958 1557461 1625824 1699709 1776557 1853904 1931584 2010893 2092045 2173294
50896 2173294 2252171 2326727 2395848 2459342 2517578 2570222 2615340 2650569 2675160 2690193 2696959
50885 2696959 2696105 2688374 2675027 2657173 2635549 2611212 2585412 2558268 2528545 2495578 2460655 2425632
50873 2425632 2390740 2354699 2316617 2276773 2235753 2193880 2151606 2109444 2067027 2022868 1975463
50862 1975463 1924342 1869903 1812910 1754641 1697040 1641958 1590144 1541392 1495611 1453169 1414100
50851 1414100 1377613 1342987 1310733 1282179 1257749 1236234 1216131 1197240 1180288 1165226 1150848
50840 1150848 1136421 1122921 1111952 1103694 1096583 1088982 1080741 1073105 1067521 1064650 1064123 1065041 1066811 1069539
50826 1069539 1073502 1078515 1084184 1090568 1097872 1105504 1112409 1118847 1127034 1139117 1154796 1171778 1188406
50813A188406J6635J7917J9935K2026K4013K5835K7609K9937L3249L7035M0622
50802A483219M4458M9517N5568O1313O6400P1909P8496Q5430R2117R9281J07583
50791B295291J16295J24496J32580J41222J49661J56575J62137J67566J72915
50782C618738J76896J78904J79321J77545J71494J59970J44181J26031J05995
50773E039075Q3742N9904L6048J3314p919k7287m4171n8044o8517p5294p8672
50762D872179p9654p8968p6246p0960o4148n8448n6129n7339o0497o4159o8390
50751D137241p4323q2523r2059j01325j09448j16405j22056j25841j27420j26972
50741C058869j24656j20523j15093j09228j03117r6098q7822p8830o9670o0395
$$ plain form
50813 1188406 1205041 1222958 1242893 1264919 1288932 1314767 1342376 1372313 1405562 1442597 1483219
50802 1483219 1527677 1577194 1632762 1694075 1760475 1832384 1910880 1996310 2088427 2187708 2295291
50791 2295291 2411586 2536082 2668662 2809884 2959545 3116120 3278257 3445823 3618738
50782 3618738 3795634 3974538 4153859 4331404 4502898 4662868 4807049 4933080 5039075
50773 5039075 5122817 5182721 5218769 5232083 5224164 5196877 5152706 5094662 5026145 4950851 4872179
50762 4872179 4792525 4713557 4637311 4566351 4502203 4443755 4387626 4330287 4269790 4205631 4137241
50751 4137241 4062918 3980395 3888336 3787011 3677563 3561158 3439102 3313261 3185841 3058869
50741 3058869 2934213 2813690 2698597 2589369 2486252 2390154 2302332 2223502 2153832 2093437
50731B093437n1433m3984l8666l4522l0182k5534k1426j8392j6475j5706j5720
50720A781397j5394j3912j1945j0717j0362j0170j0262j1634j4457j7401j9065
50709A636078j9402j9468k0244k1764k2990k2751k1145j9616j9090j8622j6819
50698A414167j3983j1549r727p299l843o59J143K322M552Q487J3387J8061K1704
50685A436763K4327K6817L0305L5238M1182M7351N2935N7317O0865O5108P1100
50674A949308P7684Q2486Q4696Q5761Q7267Q9364R1423R2955R3412R2373R0393
50663B917122Q8384Q5687Q0110P0774N9587M8880L8730K7686J5079J397j2768
50652C420668k6630l8704m7677n3526n6839n7529n5428n1610m7703m4071l9893
$$ plain form
50731 2093437 2042004 1998020 1959354 1924832 1894650 1869116 1847690 1829298 1812823 1797117 1781397
50720 1781397 1766003 1752091 1740146 1729429 1719067 1708897 1698635 1687001 1672544 1655143 1636078
50709 1636078 1616676 1597208 1576964 1555200 1532210 1509459 1488314 1468698 1449608 1430986 1414167
50698 1414167 1400184 1388635 1378908 1371609 1367766 1367107 1368250 1370572 1375124 1383611 1396998 1415059 1436763
50685 1436763 1461090 1487907 1518212 1553450 1594632 1641983 1694918 1752235 1813100 1878208 1949308
50674 1949308 2026992 2109478 2194174 2279935 2367202 2456566 2547989 2640944 2734356 2826729 2917122
50663 2917122 3005506 3091193 3171303 3242077 3301664 3350544 3389274 3416960 3432039 3433436 3420668
50652 3420668 3394038 3355334 3307657 3254131 3197292 3139763 3084335 3032725 2985022 2940951 2901058
50641B901058l5057l0831k8519k8309k9566l1535l3778l6583m0837m6763n2991
50630B506289n7663o0254o1458o1595o0244n7434n3979n0208m5345l8595l0353
50619A929161k2008j4850r177l989K369J0436J8516K4033K6259K7059K8784L2041
50607B048634L5620L7928L8122L6506L4287L2669L1951L1673L1600L2064L3320
50596B424374L5122L7089L9039M0809M2179M3177M4227M5922M8837N3214N8363
50585B912352O2691O5176O6692O9106P2929P6592P8152P7007P3838O9702O5413
50574C689650O1097N6054M9676M2682L6557L1507K5808J7614O620o471k1050l6160
50562C953584m9772n9588o4567o5007o1569n5122m7238l9669l3011k6456j9275
$$ plain form
50641 2901058 2866001 2835170 2806651 2778342 2748776 2717241 2683463 2646880 2606043 2559280 2506289
50630 2506289 2448626 2388372 2326914 2265319 2205075 2147641 2093662 2043454 1998109 1959514 1929161
50619 1929161 1907153 1892303 1883126 1879137 1881506 1891942 1910458 1934491 1960750 1987809 2016593 2048634
50607 2048634 2084254 2122182 2160304 2196810 2231097 2263766 2295717 2327390 2358990 2391054 2424374
50596 2424374 2459496 2496585 2535624 2576433 2618612 2661789 2706016 2751938 2800775 2853989 2912352
50585 2912352 2975043 3040219 3106911 3176017 3248946 3325538 3403690 3480697 3554535 3624237 3689650
50574 3689650 3750747 3806801 3856477 3899159 3935716 3967223 3993031 4010645 4017265 4010794 3989744 3953584
50562 3953584 3903812 3844224 3779657 3714650 3653081 3597959 3550721 3511052 3478041 3451585 3432310
50551C432310j2096o473l382k389k358k996n542j1679k1675l3903m6281n7638
50539C225898o7568p5655q1706q6346r0418r3709r4948r3413q9900q5778q1574
50528B284883p7029p2110o7139o1862n5414m7826m0874l6447l4200l1843k7859
50517A732280k2963j8529j4755j1217q121n658k844J379O171R524J1079J2583
50505A688929J5206J8058K0204K2588K6667L2121L7232M0906M3170M4279M4698
50494B034058M5608M7961N0990N2780N2628N1893N2227N3741N5401N6661N8198
50483B612146O1176O6083P2347P9140Q6469R5041J04796J14255J22071J28940
50473C542464J37078J47604J59095J69058J76448J82333J88186J93793J97176
$$ plain form
50551 3432310 3420214 3413741 3410359 3407970 3405612 3402616 3397074 3385395 3363720 3329817 3283536 3225898
50539 3225898 3158330 3082675 3000969 2914623 2824205 2730496 2635548 2542135 2452235 2366457 2284883
50528 2284883 2207854 2135744 2068605 2006743 1951329 1903503 1862629 1826182 1791982 1760139 1732280
50517 1732280 1709317 1690788 1676033 1664816 1656695 1651037 1648193 1649572 1655743 1665267 1676346 1688929
50505 1688929 1704135 1722193 1742397 1764985 1791652 1823773 1861005 1901911 1945081 1989360 2034058
50494 2034058 2079666 2127627 2178617 2231397 2284025 2335918 2388145 2441886 2497287 2553948 2612146
50483 2612146 2673322 2739405 2811752 2890892 2977361 3072402 3177198 3291453 3413524 3542464
50473 3542464 3679542 3827146 3986241 4155299 4331747 4514080 4702266 4896059 5093235
50464E093235J96695J92936J87815J81821J73096J59637J41574J20504R7403P2249
50454F616965M5216J6975j1989m1149o8992r3486j13784j30572j44365j54286
50444E920533j58822j57102j49279j36531j20944j04309q6607o6692m5013k4442
50434D870792p324P109K0756L2577L8394L5100K3586O848j3351l6818o2736q8858
50422D826075j13008j34241j51992j65121j72666j75218j74652j72499j69069
50413C397609j63988j56813j47149j35177j22418j11080j02026r4005q5607p7132
50403B202214o9609o2725n5165m6811l9028l2578k6662k0599j5126j1190q430
50392A814291n863l376j482j09J324K895M201N125N753N759N062M866O556R251
$$ plain form
50464 5093235 5289930 5482866 5670681 5852502 6025598 6185235 6326809 6447313 6544716 6616965
50454 6616965 6662181 6679156 6667167 6626018 6557026 6463540 6349756 6219184 6074819 5920533
50444 5920533 5761711 5604609 5455330 5318799 5197855 5093546 5006939 4940247 4895234 4870792
50434 4870792 4863468 4870577 4891333 4923910 4962304 4997404 5020990 5027838 5014487 4977669 4914933 4826075
50422 4826075 4713067 4578826 4426834 4261713 4089047 3913829 3739177 3566678 3397609
50413 3397609 3233621 3076808 2929659 2794482 2672064 2560984 2458958 2364953 2279346 2202214
50403 2202214 2132605 2069880 2014715 1967904 1928876 1896298 1869636 1849037 1833911 1822721 1814291
50392 1814291 1808428 1805052 1803570 1803461 1804785 1807680 1811881 1817006 1822759 1828518 1833580 1838446 1845002 1854253
50378A854253R988P311L580K407M493P483R545J1269J3724J6425J8516K0602K3901
50365B003497K8089L1795L5056L9552M5900N2349N7118O0794O5150P0556P5996
50354B565852Q1063Q6331R1729R6111R8679R9709R9554R8014R5084R1182Q6136
50343C589444P9048O9863N9874M9728L8103K3547O896r761k5952m2886o0576p6687
50331C700641q8919r7166j02502j05129j04492j00642r4283q5794p5340o3803
50321B782571n2393m1138k8872j5276k181P868J3896J6737J7386J5787J1201L182
50309B728768p872k0663l3474m5050n5102o3824p1081p6464p9910q1739q2180
50298B111409q1336p9452p6757p3178o8862o4609o0921n6909n1373m4960l9716
$$ plain form
50378 1854253 1864241 1871552 1875132 1877539 1882032 1889515 1899060 1910329 1924053 1940478 1958994 1979596 2003497
50365 2003497 2031586 2063381 2098437 2137989 2183889 2236238 2293356 2354150 2419300 2489856 2565852
50354 2565852 2646915 2733246 2824975 2921086 3019765 3119474 3219028 3317042 3412126 3503308 3589444
50343 3589444 3668492 3738355 3798229 3847957 3886060 3909607 3916503 3906742 3880790 3837904 3777328 3700641
50331 3700641 3611722 3514556 3412054 3306925 3202433 3101791 3007508 2921714 2846374 2782571
50321 2782571 2730178 2689040 2660168 2644892 2642711 2650579 2664475 2681212 2698598 2714385 2725586 2728768
50309 2728768 2720896 2700233 2666759 2621709 2566607 2502783 2431702 2355238 2275328 2193589 2111409
50298 2111409 2030073 1950621 1873864 1800686 1731824 1667215 1606294 1549385 1498012 1453052 1413336
50287A413336l6235l2929k8751k4863k2317j9761j5267r229l584J071N363Q880
50275A235714J0376J0204J0179J0703J0181P747M540J559j633n053p151o961n811
50262A274594n380n414m952m606n703p867r258q985p854o825n962m866l283j370
50248A192269J41M91R9L92J779K920K921L004M633P136Q910R886J0712J0425P556
50233A263274L331R59J310J814N86p96k3K256L383K118m72k790l943l684k472
50218A264851j275k79J739N651R842J1142Q064K214l707q377j1935j4494j5575
50205A247861j5017j3617j2361j1342r888p672n105k582j47J931L164L907N484
50192A184616Q323J0836J1249J0021R192R814J1406J3449J5651J6895J5942J3550
$$ plain form
50287 1413336 1377101 1344172 1315421 1290558 1268241 1248480 1233213 1223984 1220400 1221471 1226834 1235714
50275 1235714 1246090 1256294 1266473 1277176 1287357 1295104 1299644 1301203 1299570 1294517 1287366 1280405 1274594
50262 1274594 1269214 1263800 1258848 1254242 1248539 1240672 1231414 1222429 1214575 1207750 1201788 1196922 1193639 1192269
50248 1192269 1192410 1192901 1193000 1193392 1195171 1198091 1201012 1204016 1208649 1215785 1224695 1234581 1245293 1255718 1263274
50233 1263274 1266605 1267564 1268874 1270688 1271274 1270478 1270455 1272711 1276094 1278212 1277740 1274950 1271007 1267323 1264851
50218 1264851 1263576 1263297 1265036 1270687 1280529 1291671 1299735 1301949 1298242 1289865 1277930 1263436 1247861
50205 1247861 1232844 1219227 1206866 1195524 1185636 1177964 1172859 1170277 1170130 1172061 1175225 1179132 1184616
50192 1184616 1192939 1203775 1215024 1225045 1234237 1244051 1255457 1268906 1284557 1301452 1317394 1330944
50180A330944J2060J2279J2528J1398R729Q775Q217P381O900P347P345N005N84
50167A440492m026q041j2254j7000k1413k4859k7641k9851l0824l0152k8194k5270
50155A180967k1329j6955j3749j2880j3765j4815j5315j5986j7689k0017k1404
50144I97063k0786j8864j7442j7474j8155j8128j7112j5919j5211j4733j3705
50133H09534j1739r411p945q013q901r316q934q398p929p004n640m759m727m821
50119G01997m769n477p068p627n448j584J431K702L120L175K614J931K124K918
50105F90039L160L091M247O735Q631Q791Q424Q933R854J0203J0364J1215J2366
50092G96053J2750J2262J1559J0770R660Q733Q842R760J0048Q717O402M818N268
$$ plain form
50180 1330944 1343004 1355283 1367811 1379209 1388938 1397713 1405930 1413311 1420211 1427558 1434903 1439908 1440492
50167 1440492 1436466 1428425 1416171 1399171 1377758 1352899 1325258 1295407 1264583 1234431 1206237 1180967
50155 1180967 1159638 1142683 1128934 1116054 1102289 1087474 1072159 1056173 1038484 1018467 997063
50144 997063 976277 957413 939971 922497 904342 886214 869102 853183 837972 823239 809534
50133 809534 797795 788384 780439 772426 763525 754209 745275 736877 728948 721944 716304 711545 706818 701997
50119 701997 697228 691751 684683 677056 671608 670024 671455 674157 677277 680452 683066 684997 687121 690039
50105 690039 693199 696290 700537 707272 715903 724694 733118 742051 751905 762108 772472 783687 796053
50092 796053 808803 821065 832624 843394 853054 861787 870629 880389 890437 899154 905556 910374 915642
50079I15642P729J1075J4089J6256J7603J8358J9248K1593K5917L0584L3125L3238
50067A164457L3305L5431L9112M2405M4282M4933M4753M4127M3595M3366M2983
50056A622749M2110M1034L9901L8119L5022L0402K3982J5446N668l251j0188j6182
50044A864812k2483k8599l3499l7416m0847m2784m2017l9488l7269l5538l2746
50033A472126k8687k5206k3529k2835k1981k0907j9770j8378j7228j7510j9159
50022A236936k0321j9720j8273j7445j7180j6593j5634j4814j4158j3474j3021
50011A056303j2867j2297j0894r544r230r409q796p262n698m292k331K67K480
49998I66430L512L613L330K760J986J558J969L032M049M428L912K560P93p55j745
$$ plain form
50079 915642 923371 934446 948535 964791 982394 1000752 1020000 1041593 1067510 1098094 1131219 1164457
50067 1164457 1197762 1233193 1272305 1314710 1358992 1403925 1448678 1492805 1536400 1579766 1622749
50056 1622749 1664859 1705893 1745794 1783913 1818935 1849337 1873319 1888765 1894433 1891182 1880994 1864812
50044 1864812 1842329 1813730 1780231 1742815 1701968 1659184 1617167 1577679 1540410 1504872 1472126
50033 1472126 1443439 1418233 1394704 1371869 1349888 1328981 1309211 1290833 1273605 1256095 1236936
50022 1236936 1216615 1196895 1178622 1161177 1143997 1127404 1111770 1096956 1082798 1069324 1056303
50011 1056303 1043436 1031139 1020245 1010701 1001471 992062 983266 976004 970306 966014 963683 963950 966430
49998 966430 969942 973555 976885 979645 981631 983189 985158 988190 992239 996667 1000579 1003139 1003932 1003177 1001432
49983A001432k499l694n515p175p525o389m954m425m541m138l052k498l309m638
49969I37080m992l874j862L14K219L717N062O491P415O846N159M377N689P643
49955I81284Q127P333P162Q172R067R335J0366J3161J6498J8499J9012J9301K0016
49942A147333K0569K0387J9762J9445J9797K0566K1303K1945K2813K3758K3517
$$ plain form
49983 1001432 998933 995239 989724 982549 975024 968635 963681 959256 954715 950577 947525 945027 941718 937080
49969 937080 932088 928214 926352 926666 928885 932602 937664 944155 951570 958416 963575 967952 973641 981284
49955 981284 989411 996744 1003906 1012078 1021145 1030480 1040846 1054007 1070505 1089004 1108016 1127317 1147333
49942 1147333 1167902 1188289 1208051 1227496 1247293 1267859 1289162 1311107 1333920 1357678 1381195
$$ [...]
##END NTUPLES=NMR SPECTRUM
##END=
