
##TITLE=AC1045_TOLI01_5867591_BXtukkqvlH
##JCAMPDX= 6.0         $$ Bruker NMR JCAMP-DX V2.0
##DATA TYPE= NMR SPECTRUM
##DATA CLASS= NTUPLES
##ORIGIN= BRUKER
##OWNER= Administrator
$$ 1.72 TOPSPIN		Version 2.1
$$ 2012-03-30 20:26:35.656 -0500  Administrator@TOPSPIN
$$ Compression mode = diff/dup
##.OBSERVE FREQUENCY= 400.13188235
##.OBSERVE NUCLEUS= ^1H
##.ACQUISITION MODE= SIMULTANEOUS (DQD)
##.ACQUISITION SCHEME= undefined
##.AVERAGES= 8
##.DIGITISER RES= 22
##SPECTROMETER/DATA SYSTEM= spect
##.PULSE SEQUENCE= zg30
##.SOLVENT NAME= COFFEE_meoh
##.SHIFT REFERENCE= INTERNAL, COFFEE_meoh, 1, 14.98061
##AUDIT TRAIL= $$ (NUMBER, WHEN, WHO, WHERE, PROCESS, VERSION, WHAT)
$$ ##TITLE= Audit trail, TOPSPIN		Version 2.1
$$ ##JCAMPDX= 5.01
$$ ##ORIGIN= Bruker BioSpin GmbH
$$ ##OWNER= Administrator
$$ $$ C:\Bruker\TOPSPIN/data/COFFEE/nmr/AC1045_TOLI01_5867591_BXtukkqvlH/10/pdata/1/auditp.txt
$$ ##AUDIT TRAIL=  $$ (NUMBER, WHEN, WHO, WHERE, PROCESS, VERSION, WHAT)
(   1,<2012-03-30 20:26:28.859 -0500>,<Administrator>,<TOPSPIN>,<go>,<TOPSPIN 2.1>,
      <created by zg
	started at 2012-03-30 20:25:21.921 -0500,
	POWCHK enabled, PULCHK disabled,
       configuration hash MD5:
       1A 1E CE 29 27 FD 77 03 67 4E F0 E3 C4 B2 CB 90
       data hash MD5: 64K
       AC 2E 8A 29 A8 B1 B3 DB 81 25 61 86 8B 0E 4C 83>)
(   2,<2012-03-30 20:26:31.531 -0500>,<Administrator>,<TOPSPIN>,<proc1d>,<TOPSPIN 2.1>,
      <Start of raw data processing
       efp LB = 0 FT_mod = 6 PKNL = 1 PHC0 = 0 PHC1 = 0 SI = 32K 
       data hash MD5: 32K
       76 66 80 3C C5 86 4E 6A 57 9D 9C F1 CB 2C 2E E7>)
(   3,<2012-03-30 20:26:31.953 -0500>,<Administrator>,<TOPSPIN>,<proc1d>,<TOPSPIN 2.1>,
      <pk PHC0 = 209.5532 PHC1 = 0 
       data hash MD5: 32K
       CA D9 9E 17 31 C4 B2 FC 6E 96 BC 7A D3 FD C3 DF>)
(   4,<2012-03-30 20:26:32.046 -0500>,<Administrator>,<TOPSPIN>,<proc1d>,<TOPSPIN 2.1>,
      <abs ABSG = 1 
       data hash MD5: 32K
       1F 23 EB 42 01 E6 3D 3C AF EA 88 11 8F D7 8D 4F>)
(   5,<2012-03-30 20:26:32.078 -0500>,<Administrator>,<TOPSPIN>,<proc1d>,<TOPSPIN 2.1>,
      <abs ABSG = 2 
       data hash MD5: 32K
       BD D0 F9 85 F2 DA F3 30 E6 95 BD 0D 2D B6 A5 56>)
(   6,<2012-03-30 20:26:32.109 -0500>,<Administrator>,<TOPSPIN>,<proc1d>,<TOPSPIN 2.1>,
      <abs ABSG = 3 
       data hash MD5: 32K
       EA 81 E7 51 D8 80 4C 1C 07 D0 42 97 9B 55 33 D8>)
(   7,<2012-03-30 20:26:32.140 -0500>,<Administrator>,<TOPSPIN>,<proc1d>,<TOPSPIN 2.1>,
      <abs ABSG = 4 
       data hash MD5: 32K
       63 EF 69 8F DC 49 5B 21 5B FD DC 1B F7 67 E3 63>)
(   8,<2012-03-30 20:26:32.171 -0500>,<Administrator>,<TOPSPIN>,<proc1d>,<TOPSPIN 2.1>,
      <abs ABSG = 5 
       data hash MD5: 32K
       83 52 9B 90 AE 34 9B 0A 5C A8 36 BB 18 4B D3 8B>)
$$ ##END=
$$ 
$$ $$ hash MD5
$$ $$ 0F A8 E2 18 14 92 1B 93 74 CA F4 44 13 4D A9 CC
##$RELAX= 
##$RELAX= 
##$RELAX= 
##$RELAX= 
##$RELAX= 
##$RELAX= 
##$RELAX= 
$$ Bruker specific parameters
$$ --------------------------
$$ [...]
##$TP= (0..7)
150 150 150 150 150 150 150 150
##$TP07= 0
##$TPNAME0= <>
##$TPNAME1= <>
##$TPNAME2= <>
##$TPNAME3= <>
##$TPNAME4= <>
##$TPNAME5= <>
##$TPNAME6= <>
##$TPNAME7= <>
##$TPOAL= (0..7)
0.5 0.5 0.5 0.5 0.5 0.5 0.5 0.5
##$TPOFFS= (0..7)
0 0 0 0 0 0 0 0
##$TUNHIN= 0
##$TUNHOUT= 0
##$TUNXOUT= 0
##$USERA1= <user>
##$USERA2= <user>
##$USERA3= <user>
##$USERA4= <user>
##$USERA5= <user>
##$V9= 5
##$VALIST= <valist>
##$VCLIST= <CCCCCCCCCCCCCCC>
##$VD= 0
##$VDLIST= <DDDDDDDDDDDDDDD>
##$VPLIST= <PPPPPPPPPPPPPPP>
##$VTLIST= <TTTTTTTTTTTTTTT>
##$WBST= 2048
##$WBSW= 25
##$XGAIN= (0..3)
0 0 0 0
##$XL= 0
##$YL= 0
##$YMAX_a= 555141
##$YMIN_a= -674895
##$ZGOPTNS= <>
##$ZL1= 120
##$ZL2= 120
##$ZL3= 120
##$ZL4= 120
##$ABSF1= 14.98061
##$ABSF2= -5.57192
##$ABSG= 5
##$ABSL= 3
##$ALPHA= 0
##$AQORDER= 0
##$ASSFAC= 0
##$ASSFACI= 0
##$ASSFACX= 0
##$ASSWID= 0
##$AUNMP= <proc_prof1d_extract_pilot.lims>
##$AXLEFT= 0
##$AXNAME= <>
##$AXNUC= <1H>
##$AXRIGHT= 0
##$AXTYPE= 0
##$AXUNIT= <>
##$AZFE= 0.1
##$AZFW= 0.1
##$BCFW= 0
##$BC_mod= 0
##$BYTORDP= 0
##$COROFFS= 0
##$CY= 15
##$DATMOD= 1
##$DC= 0
##$DFILT= <>
##$DTYPP= 0
##$F1P= 0
##$F2P= 0
##$FCOR= 0.5
##$FTSIZE= 32768
##$FT_mod= 6
##$GAMMA= 0
##$GB= 0
##$INTBC= 1
##$INTSCL= 1
##$ISEN= 128
##$LB= 0
##$LEV0= 0
##$LPBIN= 0
##$MAXI= 10000
##$MC2= 0
##$MEAN= 0
##$ME_mod= 0
##$MI= 0
##$NCOEF= 0
##$NC_proc= -8
##$NLEV= 6
##$NOISF1= 0
##$NOISF2= 0
##$NSP= 0
##$NTH_PI= 0
##$NZP= 0
##$OFFSET= 14.98061
##$PC= 1
##$PHC0= 209.5532
##$PHC1= 0
##$PH_mod= 1
##$PKNL= yes
##$PPARMOD= 0
##$PPDIAG= 0
##$PPIPTYP= 0
##$PPMPNUM= 2147483647
##$PPRESOL= 1
##$PSCAL= 4
##$PSIGN= 0
##$PYNMP= <proc.py>
##$REVERSE= no
##$SF= 400.13
##$SI= 32768
##$SIGF1= 0
##$SIGF2= 0
##$SINO= 400
##$SIOLD= 32768
##$SPECTYP= <>
##$SREGLST= <1H.CDCl3>
##$SSB= 0
##$STSI= 32768
##$STSR= 0
##$SW_p= 8223.68421052632
##$SYMM= 0
##$S_DEV= 0
##$TDeff= 65536
##$TDoff= 0
##$TI= <>
##$TILT= no
##$TM1= 0
##$TM2= 0
##$TOPLEV= 0
##$USERP1= <user>
##$USERP2= <user>
##$USERP3= <user>
##$USERP4= <user>
##$USERP5= <user>
##$WDW= 1
##$XDIM= 32768
##$YMAX_p= 464562672
##$YMIN_p= -740400
##$CURPLOT= <Network HP LaserJet P1505>
##$CURPRIN= <$Network HP LaserJet P1505>
##$DFORMAT= <normdp>
##$LAYOUT= <+/1D_H.xwp>
##$LFORMAT= <normlp>
##$PFORMAT= <normpl>
##$SURQMSG= 1
$$ End of Bruker specific parameters
$$ ---------------------------------
##NTUPLES= NMR SPECTRUM
##VAR_NAME=  FREQUENCY,     SPECTRUM/REAL,   SPECTRUM/IMAG
##SYMBOL=    X,             R,               I
##VAR_TYPE=  INDEPENDENT,   DEPENDENT,       DEPENDENT
##VAR_FORM=  AFFN,          ASDF,            ASDF
##VAR_DIM=   32768,         32768,           32768
##UNITS=     HZ,            ARBITRARY UNITS, ARBITRARY UNITS
##FACTOR=    0.250966925370066, 1,           1
##FIRST=     8223.43324360095, -111192,      171028
##LAST=      0,             -54088,          -60799
##MIN=       0,             -740400,         0
##MAX=       8223.43324360095, 464562672,    0
$$ Real data points
##PAGE= N=1
##DATA TABLE= (X++(R..R)), XYDATA
$$ [...]
19520e0077A06751m9383a60389l3286B4151P3196a55040C99763A88869d23055
19509b73712J28192n1090d1363J6177m9505j34383c5600C8127b3909n9012F3468
19497E3913a16648D0324O4066J47785b23469B30821e9477E7334j5125d2308n4378
19486i6686H098c11628A82751q6377j4817c44122J08169P5622q2670A15655b34070
19474c63371A38727b56092M6434P3146l0378l9077B77361b91537A24729b63512
19463a44641F6806o174C665K40875J5296h4091f997j25119K8531p4945A10492
19451b11551i8160A9749b5570D8450c93631a87569A49273d027p0021B31494k0574
19440B10920C6929a64962e9149G2668B5960a63644p28c995k87067F5173a51300
$$ y = [-50077, 106751, 57368, -160389, -193675, 24151, 97347, -155040, 399763, 188869, -423055, -273712, -145520, -196610, -41363, -25186, -74691, -209074, -35600, 38127, -23909, -82921, 63468, 53913, -116648, 40324, 104390, 252175, -223469, 230821, -59477, 57334, 42209, -42308, -96686, 8098, -311628, 182751, 96374, 81557, -344122, -235953, -160331, -243001, 115655, -234070, -363371, 138727, -256092, -209658, -136512, -166890, -205967, 277361, -291537, 124729, -263512, -144641, 66806, 60632, 3665, 244540, 259836, -84091, -6997, -132116, -103585, -178530, 110492, -211551, -98160, 19749, -25570, 48450, -393631, -187569, 149273, -4027, -74048, 231494, 210920, 36929, -164962, -59149, 72668, 25960, -163644, -164372, -3995, -291062, 65173, -151300]
19428a39539B2754J7525b1127D2148J39586a34749D9534d66178a68020E4307b89888
19416C86819G413K9474a37443A78385B760g9718k02032I7598e3895j24766B91340
19404b46591d6298A86190J74012A72514c295j16797k9349j3988C6313d32307J41259
19393b91048a33459k06744C5078h0476D9135h8082C29472r265b39351e6169E5185
19381a00815r5058O6586J9160j14805K2755k94539D8723c32285k93933b60990
19370a55179b3416r8670G5383d02799Q5097D1751d58427h3100c2281G0216a53932
19358h8813j91147B43320D9537b22789e6992A19089f6680A01657K3568b8801j88971
19347b17772R4251b4610j7218C1759L06494q8689G5923i4725H5229c69752J32015
$$ y = [-139539, 22754, 40279, -21127, 42148, 181734, -134749, 49534, -466178, -168020, 54307, -289888, 386819, 7413, 36887, -137443, 178385, 2760, -79718, -281750, 97598, -53895, -178661, 291340, -246591, -46298, 186190, 360202, 172514, -3295, -120092, -149441, -163429, 36313, -432307, -291048, -133459, -340203, 35078, -80476, 49135, -88082, 329472, 320207, -239351, -56169, 55185, -100815, -195873, -129287, -110127, -224932, -202177, -496716, 48723, -332285, -626218, -260990, -155179, -23416, -122086, 75383, -402799, -317702, 41751, -458427, -83100, -32281, 70216, -153932, -88813, -279960, 243320, 49537, -222789, -56992, 119089, -66680, 101657, 125225, -28801, -217772, -123521, -24610, -41828, 31759, 338253, 249564, 75923, -94725, 85229, -369752, -237737]
19336b37737j32485B57855B8592J50926b28891A30139f7757a5656k42706E0117
19325F2108a65422j36938e3308l17150i2200A79284b30375G7645C0162b5349r2249
19314a17598J2840C40943a22447j11241Q1215j51517F3378b66769J23049O433
19304a37287A9972A664K55082D6078c45979i2250B03663K37935B3639b07446E3734
19292c58672h0153A98943c25833A7831N0646c76152a27334C29284b45718e8903
19281a6499j22516l40922a37286C6213b15398k30110B43279a03350J114d7366
19270H2470M9340e8808k9489D9286c9308D0667N8734k9403q678O1606A5041h5376
19257a53601k27842J58588k0581j09037B247J35183B3265c9245K696j94343A19989
$$ y = [-237737, -370222, 257855, 28592, 179518, -228891, 130139, -67757, -15656, -258362, 50117, 62108, -165422, -302360, -53308, -370458, -92200, 179284, -230375, 77645, 30162, -25349, -117598, -104758, 340943, -122447, -233688, -152473, -303990, 63378, -266769, -143720, -137287, 19972, 1664, 256746, 46078, -345979, -92250, 203663, 441598, 23639, -207446, 53734, -358672, -80153, 198943, -325833, 17831, 68477, -376152, -127334, 329284, -245718, -58903, -16499, -139015, -479937, -137286, 36213, -215398, -445508, 243279, -103350, -102236, -47366, 82470, 131810, -58808, -88297, 49286, -39308, 40667, 99401, 69998, 61320, 122926, 15041, -85376, -153601, -381443, -222855, -243436, -352473, 2247, 137430, 23265, -39245, -36549, -230892, 119989]
19245b06710j1797O7870A33396K0393e9193j54468b7692A72745c34964A17000
19234e286A61238g0111B1020f4221j81896J8472l0437C08990a38831N7907n2782
19223a33706N5715c3861k33951j00280A62272N5405c49033B51554f3929j51219
19213b15148A15042c28163h166H2685a79262D5411b15478a8664A74198E5693b56340
19201a2832k72350A75352a12543r4404A64938b8909A68191a85281A12906e6949
19190A13696L3424J2387n8201J33530F4239a82202K5473f8406H6342b93950Q2551
19179b11399I9438d008j62899R869M142k6607L8321K8940d2412n4699A71788n8391
19167A13397d3247j09992H8078a64998A02364a20129N2472E5423E352J85003b60400
$$ y = [-206710, -218507, -150637, 133396, 153789, -59193, -213661, -27692, 172745, -334964, 117000, -5286, 161238, -70111, 21020, -64221, -246117, -227645, -258082, 308990, -138831, -80924, -133706, -77991, -33861, -267812, -368092, 162272, 217677, -349033, 251554, -63929, -215148, 115042, -328163, -8166, 82685, -179262, 45411, -215478, -18664, 174198, 55693, -256340, -12832, -285182, 175352, -112543, -206947, 164938, -28909, 168191, -185281, 112906, -56949, 113696, 147120, 159507, 101306, 234836, 64239, -182202, -156729, -68406, 86342, -293950, -211399, 99438, -4008, -166907, -157038, -152896, -179503, -141182, -112242, -42412, -97111, 171788, 113397, -43247, -153239, 88078, -164998, 102364, -120129, -67657, 55423, 5352, 190355, -260400]
19155c76365J84034N9733C6211J31054a87248k8470F757e5875k01217M1144M7028
19144a68920A98477Q2588a90231J1690C4183a17005k37198J17702M1716A08996
19133a65260J4925F9713N190A6923J04085a91859c1834r3953F1853b9988k1631
19122e1619a316r7568E9626b39206j60130a30977o3610l1048E4189a721A52648
19110a3621n3646J3391j0717J361k0295C3322i1253A43067a62594m0428A83041
19098g1518b8189q5581l36595a61937j63721J01646G4102a32587B8187K11067
19088B39254j06423a14629C8032d6901j7821E5271b20447e151C3684a24112e4304
19076a26539c1889j51222a9202E5990J7905c2749j12348K6646L5165q3230A77255
$$ y = [-376365, -192331, -132598, 36211, 167265, -187248, -215718, 6757, -55875, -257092, -215948, -168920, 198477, 281065, -190231, -178541, 34183, -117005, -354203, -236501, -194785, 108996, -165260, -150335, 69713, 74903, 16923, 121008, -191859, -31834, -125787, 61853, -29988, -51619, -1316, -98884, 59626, -239206, -399336, -130977, -194587, -225635, 54189, -1721, 152648, -13621, -67267, -53876, -64593, -63232, -83527, 33322, -91253, 143067, -162594, -203022, 183041, -71518, -28189, -113770, -450365, -161937, -325658, -224012, 74102, -132587, 28187, 239254, 132831, -114629, 38032, -46901, -64722, 55271, -220447, -5151, 33684, -124112, -54304, -126539, -31889, -183111, -19202, 55990, 73895, -32749, -145097, -118451, -83286, -166516, 177255]
19064A25442a99316C1270M1005b17114d8216E8472P9823f2396l4322A1071L6142
19053D7213K6130i2869j10402b4511B5014L7620b13934i4478J5566k32491f5819
19041A3109c34999g5648j62291h1759j0811c6945A67036A2221b99436B40284f6747
19029E4187K510J50976p0256h0882p0624M0589e3301b4737l9198J7510H05f3909
19016B21109r7347A793a03753l2385a8967b603n4172C12073M9263a25396D4386
19004b62236p7869R691b8010r5347M4052j28708R8497c6699j06738B94977e6354
18992H3352C2121L06261j50521d924F8936Q6986a65728M7673D6702b69561b4147
18980A09523a46254C572a84650A24141e6126h30H178Q3648b57512n09a28563b2145
$$ y = [125442, -199316, 31270, 72275, -217114, -48216, 58472, 138295, -62396, -96718, 11071, 47213, 73343, -92869, -203271, -24511, 25014, 62634, -213934, -94478, -78912, -311403, -65819, 13109, -334999, -75648, -237939, -81759, -92570, -36945, 167036, 12221, -299436, 240284, -66747, 54187, 56697, 207673, 137417, -80882, -151506, -110917, -53301, -24737, -63935, -46425, 805, -63909, 221109, 123762, 1793, -103753, -136138, -18967, -2603, -56775, 312073, 361336, -125396, 44386, -262236, -340105, -330414, -28010, -123357, -79305, -208013, -109516, -36699, -143437, 294977, -56354, 83352, 32121, 338382, 187861, -4924, 68936, 155922, -165728, -118055, 46702, -269561, -24147, 109523, -146254, 3572, -184650, 124141, -56126, -830, 8178, 91826, -257512, -258021, -128563, -22145]
18967A98620N6830a77283a2436q5758L5051A68957c8660N668m1607G0247b20279
18955e5303C4509N7592i7559H4680b27583B17580a66122A04503O1597a73926f3578
18943A65789b30971E1690a94412Q7989o329k22708J62692B67661b63189r0424
18933c53613c4989j15572B62378A23055a64743e3693A77597b16269A78646P3037
18923B51683b14630e8214D2016B437L1703f7777A43823d07430a42137b4603A4806
18911a47149B69444i3542G5750c0937p5347k12435O8835L7381a7339j93849L9261
18900a71927L8752M0278D4118d64494b1928l97225h3105G7616b6916H1356B5499
18888E4025J19627k8546a42371J3149j90364R1760c0956B72357A32775c6412k2715
$$ y = [198620, 255450, -177283, -12436, -98194, -63143, 168957, -38660, -32992, -74599, 70247, -220279, -55303, 34509, 92101, -97559, 84680, -227583, 217580, -166122, 104503, 166100, -173926, -63578, 165789, -230971, 51690, -194412, -106423, -112752, -335460, -172768, 267661, -263189, -353613, -34989, -150561, 262378, 123055, -164743, -53693, 177597, -216269, 178646, 251683, -214630, -58214, 42016, 2437, 34140, -67777, 143823, -407430, -142137, -24603, 14806, -147149, 269444, -93542, 75750, -30937, -106284, -318719, -249884, -212503, -17339, -211188, -171927, -133175, -92897, 44118, -464494, -21928, -419153, -83105, 77616, -26916, 81356, 25499, 54025, 173652, 145106, -142371, -129222, -319586, -227826, -30956, 272357, 132775, -36412, -59127]
18877e9127j16122m5049D7980K38885a28413K4436r4366A24013q468f9319j82121
18866b51440G4011l6727b03727d912j66289j37187j25817d5866k33537j9643B8336
18854A50060K3886b88060D15227a33626f6742j14131G0708b30025K6535e9198
18843B07416a91678C20864b79376a35511A8360b62370B66184J1071F0626B8894
18832d0455F8375J34516g6953k73846A54147b13357j39010A31488e8234j78865
18822b37099a9937G7407k1225a17269B436b3758A02255h2751c0200J2241l80413
18811c98372A5376a6984A93367C6200K019J42906b30382R9185O0708B11945a8937
18799f622j02795G2859J1488L1209c8894B26713H5684a62439m4710C18609d01680
$$ y = [-59127, -175249, -220298, 47980, 286865, -128413, -103977, -198343, 124013, 115545, -69319, -251440, 74011, 37284, -203727, -4912, -171201, -308388, -434205, -45866, -279403, -299046, 28336, 150060, 173946, -288060, 415227, -133626, -66742, -180873, 70708, -230025, -203490, -59198, 207416, -191678, 320864, -279376, -135511, 18360, -262370, 266184, 277255, 60626, 28894, -40455, 68375, 202891, -76953, -350799, 154147, -213357, -352367, 131488, -58234, -237099, -19937, 77407, 56182, -117269, 2436, -23758, 102255, -82751, -30200, -17959, -398372, 15376, -16984, 193367, 36200, 38219, 181125, -230382, -131197, -70489, 211945, -18937, -6622, -109417, 72859, 84347, 115556, -38894, 226713, 85684, -162439, -207149, 318609, -401680]
18787F5473a87576C19344g8645B3739b62804J31187C19592a5840g321k1638k20061
18776b49020B55224a613j92365E2797g8730C29944d2011l96591J82665A00785
18765a28174K9376j59110J22394A54562k2981J20768B0836c08220i620C1654N2117
18754H3771J15037a0437l15489a36948j91380B76718b70478J31151k54404D00761
18743a35827A30409B6044l793c37241a29396A6243F056R3218M8565b63115A30153
18731F2321a67366J4432B84103A11909a27695d3693A13884d9564A11354e72880
18720a50049N4758e967k98895H0218a71458j86995H4289P6416F7732a46862B41810
18708D7850M8243f8514D9445J45226E2546J13890c2682C707b5906p1303j06948
$$ y = [65473, -187576, 319344, -78645, 23739, -262804, -131617, 319592, -15840, -7321, -28959, -249020, 255224, -1613, -193978, 52797, -78730, 329944, -42011, -438602, -255937, 100785, -128174, -98798, -257908, -135514, 154562, 131581, 252349, 20836, -308220, -9620, 31654, 83771, 198808, -10437, -325926, -136948, -328328, 276718, -270478, -139327, -393731, 400761, -135827, 130409, 26044, 22251, -337241, -129396, 16243, 6056, 99274, 147839, -263115, 130153, 62321, -167366, -152934, 284103, 111909, -127695, -43693, 113884, -49564, 111354, -572880, -150049, -95291, -5967, -304862, 80218, -171458, -358453, 84289, 160705, 67732, -146862, 241810, 47850, 96093, -68514, 49445, 194671, 52546, 166436, -32682, 3707, -25906, -97209, -204157]
18697b04157a0299j43682A14813e8371B19975b8383j1974j2243A76109a3741p6726
18686i0467l48944a06086B998a53486A56684J6590a00559A3466i5084j48966a08738
18674A73649H1502b12134B11272d5160o2314j8238A00150g6439I2342a39857k28797
18663c68654a29010F3655i162r6297j30646A71454a92291e3391a5180A01509j7357
18652H4152i6405k710K3641p1118p1697J03966r0384G400b56972a22425j30380
18641b52805j6419C46203A25033b46421L5364f845B80793b04996K3269d5204j65483
18630b10687Q8659h952k54469f5601a8015j96859H3273c6329j62021j4201P8722
18619a33829G7843R7915b34145P2336M1626G8497l6753P1954D6554a38292c6731
$$ y = [-204157, -10299, -153981, 114813, -58371, 219975, -28383, -40357, -52600, 176109, -13741, -90467, -439411, -106086, 2998, -153486, 156684, 173274, -100559, 13466, -95084, -244050, -108738, 173649, 81502, -212134, 211272, -45160, -107474, -125712, 100150, -76439, 92342, -139857, -368654, -129010, 63655, -9162, -105459, -236105, 171454, -192291, -53391, -15180, 101509, 84152, -96405, -99115, -75474, -146592, -218289, -114323, -204707, 7400, -256972, -122425, -252805, -269224, 346203, 125033, -246421, -211057, -6845, 280793, -204996, -181727, -45204, -210687, -122028, -8952, -263421, -65601, -18015, -214874, 83273, -36329, -198350, -212551, -133829, 77843, 175758, -234145, -161809, -120183, 78497, 41744, 113698, 46554, -138292, -36731]
18607B63808D8818b29166l212a9990l27903h423j1690l33546A9319J26190Q4179
18596B29688g107I4369d6855B38372a52904p9103n0912A34926e539m5262o8319
18585a19120A257b9158L577k11165A46789A9101K38953b97797J18002g5103A2405
18573c2678E1539M8272K40419b09373P1946A54854K4956a94617m0816J2556d8300
18561A37534C7856M4369e4866I4395a78787A94596G8479c6998j11949N8578r577
18550i9946m8440A99936K1240E6401i2426j69966f1133a4607j01838B05435r4994
18539A10441e6273p5876d1196H1692a87236B6206J10411a63753N3015q1552F8377
18527d6271A6109c13599a54081B94386b45185j3773f4663G6593C7335a38298j58058
$$ y = [263808, 48818, -229166, -232378, -19990, -347893, -8423, -20113, -353659, 19319, 145509, 229688, -7107, 94369, -46855, 238372, -152904, -232007, -282919, 134926, -5539, -50801, -119120, 1257, -29158, -25581, -236746, 146789, 19101, 258054, -297797, -179795, -75103, 12405, -32678, 51539, 99811, 340230, -209373, -137427, 154854, 179810, -194617, -235433, -222877, -48300, 137534, 37856, 82225, -54866, 94395, -178787, 194596, 78479, -36998, -148947, -90369, -99946, -148386, 199936, 221176, 56401, -92426, -262392, -61133, -14607, -116445, 205435, 110441, -56273, -132149, -41196, 81692, -187236, 26206, 136617, -163753, -110738, -192290, 68377, -46271, 16109, -313599, -154081, 294386, -245185, -258958, -64663, 76593, 37335, -138298, -296356]
18516b96356a4863c419k47723A53857a71951j12153C11247A14422a5148D3904
18505e4394A28882a33622d1246j23270H9548b48871M4811K2157Q1379m9173j18342
18494b68039I113d60224K16363l700A41712e7770n1015k37806j77576M9844a85000
18482a16244C9475R5041c1446H192J3609a3806e719j17057H0037J64984i0525
18470h9949r7398q4013A7680a34250J9804A87784B2141J48989c43138B4690L3863
18459E8553b46609a05376r5784A514b32811A95835a06618l27184C8140J60014
18449A98154K7128J688a43378B25099a24446B52784D0912h3709a0704l91928e6116
18437E1229d69417a92040c1044r9270b625k9744j4190j33483B80784d4574o5065
$$ y = [-296356, -14863, -3419, -251142, 153857, -171951, -284104, 311247, 114422, -15148, 43904, -54394, 128882, -133622, -41246, -164516, 89548, -248871, -204060, -181903, -100524, -149697, -268039, 9113, -460224, -243861, -247561, 141712, -57770, -108785, -346591, -524167, -474323, -185000, -116244, 39475, 134516, -31446, 8192, 21801, -13806, -5719, -122776, 80037, 245021, -90525, -89949, -187347, -271360, 17680, -134250, -114446, 187784, 22141, 171130, -343138, 24690, 58553, -246609, -105376, -201160, 1514, -232811, 195835, -106618, -433802, 38140, 198154, 225282, 226970, -143378, 225099, -124446, 252784, 40912, -83709, -10704, -402632, -56116, 51229, -469417, -192040, -31044, -130314, -2625, -32369, -46559, -180042, 280784, -44574, -109639]
18426a09639k87164H8919P1429K40737F487a00953B55660e72963B93582e1982
18415c68422c3431R569D07399A61682R8274a55423a8650B2967a36135n0544A03336
18403h7811J1294G7724j1981c22122d1872A02732e0310B52738o6453b47637E6711
18391A35810K1749G4512L77167a24387b2282m0884m3723A42303h1252A91915m4083
18380A47832A6729K80951a45135L3657m5813A8788c9164k24485A33036h5408l0649
18369a16057F0072K24984B2332K55162E834K40249c77183a07817e1648J6231j27775
18358a63192n0757M4911e8628A16488J76272E9989f2650B53330D8383C021a70283
18346B6597L33410a97415d2506j38391M1996O8450j75725b135j34657A54035b43581
$$ y = [-109639, -396803, 88919, 160348, 401085, 6487, -100953, 255660, -572963, 293582, -51982, -368422, -33431, -23862, 407399, 161682, 259956, -155423, -18650, 22967, -136135, -186679, 103336, -87811, -76517, 77724, 65743, -322122, -41872, 102732, -50310, 252738, 186285, -247637, 56711, 135810, 157559, 74512, 451679, -124387, -22282, -63166, -106889, 142303, -81252, 191915, 147832, 16729, 297680, -145135, -111478, -157291, 18788, -39164, -263649, 133036, -85408, -116057, 60072, 285056, 22332, 277494, 5834, 246083, -377183, -107817, -51648, -35417, -163192, -213949, -169038, -58628, 116488, 292760, 59989, -62650, 253330, 48383, 3021, -170283, 26597, 360007, -197415, -42506, -180897, -138901, -70451, -246176, -2135, -136792, 154035, -243581]
18334d1832A6267a37651J6492n536A34667c8850k23155k54074f9330m3574D47538
18322I5423J19796i1876j00295I4639h8472p4664F3226e6749b5794q9466p5167
18311a90427i0451B28843k9506r6570b10992A97771p2762r963c4435k18218N1837
18300b00816C63268A1801i604j31835O3500j1379k3234B51914A01142h1895I4731
18288B6032e8849q3673q9598I4304H96L806M42548a34015d5299p7424H8851a47242
18275B19827p4925g8941A28010c15956A82913C558f2829k48526M8584e0776k81077
18264c31853R0641j80735C9262J55111q073j9999C816J6033J24713a63904B4798
18252A08577b41376g0639D7794N1308K6738h9688k14105G8287a42248c3587A66533
$$ y = [-41832, 16267, -137651, -121159, -126695, 134667, -38850, -262005, -516079, -69330, -112904, 447538, 95423, 215219, -91876, -192171, 94639, -88472, -163136, 63226, -56749, -25794, -115260, -190427, -90451, 228843, 199337, 102767, -210992, 197771, 125009, 115046, -34435, -252653, -200816, 363268, 11801, -9604, -141439, -77939, -89318, -112552, 251914, 101142, -81895, 94731, 26032, -58849, -142522, -232120, 94304, 896, 4702, 447250, -134015, -45299, -122723, 88851, -147242, 219827, 144902, -78941, 128010, -315956, 182913, 3558, -62829, -311355, -262771, -50776, -331853, -241212, -421947, 39262, 194373, 186300, 166301, 3816, 19849, 144562, -163904, 24798, 108577, -241376, -70639, 47794, 99102, 125840, -89688, -303793, 78287, -142248, -33587, 166533]
18240g6088C8583O39J78248b59861K3800A84596p3264a46411A11169g1771G9849
18228c8285o739A96454j9219a61755f9542l4245k00996E2718K31318b87768A22373
18216a33295A95549D2464M2621J31527c63214c1122A99602a09779j10762i1027
18205A78524c40882j13035F2670a71256B29031B6197L0111b39266m6775a4828
18194E6156M0352b02642c3876B66986b65276P1034f7280A62995a1737j43697A24006
18182b17374A97049P5938G653i2339p6799e3713C91164g9353j72782A33696b19753
18170b62648b1676B91509j20412K23474I4275b87801i205r6268b0032j64159M1737
18159a42454C87460b0434r634j18004L3156o3744E7263H570d22984f6851A27932
$$ y = [-76088, 38583, 39222, 217470, -259861, -236061, 184596, 111332, -146411, 111169, -71771, 79849, -38285, -45024, 196454, 177235, -161755, -69542, -103787, -304783, 52718, 284036, -287768, 122373, -133295, 195549, 42464, 85085, 216612, -363214, -31122, 199602, -109779, -220541, -91027, 178524, -340882, -453917, 62670, -171256, 229031, 26197, 56308, -239266, -286041, -14828, 56156, 96508, -202642, -33876, 266986, -265276, -194242, -67280, 162995, -11737, -155434, 124006, -217374, 197049, 272987, 7653, -92339, -169138, -53713, 391164, -79353, -252135, 133696, -219753, -262648, -21676, 291509, 171097, 394571, 94275, -287801, -9205, -105473, -20032, -184191, -142454, 387460, -20434, -30068, -148072, -114916, -178660, 57263, 8570, -422984, -66851, 127932]
18147a26224A94272e560D7515b1052A36883c2475k39301A46998E0667j9517g7828
18135B82670a49420K6055C7257i5138M4772j81501A93192b06277K1548P3221o8460
18124a79968A47074b05005h4170A5486b18390A45699f4930b1027k18007O2399
18114a76635A49941c34666a39595G9553R8442E2495J26854e9116F6186R6488r317
18103A53357F1197N323b171A99117D0228J9892K08204e00927B07390I0832i8988
18091b43228n218F4144e6100j04645c0313F1977J55058d12510A25944J47180j06265
18080A66859h4824K7881k0904H0096k4955b54973b4628H401i7400R215C5098a76708
18067b19683B27463C8993N1656D4043J98656b95096E6631b44542a6137A37320
$$ y = [-126224, 194272, -5560, 47515, -21052, 136883, -32475, -271776, 146998, 50667, 31150, -77828, 282670, -149420, -123365, 37257, -95138, -50366, -231867, 193192, -206277, -184729, -111508, -179968, 147074, -205005, -84170, 15486, -218390, 145699, -64930, -21027, -239034, -176635, 149941, -334666, -139595, 79553, 177995, 52495, 179349, -59116, 66186, 162674, 153357, 61197, 66520, -2171, 199117, 40228, 60120, 268324, -500927, 207390, 90832, -98988, -243228, -248446, 64144, -56100, -160745, -30313, 61977, 217035, -412510, 125944, 273124, 166859, -84824, -56943, -77847, 80096, 55141, -254973, -24628, 8401, -97400, -88185, 35098, -176708, -219683, 227463, 38993, 90649, 44043, 242699, -295096, 56631, -244542, -16137, 137320]
18056I7799L1329B5552a93455A69632a83700c9127j22718A4733J11150b29622
18045A2046a00853A0544J87358a32012j03919a16539J8755A70841o3253C1329
18034a25105l01621a68400n5830H8835g5608m3101m2947f172I7685B400J41175
18023A43575b38935Q5979o4077m1638N5182a9046j37364A27839J20588a15638
18012b59451N0032A26171j5260B6102N1559J51736E562L7798L7891a3873j86321
18001b00194C14491a40571B40097a0119C2900N8214k2228f0036k55602A483b2557
17989a9378A47104N2039K0856C6953e8235k64027a14515m6181B20606e3787K0243
17978c3544E5206h9303K5906k2776m4874c5638E4690K6690K52339b20109B66273
$$ y = [97799, 129128, 25552, -193455, 169632, -183700, -39127, -161845, 14733, 125883, -229622, 12046, -100853, 10544, 197902, -132012, -235931, -116539, -97784, 170841, 107588, 31329, -125105, -426726, -168400, -224230, 88835, -75608, -118709, -161656, -6172, 97685, 2400, 143575, -238935, -152956, -217033, -258671, -203489, -19046, -156410, 127839, 248427, -115638, -259451, -209419, 126171, 110911, 26102, 77661, 229397, 5562, 43360, 81251, -13873, -200194, 314491, -140571, 240097, -10119, 32900, 91114, 68886, -60036, -315638, 1483, -22557, -19378, 147104, 199143, 219999, 36953, -58235, -322262, -114515, -160696, 220606, -53787, -33544, 55206, -89303, -63397, -86173, -131047, -35638, 54690, 81380, 333719, -220109, 266273]
17966F5763H25a11271E5870i4478A6701a1222D6603c9678m81642e5973B79226
17954A73824j4420g7555F641Q2394a6315B62849g531A44248f6381K2874E9287
17942a45092c6370j53911F4009l1064Q8480M3549C3925J66166G0092g7863C369
17930C05812A33856K30159A09793a21146E0371h5357E5014J70196c41423C3507
17919a18240m5612B42063b0576B7260a27241I2642L02000h0389C46614m7643e190
17907F2483h2118C3792a97210J4276F5721B2979J20405K22600a34359D34581a77756
17895a19639H9739k2370b1003C97825A36085e7089B29565a21186A28426O4134
17885A92560F0456a29125k42434a53312e1463j79122R8266q5427r0054A45530
$$ y = [65763, 825, -111271, 55870, -94478, 16701, -11222, 46603, -39678, -521320, -55973, 279226, 173824, 159404, -77555, 6641, 89035, -16315, 262849, -7531, 144248, -66381, -43507, 59287, -145092, -36370, -190281, 64009, 32945, 121425, 164974, 33925, 200091, 70092, -77863, 3369, 305812, 133856, 364015, 109793, -121146, 50371, -85357, 55014, 225210, -341423, 33507, -118240, -163852, 242063, -20576, 27260, -127241, 92642, 394642, -80389, 346614, 298971, -5190, 62483, -82118, 33792, -197210, -182934, 65721, 22979, 143384, 365984, -134359, 434581, -177756, -119639, 89739, 67369, -21003, 397825, 136085, -57089, 229565, -121186, 128426, 192560, 60456, -129125, -371559, -153312, -51463, -230585, -132319, -217746, -307800, 145530]
17874a731k2139k83022A00703P5627n1903h2530q5990A75611b8695A03878j8542
17863H5336P9713C4119b32255g4524m8417l7687A09668d40711A31945D5445J28454
17852A73899G0057K5039a18665N7252r349J9088k7446F7638A2216K93233O9114
17841C74563D0481b26910m8924B35078I7375K00012I5042J04861c52188h1117
17830A9506L48931c33530M7105J02274c3498j5391A026K52094E4185k6290L17029
17819C44924a60285d991B21472a19173l248q2369Q0393k1877a1293j87275K3383
17808a75185e764A50439G604b89590a5292B65708a37955B4748K7222J31740q9262
17797I4448K08958a09903A559M4762d1912j13744B35311r4621b13125D66437a61106
$$ y = [-1731, -23870, -306892, 100703, 176330, 124427, -82530, -168520, 175611, -28695, 103878, 85336, 165049, 34119, -232255, -74524, -122941, -160628, 109668, -440711, 131945, 45445, 173899, 70057, 95096, -118665, -61413, -70762, -51674, -79120, 67638, 12216, 305449, 374563, 40481, -226910, -275834, 235078, 97375, 297387, 95042, 199903, -352188, -81117, 19506, 368437, -333530, -286425, -184151, -33498, -48889, 1026, 253120, 54185, 27895, 344924, -160285, -4991, 221472, -119173, -122421, -204790, -124397, -146274, -11293, -198568, -175185, -5764, 150439, 7604, -289590, -15292, 265708, -137955, 24748, 51970, 183710, 94448, 303406, -109903, 1559, 46321, -41912, -155656, 235311, 140690, -213125, 466437, -161106]
17785b42896C32665b2652h32E5528h6769C66983A60895B9713b06045a3033j91261
17774b04294j3866m0653O3757B8691J85024E7815a13434B61748g6529j43a5458
17762f4369n9072D2361R3442a60512a4970o490r5001A19572l2727a0085o9055
17751g9140o1733B12669a3936B30616b48214H7889c96009e8736B91429c94389
17740D3363j2561L1268M2537a77015B48368A15752m8797J54128A3430K53447A7616
17728A41854c17422J06996L923A35072b71775A13914a79089j3687P7950B50775
17717c04596A12402l7075a17288j59806m1539A04347m2372d31k15109k5837j72661
17706d14038b3125j20101B21371h4655q1562O1367D1716M1490J68043F5909g0117
$$ y = [-242896, 332665, -22652, -832, 55528, -86769, 366983, 160895, 29713, -206045, -13033, -204294, -218160, -258813, -195056, 28691, 213715, 57815, -113434, 261748, -76529, -76672, -15458, -64369, -123441, 42361, 135803, -160512, -14970, -21460, -116461, 119572, 86845, -10085, -79140, -140873, 212669, -13936, 230616, -248214, 87889, -396009, -58736, 291429, -394389, 43363, 30802, 62070, 104607, -177015, 248368, 115752, 66955, 221083, 13430, 266877, 17616, 141854, -317422, -210426, -206503, 135072, -271775, 113914, -179089, -192776, -114826, 250775, -304596, 112402, 75327, -117288, -277094, -318633, 104347, 61975, -431, -215540, -241377, -414038, -23125, -143226, 221371, -84655, -166217, -104850, 41716, 83206, 251249, 65909, -70117]
17694d0428A76263J42459b8742P263B14588a81292A18193D7564I293K12653f5542
17682a12751A28929C0910a58903L4098l4105A061b65160A31519J99835B0000R6729
17671A16729a88851B07759J33730G6929J48763p1151b6542C2863L353N3686b43189
17659H9884f0555B04492r0641A3521L9307R1987M1245a41736A52304a08488J776
17648a06712A97317a07759k39101a54201g5152c411G9501B9981K3365K41143a5854
17636B41415C4144a50749q0627B05327r8125h7396A26932b21228F0599L24034
17626C84633I5344B945c23495e2173A02573K6564E3375P5532A6191R8011d7390
17614a36499k8744j55498D34796b20978L9066C12044B2267J49269d9422F8762
$$ y = [-40428, 176263, 318722, -28742, -21479, 214588, -181292, 118193, 47564, 9293, 221946, -65542, -112751, 128929, 30910, -158903, -124805, -158910, 1061, -265160, 131519, 331354, 20000, 116729, -188851, 207759, 341489, 76929, 225692, 154541, -26542, 32863, 36216, 89902, -243189, 89884, -60555, 204492, 113851, 13521, 52828, 144815, 186060, -141736, 152304, -108488, -106712, 197317, -107759, -346860, -154201, -75152, -3411, 79501, 29981, 53346, 294489, -15854, 241415, 34144, -150749, -231376, 205327, 107202, -87396, 126932, -221228, 60599, 384633, 95344, 2945, -323495, -52173, 102573, 129137, 53375, 128907, 16191, 114202, -47390, -136499, -165243, -320741, 434796, -220978, -181912, 312044, 22267, 171536, -49422, 68762]
17603b52129g5918b2927B18041a01503d7014A92621A727K31981a9315f736A40967
17591B99202a79973L7020B93367L8928J8927j66803C8412J47991J53596j53293
17581A86706q4164B9635J56972J50287d2375A94246f0958J3964q3522B36122J08496
17570C44618j31835m321H4107a14096d7018j45043D94210a23704B49096k0876
17560B28220J9464a25087L4191C27831d9024A47b94950B16195b30908G737J13190
17549A20927a38241H5987c11933F39756B16955E5691b53074d8448q1675D2029
17538A31169c1613p0762B95306A8391P2467hk70242R4335A84438a42920o9906
17527b12826e1492i160D9836a95192A81955Q6174a9260A67164d6124G7030K9342
$$ y = [-252129, -75918, -22927, 218041, -101503, -47014, 192621, 1727, 233708, -19315, -6736, 140967, 299202, -179973, -142953, 293367, 332295, 351222, 184419, 38412, 186403, 339999, 186706, 102542, 29635, 186607, 336894, -42375, 194246, -60958, -46994, -130516, 236122, 344618, 212783, 208462, 84107, -114096, -47018, -192061, 494210, -123704, 249096, 228220, 247684, -125087, -90896, 327831, -49024, 147, -294950, 216195, -230908, 7737, 120927, -138241, 85987, -311933, 639756, 216955, 55691, -253074, -48448, -130123, 42029, 131169, -31613, -102375, 295306, 18391, 90858, -8, -270250, -175915, 184438, -142920, -212826, -51492, -9160, 49836, -195192, 181955, 268129, -19260, 167164, -46124, 77030, 106372]
17516A06372K10657P3831C2550K64849j25851E2144J91917a20027c6750a3544
17505B78561H8389P3958Q8048J29690a4418B59422h973B77122g32A6180P3397
17494H9577L6324h9432B09714i8130c1709A27971a9849p4310B9447K20686j06484
17483A43649a47136p1397A39616L85689A95157K17698G4097g8169A47970f3162
17472A64086K87254B20722b57840C2760L7821B2629b09690C26678g1434A69781
17461E4244j3667J17991J03297d304l93302B84128G8628O0931J31519a2571p2977
17450h5548B19665r1045b240A2570J32450g858B8555L34038N5206B03198j0270
17439A92928b32171C93266J64949C4925K51713j09566K5582e2790j49756A15033
$$ y = [106372, 317029, 390860, 32550, 297399, 171548, 52144, 244061, -120027, -36750, -13544, 278561, 88389, 162347, 250395, 380085, -14418, 259422, -8973, 277122, -732, 16180, 89577, 125901, -89432, 209714, -98130, -31709, 127971, -19849, -94159, 29447, 250133, 143649, -147136, -218533, 139616, 525305, 195157, 412855, 74097, -78169, 147970, -63162, 164086, 451340, 220722, -257840, 32760, 70581, 22629, -209690, 326678, -71434, 169781, 54244, 40577, 158568, 261865, -4304, -397606, 284128, 78628, 139559, 271078, -12571, -85548, 219665, 128620, -2240, 12570, 145020, -7858, 28555, 362593, 417799, 203198, 192928, -232171, 393266, 558215, 34925, 286638, 177072, 202654, -52790, -202546, 115033]
17428B30586J218j9291N3323K10582A24736K22211q6318E479J20597K11025j45788
17417A91313r0976N10774B60091J16700A62273L06492j06832m7408P666A32098
17406B13523J14299C0741M42138j5984G3076M04543K1275B09665J79580m3246
17396C45999r3520P3112G2001J35145j5936A5713a62426B41194B185K06143H134
17384A50335J50796e1068N259B96529G0113K73022P4777H6655N7139K28268C2079
17372D87958r5675a3731C1472J06828b68357D8350d6541o5401B90684j4227H2843
17360A08486K9376L2089K54240a1113F21720B82812F4075f940k900C13886a36634
17348A36327J49576j42195K26956j72369b94321f8684J137A59159M2841a15728
$$ y = [230586, 231804, 212513, 265836, 476418, 124736, 346947, 260629, 5479, 126076, 337101, 191313, 100337, 611111, 260091, 376791, 162273, 468765, 361933, 314525, 322191, 132098, 213523, 327822, 30741, 472879, 456895, 73076, 477619, 498894, 209665, 389245, 345999, 252479, 325591, 72001, 207146, 191210, 15713, -162426, 241194, 2185, 208328, 8134, 150335, 301131, -51068, -45809, 296529, 70113, 343135, 417912, 86655, 143794, 372062, 32079, 487958, 392283, -13731, 31472, 138300, -268357, 48350, -46541, -111942, 290684, 276457, 82843, 108486, 137862, 169951, 424191, -11113, 621720, 282812, 64075, -6940, -9840, 313886, -136634, 136327, 285903, 143708, 370664, 198295, -294321, -68684, -67547, 159159, 202000, -115728]
17337A71837a93776A50554p833k8112e842o3383F240J2811b47066K556A31088
17325B36469p39b35870D87641j17247H9920L6877e6126A45428E2488J89350A045
17313H5326K78505I5853D4868J55677M039H4923L64834A72663q1371d9231A66662
17301C44638a8649D11551A41006e8659B07204R050e6655H8065K0252n3098J31237
17290A86456A8789b14980I6438h4172l541D67886H6708K3423A3937J5679K9040
17279E8656b9377A76433k2544j4829b4144D58023c4367F9374j4751h9541B66314
17267B80274q7042A9115L56460d9791B00287m6084o4873M47446A24436n0763L20819
17256C94492e5558o9870C31230a29905D68239A03990L9706a61586A22133J5425
$$ y = [171837, -193776, 150554, 142721, 114609, -5842, -69225, 6240, 19051, -247066, -244510, 131088, 236469, 235730, -235870, 487641, 370394, 89920, 126797, -56126, 145428, 52488, 241838, 1045, 85326, 363831, 95853, 44868, 200545, 204584, 84923, 449757, 172663, 91292, -49231, 166662, 344638, -18649, 411551, 141006, -58659, 207204, 216254, -56655, 88065, 108317, 55219, 186456, 18789, -214980, 96438, -84172, -87713, 467886, 86708, 110131, 13937, 29616, 58656, -29377, 176433, 153889, 139060, -24144, 458023, -34367, 69374, 54623, -89541, 266314, 280274, 193232, 19115, 375575, -49791, 200287, 154203, 89330, 536776, 124436, 73673, 394492, -55558, -125428, 331230, -129905, 468239, 103990, 143696, -161586, 122133, 137558]
17246A37558J82501C8441a01239B85420b63275e2138C23285n3965m9716a81801
17235G7984C5705L22231f2028p1855C28807A902L24465F4431J02006H3196J19020
17224B02216E8161K68800A09964P5243P8765n6308e5865B58408J0330m9843K58714
17213D77609A23983J80877H1996M16741j62341C3526J87305K35471b9579C17300
17202A74430M1535J74167j42017l1188E6043k5546K49347a4250B82894J937I0830
17190A37967J55183g1547C9883L0258J8899J56396Q6181j34858N6455M6816a7123
17178b15032E08217A58996R1246P9154i5816D44695j55741j9646N2737A27517
17167D28416n3165j25925A24024J64254K26646c0900B60722m9588K02793A04445
$$ y = [137558, 320059, 38441, -101239, 285420, -263275, -52138, 323285, 269320, 219604, -181801, 77984, 35705, 357936, -62028, -133883, 328807, 1902, 326367, 64431, 166437, 83196, 202216, 58161, 326961, 109964, 185207, 263972, 207664, -55865, 258408, 268738, 218895, 477609, 123983, 304860, 81996, 498737, 336396, 33526, 220831, 456302, -29579, 317300, 174430, 215965, 390132, 248115, 216927, 56043, 30497, 279844, -14250, 282894, 284831, 90830, 137967, 293150, -71547, 39883, 70141, 89040, 245436, 331617, 196759, 253214, 300030, -17123, -215032, 508217, 158996, 250242, 329396, -95816, 444695, 288954, 269308, 322045, 127517, 428416, 375251, 249326, 124024, 288278, 514924, -30900, 260722, 211134, 413927, 104445]
17156B66036p9806J24633q1590J80136A51739Q0574b7287q709C08698n9477J00377
17145C49598D1732J33382q6648K20223j21368j5527q214J9544J50731c49847E23375
17133A85607R1437K74578B56322j22444K10538P9632B2111K6680M24362j0322
17123D62831j81191M6197d3441A71250D6380J34773K01022J9765A00837O9083
17113A69920K93866j25618J58535A07363K65097j45400m1697M39628k47329q2764
17103B94898K01871j037j92598A26386J50680b6108E56458R0623k21473j45690
17093B79918L42403F853N37535A62809E7464M56207j09122j1129r3210J02634
17083D02844I2448M7039J70800K51847j10146B20859J4487K11171K04981j20265
$$ y = [266036, 186230, 310863, 229273, 409409, 151739, 232313, -27287, -35996, 308698, 249221, 349598, 41732, 175114, 88466, 308689, 187321, 171794, 163580, 183124, 333855, -349847, 523375, 185607, 277044, 551622, 256322, 133878, 344416, 424048, 22111, 48791, 473153, 462831, 281640, 327837, -43441, 171250, 46380, 181153, 382175, 401940, 100837, 169920, 463786, 338168, 496703, 107363, 372460, 227060, 185363, 624991, 377662, 294898, 496769, 495732, 303134, 126386, 277066, -26108, 556458, 647081, 425608, 279918, 622321, 6853, 544388, 162809, 57464, 513671, 404549, 393420, 300210, 402844, 92448, 139487, 310287, 562134, 451988, 220859, 235346, 446517, 651498, 531233]
17073E31233B34455J66847q5802J82431l1601k18387J46999m974j28976k0543
17063B40449O3170J47531j16775j4702K45388l0822j08962M0044k09908L10132
17053E65545k38904j01150M24090k20143J88572B76162J40429K72178C24968K47382
17043E72350j72736j32370K51459j0557A14955K52183j06864K14144R5636O4199
17033F34253o6551L99517A57608K20409Q9547k03269K99806o1136B17274L38912
17023E56186J28326c871E02610J70724l10498L9664K20021k46811j6614m1824
17013C17272K80090r0947J18820P494o0891O7679C15088N16131l73290K00346
17003F58275l4688j62492J63629j22785Q1216K89271l70805K84008C68499q181
$$ y = [531233, 234455, 401302, 315500, 497931, 466330, 247943, 394942, 389968, 260992, 240449, 303619, 451150, 334375, 319673, 565061, 534239, 425277, 465321, 255413, 565545, 326641, 225491, 649581, 429438, 618010, 276162, 416591, 688769, 324968, 572350, 399614, 267244, 518703, 508146, 114955, 367138, 260274, 474418, 570054, 634253, 567702, 967219, 157608, 378017, 467564, 264295, 564101, 502965, 217274, 556186, 684512, -3871, 502610, 673334, 362836, 402500, 622521, 375710, 359096, 317272, 597362, 506415, 625235, 632729, 571838, 639517, 315088, 831219, 457929, 658275, 623587, 461095, 624724, 501939, 583155, 872426, 501621, 785629, 368499, 360318]
16993C60318L92138q6656J4933o3133J79507J96886l66164m2204o5391K34153
16983G54387k1589l7014J88506o1715k60630j67891K76635K02941j83649l00477
16973C89504M74177k24754K8166K12232K75633n45045J73164J01324j84343J00203
16963H00261P1688j73109K41522J09585k95674o05M7782M5487C43654M10414o0560
16952F93508K07984k50683L53199m51554K01013J36217Q6763j76013K7749q365
16942H19818J50115j7567j15067r1133K05044k40326M62248j80159l2451r0286
16932H70236N0540L1621j00485J31960M1842o310k09556M12769o2810p3715k26365
16921H59727L25482j73702L07234l78048j5519J91080k64488N04853j9297m9238
$$ y = [360318, 752456, 665800, 680733, 617600, 797107, 993993, 627829, 585625, 520234, 754387, 732798, 695784, 884290, 822575, 561945, 394054, 670689, 873630, 689981, 389504, 863681, 638927, 667093, 879325, 1154958, 609913, 783077, 884401, 700058, 800261, 871949, 698840, 940362, 1049947, 754273, 753668, 801450, 846937, 343654, 754068, 693508, 901492, 650809, 1004008, 552454, 753467, 889684, 976447, 800434, 828183, 819818, 969933, 952366, 837299, 746166, 951210, 710884, 1173132, 992973, 960522, 870236, 920776, 952397, 851912, 983872, 1025714, 1019404, 809848, 1222617, 1159807, 1086092, 859727, 1185209, 1011507, 1318741, 940693, 925174, 1116254, 851766, 1356619, 1337322, 1288084]
16911A288084k00327L38450j10396l67388K00963p6260M02414m32401K53917p1402
16901A225654K1482L63277m18947K01677M09986m59030J80037k17472M21442l56365
16891A371741K20288J06989l07143O05091j67053k49700o7023K21555k89820J14237
16881A559162L418O063p2176M46946j42080L08299m03546K10649r6465K7306L6758
16870A884334J30000p3662n3157N0050n6547j07023J53398K2431L03049q4589
16860B168284k84642M38290l36241L14589k88333K65465M7689K57542k43965K54750
16850B593428k94933K36916K00488o5633K34521k31111M1548J01779m47071M56638
16840B826570p5509N65953m01778J09284Q2177j1634K06924J21208l16216L38606
$$ y = [1288084, 1087757, 1426207, 1315811, 948423, 1149386, 1073126, 1475540, 1043139, 1297056, 1225654, 1247136, 1610413, 1191466, 1393143, 1803129, 1344099, 1524136, 1306664, 1728106, 1371741, 1592029, 1699018, 1391875, 1996966, 1829913, 1580213, 1513190, 1734745, 1444925, 1559162, 1562580, 1568643, 1496467, 1943413, 1801333, 2109632, 1706086, 1916735, 1820270, 1847576, 1884334, 2014334, 1940672, 1887515, 1937565, 1881018, 1773995, 1927393, 1949824, 2252873, 2168284, 1883642, 2321932, 1985691, 2300280, 2011947, 2277412, 2325101, 2582643, 2338678, 2593428, 2298495, 2535411, 2735899, 2670266, 2904787, 2673676, 2715224, 2817003, 2369932, 2826570, 2751061, 3317014, 2915236, 3024520, 3106697, 3095063, 3301987, 3423195, 3106979, 3445585]
16830C445585o8047l62916O15705n484j75557K31150N5462M4919n0606K26001
16820C956212K14253l44688K87765j48267M00022J13376j57059j1438K91866O9842
16810D671884p5162L39472j1354L07814K6183K23967j58488L80659j43772M18754
16800E979957l89526N20709M3766K29673M499N90208k06900j89053M67458L08975
16790G359766K69473k55900L35543J86402J41051L65125K45290L09835l9188P68616
16780I686013j85517J11593O82195o7878M24532K76629L71200j4475O92403q1750
16770A1894945Q18314L87739K98120M55764M27931N21475L8761P99563M69340
16761A6111952N45557J031385M46021N71098O94866P14175O72780O69296R08700
$$ y = [3445585, 3377538, 3014622, 3630327, 3624843, 3449286, 3680436, 3735898, 3780817, 3730211, 3956212, 4170465, 3825777, 4113542, 3965275, 4365297, 4478673, 4321614, 4310176, 4602042, 4671884, 4596722, 4936194, 4924840, 5232654, 5258837, 5482804, 5324316, 5704975, 5561203, 5979957, 5590431, 6111140, 6154906, 6384579, 6389078, 6979286, 6772386, 6583333, 7050791, 7359766, 7629239, 7373339, 7708882, 7895284, 8036335, 8401460, 8646750, 8956585, 8917397, 9686013, 9500496, 9612089, 10294284, 10226406, 10650938, 10927567, 11298767, 11284292, 11976695, 11894945, 12713259, 13100998, 13399118, 13854882, 14282813, 14804288, 14843049, 15642612, 16111952, 16657509, 17688894, 18134915, 18706013, 19400879, 20115054, 20787834, 21457130, 22365830]
16752B2365830J117833P01859Q37641J307726Q54373J273997J281416R98156J523074
16743C2261905J374142J820112J899531J820762J605358K131677K180382K556011
16735D7649880K344747K569079L247170L084829L414298L598183L966111M324021
16727G4198318L958008M603565N195804N478802N862638O066212O434315P018340
16719A18816002P131543P451111P778878P798991Q301435P909052P544043P725734
16711A80456789O909130O644712N581929M847178L114704K597372P80526l38179
16703B10594161j965962l063314m645380n359830o445453p200303p435992q066265
16695A66411662q261973q145761q142740p637405p558625p302535p078754o582863
$$ y = [22365830, 23483663, 24185522, 25023163, 26330889, 27185262, 28459259, 29740675, 30738831, 32261905, 33636047, 35456159, 37355690, 39176452, 40781810, 42913487, 45093869, 47649880, 49994627, 52563706, 55810876, 58895705, 62310003, 65908186, 69874297, 74198318, 78156326, 82759891, 87955695, 93434497, 99297135, 105363347, 111797662, 118816002, 125947545, 133398656, 141177534, 148976525, 157277960, 165187012, 172731055, 180456789, 187365919, 194010631, 199592560, 204439738, 207554442, 210151814, 210932340, 210594161, 208628199, 205564885, 200919505, 195559675, 189114222, 181913919, 174477927, 166411662, 158149689, 150003928, 141861188, 134223783, 126665158, 119362623, 112283869, 105701006]
16687A05701006o204591n883048n301732n529177m644048m614925m060515m133842
16679F5329128l628828l641334k980695l121101k827763k112234k483901k506108
16671D2027164j752681k073046j834029j715629j489916j540052j293507j234646
16663B9093658j734827r64501j013105j196737j026627p87867q89093j011284
16655B0469617o40586p02601p14080n65942m61179m75793o89708p23029n51087
16646A4945612m75901j92553l45924o78951n71043r7288o75978m11211l45246
16637A1151517l45198l25163l43600j86717k71588m25893j08470l65008j80665
16628H599215M9540m71965M1413k77831j58096l61237n50448o0975n4429n9325
$$ y = [105701006, 99496415, 93613367, 88311635, 82782458, 78138410, 73523485, 69462970, 65329128, 61700300, 58058966, 55078271, 51957170, 49129407, 47017173, 44533272, 42027164, 40274483, 38201437, 36367408, 34651779, 33161863, 31621811, 30328304, 29093658, 27358831, 26394330, 25381225, 24184488, 23157861, 22369994, 21480901, 20469617, 19829031, 19126430, 18412350, 17846408, 17385229, 16909436, 16219728, 15496699, 14945612, 14469711, 14277158, 13931234, 13252283, 12681240, 12583952, 11907974, 11496763, 11151517, 10806319, 10481156, 10137556, 9950839, 9679251, 9253358, 9144888, 8779880, 8599215, 8648755, 8176790, 8218203, 7940372, 7782276, 7421039, 6870591, 6809616, 6755187, 6695862]
16618F695862l71979J97895k03855j2184k37239k96412k70366J54401m26360J8769
16608E248532p5946k61595J06870l78785L15471l58427l84368K98604j97893K22567
16598D535030m45682k4646r0742r8992p4992k05158K32561J28646l01156J23469
16588C778338n22790K44320l07836m29255j04155O12324R862k45038O2458j76959
16578B921269j97234L1430j45654R5207r824j23656j15730J91793J28751j37986
16568B638366l55178J34267j19329p5622R8784k62301L23301j43811O0487j88410
16558B110554j32868r2245M5713J7727j05740M1480P1055j51451k7425J70070
16548A946870k34643M9317o1920K02995j80574k54184L8379K73610o6649k74861
$$ y = [6695862, 6323883, 6521778, 6317923, 6305739, 6068500, 5772088, 5501722, 5656123, 5229763, 5248532, 5172586, 4910991, 5017861, 4639076, 4954547, 4596120, 4211752, 4510356, 4312463, 4535030, 4089348, 4064702, 3973960, 3874968, 3799976, 3594818, 3827379, 3956025, 3654869, 3778338, 3255548, 3499868, 3192032, 2762777, 2658622, 3270946, 3280808, 3035770, 3098228, 2921269, 2724035, 2755465, 2609811, 2705018, 2695194, 2571538, 2455808, 2647601, 2776352, 2638366, 2283188, 2417455, 2298126, 2222504, 2321288, 2058987, 2382288, 2238477, 2298964, 2110554, 1977686, 1885441, 1931154, 1948881, 1843141, 1884621, 1955676, 1804225, 1776800, 1946870, 1712227, 1761544, 1699624, 1902619, 1722045, 1467861, 1506240, 1779850, 1713201, 1438340]
16538A438340j89827K69581J4601k44890j80985K53697J70830l42346K60146o0690
16528A388457k47837j2201M0158M2395K33389m79967K89855J182j19237J2980
16518A149174k4082j35562J7985N6540L4503J45158N8616m34671k19225K50535
16508H98971J15401m6152r6269M34219m58638J86399K35842m14336j22018K11051
16498I44470J15695r2694n1793j00174J09381D62093L99452l29043R0174L04948
16488I27624k41375N49450k1756l85250L6784l56010J44799L01688j95450J83379
16478I43883C74711M06826J24758K1022C75404O43962j42829m6411k59722M82588
16468A052992E04148r6401M68995k69462K86734j42521k4346j58273n7663K89932
$$ y = [1438340, 1248513, 1518094, 1532695, 1287805, 1106820, 1360517, 1531347, 1189001, 1449147, 1388457, 1140620, 1128419, 1168577, 1210972, 1444361, 964394, 1254249, 1255431, 1136194, 1149174, 1125092, 989530, 1007515, 1064055, 1098558, 1243716, 1302332, 867661, 648436, 898971, 1014372, 968220, 871951, 1306170, 847532, 1033931, 1269773, 855437, 733419, 944470, 1060165, 967471, 915678, 815504, 924885, 462093, 861545, 532502, 622676, 927624, 686249, 1235699, 1213943, 828693, 865477, 509467, 654266, 955954, 760504, 943883, 374711, 781537, 906295, 927317, 375404, 1019366, 876537, 830126, 570404, 1052992, 504148, 407747, 876742, 607280, 894014, 751493, 727147, 568874, 511211, 801143]
16458H01143C71369K22483J07725J24243l93821L40428j09590p0136O114j20470
16448D78345K97260j39366l06209K12525J3321r4084K49084j05845A01735N43942
16438F45677q9080R5132j99425N1205m220n4684Q3525M9290j15285J87952L2634
16427F82721j71509j1694j93901K83511n8548m1354m6431k3556j20989M236J33398
16416D35884R2961j77752P1761q3387k09A41166J61618K28784m7285K26383j94489
16405E16177L11219l63644P2682k53499K72384r9881o7407j9512J91524B48771
16394D91427K18885k84826J45362j31435k16652Q6730O492P8240Q5084q8198K95648
16383F86757B29225o739J3127J6771J88308j2026H7483J41185J61943K3513j62983
$$ y = [801143, 371369, 593852, 701577, 825820, 431999, 772427, 662837, 592701, 598815, 478345, 775605, 636239, 330030, 542555, 555876, 461792, 710876, 605031, 101735, 645677, 556597, 651729, 452304, 503509, 499289, 444605, 528130, 577420, 462135, 650087, 682721, 511212, 499518, 305617, 589128, 530580, 489226, 442795, 419239, 298250, 302486, 435884, 528845, 351093, 422854, 339467, 339258, 141166, 302784, 531568, 484283, 710666, 516177, 827396, 463752, 536434, 282935, 555319, 455438, 388031, 368519, 560043, 248771, 491427, 710312, 425486, 570848, 439413, 222761, 309491, 315983, 394223, 479307, 391109, 686757, 229225, 222486, 235613, 252384, 440692, 428666, 87483, 228668, 390611, 414124, 251141]
16372B51141K94230p7269j17667J43416R1971q9841B05158K159L11184j77209
16362C41292J16696b5803C92159m7176J78980L5129j83266j6393K23576m4218
16352E38791j61105A36375K0543p5644M74601I6731K86092q3020K60575a9510
16341A35567L07195j10521l9582P2348A59329d7383C06238j18504D2467M69864
16331E12331B07199O1792J98852K32628G7805Q4530J7345K99187I0221J60972
16321B51193A07717K36858K6182j2477R0830j12843r0154K43890k29639E2322
16310C89913I8505K32658j51354n4402K14678J00395R8118B24443l0038J62989
16300C57394A41311M4141K83209D1946J71011O5998L5088J24692k09993L895P3632
$$ y = [251141, 545371, 468102, 350435, 493851, 585822, 495981, 205158, 207317, 518501, 341292, 457988, -25803, 392159, 344983, 523963, 559092, 375826, 359433, 583009, 538791, 377686, 136375, 156918, 81274, 555875, 96731, 382823, 299803, 560378, -19510, 135567, 442762, 332241, 292659, 365007, 159329, -47383, 306238, 187734, 42467, 512331, 207199, 268991, 467843, 700471, 77805, 162335, 179680, 478867, 90221, 251193, 107717, 344575, 370757, 358280, 449110, 336267, 246113, 490003, 260364, 52322, 389913, 98505, 331163, 179809, 125407, 340085, 440480, 538598, 224443, 194405, 357394, 141311, 185452, 468661, 41946, 212957, 278955, 314043, 438735, 228742, 232637, 306269]
16289C06269q8020n1386M54805C05584K44241B42461J81174A19648K9326D3925
16278B42466q0153J48131A35495J46832K3858b19855A08382L0947J51921N6117
16268C47367o2765P6863A24254J09745n9013R9334i2000B55988M5454p4571j05506
16257A21365J11053p5474d3512B19834r4372L19860A2169L54589A78692C929M28125
16246D32054j01366K33364A6484K76881o5400F668f3921C91394I9350J34890C677
16234A23832J93417j4181j05I9478J71356j08229H0535m069K07606j30388A4742
16222a0872C39617j66613E6281N5099D8373K71104e2768G8637N5163L4184J38689
16211C06673o0514J34567A78048C5293J97119p6120B2117K3332p959O620a7987
$$ y = [306269, 218249, 166863, 621668, 305584, 549825, 242461, 423635, 119648, 148974, 43925, 242466, 162313, 310444, 135495, 282327, 306185, -219855, 108382, 139329, 291250, 347367, 284602, 361465, 124254, 233999, 174986, 274320, -92000, 255988, 301442, 226871, 121365, 232418, 156944, -43512, 219834, 125462, 445322, 12169, 366758, 178692, 3929, 432054, 330688, 564052, 16484, 293365, 227965, 6668, -63921, 391394, 99350, 234240, 3677, 123832, 317249, 303068, 302963, 99478, 270834, 162605, 80535, 76466, 284072, 153684, 14742, -10872, 339617, 173004, 56281, 111380, 48373, 319477, -52768, 78637, 133800, 167984, 306673, 246159, 380726, 178048, 35293, 232412, 156292, 22117, 45449, 37490, 44110, -17987]
16199B04331I3448Q6307D791J32526A0961O1060q402b22286B89172q8597D5077
16187C03764I3133J5822a817l7080C85165A56146b7995j65606A69239m0537K7527
16176A56229B1602c0270B39951o2636B0928M32760c7386D729K28954a4500B53384
16164A10981M4493J07444o0670l3889G6460B6103L67265j75288c8990B97875a85941
16152a20413H6081l3235b34861A20175D4069Q0127Q0644F5723M7958a24963B3666
16140b11323a01885j61837a10904F9762L00368j47557a17698A44971J22902i5190
16129A66190a76293C62410c24916A67065g5363C48534D3356c2212A06173J21749
16119B27922q7261b48494B34720r2115j9846C6668J72012a29001B50892c95894
$$ y = [204331, 93448, 179755, 4791, 137317, 10961, 72021, 63619, -222286, 289172, 200575, 45077, 303764, 93133, 108955, -1817, -38897, 385165, 156146, -27995, -193601, 169239, 128702, 156229, 21602, -30270, 239951, 177315, 20928, 453688, -37386, 4729, 233683, -14500, 253384, 110981, 155474, 262918, 202248, 168359, 76460, 26103, 393368, 218080, -38990, 297875, -185941, -120413, 86081, 52846, -234861, 120175, 44069, 124196, 204840, 65723, 113681, -124963, 23666, -211323, -101885, -263722, -110904, 69762, 370130, 222573, -117698, 144971, 267873, -95190, 166190, -176293, 362410, -324916, 167065, -75363, 348534, 43356, -32212, 106173, 227922, 140661, -248494, 234720, 142605, 122759, 36668, 208680, -129001, 250892, -395894]
16108A07342D9049g2190A46580J7543a97910A11307i9858q250A18132d3743r9199
16097a42942b0013a209A09953b92938J27316k2144K2769A19403J673k424K66907
16086C85559j11378L30822e49900a0708k2037k21845J25048A87452a7713k20778
16076b38491f8954j8465A57171K9212m9076C7171a06081j58353C54647a72522
16065a25665H8486j3929e0492G7667d7689B7831a57049F359e4446C71205k7424
16054C43781h3432B44982A7208d20199A39395n9833Q3851b01558O024b8112o8708
16043i6820r9115b4724A12988R7966c24202E2930a41350e1358l7235q055j3373
16032a10021j69820A35415c6547A93916b4427A72858c9553k51434C9937R5715
$$ y = [107342, 49049, -72190, 146580, 164123, -197910, 111307, -99858, -108108, 118132, -43743, -142942, -20013, -1209, 109953, -292938, -165622, -187766, -164997, 119403, 121076, 118652, 385559, 274181, 605003, -549900, -10708, -32745, -254590, -129542, 187452, -17713, -238491, -68954, -87419, 157171, 186383, 137307, 37171, -106081, -264434, 354647, -172522, -125665, 88486, 74557, -50492, 77667, -47689, 27831, -157049, 6359, -54446, 371205, 343781, -83432, 244982, 17208, -420199, 139395, 79562, 163413, -201558, -195534, -28112, -96820, -195935, -24724, 112988, 210954, -324202, 52930, -141350, -51358, -88593, -96648, -110021, -279841, 135415, -36547, 193916, -24427, 172858, -39553, -290987, 39937, 135652]
16022A35652K13697a12346A45145m5417J35138h2960G9310J44433b30420Q2081
16012a48339D2071F201L4614b34725F6411i4579I2358b23950f6900B10444b86901
16000F1228c62851R4816g4353L572A27684A9871c0387M732j44318j82099a39228
15988H2594c05949D1877J03261E5006L0782a33470P319c8326B85591a24300j14767
15977b39067j71207a75466C1753A305a22335l8010A29010E9212K34823h2902B28870
15965I2883A6408K05641j10128H096L09517d38129i2768M2977C09975a10000b5632
15953C04408j35465D2892n656J8354K92060e2151j50343G4303J86603F8384d22759
15941d6773j84264a02218n2141j86736A37360F595g5710o9246j32404A44642e7638
$$ y = [135652, 349349, -112346, 145145, 99728, 234866, -82960, 79310, 223743, -230420, -148339, 42071, 6201, 40815, -234725, 66411, -94579, 92358, -223950, -66900, 210444, -286901, 61228, -362851, -268035, -74353, -70781, 127684, 19871, -30387, -25655, -169973, -352072, -139228, 82594, -305949, 41877, 145138, 55006, 85788, -133470, -126151, -38326, 285591, -124300, -239067, -410274, -175466, 31753, 1305, -122335, -160345, 129010, 59212, 294035, -82902, 228870, 92883, 16408, 222049, 111921, 8096, 317613, -438129, -92768, -49791, 309975, -110000, -25632, 304408, 168943, 42892, 37236, 55590, 347650, -52151, -202494, 74303, 260906, 68384, -422759, -46773, -231037, -102218, -154359, -341095, 137360, 6595, -75710, -144956, -277360, 144642, -57638]
15929a88235A25267a12635H4880g3344q6989F412L42539a8183E5234e1316A09667
15917f5598E4590f5273l59114A10929a52345b8602k94700P9189D37768a25938
15906b4298l8182k30873B78147a5572O031C4116L2316k4568e3090B9265K02982
15895B32247A5530J2949P185P5059a01119j07210B81901p4086g1002K851c1560
15883A91578D8246K7633a03764j98663C0201a72985H210J72b17511e8634b4231
15871a88494F2315b63777A29686h4354A14307b30586P8998G8758c44987a24172
15860g4853b4866A36980a50910j67587J44304d7990C2850J27341C2218f3148A53471
15848a06628D3854g2499p0159l9164H735a94755F9010Q1084J59802a54204A69058
$$ y = [-188235, 125267, -112635, 84880, -73344, -160333, 6412, 348951, -18183, 55234, -51316, 109667, -65598, 54590, -65273, -424387, 110929, -152345, -28602, -323302, -244113, 437768, -125938, -24298, -62480, -293353, 278147, -15572, -9541, 34116, 66432, 41864, -53090, 29265, 232247, 15530, 28479, 35664, 110723, -101119, -208329, 281901, 207815, -71002, -68151, -31560, 191578, 48246, 75879, -103764, -302427, 30201, -172985, 8210, 8382, -217511, -58634, -24231, -188494, 62315, -263777, 129686, -84354, 114307, -230586, -151588, 78758, -344987, -124172, -74853, -24866, 136980, -150910, -318497, -174193, -47990, 32850, 160191, 32218, -63148, 153471, -106628, 43854, -72499, -142658, -181822, 8735, -194755, 69010, 150094, 309896, -154204, 169058]
15836g9252c068j73351B56251D8365b35502h1143q8061A78693N4048a87405e8200
15824a10116A10839b4128j48094P0673B1326N9919a63126k69802c8989C7955J26620
15813A64575c38472a23425k9996a1013m18345a94234R5827A7167d35899i4180
15802B54328A211J41691n7633g4912j48342L0949B8815a25582I9650b95855a2865
15790a05872F7415H936d08591H9864b45045A82649a63695q1541g6571K7127B01328
15778A04661J07344E0622J69551j02129d53581C28173I4155c4724j01025d8963
15767c16491a1240m52193b9656B94746a22400A65073F8909a31253B94078b14419
15756D9203E26b24325G4039Q9441a91749c516k1502H0081a70441Q2463a4916A99547
$$ y = [-79252, -3068, -176419, 256251, 48365, -235502, -81143, -169204, 178693, 232741, -187405, -58200, -110116, 110839, -24128, -172222, -101549, 21326, 81245, -163126, -432928, -38989, 37955, 164575, -338472, -123425, -153421, -11013, -429358, -194234, -98407, 17167, -435899, -94180, 254328, 1211, 142902, 85269, -74912, -223254, -192305, 28815, -125582, 99650, -295855, -12865, -105872, 67415, 8936, -408591, 89864, -245045, 182649, -163695, -245236, -76571, -49444, 201328, 104661, 212005, 50622, 220173, 118044, -453581, 328173, 94155, -34724, -135749, -48963, -316491, -11240, -463433, -29656, 294746, -122400, 165073, 68909, -131253, 294078, -214419, 49203, 526, -224325, 74039, 163480, -191749, -3516, -25018, 80081, -170441, -87978, -14916, 199547]
15743C8665O281J9213M6213a00844b0206A79970m3986e1477C46077A4297e2096
15731b53217j87892A41343c40824A36527n2318J18663c17453B4678d877m34802
15721d39679a22846j95832A74339a45559l8922n975d1334k7073k08066D9284N9388
15710A08672a72978L6886G5115e8043J2558j27862e4677m0113M687B26175D6929
15698b66036e3170h412A42142l6315K1341d02192b9435r4984C84401a74164I2899
15686c52438a42218B28224a97642B94198g4416F4663e6317A51992J12377J23870
15676C88239A76419K01808c13078k5654A15967i8367q9797g9994A50559b96166
15665A63666n822e1908r4609G023f5391k51152a31971A59155F1414a96340A68573
$$ y = [38665, 44946, 64159, 110372, -100844, -20206, 179970, 135984, -51477, 346077, 14297, -52096, -253217, -441109, 141343, -340824, 136527, 84209, 202872, -317453, 24678, -4877, -439679, -122846, -318678, 174339, -145559, -184481, -190456, -41334, -68407, -276473, 49284, 108672, -172978, -136092, 75115, -58043, -45485, -173347, -54677, -94790, -90103, 226175, 46929, -266036, -53170, -8412, 142142, 105827, 127168, -402192, -29435, -124419, 384401, -174164, 92899, -352438, -142218, 228224, -197642, 294198, -74416, 64663, -56317, 151992, 264369, 388239, 176419, 378227, -313078, -338732, 115967, -98367, -188164, -79994, 150559, -296166, 163666, 157844, -51908, -146517, 7023, -65391, -316543, -131971, 159155, 61414, -196340, 168573]
15653g731r6381B2055F372J13496a36823A31040b58250b175n3876m7489k55770
15642c59310a24411j344k50824J30111G071a64859f45m76711F2483J03631b46010
15630a77516l0496k07847C5183J44159a26269H4003b21150e8977K1720B16464
15619a80862A17489b68142f4260k41701a08865d5719F0946K5768e2506E791O7437
15608G3228e552F9578R4629c6814J6600k34966F0436M8801a789H331b02156k2942
15596b25098B03764F7297a31790E0735J24908a88416M4241K3225c3067C86756
15585D3264a24085e4841l38106J61636B71239h5460A54053a4667j98471Q9223
15575a23915c0328k35957Q7657c7806p3005A9463c71041h6315a7342j85830G4215
$$ y = [-7731, -104112, 22055, 6372, 119868, -136823, 131040, -258250, -2175, -56051, -103540, -359310, -124411, -125755, -376579, -246468, 7071, -164859, -645, -477356, 62483, 166114, -246010, -177516, -208012, -415859, 35183, 179342, -126269, 84003, -221150, -58977, -37257, 216464, -180862, 117489, -268142, -64260, -305961, -108865, -45719, 60946, 86714, -52506, 5791, 73228, -5552, 69578, 164207, -36814, -20214, -255180, 60436, 109237, -1789, 8331, -202156, -225098, 203764, 67297, -131790, 50735, 175643, -188416, -144175, -120950, -33067, 386756, 43264, -124085, -54841, -392947, -231311, 271239, -85460, 154053, -14667, -213138, -123915, -30328, -266285, -178628, -37806, -110811, 19463, -371041, -86315, -17342, -203172, 74215]
15563A36305d3784B34990b12399j0115J08936B23085h4104A58320a83544G6740
15552b39178f346l04089E7173h143k75885H220M8517J04598j3938a09812I7905
15540G2061j4820b50913D3451J66015F718i2441H2370E15a23802a8546B8387j1335
15528A7052a2435j64A16599l3782M4101m6913r972a87317A42161O3451a44376
15516B61807b46514d8617j54644j0149b931G5706h749E3082g0635q6043e8418
15504c67602A27539b9838m3761i221A92869a1257D98444F3387I944b2298A33403
15492F5280c24110a8071j16452D3309m478e3934j80381I8669b98514h2119o4823
15481a46942A2620a52527C36094e6336j67813c7909n9732j37970a7905j16743
$$ y = [136305, -43784, 234990, -212399, -222514, -113578, 223085, -84104, 158320, -183544, 76740, -239178, -6346, -310435, 57173, -8143, -284028, 8220, 56737, 161335, 147397, -109812, 97905, 72061, 57241, -250913, 43451, 209466, 6718, -92441, 82370, 515, -123802, -18546, 28387, 17052, -12435, -12599, 116599, 82817, 126918, 80005, 70033, -187317, 142161, 205612, -144376, 261807, -246514, -48617, -203261, -213410, -2931, 75706, -8749, 53082, -70635, -156678, -58418, -367602, 127539, -29838, -73599, -9221, 192869, -11257, 498444, 63387, 9944, -22298, 133403, 65280, -324110, -18071, -134523, 43309, 38831, -53934, -234315, 98669, -298514, -82119, -146942, 12620, -152527, 336094, -56336, -224149, -37909, -97641, -235611, -17905, -134648]
15471a34648d2867j0819F5723a39136n2405k00744a00401G2985K97742I7242f5311
15459b00656D5268f20793A78344a47417B63817D9171b35535a2472j78223O062
15449a84633A935b6751o3059B5811M1353k5583b40739D663N2496a31260A27008
15437a78530p9781B05596b20074H9936h4362p8026O6970C71693H3747c11060G3755
15425C80213j86204a28947j13814B0058J20588a16439G471K8908K57008B1825
15414A12070l6277K50294g0610A19273f8296G2593J73835b09898A31958b30647
15403a54864A99436g5336j28717R4882k8898A31041c59321F8221b33274M6772
15393a86502A46420d0587A60739b9396o6504B25297o1571b73245B03705d9858
$$ y = [-134648, -42867, -53686, 65723, -139136, -191541, -392285, -100401, 72985, 370727, 97242, -65311, -200656, 45268, -620793, 178344, -147417, 263817, 49171, -235535, -12472, -190695, -184633, 1935, -26751, -89810, 25811, 67164, 41581, -240739, 4663, 57159, -131260, 127008, -178530, -258311, 205596, -220074, 89936, -84362, -162388, -95418, 371693, 83747, -311060, 73755, 380213, 194009, -128947, -242761, 20058, 140646, -116439, 7471, 36379, 293387, 21825, 112070, 75793, 326087, -70610, 119273, -68296, 72593, 246428, -209898, 131958, -230647, -154864, 199436, -75336, -204053, -109171, -138069, 131041, -359321, 68221, -233274, -186502, 146420, -40587, 160739, -29396, -95900, 225297, 163726, -273245, 203705, -49858]
15382h5432F7680l1666a75486B5103f8224e307E3249B2861J57867J2261l8771
15371A54218a07040A62282Q4571f4710C81187a60871p3471C07560c37661a22738
15360C6813c09848Q3140E041f6708b1971k57363D4120a04048D21095j85674E8804
15348a65265G9546f8736p3140E833a23729d422A74328a93270H6937O5310o9468
15337H2779A2382g865l1736l832A90254C9574a13114b1796A34881h5273B7763
15325B09054A04414L6856b27349O3188B85205C6152N4762a0567C8967K30810A29177
15313B4849O6223a96315I7035h4323D33999B1697K57243A5052G18J12212A4688
15301A55540a14816l0180J1294j9952B4421a17900c9629D21526b14852E4254J5663
$$ y = [-85432, 67680, 36014, -175486, 25103, -68224, -5307, 53249, 22861, 180728, 192989, 154218, -107040, 162282, 246853, -64710, 381187, -160871, -234342, 307560, -337661, -122738, 36813, -309848, -226708, 5041, -66708, -21971, -279334, 44120, -104048, 421095, 235421, 58804, -165265, 79546, -68736, -141876, 5833, -123729, -4422, 174328, -193270, 86937, 152247, 82779, 12382, -7865, -39601, -43433, 190254, 39574, -113114, -21796, 134881, -85273, 27763, 209054, 104414, 141270, -227349, -164161, 285205, 36152, 90914, -10567, 38967, 269777, 129177, 24849, 91072, -196315, 97035, -84323, 433999, 21697, 278940, 15052, 718, 112930, 14688, 155540, -114816, -144996, -133702, -153654, 24421, -117900, -39629, 421526, -214852, 54254, 69917]
15290F9917N8176a22754e9921I8266K9537d0251C336a47682M4323H8124d0198
15278B88585a5775c577B13720j4321a96600C14505g0773A36702f1161A196L35260
15267C36456q2913h3165b8852B46336K23520b39653h9973I4802b1635I5624J26313
15256B21937C5965a39863g360r2567l3483B14810a34681k4952f9937j58632i7760
15244A29381a42588C13942I4456h8937A00578K99651J7193R4901K19482L54725
15234A086530m31218L90052m40080k19117j32859A22767a01303B19262j2662J39912
15224C46512j00784a98661l39731A45192l6676p80K7718K88269a10782A32744
15213a1508k05005B46561J08177A72530C4090d3912A27347K89330j56627P4415
$$ y = [69917, 128093, -122754, -59921, 98266, 127803, -40251, 3336, -147682, -103359, 88124, -40198, 288585, -15775, -3577, 213720, 199399, -196600, 314505, -70773, 136702, -61161, 1196, 336456, 253543, -83165, -28852, 246336, 469856, -239653, -89973, 94802, -21635, 95624, 221937, 35965, -139863, -7360, -99927, -133410, 214810, -134681, -159633, -69937, -228569, -97760, 129381, -142588, 313942, 94456, -88937, 100578, 400229, 417422, 512323, 731805, 1086530, 655312, 1045364, 605284, 386167, 253308, 122767, -101303, 219262, 206600, 346512, 245728, -198661, -538392, 145192, 108516, 107736, 135454, 423723, -110782, 132744, -11508, -216513, 246561, 354738, 172530, 34090, -43912, 127347, 416677, 260050, 334465]
15203C34465A48330K33559g2473M127B51901a92982B28662b7167l9899L2251B60149
15191a37618A45237e6121C20344r290d963j37569A11907j0337P3802c29936Q2120
15180b47816A02572J79337G4919J69224f9041m0575A12141a68980B04841j3423
15170A91418B0414p838b48563C9410Q8786b43279D4459K19156A03585k5721b68997
15158A58501R5719L7435L47198f5844p4389n3942B76497j35004M4927B5456d5969
15146A17743E0336J4751Q652b9473k49282a16321B62539K6732a93445c7862C66448
15134a2484E0647J21221K31943g647A67163A9993a29044A70243J45289m7996A29480
15122A44252F0424K52135I5988K81896I5519k0252M24286A39735N5430I723J04827
$$ y = [334465, 148330, 381889, -72473, -68346, 251901, -192982, 228662, -27167, -67066, -34815, 260149, -137618, 145237, -56121, 320344, 311054, -4963, -142532, 111907, 101570, 175372, -329936, -247816, 102572, 281909, 74919, 244143, -69041, -109616, 112141, -168980, 204841, 191418, 20414, 12576, -248563, 39410, 128196, -243279, 44459, 263615, 103585, 77864, -268997, 158501, 254220, 291655, 638853, -65844, -140233, -194175, 276497, 141493, 186420, 25456, -45969, 117743, 50336, 65087, 73739, -29473, -278755, -116321, 262539, 289271, -193445, -37862, 366448, -12484, 50647, 171868, 403811, -7647, 167163, 19993, -129044, 170243, 315532, 267536, 129480, 144252, 60424, 312559, 95988, 377884, 95519, 75267, 499553, 139735, 195165, 9723, 114550]
15111A14550L41422c9123A82238J5906a81725C61338a1901A78788E4161L40905
15101C95066A40842l6593P5194O0241E1682P5773b10787D88971A06697J67831
15091B74528a61333A20630a50098H8734e5727D48614a9976k15300A73901h2227
15080A61017b3362j45729a5934E25308a01824A07191J37608j11162J3729E7535
15069D21260j02141O7605k3801j21703k8298C895J25771J8418G3165J60216e1203
15057G1512B3244b103B06964g1275B4097J99446a88712A18936J08099o2814O5482
15046B29703K83406B35277a0480C4951P5974J56L67666A37395J9396K16517H2201
15034B17276C1060M26007B03147J24378E4442J40093J4331K7781K3826q6430Q6568
$$ y = [114550, 455972, -39123, 182238, 198144, -181725, 361338, -11901, 178788, 54161, 395066, 140842, 104249, 179443, 239684, 51682, 127455, -210787, 488971, 106697, 274528, -161333, 120630, -150098, 88734, -55727, 448614, -19976, -235276, 173901, -82227, 161017, -23362, -169091, -15934, 525308, -101824, 107191, 244799, 133637, 147366, 57535, 421260, 319119, 386724, 362923, 241220, 212922, 3895, 129666, 148084, 73165, 233381, -51203, 71512, 23244, -2103, 206964, -71275, 24097, 223543, -188712, 118936, 227035, 164221, 229703, 513109, 235277, -10480, 34951, 110925, 111081, 478747, 137395, 156791, 373308, 82201, 217276, 31060, 457067, 203147, 327525, 54442, 194535, 208866, 236647, 260473, 174043, 260611]
15023B60611J81659j25303Q497c9691A87766O7891K18977m8502j69560J12616
15013C69188A71608p5590N2584n4179m1076e4543C16204O1730J02640j63581O238
15002C23231q0094j2387r3129E9716K41131F4732L33785l8469A16012J51730p0025
14991A97717J98153A92618k5469K29334B6982M19884j46679J78209A27990K6697
14981A54687K1358K02926J48200p9252A25526R5256K1228D8325M5921C4443K34764
14970B69207J87228k15421j11381k2380J22443L99616B60321k3265J24286A58971
14959B8985M60013b0409B53737K24542A0466P1975J49016A02745L65327N07M0926
14948E09505m6488k13966B4319J07362J93340A18896C7882K56354L88188C08180
$$ y = [260611, 442270, 316967, 325464, -39691, 187766, 255657, 474634, 426132, 256572, 369188, 171608, 96018, 148602, 94423, 53347, -54543, 316204, 377934, 480574, 316993, 323231, 243137, 230750, 137621, 59716, 300847, 64732, 398517, 360048, 116012, 267742, 197717, 395870, 192618, 167149, 396483, 26982, 446866, 300187, 478396, 127990, 154687, 176045, 378971, 527171, 447919, 125526, 220782, 242010, 48325, 94246, 34443, 269207, 456435, 241014, 129633, 107253, 229696, 629312, 260321, 237056, 361342, 158971, 28985, 488998, -20409, 253737, 478279, 10466, 82441, 231457, 102745, 468072, 468579, 509505, 463017, 249051, 24319, 131681, 325021, 118896, 37882, 294236, 682424, 308180]
14937B45421K15164j29169A03127J12428K88658B12662O2349p373m3472m1334
14927A82832L8675L39733p7542j16123O0407j0037j85241A07269J05162P706P5404
14916B95541K1817A27653K18217J2729n8477Q2490N4847I2856J63627J53869P199
14905D17551P389a4071A87368N13746k80981a00691D54356K66742k79018C4643
14894C16996p228N29081l62380O8080n6285r5457J81620k26701L1272q1787H2269
14882A24292R3913b4383C96023K37769j99156p3420J40226O6140A84331J53503
14872C37834j46088K96327j87868A35286M17143B26493J60805j79368K23412J07783
14862E39125D6366O31217l18314K20610k64983K6475J91283q4800K26100C26925
$$ y = [245421, 460585, 331416, 103127, 215555, 504213, 212662, 275011, 267638, 224166, 182832, 221507, 561240, 483698, 367575, 427982, 417945, 232704, 107269, 212431, 220137, 295541, 317358, 127653, 345870, 358599, 300122, 382612, 437459, 92856, 256483, 410352, 417551, 424940, -14071, 187368, 701114, 420133, -100691, 454356, 721098, 442080, 34643, 316996, 309768, 838849, 476469, 544549, 488264, 392807, 574427, 347726, 378998, 297211, 82269, 124292, 218205, -24383, 396023, 633792, 434636, 361216, 501442, 567582, 184331, 337834, 191746, 488073, 300205, 135286, 552429, 226493, 387298, 207930, 431342, 539125, 46366, 677583, 359269, 579879, 314896, 341371, 532654, 447854, 673954, 326925]
14851G00793k31492J9835K2638j75304K29958j17149J0650Q9790j94063l6427
14841C19229j23429J64403A21807N43795B96543O6991R4571K112J4150J52282
14831F26649C11389K44449J02993l02233J10884r5970J3953Q7557j70184L61991
14821F64829j89778K35054A20292R8135L52223k35398L01105j72097L9195j28816
14811C74639M30208l68151j1434J60018J63307j76909k43677J09050J6409j15044
14801C38416O2270J65900B19275J15682J24238L25977C71519K39319B81734L29931
14791F11665j3887J78338k34132k44286N33591l48644J13739j90301Q2993k33410
14781B55666M89925l51932K31303p3321B22733K9223K51735K57466C80044K04863
$$ y = [700793, 469301, 489136, 511774, 336470, 566428, 449279, 459929, 549719, 355656, 319229, 195800, 360203, 121807, 665602, 296543, 363534, 458105, 460217, 474367, 626649, 311389, 555838, 658831, 356598, 467482, 371512, 385465, 473022, 302838, 664829, 475051, 710105, 120292, 218427, 570650, 335252, 636357, 464260, 503455, 374639, 804847, 436696, 425262, 585280, 748587, 571678, 328001, 437051, 453460, 338416, 400686, 566586, 219275, 334957, 459195, 785172, 371519, 610838, 281734, 611665, 597778, 776116, 541984, 297698, 831289, 482645, 596384, 406083, 489076, 255666, 745591, 393659, 624962, 551641, 222733, 251956, 503691, 761157, 380044, 584907]
14771E84907R5394r6779J94469j72862J11192k97770K29878n9306J10555k24793
14761D74885m5850M6267K78464k73454n6895J66842j3992j25368J99378k3236
14751F27041K52659l83683L3883J96847j40304P9069j2882K09749j07595J41437
14741H96221k05809J1850n4576l0483L94720l40891C34708O51220m85120L56033
14731H56841J80704l47392j14160L79438J43550m79939J68537j0590J34388k1922
14721H89455j51863j9226K5120r5940L30965j25002k35733K86667j72877J23194
14711H54760J49851q0763p7842j1242J62345n0481j21154K39326k04613j50155
14701G10032k78089M52439n6238L01373n8842j44969k09983M14860m46945J74014
$$ y = [584907, 680301, 583522, 777991, 605129, 716321, 418551, 648429, 589123, 699678, 474885, 429035, 475302, 753766, 480312, 423417, 590259, 576267, 450899, 650277, 627041, 879700, 496017, 529900, 726747, 586443, 665512, 652630, 862379, 754784, 896221, 690412, 702262, 647686, 617203, 1011923, 671032, 334708, 985928, 500808, 856841, 1037545, 690153, 575993, 955431, 1098981, 619042, 787579, 776989, 911377, 889455, 737592, 718366, 743486, 647546, 978511, 853509, 617776, 904443, 731566, 854760, 1004611, 923848, 846006, 834764, 997109, 946628, 825474, 1064800, 860187, 710032, 431943, 884382, 828144, 1129517, 1070675, 925706, 715723, 1130583, 683638, 857652]
14691H57652l47j06169K89577K2619n0426R5361k34119J17515J376j66529K00207
14680A026717L58253F76604M99327n9876j21443J8333Q0281K68694l48370N3408
14670A066958J16218j81064K50362q4930j64670O1959J35337n77168L98049j61634
14660H59417Q6289K67238j0663k2737q0224n5853M0765m3199J78626j50804K82778
14649A351633r3375K9864j46219J87230l76270K39137P2645k39562J4064L90762
14639A429909m84662R8325l9960L3379K39877j29696J8614J52842j9710m3756
14629A255162L35380o2930j28050J42924j02943k19433K49222k00775P8102L3027
14619A379686j80789J36986n2872R0736l95834N92970j69225L15450R0024l50959
$$ y = [857652, 857305, 751136, 1040713, 1063332, 1012906, 1108267, 874148, 991663, 993039, 826510, 1026717, 1384970, 676604, 1175931, 1116055, 994612, 1012945, 1093226, 1361920, 1013550, 1066958, 1183176, 1002112, 1252474, 1167544, 1002874, 1064833, 1200170, 623002, 1021051, 859417, 945706, 1212944, 1202281, 1179544, 1099320, 1043467, 1084232, 1041033, 1219659, 1068855, 1351633, 1258258, 1288122, 1141903, 1329133, 952863, 1192000, 1264645, 1025083, 1039147, 1429909, 945247, 1043572, 1003612, 1036991, 1276868, 1147172, 1165786, 1318628, 1298918, 1255162, 1590542, 1527612, 1399562, 1542486, 1439543, 1220110, 1469332, 1268557, 1346659, 1379686, 1198897, 1335883, 1283011, 1373747, 977913, 1570883, 1401658, 1717108, 1807132, 1456173]
14609A456173J81580J42478m07323L83565k86530J55608l06924M3488K50654j0396
14599A602373K75229J8344o32469J79559L14325k46087K55469L5975L7697l82225
14589A458190K72577j24995J22318J53543l43755N21153k41833J01624K3316m7956
14579A894182r4069n1781M22544k08318J50238P5864k21985L7090J51342l33784
14569A821323m6559M94570J5135j35146J56462k9402P9861o0561q8255o1300k35097
14558A911031M68124O0682k19541L38311k38509J78730j67684K75016k6938M87996
14548C067218L50027k89829Q6634j28130N36634k09593O35331K21095K84951L97422
14538D951760O93113M84005J466532J901166K924139M048187N951577N807495
$$ y = [1456173, 1637753, 1780231, 1372908, 1756473, 1469943, 1625551, 1318627, 1362115, 1612769, 1602373, 1877602, 1895946, 1263477, 1443036, 1757361, 1511274, 1766743, 1802718, 1840415, 1458190, 1730767, 1605772, 1728090, 1881633, 1537878, 2059031, 1817198, 1918822, 1942138, 1894182, 1800113, 1748332, 2170876, 1962558, 2112796, 2188660, 1966675, 2003765, 2155107, 1821323, 1774764, 2269334, 2284469, 2149323, 2305785, 2276383, 2356244, 2295683, 2207428, 2146128, 1911031, 2379155, 2439837, 2220296, 2558607, 2320098, 2498828, 2331144, 2606160, 2579222, 3067218, 3417245, 3127416, 3214050, 3085920, 3622554, 3412961, 4048292, 4269387, 4554338, 4951760, 5644873, 6128878, 7595410, 9496576, 12420715, 16468902, 22420479, 28227974]
14530B8227974r45391q711011p298531l646012k043234j275089o00879o53255
14522C054572j29554m1194J87888j69240m31298K29222k69863J58102q7517K34078
14512B735196k68471J06147r01N2050r011M26738m39324K39909k10943O57935
14502C289325n62765J59475M72220l48135J9333K76759K7049j16791Q4781K2989
14492C324240l06454K39692r964R966K12988p4904P6447l0625Q2362j3667L552
14481C513633n1539J61018M86100k28324r4004J82042r1903l2174J64408K691
14471D011948K69480j24940j09218J51025J02643J76686k95004J36945K50706
14462D570271k09774j33717J37699M20353L54438l84713l8311M31145o00570M23064
$$ y = [28227974, 27282583, 18571572, 11273041, 7627029, 5583795, 4308706, 3707827, 3054572, 2925018, 2883824, 3071712, 2902472, 2471174, 2700396, 2430533, 2588635, 2501118, 2735196, 2466725, 2572872, 2571971, 2624021, 2615010, 3041748, 2602424, 2842333, 2631390, 3289325, 2726560, 2886035, 3358255, 3010120, 3029453, 3306212, 3333261, 3216470, 3301251, 3324240, 3017786, 3257478, 3247514, 3257480, 3470468, 3395564, 3472011, 3441386, 3523748, 3510081, 3513633, 3462094, 3623112, 4109212, 3880888, 3786884, 3968926, 3877023, 3844849, 4009257, 4011948, 4281428, 4156488, 4047270, 4198295, 4300938, 4477624, 4182620, 4319565, 4570271, 4360497, 4226780, 4364479, 4784832, 5139270, 4754557, 4716246, 5147391, 4546821, 4969885]
14452D969885J48821K43402k26489n8892M56094r4795k99655M49931k9129n4312
14442E504861j9836J14097J14800O5099K13609j23712M6588N8518m170J29891
14432F099745M71364n1183l20163M47077o9515N4368L80583j90509o6051m9234
14422F706482N90810j03835N08493o18815J43333N34866j04272R0319J68572J93070
14412H109023K96473l14803J53543l7316N37925J43324L8508O4607L07657L5547
14402I334488k2087L06739n9950j27345L80270K09782J02528J76725m6067M22273
14392A0677356N41367l25891q9536L84045L97138P3086N6262N74518k05613M94207
14382A2576939r3517K91118K77457L4516J86520L24314J66753L12435L77214L49515
$$ y = [4969885, 5118706, 5362108, 5135619, 5076727, 5532821, 5438026, 5138371, 5588302, 5559173, 5504861, 5485025, 5599122, 5713922, 5779021, 5992630, 5868918, 5915506, 5974024, 5969854, 6099745, 6571109, 6519926, 6199763, 6646840, 6577325, 6631693, 7012276, 6821767, 6755716, 6706482, 7297292, 7193457, 7701950, 7083135, 7226468, 7761334, 7657062, 7747381, 7915953, 8109023, 8405496, 8090693, 8244236, 8206920, 8744845, 8888169, 8926677, 8991284, 9298941, 9334488, 9312401, 9619140, 9559190, 9431845, 9812115, 10021897, 10124425, 10301150, 10255083, 10677356, 11218723, 10892832, 10803296, 11187341, 11584479, 11657565, 11713827, 12288345, 12082732, 12576939, 12483422, 12774540, 13051997, 13086513, 13273033, 13597347, 13764100, 14076535, 14453749, 14803264]
14372A4803264l0185K13375K14331N62057K70961j11552P21440L79391M76805
14363A7499887J45604J68149L79780K28539M50585O64162K65364O32056J80376
14354B0614502J49924P29940K12143K97105P20265O08787M33166L93393O67300
14345B4826525P26082J68112O77617N92350P44825O61824O97428O50907Q01179
14336C0546849Q52534M12600J052344P38129Q09959Q38416R16901J074621J409323
14327C8651676Q65933R61340J094999J004162J113385J464344J333948J418955
14319D7908742J412517J180371J749946K056814J638163J471151K370334J470728
14311F1258766K363793K213949K128000K437000K403514K225980L263573K733866
$$ y = [14803264, 14773079, 14986454, 15200785, 15762842, 16033803, 15922251, 16643691, 17023082, 17499887, 17645491, 17813640, 18193420, 18421959, 18872544, 19536706, 19802070, 20434126, 20614502, 20764426, 21494366, 21706509, 22003614, 22723879, 23332666, 23765832, 24159225, 24826525, 25552607, 25720719, 26398336, 26990686, 27735511, 28397335, 29094763, 29745670, 30546849, 31399383, 31811983, 32864327, 33602456, 34412415, 35250831, 36167732, 37242353, 38651676, 39517609, 40478949, 41573948, 42578110, 43691495, 45155839, 46489787, 47908742, 49321259, 50501630, 52251576, 54308390, 55946553, 57417704, 59788038, 61258766, 63622559, 65836508, 67964508, 70401508, 72805022, 75031002, 78294575, 81028441]
14303H1028441L183839K959597L353244L521453L548834M289963L999599M119892
14295A10004862M671014M881459N411358N557935N467405O195016O534276O656748
14287A55380073P265731P406102Q353096Q300075Q873094R313961J0239467J0427271
14279B25558870J1128059J1215484J2324576J2527834J3192013J3554633J4115640
14272C13617109J4325245J4562723J4316398J4133940J2997423J2913885J1822493
14265D08689216J0768809J0080366R140916P830621O832775N344498L799105J861613
14257D64347919K14753l85023j023289l634279n931015p445012q942346j1572678
14249D25629030j2240804j2798101j2842652j3584525j3579673j3603840j3580545
$$ y = [81028441, 84212280, 87171877, 90525121, 94046574, 97595408, 101885371, 105884970, 110004862, 114675876, 119557335, 124968693, 130526628, 135994033, 142189049, 148723325, 155380073, 162645804, 170051906, 178405002, 186705077, 195578171, 204892132, 215131599, 225558870, 236686929, 247902413, 260226989, 272754823, 285946836, 299501469, 313617109, 327942354, 342505077, 356821475, 370955415, 383952838, 396866723, 408689216, 419458025, 429538391, 438679307, 446509928, 453342703, 458687201, 462486306, 464347919, 464562672, 464177649, 463154360, 459520081, 453589066, 446144054, 437201708, 425629030, 413388226, 400590125, 387747473, 374162948, 360583275, 346979435, 333398890]
14242C33398890j3639296j3200592j2920372j2527214j2070458j2405416j1370877
14235B45264665j1047030j0850871j1033426j0276647j0033372r007590q713505
14228A74302224q306689p892247p274644p058739n672036o454583n274438n473988
14220A20894860n283677m561862m737309l889395m059758l569714l922889l630959
14212H7239297k941140l114785k684684l181692k524088k347631k601780k396879
14204F5446618j965027k484781j452442k215674j382906j566735j459172k008519
14196E0911362j405819j614326j120485j413453j032584j488571j154699j078026
14188D0603399r35626j152161q02932j289634p55463j054093p04327q27134q69596
$$ y = [333398890, 319759594, 306559002, 293638630, 281111416, 269040958, 256635542, 245264665, 234217635, 223366764, 212333338, 202056691, 192023319, 183015729, 174302224, 165995535, 158103288, 150828644, 143769905, 138097869, 131643286, 126368848, 120894860, 115611183, 111049321, 106312012, 102422617, 98362859, 94793145, 90870256, 87239297, 84298157, 81183372, 78498688, 75316996, 72792908, 70445277, 67843497, 65446618, 63481591, 60996810, 59544368, 57328694, 55945788, 54379053, 52919881, 50911362, 49505543, 47891217, 46770732, 45357279, 44324695, 42836124, 41681425, 40603399, 39667773, 38515612, 37712680, 36423046, 35667583, 34613490, 33909163, 33082029, 32212433]
14179C2212433j007045p74196m29992j129131m38268p38059o52941n96915o98538
14170B5747348j62289p79411o49075p02811l61530m49818m16489p74499l88959
14161B1062467j92793m53897q27211n3662j56523o36536m06024k27054j12764
14152A7996003m15124o50223o7928l73755k44228m8486n25460o60708l3635j51416
14142A4825040j94706m66820j50218J72921k61236l36974k33514k63895P0917
14133A3161515p35265J40172o86195K44894j96302j92810k16645l64863j46116
14124A1008385K72838m88888j63445k17908o5678M6959m8771m06068j84138k93304
14114I459982K15805k94663l33227p4137l32615m3799K37081m17130L53147l12520
$$ y = [32212433, 31205388, 30431192, 30001200, 28872069, 28433801, 27695742, 27042801, 26445886, 25747348, 25585059, 24805648, 24156573, 23453762, 23092232, 22642414, 22225925, 21451426, 21062467, 20869674, 20415777, 19588566, 19534904, 19378381, 18741845, 18335821, 18108767, 17996003, 17580879, 16930656, 16862728, 16488973, 16244745, 16196259, 15670799, 15010091, 14976456, 14825040, 14630334, 14163514, 14013296, 14186217, 13924981, 13588007, 13354493, 13090598, 13161515, 12426250, 12566422, 11880227, 12125121, 11928819, 11736009, 11519364, 11154501, 11008385, 11281223, 10792335, 10628890, 10410982, 10345304, 10392263, 10343492, 9937424, 9753286, 9459982, 9675787, 9381124, 9047897, 8973760, 8641145, 8597346, 8834427, 8417297, 8770444, 8457924]
14104H457924k22765r9910o7705n5182j7196n66631J16538Q1217k3362l45414
14094G257514l71822m5898M55330l34651M6563q6119J63053l84808k68103k14341
14084F216718L64957j64185j119j31972J33466o89679K83400j21867k56028J85876
14074E819567k14931l3150J6133J4982r1977l77548K4752L78087j73355j45514
14064E217046J75012j21323j48365k47327K8663k22476O9126m0614J63178m01896
14054D471024J63426l91288K60952J6541k675r7698l9241k7364K10624l60266
14044D204035o0856n5416J73993l3844l15014Q9946j73472q576r1313J59550J38373
14033D027406l72043J50421k85781K87962k84688p1164K85302J08221k74522k52261
$$ y = [8457924, 8235159, 8135249, 8067544, 8012362, 7995166, 7428535, 7545073, 7626290, 7602928, 7257514, 6885692, 6839794, 7295124, 6960473, 7007036, 6920917, 7083970, 6699162, 6431059, 6216718, 6581675, 6417490, 6416371, 6284399, 6417865, 5728186, 6011586, 5889719, 5633691, 5819567, 5604636, 5571486, 5587619, 5602601, 5510624, 5133076, 5157828, 5535915, 5362560, 5217046, 5392058, 5270735, 5122370, 4875043, 4903706, 4681230, 4750356, 4709742, 4872920, 4471024, 4634450, 4243162, 4504114, 4520655, 4517980, 4420282, 4381041, 4353677, 4564301, 4204035, 4143179, 4087763, 4261756, 4227912, 3912898, 4002844, 3829372, 3820796, 3729483, 3889033, 4027406, 3655363, 3805784, 3520003, 3807965, 3523277, 3452113, 3737415, 3845636, 3571114, 3318853]
14023C318853M5972L4689j72756j0807J82336m4865l02306R0625n2274L23119
14013C412586j28492n8015k79677M8399N9288K2870K77022m40408J03670j49086
14003B868157K38048r0933k17147m4633J56233k07502J35598m35169J13861M12606
13993B929119n42965P9738J50161o5276J48643l46951o8510K18805K25430k42618
13983B485576M39962q226J72788k00127M15009K39305N32095Q34452J045260K011582
13973G967676L639685N453404P757731L207511o616322o512988m675264k201654
13965H019779k049292o66401n14593n74243O2182n68737j50966m52677N4617J90350
13955C350019n16298m4507j43087L45292k21051J11475n86576J44986J95513k31615
$$ y = [3318853, 3364825, 3399514, 3226758, 3215951, 3398287, 3353422, 3051116, 3141741, 3089467, 3412586, 3284094, 3226079, 2946402, 2994801, 3054089, 3076959, 3353981, 2913573, 3017243, 2868157, 3106205, 3015272, 2798125, 2753492, 2909725, 2702223, 2837821, 2402652, 2516513, 2929119, 2386154, 2465892, 2616053, 2550777, 2699420, 2352469, 2283959, 2502764, 2728194, 2485576, 2925538, 2917312, 3090100, 2889973, 3304982, 3544287, 4076382, 4910834, 5956094, 7967676, 11607361, 17060765, 24818496, 28026007, 21409685, 14896697, 10221433, 8019779, 5970487, 5304086, 4789493, 4215250, 4277432, 3708695, 3557729, 3105052, 3159669, 3350019, 2833721, 2789214, 2646127, 2991419, 2770368, 2881843, 2295267, 2440253, 2635766, 2404151]
13945B404151M39610p27240K1421k5309J49564l12087J89745K27893l13948k2278
13935B031522L18958k18973K81704m37010J40842P4386n21033N65933p5360k91311
13925A869658K21234p464Q158k16252k11085K50394l26686l0743M85756o0985
13915A981985k00706j30972J48378k77520L60271j33305J98714O7624m76759K15718
13905A753428n8844r3126K97768l70294l726K47067k20846K31899o45512N96879
13895A734693L2643j40130j339l9979k82333K04820N5403j10441K94746k91851
13885A456232j25364O8947k74437O36856k90996L39792n55090K79504j60960J21063
13875A495547k07683q7127J42226j16489J12638k02160L4788L13548O345j12863
$$ y = [2404151, 2843761, 2116521, 2137942, 2112633, 2262197, 1950110, 2139855, 2367748, 2053800, 2031522, 2350480, 2131507, 2413211, 1976201, 2117043, 2191429, 1670396, 2236329, 2160969, 1869658, 2090892, 2083428, 2091586, 1875334, 1664249, 1914643, 1587957, 1557214, 2042970, 1981985, 1781279, 1650307, 1798685, 1521165, 1881436, 1748131, 1946845, 2014469, 1537710, 1753428, 1694584, 1601458, 1899226, 1528932, 1525206, 1772273, 1551427, 1783326, 1137814, 1734693, 1767336, 1627206, 1625867, 1585888, 1303555, 1508375, 1563778, 1453337, 1748083, 1456232, 1330868, 1399815, 1125378, 1762234, 1471238, 1811030, 1255940, 1535444, 1374484, 1495547, 1287864, 1200737, 1342963, 1226474, 1339112, 1136952, 1171740, 1485288, 1491633, 1378770]
13865A378770J05893L9822j13750l11401K89974J3654j60803o5339R2558m7896
13855A221482Q571K63061l66190K38068M5937N9219n17319K32754r7767J91391
13845A279207j15036j08611K45070l38702K1460j4487N72968k27503k15720r6261
13835A002385P1774J80879p6361l39925N18294o02368N28901k57258r9827k20923
13825G05571J69663L81868j24864k2579m3534l53046N05825p9135l57309p819
13815G74641Q3269K54198j45105r5029J14692N432N3358l9722J53677m37129N75047
13804A297329l74602J2440J8878k29924L81502l61047M70734m35243j36498L44997
13794I88566j9805p330P1268j77154k1145J46050j86683J46185j86235M41876
$$ y = [1378770, 1484663, 1524485, 1410735, 1099334, 1389308, 1402962, 1242159, 1176820, 1269378, 1221482, 1230053, 1493114, 1126924, 1364992, 1410929, 1470148, 952829, 1185583, 1087816, 1279207, 1164171, 1055560, 1300630, 961928, 983388, 968901, 1541869, 1314366, 1098646, 1002385, 1074159, 1255038, 1178677, 838752, 1357046, 754678, 1283579, 1026321, 926494, 705571, 875234, 1257102, 1132238, 1109659, 1066125, 713079, 1218904, 1139769, 782460, 774641, 857910, 1112108, 967003, 871974, 986666, 992098, 1045456, 1005734, 1159411, 722282, 1297329, 922727, 935167, 954045, 724121, 1105623, 744576, 1215310, 780067, 643569, 988566, 968761, 961431, 1032699, 855545, 834400, 980450, 793767, 939952, 753717, 1195593]
13784A195593k26033k08161J11084k5640p2247j1219l6867j23338K81425j5091
13774H69506j73033Q2020K41788k8476P628k19068J17526k7739o3921K48814k48659
13763H06386j14297Q1030j21210K94964n5258l29254L85894r5896l3988Q0295
13753H98666k15702j97172J48810j58761K87526j06035k15661K3015M2073J60009
13743F66768K0476O3016j08067k070j07745L73596j01719j24710r0756r613L9903
13732F19079K37416j72760n307l8787n3852j9638j30269J9818J83544j13627M7343
13721E72960L6677p3906K56485k86735L62640m241M4373l98632J12807L7429m989
13710F54868J35190B58442K26899N129N3614k06250M70952j18651k76350L78909
$$ y = [1195593, 969560, 761399, 872483, 846843, 774596, 763377, 726510, 603172, 884597, 869506, 696473, 778493, 1020281, 991805, 999433, 780365, 897891, 870152, 806231, 1055045, 806386, 692089, 773119, 651909, 946873, 891615, 562361, 948255, 852359, 818371, 898666, 682964, 485792, 634602, 475841, 763367, 657332, 441671, 464686, 506759, 666768, 687244, 750260, 642193, 640123, 532378, 905974, 804255, 679545, 588789, 579176, 619079, 856495, 683735, 678428, 639641, 585789, 566151, 435882, 455700, 639244, 525617, 572960, 609637, 535731, 792216, 505481, 868121, 863880, 908253, 509621, 622428, 659857, 654868, 790058, 258442, 485341, 490470, 544084, 337834, 808786, 690135, 413785, 792694]
13700G92694j60142l07343j21413L61514J58278P9506k39576O0301n0584K2194
13690E95429k21730J92878K6984K6124R4389l47521L22989J73285D22579O6198
13680D88777J66890C26223L97663j01552j00061J96504j070j83507R257R3678
13670F37135J45356B82338L65874J63945j7024k46689j04439K23719k32368J28331
13660E63687Q0396o5378j19422n6874M80798l55987j19637K09247j28353n9734
13650D28743R8458p5493Q2104L36564l07248J8984q6400A14156N02450k91130
13640C25476M48331k97800j80242L22679j08825A86011J22477K67984A65141K57293
13630D22434p4265P6353D7344K13403K87980K2462J57209j25537A48690O7034
$$ y = [792694, 632552, 325209, 203796, 565310, 723588, 803094, 563518, 623819, 573235, 595429, 373699, 566577, 593561, 619685, 714074, 366553, 689542, 862827, 422579, 488777, 655667, 326223, 723886, 622334, 522273, 718777, 717707, 534200, 543457, 637135, 782491, 282338, 648212, 812157, 795133, 548444, 444005, 667724, 435356, 563687, 644083, 578705, 459283, 402409, 883207, 527220, 407583, 616830, 488477, 428743, 527201, 451708, 533812, 870376, 563128, 582112, 495712, 114156, 616606, 325476, 773807, 476007, 295765, 618444, 509619, 186011, 308488, 576472, 165141, 422434, 348169, 424522, 47344, 260747, 548727, 571189, 728398, 602861, 148690, 215724]
13620B15724N56715k13462J0438A83366L95831K04713B67382P1415n6572j1286
13610B70939N5611M52987C82338K36513k8432k69400J9800K06469J63933k20847
13600D90374q7686M1962J77341l08209k016K5598K47930p9431O815P8036A69652
13588D92405J57164B49187K14621q3686j26157M51870C01500K04761n4117J88661
13578F40805A27176P7108J8629K05788p2536K85298G4120J33281j6242J35381
13568C26540M16859k54806A11056L36086l1167Q0046B33386J37458j16261K91445
13558E46028q281B66925H4943K60156c0976E34139l3605I1797K27568p3162n4931
13547A91272m7037a62314C52381J82414A47945J71435O3664j31033k4149M09774
$$ y = [215724, 772439, 558977, 569415, 183366, 579197, 783910, 267382, 338797, 282225, 270939, 326550, 779537, 382338, 618851, 590419, 321019, 340819, 547288, 711221, 490374, 402688, 444650, 621991, 313782, 311766, 337364, 585294, 505863, 512678, 590714, 169652, 492405, 649569, 249187, 463808, 380122, 253965, 705835, 301500, 506261, 452144, 640805, 127176, 204284, 222913, 428701, 356165, 641463, 74120, 207401, 191159, 326540, 743399, 488593, 111056, 447142, 415975, 496021, 233386, 370844, 254583, 546028, 537747, 266925, 84943, 345099, -30976, 534139, 500534, 91797, 319365, 246203, 191272, 144235, -162314, 352381, 534795, 147945, 319380, 383044, 252011, 227862, 637636]
13537F37636B49034J72743n9061L4707L13797A47864K74539j64006J60027K6477
13527D44901j54511D664J43012L85392k2900n6178K69554l06300q6622o3812j15690
13516A51120K2371J47017J24576j00553A20542J325J96879Q808o2249J56997q2022
13505C40280A14892J43453o8698K57965e6648E91050c8533E7725K75942K26679
13495E60346A99334R7400K61993J14314l26984O8491D3113N26493k04097K1745
13485C87254J96642B83800J70809j52808G8236J01147J01064n3182O7429j27229
13475A67465K79387k20827A8193K99404j21857L92711B77824o1676K44851k15162
13465B45837k7139J70325J4208E5293N95974B72513J65466A4660O14216A56336
$$ y = [637636, 249034, 421777, 362716, 397423, 711220, 147864, 422403, 258397, 418424, 444901, 290390, 4664, 147676, 533068, 510168, 453990, 723544, 417244, 330622, 266810, 151120, 173491, 320508, 445084, 344531, 120542, 121867, 318746, 327554, 265305, 422302, 340280, 114892, 258345, 189647, 447612, -56648, 591050, -38533, 57725, 333667, 560346, 199334, 296734, 558727, 673041, 346057, 414548, 43113, 569606, 365509, 387254, 583896, 283800, 454609, 301801, 78236, 179383, 280447, 227265, 294694, 167465, 446852, 226025, 18193, 317597, 195740, 588451, 277824, 216148, 460999, 245837, 218698, 389023, 403231, 55293, 651267, 272513, 437979, 14660, 628876, 156336]
13454G5969L5446R1673M8502J000m5806K70531J15376j02240r1469j90526K26428
13443D34884H8243J00603I3238K00271K28749m9459A50915P7778K25101A40122
13432A19267P6083J43582N7682o8690J40197F2290J16787P4785J0093c3915i604
13420B67789j13968J9094g243E62683G2451B8338J86153p5430J23923n7601E7963
13408C50912e8372C14729E7987K19541l4702P6742J06917g0444A18193J07091
13398B25284M2325p7788K27279J01058k54840A20705K96485j65265a7703B49795
13387B19289Q2341I6243K24447o5182J67759j96040K76805B21996p7301F7855
13376D4064N2142A4832P49R5124Q3756r4282J15526B3300O5580J79613p0168M5425
$$ y = [75969, 111415, 203088, 251590, 252590, 206784, 477315, 592691, 490451, 398982, 208456, 434884, 88243, 188846, 93238, 293509, 522258, 472799, 150915, 228693, 453794, 140122, 119267, 195350, 338932, 396614, 327924, 468121, 62290, 179077, 253862, 263955, -33915, -9604, 267789, 153821, 172915, -7243, 562683, 72451, 28338, 214491, 139061, 262984, 205383, 57963, 350912, -58372, 314729, 57987, 277528, 242826, 319568, 426485, -70444, 118193, 225284, 267609, 189821, 417100, 518158, 263318, 120705, 417190, 251925, -17703, 249795, 219289, 301630, 96243, 320690, 255508, 423267, 227227, 504032, 221996, 144695, 67855, 44064, 96206, 14832, 15581, 110705, 194461, 100179, 215705, 23300, 88880, 268493, 198325, 243750]
13364B43750q2794L46285A15920M07277j87383A65925O1510k3467J84462A30726
13353F42854l05159M9939g0542B39339L6840J90825A70946G8184P4741J22693
13343B75618k143F1883K24188J14362a35010C72087A35723M2604e6841E00402
13332D68646M0483q6521k00993J31187J1998j62569I5320M37878K83914C55764
13321C14978h1761L1596D27140r1615A0203K61009N9449k6486l3274F1259P3085
13310A34344K17144E7065J35757K29431j05966B2035K34642M1248A01913e5197
13299D86892A01996J72315J74037k02113Q7085f8394C94663j79176J66736E8417
13288a80294A28261a17332B07999L98586A57604p3929L15388a41095A30640J41042
$$ y = [243750, 160956, 507241, 115920, 523197, 335814, 165925, 227435, 203968, 388430, 130726, 642854, 337695, 387634, -70542, 239339, 276179, 467004, 170946, 78184, 152925, 275618, 273475, 61883, 286071, 400433, -135010, 372087, 135723, 178327, -56841, 500402, 468646, 509129, 422608, 221615, 352802, 364800, 202231, 95320, 533198, 817112, 355764, 314978, -81761, -50165, 427140, 335525, 10203, 271212, 330661, 304175, 270901, 61259, 134344, 351488, 57065, 192822, 422253, 316287, 22035, 256677, 297925, 101913, -55197, 486892, 101996, 274311, 448348, 246235, 333320, -68394, 394663, 215487, 382223, 58417, -180294, 128261, -117332, 207999, 606585, 157604, 83675, 399063, -141095, 130640, 271682]
13278B71682M9765B1597J98222K786n4691L0568a14121F4524d4822F9438K320
13267G1758J36585M8618L09069p4546a33666A11754d311C85995A19972h6325A532
13255A40683d3474A31670a19482B94216b47273b1413B82222j0230E830Q6763J08049
13244B00642o7583M8408J3866j3544L39066A93369F209J7708L71284c7889A48665
13232a3054G4353M93a19189L527k11784C40233e2492l7643B18844G49K34795I2641
13219A05011J8477M5262a32340n8204e9604B07360j02235L78049A13540E6651
13208B49687Q1897g6047E6668K18285K14104A02469k7603g2412B23648O2599A3545
13196b9021G9291L67560D3292J30237b90366A97497n1792q475M3809L9378k9613
$$ y = [271682, 321447, 21597, 219819, 222605, 167914, 198482, -114121, 64524, -44822, 69438, 71758, 208343, 256961, 566030, 491484, -133666, 111754, -4311, 385995, 119972, -86325, 1532, 140683, -43474, 131670, -119482, 294216, -247273, -21413, 282222, 271992, 5830, 92593, 200642, 133059, 181467, 195333, 181789, 520855, 193369, 6209, 23917, 395201, -37889, 148665, -13054, 74353, 74846, -119189, -115662, -327446, 340233, -52492, -90135, 218844, 749, 235544, 92641, 105011, 123488, 168750, -132340, -190544, -59604, 207360, 105125, 483174, 113540, 56651, 249687, 331584, -76047, 56668, 274953, 489057, 102469, 74866, -72412, 223648, 286247, 13545, -29021, 79291, 446851, 43292, 173529, -290366, 197497, 145705, 137230, 181039, 220417, 190804]
13185A90804J05475O4087J18864b77308A29721N7183q824G0595K08469a04435
13174D6144j4369N9455d405B92517b11623E2718K80836D2548J86205p6809j8004
13163A33940M2815K19490I2079Q2678c5088B22991B762K674J78420c079r308j18031
13151a30418A59116L20912A78273J73026B9500J86593c122I5276J99806B4753
13140C52085a2581A7535K92184A5707L9566K20623H0430c7096B27428A05912f817
13128A44810k9786J00583C7182j5436P36795c4804B5849J37575C5434J44287b2086
13116A55218L0276J33844A508N0919J16264q4307L2939k223J08250G7344J74414
13105B51758b33957C79693j47111d347H9473k2116Q453a82928B7746g0274A64405
$$ y = [190804, 296279, 360366, 479230, -277308, 129721, 186904, 178080, 70595, 279064, -104435, 46144, 31775, 91230, -4405, 292517, -211623, 52718, 333554, 42548, 228753, 151944, 133940, 176755, 396245, 92079, 174757, -35088, 222991, 2762, 5436, 183856, -3079, -12387, -130418, 159116, 480028, 178273, 351299, 29500, 216093, -3122, 95276, 295082, 24753, 352085, -12581, 17535, 309719, 15707, 55273, 275896, 80430, -37096, 227428, 105912, -6817, 144810, 115024, 215607, 37182, 21746, 758541, -34804, 25849, 163424, 35434, 179721, -22086, 155218, 185494, 319338, 1508, 52427, 168691, 84384, 117323, 115100, 223350, 77344, 251758, -233957, 379693, 232582, -4347, 89473, 67357, 75810, -182928, 27746, -70274, 164405]
13093A86332c57882C35393K4469A01877K16626g6220O263A43135O5282b44941
13082A4123J05131a3027B96831C0355J49952c354q4856A45647j9712n3060a79395
13070E702R6724J9855J14452B6698b3977D7838f9116A35966n3585L28428B04844
13058b19890A77018G6622a70340h821k795A1179a0208B6783K29097r7222J5814
13047A74472J32228n8518o6359J40393H1921Q9949b22365j23967B03662F241K46216
13036B52457J28562I6420Q4136k8873m9876f0332A4099R414J19763e3423H1987
13024a78039E3252d4419C00294j31549K16149d0561A51784f3669k5169H963K75290
13013B84253c08655A68116f6173L738B34725j05422g1037a75C37941N6316j89126
$$ y = [186332, -357882, 335393, 359862, 101877, 318503, -76220, -69957, 143135, 208417, -244941, 14123, 119254, -13027, 296831, 30355, 180307, -3354, -88210, 145647, 125935, 72875, -179395, 5702, 102426, 122281, 236733, 26698, -23977, 47838, -69116, 135966, 82381, 410809, 204844, -219890, 177018, 76622, -170340, -8821, -11616, 11179, -10208, 26783, 255880, 158658, 174472, 306700, 248182, 181823, 322216, 81921, 171870, -222365, -346332, 203662, 6241, 252457, 381019, 96420, 180556, 151683, 101807, -60332, 14099, 23513, 143276, -53423, 81987, -178039, 53252, -44419, 300294, 168745, 384894, -40561, 151784, -63669, -88838, 8963, 284253, -308655, 168116, -66173, -62435, 234725, 129303, -71037, -175, 337941, 394257, 205131]
13002B05131h8508k4011l6755k17050B7373J3379K61985n4607j1167A15612J88905
12991C04517D2771b55702A67713p4601J73510O6492f4387H7262k8546d0330B46322
12979E7721K05844g9864n4930D2364L05918a39550A62308f9965J4795j29464A64254
12967C9476g614K171k16934D81291G9017a99711A69722b15234h7909A8732L17114
12956C35846a47759A28446D8300c3375j31843c4687C97618d3160B49327f0396
12945C34347c96104A99018b4194A74420a2553j32166K1983N3071k34820A29342
12934a06044d4079H0406J07895a03978M9398G1049L00030H6287G478f9816A19443
12922A67466J62386G1991c6504B78556a31084j07410A55654J99296K5160e9436
$$ y = [205131, -88508, -112519, -149274, -366324, 27373, 40752, 302737, 248130, 236963, 115612, 304517, 42771, -255702, 167713, 93112, 266622, 333114, -64387, 87262, 58716, -40330, 246322, 57721, 263565, -79864, -134794, 42364, 348282, -139550, 162308, -69965, -55170, -184634, 164254, 39476, -7614, -5443, -222377, 481291, 79017, -199711, 169722, -215234, -87909, 18732, 335846, -147759, 128446, 48300, -33375, -165218, -34687, 397618, -43160, 249327, -60396, 334347, -396104, 199018, -24194, 174420, -12553, -144719, -122736, -69665, -304485, 129342, -106044, -44079, 80406, 188301, -103978, -54580, 71049, 371079, 86287, 7478, -69816, 119443, 167466, 329852, 71991, -36504, 278556, -131084, -238494, 155654, 354950, 380110, -59436]
12911A42798a7185B14268J85468G9597a69730A37490C022K25951J50937b13988
12900B03892a52644N9135M1365k2953B9490b5834C18681A43546h5837b4872F063
12888C16274j38453B4005K40796a45552m2208I720N8330J8416d80874a28894A612
12876B97347a10647k1099A7699e2043k4758C64M82583h0702B29744P4537C3454
12864F7233R6909J1996l251k2063K5379q290Q147f6671A62883b18949g362j60231
12852a67593k9395B00875J5644d7987k3674E7398N4061b79357C00533H3638b60393
12840G5684N0833c70124A81298e5991j396B292J29315D8321d5404A67074r251
12829A57823i5088B99714b78967F5298N0361e3157J9454F4150J43503n7324L47191
$$ y = [142798, -17185, 214268, 399736, 79597, -169730, 137490, 3022, 228973, 379910, -213988, 203892, -152644, -93509, -52144, -75097, 29490, -25834, 318681, 143546, -85837, -24872, 6063, 316274, 177821, 24005, 264801, -145552, -187760, 9720, 68050, 86466, -480874, -128894, 1612, 297347, -110647, -131746, 17699, -52043, -76801, 364, 482947, -80702, 229744, 304281, 33454, 67233, 164142, 176138, 172887, 150824, 176203, 167913, 176060, -66671, 162883, -218949, -7362, -167593, -196988, 200875, 216519, -47987, -71661, 57398, 111459, -279357, 300533, 83638, -260393, 75684, 126517, -370124, 181298, -55991, -57387, 2292, 131607, 48321, -45404, 167074, 157823, -95088, 299714, -278967, 65298, 115659, -53157, -33703, 64150, 207653, 150329, 497520]
12818D97520A38953J86223A39575F8451b5254C40995D1614d2287A55570a25582
12807B58455a04630B2780a03934C076L1245J39599b89805e8156F7440l611J83698
12796B47527e2275C63084B6561a54004f5408A99630b17824A41593b2406A79649
12785I5469m33b8228l2745f223m4933A72931E0086j8353J2911J69248b48295A03590
12772c5353B05239o3258b9488B19716a01104c0408j90377H7561a06584D40421
12761e3791k27465G549h4397j72914h1390A54058K24099j18356h8134m0012l5142
12750a63288A15493c0097A45683b5657j29271c1943k8011m2044j2565H2983e3237
12738G8787R0766a74117J2398j20020I7881K3976C5191K95196E2054g2393K4347
$$ y = [497520, 138953, 325176, 139575, 68451, -25254, 340995, 41614, -42287, 155570, -125582, 258455, -104630, 22780, -103934, 3076, 34321, 173920, -289805, -58156, 67440, 63829, 247527, -52275, 363084, 26561, -154004, -65408, 199630, -217824, 141593, -22406, 179649, 95469, 95036, -28228, -60973, -6223, -51156, 172931, 50086, 31733, 44644, 213892, -248295, 103590, -35353, 205239, 141981, -29488, 219716, -101104, -30408, -220785, 87561, -106584, 440421, -53791, -281256, 7549, -84397, -257311, -81390, 154058, 378157, 259801, -88134, -128146, -163288, 115493, -30097, 145683, -25657, -154928, -31943, -59954, -101998, -114563, 82983, -53237, 78787, 169553, -174117, -161719, -281739, 97881, 121857, 35191, 330387, 52054, -72393, -48046]
12727d8046J7390B54704a17805C51119b02391H758M16605a54402G0235a08640
12716I6085k8230J41924k9690a43358A52715L482e2439J5497A96369C1468N5516
12705H6984c1108j11022A31093m1097m594g2985A43619a86942g5055n6053O2618
12694f8490A3908e7523B60759b26168D75245i956I6634J96568G1215b4793B03321
12682i4985m3225B91398a4921A51856E5697N2552J35171k2948j7328E7218N644
12671F2862A5751J8384J29798G306c00986a37089k4025A38784f8950p2729H3294
12659b54j79236A04385J7031b3337E2383e3781B76443j3244c0641C13949c3954
12647F7788Q9341e255A78469d8870F9289L5134l8923J10960p1697n2109b04419
$$ y = [-48046, -30656, 254704, -117805, 351119, -202391, 8758, 425363, -154402, 70235, -108640, 96085, 67855, 209779, 180089, -143358, 152715, 156197, -52439, -36942, 196369, 31468, 86984, -31108, -142130, 131093, 89996, 85402, -72985, 143619, -186942, -75055, -131108, -68490, 13908, -57523, 260759, -226168, 475245, -9956, 96634, 293202, 71215, -24793, 203321, -94985, -138210, 291398, -14921, 151856, 55697, 108249, 243420, 220472, 203144, 57218, 62862, 15751, 34135, 163933, 7306, -300986, -137089, -161114, 138784, -68950, -141679, 83294, -254, -179490, 104385, 121416, -23337, 52383, -53781, 276443, 263199, -30641, 313949, -33954, 67788, 157129, -5255, 178469, -48870, 69289, 104423, 65500, 176460, 104763, 52654, -204419]
12635F566Q6754K75908H1108a17018a8237E3712p519a53228j7849e16A99629G2671
12622B72493O6155r1299A21223b56934a16822r2009c9467A79882d9640D49746
12611D46236A30660J05717K09010k10904j1815H8507J55049H503L72553C1610
12600A27545D6533L4825K03425E2406a44499f8214A59255A4681R1457Q4850g8435
12588a25199E0431a89345f3263D74575B18142c5188E3460a67155Q1246B74918
12577e8192j2649n6962d8757B24883L23110D7275g2639j54310d2995k37322A78435
12565B66806b49637B77207c6517E3319j6167O9329i9357p6167j6798B74802j03391
12554A71411J6011b31721c6143D04460E7036g3440B22404d3348F2569k50L4162
$$ y = [6566, 93320, 369228, 81108, -117018, -18237, 53712, 46193, -153228, -171077, -516, 199629, 72671, 272493, 338648, 247349, 121223, -256934, -116822, -208831, -39467, 179882, -49640, 449746, 446236, 130660, 236377, 445387, 234483, 222668, 88507, 243556, 8503, 381056, 31610, 127545, 46533, 81358, 284783, 52406, -144499, -68214, 159255, 14681, 106138, 190988, -78435, -125199, 50431, -189345, -63263, 474575, 218142, -35188, 53460, -167155, -85909, 274918, -58192, -70841, -127803, -48757, 224883, 547993, 47275, -72639, -226949, -42995, -280317, 178435, 266806, -249637, 277207, -36517, 53319, 37152, 106481, -99357, -175524, -192322, 274802, 171411, 187422, -231721, -36143, 404460, 57036, -73440, 222404, -43348, 62569, 62319, 96481]
12543I6481a49237B43386f9183k03045f309r9824P946M4144q0679B15243E6732
12531I0863b33779J4194f1792K9634j39564e0063k2725r2452A23686b40059R2220
12520a47839e9032B4991L1991c11694F0646g2443C7998K41362b15664n4240e4786
12508H9519D564J79289a2599E527M4994J4873J6380R6573c29813a33674B07250
12496A4116b34865F6749a53513O841I9895a51090J3123c0224l07819J60137n8388
12485b36294A60171f9791b3019j62749n5696A18700l6150k2315a4729q481k14853
12474b38063B21609J4529G8300n584K91477C1924K55786A20173C3996O3732a50624
12462a77215A53828f1974q8498a46o2879A07790J71497A1994J72420m0277J83354
$$ y = [96481, -149237, 243386, -69183, -272228, -6309, -106133, -98187, -54043, -134722, 215243, 56732, 90863, -233779, -219585, -61792, -32158, -171722, -50063, -72788, -165240, 123686, -240059, -147839, -59032, 24991, 56982, -311694, 60646, -72443, 37998, 279360, -215664, -269904, -54786, 89519, 4564, 183853, -12599, 5527, 50521, 65394, 81774, 178347, -329813, -133674, 207250, 14116, -234865, 66749, -153513, -146672, 99895, -151090, -137967, -30224, -338043, -177906, -236294, 160171, -69791, -23019, -185768, -241464, 118700, 82550, 60235, -14729, -23210, -238063, 221609, 236138, 78300, 72716, 364193, 31924, 287710, 120173, 33996, 97728, -150624, -177215, 153828, -61974, -150472, -146, -63025, 107790, 279287, 11994, 184414, 144137, 327491]
12451C27491G2202h3696B09504p0332l3980A8223b29939P0603B13971q3121b560
12439a83724d1185I2055a22847e1231A03270b56803C18377c4415B4715c43895
12428C67115b06859B33294B2431c3772C61514f4349D94J70491M8547C1039K28938
12417B59977A4417e4299B8998a5736F4020i6024j40328A68436E8211N5566a38728
12405b5375B6178f8401j673n2225l4185K0929F0350a61928f3701k25729E4071
12393I9751b9414l6712F0282J0804J1115c18736r2861B09568a55220P5605K8559
12382e1056q0820B4907a41764H2627h4160j40914F5622K4379b03514A28843N3026
12371A81869k0127a21457j47994D8295o720K24433a83895I2074L5476a22915A26360
$$ y = [327491, 72202, -83696, 209504, 139172, 105192, 18223, -229939, -159336, 213971, 130850, -2560, -183724, -41185, 92055, -122847, -51231, 103270, -256803, 318377, -34415, 24715, -343895, 367115, -206859, 233294, 22431, -33772, 361514, -64349, 494, 170985, 219532, 31039, 259977, 14417, -54299, 28998, -15736, 64020, -96024, -236352, 168436, 58211, 113777, -138728, -25375, 26178, -68401, -70074, -122299, -156484, -135555, 60350, -161928, -63701, -289430, 54071, 99751, -29414, -66126, 60282, 71086, 82201, -318736, -411597, 209568, -155220, -79615, -51056, -131876, 24907, -141764, 82627, -84160, -225074, 65622, 90001, -203514, 128843, 181869, 161742, -121457, -269451, 48295, 41575, 266008, -183895, 92074, 127550, -122915, 126360]
12359B71189E7691K18809A03052j6825a37552b8093o7613A99071d7825C78890
12348a53046A01408j5517f2135k3026C1292a97795f3427j4970J7688k57710C24751
12336a36761k11130A49648h0443E9408b71084B26703b00709d444D00295A37041
12325b48652O1490I96K24436n9563o2420C1896a07001A74067m8207g6411q0680
12314a57091a8275r566j61354Q747C2880a64583j57121A20230a4982I0876J75575
12303B66451l1646E3132N594f0445A82424M24476b36843a01959G8671a35835G1399
12291I5768L77060b26675a9651j65357j30106f9954b0715C324P8126b81451B32459
12279B68679p7656H7093i3263B28113G5956c57392O9549J27070g4034B29977j1528
$$ y = [271189, 57691, 276500, 103052, 86227, -137552, -28093, -95706, 199071, -47825, 378890, -153046, 101408, 85891, -62135, -85161, 31292, -197795, -63427, -78397, -60709, -318419, 324751, -136761, -347891, 149648, -80443, 59408, -271084, 226703, -200709, -4444, 400295, 137041, -248652, -187162, 996, 225432, 165869, 103449, 31896, -107001, 174067, 125860, -76411, -157091, -18275, -27841, -189195, -180448, 32880, -164583, -321704, 120230, -14982, 90876, 266451, 234805, 53132, 58726, -60445, 182424, 606900, -236843, -101959, 78671, -135835, 71399, 95768, 472828, -226675, -19651, -185008, -315114, -69954, -20715, 3324, 81450, -281451, 232459, 268679, 191023, 87093, -93263, 228113, 75956, -357392, -287843, -160773, -74034, 229977, 218449]
12268B18449J76240A01731M7096F5824b3599C10608a49002C431b21988A59853
12257A34840g6799C80899a48460M1771A62302a96367G0886O7725a77485D47377
12246B3271M1598n866M437a970G8799C6128b50439E7757J09977b52957A79330
12234A88381A9443a45083D82408A100J58219C2719a47334A44995J4478b17811
12223B86383F1021A9968J20688d1387C53158G6967a52092b0376G0117a7039L84
12212a6655B8951M5987L42203A35090J46746r2115j9768c1460A91121b5576G9001
12200B18647J78409A41720C014b3941B84544n718O4171c15609f0503A05049r312
12189I5737J13145C7953J00603e6193B43563G9816O7544N9416M7G9412L4788K47535
$$ y = [218449, 394689, 101731, 148827, 65824, -23599, 310608, -149002, 3431, -221988, 159853, 134840, -76799, 380899, -148460, -106689, 162302, -196367, 70886, 138611, -177485, 447377, 23271, 64869, 59003, 63440, -1970, 78799, 36128, -250439, 57757, 167734, -252957, 179330, 188381, 19443, -145083, 482408, 1100, 159319, 32719, -147334, 144995, 159473, -217811, 286383, 61021, 19968, 140656, -41387, 353158, 76967, -152092, -20376, 70117, -17039, -16655, 28951, 74938, 417141, 135090, 281836, 189721, 169953, -31460, 191121, -25576, 79001, 218647, 397056, 141720, 3014, -23941, 284544, 278826, 342997, -315609, -60503, 105049, 95737, 208882, 37953, 138556, -56193, 243563, 79816, 147360, 206776, 206823, 79412, 114200, 361735]
12177C61735A26005a49198C4944J5436K22885a32714H9867C1007a0754B81968
12166A15507J63576a38789D1012K08051j8621a77968H5542K9531D2350J19207
12156A61557M5181D217J91992r288a58882B47202q1426n3568B2487L3407J05880
12145A61774K55522b0244A52165d0180B31961a04692C01616c3252C2718P351J4765
12134E4834D761a07473m2081c5753a235j21669B80242a0191J284j0103l5582l10688
12122c65280E6249a79190A41969m0177i7355C81342a6555E2516K9264a55722A90876
12110A51519h3962b6037A04514J9207g6196p6418G6748b48029A11785A7976N2989
12099G0965K48064j03516C0499d1143A83640d312j95022P8365C27090e8620k3039
$$ y = [361735, 126005, -149198, 34944, 50380, 273265, -132714, 89867, 31007, -10754, 281968, 115507, 279083, -138789, 41012, 249063, 230442, -177968, 85542, 115073, 42350, 161557, 206738, 4217, 196209, 186921, -158882, 247202, 165776, 112208, 22487, 55894, 161774, 417296, -20244, 152165, -40180, 231961, -104692, 301616, -33252, 32718, 40069, 54834, 4761, -107473, -149554, -35753, -1235, -122904, 280242, -10191, -8907, -19010, -54592, -365280, 56249, -179190, 141969, 101792, -97355, 381342, -16555, 52516, 81780, -155722, 190876, 151519, -83962, -26037, 104514, 123721, -76196, -152614, 76748, -248029, 111785, 17976, 70965, 319029, 215513, 30499, -41143, 183640, -4312, -199334, -120969, 327090, -58620, -81659]
12088h1659j45579a8705A36662a29487G1235b6801C1044a73522G1044b75319N7002
12077b18317D63360h5301q3497A53875a23337I5587M3593d5811A57733b14861
12066A88869a28446A63699J21884a802j70255j91192C4386N8845J7299A9283b4115
12054A11218Q3809G645R8195M91516L58840k52079C14159l8232j20194a6244C19195
12042C23409I568R0692J17115a48970B36991H5842K1859i2721E1310a65136k4760
12031a89896k2281M3060K7986j76349i6686k1551E3296h7685o9989b1605A0595
12019H4098k9438O1425l2332f5811G1774B486N0374a31040k47653H0915Q4900
12008A65815d3672D3685b03630A3179J56502K4163c36689A70639g7196B1935g9549
$$ y = [-81659, -227238, -18705, 136662, -129487, 71235, -26801, 31044, -173522, 71044, -275319, -218317, 463360, -85301, -168798, 153875, -123337, 95587, 139180, -45811, 157733, -214861, 188869, -128446, 163699, 285583, -1802, -172057, -363249, 34386, 93231, 110530, 19283, -24115, 111218, 195027, 7645, 105840, 597356, 956196, 704117, 314159, 275927, 155733, -16244, 319195, 323409, 9568, 100260, 217375, -148970, 236991, 85842, 107701, -92721, 51310, -165136, -189896, -212177, -169117, -141131, -317480, -96686, -118237, 53296, -87685, -157674, -21605, 10595, 84098, 54660, 116085, 83753, -65811, 71774, 2486, 52860, -131040, -378693, 80915, 165815, -43672, 43685, -203630, 13179, 169681, 193844, -336689, 170639, -77196, 21935, -79549]
11996F25016a21147r8980p5148J05336d3199D29367B666a9978l66533F2997P4468
11985A37465a51049j22212D11618g1491n012K6838j21114A39829g3016j53787
11975b26803A22385d10867A6646b46091A17089c8652A94016a99344L3334I4996
11964c8901A11259b64137A65548b56001o5534D16630A09489b2426j16545E6199
11953B87289A35014b3806A19507a0820A71383c57213I361J41537i7375A94625
11942A32406f78k8340A13898a1389r7914k41702A33403a13342A06853e1624e698
11930D2854f7865j93288D8037n791b26929a9084j29437p2961A4790a4881B77283
11918b27100M4771i370m8259J9691D1782a77631f9819j11900M2354a2388A21215
$$ y = [625016, -121147, -220127, -295275, -189939, -43199, 429367, 2666, -19978, -386511, 62997, 137465, -151049, -273261, 411618, -71491, -76503, -49665, -170779, 139829, -73016, -226803, 122385, -410867, 16646, -246091, 117089, -38652, 194016, -199344, -166010, 94996, -38901, 111259, -264137, 165548, -256001, -321535, 416630, 109489, -22426, -138971, 56199, 287289, 135014, -23806, 119507, -10820, 171383, -357213, 9361, 150898, -97375, 194625, 132406, -678, -29018, 113898, -11389, -109303, -351005, 133403, -113342, 106853, -51624, -5698, 42854, -67865, -261153, 48037, 42246, -226929, -19084, -148521, -221482, 14790, -14881, 277283, -227100, -182329, -9370, -57629, -37938, 41782, -177631, -69819, -181719, -139365, -12388, 121215]
11906b3832j08834c9189n200C7695d43711A47958a30881e9145q8346j25881m8176
11895c21548E3082Q1924K51134e10153a15032B32679a08749k33785J27041M9198
11885a66295r3804h8570L8583k16791a8431k30386B90190A03165J86828I3316
11874c453B9770H816K09720g8920j01048F7605b28972N7341f657j59685H6235
11862a04781d3103j51096A02922M0844c82r3786C21041C0675J4994J02680a36991
11850b51360c3028C495L71732A07482k1775h4081p1487F4520a23286D9238R6830
11839A46068O6438J42986b68738M3889i3468j52727B97735c83589I4401b22250
11828A1388Q7853A5582K18007a9811j55228A88392i3873B73158c6148k2778j86745
$$ y = [-23832, -132666, -39189, -44389, 37695, -443711, 147958, -130881, -59145, -147491, -273372, -321548, 53082, 135006, 386140, -510153, -115032, 232679, -108749, -342534, -215493, -166295, -260099, -88570, -49987, -266778, -18431, -248817, 290190, 103165, 289993, 93316, -3453, 29770, 8816, 218536, -78920, -179968, 67605, -228972, -171631, -6657, -166342, 86235, -104781, -43103, -194199, 102922, 143766, -382, -94168, 321041, 30675, 45669, 148349, -136991, -251360, -33028, 3495, 375227, 107482, 85707, -84081, -155568, 64520, -123286, 49238, 146068, 212506, 355492, -268738, -224849, -93468, -246195, 297735, -383589, 94401, -222250, 11388, 99241, 15582, 233589, -19811, -175039, 188392, -93873, 273158, -36148, -58926, -245671]
11817b45671a6515k52805A49905a90683m4180Q9777C7043a34768N7787A22545
11806B74390a95448N0047j2838N768k926b7797P797A93294H2916b68551B45649
11794e9555A01801L9169A4651a12719m331R599l01699E4713I01a06067G8604L3392
11782A11996a07154A13313e8108A36051k2870L46544A07726M7153j1144b85095
11771A35827i7241L0425C4587a16849B14613m1938q2839d9342A27360b07658F3689
11759c26227O3352a12305A74417E9667a94488M47j0375G7565c1408A35440M2563
11748A78003D9951K33911h7586A72166k4115a97722A91196g5751J5259l59615
11738d20107B59273a24823B0374b04480C8834R3385a11204A55805e6072a0953
$$ y = [-245671, -16515, -269320, 149905, -190683, -234863, -145086, 37043, -134768, -76981, 122545, 274390, -195448, -145401, -158239, -152471, -155397, -27797, -20000, 193294, 82916, -268551, 245649, -59555, 101801, 140970, 14651, -112719, -117050, -107451, -409150, 54713, 901, -106067, 78604, 111996, -107154, 113313, -58108, 136051, 113181, 459725, 107726, 154879, 143735, -285095, 135827, -97241, -66816, 34587, -116849, 214613, 172675, 89836, -49342, 127360, -207658, 63689, -326227, -262875, -112305, 174417, 59667, -194488, -194041, -204416, 77565, -31408, 135440, 178003, 49951, 283862, -87586, 172166, 148051, -197722, 191196, -75751, -60492, -420107, 259273, -124823, 20374, -204480, 38834, 132219, -111204, 155805, -56072, -10953]
11727d69990B3346d6794k51934D07446A50678a75489A54834m2611a38150G4673
11716f0465E8346a55702H7984a05755C75091c4576F4162b33341L8790A20650a38917
11704A17527a3655b914I5444P2217a98917B4368c18136f8327E9185R9666K9410
11693A88261D4567f519D15J63631K5863K2394E2028M8384d383q3100A57704d3068
11680d5200H1836a7788k2465D6424c1873I2230j7294J54193R3517a5796l90052
11669d05848B56993i6706d1424B45220m3607K26766A99753F0319k127b74884A81977
11657A26541c9724A21432M6891a29426f467A7769b5505G991c21361C9932a85820
11645G936a29676N3289F3960k3389P3171O1859i7820M0106k2566q1181A43551
$$ y = [-469990, 23346, -46794, -298728, 407446, 150678, -175489, 154834, 112223, -138150, 74673, -60465, 58346, -155702, 87984, -105755, 375091, -34576, 64162, -233341, -194551, 120650, -138917, 117527, -13655, -2914, 95444, 167661, -198917, 24368, -318136, -68327, 59185, 158851, 188261, 44567, -6519, 415, 164046, 189909, 212303, 52028, 100412, -4383, -87483, 157704, -43068, -45200, 81836, -17788, -40253, 46424, -31873, 92230, 74936, 229129, 322646, -15796, -405848, 256993, -96706, -41424, 245220, 201613, 428379, 199753, 60319, 58192, -274884, 181977, 126541, -39724, 121432, 168323, -129426, -6467, 17769, -25505, 7991, -321361, 39932, -185820, 7936, -129676, -76387, 63960, 40571, 113742, 175601, -97820, -57714, -80280, -161461, 143551]
11633a12442E0958K27287C146O0546c07533D9448f7574A4045J63025b2837j47400
11622a70237P4422D8245N7467a11107c3583j87719B80958A28071o1812r811b15553
11610h5760j36092j08417e4942J1965k13506C4523J85255a3765j68588B86793
11599B39549B4021L05639A55218a04883A62108o1673I897K03029A8532i2219L7401
11588e4818j23112D7124J08068J23984j11320f1208E1647b19340A32418a39410
11577A8873d9293D4664i4198I5620j2820J8992K34492e929B7564a25467F5419
11565b11277b5751k21668C40656c1683J4032F0446J01166D8047d7930J3965j80752
11554b14717e5583J7959k40230c0260l25262B4489N0626c32869D6674a11957C75507
$$ y = [-112442, 50958, 278245, 3146, 63692, -307533, 49448, -67574, 14045, 177070, -22837, -170237, -95815, 48245, 105712, -111107, -33583, -221302, 280958, 128071, 66259, 56448, -215553, -85760, -221852, -330269, -54942, -42977, -256483, 34523, 219778, -13765, -182353, 286793, 239549, 24021, 329660, 155218, -104883, 162108, 100435, 9897, 212926, 18532, -92219, -54818, -177930, 47124, 155192, 279176, 167856, -61208, 51647, -219340, 132418, -139410, 18873, -49293, 44664, -94198, 95620, 82800, 101792, 336284, -5929, 27564, -125467, 65419, -211277, -25751, -247419, 340656, -31683, -17651, 60446, 161612, 48047, -47930, -33965, -214717, -55583, -37624, -277854, -30260, -355522, 24489, 75115, -332869, 46674, -111957, 375507]
11542G3203J9156Q6597n1957d10144G3336J47506a86280P1672A51652q98a7114
11530b6341C83899b88326B38366R498a94310j3153B97739d6457D1025K5496J85670
11519B52191j10963p0292K51856F6830Q9456m1198g3335a2410j25251A71008a34557
11507C62366C45M54748e883A73858A7043K24638a67720H0315d20574A06116a13405
11495a38129B36118a5130C9670a59022D4139f7276B71651G2875J04725i3192A42280
11483b5874B96758I0197d0023C88068E7043N3914J50984i4863A32625M7628M045
11472A84298L898a04984A74316j8279L3304E9227M9981L64669f6315D4387k0059
11461B4328d0232A71115n6586k6841J84893a445A54299B7421a92907A95044g5387
$$ y = [73203, 92359, 178956, 126999, -410144, 73336, 220842, -186280, -114608, 151652, 150754, -17114, -26341, 383899, -288326, 238366, 247864, -194310, -207463, 297739, -46457, 41025, 66521, 252191, 141228, 70936, 322792, 66830, 156286, 115088, -73335, -12410, -137661, 171008, -134557, 362366, 345, 455093, -5883, 173858, 17043, 241681, -167720, 80315, -420574, 106116, -113405, -138129, 236118, -15130, 39670, -159022, 44139, -67276, 271651, 72875, 177600, -93192, 142280, -25874, 296758, 90197, -40023, 388068, 57043, 110957, 261941, -94863, 132625, 180253, 184298, 188196, -104984, 174316, 156037, 189341, 59227, 109208, 473877, -66315, 44387, 24328, -40232, 171115, 114529, 87688, 272581, -1445, 154299, 27421, -192907, 195044, -75387]
11449B32749D1952J42862G3870e2906k0697C51710d7738m6221A55329B2541a9466
11437C9543e2354C05583A39607j8194a8996C30390a13812A93651G2002J0182R9501
11426A81685J15268A17091a43486A17094a17384e997G803a61069D33507a15310
11415I5680D010J15648D7498c81493A19166g2442B4630K06019G3852a33412B17868
11403C1344Q6976C5700a05226p0936B75339b68354D2769f6367l0928A66334d7887
11391A81385a02644B9826b11983A88207f6228D6407F743a90088j47182D6764c1490
11379B27638p1856a14511j3905b2769P146A35215a9351j17789M716F2897A8114
11367C45994A20259k8626o394h0516l07769a28263n5106m7275Q3332A2138a62857
$$ y = [232749, 41952, 184814, 73870, -52906, -73603, 351710, -47738, -93959, 155329, 22541, -19466, 39543, -52354, 305583, 139607, 121413, -18996, 330390, -113812, 193651, 72002, 82184, 181685, 296953, 117091, -143486, 117094, -117384, -5997, 7803, -161069, 433507, -115310, 95680, 4010, 119658, 47498, -381493, 119166, -72442, 24630, 230649, 73852, -133412, 217868, 31344, 118320, 35700, -105226, -176162, 275339, -268354, 42769, -66367, -97295, 166334, -47887, 181385, -102644, 29826, -211983, 188207, -66228, 46407, 6743, -190088, -337270, 46764, -31490, 227638, 155782, -114511, -128416, -22769, -15623, 135215, -19351, -137140, -132424, 62897, 18114, 345994, 120259, 91633, 85239, -80516, -388285, -128263, -183369, -230644, -147312, 12138, -162857]
11355H8119N0101E391K15902f2216j52461B7695K03742a59737l4482Q2317l5535
11344a47437k8728k4693Q7166D9954K33338g7743k07311A36743J97904a73055
11333f90C99199a38014j06154d019A99942c2162H9454J35875b28461i7496A39698
11321A72280a68164g0670j69549N3529l5900c1512B3881a52169A78113b4681E5936
11309A01447d21r8312a031C90816h0792l12962A93448I6477f3310c367C5726A0766
11296a01057b9096H9363O8563f4189H8241b63802B2627I897c05192A27291a0683
11284b00441f5435e690A86624b234I5014i599A33622l8248a11938K8183A54079
11272A54917a26606j19515G6903f4768j26717g2002A2776O1593b83314J33169
$$ y = [88119, 138220, 5391, 221293, -62216, -214677, 27695, 231437, -159737, -194219, -111902, -147437, -176165, -200858, -113692, 49954, 283292, -77743, -285054, 136743, 334647, -173055, -690, 399199, -138014, -244168, -4019, 199942, -32162, 89454, 225329, -228461, -97496, 139698, 172280, -168164, -70670, -240219, -186690, -222590, -31512, 23881, -152169, 178113, -24681, 55936, 101447, -421, -98733, -1031, 390816, -80792, -393754, 193448, 96477, -63310, -3367, 35726, 10766, -101057, -29096, 89363, 157926, -64189, 88241, -263802, 22627, 9897, -305192, 127291, -10683, -200441, -65435, -5690, 186624, -2234, 95014, -9599, 133622, 95374, -111938, -83755, 154079, 154917, -126606, -246121, 76903, -64768, -191485, -72002, 12776, 74369, -283314, -150145]
11262a50145d1921k64252B87118d9137o3825A38484C6010J5135M6677B863h212
11250A1930M1382e4667B91018b2587C2061c7556A55105g9411j62863a355A33978
11238a80188B75143j16825h2969G4581L59870a51682B1293H130a59089o2193f6079
11226G7004a41036A83481F5115M524c4600q4642k2896j38795J0763c1590k6544
11215e8134B9288J5801O6791b17698c6503E7910k281e2398j7999m723B15844i219
11202A21996c02544N8386F0152d74913A90537a41179p2926R8593H3730b0369k04209
11191b24578R1884A58719c5854l57328a83383j55679a46090A50217A7305J19752
11181A37057C2456a48926c5737j54180A95998n1179A034i5516j13663b1575j4261
$$ y = [-150145, -41921, -306173, 287118, -49137, -112962, 138484, 36010, 51145, 97822, 2863, -8212, 11930, 53312, -54667, 291018, -22587, 32061, -37556, 155105, -79411, -242274, -1355, 133978, -180188, 275143, 158318, -82969, 74581, 434451, -151682, 21293, 8130, -159089, -221282, -66079, 77004, -141036, 183481, 65115, 69639, -34600, -119242, -142138, -280933, -270170, -31590, -58134, 29288, 45089, 111880, -217698, -36503, 57910, 55629, -52398, -70397, -75120, 215844, -9219, 121996, -302544, -244158, 60152, -474913, 190537, -141179, -214105, -115512, 83730, -20369, -224578, -132694, 158719, -35854, -393182, -183383, -339062, -146090, 150217, 17305, 137057, 32456, -148926, -35737, -189917, 195998, 144819, 1034, -95516, -209179, -21575, -35836]
11170c5836m6563r8628g327q9040k94499a73041K7628L0217j40580N7129I7210
11158B01165c73739B31212b20980b8855j16371B07048b06485C67229b75314D6120
11147B10733D7803b84383d512E4222b29423q3601n7150i3759B53802C3950i7791
11135C7987e08804A24639K1676C9470j1661K0527N9590f6748n0505l43013b11458
11123A14555a5289L055H8020d0538F0098e474A15555b19411D1662a71792A70522
11111B15184J1107E4846a15955l06867B10934I6829b6978F9834c3068C64309A60988
11099E4511J14074C1818J70847F490J7354c249r0954D2072K04483K04135I7935
11087D4522J84120C9023d2702D06447C2867e8017B31271m5583b4890B69494A09497
$$ y = [-35836, -82399, -181027, -7327, -96367, -390866, -173041, -145413, -115196, -255776, -198647, 97210, 201165, -373739, 231212, -220980, -28855, -145226, 207048, -206485, 367229, -275314, 46120, 210733, 47803, -284383, -4512, 54222, -229423, -313024, -370174, -93759, 253802, 33950, -97791, 37987, -508804, 124639, 146315, 39470, 27809, 48336, 107926, -66748, -117253, -460266, -211458, 114555, -15289, -12234, 88020, -40538, 60098, -5474, 115555, -219411, 41662, -171792, 170522, 215184, 226291, 54846, -115955, -422822, 210934, 96829, -26978, 69834, -33068, 364309, 160988, 54511, 168585, 31818, 202665, 6490, 23844, -3249, -94203, 42072, 246555, 450690, 97935, 44522, 228642, 39023, -42702, 406447, 32867, -58017, 231271, 185688, -24890, 269494, 109497]
11075B88661a68298K3498B53997J13603k2948A43543i9474D4112d5751m3628D65629
11063A42404L76090A54154e583B68748r471L05502A82320H1676N20912a7717A32223
11051B98237j27505L51581C1682N80629j83448O7285J80108k98720L59533O2495
11041G99564k33259r362K18442k20430J45453A34030L59069L64418j25112J07213
11031H39618Q7377m57357K29109j5854j7232j17058L46383l23109J87352j69046
11021E90183P7439j97650J82241q7951p1666J61735j8663K95744M313j63196r2326
11010F80203K24473J8441l62314k49024L92769k71710K6903J39190J46261B85729
10999E39881J75369K3521l02197L87777C96449J30768m3400O2963L6078J53729
$$ y = [288661, -168298, -144800, 253997, 367600, 344652, 143543, -99474, 44112, -45751, -89379, 465629, 142404, 518494, 154154, -5583, 268748, 259277, 564779, 182320, 81676, 602588, -17717, 132223, 298237, 170732, 522313, 31682, 612311, 428863, 496148, 676256, 377536, 737069, 799564, 566305, 556943, 775385, 554955, 700408, 134030, 493099, 857517, 732405, 839618, 926995, 469638, 698747, 682893, 665661, 548603, 894986, 571877, 759229, 590183, 667622, 469972, 652213, 564262, 492596, 654331, 635668, 931412, 935725, 772529, 680203, 904676, 923117, 560803, 311779, 704548, 432838, 459741, 598931, 745192, 285729, 539881, 715250, 738771, 436574, 824351, 396449, 527217, 483817, 546780, 582858, 736587]
10989G36587k99095j35708M36450B96979L97916J36773l44220J48456j0394m6183
10979E79327K17889J5928r5374J31504M5951j43786B87103M89141J64044j17637
10969H22651K54867l4867L50844k15355Q8188L55313l13132M13334j47094P35654
10959B310403j1531M29746k59062k96297J66981l2942l10699j80722j86143P72
10949A630506N1199j76485l8478j77054L26626K10122k15431M9102l05816j55129
10939A199162k87661J5618M3284n7788k55975k6577A53683M4956E9562j6885M6340
10928H9017K32143E898L86555j18214d2271a1068A64148K40412D0106l343L38105
10917C74868J2187I6369P581b82145f7679k97272a31938D7589a01502A84587h7939
$$ y = [736587, 437492, 301784, 738234, 296979, 694895, 831668, 487448, 635904, 625510, 579327, 797216, 813144, 717770, 849274, 895225, 751439, 287103, 776244, 940288, 822651, 1077518, 1042651, 1393495, 1178140, 1266328, 1621641, 1308509, 1721843, 1574749, 2310403, 2298872, 2728618, 2469556, 2173259, 2340240, 2307298, 1996599, 1815877, 1629734, 1630506, 1681705, 1505220, 1466742, 1289688, 1616314, 1826436, 1611005, 1660107, 1354291, 1199162, 911501, 927119, 970403, 912615, 656640, 630063, 153683, 198639, 59562, 42677, 89017, 321160, 5898, 392453, 274239, -42271, -11068, 164148, 404560, 40106, 36763, 374868, 387055, 96369, 103950, -282145, -67679, -364951, -131938, 47589, -101502, 184587, -87939]
10905a42939p8937H4742g6472D4817c77357e1899H217a92567O5412e6587A50444
10893b7880q9016A97376a11035n4144F9796b95523f004j52416A29969l6505a12190
10881a68900e5726A44097k1886b93429l7046a31508E8082b7345j04719J7848A54139
10869c7475D7820P2273b00829A09195a22257g822E9475b25538R6328G367L2884
10858D0251g1881A68023Q738o6442F480K06673p1917B8065b98557C78604j44194
10847B34410h1120j24879I5875M5272g7894m7547P468a5024G2567e8859m3308
10836a02167j65955B8077r306a18377j01659N3948F8925d7849J728j55746f0347
10824H466a15464l3360h835A10417L7576E0354J08229E2823h6716A06511a10083
$$ y = [-142939, -221876, 84742, -76472, 44817, -377357, -51899, 8217, -192567, -127155, -56587, 150444, -27880, -116896, 197376, -111035, -165179, 69796, -295523, -6004, -158420, 129969, 93464, -112190, -168900, -55726, 144097, 122211, -293429, -330475, -131508, 58082, -27345, -132064, -114216, 154139, -37475, 47820, 120093, -200829, 109195, -122257, -7822, 59475, -225538, -129210, 7367, 40251, -71881, 168023, 176761, 110319, 6480, 213153, 141236, 28065, -298557, 378604, 234410, -81120, -205999, 95875, 141147, -77894, -125441, -117973, -15024, 72567, -58859, -102167, -268122, 28077, 18771, -118377, -220036, -166088, 68925, -47849, -46121, -201867, -60347, 8466, -115464, -148824, -8835, 110417, 147993, 50354, 158583, 52823, -86716, 106511, -110083]
10812I5378a12906d3825r033K5771k39934g879E2821a11496B81982F4359l0902
10801C3457b54583c457j16492M9328A28243a83261k4214C46151g2230J8891k15772
10790b69111h1537F7492k2402J21410k7961a14843C428b69425G0407b78720A44883
10778b6238B72035i855A3699b67228J19452b3005n31q1603j48101j0022I5386
10766A41946d3133D6258h8712B73179e4632q3584A88504e7648K1541m9801A5399
10754h2067D03131A3462N3515N7527P7904a04407L1555J5612j59103O6329A34023
10742c74364C10968A54985e6506A20511n3207B3753b99037c5373I1162f9578A93999
10730b78198a617j12997r8085O002d8789A26815b04965A01892a9171k92938F0003
$$ y = [95378, -112906, -43825, -52858, -27087, -267021, -7879, 52821, -111496, 281982, 64359, 33457, -254583, -3457, -119949, -70621, 128243, -183261, -207475, 346151, -72230, -53339, -269111, -81537, 67492, 45090, 166500, 138539, -114843, 3428, -269425, 70407, -278720, 144883, -26238, 272035, -9855, 13699, -267228, -147776, -23005, -23536, -105139, -253240, -263262, 95386, 141946, -43133, 46258, -88712, 273179, -54632, -138216, 188504, -57648, -36107, -85908, 15399, -82067, 403131, 13462, 66977, 124504, 202408, -104407, -72852, -57240, -216343, -150014, 134023, -374364, 310968, 154985, -56506, 120511, 67304, 23753, -299037, -35373, 91162, -69578, 193999, -278198, -1617, -114614, -212699, -206697, -48789, 126815, -204965, 101892, -19171, -312109, 60003]
10718C62515A14726a27863K6337A07416O1542i1779I0104a18827M5020m26340
10708e00147B8670c01107G3356L8959J19197e9499A77693j0474a17142B05344
10697a83859A36577O8099b49212d7948F2366k2990c90022J10609C9068f8997A23299
10685a26816i279D9703h6611k30584a00118M2551j78136G7641K0144d37707a69970
10673e07165b51369c331l009q3947j29884J2187R4912j10894A62092D0037b38806
10661b61097A5381e4397B9427J64452a43344n0243A93046b7485B755i5090H7891
10649B19659c43915C95341i7136n3902c4673k28611E369a43284A95429a6423A66742
10637a23499J6953C26576a61536j33753C6346p262J39574a74209o3332L0969M2432
$$ y = [362515, 114726, -127863, -101526, 107416, 168958, -91779, 90104, -118827, -73807, -500147, 28670, -301107, 73356, 112315, 231512, -59499, 177693, 167219, -117142, 205344, -183859, 136577, 204676, -249212, -47948, 62366, 39376, -390022, -279413, 39068, -68997, 123299, -126816, -9279, 49703, -86611, -317195, -100118, -57567, -235703, 77641, 97785, -437707, -169970, -507165, -251369, -3331, -6340, -90287, -220171, -207984, -113072, -223966, 162092, 40037, -238806, -261097, 15381, -54397, 29427, 193879, -143344, -193587, 193046, -27485, 2755, -95090, 87891, 219659, -343915, 395341, -97136, -151038, -34673, -263284, 5369, -143284, 195429, -16423, 166742, -123499, -106546, 326576, -161536, -295289, 36346, 29084, 168658, -174209, -237541, -206572, -164140]
10626a64140n1531h0153j93489M9789e2438j00899L7036k8150A28536e1250H057
10614b03118h466l07725c4756A4688g8903K1520k91090H9876j9872f5621l58518
10603d24139a32764l11227K04877a12089A2877K86015A33679e928A26631c6048
10592a1639A30813e7338D6198j2011a01460P055a5212j2368A20400e5069I7347
10580A8421I010f3486G861K3263J18003c36775M1759F1597K15830c30281d7045
10568b01784d2117j37875I1255a71664n7704k55768D2976K4163c40646c8045k2159
10557f0204H4454a22948d1186B06373a61446N333L0140D9122a00025m771k24597
10546c29393a48163E4232I08J5431a40409k09579A56188j7671b0621j52177I5808
$$ y = [-164140, -215671, -80153, -273642, -223853, -52438, -153337, -116301, -144451, 128536, -51250, 8057, -203118, -8466, -316191, -34756, 14688, -78903, -57383, -348473, 89876, 70004, -65621, -424139, -132764, -443991, -239114, -112089, 12877, 298892, 133679, -5928, 126631, -36048, -11639, 130813, -57338, 46198, 34187, -101460, -94405, -15212, -27580, 120400, -55069, 97347, 18421, 9010, -63486, 7861, 31124, 149127, -336775, -295016, 61597, 277427, -330281, -47045, -201784, -42117, -179992, 91255, -171664, -229368, -485136, 42976, 67139, -340646, -38045, -60204, 84454, -122948, -41186, 206373, -161446, -156113, -125973, 49122, -100025, -104796, -329393, -148163, 54232, 908, 16339, -140409, -349988, 156188, 138517, -20621, -172798, 95808]
10534i5775M3476A12035l3124j8193b8181A88807c4624B68814q5095H8568D965
10522A3760a79885f3908a559k67393I1672g6257J018o1399d9732h978F6108a93508
10509A23889a03130c2446A54023J425L76145e1675m5648C01464g0170l69521h7666
10497B6350a91790b1677B63069b58635c5437G682J7527c21818L7147A20174L0671
10486A50845b44232J01954m364I6833a32440J5964j84617B06779o2651G123N6497
10475F3620R2316g7136j08821k0019B50355A23259B6693J74108p4944K580M6585
10464A75022H6706C3581h7421A27822J2685C6464a84042A54821E9176J16468b93825
10452A56597K17749E3632K45802A00401J18385b59064f0178a8937p8425j20644
$$ y = [-95775, -52299, 112035, 78911, 60718, -28181, 188807, -34624, 268814, 183719, 88568, 4965, 13760, -179885, -63908, -1559, -268952, 91672, -76257, -75239, -136638, -49732, -8978, 66108, -193508, 123889, -103130, -32446, 154023, 155448, 531593, -51675, -97323, 301464, -70170, -439691, -87666, 26350, -191790, -21677, 263069, -258635, -35437, 7682, 25209, -321818, -284671, 120174, 150845, -244232, -142278, -146642, 96833, -132440, -116476, -301093, 206779, 144128, 7123, 63620, 155936, -77136, -185957, -205976, 250355, 123259, 26693, 200801, 125857, 128437, 175022, 86706, 33581, -87421, 127822, 140507, 36464, -184042, 154821, 59176, 175644, -293825, 156597, 374346, 53632, 299434, 100401, 218786, -259064, -60178, -18937, -97362, -218006]
10442b18006A64392G1292L2035A5312b44963O5345E4505b05566H7786e9704B1703
10430a40087l9777B67859b48603d7211D9432N0076b12764A66223c7804B0559a3814
10418C60571j14803F9608a8944A02304c93419J67732B54948a12284A07334m4867
10408F2467a18978o456A16815a17210A87249l8804H324J23667a6555B51967B2244
10396D1381f7534j68716C05777q9237a36660d5342A834Q1147K95592B4827b73961
10384e6646a4483k51155e440m5273l69427A43987k4247K09553r8748o1455A9300
10372b05650e4079j496K6420A19584E9791c6700C59122j75376A2740J45366h1213
10360b2017D5811k2558L10200j53084K27789N0989B20866F8372P0803L73560N2998
$$ y = [-218006, 164392, 71292, 103327, 15312, -244963, -179618, 54505, -205566, 87786, -59704, 21703, -140087, -179864, 267859, -248603, -47211, 49432, 99508, -212764, 166223, -37804, 20559, -13814, 360571, 245768, 69608, -18944, 102304, -393419, -225687, 254948, -112284, 107334, 62467, -118978, -125434, 116815, -117210, 187249, 148445, 8324, 131991, -16555, 251967, 22244, 41381, -67534, -236250, 305777, 216540, -136660, -45342, 1834, 82981, 378573, 24827, -273961, -56646, -14483, -265638, -5440, -50713, -420140, 143987, 119740, 329293, 230545, 169090, 19300, -205650, -54079, -55575, -29155, 119584, 59791, -36700, 359122, 183746, 12740, 158106, -81213, -22017, 45811, 23253, 333453, 180369, 408158, 459147, 220866, 68372, 139175, 512735, 565733]
10349E65733B03226A9357J97724f2239C53395o4715A43406m9817L5801L15381
10339D44771J08585B59338J54145m7368j64922P6489A3659M11802p0277I0472
10328F8720K93051A69528J42742J28757L1007b3331F2537J75481o180I7844a99792
10316A39114b1505j71106f614D03018j46893K46731e3174A26318c0465A70833
10305I2969J65456q5007i7524A54601a1844k12370h5775J5067j03486A87191c49784
10293a4166f691k24230O7558C20838a7902F9383c09447B52043C2357j60c96111
10281a73613A31674a03352r855A74831a10864k17671a49414N9828A12125l5986
10271G6139b28002B15412a71636f4646p9445A53838C5650d46483A27540a04846
$$ y = [565733, 203226, 19357, 217081, -62239, 353395, 288680, 143406, 93589, 129390, 444771, 553356, 259338, 413483, 366115, 201193, 277682, 13659, 425461, 355184, 90472, 68720, 361771, 169528, 312270, 441027, 472034, -23331, 62537, 238018, 231838, 97844, -199792, 139114, -21505, -192611, -6614, 403018, 256125, 502856, -53174, 126318, -30465, 170833, 92969, 258425, 173418, -97524, 154601, -11844, -224214, -85775, -70708, -174194, 187191, -349784, -14166, -6691, -230921, -163363, 320838, -17902, 69383, -309447, 252043, 32357, 32197, -396111, -173613, 131674, -103352, -113207, 174831, -110864, -328535, -149414, -89586, 112125, 76139, -228002, 215412, -171636, -64646, -144091, 153838, 35650, -446483, 127540, -104846]
10260a03230I8727b08504I9193m3480a66299m796K9623A35487J9964l3140J28812
10249B51123r9302F0801J31401J41220K3277A24321n9040L6026K22881E7972J53726
10238B11698b6104k6576A83518G5085c7676p0601j2561o4077A63309A3761N0804
10227F4565b34788B18664c30823E6507c074B01165C4395a72084g9909b0067B60539
10215a22372E3576f6332K7655h805l10651A35363b47448A43579r850h9819c9846
10203c90036a67992L8015o4892g9993D45676f1042D4697Q8011J74189c92641a18980
10191e927B1054F0a49295H5887J44495a88893m6929R1480j06734J12704j58318
10180b96690a05159j29765B1617R1900J43772b16675a5821D0187l057J16431c72624
$$ y = [-103230, 98727, -208504, 99193, 55713, -166299, -171095, -141472, 135487, 155451, 122311, 251123, 151821, 60801, 192202, 333422, 356699, 124321, 65281, 101307, 324188, 57972, 211698, -26104, -52680, 183518, 75085, -37676, -108277, -120838, -184915, 163309, 13761, 64565, -234788, 218664, -330823, 56507, -3074, 201165, 34395, -172084, -79909, -20067, 260539, -122372, 53576, -66332, -38677, -8805, -319456, 135363, -247448, 143579, 133729, -89819, -39846, -390036, -167992, -129977, -194869, -79993, 445676, -61042, 44697, 132708, 306897, -392641, -118980, -5927, 21054, 60, -149295, 85887, 230382, -188893, -235822, -144342, -251076, -138372, -296690, -105159, -234924, 21617, 113517, 257289, -216675, -15821, 40187, 37130, 153561, -372624]
10168A48696c88032J37401O7594d5305j3960k01198B34905a8243I5678b82726
10157C82960e0013j3560I6872a68376B75180d63786A05775A2585K2098a17861
10146e1986A22084a16180B49410e0093j65073A6380a43299M9467p4159Q0260A05790
10134A17543b45275h9287K8269j12025M7386j640D769b26873B89665c01668a6352
10122B731b18743b5140j99367n562b3376A99422G3054G79J46935J7456a72885
10110a61901Q737g4767L0435I324c24182k7911h6698B5795J59244a30883b5396
10098a18927a483j76272f5470B42983O1501f8486D06127a46421e3017k78783A99184
10086b23480E142f2672A45565a79728b1205B56224b39750R7471p8970C25309H4361
$$ y = [148696, -388032, -250631, -183037, -45305, -59265, -260463, 234905, -18243, 95678, -282726, 382960, -50013, -63573, 96872, -168376, 275180, -463786, 105775, 12585, 34683, -117861, -51986, 122084, -116180, 249410, -50093, -215166, 16380, -143299, -93832, -167991, -87731, 105790, 117543, -245275, -89287, -61018, -173043, -125657, -127297, 4769, -226873, 289665, -301668, -16352, 2731, -218743, -25140, -224507, -230069, -23376, 199422, 73054, 779, 147714, 165170, -172885, -161901, -153164, -74767, -44332, 9324, -324182, -352093, -86698, 25795, 185039, -130883, -25396, -118927, -1483, -177755, -65470, 242983, 304484, -68486, 406127, -146421, -53017, -331800, 199184, -223480, 5142, -62672, 145565, -179728, -21205, 256224, -239750, -142279, -221249, 325309, 84361]
10074A358a1233k00019H9354a82784G993f3403o3347q5911K7226k3900A53077
10062b25060A30885B9920a46274A42400A6132a8606A09100e9544F3197d8596A74579
10050A20753b09924N6072d0474j60930A17350c14080E1246b4427k93674B7049
10039c1400m7595j74240Q5124A76215a21604L4700r341j2278B913f7744h691A43563
10026D2144h1968q7153E6821b06861j00937F4652b0107j64636Q7323j48212j00285
10015c45917i0868B2905K62372b01220H620b6084m6545b4853j996h973j39309
10004a48282j40535F748a22546j92923a35593B7157K34793a79583j57728D4348
9993A56106I431a30982A87449h0779A23446b21492j97016d5344k89495n0372L2764
$$ y = [1358, -11233, -211252, 89354, -182784, 7993, -63403, -126750, -212661, -185435, -209335, 153077, -225060, 130885, 29920, -146274, 142400, 16132, -18606, 109100, -59544, 63197, -48596, 174579, 120753, -209924, -153852, -40474, -201404, 117350, -314080, 51246, -24427, -318101, 27049, -31400, -78995, -253235, -168111, 176215, -121604, -86904, -96245, -108523, 2913, -67744, -8691, 143563, 42144, -81968, -169121, 56821, -206861, -307798, 64652, -20107, -184743, -97420, -245632, -345917, -90868, 22905, 285277, -201220, 8620, -26084, -72629, -24853, -26849, -8973, -148282, -288817, 6748, -122546, -315469, -135593, 27157, 261950, -179583, -337311, 44348, 156106, 9431, -130982, 187449, -80779, 123446, -221492, -418508, -45344, -334839, -385211, -352447]
9982c52447G3016K11104a92054M8243m9567A75999a69959A80450n6723a55847
9971i8064m7239J6914E0265A5342J77853h7527j38106c3972p6154q1846c6906
9959D7316b2105C69049g1119k5884j16663o2525a24766e4982k63428H2721b49353
9947a80551B31456G5515P0304a75614G8828a57269A26768a9250A80215b033j3169
9936a5202A25673e3183j70874a10078C5242K573J81304b47125A56702a5649B700
9924b4655k00239G6446A5689d69704a66115c8383A97090b94304E510j90a03738
9912B04124N4641c36020B26988b6023I6797i8101B11299p5733a64856j00200D3395
9900F9254c42018J64782H6997e1136q8011A6794J03165c20315d8287D2366a38551
$$ y = [-352447, 73016, 284120, -192054, -143811, -193378, 175999, -169959, 180450, 123727, -155847, -98064, -145303, -128389, 50265, 15342, 193195, -87527, -225633, -33972, -110126, -191972, -36906, 47316, -22105, 369049, -71119, -97003, -213666, -276191, -124766, -54982, -318410, 82721, -249353, -180551, 231456, 75515, 145819, -175614, 78828, -157269, 126768, -19250, 180215, -2033, -15202, 125673, -53183, -224057, -110078, 35242, 37815, 219119, -247125, 156702, -15649, 2700, -24655, -224894, 76446, 15689, -469704, -166115, -38383, 197090, -294304, 5510, 5320, -103738, 204124, 258765, -336020, 226988, -26023, 96797, -98101, 211299, 135566, -164856, -265056, 43395, 69254, -342018, -177236, 86997, -51136, -139147, 16794, 119959, -320315, -48287, 42366, -138551]
9888B68693d48886i7812c4039q734a9403k57004A94871a21652l1886l5450A44079
9876A1858b9118k25671D7143h16k44616I221L7069j9792a62197E373a43157K5435
9864a17722A13738c19143A18046b37185G1725b66233b4715j56222I72K10833J09522
9853C21327A11134a50902e6763r8161d9953H8104C8288F193i6934c0167l22079
9842c52246C03200a67020a9756B9461m480a13949m0392q1162A13449c3198D3235
9830a09123a2508j21862L4530l09515F6976l315d2275A64350a84515o5687A79573
9818A5402b46325A58232n5525g8554o5515K0341o3864C13765D3343J06472M7142
9807A96957c9367j78634Q6127k42336a81545n0702f4662j80629I5855b22496r2024
$$ y = [268693, -448886, -97812, -34039, -42773, -19403, -276407, 194871, -121652, -153538, -188988, 144079, 11858, -29118, -254789, 47143, -816, -245432, 9221, 46290, 26498, -162197, 5373, -143157, -117722, 113738, -319143, 118046, -237185, 71725, -266233, -24715, -180937, 972, 211805, 321327, 111134, -150902, -56763, -154924, -49953, 88104, 38288, 6193, -96934, -30167, -352246, 303200, -167020, -19756, 29461, 24981, -113949, -154341, -235503, 113449, -33198, 43235, -109123, -12508, -134370, -99840, -409355, 66976, 63661, -42275, 164350, -184515, -250202, 179573, 15402, -246325, 158232, 102707, -78554, -144069, -123728, -187592, 313765, 43343, 149815, 196957, -39367, -218001, -131874, -374210, -181545, -232247, -64662, -245291, 95855, -222496, -314520]
9796c14520B6216e7095j59608c6724a0970p6790k44766J62991d4392k5674k53960
9785c24026J25374m0775a5192I5989b07209B18602b92286d0447q0297j6395A74958
9773h5384A7040a60666G5605a59020A36141h9182r9961A90281a77161B6533K07555
9762B34088b31572d6793j54388j78791a28482G9296l3980a64681g3845B51247
9751a14894H9221a66092M6682A39244b5481j10257C60406a70073q5108H2804c61224
9739h3470E0810i0792J0416r725J687B74275e3845f721l1066q3597B1036J20634
9727A41670o3595g1105A6932g3113j84030A05996L14319c8193k09367B80398P801
9716B88199F2893b36373p536A9480a03964C43755d1583j73053e3853I6239C0229
$$ y = [-314520, 26216, -57095, -216703, -36724, -10970, -87760, -332526, -169535, -44392, -70066, -324026, -198652, -239427, -15192, 95989, -207209, 218602, -292286, -40447, -120744, -137139, 174958, -85384, 17040, -160666, 75605, -159020, 136141, -89182, -189143, 190281, -177161, 26533, 234088, -231572, -46793, -201181, -379972, -128482, 79296, 45316, -164681, -73845, 251247, -114894, 89221, -166092, -119410, 139244, -25481, -135738, 360406, -170073, -255181, 82804, -361224, -83470, 50810, -90792, -80376, -90101, -88414, 274275, -53845, -6721, -37787, -121384, 21036, 141670, 78075, -71105, 16932, -73113, -257143, 105996, 420315, -38193, -247560, 280398, 288199, 62893, -236373, -243909, 19480, -103964, 343755, -41583, -214636, -53853, 96239, 30229]
9704b35378h3432k49738a22071b6044B48594m7213G5783a99699K6405b0499A27378
9692h2449C10509A6952K44168b2671I0692a09497j35371C54599c8344j2831A80584
9680b10767a04126H7579B9391a10823B07411l5955a20835B51475a7902A5346a92122
9668c6477q8418j29178c1979I3513K47732a1204D7490M9527b37164F0844a05036
9656i3985C11831e0277p1264A08383a31846j5701F6981d7463j48726R1959A02214
9644b79230O2855i7697B28319i5346p3643k89569b21919H4969c7082q3897A73111
9632D6638a63827k64302A44791b90303D9268f3381B19621G3468f5140j08478K4065
9621a49553j89457f8036m16528J04463D56433h4714j7545B7167b59869I2115o39
$$ y = [-235378, -83432, -333170, -122071, -26044, 248594, 201381, 75783, -199699, -173294, -20499, 127378, -82449, 310509, 16952, 261120, -22671, 90692, -109497, -244868, 354599, -38344, -51175, 180584, -210767, -104126, 87579, 29391, -110823, 207411, 171456, -120835, 251475, -17902, 15346, -192122, -36477, -124895, -254073, -31979, 93513, 341245, -11204, 47490, 97017, -237164, 60844, -105036, -93985, 311831, -50277, -121541, 108383, -131846, -147547, 66981, -47463, -196189, -104230, 102214, -279230, -216375, -97697, 228319, -95346, -168989, -458558, -221919, 84969, -37082, -120979, 173111, 46638, -163827, -428129, 144791, -290303, 49268, -63381, 219621, 73468, -65140, -173618, -149553, -339010, -68036, -484564, -380101, 456433, -84714, -102259, 27167, -259869, 92115, 91476]
9610I1476a62560c0941C36251a89983h938A01928e3380p1771E29J98377c72441
9598b45137i3694K6473j47801a07342A1919a55229e1808r9987F867d9509j68925
9587b18434i1761n2709j21991E1531b9732j46337A03018a03364d0108j22681r8834
9576b61623G755c40078J04232P5510A27489h8963l2825N3097A21758a67333A07165
9564F3534c53270F8103c73570J41884i926A2717a27490L1637k21306B884d19475
9552d24786i3314k3510H8243b87066A5355f6557a9146o0317I705a28497A3439
9540G7663O8559J64942a73789j04810c750k52134B06761q0566J39529a98712B0993
9528a4967j1595k10663e9509C3818b87935B7726J92754A04329b56374N4445B52700
$$ y = [91476, -162560, -30941, 336251, -189983, -8938, 101928, -53380, -125151, 529, 198906, -372441, -245137, -93694, -67221, -215022, -107342, 11919, -155229, -51808, -151795, 6867, -49509, -218434, -91761, -144470, -266461, 51531, -29732, -176069, 103018, -103364, -40108, -162789, -261623, 7755, -340078, -235846, -160336, 127489, -88963, -121788, -68691, 121758, -167333, 107165, 63534, -353270, 68103, -373570, -231686, -9926, 12717, -127490, -95853, -317159, 2884, -419475, -424786, -93314, -116824, 88243, -287066, 15355, -66557, -19146, -79463, 9705, -128497, 13439, 77663, 146222, 311164, -173789, -278599, -3750, -255884, 206761, 126195, 265724, -198712, 20993, -14967, -26562, -237225, -59509, 33818, -287935, 27726, 220480, 104329, -256374, -201929, 252700]
9516a90450C2499J5360J91099J6812g1908j41374j41058a977k24037a03006j91669
9505b94675J7234J19612B9854P900b8590A07963B3019c1205q9980C44680C546
9493G6138p448i6724o7603e3534l19310R2572a36889D0470A9317O0513f5645r2301
9481a57946D589J32368K88704E3370a89285B2139c13117J08428A16184l865d2718
9469b18585A12643i7070b8043j02628j71988I2582O2516a86613j48580F1578L1577
9458I3155q326M777d31416f6660j95266a26821J3215M1533j5708B20744b64262
9446B25637H6814c8598R520C1596a74661L939B50704F1645e5062B83722i4861
9434a91668A86608a8978H3672b51953N5097I441L5854a84731A36253n9132a51171
$$ y = [-190450, 32499, 47859, 238958, 255770, -71908, -213282, -354340, -1977, -226014, -103006, -294675, -277441, -157829, 29854, 37754, -28590, 107963, 23019, -31205, -121185, 344680, 3546, 76138, 68690, -96724, -164327, -53534, -372844, -280272, -136889, 40470, 19317, 79830, -65645, -157946, 4589, 136957, 425661, 53370, -189285, 22139, -313117, -204689, 116184, 112319, -42718, -218585, 112643, -97070, -28043, -130671, -302659, 92582, 155098, -186613, -335193, 61578, 93155, 84829, 89606, -431416, -66660, -261926, -126821, -113606, -72073, -87781, 220744, -264262, 225637, 86814, -38598, -29078, 31596, -174661, -170722, 250704, 61645, -55062, 283722, -94861, -191668, 186608, -18978, 83672, -251953, -196856, 9441, 45295, -184731, 136253, 77121, -151171]
9422A45805j1139d3768j74520e9085l20511i3539d3263r8805B30354D7145K0290
9411F7435R0579L7851d906B38705b43216A738J71597A9245M297a15023B13329
9399c30812C2813J0611a33227D50450j39015i5619B5595c18430D3735N00b1691
9387A35544a21281N7493j5236A44040K11197b57269A74620G3316g5372k66689
9377c42061i9622l84991b3201j289A35845B3995K1270K67248a13240A76273P0990
9366B47263a41393n3347j51794A30853c43823G0911g5104C04318a21004k42742
9356c63746c9964G1271b11046j6486B0724b74127C5339b31168c8955A08247L337
9345A11584m0392E559a07304c5336k18833I9512O9056b34313P4927j17735A5654
$$ y = [145805, 134666, -43768, -218288, -59085, -379596, -93539, -43263, -142068, 230354, 47145, 67435, 158014, 195865, -4906, 238705, -243216, 1738, 173335, 19245, 23542, -115023, 213329, -330812, 32813, 43424, -133227, 450450, 311435, -95619, 25595, -318430, 43735, 44235, -21691, 135544, -121281, -63788, -79024, 144040, 355237, -257269, 174620, 73316, -75372, -342061, -99622, -484613, -23201, -24490, 135845, 23995, 45265, 312513, -113240, 176273, 247263, -141393, -194740, -346534, 130853, -343823, 70911, -75104, 304318, -121004, -363746, -39964, 71271, -211046, -227532, 20724, -274127, 35339, -231168, -38955, 108247, 111584, 71192, 5559, -107304, -35336, -254169, 99512, 168568, -234313, -159386, -277121, 15654]
9333B32275i7624j3573I8155b09189a03367j39195L639P9326a0905l751k15287
9322b29943b0615E1171J83010A00773P7084n1133e7574j57796j13452g424p753
9311a5177A76007K0026C742b9933n2961D2831a2068A11135b76178A82168h1388
9299A22906e7009k95887e1252A62878d7097B87077c80667d7382E2014n234J06228
9288A53008d2620G1081j0895J17599b72335C994J34266a48306m5354A93805A2091
9276d71768H9504b72847a29796l36014f4849n1237r5248A97163C3032a66734B5035
9264c90864a13094c7168A32555n1618m396h468q3870p6122N9921q154e4740A60062
9251f2498k6683k16315A87805c11283a3987j01606b943j17466C1892f1357B5905
$$ y = [232275, -97624, -111197, 98155, -209189, -103367, -242562, -238923, -159597, -10905, -14656, -229943, -20615, 51171, 234181, 100773, 177857, 126724, -57574, -215370, -328822, -7424, -15177, 176007, 196033, 3742, -29933, -82894, 42831, -12068, 111135, -276178, 182168, -81388, 122906, -57009, -352896, -51252, 162878, -47097, 287077, -380667, -47382, 52014, 46780, 153008, -42620, 71081, 60186, 177785, -272335, 3994, 138260, -148306, -193660, 193805, 12091, -471768, 89504, -272847, -129796, -465810, -64849, -116086, -211334, 197163, 33032, -166734, 25035, -390864, -113094, -37168, 132555, 80937, 76541, -8468, -92338, -168460, -108539, -116693, -54740, 160062, -62498, -89181, -305496, 187805, -311283, -13987, -115593, -2943, -120409, 31892, -61357, 25905]
9239b37627R5895B42544E0092b20443a08584a0894j10166B9278L03777j18118
9229B14937H511L9121a1660A75878a37456j26986a29023j64293k818e5098I1491
9217G598c61795i7112l957A3313Q8112b33597e6602J963A43219O3439A472O8508
9205F9980b19557M597e3652o7102A51071L1436a65765a2937q912j34180g5097
9193b9369o0468F0862a89764L3947l8523R1756d6517G4579b05043i8408q0677
9182a79085d4513C0741L2963A0186J7290K3439a48651A62459C8321b27537P1766
9171a55771e0301j21587A98453c1585J181B09580b92315G056K76359b18552B64586
9159E0811B5368K70241A7680c55310Q6597e6876q8291j00371A1178f4025o8471
$$ y = [-237627, -141732, 242544, 50092, -220443, -108584, -10894, -121060, 29278, 333055, 214937, 8511, 47632, -11660, 175878, -137456, -264442, -129023, -293316, -296134, -55098, 91491, 7598, -361795, -97112, -101069, 13313, 101425, -233597, -56602, -54639, 143219, 206658, 1472, 69980, -219557, -214960, -53652, -120754, 151071, 182507, -165765, -12937, -21849, -156029, -75097, -29369, -89837, 60862, -189764, -155817, -194340, -102584, -46517, 74579, -205043, -98408, -179085, -44513, 30741, 63704, 10186, 27476, 50915, -148651, 162459, 38321, -227537, -155771, -50301, -171888, 198453, -31585, -30404, 209580, -292315, 7056, 283415, -218552, 264586, 50811, 25368, 295609, 17680, -355310, -268713, -56876, -145167, -245538, 11178, -64025, -132496]
9148a32496F9814b43968A17048J47430b3742I6656c0339m807A19809a22002j54008
9137b76010g4583b4141p5286j38069A78110a1851I3101g0106l75926J13219A44668
9125a64229j7604L4823B05055d32568a4274j15170A77937b53917r2985J49699
9115a97203j04343a22435k09246i4125k22466E058P7808a76713j4131A26578b60229
9103a03100k08552B08954f7658A76338b7472j78344J01203C18088a21865A58959
9092C7740f7406A69457g4456h655C870L2793h8077j01499c8215l45535a1045p0268
9080h1313r097p8342b0373C4942j3403N3188K09006b3710n4814N159k29565K022
9068c00908c6339g402E4657J82792e7065A32901a842q0256B25910c03639E8754
$$ y = [-132496, 69814, -243968, 117048, 264478, -23742, 96656, -30339, -35146, 119809, -122002, -276010, -74583, -24141, -99427, -237496, 178110, -11851, 93101, -70106, -446032, -332813, 144668, -164229, -181833, -147010, 205055, -432568, -14274, -129444, 177937, -253917, -346902, -197203, -301546, -122435, -331681, -94125, -316591, 5058, 82866, -176713, -190844, 126578, -260229, -103100, -311652, 208954, -67658, 176338, -27472, -205816, -104613, 318088, -121865, 158959, 37740, -67406, 169457, -74456, -8655, 3870, 36663, -88077, -189576, -38215, -383750, -11045, -81313, -90410, -168752, -20373, 34942, 21539, 74727, 283733, -23710, -78524, -73365, -302930, -300908, -36339, -7402, 54657, 237449, -57065, 132901, -1842, -82098, 225910, -303639, 58754]
9056b14245A48922G1090q751b56376B8689A1500a35017A82784a23517I3318L1143
9045A24461b75493J21385j21012J26052F0084k3883b1032I6561c06325B255L09454
9034C11709h6043D5196J04173d2658A04215a8230k23724J09199H3052i2445j19899
9023b12344l9239A34667d9765l0845a6025E2653J87784b54774A57003b4041p8992
9012a03033k29767f9057j8284r8195f5289K5491A79800b70518e7353j9855A17271
9000b7720A53707a23159j7428A14913a42938K3989k5094l466B89420A1705J25127
8989A36832D422b15424h2541K0660L0450N983A76518a82696b2454j82271l26i5708
8976f1814B44044a89969D3546K53215e2548o7222C6211a67241o7926a11546l09255
$$ y = [-214245, 148922, 71090, 62339, -256376, 28689, 11500, -135017, 182784, -123517, 93318, 124461, -275493, -154108, -275120, -149068, 60084, 36201, -21032, 96561, -306325, 2255, 311709, -86043, 45196, 149369, -42658, 104215, -18230, -241954, -132755, 83052, -92445, -212344, -251583, 134667, -49765, -80610, -16025, 52653, 240437, -254774, 157003, -24041, -103033, -332800, -69057, -87341, -185536, -65289, -39798, 179800, -270518, -57353, -77208, 117271, -27720, 153707, -123159, -140587, 114913, -142938, -118949, -144043, -147509, 289420, 11705, 136832, 4422, -215424, -82541, -61881, -31431, -25448, 176518, -182696, -22454, -204725, -205051, -95708, -61814, 244044, -189969, 43546, 296761, -52548, -119770, 36211, -167241, -235167, -111546, -420801]
8965d20801d9405l51711J73351J02589r2495B05666a27401L0704A46729L8404
8955A85133g2852B20605a7493o0308A96738C6798J0903e8337A83310b25530D4317
8943F3385a1716B33392l3304c1575k22598g9820A13137e4803m0057B79426c94571
8931E1831c47837B21943a18485B88897A28766J35371d2424k09024a03579B4353
8920f3440m45B92570n2957k4903j5892d4626j78925B06400D4397O0084N75252
8909F79733J2112Q91905J023777L360600j091524B077823I82870C31172J811H9246
8898c7643A12103K23955d5177A58937Q7219N6524A26908a00189E0483J6816K5869
8887I3168B9642K5221i1528P561q8012j56075g5504B71535a28500A98529h7116
$$ y = [-420801, -49405, -401116, -227765, -125176, -217671, 205666, -127401, -96697, 146729, 185133, -72852, 220605, -17493, -77801, 196738, 36798, 47701, -58337, 183310, -225530, 44317, 63385, -11716, 233392, 200088, -31575, -254173, -79820, 113137, -54803, -94860, 279426, -394571, 51831, -347837, 221943, -118485, 288897, 128766, 264137, -42424, -251448, -103579, 24353, -63440, -63885, 292570, 239613, 214710, 198818, -44626, -223551, 206400, 44397, 104481, 679733, 691845, 1583750, 2607527, 5968127, 4876603, 2077823, 982870, 331172, 332983, 89246, -37643, 112103, 336058, -45177, 158937, 246156, 302680, 126908, -100189, 50483, 67299, 93168, 29642, 54863, -91528, -83967, -171979, -328054, -75504, 271535, -128500, 198529, -87116]
8875f4513B19390C7607b35630D8940a17496C6036d0173B10422A8564J11424P414
8864A37402J26307o5640m7484a55735K3278B0779a38717j69871A53405p2154B5001
8852D8239a69418e3962m1183H9991a44628j11710i2213j48131E9791J6232a56818
8840c8036A32131a85608A18766e9733k2162J520k15090a5851o4152J0714j71493
8829b40782i0582C0114d16842J77804J10399k5722d4531A12140f9317E5280b26856
$$ y = [-64513, 219390, 37607, -235630, 48940, -117496, 36036, -40173, 210422, 18564, 129988, 137402, 263709, 198069, 150585, -155735, -132457, 20779, -138717, -308588, 153405, 81251, 25001, 48239, -169418, -53962, -95145, 89991, -144628, -256338, -92213, -240344, 59791, 76023, -156818, -38036, 132131, -185608, 118766, -59733, -81895, -80375, -295465, -15851, -80003, -69289, -240782, -90582, 30114, -416842, -239038, -128639, -154361, -44531, 112140, -69317, 55280, -226856]
$$ [...]
##END NTUPLES=NMR SPECTRUM
##END=
