
##TITLE=AC1045_TOLI01_5867591_BXtukkqvlH
##JCAMPDX= 6.0         $$ Bruker NMR JCAMP-DX V2.0
##DATA TYPE= NMR SPECTRUM
##DATA CLASS= NTUPLES
##ORIGIN= BRUKER
##OWNER= Administrator
$$ 1.72 TOPSPIN		Version 2.1
$$ 2012-03-30 20:40:10.765 -0500  Administrator@TOPSPIN
$$ Compression mode = diff/dup
##.OBSERVE FREQUENCY= 400.13188235
##.OBSERVE NUCLEUS= ^1H
##.ACQUISITION MODE= SIMULTANEOUS (DQD)
##.ACQUISITION SCHEME= undefined
##.AVERAGES= 64
##.DIGITISER RES= 22
##SPECTROMETER/DATA SYSTEM= spect
##.PULSE SEQUENCE= noesygpps1d.comp
##.SOLVENT NAME= COFFEE_meoh
##.SHIFT REFERENCE= INTERNAL, COFFEE_meoh, 1, 14.96673
##AUDIT TRAIL= $$ (NUMBER, WHEN, WHO, WHERE, PROCESS, VERSION, WHAT)
$$ ##TITLE= Audit trail, TOPSPIN		Version 2.1
$$ ##JCAMPDX= 5.01
$$ ##ORIGIN= Bruker BioSpin GmbH
$$ ##OWNER= Administrator
$$ $$ C:\Bruker\TOPSPIN/data/COFFEE/nmr/AC1045_TOLI01_5867591_BXtukkqvlH/12/pdata/1/auditp.txt
$$ ##AUDIT TRAIL=  $$ (NUMBER, WHEN, WHO, WHERE, PROCESS, VERSION, WHAT)
(   1,<2012-03-30 20:40:06.046 -0500>,<Administrator>,<TOPSPIN>,<go>,<TOPSPIN 2.1>,
      <created by zg
	started at 2012-03-30 20:28:34.468 -0500,
	POWCHK enabled, PULCHK disabled,
       configuration hash MD5:
       1A 1E CE 29 27 FD 77 03 67 4E F0 E3 C4 B2 CB 90
       data hash MD5: 64K
       3A F6 F7 D8 17 24 89 84 A3 8A 05 E7 A2 B3 AD BF>)
(   2,<2012-03-30 20:40:08.781 -0500>,<Administrator>,<TOPSPIN>,<proc1d>,<TOPSPIN 2.1>,
      <Start of raw data processing
       efp LB = 0.3 FT_mod = 6 PKNL = 1 PHC0 = 0 PHC1 = 0 SI = 128K 
       data hash MD5: 128K
       74 9A 86 72 67 1A 96 05 1E 2A 92 65 46 07 15 CF>)
(   3,<2012-03-30 20:40:10.015 -0500>,<Administrator>,<TOPSPIN>,<proc1d>,<TOPSPIN 2.1>,
      <pk PHC0 = 31.5802 PHC1 = 0 
       data hash MD5: 128K
       81 97 10 FC 22 8C F6 C2 96 5A 0F 2D D8 54 28 CE>)
(   4,<2012-03-30 20:40:10.250 -0500>,<Administrator>,<TOPSPIN>,<proc1d>,<TOPSPIN 2.1>,
      <abs ABSG = 1 
       data hash MD5: 128K
       1A A3 26 47 D7 99 E0 72 9E 1D 67 21 5A E8 04 EE>)
(   5,<2012-03-30 20:40:10.312 -0500>,<Administrator>,<TOPSPIN>,<proc1d>,<TOPSPIN 2.1>,
      <abs ABSG = 2 
       data hash MD5: 128K
       E0 72 7C B1 5A 23 21 0F 42 D3 9F 03 54 2C B6 3E>)
(   6,<2012-03-30 20:40:10.406 -0500>,<Administrator>,<TOPSPIN>,<proc1d>,<TOPSPIN 2.1>,
      <abs ABSG = 3 
       data hash MD5: 128K
       79 63 01 41 07 97 A1 7E EB 0D BC CF B4 B9 78 D7>)
(   7,<2012-03-30 20:40:10.625 -0500>,<Administrator>,<TOPSPIN>,<proc1d>,<TOPSPIN 2.1>,
      <abs ABSG = 4 
       data hash MD5: 128K
       C8 41 33 B6 86 DB E5 0C F1 58 C8 0E D2 74 1E B1>)
(   8,<2012-03-30 20:40:10.687 -0500>,<Administrator>,<TOPSPIN>,<proc1d>,<TOPSPIN 2.1>,
      <abs ABSG = 5 
       data hash MD5: 128K
       C2 CC 0D AA 2E 47 8C 51 80 98 A8 30 8A 3D E0 49>)
$$ ##END=
$$ 
$$ $$ hash MD5
$$ $$ 5D 4C D1 36 0B C1 8C 38 4C B8 21 E5 24 A7 45 51
##$RELAX= 
##$RELAX= 
##$RELAX= 
##$RELAX= 
##$RELAX= 
##$RELAX= 
##$RELAX= 
##$RELAX= 
$$ Bruker specific parameters
$$ [...]
##$TP07= 0
##$TPNAME0= <>
##$TPNAME1= <>
##$TPNAME2= <>
##$TPNAME3= <>
##$TPNAME4= <>
##$TPNAME5= <>
##$TPNAME6= <>
##$TPNAME7= <>
##$TPOAL= (0..7)
0.5 0.5 0.5 0.5 0.5 0.5 0.5 0.5
##$TPOFFS= (0..7)
0 0 0 0 0 0 0 0
##$TUNHIN= 0
##$TUNHOUT= 0
##$TUNXOUT= 0
##$USERA1= <user>
##$USERA2= <user>
##$USERA3= <user>
##$USERA4= <user>
##$USERA5= <user>
##$V9= 5
##$VALIST= <valist>
##$VCLIST= <CCCCCCCCCCCCCCC>
##$VD= 0
##$VDLIST= <DDDDDDDDDDDDDDD>
##$VPLIST= <PPPPPPPPPPPPPPP>
##$VTLIST= <TTTTTTTTTTTTTTT>
##$WBST= 2048
##$WBSW= 25
##$XGAIN= (0..3)
0 0 0 0
##$XL= 0
##$YL= 0
##$YMAX_a= 9745428
##$YMIN_a= -5569123
##$ZGOPTNS= <>
##$ZL1= 120
##$ZL2= 120
##$ZL3= 120
##$ZL4= 120
##$ABSF1= 14.96673
##$ABSF2= -5.5858
##$ABSG= 5
##$ABSL= 3
##$ALPHA= 0
##$AQORDER= 0
##$ASSFAC= 0
##$ASSFACI= 0
##$ASSFACX= 0
##$ASSWID= 0
##$AUNMP= <proc_prof1d_extract.lims>
##$AXLEFT= 0
##$AXNAME= <>
##$AXNUC= <1H>
##$AXRIGHT= 0
##$AXTYPE= 0
##$AXUNIT= <>
##$AZFE= 0.1
##$AZFW= 0.1
##$BCFW= 0
##$BC_mod= 0
##$BYTORDP= 0
##$COROFFS= 0
##$CY= 15
##$DATMOD= 1
##$DC= 0
##$DFILT= <>
##$DTYPP= 0
##$F1P= 0
##$F2P= 0
##$FCOR= 0.5
##$FTSIZE= 131072
##$FT_mod= 6
##$GAMMA= 0
##$GB= 0
##$INTBC= 1
##$INTSCL= 1
##$ISEN= 128
##$LB= 0.3
##$LEV0= 0
##$LPBIN= 0
##$MAXI= 10000
##$MC2= 0
##$MEAN= 0
##$ME_mod= 0
##$MI= 0
##$NCOEF= 0
##$NC_proc= -3
##$NLEV= 6
##$NOISF1= 0
##$NOISF2= 0
##$NSP= 0
##$NTH_PI= 0
##$NZP= 0
##$OFFSET= 14.96673
##$PC= 1
##$PHC0= 31.5802
##$PHC1= 0
##$PH_mod= 1
##$PKNL= yes
##$PPARMOD= 0
##$PPDIAG= 0
##$PPIPTYP= 0
##$PPMPNUM= 2147483647
##$PPRESOL= 1
##$PSCAL= 4
##$PSIGN= 0
##$PYNMP= <proc.py>
##$REVERSE= no
##$SF= 400.130005555705
##$SI= 131072
##$SIGF1= 0
##$SIGF2= 0
##$SINO= 400
##$SIOLD= 131072
##$SPECTYP= <>
##$SREGLST= <1H.CDCl3>
##$SSB= 0
##$STSI= 131072
##$STSR= 0
##$SW_p= 8223.68421052632
##$SYMM= 0
##$S_DEV= 0
##$TDeff= 65536
##$TDoff= 0
##$TI= <>
##$TILT= no
##$TM1= 0
##$TM2= 0
##$TOPLEV= 0
##$USERP1= <user>
##$USERP2= <user>
##$USERP3= <user>
##$USERP4= <user>
##$USERP5= <user>
##$WDW= 1
##$XDIM= 131072
##$YMAX_p= 412968837
##$YMIN_p= -140339871
##$CURPLOT= <Network HP LaserJet P1505>
##$CURPRIN= <$Network HP LaserJet P1505>
##$DFORMAT= <normdp>
##$LAYOUT= <+/1D_H.xwp>
##$LFORMAT= <normlp>
##$PFORMAT= <normpl>
##$SURQMSG= 1
$$ End of Bruker specific parameters
$$ ---------------------------------
##NTUPLES= NMR SPECTRUM
##VAR_NAME=  FREQUENCY,     SPECTRUM/REAL,   SPECTRUM/IMAG
##SYMBOL=    X,             R,               I
##VAR_TYPE=  INDEPENDENT,   DEPENDENT,       DEPENDENT
##VAR_FORM=  AFFN,          ASDF,            ASDF
##VAR_DIM=   131072,        131072,          131072
##UNITS=     HZ,            ARBITRARY UNITS, ARBITRARY UNITS
##FACTOR=    0.0627417313425165, 1,          1
##FIRST=     8223.62146879498, -808,         -93520
##LAST=      0,             1871,            -94977
##MIN=       0,             -140339871,      0
##MAX=       8223.62146879498, 412968837,    0
$$ Real data points
##PAGE= N=1
##DATA TABLE= (X++(R..R)), XYDATA
$$ [...]
63779H37166k8413l0103l2262l2335k9665k6196k3792k2358k1101j9901j8630
63768E52410j6663j4284j3180j4159j5640j5710j4553j3309j1859r649p834q209
63756C97361j0335j1791j1361j0034q735p119n108l727l465l290k308j306j506
63743C17276k590l003j868J79J740J775L28j482k336j955j243j204k015l070l502
63728B97030k810j491r44j985l564l834k472r35l72l58o0M42N90L11j07m78n77
63711B78386j22O50R51M60j94l89l28m61p14p53n30j50L09M76j63j391k153j837
63693B72047j017m55m9N73J069Q80K70R0O55J474J978K057K038K450L461M384
63677B91905M153K698J268J083K141L653M967N614N214L993K829K214J868J842
$$ plain form
63779 837166 808753 778650 746388 714053 684388 658192 634400 612042 590941 571040 552410
63768 552410 535747 521463 508283 494124 478484 462774 448221 434912 423053 413404 405570 397361
63756 397361 387026 375235 363874 353840 345105 337986 332878 329151 325686 322396 320088 318782 317276
63743 317276 314686 311683 309815 309994 311734 313509 313837 312355 310019 308064 306821 305617 303602 300532 297030
63728 297030 294220 292729 291785 289800 286236 282402 279930 278995 278623 278265 278205 278647 279237 279548 279441 278963 278386
63711 278386 278264 278914 279865 280325 280131 279742 279414 278953 278239 277486 276956 276806 277115 277591 277428 276037 273884 272047
63693 272047 271030 270575 270526 271099 272168 273048 273318 273408 274063 275537 277515 279572 281610 284060 287521 291905
63677 291905 296058 298756 300024 301107 303248 306901 311868 317482 322696 326689 329518 331732 333600 335442
63663C35442K918N031O403N606L753L122M032M666L805K170Q79Q8m08m95k80m11
63647C76321j198k120k646k963l438l823l535k418r74M5J96k59n48j92O04J572
63631C54624K879M480N491N145L997L256L118K859K390K423L021L293K926K904
63617D02806L956N350N882N321M184K779J256Q8k15L36J331K377L081L042K239
63602D43813J132J87m43p66j031j928l880o010o721n626m027l048k299j007M53
63587D08799J100P90J64k87k09J103M056P636R904R886Q527P612Q030R075R370
63572D85556Q595Q204R869J3116J5425J5187J3757J3746J5933J8779K0657K1448
63560F60272K2027K3055K4586K6289K7877K9494L1648L4617L8218M2163M6175
$$ plain form
63663 335442 338360 343391 349794 355400 359153 362275 366307 370973 374778 376948 377827 377915 377507 377012 376732 376321
63647 376321 375123 373003 370357 367394 363956 360133 356598 354180 353206 353251 353447 353188 352640 352448 353052 354624
63631 354624 357503 361983 367474 372619 376616 379872 382990 385849 388239 390662 393683 396976 399902 402806
63617 402806 406762 412112 417994 423315 427499 430278 431534 431622 431407 431743 433074 435451 438532 441574 443813
63602 443813 444945 445132 444689 443923 442892 440964 437084 431074 424353 418727 414700 411652 409353 408346 408799
63587 408799 409899 410689 410853 410566 410357 411460 415516 423152 433056 442942 451469 459081 467111 476186 485556
63572 485556 494151 502355 512224 525340 540765 555952 569709 583455 599388 618167 638824 660272
63560 660272 682299 705354 729940 756229 784106 813600 845248 879865 918083 960246 1006421
63549A006421M9564N1528N2317N3330N5261N6838N6184N2811M7455M0638L2499
63538A554846K3494J4195M744m333j1338j4833j5586j5869j6991j8806k1211k4468
63526A453844k8150l1513l4975l9397m3751m5624m4609m2957m1967l9988l5595
63515A025318l0512k7127k4707k0822j5663j2095j1413j1558j0060o642k207K820
63503H55332Q033J2358J5149J7118J9241K1471K3424K5492K8230L1263L3875L6332
63491A127318L9426M2917M5551M6874M8092N0690N4739N8777O0823N9235N3307
63480A687749M3770L2557K1550J1430J904p136j4956k0403k2797k2601k1476k1438
63468A668153k3461k6918l0658l4506l9179m4847n0480n4798n7342n8341n8196
$$ plain form
63549 1006421 1055985 1107513 1159830 1213160 1268421 1325259 1381443 1434254 1481709 1522347 1554846
63538 1554846 1578340 1592535 1597279 1592946 1581608 1566775 1551189 1535320 1518329 1499523 1478312 1453844
63526 1453844 1425694 1394181 1359206 1319809 1276058 1230434 1185825 1142868 1100901 1060913 1025318
63515 1025318 994806 967679 942972 922150 906487 894392 882979 871421 861361 854719 852512 855332
63503 855332 863365 875723 890872 907990 927231 948702 972126 997618 1025848 1057111 1090986 1127318
63491 1127318 1166744 1209661 1255212 1302086 1350178 1400868 1455607 1514384 1575207 1634442 1687749
63480 1687749 1731519 1764076 1785626 1797056 1798960 1791824 1776868 1756465 1733668 1711067 1689591 1668153
63468 1668153 1644692 1617774 1587116 1552610 1513431 1468584 1418104 1363306 1305964 1247623 1189427
63457A189427n7395n6344n4735n1707m7226m2711l9472l7110l4499l1798l0102
63446G06328k9217k7401k3814j9767j6800j4747j2781j1245j1022j1555j1044
63435E16935q705n705l596k664k196j731j532k025l044l647k821n81J850L229
63421D83767L425L119K757K446K494L292M506N112M467K909J267Q3o06j098j670
63406E16270k146j967j099n34j176k417k670j331N92J906K426K577K696L198M486
63391E20811O165P104O987P143R038J2362J5389J6959J7453J8032J9511K1878
63379F78832K4461K6727K9107L2532L6912M0829M3225M4454M4797M3098L8491
63368A083465L2842K9427K9033K9285K8412K7855L0053L4959M0277M4386M7627
$$ plain form
63457 1189427 1132032 1075688 1020953 969246 922020 879309 839837 802727 768228 736430 706328
63446 706328 677111 649710 625896 606129 589329 574582 561801 550556 539534 527979 516935
63435 516935 508230 502525 498929 496265 494069 492338 490806 488781 485737 482090 479269 478688 480538 483767
63421 483767 487192 490311 493068 495514 498008 501300 505806 510918 515385 518294 519561 519644 519038 517940 516270
63406 516270 514124 512157 511058 510524 509348 506931 504261 502930 503522 505428 507854 510431 513127 516325 520811
63391 520811 526976 534080 541067 548210 557248 569610 584999 601958 619411 637443 656954 678832
63379 678832 703293 730020 759127 791659 828571 869400 912625 957079 1001876 1044974 1083465
63368 1083465 1116307 1145734 1174767 1204052 1232464 1260319 1290372 1325331 1365608 1409994 1457621
63357A457621N1042N5128N9808O4570O8232O9249O6660O0598N1920M1503K9839
63346B076170J7226M509o530j4262j8822k1850k4402k6151k7315k9999l5995m3968
63334A848611n0535n4187n6459n9131o1841o3172o2616o0477n6927n2286m7534
63323A223446m3424l9492l4943l0133k6124k2930j9362j4799j0054o000k213K310
63311I76282P465J1970J4986J7092J9362K2039K4754K7692L1662L6719M1557M4964
63299A276544M7376N0258N4246N8731O3017O6793O9336O9468O6733O1788N5136
63288A939426M6348L5189K2591R737k916j4644k3345k7105k6816k5738k6207k8009
63276A878511l0335l3818l9548m6939n3858n8723o1450o2468o1938o0294n8598
$$ plain form
63357 1457621 1508663 1563791 1623599 1688169 1756401 1825650 1892310 1952908 2004828 2046331 2076170
63346 2076170 2093396 2097905 2091375 2077113 2058291 2036441 2012039 1985888 1958573 1928574 1892579 1848611
63334 1848611 1798076 1743889 1687430 1628299 1566458 1503286 1440670 1380193 1323266 1270980 1223446
63323 1223446 1180022 1140530 1105587 1075454 1049330 1026400 1007038 992239 982185 976185 973972 976282
63311 976282 983747 995717 1010703 1027795 1047157 1069196 1093950 1121642 1153304 1190023 1231580 1276544
63299 1276544 1323920 1374178 1428424 1487155 1550172 1616965 1686301 1755769 1822502 1884290 1939426
63288 1939426 1985774 2020963 2043554 2053291 2050375 2035731 2012386 1985281 1958465 1932727 1906520 1878511
63276 1878511 1848176 1814358 1774810 1727871 1674013 1615290 1553840 1491372 1429434 1369140 1310542
63265A310542n7487n6125n3049m8030m2288l6843l1727k7330k5366k7041l0666
63254H74590l2753l1770k9530k8332k8073k7085k4736k1917j9498j7641j6297
63243E96958j5332j4204j2521j0899j0385j1059j1969j2366j2139j1139r123o498
63231D59324m294l060k499k302k537l028l181k750k219k066k179k202j931j333
63217D23743o97o63j434k011j190O80J981K032J864K418L226L563L749M405N217
63202D46883N397M805L863K965K645L578N542P120P321O935P282Q287Q975R405
63188E31003J0695J3112J5403J6259J5704J4925J5391J7951K1908K5013K5421
63177G22785K3852K2995K4517K7453K9817L0839L1090L1079L0687K9798K8810
$$ plain form
63265 1310542 1253055 1196930 1143881 1095851 1053563 1016720 984993 957663 932297 905256 874590
63254 874590 841837 810067 780537 752205 724132 697047 672311 650394 630896 613255 596958
63243 596958 581626 567422 554901 544002 533617 522558 510589 498223 486084 474945 465822 459324
63231 459324 455030 451970 449471 447169 444632 441604 438423 435673 433454 431388 429209 427007 425076 423743
63217 423743 423046 422383 420949 418938 417748 418428 420409 422441 424305 426723 429949 433512 437261 441666 446883
63202 446883 452280 457085 460948 463913 466558 470136 475678 482798 490119 497054 504336 512623 521598 531003
63188 531003 541698 554810 570213 586472 602176 617101 632492 650443 672351 697364 722785
63177 722785 746637 769632 794149 821602 851419 882258 913348 944427 975114 1004912 1033722
63166A033722K8273K8263K8318K8097K7898K8237K8888K8787K7140K4264K0969
63155A332856J7607J4091J0315N896J04p067j4095j9209k2450k5382k8777l1622
63143A232267l2658l1880l0053k7644k4916k2321j9958j7081j2926p874l155N79
63131A002380L870P571J1712J5405J7796J8952J9805K1218K3186K5043K6320K7143
63119A220401K7796K8150K7683K6074K3802K1938K1010K0109J7708J3525Q956
63108A457152N219J743k820q619j4662k0492k6542l2770l8148m1955m4658m6920
63096A186528m8467m8556m7056m4518m1417l7855l3874k9877k6708k5112k4792
63085G78296k4251k2244j9249j6810j5428j4246j2802j1840j1694j1094q737n282
$$ plain form
63166 1033722 1061995 1090258 1118576 1146673 1174571 1202808 1231696 1260483 1287623 1311887 1332856
63155 1332856 1350463 1364554 1374869 1380765 1380869 1373802 1359707 1340498 1318048 1292666 1263889 1232267
63143 1232267 1199609 1167729 1137676 1110032 1085116 1062795 1042837 1025756 1012830 1004956 1001801 1002380
63131 1002380 1006250 1013821 1025533 1040938 1058734 1077686 1097491 1118709 1141895 1166938 1193258 1220401
63119 1220401 1248197 1276347 1304030 1330104 1353906 1375844 1396854 1416963 1434671 1448196 1457152
63108 1457152 1462371 1464114 1461294 1452675 1438013 1417521 1390979 1358209 1320061 1278106 1233448 1186528
63096 1186528 1138061 1089505 1042449 997931 956514 918659 884785 854908 828200 803088 778296
63085 778296 754045 731801 712552 695742 680314 666068 653266 641426 629732 618638 609901 604619
63073F04619k698j894k077k266k339k471k429j877r03R7Q94J624K578L794M804
63058E99456N080M820M980O107P423P527N862L236J091O08K138M801O761O614
63044F66504M697K651J679J722K326L400M686N259M538L493L795N569P008O692
63030G24019N386M625M260K924P08k65J372M226N960O141O037O429P045P827R199
63015G95893J1073J2872J4634J6827J8988J9975J9969K0800K3576K7186K9970
63004A011763L1772L3378L5016L6541L8356M0971M4035M6886M9672N2941N6468
62993A477799N9421O1625O3733O6195O8731P0760P1850P1929P1574P1768P2876
62982B228261P4079P4283P3258P1459O9312O7198O5473O3728O0570N5010M7598
$$ plain form
63073 604619 601921 600027 597950 595684 593345 590874 588445 586568 585665 585762 586656 588280 590858 594652 599456
63058 599456 604536 609356 614336 620443 627866 635393 641255 644491 645582 646190 648328 653129 659890 666504
63044 666504 671201 673852 675531 677253 679579 682979 687665 692924 697462 700955 704750 710319 717327 724019
63030 724019 729405 734030 738290 741214 741922 741657 743029 747255 753215 759356 765393 771822 778867 786694 795893
63015 795893 806966 819838 834472 851299 870287 890262 910231 931031 954607 981793 1011763
63004 1011763 1043535 1076913 1111929 1148470 1186826 1227797 1271832 1318718 1368390 1421331 1477799
62993 1477799 1537220 1598845 1662578 1728773 1797504 1868264 1940114 2012043 2083617 2155385 2228261
62982 2228261 2302340 2376623 2449881 2521340 2590652 2657850 2723323 2787051 2847621 2902631 2950229
62971B950229L9308K9859J8322N042q202j9987l0222l9587m8791n8138o6859p3140
62959B697834p5711p5110p2402o7464o0009n1676m4899l9578l3014k3821j3907
62948B140243n619J275Q410J6049K3116K9012L3861L7526L9984M2288M5622M9302
62936B461069N1042M9604M6343M3668M2477M1567L9246L5160L0353K5602K0048
62925B886179J1964P84j2195k5218l7404m8536n8377o6931p4775q2353q9135r4057
62913B309946r6571r6886r5416r2447q8204q2918p6922p0793o5083n9806n4658
62902A430242m9793m5749m2452l9137l5557l2361k9760k6968k3768k1576k1600
62891A061521k2697k2590k0899j9445j9581k0712k1645k1894k1162j8995j5903
$$ plain form
62971 2950229 2989537 3019396 3037718 3042760 3034558 3014571 2984349 2944762 2895971 2837833 2770974 2697834
62959 2697834 2622123 2547013 2474611 2407147 2347138 2295462 2250563 2210985 2177971 2154150 2140243
62948 2140243 2134624 2135899 2144309 2160358 2183474 2212486 2246347 2283873 2323857 2366145 2411767 2461069
62936 2461069 2512111 2561715 2608058 2651726 2694203 2735770 2775016 2810176 2840529 2866131 2886179
62925 2886179 2898143 2898927 2886732 2861514 2824110 2775574 2717197 2650266 2575491 2493138 2404003 2309946
62913 2309946 2213375 2116489 2021073 1928626 1840422 1757504 1680582 1609789 1544706 1484900 1430242
62902 1430242 1380449 1334700 1292248 1253111 1217554 1185193 1155433 1128465 1104697 1083121 1061521
62891 1061521 1038824 1016234 995335 975890 956309 935597 913952 892058 870896 851901 835998
62880H35998j3675j3430j4021j3568j2113j1385j2012j2404j1070q914q051q805
62868F96550r250p872n513l993l745l836l683l485l081j875j98N76q5r44p91j36
62852F48639q4m58l98l27j628m299o404o311m538k766j916j852k344l364m599
62837F07351n292m955l939l105k863k748k125j095l34j07n3K1j43m93l95L73J063
62820E81161J006N80N02Q38J387K345L609M198L448K179J481R88j79j387j288
62805F00868l66o14k413l746l169j718r51p06m8Q45J153Q77O55O64P06Q12R67
62788E93816P39m8p42o82n6N44Q60P61P0q56j146n52K07O71J150J577J183J46
62770E97642M4J569L158L263K571K414K403J703J469L374O441P872P018O056O552
$$ plain form
62880 835998 822323 808893 794872 781304 769191 757806 745794 733390 722320 713406 705355 696550
62868 696550 687300 679428 673915 669922 666177 662341 658658 655173 652092 650217 650019 650595 650510 649566 648775 648639
62852 648639 648555 648097 647699 647372 645744 641445 635041 628730 624192 621426 619510 617658 615314 611950 607351
62837 607351 602059 597104 593165 590060 587197 584449 582324 581229 580895 580788 580735 580756 580613 580120 579725 580098 581161
62820 581161 582167 582747 583249 584087 585474 587819 591428 595626 599074 601253 602734 603722 603543 602156 600868
62805 600868 600502 599888 597475 593729 590560 588842 587891 587185 587137 587982 589135 590012 590667 591331 592037 592849 593816
62788 593816 594555 594507 593765 593083 593027 593571 594431 595192 595262 594406 593260 592708 592915 593586 594736 596313 597496 597642
62770 597642 597686 599255 602413 605676 608247 610661 613064 614767 616236 619610 626051 633923 640941 646997 653549
62755F53549P670Q256Q595R362J0550J1995J3511J4232J3537J2811J4198J7239
62743G95505J9060J8619J8342K0277K3075K4526K5043K6529K9311L2335L5244
62732A067866L8252M1000M3402M6675N1582N6635O0133O3117O7980P4739Q1164
62721A692545Q6234R0875R5255R8029R8754R8617R7956R5247Q9618Q2211P3769
62710B699110O2807M7850L0168J2436m263k0463l6152n0404o2894p4142q4241
62699B519812r2512r8567j02597j04485j03702j00460r6114r1866q7507q2029
62689A559973p5228o8278o2563n8305n4543n0485m6362m2723l9299l5252l0423
62678I96512k5646k1690j8550j5941j3833j2116j0306q110n869m093k833j755
$$ plain form
62755 653549 661219 669475 678070 687432 697982 709977 723488 737720 751257 764068 778266 795505
62743 795505 814565 833184 851526 871803 894878 919404 944447 970976 1000287 1032622 1067866
62732 1067866 1106118 1147118 1190520 1237195 1288777 1345412 1405545 1468662 1536642 1611381 1692545
62721 1692545 1778779 1869654 1964909 2062938 2161692 2260309 2358265 2453512 2543130 2625341 2699110
62710 2699110 2761917 2809767 2839935 2852371 2848108 2827645 2791493 2741089 2678195 2604053 2519812
62699 2519812 2427300 2328733 2226136 2121651 2017949 1917489 1821375 1729509 1642002 1559973
62689 1559973 1484745 1416467 1353904 1295599 1241056 1190571 1144209 1101486 1062187 1026935 996512
62678 996512 970866 949176 930626 914685 900852 888736 878430 870320 864451 860358 857525 855770
62666H55770n23J070K916M372M891N130O704J0296J4684J8188K0575K2845K5651
62653I92569K8823L2037L5092L7609L9407M1218M4411M9653N6283O2938O8573
62642A488613P3024P7032Q1652Q7224R2879R7352J00000J00759R9552R6261R0908
62631B485256Q3241P2498N8407M2203K5740R615o891k3991m0555n5342o8130p9141
62619B502910q8187r5051j00009j03248j04269j02681r9293r5566r2013q7797
62609A534796q2148p5589o9450o4502o0360n6181n1609m6972m2729l8947l5369
62598I10940l1864k8652k6049k4127k2533k0667j8206j5581j3669j2766j2153
62587F84673j1050r807r551j0595j1782j1689j0096p947o170m896l773k670j841
$$ plain form
62666 855770 855247 856317 859233 863605 868496 873626 880330 890626 905310 923498 944073 966918 992569
62653 992569 1021392 1053429 1088521 1126130 1165537 1206755 1251166 1300819 1357102 1420040 1488613
62642 1488613 1561637 1638669 1720321 1807545 1900424 1997776 2097776 2198535 2298087 2394348 2485256
62631 2485256 2568497 2640995 2699402 2741605 2767345 2776960 2770069 2746078 2705523 2650181 2582051 2502910
62619 2502910 2414723 2319672 2219663 2116415 2012146 1909465 1810172 1714606 1622593 1534796
62609 1534796 1452648 1377059 1307609 1243107 1182747 1126566 1074957 1027985 985256 946309 910940
62598 910940 879076 850424 824375 800248 777715 757048 738842 723261 709592 696826 684673
62587 684673 673623 663816 654265 643670 631888 620199 610103 602156 595986 591090 587317 584647 582806
62574E82806j470j247o79J73O51M34J29M50J100J145M34r6L51J547K823L967N084
62557E97602O093O820P353P933Q691R744J1207J2827J4073J4996J6585J9586K3220
62544G56730K5811K6739K7126K8402L0744L3347L5822L8648M2144M5541M7566
62533A138620M7824M7063M5903M3823L9884L4096K7435K0657J3814O861j14p410
62521A458456j5515k3946l1159l6279m0181m4043m7528m9372m9292m8096m6166
62510A026879m3164l9383l6124l4200l2872l0783k7438k3430j9815j7566j6844
62499G05260j6425j4635j1417q838q763j0508j1530j0168o939l470r83J88M19
62486F02191M92J104K420M061N263N121L313J047N04K491N095N852M839M482O249
$$ plain form
62574 582806 581336 580089 579410 579583 580234 580668 580797 581247 582347 583492 583926 583830 584181 585728 588551 592518 597602
62557 597602 603695 610515 617868 625801 634492 644236 655443 668270 682343 697339 713924 733510 756730
62544 756730 782541 809280 836406 864808 895552 928899 964721 1003369 1045513 1091054 1138620
62533 1138620 1186444 1233507 1279410 1323233 1363117 1397213 1424648 1445305 1459119 1465980 1465866 1458456
62521 1458456 1442941 1418995 1387836 1351557 1311376 1267333 1219805 1170433 1121141 1073045 1026879
62510 1026879 983715 944332 908208 874008 841136 810353 782915 759485 739670 722104 705260
62499 705260 688835 674200 662783 653945 645182 634674 623144 612976 606037 602567 601584 601772 602191
62486 602191 602683 603787 606207 610268 615531 620652 623965 625012 625516 628007 633102 638954 643793 648275 654524
62471F54524R048J1278J3026J5296J8045K0181K1227K1938K3354K5807K8845L1767
62459H94336L4364L7220M0904M4775M7414M8556M9635N1763N4157N5396N5218
62448A413738N3760N0013M2864L3321K3794J5140O204l489j2541j9899k6404l3026
62436A543475l8994m3062m5408m6839m6955m4704m0270l5081l0216k5984k2584
62425A123378j9865j6691j2062o908l375k067j204J034M489P894J0780J3527J5953
62412A114883J6873J5266J1648P855N252L256J48m504r035j1748j3058j4710j7550
62399A104576k0967k4120k6499k7660k7699k7754k8731k9698k8929k6426k3792
62388H12301k1589j8837j5469j3115j2416j1595r224o632n659n387l508j84J872
$$ plain form
62471 654524 663572 674850 687876 703172 721217 741398 762625 784563 807917 833724 862569 894336
62459 894336 928700 965920 1006824 1051599 1099013 1147569 1197204 1248967 1303124 1358520 1413738
62448 1413738 1467498 1517511 1560375 1593696 1617490 1632630 1638834 1635345 1622804 1602905 1576501 1543475
62436 1543475 1504481 1461419 1416011 1369172 1322217 1277513 1237243 1202162 1171946 1145962 1123378
62425 1123378 1103513 1086822 1074760 1067852 1064477 1062410 1061206 1062240 1066729 1074623 1085403 1098930 1114883
62412 1114883 1131756 1147022 1158670 1166525 1171777 1175033 1175181 1170677 1161642 1149894 1136836 1122126 1104576
62399 1104576 1083609 1059489 1032990 1005330 977631 949877 921146 891448 862519 836093 812301
62388 812301 790712 771875 756406 743291 730875 719280 710056 703424 697765 692378 688870 688686 690558
62375F90558J353J25M14J933K794K110O03q21k081l617n714q193j0495j1932j2049
62360F44988j0998r754r598j0924j2539j2723j1055q569o230m200k785k729l824
62347E39060m374l126r79K94K82j51m54n77k54N51J036P70J046L294O515Q107
62331E51040P315N921N340M985M132L546M148N481O754Q269J0662J3426J5306
62318F46325J5749J5304J5049J6006J8379K1010K2452K2915K4099K6656K9247
62307H73191L0838L2495L5686M0065M4386M8573N3363N8658O3816O8989P4716
62296A424776Q0661Q6171R1449R6603J00089R9965R6341R0647Q2832P1525N7068
62285B378127M1889K7238J1983m251j9181l0844m0612n1110o2296p1814p8443
$$ plain form
62375 690558 691911 692036 692450 694383 697177 699287 699890 699069 696988 693371 687657 679464 668969 657037 644988
62360 644988 633990 624236 614638 603714 591175 578452 567397 558828 552598 548398 545613 542884 539060
62347 539060 534686 531560 530581 530875 531157 531006 530552 529975 529721 530272 531308 532078 533124 536418 542933 551040
62331 551040 558355 564276 569616 574601 578733 582279 586427 591908 598662 606931 617593 631019 646325
62318 646325 662074 677378 692427 708433 726812 747822 770274 793189 817288 843944 873191
62307 873191 904029 936524 972210 1012275 1056661 1105234 1158597 1217255 1281071 1350060 1424776
62296 1424776 1505437 1591608 1683057 1779660 1879749 1979714 2076055 2166702 2249534 2321059 2378127
62285 2378127 2420016 2447254 2459237 2454986 2435805 2404961 2364349 2313239 2250943 2179129 2100686
62274B100686q3052q6402q8036q7515q5092q0953p5168o8666o2795n7524n1445
62263A274038m4181l7563l3577l2037l1187k9873k8247k6872k6121k6165k6720
62252I31495k6908k6063k4592k3390k2521k1176j9041j6898j5537j4575j2962
62241G07832j0486q202p125o896o196m519k906k462k622j810J42J393N77j012
62227F55708q25J754M880O819P784Q816J0019J0769J0882J0700J0432J0366J1369
62214G59473J4172J8066K1225K2585K2849K3480K5287K8224L1924L5937L9772
62203A042994M3185M6312M9404N2756N7014O2916P0276P7653Q3708Q8599R3384
62192A768201R8222J01801J02478R9232R1638Q0014O5907N1467L7589K3338P911
$$ plain form
62274 2100686 2017634 1931232 1843196 1755681 1670589 1589636 1514468 1445802 1383007 1325483 1274038
62263 1274038 1229857 1192294 1158717 1126680 1095493 1065620 1037373 1010501 984380 958215 931495
62252 931495 904587 878524 853932 830542 808021 786845 767804 750906 735369 720794 707832
62241 707832 697346 689144 682019 675123 668927 664408 661502 659040 656418 654608 654750 656143 656720 655708
62227 655708 654883 656637 661517 668336 676120 684936 694955 705724 716606 727306 737738 748104 759473
62214 759473 773645 791711 812936 835521 858370 881850 907137 935361 967285 1003222 1042994
62203 1042994 1086179 1132491 1181895 1234651 1291665 1354581 1424857 1502510 1586218 1674817 1768201
62192 1768201 1866423 1968224 2070702 2169934 2261572 2341586 2407493 2458960 2496549 2519887 2527798
62181B527798p640k1624l4080m6489n9272p1013q0515q8143r4429r8530r9339
62170A826724r7302r3924q9894q4977p9488p4440o9943o4751n8019n0668m4391
62159A018927l9854l6428l3233k9883k6498k3436k0880j8581j6226j4092j2738
62148G47078j1982j0874r010p118n907n071m022k985k557k566k175r28R47K919
62134F85749M364M877N056O444R840J3995J6921J8095J8459J8638J8472J8132
62122H39042J8291J9005J9711K0544K2319K4816K6501K6718K6927K8800L2027
62111A104701L5123L7663M0501M4269M8732N3471N8374O3505O9090P5225Q0976
62100A711630Q4262Q3560P9418P3308O5316N4239L9959K4483J0132k376j3553
$$ plain form
62181 2527798 2520158 2498534 2464454 2417965 2358693 2287680 2207165 2119022 2024593 1926063 1826724
62170 1826724 1729422 1635498 1545604 1460627 1381139 1306699 1236756 1172005 1113986 1063318 1018927
62159 1018927 979073 942645 909412 879529 853031 829595 808715 790134 773908 759816 747078
62148 747078 735096 724222 715212 708094 702187 697116 693094 690109 687552 684986 682811 681883 682830 685749
62134 685749 690113 694990 700046 706490 716330 730325 747246 765341 783800 802438 820910 839042
62122 839042 857333 876338 896049 916593 938912 963728 990229 1016947 1043874 1072674 1104701
62111 1104701 1139824 1177487 1217988 1262257 1310989 1364460 1422834 1486339 1555429 1630654 1711630
62100 1711630 1795892 1879452 1958870 2032178 2097494 2151733 2191692 2216175 2226307 2223931 2210378
62089B210378k3742l2890m1205m9124n6635o3075o7733p0404p1328p0745o8592
62078A594905o4651n9054n2503m5826l9345l2969k6860k1576j7309j3470r430
62067A211912n604l300l264m752o255p036p492q132q706q646p973p345p412q462
62053A117533j0434j2782j4516j5070j4995j5136j5227j4219j2031r848q305o572
62041I68398l985j478k51J96J276L040M195M365M888O872R582J1446J1952J1921
62027A032417J2418J3883J6031J8119J9496K0170K0688K1424K2322K3370K4856
62016A245194K6940K9370L1780L4048L6153L8053L9889M1967M4305M6445M8004
62005A662148M9316N1181N3942N6843N8576N8674N8062N7589N6093N0946M1149
$$ plain form
62089 2210378 2186636 2153746 2112541 2063417 2006782 1943707 1875974 1805570 1734242 1663497 1594905
62078 1594905 1530254 1471200 1418697 1372871 1333526 1300557 1273697 1252121 1234812 1221342 1211912
62067 1211912 1206308 1203008 1199744 1194992 1188737 1181701 1174209 1166077 1157371 1148725 1140752 1133407 1125995 1117533
62053 1117533 1107099 1094317 1079801 1064731 1049736 1034600 1019373 1005154 993123 983275 974970 968398
62041 968398 964413 962935 962684 962880 964156 967196 971391 975756 980644 987516 997098 1008544 1020496 1032417
62027 1032417 1044835 1058718 1074749 1092868 1112364 1132534 1153222 1174646 1196968 1220338 1245194
62016 1245194 1272134 1301504 1333284 1367332 1403485 1441538 1481427 1523394 1567699 1614144 1662148
62005 1662148 1711464 1762645 1816587 1873430 1932006 1990680 2048742 2106331 2162424 2213370 2254519
61994B254519K8883J7062O258m557j5102k3796l0631l7836m6784n5963o3125o8017
61982A960911p1694p4380p5602p5600p4985p3454p0349o6198o2278n8713n4363
61971A203295m8668m2406l6605l1884k8879k7826k7392k5353k1232j7201j5535
61960H80314j5980j6563j6203j5482j5214j5336j5159j4096j2153j0082q902q789
61948G16355q756p914o725o252o391n786l681j042O39J157J562K525L336K714
61934F81741L68k546m464m760l999l183k946l411m393n535o503p330q421r867
61920F14751j0990j0970r933q940q698q721q179p201o665o700o243m511k296r74
61906E13730o36j91P17J137N50N9P91K011K125J100M32Q51J596K171L169M648
$$ plain form
61994 2254519 2283402 2300464 2306722 2302165 2287063 2263267 2232636 2194800 2148016 2092053 2028928 1960911
61982 1960911 1889217 1814837 1739235 1663635 1588650 1515196 1444847 1378649 1316371 1257658 1203295
61971 1203295 1154627 1112221 1075616 1043732 1014853 987027 959635 934282 913050 895849 880314
61960 880314 864334 847771 831568 816086 800872 785536 770377 756281 744128 734046 725144 716355
61948 716355 707599 699685 692960 686708 680317 674531 670850 669808 670447 671604 673166 675691 679027 681741
61934 681741 682109 679563 675099 670339 666340 663157 660211 656800 652407 646872 640369 633039 624618 614751
61920 614751 603761 592791 582858 573918 565220 556499 548320 541119 534454 527754 521511 517000 514704 513730
61906 513730 513094 512903 513620 514757 515307 515366 516157 518168 520293 521393 521825 522676 524272 526443 529612 534260
61890E34260N260M322L564N196Q793J1757J2784J3234J4796J7238J9240K0350
61878F70794K1082K1676K1763K1248K0788K1083K1891K2089K0855J8682J6885
61867H98836J5998J5160J3459J1243R320P368M311K38l273n127n926o653p149
61854I47805o708n469m326l789l618l261k014P86M944R055J1759J3194J4559J6308
61840I89225J7509J6964J4325J0053M916j32m130o590p942r370j1891j5289j8002
61827I79646j8660j7756j7096j7379j7389j6069j4287j3446j3332j2749j1704
61816H09779j1242j1483j1449j0905j0622j0617r818q058o706o515o323m920k888
61803F98233j376j25J895M675P374R795J2346J4818J6457J7157J7670J8681K0391
$$ plain form
61890 534260 539520 543842 547406 552602 561395 573152 585936 599170 613966 631204 650444 670794
61878 670794 691876 713552 735315 756563 777351 798434 820325 842414 863269 881951 898836
61867 898836 914834 929994 943453 954696 964016 971384 975695 975933 972660 967533 961607 954954 947805
61854 947805 941097 935628 931302 927513 923895 920634 918620 919406 924350 933405 945164 958358 972917 989225
61840 989225 1006734 1023698 1038023 1048076 1052992 1052860 1048730 1042140 1034198 1024828 1012937 997648 979646
61827 979646 960986 943230 926134 908755 891366 875297 861010 847564 834232 821483 809779
61816 809779 798537 787054 775605 764700 754078 743461 733643 725585 718879 712364 706041 701121 698233
61803 698233 696857 696732 698627 703302 710676 720471 732817 747635 764092 781249 798919 817600 837991
61790H37991K2720K5275K7412K9009L0602L2147L2415L0612K7796K5379K3001
61779A144359J9452J5048J1248Q161M485J1l929o800r534j2062j2415r688o085
61766A142251m210l607j851J855O099R645J2313J3633J2582R155M794P00l311
61753A200048p903j3088j8371k3168k6788k8766k9631l0551l1854l2551l1747
61742I25630k9846k7756k5594k2949k0111j8151j7620j7701j6983j5015j2770
61731G01134j1411j0830r897q245o942o795o859n803m300m346o075p083n742l558
61717F03248k905l672l943l232k921l546l727k424p27m14j665l092l440k606j534
61702E63400j578l265n239n208k665J92J083L83K5M78M58n06j072k86P80N76p07
$$ plain form
61790 837991 860711 885986 913398 942407 973009 1005156 1037571 1068183 1095979 1121358 1144359
61779 1144359 1163811 1178859 1190107 1198268 1202753 1202764 1198835 1192035 1182501 1170439 1158024 1148336 1142251
61766 1142251 1138041 1134434 1132583 1134438 1140537 1150182 1162495 1176128 1188710 1197865 1202659 1203359 1200048
61753 1200048 1192145 1179057 1160686 1137518 1110730 1081964 1052333 1021782 989928 957377 925630
61742 925630 895784 868028 842434 819485 799374 781223 763603 745902 728919 713904 701134
61731 701134 689723 678893 668996 660751 653809 647014 640155 634352 630052 625706 619631 612548 606806 603248
61717 603248 600343 596671 592728 589496 586575 583029 579302 576878 576151 575737 574072 570980 567540 564934 563400
61702 563400 561822 558557 553318 548110 545445 545637 546720 547103 547128 547606 548064 547558 546486 546200 546980 547556 546849
61685E46849j648j683j435j228o16L99P70k35j783k397j785r38n42j27R16K282
61669E36799L241L544L201J937j00j499p41J681L566L803L556M002M311L133J062
61654E71496K9O08J527J650J022J9j118j724j093J60M25p90k200k644k404k099
61638E62864j593r21j077k712m866o145o427o404o126n268m303m027m091l333
61624E05571j621j71P1n99j543k642l694l850k482k85J255J533J373J561J401
61609D95878m25l438m982l149O69L373L839L519L643L761L398L056K635Q97k095
61594E10579l747k115J052K446J502M12N94J392K031K569K747J833N0j357j719
61579E18269j247O2K225M061M087K756J892J795R36j087k623k805l022m361n610
$$ plain form
61685 546849 545201 543518 542083 540855 540239 540638 541408 541173 539390 536993 535208 534270 533728 533601 534517 536799
61669 536799 540040 543584 546785 548722 548622 547123 546382 548063 551629 555432 558988 562990 567301 570434 571496
61654 571496 571525 572133 573660 575310 576332 576351 575233 573509 572416 572576 573001 572211 570011 567367 564963 562864
61638 562864 561271 560350 559273 556561 551695 545550 539123 532719 526593 521325 517022 512995 508904 505571
61624 505571 503950 503779 503850 503251 501708 499066 495372 491522 489040 488755 490010 491543 492916 494477 495878
61609 495878 495453 492015 487033 483884 484553 487926 491765 495284 498927 502688 506086 509142 511777 512674 510579
61594 510579 506832 504717 505769 508215 509717 510129 510723 512115 514146 516715 519462 521295 521345 519988 518269
61579 518269 517022 517084 519309 523370 527457 530213 532105 533900 534836 533749 531126 528321 525299 520938 515328
61564E15328n414m682n018o005n907m321k467j355r10n58K96J877L312L065R02
61549D88143j371k090j745j933l199m979o731p919p784o430n470o170p572p780
61535D16970o522n166m599m494m245l449j857n3L92j247l353l739k513j596j828
61520C72701k349k719l685n426o721o546n316l911k636j608j194j331j218k48
61506C27793J198K221K211J147l94j470j566j061n20N9O26M38p66j576m66J709
61490C29583K558J555P69J627K835K506R64L1L70Q34J81j445k670k168j13J683
61474C39100J590J50o16K05J660K739L506L881K961O09j536j925j091n82p48q81
61458C49022r41j519k409k671k258k235l044l656l023j523l29J99P81J977L155
$$ plain form
61564 515328 509914 505232 500214 494209 488302 483981 481514 480159 479249 478691 478987 480864 484176 487241 488143
61549 488143 486772 484682 482937 481004 477805 472826 466095 458176 450392 443962 438492 432322 424750 416970
61535 416970 410448 405282 400683 396189 391944 388495 386638 386585 386977 385730 382377 378638 376125 374529 372701
61520 372701 370352 367633 363948 358522 351801 345255 339939 336028 333392 331784 330590 329259 328041 327793
61506 327793 328991 331212 333423 334570 334176 332706 331140 330079 329559 329618 330244 330682 329916 328340 327874 329583
61490 329583 332141 333696 334465 336092 338927 341433 342397 342428 342798 343632 343813 342368 339698 337530 337417 339100
61474 339100 340690 340840 340224 340429 342089 344828 348334 352215 355176 355785 354249 352324 351233 350651 349903 349022
61458 349022 348081 346562 344153 341482 339224 336989 333945 330289 327266 325743 325414 325613 326394 328371 331526
61443C31526K982R53j765l251k653r19L54M74p1n19o43q48j594k730l375k781
61427C15140j318j29K66N31J440K726L373K729R89j046k309j928N4K408L496K497
61411C28919pk362k857j009J805L367K658P08o59n68N68J866K647K627K004J337
61395C41044J021R39Q47Q91J420K308K739J896p9j878k111q00N32O06j18j81R07
61378C49983K207K727K475K025J792J965K566L326L957M582N379N907N521M392
61364C98804L268K226P52q65j473p55K73R67J859L066L351J987L49N7N06j1j333
61347D13028j520R8J759J720M59l88l36m01j442k940l446k128K06J699J220o19
61331D06969k228k527j489K01J652K260K192K121K253K103J542J256J580J654
$$ plain form
61443 331526 334508 335461 333696 330445 327792 326873 327227 327701 327630 327111 326468 325620 324026 321296 317921 315140
61427 315140 313822 313693 313959 314490 315930 318656 322029 324758 325747 324701 322392 320464 320518 322926 326422 328919
61411 328919 328912 326550 323693 322684 324489 327856 330514 331222 330563 329995 330563 332429 335076 337703 339707 341044
61395 341044 342065 343004 343851 344742 346162 348470 351209 353105 353026 351148 349037 348237 348769 349375 349257 349076 349983
61378 349983 352190 354917 357392 359417 361209 363174 365740 369066 373023 377605 382984 388891 394412 398804
61364 398804 402072 404298 405050 404185 402712 401957 402230 403197 405056 408122 411473 413460 413809 413866 414372 414361 413028
61347 413028 411508 411606 413365 415085 415544 415156 414820 414419 412977 410037 406591 404463 404669 406368 407588 406969
61331 406969 404741 402214 400725 400926 402578 404838 407030 409151 411404 413507 415049 416305 417885 419539
61317D19539O61o59q63K51J462J737J033j68j126q26J161L689M879M074K304R60
61301D38108Q39K204M529O163N616L535K306L198M921N612N205M952N325N470
61287D97983M600L179K423K878L707L651K735K449L688N221N222L924L349M363
61273E49372N617N793N425N575N988N676M506L044J496j03j168j194p30o12n68
61258E88117K94J791K656K379J835J894K445L185M401O293Q324R911J1193J2482
61244F57200J3406J3413J2728J1963J0964Q999O240M173M012N206N992N195L101
61231G62592R10k80k06L40O7j646m133o202p294p614p425o947o661o899p031n939
61215F95632l686j877j847l021l611k594m76J395J878Q07o62q79N66K243K547
$$ plain form
61317 419539 420200 419541 418678 418929 420391 422128 423161 422993 421867 421041 422202 425891 430770 434844 437148 438108
61301 438108 438947 441151 445680 451843 457459 460994 463300 466498 471419 477031 482236 487188 492513 497983
61287 497983 502583 505762 508185 511063 514770 518421 521156 523605 527293 532514 537736 541660 545009 549372
61273 549372 554989 560782 566207 571782 577770 583446 587952 590996 592492 592389 591221 590027 589297 588685 588117
61258 588117 588411 590202 592858 595237 597072 598966 601411 604596 608997 615290 623614 633525 644718 657200
61244 657200 670606 684019 696747 708710 719674 728673 734913 739086 743098 748304 754296 759491 762592
61231 762592 763502 763222 763016 763356 763423 761777 757644 751442 744148 736534 729109 722162 715501 708602 701571 695632
61215 695632 691946 690069 688222 685201 681590 678996 678520 679915 681793 682600 681938 681059 681625 683868 686415
61200F86415J640J095J968L783N266N381L998K097J061J225J492R98N05J198K677
61185G20799L516L422L426L837L706K712K059K623L395K758O65j396k196j780
61171G47546j072r29j336j311M4K238L891M564N128O027O355N472M433M755O475
61156G92280Q509J0257J1604J1916J0491Q071O526O810Q095R134R601R812R934
61143I13040R926R771R382Q644P715O966O550O411O661P463Q498R182R432R602
61129A029243R533Q460O236L882K359J362J20j132j390n41J76l04j652k848l588
61114A049916m330n196n601n149m391m369n474p018p914p745p170p152p789q206
61100I62412p817p268p499q205q178p233o642p181p931p862p609q314r451r424
$$ plain form
61200 686415 688055 689150 691118 694901 700167 705548 709546 711643 712704 713929 715421 716419 716924 718122 720799
61185 720799 724315 727737 731163 735000 738706 741418 743477 746100 749495 752253 752918 751522 749326 747546
61171 747546 746474 745545 744209 742898 742942 745180 749071 753635 758763 764790 771145 776617 781050 785805 792280
61156 792280 800789 811046 822650 834566 845057 853128 859654 866464 874559 883693 893294 903106 913040
61143 913040 922966 932737 942119 950763 958478 965444 971994 978405 985066 992529 1001027 1010209 1019641 1029243
61129 1029243 1038776 1047236 1053472 1057354 1059713 1061075 1061195 1060063 1058673 1058132 1058308 1058004 1056352 1053504 1049916
61114 1049916 1045586 1040390 1034789 1029640 1025249 1020880 1015406 1008388 1000474 992729 985559 978407 970618 962412
61100 962412 954595 947327 939828 931623 923445 916212 909570 902389 894458 886596 878987 870673 861222 851798
61086H51798q149p326p923q968r329r268r375r199q125o739o126o202n735l894
61072G45440j090J512K793K412J336J285L011N442P037P588Q095R339J1218J3193
61058H18611J4685J5383J5736J6803J9016K1584K3743K5906K8618L1001L1481
61047A062567K9809K7254K5029K3596K3139K3301K2564J9518J5022J1691J0759
61036A294249J0798R966Q142O046L583L06l478p115j0496j3585j5747j6581j6829
61023A249259j7348j7750j7235j6342j6449j7609j8176j6934j4560j2488j1180
61012A073188j0070q651o934n124l317j555J39J858L903O586R767J2645J4498
60999A086933J5782J7916K1514K5413K8106K9776L2032L5819M0432M4616M7901
$$ plain form
61086 851798 843649 836323 828400 819432 810103 800835 791460 782261 774136 767397 761271 755069 749334 745440
61072 745440 744350 745862 748655 751067 752403 753688 756699 762141 769178 776766 784861 794200 805418 818611
61058 818611 833296 848679 864415 881218 900234 921818 945561 971467 1000085 1031086 1062567
61047 1062567 1092376 1119630 1144659 1168255 1191394 1214695 1237259 1256777 1271799 1283490 1294249
61036 1294249 1305047 1315013 1323155 1329201 1332784 1333090 1329612 1322497 1312001 1298416 1282669 1266088 1249259
61023 1249259 1231911 1214161 1196926 1180584 1164135 1146526 1128350 1111416 1096856 1084368 1073188
61012 1073188 1063118 1054467 1047533 1042409 1039092 1037537 1037676 1039534 1043437 1050023 1059790 1072435 1086933
60999 1086933 1102715 1120631 1142145 1167558 1195664 1225440 1257472 1293291 1333723 1378339 1426240
60988A426240N0664N3611N7396O2246O7743P3373P9268Q5929R3318J00885J08407
60977B259080J16009J23406J30213J37039J45259J55300J66368J78199J91891
60968C602764K08225K26472K45775K66645K90146L16834L47738L85010M29971
60959F319580M81789N40122O07622O87059P77338Q76539R88452J120744J275655
60950A3674900J448931J639972J850179K053794K170960K093500J764201J239506
60942B7935943O67227J96238r5841k02724j52260L036J65333K00000L196m23831
60932B8296317r69362j482160j853155k047221k084984k011151j872633j706507
60924A4269144j534712j366753j206864j058045r21679p97852o87429n92071n11994
$$ plain form
60988 1426240 1476904 1530515 1587911 1650157 1717900 1791273 1870541 1956470 2049788 2150673 2259080
60977 2259080 2375089 2498495 2628708 2765747 2911006 3066306 3232674 3410873 3602764
60968 3602764 3810989 4037461 4283236 4549881 4840027 5156861 5504599 5889609 6319580
60959 6319580 6801369 7341491 7949113 8636172 9413510 10290049 11278501 12399245 13674900
60950 13674900 15123831 16763803 18613982 20667776 22838736 24932236 26696437 27935943
60942 27935943 28603170 28799408 28703567 28500843 28348583 28351619 28516952 28716952 28720148 28296317
60932 28296317 27326955 25844795 23991640 21944419 19859435 17848284 15975651 14269144
60924 14269144 12734432 11367679 10160815 9102770 8181091 7383239 6695810 6103739 5591745
60915E591745m45476l90658l45912l08571k75584k46031k21045k00765j83170
60906B974533j66548j51238j38077j26655j16046j05983r6583q8154q1686p8019
60896A825544p5878p2540o7262o2344n9571n7458n3524m7856m2536l8598l5404
60885A212573l2375k9602k6991k4265k1597j9254j7068j5190j4665j6011j7922
60874I77633j8712j8425j8140j7855j6782j5279j4648j4946j4638j2803j0338
60863H05067q726q633r886j1619j2361j1150q805p124o723o662o272o028o407
60850F94671p013p373p517p337o312m384k473j585j917k936l698l196j306N98
60836F38222R79J53j37P05J300M42j247k472k885k720j830j09J754K780K542J169
$$ plain form
60915 5591745 5146269 4755611 4409699 4101128 3825544 3579513 3358468 3157703 2974533
60906 2974533 2807985 2656747 2518670 2392015 2275969 2169986 2073403 1985249 1903563 1825544
60896 1825544 1749666 1677126 1609864 1547520 1487949 1430491 1376967 1329111 1286575 1247977 1212573
60885 1212573 1180198 1150596 1123605 1099340 1077743 1058489 1041421 1026231 1011566 995555 977633
60874 977633 958921 940496 922356 904501 887719 872440 857792 842846 828208 815405 805067
60863 805067 796341 787708 777822 766203 753842 742692 733887 726763 720040 713378 707106 701078 694671
60850 694671 687658 680285 672768 665431 659119 654735 652262 650677 648760 645824 642126 638930 637624 638222
60836 638222 639201 639354 639217 639922 641222 641664 640417 637945 635060 632340 630510 630401 632155 634935 637477 638646
60820F38646p85j993r87J961M524M876L906L846N377P353Q869J0166J1475J2339
60806G09573J2541J2739J3541J4463J4411J3065J1514J1382J3217J5712J6805
60795H58963J5875J4487J4627J6428J8226J8817J8946K0241K2958K5412K5830
60784A070810K4434K3112K2963K3062K2113K0518J9617J9260J7702J4183J0131
60773A287905P009M208K20m971r946j3875j7246k0701k4160k7217k9616l1191
60761A120419l1962l2303l2501l2189l0755k8328k5887k4340k3871k4064k4195
60750H10024k3546k1901j9714j7495j5302j3226j1820j1372j1091r969q295p292
60738F39001p258p148o194m905m102l876l986m332m402l268j033N38j1j739k518
$$ plain form
60820 638646 637861 635868 634881 636842 641366 646242 650148 653994 659371 666724 675593 685759 697234 709573
60806 709573 722114 734853 748394 762857 777268 790333 801847 813229 826446 842158 858963
60795 858963 874838 889325 903952 920380 938606 957423 976369 996610 1019568 1044980 1070810
60784 1070810 1095244 1118356 1141319 1164381 1186494 1207012 1226629 1245889 1263591 1277774 1287905
60773 1287905 1294914 1299122 1299342 1294371 1284425 1270550 1253304 1232603 1208443 1181226 1151610 1120419
60761 1120419 1088457 1056154 1023653 991464 960709 932381 906494 882154 858283 834219 810024
60750 810024 786478 764577 744863 727368 712066 698840 687020 675648 664557 654588 646293 639001
60738 639001 631743 624595 618401 613496 609394 605518 601532 597200 592798 589530 588497 589035 589024 587285 584767
60723E84767j942j583k361l246l143k527k218j800p41j47j571m282n658m690l376
60708E45482l732m930m783l115j880k347l697m583m780m773m777m714m595m517
60694D88259m582m966n561n557m135j727J73O98M68M68Q42J180J294J126M82n04
60678D67958j192j180r03r83j438j920k197j983r41N86J484J202N91O15Q48K36
60662D60783j170k347k893l259l467k874j514n35q36j995l087l839m507n184n801
60647D17475o341o535n719l645j262j49j003k941m319m111k590q73J38M56P12
60632C79293J302J935K075J639J080Q44Q96Q79O06K16j80p33j461j904j608q79
60616C84000m70m98j41J272L381N264O417O855O615N706M384L147K340J928J594
$$ plain form
60723 584767 582825 581242 578881 575635 572492 569965 567747 565947 565206 565059 563488 559206 553548 548858 545482
60708 545482 541750 536820 532037 528922 527042 524695 520998 516415 511635 506862 502085 497371 492776 488259
60694 488259 483677 478711 473150 467593 463458 461731 461904 462602 463070 463538 464380 465560 466854 467980 468462 467958
60678 467958 466766 465586 464683 463700 462262 460342 458145 456162 455221 455807 457291 458493 459084 459699 460547 460783
60662 460783 459613 457266 454373 451114 447647 444773 443259 442724 441888 439893 436806 432967 428460 423276 417475
60647 417475 411134 404599 398880 395235 393973 393824 392821 389880 385561 381450 378860 377987 378125 378581 379293
60632 379293 380595 382530 384605 386244 387324 388168 389064 389943 390549 390765 390585 389852 388391 386487 384879 384000
60616 384000 383530 383032 382891 384163 387544 392808 399225 406080 412695 418401 422785 425932 428272 430200 431794
60601D31794J103P28J155K605M225N005N125N575O394O472N490M742N232O011
60587D91656N569M075K909K443J733K53j324k246k599k937l657m829n990o267
60573D78789n424m610n217o997q174p463n350l359k691l404m253l584j164J106
60559D18205J093j135l555m449l503j242J180J984K57k352k974r34J487K078J162
60544D07302N09J072K472L699L768K497J060Q24J561J947J750J975K639K385R13
60529D36373j51K43J068J331J615K189J630o14k159p47J961K555J100J159M509
60514D52062Q611J0119Q755O712N834O465P964R431J0297J0656J0575R447O799
60501E63727L433O63j273k859l808l475k555k509l233l098j625k14M61J800M938
$$ plain form
60601 431794 432897 433625 434780 437385 441610 446615 451740 457315 463709 470181 475671 480413 485645 491656
60587 491656 497225 501300 504209 506652 508385 508638 507314 505068 502469 499532 495875 491046 485056 478789
60573 478789 473365 468755 463538 456541 448367 440904 435554 432195 429504 426100 421847 418263 417099 418205
60559 418205 419298 418163 414608 410159 406656 405414 406594 408578 408835 406483 403509 402575 404062 406140 407302
60544 407302 407811 408883 411355 415054 418822 421319 422379 423203 424764 426711 428461 430436 433075 435460 436373
60529 436373 436222 436465 437533 438864 440479 442668 444298 443684 441525 440778 442739 445294 446394 447553 452062
60514 452062 460673 470792 479547 486259 492093 498558 506522 515953 526250 536906 547481 556928 563727
60501 563727 567160 567823 566550 563691 559883 556408 553853 551344 548111 545013 543388 543174 543635 545435 550373
60486E50373Q591J0659J0789J0206R895J0127J0884J1591J1066Q865O102M057
60474F63205K559O79j660l788n343o113n462l236q96l83j825l381l393j816L45
60459F29492J988K346J485P01J535M072O812Q404Q887R098R538J0254J1315J2977
60445G18904J5494J8860K2569K5688K7632K8855L0389L2602L4834L6186L6161
60434A028174L4428L0599K4629J7155R094J018o941j4842k2700l0226l6563m0664
60422I93161m2272m2324m1892m0864l8210l3759k9041k5798k3989k2075j9239
60411F33698j6376j4559j3450j2137j0792j0332j0636j0426r027p162n681m577
60399E08543l704l406l773m165m230m537n412n968n232l631k422k146k582l530
$$ plain form
60486 550373 558964 569623 580412 590618 600513 610640 621524 633115 644181 653046 659148 663205
60474 663205 665764 666443 664783 660995 655652 649539 644077 640841 639945 639562 637737 634356 630963 629147 629492
60459 629492 631480 633826 635311 636012 637547 641619 648431 656835 665722 674820 684358 694612 705927 718904
60445 718904 734398 753258 775827 801515 829147 858002 888391 920993 955827 992013 1028174
60434 1028174 1062602 1093201 1117830 1134985 1144079 1145097 1138156 1123314 1100614 1070388 1033825 993161
60422 993161 950889 908565 866673 825809 787599 753840 724799 699001 675012 652937 633698
60411 633698 617322 602763 589313 577176 566384 556052 545416 534990 525963 518801 513120 508543
60399 508543 504839 501433 497660 493495 489265 484728 479316 473348 468116 464485 462063 459917 457335 453805
60385D53805m607m781l342j076O10J354J533R25q14k651k937j711n88j72N79J944
60369D38071K359Q25j252j945j384r36p75J63K100L742L749K059k21j637j278
60354D43640N22K437L369L132J974K58j066q60N25J000p29l186l884k428n09O44
60338D44839J315K051K835L607M288M269L115J848K121L741M452K828K83o80O01
60323D81513K562L416K847K009K244L540M309L277J445J162L066N174N515M448
60309E26527L506K975K015N35m20j12J079K421L543M328M804N330O299P435P854
60294E78119P092N746M946N323O618Q096R177R634R264P654M555M92l438o379
60280F46899q115q756q586q211q118p872o520m230k718l277n017n807m688k564
$$ plain form
60385 453805 449198 444417 441075 439999 440609 441963 443496 444421 443607 440956 438019 436308 435720 435548 436127 438071
60369 438071 440430 441255 440003 438058 436674 435738 434963 435126 437226 440968 444717 446776 446555 444918 443640
60354 443640 444162 446599 449968 453100 455074 455332 454266 453406 453931 454931 454202 451016 447132 444704 444195 444839
60338 444839 446154 448205 451040 454647 458935 463204 466319 468167 470288 474029 478481 481309 481592 480912 481513
60323 481513 484075 487491 490338 492347 494591 498131 502440 505717 507162 508324 511390 516564 522079 526527
60309 526527 530033 533008 535023 535558 535138 535026 536105 538526 542069 546397 551201 556531 562830 570265 578119
60294 578119 585211 590957 595903 601226 607844 615940 625117 634751 644015 651669 656224 656716 653278 646899
60280 646899 638784 630028 621442 613231 605113 597241 590721 586491 583773 580496 575479 569672 564984 562420
60266E62420r10n80j635l380m515m035k204j17J610L101M278M545L761K856K995
60251E68190M411O288P673Q381R233J1301J4628J7823J9268J8528J6192J2728
60239G14644Q300L564m71l611o735j0511j4481j7681j9454j9445j7603j4747j2333
60226E89436j1027j0079q652p092o145n643m984m388m390m399l091m10J980K600
60212E23716J533k96k187l469l374k008o92m31p41q35j172k470l821l514j767
60197D98472q18j770k964k469q93k89j167k111j998j092n3Q43J285J016O43J306
60181D87941L091M676N052M638M128L283J816O83J168K884L814K641K72j280j011
60166E23796L80J572J912J629J129M88k01m27K57J534K687L558M450N069M572
$$ plain form
60266 562420 561510 560930 559295 555915 551400 547365 545161 545044 546654 549755 554033 558578 562339 565195 568190
60251 568190 572601 578889 586562 594943 604176 615477 630105 647928 667196 685724 701916 714644
60239 714644 722944 726508 726037 722426 715691 705180 690699 673018 653564 634119 616516 601769 589436
60226 589436 578409 568330 559678 552586 546441 540798 535814 531426 527036 522637 519546 519136 521116 523716
60212 523716 525249 524953 522766 519297 515923 513915 513223 512792 512051 511216 510044 507574 503753 500239 498472
60197 498472 497654 495884 492920 490451 489558 489269 488102 485991 483993 482901 482848 483691 484976 485992 486635 487941
60181 487941 491032 495708 500760 505398 509526 512809 514625 515308 516476 519360 523174 525815 526087 524807 523796
60166 523796 524176 525748 527660 529289 530418 530906 530705 530278 530535 532069 534756 538314 542764 547833 552405
60151E52405L005J706J703K408K679K484K770M118O299Q547R651Q535N760L766
60137F15836M295O121O734N806N219N711N664L892J743J078J528J370K51n67m66
60122F64215l25r10j676j802j510j553j898j833j273j107j971l277m054m279m634
60107F32113n173n158m343l452l002k598j902j450j706k091j933j608j713j720
60093E94264q55K94N69K64O86J737J854O01n09m08J63N29J510L537M978M142J974
60076F15330Q09J046R95l8n26Q35K980L826K943J801J600J831J345K35r8J187
60060F36101L099M065L885L627L762L551K458J051O1n47r33o73M89J843K507K595
60044F66941K847L425L779L476K628J630Q60M56J58k53l93K35J118J045j14r71
$$ plain form
60151 552405 555410 557116 558819 561227 563906 566390 569160 573278 579577 588124 597775 606310 612070 615836
60137 615836 620131 626252 632986 638792 644011 649722 655386 659278 661021 662099 663627 664997 665248 664681 664215
60122 664215 663890 662980 661304 659502 657992 656439 654541 652708 651435 650328 648357 645080 641026 636747 632113
60107 632113 626940 621782 617439 613987 610985 608387 606485 605035 603329 601238 599305 597697 595984 594264
60093 594264 593409 593703 594272 594536 595222 596959 598813 599414 598905 598497 598660 599189 600699 604236 609214 613356 615330
60076 615330 616139 617185 618180 618142 617616 618451 621431 625257 628200 630001 631601 633432 634777 635012 634914 636101
60060 636101 639200 643265 647150 650777 654539 658090 660548 661599 661660 661113 660180 659507 659996 661839 664346 666941
60044 666941 669788 673213 676992 680468 683096 684726 685586 686042 686200 685947 685554 685789 686907 687952 687838 686867
60028F86867n33M85R21P04K50n41j509j437N22L157M387L760K576J822J263L93
60012G03087q65k365l717m303m191m546o145p919q287p447p007p590q312q488
59998F21905q374q189p776p280o901o085m347k744k726l613l208j301k38j181
59984E57942k063p37J623K338J228O43J949L903M739M296L603L318L296L234L085
59969E92397K795K031N37j219k316k528k606l002l085k472k212l295m673m620
59955E65732l615l704n009n388m052k923l270l520k228r11j571l263l788l447
59941E19043m060n083m033q66J277N74j020j079j90k58j162j242j81O92P00O21
59925E03733J122J767J997J911J628Q22l64p47N36K502L159J937K44o63j210k231
$$ plain form
60028 686867 686334 686819 687740 688444 688694 688153 686644 685207 685729 688886 693273 697033 699609 701431 702694 703087
60012 703087 702222 699857 696140 691837 687646 683100 676955 669036 660749 653302 646295 638705 630393 621905
59998 621905 613531 605342 597566 590286 583385 577300 572953 570209 567483 563870 560662 559361 559123 557942
59984 557942 555879 555142 556765 559103 560331 560974 562923 566826 571565 575861 579464 582782 586078 589312 592397
59969 592397 595192 597223 597760 596541 594225 591697 589091 586089 583004 580532 578320 575025 570352 565732
59955 565732 562117 558413 553404 548016 543964 541041 537771 534251 532023 531112 529541 526278 522490 519043
59941 519043 514983 509900 505867 505001 506278 506852 505832 504753 504563 504305 503143 501901 501720 502412 503112 503733
59925 503733 504855 506622 508619 510530 512158 512980 512616 511869 512405 514907 518066 520003 520247 519584 518374 516143
59909E16143l184k921j756j195j612j651m07J162J730J409J069P69m3j319k361
59894E05833k709k297j090O60K151K787K839K790K463J627Q68Q62J154P65j69
59879E18534n38OM76n6j376k598l030k486j386n87n52p49m34K11M77L31L38N29
59861E07110N08N27J246K310K492J564Q28J255K245K786K892L096L449L785M159
59846E40252M363L767K471J709K138K538J396o80j547l37J627K748K852K671K764
59831E68732L360M333M863L981K089J149K520N161O899P027O585O371N994N213
59817F34277M753N034N044L704J679N93O79O37j78q57p29o04j327k130j671o9
59801F48835J319J855K157K976M512O713R002R821P756L597P3j009m90j71m11
$$ plain form
59909 516143 512959 510038 508282 507087 505475 503824 503417 504579 506309 507718 508787 509556 509513 508194 505833
59894 505833 503124 500827 499737 500397 502548 505335 508174 510964 513427 515054 515922 516784 517938 518703 518534
59879 518534 517996 518002 518478 518422 517046 514448 511418 508932 507546 506959 506407 505658 505224 505435 505912 506243 506581 507110
59861 507110 507618 508145 509391 511701 514193 515757 516585 517840 520085 522871 525763 528859 532308 536093 540252
59846 540252 544615 548382 550853 552562 554700 557238 558634 557954 556407 556070 557697 560445 563297 565968 568732
59831 568732 572092 576425 581288 585269 587358 588507 591027 596188 603087 610114 616699 623070 629064 634277
59817 634277 639030 644064 649108 652812 654491 655084 655763 656400 656222 655365 654636 654032 652705 650575 648904 648835
59801 648835 650154 652009 654166 657142 661654 668367 677369 687190 694946 698543 698616 697607 697117 696946 696535
59786F96535l62J29N8j352l717o122q111r850j1509j2736j2801j1430r427q035
59772F01270p505o825n180l139j842j399r39q6N31M51K01L44K91j017l393n216
59756E66547n207l793k275j320q36q78j661k744l088k238q60J96O99P00J59p01
59740E42700j293j441j584j780j312QR95N60p75j866k679l675m123k890o59M88
59724E20674o9q50q30p79j313j464m66M65l18k454m051l961k463l08J660K429
59708E05902J675M55J66R97K164L121L596L100J687P54J621L478M099K744J040
59693E36599P37J750K775K886K129J303J441K727L893L562K248J848K982M131
59679E71011L910K901K389K496K647K883L441L635K546N71r15j343j318j333j142
$$ plain form
59786 696535 696173 696302 696360 695008 691291 685169 677058 667208 655699 642963 630162 618732 609305 601270
59772 601270 593765 586940 581760 578621 576779 575380 574441 574355 574886 575337 575538 575882 576173 575156 571763 566547
59756 566547 561340 557547 555272 553952 553116 552238 550577 547833 544745 542507 541647 541843 542542 543242 543401 542700
59740 542700 541407 539966 538382 536602 535290 535298 536293 536853 536078 534212 531533 527858 523735 520845 520186 520674
59724 520674 520605 519755 518925 518146 516833 515369 514903 515368 515050 512596 508545 504584 502121 501813 503473 505902
59708 505902 507577 508032 508198 509195 511359 514480 518076 521176 522863 523617 525238 528716 532815 535559 536599
59693 536599 537336 539086 541861 544747 546876 548179 549620 552347 556240 559802 562050 563898 566880 571011
59679 571011 574921 577822 580211 582707 585354 588237 591678 595313 597859 598430 597515 596172 594854 593521 592379
59664E92379n20K64R79J663K192K339K374K796L351L173K177J322J091P10m02
59649F15888j324q41O97J799J846J539J507J476J043K73o72j708k383k065q67
59634F16208L33J086J714K166J576l06k104k270r48M94J309J631J428M77o98j129
59618F20967q73r83j874k736k912k780k693k203j121n36j644m016n901o127n127
59603E79441m188m169m778m751l106n06J130P94l46m83N98J546J339K68o53m85
59587E61651J181L657N132M238J657n94j474j566j517j150n53p33k202l791l986
59572E59950k954k087j826j174M15J814J621J08j010n96P74J772J834J393R65
59557E60999N18k27j231k123k596k625k412k245k292k382k080j209k08K38l5m69
$$ plain form
59664 592379 591859 592123 593102 594765 596957 599296 601670 604466 607817 610990 613167 614489 615580 616290 615888
59649 615888 614564 613723 614420 616219 618065 619604 621111 622587 623630 623903 623231 621523 619140 617075 616208
59634 616208 616541 617627 619341 621507 623083 622777 620673 618403 617455 617949 619258 620889 622317 622794 622096 620967
59618 620967 620094 619111 617237 614501 611589 608809 606116 603913 602792 602256 600612 596596 590695 584568 579441
59603 579441 575253 571084 566306 561555 558449 557943 559073 559867 559521 559038 559636 561182 562521 562789 562136 561651
59587 561651 562832 566489 571621 575859 577516 576922 575448 573882 572365 571215 570662 569929 567727 563936 559950
59572 559950 556996 554909 553083 551909 552324 554138 555759 555867 554857 554261 555035 556807 558641 560034 560999
59557 560999 561517 561290 560059 557936 555340 552715 550303 548058 545766 543384 541304 540095 539887 540125 540090 539621
59541E39621l26O31J930K621J943N2j839k359j260L06Q22k47k012k874j839N84
59525E35754K727L191K028M58m62p05r11j586k692l774m322m152l479k537j253
59510E18285L92J715J585k83k532l204j725M75J512J059M46Q75K004K585K137
59495E25326J359J021J170J611K456L670M678N068N309O007O744O553N577N344
59481E81893O978R809J2272J3773J5152J7334J9851K0790J8277J2175M382k653
59469G30033p565j0176j0617r288p473o744p214p213n399k643r98j255k279k670
59455F48499k228j623j358j392j571j979k801l799m224l642k859l359n411p390
59441F04863p623o384n254m896m537l649k859k772k874k287j017J92Q24P78M9
$$ plain form
59541 539621 539295 539926 541856 544477 546420 546472 544633 542274 541014 541320 542142 541895 539883 537009 535170 535754
59525 535754 538481 541672 543700 544158 543696 542991 542080 540494 537802 534028 529706 525554 522075 519538 518285
59510 518285 518677 520392 521977 521694 519162 515958 514233 514708 516220 517279 517725 518600 520604 523189 525326
59495 525326 526685 527706 528876 530487 532943 536613 541291 546359 551668 557675 564419 570972 576549 581893
59481 581893 588871 598680 610952 624725 639877 657211 677062 697852 716129 728304 732686 730033
59469 730033 722468 712292 701675 692387 684914 678170 670956 663743 658344 655701 654703 653448 651169 648499
59455 648499 646271 644648 643290 641898 640327 638348 635547 631748 627524 623882 621023 617664 612253 604863
59441 604863 597240 590856 585602 580706 576169 572520 569661 566889 564015 561728 560711 560903 561727 562505 562554
59426E62554j129k054k090j273m0J427K990M042L978L088K314K052J936J833K245
59411E81873L346M363M446L704K857K245J725J302J286J894L011M297N235N322
59397F26906M535L483K761K465K543L226M541N788O243O289P024Q696J0283J0737
59383G05520R960Q301N877K912J44j754k891l837m815n545n709n270m532m050
59369F94311m152m363l768k233o94J54Q87K449M689O570P672Q618J0187J2622
59355G32949J5748J9066K1766K3526K5317K8362L1786L2223K6709J5823L433o497
59343I70211j2408j4826j4646j2317q303l525R63M350N734L721k732j2644k2725
59330H80853k9441l1443k9801k6338k2431j9116j7214j6633j6045j3979j0367
$$ plain form
59426 562554 561425 559371 557281 556008 555968 557395 560385 564427 568405 571493 573807 575859 577795 579628 581873
59411 581873 585219 589582 594028 597732 600589 602834 604559 605861 607147 609041 612052 616349 621584 626906
59397 626906 631441 634924 637685 640150 642693 645919 650460 656248 662491 668780 675804 684500 694783 705520
59383 705520 715480 723781 729658 732570 732714 730960 728069 724232 719417 713872 708163 702893 698361 694311
59369 694311 690159 685796 682028 679795 679101 679255 680142 682591 687280 693850 701522 710140 720327 732949
59355 732949 748697 767763 789529 813055 838372 866734 898520 930743 957452 973275 976708 970211
59343 970211 957803 942977 928331 916014 907711 904186 905149 909499 915233 918954 916222 903578 880853
59330 880853 851412 819969 790168 763830 741399 722283 705069 688436 672391 658412 648045
59319F48045o767m846m649m600l388j603q37j285j217N60K732L152J831Q34J304
59304F29266K223K418K306K785L664M282M867O053P490Q105P646P002P006P644
59290G02757Q408Q791Q415P480P024Q080J0312J2194J2731J2413J2146J1929J1234
59277H33914J0362J0432J1718J2581J0917O680K327K08rm92k138l432k857j317
59263H88894j076k849n048n943n571n147n295n390m449k273K52K058K993L894
59249H55050N292O393N756K854j551o372j0927j4708j7136j7828j6830j4474j1451
59236G64068q947q048q675r563r506q279o206l566r61M45m9j460j725J66K994
59221G00688M577M062K668K107K526K459R68p33n87J649M006M830M639M898N826
$$ plain form
59319 648045 641278 636432 631783 627183 623795 622192 621355 620070 618853 619413 622145 625297 627128 627962 629266
59304 629266 631489 633907 636213 638998 642662 646944 651811 657864 665354 673459 681105 688107 695113 702757
59290 702757 711165 719956 728371 735851 742875 750955 761267 773461 786192 798605 810751 822680 833914
59277 833914 844276 854708 866426 879007 889924 896604 898931 899139 899130 898638 896500 893068 890211 888894
59263 888894 887818 884969 879921 873978 868407 863260 857965 852575 848126 845853 846105 848163 851156 855050
59249 855050 860342 866735 872491 875345 873794 867422 856495 841787 824651 806823 789993 775519 764068
59236 764068 755121 747073 738398 728835 719329 711050 704844 701278 700317 700762 700713 699253 697528 697694 700688
59221 700688 705265 709327 711995 714102 716628 719087 720055 719322 718735 720384 724390 729220 733859 738757 744583
59206G44583O500O594O706P007O724N284L086P92j313k837l002j660r0K7j685
59191G76716m096n881o545o396o014n711n228m173l036l091m685o195n788l861
59177G06016k443k288j994m48J439K332K476K836L239K890K127J935J951P31j824
59162G18975m031m870n225n878n910m489k927l140m706n311l993k179j346j328
59148F63642j518k081l037l380k385r81m54m36M07J968K645J838R93J502K827
59133F61550L571L366K626J323m97j510j22L052N293N008L582L064L163K078k17
59118F95330j358L61L671N878N880M787M031L937M047M032L859L607L417L476
59104G44955L719L872L993M676O288Q152Q986Q222O437M431K486P65k83n35o71
$$ plain form
59206 744583 751083 757677 764383 771390 778114 783398 786484 787276 785963 783126 780124 778464 778374 778401 776716
59191 776716 772620 766739 760194 753798 747784 742073 736845 732672 729636 726545 721860 715665 709877 706016
59177 706016 703573 701285 699291 698843 700282 702614 705090 707926 711165 714055 716182 718117 720068 720799 718975
59162 718975 714944 710074 704849 698971 693061 688572 685645 682505 677799 672488 668495 666316 664970 663642
59148 663642 662124 660043 657006 653626 651241 650260 649806 649370 649777 651745 654390 656228 657221 658723 661550
59133 661550 665121 668487 671113 672436 671939 670429 670307 673359 678652 683660 687242 690306 693469 695547 695330
59118 695330 693972 694333 698004 703882 709762 714549 718580 722517 726564 730596 734455 738062 741479 744955
59104 744955 748674 752546 756539 761215 767503 775655 784641 792863 799300 803731 806217 806982 806699 806164 805493
59089H05493j224j619j177p94k173n153p348p198o046o028o931o742m802k664
59075G45594j774j856k026k259k898l585l487k400j182j013k230l655l467j196
59061G12566J506K804K976L643N092N876N227M256M146M588M792M781M667L904
59047G70824K527K004L401N419N829M453L131L000L314L105K578K474L082M226
59033H19367N408N720M454K095n1j345k301l458m619n412n793n731n109m244l863
59018G95118m237m857n252n497n765n948o045o268o538o424n872n393n288n288
59004G16446n208n228n182m383k736j365j421k661l889m464m728n113n453n198
58990F59417l956j858K91J395R28n53j853k014r03P49J877K002J635J426J139
$$ plain form
59089 805493 804269 802650 801473 800679 798506 793353 786005 778807 772761 766733 759802 753060 748258 745594
59075 745594 743820 741964 739938 737679 734781 731196 727709 725309 724127 723114 720884 717229 713762 712566
59061 712566 714072 716876 719852 723495 728587 734463 739690 743946 748092 752680 757472 762253 766920 770824
59047 770824 773351 775355 778756 784175 790004 794457 797588 800588 803902 807007 809585 812059 815141 819367
59033 819367 824775 830495 834949 837044 836993 835648 833347 829889 825270 819858 814065 808334 803225 798981 795118
59018 795118 790881 786024 780772 775275 769510 763562 757517 751249 744711 738287 732415 727022 721734 716446
59004 716446 711238 706010 700828 696445 693709 692344 690923 688262 684373 679909 675181 670068 664615 659417
58990 659417 655461 653603 653894 655289 656217 655664 653811 651797 650894 651643 653520 655522 657157 658583 659722
58975F59722K23q15p38N26J543J553J700L090M746M915L699K806L026L623M226
58960F93845N520P560Q981Q913Q453R032J0115R893P928N805M988N196N259M705
58946G96193L896L224K825K781L000L092K924L045L877M601L900K013R60K010
58932H38341L825M219L136K432K965L499K859J762J560K239K730K543K105J898
58918H76113K199L278M955O195O141N410N487O876Q727J0276J1619J2896J3730
58905I73902J3901J3708J3281J2257J0655R361R038R137Q687P660O742O048M953
58892A099330L140J111n33j763k892m152n695p594r558j0841j0828r641q149p459
58878A024476q277j0303j2136j2208j0288p878o731p169q146q684q603p925o552
$$ plain form
58975 659722 659945 659130 658392 658918 660461 662014 663714 666804 671550 676465 680164 682970 685996 689619 693845
58960 693845 699365 706925 715906 724819 733272 742304 752419 762312 770240 776045 781033 786229 791488 796193
58946 796193 800089 803313 806138 808919 811919 815011 817935 820980 824857 829458 833358 835371 836331 838341
58932 838341 842166 846385 849521 851953 854918 858417 861276 863038 864598 866837 869567 872110 874215 876113
58918 876113 878312 881590 886545 892740 898881 904291 909778 916654 925381 935657 947276 960172 973902
58905 973902 987803 1001511 1014792 1027049 1037704 1047065 1056103 1065240 1073927 1081587 1088329 1094377 1099330
58892 1099330 1102470 1103581 1103048 1101285 1098393 1094241 1088546 1080952 1071394 1060553 1049725 1040084 1031935 1024476
58878 1024476 1016199 1005896 993760 981552 971264 963386 956655 949486 941340 932656 924053 916128 909576
58865I09576m887l961m224m645l949k417j511j719j845q82M23P13N9q3J124K858
58849H84630L748L423K650K441L340N348Q065J0817J2880J3825J3806J3404J3116
58836I91493J2854J2112J0628Q761P214O599P189Q773J0579J1823J2491J3275
58824A113791J4424J5152J4522J2610J0354Q546P496P239P341O616M018n3l918
58811A218138o328p496q363r541j1253j3482j5620j6496j5485j3465j2049j1950
58799A076610j2563j3034j3164j3099j2666j1474r622p953p421q236r716j0976
58787I46686j1554j1365j0484r326q795r526j0866j1202r766p631o459o520o510
58774H26682n295l327k097k495l942n055n001m081l095k376j702r10j18P47J999
$$ plain form
58865 909576 904689 900728 896504 891859 887910 885493 883982 882263 880418 879536 879959 880672 880731 880648 881772 884630
58849 884630 888378 891801 894451 896892 900232 905580 913645 924462 937342 951167 964973 978377 991493
58836 991493 1004347 1016459 1027087 1035848 1043062 1049661 1056850 1065623 1076202 1088025 1100516 1113791
58824 1113791 1128215 1143367 1157889 1170499 1180853 1189399 1196895 1204134 1211475 1218091 1222109 1222056 1218138
58811 1218138 1211810 1204314 1195951 1186410 1175157 1161675 1146055 1129559 1114074 1100609 1088560 1076610
58799 1076610 1064047 1051013 1037849 1024750 1012084 1000610 990988 983035 975614 967378 957662 946686
58787 946686 935132 923767 913283 903957 895162 885636 874770 863568 853802 846171 839712 833192 826682
58774 826682 821387 818060 815963 813468 809526 804471 799470 795389 792294 789918 788216 787306 787188 787935 789934
58759G89934L468M206L581K376K122L365N167O355O559N874M308K241Q61J241
58745H41658K971M433M534L549K074n1k979n594o206m834l805n210q229r989r016
58730H03306o825n823o482p252o715m960l048j945k030l006m012m209l457k181
58716G41361p22P98J990K180J087r53l395n686p017o785n580m940n562o433o317
58701F94026n343m347l429k287j442j651k314j938m07O62L28k87J61J185J430
58686F74347Q63P70J825L370M508N008N010M667M307M386N015N759O009N414M086
58671G35344K707K245L204N144P016P861P263N694M495M745N799N747L940K100
58657H03304K073L387M217M131M299N364O621P275P087N771L350J273J457L574
$$ plain form
58759 789934 793402 797608 801189 803565 805687 809052 814219 820574 827133 833007 837315 839556 840417 841658
58745 841658 844629 849062 853596 857145 859219 859168 856189 850595 844389 839555 835750 830540 822311 812322 803306
58730 803306 796481 790658 784176 776924 770209 765249 762201 760256 758226 755220 751208 746999 743542 741361
58716 741361 740639 741437 743427 745607 746694 745741 742346 736660 729643 722858 717278 712338 706776 700343 694026
58701 694026 688683 684336 680907 678620 677178 675527 673213 671275 670868 671530 671858 671571 671732 672917 674347
58686 674347 675210 675980 677805 681175 685683 690691 695701 700368 704675 709061 714076 719835 725844 731258 735344
58671 735344 738051 740296 743500 748644 755660 763521 770784 776478 780973 785718 791517 797264 801204 803304
58657 803304 805377 808764 812981 817112 821411 826775 833396 840671 847758 853529 856879 858152 859609 863183
58643H63183M873L533P44j519l275n680q444r949r666q987r462j1128j2696j2836
58629G78691j1324r292q187q239q438q184p992q142p804o486n295n369n835n000
58615F73104l082j926k038j847l97J025J069N95J334L011L506J936J24M02K736
58600F79552M881N105L835K476J485L62j043k210k878l269l297k593j551j285
58586F79570j943k211j212J42O47O18J000J536J305M31k38p02j459j919r20J233
58570F75878K865L287L363L575L264K371K136L137M123L957L394L746M812N532
58556G25440N801O252O638O024M506L469L865N106N939N837N217M749M649M499
58542G97991L598J676o41k135j907k35J445J718O55k49N8Q81R64M36M57J269J907
$$ plain form
58643 863183 868056 871589 872333 870814 867539 861859 853415 843466 833800 824813 815351 804223 791527 778691
58629 778691 767367 758075 749888 741649 733211 725027 717035 708893 701089 694603 689308 683939 678104 673104
58615 673104 670022 668096 666058 664211 663814 664839 665908 666503 667837 670848 674354 676290 676414 676816 679552
58600 679552 684433 689538 693373 695849 697334 697696 696653 694443 691565 688296 684999 682406 680855 679570
58586 679570 677627 675416 674204 674346 674993 675611 676611 678147 679452 679883 679645 678943 677484 675565 674645 675878
58570 675878 678743 682030 685393 688968 692232 694603 696739 699876 703999 707956 711350 715096 719908 725440
58556 725440 731241 737493 744131 750155 754661 758130 761995 767101 773040 778877 784094 788843 793492 797991
58542 797991 801589 803265 802624 800489 798582 798347 799792 801510 802165 801916 801974 802855 803819 804255 804712 805981 807888
58525H07888K027K541L996N475N888N448N068N135N599O583P999R139R274Q447
58511H90507P195O034N581O421Q323J0127J1038J1427J1932J2517J2988J3634
58499A007724J4622J5473J5769J5716J5462J4767J3906J3762J4161J3328J0201
58488A164891O167L164J211o03j914j928j572k416l969m461m156n061p230q351
58474A133772p819q169j0883j3613j3913j3218j4175j5732j4458j0079o171n071
58462A000471n327n065m876n583n799l967j335k88p14m70R87J855R84o46j929
58447I68298k975l653k790j93K147K388J161N4r51k638m190l988k418j464j526
58432I47262r54P77J777P45p40k97K205N086P069P709O656M230K219K562N276
$$ plain form
58525 807888 809915 812456 816452 821927 827815 833263 838331 843466 849065 855648 863647 872786 882060 890507
58511 890507 897702 903736 909317 915738 924061 934188 945226 956653 968585 981102 994090 1007724
58499 1007724 1022346 1037819 1053588 1069304 1084766 1099533 1113439 1127201 1141362 1154690 1164891
58488 1164891 1171058 1174222 1175433 1174830 1172916 1170988 1169416 1167000 1163031 1158570 1154414 1149353 1142123 1133772
58474 1133772 1125953 1117784 1106901 1093288 1079375 1066157 1051982 1036250 1021792 1011713 1005542 1000471
58462 1000471 995144 990079 985203 979620 973821 969854 968519 968231 967517 967047 968034 969889 970873 970227 968298
58447 968298 965323 961670 958880 958687 960834 963222 964383 964437 963486 960848 956658 952670 950252 948788 947262
58432 947262 946308 947085 948862 949607 948867 948570 950775 955861 962930 970639 977295 981525 983744 986306 991582
58417I91582Q571J0824J1590J1110R858Q440P291O504O286O885P710P415N671
58404A099737L914L332L017J460q05j627p8K512M347M874M681M679N398O372O393
58389A148206N139M043M517N813N938M452K955K744L197K792Q26k055m324m697
58375A179546l422k147j929j906q36J022K810M838P512R420Q900P210P364R557
58361A227939J0559Q682O591P467J0495J2278J1294Q872O597M845L508K521J626
58348A323274O60Lj43m06j282k019j517j17O82J05j135j883j519N2K453M815O294
58331A328317O790O729O323N585M974N275O630Q113Q592P834O566N529M723L751
58317A415731K770K606L611M947N552N516N770O630P558Q286R197J0378J1226
$$ plain form
58417 991582 1000153 1010977 1022567 1033677 1043535 1051975 1059266 1065770 1072056 1078941 1086651 1094066 1099737
58404 1099737 1103651 1106983 1110000 1111460 1110655 1109028 1108950 1111462 1115809 1120683 1125364 1130043 1135441 1141813 1148206
58389 1148206 1153345 1157388 1161905 1167718 1173656 1178108 1181063 1183807 1187004 1189796 1190622 1188567 1184243 1179546
58375 1179546 1176124 1173977 1172048 1170142 1169306 1170328 1173138 1177976 1185488 1194908 1203808 1211018 1218382 1227939
58361 1227939 1238498 1247180 1253771 1261238 1271733 1284011 1295305 1304177 1310774 1315619 1319127 1321648 1323274
58348 1323274 1323934 1323937 1323794 1323388 1322106 1320087 1318570 1318453 1319135 1319240 1318105 1316222 1314703 1314755 1317208 1322023 1328317
58331 1328317 1335107 1341836 1348159 1353744 1358718 1363993 1370623 1378736 1387328 1395162 1401728 1407257 1411980 1415731
58317 1415731 1418501 1421107 1424718 1429665 1435217 1440733 1446503 1453133 1460691 1468977 1478174 1488552 1499778
58304A499778J1430J1546J2099J2770J2968J2767J2838J3725J5415J7260J8331
58293A650927J8309J7924J7947J7892J6692J4600J3252J3519J4430J4775J4736
58282A825003J5210J6371J7700J8900K0006K1030K1978K2871K3424K3251K2669
58271B048413K2747K4114K6174K7755K8182K7606K6856K6957K8106K9148K8847
58260B344905K7667K7191K7831K8317K7723K6691K6266K6721K7988K9976L1966
58249B653242L2823L2487L2204L2815L4020L5651L8086M0862M2577M3024M3710
58238C061501M5217M5877M4640M3508M5120M9014N2430N4047N4961N6254N7663
58227C610232N8807O0278O2979O6969P1217P4237P5444P6078P8111Q1927Q6098
$$ plain form
58304 1499778 1511208 1522754 1534853 1547623 1560591 1573358 1586196 1599921 1615336 1632596 1650927
58293 1650927 1669236 1687160 1705107 1722999 1739691 1754291 1767543 1781062 1795492 1810267 1825003
58282 1825003 1840213 1856584 1874284 1893184 1913190 1934220 1956198 1979069 2002493 2025744 2048413
58271 2048413 2071160 2095274 2121448 2149203 2177385 2204991 2231847 2258804 2286910 2316058 2344905
58260 2344905 2372572 2399763 2427594 2455911 2483634 2510325 2536591 2563312 2591300 2621276 2653242
58249 2653242 2686065 2718552 2750756 2783571 2817591 2853242 2891328 2932190 2974767 3017791 3061501
58238 3061501 3106718 3152595 3197235 3240743 3285863 3334877 3387307 3441354 3496315 3552569 3610232
58227 3610232 3669039 3729317 3792296 3859265 3930482 4004719 4080163 4156241 4234352 4316279 4402377
58216D402377Q9734R3575R8140J02483J05973J09758J14970J20762J25746J30285
58206E493803J35673J42054J48762J55928J64023J72526J80636J88697J97358
58197F979460K06134K14418K23264K34441K48110K63002K78463K94889L12542
58188I254723L31335L51427L72886L95233M18314M42869M69263M96743N25150
58179A3057943N56026N90610O27877O66256P06100P48821P94627Q42921Q93741
58170A9484922R47013J001567J056747J114071J175626J242074J313889J393011
58162B8728920J481332J579060J686320J804571J934546K075083K226145K390428
58154D3906405K569480K761434K966131L189587L439528L719544M032276M385314
$$ plain form
58216 4402377 4492111 4585686 4683826 4786309 4892282 5002040 5117010 5237772 5363518 5493803
58206 5493803 5629476 5771530 5920292 6076220 6240243 6412769 6593405 6782102 6979460
58197 6979460 7185594 7400012 7623276 7857717 8105827 8368829 8647292 8942181 9254723
58188 9254723 9586058 9937485 10310371 10705604 11123918 11566787 12036050 12532793 13057943
58179 13057943 13613969 14204579 14832456 15498712 16204812 16953633 17748260 18591181 19484922
58170 19484922 20431935 21433502 22490249 23604320 24779946 26022020 27335909 28728920
58162 28728920 30210252 31789312 33475632 35280203 37214749 39289832 41515977 43906405
58154 43906405 46475885 49237319 52203450 55393037 58832565 62552109 66584385 70969699
58146G0969699M788461N247546N766777O354972P023419P780241Q634433R603298
58138A26168846J0705874J1946631J3310918J4774295J6305451J7855947J9353607
58131B30421569K0710955K1841540K2671261K3124498K3057999K2164470J9962760
58124C83955052J5991486J0142655K879644m867375j2063626j7926665k2083214
58117C56027957k4531209k5514057k5384774k4493646k3123523k1479446j9706948
58110A91794354j7908886j6155529j4494452j2957217j1559447j0302122r179310
58103I9237391q184274p307797o536341n856498n258992m735846m276793l871425
58095E3209425l512308l193585k909124k654350k427489k226949k049727j893659
$$ plain form
58146 70969699 75758160 81005706 86772483 93127455 100150874 107931115 116565548 126168846
58138 126168846 136874720 148821351 162132269 176906564 193212015 211067962 230421569
58131 230421569 251132524 272974064 295645325 318769823 341827822 363992292 383955052
58124 383955052 399946538 410089193 412968837 408101462 396037836 378111171 356027957
58117 356027957 331496748 305982691 280597917 256104271 232980748 211501302 191794354
58110 191794354 173885468 157729939 143235487 130278270 118718823 108416701 99237391
58103 99237391 91053117 83745320 77208979 71352481 66093489 61357643 57080850 53209425
58095 53209425 49697117 46503532 43594408 40940058 38512569 36285620 34235893 32342234
58087C2342234j758011j639940j533484j434179j341850j256779j176405j098341
58079B1103245j023737r54842q91526q32874p79779p33133o91446o52887o17842
58070A3925179n86907n58274n29810n02122m77014m54357m32914m12860l94873
58061I576048l78022l60946l44107l28673l14285l00021k86473k74581k63462
58052F725478k51587k39299k28190k18743k10376k02904j96101j88833j80418
58043D809027j71948j64599j57687j50139j42587j36223j30755j25433j20661
58034C508995j16529j11312j03897r6357r1413q8435q4835q0378p6933p4597p1491
58023B512818o7286o3641o0853n7353n3050n0078m9209m8404m6241m4219m3934
$$ plain form
58087 32342234 30584223 28944283 27410799 25976620 24634770 23377991 22201586 21103245
58079 21103245 20079508 19124666 18233140 17400266 16620487 15887354 15195908 14543021 13925179
58070 13925179 13338272 12779998 12250188 11748066 11271052 10816695 10383781 9970921 9576048
58061 9576048 9198026 8837080 8492973 8164300 7850015 7549994 7263521 6988940 6725478
58052 6725478 6473891 6234592 6006402 5787659 5577283 5374379 5178278 4989445 4809027
58043 4809027 4637079 4472480 4314793 4164654 4022067 3885844 3755089 3629656 3508995
58034 3508995 3392466 3281154 3177257 3080900 2989487 2901052 2816217 2735839 2658906 2584309 2512818
58023 2512818 2445532 2381891 2321038 2263685 2210635 2160557 2111348 2062944 2016703 1972484 1928550
58012A928550m4239m3183m1108l9746l9272l8198l5745l2814l0648k9575k9053
58001A524969k8164k6207k3298k0518j9140j9643k1349k2850k2958k1653j9926
57990A279263j8527j7289j6040j5489j6328j7930j8960j8927j8287j7306j5971
57979A088209j4746j4323j4516j4382j3451j2040j0559r331q965r912j1652j3128
57967I41204j3859j3985j3603j2943j2623j2686j2032j0035q170q346j0096j1257
57955H01569j1266j1612j2914j3760j3201j2231j1709j0766q728p033p421r148
57943F71780r855q699p084o474o935p780q317p710n350j994K86Q3j675k714j992
57928E95570p39p43k202l831m698n091n452n538n210n241o308p769q360p894p242
$$ plain form
58012 1928550 1884311 1841128 1800020 1760274 1721002 1682804 1647059 1614245 1583597 1554022 1524969
58001 1524969 1496805 1470598 1447300 1426782 1407642 1387999 1366650 1343800 1320842 1299189 1279263
57990 1279263 1260736 1243447 1227407 1211918 1195590 1177660 1158700 1139773 1121486 1104180 1088209
57979 1088209 1073463 1059140 1044624 1030242 1016791 1004751 994192 984861 975896 965984 954332 941204
57967 941204 927345 913360 899757 886814 874191 861505 849473 839438 831268 822922 812826 801569
57955 801569 790303 778691 765777 752017 738816 726585 714876 704110 695382 688349 680928 671780
57943 671780 661925 653226 646142 639668 632733 624953 616636 608926 603576 601582 601868 601951 600276 597562 595570
57928 595570 594831 594088 591886 588055 583357 578266 572814 567276 562066 556825 550517 542748 534388 526494 519252
57913E19252o851o313n419m569l957l168k020j118j327k968n543p715p844n369
57899D55071j711Q81J384L05j600l810n297m769k253N08J868J857J598J786K242
57884D48060K422K009J289J144K090L401L781L043K378K780L952M940N099M242
57870D90630K644J154N33L68n11k240l506l376k621k558l437m692o038p408q302
57855D50640q223p588p372p830q188p659o323m887l901l369l038k859k940l100
57841C73363k844k049j239q30n90k85l03q14j017k48O51M42m74o56n0j6p96r97
57823C61248j70J65q96j880j190L59Q81J51p19j323k050k761l094l475m204m113
57807C36929k041O55J151j107l636m286l639l207l020k239j013k92l31n66o89
$$ plain form
57913 519252 512401 506088 500669 496100 492143 488975 486955 485837 484510 481542 475999 468284 460440 455071
57899 455071 453360 454241 455625 455930 454330 450520 445223 440454 438201 438709 440577 442434 444032 445818 448060
57884 448060 450482 452491 453780 454924 457014 460415 464196 467239 469617 472397 476349 481289 486388 490630
57870 490630 493274 494428 494961 495329 494818 492578 489072 485696 483075 480517 477080 472388 466350 458942 450640
57855 450640 442417 434829 427457 419627 411439 403780 397457 392570 388669 385300 382262 379403 376463 373363
57841 373363 370519 368470 367231 366401 365811 365526 365223 364409 363392 363144 363795 364237 363763 363107 363057 363041 362245 361248
57823 361248 361078 361243 360347 358467 357277 357636 358517 358668 357949 356626 354576 351815 348721 345246 341042 336929
57807 336929 334888 335543 336694 335587 331951 327665 324026 320819 317799 315560 314547 314255 313924 313358 312669
57792C12669q40q66l27P09J557J759J565J289O99o25k491m034m545m135l460k938
57776B95986k496k031j690j503j057J0J239J584O57n49n99P56K296K867K754K965
57760C01189L455K909O84j967l306l182k790k770k690k385k573l656m881n275
57746B72762m790l972l134k465k435l277m308m406l228j602p45j253k668l879
57732B30600m109l532k683j507L69K426L244K162K42r25q73k57K32M39O36J299
57716B27763K661M131M696M166L460L242K978J966N31n14j038j396j577j474j599
57701B47996k512l687l899k745j076J44O67O33J27o94j359j290j98J515K724K369
57685B38715O12j198j958j728r67K90J791K423J323p01j876j463k39P85J179Q60
$$ plain form
57792 312669 311829 310963 310636 311345 312902 314661 316226 317515 318214 317589 315098 311064 306519 302384 298924 295986
57776 295986 293490 291459 289769 288266 287209 287219 288458 290042 290699 290150 289551 290307 292603 295470 298224 301189
57760 301189 304644 307553 308237 306270 302964 299782 296992 294222 291532 289147 286574 282918 278037 272762
57746 272762 267972 264000 260866 258401 255966 252689 248381 243975 240747 239145 238400 237147 234479 230600
57732 230600 226491 222959 220276 218769 219138 221564 224808 226970 227212 226287 225414 225157 225389 225828 226464 227763
57716 227763 230424 234555 239251 243417 246877 250119 253097 255063 255594 255080 254042 252646 251069 249595 247996
57701 247996 245484 241797 237898 235153 234077 234221 234888 235521 235648 234954 233595 232305 232107 233622 236346 238715
57685 238715 239327 238129 236171 234443 233476 233766 235557 237980 239303 238602 236726 235263 235024 235809 236988 237848
57669B37848K2o00l80J80q7j348k307j738L7J453J189o76k708l433k873k366k570
57652B19643k409p95J316J951P76o79j463k219l460m389m341m116m757n726n470
57637A83862l464p65J281K106J884J173O79P95J176J157O59L07N07P66M14j89
57621A92348K60K404N151O802O938O450N819M584L015L072O493J2370J7809K0915
57607B94430K2163K2838K3086K1846J8092J1973M918j408o608j1730j7487k2753
57595C59360k5543k5181k2670j9211j5366j1571q474o445n475n502o217o703o127
57582A94875m746l421k292r87J75L73k73q20j138k011l301l494j723J029L392
57567A75638M949N422M039R50j931k884k406k100k304k214j641j139p61k18q9
$$ plain form
57669 237848 237870 237270 236890 237070 236983 235635 233328 231590 231627 233080 234269 233593 230885 227452 224579 222213 219643
57652 219643 217234 216439 217755 219706 220482 219803 218340 216121 212661 208272 203931 199815 195058 189332 183862
57637 183862 180398 179633 180914 183020 184904 186077 186756 187551 188727 189884 190543 190850 191357 192123 192537 192348
57621 192348 192608 195012 200163 206965 213903 220353 226172 230756 233771 236843 243336 255706 273515 294430
57607 294430 316593 339431 362517 384363 402455 414428 419346 417938 411330 399600 382113 359360
57595 359360 333817 308636 285966 266755 251389 239818 231344 224899 219424 213922 207705 201002 194875
57582 194875 190129 186708 184416 183429 183604 183977 183704 182884 181746 179735 176434 172940 171217 172246 175638
57567 175638 180587 186009 190048 190998 189067 186183 183777 181677 179373 177159 175518 174379 173618 173400 173311
57552A73311j285l158l672k003K10R73L05l07j18K06j59j204k419l353l508k353
57536A51466j20J730J614l62k352k831k239k013k588l143l004k420j875j493j298
57521A29072j408j735k039k356k828l156k872k124j486j031m75j86r07k318l064
57506A01087k625j931j628j076J72J114P17m72j225j446j723j865j167J01Q58
57491H8891P34M03M55Q04J118J027J43j282k024j106P35J796J438N36P6L79J425
57474I5548K804L255J655j144k625j399J150K605K186R44J7l66l59P4R24J801
57458A07070K190K037J840K016K356K312J852J617K085K957L597L743L429K622
57444A41723J481O37O89J512K473L109L181K362O03j362k489k469j901j485j497
$$ plain form
57552 173311 172026 168868 165196 163193 163403 164376 164681 164374 164256 164462 164303 163099 160680 157327 153819 151466
57536 151466 151346 153076 154690 154328 151976 149145 146906 144893 142305 139162 136158 133738 131863 130370 129072
57521 129072 127664 125929 123890 121534 118706 115550 112678 110554 109068 108037 107562 107376 106469 104151 101087
57506 101087 98462 96531 94903 93827 93999 95113 95830 95358 94133 92687 90964 89099 87932 88033 88891
57491 88891 89625 90028 90483 91287 92405 93432 93575 92293 90269 89163 89898 91694 93132 93668 93744 94123 95548
57474 95548 98352 101607 103262 102118 99493 98094 99244 101849 104035 104979 104996 104630 104271 104345 105269 107070
57458 107070 109260 111297 113137 115153 117509 119821 121673 123290 125375 128332 131929 135672 139101 141723
57444 141723 143204 143841 144530 146042 148515 151624 154805 157167 157770 156408 153919 151450 149549 148064 146567
57429A46567j895k474k913l070l128l199l048k624k435k746k827j849l40K45n01
57414A13763j286q02O23J520R53o52k136k653k154j077K35J595K601K731K057
57399A15318J335J008O10l11j136q11P35K446L301L079K198J413J413K110K540
57384A35248J968P94j30n78o99l23N68J231J122Q94J282J586P85k50L59K397L434
57367A49688K342R35J109K114K098J094O95J475K452K877L084L325L034J774K62
57352A78358k68M72J476J650J084P05Q54R19N84M91R72J096Q4j060q37L86J099
57335A88065J394K707M720N017K878R84J760L872M478L448L052M237N627O033
57321B38272N792N463M949M282L883L534K358K95j339j215P63L669O230P282O530
$$ plain form
57429 146567 144672 142198 139285 136215 133087 129888 126840 124216 121781 119035 116208 114359 114019 114264 113763
57414 113763 112477 111675 112298 113818 114771 114119 111983 109330 107176 106099 106334 107929 110530 113261 115318
57399 115318 116653 117661 118271 117960 116824 116013 116748 119194 122495 125574 127772 129185 130598 132708 135248
57384 135248 137216 138010 137880 137302 136603 136280 136848 138079 139201 140095 141377 142963 143748 143498 143857 146254 149688
57367 149688 152030 152965 154074 156188 158286 159380 160075 161550 164002 166879 169963 173288 176322 178096 178358
57352 178358 178090 178562 180038 181688 182772 183477 184331 185250 185834 186325 187297 188393 188477 187417 186580 186966 188065
57335 188065 189459 192166 196886 201903 204781 205765 207525 211397 215875 219323 222375 226612 232239 238272
57321 238272 244064 249527 254476 258758 262641 266175 268533 268828 267489 266274 267037 270706 276936 284218 290748
57306B90748N073M328M247L585K068J122J934L827N316N947O270O582O737O856
57292C54640P271P738P543O554N565N261N327N008M311M123N101O902Q661R904
57278D43909J0674J1083J1207J1231J1208J0774R693Q535Q159Q510Q786Q900R718
57265E72387J1426J2730J2555J1539J0905J0664J0158R810J0691J2520J3671J3455
57253G12511J3109J3934J5573J6740J6793J5861J4267J2685J2307J3942J6943
57242H74665J9632K0696J9960J8215J6807J7026J9008K1320K2190K1385K0327
57231A091231K0329K1341K2500K3244K3315K2293K0084J7756J6963J8137J9870
57220A317063K0493J9782J8616J7501J6200J4636J3271J2549J2572J3352J4768
$$ plain form
57306 290748 295821 300149 304396 307981 310049 311171 313105 316932 322248 328195 334465 341047 347784 354640
57292 354640 361911 369649 377192 383746 389311 394572 399899 404907 409218 413341 418442 425344 434005 443909
57278 443909 454583 465666 476873 488104 499312 510086 519779 528314 536473 544983 553769 562669 572387
57265 572387 583813 596543 609098 620637 631542 642206 652364 662174 672865 685385 699056 712511
57253 712511 725620 739554 755127 771867 788660 804521 818788 831473 843780 857722 874665
57242 874665 894297 914993 934953 953168 969975 987001 1006009 1027329 1049519 1070904 1091231
57231 1091231 1111560 1132901 1155401 1178645 1201960 1224253 1244337 1262093 1279056 1297193 1317063
57220 1317063 1337556 1357338 1375954 1393455 1409655 1424291 1437562 1450111 1462683 1476035 1490803
57209A490803J6201J7033J7542J8517J9764K0096J9244J8668J9493K0604K0199
57198A698164J8664J8279K0015K2141K2720K2194K2407K3765K4881K4924K4965
57187A943119K6219K7908K8170K6757K5331K4882K4348K2800K1546K2329K4223
57176B217632K4478K2348J9943J8965J8748J8412J8795K0740K3163K4640K5581
57165B453445K7021K8352K8358K7829K8823L1635L4436L5946L6562L6864L6895
57154B806166L7124L8214L9467L9210L7149L4637L2263K9142K5270K2438K1684
57143C162764K1661K0955K0316K0884K1688K1010J9306J8596J9388K0191K0068
57132C386827J9739J9906K0160K0162K0493K1519K2456K2541K2351K2970K4221
$$ plain form
57209 1490803 1507004 1524037 1541579 1560096 1579860 1599956 1619200 1637868 1657361 1677965 1698164
57198 1698164 1716828 1735107 1755122 1777263 1799983 1822177 1844584 1868349 1893230 1918154 1943119
57187 1943119 1969338 1997246 2025416 2052173 2077504 2102386 2126734 2149534 2171080 2193409 2217632
57176 2217632 2242110 2264458 2284401 2303366 2322114 2340526 2359321 2380061 2403224 2427864 2453445
57165 2453445 2480466 2508818 2537176 2565005 2593828 2625463 2659899 2695845 2732407 2769271 2806166
57154 2806166 2843290 2881504 2920971 2960181 2997330 3031967 3064230 3093372 3118642 3141080 3162764
57143 3162764 3184425 3205380 3225696 3246580 3268268 3289278 3308584 3327180 3346568 3366759 3386827
57132 3386827 3406566 3426472 3446632 3466794 3487287 3508806 3531262 3553803 3576154 3599124 3623345
57121C623345K4755K4046K3354K4141K6012K7026K6007K3844K2084K1002J9765
57110C885381J7969J6052J4326J2650J1142J0110R003O535K464j648m167n122
57098C974695n512n714n502m972m277k603J339P572J4348J9786K3543K6705L0406
57085D069814L4861L9565M3964M7637M9878M9637M6439M1039L4488K6666J6606
57074D500594M282q932k2007l5522n0570o7183q4537j02279j20980j41632j65112
57063C706122j91738k21007k52229k85660l22200l61761m02966m45166m89857
57054G33538A94244d00177o55061p21291p93837q73660r62245j061730j173858
57045f641859j299305j438791j594200j767949j962267k180329k427069k707242
$$ plain form
57121 3623345 3648100 3672146 3695500 3719641 3745653 3772679 3798686 3822530 3844614 3865616 3885381
57110 3885381 3903350 3919402 3933728 3946378 3957520 3967630 3976633 3983168 3985632 3983984 3979817 3974695
57098 3974695 3969183 3963469 3957967 3952995 3948718 3946115 3947454 3955026 3969374 3989160 4012703 4039408 4069814
57085 4069814 4104675 4144240 4188204 4235841 4285719 4335356 4381795 4422834 4457322 4483988 4500594
57074 4500594 4504876 4495944 4473937 4438415 4387845 4320662 4236125 4133846 4012866 3871234 3706122
57063 3706122 3514384 3293377 3041148 2755488 2433288 2071527 1668561 1223395 733538
57054 733538 194244 -400177 -1055238 -1776529 -2570366 -3444026 -4406271 -5468001 -6641859
57045 -6641859 -7941164 -9379955 -10974155 -12742104 -14704371 -16884700 -19311769 -22019011
57037b2019011l023043l374693l762209m184404m636014n106908n583510o049388
57029e7739180o484816o867496p174001p381251p470907p436827p285431p019182
57021a14859091o613456o012566n156394m018456k626219j053689O01380K239571
57013a37498920L773518N133078O265762P137764P737204Q075147Q180444Q091172
57005h3104831P848208P491521P056665O572122O059943N538421N022910M524940
56997c2990101M052511L611737L207057K839891K508816K211696J947062J713451
56989a0897880J508598J329676J173667J037544R18960Q16690P29451O54488N88559
56980b140247N30313M80406M39027b86059H7984L45297L15279K81429K44070K07285
$$ plain form
57037 -22019011 -25042054 -28416747 -32178956 -36363360 -40999374 -46106282 -51689792 -57739180
57029 -57739180 -64223996 -71091492 -78265493 -85646744 -93117651 -100554478 -107839909 -114859091
57021 -114859091 -121472547 -127485113 -132641507 -136659963 -139286182 -140339871 -139738491 -137498920
57013 -137498920 -133725402 -128592324 -122326562 -115188798 -107451594 -99376447 -91196003 -83104831
57005 -83104831 -75256623 -67765102 -60708437 -54136315 -48076372 -42537951 -37515041 -32990101
56997 -32990101 -28937590 -25325853 -22118796 -19278905 -16770089 -14558393 -12611331 -10897880
56989 -10897880 -9389282 -8059606 -6885939 -5848395 -4929435 -4112745 -3383294 -2728806 -2140247
56980 -2140247 -1609934 -1129528 -690501 -286059 87984 433281 748560 1029989 1274059 1481344
56970A481344J75794J51321J32642J18218J07365R9235R2177Q4590P5796O6003
56960B584485N5887M6234L7490K9514K1892J4354O822n87p342j2860j7514k2753
56948B735622k9586l7325m4522n0880n7560o5837p6133q8037j00463j11789j20822
56937A952668j27668j33009j36621j37540j35733j32480j28516j23005j15097
56928G82999j05737r6779q8812q0920p2422o3791n5813m8735m2595l7578l3603
56917E6214B6105f58k4029k2486k1759k0614j8073j4273j0241p038n043l860k831
56904a50905j579k4J899M179O280P353P179O638O746P386P324N542K329q57k544
56889i3054k456j816k144l492m190k851k91J367J396J318K740N269P417Q902J0873
$$ plain form
56970 1481344 1657138 1808459 1941101 2059319 2166684 2265919 2358096 2442686 2518482 2584485
56960 2584485 2640372 2686606 2724096 2753610 2775502 2789856 2796678 2796091 2788749 2775889 2758375 2735622
56948 2735622 2706036 2668711 2624189 2573309 2515749 2449912 2373779 2285742 2185279 2073490 1952668
56937 1952668 1825000 1691991 1555370 1417830 1282097 1149617 1021101 898096 782999
56928 782999 677262 580483 491671 410751 338329 274538 218725 169990 127395 89817 56214
56917 56214 26105 -658 -24687 -47173 -68932 -89546 -107619 -121892 -132133 -139171 -144214 -148074 -150905
56904 -150905 -152484 -152508 -150609 -146430 -140150 -132797 -125618 -118980 -112234 -104848 -97524 -91982 -89653 -90510 -93054
56889 -93054 -95510 -97326 -99470 -102962 -107152 -110003 -110294 -108927 -107531 -106213 -103473 -98204 -90787 -81885 -71012
56874g1012J3847J6600J7629e961I802J4339J1927Q326M823K610J023j592n364
56861D5894q489r582r293q944I19g054p423q105r570r741p420l772q06P60J505
56846e1626K008K420K823L275L670M129N115O687Q019e106C141Q844J0500J2334
56832C4819J3357J3412J3068J3143J4204J5968J7233J7023J5811J4975J5014J4940
56820B12967J3547J0683P097L681J175j3q5M05J278K770M665O187P164Q550J0998
56805B91069J3547J4715J4572J4610J5660J7081J8150J8901J8950J6822J1727
56794D65804N224k33m028p205r770j0178q145o161o628q482q330m545J345P129
56780D05797J2153J6679K0594K3566K5700K7373K8888L0393L1289K9636K3507
$$ plain form
56874 -71012 -57165 -40565 -22936 -5961 9802 24141 36068 44394 49217 51827 52850 51258 45894
56861 45894 37405 27823 18530 9586 919 -7054 -14477 -22582 -32152 -41893 -49313 -53085 -53891 -53131 -51626
56846 -51626 -49618 -47198 -44375 -41100 -37430 -33301 -28186 -21499 -13480 -5106 3141 11985 22485 34819
56832 34819 48176 61588 74656 87799 102003 117971 135204 152227 168038 183013 198027 212967
56820 212967 226514 237197 244294 247975 249150 249137 249052 249457 250735 253505 258170 264357 271521 280071 291069
56805 291069 304616 319331 333903 348513 364173 381254 399404 418305 437255 454077 465804
56794 465804 471028 470795 466767 459562 449792 439614 431469 425308 418680 410198 401868 397323 398668 405797
56780 405797 417950 434629 455223 478789 504489 531862 560750 591143 622432 652068 675575
56769F75575J3648L443m552j0891j7019k2175k4395k3711k2177k0879j8797j5007
56757E13063j0345o301l526j896q48R11M808J0581J5911J8607J8569J7135J5223
56744E91892J2740R058L509l896j1670j7499k0394k1564k2684k4030k4886k4772
56732D45804k3372k0202j5549j1125q508p349o156m390k552o53J792M327N614
56719C57681N264M196K882N08l453p934j1353j3219j3984j4069j3796j3618j3641
56706B65464j3315j2287j1143j0642j0609j0309r650r150q906q391p280n851m480
56693A43451l362k778k887l158k752j894k039l996o435p162n676l518k110j326
56679I4358n35jk92r79j056n38m75j234j761j059L40J056N51m55r84o26M37J695
$$ plain form
56769 675575 689223 692666 688114 677223 660204 638029 613634 589923 567746 546867 528070 513063
56757 513063 502718 496417 492891 490995 490147 491058 495866 506447 522358 540965 559534 576669 591892
56744 591892 604632 613690 617199 613303 601633 584134 563740 542176 519492 495462 470576 445804
56732 445804 422432 402230 386681 375556 367048 359699 353543 349153 346601 345948 347740 352067 357681
56719 357681 362945 367141 370023 370531 367078 359144 347791 334572 320588 306519 292723 279105 265464
56706 265464 252149 239862 228719 218077 207468 197159 187509 178359 169453 161062 153782 147931 143451
56693 143451 140089 137311 134424 131266 128514 126620 124581 120585 114150 106988 101312 97794 95684 94358
56679 94358 93823 93822 93530 92551 91495 90957 90482 89248 87487 86428 86768 87824 88375 87920 86936 86310 86747 88442
56661H8442K567K718K213J363N12j6r6J39P18K110M416O372O325M431K779K713
56645A27706L217K828J911J724K275K663K914L623M164L205J085j64M59J814K579
56630A62003K724K494J644M88K02J082J728R97m06j203j256j013m25L99N25m89
56614A69494j548j503q39n66m03L89J248J093K81L7M28N88N84J155J794J166n19
56597A72879j470r59j78mK58J188J999J842J111N75L55L47N59M74o15k100k301
56580A73960r60J3q29k531l448l476l305k808j680n90k16r9J67k50j733k581j087
56563A48547J480K319J067O7O85J711J748J096N43J02k35o2L02l70k353m057l869
56546A48721j976K38J594J404l78k502k991j328Q21J734J492J053P76Q41J840
$$ plain form
56661 88442 91009 93727 95940 97303 97815 97799 97703 97842 98560 100670 105086 111458 117783 122214 124993 127706
56645 127706 130923 133751 135662 137386 139661 142324 145238 148861 153025 156230 157315 157151 157610 159424 162003
56630 162003 164727 167221 168865 169353 169555 170637 172365 173362 172956 171753 170497 169484 169059 169458 169983 169494
56614 169494 167946 166443 165604 165038 164635 165024 166272 167365 167646 167683 168111 168699 169283 170438 172232 173398 172879
56597 172879 171409 170450 170272 170268 170526 171714 173713 175555 176666 177241 177596 177943 178502 178976 178361 176261 173960
56580 173960 173000 173013 172184 169653 166205 162729 159424 156616 154936 154346 154130 154031 154198 153948 152215 149634 148547
56563 148547 150027 152346 153413 153480 154165 155876 157624 158720 159263 159365 159130 159068 159370 159000 156647 152590 148721
56546 148721 146745 146983 148577 149981 149603 147101 144110 142782 143603 145337 146829 147882 148658 149499 151339
56531A51339L573M359L048J024N47J767K904K943K370J550K27j156j416l80O49
56516A73348P67N79R27J676K347K894L254L016K298K089K911L972M366M411M952
56501B13807N945O653O829O799O669O310N955N986O164N825M808L673K999K968
56487B91390L376L577K669M76j762k516j697o03k25m52r68j843k951l759m213
56472B80499m954o022o236m871l126k761l634l946k960j993k175k538j442Q06
56458B34647K086J144r28k286k547k817l826m813m463k561l66O46K19o51j004
56443B12480q61p26n03M90K306L744L513J858M09M00J457K396K633K306J456n6
56427B33302j688k215j152L64Q15J52l80k10k05j052j900j471l2Q67N39n4R7O70
$$ plain form
56531 151339 154912 159271 162319 163343 163890 165657 168561 171504 173874 175424 175651 174495 173079 172699 173348
56516 173348 174115 174694 175621 177297 179644 182538 185792 188808 191106 193195 196106 200078 204444 208855 213807
56501 213807 219752 226405 233234 240033 246702 253012 258967 264953 271117 276942 281750 285423 288422 291390
56487 291390 294766 298343 301012 301488 299726 297210 295513 294910 294685 294233 293265 291422 288471 284712 280499
56472 280499 275545 269523 263287 258416 255290 252529 248895 244949 241989 239996 237821 235283 233841 234647
56458 234647 236733 237877 236949 234663 232116 229299 225473 220660 216197 213636 213270 213916 214135 213484 212480
56443 212480 211619 210893 210390 210880 213186 216930 220443 222301 222710 223110 224567 226963 229596 231902 233358 233302
56427 233302 231614 229399 228247 228611 229426 229578 229198 228988 228783 227731 225831 224360 224328 225195 225734 225680 225777 226447
56409B26447Q49O84Q21J299J564J381R00l3j589l003k926j103J143K586L343L909
56393B36272L871K598O68o07q19o76o73n89l36k48l03j5N53O66J78RP04J438J276
56374B43967O69P49J620K386K514K180J526N54l43o94p84j318k215k673k388j760
56358B43990q95M59J922K633K760L429M603M482K106q28k088j787j451j111N33
56343B58757L206M589L398J247M11J015J557J236N88L00N14J156K057K788K936
56328B85755K498J575P1j764k757j761P12K622K590J434J078K121L101K330J35
56313B99740j289m17J711K777K094J238J514K100J636P44J273L246M385L236J221
56298C25209M72Q59P60K9K22J802L056K624J638K003L601M695M636M400M528M286
$$ plain form
56409 226447 227296 227980 228801 230100 231664 233045 233945 233912 232323 229320 226394 225291 226434 229020 232363 236272
56393 236272 240143 242741 243409 242802 241983 241307 240634 240045 239709 239461 239158 239143 239696 240362 240540 240549 241253 242691 243967
56374 243967 244636 245385 247005 249391 251905 254085 255611 256165 255822 255128 254344 253026 250811 248138 245750 243990
56358 243990 243095 243554 245476 248109 250869 254298 258901 263383 265489 264661 262573 260786 259335 258224 258757
56343 258757 261963 266552 269950 271197 271608 272623 274180 275416 276004 276304 276818 277974 280031 282819 285755
56328 285755 288253 289828 289899 288135 285378 283617 284329 286951 289541 290975 292053 294174 297275 299605 299740
56313 299740 298451 298034 299745 302522 304616 305854 307368 309468 311104 311848 313121 316367 320752 323988 325209
56298 325209 325681 326540 327300 327329 327551 329353 332409 335033 336671 338674 342275 346970 351606 356006 360534 364820
56282C64820L339K689K910K822J297n84q46L38Q31j62q12N33K793L724K997K335
56266C89024K922M078M596M304L835L553L267K766K207J850J589R59j34q81l64
56251D23571J035J693O67r74j410k06J601L116M348N401O008O167O419P039P506
56236D71981P224O270N101L946L080L152M558O550P617P126O269P010R944J3360
56222E63188J4830J3786J2158J2074J3499J4790J5217J5757J7283J9156K0253
56211G31991K0641K1317K2933K5383K8244L0844L2349L2735L3457L6073M0182
56200A056149M3628M5085M5594M7270N1167N6904O3692P0878P7764Q3791Q9164
56189A731086R4904J01851J09749J17632J25002J32200J39297J45004J47469J46346
$$ plain form
56282 364820 368159 370848 373758 376580 377877 377293 376447 376785 377616 377454 376642 377175 379968 383692 386689 389024
56266 389024 391946 396024 400620 404924 408759 412312 415579 418345 420552 422402 423991 424950 424816 423935 423571
56251 423571 424606 426299 426966 425992 424582 424376 425977 429093 433441 438842 444850 451017 457436 464475 471981
56236 471981 479205 485475 490576 494522 497602 500754 505312 511862 519479 526605 532874 539884 549828 563188
56222 563188 578018 591804 603962 616036 629535 644325 659542 675299 692582 711738 731991
56211 731991 752632 773949 796882 822265 850509 881353 913702 946437 979894 1015967 1056149
56200 1056149 1099777 1144862 1190456 1237726 1288893 1345797 1409489 1480367 1558131 1641922 1731086
56189 1731086 1825990 1927841 2037590 2155222 2280224 2412424 2551721 2696725 2844194 2990540
56179B990540J43306J39921J35559J28101J16262J00354Q1057N8764L4401R736
56169C938001j3848l6170n7300p6576r3216j07175j18558j26834j31729j34386
56159C042209j36362j37496j36186j31877j26037j20113j13846j06463r8522r1374
56149A843933q5344p9657p3900o8389o3152n7621n1675m6024m1315l7543l4695
56138A204618l3047l2284l1065k8259k4203k0076j6530j3751j2305j2634j3692
56127I66772j3321j0489o398k893o09P26J053J67j232j816j102J04Q22Q14L88
56112I32986QK38J310K518K855K502K768M014M785M041L248M647P861J0076R781
56097I93638Q655R041J1056J3287J5226J7522K0496K3744K7023L0318L3215L5382
$$ plain form
56179 2990540 3133846 3273767 3409326 3537427 3653689 3754043 3835100 3893864 3928265 3938001
56169 3938001 3924153 3887983 3830683 3754107 3660891 3553716 3435158 3308324 3176595 3042209
56159 3042209 2905847 2768351 2632165 2500288 2374251 2254138 2140292 2033829 1935307 1843933
56149 1843933 1758589 1678932 1605032 1536643 1473491 1415870 1364195 1318171 1276856 1239313 1204618
56138 1204618 1171571 1139287 1108222 1079963 1055760 1035684 1019154 1005403 993098 980464 966772
56127 966772 953451 942962 936564 933671 933062 933788 934841 935008 933776 931960 930858 930962 931784 932598 932986
56112 932986 932994 933232 934542 937060 939915 942417 945185 949199 953984 958025 961273 965920 973781 983857 993638
56097 993638 1002293 1011334 1022390 1035677 1050903 1068425 1088921 1112665 1139688 1170006 1203221 1238603
56085A238603L7672M1522M7054N2791N7525O1404O4679O6410O5198O0667N3736
56074A847261M5906L8697L3117K9156K6140K3788K2175K0611J7694J3200Q832
56063B126577O110M489K569J55k455o364j3115k1936k9869l5220l9262m3789m8303
56050A899587n0627m9343m4805l8424l1817k6079k1113j6002j0474n565k374o99
56038A602265N41K108M151O656R414J1845J3328J3636J3004J2157J2311J4319
56026A715735J7405J9628K0076J9802K0009K0392K0185J9907K0650K2173K3104
56015A939066K2993K2956K4156K6572K9332L1528L2662L2912L2901L2788L2020
56004B259886L0663L0158L1535L3529L4122L3701L4766L8263M2130M4157M4638
$$ plain form
56085 1238603 1276275 1317797 1364851 1417642 1475167 1536571 1601250 1667660 1732858 1793525 1847261
56074 1847261 1893167 1931864 1964981 1994137 2020277 2044065 2066240 2086851 2104545 2117745 2126577
56063 2126577 2132687 2137176 2139745 2139900 2137445 2131081 2117966 2096030 2066161 2030941 1991679 1947890 1899587
56050 1899587 1848960 1799617 1754812 1716388 1684571 1658492 1637379 1621377 1610903 1605338 1602964 1602265
56038 1602265 1602806 1604914 1609065 1615721 1625135 1636980 1650308 1663944 1676948 1689105 1701416 1715735
56026 1715735 1733140 1752768 1772844 1792646 1812655 1833047 1853232 1873139 1893789 1915962 1939066
56015 1939066 1962059 1985015 2009171 2035743 2065075 2096603 2129265 2162177 2195078 2227866 2259886
56004 2259886 2290549 2320707 2352242 2385771 2419893 2453594 2488360 2526623 2568753 2612910 2657548
55993B657548M5131M6097M7114M8356N0257N2325N3683N4581N6173N8861O1779
55982C231905O3929O5093O5841O7262P0380P4997P9371Q1975Q3541Q6400R1671
55971D062365R7951J03080J06426J09142J12773J17953J24119J30058J35131J40086
55961E239084J46269J53829J61290J67461J73243J80802J90969K02279K12992
55952F828218K23380K35321K49752K65542K81240K97286L15478L36504L59000
55943I391721L81395M03787M27362M52690M79477N07671N37723N69809O03705
55934A3755340O39677O78536P20402P64089Q08376Q53238Q99251R46587R95692
55925B1061188J048545J107746J174216J247008J325802J412286J508252J613571
$$ plain form
55993 2657548 2702679 2748776 2795890 2844246 2894503 2946828 3000511 3055092 3111265 3170126 3231905
55982 3231905 3295834 3360927 3426768 3494030 3564410 3639407 3718778 3800753 3884294 3970694 4062365
55971 4062365 4160316 4263396 4369822 4478964 4591737 4709690 4833809 4963867 5098998 5239084
55961 5239084 5385353 5539182 5700472 5867933 6041176 6221978 6412947 6615226 6828218
55952 6828218 7051598 7286919 7536671 7802213 8083453 8380739 8696217 9032721 9391721
55943 9391721 9773116 10176903 10604265 11056955 11536432 12044103 12581826 13151635 13755340
55934 13755340 14395017 15073553 15793955 16558044 17366420 18219658 19118909 20065496 21061188
55925 21061188 22109733 23217479 24391695 25638703 26964505 28376791 29885043 31498614
55917C1498614J727354J850396J985110K133456K296336K474790K670261K883690
55909D9520007L115963L369919L651147L967019M326166M738658N214366N760347
55901H3663592O381205P082373P871408Q756110R744120J0844953J2068885J3421345
55893A59833991J4898916J6487753J8155755J9836513K1414494K2709566K3444179
55886B96781167K3209941K1511906J7954595J2502091N623644j813971q851133
55879C66918240j4739580j9090121k1852437k3207364k3446650k2877041k1763899
55872B19941148k0314572j8685353j6992388j5319591j3725411j2247584j0904797
55865A11751452r699634q626196p677036o843447o113057n471975m909587m418622
$$ plain form
55917 31498614 33225968 35076364 37061474 39194930 41491266 43966056 46636317 49520007
55909 49520007 52635970 56005889 59657036 63624055 67950221 72688879 77903245 83663592
55901 83663592 90044797 97127170 104998578 113754688 123498808 134343761 146412646 159833991
55893 159833991 174732907 191220660 209376415 229212928 250627422 273336988 296781167
55886 296781167 319991108 341503014 359457609 371959700 377583344 375769373 366918240
55879 366918240 352178660 333088539 311236102 288028738 264582088 241705047 219941148
55872 219941148 199626576 180941223 163948835 148629244 134903833 122656249 111751452
55865 111751452 102051818 93425622 85748586 78905139 72792082 67320107 62410520 57991898
55857E7991898l990816l615557l283521k989168k728573k496693k288278k100407
55849C4498885j932615j784610j654457j538710j433798j337289j248185j166182
55841B2403039j090679j020408r53852q90122q29814p74830p26656o84588o46390
55832A4785700o10976n79584n53694n32501n13199m93255m71782m49285m26984
55823A0154440m06151l87273l69777l52799l36057l19731l04032k89283k75861
55814G113476k63664k52160k41342k31813k23486k15209k06486j98484j92155
55805E088677j86281j78863j69957j61555j54880j49279j43720j37982j32084
55796C674076j25790j19067j12183j05204r8270r2265q8083q5192q2161p8625
$$ plain form
55857 57991898 54001082 50385525 47102004 44112836 41384263 38887570 36599292 34498885
55849 34498885 32566270 30781660 29127203 27588493 26154695 24817406 23569221 22403039
55841 22403039 21312360 20291952 19338100 18447978 17618164 16843334 16116678 15432090 14785700
55832 14785700 14174724 13595140 13041446 12508945 11995746 11502491 11030709 10581424 10154440
55823 10154440 9748289 9361016 8991239 8638440 8302383 7982652 7678620 7389337 7113476
55814 7113476 6849812 6597652 6356310 6124497 5901011 5685802 5479316 5280832 5088677
55805 5088677 4902396 4723533 4553576 4392021 4237141 4087862 3944142 3806160 3674076
55796 3674076 3548286 3429219 3317036 3211832 3113562 3021297 2933214 2848022 2765861 2687236
55786B687236p5451p2844o9878o6344o3393o1470n9212n5590n1744m9260m7752
55775B014298m5879m3813m2676m1942l9699l5745l2429l1520l1888l1411k9914
55764A607382k8774k8402k7827k6539k5290k4747k4475k3844k3060k2687k2672
55753A329065k2495k1887k0818j9117j6887j5061j4715j5737j6838j7093j6730
55742A131687j6186j5202j3424j1316r693q720q039p681q011q814r241q778p682
55729I98900o233m308k089n00k31p09q42o69j414l716o626r000j1126j4047j7486
55714I19904j9618j9232j7112j4830j3006j1607j1018j1593j2599j2952j2862
55703G63475j3366j4187j3689j1469r420r353j0710j1699j1631j0867r441p330
$$ plain form
55786 2687236 2611785 2538941 2469063 2402719 2339326 2277856 2218644 2163054 2111310 2062050 2014298
55775 2014298 1968419 1924606 1881930 1839988 1800289 1764544 1732115 1700595 1668707 1637296 1607382
55764 1607382 1578608 1550206 1522379 1495840 1470550 1445803 1421328 1397484 1374424 1351737 1329065
55753 1329065 1306570 1284683 1263865 1244748 1227861 1212800 1198085 1182348 1165510 1148417 1131687
55742 1131687 1115501 1100299 1086875 1075559 1065866 1057146 1049107 1041426 1033415 1024601 1015360 1006582 998900
55729 998900 992667 988359 986270 985770 985539 984830 983988 983319 981905 978189 971563 962563 951437 937390 919904
55714 919904 900286 881054 863942 849112 836106 824499 813481 801888 789289 776337 763475
55703 763475 750109 735922 722233 710764 701344 691991 681281 669582 657951 647084 637643 630313
55691F30313n540n386o681p946q411q640r078r253q796q242q256q622q516p537
55677E19409o248n767o548p458o687m133k019k195l739m590m874o477r492j1406
55663D37776j0542q326o960o445n429l852l015l457m301m536l849k190L68L197
55649C78439N288O143N940M826K645l13k808l447k133m92m33k195m223n229n642
55634C76366o353o815n832l965l338m566n518m190j494J56L8n47n99n07q82j568
55618C30386k060k083j565p49l09p12j488j752j398j109j252j518j733k204k991
55603C07463l534l347k644j866j036m5P56Q43M53N73J626K640K431J357R26J334
55587C07930Q13j638m066l799j302K46p21k437k872k383k167k090j622j357j801
$$ plain form
55691 630313 624773 619387 612706 604760 596349 587709 578631 569378 560582 552340 544084 535462 526946 519409
55677 519409 513161 507394 500846 493388 486701 482568 480549 478354 474615 470025 465151 458674 449182 437776
55663 437776 427234 418908 411948 405503 400074 396222 393207 389750 385449 380913 377064 374874 375242 378439
55649 378439 383727 389870 395810 400636 403281 402968 400160 396713 394580 394088 393655 391460 387237 382008 376366
55634 376366 370013 363198 357366 353401 350063 345497 339979 335789 334295 334451 334489 333942 333343 332836 331954 330386
55618 330386 328326 326243 324678 323929 323620 322908 321420 319668 318270 317161 315909 314391 312658 310454 307463
55603 307463 303929 300582 297938 296072 295036 294991 295747 296590 297043 297616 299242 301882 304313 305670 306596 307930
55587 307930 308743 307105 303039 299240 297938 298184 297463 295026 292154 289771 287604 285514 283892 282535 280734
55572B80734j966j115o95k328m755n407m382m202n566o287n050l460l083k927
55558B29511j568J05L48n78j095j017j549k859l567k829j534j004j527k475l134
55543B05228l125k466j550p40p5M33M91j16j068j918k652l395l847l603k822j918
55527A76857r27J33N14n78k449l181j857K58J315R97L74K58N27P84Q02M11k23
55510A74015k99Q00K247K388R36m77n84k20p33j717j896j631k513m435n224l871
55494A56786k187k141l226l947m367n183n457l645m93J439J228M56L63L12k71
55479A29667n11J97P80K55m75j38O42K89j137j982j413k74N48J245K173K913K829
55462A35608J972R26J56k38l89n32p65q58n15P9K42m45j472j804j018J47O55M94
$$ plain form
55572 280734 278768 277653 276958 274630 269875 264468 260086 255884 250318 244031 238981 235521 232438 229511
55558 229511 227943 228048 228396 227818 226723 225706 224157 221298 217731 214902 213368 212364 210837 208362 205228
55543 205228 202103 199637 198087 197347 197272 197705 198196 198080 197012 195094 192442 189047 185200 181597 178775 176857
55527 176857 175930 176063 176577 175999 173550 170369 168512 168770 170085 171082 171456 171714 172241 173025 173827 174238 174015
55510 174015 173716 174516 176763 179151 180087 179610 179026 178806 178073 176356 174460 172829 170316 165881 160657 156786
55494 156786 154599 152458 149232 145285 140918 135735 130278 126633 126140 127579 128807 129263 129626 129938 129667
55479 129667 129156 129353 130133 130388 129913 129775 130417 130706 129569 127587 126174 125900 126448 127693 129866 132779 135608
55462 135608 137580 138506 138662 138424 138035 137503 136738 135880 135365 135444 135686 135241 133769 131965 130947 131094 131749 132243
55444A32243O30J400J741O02j356k493k361j983j935j457L0J686K277J633L53
55429A31010j147k447k680j412L66J124O32J37O90J954K719K255J021J79L13O28
55413A35342j9j346j772o49O67O79k22o42l76m52j333k317k751k786k746k551
55397A16726j994j057N1Q33P86J62j7O57J190O02n41j074j019j037o25J196L464
55380A18303L602Q41k333l137j656q5P2r06j790j449K83J945J526j024l229l015
55364A07948j226k4K99J114K540K858J231p66j349r67j269k392k785j635j48J40
55348A03569n25o54J78O29m33k057k189l29J760K214J160J46O7M72P74J170K047
55331A07999K951K866J507n9m75L40R81J54j781l179k894j271O00J962K410J439
$$ plain form
55444 132243 132873 134273 136014 136616 135260 132767 130406 128423 126488 125031 125061 126747 129024 130657 131010
55429 131010 129863 127416 124736 123324 123690 124814 125446 125583 126273 128227 130946 133201 134222 134401 134714 135342
55413 135342 135323 133977 132205 131556 132223 132902 132680 132038 131662 131210 129877 127560 124809 122023 119277 116726
55397 116726 114732 113675 113726 114559 115345 115507 115490 116147 117337 117939 117398 116324 115305 114268 113643 114839 118303
55380 118303 121905 122746 120413 117276 115620 115535 115607 114701 112911 111462 111745 113690 115216 114192 110963 107948
55364 107948 106722 106698 106997 108111 110651 113509 114740 113974 112625 111658 110389 107997 105212 103577 103429 103569
55348 103569 103044 102390 102568 103197 102764 100707 98518 98189 99949 102163 103323 103469 103536 104008 104782 105952 107999
55331 107999 110950 113816 115323 115264 114789 115129 116110 116264 114483 111304 108410 107139 107739 109701 112111 113550
55315A13550j125m186n619m128p95J776K047R24L06P63J340J345J197J281J046
55300A09722R0o93k71P66R09P7k03P72J612O79j690l688m036k808q42Q80J661
55283A02937J656J772K484K984K120j43k719m547n098m119j750J038K877L085
55269A02577K083P75j07j91M07J043R91N8j351k572k828j556P57K398K009L56
55253A04849l43Q56K450K472Q76p41j252r47n58k22K06M40p6j404k755l110k105
55236I8636l87R41J259Q68M67K95K7m34m41O11K157K828K138J172J025J173L17
55219A12652j418k350j537m7O49O40R57J660J751Q34k53p56r25j256j465r17L55
55202A08574J639K367K387J547l00k649m153l721j800n9L03k97o11q7P56J254
$$ plain form
55315 113550 112425 108239 102620 98492 97697 99473 101520 102444 102750 103513 104853 106198 107395 108676 109722
55300 109722 109812 109119 108848 109614 110523 110600 110397 111169 112781 113460 111770 108082 104046 101238 100396 101276 102937
55283 102937 104593 106365 108849 111833 113953 113810 111091 106544 101446 97327 95577 96615 99492 102577
55269 102577 104660 105435 105328 105137 105544 106587 107578 107636 106285 103713 100885 99329 100086 102484 104493 104849
55253 104849 104506 105362 107812 110284 111160 110419 109167 108220 107662 107440 107646 108086 108010 106606 103851 100741 98636
55236 98636 98249 99190 100449 101317 101784 102079 102106 101672 101231 101842 103999 106827 108965 110137 111162 112335 112652
55219 112652 111234 108884 107347 107300 107949 108589 109546 111206 112957 113791 113538 112782 111857 110601 109136 108219 108574
55202 108574 110213 112580 114967 116514 116214 113565 109412 105691 103891 103832 104135 103838 103227 103140 103896 105150
55186A05150J241Q11M7p48j084q28m19k52k73l14l75k55M53J578K144J579P05
55169A09160O50J185J034k12j518j869j480j137j024o98J05J067J523R55n51k211
55153A04979l079k789j658j91J185K048K081J349K32q18j315r19l2J94p40j628
55137I8899q77J218K650K255R40Q5r6K6M59J146J422R46M58O43Q58J30j170j839
55119A08153j622j215p34L82J891K569J940R86O58O85M35K7j32j76m55q32r62
55102A11598q10m20J78L67q64l297m810l539l45K133K695K555L013L580L053J381
55086A16468l55j248j128l36M78O98M29L91P58P48m5p28m46M8m49j328p97J181
55068A14339K402J526k0l40J81q2j218j950j996k323l049k946j511J20R80J560
$$ plain form
55186 105150 106391 107202 107249 106501 105417 104589 104170 103918 103645 103331 102956 102701 103154 104732 106876 108455 109160
55169 109160 109810 110995 112029 111817 110299 108430 106950 105813 104789 104091 104196 105263 106786 107741 107190 104979
55153 104979 101900 99111 97453 97262 98447 100495 102576 103925 104157 103339 102024 101105 101073 101267 100527 98899
55137 98899 98022 99240 101890 104145 105085 105170 105074 105100 105559 106705 108127 109073 109531 110174 111032 111162 109992 108153
55119 108153 106531 105316 104582 104964 106855 109424 111364 112350 113008 113693 114128 114155 114023 113847 113392 112560 111598
55102 111598 110788 110368 110546 110913 110049 106752 101942 98403 98058 100191 102886 105441 108454 112034 115087 116468
55086 116468 116113 114865 113737 113401 113879 114577 115006 115397 116155 116903 116858 116130 115684 115732 115283 113955 113158 114339
55068 114339 116741 118267 118247 117907 118088 118006 116788 114838 112842 110519 107470 104524 103013 103133 104113 105673
55052A05673K407K787J925N80lN2k03o41k32J025J818J296M3r44j242p91J65O44
55034A14359l20k005k171K97L718N428M629K639R80J57p3j79n09q63o23K39Q06
55017A26509N56L61J123J996J397m30j454o85N13O11j11o41j109k158l176k713
55001A20589n36J865L044K908K168J346O60J95k69j155k355k892j827M73K386
54986A26600K567J323K12J73M04m23k101k826j514O08J435M73q51j033J15J787
54970A26949K957K859J493j35r85j224j741k343j685M36J915O92k334m085k901
54955A19868k05J618J853J430J124P75N9q32j502j819j799j332m54L22M13q9l77
54938A19053J20J165K216L108L788L769K567N90j052j765j873j799j507j091j124
$$ plain form
55052 105673 108080 110867 112792 113372 113369 113421 113218 112577 112345 113370 115188 116484 116527 115583 114341 113550 113715 114359
55034 114359 114039 112034 109863 110160 113878 119306 123935 126574 127554 127711 127638 127459 126950 126087 125464 125703 126509
55017 126509 127065 127426 128549 130545 131942 131512 130058 129373 129886 130497 130386 129745 128636 126478 123302 120589
55001 120589 120053 121918 124962 127870 130038 131384 132044 132239 131970 130815 128460 125568 123741 124214 126600
54986 126600 129167 130490 130702 130875 131279 130856 128755 125929 124415 125023 126458 126931 126080 125047 125162 126949
54970 126949 129906 132765 134258 134123 133138 131914 130173 127830 126145 126581 128496 129188 126854 122769 119868
54955 119868 119663 121281 123134 124564 125688 126463 126522 125690 124188 122369 120570 119238 118784 119106 119519 119430 119053
54938 119053 119173 120338 122554 125662 129450 133219 135786 136376 135324 133559 131686 129887 128380 127289 126165
54923A26165j871k560k127m72J444K594K602J736O38q8l82p31j368j774j424o73
54907A21709l69p56j204j024K2J781L707M843M458K953J613J260J530J618J218
54892A43359O09M2n34j300k270l134l377k742j523k51P75J446J522Q19l36j177
54876A31928j110j38J167J873J206n91k128k133q36M40R25R65J055J168J206J344
54860A36341J574J564J270J090J111R43O58J109K617M008L878K404J098R23J503
54845A62091K183K890L625L798K715O20j316k206k403k913l968m699m447l747
54831A52223l323k703j019J017J444k42k073k217j348j199j727j396J94J710K141
54816A41482J919J637J056J07l31M15J638K149J822J412J268J207J408K449M204
$$ plain form
54923 126165 124294 121734 119607 119135 120579 123173 125775 127511 128149 128061 127679 126948 125580 123806 122382 121709
54907 121709 121340 120584 119380 118356 118378 120159 123866 128709 133167 136120 137733 138993 140523 142141 143359
54892 143359 143968 144010 143476 142176 139906 136772 133395 130653 129130 128879 129654 131100 132622 133441 133105 131928
54876 131928 130818 130680 131847 133720 134926 134335 132207 130074 129238 129678 130603 131568 132623 133791 134997 136341
54860 136341 137915 139479 140749 141839 142950 143893 144551 145660 148277 152285 156163 158567 159665 160588 162091
54845 162091 164274 167164 170789 174587 177302 177922 176606 174400 171997 169084 165116 160417 155970 152223
54831 152223 148900 146197 145178 146195 147639 147397 145324 143107 141759 140560 138833 137437 137631 139341 141482
54816 141482 143401 145038 146094 146201 145870 146285 147923 150072 151894 153306 154574 155781 157189 159638 163842
54801A63842N519N384M027K391R40m17j416j322j68N52o60l268n093m991m176
54786A61144m228m797m363k846j916k582l753l828k723j533q09p3J079K188K354
54771A33314J185p21k149k216j172r0L18L39O08J199J572J186l6j539k360j860
54755A27578n57K46o1o70n01L56Q74N17k77q57r65n64K47J049J325J092Q88R13
54737A30633O92m5o08k4J581K824K512R78l06m31M2On91o30N83K246L001K597
54719A45060J858J236L73o30o11J110L214L613K100O33O34J208Q22k47m02Q19
54703A60790K202K859L327M072M271L166J731J612K756L448K691J313M57J19k83
54688A94531p82j094j330j741k132k182k157k672l811m858m952l870k256j130
$$ plain form
54801 163842 169361 174745 178772 181163 182103 181686 180270 178948 178780 179332 178672 175404 170311 165320 161144
54786 161144 156916 152119 147756 144910 142994 140412 136659 132831 130108 128575 127766 127693 128772 130960 133314
54771 133314 134499 133778 131629 129413 128241 128151 128469 128808 129416 130615 132187 133373 133337 131798 129438 127578
54755 127578 127021 127267 127206 126536 126035 126391 127265 127782 127505 126648 125683 125119 125366 126415 127740 128832 129720 130633
54737 130633 131325 131280 130672 130648 132229 135053 137565 138543 138237 137806 137848 137854 137263 136633 137216 139462 142463 145060
54719 145060 146918 148154 148527 147897 147286 148396 151610 155223 157323 157956 158590 159798 160620 160373 159971 160790
54703 160790 162992 165851 169178 173250 177521 180687 182418 184030 186786 190234 192925 194238 194695 194814 194531
54688 194531 193749 192655 191325 189584 187452 185270 183113 180441 176630 171772 166820 162950 160694 159564
54674A59564q30n51O11K051J980k84l102m251l289j436K09J407K084K117J834
54659A58114J852K207K278J667O46k60o03QJ517L082L834L902L996M077L383J862
54643A91562N17j0k28q20j696k523l354m138m374l888l224k680j658J34J572J289
54627A66481l76j690j731j315j527k257k512j664l9J515K294K026P65j196l125
54612A55649l894l031j659j525k730l389k187l08J73q81j779j534q18l09M78K047
54596A34303L582L633J907k18r77P6J651K152J493R99J397J685O33j338k719k816
54580A45443k045q29M32P22p49k976l885k870j234l0J055K285K964K696K107J584
54564A44670O67n68j029n00m20j531k275j204M41O82J70J142L506M569K880J13
$$ plain form
54674 159564 158734 158183 158794 160845 162825 162541 159439 155188 151899 150463 150672 152079 154163 156280 158114
54659 158114 159966 162173 164451 166118 166764 166504 165901 165909 167426 170508 174342 178244 182240 186317 189700 191562
54643 191562 192079 192069 191841 191021 189325 186802 183448 179310 174936 171048 167824 165144 163486 163620 165192 166481
54627 166481 166105 164415 162684 161369 159842 157585 155073 153409 153370 154885 157179 159205 159970 158774 155649
54612 155649 151755 148724 147065 145540 142810 139421 137234 136926 137099 136218 134439 132905 132087 131778 132256 134303
54596 134303 137885 141518 143425 143207 142230 142306 143957 146109 147602 148601 149998 151683 152316 150978 148259 145443
54580 145443 143398 142569 143001 143723 142974 139998 136113 133243 132009 131979 133034 135319 138283 140979 143086 144670
54564 144670 145337 144769 143740 143240 142820 141289 139014 137810 138251 138933 139103 140245 143751 148320 151200 151313
54548A51313j534j954k220k514k108o11J493L142L363K153O96l2n52j815l245
54533A45575l299j899o43l75k76J82K49l06j93J317K803K545R59l02p18r50j230
54516A43439j271j277j671k055j679o51M36J618L030L714K473r4j907j894q51
54501A41360K76J458K607K941K148J186J010J256R24j99j511k486k899k504j205
54486A44362M47J465J195j52j545j760l02K000L688L992L238J973L61j281k041
54471A55640j232M96J499P60j008k016j207O85J945J790J111J086J566J481M85
54456A63081o10j113j284j654k239k791l166l125k309q14O73J718K586L395L525
54441A55873K474R78L58Q95J417P06j138k823l156k063n18M39N87M35N15J001
$$ plain form
54548 151313 149779 147825 145605 143091 140983 140372 141865 145007 148370 150523 151219 151187 150635 148820 145575
54533 145575 142276 140377 139734 139359 139083 139265 139514 139208 139015 140332 143135 145680 146639 146337 145619 144669 143439
54516 143439 142168 140891 139220 137165 135486 134835 135271 136889 139919 143633 146106 146012 144105 142211 141360
54501 141360 141636 143094 145701 148642 150790 151976 152986 154242 155166 154967 153456 150970 148071 145567 144362
54486 144362 144809 146274 147469 147317 145772 144012 143710 145710 149398 153390 156628 158601 158962 157681 155640
54471 155640 154408 154904 156403 157163 156155 154139 152932 153617 155562 157352 158463 159549 161115 162596 163081
54456 163081 162471 161358 160074 158420 156181 153390 150224 147099 144790 143976 144649 146367 148953 152348 155873
54441 155873 158347 159325 159683 160578 161995 162701 161563 158740 155584 153521 153003 153442 154029 154464 154979 155980
54425A55980J674J919J017q68k223j667J36J071K99p41m66Q58K026K598K745K254
54409A66612R43n52j518k093k535k267r09M68O77L95J075K279K092K36j378j522
54393A62003j072r36o01K89P62K58q6O58J495J215M99N15P01q1j137r14J95M04
54375A64167l84m88M01M78j105k617k317q10L30Q12J228J637J883K319K997L067
54359A71598K105J179J308J705R21r00k329k689k361j459J44J631J688L57r27
54344A71971j408j750k301k049j29K635M534M739L596J866L55j84M01J389J875
54329A85540J613R69M19K79O21J123J383J441J585J646J128J84l64k95m10j186
54313A95676j863j544n65O1N6j44l29n82o52j45P46J416J627J514R71k06j678
$$ plain form
54425 155980 157654 159573 160590 159722 157499 155832 155968 157039 157338 156597 156131 156989 159015 161613 164358 166612
54409 166612 167555 167003 165485 163392 160857 158590 157681 158149 158826 159221 160296 162575 164667 164903 163525 162003
54393 162003 160931 159995 159394 159683 160445 160703 160617 161275 162770 163985 164484 164999 165700 165619 164482 163568 163763 164167
54375 164167 163783 163295 163696 164174 163069 160452 158135 157325 157655 158467 159695 161332 163215 165534 168531 171598
54359 171598 173703 174882 176190 177895 178816 177916 175587 172898 170537 169078 169222 170853 172541 172898 171971
54344 171971 170563 168813 166512 164463 164334 166969 171503 176242 179838 181704 182059 181875 182276 183665 185540
54329 185540 187153 188122 188541 188820 189441 190564 191947 193388 194973 196619 197747 197931 197567 197272 196862 195676
54313 195676 193813 192269 191704 191765 191821 191677 191348 190766 190114 189969 190715 192131 193758 195272 196243 196037 194359
54296A94359k680k790j996l45J735K984K270J74j235o17J304K828L128K661K287
54281B04067K371K530K163J442J500L033M926N166L274Q35o39j362k213l044l142
54266B20907k776l060m233n033m165j898J40N15p50k329k874k181j188r02j426
54251A88747k041k039j487j220j912l008k986j167J098J888J135N70J141J706
54237A80425Q70q93j918j389J71J876L025L043K002R64Q65J156N45r76j942j491
54221A86333n57n04j355k078k081j659j160m38P09J932K510K098J122K60l92j223
54205A83517k165k397j369L10J584K209K571K586J786N19J6Q17J841J629K2j795
54189A91681k616k151r96o9J94K03N56R85N92o95j639j271k39J16n09j302j681
$$ plain form
54296 194359 191679 188889 186893 186548 188283 191267 193537 193711 192476 191859 193163 195991 199119 201780 204067
54281 204067 206438 208968 211131 212573 214073 217106 222032 227198 230472 231307 230668 229306 227093 224049 220907
54266 220907 218131 215071 210838 205805 201640 199742 199882 200397 199647 197318 194444 192263 191075 190173 188747
54251 188747 186706 184667 183180 181960 180048 177040 174054 172887 173985 175873 177008 177578 178719 180425
54237 180425 181295 180402 178484 177095 177266 179142 182167 185210 187212 188176 189041 190197 190742 189766 187824 186333
54221 186333 185776 185272 183917 181839 179758 178099 176939 176501 177210 179142 181652 183750 184872 185132 184740 183517
54205 183517 181352 178955 177586 177896 179480 181689 184260 186846 188632 189151 189167 189984 191825 193454 193476 191681
54189 191681 189065 186914 185918 185849 186043 186246 186802 187787 188379 187684 186045 184774 184535 184651 184142 182840 181159
54172A81159j664j268n07m2o24j698j652l2J496J222l22j190o10M58J087J413
54156A77226J682J539R65Q00J467J940J081m53j004l73n2p65j253l21J186J594
54140A85259Q20J69J65L1p05j406j519j359j279j008m57l43j153k107j993p44
54124A72371N81J129R73O07M05N27Q73J136J158J123J092P29j31j039j532j814
54108A78188k117j953r01K07J68o66p07L85R99J20q66j15J785K458R30j192j877
54091A74846q70O09J413J291O75K38L71Q55J145R98O30L25K62N37R40Q07j82j188
54073A83702r94K37R26K07p58l46J248K256J583j5r78n62O73J552J418Q17Q57
54056A91823J651J896N70j376j968o72J097J969K004J701P96j000k774l001j304
$$ plain form
54172 181159 179495 178227 177720 177678 177054 175356 173704 173672 175168 176390 176068 174878 174268 174726 175813 177226
54156 177226 178908 180447 181412 182212 183679 185619 186700 186247 185243 184870 184818 184053 182800 182479 183665 185259
54140 185259 186079 186248 186413 186444 185739 184333 182814 181455 180176 179168 178711 178368 177215 175108 173115 172371
54124 172371 172952 174081 175054 175661 176066 176593 177466 178602 179760 180883 181975 182704 182573 181534 180002 178188
54108 178188 176071 174118 173217 173424 173592 172926 172219 172604 173603 173723 172857 172742 174527 176985 177915 176723 174846
54091 174846 173976 174585 175998 177289 177964 178202 178573 179428 180573 181571 182201 182526 182788 183325 184265 185072 184890 183702
54073 183702 182708 182945 183871 184078 183320 182974 184222 186478 188061 188046 187068 186506 187179 188731 190149 190966 191823
54056 191823 193474 195370 195940 194564 192596 191924 193021 194990 196994 198695 199491 198491 195717 192716 191412
54041A91412J134K856L203K227L50j586k557k199j310j037j577j972j295J80J276
54026A89105J265M91m04j318k220k352r14J458K977K824K136K194K588K194J265
54011B01289J116J811J794K78j196o16J825L882L826K024J13o02R7J442K272J991
53995B21346J200J028J746K450K404K101K519L557L927K782R94L78J714L854M966
53980B56966M549L894M355N563N985N253N003O740R461J0595R103O578N082N030
53966C44157N709O730P907Q493P784O195M690L322J403j064l217m648n764o686
53952C75011o900o412o112o597p505q459r604j0576j0147p795m837l001k592k931
53938B81543l690m695n119m293k885k028j680j138p42j426k731l008j892r19j109
$$ plain form
54041 191412 192546 195402 198605 200832 201182 199596 197039 194840 193530 192493 190916 188944 187649 187829 189105
54026 189105 190370 190861 190457 189139 186919 184567 183653 185111 188088 190912 193048 195242 197830 200024 201289
54011 201289 202405 204216 206010 206288 205092 204476 206301 210183 214009 216033 216146 215544 215641 217083 219355 221346
53995 221346 222546 223574 225320 227770 230174 232275 234794 238351 242278 245060 246054 246432 248146 252000 256966
53980 256966 261515 265409 269764 275327 281312 286565 291568 298308 307769 318364 327467 334045 339127 344157
53966 344157 349866 356596 364503 372996 380780 386975 391665 394987 396390 395326 392109 387461 381697 375011
53952 375011 368111 361699 355587 348990 341485 333026 323422 312846 302699 294904 290067 287066 284474 281543
53938 281543 277853 273158 268039 263746 260861 258833 257153 256015 255273 253847 251116 248108 246216 245297 244188
53923B44188j404m56J233J972J012q30k154j977k68J860K967K714K014J540Q64
53908B53275m79j983k851k959k433j044J069K722K821J801R79P71O05L23M64J105
53892B54186J485J184P71Q60J194J221J106J574K922M653O003O552O276N397M350
53877B99734L747M068N244O706P935Q823R317R106Q061O788O109O054N937N451
53863C93080N036M983M928M537M096M053M468N223O252P251P731P668P410O741
53849D73457M913K123o9n83k77o49j872l088l904m317l917k604j697k717n155
53834D49644o939p151o661o061m773k832j785k613m028m181l204k666l030l033
53820C90687j668L51J504J305Q37J599L890O302O934N147J932j400m402p206r626
$$ plain form
53923 244188 242784 242328 243561 245533 246545 245715 243561 241584 241316 243176 246143 248857 250871 252411 253275
53908 253275 252796 250813 247962 245003 242570 241526 242595 245317 248138 249939 250918 251689 252294 252617 253081 254186
53892 254186 255671 256855 257626 258486 259680 260901 262007 263581 266503 271156 277159 283711 289987 295384 299734
53877 299734 303481 307549 312793 319499 327434 336257 345574 354680 362741 369529 375638 381692 387629 393080
53863 393080 398116 403099 408027 412564 416660 420713 425181 430404 436656 443907 451638 459306 466716 473457
53849 473457 478370 480493 480424 479841 479564 478915 477043 473955 470051 465734 461817 459213 457516 454799 449644
53834 449644 442705 435554 428893 422832 418059 415227 413442 410829 406801 402620 399416 396750 393720 390687
53820 390687 389019 389370 390874 392179 393016 394615 398505 404807 411741 416888 418820 417420 413018 405812 396186
53805C96186j0953j0490q212n122k925k791m248n695o234o374o837p324p029n827
53791C06125m394l448l286l664l838l113j839j334k244l504l648k784k318k812
53777B63899l166k232m59O36L50m75m57Q63K609L395K541O66p62o79N42J248J54
53760B68673k118l464k629o06P69J129J551K541L254L001K408K470L247M177N004
53745B89407N649N721N016M132L858M104M118L605L056L023L581M381M843M531
53731C49025L650K901K497J867Q04K73J103K450K621J282l32j351k198l366m466
53716C56760n106n701o604p184o668n501m957n466o134n983n017l822k648j381
53702B84588k49P8o60j644j709p67K2l17j307j636q01L49N81m71j937k370r80
$$ plain form
53805 396186 385233 374743 366531 361409 358484 355693 351445 345750 339516 333142 326305 318981 311952 306125
53791 306125 301731 298283 294997 291333 287495 284382 282543 281209 278965 275461 271813 269029 266711 263899
53777 263899 260733 258501 258042 258678 259028 258553 258096 258959 261568 264963 267504 268170 267408 266729 267271 268519 268673
53760 268673 266555 263091 260462 259856 260625 261754 263305 265846 269100 272101 274509 276979 280226 284403 289407
53745 289407 295056 300777 305793 309925 313783 317887 322005 325610 328666 331689 335270 339651 344494 349025
53731 349025 352675 355576 358073 359940 360744 361017 362120 364570 367191 368473 368141 366790 364592 361226 356760
53716 356760 351654 345953 339349 332165 325497 319996 315039 309573 303439 297456 292439 288617 285969 284588
53702 284588 284339 284417 283757 282113 280404 279637 279659 279342 278035 276399 275598 275947 276528 276057 274120 271750 270770
53685B70770J434L029K762J437M92K43O7j33J97R38J126N97O20K034L614L427
53669B92654J542J07N98J992K260J059O6P02K362L406L428L619M830O169O128
53654C30922M556K750J817J735J986K306K602K696K539K346K453L191M679O193
53640C72771O146L626Lk009j166J207L165M125M441M151L213K235J843J673R64
53625D06388J5l5J100K173J789o3j977k481j407r7o4j293k285k075j478j785k822
53608C93603l283k616j519p57m94p56j417j687p16Q85J348P2j352j223J75J476
53592C81739K362L458M556M447K765P86k32m97q23j002j40J611K756K266R02K40
53576D05194Q21J975L124M271N237N464N030M947N696O328N937N303N775O951
$$ plain form
53685 270770 272204 275233 277995 279432 279924 280167 280234 280101 280298 281236 282362 282959 283579 285613 289227 292654
53669 292654 294196 294303 294901 296893 299153 300212 300278 300980 303342 306748 310176 313795 318625 324794 330922
53654 330922 335478 338228 340045 341780 343766 346072 348674 351370 353909 356255 358708 361899 366578 372771
53640 372771 378917 382543 382546 380537 379371 380578 383743 387868 392309 396460 399673 401908 403751 405424 406388
53625 406388 406403 406368 407468 409641 411430 411367 409390 406909 405502 405405 405341 404048 401763 399688 398210 396425 393603
53608 393603 390320 387704 386185 385428 384934 384178 382761 381074 380358 381243 382591 382663 381311 380088 380263 381739
53592 381739 384101 387559 392115 396562 399327 400113 399881 399384 398561 397559 397419 399030 401786 404052 404954 405194
53576 405194 406015 407990 411114 415385 420622 426086 431116 436063 441759 448087 454024 459327 465102 472053
53562D72053P163O145N465N832N903M804M112N572Q150R304Q580P693P395O543
53548E64714M704L389L732M639M572L769L297L085K431J598J308J214N52j35L10
53533F03179J408J394Qr20l27L99l45j941k696k380k111k403k782l170m162n847
53517E77304p344p830p327o313n081l648j974k88O60J09j497k464j710j27P77
53502E33247J043J793L012L380K474J516J393J354O09J18J556M921Q212R383Q129
53487E82140N934M792N626P626R298J0130J0789J1828J2999J4052J5207J6475
53475G06896J7408J8032J9023K0388K1026K0511K0225K1554K3879K5605K6551
53464I41098K7783K9508L0681L0704L0118K9573K9351L0067L2473L6197L9682
$$ plain form
53562 472053 479216 485361 490826 496658 502561 507365 511477 517049 525199 534503 543083 550776 558171 564714
53548 564714 569418 572807 576539 581178 585750 589519 592816 595901 598332 599930 601238 602452 603004 602869 603179
53533 603179 604587 605981 605989 605069 604742 605141 604796 602855 600159 597779 595668 593265 590483 587313 583151 577304
53517 577304 569960 562130 554803 548490 543409 539761 537787 537499 538159 538268 536771 534307 532597 532470 533247
53502 533247 534290 536083 539095 542475 544949 546465 547858 549212 549821 549939 551495 556416 564628 574011 582140
53487 582140 588074 592866 598492 606118 615416 625546 636335 648163 661162 675214 690421 706896
53475 706896 724304 742336 761359 781747 802773 823284 843509 865063 888942 914547 941098
53464 941098 968881 998389 1029070 1059774 1089892 1119465 1148816 1178883 1211356 1247553 1287235
53453A287235M1822M2890M3571M4035M4303M4627M5013M5008M4353M3331M2267
53442A768455M1211M0201L9261L8096L6455L4766L3617L2757L1640L0765L1166
53431B158390L2411L2728L1601L0649L1002L1273K9514K6042K2849K0914J9543
53420B466916J8048J6483J4722J2051Q063L271j396n233q049j0311j2848j5973
53408B485744j9116k1722k4059k6536k8674k9656k9637k9669l0394l1520l2488
53397B182273l3063l3305l3564l4325l5457l5902l4741l2344k9820k7627k5481
53386A826644k3356k1483j9552j6963j3942j1469r877q344n944k482J655N615
53374A700502Q075Q353P814Q957J2644J7175K0541K2470K3625K4161K4310K5423
$$ plain form
53453 1287235 1329057 1371947 1415518 1459553 1503856 1548483 1593496 1638504 1682857 1726188 1768455
53442 1768455 1809666 1849867 1889128 1927224 1963679 1998445 2032062 2064819 2096459 2127224 2158390
53431 2158390 2190801 2223529 2255130 2285779 2316781 2348054 2377568 2403610 2426459 2447373 2466916
53420 2466916 2484964 2501447 2516169 2528220 2536283 2539554 2538158 2532925 2524876 2514565 2501717 2485744
53408 2485744 2466628 2444906 2420847 2394311 2365637 2335981 2306344 2276675 2246281 2214761 2182273
53397 2182273 2149210 2115905 2082341 2048016 2012559 1976657 1941916 1909572 1879752 1852125 1826644
53386 1826644 1803288 1781805 1762253 1745290 1731348 1719879 1710002 1701658 1695714 1693232 1694887 1700502
53374 1700502 1708577 1716930 1724744 1733701 1746345 1763520 1784061 1806531 1830156 1854317 1878627 1904050
53362A904050K8838L3986L8876M2452M5308M8150N0660N2337N3485N4895N7031
53351B410068N9906O3285O6694O9681P2390P5406P8794Q1765Q3769Q5454Q7774
53340C234986R0474R2305R2837R3147R4227R5486R5484R3776R1219Q8678Q6246
53329D248865Q3687Q0744P6835P1352O4826N9043N5204N2364M8290M1631L2667
53318D915508K2475J2193K909m820j1611j8821k7198l6391m5772n5128o4298p2739
53306D616307p9865q5496q9759r2834r5001r6608r7715r8022r7291r5631r3272
53295C594813r0449q7546q5051q3122q1425p9595p7521p5126p2216o8855o5615
53284B728292o3036o0997n8886n6339n3514n0526m7024m2601l7601l3158l0192
$$ plain form
53362 1904050 1932888 1966874 2005750 2048202 2093510 2141660 2192320 2244657 2298142 2353037 2410068
53351 2410068 2469974 2533259 2599953 2669634 2742024 2817430 2896224 2977989 3061758 3147212 3234986
53340 3234986 3325460 3417765 3510602 3603749 3697976 3793462 3888946 3982722 4073941 4162619 4248865
53329 4248865 4332552 4413296 4490131 4561483 4626309 4685352 4740556 4792920 4841210 4882841 4915508
53318 4915508 4937983 4950176 4953085 4948265 4936654 4917833 4890635 4854244 4808472 4753344 4689046 4616307
53306 4616307 4536442 4450946 4361187 4268353 4173352 4076744 3979029 3881007 3783716 3688085 3594813
53295 3594813 3504364 3416818 3331767 3248645 3167220 3087625 3010104 2934978 2862762 2793907 2728292
53284 2728292 2665256 2604259 2545373 2489034 2435520 2384994 2337970 2295369 2257768 2224610 2194418
53273B194418k8517k7174k5565k3904k2658k1981k1656k1181j9966j8023j6315
53262A947478j5587j4886j2368p891l526q63Q06K664M237M639M867O785J0362
53249A926717J3820J6371J8818K1535K3748K5227K6894K9211L1606L3812L6161
53238B203920L8166L8779L8658M0110M3611M6351M5772M2926M0577L9354L7691
53227B655915L4650L0774K6593K2056J7292J2564P637K263l046p745j2262j7204
53215B769487k2090k6055k9237l2184l4594l6029l7384m0039m3751m6909m8742
53204B372473m9786n0354n0199m9768n0189n1653n3116n3815n3869n3190n1329
53193A805205m8721m6718m5910m5545m4986m4479m4061m3054m1313l9676l8413
$$ plain form
53273 2194418 2165901 2138727 2113162 2089258 2066600 2044619 2022963 2001782 1981816 1963793 1947478
53262 1947478 1931891 1917005 1904637 1896746 1893220 1892357 1893163 1895827 1900064 1904703 1909570 1916355 1926717
53249 1926717 1940537 1956908 1975726 1997261 2021009 2046236 2073130 2102341 2133947 2167759 2203920
53238 2203920 2242086 2280865 2319523 2359633 2403244 2449595 2495367 2538293 2578870 2618224 2655915
53227 2655915 2690565 2721339 2747932 2769988 2787280 2799844 2807481 2809744 2806698 2798953 2786691 2769487
53215 2769487 2747397 2721342 2692105 2659921 2625327 2589298 2551914 2511875 2468124 2421215 2372473
53204 2372473 2322687 2272333 2222134 2172366 2122177 2070524 2017408 1963593 1909724 1856534 1805205
53193 1805205 1756484 1709766 1663856 1618311 1573325 1528846 1484785 1441731 1400418 1360742 1322329
53182A322329l6486l3334l0315k9121k9421k9267k7497k4739k2119j9997j8102
53171A021931j6302j4924j4402j4738j5366j5713j5806j6070j6636j7185j7332
53160H47457j6853j5773j4783j5177j7568k0708k2365k1395j8472j5106j2690
53149F56567j2136j3176j4092j3347j1542j0694j1413j2131j1439r925r146r837
53137E17689j1656j3682j4638j3628j1184q752o853m812k621j566k310l678m358
53124D17951m567m969n115m292k937j848q33M37R26n98l182m253k843q72o85k333
53108C79987l932l964k546p67M98J014Q13j02j509k761l330l358l207k654j292
53093C52890M06J346J174M61n05j864l076l022j779q91j153j425n60P93J425J359
$$ plain form
53182 1322329 1285843 1252509 1222194 1193073 1163652 1134385 1106888 1082149 1060030 1040033 1021931
53171 1021931 1005629 990705 976303 961565 946199 930486 914680 898610 881974 864789 847457
53160 847457 830604 814831 800048 784871 767303 746595 724230 702835 684363 669257 656567
53149 656567 644431 631255 617163 603816 592274 581580 570167 558036 546597 536672 527526 517689
53137 517689 506033 492351 477713 464085 452901 444149 437296 432484 429863 428297 425987 422309 417951
53124 417951 413384 408415 403300 399008 396071 394223 393390 393827 394753 394155 390973 386720 383877 383005 382320 379987
53108 379987 376055 372091 369545 368778 369276 370290 371103 371001 369492 366731 363401 360043 356836 354182 352890
53093 352890 353296 354642 355816 356277 355772 353908 350832 347810 346031 345140 343987 342562 342002 342795 344220 345579
53077C45579J240R49K76O7J149K686L040J888K43j164k260k815k530j769j193
53062C45386r19r01j454k477k941k296j666k215l130k743j009P56J923K596K231
53047C31141L89j558j723o06l95j303j228M36J399qk219k948k383k066k079j438
53031C13411l65j68j052j624p23J233K833K943J574r9p37k36K08l30j412k002
53015C13454j736r70j26M73M98j94j368k501k760j301J612L851L095m04l763m628
52999C03232l468k211j785j827j864j611o47J043K467K476J189o0k26N05J214
52984B98427J269P50R6m33p99p59K6J163J453L88p77m43J119K081J422j39j476
52967C03368k091j819p59K46J92q12j845k546k900k037P63L854M287J685j072
$$ plain form
53077 345579 346819 347768 348044 348111 349260 351946 354986 356874 357117 355953 353693 350878 348348 346579 345386
53062 345386 344467 343566 342112 339635 336694 334398 332732 330517 327387 324644 323635 324391 326314 328910 331141
53047 331141 331530 329972 328249 327643 327248 325945 324717 325153 326552 326544 324325 321377 318994 316928 314849 313411
53031 313411 313046 312878 311826 310202 309479 310712 313545 316488 318062 317963 317226 316990 317198 316868 315456 313454
53015 313454 311718 310748 310622 311095 311593 311399 310031 307530 304770 303469 305081 308932 312027 311623 307860 303232
52999 303232 299764 297553 295768 293941 292077 290466 289819 290862 293329 295805 296994 296934 296708 297213 298427
52984 298427 299696 300446 300542 300109 299310 298551 298577 299740 301193 301581 300804 300361 301480 303561 304983 304844 303368
52967 303368 301277 299458 298699 298945 299137 298325 296480 293934 291034 288997 289760 293614 297901 299586 298514
52952B98514j820j569j842j934n81J427K340J876Q23m19j339p78J259K591J642
52937C00190p3l21M10K82m11o3P74M8j895k374n79J199J328R47J293J617J227
52920C03599J250K572L789L085R57o35r34o70m05n7L43N76P49J041J226J044P15
52903C18245N60N16M48N25Q74J188R80n5j799l302k999m44K329K570J43k395l242
52886C14142l192l381l144j525O21J715J651J377J113N59J96N50P60l20j750j404
52870C07968O01J430o48l727m825l664k282j573k31K594N135M751J280k488l852
52855C00469k892j661j365j343o45M46J009P57M6q81j878k419j974p87L74J273
52839B88529K233L041K731R00j364k605k587k092j445j63J740L096K841J405J25
$$ plain form
52952 298514 296694 295125 293283 291349 290768 292195 294535 296411 297234 296815 295476 294698 295957 298548 300190
52937 300190 300117 299796 300206 300488 300077 300014 300788 300836 298941 296567 295988 297187 298515 299462 300755 302372 303599
52920 303599 304849 307421 311210 314295 315252 314617 313683 313013 312608 312551 312894 313470 314219 315260 316486 317530 318245
52903 318245 318805 319321 319769 320294 321168 322356 323336 323281 321482 318180 315181 314737 317066 319636 319779 317384 314142
52886 314142 310950 307569 304425 302900 303521 305236 306887 308264 309377 309936 310132 310682 311442 311122 309372 307968
52870 307968 308569 309999 309351 305624 300799 297135 294853 293280 293049 295643 300778 305529 306809 304321 300469
52855 300469 297577 295916 294551 293208 292563 293009 294018 294775 294821 293940 292062 289643 287669 286882 287256 288529
52839 288529 290762 293803 296534 297434 296070 293465 290878 288786 287341 287178 288918 292014 294855 296260 296385
52824B96385m30p19j049j089p66o72j019r95J03J624K321K021J692J978K444K330
52808C04159J433J85o63n22L20O83j76j456j778j127p90j386k110k210k079k309
52792B90174k578k238j438r00r13j120j015l74M79O37n35k216k532p27J631K290
52776B78625P62j423k505j912k74J207J598R38L6o50j473k566l030k005q7J206
52760B68447J182M23l57r24r94j64J262K165J847Q56J27k62q45j647j977j375
52744B67764j69J095K288L283L396K066Q1p94L5J020M37j208j971j337p91j229
52728B73966j540o54L63n6j143n75J903L595K366l97j719r58k00q66j693q39J223
52711B72776K321J538J41n99q91j180p69R43K770K866J293j32m49m59p78q00l67
$$ plain form
52824 296385 295955 295236 294187 293098 292332 291660 290641 289646 289749 291373 293694 295715 297407 299385 301829 304159
52808 304159 305592 305777 305114 304592 304912 305595 305419 303963 302185 301058 300268 298882 296772 294562 292483 290174
52792 290174 287596 285358 283920 283020 282107 280987 279972 279598 280077 280714 280179 277963 275431 274704 276335 278625
52776 278625 279387 277964 275459 273547 273273 274480 276078 277016 277052 276402 274929 272363 269333 267328 267241 268447
52760 268447 269629 270052 269695 268771 267777 267613 268875 271040 272887 273743 273870 273608 272763 271116 269139 267764
52744 267764 267595 268690 270978 274261 277657 279723 279804 279010 279045 280065 280502 279294 277323 275986 275195 273966
52728 273966 272426 271772 272135 272079 270936 270361 272264 275859 278225 277828 276109 275151 274951 274085 272392 271553 272776
52711 272776 275097 276635 276776 276177 275286 274106 273337 274280 277050 279916 281209 281077 280628 280169 279391 278591 278224
52694B78224p80k858n063n191l247j293o80p62l28Q79K239L061L001K293J660
52679B71155J625J931K081K181K707L540L904L323K187J361J464K439L456L483
52665C06837K266O24n03r61j065r60p96j060j970k892k922j916m84O27P33n41
52649B95017k452l227j931K10J251R38O04J110K076K822K893J809k39j619p01
52634B98561J662K698J181r99j447j27J203J312K67j273k480k564j461q8O56P74
52618B97875P04N52K90J27R4k43j044j699j602j007n29k19J68M83M50L73Q27J738
52600B97338K344K026Q34o78j710j563k23J549K882L478L415K737J634N61k50
52585C14374j047j896k106j073N73J355N02j333k912l524l265k668k142j543l65
$$ plain form
52694 278224 277444 274586 269523 264332 261085 259792 259112 258350 258022 258901 261140 264201 267202 269495 271155
52679 271155 272780 274711 276792 278973 281680 285220 289124 292447 294634 295995 297459 299898 303354 306837
52665 306837 309103 309727 309224 308263 307198 306238 305442 304382 302412 299520 296598 294682 294198 294825 295558 295017
52649 295017 292565 289338 287407 287617 288868 289806 290410 291520 293596 296418 299311 301120 300881 299262 298561
52634 298561 300223 302921 304102 303103 301656 301529 302732 304044 304311 303038 300558 297994 296533 296445 297101 297875
52618 297875 298579 299131 299421 299548 299642 299399 298355 296656 295054 294047 293518 293299 293467 293950 294400 294773 295600 297338
52600 297338 299682 301708 302542 301864 300154 298591 298368 299917 302799 306277 309692 312429 314063 314624 314374
52585 314374 313327 311431 309325 308252 308825 310180 310682 309349 306437 302913 299648 296980 294838 293295 292930
52570B92930J526L510M849N307M848L202M95j846j910N05L167L498J191j648k814
52555C16810j907o8J410J820J010m72j313m90J304K132J135m09r86q73j153j534
52539C16416q24P32J477R62O76J502K131J159o42j542j288p53l3J424L194M023
52523C28614L581K659J674M01p75p99L36J086K68j473k709k928k510j825j039
52508C24561l85Q4O44J217R58p11k912l903k952j106J56N04P73J601K526K573
52492C23628J456p1j031j084n45P1L58K15O2N11J446J800P97q60j716j383q57
52475C22797r70j316j136n74l73o46o77k0P04M59r48k547l220k802k033j579j453
52458C03666j291o99N73K336L605L311J671K53J31O77Q25Q03J609L182M411M741
$$ plain form
52570 292930 294456 297966 302815 308122 312970 316172 316667 314821 312911 313416 316583 320081 321272 319624 316810
52555 316810 314903 314835 316245 318065 319075 318603 317290 316800 318104 320236 321371 320962 319976 319103 317950 316416
52539 316416 315592 316324 317801 318763 319439 320941 323072 324231 323589 322047 320759 320006 319973 321397 324591 328614
52523 328614 332195 334854 336528 336929 336154 335355 335691 336777 337045 335572 332863 329935 327425 325600 324561
52508 324561 324176 324260 324904 326121 327079 326368 323456 319553 316601 315495 315651 316155 316928 318529 321055 323628
52492 323628 325084 325013 323982 322898 322353 322424 322782 322997 323059 323570 325016 326816 327613 326753 325037 323654 322797
52475 322797 321827 320511 319375 318801 318428 317782 317105 317085 317789 318248 317300 314753 311533 308731 306698 305119 303666
52458 303666 302375 301676 302249 304585 308190 311501 313172 313425 313556 314233 315058 315861 317470 320652 325063 329804
52442C29804M593M079K683O45o31l77K41l37j819k465j594n23o38j382r88R33
52426C32224K465J617j066l093l127k306k024j806n88R21R85m17j385q20L64J071
52410C23015J435J706J331K07m36L50J723K316K157K138K334K301K379L287M654
52395C50897N324M938M012K637M86j850k905k174r32p48j851l176l496k405q13
52380C47944l05j366k492j907O4J519J590J147Q75L26o10p79N87K483L381L066
52364C55523K291J437N56O2K18M12L2k52P68K953M700M828L841L181L809N493
52348C89852P045P303O367N702O491Q122Q838P590M680R22k871n782p133p070
52334D30056o098m234j551O85P52j217l013k979j829j075p80K7J466K691L303
$$ plain form
52442 329804 334397 338476 341159 341804 341173 340796 341037 340700 338881 336416 334822 334299 333661 332279 331291 332224
52426 332224 334689 336306 335240 332147 329020 326714 324690 322884 322296 323217 324202 323785 322400 321580 321944 323015
52410 323015 324450 326156 327487 327694 327258 327608 329331 331647 333804 335942 338276 340577 342956 346243 350897
52395 350897 356221 361159 365171 367808 368294 366444 363539 361365 360433 359685 357834 354658 351162 348757 347944
52380 347944 347639 346273 343781 341874 341938 343457 345047 346194 347069 347395 346785 346006 346593 349076 352457 355523
52364 355523 357814 359251 359807 359869 360087 360499 360531 360279 361047 364000 368700 373528 377369 380550 384359 389852
52348 389852 396897 404200 410567 416269 422760 430882 439720 447310 451990 452912 450041 444259 437126 430056
52334 430056 423958 419724 418173 418858 419610 418393 415380 412401 410572 409497 408717 408744 410210 412901 416204
52319D16204L678L937L749L300L362M002M159L080J535R79J877L471M868N730
52305D63931O067O029O034O541P392P723O905N353M140L904M441N234N878O037
52291E45609N525M750M624N657P372Q974J0149J0831J0743J0131J0438J2989J6807
52278F64599J9154J8877J7892J8542K0548K2045K2637K3502K4778K5066K4100
52267I01740K3954K6311K9879L2017L2013L1164L0133K8263K5608K3874K4340
52256A209296K5911K6350K4758K1942J8779J5391J1935R119P389O157M447K087
52244A383561k24k004l592n423p077p565o676n497n197n576n385m059k443j539
52230A321304j102j09J676L409M449N290O817R004J0851J1574J1545J1949J3555
$$ plain form
52319 416204 419882 423819 427568 430868 434230 438232 442391 445471 447006 447985 449862 453333 458201 463931
52305 463931 469998 476027 482061 488602 495994 503717 510622 515975 520115 524019 528460 533694 539572 545609
52291 545609 551134 555884 560508 566165 573537 582511 592660 603491 614234 624365 634803 647792 664599
52278 664599 683753 702630 720522 739064 759612 781657 804294 827796 852574 877640 901740
52267 901740 925694 952005 981884 1013901 1045914 1077078 1107211 1135474 1161082 1184956 1209296
52256 1209296 1235207 1261557 1286315 1308257 1327036 1342427 1354362 1363481 1370870 1377027 1381474 1383561
52244 1383561 1383337 1381333 1377741 1372318 1365241 1357676 1351000 1345503 1340306 1334730 1329345 1325286 1322843 1321304
52230 1321304 1320202 1320093 1321769 1325178 1329627 1334917 1341734 1350738 1361589 1373163 1384708 1396657 1410212
$$ [...]
##END NTUPLES=NMR SPECTRUM
##END=
