
##TITLE=AC1046_TOLI02_5906655_wCWJAPoUAQ
##JCAMPDX= 6.0         $$ Bruker NMR JCAMP-DX V2.0
##DATA TYPE= NMR SPECTRUM
##DATA CLASS= NTUPLES
##ORIGIN= BRUKER
##OWNER= Administrator
$$ 1.72 TOPSPIN		Version 2.1
$$ 2012-04-10 10:13:44.609 -0500  Administrator@TOPSPIN
$$ Compression mode = diff/dup
##.OBSERVE FREQUENCY= 400.13188235
##.OBSERVE NUCLEUS= ^1H
##.ACQUISITION MODE= SIMULTANEOUS (DQD)
##.ACQUISITION SCHEME= undefined
##.AVERAGES= 64
##.DIGITISER RES= 22
##SPECTROMETER/DATA SYSTEM= spect
##.PULSE SEQUENCE= noesygpps1d.comp
##.SOLVENT NAME= COFFEE_meoh
##.SHIFT REFERENCE= INTERNAL, COFFEE_meoh, 1, 14.96874
##AUDIT TRAIL= $$ (NUMBER, WHEN, WHO, WHERE, PROCESS, VERSION, WHAT)
$$ ##TITLE= Audit trail, TOPSPIN		Version 2.1
$$ ##JCAMPDX= 5.01
$$ ##ORIGIN= Bruker BioSpin GmbH
$$ ##OWNER= Administrator
$$ $$ C:\Bruker\TOPSPIN/data/COFFEE/nmr/AC1046_TOLI02_5906655_wCWJAPoUAQ/12/pdata/1/auditp.txt
$$ ##AUDIT TRAIL=  $$ (NUMBER, WHEN, WHO, WHERE, PROCESS, VERSION, WHAT)
(   1,<2012-04-04 15:20:25.062 -0500>,<Administrator>,<TOPSPIN>,<go>,<TOPSPIN 2.1>,
      <created by zg
	started at 2012-04-04 15:08:53.343 -0500,
	POWCHK enabled, PULCHK disabled,
       configuration hash MD5:
       1A 1E CE 29 27 FD 77 03 67 4E F0 E3 C4 B2 CB 90
       data hash MD5: 64K
       88 A0 F7 74 2E 5D 14 AE 88 2C 02 A3 9F DC 05 4A>)
(   2,<2012-04-04 15:20:28.859 -0500>,<Administrator>,<TOPSPIN>,<proc1d>,<TOPSPIN 2.1>,
      <Start of raw data processing
       efp LB = 0.3 FT_mod = 6 PKNL = 1 PHC0 = 0 PHC1 = 0 SI = 128K 
       data hash MD5: 128K
       83 D0 10 85 81 A1 7D 75 F5 B0 C3 AF FD B3 C4 AA>)
(   3,<2012-04-04 15:20:30.062 -0500>,<Administrator>,<TOPSPIN>,<proc1d>,<TOPSPIN 2.1>,
      <pk PHC0 = 37.63916 PHC1 = 0 
       data hash MD5: 128K
       B9 B4 D6 1F 15 65 7C 52 5B 8D 76 CD 57 59 AB E1>)
(   4,<2012-04-04 15:20:30.468 -0500>,<Administrator>,<TOPSPIN>,<proc1d>,<TOPSPIN 2.1>,
      <abs ABSG = 1 
       data hash MD5: 128K
       F1 9E 38 0E 42 D7 D5 1C CF E8 96 A4 65 01 B5 E8>)
(   5,<2012-04-04 15:20:30.562 -0500>,<Administrator>,<TOPSPIN>,<proc1d>,<TOPSPIN 2.1>,
      <abs ABSG = 2 
       data hash MD5: 128K
       FE 0C FC D3 AD 8D B5 33 64 FD 29 40 63 70 13 E7>)
(   6,<2012-04-04 15:20:30.609 -0500>,<Administrator>,<TOPSPIN>,<proc1d>,<TOPSPIN 2.1>,
      <abs ABSG = 3 
       data hash MD5: 128K
       3C 0E C7 7D AC A8 FA A5 F6 DA 19 43 10 02 EA E7>)
(   7,<2012-04-04 15:20:30.671 -0500>,<Administrator>,<TOPSPIN>,<proc1d>,<TOPSPIN 2.1>,
      <abs ABSG = 4 
       data hash MD5: 128K
       A5 4E 1A 2F 86 70 8B 80 F9 EE 2A C7 A5 33 ED 4A>)
(   8,<2012-04-04 15:20:30.718 -0500>,<Administrator>,<TOPSPIN>,<proc1d>,<TOPSPIN 2.1>,
      <abs ABSG = 5 
       data hash MD5: 128K
       A1 32 D8 C7 00 6E 2A 21 F7 F9 38 E0 DC DE CE 8F>)
(   9,<2012-04-04 15:20:30.937 -0500>,<Administrator>,<TOPSPIN>,<audit>,<TOPSPIN 2.1>,
      <user comment:
       ICON-NMR User ID: COFFEE
       data hash MD5: 128K
$$ [...]
##$TP07= 0
##$TPNAME0= <>
##$TPNAME1= <>
##$TPNAME2= <>
##$TPNAME3= <>
##$TPNAME4= <>
##$TPNAME5= <>
##$TPNAME6= <>
##$TPNAME7= <>
##$TPOAL= (0..7)
0.5 0.5 0.5 0.5 0.5 0.5 0.5 0.5
##$TPOFFS= (0..7)
0 0 0 0 0 0 0 0
##$TUNHIN= 0
##$TUNHOUT= 0
##$TUNXOUT= 0
##$USERA1= <user>
##$USERA2= <user>
##$USERA3= <user>
##$USERA4= <user>
##$USERA5= <user>
##$V9= 5
##$VALIST= <valist>
##$VCLIST= <CCCCCCCCCCCCCCC>
##$VD= 0
##$VDLIST= <DDDDDDDDDDDDDDD>
##$VPLIST= <PPPPPPPPPPPPPPP>
##$VTLIST= <TTTTTTTTTTTTTTT>
##$WBST= 2048
##$WBSW= 25
##$XGAIN= (0..3)
0 0 0 0
##$XL= 0
##$YL= 0
##$YMAX_a= 15703228
##$YMIN_a= -7623129
##$ZGOPTNS= <>
##$ZL1= 120
##$ZL2= 120
##$ZL3= 120
##$ZL4= 120
##$ABSF1= 14.96874
##$ABSF2= -5.58379
##$ABSG= 5
##$ABSL= 3
##$ALPHA= 0
##$AQORDER= 0
##$ASSFAC= 0
##$ASSFACI= 0
##$ASSFACX= 0
##$ASSWID= 0
##$AUNMP= <proc_prof1d_extract.lims>
##$AXLEFT= 0
##$AXNAME= <>
##$AXNUC= <1H>
##$AXRIGHT= 0
##$AXTYPE= 0
##$AXUNIT= <>
##$AZFE= 0.1
##$AZFW= 0.1
##$BCFW= 0
##$BC_mod= 0
##$BYTORDP= 0
##$COROFFS= 0
##$CY= 15
##$DATMOD= 1
##$DC= 0
##$DFILT= <>
##$DTYPP= 0
##$F1P= 0
##$F2P= 0
##$FCOR= 0.5
##$FTSIZE= 131072
##$FT_mod= 6
##$GAMMA= 0
##$GB= 0
##$INTBC= 1
##$INTSCL= 1
##$ISEN= 128
##$LB= 0.3
##$LEV0= 0
##$LPBIN= 0
##$MAXI= 10000
##$MC2= 0
##$MEAN= 0
##$ME_mod= 0
##$MI= 0
##$NCOEF= 0
##$NC_proc= -3
##$NLEV= 6
##$NOISF1= 0
##$NOISF2= 0
##$NSP= 0
##$NTH_PI= 0
##$NZP= 0
##$OFFSET= 14.96874
##$PC= 1
##$PHC0= 37.63916
##$PHC1= 0
##$PH_mod= 1
##$PKNL= yes
##$PPARMOD= 0
##$PPDIAG= 0
##$PPIPTYP= 0
##$PPMPNUM= 2147483647
##$PPRESOL= 1
##$PSCAL= 4
##$PSIGN= 0
##$PYNMP= <proc.py>
##$REVERSE= no
##$SF= 400.130004750846
##$SI= 131072
##$SIGF1= 0
##$SIGF2= 0
##$SINO= 400
##$SIOLD= 131072
##$SPECTYP= <>
##$SREGLST= <1H.CDCl3>
##$SSB= 0
##$STSI= 131072
##$STSR= 0
##$SW_p= 8223.68421052632
##$SYMM= 0
##$S_DEV= 0
##$TDeff= 65536
##$TDoff= 0
##$TI= <>
##$TILT= no
##$TM1= 0
##$TM2= 0
##$TOPLEV= 0
##$USERP1= <user>
##$USERP2= <user>
##$USERP3= <user>
##$USERP4= <user>
##$USERP5= <user>
##$WDW= 1
##$XDIM= 131072
##$YMAX_p= 538889291
##$YMIN_p= -563912977
##$CURPLOT= <Network HP LaserJet P1505>
##$CURPRIN= <$Network HP LaserJet P1505>
##$DFORMAT= <normdp>
##$LAYOUT= <+/1D_H.xwp>
##$LFORMAT= <normlp>
##$PFORMAT= <normpl>
##$SURQMSG= 1
$$ End of Bruker specific parameters
$$ ---------------------------------
##NTUPLES= NMR SPECTRUM
##VAR_NAME=  FREQUENCY,     SPECTRUM/REAL,   SPECTRUM/IMAG
##SYMBOL=    X,             R,               I
##VAR_TYPE=  INDEPENDENT,   DEPENDENT,       DEPENDENT
##VAR_FORM=  AFFN,          ASDF,            ASDF
##VAR_DIM=   131072,        131072,          131072
##UNITS=     HZ,            ARBITRARY UNITS, ARBITRARY UNITS
##FACTOR=    0.0627417313425165, 1,          1
##FIRST=     8223.62146879498, 4044,         -125734
##LAST=      0,             7229,            -125902
##MIN=       0,             -563912977,      0
##MAX=       8223.62146879498, 538889291,    0
$$ Real data points
##PAGE= N=1
##DATA TABLE= (X++(R..R)), XYDATA
$$ [...]
66781 3267707 3239176 3209158 3179924 3152421 3125685 3098285 3070002 3041526 3013084 2984638 2957143
66770 2957143 2931859 2908020 2882982 2855572 2827678 2801209 2775056 2746922 2717058 2687874 2660293
66759 2660293 2632890 2604717 2576699 2549485 2522086 2493903 2466378 2440880 2416108 2389517 2360858
66748 2360858 2332493 2306220 2281397 2256465 2230806 2204473 2177412 2149973 2123380 2098650 2075427
66737 2075427 2052668 2030117 2008248 1987128 1966247 1945413 1924968 1905138 1885836 1867031 1848522
66726 1848522 1829395 1808657 1786515 1764184 1742295 1720464 1698652 1677796 1658461 1639893 1621154
66715 1621154 1602420 1584374 1567065 1550235 1534059 1518580 1502997 1486633 1470236 1455214 1441750
66704 1441750 1428590 1414543 1399258 1382716 1365015 1346803 1329119 1312610 1297287 1282840 1268642
66693 1268642 1253896 1238689 1224621 1213387 1204809 1197073 1188646 1179004 1167825 1154871 1140848 1127207
66681 1127207 1114703 1102937 1091386 1080029 1068885 1057958 1047631 1038100 1028477 1017706 1006420 996462
66669 996462 988305 980468 971840 962959 954310 945166 935282 926190 919218 913238 905999 897027 887734 879121
66655 879121 870846 862287 853260 843814 834392 825966 818939 812150 804188 795501 787882 781847 775948 769091
66641 769091 762138 756395 751496 745860 738814 731375 724935 719800 715116 709885 703855 697509 691345 685373
66627 685373 679476 674017 669650 666468 663678 660309 655965 650660 644210 636386 627837 620302 615232 612176
66613 612176 609149 604857 599894 595196 590153 583410 575366 568441 564411 562530 560866 558452 555230 550831
66599 550831 544886 538308 532909 529395 526644 523340 519560 516276 513796 511360 508132 504076 499775 495696
66585 495696 491845 488029 484188 480371 476569 472789 469253 466233 463665 461131 458295 455199 452146 449502
66571 449502 447538 446169 444831 442929 440410 437583 434429 430649 426499 423042 421217 420898 421027 420413 418385
66556 418385 415234 412220 410590 410229 409662 407729 404830 402125 399997 397802 394828 390942 386475 382007 378261
66541 378261 375809 374747 374680 374862 374384 372699 370225 368045 366644 365302 363101 360267 357973 356982 356885 356706
66525 356706 355911 354836 354257 354575 355332 355671 355160 353848 351609 348055 343403 339002 336502 336566 338412 340256
66509 340256 340222 337524 333198 329263 326858 325551 324573 323947 323972 324274 324110 323190 321592 319305 316439 313533
66493 313533 311069 309035 307403 306438 305911 304722 302287 299665 298082 296767 293798 289084 284944 283226 283224
66478 283224 283160 282495 281630 280211 277284 273028 269065 266633 265309 264015 262685 262187 262819 263741 264103 264053 264011
66461 264011 263444 261385 258198 255794 255453 256178 256022 254580 253134 252476 251715 249660 246573 243837 242265 241457
66445 241457 240806 240593 241624 243966 246458 247704 247323 245834 243598 240545 237078 234437 233545 233911 234223 233729
66429 233729 232533 230903 229031 227189 225372 222964 219706 216992 217025 220210 224272 226669 227185 227369 227925
66414 227925 227752 225587 221664 217437 214184 212240 211225 210592 210077 209864 210303 211446 212978 214560 215871
66399 215871 216263 215040 212574 210639 210757 212242 212768 211069 208253 206065 204774 203557 202341 202123 203515
66384 203515 205827 207644 207785 205799 202311 198951 197171 196843 196568 195443 193918 192801 192098 191218 189846
66369 189846 188335 187515 188106 189773 190861 189839 187165 185007 184967 186830 189557 192362 194492 195225 194877 194780
66353 194780 195426 195581 194242 192419 191626 191443 190285 188288 187536 189060 191104 191148 188683 185235 182358 180509
66337 180509 179547 179414 179939 180412 179891 178204 176364 175528 175619 175556 174880 174303 174250 173786 171871 169043 166779 165504
66319 165504 164318 162621 160968 160143 160308 161377 163395 166071 168482 169794 169979 169478 168392 166414 163543
66304 163543 160556 158557 158021 158333 158381 157520 155846 153830 152195 151971 153804 156919 159482 160464 160619 161236
66288 161236 162524 163702 164016 163125 161164 159045 158035 158236 158235 157144 156159 156844 158524 158921 157151 154506
66272 154506 152224 150081 147673 145660 144932 145413 146440 147617 148721 149368 149519 149969 151667 154621 157694
66257 157694 159448 159194 157478 155475 153666 151426 148394 145863 145776 148215 150864 151399 149751 147529 145746
66242 145746 143788 140579 136384 133199 133148 136361 140662 143489 143796 141958 138677 134781 131423 129317 127904
66227 127904 126272 124759 124620 126150 128219 129793 130854 131566 131680 131277 131211 132139 133598 134502 134151 132554
66211 132554 130285 128199 126831 125976 125257 124875 125126 125427 124903 123849 123445 123973 124571 125028 126429 129413 132974
66194 132974 135648 136837 136357 133956 130264 127107 125632 124891 123406 121407 120275 120380 120868 121267 121841 122324
66178 122324 121720 119787 117776 117171 118362 120935 124513 128611 131961 132860 130590 126325 122350 120313 120323
66163 120323 121619 123551 125590 126943 127017 126187 125332 124578 123209 120964 118626 117078 116393 116132 115884 115299
66147 115299 114279 113403 113464 114333 115097 115573 116574 118205 119140 118595 118010 119427 122731 125823 127275 127573 127757
66130 127757 128094 128428 128893 129622 130204 130088 129525 129759 131875 135363 138178 138704 137512 136534 136652 137063 137120 137583
66112 137583 139318 141803 143892 145445 147143 149072 150322 149827 147057 142274 136669 131667 127468 122952
66098 122952 117777 113725 112742 114222 115652 115708 115333 115805 117119 118499 119364 119445 118867 118377 118622 119116 118894
66081 118894 118260 118649 120420 122029 122035 120855 119757 119071 118391 117772 117577 117487 116724 115188 113616 112670 112439 112681
66063 112681 112861 112108 109986 107434 106212 107090 109058 110627 111392 111926 112599 113217 113709 114432 115456 115988 115048
66046 115048 112608 109765 107779 107278 108281 110457 113154 115628 117662 119600 121390 122046 120870 119005 118700
66031 118700 120550 122317 121340 117714 114148 112758 113011 113088 112368 111792 112235 113408 114324 114257 113210 111952 111585
66014 111585 112501 113727 113888 112927 112278 113167 115389 117937 119931 120548 119123 116253 114020 113955 115298 116405
65998 116405 117410 120004 124544 128876 130550 129225 126508 124242 123333 123387 123033 121264 118753 117159 117034
65983 117034 117355 117352 117618 118782 120155 120584 119877 118613 117235 116157 116094 117308 118919 119749 119607 119163 119050
65966 119050 119712 121494 124056 126187 127108 127545 128606 129994 130437 129715 129153 129951 131834 133482 133670 131980
65950 131980 129059 126354 124960 124624 124228 123195 122039 121619 122355 124066 126057 127434 127749 127282 126450 125277
65934 125277 123871 122887 122793 123092 123097 123178 124303 126465 128565 129863 130578 131022 131162 131306 132124 133410 133712 131966
65916 131966 128921 126164 124262 122731 121572 121689 123497 125967 127707 128591 129574 131125 132704 133990 135649
65901 135649 138154 140473 140997 139531 137367 135441 133618 131961 131334 132010 132748 132263 131000 130497 131470 133324
65885 133324 135156 136499 137487 138941 141768 145461 147778 146917 143647 140280 137912 135843 133545 131852 131844
65870 131844 133533 136062 138652 140994 143103 144939 146075 146059 145341 145235 146304 147361 146855 144675 141606
65855 141606 137700 132696 127731 124942 125011 126445 127665 128622 129877 131289 132349 132996 133404 133528 133365 133190
65839 133190 133199 133358 133730 134280 134363 133345 131958 131999 134154 137024 138865 139362 139017 137822 135716 133816 133820 136078
65821 136078 139074 141054 141581 141344 141041 140877 140862 141032 141156 140548 138699 136185 134512 134786 136852 139901 143334
65804 143334 146544 148510 148516 147092 145522 144605 144511 145348 146860 147837 147062 144876 142779 141403 139997 138013
65788 138013 135927 134161 132509 131204 131301 133135 135386 136601 136838 136889 136660 135534 133910 133123 133811 135231
65772 135231 136385 137100 137814 138751 139633 140037 139869 139505 139504 140216 141570 142960 143263 141520 138187 135334 134814
65755 134814 136344 138091 138944 139237 139349 138846 137503 136135 135744 136500 138046 140113 142262 143558 143166 141060
65739 141060 138013 135313 134427 136006 138880 140896 141187 140794 140750 140599 139485 137706 136206 135328 135003 135561
65723 135561 137229 139200 140141 139463 137436 134532 131466 129390 129002 129642 130191 130626 131693 133201 133789 132696
65707 132696 130786 129396 128885 128835 129122 130030 131441 132460 132129 130276 127516 124579 122043 120676 121321 123819
65691 123819 126489 127603 127298 127129 127728 127999 126991 125428 124513 124078 122994 121059 119487 119499 121088 123170
65675 123170 124557 124771 124190 123401 122457 121107 119641 118735 118294 117280 115200 113012 111914 111832 111821 111427 110956
65658 110956 110763 110898 111085 110547 108371 104676 100885 98261 96678 95511 95035 95951 97994 100096 101714 103111
65642 103111 104462 105504 105963 105625 104258 102172 100517 100132 100344 99831 98509 97633 98167 99946 102325 104701
65626 104701 106426 107155 107290 107272 106614 104725 102562 102087 103744 105801 106735 107103 108204 109815 110351 108896
65610 108896 106199 103798 102769 103286 104847 106772 108594 110015 110630 110048 108350 106112 103928 102134 100966
65595 100966 100637 101280 103098 106327 110540 114188 115612 114654 112731 111290 110824 111291 112545 114055 115095
65580 115095 115735 116903 118969 120925 121627 121241 120802 120808 120966 120910 120320 118625 115550 111967 109397 108485 108551 108693
65562 108693 108660 108539 108409 108652 109788 111366 111758 109968 107260 105979 106757 107888 107636 106181 104886 104582
65546 104582 105292 106870 108904 110437 110874 110989 112065 114064 115672 116178 116260 116671 117279 117930 119118 120950
65530 120950 122194 121472 119052 116616 115399 115236 115243 114766 113666 112211 110739 109248 107526 105822 104933 105229
65514 105229 106028 106381 106018 105098 103635 101875 100641 100396 100346 99429 98026 97685 99159 101576 103571 104384 103776
65497 103776 101837 99313 97452 96945 97247 97128 95778 93445 91351 90879 92460 95311 98429 101445 104150
65482 104150 105939 106633 107351 109227 111436 111831 109701 106544 103742 100959 97656 94823 93826 94264 94461 93827
65466 93827 93490 94533 96770 99521 102607 105991 109141 111499 113288 115201 117372 119218 120337 121085 122060
65451 122060 123505 125536 128622 133244 139154 145360 150763 154490 155885 154920 152618 150277 148127 145500
65437 145500 142504 140508 140429 141557 142912 144888 148313 152425 155242 155881 155336 154829 154604 154681 155708 158255
65421 158255 161768 164814 166216 165846 164664 164110 164990 166874 168919 171234 174781 179810 185116 189232 191831
65406 191831 193554 194937 196056 196970 197887 198776 199115 198351 196598 194661 193192 191965 190298 188018 185370
65391 185370 181992 176908 170013 162777 156791 152316 149026 147384 147986 149912 151063 150177 147564 143982 139914
65376 139914 135971 132777 130211 127721 125455 124009 122958 121029 118174 116107 116053 117067 117499 117235 117481
65361 117481 118927 121010 122607 122758 121081 118170 115397 113860 113749 114815 116773 118972 120465 121000 121340
65346 121340 122161 123273 124394 125786 127468 128707 129238 130217 132852 136570 139689 141512 142660 143639 144328
65331 144328 144809 145466 146097 146023 145367 145237 146301 148073 150123 153050 157434 162355 165891 167042 166602 166142
65315 166142 166651 168289 170990 174873 180070 186528 194155 202985 212883 223166 232966 242203 251976 263736
65301 263736 278167 294722 311712 326647 337171 342438 343488 341957 338696 333991 328425 322481 315462
65288 315462 306056 294340 282291 271750 262695 254304 246975 242129 240162 239789 239606 239352 239165 238493 236566
65273 236566 233486 229990 226381 222456 218378 214651 211115 206723 200732 193504 185913 178617 172307 167873
65259 167873 165462 163711 160708 155705 149567 143764 139288 136229 133887 131466 128923 126755 124843 122425
65245 122425 119729 118469 119511 120968 120314 117872 116301 116652 117006 115523 112937 111034 110298 110293 110939 111867
65229 111867 111602 109205 106215 105207 106483 107781 107346 105915 105242 105903 107196 108354 109125 109681 110520 112059
65213 112059 113857 114629 113542 111253 109200 108059 107406 106803 106561 107152 108350 109447 110180 110916 111846 112506
65197 112506 112486 112379 113480 116457 120599 124478 127134 128602 129518 130465 131650 133049 134701 136676 138775
65182 138775 140442 141080 140322 138120 134949 132048 130833 131585 132945 133151 131639 129300 127532 127275 128402
65167 128402 129515 128855 126062 122610 119954 117804 115033 111631 108578 106185 103906 101746 100557 100817 102227
65152 102227 104661 108275 112401 115511 116824 117035 117088 117103 116724 115559 113017 108868 104305 101237 100035 99166
65136 99166 97627 96349 96374 97013 96983 96262 95543 94725 93335 91849 91195 91243 90991 90043 88940 88204 87904 88025
65118 88025 88524 89205 90067 91470 93401 95081 95877 96102 96312 96543 96896 98000 99945 101545 101815 101493 101807
65101 101807 102324 101525 99192 96762 95412 95106 95558 96744 98227 99168 99347 99282 99196 98725 97755 96689 95846
65084 95846 95487 96420 99441 103987 108350 111445 113488 114779 114921 113692 111822 110399 110107 111254 113730
65069 113730 116576 118379 118573 117876 117247 117011 117079 117209 116887 115864 115189 116709 120919 126071 130070 132640
65053 132640 134927 137558 139948 141310 141596 141364 141050 140484 139164 137199 135809 136323 138660 141423 143556
65038 143556 145256 147175 149642 153005 157698 163363 168833 173795 179611 187422 196197 203984 210697 218060
65024 218060 226751 235163 241544 246026 249546 251931 252408 251564 251208 252052 252608 250892 246472 240249 232931
65009 232931 224508 214961 204686 194247 184395 176338 171274 169131 168063 165567 160195 152371 143853 136476
64995 136476 131105 127571 125524 124925 125396 125603 124281 121888 120316 120618 121716 121779 120174 117542 114642 111805
64979 111805 109171 106821 104803 103325 102586 102205 101438 100411 100481 102750 106649 110620 113663 115506 115761 113941
64963 113941 110325 106095 102560 100537 100143 100686 101087 100959 100904 101228 100927 98848 95478 92605 91358 91449 92225
64946 92225 93529 95364 97455 99385 100747 101183 100665 99622 98448 97134 95726 94638 94005 93419 92986 93821
64930 93821 96327 98659 98384 95444 92133 90342 90285 91762 94779 98413 100707 100629 99128 97581 96270 95046
64914 95046 94305 94251 94036 92802 91147 90589 91788 94044 96281 97812 98323 97904 97279 97445 98724 100295 100928
64897 100928 100362 99860 101051 104060 107157 108565 108212 107258 106431 105610 104637 103521 101987 99854 97918 97445
64881 97445 98483 99452 98769 96354 93540 92144 93536 97595 102332 105337 105864 104986 103897 102996 102564 103050
64865 103050 104317 105639 106781 108078 109207 109121 107673 106104 105261 104513 103285 102473 103241 105199 106984 108080
64849 108080 109103 110648 112730 114969 116523 116220 113671 110070 107232 105906 105431 104665 102854 100117 97638
64834 97638 96885 98068 99773 100614 100645 100637 100786 100973 101544 102687 103462 102696 100709 99047 98494 98346 97869 97481
64816 97481 98068 99730 101625 102721 102472 101095 99388 98127 97515 97304 97276 97376 97502 97527 97490 97578 97881 98228
64798 98228 98196 97287 95404 93188 91541 90789 90685 91181 92494 94157 94823 93617 91199 88967 87628 87049
64782 87049 86980 87230 87471 87549 87831 88739 90085 91333 92184 92479 91932 90663 89586 89449 89686 89155 88069 88198
64764 88198 90749 94712 97924 99339 99644 99795 99732 98910 97623 97024 97689 98778 99133 98747 98499 98728 98965
64747 98965 99119 99918 101792 104081 105905 107269 108743 110503 112216 113581 114426 114523 113733 112281 110616 109155
64731 109155 108190 107694 107118 105833 103922 102136 100987 100493 100847 102500 105222 107908 109744 110855 111427 111056
64715 111056 109613 107897 106601 105407 103990 103222 104213 106617 108946 110337 111045 111476 111817 112428 113478 114004
64699 114004 112379 108168 103029 99559 99476 102673 107317 110934 112176 111796 111520 111981 112319 111679 110321 109012
64683 109012 108017 107175 106534 106343 106486 106357 105575 104664 104641 105741 106979 107416 107538 108544 110335 111251 110167
64666 110167 107917 106107 105353 105392 106114 107548 109388 111445 114080 117279 119716 119864 117863 115342 113452
64651 113452 112036 110651 109457 108860 108976 109652 110541 111113 111040 110482 109605 108182 106298 105143 106209 109780
64635 109780 114845 120195 124721 127036 126208 123172 120370 119463 120077 121003 121759 122497 123206 123683 123934 124106 124256
64618 124256 124446 124693 124629 123685 122018 120905 121776 124890 129054 132433 133576 132156 129160 126341 125079 125533
64602 125533 126720 127377 126932 125825 124846 124149 123130 121410 119632 118967 120023 122352 124672 125387 123489 119662
64586 119662 116188 115081 116313 118243 119560 120179 120499 120607 120419 120000 119453 118767 117925 117011 116220 115866 116171
64569 116171 116818 117073 116735 116612 117528 119068 119937 119455 118198 117276 117525 119181 121682 123695 123950 122361 120077
64552 120077 118475 118285 119432 121192 122571 123034 122965 123080 123414 123218 121903 119839 118150 117759 118523 119320 119240
64535 119240 118627 118511 119165 120009 120874 122210 123753 124298 123576 123078 123909 124940 124540 123217 122830 123773 124790
64518 124790 125389 126421 128034 128858 127973 126315 125352 125395 125944 126799 128002 129216 129881 129753 129051 128382 128516
64501 128516 129622 130672 130215 127958 125110 123206 123108 124891 127763 130126 130737 130018 129420 129447 129311 128712 128752
64484 128752 130484 133439 136172 137633 137588 136461 135267 135037 135643 135669 134008 131290 129315 129267 130704 132041
64468 132041 131930 130403 128640 127442 126406 125154 124716 126434 129701 132216 132747 132388 132632 133439 133910 133808
64452 133808 133437 132749 131531 130084 128931 128022 126776 124802 122274 119811 118154 117704 118273 119509 121286
64437 121286 123204 124130 123275 121570 120802 121227 121302 120096 118662 118390 119191 120103 120600 120368 118789 115967 113677
64420 113677 114008 117139 121343 125029 127984 130642 132983 134459 134717 134197 133899 134297 134632 133771 131779 129911
64404 129911 128956 128448 127777 127189 127129 127439 127848 128585 129876 131477 133332 135841 138630 139791 137612 132934
64388 132934 128748 127391 128695 130784 131984 131946 131553 131907 133150 134354 134754 134767 135339 136543 137379 136891 134983
64371 134983 132222 129313 126904 125556 125498 126368 127318 127637 127332 126863 126296 125298 124205 124263 125968 127888 128405
64354 128405 128189 129395 132411 135151 135968 135570 135206 134605 133036 131213 130496 130826 130957 130537 130665 132274 134868
64337 134868 137002 137568 136677 135632 135696 136573 136701 135433 134099 134121 134904 134756 133441 132499 133112 134767 136187
64320 136187 136618 135884 134007 131376 128889 127496 127524 128478 129405 129599 129103 128519 128347 128633 129185 129733 130036 130348
64302 130348 131710 134992 139563 143734 146694 149026 151028 151822 150897 149405 148796 148883 148433 147126 145741 144785
64286 144785 144104 143746 144144 145384 147131 149317 152108 155075 157121 157499 156593 155536 155326 156231 157806 159507
64270 159507 161309 163378 165188 165699 164732 163535 163579 165350 168602 172896 177333 180648 182456 183689 185059
64255 185059 185868 185266 183892 183072 182973 182793 182271 181650 180512 178186 175355 173851 174540 176457 178244 179419
64239 179419 180033 180171 180310 181334 183645 186684 189626 192063 193904 195190 196261 197625 199490 201761 204565
64224 204565 208270 212953 218224 223631 228834 233523 237719 242078 247289 253146 258733 263450 267196 269539
64210 269539 269599 267284 264116 262180 262151 262639 261634 258529 254509 250819 247078 241979 235519 229539 225647
64195 225647 223489 221693 219805 218479 218261 219007 220219 221275 221673 221661 222256 224007 226186 227821 228982 230238
64179 230238 231480 232341 233412 235885 240083 245254 250638 255887 260701 265123 269996 276094 282855 288904
64165 288904 293716 297719 300937 302718 302908 302092 300526 297948 294659 291620 289078 286228 282802 279868 278299
64150 278299 277296 275398 272562 270433 270615 273152 276492 278722 279042 278418 278725 281070 284963 288950 291884
64135 291884 293796 295850 299172 303306 306202 306377 304759 303512 303339 303132 302310 302016 303224 304833 304909 303347
64119 303347 302090 302650 304498 306258 307538 308680 309274 308336 306298 305546 307883 312169 315803 318156 320944
64104 320944 325161 329511 332733 335888 341025 348549 357255 366244 375490 385028 394921 405759 418006 430963
64090 430963 443309 454634 465738 477854 492239 509774 529832 550002 568043 583742 597838
64079 597838 609788 617985 621773 621724 618214 611227 601491 590301 578141 564846 550944 537327 523573
64066 523573 508454 492522 478444 467975 459909 451903 443219 434885 428024 422894 419102 416154 414053
64053 414053 413418 414494 416236 417221 417373 417797 419001 420535 422485 425869 431068 437059 442826 448509 454570
64038 454570 460759 466653 472539 479128 486855 495875 506375 518611 532812 548796 565266 580125 592523
64025 592523 604173 617286 631386 643540 651608 655716 656525 654061 648930 642948 637411 631817 625167
64012 625167 617530 609541 601355 593021 585174 578471 572805 567641 562759 558316 554619 552041 550738 550427
63998 550427 550901 552421 554982 557877 561073 566212 574579 584667 593861 602331 612833 626445 641045
63985 641045 654793 668740 684742 702854 722171 742525 763904 785644 807533 830452 854698
63974 854698 878945 901882 923512 943810 961674 976473 989203 1000811 1010896 1019439 1028341 1039620
63962 1039620 1053289 1068358 1084466 1101009 1116234 1129166 1141235 1154166 1167461 1179783 1191453
63951 1191453 1203349 1214426 1222814 1228753 1234264 1240577 1248062 1258018 1271953 1289262 1307955 1327710
63939 1327710 1350140 1376074 1404783 1436062 1470887 1509596 1551331 1595803 1643940 1696377 1752917
63928 1752917 1813934 1880695 1953797 2032697 2117221 2208141 2305852 2409862 2520041 2637114 2761596
63917 2761596 2893731 3034809 3186964 3350951 3525581 3710158 3906188 4115963 4340939
63908 4340939 4582658 4844104 5128708 5438729 5775975 6143888 6547723 6992756 7483370
63899 7483370 8024383 8622719 9287219 10026691 10848101 11756265 12754139 13842000 15015829
63890 15015829 16267339 17586355 18962766 20385556 21840500 23309241 24769398 26193981
63882 26193981 27551212 28807041 29929415 30891284 31671778 32256838 32638608 32812294 32772913
63873 32772913 32515958 32041332 31355983 30473836 29415748 28210040 26890359 25490119 24037930
63864 24037930 22557532 21070156 19595819 18153303 16760138 15432220 14182378 13019009
63856 13019009 11946165 10964617 10072723 9266794 8541303 7889141 7302602 6775128 6302198
63847 6302198 5879945 5503071 5164919 4859474 4582369 4330083 4099344 3887563 3692777
63838 3692777 3512766 3345079 3188210 3041826 2905404 2777402 2656070 2540310 2429491
63829 2429491 2323330 2222213 2126679 2036105 1948853 1864181 1783033 1706319 1633408 1563290 1496488
63818 1496488 1434607 1378116 1325467 1274546 1224595 1176629 1132224 1091981 1055227 1021106 989375
63807 989375 959656 930683 901528 873382 848658 828076 809954 792819 777279 764363 753271
63796 753271 742191 730731 720241 711914 705699 701040 697736 695797 695001 694792 694362 692921 690227 686706
63782 686706 682746 678054 672013 664484 655799 646084 634958 621906 606684 589501 571121 552814 535921
63769 535921 521250 508784 497824 487475 477183 466888 456563 445815 434388 423029 413244 405721
63757 405721 399277 391874 382751 373272 365469 359779 354485 347583 339103 331148 325662 322603 320520 318271
63743 318271 315700 313130 310879 309050 307223 304621 301167 298104 296740 296685 296031 293369 289104 284889 282329
63728 282329 282114 283625 285289 285807 285075 283627 281650 279302 277510 277210 277773 277324 274836 271026 267107 263757
63712 263757 261579 261298 262673 264148 264394 263759 263537 264286 265491 266434 266727 266228 265058 263653 262537 262084
63696 262084 262595 264244 266681 268975 270332 270773 271063 272113 274426 277802 281448 284590 287056 289209 291550
63681 291550 294622 298979 304761 311558 319192 328373 339912 353533 368066 382664 397148 411444 425633
63668 425633 440482 457002 475325 494681 514397 534038 552670 568976 582199 592120 598224 599985
63656 599985 597987 593444 586409 575852 561928 546769 532240 518139 503491 488503 474116 460426
63644 460426 446777 433045 419917 408202 398500 391094 385401 379995 373941 367796 362621 358398 354263
63631 354263 350088 346977 346110 347640 350778 354524 358275 362103 366628 372518 380048 389073 399365 411072
63617 411072 424862 441265 459595 478104 495844 513820 533239 552940 569856 582097 590353 596145
63605 596145 600055 602120 602335 599769 592373 579011 561175 541771 522750 504689 487929 472844 459166
63592 459166 446104 433334 421366 410917 402314 395373 389568 384437 379964 376425 373926 372587 372984
63579 372984 375592 379736 384041 388187 393197 399662 406884 414429 423360 434882 448520 462665 476434
63566 476434 490163 504636 520626 538667 558444 578832 599282 620809 644952 672293 702489
63555 702489 734955 768666 802029 834086 865373 896595 926833 954048 976998 995656 1010015
63544 1010015 1019602 1024265 1024763 1022567 1019500 1017010 1015065 1012117 1006930 1000057 992736 984772 974446 960244
63530 960244 941930 920337 897118 874348 853277 833498 814066 795051 777087 759915 742742
63519 742742 725872 710600 697401 685525 674638 665596 659133 654839 652073 651065 652488 656505 662710
63506 662710 670510 679154 687904 696765 706870 719829 736754 757867 782722 810655 841174 873832
63494 873832 907667 941372 974677 1009155 1046622 1086601 1126140 1162251 1193837 1221100 1244081
63483 1244081 1262521 1276815 1288370 1298814 1308928 1318419 1326833 1334663 1343185 1352877 1362363 1369169 1371066
63470 1371066 1366295 1353320 1331545 1302088 1266786 1226471 1181311 1132789 1083905 1036724 990761
63459 990761 944679 898912 855675 816746 782239 751464 724044 699729 677746 657115 637807
63448 637807 621135 608514 599745 592787 585382 576757 567801 560049 554808 552787 553910 557506 563012 570372
63434 570372 579417 589338 599539 610859 625045 642634 662061 681383 700447 720654 742709 765260
63422 765260 786150 804669 821928 838846 854279 865802 872168 874260 873409 869580 861841 850124 835612
63409 835612 819421 801628 781941 760832 739589 719350 700441 682788 666682 652743 641081
63398 641081 631071 622268 615111 610037 606321 602635 598677 595246 592769 590863 589584 589818 591929 595257
63384 595257 599667 606356 616024 627437 639264 652500 669332 689934 712104 734163 756713 781225
63372 781225 808233 837428 868429 900794 934127 968769 1005786 1045689 1087640 1130384 1173496
63361 1173496 1217218 1261433 1305262 1347308 1385722 1418099 1442039 1456371 1461871 1460626 1454614 1445028
63349 1445028 1432912 1419864 1407308 1395065 1381415 1365004 1346136 1325783 1303841 1278986 1250012
63338 1250012 1216810 1180346 1142239 1104241 1067610 1032868 1000110 969231 939869 911810 885795
63327 885795 863330 845212 830831 819302 810545 804682 801205 799752 801107 806336 815213 826451 839329
63314 839329 854158 871204 890063 910220 931716 955266 982023 1013003 1048228 1086755 1127884
63303 1127884 1171768 1218260 1265835 1312475 1357108 1399219 1437505 1469905 1494726 1510981 1518203
63292 1518203 1517049 1509824 1499228 1486627 1472278 1456827 1441373 1426163 1410334 1393045 1374075 1353365
63280 1353365 1330618 1305178 1275778 1241137 1201745 1160344 1119584 1079976 1041364 1005210 973244
63269 973244 944520 916299 887939 861523 838282 816863 796105 777257 762035 750030 739578
63258 739578 730050 721942 715522 710588 706924 704016 700855 696848 692501 688662 685667 683524 682061 680535
63244 680535 678146 675510 674425 675320 675966 673845 669132 664345 661576 660894 661049 660881 660210 659798 660250 660857
63228 660857 660237 658344 656977 657935 661468 666768 672883 678704 683363 687454 692731 699672 706384 710847 713229
63213 713229 715045 717210 720141 724553 730372 735717 738859 740855 744443 750484 757266 763350 769310 776205
63199 776205 783938 791806 799318 805724 809989 812420 815529 822134 832797 845883 859719 873802 888154
63186 888154 902584 916998 931832 947789 965518 985769 1009366 1036442 1065939 1096495 1127837
63175 1127837 1160822 1196138 1233722 1273588 1316299 1361892 1408986 1455850 1502089 1548545 1595797
63164 1595797 1643510 1691005 1737589 1782477 1825318 1866816 1908030 1949081 1989237 2028052 2065472
63153 2065472 2100994 2133808 2163621 2190059 2211266 2224641 2229236 2225920 2214817 2194358 2163809 2125160
63141 2125160 2081270 2033340 1981523 1926959 1871665 1817036 1763839 1713284 1666912 1625660 1589887
63130 1589887 1559753 1534713 1513416 1495433 1482513 1476607 1476899 1480223 1484422 1489946 1498101 1509186 1522879
63117 1522879 1539288 1558704 1580843 1604792 1629311 1653071 1675310 1696726 1719224 1744087 1770417
63106 1770417 1795685 1817835 1836701 1853294 1867882 1879009 1884605 1883800 1877267 1866011 1850507 1830989
63094 1830989 1807734 1780738 1749851 1715697 1679795 1643380 1606805 1570552 1535906 1503841 1474050
63083 1474050 1446034 1420416 1398049 1378314 1359616 1341398 1324544 1309830 1297085 1285970 1276514
63072 1276514 1268542 1261438 1254875 1249191 1244752 1241454 1239095 1237852 1238221 1240747 1245677 1252426 1259517 1265804
63058 1265804 1271871 1279641 1290351 1303423 1317491 1331926 1346907 1362287 1377004 1389882 1400956 1411759
63046 1411759 1424019 1437965 1452244 1465474 1477412 1488396 1498390 1507190 1515051 1522264 1528405 1532838
63034 1532838 1535935 1538936 1542617 1546858 1551633 1557410 1564020 1569922 1573522 1575079 1576568 1579570 1583889 1588491
63020 1588491 1593308 1599489 1608043 1618879 1631382 1645381 1661164 1678942 1698725 1720376 1743355 1766939
63008 1766939 1791413 1818490 1849547 1883710 1918973 1955218 1994778 2039729 2089827 2143575 2200075
62997 2200075 2259227 2321397 2387804 2460096 2538458 2620960 2705753 2792967 2883417 2976443 3070528
62986 3070528 3165388 3261894 3360274 3459791 3559894 3660211 3759477 3855903 3948784 4038704 4126195
62975 4126195 4211418 4295072 4378199 4460684 4541035 4617846 4690260 4756622 4813911 4859114 4890247
62964 4890247 4905623 4903357 4882509 4843918 4789026 4718503 4632944 4534450 4426587 4312886 4195966
62953 4195966 4077893 3960677 3846367 3737181 3635553 3543660 3462655 3392482 3332496 3282283
62943 3282283 3242037 3212190 3192522 3181682 3177952 3180617 3190148 3206731 3228941 3254394 3281529 3310231
62931 3310231 3340702 3372392 3404454 3436663 3469066 3500798 3530047 3555425 3576680 3593659 3605267
62920 3605267 3610097 3607421 3596664 3576480 3545576 3504207 3453637 3394193 3325304 3247708 3164075 3076830
62908 3076830 2986734 2894360 2801621 2710657 2622315 2536908 2455429 2378647 2305922 2236522 2171583
62897 2171583 2113145 2061559 2015426 1973815 1936784 1903657 1872667 1842966 1815551 1791376 1769706
62886 1769706 1749170 1729457 1711008 1693716 1677009 1660941 1646215 1632994 1620240 1606487 1591086
62875 1591086 1574637 1558272 1542595 1527290 1511731 1495849 1480361 1466192 1453615 1441764 1429130
62864 1429130 1414825 1399280 1383394 1367479 1351893 1338279 1328594 1322451 1316883 1309471 1300432 1290807
62852 1290807 1280235 1268169 1256107 1246487 1239733 1234176 1228598 1223112 1217677 1211724 1205583 1200642 1197496
62839 1197496 1195275 1193254 1191802 1191178 1190653 1189546 1188062 1186374 1183851 1179996 1175404 1170980 1166739 1162061
62825 1162061 1156727 1151149 1145914 1141382 1137401 1133282 1128683 1124729 1123534 1126157 1131442 1137168 1141800 1144873
62811 1144873 1146414 1146733 1146615 1147115 1148896 1151586 1153735 1153855 1152096 1150670 1151880 1155696 1159873 1162413 1163282
62796 1163282 1163725 1164623 1165724 1165983 1164521 1161597 1158531 1156366 1155024 1154267 1154672 1156571 1158615 1158877 1157210
62781 1157210 1155104 1153236 1150776 1147418 1144444 1142982 1142404 1141260 1138855 1135175 1130247 1124470 1119043 1115259
62767 1115259 1113592 1113589 1114066 1113349 1110344 1105707 1101133 1097215 1092993 1087944 1083268 1080570 1080268 1081890 1084905
62752 1084905 1088512 1091559 1093482 1094725 1095803 1096958 1099208 1104335 1112829 1123034 1133526 1145237 1159866
62739 1159866 1177132 1195365 1214183 1234800 1257794 1282386 1308234 1336460 1368268 1403570 1441593
62728 1441593 1482168 1525869 1573343 1624867 1680304 1739442 1802744 1871771 1948256 2032534 2123332
62717 2123332 2219367 2320877 2429325 2545883 2670494 2802311 2940528 3084297 3231849 3380292
62707 3380292 3526840 3669887 3808227 3939347 4059303 4164243 4251090 4316631 4357328 4371156
62697 4371156 4359037 4323599 4266814 4189437 4092243 3977028 3846824 3705923 3559203 3410261
62687 3410261 3260164 3108898 2958103 2811429 2671982 2540188 2414613 2294309 2179945
62678 2179945 2073134 1975216 1886494 1806127 1732682 1664993 1602528 1544942 1491612 1441936 1395960
62667 1395960 1354160 1316502 1282181 1250708 1222791 1199361 1179763 1161803 1144022 1127283 1113579
62656 1113579 1103751 1097016 1092321 1089398 1088603 1090389 1094956 1101977 1110812 1121337 1134290 1150431 1169886
62643 1169886 1192825 1219992 1251499 1285796 1321345 1359067 1401601 1450133 1503518 1560738 1622448
62632 1622448 1689323 1760365 1833945 1909438 1986907 2066021 2146155 2226418 2304475 2376182 2437804
62621 2437804 2488280 2528244 2557246 2573081 2573656 2558508 2528577 2485568 2431681 2369064 2299113 2222615
62609 2222615 2140657 2055082 1968114 1881867 1797984 1717194 1639227 1563602 1490629 1421462 1357250
62598 1357250 1298407 1244471 1194371 1147064 1102349 1061046 1024050 991219 961471 934014 909192
62587 909192 887827 869687 852893 835287 816429 797846 781193 766738 753949 742691 732965 723982
62575 723982 714649 704859 695434 686925 679434 673391 669353 666875 664646 661873 658698 655419 652533 651471
62561 651471 653642 658247 662477 664570 665511 667213 670433 675270 682242 691509 702009 712623 723662 736196
62547 736196 750498 765984 782129 798713 815844 834418 855776 880125 906182 933216 962509
62536 962509 995757 1033003 1073452 1117474 1166302 1220205 1278422 1340532 1406516 1475743 1547445
62525 1547445 1622052 1700332 1780643 1858393 1929164 1991689 2047158 2096154 2136986 2166787 2183591
62514 2183591 2187082 2177621 2155202 2119904 2073193 2018013 1957320 1892982 1826203 1758158 1689727 1621240
62502 1621240 1553201 1486892 1423760 1364526 1309287 1258085 1210954 1167722 1128116 1091740 1057830
62491 1057830 1025510 994424 964620 935982 908635 883744 862505 844014 825681 806435 788123
62480 788123 772803 760068 748370 737822 730029 725598 723251 721170 718286 714641 711456 710540 712829
62467 712829 717727 724154 731455 738895 745624 752210 761052 773900 789723 806217 822587 839578 857729
62454 857729 877296 899281 924747 953315 983794 1016194 1051804 1091509 1135167 1182280 1231818
62443 1231818 1281590 1329261 1374030 1416198 1455229 1489565 1518233 1541169 1557734 1566228 1565427 1555785
62431 1555785 1538851 1516102 1488522 1456708 1421232 1383065 1343411 1302905 1261650 1220481 1181319
62420 1181319 1145624 1113357 1084129 1058235 1035544 1014669 994671 976626 962010 950440 940572
62409 940572 932274 926034 921020 915846 910824 907481 906062 905342 904671 904448 904839 905947 908934 914983 923219
62394 923219 931673 940154 950093 961579 972877 983184 993640 1005062 1016638 1027340 1036678 1043651
62382 1043651 1046967 1046934 1045188 1041946 1035484 1024911 1011289 995304 976228 954381 932304 911825 891878
62369 891878 871072 850806 833839 820833 810151 800309 791019 782422 774812 768812 764717 762094 760863
62356 760863 762100 766691 773742 781297 788228 794670 801220 808631 817733 828683 840436 851624 861748
62343 861748 871196 880518 890075 899870 909369 917953 925672 932956 939513 944355 946960 947392 945355 940554
62329 940554 934292 929177 926489 925127 923721 922414 921760 921458 921435 923006 927578 934972 944069 954356 965969
62314 965969 979223 995195 1015695 1041331 1070406 1101149 1134433 1172885 1217694 1267655 1321110
62303 1321110 1377491 1436917 1499448 1565101 1633950 1705823 1779961 1854738 1927624 1996028 2058533
62292 2058533 2114797 2164037 2204456 2234516 2253792 2262050 2258763 2244673 2222802 2196374 2165956 2129685
62280 2129685 2086049 2035610 1980438 1922957 1865189 1808222 1752348 1698210 1647399 1601249 1559382
62269 1559382 1520156 1482231 1445075 1408461 1372538 1338240 1306711 1278263 1252464 1229093 1208241
62258 1208241 1189605 1172530 1157041 1144204 1134993 1128910 1124011 1118432 1111960 1105978 1101698 1098619 1095063
62245 1095063 1089923 1083348 1075963 1068330 1061196 1055259 1050340 1045500 1040271 1035129 1030678 1027247 1025474 1026247
62231 1026247 1029527 1034093 1039021 1044797 1052517 1062553 1074231 1086135 1096693 1105483 1114186 1125207 1139032
62218 1139032 1154080 1169284 1185235 1202241 1219109 1235140 1251967 1271875 1295140 1320405 1346915
62207 1346915 1374995 1404830 1436291 1469971 1507378 1549945 1598145 1651243 1707608 1766120 1827828
62196 1827828 1895399 1970064 2049596 2129807 2207148 2279177 2343608 2398251 2441528 2472249 2489398
62185 2489398 2492857 2483739 2463327 2432391 2392169 2345087 2293446 2238096 2179186 2117525 2054385 1990830
62173 1990830 1928114 1867916 1811308 1758388 1709699 1666788 1630326 1598959 1571318 1547830 1528992
62162 1528992 1513169 1498275 1484775 1474743 1468360 1463502 1458734 1454681 1452354 1451917 1453334 1456545 1460645
62149 1460645 1464430 1468163 1473541 1481588 1491728 1503029 1515051 1527416 1540052 1554314 1572399 1595050
62137 1595050 1620969 1648977 1679533 1713424 1750124 1788528 1828579 1871162 1916636 1964301 2013266
62126 2013266 2063227 2114094 2164890 2213255 2256386 2292722 2322547 2346989 2366982 2383375 2397220
62115 2397220 2409308 2419968 2429916 2440655 2453381 2468209 2485372 2506438 2533133 2565341 2601373
62104 2601373 2639856 2680256 2721755 2762769 2801564 2836404 2865259 2886436 2899670 2906011 2906832 2903524
62092 2903524 2897557 2889708 2879381 2865610 2848464 2828642 2806247 2781239 2754936 2729848 2707927 2689805
62080 2689805 2675414 2664256 2655225 2647319 2640590 2635598 2632282 2630336 2630311 2633185 2639091 2647589 2658845 2673331
62066 2673331 2690788 2710804 2733926 2760607 2789478 2818690 2848944 2883099 2922397 2964948 3008598
62055 3008598 3053473 3100856 3151157 3204031 3259203 3316132 3373855 3432020 3491150 3551225 3611128
62044 3611128 3670337 3730195 3792544 3857821 3925299 3994471 4065399 4138309 4213601 4291751 4372655
62033 4372655 4455683 4540880 4629447 4722370 4819141 4918243 5018101 5117050 5213408 5306707 5398432
62022 5398432 5490647 5584248 5679194 5775788 5874502 5974520 6073308 6167907 6256440 6338661 6415783
62011 6415783 6489875 6562965 6636491 6711519 6789041 6869550 6952346 7035767 7118350 7199590 7279523
62000 7279523 7357760 7433220 7504793 7572049 7635107 7694005 7748483 7798228 7842806 7881327 7912796
61989 7912796 7937056 7954966 7967512 7975336 7979228 7980049 7977641 7970714 7958682 7942860 7924927 7904950
61977 7904950 7882151 7857130 7831986 7808318 7786139 7764692 7743320 7721571 7699446 7677594 7656385
61966 7656385 7634859 7611516 7586188 7560287 7535147 7510889 7486962 7463114 7439845 7418483 7400599
61955 7400599 7386764 7376251 7368644 7365110 7367072 7374301 7385624 7400964 7421042 7445286 7471916 7500360
61943 7500360 7531982 7567922 7607538 7649334 7691925 7733437 7771198 7802817 7826646 7840723 7842397
61932 7842397 7829919 7803715 7765411 7716149 7656475 7587362 7510758 7429217 7345103 7259829 7173909
61921 7173909 7087922 7002873 6919074 6835530 6751595 6668593 6588429 6511136 6435558 6362070 6292488
61910 6292488 6227193 6164613 6104123 6047231 5994832 5945342 5897009 5850471 5807361 5767704 5730490
61899 5730490 5696022 5665845 5640605 5619598 5602415 5589870 5583075 5582426 5587659 5598320 5614120 5635317
61887 5635317 5662862 5697845 5740700 5790916 5847408 5909259 5976321 6048907 6126489 6207039 6288427
61876 6288427 6370378 6454339 6541464 6631452 6723211 6815651 6907783 6998977 7089481 7180087 7271357
61865 7271357 7363907 7459247 7559486 7666481 7782392 7910757 8055619 8219789 8405478 8616421
61855 8616421 8857369 9131082 9437802 9778393 10156253 10575332 11038162 11547126 12106096
61846 12106096 12719174 13388789 14116473 14904703 15756411 16672672 17651018 18684317 19758619
61837 19758619 20850401 21924608 22934070 23821354 24525172 24990955 25181173 25081312 24701015
61828 24701015 24071092 23236430 22246946 21150924 19992468 18810263 17635724 16492425
61820 16492425 15397844 14364730 13400541 12507643 11685998 10935279 10253868 9637483 9080546
61811 9080546 8578372 8127010 7722039 7359078 7035026 6747542 6493750 6270490 6075212
61802 6075212 5905602 5758979 5633293 5528233 5444207 5380588 5335844 5308726 5298209 5302805 5320916
61791 5320916 5351208 5391377 5437222 5484420 5530955 5576452 5619302 5656023 5683554 5700893 5708165
61780 5708165 5705351 5692742 5672047 5646327 5618952 5592834 5570491 5554369 5546488 5547299 5555134 5567492
61768 5567492 5582798 5600045 5616798 5628903 5632847 5627388 5612254 5586403 5548796 5500179 5442990 5379881
61756 5379881 5313289 5246140 5181813 5123108 5071651 5028385 4994486 4971870 4962710 4968164 4987926 5021713
61744 5021713 5070747 5136675 5219408 5317561 5430948 5560789 5707310 5869363 6047283 6244030
61734 6244030 6462245 6701965 6962612 7245471 7552576 7884901 8243801 8633040 9057213
61725 9057213 9519011 10020151 10564477 11158296 11808201 12520580 13302974 14163968 15111687
61716 15111687 16153906 17299317 18556918 19933888 21435072 23063642 24819452 26695065
61708 26695065 28672872 30723794 32804282 34851140 36778800 38483646 39855980 40797193
61700 40797193 41237701 41149445 40548376 39487893 38047582 36320287 34399014 32366726 30292003
61691 30292003 28229517 26221676 24299822 22485604 20792307 19225508 17784341 16464525
61683 16464525 15261121 14168518 13179056 12283438 11472709 10739222 10076218 9477592 8937804
61674 8937804 8451010 8010682 7610964 7247903 6918376 6618619 6345101 6096073 5870342
61665 5870342 5664743 5474491 5295971 5127550 4967618 4813778 4664572 4520591 4382992
61656 4382992 4251854 4126593 4007141 3893914 3786984 3685829 3589868 3499085 3414060 3335141
61646 3335141 3261624 3192325 3126947 3065864 3008375 2952530 2897495 2844599 2794780 2746201 2696089
61635 2696089 2644114 2592439 2543175 2497370 2455634 2417707 2381687 2345544 2309356 2274683 2242196
61624 2242196 2211693 2183957 2160414 2140786 2122978 2105594 2088978 2073611 2059191 2045591 2033065
61613 2033065 2021140 2008866 1996626 1986211 1978592 1972914 1968051 1963737 1959704 1955131 1949701 1944105 1938805
61600 1938805 1933331 1927350 1921455 1916200 1911115 1905366 1899037 1893426 1890346 1890905 1894481 1899154 1903812 1909336
61586 1909336 1916868 1925437 1932558 1936832 1938843 1939889 1941083 1943312 1946623 1949968 1952883 1956951 1963994 1973364
61572 1973364 1982983 1992713 2004451 2018891 2034572 2050492 2067297 2085008 2101565 2114563 2122768 2125223
61560 2125223 2120870 2110326 2096459 2081770 2066223 2048554 2028576 2007105 1984683 1961520 1938132
61549 1938132 1915240 1893430 1873082 1853821 1834064 1812401 1789646 1768222 1749302 1732062 1716031
61538 1716031 1702293 1691566 1682818 1674869 1668002 1662976 1659751 1658169 1658638 1661094 1664486 1668323 1673654 1681512
61524 1681512 1691568 1703387 1717869 1736154 1758034 1782587 1809499 1838624 1869223 1900997 1935244
61513 1935244 1973713 2016775 2063690 2113959 2167225 2222406 2278342 2335200 2394191 2455797 2518826
61502 2518826 2581054 2640431 2696211 2749457 2802002 2854276 2904623 2951163 2993688 3033197 3070437
61491 3070437 3105745 3139587 3172116 3202417 3229000 3250914 3267805 3279307 3285142 3285659 3281435 3272287
61479 3272287 3257303 3236224 3210678 3183823 3158532 3135856 3115476 3097668 3084146 3076444 3074167 3075699
61467 3075699 3080232 3088209 3100443 3118149 3143493 3178513 3223338 3276639 3337779 3407360 3486047 3574530
61455 3574530 3674500 3787817 3914642 4054363 4208569 4380906 4573381 4785114 5015652 5267273
61445 5267273 5542658 5842289 6165572 6512513 6882342 7271994 7677736 8096485 8522678
61436 8522678 8944274 9344028 9704794 10012595 10256084 10426347 10518663 10533688 10476704 10356281
61426 10356281 10182969 9967569 9719814 9448732 9163546 8873173 8585053 8305163 8038784
61417 8038784 7790335 7562577 7356697 7172963 7010992 6870119 6750499 6653522 6580360 6530340
61407 6530340 6501374 6491537 6499525 6523989 6563351 6616254 6681558 6757821 6842994 6934388 7028910 7123930
61395 7123930 7218315 7312237 7405947 7499250 7592042 7684274 7775183 7863766 7950464 8037260 8125543
61384 8125543 8214880 8304360 8393903 8483489 8572220 8659038 8743352 8824109 8899241 8966872 9026191
61373 9026191 9076369 9115829 9143515 9159788 9164882 9157625 9137014 9104195 9061425 9009648 8948552 8878788
61361 8878788 8803107 8725450 8649477 8577398 8509561 8445729 8387189 8336624 8295418 8262574 8237277
61350 8237277 8220950 8215043 8217818 8225123 8233819 8242781 8251076 8257017 8259201 8257330 8251951 8244341 8236464 8230141
61336 8230141 8226356 8226019 8231102 8244549 8269692 8310322 8370413 8452819 8558964 8690457 8849884
61325 8849884 9039018 9257565 9505256 9784075 10096554 10442393 10818388 11221020 11646996
61316 11646996 12091063 12544678 12996783 13434512 13843244 14207599 14513430 14749135 14906505
61307 14906505 14982181 14978361 14900892 14756471 14552066 14295697 13995522 13657864 13287544 12890510
61297 12890510 12475066 12050364 11624526 11204069 10793773 10396600 10014444 9649217 9302816
61288 9302816 8976263 8669694 8383178 8117038 7871552 7646981 7443645 7261408 7099398
61279 7099398 6956843 6833882 6731023 6648286 6585327 6541672 6516112 6506532 6511082 6528870 6558789
61268 6558789 6598589 6646077 6700457 6761358 6827092 6894828 6961996 7026841 7088471 7147157 7203620
61257 7203620 7257073 7305083 7346357 7382319 7414709 7443146 7466778 7486862 7505349 7521729 7533492
61246 7533492 7539023 7537864 7528714 7509723 7480805 7443544 7398762 7346073 7285698 7218645 7145008 7064254
61234 7064254 6977527 6887696 6796609 6704083 6610094 6516376 6425324 6338883 6258994 6187542 6125031
61223 6125031 6070456 6023074 5983374 5951996 5928734 5912853 5903337 5898590 5896821 5896835 5897730 5898240 5897588 5896577
61209 5896577 5896378 5896680 5896676 5897506 5901582 5909468 5919516 5930915 5944934 5962439 5982249 6003082 6025816 6053041
61195 6053041 6087730 6133066 6192048 6266209 6355590 6460477 6581836 6719375 6870402 7031268
61185 7031268 7198606 7368162 7533385 7686012 7817163 7917308 7976599 7986997 7944476 7849381
61175 7849381 7705572 7519469 7298803 7051525 6786107 6512242 6239380 5973794 5718021
61166 5718021 5473482 5242401 5026831 4827453 4644379 4478007 4328183 4193529 4072546
61157 4072546 3964523 3868530 3782571 3704956 3635889 3576560 3526976 3485651 3451241 3423723 3403884
61146 3403884 3392134 3387821 3389606 3396586 3408845 3426501 3448566 3473547 3500918 3530765 3561745 3590637
61134 3590637 3614586 3633101 3647424 3658757 3667595 3673891 3676965 3675594 3668918 3657220 3641596 3622965
61122 3622965 3601437 3576339 3546842 3512779 3474758 3433223 3387896 3338592 3286002 3230920 3173270
61111 3173270 3112956 3051180 2989573 2928199 2865773 2801888 2737762 2674593 2612477 2551194 2490910
61100 2490910 2431703 2373443 2316552 2262044 2210509 2161877 2116256 2074049 2035019 1998199 1962874
61089 1962874 1928676 1894562 1858942 1821376 1783264 1746431 1711791 1679622 1650179 1623574 1599818
61078 1599818 1579405 1563195 1551304 1542631 1535850 1530448 1526746 1525294 1526386 1529888 1535698 1544528 1557519
61065 1557519 1574460 1593143 1611408 1629232 1647922 1668015 1689141 1711161 1733870 1756122 1776933
61054 1776933 1797150 1818429 1840748 1862494 1882829 1902308 1921148 1938541 1953802 1966737 1976752
61043 1976752 1982894 1984857 1982728 1976102 1964922 1950855 1936036 1920613 1903197 1883611 1863293 1843103
61031 1843103 1822651 1801850 1781081 1759613 1735908 1709938 1683477 1657692 1632114 1606230 1580369
61020 1580369 1554850 1529962 1506924 1487047 1469856 1453784 1438656 1425579 1414652 1405030 1397043 1391734
61008 1391734 1388361 1385111 1382325 1381973 1383661 1384519 1383781 1384055 1386838 1390106 1391955 1393426 1395797 1397955 1398777
60993 1398777 1399667 1402441 1406615 1410930 1415706 1421793 1428913 1436834 1446495 1458311 1471155 1484555 1499942
60980 1499942 1518105 1537596 1557505 1579621 1605738 1634807 1665004 1696685 1730854 1766390 1801387
60969 1801387 1835919 1871099 1906612 1941547 1976594 2013188 2051257 2089790 2128606 2167754 2206273
60958 2206273 2243703 2282033 2324211 2371216 2422087 2476135 2533832 2596289 2664932 2740726 2822998
60947 2822998 2910489 3004216 3107374 3221547 3345443 3478568 3623454 3782461 3954950 4139554
60937 4139554 4336733 4547085 4769963 5006342 5260620 5537173 5837785 6164664 6522380
60928 6522380 6913421 7335132 7785067 8266759 8786818 9350581 9966304 10650867 11425280
60919 11425280 12306349 13307858 14446734 15741264 17206750 18862611 20742707 22889733
60911 22889733 25342827 28142949 31336671 34920368 38727884 42377189 45390309 47436957
60903 47436957 48503200 48845956 48807471 48677536 48676116 48952110 49498021 50054191 50166355 49418669
60893 49418669 47660937 45044429 41877034 38459526 35016127 31698099 28596024 25747479
60885 25747479 23156888 20820040 18732285 16883531 15257921 13838993 12608919 11543737
60877 11543737 10615561 9800251 9079706 8438562 7863672 7346421 6880999 6459947 6074662
60868 6074662 5719932 5394405 5096398 4822429 4570030 4338696 4127023 3931294 3747785
60859 3747785 3574518 3410175 3253258 3103312 2961696 2830189 2709412 2598770 2497082
60850 2497082 2403197 2316695 2237952 2166927 2102171 2041717 1984443 1930049 1878526 1830678 1788231
60839 1788231 1751939 1720064 1690121 1661754 1636490 1614909 1595707 1577759 1561759 1549210 1540656
60828 1540656 1535280 1531669 1528655 1525853 1523535 1521698 1519372 1515289 1509100 1501444 1492875 1483198 1471812 1458302
60814 1458302 1442694 1425507 1407654 1390113 1373591 1358312 1343875 1329416 1314414 1299510 1286089
60803 1286089 1274973 1265969 1258758 1253572 1250667 1249626 1249619 1250173 1251506 1254411 1259896 1268529 1279955 1293330
60789 1293330 1308240 1324886 1343469 1363897 1386050 1409848 1434974 1460958 1487442 1514048 1540287
60778 1540287 1566135 1592205 1618514 1643386 1664559 1681331 1694795 1706199 1716075 1724736 1732388 1738604
60766 1738604 1742790 1745227 1746591 1746453 1743642 1738370 1732567 1727507 1722202 1714820 1704691 1692274 1678180
60753 1678180 1663034 1647557 1631880 1615188 1596644 1576341 1555029 1533427 1512197 1492022 1473166
60742 1473166 1455272 1437949 1421318 1405834 1391862 1379642 1369398 1361393 1355913 1352925 1351655 1351158
60730 1351158 1351719 1354860 1361204 1369275 1377549 1386785 1398757 1413274 1428376 1443260 1458977 1475975 1492985
60717 1492985 1508988 1524636 1540813 1557168 1573039 1588776 1605085 1621656 1637210 1650621 1661826
60706 1661826 1672137 1683623 1697362 1712283 1726568 1739957 1753544 1767441 1780060 1789906 1796822 1801351
60694 1801351 1804255 1806731 1809476 1811247 1809961 1805823 1801752 1799967 1799628 1798705 1796734 1794554 1792362 1789212
60680 1789212 1783983 1776187 1766275 1755329 1743683 1729949 1712680 1693101 1674614 1659134 1645442 1631704
60668 1631704 1617940 1605160 1593637 1583220 1574060 1565834 1557302 1547798 1538302 1530130 1523485 1518112 1514183
60655 1514183 1511401 1508213 1503253 1496983 1490916 1485810 1481513 1477987 1475429 1473632 1471835 1469083 1464756 1459484
60641 1459484 1455503 1454865 1456938 1459006 1459743 1460588 1462878 1465222 1465015 1461373 1455194 1447174 1437183 1425092 1411043
60626 1411043 1395154 1377706 1359243 1339919 1319383 1297953 1277209 1258778 1242983 1229126 1216475
60615 1216475 1204680 1193951 1185062 1178353 1172717 1166799 1161290 1158490 1159240 1162033 1165705 1171057 1178673 1186954
60601 1186954 1193809 1199025 1203571 1207792 1211726 1216064 1221389 1227293 1233442 1240520 1248910 1257464 1264944 1271750
60587 1271750 1278931 1286363 1293122 1298841 1303657 1307916 1312997 1321017 1332215 1343975 1354154 1364157 1376827
60574 1376827 1392428 1408998 1425821 1444019 1463895 1484068 1503574 1522913 1542585 1562155 1581168
60563 1581168 1599768 1617998 1635347 1651045 1663988 1672743 1676697 1677008 1675352 1672045 1666472 1658797 1649720
60550 1649720 1638921 1625547 1610442 1596300 1585114 1576701 1570053 1564853 1561047 1557995 1554858 1551312 1547328
60537 1547328 1542797 1537838 1533065 1528949 1525028 1520258 1514428 1509063 1506431 1507300 1510104 1512918 1515751 1519807
60523 1519807 1524900 1529302 1532459 1536072 1541576 1548049 1553719 1558212 1561914 1564316 1564661 1563552 1562320 1561190
60509 1561190 1559451 1557074 1554816 1552949 1551137 1549531 1548853 1549336 1550237 1550344 1548558 1544519 1539262 1534636 1531416
60494 1531416 1528759 1526240 1525495 1528742 1536447 1547571 1561437 1578147 1597823 1620728 1647689 1679165
60482 1679165 1714370 1752494 1794322 1841408 1894153 1952022 2015306 2085192 2161971 2244130 2328914
60471 2328914 2412559 2490004 2555536 2604337 2633483 2642374 2633141 2610158 2578069 2540231 2499257 2458046
60459 2458046 2419355 2385127 2357145 2337519 2327306 2325435 2330171 2341074 2358471 2381858 2410219 2443247
60447 2443247 2480878 2522151 2566038 2613064 2664901 2722871 2788048 2862180 2946962 3042720 3149189
60436 3149189 3267441 3399940 3549167 3717248 3906219 4117345 4350655 4606172 4884662
60427 4884662 5185948 5507830 5848745 6210683 6597548 7011421 7452112 7918013 8402216
60418 8402216 8885907 9338076 9723758 10012635 10181617 10214527 10104097 9855454 9487016 9027247
60408 9027247 8508452 7960000 7404491 6858738 6336381 5847589 5396793 4983462 4606129
60399 4606129 4264530 3957724 3682378 3434453 3211657 3013170 2837591 2682055 2543176
60390 2543176 2418426 2306600 2206894 2117544 2036056 1961211 1893751 1834048 1780101 1729325 1681412
60379 1681412 1637543 1597325 1558731 1521055 1485768 1454042 1425325 1398925 1375230 1354532 1336013
60368 1336013 1318747 1302740 1288454 1276121 1265694 1256600 1247615 1238130 1229383 1223072 1218889 1215081 1211320
60355 1211320 1209076 1208826 1209059 1208824 1209253 1211301 1213596 1214153 1213265 1213281 1215878 1220569 1225587 1229518 1232305 1235097
60339 1235097 1239020 1244056 1249423 1254729 1260032 1265131 1269791 1274553 1280253 1286842 1293743 1301054 1309046 1316597
60325 1316597 1321754 1324014 1324596 1324292 1322660 1319649 1316321 1313298 1310096 1306777 1304740 1304807 1305739 1305743 1304585 1303222
60309 1303222 1302245 1301688 1301730 1302573 1304000 1305839 1308623 1313096 1319228 1326127 1332824 1339032 1345291 1352352 1360207
60294 1360207 1367869 1374514 1380574 1387365 1395979 1406924 1420072 1434218 1447499 1459292 1471051 1484141
60282 1484141 1497661 1509812 1520635 1531596 1542928 1553294 1561922 1569120 1574752 1578215 1580051 1581691
60270 1581691 1583279 1583671 1583065 1583692 1587218 1593022 1599659 1606395 1612669 1617684 1621422 1624660 1627206 1627410 1624091
60255 1624091 1617727 1609193 1598863 1587748 1578035 1571312 1567110 1563927 1560779 1557216 1553041 1548779 1545430
60242 1545430 1543046 1540440 1536854 1532994 1529979 1528258 1527969 1529272 1531719 1534344 1536918 1540283 1545119 1551334
60228 1551334 1558845 1567826 1577844 1587884 1597627 1607686 1618344 1629099 1639643 1650306 1661537 1674014
60216 1674014 1688933 1706811 1726361 1746256 1767554 1792257 1819683 1846930 1873297 1901634 1934500
60205 1934500 1971459 2011141 2053601 2099344 2148173 2200460 2257689 2320312 2386813 2456305 2530456
60194 2530456 2611567 2700357 2796967 2902365 3017168 3140515 3271670 3411479 3561039 3720408
60184 3720408 3889893 4070826 4263305 4464558 4671273 4882284 5097329 5314415 5530160
60175 5530160 5741497 5945154 6136560 6311490 6468480 6607924 6729050 6829083 6905129 6955918
60165 6955918 6982278 6986914 6973284 6944087 6901503 6849096 6791896 6733701 6675910 6620167 6570707
60154 6570707 6532758 6509956 6504529 6518457 6552773 6606927 6680404 6773923 6887847 7020921 7172040
60143 7172040 7341553 7528722 7729249 7937324 8148901 8360725 8567375 8761911 8939001
60134 8939001 9095274 9227331 9331882 9407625 9454695 9472242 9458597 9413950 9341063 9243306 9123925
60123 9123925 8987458 8840048 8687673 8535134 8386957 8248055 8123123 8016190 7930731 7869311
60113 7869311 7833038 7822031 7836125 7874508 7935359 8016920 8118362 8238322 8372814 8515680
60103 8515680 8660931 8803894 8940641 9067494 9181015 9277957 9355845 9414391 9455513 9481117
60093 9481117 9491812 9488984 9477194 9463122 9452747 9450704 9461348 9488614 9535196 9603399 9696547 9818340
60081 9818340 9971204 10156417 10375322 10629240 10918973 11245905 11613055 12023369 12477220
60072 12477220 12972850 13508719 14083778 14695651 15339945 16011017 16701732 17402322 18100724
60063 18100724 18784319 19440854 20058514 20626587 21135910 21577724 21942662 22222101 22410026
60054 22410026 22502342 22495314 22386753 22178938 21879081 21496948 21043153 20529544 19969882 19379821
60044 19379821 18776531 18177191 17596219 17043946 16528619 16058638 15641381 15280819 14978189
60035 14978189 14734595 14551190 14427200 14359664 14345173 14380131 14459088 14574109 14715842 14874163
60025 14874163 15038167 15197031 15341080 15461325 15549076 15597962 15606119 15574769 15504943 15397157
60015 15397157 15253707 15078927 14876731 14649555 14399862 14131044 13846573 13549859 13245218
60006 13245218 12937466 12630338 12326864 12031547 11750379 11488059 11246529 11026827 10830950
59997 10830950 10661201 10518978 10405275 10321578 10269382 10249172 10260369 10302008 10373161 10472786
59987 10472786 10599036 10748509 10916571 11098676 11290639 11487168 11681173 11865459 12034108
59978 12034108 12181202 12299611 12382949 12428128 12434345 12400379 12325072 12210098 12060095 11880082
59968 11880082 11674695 11449892 11213028 10970558 10727357 10488749 10261352 10050991 9860994
59959 9860994 9693081 9548743 9429357 9336317 9271663 9237528 9234548 9261843 9318799 9405870 9523526
59948 9523526 9671770 9850772 10060428 10298732 10561818 10845864 11147273 11460132 11774883
59939 11774883 12080681 12368392 12630834 12861517 13054666 13206147 13313396 13374548 13388208 13353945
59929 13353945 13272636 13146586 12979899 12778910 12552073 12308948 12058635 11808782 11566070
59920 11566070 11337248 11128715 10944967 10788550 10661986 10568544 10510478 10487855 10500132 10547473
59910 10547473 10628974 10740790 10877969 11037413 11217270 11413980 11621948 11835901 12051769
59901 12051769 12265426 12472566 12670136 12856379 13029225 13186008 13325004 13446134 13550250
59892 13550250 13638975 13715425 13784062 13849980 13919178 13998741 14095124 14212615 14354995 14528269
59882 14528269 14739989 14996106 15300412 15656853 16069968 16542169 17072166 17656618 18291648
59873 18291648 18971556 19686752 20423377 21163997 21887947 22571510 23188552 23711880 24116014
59864 24116014 24380993 24494933 24453982 24261765 23929872 23477218 22926541 22301082 21624224
59855 21624224 20919433 20207391 19503488 18819740 18168158 17560171 17003757 16503616 16063497
59846 16063497 15685943 15370506 15115270 14920287 14787161 14715274 14700835 14739673 14828662 14964372
59836 14964372 15142564 15358755 15606559 15875090 16150158 16417999 16665473 16877165 17035827
59827 17035827 17126723 17139599 17066953 16904315 16653494 16322714 15922216 15461880 14953409 14411274
59817 14411274 13849565 13279897 12713170 12160320 11629433 11124371 10647919 10204335 9797372
59808 9797372 9427800 9094395 8795541 8528650 8290228 8078266 7892941 7733383 7595318
59799 7595318 7473104 7362385 7259565 7160853 7063750 6968138 6874502 6782518 6692647 6607352 6528973
59788 6528973 6457655 6392845 6335578 6287737 6249836 6220495 6196907 6174911 6149822 6118255 6078376
59777 6078376 6028410 5966951 5895368 5817820 5737849 5656919 5577069 5502525 5437006 5381398 5335556
59766 5335556 5300476 5277113 5265057 5264254 5276340 5302490 5341500 5391725 5453223 5526139 5608560 5698128
59754 5698128 5794576 5898705 6009854 6126232 6246780 6370861 6496702 6621360 6741282 6851863
59744 6851863 6947949 7026608 7088622 7136384 7171860 7197846 7219131 7240169 7262849 7288559 7321189
59733 7321189 7365820 7425314 7500442 7592806 7705572 7841596 8002815 8191603 8411438 8666088
59723 8666088 8958932 9292704 9669267 10090092 10557349 11073372 11638127 12247564 12893748
59714 12893748 13563432 14233979 14871361 15434076 15880713 16177745 16307055 16271154 16091080
59705 16091080 15797149 15420785 14992582 14541725 14091889 13658045 13249417 12874382 12540382
59696 12540382 12250890 12005963 11805724 11651238 11542470 11477613 11454366 11470467 11523667 11612879
59686 11612879 11738920 11902707 12103423 12339670 12611350 12918943 13262304 13642055 14061118
59677 14061118 14522976 15029394 15581656 16182864 16836810 17545399 18309414 19131199 20014531
59668 20014531 20962212 21975309 23053510 24193698 25388295 26626629 27897165 29186565
59660 29186565 30477729 31751692 32991925 34185939 35324718 36404418 37429557 38412512
59652 38412512 39369226 40316080 41269561 42245579 43257420 44314383 45421076 46575482 47767037
59643 47767037 48977450 50182916 51354637 52459027 53461183 54330189 55041899 55579464
59635 55579464 55935119 56112551 56126060 55997246 55753509 55428117 55057595 54676511 54314761
59626 54314761 53999043 53754513 53603789 53565443 53654331 53883012 54262636 54802779 55510137 56386793
59616 56386793 57430038 58633721 59987792 61474418 63064391 64717332 66383050 68000213
59608 68000213 69494692 70782952 71780772 72413204 72623650 72381709 71687251 70568476 69076352
59599 69076352 67279044 65255450 63086079 60844448 58593372 56384618 54257709 52238312
59591 52238312 50338814 48559346 46886184 45290431 43732418 42171203 40573709 38921196
59583 38921196 37213308 35467283 33710319 31970108 30270567 28631949 27069810 25592878
59575 25592878 24204567 22907222 21703169 20591909 19569157 18629555 17768593 16981511
59567 16981511 16262492 15606033 15007874 14464103 13970668 13524130 13121569 12759344 12432996
59558 12432996 12138652 11873479 11634603 11418436 11220965 11037809 10864233 10696067 10530229
59549 10530229 10363642 10192672 10014902 9830469 9640115 9443049 9238821 9030456 8823201
59540 8823201 8620396 8422769 8231613 8050187 7881399 7725944 7583283 7453144 7335867
59531 7335867 7232581 7145090 7074443 7019781 6979632 6953762 6942320 6943889 6956173 6978120 7009709
59520 7009709 7050121 7097921 7152407 7212860 7277008 7342380 7408854 7477878 7549699 7623780 7701703
59509 7701703 7787168 7882887 7989475 8107404 8238008 8382593 8542671 8721073 8920690 9142156
59499 9142156 9384826 9649809 9939572 10254804 10594616 10960269 11355631 11782770 12239635
59490 12239635 12723365 13233545 13770262 14330359 14907253 15493648 16083266 16670539 17249618
59481 17249618 17813801 18356200 18871487 19356745 19810177 20229900 20614972 20966207 21284249
59472 21284249 21567816 21816044 22032002 22222114 22393106 22551683 22705919 22863451 23027915
59463 23027915 23199324 23377060 23558909 23736614 23895391 24018691 24091226 24097700 24022825 23855182
59453 23855182 23589757 23226089 22766237 22215639 21583953 20883852 20130273 19340824 18534106
59444 18534106 17725908 16928026 16150778 15404344 14696796 14032832 13415409 12846951 12328417
59435 12328417 11859190 11438783 11066871 10741095 10456954 10210888 10001831 9828977 9689932
59426 9689932 9582028 9503865 9454668 9433746 9441505 9479528 9548722 9648357 9777265 9934705 10120031
59415 10120031 10333265 10576283 10851579 11159327 11497153 11862750 12254605 12669588 13101620
59406 13101620 13542883 13984224 14413866 14817813 15182442 15495378 15744113 15916315 16002565
59397 16002565 15997539 15898928 15707861 15430984 15079781 14666886 14204338 13704883 13181863 12646792
59387 12646792 12108905 11577222 11060473 10564497 10092163 9646262 9229967 8844152 8487314
59378 8487314 8158799 7859226 7587087 7338418 7111217 6907061 6726815 6567800 6426978
59369 6426978 6303998 6198991 6109944 6034753 5973927 5928977 5899535 5883788 5880309 5887975 5905450
59358 5905450 5931984 5967433 6010913 6061240 6119144 6186701 6264082 6349714 6444298 6550951 6669253
59347 6669253 6792287 6912282 7027501 7142195 7262500 7394466 7543223 7711039 7897714
59338 7897714 8105042 8338850 8604023 8899001 9217691 9555905 9914527 10298459 10715098
59329 10715098 11172792 11678218 12235109 12846069 13514273 14242573 15032660 15885882 16802481
59320 16802481 17778215 18803286 19865293 20950574 22041212 23114085 24146233 25120342
59312 25120342 26024148 26847681 27584230 28232424 28794753 29274910 29677670 30008551 30270578
59303 30270578 30462472 30581656 30626916 30595956 30482966 30281994 29991844 29615703 29158272 28626831
59293 28626831 28034274 27398114 26736406 26065430 25398554 24743490 24100666 23466144 22835415
59284 22835415 22203199 21562229 20906037 20232829 19544789 18844902 18136881 17426995 16723027
59275 16723027 16031734 15359198 14712491 14098317 13520343 12979778 12477794 12015403 11592046
59266 11592046 11206674 10859581 10551012 10278542 10037998 9826593 9643494 9487973 9358779
59257 9358779 9254622 9173694 9113464 9072392 9050868 9049145 9065860 9100170 9153413 9226208 9315248
59246 9315248 9415293 9523154 9637420 9755604 9874187 9990509 10101938 10204019 10292209 10365171
59236 10365171 10424147 10469600 10500728 10517872 10523222 10519453 10509621 10498045 10489496 10487818 10496663 10520547
59224 10520547 10563325 10626341 10709654 10814202 10941239 11090936 11263317 11459128 11677507 11913837
59214 11913837 12161922 12416975 12674160 12925486 13160929 13372196 13553465 13699601 13806059
59205 13806059 13869756 13888046 13858435 13782347 13668520 13529944 13377672 13219355 13061996 12912430
59195 12912430 12775010 12651547 12543484 12451820 12375206 12310697 12256523 12212123 12175826 12144721
59185 12144721 12116821 12091530 12068392 12047471 12030946 12022663 12026447 12046249 12087085 12154037 12251005
59174 12251005 12381981 12552330 12766843 13027631 13335972 13694939 14107648 14573743 15089570
59165 15089570 15650279 16248539 16871433 17500866 18116414 18695856 19214496 19647579 19974059
59156 19974059 20177170 20243448 20164528 19939752 19575189 19081428 18474461 17776678 17013122 16206706
59146 16206706 15378389 14548957 13736048 12950264 12197973 11487045 10825784 10216950 9657478
59137 9657478 9144532 8677939 8256387 7875467 7530885 7220444 6941723 6690642 6463444
59128 6463444 6257924 6072147 5904144 5753091 5618371 5497334 5386409 5284559 5193181 5112749
59118 5112749 5042162 4981267 4931044 4891114 4859829 4837031 4824064 4820987 4826575 4840973 4865236 4898102
59106 4898102 4936547 4980087 5031365 5091789 5159649 5233409 5314048 5403105 5501046 5608420 5726187
59095 5726187 5853868 5989523 6132291 6282976 6441749 6607327 6778462 6953798 7130158
59086 7130158 7303595 7472316 7635749 7790583 7930897 8052856 8156301 8240997 8304733 8346686
59076 8346686 8370015 8379359 8377698 8366969 8349994 8330581 8312894 8301106 8298219 8305256 8323418 8356857
59064 8356857 8411178 8489496 8592305 8720761 8877012 9061355 9272411 9510599 9778249 10075559
59054 10075559 10399564 10748124 11121941 11521255 11942748 12380455 12827105 13273405 13708153
59045 13708153 14119898 14496528 14823168 15083739 15266366 15366060 15382685 15319515 15184369 14988728
59035 14988728 14743759 14458536 14141874 13802563 13446534 13076237 12693730 12302031 11902982
59026 11902982 11496832 11085187 10671961 10260495 9852277 9449285 9054877 8671282 8298776
59017 8298776 7938393 7592940 7264169 6951351 6653666 6371823 6106454 5857356 5624989
59008 5624989 5410189 5211650 5026376 4853420 4694426 4549724 4416908 4294288 4182607
58999 4182607 4081922 3989771 3904047 3825076 3753260 3687146 3625372 3568082 3514815 3463209 3411365
58988 3411365 3359576 3308553 3257930 3207672 3159092 3113743 3073099 3039355 3013824 2994206 2976438
58977 2976438 2959747 2946842 2938766 2933263 2929044 2927651 2929697 2933270 2937995 2946959 2962334 2982396 3005056
58964 3005056 3030766 3059304 3086858 3109483 3127153 3141773 3153448 3161234 3165510 3167180 3166400 3164148
58952 3164148 3163086 3164944 3169101 3175405 3185909 3201800 3221034 3241233 3262531 3285348 3307642 3326782
58940 3326782 3342051 3353028 3357775 3355239 3347636 3337920 3326476 3312628 3297782 3284622 3274479 3267555
58928 3267555 3264509 3265792 3270581 3278025 3288527 3302578 3319806 3340372 3365500 3395303 3427892 3461969
58916 3461969 3498539 3538770 3582176 3628249 3677972 3732257 3790685 3852888 3919280 3989616 4063163
58905 4063163 4141122 4226065 4317836 4412836 4508706 4606791 4708634 4813320 4920160 5030833
58895 5030833 5146753 5267256 5392427 5524713 5665447 5812966 5966756 6130534 6308353
58886 6308353 6500222 6704409 6921583 7153795 7401677 7665608 7947829 8250676 8574470
58877 8574470 8919417 9287652 9681254 10100430 10546038 11021724 11531270 12076002 12657143
58868 12657143 13278467 13944356 14657593 15421462 16241512 17122465 18065418 19070349 20138898
58859 20138898 21272015 22467066 23719444 25024014 26371600 27745740 29124973 30485307
58851 30485307 31797491 33024917 34128359 35071842 35822492 36349344 36628365 36649008 36414118
58842 36414118 35936083 35236260 34345264 33298372 32129734 30871974 29557977 28218266
58834 28218266 26876855 25552082 24260108 23014844 21825876 20699276 19639512 18648612
58826 18648612 17725376 16867853 16074958 15343888 14668668 14043904 13467371 12936086 12442677
58817 12442677 11979347 11543408 11135602 10755068 10399417 10067779 9760034 9474295 9208136
58808 9208136 8960868 8732026 8519653 8322848 8143682 7983522 7839696 7708784 7590770
58799 7590770 7486676 7394833 7313333 7243894 7189522 7150321 7125117 7114821 7120342 7139424 7169685
58788 7169685 7212874 7272340 7348315 7439409 7546308 7669922 7808398 7960497 8129613 8319737
58778 8319737 8529459 8754839 8996377 9258188 9542018 9847200 10175095 10528332 10906772
58769 10906772 11309453 11739824 12204165 12705422 13243175 13818902 14436591 15098957 15807910
58760 15807910 16568273 17386304 18264778 19203620 20204504 21270105 22399127 23586011 24824167
58751 24824167 26104248 27409513 28717220 30003614 31242501 32399833 33435589 34312004
58743 34312004 34996569 35459540 35676636 35637187 35346261 34818675 34075171 33143909 32059315
58734 32059315 30856441 29568473 28228362 26867111 25508618 24169490 22864131 21606076
58726 21606076 20404227 19262267 18182632 17167487 16215892 15324486 14491747 13717711 12999320
58717 12999320 12330416 11707023 11128598 10593251 10095661 9630638 9195366 8787569 8404866
58708 8404866 8046284 7711097 7396185 7098001 6816917 6555770 6314323 6089193 5878955
58699 5878955 5684795 5505941 5339136 5183316 5040433 4910716 4791187 4679877 4577791
58690 4577791 4485705 4402400 4326835 4259012 4198265 4143607 4095678 4055232 4020235 3987820 3958246
58679 3958246 3932923 3909313 3882176 3849471 3812741 3772242 3726478 3676282 3624504 3571600 3516100
58668 3516100 3459196 3403906 3349714 3293022 3232976 3171862 3109730 3044079 2975345 2907354 2841589
58657 2841589 2776030 2710246 2646487 2585153 2524464 2465314 2411047 2361568 2313079 2264616 2219404
58646 2219404 2178769 2140370 2103669 2071379 2043793 2017345 1990654 1966561 1946107 1925866 1903529
58635 1903529 1881120 1860456 1840351 1820541 1803635 1790700 1779228 1767473 1756544 1746571 1735337
58624 1735337 1722443 1710237 1699109 1686630 1672799 1660927 1651679 1641761 1630627 1622961 1621951 1625208
58612 1625208 1629835 1636350 1644991 1653434 1661172 1671253 1684718 1698084 1709212 1720765 1734874 1749211
58600 1749211 1761635 1773943 1787611 1800445 1810962 1821784 1835076 1848772 1860911 1873827 1890554
58589 1890554 1910832 1933971 1961910 1995947 2033848 2073464 2116030 2163231 2214506 2269842 2331362
58578 2331362 2399362 2470655 2543723 2621648 2707158 2798943 2895959 3001186 3117620 3244367 3380276
58567 3380276 3527917 3690421 3867645 4058827 4266070 4492290 4738856 5007837 5302921
58558 5302921 5625109 5970850 6337091 6724269 7131045 7549416 7967900 8375785 8760844
58549 8760844 9106442 9394990 9612571 9748686 9795709 9752206 9624254 9421095 9152351 8831110
58539 8831110 8475074 8100780 7718877 7336731 6961810 6600027 6254406 5928003 5625027
58530 5625027 5347153 5092340 4859094 4648132 4458530 4286930 4132372 3997023 3880160
58521 3880160 3776656 3683639 3603149 3535602 3476342 3421718 3372913 3330368 3290150 3249680 3211595
58510 3211595 3177897 3145542 3112055 3080384 3053787 3030635 3008397 2987820 2968883 2947423 2920174
58499 2920174 2888479 2852911 2809384 2755247 2694405 2631713 2567084 2499841 2433928 2373565 2318025
58488 2318025 2265501 2217674 2175564 2135447 2093935 2052807 2014115 1975292 1934259 1894615 1860224
58477 1860224 1828920 1796980 1765616 1737655 1712103 1687380 1665655 1648455 1632132 1613200 1594073
58466 1594073 1578034 1562784 1544603 1524688 1505685 1486176 1464483 1443777 1427394 1413034 1397488
58455 1397488 1383038 1373121 1365695 1357144 1349008 1344695 1343260 1342509 1344364 1350919 1359039 1365163 1371648 1382098
58441 1382098 1394448 1405271 1416982 1433706 1453512 1471731 1488815 1508311 1530303 1553355 1579428
58430 1579428 1609963 1640348 1665111 1685499 1705360 1722932 1733563 1737280 1736794 1731237 1718715 1701813
58418 1701813 1683733 1662282 1634488 1603622 1574632 1546249 1514891 1482759 1454527 1429461 1404446
58407 1404446 1381295 1363184 1347222 1328657 1309394 1294406 1282846 1270722 1259042 1250970 1244159 1234703
58395 1234703 1225801 1223445 1225957 1226639 1224627 1224352 1226438 1227985 1229967 1235666 1243478 1249687 1256492 1268913
58381 1268913 1285804 1302471 1319962 1343010 1370834 1398861 1427299 1458696 1488914 1510176 1521964
58370 1521964 1529883 1535189 1534607 1529089 1523250 1517054 1507110 1495118 1485947 1478529 1467880 1455087 1445967
58357 1445967 1440688 1434026 1425238 1418657 1415302 1412779 1412528 1418272 1428417 1438775 1451136 1469833 1491638
58344 1491638 1509025 1521846 1535608 1549676 1557874 1559642 1559719 1557673 1548837 1535242 1524249 1516243 1504746
58331 1504746 1489111 1476127 1468283 1461168 1453310 1448122 1445286 1440653 1435556 1435949 1441457 1445242 1445374 1446459
58317 1446459 1449775 1452078 1454276 1460725 1469672 1475070 1477977 1485259 1496951 1506360 1512969 1523428 1538921
58304 1538921 1553315 1564977 1578801 1595415 1609979 1622816 1639482 1659230 1675425 1688634 1706849
58293 1706849 1731159 1753712 1771857 1791665 1814926 1835051 1848715 1859719 1868677 1870758 1866399 1862762
58281 1862762 1861983 1859171 1853790 1851276 1851770 1849615 1845720 1847800 1856531 1864414 1870360 1881898 1900561 1918716
58267 1918716 1933736 1951827 1974800 1996558 2015814 2038839 2066502 2091942 2114074 2139888 2170759
58256 2170759 2200369 2228732 2263660 2305497 2345146 2380046 2416869 2455456 2486154 2506743 2525990
58245 2525990 2546718 2561791 2570916 2584355 2605155 2624580 2640144 2661010 2690215 2718976 2744377
58234 2744377 2775195 2814016 2851309 2883774 2920963 2966933 3013113 3056293 3105703 3164936 3224834
58223 3224834 3281691 3344383 3416095 3487647 3556649 3634227 3724627 3817362 3907880 4006278 4116666
58212 4116666 4227824 4333598 4442562 4557993 4668714 4769662 4871115 4977737 5079693
58203 5079693 5174667 5276883 5393390 5513307 5631511 5760344 5906299 6058360 6211676 6379419
58193 6379419 6568555 6767762 6972058 7194618 7440681 7695268 7951119 8223121 8520476
58184 8520476 8831147 9149092 9489572 9861625 10253475 10661520 11104317 11590416 12102559
58175 12102559 12631958 13197015 13809374 14454640 15127276 15850305 16638065 17474227 18349793
58166 18349793 19286436 20297617 21364871 22479715 23670471 24959537 26334335 27789586
58158 27789586 29355081 31049480 32851366 34750664 36782738 38976270 41318256 43810714
58150 43810714 46509238 49461451 52661511 56110596 59862563 63961013 68399501 73204426
58142 73204426 78491820 84385303 90959949 98339493 106761639 116463509 127595451 140339038
58134 140339038 155000334 171877438 191158773 213070267 237970096 266206468 298224838
58127 298224838 335058011 377982247 426312263 474933246 514828249 537361247 538889291
58120 538889291 521769268 491669668 454348365 414222339 374353141 336614634 301818777
58113 301818777 270109015 241435450 215725200 192836510 172593541 154864159 139504808
58106 139504808 126270472 114870726 105082471 96739284 89657648 83657565 78631578 74522320
58098 74522320 71246873 68701900 66827637 65605301 64998429 64971195 65597680 67083568 69547311
58089 69547311 72671891 75572175 77126187 76589111 73972756 69874151 64996959 59848059
58081 59848059 54750683 49930932 45506042 41474015 37795142 34462838 31475841 28798468
58073 28798468 26392984 24254717 22378969 20726130 19252544 17945319 16796079 15770098
58065 15770098 14832703 13979831 13213095 12509397 11843500 11217204 10638578 10094329 9569566
58056 9569566 9073981 8621666 8203556 7804548 7429513 7088008 6770697 6464596 6174987
58047 6174987 5909297 5655625 5400269 5151416 4923372 4711943 4506901 4314230 4143983
58038 4143983 3989308 3838822 3697377 3574059 3461731 3348676 3238983 3141644 3050487 2954387
58028 2954387 2856898 2766936 2680427 2589763 2501253 2424420 2353418 2277370 2200191 2132315 2071483
58017 2071483 2009387 1948982 1897683 1851344 1802166 1754869 1718121 1687328 1652760 1617692 1591669
58006 1591669 1572288 1550207 1526183 1506881 1489420 1466235 1440400 1420678 1405855 1388597 1370092
57995 1370092 1356332 1344502 1327429 1307329 1291352 1277794 1260268 1241093 1226932 1215354 1199265
57984 1199265 1180703 1166956 1156886 1144260 1130907 1123478 1120528 1115635 1109976 1109151 1110753 1107824 1101836
57971 1101836 1099866 1101513 1100555 1096971 1095574 1095405 1092101 1088194 1089595 1094343 1096002 1095440 1098103 1102560 1103231
57956 1103231 1101652 1103497 1107042 1106399 1103746 1106372 1113418 1117298 1116741 1116935 1118151 1115827 1110933 1109045 1109820
57941 1109820 1108110 1104553 1104271 1106008 1103333 1095869 1088623 1081020 1067556 1049018 1032109 1017883 1001179
57928 1001179 981735 965296 953089 940545 927218 917894 912818 906732 898957 894972 896519 899188 901167
57915 901167 905509 912280 917267 920244 926215 936522 946338 952521 956671 959297 958386 954858 952274 950236
57901 950236 945037 937282 931553 928207 923070 915681 910015 906321 900131 890516 881725 875447 868707 860696
57887 860696 854502 850895 847290 843922 844077 847102 848078 845544 843008 842056 840704 839093 839641 840732 837506
57872 837506 829878 822682 816897 808106 794831 780998 768554 754926 739619 726201 715806 705386
57860 705386 694351 686281 682160 678525 674314 673013 675972 680023 683872 690489 700862 711461 720231
57847 720231 729295 739635 748898 756552 765446 776138 785273 791563 797916 805801 812994 818579 824616 831322
57833 831322 836371 840323 846588 854416 858361 856632 853596 851852 848435 841414 833744 827502 820430 811390
57819 811390 803419 798038 791956 782768 772852 764588 756847 749226 744614 744474 746312 748584 753128 760082
57805 760082 765716 768400 771632 777999 785119 790654 796285 803379 809687 813862 818581 825566 831954 835037
57791 835037 836317 837663 837810 835934 834199 833378 830414 823795 816954 812751 808975 803006 796659 792447 789138
57776 789138 784975 781426 779607 776697 770106 762029 755959 751643 746958 741498 734809 724506 709922 694571
57762 694571 681430 668860 654552 640105 627961 617044 605352 593880 584147 574717 564028 554018
57750 554018 547031 541586 534900 527382 521233 516896 514038 513501 515093 516042 514848 514029 515989 519112 521217
57735 521217 523773 529046 536027 543003 551252 562145 573244 581430 587523 593827 599628 603397 606997 612985
57721 612985 619511 622488 621489 619283 616829 612962 608049 603909 600669 597166 593732 591518 590013 588140
57707 588140 586554 586011 585032 582346 580119 581467 586185 592041 598634 606531 614174 619401 622953 627102 631882
57692 631882 636090 640761 648105 657901 668245 678862 690385 701466 710071 716865 724002 731406 737523
57679 737523 742942 749868 758575 767415 775784 784217 792420 800093 808795 820127 833145 846454 861310
57666 861310 879425 899274 918536 938935 964442 995421 1028740 1063081 1099748 1138413 1176717
57655 1176717 1214675 1255294 1299932 1346735 1394672 1445396 1499842 1556280 1613436 1672973 1737423
57644 1737423 1807830 1884504 1968010 2058230 2154229 2256064 2365401 2483928 2612568 2752403
57634 2752403 2904796 3070460 3249934 3444955 3657863 3889914 4141551 4413630 4706449
57625 4706449 5018157 5345912 5687593 6039733 6394109 6738676 7061295 7350247 7592235
57616 7592235 7773936 7886938 7929829 7906475 7825221 7699433 7544967 7375274 7199806 7025568
57606 7025568 6855849 6686165 6504882 6300741 6069865 5816361 5548992 5278104 5013087
57597 5013087 4760513 4524507 4308352 4114263 3942042 3790083 3657721 3544810 3449389 3368341
57587 3368341 3300665 3247799 3210192 3185787 3172536 3170415 3180144 3201553 3234022 3277373 3331888 3398389
57575 3398389 3478175 3571755 3678159 3796937 3930159 4080631 4248812 4433557 4635157 4855116
57565 4855116 5093246 5347259 5614684 5892207 6173031 6447387 6705513 6937418 7130094
57556 7130094 7268980 7343905 7351831 7293838 7172686 6994414 6769326 6509411 6225956 5929644
57546 5929644 5629992 5333118 5041836 4758841 4488070 4232418 3992412 3768044 3559815
57537 3559815 3367282 3188852 3024000 2873654 2737467 2612845 2497577 2391367 2293960 2204097
57527 2204097 2121398 2046951 1980609 1919737 1862063 1807924 1758491 1713640 1672927 1636789 1605210
57516 1605210 1576661 1549791 1524886 1502653 1482943 1465628 1451369 1440684 1433640 1430878 1433014 1438451
57504 1438451 1443984 1448475 1453856 1461703 1471303 1482241 1496234 1514674 1536618 1560918 1588138 1618527
57492 1618527 1650399 1682758 1717620 1757395 1801568 1848257 1897634 1951474 2010563 2074971 2146045
57481 2146045 2225890 2315341 2414140 2522553 2641331 2770831 2911532 3064710 3231401 3411637
57471 3411637 3605465 3813090 4032600 4259132 4487729 4715211 4937244 5145103 5327428
57462 5327428 5474011 5576434 5627503 5623625 5567354 5465178 5323363 5147882 4947043 4730797
57452 4730797 4507119 4281021 4056759 3838776 3630523 3434387 3252674 3086907 2936421
57443 2936421 2799538 2675988 2566476 2470366 2385914 2312561 2250777 2199554 2156296 2119750 2091158
57432 2091158 2071815 2060833 2055930 2055436 2059192 2068353 2084453 2107971 2138055 2174288 2218079 2271202
57420 2271202 2333700 2404497 2483562 2572123 2671415 2782660 2907554 3047001 3199686 3363474
57410 3363474 3537815 3723120 3918218 4120048 4325258 4529828 4726859 4906381 5057616
57401 5057616 5170613 5236742 5250210 5209927 5119005 4982878 4808994 4606980 4386268 4153176
57391 4153176 3911953 3668237 3429160 3199916 2982329 2777045 2584999 2406471 2240760
57382 2240760 2087572 1947249 1819435 1703084 1597820 1503433 1418012 1338702 1264631 1197075
57372 1197075 1136412 1081051 1029812 983051 940621 900864 862653 826561 793020 761074 730006
57361 730006 700487 673097 647151 622024 598179 575938 554658 534040 514935 497849 481882
57350 481882 465988 450138 434592 419321 404807 392069 381213 371218 361646 353063 345278 336953
57338 336953 327707 318872 311289 304072 296558 289758 284753 281217 278554 276896 275765 273429 268981 263747
57324 263747 259453 256364 254285 253775 254878 256095 256126 255405 254584 252940 249856 246596 244790 244066 242859 240833
57308 240833 238981 237916 237389 237081 236824 236537 236577 237406 238421 238270 236894 235900 236173 236626 236150 235169 234219 232679
57290 232679 230120 227415 225352 223722 222735 223405 225297 226113 225212 225366 229045 234942 240435 245492 251485
57275 251485 257728 262112 264275 265632 267055 268792 271696 276168 280662 283501 285326 287644 289969 290814
57261 290814 290685 291636 294489 298857 305221 314440 325632 336863 347631 358560 369275 379005 388933
57248 388933 401584 417866 436528 456137 475786 494483 511963 529656 549021 569631 590723
57237 590723 613527 639651 668123 696728 725582 756846 791356 828165 867006 908706 953452
57226 953452 1000970 1051997 1107369 1166319 1227954 1293505 1364509 1439615 1515761 1591407 1665484
57215 1665484 1734381 1793776 1843050 1884269 1917019 1938055 1946169 1943740 1932959 1913962 1887377 1855631
57203 1855631 1820940 1784688 1749164 1717144 1689321 1664689 1643487 1627242 1616115 1609152 1606720 1609554
57191 1609554 1615802 1622571 1630109 1640688 1653479 1664596 1672358 1678446 1683635 1686785 1688817 1693315 1702168
57178 1702168 1714693 1732163 1758978 1797817 1847310 1905660 1972631 2046593 2123729 2202070 2282813
57167 2282813 2366001 2448299 2526589 2600468 2669866 2733741 2792673 2849588 2906598 2964076 3023312
57156 3023312 3086298 3152143 3217734 3282860 3350464 3420967 3490969 3558751 3626314 3694477 3760926
57145 3760926 3824981 3889544 3956264 4023258 4089446 4156418 4224197 4290041 4353371 4416593 4478741
57134 4478741 4533658 4577134 4610679 4635599 4649057 4649552 4641283 4629443 4615486 4599831 4584314 4568796
57122 4568796 4550175 4527726 4504671 4481901 4455824 4425341 4395020 4368046 4342192 4316265 4293847
57111 4293847 4276259 4258253 4235729 4211962 4191566 4174352 4159927 4151931 4152180 4156430 4161322 4169521
57099 4169521 4182546 4194782 4200687 4202110 4202621 4200504 4193304 4183319 4172529 4157985 4137896 4115831 4093027
57086 4093027 4063452 4022500 3973038 3916378 3845536 3754978 3648935 3531945 3399142 3244362
57076 3244362 3069686 2878212 2665751 2428990 2173342 1903110 1612785 1298340 967793
57067 967793 629444 278784 -91512 -478661 -879446 -1303307 -1762796 -2261019 -2802061 -3403168
57057 -3403168 -4081606 -4839906 -5679630 -6619042 -7681361 -8877872 -10220811 -11741223 -13475623
57048 -13475623 -15448065 -17685544 -20237173 -23155904 -26475255 -30226896 -34465268 -39250841
57040 -39250841 -44630680 -50669721 -57487443 -65235916 -74065321 -84147295 -95706437 -108983729
57032 -108983729 -124186745 -141502113 -161094072 -183011778 -207133038 -233256514 -261148722
57025 -261148722 -290371851 -320237267 -350333491 -381207330 -414078799 -449327846 -485117065
57018 -485117065 -517680590 -543080486 -558776875 -563912977 -558763595 -544302536 -522106775
57011 -522106775 -494219531 -462806304 -429795358 -396651171 -364275230 -333055909 -303087426
57004 -303087426 -274420135 -247161941 -221441905 -197378052 -175087516 -154670075 -136163496
56997 -136163496 -119539865 -104740975 -91685849 -80248961 -70268151 -61582730 -54046898
56990 -54046898 -47515237 -41846446 -36924808 -32657130 -28949739 -25709126 -22863090 -20360286
56982 -20360286 -18149858 -16180656 -14418581 -12844499 -11434359 -10158250 -8997635 -7945323
56974 -7945323 -6987901 -6104612 -5283895 -4525176 -3823721 -3169005 -2559020 -2001338 -1497776
56965 -1497776 -1040557 -624643 -251191 82598 385141 660216 905480 1121766 1313557 1480042
56955 1480042 1616302 1724135 1812121 1884658 1940148 1979570 2006912 2021065 2016789 1994007 1957272
56944 1957272 1906442 1837074 1750037 1652053 1547119 1435983 1323763 1220139 1133437 1071873
56934 1071873 1045410 1052675 1066331 1044907 963530 826242 650374 451237 243138 41366 -144235
56922 -311261 -457468 -578857 -676713 -758467 -828777 -886660 -932954 -972818 -1008681 -1037929 -1059544
56911 -1059544 -1075951 -1086744 -1088075 -1080035 -1067262 -1050589 -1025814 -992753 -957609 -923834 -888296 -849117
56899 -849117 -809540 -770905 -729430 -684021 -640599 -604836 -576717 -555729 -544973 -545840 -554134 -565468
56887 -565468 -579561 -595867 -610308 -620191 -627688 -634875 -639620 -639554 -635808 -629825 -620585 -607643 -592686
56874 -592686 -575652 -553575 -525403 -493446 -458390 -418508 -376497 -341476 -320572 -313033 -315375 -326965
56862 -326965 -346790 -369766 -390958 -410123 -428659 -445683 -460259 -473527 -485134 -491288 -489884 -484229
56850 -484229 -478439 -472302 -463716 -452766 -440254 -425447 -408380 -391443 -375980 -360335 -343525 -327281
56838 -327281 -311957 -294381 -272728 -249839 -228613 -207760 -185281 -162424 -140713 -118552 -94430
56827 -94430 -70373 -48614 -27897 -6813 11842 23706 27452 23709 12049 -7423 -31687 -57078
56815 -57078 -82027 -105185 -123658 -135957 -144110 -149972 -151972 -148089 -139195 -126702 -109869 -88276 -63839
56802 -63839 -37164 -4798 36713 86529 141486 198470 251604 291374 311440 313898 304351 285250
56790 285250 258225 228953 203659 182735 163199 145811 134762 131595 134453 142640 157381 178705
56778 178705 205719 239524 282219 333660 392574 459496 534378 611588 680815 732874 762549
56767 762549 767975 751289 718953 677658 630340 578679 527345 481672 442614 408181 378714 356488
56755 356488 341223 330741 325722 329354 342306 362143 387774 420462 460208 504575 550830 595334
56743 595334 631056 650192 650315 634811 607262 569232 523696 476090 430348 387106 346891 311921
56731 311921 283542 260896 243362 231725 225836 223770 224565 229646 240392 256176 275605 297768
56719 297768 321387 344119 363159 375417 377605 368197 349292 324908 297759 269285 241542 216312
56707 216312 192939 169858 147860 129131 113631 99562 87021 77863 71926 66778 61540 57695
56695 57695 55594 53420 50502 48650 49298 51843 55627 60914 67080 72259 75646 78087 79950 80667 80607
56680 80607 80959 81475 80969 80190 81199 83435 83426 79287 72808 66346 60482 55489 52088 49524 45657 40154
56664 40154 35176 31870 28789 24819 20942 17701 13535 7223 -154 -7028 -13058 -17945 -20788 -21827 -22745
56649 -22745 -24182 -24975 -24650 -24182 -23356 -20148 -14166 -8144 -4443 -2357 -309 1831 4294 8724 15831 23760
56633 23760 30795 37827 46231 55222 63301 70556 77412 82634 84831 84839 84654 84877 84889 84620 84462 84097 82835
56616 82835 80676 78169 75732 73605 71586 68583 63672 57740 52612 48480 44058 39356 35922 33950
56602 33950 31682 28363 25194 22570 19210 15054 11996 10291 7334 2027 -2601 -3509 -1794 -178 1321
56586 4400 9020 13842 18856 25002 32145 39533 47175 54880 61229 65483 69180 73924 78877 82414 84843
56571 84843 87330 89366 89505 87682 84829 81198 76920 73216 71041 69359 66472 62298 57894 53797 50280
56556 50280 48017 46934 45610 43298 41249 40754 41486 43162 46917 53271 60604 67567 75017 83483 90853
56541 90853 95097 97399 99878 102003 102258 101825 103314 106902 110829 114833 119957 125571 129736 132307 134944
56526 134944 138189 141012 143090 145192 147495 149686 152396 156437 161003 164699 167911 172158 177591 183101
56512 183101 188276 193187 197011 199084 200772 204130 209185 214457 219447 224689 230272 236406 244431 254975
56498 254975 266023 275082 282189 288489 293279 295428 296635 300007 305846 311772 316499 320668 324479 327418
56484 327418 329897 332382 333394 331299 327507 324861 323285 320150 314552 308086 301749 295303 289404 284971
56470 284971 280616 274119 266424 260799 258077 256198 254355 253642 253329 250584 244805 238513 233032 226961 219957
56455 219957 214263 210992 208292 204842 201942 200508 198988 196115 193039 190989 189275 187220 185692 185169
56441 185169 184532 183304 182923 184425 186882 189303 192024 195175 197938 200279 203187 206361 208130 208526 209719
56426 209719 212378 214519 215303 217047 221658 227721 233040 237701 242580 246931 249587 250986 252282 253919
56412 253919 256337 260389 265695 270267 273042 275209 278133 281719 285682 290340 295192 298904 301828 306308
56398 306308 313281 320636 326109 329682 332046 332997 332624 331993 331401 330024 328272 328178 330304 332505 332829 331472
56382 331472 329073 325752 322770 322257 324015 325279 324793 324102 323739 321721 317522 313943 312733 311701 308754
56367 308754 305634 304755 305076 304116 301763 299321 296956 294781 294207 295496 296011 293673 290238 288509 288199 287232
56351 287232 285295 283437 281870 280765 281575 284988 289038 291607 293107 294530 294883 293309 291934 293654 298194
56336 298194 302775 305523 306136 304683 301961 299670 298291 296248 292885 290322 290424 292009 293208 294481 296998
56321 296998 300066 302564 305125 308605 312203 315078 317786 320292 321144 320686 322172 327146 332671 335968 338742
56306 338742 343591 349066 352167 353322 354938 357075 358410 359730 362722 366804 370495 374237 378649 382088
56292 382088 383430 385101 389567 394950 398140 400226 404519 410918 416786 421988 428495 435931 441935 446367
56278 446367 451171 456681 461717 466556 472251 478018 482913 488880 498329 509815 520047 529137 539781
56265 539781 552189 563998 574612 585742 598167 611472 626093 641932 656043 665631 672525 680797
56253 680797 690944 700266 707882 715124 721774 726204 728770 731280 733755 735283 736945 740135 743409 745043
56239 745043 747111 752557 759927 765896 771479 780400 792549 804718 816889 831879 849167 865084 879336
56226 879336 895718 915991 938405 962542 990172 1020774 1051629 1083071 1118479 1158343 1199503
56215 1199503 1241133 1286335 1336859 1391273 1449432 1513747 1584651 1659476 1737280 1820627 1911516
56204 1911516 2009640 2115518 2231176 2356956 2491755 2636891 2795477 2967468 3149629 3340774
56194 3340774 3542659 3755437 3976616 4204569 4438308 4673684 4904623 5128055 5342628
56185 5342628 5542957 5720919 5872788 5999296 6098633 6165955 6200604 6207298 6188889 6144303 6075114
56174 6075114 5987867 5887950 5776990 5657922 5536384 5414714 5290203 5161466 5031130 4900274
56164 4900274 4765887 4626146 4483093 4338089 4189711 4037784 3884317 3729326 3571427
56155 3571427 3413607 3261911 3116878 2973100 2829140 2690718 2561585 2438640 2319499
56146 2319499 2207844 2107076 2014811 1927993 1848024 1776797 1712537 1653196 1599326 1550655 1504636
56135 1504636 1460944 1422348 1388881 1356813 1325524 1299077 1278466 1258936 1237979 1219208 1205059
56124 1205059 1192521 1179770 1170114 1165312 1161756 1157512 1156354 1160284 1164833 1166723 1169721 1177724 1188245
56111 1188245 1197923 1208312 1220892 1232441 1240989 1250603 1264552 1279178 1290079 1298878 1308279 1316070
56099 1316070 1320025 1323618 1330801 1339825 1348014 1357916 1372919 1391239 1409993 1431011 1457232 1487405
56087 1487405 1519252 1553733 1591686 1630970 1671358 1717269 1771415 1831272 1896187 1971704 2061802
56076 2061802 2163170 2272666 2394063 2531395 2681746 2840676 3008472 3184129 3358966
56067 3358966 3523461 3675821 3817858 3948020 4065158 4173645 4277410 4372827 4453171 4515223
56057 4515223 4556295 4571099 4558382 4525608 4480991 4425889 4359771 4285411 4202730 4104554 3985825
56046 3985825 3851184 3707403 3555684 3398293 3244774 3103012 2970742 2843796 2725757
56037 2725757 2621237 2526850 2437755 2356520 2286828 2225164 2167501 2117226 2077385 2042203 2005700
56026 2005700 1971641 1945335 1922926 1898981 1877375 1863892 1854974 1844673 1836007 1834291 1835970 1835441
56014 1835441 1836306 1844238 1855165 1862422 1869171 1881639 1896499 1907371 1917571 1933733 1952880 1968743
56002 1968743 1984860 2008241 2035956 2061363 2087658 2121413 2158260 2189185 2215971 2246542 2280171
55991 2280171 2311268 2342599 2380447 2421644 2459542 2497776 2543909 2594751 2642343 2688979 2741644
55980 2741644 2797334 2849005 2900413 2959793 3024625 3087978 3153589 3228727 3308868 3386084 3465762
55969 3465762 3557628 3657092 3753555 3850441 3958328 4075068 4192030 4313269 4448365 4592675
55959 4592675 4735103 4879061 5035127 5199885 5363571 5531587 5715793 5911535 6106821
55950 6106821 6307344 6527896 6765635 7007088 7255052 7522603 7807204 8097992 8402279
55941 8402279 8736655 9098070 9472554 9865995 10295790 10758401 11237098 11736345 12275996
55932 12275996 12857158 13467488 14114330 14816990 15571455 16359102 17184731 18068337 19005978
55923 19005978 19979605 20999875 22096935 23274906 24519877 25845952 27284948 28836303
55915 28836303 30478146 32222769 34108313 36142595 38313682 40650273 43208864 46005529
55907 46005529 49025988 52296912 55875389 59776335 63994524 68597965 73715594 79441213
55899 79441213 85850947 93112731 101465008 111084546 122097414 134721775 149266378 166009767
55891 166009767 185276889 207649176 233894045 264702784 300749675 342746207 390326966
55884 390326966 439905475 483932688 513585033 523320999 513373964 488353133 454005479
55877 454005479 415097901 375065616 336239012 299932534 266652704 236526467 209573625
55870 209573625 185699550 164696489 146355765 130487602 116823480 105018245 94776909
55863 94776909 85895919 78180241 71419121 65458649 60212461 55582995 51443228 47705208
55855 47705208 44335254 41289202 38497432 35924345 33579664 31456374 29511441 27717266
55847 27717266 26077781 24581887 23191181 21885579 20674903 19555218 18498327 17494445
55839 17494445 16562223 15706033 14903283 14143013 13437283 12784566 12160328 11554831 10984612
55830 10984612 10456264 9953098 9467692 9014237 8597905 8203298 7823410 7470021 7145479
55821 7145479 6833346 6526879 6238997 5974653 5720484 5471005 5238231 5025645 4818357
55812 4818357 4608998 4408866 4223931 4043639 3863066 3693024 3538603 3389804 3242635
55803 3242635 3107835 2989526 2876329 2762942 2660217 2574594 2497225 2422443 2357957 2307859
55793 2307859 2263959 2222352 2190310 2168207 2142535 2105566 2064964 2026117 1982348 1930879 1881386
55782 1881386 1839873 1799936 1758058 1721592 1693460 1664632 1629981 1596443 1567594 1535295 1494758
55771 1494758 1453238 1415898 1377450 1335543 1297966 1268493 1239479 1206385 1175992 1152493 1129074
55760 1129074 1101138 1074515 1052732 1029386 1001167 975600 957795 941962 923757 908565 899858
55749 899858 891801 881306 875107 876803 878910 875808 872795 874287 874838 870130 865419 864619 862095 853586
55735 853586 844413 838526 830226 815095 798583 785353 770516 749966 729190 713178 697558 678400
55723 678400 661004 650043 640408 626807 613465 605531 599636 591719 585503 584301 582644 574856 564084
55710 564084 554454 542353 524113 504473 488729 473968 456574 440912 431844 425740 417565 409911
55698 409911 406496 403494 395985 386648 379576 371748 359072 344888 334088 324542 312450 300567 292977
55685 292977 287128 279093 271561 268772 268393 265888 262147 259762 256764 251162 246588 246502 247875 247276 247768
55670 247768 252812 258848 261137 261620 263727 264680 260500 253769 248983 244821 238168 231144 226923 223108 216361
55655 216361 209286 205864 204491 202216 201240 204404 208863 211056 213288 218635 224292 227015 230250 238375
55641 238375 248548 255719 261198 268591 275820 279285 281883 288680 298003 304829 309715 316536 324278 328872
55627 328872 330659 332738 334365 332876 329653 327523 324989 319589 314037 312435 313318 312964 312515 315110 319152
55612 319152 321106 321891 323790 324529 321478 318298 319797 323276 322735 318913 317241 318201 317807 315770 315261 315909
55596 315909 314614 312199 312028 313083 311408 307415 304960 304096 301334 296175 291024 285579 277533 267832 259169
55581 259169 250503 239176 227113 218513 212520 204484 193608 183227 174442 165528 156801 150106 144260
55568 144260 136685 128673 123570 120893 117613 113755 111097 108126 102485 96832 95849 98582 99963 98740
55554 98740 97649 96983 94618 91484 90417 90312 87837 84199 83636 85839 86469 84682 83352 82287 78304
55539 78304 72205 68602 68186 66984 64196 64057 68383 73399 75805 76610 77307 77221 76260 75864 76098 75840 76248
55522 76248 79637 84607 86899 85473 83222 81553 79171 76541 76529 79705 83419 86236 89180 92255 93972
55507 93972 94633 96064 98058 99070 100134 103776 109374 114030 117602 122202 127103 129077 127680 125445 123085
55492 123085 119318 115137 113100 112334 109309 103647 98275 93963 88955 84052 82529 84413 86022 85815 85808
55477 85808 86719 86742 85822 86313 88684 91143 93839 98732 105078 109867 112898 116468 120040 120675 118966 118877
55461 118877 121051 121931 120259 118735 118135 115543 109927 104097 99587 94797 89616 86587 85798 83851 79643
55446 79643 76120 74501 71864 66498 60713 56284 51793 46578 42538 39868 35599 28730 22434 18943
55432 18943 16497 13471 11209 10371 8704 4981 1392 -267 -1167 -2250 -2252 -950 -450 -1157 -325 3217 6570
55415 6570 7249 6532 6218 5714 4563 4316 5438 5643 3548 947 -596 -2204 -4765 -6705 -6814 -6451 -6970
55398 -6970 -7719 -8161 -9167 -10769 -11530 -11417 -12189 -13864 -14204 -12887 -12508 -14036 -14995 -13805 -12295 -12152 -12340
55381 -12340 -11785 -11223 -10788 -9131 -6476 -5139 -5537 -5250 -3375 -2127 -2714 -3473 -3561 -4482 -6445 -7299 -6731
55364 -6731 -7222 -9131 -9390 -7097 -5642 -6896 -7945 -6417 -4422 -4023 -3285 -400 2358 2602 2188 3798
55348 3798 6387 7751 8628 10713 13270 15048 16859 19145 19863 18022 16531 18101 20913 21657 20500
55333 20500 19702 19641 19440 19452 19973 19414 16487 12361 8411 4247 253 -923 1735 5069 6043 5911 7029
55316 7029 8403 7916 6326 5299 3801 365 -2986 -3107 -690 766 -67 -1621 -2684 -3308 -3340 -2765 -2737 -3940
55298 -3940 -4964 -4498 -3851 -5076 -7820 -10137 -11194 -11237 -10332 -9042 -8872 -10314 -11966 -13012 -14485 -16564
55282 -16564 -17145 -15149 -12770 -12180 -12420 -11877 -11422 -12502 -14362 -15752 -17266 -19488 -20963 -20473 -19066 -17352
55266 -17352 -13438 -6441 439 3587 3512 2649 938 -2720 -6496 -7145 -4629 -1894 -789 -981 -1982 -3512
55250 -3512 -4602 -4576 -4206 -4224 -4034 -3441 -3662 -4890 -5184 -3816 -3021 -4093 -4684 -2852 -861 -1485 -3271 -3388
55232 -3388 -2727 -3985 -6590 -7879 -7874 -8522 -9367 -8214 -5452 -3706 -3590 -3477 -2983 -3124 -3361 -2009 494 1828
55214 1828 1193 -295 -2162 -4629 -6622 -6642 -5322 -4442 -3948 -2624 -920 -164 318 2145 4425 4539 2157
55196 -557 -2612 -5031 -8012 -10170 -10966 -11389 -11910 -11906 -11217 -10258 -8643 -5680 -2122 437 1628 2058 1572 -355
55177 -3118 -5708 -8293 -11261 -13560 -13906 -12693 -10756 -7462 -2293 2778 5083 4693 3718 2980 1721 -84
55160 -1593 -2703 -3749 -4286 -4093 -4402 -6079 -7684 -7382 -5540 -3374 -743 2242 3320 987 -2082 -1862
55144 -1862 1767 5612 7859 8973 8980 7476 5725 5360 5472 4236 2700 3381 5509 5518 2411 -933 -2177
55127 -2177 -1930 -1262 17 1794 3134 4165 6262 9707 13102 15286 15975 14679 11150 6802 3641 1938
55111 1938 780 305 1202 2713 3509 3923 4931 5787 5282 4436 4920 5515 3376 -1440 -5788 -7581 -7322
55094 -7322 -5907 -3875 -2482 -2458 -2040 659 3800 3710 333 -2792 -3862 -4205 -4206 -1967 2835 7398 9599
55077 9599 10491 11773 13373 14689 15835 16653 16580 16174 16767 18279 19440 20257 21877 24112 25733 27122
55061 27122 29725 32896 34472 34636 35753 37849 37847 34317 29665 26346 24038 21971 21080 22084 23828 25130
55045 25130 26315 27750 28917 29896 31671 34104 35769 36520 37836 39778 40248 38439 36607 37022 39269
55030 39269 41841 44349 46823 48637 49456 49973 50853 52261 54599 57890 60206 59034 54746 50636 49004
55015 49004 49289 50344 52041 54052 55559 56919 59284 61974 62840 61838 61486 62855 63986 63458 62717 63426
54999 63426 65065 66689 68581 70478 70547 68017 64944 63621 63865 64309 64513 64279 62685 59542 56454 55051
54983 55051 55325 56686 59012 61653 63096 62870 62348 62696 63566 64660 66669 69481 71198 70284 67369 63921
54967 63921 60583 57636 55510 53816 51447 48565 46915 47332 48502 48988 48775 48103 46719 45293 45607 48044
54951 48044 50522 51113 50243 49337 48903 49096 50519 53148 55648 56861 57004 56757 56421 56506 57738 59853 61658
54934 61658 62599 62893 62112 59587 56421 54884 55262 55381 53832 51634 50188 49801 50831 53993 58666 63016
54918 63016 66505 70185 73983 76249 76751 77544 79807 82275 83795 84898 85809 85610 84710 85463 88777 92548
54902 92548 94957 96933 99847 103394 107484 113715 122858 133077 142610 152131 162550 172676 181332 189946
54888 189946 200730 213689 227244 240429 252792 263608 272693 280429 285701 285822 280152 271712 263381
54875 263381 254366 242366 227382 211355 195664 181012 168255 157390 147095 136972 128774 123836
54863 123836 120978 118619 117168 117491 118792 119952 121286 123122 124394 124707 126039 130172 135975 141452 146948
54848 146948 154104 163042 172943 184169 197404 211602 224839 236404 246337 254042 259168 262662 265101
54835 265101 265077 261013 253459 243915 232719 219851 206509 194003 182225 170860 160700 152104 143797
54822 143797 135067 127463 122261 117938 112523 106959 103637 102783 102724 102620 102513 101625 99051 95438 91946 88401
54806 88401 84426 81281 80444 81275 82130 82726 83437 83441 81766 79157 76800 74336 71275 69063 69245 70654 70983
54789 70983 70148 69552 68959 66885 63521 60686 59259 58920 59733 61602 62809 61702 59456 58779 60241 62180
54773 62180 63762 65592 67604 68885 69633 71049 73191 74918 75842 76468 76645 75896 75036 75411 76669 77259
54757 77259 77090 77835 80529 84523 88723 92460 95390 97894 101108 105297 109021 111329 113619 117607 122765
54742 122765 127864 133814 142291 152468 161896 170240 179594 191369 205254 220907 238167 255821 272469
54729 272469 288343 303933 317267 325327 328006 328008 326680 322667 315064 305199 294567 283246 271229
54716 271229 259490 248946 239776 232056 225747 220119 214711 210505 208365 206764 203321 198435 195025 194593
54702 194593 195903 197756 200681 205419 212001 220939 233090 247480 261334 273298 285046 298792 314749
54689 314749 331835 349439 367318 384657 400029 411768 418313 419002 414678 406752 395875 382294
54677 382294 366896 350590 333164 314243 294988 277321 261848 248029 235898 225782 216772 207532
54665 207532 198538 191540 186686 182005 175955 168803 161415 154356 148378 144242 141820 140604 140868 142856
54651 142856 145162 145754 144491 142907 141666 140132 138359 137495 137940 138912 140093 142067 144828 147433 149315
54636 149315 150622 151327 151508 152295 154752 157912 159669 159560 158939 158522 157766 156685 156208 156345 155904 154568 153634
54619 153634 154264 156383 159482 162984 165722 166732 166987 168910 173751 180534 187619 194121 199914 205519 211956
54604 211956 219521 226945 232848 237498 241931 246208 250077 254375 259810 265196 269037 272198 276743 282628
54590 282628 287930 291984 296019 300982 306915 314167 322943 332135 340741 349807 360491 371162 379480 386593
54576 386593 395540 405566 411797 411187 405388 397026 386500 373611 359243 344029 327851 311721 297627
54563 297627 285539 273200 260022 248595 241013 236037 231148 225226 218129 209928 201978 196665 194728
54550 194728 194397 194066 193995 194680 195572 196274 197130 198027 198576 199737 202821 206458 207340 204658 201045 198266 195029
54533 195029 190203 185093 180911 176905 172668 169518 167618 164483 158581 152079 147729 145160 142493 139575
54519 139575 137161 134626 130994 127026 124142 122319 120841 119914 119779 119401 117799 115595 113775 112023 109744
54504 109744 107522 106085 104922 103296 101641 100860 101288 103141 106526 110132 111621 110422 108435 107073 105638
54489 105638 103853 103579 106105 109664 111817 112789 114481 117466 120895 124190 127102 129157 130638 133023 137052
54474 137052 141632 145915 150830 156960 162704 166630 170183 175681 182575 187899 189921 189500 188292 187212
54460 187212 186328 184897 181828 176954 171295 165512 159233 152544 146698 142331 138480 134450 131119 129134
54446 129134 127385 124817 122339 121324 121392 121163 120086 118224 115457 112319 110360 110275 110821 110903 111393 113460
54430 113460 116325 118209 118560 118164 118126 119684 123588 128529 131731 132266 132169 133223 134625 135269 136138 138487
54414 138487 141447 143637 145630 148717 152411 155067 155831 154474 150855 146243 143455 143719 144971 145104 145092
54399 145092 146604 148404 147895 145123 142583 141842 142522 143711 144231 142512 138347 133873 130950 128750 125842
54384 125842 123127 122229 122400 121724 120413 120217 121339 122496 123327 124227 124480 123076 120888 119731 119791 120117 120802
54367 120802 122243 123047 121379 117921 115019 113299 111666 110141 110030 111446 113205 115108 117923 121139 123127
54352 123127 123619 123996 125153 127086 130211 134857 139616 142469 143584 144889 147063 149226 151497 155404 161358
54337 161358 167781 173116 177062 179793 181763 184225 188134 192534 195700 197654 199718 201914 202940 202626
54323 202626 202295 202538 202581 201958 201033 199728 197349 193773 189493 184804 180236 176996 175301 173285 169619 166127
54307 166127 165231 165725 164153 159886 155624 152966 150874 148914 148662 150700 152970 153470 152461 151027 149564
54292 149564 148695 149637 152452 155447 157232 157953 157983 157083 155590 154845 155671 157775 161094 166273 173262 180793
54276 180793 187642 193242 197097 199224 201221 204992 210052 213741 214476 213144 211068 208432 205231 201972
54262 201972 198705 194759 189951 184857 179583 173483 166192 157759 148147 138187 130545 127474 127477 126400 122210
54247 122210 116805 112847 110957 110481 110870 111382 111008 109486 107184 103907 99384 94921 92611 92609 92977 92453
54231 92453 91455 90282 88521 86618 85871 86245 86172 85050 83991 83573 82927 81662 80767 80871 81495 82445 84029
54214 84029 85476 85308 83833 83061 83573 83713 82663 81920 82774 84575 86521 88982 91940 94259 95649 97256
54198 97256 99277 100146 99292 98380 98472 98309 97032 96363 98067 101241 104053 106351 108489 109342 107961 106038
54182 106038 106256 108766 111218 111872 111080 110096 109789 110274 110901 110990 111010 112006 113408 112954 109732 105771 103416
54165 103416 102562 101813 100939 100531 100367 99841 99327 99612 100562 101571 102692 104261 106020 107506 108536 108511 106326
54148 106326 102094 97987 96174 96665 98118 99815 101670 103194 103793 103536 102649 100857 98193 95755 94680
54133 94680 94958 96054 97959 100669 103283 104634 104474 103439 102282 101587 101591 101937 102230 102926 104655 106630 107121
54116 107121 105843 104361 103624 102766 101105 99550 98841 97918 95550 92459 90463 90293 91391 93048 94674
54101 94674 95705 96282 97332 99187 100843 101365 101238 101592 102718 103873 103871 101676 97462 93347 91842 93189
54085 93189 95414 97134 98702 100343 101167 100839 100316 100018 99038 97112 95594 95382 95599 95403 95343 95705 95348
54068 95348 93563 91444 90059 88879 87265 85750 84510 82538 79831 78348 78900 79211 77309 74934 74902
54053 74902 76635 77195 75839 74683 75275 76983 78672 79857 80260 79995 80036 81101 82376 82690 82283 82061 81901
54036 81901 81273 80766 81339 82687 83856 84728 85406 85064 83188 81118 80534 81132 81587 81958 83065 84172 83524
54019 83524 81062 78743 78314 80195 83986 88248 90350 88616 84515 81106 79662 79438 80050 81893 84537
54004 84537 86987 89612 93716 98980 103265 105387 106426 107879 110003 112313 114332 115538 115758 115847 116916
53989 116916 118906 120938 122828 125003 127195 128676 129664 131029 132729 134029 135359 138420 144102 151417
53975 151417 158734 165147 170615 175702 181159 186974 192265 196971 202988 212343 224717 237917 250052
53962 250052 259983 266735 270638 274478 281206 290430 299080 305422 310398 315052 319038 322229 325546 329101
53948 329101 331223 330378 326952 322377 317594 312910 308294 303245 297367 291370 286386 282111 277118 271463
53934 271463 267341 266127 266110 264454 260602 256522 253997 252741 251156 248087 243656 238798 234393 230907 228606
53919 228606 227542 227095 226169 224280 222062 220297 219002 217995 217611 218142 219156 220232 221758 224110 226632
53904 226632 228349 229184 229565 229490 229003 228888 229729 230908 231713 232757 234919 237507 239040 239420 239789 240543 241048
53887 241048 241078 241110 241366 242013 243950 247747 252011 254555 255310 256459 259639 264485 269955 275350 279863 282830
53871 282830 284911 287497 290464 292003 291219 289474 288484 288310 288109 287899 288709 291495 296383 302565 308756 314281
53855 314281 319718 325912 332521 338420 343448 348784 355534 363709 372548 381114 388723 395587 402846 411146
53841 411146 419477 426276 431284 435288 438489 440479 441606 442958 444762 445794 444563 440536 434370 427570
53827 427570 421469 415903 409476 401679 393711 386371 378544 369215 359644 351676 344945 337773 329989 322757
53813 322757 316381 310507 305745 302607 299348 293520 285440 277637 271101 264773 258566 253814 250403 246448
53799 246448 241452 236961 233320 228675 222299 216110 211595 207739 203464 199592 196662 193143 187897 182531
53785 182531 179188 177369 174949 171251 167308 163997 161516 160015 159423 159184 159053 159419 160219 160672 160699 161243
53769 161243 162384 162789 162085 162123 164413 167825 170433 172343 174814 177568 178960 178416 177020 175827 175013 174537
53753 174537 174486 174629 174477 173876 173156 172860 173577 175562 178298 181001 183730 187235 191667 196410 201379 207292
53737 207292 214306 221578 228592 235620 242475 248282 253120 258431 264941 271595 277423 283066 289351 295672
53723 295672 301040 305534 309467 312213 313294 313816 315513 318807 322727 326046 327709 327146 325172 323696 323498
53708 323498 323102 320835 317059 313271 309933 306518 302939 299536 296038 291849 287104 282593 278904 276328
53694 276328 275126 275173 275872 276993 278872 281238 282872 283233 283392 284267 284931 284006 282073 281243 282678 285630
53678 285630 288661 290708 291153 289911 287558 284872 282287 280025 278276 276896 275469 273969 272615 270827
53664 270827 267457 262631 258227 255616 254019 252173 250670 251322 254710 259637 264686 269253 273124 276038
53650 276038 277923 279229 280999 284421 289714 295376 299406 301412 302715 304369 306332 308878 313215 319940
53636 319940 328120 336698 345504 354082 360969 365439 368892 373297 379053 385419 392136 399527 407709 416671
53622 416671 426319 435643 442910 447612 451217 455087 458815 461633 464039 466612 468484 468663 467936 467753 467981
53607 467981 467395 465827 464277 463366 463148 463940 465818 467617 467891 466601 464684 462389 459307 455662 452253
53592 452253 449330 446650 444357 442753 441550 440334 439302 438607 437581 435716 433699 432211 430410 427114
53578 427114 422990 419986 418914 418962 419335 419841 420055 419500 418913 419980 423321 427570 430762 432103 432396 433180
53562 433180 435295 438021 440159 442139 445982 452514 459870 465889 470974 477180 485359 494712 504490 514583
53548 514583 524756 534665 544464 554407 564234 573787 583489 593305 602293 610355 619196 630024 641570
53535 641570 652270 663260 676824 692636 708008 721559 734151 746308 757302 767133 777057 787453
53523 787453 797236 806196 816020 828011 841195 853654 864554 874092 882420 889475 895292 900099 904604
53510 904604 910033 917039 924690 931441 936837 941225 944423 946248 948045 951708 957010 961638 964203 965486
53496 965486 966406 966662 966190 966273 968011 970802 973327 975104 976288 976843 976759 976360 975668 974041 971051 967309 964038
53479 964038 962275 962579 964775 967730 970145 971905 974159 977903 983093 989171 995762 1002785 1010566 1019872
53465 1019872 1031145 1043734 1056601 1069660 1083628 1098755 1114771 1132066 1151833 1174773 1200389
53454 1200389 1227582 1255281 1282725 1310134 1339062 1371139 1406474 1444068 1483414 1524560 1566856
53443 1566856 1609102 1651162 1694313 1739769 1787717 1837825 1889793 1943513 1999475 2058600 2120539
53432 2120539 2182694 2242509 2300565 2359879 2422209 2486566 2551289 2615733 2679670 2742792 2805420
53421 2805420 2868355 2931623 2994632 3057754 3122263 3188328 3254527 3319667 3383535 3445464 3503889
53410 3503889 3558131 3609248 3658410 3705631 3750602 3793317 3833242 3869222 3900988 3929631 3956139
53399 3956139 3980715 4003878 4026605 4048756 4068943 4086573 4102249 4115393 4123384 4124194 4118187 4106163
53387 4106163 4087575 4062273 4032225 3999525 3964070 3925185 3884150 3842690 3799745 3752420 3700027
53376 3700027 3645003 3589644 3533997 3477394 3420151 3362782 3304773 3245170 3183845 3121857 3061202
53365 3061202 3004407 2953331 2907662 2865105 2823613 2783155 2745013 2709881 2677340 2647136 2620328
53354 2620328 2598771 2583513 2573920 2568411 2565981 2567053 2573177 2585926 2605701 2631270 2660710 2692983
53342 2692983 2728354 2767273 2809644 2855564 2905791 2960565 3018820 3079714 3144297 3214188 3289022
53331 3289022 3366838 3446869 3530301 3618091 3709776 3804962 3904417 4008876 4118010 4231266 4348640
53320 4348640 4469983 4594664 4722682 4854953 4991699 5131562 5273120 5416212 5560730
53311 5560730 5705070 5847062 5985892 6121992 6255423 6385449 6511438 6633121 6749681
53302 6749681 6859204 6959486 7049635 7131023 7206276 7276614 7340344 7394734 7439218 7475535 7504639
53291 7504639 7524868 7533853 7531104 7517884 7495226 7462756 7418868 7361489 7289235 7202280 7101818
53280 7101818 6988895 6864689 6731809 6593885 6453427 6311271 6168357 6026449 5886323
53271 5886323 5746750 5606435 5466013 5327213 5191139 5058339 4929557 4805272 4685144
53262 4685144 4568716 4455878 4346057 4238310 4133235 4033589 3941637 3856855 3777518 3703516
53252 3703516 3635925 3574531 3517619 3463994 3413738 3367024 3323589 3283577 3247874 3217330 3192126
53241 3192126 3171678 3154725 3139998 3127402 3117908 3111688 3107335 3103882 3102499 3104713 3109825 3115875 3122773
53228 3122773 3132589 3146713 3164500 3185101 3209062 3237402 3270123 3306225 3344520 3384195 3425533
53217 3425533 3470460 3521364 3578593 3639465 3700199 3758613 3814905 3870556 3926887 3984241 4041995
53206 4041995 4099202 4155114 4208932 4259393 4305394 4347196 4386393 4424196 4459873 4491189 4516368
53195 4516368 4535515 4550156 4561416 4568666 4569889 4563330 4548723 4527112 4499751 4467191 4429185 4385325
53183 4385325 4335712 4280853 4221066 4156616 4088587 4018673 3947347 3873149 3795021 3714702 3635234
53172 3635234 3557430 3479615 3400934 3322880 3246982 3172927 3100155 3029673 2962802 2899037 2836432
53161 2836432 2773370 2709084 2643488 2577732 2513992 2453373 2394695 2336486 2279333 2224844 2173102
53150 2173102 2122960 2074466 2029052 1987095 1946904 1906676 1866292 1826517 1787352 1748001 1708125
53139 1708125 1668482 1630193 1593429 1557062 1519954 1482557 1446517 1412489 1379214 1345285 1311077
53128 1311077 1278011 1246489 1215537 1184157 1152196 1120063 1088310 1057410 1027467 998315 970243
53117 970243 944037 919814 896380 872528 848535 825690 804679 785021 765625 745317 723460
53106 723460 700870 679703 661617 646276 632224 618681 605783 593645 582054 570709 559080
53095 559080 546586 533690 522183 513401 506701 500626 494883 489975 485501 480405 474802 470106 467080
53082 467080 464845 462076 458281 453725 448913 444416 440540 436995 433401 430137 428153 427911 428910 430210 431023
53067 431023 430999 430432 430027 430092 430260 430416 431394 434202 438909 444756 450846 456161 459607 460929 461222 461728 462492
53050 462492 462741 461986 459882 455705 449142 441313 433912 427455 421246 414816 408476 402543 396899 391214 384919
53035 384919 377286 368370 359682 353012 348526 344626 339595 332971 325672 319310 315020 312374 309753 306064
53021 306064 301459 296116 289621 282307 275985 272006 269566 267198 265055 264160 264226 263938 262882 261539 259709
53006 259709 256777 253382 251157 250773 251618 253218 255438 257440 258123 257703 257326 257161 256561 256022 256975 259230
52990 259230 260611 259846 258125 256933 256055 254871 254123 254840 256387 257042 256108 254334 252509 250649 248567 246481
52974 246481 244769 243457 242154 240574 239044 238220 238126 237844 236549 234546 232837 232041 232123 232730 233252 233022 232075
52957 232075 231176 230481 228964 225967 222571 220369 219641 219779 220658 222208 223452 223570 223280 223545 223644 222458 221061
52940 221061 221630 223927 225291 224424 222916 222588 223510 225281 227979 230801 231843 230611 229184 229573 231341
52925 231341 233077 234728 237018 239722 242121 244456 247543 251496 256077 261761 269183 277736 285817 292522
52911 292522 298345 304146 310024 315407 320018 324402 329099 333219 334724 332888 329850 328582 329642 331165
52897 331165 331660 331265 330387 328921 327145 325657 323938 320512 315196 309772 305760 302874 300303 298040 296213
52882 296213 294538 293344 293759 295811 297609 297489 295925 294357 293303 292730 293135 294848 297009 298423 298900
52867 298900 298833 298279 297363 296773 296871 297075 297020 297392 298572 299424 298757 297304 296892 298139 300180 302206 304039 305542
52849 305542 306626 307715 309247 310907 312110 312842 313190 312583 310570 308030 306559 306812 308246 310184 312131
52834 312131 313360 313406 313112 314150 317154 320972 324017 325925 327595 329861 332337 333631 332876 330957 329778
52819 329778 330347 332170 334545 337449 340696 343202 344066 343882 344169 345679 347842 349689 350909 352170 354525
52804 354525 358070 361151 361689 359644 357365 357183 359467 363427 368606 374684 380730 385872 390264 394535 398723
52789 398723 402583 406443 410859 415741 420621 425420 430207 434471 437435 438869 439067 438363 437227 436344 435879
52774 435879 435046 433093 430270 427123 423313 418066 411541 404757 398234 391567 384467 377481 371381 366266
52760 366266 361620 357058 352728 348880 345230 341281 337479 335311 335350 335739 333914 329605 324805 320801 317060
52745 317060 313505 311784 312996 315629 317332 317617 317246 315915 312493 307235 301977 297953 294726 291458 288137
52730 288137 285238 283030 281444 280107 278389 275898 272946 270221 268153 266915 266611 266933 266940 265716 263185
52715 263185 260040 257174 255282 254429 253770 252342 250331 248667 247149 244245 239395 234241 230530 228005 225625
52700 225625 223714 223163 223188 221892 219028 216518 215871 216408 216541 215660 214065 211743 208010 202330 195229 188275
52684 188275 183023 179872 178097 176859 175705 174221 172172 170213 169419 169649 169363 167774 166138 166019 167141
52669 167141 167963 167595 166102 163662 160621 157925 156378 155798 155790 156832 159630 163862 168519 172982 176769 178825
52653 178825 178288 175664 172301 168990 165959 163662 162457 161962 161719 162096 163578 165849 168647 172723 178537
52638 178537 184680 189243 192284 195238 198217 199764 199263 197761 196020 193487 189730 185526 181934 179399
52624 179399 178144 178218 178581 177324 173636 168916 165396 164139 164483 164707 162971 158468 152160 146013 141435
52609 141435 138828 138247 139405 141029 141332 139600 136604 133269 129745 126017 122557 119931 118371 118075 119295
52594 119295 121659 123905 124818 124381 123810 124444 126443 128398 128479 126185 122749 119690 117518 116171 115857 116679
52578 116679 117987 119001 119765 120774 122089 123603 125666 128540 131590 133859 135138 135680 135323 133794 131441
52563 131441 128783 125813 122668 120355 119746 120379 121414 123092 125924 128975 130572 130481 129912 129585 129300 129244
52547 129244 130102 131821 133767 136160 139816 144247 147505 148351 147483 146506 146752 148963 152678 155817 156409 154933
52531 154933 153603 153338 153121 152500 152758 154911 158273 161882 165765 169817 172924 174483 175723 178191 181615
52516 181615 184409 185804 186505 187592 189562 192254 195128 197742 200189 202870 205779 208410 210386 211726
52502 211726 212588 213314 214551 216643 219049 221015 222545 223960 225059 225756 226962 229371 231806 232499 231901
52487 231901 232383 234887 237674 238841 238473 237756 237547 238443 240647 242940 243167 240740 237562 235762 235614 236354
52471 236354 237755 239874 242238 244181 245324 245198 243304 240091 236911 234497 232481 230851 230598 232167 234343
52456 234343 235477 234985 233135 230434 227900 226796 227375 228660 229947 231516 233434 234904 235419 235427 235364 235242
52440 235242 235625 237485 240362 242250 242157 241360 241262 241596 241753 242194 243285 244317 245052 246605 249170 250509 248861
52423 248861 246183 246234 250109 255694 260944 265470 269092 271024 271037 270060 269217 269163 270298 272679 275754 278991
52407 278991 282536 286532 290237 292805 294515 296405 299209 303466 309774 317583 324428 327977 328707 329225 331103
52392 331103 333580 335192 335331 334177 332335 330685 329585 328128 324998 320111 314728 310083 306609 304206
52378 304206 302385 300336 297698 294997 292656 290030 286360 282207 278904 276956 275937 275483 275192 274068 271502
52363 271502 268596 267078 266963 266694 265457 263874 262285 260100 257367 255425 255136 255593 255479 254855 254773 255841
52347 255841 257956 260869 264146 266974 268828 270252 272369 275548 278874 280986 281255 280241 279248 279448 281230
52332 281230 284149 287378 290281 292726 294973 297192 299327 301542 304440 308242 312018 314578 316113 318025
52318 318025 320981 324192 326958 329772 333178 336680 339714 342928 347358 352928 358655 363783 367770 369923
52304 369923 370266 370327 371751 374422 377191 380181 384942 392159 400465 407905 413644 417966 421518 425058 429317
52289 429317 434592 440644 447098 453625 459796 465231 470005 474609 479510 484859 490408 495499 499538 502806
52275 502806 506456 511401 517590 524601 532228 540038 547140 553006 557837 561675 564124 565733 568581 574208
52261 574208 581804 589670 597626 606414 615631 624277 633007 643542 655550 666262 673991 680446 688583
52248 688583 699595 713015 728414 745531 763497 781451 799846 820033 842502 866398 890874
52237 890874 916167 942953 971196 1000149 1029220 1058316 1087427 1116547 1146257 1177569 1210486
52226 1210486 1243237 1273947 1302846 1331778 1361673 1391894 1422097 1453051 1484880 1516071 1545334
52215 1545334 1573234 1600759 1627404 1652029 1674676 1696073 1716171 1734758 1752701 1770806 1787866
52204 1787866 1801668 1811798 1819749 1826407 1831112 1833297 1833369 1831851 1829207 1826718 1825737 1825606 1823924 1819580
52190 1819580 1814127 1809450 1805509 1801417 1797553 1795347 1795553 1797787 1801445 1806323 1812542 1820453 1830484 1842753
52176 1842753 1856898 1872311 1888432 1905067 1922822 1942870 1965567 1989545 2012979 2035494 2057892
52165 2057892 2080210 2101266 2120157 2137019 2152063 2164999 2175725 2184575 2191449 2195724 2197355 2197122
52153 2197122 2195248 2190727 2182646 2171462 2158405 2144224 2128995 2112495 2094227 2073661 2051038 2027583
52141 2027583 2004594 1982556 1961216 1940059 1918687 1897349 1877107 1858736 1841442 1823585 1804913
52130 1804913 1787165 1772027 1759324 1747691 1736322 1725360 1715124 1705572 1696414 1687411 1678727 1671053
52118 1671053 1665067 1660776 1657686 1655399 1653472 1650939 1646825 1641192 1635033 1629126 1623645 1618628 1613864 1608419
52104 1608419 1601330 1592886 1584260 1575867 1567209 1558366 1550257 1543079 1535810 1527871 1520041 1512971 1505909 1497861
52090 1497861 1489217 1481290 1474721 1469112 1463716 1457897 1451421 1444813 1438944 1433761 1427961 1420472 1411800 1403466
52076 1403466 1396623 1391623 1388339 1386270 1384586 1382470 1379244 1374252 1367355 1359649 1352845 1347522 1342717 1337557
52062 1337557 1332398 1327859 1323679 1319344 1315156 1311860 1309650 1308346 1308116 1309256 1311541 1314584 1318760 1325070
52048 1325070 1333930 1344559 1355759 1367066 1378950 1391911 1405744 1420062 1435416 1453142 1473825
52037 1473825 1496689 1521060 1547509 1576571 1607175 1637783 1668690 1701706 1737769 1776275 1816584
52026 1816584 1858473 1900952 1942287 1981564 2018869 2053878 2086067 2116540 2147474 2179012 2208754
52015 2208754 2235267 2259903 2283675 2304503 2319688 2329678 2337145 2343357 2347725 2350246 2351969 2352872 2351161
52002 2351161 2345129 2334671 2320975 2305791 2290757 2276215 2260732 2242866 2223334 2204503 2188025
51991 2188025 2174032 2162206 2152204 2143035 2133606 2124325 2117133 2113416 2112719 2113776 2115989 2119479 2124351
51978 2124351 2130442 2137504 2145494 2154905 2166722 2181492 2198442 2215864 2232397 2247672 2262028 2276129
51966 2276129 2290566 2305107 2318480 2329475 2338155 2345269 2350607 2352818 2351070 2346195 2339803 2332686 2324401
51953 2324401 2314132 2301599 2287086 2270649 2251383 2227829 2199328 2166836 2132244 2097102 2062060
51942 2062060 2027057 1991515 1954558 1915565 1874657 1832508 1789808 1746885 1703624 1659601 1614589
51931 1614589 1569067 1524018 1480303 1438502 1399059 1361819 1325587 1289112 1252664 1217654 1184464
51920 1184464 1151814 1118732 1085973 1054682 1024694 995149 965972 937799 911113 886392 864310
51909 864310 844653 825711 806043 786453 769002 754421 741735 730136 719697 710089 700029 688654
51897 688654 676604 665215 655243 646699 639318 632671 626010 618446 609493 599676 590603 583917 579755 576547
51883 576547 572633 567665 562136 556318 550350 544786 540134 536100 531990 527544 522748 517302 511207 505469
51869 505469 501179 497990 494409 489615 484318 479844 477031 475734 474657 471984 467059 461285 456565 453177
51855 453177 450113 447118 444944 443570 441716 438678 435448 433269 431947 430443 428552 427084 426559 426383 425430
51840 425430 423179 420159 417287 414888 412651 410595 409513 409975 411340 412392 412676 412596 412556 412763 413536 414761
51824 414761 415208 413543 410245 407441 406516 406770 406855 406579 406598 407033 407259 406822 405906 404943 404113 403185 401787 400082
51806 400082 399199 400383 403384 406245 407279 406933 407114 408872 411492 413886 416038 418554 421324 423515 424983
51791 424983 426943 430701 435936 440728 443285 443455 442740 443114 445562 449182 451744 451615 449231 446419 444486
51776 444486 443520 443317 444032 445656 447582 449086 449788 449567 448666 448099 449202 452396 456941 462048 467514 473000
51760 473000 477601 480686 482588 484078 485743 488026 490945 493397 493763 491768 488859 486253 483643 480421
51746 480421 477011 474130 471849 470316 470326 472053 474222 475710 476970 478727 480366 481070 481443 482301 482793 481758
51730 481758 480294 480765 483428 486147 487492 488161 489051 489921 490537 491476 493039 494686 496193 498120 500544 502462
51714 502462 503131 503121 503358 503861 503905 502895 500845 498571 497411 498097 500034 502415 505560 509892 514003 515581
51698 515581 514533 513493 514595 517151 519334 520785 522510 525114 528215 531150 533549 535545 537715 540377
51684 540377 542818 543892 543451 542393 541255 539791 538021 536384 534466 530938 525501 519817 515682 513255
51670 513255 511835 511365 511999 512844 512399 510148 506984 504030 501540 498861 495161 490332 485202 480660 476695
51655 476695 472794 468967 465528 462050 457746 453019 449366 447257 445313 442282 438745 436007 434132 432059
51641 432059 429139 425699 422439 419914 418293 417076 415388 412963 410534 408955 408414 408749 409973 412135 415166
51626 415166 419041 423557 427871 431159 433950 437921 443978 451402 459124 466704 473547 478490 481192 483013
51612 483013 485400 488071 489799 490297 490199 489637 488125 485740 483375 481572 479878 477537 474371 470750 466884
51597 466884 462221 455697 446964 437374 429224 423818 420678 418579 416581 413960 410189 405485 400630 395784
51583 395784 390351 384472 379667 377143 376231 375295 373620 371578 369618 368021 367219 367439 368244 369045 369676 369902
51567 369902 368930 366211 362383 358761 356241 355290 356357 359325 362871 365306 366002 365488 364511 363641 363340 363620
51551 363620 363932 364103 365057 367834 372145 376612 380159 382520 383867 384874 386757 390136 394029 396996 399159
51536 399159 401967 405983 410152 413602 416913 420919 425205 428761 431614 434926 439601 445617 452712 460954
51522 460954 470111 478891 485566 489596 492267 495349 499364 503485 506813 509070 510137 509742 507982 505573
51508 505573 503238 501212 499598 498694 498618 499086 499994 501878 505350 510361 516317 522565 528467 533515 537879
51493 537879 542595 548670 556139 564221 572153 579581 586497 593214 600123 607094 613218 617435 619327 619296 618251
51478 618251 617123 616285 615427 614435 614192 615663 618195 619893 620082 620272 621920 624162 624804 622910 619340 615171
51462 615171 610659 605684 600326 594960 590295 587211 585862 584990 582758 578427 572990 568173 564975 562922
51448 562922 560490 556404 550737 544607 538916 533835 529380 525581 521905 517462 512342 507880 505001 503037
51434 503037 500919 498841 497884 498417 499633 500392 500018 498703 497527 497561 498531 499160 499231 500230 503035 506185 507830
51417 507830 508579 510696 514849 519457 523394 527690 533801 541243 547782 551553 552609 552791 554372 558527 564802
51402 564802 572000 579363 586687 593695 599858 604753 608292 610695 612452 613950 614926 614711 613358 612010 611641
51387 611641 611945 611880 610850 608820 605891 602353 598693 594934 590398 584626 577989 570901 563150 554657 546075
51372 546075 537821 529263 519843 510282 501560 493335 484738 476315 469817 465960 463462 460448 456155 451289
51358 451289 447277 444959 443633 441899 439788 439076 440787 443566 445723 447629 450447 453495 455032 455231 456161
51343 456161 458688 461274 462063 460414 456125 448983 439766 430234 421480 413348 405733 398933 392352 384465
51329 384465 374925 365397 357360 350219 342501 333948 325474 317829 311214 305607 300623 295471 289734 283925
51315 283925 278857 274811 271613 269001 266675 264486 262712 261570 260349 257864 253975 249909 246761 244478
51301 244478 242524 240645 238621 236263 234189 233719 235274 237558 239001 239394 239464 239463 239069 238413 238363 239674 242177
51284 242177 244825 246477 246784 246421 246405 247357 249544 253038 257213 260678 262758 264671 268000 272205 275216
51269 275216 276671 278879 283844 290805 297762 304196 310927 317977 324071 328136 330439 332191 334515 337501
51255 337501 339801 339454 335717 329796 323469 317432 311430 305382 299557 293931 288185 282368 276987 272354
51241 272354 268230 264180 260066 256143 252785 250066 247601 244917 241987 239227 237114 235951 235832 236407 236849
51226 236849 236489 235389 233884 231834 228941 225639 222895 221186 220329 220140 220435 220531 219847 219024 219373 221028
51210 221028 222811 224174 226006 228808 231296 231843 230667 229656 230457 233389 237727 242169 245240 245965 244396
51195 244396 241432 238341 236367 236165 237345 238964 240463 241603 241609 239564 235948 232773 231466 231290 230449 228071
51179 228071 224636 221163 218730 218183 219447 221332 222562 222796 222400 221702 220962 220590 220865 221661 222736 223972
51163 223972 225190 226254 227501 229444 231813 233627 234493 235104 236121 237374 238548 239687 240535 240320 239015
51148 239015 238026 238805 241382 244863 248543 251706 253337 253275 253077 254455 257147 259386 260223 260341 260761 261897
51132 261897 263820 266331 268482 268955 267340 264539 261782 259787 258893 259278 260768 262890 265308 267766 269545
51117 269545 269726 268473 267489 268425 270852 272479 271592 268846 266257 264870 264068 262983 261576 259903 257234
51102 257234 252792 247109 241881 238505 237102 236649 235629 233129 229947 228069 228299 229041 228393 226665 225489
51087 225489 225200 224955 225105 227260 231667 236454 240009 242370 243686 243196 240829 238245 237075 237206 237768 238637
51071 238637 240035 241805 243957 246692 248960 248432 244166 238210 233436 230817 229813 229954 230583 230335 228563
51056 228563 226489 225542 225535 225842 227163 230295 234064 236405 236941 236841 236771 236738 237308 239081 241375 243119 244545
51039 244545 246326 247653 247307 246147 246295 247921 249101 249038 249243 251017 253724 256217 258345 260468 262854
51024 262854 265979 270035 273892 276053 276820 277799 279077 278839 276357 273402 271773 271219 270833 270871 271925 273553
51008 273553 274978 276090 276832 276738 276206 277096 280723 286053 290972 294692 297865 301036 304086 306725 308633
50993 308633 309469 309487 309677 310678 312031 312933 313018 311994 309632 306865 305780 307391 310253 312322 313362 314348
50977 314348 315380 315758 315634 316005 317114 318239 319019 319767 320419 320508 320485 321771 324883 328318 330090 329946 329585
50960 329585 330912 334384 338825 342634 345164 346960 348726 350516 352248 354374 357383 360899 364142 367207
50946 367207 371059 376190 382111 388362 395201 402932 411246 419818 429065 439683 451597 463849 475443
50933 475443 486081 496310 507283 520159 535272 551836 568706 585472 602759 621631 642852
50922 642852 666395 691410 716910 742997 771259 803358 839193 877058 915752 956012 999553
50911 999553 1047314 1099201 1155192 1215959 1282405 1355047 1433816 1518142 1607288 1700953 1799444
50900 1799444 1902936 2010705 2121430 2234037 2347721 2461359 2573501 2682811 2787777
50891 2787777 2886050 2974925 3052739 3119180 3174137 3217004 3247248 3264866 3270027 3263113 3245467 3219200
50879 3219200 3185886 3146293 3101802 3054951 3007857 2961126 2915140 2871192 2830013 2790004 2748539
50868 2748539 2704627 2658925 2611531 2561355 2507674 2450723 2390435 2325962 2257073 2185016 2111327
50857 2111327 2036532 1960561 1883857 1807583 1733171 1661983 1595022 1532619 1474662 1421122 1371996
50846 1371996 1326800 1284766 1245621 1209745 1177610 1149544 1125826 1106176 1089144 1072942 1057175
50835 1057175 1043121 1032127 1024430 1019641 1017445 1017312 1018326 1019956 1022557 1026609 1031860 1037705 1044033 1051232
50821 1051232 1059696 1069789 1082015 1096644 1113236 1130933 1149224 1168147 1187861 1208322 1229509
50810 1229509 1251752 1275731 1302182 1331700 1364797 1401924 1443232 1488388 1537016 1589336 1646018
50799 1646018 1707372 1773345 1844635 1923112 2010460 2106776 2211191 2323658 2445494 2578305
50789 2578305 2723062 2880312 3050666 3234704 3432479 3643164 3865260 4097412 4338890
50780 4338890 4588753 4844530 5102454 5359061 5611288 5854483 6081642 6285868 6462854
50771 6462854 6610000 6724358 6803398 6847371 6859072 6841263 6795986 6726564 6638598 6538197 6430213
50760 6430213 6318544 6207020 6099326 5998563 5906948 5824952 5750325 5678665 5605413 5527199
50750 5527199 5441806 5347945 5245062 5132520 5009162 4874591 4730584 4579985 4424398 4264319
50740 4264319 4101337 3938519 3778479 3622895 3474232 3335987 3210320 3097046 2996005
50731 2996005 2908945 2837762 2782015 2739532 2708838 2689889 2683099 2688699 2706739 2736729 2777344 2826677
50719 2826677 2882430 2941790 3001868 3060479 3115751 3165107 3206002 3237964 3262433 3280045 3289522
50708 3289522 3289935 3282426 3268515 3248043 3220094 3184942 3143770 3097252 3045528 2988769 2926877 2859841
50696 2859841 2789625 2720479 2655755 2595205 2536951 2481262 2430565 2386413 2348458 2316281 2290397
50685 2290397 2271263 2258835 2253389 2255527 2265209 2282034 2306582 2340284 2383777 2436529 2498149 2568858
50673 2568858 2648379 2735774 2831037 2935846 3051927 3179266 3316474 3462302 3616121 3777100
50663 3777100 3943367 4111890 4278979 4440915 4594126 4734850 4859221 4964135 5047753 5108661
50653 5108661 5144914 5154670 5137800 5096458 5034257 4955322 4863856 4763969 4659763 4555662 4456004
50642 4456004 4363543 4278665 4200732 4129933 4067190 4012571 3964632 3921074 3879147 3835533 3786892
50631 3786892 3731070 3667576 3597138 3521285 3442043 3361197 3279796 3198921 3120683 3047772 2982134
50620 2982134 2924746 2876446 2838136 2810305 2793231 2787724 2794881 2815111 2848332 2895135 2956857 3034197
50608 3034197 3126663 3233705 3355522 3492193 3642614 3804792 3976483 4154771 4335380 4513298
50598 4513298 4684423 4846225 4996588 5132407 5250080 5347857 5427230 5491156 5540687 5574117
50588 5574117 5589639 5587718 5570057 5537235 5488877 5425887 5351135 5267838 5178446 5085407 4991826
50577 4991826 4900685 4814060 4733505 4660464 4595755 4539392 4491622 4453670 4426619 4409695 4400204
50566 4400204 4395112 4392309 4390601 4389200 4387519 4385040 4381086 4374882 4366120 4355369 4343738 4332326 4322383
50553 4322383 4315891 4315211 4321641 4334588 4352515 4374271 4398955 4425017 4450497 4474086 4494936 4511396
50541 4511396 4521062 4522510 4516030 4502030 4479468 4446342 4400905 4341933 4268788 4182182 4084355 3977729
50529 3977729 3863809 3743912 3620144 3494796 3369361 3245045 3123679 3007209 2896633
50520 2896633 2792179 2694035 2602220 2516507 2437476 2366907 2305963 2253527 2207631 2167913 2135328
50509 2135328 2109896 2090479 2076730 2069533 2069287 2075121 2086129 2102154 2123226 2149594 2182557 2223705
50497 2223705 2272774 2327701 2387542 2454066 2529455 2613565 2704696 2802403 2908288 3024188 3150518
50486 3150518 3286412 3430724 3582541 3740722 3902957 4065504 4224271 4376087 4518538
50477 4518538 4649014 4765218 4867000 4956855 5038094 5113001 5182750 5247947 5308441 5363358 5412237
50466 5412237 5455949 5496126 5534114 5570981 5607991 5646516 5687877 5733761 5786175 5846014 5911798
50455 5911798 5980645 6050511 6120888 6191286 6259805 6323436 6379148 6424154 6455541 6470466 6466965
50444 6466965 6444263 6402234 6341029 6261539 6165804 6056436 5935961 5807468 5675682 5546231
50434 5546231 5423385 5309241 5205573 5115433 5042025 4986488 4947784 4924354 4914857 4917405 4929093
50423 4929093 4946490 4965948 4983356 4994333 4994879 4981438 4950318 4897787 4821379 4721264 4600422
50412 4600422 4463325 4313989 4154977 3988520 3818338 3649372 3485338 3327443 3176008
50403 3176008 3032192 2897262 2771345 2654231 2546637 2449209 2361050 2280896 2209207 2147261
50393 2147261 2094370 2048037 2007111 1972919 1946707 1927593 1913806 1904593 1900062 1900218 1905068 1914917
50381 1914917 1929836 1949224 1972140 1997605 2024831 2054190 2087748 2127420 2172379 2219642 2267437
50370 2267437 2316589 2368355 2422708 2479540 2539792 2603984 2670721 2737808 2804102 2869490 2934159
50359 2934159 2998808 3064522 3131215 3196982 3260038 3320522 3379498 3437143 3493086 3547678 3601610
50348 3601610 3654815 3707025 3758906 3811414 3864298 3916330 3966695 4015123 4060986 4103320 4141469
50337 4141469 4174720 4201666 4221002 4232682 4237078 4233201 4218953 4193109 4155771 4106716 4044621 3968598
50325 3968598 3879697 3780353 3672958 3559456 3441745 3321877 3202047 3084867 2973444 2870692
50315 2870692 2778363 2696865 2626129 2566645 2519433 2484835 2461540 2447215 2440089 2439419 2444266 2452378
50303 2452378 2460633 2466162 2466741 2460506 2445912 2422111 2389342 2349042 2303290 2253534 2199778 2141504
50291 2141504 2079319 2015098 1950632 1887083 1825777 1768231 1714826 1664535 1616718 1572287 1532272
50280 1532272 1496208 1463076 1433108 1407390 1385990 1367690 1351562 1337850 1327231 1319920 1315579 1313583
50268 1313583 1313430 1315314 1320093 1328274 1339404 1352900 1368890 1387493 1407854 1429024 1451591 1477211
50256 1477211 1506339 1537383 1568408 1598930 1629720 1661652 1695351 1731384 1769958 1810466 1851848
50245 1851848 1893589 1935982 1979076 2021567 2061268 2096853 2128637 2157353 2182795 2204344 2222232
50234 2222232 2237104 2248444 2254745 2255472 2251679 2244310 2233139 2218150 2200754 2182433 2162818 2140132
50222 2140132 2113089 2081500 2045621 2006081 1964215 1921550 1878857 1836230 1793761 1751619 1709825
50211 1709825 1668633 1628756 1590582 1553563 1517169 1482143 1449967 1421238 1395188 1370629 1346822
50200 1346822 1323732 1302186 1283692 1269423 1259359 1252636 1248416 1246083 1245051 1244816 1244841 1244131 1241696 1237919
50186 1237919 1234632 1233226 1233521 1235094 1238469 1243750 1249210 1252835 1254692 1256088 1256849 1255291 1250833 1244885
50172 1244885 1238803 1232466 1225323 1217468 1209053 1199715 1189426 1179190 1170268 1163042 1156853 1150484 1142758
50159 1142758 1133419 1123697 1115577 1110403 1108450 1109350 1112044 1114623 1115508 1115140 1115714 1118987 1124912 1132264 1139532
50144 1139532 1145115 1147883 1148366 1148835 1151568 1157006 1163538 1168704 1170870 1170325 1168674 1166724 1163428 1157660 1150475
50129 1150475 1144287 1139969 1136100 1131220 1125568 1120302 1116166 1113223 1110786 1107236 1101070 1092642 1083729 1074990
50115 1074990 1065083 1053003 1040032 1028279 1018252 1008962 999759 990855 982473 974728 968368 964710 964507
50102 964507 967143 970836 973487 973866 972443 970695 969061 965957 959422 949424 937911 926717 916113 905453
50088 905453 894575 884211 875271 868063 862173 856858 851422 845475 839346 834340 831938 832174 833181 832947
50074 832947 831248 829185 827245 824968 822545 821490 823090 826923 831489 835878 840440 846171 853685 862420
50060 862420 870789 877621 883510 890073 897822 905642 912699 919859 928484 938526 948617 957583 965106 971229
50046 971229 976095 980190 984184 988398 992818 997713 1003793 1011481 1020179 1028671 1036534 1044948 1055584 1068610
50032 1068610 1082455 1095852 1109301 1123739 1138633 1152713 1166296 1181381 1199338 1219886 1242556
50021 1242556 1267615 1294805 1322690 1350349 1378758 1409338 1441834 1474835 1507855 1541752 1577359
50010 1577359 1614683 1653383 1693184 1733966 1776163 1820876 1868738 1918661 1968593 2017733 2067447
49999 2067447 2119868 2176227 2236726 2301379 2370460 2444337 2523406 2608286 2699818 2798655 2905020
49988 2905020 3019197 3142307 3276071 3421291 3576661 3739254 3905721 4072294 4234066
49979 4234066 4385473 4522042 4641154 4741236 4821323 4882032 4926296 4958374 4982183 5000482
49969 5000482 5014760 5025367 5032002 5033893 5028472 5009709 4969320 4900973 4803238 4678444 4530183
49958 4530183 4362932 4182713 3995974 3807734 3621855 3442540 3273824 3117418 2972532
49949 2972532 2838368 2715706 2605590 2507519 2419681 2340397 2268753 2204286 2146576 2094857 2047764
49938 2047764 2003820 1962521 1924504 1890301 1859204 1829642 1800435 1771386 1742977 1715812 1690203
49927 1690203 1666063 1643230 1621887 1602249 1583731 1564977 1545262 1525603 1507929 1493197 1480746
49916 1480746 1469497 1459245 1450602 1444137 1440081 1438598 1439766 1443091 1447468 1452088 1457457 1465160 1476369
49903 1476369 1490601 1506192 1521979 1538269 1556032 1575595 1596700 1619655 1645554 1674918 1706755
49892 1706755 1739627 1773270 1808516 1845965 1885708 1928205 1974422 2024921 2079758 2139438 2204873
49881 2204873 2276051 2352071 2433361 2522731 2622973 2734182 2854876 2985378 3128776 3288632
49871 3288632 3466906 3663933 3879037 4110736 4357037 4615585 4882693 5152383 5417426
49862 5417426 5671741 5911336 6133558 6336829 6521234 6688123 6838896 6975288 7100716
49853 7100716 7219331 7332562 7437298 7527790 7597967 7641239 7649880 7616922 7539131 7417857 7257655
49842 7257655 7064753 6845920 6607321 6353997 6090423 5820959 5549281 5278138 5010268
49833 5010268 4748926 4496792 4254934 4023665 3803958 3597316 3404698 3226323 3062056
49824 3062056 2911220 2772461 2644695 2527948 2422462 2327261 2240413 2160479 2086832 2018713
49814 2018713 1954989 1895036 1838975 1786661 1737067 1689108 1642770 1598867 1557677 1518123 1478759
49803 1478759 1439611 1402634 1369866 1341344 1315487 1291319 1269397 1250385 1233708 1218198 1203375
49792 1203375 1189500 1176944 1166123 1157592 1151538 1147338 1143997 1140790 1137425 1134141 1131864 1131616 1133414
49779 1133414 1136315 1139727 1144007 1149652 1156780 1165676 1176682 1189095 1201446 1213540 1227099 1243503
49767 1243503 1262177 1282226 1304425 1330145 1359323 1391007 1425130 1462233 1502285 1545576 1594250
49756 1594250 1650928 1715889 1787390 1864942 1950630 2046999 2155218 2275750 2409310 2556329
49746 2556329 2716339 2888267 3070380 3259498 3450966 3639528 3819446 3984031 4126970
49737 4126970 4245296 4340599 4417001 4478590 4528889 4571319 4608838 4643198 4674776 4702454 4722994
49726 4722994 4730857 4719176 4681121 4611029 4505734 4365928 4196317 4004211 3797740 3584617
49716 3584617 3371258 3162294 2961023 2770329 2592793 2429912 2281765 2147505 2025902
49707 2025902 1915614 1815599 1725350 1644361 1571664 1506454 1448802 1398863 1355521 1316708 1281003
49696 1281003 1248031 1217553 1189289 1163697 1141667 1123042 1106501 1091302 1078105 1067493 1058651
49685 1058651 1050229 1041801 1033699 1025932 1018089 1010151 1002779 996785 992490 989469 986849 984132 981726 980422
49671 980422 980393 980975 981256 980505 978391 975423 972870 971446 970309 968126 964878 961654 958954 956368 953778
49656 953778 951538 949429 946841 944210 942833 942837 942780 941809 940745 940232 939358 937404 935729 936380 939403 942885
49640 942885 945290 946662 947753 949006 950422 951795 953129 954996 957990 961612 964550 966698 969936 975825
49626 975825 983188 989097 991949 992549 992499 992678 993347 994694 996811 999490 1002213 1004200 1004793 1004120 1003121 1002527
49610 1002527 1002161 1001645 1001319 1001862 1003305 1004958 1006031 1005963 1004686 1003168 1003182 1005663 1009516 1012697 1014300 1015038
49594 1015038 1016062 1017979 1020768 1023883 1026573 1028627 1030672 1033244 1035960 1038137 1039713 1040885 1041384 1041035
49580 1041035 1040619 1041103 1042200 1042658 1041903 1040532 1039450 1039410 1041152 1044738 1048843 1051962 1054425 1058011 1063378
49565 1063378 1069232 1074351 1078968 1083416 1086815 1088273 1088568 1089505 1092216 1096947 1103776 1112372 1121403 1129411
49551 1129411 1136182 1142433 1148449 1154107 1160102 1167872 1178021 1189849 1202871 1217801 1235383 1254968
49539 1254968 1275086 1294977 1314808 1334810 1355233 1377155 1402251 1431104 1462182 1493137 1523106
49528 1523106 1553396 1585975 1621670 1659931 1699949 1741515 1784801 1829772 1876260 1924499 1975164
49517 1975164 2028686 2084909 2143676 2205476 2270950 2339872 2411085 2483543 2557025 2631866 2708464
49506 2708464 2787258 2868620 2952405 3038056 3125446 3215025 3306503 3397926 3487011 3573254 3657862
49495 3657862 3741652 3824023 3904124 3981840 4056781 4127066 4190173 4244814 4291163 4329318 4358450
49484 4358450 4377795 4387823 4389860 4384898 4373298 4355571 4332835 4306260 4276582 4244617 4211924 4180243
49472 4180243 4150224 4121417 4093725 4068332 4046864 4030237 4018739 4012448 4010777 4012346 4016510 4024812
49460 4024812 4039596 4061213 4087812 4118002 4152161 4190588 4232016 4275240 4321034 4370730 4423407
49449 4423407 4476134 4526905 4575766 4622825 4666692 4705683 4739305 4767419 4788604 4800554 4801979
49438 4801979 4793242 4775151 4747992 4711741 4666232 4610639 4543565 4464546 4375305 4278988 4178259
49427 4178259 4074497 3968438 3860675 3751442 3640781 3529447 3419247 3312072 3208892
49418 3208892 3109884 3014989 2923930 2836128 2751181 2669191 2590303 2514403 2441687 2372927 2308469
49407 2308469 2247476 2189119 2134015 2083347 2036756 1992413 1949285 1908037 1869399 1833000 1798527
49396 1798527 1766861 1738966 1714309 1691400 1669454 1648637 1629082 1610704 1593910 1579447 1567315
49385 1567315 1556461 1545821 1535200 1524983 1515531 1507264 1500989 1497471 1496414 1496041 1494075 1489486 1483374
49372 1483374 1478061 1475255 1475087 1476786 1479952 1484991 1492306 1501355 1510880 1520304 1530597 1543252 1558566
49359 1558566 1575752 1594793 1616931 1642424 1668704 1691942 1710188 1724119 1735315 1745164 1755118 1766348
49347 1766348 1778847 1792128 1806959 1824947 1845972 1867590 1887794 1907144 1927316 1948829 1971288
49336 1971288 1994776 2019454 2044529 2069088 2093677 2119714 2147395 2175326 2202234 2228026 2252979
49325 2252979 2276918 2299646 2321701 2344245 2368408 2394697 2422778 2451754 2480853 2509871 2538975
49314 2538975 2568408 2598531 2629722 2662050 2695513 2730789 2769106 2810910 2855177 2900579 2946837
49303 2946837 2994422 3043488 3093989 3146507 3202122 3261322 3323489 3387502 3452677 3519384 3588883
49292 3588883 3662054 3738058 3814939 3892029 3971049 4054118 4141337 4231300 4323456 4418880 4518755
49281 4518755 4623079 4730902 4841140 4953136 5067166 5184477 5306257 5432383 5561622
49272 5561622 5693116 5827305 5965328 6107734 6253737 6401467 6549047 6695511 6840565
49263 6840565 6983639 7123756 7260334 7393186 7521291 7642394 7754457 7856910 7949906 8033017
49253 8033017 8105285 8165839 8213772 8248140 8269044 8278116 8277060 8266217 8245452 8215892 8179808 8139387
49241 8139387 8096482 8052858 8009440 7965883 7922226 7880459 7843048 7810286 7780684 7753849 7731383
49230 7731383 7714841 7704330 7699440 7700196 7706633 7718561 7736105 7759515 7788307 7821561 7859101 7901163
49218 7901163 7946843 7994246 8042481 8092083 8142943 8193130 8240397 8283530 8321504 8352495 8374770
49207 8374770 8387662 8390745 8382851 8362774 8330267 8285457 8227838 8156839 8073134 7978679 7875616
49196 7875616 7765520 7649302 7527439 7400670 7270746 7139969 7009754 6880342 6752303
49187 6752303 6627377 6507109 6391406 6279367 6171093 6067695 5969662 5876121 5786000 5699502
49177 5699502 5618222 5543731 5475780 5411963 5349612 5288171 5229177 5173834 5121358 5070050 5019149
49166 5019149 4969031 4920252 4873264 4828659 4786729 4746722 4707262 4667857 4629661 4594450 4562816
49155 4562816 4533478 4504576 4475665 4447974 4422471 4398317 4374046 4349715 4326684 4305373 4284589
49144 4284589 4263400 4242381 4222465 4203728 4186137 4170414 4157089 4145525 4134936 4125691 4118404 4112272
49132 4112272 4105790 4099179 4094845 4095009 4099665 4107243 4116442 4126871 4138383 4150666 4163679 4178154 4195252
49119 4195252 4215572 4238557 4262977 4287912 4313200 4339179 4366336 4395142 4425829 4458341 4492711
49108 4492711 4529251 4567967 4608011 4648464 4689611 4732646 4777955 4824338 4870206 4915147 4960354
49097 4960354 5008052 5060351 5117742 5178498 5240231 5302114 5364876 5428938 5493927 5560194 5629151
49086 5629151 5701237 5774811 5848050 5920931 5994318 6068126 6141572 6214455 6286759 6357493 6425172
49075 6425172 6489274 6550195 6608227 6663738 6717921 6771954 6825457 6877090 6926713 6975687 7024728
49064 7024728 7072756 7118398 7161588 7202963 7242557 7279926 7315095 7348520 7380336 7410329 7438613
49053 7438613 7465686 7491627 7515733 7537276 7556497 7574437 7591820 7608373 7623338 7636391 7647913
49042 7647913 7658767 7670083 7682858 7697184 7712111 7726843 7741831 7758048 7775550 7793659 7812305
49031 7812305 7831906 7851987 7871468 7890848 7912565 7938158 7966181 7994002 8020817 8047664 8075293
49020 8075293 8103438 8131766 8160128 8187913 8214391 8239836 8265306 8291075 8316002 8338729 8358928
49009 8358928 8377145 8393785 8408464 8420269 8428756 8434572 8438610 8440523 8438826 8432731 8422942 8410213 8394233
48996 8394233 8374713 8352498 8328441 8302042 8272411 8239786 8204801 8167129 8126538 8084538 8042953
48985 8042953 8001258 7957473 7911776 7866939 7824684 7783773 7742661 7702034 7663349 7626486 7590626
48974 7590626 7556441 7525720 7499215 7476175 7455790 7438012 7423102 7411256 7402651 7397209 7394487 7394224
48962 7394224 7396551 7401054 7406244 7410947 7415935 7423171 7433423 7445487 7457810 7470129 7483208 7497569
48950 7497569 7512928 7528592 7544017 7558947 7573155 7586223 7597886 7608547 7618786 7627941 7633790 7634577
48938 7634577 7631251 7626708 7622567 7617562 7609610 7598658 7586464 7573989 7560283 7544268 7526481 7508321
48926 7508321 7490290 7472031 7453682 7435886 7418353 7399638 7378870 7356738 7334061 7310314 7284535
$$ [...]
##END NTUPLES=NMR SPECTRUM
##END=
