
##TITLE=AC1046_TOLI02_5906655_wCWJAPoUAQ
##JCAMPDX= 6.0         $$ Bruker NMR JCAMP-DX V2.0
##DATA TYPE= NMR SPECTRUM
##DATA CLASS= NTUPLES
##ORIGIN= BRUKER
##OWNER= Administrator
$$ 1.72 TOPSPIN		Version 2.1
$$ 2012-04-10 10:13:36.718 -0500  Administrator@TOPSPIN
$$ Compression mode = diff/dup
##.OBSERVE FREQUENCY= 400.13188235
##.OBSERVE NUCLEUS= ^1H
##.ACQUISITION MODE= SIMULTANEOUS (DQD)
##.ACQUISITION SCHEME= undefined
##.AVERAGES= 8
##.DIGITISER RES= 22
##SPECTROMETER/DATA SYSTEM= spect
##.PULSE SEQUENCE= zg30
##.SOLVENT NAME= COFFEE_meoh
##.SHIFT REFERENCE= INTERNAL, COFFEE_meoh, 1, 14.98061
##AUDIT TRAIL= $$ (NUMBER, WHEN, WHO, WHERE, PROCESS, VERSION, WHAT)
$$ ##TITLE= Audit trail, TOPSPIN		Version 2.1
$$ ##JCAMPDX= 5.01
$$ ##ORIGIN= Bruker BioSpin GmbH
$$ ##OWNER= Administrator
$$ $$ C:\Bruker\TOPSPIN/data/COFFEE/nmr/AC1046_TOLI02_5906655_wCWJAPoUAQ/10/pdata/1/auditp.txt
$$ ##AUDIT TRAIL=  $$ (NUMBER, WHEN, WHO, WHERE, PROCESS, VERSION, WHAT)
(   1,<2012-04-04 15:06:35.781 -0500>,<Administrator>,<TOPSPIN>,<go>,<TOPSPIN 2.1>,
      <created by zg
	started at 2012-04-04 15:05:28.859 -0500,
	POWCHK enabled, PULCHK disabled,
       configuration hash MD5:
       1A 1E CE 29 27 FD 77 03 67 4E F0 E3 C4 B2 CB 90
       data hash MD5: 64K
       DE B5 6A C1 8F C2 B0 62 7F FE 7C 0D 37 D7 31 5A>)
(   2,<2012-04-04 15:06:39.312 -0500>,<Administrator>,<TOPSPIN>,<proc1d>,<TOPSPIN 2.1>,
      <Start of raw data processing
       efp LB = 0 FT_mod = 6 PKNL = 1 PHC0 = 0 PHC1 = 0 SI = 32K 
       data hash MD5: 32K
       95 8C A4 CB F3 53 C9 29 22 81 42 D3 DF 74 23 B6>)
(   3,<2012-04-04 15:06:39.828 -0500>,<Administrator>,<TOPSPIN>,<proc1d>,<TOPSPIN 2.1>,
      <pk PHC0 = 214.8871 PHC1 = 0 
       data hash MD5: 32K
       8F 3E 44 44 E4 7B A4 EF 1B 94 68 CF DE 05 16 D5>)
(   4,<2012-04-04 15:06:39.906 -0500>,<Administrator>,<TOPSPIN>,<proc1d>,<TOPSPIN 2.1>,
      <abs ABSG = 1 
       data hash MD5: 32K
       F2 A9 1E 19 86 69 89 D4 B4 A4 63 85 88 CF CC E1>)
(   5,<2012-04-04 15:06:39.921 -0500>,<Administrator>,<TOPSPIN>,<proc1d>,<TOPSPIN 2.1>,
      <abs ABSG = 2 
       data hash MD5: 32K
       8D 7E 6A 9A 3C AD EC 64 01 6E 89 D5 63 F6 58 F9>)
(   6,<2012-04-04 15:06:39.953 -0500>,<Administrator>,<TOPSPIN>,<proc1d>,<TOPSPIN 2.1>,
      <abs ABSG = 3 
       data hash MD5: 32K
       2F 01 E6 13 2A CE 89 90 80 5F 90 64 F4 4D 14 A6>)
(   7,<2012-04-04 15:06:39.984 -0500>,<Administrator>,<TOPSPIN>,<proc1d>,<TOPSPIN 2.1>,
      <abs ABSG = 4 
       data hash MD5: 32K
       EB 39 39 E1 9C 20 EC 47 F6 B3 E1 43 08 F1 3B 09>)
(   8,<2012-04-04 15:06:40.015 -0500>,<Administrator>,<TOPSPIN>,<proc1d>,<TOPSPIN 2.1>,
      <abs ABSG = 5 
       data hash MD5: 32K
       6C D5 B9 A6 A1 A0 F9 56 63 BF 05 31 F5 88 D8 89>)
(   9,<2012-04-04 15:06:44.875 -0500>,<Administrator>,<TOPSPIN>,<audit>,<TOPSPIN 2.1>,
      <user comment:
       ICON-NMR User ID: COFFEE
       data hash MD5: 32K
       6C D5 B9 A6 A1 A0 F9 56 63 BF 05 31 F5 88 D8 89>)
$$ ##END=
$$ 
$$ [...]
150 150 150 150 150 150 150 150
##$TP07= 0
##$TPNAME0= <>
##$TPNAME1= <>
##$TPNAME2= <>
##$TPNAME3= <>
##$TPNAME4= <>
##$TPNAME5= <>
##$TPNAME6= <>
##$TPNAME7= <>
##$TPOAL= (0..7)
0.5 0.5 0.5 0.5 0.5 0.5 0.5 0.5
##$TPOFFS= (0..7)
0 0 0 0 0 0 0 0
##$TUNHIN= 0
##$TUNHOUT= 0
##$TUNXOUT= 0
##$USERA1= <user>
##$USERA2= <user>
##$USERA3= <user>
##$USERA4= <user>
##$USERA5= <user>
##$V9= 5
##$VALIST= <valist>
##$VCLIST= <CCCCCCCCCCCCCCC>
##$VD= 0
##$VDLIST= <DDDDDDDDDDDDDDD>
##$VPLIST= <PPPPPPPPPPPPPPP>
##$VTLIST= <TTTTTTTTTTTTTTT>
##$WBST= 2048
##$WBSW= 25
##$XGAIN= (0..3)
0 0 0 0
##$XL= 0
##$YL= 0
##$YMAX_a= 534828
##$YMIN_a= -645991
##$ZGOPTNS= <>
##$ZL1= 120
##$ZL2= 120
##$ZL3= 120
##$ZL4= 120
##$ABSF1= 14.98061
##$ABSF2= -5.57192
##$ABSG= 5
##$ABSL= 3
##$ALPHA= 0
##$AQORDER= 0
##$ASSFAC= 0
##$ASSFACI= 0
##$ASSFACX= 0
##$ASSWID= 0
##$AUNMP= <proc_prof1d_extract_pilot.lims>
##$AXLEFT= 0
##$AXNAME= <>
##$AXNUC= <1H>
##$AXRIGHT= 0
##$AXTYPE= 0
##$AXUNIT= <>
##$AZFE= 0.1
##$AZFW= 0.1
##$BCFW= 0
##$BC_mod= 0
##$BYTORDP= 0
##$COROFFS= 0
##$CY= 15
##$DATMOD= 1
##$DC= 0
##$DFILT= <>
##$DTYPP= 0
##$F1P= 0
##$F2P= 0
##$FCOR= 0.5
##$FTSIZE= 32768
##$FT_mod= 6
##$GAMMA= 0
##$GB= 0
##$INTBC= 1
##$INTSCL= 1
##$ISEN= 128
##$LB= 0
##$LEV0= 0
##$LPBIN= 0
##$MAXI= 10000
##$MC2= 0
##$MEAN= 0
##$ME_mod= 0
##$MI= 0
##$NCOEF= 0
##$NC_proc= -8
##$NLEV= 6
##$NOISF1= 0
##$NOISF2= 0
##$NSP= 0
##$NTH_PI= 0
##$NZP= 0
##$OFFSET= 14.98061
##$PC= 1
##$PHC0= 214.8871
##$PHC1= 0
##$PH_mod= 1
##$PKNL= yes
##$PPARMOD= 0
##$PPDIAG= 0
##$PPIPTYP= 0
##$PPMPNUM= 2147483647
##$PPRESOL= 1
##$PSCAL= 4
##$PSIGN= 0
##$PYNMP= <proc.py>
##$REVERSE= no
##$SF= 400.13
##$SI= 32768
##$SIGF1= 0
##$SIGF2= 0
##$SINO= 400
##$SIOLD= 32768
##$SPECTYP= <>
##$SREGLST= <1H.CDCl3>
##$SSB= 0
##$STSI= 32768
##$STSR= 0
##$SW_p= 8223.68421052632
##$SYMM= 0
##$S_DEV= 0
##$TDeff= 65536
##$TDoff= 0
##$TI= <>
##$TILT= no
##$TM1= 0
##$TM2= 0
##$TOPLEV= 0
##$USERP1= <user>
##$USERP2= <user>
##$USERP3= <user>
##$USERP4= <user>
##$USERP5= <user>
##$WDW= 1
##$XDIM= 32768
##$YMAX_p= 471977628
##$YMIN_p= -696210
##$CURPLOT= <Network HP LaserJet P1505>
##$CURPRIN= <$Network HP LaserJet P1505>
##$DFORMAT= <normdp>
##$LAYOUT= <+/1D_H.xwp>
##$LFORMAT= <normlp>
##$PFORMAT= <normpl>
##$SURQMSG= 1
$$ End of Bruker specific parameters
$$ ---------------------------------
##NTUPLES= NMR SPECTRUM
##VAR_NAME=  FREQUENCY,     SPECTRUM/REAL,   SPECTRUM/IMAG
##SYMBOL=    X,             R,               I
##VAR_TYPE=  INDEPENDENT,   DEPENDENT,       DEPENDENT
##VAR_FORM=  AFFN,          ASDF,            ASDF
##VAR_DIM=   32768,         32768,           32768
##UNITS=     HZ,            ARBITRARY UNITS, ARBITRARY UNITS
##FACTOR=    0.250966925370066, 1,           1
##FIRST=     8223.43324360095, -65407,       -274615
##LAST=      0,             -112409,         -53511
##MIN=       0,             -696210,         0
##MAX=       8223.43324360095, 471977628,    0
$$ Real data points
##PAGE= N=1
##DATA TABLE= (X++(R..R)), XYDATA
$$ [...]
19456e30149B2009K6569g6876D3878g0825L1694F9570c72151i5749o2754j15852
19445b74355i8484b2661A05714a26297a1858o1280j58432a06126l67090C15530
19434f8303j2892A06906R9202a76689A25100a59872B16003J36433b82l53419a71850
19422A23215a26621N1661J3759j13673b5000d129A02485L2746a31675A0599a72489
19410a53797M3413m58055b61085o6943a46064b4261k42501e2925l61164N698B64933
19398C0491a70392A57494M6884K3836a85051n6719A33673b87583A31933a5919
19387f2087A06477d52906N2011b8969k31177B6611g4192j10557d9716A93534q1302
19376A12232J57054a30579d0328p5660I1735J0441M4112b88367R7394c7306A7901
$$ plain form
19456 -530149 22009 48578 -76876 43878 -70825 -39131 69570 -372151 -95749 -158503 -274355
19445 -274355 -98484 -22661 105714 -126297 -11858 -73138 -231570 -106126 -473216 315530
19434 -68303 -81195 106906 206108 -176689 125100 -159872 216003 352436 -282 -353701 -171850
19422 123215 -126621 -74960 -61201 -174874 -25000 -4129 102485 135231 -131675 10599 -172489
19410 -153797 -110384 -568439 -261085 -328028 -146064 -24261 -266762 -52925 -414089 -408391 264933
19398 30491 -170392 157494 204378 228214 -185051 -241770 133673 -287583 131933 -15919
19387 -62087 106477 -452906 -400895 -28969 -260146 26611 -74192 -184749 -49716 193534 112232
19376 112232 269286 -130579 -40328 -115988 91735 102176 146288 -288367 -190973 -37306 17901
19364c6760G5838d4453p3702k13024D4577R0186a05465j79388C09883a12591B1447
19352a90713A53817g2937B8758J51200a03746n4497k52635A47798f5451E3526
19341B9868d2247o2073a8986A61901e4114n370A56207b69086c7758k19930E4287
19329g2952j2565k0440L2135B52200q2962B3820b3371j3328H151e8478m8311G3611
19316A37214f9971C1096f9448k62657P2480r2720A37881c2159k3544p382H6930
19304G204a36239A98843c24756g8623G8104b26133b066j64305j43301A50429a66913
19292A33955o3871a96446n0606G2541J51752a92150e5361E1926b39103I2211c27723
19280a52292q2995I9942f0486L772j82409A18598d9365P180C6895f6601q5837
$$ plain form
19364 -36760 75838 -44453 -118155 -331179 44577 134763 -105465 -284853 309883 -112591 21447
19352 -190713 153817 -72937 28758 179958 -103746 -158243 -410878 147798 -65451 53526
19341 29868 -42247 -104320 -18986 161901 -54114 -59484 156207 -269086 -37758 -257688 54287
19329 -72952 -85517 -105957 -73822 252200 169238 23820 -23371 -36699 8151 -58478 -106789 73611
19316 137214 -69971 31096 -69448 -332105 -259625 -352345 137881 -32159 -55703 -63085 86930
19304 7204 -136239 198843 -324756 -78623 78104 -226133 -2066 -166371 -309672 150429 -166913
19292 133955 70084 -196446 -247052 72541 224293 -192150 -55361 51926 -239103 92211 -327723
19280 -152292 -235287 99942 -60486 -56714 -239123 118598 -49365 -42185 36895 -66601 -152438
19269a52438a1857H5597B7852h3848a1711F5552c03804a24100A52355e3H375c19125
19256A210J21977a2773A64466b1H5015b8468A33917E5893b31453a04054k15911
19245c19965d1677j32116m28950a95908I0746c24535a42774n8728b1744l31115
19235c52859b4553k41069o5270a22690k4994l0370n6087C225h8784A04981m5743
19224E9238c9899j99640B02937D5302K32704i8376j27982A54158E0538b73195
19213a00945k08950b7754l2881p3314l39403F4341J89858r4759h0767Q095o168
19202g8840l8589j77716A83934G1858a15008E0207g7692j63231A1845J3124b55383
19190a25722k42776e4437J1140j23279A27080a6442B400b91442J40137p6589J09101
$$ plain form
19269 -152438 -11857 85597 27852 -83848 -11711 65552 -303804 -124100 152355 -53 8375 -319125
19256 1210 123187 -12773 164466 -21 85015 -28468 133917 55893 -231453 -104054 -319965
19245 -319965 -41677 -173793 -602743 -195908 90746 -324535 -142774 -201502 -21744 -352859
19235 -352859 -24553 -265622 -330892 -122690 -147684 -178054 -234141 3225 -88784 104981 59238
19224 59238 -39899 -239539 202937 45302 278006 -98376 -226358 154158 50538 -273195
19213 -100945 -309895 -27754 -60635 -133949 -473352 64341 254199 159440 -80767 -72672 -78840
19202 -78840 -117429 -295145 183934 71858 -115008 50207 -77692 -240923 11845 24969 -255383
19190 -125722 -368498 -54437 -43297 -166576 127080 -16442 2400 -291442 -151305 -227894 -118793
19179a18793B08977b26317k228i2730k78767N949h3799A69059a78534d7290j70024
19168b17314A09661R1267b23926E3628B6553b10257g125G8305l158a54096A05353
19156b65112a2146j58041O0401B66171c15766a16103A77091b58463Q7427j44378
19146c15414N7508A977b22339P0402B34767b35576a5451A13511a27027J9674j29182
19135b36535A93224E7902M118J1951B7430h2446l1067j66210B7499a25785e7925
19123B04082l4973I505a50083k43852A89249d7307H6642h3857A20701A1848f9336
19111i6961C2772b15247d1266B6395O3319A3828L2474d7371A23409d3474j46685
19100a90159E2788k1073M0827a17179d3090j82374A25199a30162o2024c4136l490
$$ plain form
19179 -118793 208977 -226317 -228545 -92730 -371497 -365548 -83799 169059 -178534 -47290 -217314
19168 -217314 109661 200928 -223926 53628 26553 -210257 -7125 78305 75147 -154096 105353
19156 -265112 -12146 -170187 -109786 266171 -315766 -116103 177091 -258463 -171036 -315414
19146 -315414 -257906 1977 -222339 -151937 234767 -235576 -15451 113511 -127027 -107353 -236535
19135 -236535 193224 57902 62020 73971 27430 -82446 -113513 -279723 27499 -125785 -57925
19123 204082 169109 9505 -150083 -393935 189249 -47307 86642 -83857 120701 11848 -69336
19111 -96961 32772 -215247 -41266 26395 89714 13828 46302 -47371 123409 -43474 -190159
19100 -190159 52788 31715 72542 -117179 -43090 -225464 125199 -130162 -192186 -34136 -37626
19089c7626A80857b03802d2056j44403g5809n1147M4291o0354B2576i089j07659
19078a16748B66256D0251b4146A00054D83a8818C97006b86590N8730g7114B08498
19066E2347J64099G6791b4814n1171F1585a66364g6044j64769i7225o634D2925
19054a74138C0029a86992P0581k00258F7895e3108k0649j64821a13270p7041M0579
19043a49732H8739b77836A29991m9409b73133A79529a50906F1760B9639J44066
19033A73705o5584E3063J1927b99324K0242e1156q9974a8242N159q5088K0240
19022g7931l41355J39558h2015k58256a1457j63880O0928A86305a63505H0040
19011b90110i9530I864a22621A06179i001m1770C05563A41514F0469R9802E8652
$$ plain form
19089 -37626 180857 -203802 -42056 -186459 -75809 -126956 -82665 -143019 22576 -9089 -116748
19078 -116748 266256 40251 -24146 100054 483 -18818 397006 -286590 -227860 -77114 208498
19066 52347 216446 76791 -24814 -75985 61585 -166364 -76044 -240813 -97225 -103859 42925
19054 -174138 30029 -186992 -116411 -316669 67895 -53108 -73757 -238578 -113270 -190311 -149732
19043 -149732 88739 -277836 129991 80582 -273133 179529 -150906 61760 29639 173705
19033 173705 108121 53063 64990 -299324 -279082 -51156 -141130 -18242 -13083 -98171 -77931
19022 -77931 -419286 -279728 -82015 -340271 -11457 -175337 -114409 186305 -163505 80040
19011 -290110 -99530 9864 -122621 106179 -9001 -50771 305563 141514 60469 160271 58652
18999D6804P7289n946J4160o4544L80966k05923K597b47490a4276l07403D1860
18987B60964e5176B55682c05661C5082J22985L4263J06039j18272h0614j78235
18977b58849D753J41383b22834h4656j27425H160O3995k1650d9192D37303a09497
18965H1633c1571j51540g1769k7573a2951B87582p4032J13583O4745J45204h6038
18953h1614H6184c54998B3319a437q0111A6831e5211j66898B63783d4558j6664
18942f1222C14754j17263b68543f2176k15220B34656o3338a71152B41901c32168
18931b6415C5290J31508c7123A1807a3778k39873q3620d7251j60938g6949q5945
18920a62894p9653I971i6684l8864A13695B1092J53556i6187a2448C0880P7634
$$ plain form
18999 46804 124093 118147 132307 67763 448729 242806 245403 -247490 -14276 -321679 41860
18987 260964 -55176 255682 -305661 35082 158067 192330 298369 180097 -80614 -258849
18977 -258849 4753 146136 -222834 -84656 -212081 8160 72155 50505 -49192 437303 -109497
18965 81633 -31571 -183111 -71769 -99342 -12951 287582 213550 327133 391878 537082 -86038
18953 -81614 86184 -354998 23319 -1437 -81548 16831 -55211 -222109 263783 -44558 -61222
18942 -61222 314754 197491 -268543 -62176 -277396 234656 171318 -171152 241901 -332168
18931 -26415 35290 166798 -37123 11807 -13778 -253651 -337271 -47251 -208189 -76949 -162894
18920 -162894 -242547 9971 -96684 -135548 113695 21092 174648 -96187 -12448 30880 108514
18909A08514a39523j1918C8803i6740n7471k54483a86979M9496a4725B6465M5493
18898G1958J3499a94678D0387L72413J66430Q437k93771G2501J10130J1357a30849
18886B72966A08315A8773a35114j18517p966O5305D6641j7330K07064A02756O2271
18875A65027a99062C81781b08305A18796b2117n2499j36023D5439f1186A18327
18864a07422A17897J86695f7833H077c2102k73192A09133b44398D26620b62131
18853d15963B95287j03909G7557J29498A8716b05074D421J89861F68a79412k39942
18842d19354a24693l5653N8284A8892a36278A6555K97991G1888e6063r180B7770
18830b05084F7326g1533j98915D4229J10720c51588O2802a21411L1382I990a13566
$$ plain form
18909 108514 -139523 -151441 38803 -96740 -154211 -408694 -186979 -137483 -14725 26465 71958
18898 71958 85457 -194678 40387 412800 579230 587667 293896 72501 182631 193988 -130849
18886 272966 108315 18773 -135114 -253631 -261597 -196292 46641 29311 236375 102756 165027
18875 165027 -199062 381781 -208305 118796 -22117 -74616 -210639 45439 -61186 118327
18864 -107422 117897 304592 -67833 8077 -32102 -305294 109133 -244398 426620 -262131
18853 -415963 295287 191378 77557 207055 18716 -205074 4421 194282 668 -179412 -419354
18842 -419354 -124693 -160346 -102062 18892 -136278 16555 314546 71888 -56063 -65243 27770
18830 -205084 67326 -71533 -270448 44229 154949 -351588 -288786 -121411 -90029 9990 -113566
18818A95592b69304a00437j43877B53037b56041J26254k0337d1235k8025A83015
18807A22473D271f4532r3745A54081E0416L7957P1556Q9092a41915E6132J2427
18796F8559g9942A81490a22358B24498j2488D3751c2465f483l8465A99930b19029
18784a97055A14108h174B5932a11539q5620O7435r6417B241j033Q3815c4967k91237
18772c26204A16030C6680e936n9527k7606c0008E0291c28697D5390a51821k39966
18761c91787a55557k043k59941e2237C39957a46077j5066d0371C6520K04765b50996
18749c48354B03401a90740a1604k59187G6912J28466b96068J06046N0565c6637
18738C4081F360a54581C7851d6542A15798a21956F8525m07i9853A97461b0468
$$ plain form
18818 195592 -269304 -100437 -244314 253037 -256041 -129787 -150124 -41235 -69260 183015
18807 122473 4271 -64532 -158277 154081 50416 88373 159929 249021 -141915 56132 68559
18796 68559 -79942 181490 -122358 224498 212010 43751 -32465 -6483 -44948 199930 -219029
18784 -197055 114108 -8174 25932 -111539 -197159 -129724 -226141 2241 1208 85023 -34967 -326204
18772 -326204 116030 36680 -5936 -65463 -93069 -30008 50291 -328697 45390 -151821 -391787
18761 -391787 -155557 -157600 -417541 -52237 339957 -146077 -161143 -40371 36520 241285 -250996
18749 -348354 203401 -190740 -11604 -270791 76912 205378 -296068 -190022 -139457 -36637
18738 34081 6360 -154581 37851 -46542 115798 -121956 68525 68118 -99853 197461 -20468
18726a67281h2571E5780b5636A27061d7983k02206J0933o2211J12770a6968n0611
18715f7579F9614l3961b49128b690C29041I076a86270J8601B46740d2213k51623
18704b93836r3139P3030d1485k80138k4202h6409j08345h4126B08637p9762a11278
18692a82506B6455a67128m9380A58263a41767L8986l0730J1l565C9082a42240
18680a9900C4082O7211C6834a5287n4315n6184e4769q009j80688f6116A96749
18668c9686l11119j0869J53118c677E2946e0048A95511o5232C1256E404c79343
18656E8264A0891a48246B9178a65354j07062C76303m9620d5129a3399D8546G890
18644h6062j19527B780a35266A57900a97368Q6193k059j19616H6058b84424A18140
$$ plain form
18726 -167281 -82571 55780 -25636 127061 -47983 -250189 -239256 -301467 -188697 -16968 -67579
18715 -67579 69614 35653 -249128 -2690 329041 9076 -186270 -167669 246740 -42213 -293836
18704 -293836 -386975 -313945 -41485 -321623 -345825 -86409 -194754 -84126 208637 128875 -111278
18692 -182506 26455 -167128 -216508 158263 -141767 -102781 -133511 -133500 -137065 39082 -142240
18680 -19900 34082 101293 36834 -15287 -69602 -125786 -54769 -62778 -243466 -66116 196749
18668 -39686 -350805 -361674 -208556 -3677 52946 -50048 195511 130279 31256 5404 -379343
18656 58264 10891 -148246 29178 -165354 -272416 376303 326683 -45129 -13399 48546 7890
18644 -86062 -205589 2780 -135266 157900 -197368 -111175 -113234 -232850 86058 -284424 118140
18632A36077h8550L3412j32175p3459f2799l2093e406j88541F6945d73977a78526
18620A18692b50182i2334a0221k92752a4706B0762F189b3596H1291B9813a03687
18608A10213C818a85838h5529r8604h447k04101F4949c46095J08735A70061F7691
18596b55645B54015C7915P9879d30559J80886p353J14683A2122Q5120b22628n9980
18585b82608D7918i8121l6127E5738a12182A08070P0303m3048o1360a98551h5931
18573F874a43476A46644b85507i4895K6487j57352f6441K0180A01453d18318e3180
18561e4887A74334b50059i8342C12211a29882F224L3278b15090M3210N5147p827
18550a24560B4850b26065e362q3755L7884O985C0962O7069m2368J21515o4834
$$ plain form
18632 136077 -88550 -55138 -187313 -260772 -62799 -94892 -5406 -193947 66945 -473977 -178526
18620 118692 -250182 -92334 -10221 -302973 -14706 20762 6189 -23596 81291 29813 -103687
18608 110213 3818 -185838 -85529 -184133 -8447 -212548 64949 -346095 -237360 170061 67691
18596 -255645 254015 37915 117794 -430559 -249673 -257026 -142343 12122 97242 -222628 -282608
18585 -282608 47918 -98121 -134248 55738 -112182 108070 178373 135325 73965 -198551 -85931
18573 6874 -143476 146644 -285507 -94895 -68408 -225760 -66441 -46261 101453 -418318 -53180
18561 -54887 174334 -250059 -98342 312211 -129882 6224 39502 -215090 -171880 -116733 -124560
18550 -124560 24850 -226065 -5362 -89117 -51233 -44248 30962 98031 55663 177178 112344
18539A12344b08970a8675n5433K7743j26264J1682e1388L042h038j1995B15840
18527A18645h1250A49379a24759E61d81l03678C9594f7621B74238b02835R4319
18516a08516r9547E5838a1983j1914l44686L0253A75082j3749c79026A59069C8268
18504b29209P7235j66189k52763h8600j91200C28424p7222b96308F1903h5340
18493c3787n63n1896A10028b26039d1824A12693C0024c16342a38322o1281g3996
18481b54186G3502L59490b26068d9456E1732b41495i728k2336k63680j38518Q3832
18470c50430J02057J16034k28828B05469c4815B9825J10349b28842J14315j88207
18460c02734A70898F8851b07250q8972J05564H1956l5093J17952e0296I0990B4479
$$ plain form
18539 112344 -208970 -18675 -74108 -46365 -172629 -160947 -51388 -48346 -8038 -20033 215840
18527 118645 -81250 149379 -124759 561 -481 -304159 39594 -67621 274238 -202835 -108516
18516 -108516 -208063 55838 -11983 -23897 -368583 -338330 175082 161333 -379026 159069 38268
18504 -229209 -151974 -318163 -570926 -88600 -279800 328424 251202 -296308 61903 -85340
18493 -33787 -34350 -86246 110028 -226039 -41824 112693 30024 -316342 -138322 -199603 -73996
18481 -254186 73502 432992 -226068 -49456 51732 -241495 -9728 -32064 -295744 -434262 -350430
18470 -350430 -248373 -132339 -361167 205469 -34815 29825 140174 -228842 -114527 -302734
18460 -302734 170898 68851 -207250 -296222 -190658 81956 46863 164815 -50296 90990 24479
18448D60157l1546E9753b93197I8874e8620b452I8603J158a19708I7766c9908
18436b98866a33245k59233a5690l70565B12944D2139K33317b10460o4726a15704
18425e4052I0628k1565a0355A17050c02875A7532N3693P8562F503i693n01909
18414e11602A28678a17897B3636h7905k171L7547a5715H0195a03723k22087D8603
18402G8588J30827G4464N9023c30400A35791P7561F8778j7908d5903M039A89265
18390G3224B6133P316J33336a00868l6950M4881D0346a31853B55137a59075p7590
18379b36665e7065m9469E8242i495l52976a36676C4300N8110c07209B9797M0665
18368G0462b7097j71930A60259h3681A8988a27791p8833K2650I522K50977a53604
$$ plain form
18448 460157 428611 59753 -293197 98874 -58620 -2452 98603 99761 -119708 97766 -39908
18436 -298866 -133245 -392478 -15690 -386255 212944 42139 275456 -210460 -275186 -115704
18425 -54052 90628 69063 -10355 117050 -302875 17532 71225 149787 6503 -9693 -511602
18414 -511602 128678 -117897 23636 -87905 -90076 -52529 -15715 80195 -103723 -325810 48603
18402 78588 209415 74464 133487 -330400 135791 213352 68778 50870 -45903 -41864 189265
18390 73224 26133 33449 166785 -100868 -137818 -92937 40346 -131853 255137 -159075 -236665
18379 -236665 -57065 -106534 58242 -9495 -362471 -136676 34300 92410 -307209 29797 70462
18368 70462 -27097 -199027 160259 -83681 18988 -127791 -206624 -183974 9522 260499 -153604
18356b64841a30754F2299J59225c7112A34581a4078k71712f5191H3970c8714j14680
18345a53394b1287E847e072I55a19069o1962k06243B12375b1593j52290A56077
18333a39707B2088a1951B4442c60627a19831b9929A39386J56265h4811o4773e4854
18321a64822N3278A49672n3358a88836R3586C8336h5301A9394a69847o4061D5934
18309d7066k7839b3451j69750A64931P1392h4399p4183e6345p2607j98496A08593
18297f6424j12104f919k93138F9592C4165J70403c4448F0241d27963A71796E4255
18285h7882F0057a29486c7278k13705O7745A90853h6473J2279A99310I0752b73282
18273G9718i1894H1492d9917C9144c3096q0431B1601N1171c1813A2285b72932
$$ plain form
18356 -264841 -130754 62299 221524 -37112 134581 -14078 -285790 -65191 83970 -38714 -153394
18345 -153394 -21287 5847 -5072 955 -119069 -181031 -387274 212375 -21593 -173883 156077
18333 -139707 22088 -11951 24442 -360627 -119831 -29929 139386 295651 -84811 -149584 -54854
18321 -164822 -111544 149672 96314 -188836 -95250 38336 -85301 19394 -169847 -233908 45934
18309 -47066 -74905 -23451 -193201 164931 236323 -84399 -158582 -56345 -128952 -327448 108593
18297 -66424 -178528 -6919 -300057 69592 34165 204568 -34448 60241 -427963 171796 54255
18285 -87882 60057 -129486 -37278 -250983 -183238 190853 -86473 -74194 199310 90752 -273282
18273 79718 -91894 81492 -49917 39144 -33096 -113527 21601 72772 -31813 12285 -272932
18261d7600A04284N0758m48a9286m07148A34247R9666e1592k8900A04036b60914
18249a63829C4337b97954C90023b77097A57521b63108F6826d3620A27465R1032
18239B18497c47544J03828r4375b2403a1124A69533p0748a60226L2556j66399
18229b94069J04817H2261d058r0543G2170b92744g4761j83067B2406e2356l1654
18218h4010B20410g3590A88982d4303j10191M1159A40016j5798f5353b1780A40092
18206A2627C310J05648a29264e7570A02327A0083i5763k17780A60042J9682J27111
18195C06835D1203a19570B30479f9607A40413e22701B72180a78838A12553h286
18184c4916B22330a03252I2973a03331c5776f117B38585b38268c1886B36369c0692
$$ plain form
18261 -47600 104284 155042 154594 -19286 -426434 134247 233913 -51592 -80492 104036 -260914
18249 -163829 34337 -297954 390023 -277097 157521 -263108 66826 -43620 127465 218497
18239 218497 -347544 -243716 -338091 -22403 -11124 169533 98785 -160226 -127670 -294069
18229 -294069 -189252 82261 -4058 -94601 72170 -292744 -74761 -257828 22406 -52356 -84010
18218 -84010 220410 -73590 188982 -44303 -154494 -113335 140016 124218 -65353 -21780 140092
18206 12627 3310 108958 -129264 -57570 102327 10083 -95763 -313543 160042 179724 306835
18195 306835 41203 -119570 230479 -69607 140413 -522701 272180 -178838 112553 -8286
18184 -34916 222330 -103252 92973 -103331 -35776 -6117 238585 -238268 -31886 236369 -30692
18172A26339E5064j1269a48554b7058j21530A20462J10372a34582j59742c5604
18161A60565m6269K5270a65143A22049E83f2557j15965C661M3617N8300i582k66075
18149b75657D1584b86900g9917L3990m102k88992E838d31643A39539E4994R2229
18138A47223k0650a16802k6999q3105o6654B01041b0179A88523h1897p6277n3695
18127b11869M3751e5263C1427J79193a91368B78077a64962A58650d49702b03233
18116D1214a58460I9011e5786m07212a76674L3130I8209b80587C5502a73247L7065
18105a36182l6795B89434a38403j319B37702q7276j2123C086Q8778B0919K68472
18094B89391E2606a35972L8463A35105L7846F697d5370I169J19684J7372a36739
$$ plain form
18172 126339 55064 43795 -148554 -27058 -148588 120462 230834 -134582 -294324 -35604
18161 160565 114296 139566 -165143 122049 583 -62557 -178522 3661 47278 105578 -9582 -275657
18149 -275657 41584 -286900 -79917 -45927 -50029 -339021 5838 -431643 139539 54994 147223
18138 147223 126573 -116802 -143801 -226906 -293560 201041 -20179 188523 -81897 -158174 -211869
18127 -211869 -168118 -55263 31427 210620 -191368 278077 -164962 158650 -449702 -203233
18116 41214 -158460 99011 -55786 -462998 -176674 -143544 98209 -280587 35502 -173247 -136182
18105 -136182 -172977 289434 -138403 -139722 237702 150426 138303 3086 91864 20919 289391
18094 289391 52606 -135972 -97509 135105 172951 6697 -45370 9169 128853 146225 -136739
18082a74725g4908b7214k6511E6721I346K51495J35913D2930K89600A5092J8120
18071C3212a90964L9621j51633a50151K5853B64501a46581c891j6603j90416o2753
18060b73663h5163C6015c24776F043b34218A63780a437F9987j7230H455g0260
18048b79878f6922A946L53807n0692c66816H814a20612j5519g33r8180B13845
18036b49977A01646b51630i4528B57117a6782j78608F4055a26340H9134b7199
18025I0851b21276j97047a98364P2101B65494c8659A90491G3383K9713K02400
18015C05496K72852F0763a84465J9412G8221a47699A42356d76984a06738n1920
18005a58658g0510I1126O1464D8462f4204j73974b0600C1698R1546b7175j44137
$$ plain form
18082 -174725 -74908 -27214 -53725 56721 9346 260841 396754 42930 332530 15092 33212
18071 33212 -190964 -151343 -302976 -150151 -124298 264501 -146581 -3891 -20494 -210910 -273663
18060 -273663 -85163 36015 -324776 6043 -234218 163780 -1437 69987 52757 8455 -70260
18048 -279878 -66922 1946 355753 305061 -366816 8814 -120612 -136131 -733 -98913 213845
18036 -249977 101646 -251630 -94528 257117 -16782 -195390 64055 -126340 89134 -27199
18025 90851 -221276 -418323 -198364 -126263 265494 -38659 190491 73383 103096 305496
18015 305496 578348 60763 -184465 -165053 78221 -147699 142356 -476984 -106738 -158658
18005 -158658 -70510 91126 152590 48462 -64204 -238178 -20600 31698 123244 -27175 -171312
17994a71312c9904n3173C43569o5745G9035J59161a08607F6026B8490j0829K03805
17983B21466a02043k5500a1455j11918A4323N348J5720k686Q0077h8552G4762
17971C9520J51373b15594N1898q121B50266A18667b04894F9725a53388F6524J25853
17960A92377a00588A88550F5539G819a59338J0652k5660E2572F058h0611b6011
17948B74920i386A16330c98091a91020B18578G3955K9895J07992A04333d29646
17937F9784k0562b5219A9897K74214r1860N6797C3869b01461A46127a06109E8782
17925a68171J3800k36913J06088d3654A5834g3960B5732K04656m4535K22524b67728
17913B3881Q0968O3350R3172C2072L21659A00828a93768i3484j84260i645j56454
$$ plain form
17994 -171312 -39904 -93077 343569 277824 79035 238196 -108607 66026 28490 17661 221466
17983 221466 -102043 -127543 -11455 -123373 14323 19671 35391 32705 112782 -88552 74762
17971 39520 190893 -215594 -163696 -171817 250266 118667 -204894 69725 -153388 66524 192377
17960 192377 -100588 188550 65539 7819 -159338 -148686 -174346 52572 6058 -80611 -26011
17948 274920 -9386 116330 -398091 -191020 218578 73955 103850 211842 104333 -429646
17937 69784 49222 -25219 19897 294111 202251 259048 33869 -201461 146127 -106109 58782
17925 -168171 -154371 -391284 -285196 -43654 15834 -73960 25732 230388 185853 408377 -267728
17913 23881 104849 168199 261371 32072 353731 100828 -193768 -93484 -277744 -9645 -166099
17902a66099B26090e861n5466B12491a54483r8136i7677j04456B22987B8353b5814
17890D39301b2350C3692M3921a95555O8404C6299b71870r859A89276J33190a28476
17878a46387L3695L3895m2225B4984M6869J15568Q6643d7431m70074d2380A57750
17866B53853d4800l7533K2107H9472J62038A20722a29543E6751b06029B44150
17855a46702A00242D1958g2708A71523h9948A76599B8567K08968A12419f1335
17844C31844c8071A10214M1809j8998N2644d72517A81315p7117a35569B22222
17833C40421H3132a96476F3340M3132c9261A98435D3942g2983j02845Q416A24302
17821C59500b1797A74162K8795a30300j00662R6265R209f1236A33387B3120K5966
$$ plain form
17902 -166099 226090 -5861 -61327 212491 -154483 -252619 -97677 -202133 222987 28353 -25814
17890 439301 -22350 33692 77613 -195555 -127151 36299 -271870 -281729 189276 322466 -128476
17878 -146387 -112692 -78797 -121022 24984 71853 187421 274064 -47431 -517505 -42380 157750
17866 253853 -44800 -82333 -60226 89472 251510 120722 -129543 56751 -206029 244150
17855 -146702 100242 41958 -72708 171523 -89948 176599 28567 237535 112419 -61335
17844 331844 -38071 110214 152023 133025 185669 -472517 181315 104198 -135569 222222
17833 340421 83132 -196476 63340 106472 -39261 198435 43942 -72983 -175828 -167412 124302
17821 359500 -21797 174162 202957 -130300 -230962 -134697 -125488 -61236 133387 23120 49086
17810D9086d48926a70215B0933O1883A8354b46256I9016O6440l6310M0641e7784
17798b1267H5292a0871A61141F349f3738C72138j77472m5992c5449D0904a39787
17786C54998C6903a1121B5009a56458I3082a0432D8640q490a91503c8371l6686
17775g5057B49796j01693d8660r7060A20324J00566m3030H7366a70679A27222
17764B89964O0808G3084J68086J08460q8417D734J2102L4513J95591P1109B403
17752a07504C86100A11116M8411K16603b77777F434N05489k03756D5986a96566
17741C8466J4056i5472A09212m1456a10385B03241H0854l7163L8084B497b1427
17729E224P2778K37492K0043a82411A69476a66645g2506A4437K22875e5252j90375
$$ plain form
17810 49086 -448926 -170215 20933 82816 18354 -246256 99016 165456 129146 169787 -57784
17798 -21267 85292 -10871 161141 6349 -63738 372138 194666 148674 -35449 40904 -139787
17786 354998 36903 -11121 25009 -156458 93082 -10432 48640 40150 -191503 -38371 -75057
17775 -75057 249796 148103 -48660 -145720 120324 220890 177860 87366 -170679 127222
17764 289964 350772 73084 241170 349630 261213 4734 16836 51349 246940 318049 2403
17752 -107504 386100 111116 159527 376130 -277777 6434 511923 308167 45986 -196566
17741 38466 52522 -95472 109212 67756 -110385 203241 80854 43691 81775 2497 -21427
17729 5224 78002 315494 335537 -182411 169476 -166645 -72506 14437 237312 -55252 -245627
17718b45627A39613M03849c35972C99249A48939D4981K69571N1686j27623B4731
17707f0441p675B1053I896P6091L42389A74982G1152b32969A24591a1718E3900
17695E0849O2627a23252q930b6053r3993E73650B8432K0090A7953R5527c1707
17683d9192B41717M8554Q6616G8154K64298D6623a13456H6483m0320K92788q9909
17672B49042e6647A51644e3390C29658r4829B0569a55029A90618i907q9347l4070
17661a33324A43674K11351A04274l1179i7292a8206A10360c3002A72640n3780
17651A18860a8978B2918J66627a5553k9110B8745e9008j39213a9681n4909a414
17639a3598j6671p2472C28627b8403n5556L5974B20432C6429f0751l9479B14794
$$ plain form
17718 -245627 139613 543462 -335972 399249 148939 44981 314552 366238 238615 24731
17707 -60441 -68116 21053 9896 85987 428376 174982 71152 -232969 124591 -11718 53900
17695 50849 113476 -123252 -132182 -26053 -120046 573650 28432 48522 17953 113480 -31707
17683 -49192 241717 290271 376887 78154 342452 46623 -113456 86483 46163 338951 249042
17672 249042 -56647 151644 -53390 329658 234829 20569 -155029 190618 -9907 -99254 -133324
17661 -133324 143674 355025 104274 73095 -97292 -18206 110360 -33002 172640 118860
17651 118860 -18978 22918 189545 -15553 -44663 28745 -59008 -198221 -19681 -74590 -1414
17639 -13598 -30269 -102741 328627 -28403 -83959 -47985 220432 36429 -60751 -100230 214794
17627A38076q624J42716F6626d8532B20275R2092j54306M127J90849A63592o1258
17616A02334b0791n3743j59635d5428A00371a00873D8519a64519A37897J66024
17606C03921J7577a42204O201B15994l8078i8587C15471A11655l4549H527L47428
17595C55955F1613L4496E501d3877J3132H0363h9114C7969N9128m860O4741E9735
17582C49435A19810A8038L00609a8346C04517M2072j48695A4655L8225O041K71775
17571C30696a49208B23022M50634B68581j08565G7455K74350E3809L33398A08764
17560B3878J93986b1228A47333e099A14203J53758c5384d745k2531A34860J18221
17549B53081J2047q3246K07494o8695A18823c0392G0172k1832K91837A08610D0902
$$ plain form
17627 138076 129452 272168 66626 -48532 220275 312367 158061 162188 353037 163592 102334
17616 102334 -20791 -74534 -234169 -45428 100371 -100873 48519 -164519 137897 303921
17606 303921 321498 -142204 -136003 215994 177916 -98587 315471 111655 77106 8527 355955
17595 355955 61613 96109 5501 -43877 -30745 80363 -89114 37969 97097 92237 156978 59735
17582 349435 119810 18038 318647 -18346 304517 346589 197894 14655 52880 58921 330696
17571 330696 -149208 223022 673656 268581 160016 77455 351805 53809 387207 108764
17560 23878 217864 -21228 147333 -5099 114203 267961 -35384 -4745 -27276 134860 253081
17549 253081 265128 181882 389376 320681 118823 -30392 70172 48340 340177 108610 40902
17537D20702A35851a1321A01213J63002j17996L31629p2765A52536A9560K04633
17527B24193L08316A15858K08472n0251K29503j10310o4030G391M00686l6842
17517C71235A23161K58158R4869K00399B51279N53437Q8911J53404l23573R0196
17507H13654J25945j99274j09312M1522l6434C06943Q4708J26980k9269K9153
17497E18515o9473K85611J19098P0422K2352j70174J92859D00215m5626A70694
17486C76165o9887L0604p5161J45607j65970a01256B19097L79465B49976H4641
17475C58913K43781B24370J206l0198R0673K5119P631k477j27391k654J66733
17464C53012A18973J46579B6605J62960K43554A97073J41960J9373j70151L01848
$$ plain form
17537 420702 135851 -11321 101213 264215 146219 477848 405083 152536 19560 224193
17527 224193 532509 115858 324330 274079 503582 393272 329242 7391 408077 371235
17517 371235 123161 381319 476188 676587 251279 804716 893627 1047031 723458 813654
17507 813654 939599 740325 631013 672535 636101 306943 391651 518631 489362 518515
17497 518515 449042 734653 853751 924173 946525 776351 969210 400215 354589 170694
17486 376165 306278 336882 261721 407328 241358 -101256 219097 598562 249976 84641
17475 358913 602694 224370 225576 195378 286051 311170 318801 316324 188933 186279 353012
17464 353012 118973 265552 26605 189565 433119 197073 339033 358406 188255 490103
17454D90103B14016Q0123A07629N50857A56809K18839q6107J5889K08662j88681
17444C25411p5812B7384J31001K67974l3693J79521A20825J34146J53760j70630
17434B38101K34537L20688a5223C74499P0484J01387B51828J62234K14424k22491
17424D05995J9987A68678J81850q3588L57747l8845A42250K95445j92317q8897
17414A56481M07577n3785j37667P1273j97812K73944j07709l2681p8054J2829
17404C14396J44272K9947o0016j61585N85581A82614J40988K84367o2866B51956
17393F03511f6810D06412j28547j3205A29326P2626J58876j52598J9392a7492
17382A87215K55345K9608j35002A52665G895M84506J98450l6104k57080J11660
$$ plain form
17454 490103 214016 294139 107629 658486 156809 375648 289541 305430 514092 325411
17444 325411 249599 27384 158385 426359 392666 572187 120825 254971 408731 238101
17434 238101 472638 793326 -15223 374499 444983 546370 251828 414062 628486 405995
17424 405995 425982 168678 350528 266940 624687 585842 142250 437695 245378 156481
17414 156481 564058 510273 372606 443879 246067 520011 412302 379621 301567 314396
17404 314396 458668 488615 428599 267014 852595 182614 323602 607969 545103 251956
17393 603511 -66810 406412 277865 264660 129326 201952 360828 208230 227622 -17492
17382 187215 442560 472168 337166 152665 7895 492401 690851 654747 397667 509327
17372E09327k05647K6138A32187O5734J83723J28320J02635j88986d8931l4960
17362h3891d1809D32071A90692p8929M76469A42171b2646D68384j46954j40103
17352A81327L9789r4150N8478B3795f1913B58243J70982l2520C1599M51318J6754
17341D99671D9680L82212j62363M9477N671H4549M361k8446J66913a60374B25041
17329C01395J38805A0393L37102k7625j8250N0702R6459A76377K90148k31776
17319B34749j2535M19269j03450k17864M2674K8670D8504L99289A38950B9668
17308D7901j6243K75457a11659D39758A39146L4690J93066R2314A77179J67041
17298C44220P3475K62713A71306J85667q1956N07291j71253B31203L57377n7781
$$ plain form
17372 509327 303680 329818 132187 197921 381644 509964 612599 423613 -48931 -83891
17362 -83891 -41809 432071 190692 111763 588232 142171 -22646 468384 321430 181327
17352 181327 221116 126966 185444 23795 -61913 258243 429225 396705 31599 482917 499671
17341 499671 49680 431892 269529 319006 324677 84549 88910 60464 227377 -160374 225041
17329 301395 440200 10393 347495 319870 301620 352322 448781 176377 466525 234749
17319 234749 222214 641483 538033 320169 362843 391513 48504 447793 138950 29668
17308 47901 31658 307115 -111659 439758 139146 173836 366902 459216 177179 344220
17298 344220 417695 680408 171306 356973 275017 782308 611055 231203 588580 530799
17288E30799j51879j33218J89560q1472l3963A37141O31719a6900B42697Q7375
17278C30072e220E23222A36250P9154J79188C9777K97318C9447M44677k15156
17268B68968A11169J41556K32928A73693O1879O2809L24099o0692B06788J05966
17258C12754J21834A13972J91315P5313K13401o7454o6641O3509J30793A89817
17247B15352J8303J62633j13066L9236L7341B4299L02898q6165M1830k8235b8202
17235B98341j07540J55522J2596K16160j44622o3421j12296L05697j92013L21410
17225F89834k57890j01087p9741Q0464J38939J87833k6261A57987J50184Q8280
17215C96451A63239J69213j05753K86696j89270K508K51831A80703L72917q7514
$$ plain form
17288 530799 378920 245702 435262 353790 319827 137141 768860 -16900 242697 330072
17278 330072 -5220 523222 136250 215404 394592 39777 337095 39447 484124 268968
17268 268968 111169 252725 485653 173693 235572 298381 622480 561788 206788 312754
17258 312754 434588 113972 305287 380600 594001 526547 459906 523415 654208 189817
17247 215352 233655 396288 283222 322458 359799 24299 327197 241032 282862 254627 -28202
17235 298341 190801 346323 358919 575079 430457 367036 254740 560437 368424 689834
17225 689834 431944 330857 251116 331580 470519 658352 632091 157987 308171 396451
17215 396451 163239 332452 226699 513395 324125 326633 578464 180703 553620 466106
17205D66106A77917K3062J58543L42390k40549A84986J09585M87469l33319K08325
17195F57046j49378K7208J27369k46041J22877l8957G6685L74247I8923j2289
17185H6634M74058J30450C09653J71876K22979j06552L08269k19337n2597r5487
17175E38804j92896A60758N11375L8976k83342L07384C51717l7872J29124r0689
17165C52280J36240j43688J0375O0028j44412l7427L90170j65590L1111k1198
17155D67889J31697R5747j12015q618p1756m2772O6099J36741k15640J70575J7965
17144F35912k97385J72523M2025j04948J24029N6288l07815j04967L23425O0948
17134F00035B70371K42468L8258Q8690l1372l6363O690Q7458j96888J24577j73058
$$ plain form
17205 466106 177917 200979 359522 701912 461363 184986 294571 782040 448721 657046
17195 657046 507668 534876 662245 416204 539081 500124 76685 450932 98923 86634
17185 86634 560692 691142 309653 481529 704508 597956 906225 686888 634291 538804
17175 538804 345908 160758 672133 711109 427767 735151 351717 313845 442969 352280
17165 352280 488520 344832 355207 415235 270823 233396 623566 457976 489087 467889
17155 467889 599586 695333 583318 574700 502944 460172 526271 663012 447372 617947 635912
17144 635912 338527 511050 553075 448127 572156 628444 320629 215662 539087 600035
17134 600035 270371 512839 551097 639787 608415 572052 578742 666200 469312 593889 420831
17123D20831J87742J86275k22423j22547K81618j58646N8913l11566J47724j35916
17113C32005N17006D22917K49322j31030M15K14920j84016K5668k4668B52079
17102F16485k25854L67018q6808p8486L45722m39340j87180K71207L18437l07857
17092E93344j90588O06190m29193k73188K01018M98247k30588l2209j53484L01808
17082H91357j46359J27332j77038J70213l8167M8499D10047M13671C71489L92293
17072G63782R5048r3665p5125k20680K00766J60966J68754M5427D82642L08029
17062G90671N8389K23165j28498Q7387k86437j10924K63315J15434l50431L45642
17052A007713j52533k56321J89738J29526k71444L33227r3365J40435n5762D70881
$$ plain form
17123 420831 608573 794848 572425 449878 731496 572850 631763 320197 467921 332005
17113 332005 849011 422917 672239 541209 541624 756544 572528 598196 573528 252079
17102 616485 390631 757649 670841 592355 938077 498737 311557 582764 901201 593344
17092 593344 402756 1008946 579753 306565 507583 1005830 775242 743033 589549 891357
17082 891357 744998 872330 695292 865505 827338 875837 410047 823718 371489 763782
17072 763782 858830 765165 690040 469360 670126 831092 999846 1045273 482642 790671
17062 790671 849060 1072225 943727 1031114 744677 633753 897068 1012502 662071 1007713
17052 1007713 855180 598859 788597 918123 646679 979906 886541 1026976 971214 470881
17041I99993n4155j83329K31396K06513n32247P869R5620K48234Q3890j85959
17031I17825K5350n5372L41543j87329k58313J77773j65322J57504r7909L25530
17021A181280J2769k54228L46960j96078J87176k36109k59012K40725L07215l02345
17011A028353J5657j17394R2859K33330J49229o0580l28265K51684j01508p2401
17001A090964K18509j51811J03876o9120P356J7875n31294P00292j91132o9243
16991A126272J67555m5598k48216L91115q501j75625j7132K19220l20654L62068
16981A450504k79348M05275l23510K83498l10557O13466m0770k99055j21290J99178
16971A577391k01191L3373p2580J38434J14109o0561j23209J53215J83277k41393
$$ plain form
17041 999993 945838 762509 993905 1200418 668171 676040 771660 1019894 1103784 917825
17031 917825 943175 887803 1229346 1042017 783704 961477 796155 953659 855750 1181280
17021 1181280 1194049 939821 1286781 1090703 1277879 1041770 782758 1023483 1330698 1028353
17011 1028353 1044010 926616 1019475 1252805 1402034 1341454 1013189 1264873 1163365 1090964
17001 1090964 1309473 1157662 1261538 1192418 1199774 1217649 686355 1386647 1195515 1126272
16991 1126272 1293827 1248229 1000013 1391128 1382627 1207002 1189870 1409090 1088436 1450504
16981 1450504 1171156 1576431 1252921 1536419 1225862 1839328 1798558 1499503 1378213 1577391
16971 1577391 1376200 1409573 1336993 1475427 1589536 1528975 1405766 1558981 1742258 1500865
16961A500865L587P7950j24597J52192q1747n2059J80393k20644J09316J67799
16951A713055q0163Q2026j49572L48055j8022k18595K83388j39651J89996k00429
16941A810088J2688K54605k92165K65670k1195l95226N18301k62297R3773n9430
16931A924812o5905L24746L3502k01179K63146l05520J05695q8924J75284j42303
16921B023354J83325j49206K26750K9157K65821k39124k24284K08903J76739m71542
16911B029893O5948N98262l20073M0869p8364L57471l07987J69061J3733L02465
16901B871278k23009m3743K5026j25088L47461m41301L24977j39637K80726J67357
16891C044047l94040K49109J84998p0611m7443P9821J09046j26993J97545k7699
$$ plain form
16961 1500865 1504452 1582402 1457805 1609997 1528250 1476191 1656584 1435940 1545256 1713055
16951 1713055 1632892 1714918 1565346 1913401 1895379 1676784 1960172 1820521 2010517 1810088
16941 1810088 1822776 2077381 1785216 2050886 2029691 1634465 2152766 1890469 1984242 1924812
16931 1924812 1858907 2183653 2217155 2015976 2279122 1973602 2079297 1990373 2165657 2023354
16921 2023354 2206679 2057473 2284223 2313380 2579201 2340077 2115793 2324696 2501435 2029893
16911 2029893 2095841 2694103 2374030 2414899 2336535 2694006 2386019 2555080 2568813 2871278
16901 2871278 2648269 2604526 2629552 2504464 2851925 2410624 2735601 2595964 2876690 3044047
16891 3044047 2650007 2899116 3084114 3013503 2966060 3045881 3154927 3027934 3225479 3197780
16881C197780K91825k49682r4386R417k6124R8319L23426k79889J18440K70962
16871C660088j60890k3931J09869K99863p0896Q1782j68587P6090K87103j22294
16861C968197L65837k42309M23153l47843m0649J02357m0148M25298l19532L01677
16851D596038J44812k67593O68710p10228K10742J84783K28901J29243p2552k803
16841E110053N9253K82287n1841N37243o78953K97962N37177K2719j81888J28515
16831F062527n2299K34098j9612l4236J3411O33815m11643M01187O6785j20909
16821F773124M74787j23555N32007o0625J84088k16715L01617J10577K8833K22718
16811H226856M04707r7953K61243L76344j95629j68186L72915Q4212N13018K60296
$$ plain form
16881 3197780 3489605 3239923 3145537 3154954 3128830 3227149 3550575 3270686 3389126 3660088
16871 3660088 3499198 3475267 3585136 3884999 3814103 3895885 3727298 3803388 4090491 3968197
16861 3968197 4334034 4091725 4514878 4167035 4126386 4228743 4188595 4613893 4294361 4596038
16851 4596038 4740850 4473257 5141967 4431739 4642481 4827264 5056165 5185408 5112856 5110053
16841 5110053 5169306 5451593 5399752 5936995 5258042 5556004 6093181 6115900 5934012 6062527
16831 6062527 6010228 6244326 6224714 6190478 6203889 6837704 6426061 6827248 6894033 6773124
16821 6773124 7247911 7124356 7656363 7595738 7779826 7563111 7864728 7975305 8004138 8226856
16811 8226856 8631563 8533610 8794853 9171197 8975568 8807382 9180297 9264509 9777527 10037823
16801A0037823K67836L7361K41061J50883M4298O55806l6840K9359L28804N10721
16791A2267112L84412j38528M02252J81043M10624K93453R7577L66909K98236
16782A4563090O02878M16399J45576L35284N60359N20457J26295J95151P74564
16773A8240053K84509N79020P60804L50963O10114Q20849N52838L77251O20926
16764B3197327R52164N42624O08341Q63764O35193R25958Q49067O46647J020507
16755C0241592P92564J016591Q71400J517982P70243J189496J341384J302439
16747C9043691J056806J524812J423662J296657J795815J678615J241443K091818
16739E1153319K019969J975934J928735K090750K411466K024476K189563K442951
$$ plain form
16801 10037823 10305659 10343020 10584081 10734964 10779262 11435068 11398228 11427587 11756391 12267112
16791 12267112 12651524 12512996 12915248 13096291 13506915 13800368 13897945 14264854 14563090
16782 14563090 15165968 15582367 15727943 16063227 16623586 17144043 17270338 17465489 18240053
16773 18240053 18524562 19103582 19864386 20215349 20825463 21646312 22199150 22576401 23197327
16764 23197327 24149491 24692115 25300456 26164220 26799413 27725371 28574438 29221085 30241592
16755 30241592 31034156 32050747 32922147 34440129 35210372 36399868 37741252 39043691
16747 39043691 40100497 41625309 43048971 44345628 46141443 47820058 49061501 51153319
16739 51153319 53173288 55149222 57077957 59168707 61580173 63604649 65794212 68237163
16731F8237163K063564K996303K278064K845971L139489K623669K565256K839540
16723H9589019K983564K915395L288742K653469K903197K468262K630168K838976
16715A12270792K634866J617130K213379J922582J564227J634606P28836O09747
16707A25196165P25529n7117k10837m70309j016806j015852j639873j357604j924278
16698A18229018k074353k656968k244724k764539k304322l255097k885047k946971
16690I7096997k593698l035705k936383l242126k943791k782972k736696k590471
16682G4235155k773327k377282k709926k179288k526436k275878k124526j918820
16674E5349672j951427k052725k050511j438105j926508j617609j671177j408763
$$ plain form
16731 68237163 70300727 73297030 75575094 78421065 81560554 84184223 86749479 89589019
16723 89589019 92572583 95487978 98776720 101430189 104333386 106801648 109431816 112270792
16715 112270792 114905658 116522788 118736167 120658749 122222976 123857582 124586418 125196165
16707 125196165 125921694 125864577 125653740 125183431 124166625 123150773 121510900 120153296 118229018
16698 118229018 116154665 113497697 111252973 108488434 106184112 102929015 100043968 97096997
16690 97096997 94503299 91467594 88531211 85289085 82345294 79562322 76825626 74235155
16682 74235155 71461828 69084546 66374620 64195332 61668896 59393018 57268492 55349672
16674 55349672 53398245 51345520 49295009 47856904 45930396 44312787 42641610 41232847
16666D1232847j528409j178260j583522r25303j356500j409486o57243j459518
16658C1134606n86037j112936p43353j035750p41796p71642r53283m52353j393042
16649B3344414l41884o36858n33654q28313q10490m91336p10318J67722q50893
16640A8308390p42985j46077m10275p68642m5315m34033m96441n61592l72561
16631A4330469j02427l49914k34347o29282P4262k96110m84384l07276j37028
16622A1863963m75974J30260m00785k77176k44143m7226l08928m08522j76537
16613I654932m36151L14319k83578k47257j80803j14310q4948k16689j98981m8861
16603H157673m63312k77416N9073j5816k23966j95808k13326l0439q5443k19480
$$ plain form
16666 41232847 39704438 38526178 36942656 36017353 34660853 33251367 32594124 31134606
16658 31134606 30548569 29435633 28692280 27656530 26914734 26143092 25189809 24737456 23344414
16649 23344414 23002530 22365672 21832018 21003705 20193215 19701879 18991561 19159283 18308390
16640 18308390 17565405 17419328 17009053 16240411 16195096 15761063 15264622 14703030 14330469
16631 14330469 14228042 13878128 13643781 13014499 13088761 12792651 12308267 12000991 11863963
16622 11863963 11387989 11518249 11117464 10840288 10596145 10548919 10239991 9831469 9654932
16613 9654932 9218781 9533100 9249522 9002265 8821462 8707152 8622204 8405515 8206534 8157673
16603 8157673 7694361 7416945 7476018 7460202 7236236 7040428 6827102 6796663 6711220 6491740
16593F491740j80171m6288J14103j71039l79540N9230o125k43737j46585M73976
16583E965564m43620l23756J64084j36502J29604J7161m34347N8014k28681j60012
16573D607509m2754k38155K61999k82333K84975o7847j07097j88287k77733M30202
16563D380479o41630J48535Q5790J29839K8418j8674j77894j58807n43266M31795
16553C664585j62889J48140l69654J42146Q5887j71520m48639K79271J27426m86964
16543B807789L94430k04734L67081j70839m14445L82762k90527q828J45484j97313
16533B810860n00122N03739N9678N3487o83834N37965k52255J33497j99057n8754
16523B405204o7654m8093K22381k89173K90274j27791j96591L1786j08133L16079
$$ plain form
16593 6491740 6311569 6265281 6379384 6208345 5828805 5888035 5881910 5638173 5491588 5965564
16583 5965564 5521944 5198188 5362272 5225770 5355374 5372535 4938188 4996202 4767521 4607509
16573 4607509 4564755 4326600 4588599 4306266 4591241 4523394 4416297 4228010 3950277 4380479
16563 4380479 3738849 3887384 3973174 4103013 4131431 4112757 3934863 3776056 3232790 3664585
16553 3664585 3501696 3649836 3280182 3422328 3508215 3336695 2888056 3167327 3294753 2807789
16543 2807789 3202219 2997485 3364566 3193727 2779282 3162044 2871517 2862689 3008173 2810860
16533 2810860 2310738 2814477 2874155 2927642 2243808 2781773 2529518 2663015 2463958 2405204
16523 2405204 2337550 2289457 2511838 2222665 2512939 2385148 2188557 2220343 2112210 2428289
16513B428289k26606K54680l65737j47732J49077k37864K34321K03793k90977
16504B001244L2241j55779K15007j94202j15751L7823o751R0243j4808q5727m95602
16493A307938M25376N71504n69172j1813l16419K89525l25687L50690k58437J0717
16483A474222J5317r6276K80193r9057R467o670r3905N5765L095l13248p0912
16472A157991J32768L36394l05874p8235L01861j44111p307J14980j23310J41423
16462A526580j62654M5522Q2000j86450o26784P19639j32315P2146o3296j61229
16452A113159j33867J87482m5299k74344K34583L14765k88119j39314J12863J42782
16442A224691p7412M9958q5076j99689J34458l22251N31287J26735l51431j50463
$$ plain form
16513 2428289 2201683 2456363 2090626 1942894 2091971 1854107 2088428 2292221 2001244
16504 2001244 2033485 1877706 2092713 1898511 1782760 1820583 1813832 1904075 1889267 1803540 1307938
16493 1307938 1733314 2304818 1735646 1723833 1407414 1696939 1371252 1721942 1463505 1474222
16483 1474222 1489539 1393263 1673456 1574399 1583866 1577196 1483291 1539056 1542151 1228903 1157991
16472 1157991 1290759 1627153 1321279 1243044 1544905 1400794 1393487 1508467 1385157 1526580
16462 1526580 1363926 1409448 1491448 1304998 678214 1397853 1265538 1337684 1274388 1113159
16452 1113159 979292 1166774 1121475 847131 1081714 1396479 1108360 969046 1081909 1224691
16442 1224691 1147279 1197237 1112161 912472 1046930 724679 1255966 1382701 1031270 880807
16432H80807K34822J93592j22190k72423J42384k03442q1368K98578k37035q6679
16422G47046J28536J64535k63653K0385J66295q4204M0230p8851J89913K3701
16412A053933l41824O7838j4189N7755j01959o6388j71673L22517p9771O6772
16402G93011K80310m3525l44039n8621r1475J23192L49774k31728J791p1120A29913
16390I52297j24091J06925l19350J32913j24465L32435l05488C04492K93242J06384
16380G04118L36544l39758j11977K7338J14419j96127A36914K84743N6446J98838
16370F76941N6110K3409q1340k1431j25505J58062J65649k93432M9849p7825N02987
16359A033474l19733J45943R9407k86277C25474J70624K23866q0311q3580K59953
$$ plain form
16432 880807 1115629 1309221 1187031 914608 1056992 853550 772182 1070760 833725 747046
16422 747046 875582 1040117 776464 796849 963144 878940 919170 840319 1030232 1053933
16412 1053933 712109 779947 765758 823513 721554 655166 483493 806010 726239 793011
16402 793011 1073321 1029796 685757 627136 535661 658853 1008627 776899 778690 707570 129913
16390 952297 828206 935131 615781 748694 624229 956664 651176 304492 597734 704118
16380 704118 1040662 700904 588927 616265 730684 534557 136914 421657 478103 676941
16370 676941 733051 756460 675120 653689 528184 686246 851895 558463 608312 530487 1033474
16359 1033474 713741 859684 959091 672814 325474 496098 719964 639653 556073 816026
16349H16026j69815M0960j62542K518j46023L97860k34854K17482q6230k72277
16339D03105P3281l3221r0338M08160P8881l09356B61896h344D34585N2273K07590
16328F94448l13315J22559K94236l51861R4584B38281L67841J42452k82242Q6240
16318E52572A78335K20567M6940P7950A87774M64623k91996J07606j73715J82120
16308D76412j35186J30260N9192A47551K40803j78219J51297l376K92629k96373
16298C54312L48130l21679J69745o0342J35488j269B35656L52272r8365j78898
16288C10665O2902k2854K81215j48825A70746Q5133j27810M98121B66392J26389
16278C92781N3386M5565A65838n8218K32508N2535o4565N5067r9440E4032M50117
$$ plain form
16349 816026 646211 687171 524629 527147 381124 778984 544130 761612 675382 403105
16339 403105 476386 443165 352827 760987 839868 530512 261896 -8344 434585 486858 694448
16328 694448 381133 503692 797928 446067 540651 238281 606122 748574 466332 552572
16318 552572 178335 398902 445842 523792 187774 652397 360401 468007 294292 476412
16308 476412 341226 471486 530678 147551 388354 210135 361432 358056 650685 354312
16298 354312 702442 380763 550508 490166 625654 624385 235656 587928 489563 310665
16288 310665 373567 350713 631928 483103 170746 255879 128069 626190 266392 392781
16278 392781 446167 491732 165838 107620 340128 392663 328098 383165 283725 54032 504149
16267E04149d4160B10354a6460D51349L9926j99430n7860j05482J6894K04260
16257C49657m9474A47945J28147q8528J15086m8053k6200j04090M128K52236J36129
16246E16800f1053H1248l6128M6975K36274r0894c5214B23515K66574r8506M5025
16235D36608B06903r8595J27192R8497P7819j23042a0191C50917j11917J75353
16225D14353j46424k970C0902O5999b28279A10445f9773I6494K14043J08558B6672
16213C38589i2649B64653r8678J23497E175K86257C8534M24224A29786l1081O0104
16202A58809P4413j14030M03788E4883i9354B69225K07565D4958L17478A67952
16191b07314B86761M4496b20385C2087J52376j8146m8258L1166a9861j7049g526
$$ plain form
16267 504149 -44160 210354 -16460 451349 491275 291845 233985 128503 145397 349657
16257 349657 300183 147945 276092 187564 302650 254597 228397 124307 128435 380671 516800
16246 516800 -61053 81248 45120 92095 328369 237475 -35214 223515 490089 391583 436608
16235 436608 206903 108308 235500 333997 411816 288774 -10191 350917 239000 414353
16225 414353 267929 264959 30902 96901 -228279 110445 -69773 96494 310537 419095 26672
16213 338589 -92649 264653 165975 289472 5175 291432 38534 462758 129786 98705 158809
16202 158809 233222 119192 522980 54883 -99354 269225 476790 44958 362436 167952
16191 -207314 286761 331257 -220385 32087 184463 166317 118059 149225 -19861 -36910 -7526
16179E2140L31832D9602L56003j20919g3386D25709B6498n64h2342B47457A19876
16167C21635h0377A54470J10637C4418J07156L05832d0227A27403c9988B1521
16156A98381P921Q922D9285K27847a16873C88677j64304A07530a77641A34660
16145B96849b4220D37218A21401m3685O4569E450d9677A56882K7657D7495b11684
16133b612G5780P3158K90539F7809J22531p9040M1589p916Q6817H2149d6732n30
16121d7262A12272J6366O1110H2846K739c59314C08399A11107a01693A9290c7172
16109B17395a95A0526L8029K2807i0083Q71A90178a30240k7707B09351n2270N4772
16097B11853L2178i468D37485a67690C637f9881I0887j0544d5647C98615a2643
$$ plain form
16179 52140 383972 49602 405605 284686 -73386 425709 26498 25934 -82342 247457 119876
16167 321635 -80377 154470 265107 34418 141574 447406 -40227 127403 -39988 21521
16156 198381 206302 215224 49285 277132 -116873 388677 224373 107530 -177641 134660
16145 296849 -24220 437218 121401 77716 142285 5450 -49677 156882 184539 47495 -211684
16133 -2612 75780 148938 439477 67809 190340 111300 152889 144973 231790 82149 -46732 -47262
16121 -47262 112272 128638 189748 82846 85585 -359314 308399 111107 -101693 19290 -37172
16109 217395 -195 10526 48555 71362 -90083 -89212 190178 -130240 -157947 209351 157081 211853
16097 211853 244031 -9468 437485 -167690 3637 -69881 90887 80343 -45647 398615 -12643
16085A0058h6230A33230J7919B7958J60614I1886e6669C66582B4568c0647j47777
16074a78424c1767k02140C1238J96607k1415h0634A00448A7803K50081j31000
16064A36884N9739b39886H6295R9180a74614C6182j7588h8921D045N4227L58149
16053D16421b10749b6116E1924B1701J22368F2026P9048k8295b53780e2409A99667
16041B00770a6981k14014m5491A13186O6694b60033J04178B27764P5561a48277
16030C71324a64952P4958H9585J06547b98973B37852j16072f5531A17341O4602
16020A81943i9432k6306k0543F3380K86776d6564A12861a08161A27741J38513
16010B66254a72101e706A60523n5731D4169K98372A13048c25396A94513H1984
$$ plain form
16085 10058 -86230 133230 151149 27958 188572 91886 -56669 366582 24568 -30647 -178424
16074 -178424 -31767 -233907 31238 227845 206430 -80634 100448 17803 267884 136884
16064 136884 196623 -239886 86295 185475 -174614 36182 18594 -88921 4045 58272 416421
16053 416421 -210749 -26116 51924 21701 144069 62026 141074 112779 -253780 -52409 199667
16041 200770 -16981 -230995 -276486 113186 179880 -260033 -155855 227764 303325 -148277
16030 371324 -164952 -89994 89585 196132 -298973 237852 121780 -65531 117341 181943
16020 181943 -99432 -125738 -146281 63380 350156 -46564 112861 -108161 127741 266254
16010 266254 -172101 -5706 160523 104792 44169 342541 113048 -325396 194513 81984
15999a18529a5815m0147A177N5644p958J38989Q3121a22025G1154J04570D9190
15987d36781D5841c0763D4515K14360c62441h6730J0151A15347J07079a50625
15976h0218F1004J35282L7758j01133L89604J79582J12464L77285m45357r0855
15966F55634j01045l4322A26164b44323R0424B54232H5262c2230C65282A48181
15955H9447g5365j45318C51541a47143q6533A51082e1654A5919N47671k52001
15945C11589e0461k40442A06415j9958b838l3693i279j45590o4401B7641a78109
15933a7892C82328b07072J307i9867F9689c6982I1037a2654j48690k65756P2955
15922c54145B51425c8921B87129b43673A32759c35242B65429D9684B2202J97787
$$ plain form
15999 -118529 -15815 -55962 1177 56821 48863 187852 270973 -122025 71154 175724 49190
15987 -436781 45841 -30763 44515 258875 -362441 -86730 -76579 115347 222426 -150625
15976 -80218 61004 196286 234044 132911 522515 702097 814561 1191846 746489 655634
15966 655634 554589 520267 126164 -244323 -153899 254232 85262 -32230 365282 148181
15955 89447 -75365 -220683 351541 -147143 -233676 151082 -51654 15919 563590 311589
15945 311589 -50461 -290903 106415 86457 -2838 -36531 -9279 -154869 -219270 27641 -178109
15933 -17892 382328 -207072 -205765 -99867 69689 -36982 91037 -12654 -161344 -427100 -354145
15922 -354145 251425 -38921 287129 -243673 132759 -335242 265429 49684 22202 219989
15912B19989d02106E7033O1084a4670A22051a96684O5342I8317a98341i1836j10428
15901b02264C2631j3264a19294A05567b43565A67782B5701a73210d3845j09231
15891a53076e5231l66328B10273E0265e4842r507A98370b15001H4359J23354G1644
15879a11296B11551a20086G1752N3818A4381K78775B8299J31496O8113a60515
15868a66525k33B16467a91029B51399C058b80619K167B4657h2716J2381j48371
15857b18706k68608E738K7691J145P5877f1762k10799f2751r3299F1285g2931
15845B6432a30501e6775N804j58756j70331B3648M7889O1127M4632c6930A96036
15833a98820F050b11441d4497F6635C0379j954a04446E9762a37885B46541a65068
$$ plain form
15912 219989 -402106 57033 118117 -14670 122051 -196684 -131342 98317 -198341 -91836 -202264
15901 -202264 32631 19367 -119294 105567 -243565 167782 25701 -173210 -43845 -153076
15891 -153076 -55231 -421559 210273 50265 -54842 -64349 198370 -215001 84359 207713 71644
15879 -111296 211551 -120086 71752 125570 14381 293156 28299 159795 227908 -160515
15868 -166525 -166758 216467 -191029 251399 3058 -280619 -278452 24657 -82716 -70335 -218706
15857 -218706 -487314 5738 33429 34574 110451 -61762 -272561 -62751 -156050 61285 -72931
15845 26432 -130501 -56775 -50971 -209727 -380058 23648 71537 132664 177296 -36930 196036
15833 -198820 6050 -211441 -44497 66635 30379 28425 -104446 59762 -137885 246541 -165068
15821A1212R1239a9652A11437R2814f5968H12a73325A02054a09856B08614c31765
15809e84611h3350l24073B31439b07403m6304P4461g3266B23437L3557b13570
15798a53480d0718j2012J4788J3021k62673a7923l7022J5335j60034I9163f6006
15786B17383F1082f97m22800K09425B5373a20990A00556i0432K4262n1651C32168
15774A32891e7117C8997J73626D3993Q3937g205A54354f3459B45541c46429a63112
15762G5178b5668C8993N7922b00561G5848o053b10922o7327a32287d7471b0400
15750d9542H6884a11336C53916j13077C6501Q073K7592J64896K7252b53128A61608
15738G48N1115e5262B56161b11252d5638J8610j98680D45420C4604f7170I5872
$$ plain form
15821 11212 102451 -19652 111437 204251 -65968 812 -173325 102054 -109856 208614 -331765
15809 -584611 -83350 -407423 231439 -207403 -253707 -179246 -73266 223437 256994 -213570
15798 -153480 -40718 -52730 -37942 -24921 -287594 -17923 -54945 -39610 -199644 99163 -66006
15786 217383 61082 -697 -423497 -214072 25373 -120990 100556 -90432 -66170 -117821 332168
15774 132891 -57117 38997 212623 43993 127930 -7205 154354 -63459 245541 -346429 -163112
15762 75178 -25668 38993 96915 -200561 75848 69795 -210922 -278249 -132287 -47471 -20400
15750 -49542 86884 -111336 353916 240839 36501 44574 72166 237062 264314 -253128 161608
15738 748 51863 -55262 256161 -211252 -45638 -27028 -225708 445420 34604 -67170 95872
15726a30665C6946d9144B92982C7502a75007l587j5832i4186B8461Q9877a14931
15714a330k8219A12545d70830B27457I8302J4300b33736C41314b95382B3821b06875
15702F2898Q0352b44970A6960a83728E0485P6823o0593a84509m9595B743O1200
15691F3943e2350D81664b20260D6432c2119A01085d1166m0502B36314a46715F7873
15679a21476A46331a05649C03896c2575k6378C0342D245a66341A08780a71058
15668H9378C1731r146f3426a352m54n5199j50552A20b3948A82911f5136J0295
15656e4841J2449D08147B1216J81174n7201k2527c86970c7764H5481J05249b86365
15644F8697c22266e221m1431p6896j45586A41548K32744F9373l0273K2869h3672
$$ plain form
15726 -130665 36946 -49144 292982 37502 -175007 -178594 -194426 -94186 28461 118338 -114931
15714 -1330 -29549 112545 -470830 227457 98302 112602 -233736 341314 -295382 23821 -206875
15702 62898 143250 -244970 16960 -183728 50485 127308 66715 -184509 -234104 2743 63943
15691 63943 -52350 481664 -220260 46432 -32119 101085 -41166 -81668 236314 -146715 67873
15679 -121476 146331 -105649 303896 -32575 -58953 30342 4245 -166341 108780 -171058
15668 89378 31731 22585 -63426 -1352 -1806 -57005 -207557 120 -23948 182911 -65136 -54841
15656 -54841 -42392 408147 21216 202390 145189 122662 -386970 -37764 85481 190730 -286365
15644 68697 -322266 -5221 -46652 -123548 -269134 141548 374292 69373 39100 61969 -83672
15632f7115k65565C90663j46491k2759c08456a24019J1954j72269H0631b31044
15621A48675a76148G5926J08293d9685k21059A50996h8077B22752c85226a04905
15610b39295Q7240c4515k7106g987k80410D9592a18587G7917a31488i030F9942
15598C2002c8920k40230a11503E2950b07826B9931a56376m0634b1609n2841E0811
15586e44944K57995B23693c86025A96306D1586a34175l1786H2993h1765e607k99896
15575c05503j14852a21013O340E0222K47192c02094A45278P3984b75154l3336
15565c08490A4774R7190a66771l6114H2028L1904i4200b8168k7076B48263b25690
15553A15387d42204A83082g1279q394B22853G77J73220b3792j07652A49331F2662
$$ plain form
15632 -67115 -332680 390663 244172 221413 -308456 -124019 -112065 -284334 80631 -231044
15621 148675 -176148 75926 184219 -49685 -270744 150996 -88077 222752 -385226 -104905
15610 -239295 -152055 -34515 -61621 -7987 -288397 49592 -118587 77917 -131488 -9030 69942
15598 32002 -38920 -279150 -111503 52950 -207826 29931 -156376 -197010 -21609 -74450 50811
15586 -544944 -286949 223693 -386025 196306 41586 -134175 -165961 82993 -81765 -5607 -305503
15575 -305503 -420355 -121013 -114673 50222 297414 -302094 145278 219262 -275154 -308490
15565 -308490 14774 111964 -166771 -202885 82028 113932 -94200 -28168 -55244 248263 -225690
15553 115387 -442204 183082 -71279 -79673 222853 777 173997 -23792 -131444 149331 62662
15541G8373g8123j1581G9271M4078K33475a23004m780q500O3664D665J81001L7500
15529B23166d6524p1823B14896A03184h9544J2086J7190r4835j87235C76234a55852
15517b72778h9249A01496a08871B13848f3932K3276b134C5602b58381h4089J7736
15506f6353A32122r956J13112L2182E4447K975e41446A1800J00287j8888J44946
15495B38145a3696B67600C3461b67159C18929c11410E3089K02940F882d4571C94254
15483H93K90616A29548l1181O609d35743C47372A2486K43176a27585A77584L4570
15472B12154J43823k9402R6989r4135I4529L08999o3794H7483d6305C41027j8158
15461C22869M2888O4679K10325p1067j46410K21638A53928p6439i5711M7710P624
$$ plain form
15541 78373 -78123 -89704 79271 123349 356824 -123004 -127784 -136284 -72620 4665 185666 223166
15529 223166 -46524 -118347 214896 103184 -89544 -77458 -60268 -155103 -342338 376234 -155852
15517 -272778 -89249 101496 -108871 213848 -63932 -40656 -2134 35602 -258381 -84089 -66353
15506 -66353 132122 122166 235278 267460 54447 57422 -541446 11800 112087 93199 238145
15495 238145 -13696 267600 33461 -267159 318929 -311410 53089 256029 6882 -44571 394254
15483 893 291509 129548 98367 104976 -435743 347372 12486 255662 -127585 177584 212154
15472 212154 355977 326575 423564 329429 94529 403528 339734 87483 -46305 341027 322869
15461 322869 365757 430436 640761 569694 423284 644922 153928 77489 -95711 -48001 -40377
15450d0377l784o6485h61C8853f7401D01631H7913h3188A85324a0353j07836A42722
15437a22893A12921J35911L9485e0953B47274n5310L49694B4751M40202o5285
15427C99668K13443K43760J4282l8860R7916C22429A04204J25577J07903l0831
15417C06853j35549n5262D3178L70712G3199j1133K15570a61759B16086b29291
15406b58977L8571B02606g9451D03256F746K30033A3732N2959b66619d1374D64444
15394a94137A77517E8179G156J8276f2068A80357C8228f7229J4471A8950K07003
15383B25953n9086a16361B4733h5955j21864j7152I8124I159a22803a2567H9782
15371B43863k4651g4705A71955K5603F1122d4536F8903K0746a15157h815D3309
$$ plain form
15450 -40377 -44161 -110646 -861 38853 -67401 401631 87913 -83188 185324 -10353 -118189 142722
15437 -122893 112921 248832 288317 -50953 247274 191964 541658 24751 464953 399668
15427 399668 613111 856871 871153 832293 930209 322429 104204 229781 337684 306853
15417 306853 171304 116042 43178 413890 73199 62066 277636 -161759 216086 -229291
15406 -258977 -220406 202606 -79451 403256 6746 236779 13732 66691 -266619 -41374 464444
15394 -194137 177517 58179 7156 25432 -62068 180357 38228 -67229 -52758 18950 225953
15383 225953 166867 -116361 24733 -85955 -207819 -224971 98124 9159 -122803 -12567 89782
15371 243863 219212 -74705 171955 197558 61122 -44536 68903 89649 -115157 -8815 43309
15359A19074K19916H4289J34178E6099J47663h9479B22865q9494K3885m4352J69878
15348B82782F3886J45271M2019k8064k1309c4858r8115A80885K89576j15616A35751
15336I4757j5185R4869M0975f697j21950D79454A74374L01837J73471A70849D2490
15324E8347K25132J91358k20283q2885a12382B41575j13321a6703C17103j18580
15314A98523I3855N0005o3970J11838a5869B04756J93940A39287d8894C8147K37646
15303B75793A36085C1912b5109G4477L8896J64768c4804C79483A75687l2766K54529
15292C97450C0826K98265c2800j62062D55118a08153A7575J70667j7852j8212
15282A52178a9342D21483F5718O7019B8991g0942G7359a42892A59204a25677d5097
$$ plain form
15359 119074 338990 84289 218467 56099 203762 -89479 222865 133371 157256 112904 282782
15348 282782 63886 209157 251176 223112 201803 -34858 -132973 180885 470461 354845 135751
15336 94757 79572 174441 215416 -6697 -128647 479454 174374 476211 649682 170849 42490
15324 58347 283479 474837 254554 171669 -112382 241575 128254 -16703 317103 198523
15314 198523 93855 143860 79890 191728 -15869 204756 398696 139287 -48894 38147 275793
15303 275793 136085 31912 -25109 74477 113373 278141 -34804 379483 175687 142921 397450
15292 397450 30826 329091 -32800 -194862 455118 -108153 17575 188242 170390 152178
15282 152178 -19342 421483 65718 132737 28991 -70942 77359 -142892 159204 -125677 -45097
15270b50793a22988L5722H2303l5942J01198J636h6503D15486C7397J52368c95875
15258d4478B66769H4261J32866A197d1966k3261A83015o3756c58166C7371Q5727
15247A23098H950K21251h1483j09134G1571d7602d102D7540P4311O3644o3096
15236A22399J30220a67913F2754J45519p0184K00896A0996K82173N02832J11566
15226I07567O42601k86008J67667J7802o63768C52451A16462J77342I2996d7189
15215A75866K95969f7843B15756J4753b5615k9528m8562B86142l1573a6185j02123
15204a18308I949K00041F9063K36355e5331j43488H2664K5415a51467C01587G7890
15192D4331N6492a83576A28264J12148b0010A77407J09544e1886n9289F9872h849
$$ plain form
15270 -250793 -122988 -87266 82303 46361 147559 149195 -86503 415486 37397 189765 -395875
15258 -44478 266769 84261 217127 1197 -41966 -65227 183015 119259 -358166 37371 123098
15247 123098 8950 230201 -81483 -190617 71571 -47602 -4102 47540 121851 185495 122399
15236 122399 252619 -167913 62754 208273 138089 338985 10996 293169 796001 907567
15226 907567 1550168 1264160 1431827 1449629 785861 352451 116462 293804 92996 -47189
15215 175866 471835 -67843 215756 230509 -25615 -55143 -103705 286142 254569 -16185 -118308
15204 -118308 9949 209990 69063 305418 -55331 -198819 82664 108079 -151467 301587 77890
15192 44331 100823 -183576 128264 240412 -20010 177407 286951 -51886 -111175 69872 -8849
15180A55933f5338B9461J84750K8394a46058A26953a97322C9710K6040M47815
15170E13565B42117j15146J9538e2839C2063i6552D77879A21819a55190O7234
15160h7956k3039A05866m6519k3778g8939H3542q265K35834p1744r4294b8531
15148B90656H5275h8732o5000E0540J26705k0721P2887r6266E9235b46502A7912
15136b82223B51913J12945A80348C4143R6578f5450F6728K84536H9746h975l14592
15125c23567I8466R386a24759A7772e8131k5050A93057a87864g704B77890b17062
15113A6991N5470J97255m8682L2150Q807b1979F2591a07944F0183J84939L76220
15102F21342d0348B57888J51762A16942a56534b7451C36842H815a7019B96590
$$ plain form
15180 155933 -65338 29461 214211 242605 -146058 126953 -197322 39710 65750 513565
15170 513565 242117 126971 146509 -52839 32063 -96552 477879 121819 -155190 -87956
15160 -87956 -110995 105866 59347 35569 -78939 83542 75277 311111 239367 145073 -28531
15148 290656 85275 -88732 -153732 50540 177245 156524 229411 133145 59235 -246502 17912
15136 -282223 251913 364858 180348 34143 130721 -65450 66728 351264 89746 -8975 -323567
15125 -323567 98466 107852 -124759 17772 -58131 -83181 193057 -187864 -7704 277890 -217062
15113 16991 72461 269716 221034 253184 261991 -21979 62591 -107944 60183 245122 621342
15102 621342 -40348 257888 409650 116942 -156534 -27451 336842 8815 -17019 296590
15091c938E0844K86168j16859I6315C8440j6637g5196A20713c1739A68602l4857
15080A33745Q1107e3159C13668j01758r1857L56787A97039B6599a0565B97062
15069B44240a97007B16096L5050l617k7221O5894J60887A52882a92112D09277
15058G3212L41192A19551J27315q0076c921A17025E7293K79930A4188O2408J16321
15047A92917p2063K01464A23323Q4792M5519k5237J25295j761k0778j17655K04821
15036D18319F8107L01690j28639L48603j4014j12145j68221p1693Q0897k7277
15026B77308K57540I1549J23687J48848p8741q4966j5025a0875E67083k01742
15016C65341L52016J06890j35803R8128k17658j26500K01703q0403j71562J94860
$$ plain form
15091 -3938 50844 337012 220153 96315 38440 21803 -75196 120713 -31739 168602 133745
15080 133745 214852 -53159 313668 211910 120053 476840 197039 26599 -10565 297062
15069 244240 -197007 216096 251146 247529 220308 286202 447089 152882 -192112 409277
15058 73212 414404 119551 246866 166790 -3921 117025 57293 337223 14188 76596 192917
15047 192917 120854 322318 123323 208115 253634 228397 353692 351931 331153 213498 418319
15036 418319 68107 369797 241158 589761 575747 463602 295381 223688 304585 277308
15026 277308 534848 91549 215236 364084 285343 200377 185352 -10875 567083 365341
15016 365341 717357 824247 688444 786572 568914 442414 644117 563714 392152 587012
15006E87012j17564J52378J35163m4745A90633P6830p5632K07138J51594j83370
14996C67193q6100j0868J40043L57358k31690k617j85957R2659I3195L58505Q9350
14985E41050j1858k60625L55430o8305K8874k54989j61678L28489k30762J71625
14975D37251K04011j99945K8487B29529L25177L10457j79643j17895L30560N2133
14965I50318j07190j7173j50505r1901j95618J24972J52814j56830L38840q8052
14955G59675k67913J51552j47971Q2726k66560Q2989j03901n9019M68393k98522
14945D01449P2249I8383M67513K6117A33002l2870J12310D0566K23304L48593
14935F12463J6273k81661R3167O8326K64283C35080L30944J05001l21115L50923
$$ plain form
15006 587012 469448 621826 756989 712244 190633 267463 191831 398969 550563 367193
14996 367193 281093 270225 410268 767626 535936 533319 347362 440021 93195 451700 541050
14985 541050 529192 268567 623997 555692 584566 329577 167899 496388 265626 437251
14975 437251 641262 441317 469804 229529 554706 865163 685520 567625 898185 950318
14965 950318 843128 825955 675450 583549 387931 512903 665717 508887 847727 759675
14955 759675 491762 643314 495343 578069 311509 394498 290597 231578 699971 401449
14945 401449 473698 98383 565896 592013 133002 100132 212442 40566 263870 612463
14935 612463 628736 347075 440242 508568 772851 335080 666024 771025 449910 800833
14925H00833l5418j80249j58557o6703Q0946j00901K03981L203L47041K10418
14915A104594j66292J87495K2505P726M28069k11227L08164j59101M16292k86950
14905A651275j13365J23125N60530q9606J9115L07737p02051j49697k86156k83664
14895A037243L70188m57301j41260K30683m96461R2628j03021j54135A19951L34407
14885D54358A28402L00837K1113j03866j17194O4501J67073j11731J36618J69445
14875F55198k14354K71163Q8912k9675j12199J54765K85309j78073J25465l71030
14865F75481M27425k07742J27330Q72m33005q4285j73621K2949M12388k96928
14855D70864j96870K19028j3848j13425J98782J62378J96522j9361l67253M49008
$$ plain form
14925 800833 765415 585166 426609 359906 440852 339951 543932 547135 894176 1104594
14915 1104594 938302 1125797 1148302 1156028 1584097 1372870 1681034 1521933 1938225 1651275
14905 1651275 1537910 1661035 2221565 2131959 2151074 2458811 1756760 1607063 1320907 1037243
14895 1037243 1407431 950130 808870 1039553 543092 635720 532699 378564 119951 454358
14885 454358 128402 429239 450352 346486 229292 293793 460866 349135 485753 655198
14875 655198 440844 712007 800919 771244 659045 813810 1099119 921046 1046511 675481
14865 675481 1102906 895164 1022494 1023366 590361 506076 332455 355404 767792 470864
14855 470864 273994 493022 479174 365749 564531 726909 923431 904070 536817 985825
14845I85825D72795k20035K90216o0469j66968J64083q5389k4705A75062K07171
14835C82233M55506C67843J97015K37966C56542L26386L84081n7531N9516J90928
14825A259922j93282M3202j19239j02012j11241q4048J57452P5190D40201J24121
14815E64322j43587K17979k04842Q2338K0446j09542J09807j64260L59996P4825
14805H07482J52215k46764J39085j90385K43096j97311P3624k09785K52257L5331
14795H58845j85307p0933L5303K82710q595k21770K67609Q0855j87496N7726L6274
14784I45221k26597n6437j10446k2892j19327L95870J90295l57580j26386l2214
14774D79507M33290j51524j90567L52839l49244K98133J29904m15520l8621R9443
$$ plain form
14845 985825 472795 252760 542976 482507 315539 479622 394233 369528 175062 382233
14835 382233 837739 367843 564858 802824 356542 682928 1067009 1009478 1068994 1259922
14825 1259922 1066640 1109842 990603 888591 777350 693302 850754 925944 440201 564322
14815 564322 420735 638714 433872 516210 536656 427114 536921 372661 732657 807482
14805 807482 959697 712933 852018 661633 904729 707418 781042 571257 823514 858845
14795 858845 673538 602605 637908 920618 912023 690253 957862 1038717 851221 908947 945221
14784 945221 718624 662187 551741 528849 409522 805392 995687 638107 511721 479507
14774 479507 912797 761273 570706 923545 574301 872434 1002338 586818 548197 647640
14764F47640K82844l12969K91577K80534m49088N15581m99224J05022q963l30418
14754E22536J84971K3753Q1990B94322L73645l0970j80969M49007l86145j09206
14744D09684N48374j34594k14253j56700J48540j3149M42346l34479k0347Q5319
14734G60741p7331J46795k22873L06758j23370J22412j02435k98131N80505k38515
14724H54556l4939K84466q3919j53947k82612N54235j07758K21398j71779O61045
14714A740746k06280J15602R2961n4443l6676k72983J58502l29412m98484K76959
14704I86492J9767J54285k22687l06834K19402K0383n6553j43214K08798K51975
14694A131814n2557L9617j92215J06060J78314K59697J69774j74157K14566J21779
$$ plain form
14764 647640 930484 617515 909092 1189626 740538 1256119 756895 861917 852954 522536
14754 522536 707507 731260 813250 294322 667967 636997 456028 905035 518890 409684
14744 409684 958058 823464 609211 452511 601051 587902 1030248 695769 675422 760741
14734 760741 683410 830205 607332 914090 790720 913132 810697 512566 1093071 854556
14724 854556 819617 1104083 1020164 866217 583605 1137840 1030082 1251480 1079701 1740746
14714 1740746 1534466 1650068 1743029 1688586 1651910 1378927 1537429 1208017 709533 986492
14704 986492 1006259 1160544 937857 631023 850425 870808 814255 671041 879839 1131814
14694 1131814 1079257 1118874 926659 1032719 1211033 1470730 1640504 1466347 1680913 1802692
14684A802692K32514m26382k22761l14786J58522j36530n7433K5605q8474q4336
14674H88631Q9818J39465j39074j81042q6312L55667j42317n702L0054k03275
14664G45913L68634m15962L58165R5786j88738l41472K96120o9908r7237L60410
14654A111711l26601L27483k49761j9918K50736K06146j51145K87292l50830j56939
14644I28174K99141j85476L1453r1850M64660L6099M1732j21494j25958k30300
14634A046181J39396r9244L07435N4587p5402j12521k80856J15908K02767J36240
14624A434491k02208R9644l35544L35706J51089j54225j09701J28184J06978l16788
14614A137626L29293k00226l2869Q3914K07963k01333O9702K50462l85414J44425
$$ plain form
14684 1802692 2035206 1608824 1386063 1071277 1229799 1093269 1035836 1061441 972967 888631
14674 888631 978449 1117914 978840 797798 711486 1067153 924836 919134 949188 745913
14664 745913 1114547 698585 1056750 1152536 963798 622326 918446 848538 751301 1111711
14654 1111711 785110 1112593 862832 842914 1093650 1299796 1148651 1435943 1085113 928174
14644 928174 1227315 1041839 1073292 981442 1446102 1482201 1523933 1402439 1276481 1046181
14634 1046181 1185577 1086333 1393768 1448355 1372953 1260432 979576 1095484 1298251 1434491
14624 1434491 1232283 1331927 996383 1332089 1483178 1328953 1219252 1347436 1454414 1137626
14614 1137626 1466919 1266693 1233824 1317738 1525701 1324368 1394070 1644532 1259118 1403543
14604A403543k44404M5844L15152j78490k31690R2044J61827J4538m3950K69300
14594A603714N0281k83257J47286M25094o42453K30638N1886J19244k0942k02888
14584A478603M46803k67573k36830R2932L41428l7280N884L7666l83884M00473
14574A878222k41990J76640j05427L11345j61077q9264K81257j79517M0432M7783
14564A958404K14563j61164K6434J34333l1117J27516k18710N8304N21170m78706
14554B151027N3070M9758P7156L86828j59936j17721n161M60621n556Q3884j28255
14543B845715L4954O79058O1192K42849K65720M55429O89842M47324J535408J917392
14533I174883L580752P187225J1119860M452199j5714694q564223m102208k185416
$$ plain form
14604 1403543 1159139 1204983 1520135 1341645 1109955 1201999 1363826 1378364 1334414 1603714
14594 1603714 1653995 1370738 1518024 1943118 1300665 1531303 1583189 1702433 1681491 1478603
14584 1478603 1925406 1657833 1421003 1513935 1855363 1818083 1823967 1861633 1477749 1878222
14574 1878222 1636232 1812872 1707445 2018790 1857713 1768449 2049706 1870189 1910621 1958404
14564 1958404 2172967 2011803 2038237 2172570 2141453 2268969 2050259 2108563 2629733 2151027
14554 2151027 2204097 2253855 2331011 2717839 2557903 2440182 2435021 2895642 2890086 2973970 2845715
14543 2845715 2880669 3559727 3620919 3863768 4129488 4584917 5274759 5722083 7257491 9174883
14533 9174883 12755635 19942860 31062720 35514919 19800225 11236002 7133794 4948378
14525D948378r65518J53716l99167J086721l70190j363774K1507l69557m72998
14516B269118p4441O17525o27478L01381k82679O62376n84348L64715j47892n3474
14506B444803K66479j95922l14082M69421k43858M62787l86801J08313J14519
14497B725659j20197J89185q7653L5930j48257K10906Q0119R2485J84110j67769
14487B994518J2143J40059k61062J57252L16334p3181J31316k38258P7102M46637
14477C702860l93349L10622J90709m08280M40850j34584m6614R5805Q2289k79373
14467C560935L39268o9661J6901j20684M53492k75406J34900k11687P63477k62569
14457D328966J03977K10771l94079J20263J4251K29932L3681l2323R9735J82436
$$ plain form
14525 4948378 3982860 4136576 3737409 4824130 4453940 3090166 3111673 2742116 2269118
14516 2269118 2194677 2812202 2184724 2486105 2203426 2865802 2281454 2646169 2498277 2444803
14506 2444803 2711282 2515360 2201278 2670699 2426841 2889628 2502827 2611140 2725659
14497 2725659 2605462 2794647 2706994 2742924 2594667 2805573 2885692 2978177 3162287 2994518
14487 2994518 3006661 3146720 2885658 3042910 3359244 3286063 3417379 3179121 3256223 3702860
14477 3702860 3309511 3620133 3810842 3402562 3843412 3708828 3662214 3758019 3840308 3560935
14467 3560935 3900203 3830542 3847443 3726759 4180251 3904845 4039745 3828058 4591535 4328966
14457 4328966 4432943 4643714 4249635 4369898 4384149 4614081 4647762 4615439 4715174 4897610
14447D897610J87933n38839P43884l27952N6168o9382K51961r8476J72000L00451
14437E575358m25107M65586J10860m6981k7614J199Q1027k4470N09120k42459
14427E976519K95769j27812j38870M67030Q0118k80366Q40222l83956k39803K41458
14417F730309J49253J08229L21526j82941K91156M0985P4813q4481J48846K88787
14407G886482K21727K44670R8093J11451J39948J83569O6767j11052n8984K12727
14397H995398K86986K9195J08796q6330J54307K79429K80986M52381n1547J15493
14387A0565094M5105J39252M1702N52485l02380J36056L95665P2993L1285N23321
14377A2200578N60066j36469k18561N06431L53709l9260K54570J03894M71610
$$ plain form
14447 4897610 5085543 4546704 5290588 4962636 5018804 4949422 5201383 5102907 5274907 5575358
14437 5575358 5150251 5615837 5726697 5679716 5652102 5653301 5734328 5709858 6218978 5976519
14427 5976519 6272288 6144476 6005606 6472636 6552754 6272388 7112610 6728654 6488851 6730309
14417 6730309 6879562 6987791 7309317 7126376 7417532 7458517 7533330 7448849 7597695 7886482
14407 7886482 8108209 8352879 8450972 8562423 8702371 8885940 8952707 8841655 8782671 8995398
14397 8995398 9282384 9311579 9420375 9334045 9488352 9767781 10048767 10501148 10449601 10565094
14387 10565094 10610199 10749451 10791153 11343638 11041258 11177314 11572979 11645972 11677257 12200578
14377 12200578 12760644 12624175 12405614 12912045 13265754 13226494 13481064 13584958 14056568
14368A4056568N29552N9300L06643P02983J82602p0851K29885N48576J80391P60580
14358A7486229n3551J72849L57081K16320N84163O97514J7686N58683M67955K75458
14348B0780387P27387J95778O69132j0406O65917P25906K05261L71161P47515
14339B5078038P18117N91930O60861M68751M07045J113148N89759R00901O51773
14330C1180323Q80602O25650J106520O58482R98109J109873Q64487J228661J035099
14321C9687806J406613J107556J046292J343164J501326J472087J220887J358788
14313E0144519K265066J600237J794442J719455J880808K502836J839007K051054
14305F5797424K781361K477621K579061K641549L007979L160188L138229L654607
$$ plain form
14368 14056568 14586120 14645420 14952063 15655046 15837648 15766797 15996682 16545258 16725649 17486229
14358 17486229 17432678 17605527 17962608 18178928 18763091 19460605 19478291 20036974 20504929 20780387
14348 20780387 21507774 21703552 22372684 22362278 23028195 23754101 23959362 24330523 25078038
14339 25078038 25796155 26388085 27048946 27517697 27924742 29037890 29627649 30528550 31180323
14330 31180323 32060925 32686575 33793095 34451577 35449686 36559559 37424046 38652707 39687806
14321 39687806 41094419 42201975 43248267 44591431 46092757 47564844 48785731 50144519
14313 50144519 52409585 54009822 55804264 57523719 59404527 61907363 63746370 65797424
14305 65797424 68578785 71056406 73635467 76277016 79284995 82445183 85583412 89238019
14297H9238019L437786L540980M455376M224769M565626M641324N073226N279495
14289A24456601O158767N853037O475976P258699O794472P653501Q202073Q506594
14281A81359720R155561R509786J0075403J0903730J1305446J1872162J2732279
14274B56914087J2960213J3930530J3817729J4669940J4704847J4390717J4783416
14267C56171479J4470471J3823850J2972528J1881703J0959922J0200745R981853
14260D40462551Q219529Q276329O484918L725992K137766K534020J36523o639366
14252D65338262m092820p409259r079452j1892863j1946381j2638142j3172375
14245C95106970j3569799j4340990j4095232j4330722j4045381j4009295j3923312
$$ plain form
14297 89238019 92675805 96216785 100672161 104896930 109462556 114103880 119177106 124456601
14289 124456601 130615368 136468405 142944381 150203080 156997552 164651053 172853126 181359720
14281 181359720 190515281 200025067 210100470 221004200 232309646 244181808 256914087
14274 256914087 269874300 283804830 297622559 312292499 326997346 341388063 356171479
14267 356171479 370641950 384465800 397438328 409320031 420279953 430480698 440462551
14260 440462551 448682080 456958409 463443327 467169319 469307085 471841105 471977628 465338262
14252 465338262 461245442 453836183 444756731 432863868 420917487 408279345 395106970
14245 395106970 381537171 367196181 353100949 338770227 324724846 310715551 296792239
14238B96792239j2890349j3300482j2502619j2060371j2425482j2008362j0657009
14231B10947565j0672088j0289415r410433r106208q150491q087990p336228o844507
14223A41050205o244513n965206n684851n476960n130777m637736m516371l696597
14215I9697194m472044l838863l564752l723746k722369l036099k959970k655048
14207G2724303k651321k616454k308714j978123k189715k156102j906476j770105
14199E5147293j571410j744753j398455j530689j492517j712068r15444r67383
14191D3814574j234379j223464j404236j383651q06708p25777q33320j336969
14183C4866070p58755j278358n50043r63247p94842r6755r27989j296694n44203
$$ plain form
14238 296792239 283901890 270601408 258098789 246038418 233612936 221604574 210947565
14231 210947565 200275477 189986062 180575629 171469421 163318930 155230940 147894712 141050205
14223 141050205 134805692 128840486 123155635 117678675 112547898 107910162 103393791 99697194
14215 99697194 95225150 91386287 87821535 84097789 81375420 78339321 75379351 72724303
14207 72724303 70072982 67456528 65147814 63169691 60979976 58823874 56917398 55147293
14199 55147293 53575883 51831130 50432675 48901986 47409469 45697401 44781957 43814574
14191 43814574 42580195 41356731 39952495 38568844 37762136 37036359 36203039 34866070
14183 34866070 34107315 32828957 32278914 31315667 30520825 30424070 29496081 28199387 27655184
14174B7655184q16543n47541k91138p05473m08069m06024r12418n00916p47724
14165B2319338p2195m80185o81839l90350k84311o43498l25958j07402p47657
14156A8585943k40588l77828m48520m8621n41537m11003j50527k80573m55546
14147A5631200j02812r2063q33290J94000j48654l34077k23532R3133n30513m21813
14137A3231579j24455m47642J24028p27955J89552q9901m78600J35676m69309
14128A1342973N0088l52105J8111K91245m50847l87906J60764n30064l11298j00025
14118I730936K76524l54416k75751N0717j05252k40552l01578K9458l15776q3328
14108H410982k58475L67420k32981k39090O0389K40m21449j26066K14494l89081
$$ plain form
14174 27655184 26838641 26291100 25999962 25294489 24886420 24480396 23567978 23067062 22319338
14165 22319338 22247143 21766958 21085119 20694769 20410458 19766960 19441002 19333600 18585943
14156 18585943 18345355 17967527 17519007 17470386 16928849 16517846 16367319 16086746 15631200
14147 15631200 15528388 15436325 14603035 14797035 14648381 14314304 14090772 14183905 13653392 13231579
14137 13231579 13107124 12659482 12783510 12055555 12245107 12155206 11676606 11812282 11342973
14128 11342973 11393061 11040956 11059067 11350312 10899465 10511559 10672323 10142259 9830961 9730936
14118 9730936 10007460 9653044 9377293 9428010 9322758 9082206 8780628 8810086 8494310 8410982
14108 8410982 8152507 8519927 8286946 8047856 8108245 8108485 7687036 7560970 7775464 7386383
14098G386383K86060n57167K56828k04257j17696k16732l7682j40259M1566J4246
14088F711290j23530m9518R107j51455j07443k7659r4402j12432l53313R5008
14078E795653n2627p7346j73830m8156J71412j2445O0929J4387m11915l8606O0774
14067E288230K00173k76426n0928P4818k13511l68120K42631K9281k90953p1474
14057D563721k11980J27103K43372k73178k59344K70853Q5564k80915k4223M86622
14047D727595m42895j38471K49022j92858J20860j39036j32958J49567k97934
14038C902892N9466k76008K2781J81501k98364j00702J82579P0514l03192Q4201
14028C525668r0697j40255K58028r271o8964l60665N6454L52954j45843j42020
$$ plain form
14098 7386383 7672443 7115276 7372104 7167847 7050151 6833419 6795737 6655478 6697044 6711290
14088 6711290 6587760 6538242 6547349 6395894 6288451 6260792 6166390 6053958 5700645 5795653
14078 5795653 5743026 5665680 5491850 5443694 5615106 5602661 5663590 5677977 5266062 5227456 5288230
14067 5288230 5488403 5211977 5161049 5235867 5022356 4654236 4896867 4926148 4635195 4563721
14057 4563721 4351741 4478844 4722216 4449038 4189694 4460547 4546111 4265196 4240973 4727595
14047 4727595 4284700 4146229 4395251 4202393 4323253 4184217 4051259 4200826 3902892
14038 3902892 3962358 3686350 3709131 3890632 3592268 3491566 3674145 3744659 3441467 3525668
14028 3525668 3434971 3294716 3552744 3543473 3474509 3113844 3170298 3523252 3377409 3235389
14018C235389r7813Q9752q294j94651M47870k20834j0178j59956M812j59945J64780
14007C090932k51130K7574m8551J26727j70522j87939N0508J71605n7747p3703
13997B677754L10218k64574J53747l58198k72025L53219n08981K88227J33772
13988B513159j39879R9299r9044K94024l96159P259L64093l33984M80717J69365
13978B958850l5104K57526O09270O96175J538523K440937N763061J1315730J2314783
13969C7859751j2838636r178077n526731k652554j489298j067829m51600m67123
13961D187903k79306k18138l53557j47601j4072k93388k07637q1041M6740n23837
13951B116066L78511n04486O99653n50494j8253l6872K54349J56042l74974L14331
$$ plain form
14018 3235389 3137576 3227328 3219034 3024383 3472253 3251419 3241241 3081285 3086097 2926152 3090932
14007 3090932 2839802 2867376 2818825 2945552 2775030 2587091 2637599 2809204 2751457 2677754
13997 2677754 2987972 2723398 2877145 2518947 2246922 2600141 2091160 2379387 2513159
13988 2513159 2373280 2472579 2373535 2667559 2271400 2278659 2642752 2308768 2789485 2958850
13978 2958850 2923746 3181272 3790542 4486717 6025240 8466177 14229238 25544968 37859751
13969 37859751 25021115 15843038 10316307 7663753 6174455 5106626 4655026 4187903
13961 4187903 3908597 3690459 3336902 3189301 3175229 2881841 2674204 2593163 2639903 2116066
13951 2116066 2494577 1990091 2689744 2139250 2120997 2084125 2338474 2494516 2119542 2433873
13941B433873l38051q2589K65727k71039j8634m7195j9875L82784j26049l91697
13931A787255m368P702J80030J16490n29890J25875M54059l23497L45300m54885
13921A704071p0406L17001k59981n1176M8542M14442k60458K4155l90874p358
13911A467958M84051k47284J61768k4835l14244K16239k92626K23412K42820n77680
13901A339579M92041k57201P4187O3125l0071m8715n4447j36325q7628M63333
13891A817878k56465l60585j930j58818M00851k9279j12935K70181m42412p2020
13881A054466O32061l50702P4101r8864J0837L73493m84201J69007k42093P8186
13871A216291M0314n4686Q5383N1207M8071J23308l87318J34903k3331j9229J13421
$$ plain form
13941 2433873 2095822 2013233 2278960 2007921 1989287 1942092 1922217 2305001 2178952 1787255
13931 1787255 1782887 1790589 1970619 2087109 1557219 1683094 2137153 1813656 2158956 1704071
13921 1704071 1633665 1950666 1690685 1639509 1688051 2102493 1842035 1866190 1475316 1467958
13911 1467958 1952009 1704725 1866493 1841658 1527414 1743653 1451027 1674439 1917259 1339579
13901 1339579 1831620 1574419 1648606 1711731 1681660 1632945 1578498 1442173 1354545 1817878
13891 1817878 1561413 1200828 1198898 1040080 1440931 1411652 1298717 1568898 1126486 1054466
13881 1054466 1686527 1335825 1409926 1311062 1321899 1695392 1211191 1380198 1138105 1216291
13871 1216291 1256605 1201919 1287302 1338509 1386580 1509888 1122570 1257473 1234142 1214913 1328334
13860A328334l81019M2268K75893l0876N5892n684n1479J36361k85823j18979
13850I64888L41843j42291L2760j02452o0675K03118k99791l7124N92509k46910
13840A245875k94046j35368L10142K59808j10531j00398m9296j52919j09198J83763
13830A047832M1182j73924O6847J07595l5985Q8865K2581r2256j66331j06969
13820G99437J65654r9836N92937m25379J14081J8516o7575l24827K45894P3828
13810A092730r8021j19578M56588l72120j90014N041n5033L2468K49937q1980
13800I20018j09337q8885K76861J09496k95995J74268K09224m67698P9634J97039
13790A004625j07439M7411Q9706Q8793j00289r2763R4758l1437l00944M3986J72338
$$ plain form
13860 1328334 947315 989583 1265476 1234600 1290492 1284808 1233329 1369690 1083867 964888
13850 964888 1306731 1164440 1197200 1094748 1034073 1237191 937400 900276 1492785 1245875
13840 1245875 951829 816461 1126603 1386411 1275880 1175482 1126186 973267 864069 1047832
13830 1047832 1089014 915090 981937 1089532 1053547 1142412 1164993 1072737 906406 799437
13820 799437 965091 865255 1458192 1032813 1146894 1165410 1097835 773008 1018902 1092730
13810 1092730 994709 875131 1331719 959599 769585 774626 719593 752061 1001998 920018
13800 920018 810681 721796 998657 1108153 812158 986426 1195650 727952 807586 1004625
13790 1004625 897186 944597 1034303 1123096 1022807 930044 1024802 993365 692421 736407 908745
13779I08745L3766l2636N5838j66962J31808k40696m219r6395J94617L5732j24387
13768F95211K18707k60670K04944J22584p9827R4920l45557K25572j38788L98575
13758A135671D84238N70511D32921L65965q05k12157J53819m4535O6677m471R388
13747G66802j37046L09715j01211K68876l22663k02043Q6074J11186j61512R6422
13737G14600n3262l23025M56117j8341l23125M36460C45734L30294r9849l7842
13727E38337n8325o5281K20836j6043J3128M7350n8409j66784N02886j98942N596
13716G64349l8723q4901j6617o7900l6287n2330J44943k9092J01816j79508B26873
13704D93022K04811l9009J06303j92147k0604j54992k113K26249K20510k24729
$$ plain form
13779 908745 942511 909875 965713 798751 930559 689863 685644 589249 783866 819598 695211
13768 695211 913918 653248 858192 980776 900949 995869 650312 875884 737096 1135671
13758 1135671 484238 1054749 432921 798886 798081 585924 739743 695208 761885 757414 766802
13747 766802 629756 939471 838260 1107136 784473 582430 668504 779690 618178 714600
13737 714600 661338 338313 794430 776089 452964 889424 345734 676028 576179 538337
13727 538337 480012 414731 635567 619524 632652 680002 621593 454809 957695 758753 764349
13716 764349 725626 640725 624108 556208 519921 467591 612534 583442 685258 505750 226873
13704 493022 697833 658824 765127 572980 552376 397384 395271 621520 842030 617301
13694F17301J1215C11469L63973r9916K9773l3119N3008j54970j59324J98799
13684E09693j23606K52573j14037K03682j33308N5838k65356L24769j83785A61707
13673F93959k77570K73651j57611r9029g644C31153J53675K19527l16192L4596
13663D22759L55021C84387R0330L1649j5817Q6550K6126B62994J27020K35038
13653F25052k92016L8549A76200L14635j99218M02534j08670k9581J38127j29841
13643E64186j03702B20676j1811p528J13615L66523j17717j00872M6459K78806
13633G88151A99444L63010j85324L04189C30991M54865m4246B80766N56607D18064
13622D20169P5010k03996L50761j98297J1933M7749j19653J28007B14603L94165
$$ plain form
13694 617301 628516 311469 675442 575526 605299 572180 625188 470218 310894 509693
13684 509693 386087 638660 524623 728305 594997 650835 385479 710248 526463 161707
13673 693959 416389 690040 532429 433400 -7644 331153 484828 704355 388163 422759
13663 422759 777780 384387 474717 506366 490549 577099 603225 262994 390014 625052
13653 625052 333036 371585 176200 490835 291617 694151 585481 555900 694027 564186
13643 564186 460484 220676 208865 201337 314952 681475 563758 462886 509345 788151
13633 788151 199444 562454 377130 681319 330991 785856 741610 280766 837373 418064
13622 420169 495179 291183 641944 443647 455580 503329 383676 511683 214603 608768
13612F08768k88154j31619J57503P7457J75236B73874J91238k0561P4929K962
13602E22442M1648k02434j70250L59013j28983r4857H2546M59311k7778q6642
13592D27437p554K73954j51176O7931k52888J29899J12608j34898j41976l0077
13582B93260r6686J54867l6413J80666M8575B44418K43772k41197A02721K8421
13572A31142J35719J40390H2542O24196A24119N19908i33B34661m7606q64N8377
13561B44568N3172q8878J8203a15410A46972J08933a65899C38434q7098J36887
13551C88223J29877B57453K65839q6804k09508p4799L17276j83106l6324J47041
13541C97068j06213L81118k15461q9212j34198J48345j9444p8962r1407L81748
$$ plain form
13612 608768 320614 188995 346498 423955 599191 273874 465112 444551 519480 522442
13602 522442 564090 361656 191406 550419 421436 326579 82546 541857 514079 427437
13592 427437 419883 693837 542661 610592 357704 487603 600211 465313 323337 293260
13582 293260 196574 351441 315028 495694 544269 244418 488190 246993 102721 131142
13572 131142 266861 407251 82542 706738 124119 644027 -933 234661 187055 186191 244568
13561 244568 297740 208862 227065 -115410 146972 255905 -165899 338434 251336 388223
13551 388223 518100 257453 523292 436488 226980 152181 469457 286351 250027 397068
13541 397068 290855 671973 456512 367300 233102 381447 362003 283041 191634 573382
13531E73382B63470O8147J32134a16281C25032A37397M22278q0636l5206j15767
13521C28066L52063A59228K18456m2811K5366j29986o2870J38371q4072N9056
13511B80738j17351M9359a2742B85832L15745k93775n0459j18389L43136j68482
13501C13608J21878j16986q1687M7462J20990j10301k0712K5709P5390A72797
13490E00415k06236J04069j05286n0451j19918J68963J05692c89B30960N2630
13480B83590O9840J19011b12220B83193m306K06388k01696J99252A53254J26143
13470B79397j30190k6216E438M50857B14733P3847p6895F0715L18930A84393J85024
13459C69417n8066f3936E12648j98210K34862j01073k20076n9222d8584B66137
$$ plain form
13531 573382 263470 331617 463751 -116281 325032 137397 559675 479039 443833 328066
13521 328066 680129 159228 377684 334873 360239 230253 167383 305754 221682 280738
13511 280738 163387 212746 -12742 285832 601577 307802 257343 138954 482090 313608
13501 313608 435486 318500 236813 284275 405265 294964 274252 299961 375351 172797
13490 500415 294179 398248 292962 242511 122593 291556 397248 -389 230960 283590
13480 283590 353430 472441 -212220 283193 278887 485275 283579 482831 153254 279397
13470 279397 149207 122991 5438 456295 214733 288580 211685 60715 379645 184393 369417
13459 369417 311351 -63936 512648 314438 549300 448227 228151 168929 -48584 266137
13448A29244K1822J29700d9969a7461C220Q1145K38452C8627N2977l2255K57947
13437C17296j45071b33564A29986K34196L82357l72259r2857j07815a4957B71297
13426B13162a07638B52194A18362P2771I162N9271k702K87603q2583J4259K23515
13415E08525B40637R1949A31267O5670a69865B39299j291l2322N444C9819K08149
13404B47968A04181i016E94293A35599L25399B20495G8904M4463O2529J58361
13394C44257q8435a3717C74549k6069A70892L7939F7630J72551A9801b30953A19722
13382b45820A49697o9818J79256c9917B31155m2213J19102J18494c1385B99028
13371B8552J20294K66093K1531A47585R5334Q6711r9645P8973A467K58557H4857
$$ plain form
13448 129244 151066 280766 -49969 -17461 3220 84365 322817 38627 91604 59349 317296
13437 317296 172225 -233564 129986 364182 746539 374280 281423 173608 -14957 271297
13426 213162 -107638 252194 118362 191133 9162 68433 65731 353334 270751 285010 508525
13415 508525 240637 332586 131267 196937 -169865 239299 238008 205686 211130 39819 247968
13404 247968 104181 -9016 594293 135599 460998 220495 78904 123367 185896 344257
13394 344257 255822 -13717 374549 348480 170892 208831 67630 240181 19801 -230953 119722
13382 -245820 149697 79879 259135 -39917 231155 188942 308044 426538 -31385 299028
13371 28552 148846 414939 436470 147585 242919 329630 229985 308958 1467 260024 84857
13359C95126A40433J7462L18236B1642J89029j442L753H7822J48121J7271K51030
13348E04244B23891M6176K2185o9137K81263A19737R1996j01718J97759I6603
13337A74873D5775J56550H6619M56123k33666K66082k20340J63681j05117j78849
13327B34533K97262j43553J3580p0505A25667L06689j19571p4772L56959A82740
13316D22849q7221m3115a89539B0624M32560j94787p9330K58624A14313J46167
13306B60480K6488J99694B06649L96545B66631D2254K12972O7679j12490A4811
13295B54324K82727a98987D66428o1411J85399k52989M1388A41164P7810F2524
13284B12464o2519J13556l0020r4896K5936i1501m5506C85751j41912L07294B29550
$$ plain form
13359 395126 140433 157895 476131 21642 210671 209229 212982 87822 235943 253214 504244
13348 504244 223891 270067 292252 223115 504378 119737 211733 110015 307774 96603
13337 174873 45775 202325 86619 542742 309076 575158 354818 518499 413382 234533
13327 234533 531795 388242 401822 331317 125667 432356 312785 238013 594972 182740
13316 422849 335628 292513 -189539 20624 453184 258397 179067 437691 114313 260480
13306 260480 286968 486662 206649 603194 266631 42254 255226 322905 210415 14811
13295 254324 537051 -198987 466428 405017 590416 337427 378815 141164 218974 62524
13284 212464 149945 263501 233481 138585 164521 -91501 -137007 385751 243839 551133 229550
13272B47796j03949A9218d5928B8581f2793n529o4631B06002I2080J5853K36259
13261C44192r5359O1729J18653b28420R4099G2547J59691K39885B4295l664b46822
13249C88665d859B87855b7899A44786L25249e9685C80722A63628K2594M1581A5785
13237D199O5742b58885B61583k1227N8459c1975C0344N0856M4389J39410a33775
13225B06754e9669m3867F2189a63013m3208C69578i6086A85748B1459R8734J30516
13214B50709C2742N9683L6674M8450a18950C13006C5503J06951K51991A19357
13203H0620J7257d9023h801l13k66468n8357A68553a02111B21749a65375F4058
13191B04705K4847g0904R51k6034C2145f2745A39856A6642J75580l4354b00349
$$ plain form
13272 247796 143847 19218 -45928 28581 -62793 -68322 -132953 206002 92080 107933 344192
13261 344192 248833 310562 429215 -228420 -134321 72547 232238 472123 24295 20631 -246822
13249 388665 -4859 287855 -27899 144786 470035 -59685 380722 163628 186222 227803 15785
13237 4199 69941 -258885 261583 240356 298815 -31975 30344 81200 125589 264999 -133775
13225 206754 -59669 -103536 62189 -163013 -206221 369578 -96086 185748 21459 120193 250709
13214 250709 32742 92425 129099 177549 -118950 313006 35503 142454 394445 119357
13203 80620 97877 -49023 -8801 -9114 -275582 -333939 168553 -102111 221749 -165375 64058
13191 204705 229552 -70904 -69953 -95987 32145 -62745 139856 16642 192222 157868 -200349
13179B15913h0956A92074C5472J31762H981K77701A32580n7895k4016e8750B15697
13167b24462e6299F0034c8563B79247A39197b58496G6357M229K35289A730J4965
13156A6695J52041c7368o3545A11170a42642A64977K7163Q3473q4007M0583H4795
13144a38437A66002b6877n7846A93194a86730i836A01124m4874L7290Q9855a408
13132A7173a49171B45304K6970n1092i2171j58921A71331p5150Q4608r011N0301
13121B22079r334j0578l7856a1145D5334B0656b63195A20666b18310C51215A14639
13109B66496F0746b69699D16805d3652I3363M9473a34280B1169K34118a11929
13098B14360a49312C07191A40471J8920R6459K24398b71282d1499E4982K41345
$$ plain form
13179 215913 -80956 192074 35472 167234 8981 286682 132580 74685 50669 -58750 215697
13167 -224462 -56299 60034 -38563 279247 139197 -258496 76357 80586 315875 1730 16695
13156 16695 168736 -37368 -100913 111170 -142642 164977 192140 275613 191606 232189 84795
13144 -138437 166002 -26877 -84723 193194 -186730 -9836 101124 56250 93540 183395 -1408
13132 17173 -149171 245304 272274 221182 -92171 -251092 171331 96181 180789 171778 222079
13121 222079 212745 202167 164311 -11145 45334 20656 -263195 120666 -218310 351215 114639
13109 266496 60746 -269699 416805 -43652 93363 142836 -134280 21169 255287 -111929
13098 214360 -149312 307191 140471 159391 255850 480248 -271282 -41499 54982 296327
13088B96327a38081L1380e662A02582f2045j96082F2064O4342b4544l9673A54016
13076B61193I2981J7934k0727Q2323b65312A589d2504k42784a27457A01491b88057
13064d01846A33830a28355L5969B43045A01147K3882j4750K5875d8848A15693
13053a59887C41161a61728J8390H9269Q416K41238a16267h345p725C73944a18580
13041A0256O9399j1790k742K15420P3933j31014c1094j38759A921O4482K62695
13030C29098D8041J12206G5548a41123H7140J12371K600K48685A18065h3519L5547
13019d7972C74463A39232K50773A07307a07539C80179f6789D1635J7638b00929
13008C66175A43725J36843i006B76256A8120J95080J34102A65254a83009A63720
$$ plain form
13088 296327 -138081 -106701 -5662 102582 -62045 -258127 62064 126406 -24544 -64217 154016
13076 261193 92981 110915 90188 172511 -265312 1589 -42504 -285288 -127457 101491 -288057
13064 -401846 133830 -128355 -92386 243045 101147 125029 110279 136154 -48848 115693
13053 -159887 341161 -161728 -143338 89269 97685 338923 -116267 -8345 -16070 373944 -118580
13041 10256 79655 67865 65123 280543 354476 223462 -31094 -169853 1921 66403 329098
13030 329098 48041 160247 75548 -141123 87140 199511 202111 450796 118065 -83519 -47972
13019 -47972 374463 139232 390005 107307 -107539 380179 -66789 41635 59273 -200929
13008 366175 143725 280568 -9006 276256 18120 213200 347302 165254 -183009 163720
12997A61756l0918a22404e5432B65167E6089A1661a28739C51057j56961K08543
12987D02639h5975L8845K257r2463j82054a14421j15710B8867J26367O1766a36885
12975h5841B7543J00156a6476k49918B52655a20527J6568d1368B58218D3203J3949
12964E7152Q2196a9197A74502J10269a32813D8573N4411B2638P988K4575A0244
12952B10506L0821b4616a792o2821j38655A17016D6216A5532K25287P7903A3329
12940h9044J3490J1159c216p0155j22398h660k8815A50506a11053c1390E15114
12928G5936Q1889b62450a18983l4758B49245i723j88323Q3060B17140C2249L7872
12917G0121L8056g8033B83549B0528q778r33b50299H0862i0201e295l6987j8514
$$ plain form
12997 161756 130838 -122404 -55432 265167 56089 11661 -128739 351057 194096 402639
12987 402639 -85975 -47130 -44873 -137336 -319390 -114421 -230131 28867 155234 217000 -136885
12975 -85841 27543 127699 -16476 -266394 252655 -120527 -103959 -41368 258218 43203 57152
12964 57152 139348 -19197 174502 284771 -132813 48573 102984 22638 30626 55201 10244
12952 210506 241327 -24616 -1792 -64613 -203268 117016 46216 15532 240819 318722 13329
12940 -89044 -75554 -64395 -3216 -73371 -195769 -8660 -37475 150506 -111053 -31390 515114
12928 75936 157825 -262450 -118983 -153741 249245 -9723 -198046 -114986 217140 32249 70121
12917 70121 108177 -78033 283549 20528 11750 10817 -250299 80862 -90201 -5295 -42282 -60796
12905f0796r2667A47387b02736C21847A52751a84673A62375F5646a95796C57M48633
12894D48990d17858C9171g8133A43601J72824C0620L13099F7105a07632E1618
12883A28003K2327Q3163G9637J82111r9118p5676c76326C5308R7876b2905B54821
12871h3584A87254F5379J3800a26651A30966E924d98138a46369B90563b31775
12860g9431e921j6777A33370a45927e9750A25468a8459A94471D1708b44946a5209
12848b3928q1045j32246f2867q0919B6043P2715f6514b5923A08127m6056Q6261
12837A48332b81320A73933a42042A93591a61866A59146A4713K73994E1156b5285
12826a97183F3742M669O5495a87371C86427e700m70727A58673a09600q6315A27381
$$ plain form
12905 -60796 -153463 147387 -202736 321847 152751 -184673 162375 65646 -195796 357 448990
12894 448990 -417858 39171 -78133 143601 316425 30620 343719 67105 -107632 51618
12883 128003 150330 233493 79637 261748 162630 86954 -376326 35308 133184 -22905 254821
12871 -83584 187254 65379 79179 -126651 130966 5924 -498138 -146369 290563 -231775
12860 -79431 -5921 -22698 133370 -145927 -59750 125468 -18459 194471 41708 -244946 -15209
12848 -23928 -104973 -237219 -62867 -143786 26043 98758 -66514 -25923 108127 62071 148332
12837 148332 -281320 173933 -142042 193591 -161866 159146 14713 288707 51156 -25285
12826 -197183 63742 68411 133906 -187371 386427 -5700 -476427 158673 -109600 -195915 127381
12814A60008a4695k9600C4971J11310o207J544F8628P153c40127F2509b05505
12802b72481C17545A00095i6099b360j01352o5365e807k4063A21402K71507c0061
12790a29286B5644N6098B968c31871I3172b19125Q4565d5869b1165I1476f4012
12778a81394A33526a21057A21224m6517A8438L29948c006j4770C2250e8931R268
12767d9663A17247J841a92211B82153a81745O4086A97444d78143A19657g1671
12756C57231d4402l6318r4137D7651a32736d2193j28215A94904L695a54729C53339
12744B28805J59096f1551H0599f0596I5464D5398a89219Q951d5150k52098g0136
12732C78470A61323M3973c0218c505j99910f0703p9533n4622D84444B05316H926
$$ plain form
12814 160008 -14695 -44295 34971 146281 140074 141618 68628 75781 -340127 62509 -205505
12802 -272481 317545 100095 -96099 -2360 -103712 -169077 -5807 -29870 121402 392909 -30061
12790 -129286 25644 81742 2968 -331871 93172 -219125 -134560 -45869 -21165 91476 -64012
12778 -181394 133526 -121057 121224 74707 18438 348386 -3006 -17776 32250 -58931 -49663
12767 -49663 117247 119088 -192211 282153 -181745 -117659 197444 -478143 119657 -71671
12756 357231 -44402 -80720 -174857 47651 -132736 -42193 -170408 194904 198599 -154729 353339
12744 228805 387901 -61551 80599 -60596 95464 45398 -189219 -180268 -45150 -297248 -70136
12732 378470 161323 205296 -30218 -3505 -203415 -60703 -140236 -194858 484444 205316 8926
12720b02576D2276d4942j6110j7797B81956j14547i8850j2258I9962b4988A2775
12708b9588j61026A04384a29287A9589c77170e2063J0062D8043a47281B18030
12697B35890a06717B99455I8339l0301K42713q8166G6990M39788j37946k2582
12687C56250A49616a56463C12812C3304R994d5495A11301a13464c0133A09436
12676B9333N9694b15725B32937q0850E9277d3901j23351L0163p5236A93633E3707
12664D18931D5543K61472A31412M77726a82215k07502A46765L6109b49319B57665
12653a01213k22570C939J73928K76992k13929e6595A26893a46352D3090J4418
12643E7508p029Q0282c40557G9056J40259A02876J41795b54287A10405J78343
$$ plain form
12720 -202576 42276 -44942 -61052 -78849 281956 167409 -98850 -111108 99962 -24988 12775
12708 -29588 -190614 104384 -129287 19589 -377170 -52063 -42001 48043 -147281 218030
12697 235890 -106717 299455 98339 68038 310751 222585 76990 516778 378832 356250
12687 356250 149616 -156463 312812 33304 43298 -45495 111301 -113464 -30133 109436
12676 29333 89027 -215725 232937 152087 59277 -43901 -167252 -137089 -212325 193633 53707
12664 418931 45543 307015 131412 609138 -182215 -389717 146765 182874 -249319 257665
12653 -101213 -323783 3939 177867 454859 240930 -56595 126893 -146352 43090 57508
12643 57508 50479 130761 -340557 79056 219315 102876 244671 -254287 110405 288748
12633B88748I7850g8182m3103A06802l0239L13452a08711D7803e254A58288c5611
12621A335R0589J723l9395K0132J53715H3216K91381A72319J97026A57468J93499
12610C50967H520K50208l6106P5525H0339m172f1259D0205K14580G8634K10012
12599B88646Q4903A71753G3196f1658o2777C28337a44395E54980b24885j2620
12589b37505C837c19538A14954R3466M5314l2169d3231D61514A51325g1754A73392
12577A92192f9916j29327f8184B3632G463K7968J70816f37A14965J23464A18829
12565g9721C07522B5936J31783J76029b9050A32641C9679D564c6987I7685d5955
12553I2894R8167H2754d5775Q984D51030h7948j01763e6579A7011h3158L3446
$$ plain form
12633 288748 97850 -78182 -121285 106802 76563 390015 -108711 47803 -5254 158288 -35611
12621 1335 91924 93647 54252 74384 228099 83216 374597 172319 369345 157468 350967
12610 350967 8520 258728 222622 298147 80339 76167 -61259 40205 254785 78634 288646
12599 288646 373549 171753 73196 -61658 -124435 328337 -144395 554980 -224885 -237505
12589 -237505 3837 -319538 114954 208420 253734 221565 -43231 461514 151325 -71754 173392
12577 192192 -69916 -199243 -68184 23632 7463 35431 206247 -637 114965 238429 118829
12565 -79721 307522 25936 157719 333748 -29050 132641 39679 4564 -36987 97685 -45955
12553 92894 191061 82754 -45775 -36791 451030 -87948 -189711 -56579 17011 -83158 -49712
12542d9712m5562A54456b87659a10428g446D1163J36307a76383C3221h4376C4495
12530I5570i0550B37521g3262D4022b58659j84412C21863b08357B49523b3986
12519A8755L46850a02211j9579E7744a19717A30971l5656A049c39184J31524B0271
12507a96740e5298A598a75776C8958J31931J26250g3291K2456F6235a82683Q0864
12496a01819H6353L2116L32639A29084Q7574k6943c17695A38309A7147O3769a13007
12484b52780g6166A63048l5784c50195C96094a30756C31476c3069k40940e6022
12473C998J45838D883L02917j6805a28178l7432A92965D4935J28352B284J78875
12462A81159l8585D1869K26709A13778J81404I722J53656j8282J5153G3850J03089
$$ plain form
12542 -49712 -95274 154456 -287659 -110428 -7446 41163 177470 -176383 33221 -84376 34495
12530 95570 -90550 237521 -73262 44022 -258659 -443071 321863 -208357 249523 -23986
12519 18755 365605 -102211 -121790 57744 -119717 130971 95315 1049 -339184 -207660 20271
12507 -196740 -55298 1598 -175776 38958 170889 297139 -73291 -50835 66235 -182683 -101819
12496 -101819 86353 118469 451108 129084 216658 189715 -317695 138309 17147 80916 -113007
12484 -252780 -76166 163048 127264 -350195 396094 -130756 331476 -33069 -274009 -56022
12473 3998 149836 4883 307800 290995 -128178 -165610 192965 44935 173287 2284 181159
12462 181159 142574 41869 268578 113778 295182 9722 163378 145096 160249 73850 176939
12451A76939J31431B4403a41844A69484R1584b26896I6726L6065F2316b3551j20448
12440a43999C5457a1046H9530b19551H5291L975B367J90227K8974j03288K50889
12429C69169b21344c0706l27417C6557J59108D8623a9494A13217a63309j21996
12419b85305F8218M10648B31762J0590J07089A02297b8513p4783A41686C1378
12408A83187j4053L0318c00268a39935A65964d11880A93670g8505r143K0697n01
12397f7452E7661J36729a24846A18898J1893J31664A2121M0771R8138a90614Q1365
12386a09249J3091J3217k1726d6245A27134b35342H3736C4375b05665c2803C11895
12374B97616a80709E0889c13563B48910G8027a1453A33062D1833J30925Q2441
$$ plain form
12451 176939 308370 24403 -141844 169484 261068 -226896 96726 132791 62316 -23551 -143999
12440 -143999 35457 -11046 89530 -219551 85291 89266 2367 192594 221568 118280 369169
12429 369169 -221344 -30706 -358123 36557 195665 48623 -19494 113217 -163309 -285305
12419 -285305 68218 478866 231762 242352 349441 102297 -28513 -103296 141686 31378
12408 183187 169134 199452 -300268 -139935 165964 -411880 193670 -78505 -87648 -66951 -67452
12397 -67452 57661 194390 -124846 118898 130791 262455 12121 52892 151030 -190614 -109249
12386 -109249 -96158 -82941 -104667 -46245 127134 -235342 83736 34375 -205665 -32803 311895
12374 297616 -180709 50889 -313563 248910 78027 -11453 133062 41833 172758 255199
12364B55199n7298J41827A64345d2300D0980c19837A36373a17948b9418G3914
12353b73138G3758a13392C1348b470G0248a570A80569M1303d8961n2994M6198
12342e5757A68342k8212b25222d2846o8758C34937a6409j73332o8616R0675D14925
12330a66205L3582B92871f7017E39778E4166f3174I9237M8445c3846j30604B5037
12318a63467D1215J36085l6217J03774A16756J52721C472L76216H7166R6851J15821
12307B99838K07388D114Q6556K72763j6607A65371O7562m0926m4810E2569J88576
12296B41145a07258A64727L9941Q2600C2210J0117K51263B8093O894e074B2388
12284b07293F329K48751j08385n4748R6125J5158b8216B32691h6321r0482B82620
$$ plain form
12364 255199 197901 339728 164345 -42300 40980 -319837 136373 -117948 -29418 73914
12353 -273138 73758 -113392 31348 -2470 70248 -1570 180569 221872 -48961 -101955 -55757
12342 -55757 168342 140130 -225222 -42846 -111604 334937 -16409 -189741 -258357 -167682 414925
12330 -166205 -132623 292871 -67017 539778 54166 -63174 99237 147682 -33846 -164450 25037
12318 -163467 41215 177300 141083 244857 116756 269477 3472 379688 87166 184017 299838
12307 299838 507226 4114 90670 363433 346826 165371 232933 192007 147197 52569 241145
12296 241145 -107258 164727 204668 287268 32210 42327 293590 28093 34987 -5074 22388
12284 -207293 6329 255080 146695 91947 188072 203230 -28216 232691 -86321 -176803 282620
12272G5092l1380J26226o41J98547m3322a72998M9566A88305J34921j51329J5649
12261A87546M6226A11825B4120J63443p0745J02219F8281b61832I3590b16560
12250i6344C88185A77864a19828A78448K05643D5286L08246p8588k2521a5535
12239H2468J17569K945E1107j3475R3624O6273M4901Q5561q1858r2450k6330J97519
12227C24872a71362M4340D27293r0720A21919e6817G2354l1548L6281d2909A96221
12215B45343o6002p9597N16a67328B66042m6010K1301M8580N5269L18439j06738
12204E56883B64313J2473C2576J20938K45726j85122n9629h445C46271R1436F3896
12192C20664d8406A53164i7462G3205a67057C31397j21926a05018j94514C26792
$$ plain form
12272 75092 43712 169938 169297 367844 324522 -172998 -123432 188305 323226 171897 187546
12261 187546 233772 111825 24120 187563 116818 219037 68281 -261832 93590 -216560
12250 -96344 388185 177864 -119828 178448 384091 45286 353532 274944 252423 -15535
12239 82468 200037 202982 51107 37632 131256 197529 242430 327991 246133 153683 127353 324872
12227 324872 -171362 -127022 427293 336573 121919 -56817 72354 40806 77087 -42909 196221
12215 245343 179341 99744 100260 -167328 266042 220032 241333 289913 345182 663621 556883
12204 556883 264313 276786 32576 153514 399240 214118 154489 -8445 346271 437707 63896
12192 320664 -48406 153164 -97462 73205 -167057 331397 209471 -105018 -299532 326792
12181C66046J1860j46841a59823E00629j76831Q6077A97395L4776j6539K76734
12171D92366N6989k64746q4407j1855K98169A87446L9991G6665L07039a26319
12160C57365o0707J43369l9072j63965J94933A68049g1094H1848M38139j18072
12150D01915K7561O2428A85980L84716a5919B00738j2328P3326G0885J64864F787
12138g6442B94761a77791C54182c673A47536b47834D4290J57080b43137F667M4665
12127E1332a06442A14222J52555a05186C42980A02370j7046B0331g1619A56676
12116G0729L53578j42008J91002a24367B67763J09450j52239H6272N6836J65813
12106C08921p565G2608O0584k7363K04221j41690J25900F8432M40467A3634a99624
$$ plain form
12181 366046 377906 231065 -159823 500629 323798 409875 197395 232171 215632 492366
12171 492366 549355 284609 200202 188347 486516 187446 227437 76665 383704 -126319
12160 357365 296658 440027 400955 236990 431923 168049 -71094 81848 519987 401915
12150 401915 429476 491904 185980 570696 -15919 200738 188410 261736 70885 235749 6787
12138 -76442 294761 -177791 354182 -3673 147536 -247834 44290 201370 -243137 6667 51332
12127 51332 -106442 114222 266777 -105186 342980 102370 85324 20331 -71619 156676
12116 70729 424307 282299 473301 -124367 267763 377213 224974 86272 143108 308921
12106 308921 301356 72608 133192 105829 310050 168360 294260 68432 508899 13634 -199624
12094B7305P1859m4420L15022a88370A60733J93255A71439C1873K71859j06486
12084A97246F4742K37099F631e2101D5863O6044E4225K3703J00171e049k27982
12073b33031e6649A31841f4281I7133P1572b73804C71798H0743b92671R7129B30970
12061c3813A14203j5749J59154d0670A41806J62183K4207A05836J58512B8524
12050A70186n0003b19D29533j83390D3633b67885J07281o0973A92236D5057a41170
12038g2492k7874A93959d8854B7382r847K52150i097n6636A80906b68954G1412
12026d14450A69376A5152d2190A69339p6348b63467J10359k9594b3939A56935
12015B5047L41637f2706H4482J94855A38883b38578F8435j1223J66244n2612o7506
$$ plain form
12094 27305 99164 54744 369766 -188370 160733 353988 171439 31873 303732 197246
12084 197246 64742 301841 6631 -52101 45863 111907 54225 77928 178099 -5049 -233031
12073 -233031 -56649 131841 -64281 97133 168705 -273804 371798 80743 -292671 -195542 230970
12061 -33813 114203 98454 257608 -40670 141806 303989 328196 105836 264348 28524
12050 170186 120183 -219 429533 246143 43633 -267885 -160604 -221577 192236 45057 -141170
12038 -72492 -100366 193959 -48854 27382 17535 269685 -9097 -65733 180906 -268954 71412
12026 -414450 169376 15152 -42190 169339 92991 -263467 -153108 -182702 -23939 156935
12015 25047 366684 -62706 84482 279337 138883 -238578 68435 57212 223456 170844 103338
12004A03338m5080a60125B10311O036a45322D4900N308K29271o6578I6733H976
11992b76002j5431a32432C94457E0782c1092j2093I7967k1413J71171N029A04226
11980a6178C05295d84848F4004P0632c03025D5929c15136A43842h653j83471j08857
11969c00981B11555b30631h5628C23033H7718Q6155p383G4111a58963M305H0173
11957a11438r5800P9381J8283k13733J32597E8241a97758J2257C84891A75455
11946a08359C24057a71805O9091B02171i7076b0850E3030b14224l50484A53598
11935B45394d4339j472n7174j6654j26929i9184B60488C6689f8940G9612J17262
11924A96874a49350e0669A53527b58063a16171m7367G8364J31167A00079K50873
$$ plain form
12004 103338 58258 -160125 210311 216347 -145322 44900 50208 279479 212901 96733 8976
11992 -276002 -291433 -132432 394457 50782 -31092 -43185 97967 76554 247725 252754 104226
11980 -16178 305295 -484848 64004 134636 -303025 45929 -315136 143842 -8653 -192124 -300981
11969 -300981 211555 -230631 -85628 323033 87718 173873 166490 74111 -158963 -154658 80173
11957 -111438 -207238 -127857 -109574 -323307 -190710 58241 -197758 -185501 384891 175455
11946 -108359 324057 -171805 -102714 202171 -97076 -20850 53030 -214224 -564708 153598
11935 245394 -44339 -45811 -102985 -119639 -246568 -99184 260488 36689 -68940 79612 196874
11924 196874 -149350 -50669 153527 -258063 -116171 -163538 78364 209531 100079 350952
11914C50952A64067o2521g1084j24077G0499l335b6360b588l7233n3561o4117
11903a57499A3535J260d4995B54454A11401J9908L0950K180D0590r345g7202A49839
11890B15207a39414k24172G7261L7419n0811g093l60236B02392J6835c80208A01966
11878G2450a68892C33260B7426J03207b27298j83061b9928A65454C6158b2806
11867I7692b74710i6508C2802p621a02898b6129k2551H6773b33439l471i9411
11855B7470J71951I3590a65291c9020j68465H8541b86856J785g6327k0053k37445
11844c33825A85552a58207k1690B72035j12356c5750l2263K2534A0952L08910
11834C19862G9416b25115N4484B05176G524b29954B66193a86361e8057j60398
$$ plain form
11914 350952 164067 101546 -71084 -195161 70499 67164 -26360 -2588 -39821 -93382 -157499
11903 -157499 13535 14795 -44995 254454 111401 131309 162259 164439 40590 31245 -77202 149839
11890 215207 -139414 -363586 77261 114680 63869 -7093 -367329 202392 219227 -380208 101966
11878 72450 -168892 333260 27426 130633 -227298 -410359 -29928 165454 36158 -22806
11867 97692 -274710 -96508 32802 25181 -102898 -26129 -48680 86773 -233439 -236910 -99411
11855 27470 199421 93590 -165291 -39020 -207485 88541 -286856 -285071 -76327 -96380 -333825
11844 -333825 185552 -158207 -179897 272035 159679 -35750 -68013 -45479 10952 319862
11834 319862 79416 -225115 -170631 205176 7524 -229954 266193 -186361 -58057 -218455
11824b18455K5180b5252o4791k73608H2696K913b11779A95804d1659E4548b53903
11812B91314b73117J08340B0240L16372r7463p6292k4247O5540i4452j78354a24484
11800E0635J00934O9352H0724a60860K361B06309b11651G34b17490A16299i1358
11788c0594Q613B35359b16998B70034a49315E0664a37180j1002j75231d8904j51353
11777b00257Q8025a9649D7490k1990K0319J6776a62542b8562j11385d8013j89287
11766b37300D7969b791j55175A01228D978c58765B09004a81071H9901A9685J58614
11755A78299c18703A791K5558a82957G6131M4953h95C55233j30703c1823j04228
11744a36051j97459G3252K1210h7465D7392L2958K2764b52873j2548j20862A65651
$$ plain form
11824 -218455 -193275 -25252 -90043 -363651 82696 85609 -211779 195804 -41659 54548 -253903
11812 291314 -273117 -164777 20240 336612 239149 162857 138610 204150 -94452 -272806 -124484
11800 50635 151569 220921 80724 -160860 -158499 206309 -211651 734 -217490 116299 -91358
11788 -30594 -21981 235359 -216998 270034 -149315 50664 -137180 -148182 -323413 -48904 -200257
11777 -200257 -112232 -19649 47490 25500 45819 62595 -162542 -28562 -139947 -48013 -237300
11766 -237300 47969 -2791 -157966 101228 4978 -358765 209004 -181071 89901 19685 178299
11755 178299 -318703 1791 27349 -182957 76131 121084 -895 355233 224530 -31823 -136051
11744 -136051 -333510 73252 94462 -87465 47392 80350 103114 -252873 -265421 -386283 165651
11732B65883c35945B66171I0294a05855L1302a6788A72251a01815c4840A2447
11721A60232o7115k2488a08135D1841j9785c27317A65992a33867q5803R9548K1881
11710i8241C2660K79927F5296J9990f141D0636a1346C9631j735K8313N9746c14480
11697F1766J45325e1069A44369J25626F2351L559K41454R9088F2806a36498C81549
11685F4150a30694A50930h5211C1136J2752Q9387b39741g9149I2639O1060M1701
11674A95400D9598f7689k8607B10773c2006e273B70871C0831K72566C4908N427
11663D0335J43516a64272k3509e1358b4918B65743F0176N6913Q8127h2853j28795
11652b11648N698J224E9644a05793D3895h9897A3017h4601K9815A13964c02856
$$ plain form
11732 265883 -335945 266171 90294 -105855 -74553 -16788 172251 -101815 -34840 12447
11721 160232 93117 70629 -108135 41841 22056 -327317 165992 -133867 -219670 -120122 -98241
11710 -98241 32660 312587 65296 85286 -6141 40636 -11346 39631 37896 66209 125955 -314480
11697 61766 207091 -51069 144369 269995 62351 65910 307364 406452 62806 -136498 381549
11685 64150 -130694 150930 -85211 31136 43888 133275 -239741 -79149 92639 153699 195400
11674 195400 49598 -67689 -96296 210773 -32006 -5273 270871 30831 303397 34908 40335
11663 40335 183851 -164272 -187781 -51358 -24918 265743 60176 117089 205216 -82853 -211648
11652 -211648 -205950 -204726 59644 -105793 43895 -89897 13017 -84601 -54786 113964 -302856
11640C00920j00902B506Q1635b14395A93391a25730p9285J6480I1641b43324M0451
11629b02873j9916D0841K78955b08340A85977Q7273c972k22564c6507a311I8943
11617b37276H4543N5710b32009C8392a68504A63705d07080A48906a25149H6829
11606H9741A3930a12443A76396e456k73589C97970A43582K0064b1052o7821j78971
11595b67844A22142R6047C711d8022L452I644a18128E1048N4027c08703B4641
11583a03274J3735A74507b1875B56448A18074a5292C74976a59886k08683B3829
11572B38345g8486B49783d2001j12078g1958B20182a8242E3752L00906l5773B6878
11560D6509K02094a97444A67337a7408I4377g2188H8914b5669a109B92888g5550
$$ plain form
11640 300920 200018 2506 84141 -214395 193391 -125730 -205015 -188535 91641 -243324 -202873
11629 -202873 -222789 40841 319796 -208340 185977 273250 -3972 -226536 -36507 -1311 98943
11617 -237276 84543 140253 -232009 38392 -168504 163705 -407080 148906 -125149 86829
11606 89741 13930 -112443 176396 -5456 -279045 397970 143582 163646 -21052 -88873 -267844
11595 -267844 122142 218189 3711 -48022 -44570 9644 -118128 51048 105075 -308703 24641
11583 -103274 -89539 174507 -21875 256448 118074 -15292 374976 -159886 -368569 23829
11572 238345 -78486 249783 -42001 -154079 -71958 220182 -18242 53752 354658 318885 26878
11560 46509 248603 -197444 167337 -17408 94377 -72188 88914 -25669 -1109 292888 -75550
11548B06687k0907a18756c1225C4448K43918b6567B1979f4702B4982J89398a58686
11536h4895j29587i1162A0734a7872A62420K8359a89832A9161g9219a4660A04520
11524a46894A6129J10210a2400C30327d744D452J3568R048c2969k16320A88455
11512A73594d3097B68991D9934d382C2658N3491f810k0995I4597c284B51066F1230
11499G6529q739K15150O9463A61109J0359c1230C35552j16671J52269a42203C74218
11487B78027L07193j87686k9035A05377K25438B2692a30941G4484J4117a1335
11476A64223g3687C45206j27235k1490E8383K34518O7329m33j6192k076j25880
11465B15649c23680A57903l8548n3198f0704B49877j19515J7464K77054a34146
$$ plain form
11548 206687 185780 -118756 -31225 34448 278366 -26567 21979 -64702 24982 214380 -158686
11536 -84895 -214482 -91162 10734 -17872 162420 190779 -189832 19161 -79219 -14660 104520
11524 -146894 16129 126339 -12400 330327 -4744 4452 18020 27068 -32969 -249289 188455
11512 173594 -43097 268991 49934 -4382 32658 86149 -6810 -27805 94597 -3284 251066 61230
11499 76529 67790 282940 352403 161109 171468 -31230 335552 218881 371150 -142203 374218
11487 278027 585220 397534 368499 105377 330815 22692 -130941 74484 88601 -11335
11476 164223 -73687 345206 217971 196481 58383 292901 360230 359797 343605 341529 215649
11465 215649 -323680 157903 119355 66157 -60704 249877 130362 147826 424880 -134146
11454B23128B0957Q1095a65402D22075C2073c3835B45835P9328d8867C77406a38005
11442a20147A21498A8342M09886I977b8101B39086B279d9283A47546h2591A34774
11430c9212B54734l5335g0243A80841J99406b85176Q2923D4966c6283C24599A4110
11418A0069L92017r303A02694q239M4809B6469K34447D82J09769h1749I704L72077
11406C81781G7050K06433C8366h3283b6495G2589M7914b8456A96425r65o319r4010
11394I5131a37537B70787A8672K7460d8574j2281l869A85566b49939k9014a04286
11382A27978o2829b36142A32702c8367C03511n7071J07935a43430M3048a6685
11371G1457a83762m9318B02596a16318l552k05204a37788C66302A73012D8011
$$ plain form
11454 223128 20957 102052 -165402 422075 32073 -33835 245835 325163 -48867 377406 -138005
11442 -120147 121498 18342 428228 9977 -28101 239086 2279 -49283 147546 -82591 134774
11430 -39212 254734 219399 -70243 180841 380247 -285176 -202253 44966 -36283 324599 14110
11418 10069 402086 392783 102694 94455 139264 26469 260916 482 110251 -81749 9704 381781
11406 381781 77050 283483 38366 -83283 -26495 72589 120503 -28456 196425 195460 189141 95131
11394 95131 -137537 270787 18672 46132 -48574 -60855 -64724 185566 -249939 -278953 -104286
11382 127978 65149 -236142 132702 -38367 303511 246440 354375 -143430 -100382 -16685
11371 71457 -183762 -233080 202596 -116318 -119870 -325074 -137788 366302 173012 48011
11360d3584A0171e363A87673a55406L2555I5910K12013a22562e0055C0794J89554
11349B20348h3579k02139D5573e00765A40511a74036j19034O13K589f9482B51569
11337I914g561E72818D4751F177c26116m9913a81652k26863a54397A79141f9286
11325A30529E2082b78847H7056b06329B64874r7472a06347j32895R4293R144E0982
11313B0928a52618c3740j36490E769J19214b08143n8925c8744k4616B80304R8146
11302C78450F2655d25545K02813j35994L908i4011a0818A00264J23879a16593
11291a37081G5853K05673e9448A61310a88785B52458j08083b620D8257a14950
11280b59877O3049g5030H0005l6348L04485d1446L994g192j38436J2876E5931
$$ plain form
11360 -43584 10171 -5363 187673 -155406 -122851 95910 307923 -122562 -50055 30794 220348
11349 220348 -83579 -285718 45573 -500765 140511 -174036 -293070 -292457 -289868 -69482 251569
11337 9914 -7561 572818 44751 6177 -326116 -376029 -181652 -408515 -154397 179141 -69286
11325 130529 52082 -278847 87056 -206329 264874 167402 -106347 -239242 -144949 -135805 50982
11313 20928 -152618 -33740 -170230 5769 124983 -208143 -267068 -38744 -63360 280304 378450
11302 378450 62655 -425545 -222732 -358726 -354818 -94011 -10818 100264 224143 -116593
11291 -137081 75853 281526 -59448 161310 -188785 252458 144375 -2620 48257 -114950
11280 -259877 -196828 -75030 80005 43657 348142 -41446 -37452 -7192 -145628 -132752 55931
11268b85436i6988d0641l05021J23412D4196g2060A92925b35281A02341a45585
11257A98404a49431A29620A7907h1125r430B48630D3367a82735f8451K6828k66500
11246c08123B09954B9921c12736g5900j10701d7178C4588a35730c5542j7511A27524
11234A34366c4242k02966C2076M8018a00717k57142a25635j2891c4044C6786f477
11222h9063j95937O0402A62654h0223a3975j06462A74128R584q2438j4804b25474
11210D70063a53356O5102m3702A2657a21701A59436a13444I4861a40722H0388
11199a51297m0984M6905A05523c24700P2963I5789e8556a9693D8770L02811E9840
11187E9233f8663j73310e8687r3358j06769d0295k58616g6708j10270j13392J01816
$$ plain form
11268 -285436 -96988 -40641 -345662 -222250 44196 -72060 192925 -235281 102341 -145585
11257 198404 -149431 129620 17907 -81125 -90555 248630 43367 -182735 -68451 -41623 -308123
11246 -308123 209954 29921 -312736 -75900 -186601 -47178 34588 -135730 -35542 -53053 127524
11234 134366 -34242 -237208 32076 80094 -100717 -357859 -125635 -138526 -34044 36786 -6477
11222 -89063 -285000 -224598 162654 -80223 -13975 -120437 174128 183712 101274 86470 -225474
11210 470063 -153356 -88254 -131956 12657 -121701 159436 -113444 94861 -140722 80388
11199 -151297 -192281 -145376 105523 -324700 -251737 95789 -58556 -19693 48770 351581 59840
11187 59233 -68663 -241973 -58687 -152045 -258814 -40295 -298911 -76708 -186978 -300370 -198554
11176a98554H4541J73089a90564k9138B8732a08108j08864j3923B39172m0319
11166A98853c41027b2153j60890A23622a24636e3701j72735E4238m298i6211p7347
11155a73558E622b96218a14015B5636c19512J33983A93817j0026l4765a64744
11144b01655G31K8713c88257P0507c8835A68671a55210D79128d41566B33263d0357
11132h9165O08q7111m3315j35050d3523K0126g052p3088L7500a3834G0595h8281
11119B03252l4378k2956K11852e1299l659D6416L4870K01034j39296h3307A23007
11107B89944G9729K58095J08577A64389b50684A20283K80318A88675P408a86205
11096B51166c2544o5900j55993A51056J54219p8466R3653A37204a9340B73477
$$ plain form
11176 -198554 84541 257630 -190564 -219702 28732 -108108 -216972 -230895 239172 198853
11166 198853 -341027 -22153 -183043 123622 -124636 -53701 -226436 54238 49940 -96211 -173558
11155 -173558 5622 -296218 -114015 25636 -319512 -185529 193817 183791 149026 -164744
11144 -201655 731 29444 -388257 -317750 -38835 168671 -155210 479128 -441566 233263 -40357
11132 -89165 -88557 -175668 -218983 -354033 -43523 -23397 -7052 -80140 -42640 -13834 70595 -88281
11119 203252 168874 145918 357770 -51299 -54958 46416 81286 282320 143024 -83307 123007
11107 289944 79729 337824 446401 164389 -250684 120283 400601 188675 196083 -186205
11096 251166 -32544 -98444 -254437 151056 305275 226809 320462 137204 -19340 273477
11085A43905J06249Q3986q3256G0553J13046B2549J83181a6963B43223N4697O1691
11074C59611j76082o2947K836n9629L48995j23671l0549m4542J01480J70639F1782
11062B79433M4980A16955K35734q4437J8952l9862K54599q8740r9391j49106Q6401
11051B51105Q886J51111K18099A09847M69317n134j16073O6950m8247M59597k27612
11040G08645m7954N6450J20550j50980J5099O0340K3407m8372l8721J90949M31229
11029A320642k47184j46465j22262O2433J50232k8000J97636m40991K76154k08786
11019H13409Q19669n09225p7751P788O382J7328K03384l83137J6478j63255k05601
11008E45469O71560l41122j45477L43167l43808Q5054K74658j09273P5979l28153
$$ plain form
11085 143905 250154 334140 250884 70553 183599 22549 205730 -16963 243223 297920 359611
11074 359611 183529 120582 123418 63789 412784 289113 258564 214022 315502 486141 61782
11062 279433 324413 116955 352689 268252 287204 247342 501941 413201 313810 164704 251105
11051 251105 259991 411102 629201 109847 579164 574030 457957 524907 476660 936257 708645
11040 708645 660691 717141 837691 686711 701810 762150 785557 737185 698464 889413 1320642
11029 1320642 1073458 926993 804731 867164 1017396 989396 1187032 746041 1022195 813409
11019 813409 1633078 1123853 1046102 1053890 1060272 1077600 1280984 897847 914325 751070 545469
11008 545469 1217029 875907 730430 1073597 729789 814843 1089501 980228 1056207 728054
10998G28054K09341j07750P4808k41806K16917k38305j65704K55090J26168j54109
10988G02704K78086j16188K36934l32509j59731K02375J07177k11996K69278k96962
10978F79168L4786o1833K70547J8493l86439M48261l0296J05849j6112j38687
10968I23737M24084k71147K92693k96910M39118j85728J6622K29450R6382J45506
10958A813807N9236M97461R5094K00650Q99260m56797O7276L07025J58720K18278
10948C860010m52533R7313m95866k18802k95440j18587l90330j70605j17846Q3027
10938A780341l6710j87639K85416l58567J09443p8760n05232O7146K85872l70130
10928I91180m16303l5888p682A16500J05819J00363M755D7924h4510A9490P2993
$$ plain form
10998 728054 937395 829645 904453 662647 879564 641259 475555 730645 856813 702704
10988 702704 980790 864602 1101536 769027 609296 811671 918848 706852 976130 679168
10978 679168 713954 652121 922668 941161 554722 1002983 972687 1078536 1062424 923737
10968 923737 1347821 1076674 1369367 1072457 1511575 1325847 1342469 1571919 1668301 1813807
10958 1813807 1873043 2370504 2465598 2666248 3565508 3108711 3175987 3483012 3641732 3860010
10948 3860010 3407477 3504790 3008924 2790122 2494682 2376095 1985765 1815160 1697314 1780341
10938 1780341 1743631 1555992 1841408 1482841 1592284 1513524 1008292 1075438 1361310 991180
10928 991180 574877 538989 531307 116500 222319 322682 327437 47924 -84510 19490 92483
10917I2483K98673A38524A2104e3467A17120a02038A07387m1337a24459E827Q3155
10906H8982a22695N0240A68270k5569D1890h6420A01922d31512Q6914J71051g326
10894B0150J20362J63328r8738c74155B50438q844h8563n9231B06657a87242A82752
10882h3126l9189F6779a69912l7553A79e474C2954a86513j41946a60314M0981
10871a19333D7905h5664o4480q0816a06816A27801C7819a60248j05988G3746C4188
10859a90020M8013j12936f4017n9841h683j1068m6322A60634a12303m2391I3954
10847a11562l93244b5153A52169b69294C66459c43724C05926b8722B96277j25927
10837A70350a61916A6617J10710o2142B9168J68746g5776G1140a01917d4978n7209
$$ plain form
10917 92483 391156 138524 12104 -53467 117120 -102038 107387 66050 -124459 5827 88982
10906 88982 -122695 -72455 168270 142701 41890 -86420 101922 -431512 -344598 -173547 -7326
10894 20150 140512 303840 205102 -374155 250438 241594 -88563 -147794 206657 -187242 182752
10882 -83126 -122315 66779 -169912 -207465 179 -5474 32954 -186513 -328459 -160314 -119333
10871 -119333 47905 -85664 -150144 -230960 -106816 127801 37819 -160248 -266236 73746 34188
10859 -190020 -142007 -254943 -64017 -123858 -8683 -19751 -66073 160634 -112303 -154694 93954
10847 -111562 -504806 -25153 152169 -269294 366459 -343724 305926 -28722 296277 170350
10837 170350 -161916 16617 127327 65185 29168 197914 -75776 71140 -101917 -44978 -102187
10826a02187A89080d69909A59185m0703n4387a3550r4702D87L14523C5763a7007
10814A88060F605c8B6941a571A51243O0558a14888l2722A16198d7462j75446F301
10801B13133D6628a12624B43243n5528a38181O7422A36974j8211B3954H69a39928
10789A63836b31016c4365k2547p9498G0313a03022K6253L2045A41091i7873D6583
10777E8150b98402D0793g4449E6826a38720l5935C7153a00600j8283a1343k49729
10766b61072g4023j06446k31294F0286k1908b10569B8978i248k02441b4161l34145
10755c58306a45806I8567a10691E20211k45651D2170P0611c52210j04144a88772
10744I2745a1839k26075C2683b09026o041P2133O7908k35247a09993G795e1509
$$ plain form
10826 -102187 189080 -469909 159185 118482 64095 -13550 -108252 487 315010 35763 -17007
10814 188060 6605 -38 26941 -1571 151243 211801 -114888 -147610 116198 -47462 -222908 6301
10801 213133 46628 -112624 243243 187715 -138181 -70759 136974 118763 23954 869 -139928
10789 163836 -231016 -34365 -56912 -136410 70313 -103022 -76769 -44724 141091 -97873 46583
10777 58150 -298402 40793 -74449 56826 -138720 -174655 37153 -100600 -118883 -11343 -261072
10766 -261072 -74023 -180469 -411763 60286 38378 -210569 28978 -9248 -211689 -24161 -358306
10755 -358306 -145806 98567 -110691 520211 274560 42170 112781 -352210 -456354 -188772
10744 92745 -11839 -237914 32683 -209026 -215067 -142934 -75026 -310273 -109993 7795 -51509
10732e6497k58402A47945b67625H1793a26442m59182A07529M9430a12258g47n2551
10721e3298l5536J4346m9097B84407m1371a16503M1735h032k37892j65583A56142
10709B71712n1936b52449B31313b69395e4373A51919b96426B0424h1632D5906
10698B69804b51636c2311o4280G2139b05533j411e9486E739J11571c17677a10188
10686b25916m0065N7333l4859J1147B04780b01858e5098k07331P857R3216k94498
10675d55854e7186A27348A4633b27171N5207h359k65896j89020G1161b28581E0051
10663a41578o0690m177d7631B91096l644a24777A9782a52779B47105b30183a01925
10651B35460d78783b26776c2654k71641J4128a15804C33372d7396J8923A78216
$$ plain form
10732 -56497 -314899 147945 -267625 81793 -126442 -585624 107529 156959 -112258 -747 -53298
10721 -53298 -88834 -74488 -123585 284407 243036 -116503 -74768 -8032 -245924 -411507 156142
10709 271712 219776 -252449 231313 -269395 -54373 151919 -296426 20424 -81632 45906
10698 269804 -251636 -32311 -96591 72139 -205533 -206944 -59486 5739 117310 -317677 -110188
10686 -225916 -265981 -208648 -243507 -232360 204780 -201858 -55098 -262429 -254572 -161356 -455854
10675 -455854 -57186 127348 14633 -227171 -171964 -8359 -274255 -463275 71161 -228581 50051
10663 -141578 -202268 -206445 -47631 291096 287452 -124777 19782 -152779 247105 -230183 -101925
10651 235460 -478783 -226776 -32654 -304295 -290167 -115804 333372 -47396 -28473 178216
10640a08883l48411B12920E70b32379G2355b14714K6463h3054r1332F0733K51551
10629C12284A02017d6171j15879A46591g4619m14817f7005D2616a23541G9692
10618c6509A8687f4151k22145c3768B92869a8414k6968k08455a26304r6305A20176
10606c43847a65302Q309g5853D8092g7211A60360C5976b98003a45524j66138J51603
10595a60059g7800j05937j22247E09457f7031k9181A60360f7865A97156e1229
10584B1572c88341F9167d5083n2213q7282A52472F6669g2066j41931A19123a31773
10572b09953j14108i9022M1433E0450J1643a25313r8071j88838a57982j38058
10562b96040M4171H4155a2898j46398a7725l57211a45095M5235j21325A4236b13688
$$ plain form
10640 -108883 -457294 212920 570 -232379 72355 -214714 -188251 -83054 -174386 60733 312284
10629 312284 102017 -46171 -162050 146591 -74619 -489436 -67005 42616 -123541 79692
10618 -36509 18687 -64151 -286296 -33768 292869 -18414 -45382 -253837 -126304 -222609 120176
10606 -343847 -165302 -156993 -75853 48092 -77211 160360 35976 -298003 -145524 -311662 -160059
10595 -160059 -77800 -183737 -305984 509457 -67031 -96212 160360 -67865 197156 -51229
10584 21572 -388341 69167 -45083 -97296 -184578 152472 66669 -72066 -213997 119123 -131773
10572 -209953 -324061 -99022 -57589 50450 62093 -125313 -223384 -412222 -157982 -296040
10562 -296040 -251869 84155 -12898 -159296 -17725 -374936 -145095 -99860 -221185 14236 -213688
10550b10773e6590I9045o078h6048a3043A01042b7824j16838d6565a1054j79287
10539a90341L138C9559a19780j58204i9515k318J4274B27699p9111G1012a01760
10527a49841j38771R9200A84959a41331n4507b9512k6027A0295J55596J07929
10517B73820C5434b31935A71724L4827a48695a4890d10j61800I9773d5315k39345
10506b84660A49787b06320A10118D17g999j29032A88500a00988O337A81499l8947
10495A42552B1817Q275b9206k25454d8513C2185K76930a96711A63976i1723i284
10483B7933N6486h3259G9666Q8799G5895J25071b00867A48718J28884c66838P2827
10472b94011A78949g7899B7444R669J59990c0807H5526a18397B06713B8829J92174
$$ plain form
10550 -210773 -56590 99045 92967 -86048 -13043 101042 -27824 -144662 -46565 -11054 -190341
10539 -190341 -187203 39559 -119780 -277984 -99515 -101833 -87559 227699 148588 71012 -101760
10527 -149841 -288612 -189412 184959 -141331 -195838 -29512 -55539 10295 165891 273820
10517 273820 35434 -231935 171724 206551 -148695 -14890 -410 -162210 99773 -45315 -284660
10506 -284660 149787 -206320 110118 417 -7999 -137031 188500 -100988 -94651 181499 142552
10495 142552 21817 30092 -29206 -254660 -48513 32185 309115 -196711 163976 -91723 -9284
10483 27933 84419 -83259 79666 168465 75895 200966 -200867 148718 277602 -366838 -294011
10472 -294011 178949 -77899 27444 37113 197103 -30807 85526 -118397 206713 28829 221003
10461B21003j5022K3831J16005M5361d5338H2193K90688J12402b1679A0153f046
10449A81673a40181k9344l5699i7524A25775a50573n3319h3384n9190G7154a88007
10437a23154j4242j83547B05918b45908j37934a59585j6356k42105A08443J82552
10427B90995J7856f3507b473o1460n9247g492p8577r0864q0302E3263J95442a60517
10414F9040i0423j78175Q5715c9648A47341B5354K07366a87232J3964A23428K7122
10403A50550E425g9242A35573b28515G0292K08096h2157j58683c3026l78571a49247
10391c08196c1743B59450r7314n265d8367G9945f734J477k37216A16193Q876J33387
10379B58456o104j21052b99639A50968L10069B8787K38171B1720K94392r9886
$$ plain form
10461 221003 205981 229812 345817 391178 -45338 82193 372881 485283 -21679 10153 -6046
10449 181673 -140181 -169525 -205224 -97524 125775 -150573 -203892 -83384 -142574 77154 -188007
10437 -123154 -137396 -320943 205918 -245908 -383842 -159585 -175941 -418046 108443 290995
10427 290995 308851 -63507 -2473 -63933 -123180 -7492 -86069 -176933 -257235 53263 248705 -160517
10414 69040 -90423 -268598 -182883 -39648 147341 25354 232720 -187232 -173268 123428 150550
10403 150550 5425 -79242 135573 -228515 70292 278388 -82157 -240840 -33026 -411597 -149247
10391 -308196 -31743 259450 162136 156871 -48367 79945 -6734 -5257 -242473 116193 125069 258456
10379 258456 252352 131300 -299639 150968 461037 28787 266958 21720 316112 216226
10369B16226F1579K1634A2051M34442A71680j9817G1679N66533a7893I6940J07174
10358B04114K5240q7786a1762D90706B22636O408q671k3992F3762N10574j02671
10347D71665j67804L09009J03854l47142L22492A92294M08065j27968m8363J61277
10337E85305B36477j2077J15269L7043j4722N50247C87885M62459B67144J29724
10327C96868M0880j19980K1472j69250M09877k68903b13539C12308M7241K206
10317C61755A43717K0710h1646A26196m7264J39513B5972a99330h4782D840P5590
10306H0430A1506J51914J60239p8428J4040M0875j48795K32646a97169C84552
10295A47197g8576A86973K232J43703A20092g3612i344B15719p6310f8953l14900
$$ plain form
10369 216226 61579 83213 12051 446493 171680 151863 71679 638212 -17893 96940 204114
10358 204114 229354 141568 -11762 490706 222636 229044 220373 196381 63762 574336 471665
10347 471665 303861 612870 716724 369582 692074 192294 600359 472391 424028 585305
10337 585305 236477 224400 339669 376712 361990 912237 387885 850344 267144 396868
10327 396868 437748 317768 339240 169990 579867 310964 -213539 312308 359549 361755
10317 361755 143717 164427 -81646 126196 78932 218445 25972 -199330 -84782 4840 80430
10306 80430 11506 163420 323659 245231 259271 300146 151351 383997 -197169 384552
10295 147197 -78576 186973 189205 332908 120092 -73612 -9344 215719 139409 -68953 -383853
10284c83853A0830K8779K25777a47355A90474j4599e1506B43275A08609K4515
10274A33124a01112j34720J09048B01758b0293I3425j6747e1289J9445C0901p526
10263B3375j0251h560k42294D8615K12223a53303e7028J759K4944B09037b70611
10251i2731l755A17187h2840A74900p5681c35068a17922b6842C036b11422O0445
10240a50977C70977A17130L96575k08691a81246G0786l0075J29171F7452a764
10229A57200d3837n1447p0290B25904b9441F1016d2477A050a80278D236a90078
10217i9071b6608C67698C3275b29994f1865j81860b2025A86573F4878a61403o4224
10206b25627m9835D7992O873c21322E2479b55708A55570c03187O7424j08582a38342
$$ plain form
10284 -383853 10830 39609 265386 -147355 190474 175875 -51506 243275 108609 133124
10274 133124 -101112 -235832 -126784 201758 -20293 93425 76678 -51289 -31844 30901 23375
10263 23375 13124 -8560 -250854 48615 260838 -153303 -57028 -55269 -30325 209037 -270611
10251 -92731 -96486 117187 -82840 174900 99219 -335068 -117922 -26842 3036 -211422 -150977
10240 -150977 370977 117130 513705 305014 -181246 70786 40711 169882 67452 -1764
10229 157200 -43837 -95284 -165574 225904 -29441 61016 -42477 1050 -180278 4236 -190078
10217 -99071 -26608 367698 33275 -229994 -61865 -243725 -22025 186573 64878 -161403 -225627
10206 -225627 -275462 47992 54865 -321322 52479 -255708 155570 -303187 -235763 -344345 -138342
10194d57069h035H8847d005o217D4532b83608A02947a41313j07357C4623b37980
10182I4451h7931b6219l01914c1497j09812A67931a42332A70592a03266A2838
10171a59579C0142J7285e97405F3843b18637f8843C74764b330B89676A7520c16159
10159b67465C671O276b11276e0529B96706b6791m12541k6550K17674a3247o2723
10148g5970A42805a88838B0851c23739N3775e2399o1885K7385B6937a14072A07971
10136B31423m6039k7170f2581l11728a32699q5934R3571l99267b9018A65203a55456
10124h9754k0301r3859k19651g9723j4964j06620G014a23654A68286i0353r2018
10113a82371C9343d3689H6286b903A96215B633K50394c0336D1980b27100F6139
$$ plain form
10194 -457069 -8035 88847 -4005 -10222 44532 -283608 102947 -141313 -248670 34623 -237980
10182 94451 -87931 -26219 -328133 -31497 -141309 167931 -142332 170592 -103266 12838
10171 -159579 30142 47427 -597405 63843 -218637 -68843 374764 -2330 289676 17520 -316159
10159 -267465 3671 9947 -211276 -50529 296706 -26791 -439332 -465882 -248208 -13247 -75970
10148 -75970 142805 -188838 20851 -323739 -269964 -52399 -114284 -86899 26937 -114072 107971
10136 231423 185384 158214 -62581 -374309 -132699 -218633 -125062 -524329 -29018 165203 -155456
10124 -89754 -110055 -203914 -423565 -79723 -94687 -201307 7014 -123654 168286 -90353 -182371
10113 -182371 39343 -43689 86286 -2903 196215 2633 253027 -30336 41980 -227100 66139
10101c37472A12369f0633d35k27850H1717a50371k02977G0678b12361Q8620A53320
10089i7595q1099L7968l1359b9141C7135a36321G7752b1586I1365c16077f507
10077a38517A8083J57112a19237l60161a51786A97308F7240k5600P0124a83141
10066i6846B65430q6923o1149a59677o6087A04358c16896a27850j1208N3665k24956
10055c10349H2182k6898g8355a6816I3112b475B69960e514B73047G7767c38608
10043b40042H3990J44756a31957c4628H4062a68021O2180a9468o2273A14911e8316
10031A73244b02152R6477N153M40I9037f5090H4799J08600a42718A0896b75292
10019b03035j07931D23585a47858e9995D2541a77091c0429G3867C482J94944c8500
$$ plain form
10101 -337472 112369 -60633 -435 -228285 81717 -150371 -353348 70678 -212361 -123741 153320
10089 -97595 -178694 -140726 -172085 -29141 37135 -136321 77752 -21586 91365 -316077 -6507
10077 -138517 18083 175195 -119237 -479398 -151786 197308 67240 41640 111764 -183141
10066 -96846 265430 178507 117358 -159677 -225764 104358 -316896 -127850 -139058 -85393 -310349
10055 -310349 82182 55284 -78355 -16816 93112 -2475 269960 -5514 273047 77767 -338608
10043 -240042 83990 228746 -131957 -34628 84062 -168021 -105841 -19468 -81741 114911 -58316
10031 173244 -202152 -105675 -100522 -100082 99037 -65090 84799 193399 -142718 10896 -275292
10019 -203035 -310966 423585 -147858 -59995 42541 -177091 -30429 73867 3482 198426 -38500
10007b46370j75541a98838a2365j76811L0625d8330C7126b27094R8838f2566F9503
9995A06636c54740e0334l4068G0822b3326I0992a88254I7915b29700j04208A98458
9983C6802J18217a51888M4840D6748O8804a46218k13396J13792B343J96520c83004
9971I8915j8262a2608j63550B7399b3085j21667N2442l0679k3610H1227l3891
9960D7336c52381E8243d1457j72117Q4098A96687b04861i7902k18607A78124i7189
9948a21786r718h500B18714a15401A0080J1883a67193q1877B4054J9319L6289
9937G9662j1646B5162J61839q8448b3122j11622K4478j6726A53797J1482a77221
9925c17682J55509n5250A08612m5017J02865C3819P2416m6985B4700g5125A42834
$$ plain form
10007 -246370 -421911 -198838 -12365 -189176 -158551 -48330 37126 -227094 -128256 -62566 69503
9995 106636 -354740 -50334 -84402 70822 -23326 90992 -188254 97915 -229700 -333908 198458
9983 36802 155019 -151888 -107048 46748 115552 -146218 -359614 -245822 2343 198863 -383004
9971 98915 80653 -12608 -176158 27399 -23085 -144752 -92310 -122989 -146599 81227 47336
9960 47336 -352381 58243 -41457 -213574 -129476 196687 -204861 -97902 -316509 178124 -97189
9948 -121786 -131504 -8500 218714 -115401 10080 21963 -167193 -249070 24054 43373 79662
9937 79662 68016 25162 187001 98553 -23122 -134744 -110266 -126992 153797 165279 -177221
9925 -317682 -162173 -217423 108612 63595 166460 33819 106235 59250 24700 -75125 142834
9913c33347e8774o8744d7783l881M502j05290e6780B16446a11259A99288h5592
9901a37094A73285b28783b9885F8020c10141f0804j65838r2905i8457C2031J76948
9890B08979b36139A05036a28458L3849j17295C69015o1384r7599b00200N1894
9880a48306E7173e1580o9155k41751A64150D7909f5482E702B85a61720l7045d5090
9867a38241p1271a8621C601J52567b08931l0985Q1438k5225A53406d0166A9373
9855A92530a12435j9503m7361G6288h8431j16179c2873n9426B04451A9768N6062
9844G5830a97960f6498j28771d9466j39191A75974D5502K96584b96244J33551
9834a62693k55997a2239j72517l9708j32960N9694K2639M8142j7671A42790b64389
$$ plain form
9913 -333347 -58774 -127518 -47783 -51664 -47162 -152452 -56780 216446 -111259 199288 -85592
9901 -137094 173285 -228783 -29885 68020 -310141 -60804 -226642 -319547 -98457 32031 208979
9890 208979 -236139 105036 -128458 -94609 -211904 369015 307631 210032 -200200 -148306
9880 -148306 57173 -51580 -120735 -362486 164150 47909 -65482 5702 285 -161720 -198765 -45090
9867 -138241 -209512 -18621 3601 156168 -208931 -239916 -158478 -183703 153406 -40166 19373
9855 192530 -112435 -131938 -179299 76288 -88431 -204610 -32873 -92299 204451 19768 75830
9844 75830 -197960 -66498 -195269 -49466 -188657 175974 45502 342086 -296244 -162693
9834 -162693 -418690 -12239 -184756 -224464 -357424 -297730 -275091 -226949 -244620 142790 -264389
9822a79359G7696g8970j21997h531j09177k47796A14755a99738o5423q8987a44230
9810e4973o1557j23408E5239a43603M3875A0777a11039F1061a5934C806f1813
9798c96411C68269a58210G3988b24133B24816A01865B2935Q7658a83811n368R3622
9787i5557B8053J26368c06212c5328k24867g0437E3446j4340b3542j09774K2027
9776a11289A41508a38136j7520A0412a83459j20332j44585i3830f865k5178D16692
9764b26552A13575c25556a17326p6330G2782i2991m1859j49929b078j3245p2431
9753h7754c5529q6813d4372A61521k7601a11869j11838h740j67561m0975A22109
9741b08507A61241b24842J03133A87987g287k43178C1143R5516g113l92291g1319
$$ plain form
9822 -179359 77696 -78970 -200967 -8531 -117708 -365504 114755 -199738 -265161 -354148 -144230
9810 -54973 -116530 -239938 55239 -143603 -99728 10777 -111039 61061 -15934 3806 -61813
9798 -396411 368269 -158210 73988 -224133 224816 101865 22935 110593 -183811 -189179 -95557
9787 -95557 28053 154421 -306212 -35328 -260195 -70437 53446 39106 -23542 -133316 -111289
9776 -111289 141508 -138136 -155656 10412 -183459 -303791 -448376 -93830 -6865 -32043 416692
9764 -226552 113575 -325556 -117326 -193656 72782 -92991 -134850 -284779 -2078 -15323 -87754
9753 -87754 -35529 -122342 -44372 161521 133920 -111869 -223707 -8740 -176301 -217276 122109
9741 -208507 161241 -224842 -121709 187987 -7287 -250465 31143 126659 -7113 -399404 -71319
9729a74183k04664J58587C4055b13703j10401H6492a78581j07129e3325J509k29923
9718b81739e7782H405c27369a35733A8954L03608a2268j00962B03365H4172c95
9706a76983m7004H4668L7006d887k02884e6614k79279G1020a33536a3716l9886
9695e3602B06878D1598b49033i6606A87344k6962f1210k05169a20651A00475a81080
9683a05914C00808B7478c01091N0747g8452L6207l9402o4166C8134a11432e0211
9671A69460K4177b79015I7564i698j78542E8256e0908j88668k9408H0110J6947
9660I7057c25391A19768A8105K11864q9870a25900E7852L1083e8594r1084K918
9649a46760A9563a59007g8873B6318J74572b0420j84799k0923N3435P7631L8540
$$ plain form
9729 -174183 -378847 -220260 34055 -213703 -324104 86492 -178581 -285710 -53325 -51816 -281739
9718 -281739 -57782 8405 -327369 -135733 18954 322562 -12268 -113230 203365 84172 -395
9706 -176983 -223987 84668 121674 -4887 -207771 -56614 -335893 71020 -133536 -13716 -53602
9695 -53602 206878 41598 -249033 -96606 187344 160382 -61210 -266379 -120651 100475 -181080
9683 -105914 300808 27478 -301091 -250344 -78452 -42245 -81647 -145813 38134 -111432 -50211
9671 169460 193637 -279015 97564 -9698 -188240 58256 -50908 -239576 -268984 80110 97057
9660 97057 -325391 119768 18105 229969 140099 -125900 57852 88935 -58594 -149678 -146760
9649 -146760 19563 -159007 -78873 26318 200890 -20420 -205219 -226142 -172707 -95076 -56536
9638e6536n5844C47814f5091j11773h3657B82020a17866j85981b0774p273k062
9627c0109k5426B6267a10747A07599j6740f0157C82820a98477M8624k93j329n8292
9615b09767A33027c73885a66012k80229P4309C71983A16385M6007c54428N0029
9605c04399C59126a67487N1114b973k00502e8307K0229A06870a78719F9456a14989
9593a00896q5192c4712J2729A86971p1360a66721B80389c0328A68664a24506H2199
9581b04544b6133C5106K74743j36207q5284f5514A19091e8344A51769D4174b75316
9569C9126b18263B36404b3845l33950B19894a31115a0966j91551Q753C196a30353
9557g7100p1465k68575J4119a67908d5894k24026B3390a55750M3227j31428G2089
$$ plain form
9638 -56536 -112380 347814 -65091 -176864 -83657 282020 -117866 -303847 -20774 -28047 -30109
9627 -30109 -55535 26267 -110747 107599 90859 -60157 382820 -198477 -149853 -150146 -151475 -209767
9615 -209767 133027 -373885 -166012 -446241 -371932 371983 116385 162392 -354428 -304399
9605 -304399 359126 -167487 -116373 -2973 -203475 -58307 -38078 106870 -178719 69456 -114989
9593 -100896 -186088 -34712 -21983 186971 115611 -166721 280389 -30328 168664 -124506 82199
9581 -204544 -26133 35106 309849 173642 88358 -65514 119091 -58344 151769 44174 -275316
9569 39126 -218263 236404 -23845 -357795 219894 -131115 -10966 -202517 -193764 3196 -130353
9557 -77100 -148565 -417140 -403021 -167908 -45894 -269920 23390 -155750 -112523 -243951 72089
9545a0634j28286q529k01165A11894k2545d2991j19548l7803k6206a7868C646
9533I0977a6241j80535b2865C004h7306E1914k1711J9202b51517a3368N349j11432
9521a19451j29922O1371F946J85875a41379A52272E1832b47294b5374o9540j15939
9510b10853d1068F7688k2491b28272L7900j2871P3144A8799c53090C205J04724
9499A07929b17809n7616F0957f1024G0926c23266k8392A00602j0694j5301i7584
9487a11843B68322P5067f17733B39900d6541p1881N6491p3386k36478a12440C17702
9475A12551J78734a02587H1947b79637C11549i9555j10733R8979C619d0065j54537
9464a94602G8204a26385p4479C5676a04087n8346B54789g1503j07289j02619A15020
$$ plain form
9545 -10634 -138920 -147449 -348614 111894 89349 -42991 -162539 -200342 -226548 -17868 3646
9533 90977 -16241 -196776 -22865 3004 -87306 51914 30203 49405 -251517 -13368 -8019 -119451
9521 -119451 -249373 -188002 6946 192821 -141379 152272 51832 -247294 -25374 -94914 -210853
9510 -210853 -41068 67688 45197 -228272 -190372 -203243 -130099 18799 -353090 3205 107929
9499 107929 -217809 -275425 60957 -61024 70926 -323266 -351658 100602 89908 74607 -97584
9487 -111843 268322 343389 -617733 239900 -46541 -118422 -61931 -135317 -371795 -112440 317702
9475 112551 291285 -102587 81947 -279637 311549 -99555 -210288 -111309 3619 -40065 -194602
9464 -194602 78204 -126385 -200864 35676 -104087 -162433 254789 -71503 -178792 -281411 115020
9452I4305c66192G2262a50983k41320j64763a44188A04900f9368A37904J14292
9442B52196a51515E9481a50134m2467k40266C3071a96654j15657n8045d3265n9106
9431a02371k05575g5610i004A0004a61253M4638L0825r8935k5124A28995a70219
9419i5069K1068C2532e0798m1383j16636r6759A23878B1227h3259j28178A7215
9407C0055b986C15394C7925b05925a4585D31227a57223A28255B2356a60584K7826
9396a32758N9969F1968J74002h0407B65841b96269A10831b985D7673e3425A53876
9384C287J207f495o41813C13017a41475q632m1221g5980m9148a8151k5934C73770
9371a5454l49814H2500a21707f0157A47369b3055r5505K8822k2221b7841a1628
$$ plain form
9452 94305 -366192 72262 -150983 -392303 -557066 -144188 104900 -69368 137904 252196
9442 252196 -151515 59481 -150134 -192601 -432867 33071 -196654 -312311 -370356 -43265 -102371
9431 -102371 -307946 -75610 -9004 10004 -161253 -116615 -85790 -184725 -209849 128995 -170219
9419 -95069 -74001 32532 -50798 -92181 -208817 -305576 123878 21227 -83259 -211437 17215
9407 30055 -2986 315394 37925 -205925 -14585 431227 -157223 128255 22356 -160584 -132758
9396 -132758 -72789 61968 235970 -80407 265841 -296269 110831 -2985 47673 -53425 153876
9384 3287 4494 -6495 -648308 313017 -141475 -150107 -191328 -75980 -125128 -18151 -44085 373770
9371 -15454 -365268 82500 -121707 -60157 147369 -23055 -118560 -89738 -111959 -27841 -11628
9359I4434b52836i5729B2433a37451e8842k58654a10589B17527A4116i5534d1732
9347C1880b17645Q0361A66600i2305I3791a17684E8460a17173j04345B8416a35659
9335D3839b77180Q41E5802F915L9415A9211i4272d5925k12681O8189j70886a70014
9322H279b00699B18886a63804B39640A14112c22736B46160h3509K3268m830j80947
9311b46018d4005l41946A43958b85245D00636b4670A29549D3138J12632a34667
9300i6189P835I2339a32005A65796c8941j40853n5890C8020b04596C24466A42647
9288A27999c1833A58919f1313A94534E3607p979a76759j3461k02506a61948N3347
9277a08601j91178J8122H5348a48788p9865R1615G4148a32937c5037j98812A92614
$$ plain form
9359 94434 -252836 -95729 22433 -137451 -58842 -317496 -110589 217527 14116 -95534 -41732
9347 31880 -217645 -137284 166600 -92305 93791 -117684 58460 -117173 -221518 28416 -135659
9335 43839 -277180 -276339 55802 6915 46330 19211 -94272 -45925 -258606 -190417 -361303 -170014
9322 8279 -200699 218886 -163804 239640 114112 -322736 246160 -83509 -60241 -65071 -246018
9311 -246018 -44005 -385951 143958 -285245 400636 -24670 129549 43138 155770 -134667
9300 -96189 -88354 92339 -132005 165796 -38941 -179794 -235684 38020 -204596 324466 142647
9288 127999 -31833 158919 -61313 194534 53607 45628 -176759 -190220 -392726 -161948 -108601
9277 -108601 -299779 -281657 85348 -148788 -228653 -137038 74148 -132937 -35037 -233849 192614
9265e9837A36430c06618J25787j29442B2498d27053a62490c764k84299M5575C7767
9253d652j5961C8863h9122E3678f7899j7440D1063a52134M0909j11221A46319
9241b9047D9249L1876g1146B55613a32202M7118P662K4329G6135d49254A66966
9229A12597a84731r792c5631j77096M3478b973k10580h3555k33974J15372f8199
9217h6353B52796a30816k46513h5616d1433j64046q1606a24037c6955k30256a30249
9205c66106h2007A60012a89814A25234C2822a326j48407k44581B2249d28618m6427
9194d75045B9222B861J25819e9825A92512G0527a45135o5911o085l0687d0843
9182A20433M5833a93275L1959d8210C84181G3196a19021B0518a30949j79634a30238
$$ plain form
9265 -59837 136430 -306618 -180831 -310273 22498 -427053 -162490 -3764 -288063 -242488 37767
9253 -4652 -20613 38863 -89122 53678 -67899 -85339 41063 -152134 -111225 -222446 146319
9241 -29047 49249 81125 -71146 255613 -132202 -85084 -77422 -53093 76135 -449254 166966
9229 112597 -184731 -194523 -35631 -212727 -169249 -2973 -213553 -83555 -317529 -202157 -68199
9217 -86353 252796 -130816 -377329 -85616 -41433 -205479 -287085 -124037 -36955 -267211 -130249
9205 -366106 -82007 160012 -189814 125234 32822 -1326 -149733 -394314 22249 -428618 -475045
9194 -475045 29222 2861 128680 -59825 192512 70527 -145135 -211046 -217131 -247818 -40843
9182 120433 166266 -193275 -161316 -48210 384181 73196 -119021 20518 -130949 -310583 -130238
9170e9850q3944B46894a06603A91048J15133a48212K8692H3982i5638H5330J29772
9159B15102b86001a33927j21075J01674A20672b31027A35278a7949H550b00104
9148D5934P845i9910j7702l2493j32335E513b25795B76298H2061K6463b03210
9136a5165I8851a63838l1635o4127f2875l3258o1656j3577g6962M27b4147j133
9124b5280G1979L6781i3614F8606A8889b1866j41290l10762J12353J29911H7903
9112a50015j8711B7354M3039b3708k25745g8074m2687j22077K5621h425A20201
9100A43620J3970o172a83608L8511k2191c8159j87978b0411F0779K47198a29193
9088A7818b00418A58324A6864b93324a12393M7826p3672M1820j09412n4059J05176
$$ plain form
9170 -59850 -143794 246894 -106603 191048 306181 -148212 -119520 83982 -95638 85330 215102
9159 215102 -286001 -133927 -255002 -153328 120672 -231027 135278 -17949 8550 -200104
9148 45934 53779 -99910 -117612 -150105 -282440 5513 -225795 276298 82061 108524 -203210
9136 -15165 98851 -163838 -195473 -259600 -62875 -96133 -157789 -171366 -76962 -76535 -24147 -25280
9124 -25280 71979 108760 -93614 68606 18889 -21866 -163156 -473918 -361565 -231654 87903
9112 -150015 -168726 27354 70393 -23708 -249453 -78074 -120761 -242838 -217217 -8425 120201
9100 143620 157590 151418 -183608 -145097 -167288 -38159 -226137 -20411 60779 307977 -129193
9088 17818 -200418 158324 16864 -293324 -112393 -64567 -138239 -96419 -205831 -259890 -154714
9077a54714d0049J7470p6015H4277a65034f9871o9593I574K376a94880i725B03858
9064A20683k6824g5395o9222p3539H9984i7120A85812c57730g0849j49807b0688
9052b93723B06029c41178A02526B3580h0938j4140p720k07420E2323c8463a0345
9040a72641E1648c50223A06408c51129A48405K28857j44885j13259E8310j381
9030E6929b90114a11952B51301J41670g6348l9523A4065b67950J9873G7199C6832
9018b73117A26203c72586E1893J27196C0844J9894c7597r5793B4688e7471j86322
9007b43793B23478c8135k20922H5485O3879k1372a71741d8294l2126A71758e2786
8995b87067J19995A08413n2830h5064B8274d5555B58478d3090D9449R9835F143
$$ plain form
9077 -154714 -40049 -22579 -98594 84277 -165034 -69871 -139464 9574 11950 -194880 -9725 203858
9064 120683 93859 -75395 -144617 -218156 89984 -97120 185812 -357730 -70849 -220656 -20688
9052 -293723 206029 -341178 102526 23580 -80938 -95078 -102798 -310218 52323 -38463 -10345
9040 -172641 51648 -350223 106408 -351129 148405 377262 232377 119118 58310 56929
9030 56929 -290114 -111952 251301 392971 -76348 -115871 14065 -267950 -248077 77199 36832
9018 -273117 126203 -372586 51893 179089 30844 50738 -37597 -133390 24688 -57471 -243793
9007 -243793 223478 -38135 -259057 85485 149364 127992 -171741 -48294 -80420 171758 -52786
8995 -287067 -167072 108413 55583 -85064 28274 -45555 258478 -43090 49449 149284 6143
8983A11928J01100j1685h9731j08756H5598i5507n5153r6644C13895j42255J914
8972A73554J93692a00459l8949k17557a49280L3001c8751l73884a25401k71958
8962c97359a48731B82697P814h4522l65734D1385q876j96e933A30839c33174J18404
8950b14770m2016G1689J95611H7914l9138d8055i16o6036K7064n7267j61874R896
8938b49133e6126j02488B6799Q2241b6791A06167a26435l25914A27814j5458h772
8926b4519k43077a12547l4181L1161j42832A60099a060H6814b57234C78268j23853
8915B54415a10603g642j6352F8655K56569A30790l382K02788P3083L78212L88955
8904A170446J453460K409670O40717B813509j325494o85770j96705A88954M9523
$$ plain form
8983 111928 213028 201343 -89731 -198487 85598 -95507 -150660 -247304 313895 171640 173554
8972 173554 367246 -100459 -139408 -356965 -149280 -116279 -38751 -412635 -125401 -397359
8962 -397359 -148731 282697 290511 -84522 -450256 41385 32509 32313 -5933 130839 -333174 -214770
8950 -214770 -256786 71689 267300 87914 48776 -48055 -916 -66952 -39888 -97155 -259029 -249133
8938 -249133 -56126 -158614 26799 109040 -26791 106167 -126435 -452349 127814 112356 -8772
8926 -24519 -267596 -112547 -146728 -115567 -258399 160099 -1060 86814 -257234 378268 254415
8915 254415 -110603 -7642 -23994 68655 325224 130790 127408 330196 403279 781491 1170446
8904 1170446 2623906 5033576 5674293 2813509 1488015 802245 605540 188954 238477
8895B38477p474Q8869B5074R9212n5413J00541O6450h4825A47112o2754a03827
8883a38005A77643p4910g0189I7933a19184j00245b8063j25986c3036A30236b21092
8871G98R0327a31898l8079H5808A7669P5084J66474e1012k17794p4788a60122
8859A83918c32467A0148b48903E169K26836D6769G820a73193A88119N15b15655
8847I2082G719b73396J18230A35826B9401N8089b47911J08597f7778m32782a69499
$$ plain form
8895 238477 231003 319872 25074 124286 68873 169414 235864 -84825 147112 84358 -103827
8883 -138005 177643 102733 -70189 97933 -119184 -219429 -28063 -154049 -33036 130236 -221092
8871 798 91125 -131898 -169977 85808 17669 92753 259227 -51012 -268806 -343594 -160122
8859 183918 -332467 10148 -248903 5169 232005 46769 7820 -173193 188119 188634 -215655
8847 92082 7719 -273396 -155166 135826 29401 87490 -247911 -139314 -67778 -500560 -169499
$$ [...]
##END NTUPLES=NMR SPECTRUM
##END=
