
##TITLE=AC1067_TOPA01_5819214_63GCd5k7ek
##JCAMPDX= 6.0         $$ Bruker NMR JCAMP-DX V2.0
##DATA TYPE= NMR SPECTRUM
##DATA CLASS= NTUPLES
##ORIGIN= BRUKER
##OWNER= Administrator
$$ 1.72 TOPSPIN		Version 2.1
$$ 2012-03-24 18:57:19.328 -0500  Administrator@TOPSPIN
$$ Compression mode = diff/dup
##.OBSERVE FREQUENCY= 400.13188235
##.OBSERVE NUCLEUS= ^1H
##.ACQUISITION MODE= SIMULTANEOUS (DQD)
##.ACQUISITION SCHEME= undefined
##.AVERAGES= 8
##.DIGITISER RES= 22
##SPECTROMETER/DATA SYSTEM= spect
##.PULSE SEQUENCE= zg30
##.SOLVENT NAME= COFFEE_meoh
##.SHIFT REFERENCE= INTERNAL, COFFEE_meoh, 1, 14.98061
##AUDIT TRAIL= $$ (NUMBER, WHEN, WHO, WHERE, PROCESS, VERSION, WHAT)
$$ ##TITLE= Audit trail, TOPSPIN		Version 2.1
$$ ##JCAMPDX= 5.01
$$ ##ORIGIN= Bruker BioSpin GmbH
$$ ##OWNER= Administrator
$$ $$ C:\Bruker\TOPSPIN/data/COFFEE/nmr/AC1067_TOPA01_5819214_63GCd5k7ek/10/pdata/1/auditp.txt
$$ ##AUDIT TRAIL=  $$ (NUMBER, WHEN, WHO, WHERE, PROCESS, VERSION, WHAT)
(   1,<2012-03-24 18:57:11.484 -0500>,<Administrator>,<TOPSPIN>,<go>,<TOPSPIN 2.1>,
      <created by zg
	started at 2012-03-24 18:56:03.062 -0500,
	POWCHK enabled, PULCHK disabled,
       configuration hash MD5:
       1A 1E CE 29 27 FD 77 03 67 4E F0 E3 C4 B2 CB 90
       data hash MD5: 64K
       D3 45 13 E2 15 CF 26 A1 92 A6 41 CC 86 E2 26 A3>)
(   2,<2012-03-24 18:57:15.031 -0500>,<Administrator>,<TOPSPIN>,<proc1d>,<TOPSPIN 2.1>,
      <Start of raw data processing
       efp LB = 0 FT_mod = 6 PKNL = 1 PHC0 = 0 PHC1 = 0 SI = 32K 
       data hash MD5: 32K
       95 41 4D E9 61 EE 0D 0A 1D 25 E5 4E 38 52 30 D7>)
(   3,<2012-03-24 18:57:15.390 -0500>,<Administrator>,<TOPSPIN>,<proc1d>,<TOPSPIN 2.1>,
      <pk PHC0 = 212.9205 PHC1 = 0 
       data hash MD5: 32K
       19 29 1B 3B 0C 75 28 27 46 51 4C 58 2C 57 A4 BF>)
(   4,<2012-03-24 18:57:15.546 -0500>,<Administrator>,<TOPSPIN>,<proc1d>,<TOPSPIN 2.1>,
      <abs ABSG = 1 
       data hash MD5: 32K
       97 E5 95 27 D4 8E 95 06 46 FA 2F DE F6 EA FB D2>)
(   5,<2012-03-24 18:57:15.671 -0500>,<Administrator>,<TOPSPIN>,<proc1d>,<TOPSPIN 2.1>,
      <abs ABSG = 2 
       data hash MD5: 32K
       42 13 30 1D A5 EA B5 8B 87 64 23 59 D0 09 F5 A8>)
(   6,<2012-03-24 18:57:15.703 -0500>,<Administrator>,<TOPSPIN>,<proc1d>,<TOPSPIN 2.1>,
      <abs ABSG = 3 
       data hash MD5: 32K
       E0 35 69 D8 7C 84 85 E3 E2 51 F5 DC C9 C2 C2 12>)
(   7,<2012-03-24 18:57:15.734 -0500>,<Administrator>,<TOPSPIN>,<proc1d>,<TOPSPIN 2.1>,
      <abs ABSG = 4 
       data hash MD5: 32K
       94 19 69 27 95 E4 88 F2 6D AC 35 0D 5B 3E 69 DF>)
(   8,<2012-03-24 18:57:15.765 -0500>,<Administrator>,<TOPSPIN>,<proc1d>,<TOPSPIN 2.1>,
      <abs ABSG = 5 
       data hash MD5: 32K
       32 05 D8 C2 7C F7 71 F8 82 D0 F7 5A FF BB E1 1A>)
$$ ##END=
$$ 
$$ $$ hash MD5
$$ $$ 67 D9 0C 1E D8 F2 74 39 93 8D B3 9A 0B BB 53 E4
##$RELAX= 
##$RELAX= 
##$RELAX= 
##$RELAX= 
##$RELAX= 
##$RELAX= 
##$RELAX= 
$$ Bruker specific parameters
$$ --------------------------
$$ [...]
150 150 150 150 150 150 150 150
##$TP07= 0
##$TPNAME0= <>
##$TPNAME1= <>
##$TPNAME2= <>
##$TPNAME3= <>
##$TPNAME4= <>
##$TPNAME5= <>
##$TPNAME6= <>
##$TPNAME7= <>
##$TPOAL= (0..7)
0.5 0.5 0.5 0.5 0.5 0.5 0.5 0.5
##$TPOFFS= (0..7)
0 0 0 0 0 0 0 0
##$TUNHIN= 0
##$TUNHOUT= 0
##$TUNXOUT= 0
##$USERA1= <user>
##$USERA2= <user>
##$USERA3= <user>
##$USERA4= <user>
##$USERA5= <user>
##$V9= 5
##$VALIST= <valist>
##$VCLIST= <CCCCCCCCCCCCCCC>
##$VD= 0
##$VDLIST= <DDDDDDDDDDDDDDD>
##$VPLIST= <PPPPPPPPPPPPPPP>
##$VTLIST= <TTTTTTTTTTTTTTT>
##$WBST= 2048
##$WBSW= 25
##$XGAIN= (0..3)
0 0 0 0
##$XL= 0
##$YL= 0
##$YMAX_a= 540989
##$YMIN_a= -659410
##$ZGOPTNS= <>
##$ZL1= 120
##$ZL2= 120
##$ZL3= 120
##$ZL4= 120
##$ABSF1= 14.98061
##$ABSF2= -5.57192
##$ABSG= 5
##$ABSL= 3
##$ALPHA= 0
##$AQORDER= 0
##$ASSFAC= 0
##$ASSFACI= 0
##$ASSFACX= 0
##$ASSWID= 0
##$AUNMP= <proc_prof1d_extract_pilot.lims>
##$AXLEFT= 0
##$AXNAME= <>
##$AXNUC= <1H>
##$AXRIGHT= 0
##$AXTYPE= 0
##$AXUNIT= <>
##$AZFE= 0.1
##$AZFW= 0.1
##$BCFW= 0
##$BC_mod= 0
##$BYTORDP= 0
##$COROFFS= 0
##$CY= 15
##$DATMOD= 1
##$DC= 0
##$DFILT= <>
##$DTYPP= 0
##$F1P= 0
##$F2P= 0
##$FCOR= 0.5
##$FTSIZE= 32768
##$FT_mod= 6
##$GAMMA= 0
##$GB= 0
##$INTBC= 1
##$INTSCL= 1
##$ISEN= 128
##$LB= 0
##$LEV0= 0
##$LPBIN= 0
##$MAXI= 10000
##$MC2= 0
##$MEAN= 0
##$ME_mod= 0
##$MI= 0
##$NCOEF= 0
##$NC_proc= -8
##$NLEV= 6
##$NOISF1= 0
##$NOISF2= 0
##$NSP= 0
##$NTH_PI= 0
##$NZP= 0
##$OFFSET= 14.98061
##$PC= 1
##$PHC0= 212.9205
##$PHC1= 0
##$PH_mod= 1
##$PKNL= yes
##$PPARMOD= 0
##$PPDIAG= 0
##$PPIPTYP= 0
##$PPMPNUM= 2147483647
##$PPRESOL= 1
##$PSCAL= 4
##$PSIGN= 0
##$PYNMP= <proc.py>
##$REVERSE= no
##$SF= 400.13
##$SI= 32768
##$SIGF1= 0
##$SIGF2= 0
##$SINO= 400
##$SIOLD= 32768
##$SPECTYP= <>
##$SREGLST= <1H.CDCl3>
##$SSB= 0
##$STSI= 32768
##$STSR= 0
##$SW_p= 8223.68421052632
##$SYMM= 0
##$S_DEV= 0
##$TDeff= 65536
##$TDoff= 0
##$TI= <>
##$TILT= no
##$TM1= 0
##$TM2= 0
##$TOPLEV= 0
##$USERP1= <user>
##$USERP2= <user>
##$USERP3= <user>
##$USERP4= <user>
##$USERP5= <user>
##$WDW= 1
##$XDIM= 32768
##$YMAX_p= 469190307
##$YMIN_p= -711025
##$CURPLOT= <Network HP LaserJet P1505>
##$CURPRIN= <$Network HP LaserJet P1505>
##$DFORMAT= <normdp>
##$LAYOUT= <+/1D_H.xwp>
##$LFORMAT= <normlp>
##$PFORMAT= <normpl>
##$SURQMSG= 1
$$ End of Bruker specific parameters
$$ ---------------------------------
##NTUPLES= NMR SPECTRUM
##VAR_NAME=  FREQUENCY,     SPECTRUM/REAL,   SPECTRUM/IMAG
##SYMBOL=    X,             R,               I
##VAR_TYPE=  INDEPENDENT,   DEPENDENT,       DEPENDENT
##VAR_FORM=  AFFN,          ASDF,            ASDF
##VAR_DIM=   32768,         32768,           32768
##UNITS=     HZ,            ARBITRARY UNITS, ARBITRARY UNITS
##FACTOR=    0.250966925370066, 1,           1
##FIRST=     8223.43324360095, -25594,       -142060
##LAST=      0,             137774,          -272534
##MIN=       0,             -711025,         0
##MAX=       8223.43324360095, 469190307,    0
$$ Real data points
##PAGE= N=1
##DATA TABLE= (X++(R..R)), XYDATA
$$ [...]
23746 199537 -63933 -128953 -517844 -115763 -294670 64572 251900 253057 -159044 -51826 -185784
23735 -185784 -122108 16490 -57959 -60063 -24185 -43822 -84788 366559 -11748 51860 279615
23724 279615 229070 34334 -148843 93526 21493 -106877 -328935 -30023 167810 -211728
23713 -248834 149334 196074 69190 53373 -145630 -157697 42390 -235020 -88149 254536 162544
23702 162544 -32369 -218895 131167 50713 -10747 -48102 -73125 288113 67496 -159788 80786
23690 -429752 -276600 -61498 -70277 46595 -106175 276777 148216 156123 53035 53677 12592
23678 -136920 -206186 -13583 -63779 -149858 150738 -31659 77101 -184051 398561 217441 -43356
23666 -14769 177868 -227374 -78390 -56014 -203503 210946 131114 -107757 -40753 -134113 -254166
23655 -254166 44866 -76689 -238128 -151108 -4113 -42164 -163015 203194 -18763 60062 311615
23644 311615 242334 -165940 61500 126905 -37861 -37662 -173551 -12043 -15451 -41004 88271 -173293
23631 -239019 100107 -56150 87212 177382 -227703 18050 -180672 -25010 -74667 -158091 -78206
23619 96649 151454 -264643 83453 14281 -126784 141976 51437 -227962 166541 -211051
23608 -77734 300839 -49458 31734 -250813 -130271 133110 -229638 -69428 46855 -352369
23597 126504 -525415 133861 211891 -61858 44349 307523 -22934 -166691 -116855 -220826
23587 -220826 63617 68302 163259 -82335 378349 -69184 -116661 143209 372552 259592 308261
23576 308261 329379 14213 301679 162494 239429 -62993 211760 30200 -414926 264598
23565 -72462 101385 69449 115106 64703 30027 -70987 141564 -96150 188381 19557 -279102
23553 213522 -186893 189311 -152957 -70730 343992 -78498 -84541 -11701 -49630 -250099 250701
23541 169502 -14812 -215199 -156870 56022 -31926 181984 -93302 -298723 137193 27032 -76685
23529 -35989 -337912 140072 394155 -89400 -129277 -70840 10605 119623 158305 34368 -181353
23517 132408 -6976 -124731 -237094 -197712 197949 -128077 -71278 54933 -24437 -264240 -229768
23506 -229768 -107409 -130913 13361 709 128308 -66649 64236 -86631 91164 -9441 -145053
23495 -145053 -153216 109019 -5510 11398 3072 255981 28902 -125693 -209629 -8270 -76462 18613
23482 -358863 39266 -44822 -22340 166845 72823 83076 -240030 -113798 58100 -208348 -44440
23470 262450 128566 -10546 -157147 120694 -34128 -303644 85888 13017 196132 -143324
23459 -9683 84197 -110623 244339 -69801 -188498 307499 -71639 38104 176388 32359 -112932
23447 -190679 -324474 -287222 -18318 3572 154952 -239115 42713 -30011 37866 82742 -400623
23435 -7855 -124587 -43455 -138009 -491654 166435 -87833 171896 -10860 -113002 -167920 -85398
23424 -85398 -110270 114421 -153058 -243303 43500 -152707 91103 -53927 147722 -153371 140583
23412 -179087 352210 -81655 -28041 -173282 131923 -85139 -10067 -190643 102873 165426
23402 165426 -162699 228228 -42871 -193979 144470 -77443 -124686 10602 -192909 -128285
23392 -128285 13230 -84309 45414 92008 -123943 -122664 -93690 -21129 146927 124445 166619
23381 166619 60368 257953 -101701 58121 115424 -100151 101076 222123 176184 75439
23370 52005 9933 -68113 -59402 7777 47420 -141815 7949 -118231 971 265152 204076 189223
23358 189223 -67202 -107515 69059 -209030 211433 -371074 83140 -213588 45769 -161978
23347 -90110 -192471 -94799 -357107 -44607 151171 -46604 -75868 -167709 4502 -342951 228717
23335 -267595 -86023 -278579 68032 -7125 30879 178215 -327511 -6695 -159764 133002 -125040
23323 740 178927 -99121 20086 383804 -47007 122011 69232 -147618 -152998 44102 -46603
23311 -138200 1640 -3104 124532 -69685 244829 112840 -215967 -93533 313617 42820 -132575
23299 -149272 348496 71063 -14566 -450266 153024 -116351 295964 -166374 132333 -97242
23288 116031 -203203 -50384 -46323 22933 -145779 59807 -468770 -10164 -41354 -155287 231422
23276 -45369 75833 207284 138900 -184814 104822 143231 -376284 14903 145943 -153993
23265 -50220 -110303 -219073 -236919 -240066 -128641 -94336 -260493 -62097 -40199 57931 20581
23253 -24405 62081 44191 -209542 -106917 39280 -243801 -201095 77564 -236741 54930 -301098
23241 -338026 119128 23766 -108865 -250148 -198249 82363 -1970 35495 -227719 25975 32662
23230 32662 387522 -264221 -124638 -152138 12293 89367 -235847 -12030 4797 133540 -89593
23218 156155 -7942 172505 -109263 197531 133421 -568893 73729 -105215 -190152 151596
23207 79684 152225 190620 65159 -314065 -156949 73947 26116 -393658 -57572 -171327 -121587
23196 -121587 205904 72786 -498673 -170362 -119763 87790 138440 74924 119959 193848 52530
23184 133624 315407 -266561 254226 -140091 -213011 -232901 66513 4626 -194682 14707 -250424
23172 -29055 -8079 -59843 -72011 -103991 -56348 28325 -109311 78299 97797 105452 -177593 -69386
23159 97542 254844 44379 269579 59196 68920 98200 -110659 -68243 21591 -235629 59346
23147 59614 123153 10783 -181509 -88175 75585 -122300 151852 -182720 -71899 -190793 73746
23135 -23302 180362 361760 135680 123436 -94111 -77425 77803 -140633 -340402 -8228 131762
23123 -53908 66915 85020 130400 -14022 201029 -105750 156225 -48345 175471 165086 -317519
23111 168289 170214 296215 40467 -274376 265164 -64003 -96714 -215266 -272565 -277226 53571
23099 -203038 -212886 -180090 41823 -2096 -43747 360054 -376456 240322 169711 -83182 -47765
23088 -47765 269003 171007 209092 241430 -129773 50317 -52083 236334 -317129 -85438 15635
23076 16874 46607 26209 -367797 -104038 163405 -232736 86356 -326195 -49411 -231044
23066 -231044 -241637 -93822 348140 5637 185153 -72257 227494 219174 82583 -312881 382
23054 -22408 -371284 -133693 -152234 194240 224327 102786 -4879 -7892 -39368 -108653 -197539
23043 -197539 -22584 106417 97589 -22306 268087 11167 -103211 -80576 202947 204936 48617
23031 264224 -26985 -242933 162449 -74923 -259287 -40069 -62920 233171 403011 50197
23020 -233637 349856 -136596 134557 134684 10656 245783 -59256 114278 -406522 -212869
23010 -212869 50474 -31371 216565 -188482 -49930 43527 122383 -117030 -52672 -40685 77516
22998 -91433 -473399 -32539 14771 408279 -51677 -22184 -225449 127584 -62875 199492 262985
22987 262985 -164125 -163865 -205997 -18531 11602 -110376 95115 -175125 74170 -184598 -72479
22975 34972 -104693 20655 3494 -101754 -153801 -234724 302486 -129222 222068 79511 158119
22964 158119 -196110 129502 110453 -55627 -73236 -188940 -176856 156637 -309710 -347909
22954 -347909 389124 -74955 143735 -220835 -12105 19907 -79119 -160565 17784 19565 -17676
22942 112250 -75620 -119695 -74912 228796 7640 -68790 163985 -363246 89993 130508 -154068
22930 -38172 -242358 -33741 -182385 72429 -52654 77917 -76008 -326207 43096 -236488 -332879
22919 -332879 57112 -79957 -123898 -65618 22365 -338227 247477 -101891 -64010 -21158 16707
22907 -18346 37604 -146371 81079 19152 -161150 76334 266457 -89578 -76802 82696 -20041
22895 -10441 -93343 136958 -315814 116551 69425 -68255 1949 234074 -147322 11093 -267877
22883 -60540 -228632 53400 -79967 11044 54372 30173 188499 -197901 23061 -142469 -280981
22872 -280981 -80768 28967 46443 -43988 -7035 245990 -531492 -33086 55878 115476 14803
22860 -121767 -149525 160020 -24471 -119419 -245488 82103 -8508 -357405 -154119 -207721 -215503
22849 -215503 -107117 30403 -18145 -13455 97039 189767 -299232 38434 -276056 -163420 56207
22837 -117215 -351008 114795 -12420 95378 -237299 -204143 -271398 29307 -186774 -7877 -7160
22826 -7160 -127182 -13006 44868 -243733 -46112 135298 35598 -44551 -20811 71204 -140419
22814 -189307 -293896 -363219 -364876 276355 -121 -155492 156250 -67212 -232803 215749 -166342
22802 -155829 312749 -98546 -56585 -229983 -174518 -124198 -134951 151131 -167359 13316 96011
22791 96011 56529 37231 144557 77553 61329 -164348 -13620 -273670 15511 85259 -179192
22779 -149000 -39618 54312 -23230 -343102 18355 -19494 -56812 110704 -226777 65812 -220718
22767 -95676 -91029 -88658 274995 -81840 -151875 -97482 -126621 -48305 76561 250858 54587 180471
22755 180471 -116778 32480 -122136 112850 162477 -278009 -160242 3161 39067 7448 242390
22744 242390 -218212 6337 431178 -109168 -67028 -262239 232094 69350 -50177 69131 -452589
22732 -341602 -314925 -116712 -42033 -36529 59529 -164839 -176885 -46310 -225061 -192717 237149
22720 153057 -125598 -363353 232894 22466 75372 -230984 72467 114656 52059 -15233 -276347
22709 -276347 -46239 -144563 116373 -311367 40702 -199711 46238 -86845 161954 -277924
22698 40369 -151745 -171931 -332926 73827 264788 -19615 -96776 -160325 46959 -282602 172205
22686 -23709 -177604 -125239 182025 31537 205964 124689 -34414 -69517 -187845 7253 -84591
22674 162383 -30535 134119 -93966 -119480 -41998 -79099 -236919 218319 14815 84532 -88526
22662 -758 180421 -275116 153505 228430 343172 -80093 168022 -16750 -408349 -248112 52742
22650 17821 -317707 -187660 -375478 -322525 -110202 157348 86364 48744 -3348 -368204 -293428
22639 -293428 -157080 -76902 -108246 -6934 -297460 -105836 -216206 262729 -20071 -252913
22629 -252913 179931 29866 -48523 50949 -42463 -97147 24884 -156076 -334829 -240616 142560
22617 113941 17313 -167316 151579 23899 -305871 -345032 -222471 28048 -206408 134233
22606 60470 -72140 -91295 -32058 288595 -496469 218077 83704 -90228 55447 47961 -137084
22594 -292924 -161174 -147912 267469 -27974 -154376 -276901 -236106 -98389 109037 -57269
22583 56277 46055 -188693 -15637 283432 -37555 112779 61574 -140122 95047 366653 -177894
22571 -131719 1902 76111 -1205 124590 414385 76503 139296 -335292 160782 8343 -120249
22559 141623 -174338 -88172 -245111 87447 13991 -177329 12927 -147083 -110773 182821
22548 -113490 220345 -97154 -99238 -112158 -263258 20822 -316225 86602 -264013 -48920 30077
22536 -49287 72646 4767 242163 -122424 -74223 77513 147276 -118038 -184847 -97256 2932
22524 27669 -91134 -39384 -232446 237351 -28893 18408 -79584 -120813 184364 73775 -148646
22512 -177271 -54906 -51016 89176 -214489 -221140 210360 -23916 135732 -57455 102369 -94867
22500 59272 -117287 80002 -81353 134182 -194971 -238356 -302234 -57665 250757 -106280 71341
22488 151431 -211567 -166088 -285446 -236800 -211248 112935 -177280 262404 20282 -301785
22477 225187 -336089 -37562 -209642 -332629 252155 -215739 108956 -165573 -208754 -164534
22467 -164534 -351415 -271934 -84646 -376339 197180 247437 177721 -183676 -244181 -217536 -134661
22456 -134661 -61438 34384 224045 137389 12835 -47746 176629 -133374 114143 104198 327518
22445 327518 -218978 -317054 -12143 747 44398 -52440 31452 -189024 -12632 -226624 147603
22433 231960 -27327 222068 -130959 170238 89339 -95693 38247 -7452 51580 221245 -204914
22421 -222804 -180293 -278807 68692 -136342 114673 60630 3899 43271 55463 -17752 -240952
22410 -240952 -106670 192270 -176077 147100 -93195 24250 -57822 -307057 105795 -93593
22399 204937 12327 384371 256837 -39896 34685 102260 -97790 -8556 -310532 81831 -163798
22387 8156 -494999 -7411 -137623 11805 -228341 337310 183811 46352 55741 -122250 345146
22375 -133962 -27164 300089 66903 -132325 278338 -195022 -75378 -115928 59085 -131931
22364 54440 -263860 40423 54185 -211797 -42639 -112582 104997 95580 -295037 -7527 130280
22352 115181 222183 66281 -29988 -167732 -101868 -105278 -170391 -296634 -143122 -66580 112077
22340 96493 122184 -272160 -29758 -50204 58623 -75121 24318 16779 306382 111351 -106377
22328 -278405 -138910 35139 238766 331106 451000 -144285 -163058 -121030 -107599 -18550 46686
22316 18204 -256096 -340269 -136861 8726 86769 95634 453119 184493 88925 -43838 14765
22304 -10926 52055 61271 -51193 36670 26717 10874 -198934 -60170 -211782 86468 -163655
22292 -79873 61886 121556 -241854 -120309 105505 140631 -53838 367350 -495584 -286822
22282 -286822 37990 -150827 126650 209196 -138253 32664 -8541 236624 -30559 -79104 -105893
22271 -105893 -108368 -139038 256594 -70318 132145 -109400 -311909 -364903 -204348 -212690 -247754
22260 -247754 75882 -154798 55379 156591 -76183 181945 125144 -54804 119575 46763 117504
22249 117504 -111529 -296583 151535 185155 -400063 -111240 60361 -748 -98455 -163296 1398
22237 -266210 -197264 -52919 -144580 -145661 -13527 -326363 -183357 -108803 -312822 -19529 276171
22225 25821 -138970 40308 -117239 -355388 -101054 -32977 21632 -44638 45325 336274 54706
22213 -309 131563 -171699 72860 197867 -187466 -190116 -20889 -192353 85685 110942 -50645
22201 -53730 -325311 -206628 69254 180763 -178508 80475 -192617 8341 -281274 -117843
22190 -27591 -129120 -134592 -178124 243670 -326510 -52364 -118633 -81531 -322065 298911 -11605
22178 -162497 109109 -19259 69655 47093 192181 236293 470041 397550 -57339 229748 -50228
22166 72158 491238 2991 174504 -63321 -138170 -32308 -403141 -15715 277675 -306275 -111711
22154 -82921 -107534 -129973 91089 74252 -15297 -32680 -159525 -395216 9723 -92048 -199013
22143 -199013 12451 -111046 -134170 -107616 -41675 -462251 -83192 -67505 184587 53526 239854
22132 239854 89667 101597 -52562 -96281 -119405 -4578 -136624 -49848 59577 -81234 15267
22120 -81540 -33114 -306370 -63748 -120445 55541 204814 -223656 -151076 -213316 -139181 -349891
22109 -349891 183096 -106842 133734 -50368 -252799 104603 -157358 -236079 -231220 140459
22098 -55142 -77588 -359531 138067 -146632 -81207 -30054 135072 6217 -346781 62056 281674
22087 281674 -195263 352414 -29346 101216 -42473 -204359 -31266 -61250 165913 4654 286391
22076 286391 -186708 -131206 -341801 -200708 -29406 70494 -147097 -152780 -26951 -57002 -189088
22065 -189088 97748 395257 143613 -241553 -426441 -98326 107863 66 -78136 -89762 228237
22053 28952 -287059 314310 76795 -15444 -175798 -131730 -39980 -169144 -75913 -223900 -201210
22042 -201210 -31302 257060 162854 -59129 83682 3504 -76414 -197077 44574 -72280 204273
22030 256919 -202546 -109001 -117881 -140473 7648 -208251 14596 -272809 -138383 -55039 57217
22018 271523 25517 -73730 -170399 89029 114610 -323613 10480 108179 147520 81308 -9524
22006 -48528 -297766 19180 118233 -306144 65904 -151103 29362 -130534 29001 -154122 -45551
21994 -327928 57000 21344 -98733 5833 26806 -4687 126085 186899 -54346 -2507 48024 4105
21981 -55430 -193607 -127818 -211958 5889 124417 -144141 -64673 4586 -251919 -230917 62705
21969 69202 116461 170122 -46116 62737 -112887 -178112 -16189 94903 6009 18671 -181502
21957 -196138 157653 -85369 122715 -98664 -321091 -158882 37204 40352 75468 291276 114573
21945 -15854 11729 -241716 79371 64541 -6045 -82000 -36766 -78509 -167776 -47665 4435 -297188
21932 -152244 -98868 166059 147675 -177287 -41336 -63326 166477 79382 127268 54006 -209167
21920 -60210 -337444 -122562 -7813 -85157 132946 20463 103822 -152001 -364002 -153945 -139955
21909 -139955 338565 -101353 20719 -231325 -30615 -160879 -261198 -106962 -160615 227303
21898 -173901 69283 -47513 -154824 -162790 29222 57605 -403469 -393200 -302659 -110447 -16001
21886 -201309 280410 -137544 -90156 -21573 56029 -30168 38403 -254153 -105976 30964 -215564
21874 -147330 -255154 -320792 -174704 -121005 93353 -46479 50284 -71823 -212508 -148046 -38179
21862 -89369 336861 1769 -454480 165765 -152815 -323422 -258321 -349883 -316726 109030 110191
21851 110191 -31549 64515 99726 7131 -245720 -108176 134176 17557 -102738 -74531 -226466
21840 -226466 -232044 195898 -47299 -299765 -43065 -213136 74564 -60793 156471 -119345 16434
21828 40958 -19277 -97465 -174257 -287208 101909 -176699 -89767 -207566 -24500 -457200 160079
21816 249790 167634 -236569 45843 463962 -116242 -54911 262721 127283 -164990 -74758
21805 -222511 -350372 -497593 116463 -171484 -15936 -261893 -219327 -16202 -119711 39633
21794 -198959 290736 22570 107765 -3507 -31383 285385 -232722 7559 -174583 -82800 -409119
21783 -409119 -26302 -121429 13656 -132514 19095 42323 154402 490777 27421 -125136 -136904
21772 -136904 212269 35869 70166 183105 -266128 -179950 -6173 21266 -45172 -157369 187007
21760 109186 435916 -274259 48052 -248792 -46021 205415 -205310 145636 -172601 -129572
21750 -129572 479791 -470722 237109 -144671 -148690 212172 13572 -15581 -37182 65718 241702
21739 241702 108792 195716 105909 133661 -240853 9526 42198 -86887 -71718 190535 -214639
21727 -169936 50653 230452 -342357 -104005 -171632 -67433 64948 40048 -210686 41679 30456
21716 30456 -371434 -34643 -48850 -147880 -53351 -57207 54649 -122361 -400222 -34091 26134
21704 150975 119114 -486716 118486 -161795 -85061 33350 52843 -149429 155365 78373
21694 78373 -239069 -358868 -211866 -48998 -125323 43312 -133524 166996 -306616 95532
21683 -102324 -87421 179036 -251572 13594 -223482 -342626 -98197 138779 -284458 264862
21672 -250102 26038 3580 -36259 -42892 38124 -98638 -133181 -219549 -119027 -158172 -449613
21661 -449613 32078 -443074 -352427 -142066 -200681 168895 -221735 -164227 -194802 -2756 -93711
21650 -93711 -236583 -139873 -283197 -113376 -138668 -251086 -76488 -214564 34155 -396767
21639 -93065 -162670 -191571 -204705 124622 207133 -253433 -10069 -107935 43141 44284 -232511
21627 -158793 4904 80549 -135777 163884 -65975 212737 -168412 20972 408591 -188173
21616 -348309 -109481 5680 123091 -261700 159065 -44333 10416 -75763 -111329 154933 171855
21605 171855 -51597 36094 253729 -36452 -214018 -313521 243832 19072 -93342 -104942 -196464
21594 -196464 420531 171212 48966 -235728 -53906 64910 -17014 182480 -314812 -88241
21583 -66010 70847 -213542 54085 40406 -67373 -370105 -238136 -63902 -345693 -44476 67727
21571 108575 -203218 160641 -214579 10015 86089 -117816 129325 255160 -34560 -38731
21561 -38731 -159613 -91639 -178639 194216 29984 -77003 -173407 136890 181 48703 -28223
21549 -285792 -267937 -214102 -93266 -94079 -25626 -124337 -83826 -80701 -199727 -50865 60360 -141224
21536 -26673 -7316 -208578 -181476 134693 -247425 50360 -49615 319795 3350 -99952 -350531
21525 -350531 25930 -313819 181923 57098 -175203 -425683 -91365 145202 -34236 136254
21514 21562 131911 -51101 -140380 -18744 -211968 146387 -136991 -96362 -286551 -48253 29500
21502 -142764 234659 -45422 -19907 -12183 21785 -151515 -96900 -141776 -48320 -77799 -567205
21491 -567205 -247352 -406674 86599 -54032 -195306 -120051 -38908 -145479 -7259 -102649 -172214
21480 -172214 145315 -85132 14764 -18694 -318265 79811 45740 -149008 -91190 -219367 112417
21468 -145007 183767 116190 -131186 42403 172012 -35137 -173773 -482625 98898 -70799
21457 81994 426212 145538 55654 180540 50641 -130994 -57474 236233 47926 -253765
21446 -138330 -24502 37486 -216077 -87319 47845 107108 -191 -371214 257316 -126535 332241
21434 -53184 40567 13100 -233251 -59282 6967 114966 187376 276928 -82994 -20382 145245
21422 381482 137988 345834 103211 38650 499300 356056 184681 -156240 -107823 -61284
21412 -61284 -150457 -232168 -235039 -245418 -80782 206991 -135653 -169005 -61542 -267826 164583
21400 27156 -62810 55245 347354 38160 277124 -150179 58168 -158812 221418 18447 -32252
21388 -154047 -46033 -103666 -234287 -298901 -225095 -120865 37649 -123947 -189400 67042 29951
21376 -37629 11481 -112163 -217300 -355296 315476 -546567 -75558 210951 -195195 -77398
21365 -303277 129050 -63699 124586 -58310 -579022 5811 -235714 64140 -142434 -227806 59554
21353 58734 -466468 -352785 -163040 -41536 120148 -50289 80364 -37293 54859 -448930 -21550
21341 19861 11114 9765 -123280 -71744 -184847 -232864 -47923 -88527 4317 -98547 -43303 41360
21328 5061 189076 -20264 -23429 138359 -24689 97965 280831 -88560 -380969 -293608 -191942
21317 -191942 191011 -258377 -333428 -96488 105386 69389 -91547 39545 -100719 178079
21306 283791 -353709 7430 -116623 -378577 -73366 105555 -62929 -22077 20104 -124375 -428445
21295 -428445 2588 -42150 -53137 -68476 -316968 53938 -332026 -350045 -28323 7635 -73037
21283 94998 -53783 -220696 102973 -291294 36151 -212406 -222440 -318728 108959 -199004
21272 150461 118372 43522 -131291 -345632 -162529 176777 136551 -232487 -409735 -146878
21261 144295 -262805 13312 -196490 -29530 -319610 132915 -340722 116737 79171 272337
21251 272337 -49160 51176 -99471 44906 -149231 -51194 -142016 25095 -100845 61611 208236
21240 208236 218565 -337859 189124 191559 -309997 25747 103652 43795 203837 244757 58404
21228 88626 -106714 237024 -5757 2349 -196380 -179113 104102 -181064 -101144 29120 217185
21217 217185 413698 149865 111508 104392 20413 -7200 -213389 240899 22608 -299606 104447
21205 -342523 -400742 -64123 342201 -168875 297095 23662 -268652 119791 -78171 135127
21194 -150738 61745 -237605 208065 49691 -131064 14660 -214399 -259391 -189530 53271 -164252
21182 -80091 -205505 -87323 43848 170553 -36910 -140349 4512 -130952 88345 -111393 127568
21170 -351888 -19394 31518 -251672 -103251 265305 40265 -93992 -28398 -140280 236174
21159 -121099 -14756 -114282 191582 -111732 79253 219934 -49882 199064 -3209 -106483 -271295
21148 -271295 -229606 8592 -267129 -194660 -56325 384787 131235 -67301 -246183 -135605 -85709
21137 -85709 -190639 -326437 15523 -319036 54253 -147954 71028 -34999 110651 36360 26451
21126 26451 17554 -304195 -263945 -183661 -280279 82756 -40758 -14544 -95662 -218360 -227022 46482
21113 -19644 34197 -161788 -26838 192104 -238682 -350068 2156 -80073 -14017 64562 -47670
21101 -107161 -74281 58122 48221 -222885 -105859 27258 89139 -21473 107724 -78410 -399395
21090 -399395 -344928 -110021 -225415 -333311 44809 65914 -112735 219784 -283579 -169234
21080 -169234 -196444 -197267 310949 -106454 74734 -356982 91016 -53324 -52275 60219 64689 -108854
21067 100189 152930 -56108 -42267 -329485 81615 -81362 -160725 -293926 203214 -129619 15706
21055 49048 -195771 -196665 -158277 -53649 306185 433647 -189743 -24451 -143844 42551 190987
21044 190987 114795 -119832 -216519 187413 30244 199802 91786 -163704 140243 -146750
21033 -315511 110561 18254 -191602 -255418 -1804 273691 -84183 32837 68284 155681 303769
21022 303769 -243995 -72879 -64845 -287292 10953 -45391 65943 -83476 -365017 15168 -139627
21010 -29658 453684 152604 -9459 80789 -257616 -112768 -155691 -150234 -16713 78141 95600
20999 95600 281504 242297 49473 71269 350701 144898 221943 286360 156299 5813 200584
20988 200584 79057 134506 51492 21683 -52324 176140 65518 -282912 331081 -135835 85366
20976 -244191 33259 -175107 34645 488557 -34016 45733 143628 39072 30971 61844 -74491
20964 8882 -379008 -222784 -323278 -180354 -27626 71270 -45098 214378 -233660 -11095 -73417
20953 -73417 123885 -187200 275036 -59362 161686 71349 -45664 -159383 194850 -18567
20942 -133154 86128 -63562 145257 234803 -254111 2809 10659 216465 -36142 18260 -17415
20930 351322 97064 364850 356660 78482 284220 -52053 -8153 -118427 -145909 -177996 5222
20918 -104818 64819 156531 47175 -255502 -209516 445453 -61252 -53326 241530 85152 15018
20906 12555 255358 255693 -103896 -230863 -272918 -270856 -129069 -84831 57585 127214 -80714
20894 -369008 -274451 -38229 -266652 -2739 -101844 342171 -90145 317421 154321 -190873 10147
20882 111249 8791 -162373 159877 -181207 11317 131942 -200159 57474 151791 -147465
20871 -30068 -162038 249001 -185093 -174072 -220011 -22377 176660 149886 -154738 -179450 -165264
20860 -165264 -18858 33659 -368937 -164102 -1064 171874 327654 70303 -157838 -186424 -239686
20849 -239686 -132935 -281947 322345 33597 -22313 21390 -95337 -75001 -193745 -300992
20839 -300992 -195530 -29420 110746 -271214 132375 231850 38921 71358 191182 -196367
20828 -233978 271397 183058 95915 204754 -38742 -169939 -93403 -136981 -474441 -189894
20817 -14110 -350877 -256608 95763 26344 -86502 -167558 -111417 94476 -182629 8567 -325746
20805 7323 106329 -145217 -116089 -399784 -1218 -153501 17072 -35879 72374 29052 -285991
20793 -114182 316491 50717 -276076 -260760 -121520 -183584 -134076 199162 -152590 -199826
20783 -199826 65240 -146159 83633 72700 -91812 54455 -128257 -122752 -177842 -207590 -308647
20772 -308647 -27303 -135653 -282162 -273333 -150542 33577 -98200 124502 -241916 362678
20761 -46772 139937 -240856 -45744 -88701 -77802 -30230 -46665 -75023 78745 125110 52295
20749 -31777 -287 -149924 -27377 16978 -148369 -103954 -95490 232830 63298 58494 -32462 -69463
20737 -69463 190045 -52743 -100769 -220266 51680 -218893 -187948 -228640 127689 -101677 -53340
20726 -53340 -58489 -64541 154999 21046 -245134 -122320 -268369 -25616 70478 -99932 -362533
20715 -362533 36929 -135566 -14109 -133385 -272562 -202298 -145223 -42167 112672 -169832
20704 -351795 -81934 -65563 -52949 -219443 -290145 -511902 179552 -111937 -278413 17942
20693 -114301 -98086 -199921 -188224 212341 -345234 298702 -293115 65004 -230121 116898
20682 45749 -217833 -12699 -108765 -454057 -130684 -228620 -172256 30114 164248 -86650 -31373
20670 -103032 -222111 308234 -78955 -306092 57477 -151556 7150 11433 -347938 -201352 -221066
20659 -221066 169982 -104909 -83905 115302 19800 -99611 -198402 163500 -211293 73330
20648 68818 -33635 -57713 -214552 -207886 -129501 -72804 -77705 -489191 229376 -99424 -217840
20637 -217840 -241352 -104087 -32518 79471 -292985 -395515 105209 178608 134920 59936 56880
20626 56880 -112979 -103290 -191368 -123765 2579 269824 -377011 -160821 -150472 222664 -238549
20614 118831 -106458 -225722 21355 -92662 -277046 -23184 -73946 -565225 -100252 -762 -71223
20603 -71223 152603 52289 -41771 -240371 58480 -10036 -125227 184785 -19736 -346990 96029
20591 101074 133833 -278863 -122998 187705 -32724 -314194 55827 -42816 -103273 -161909 241227
20579 -4383 -37879 38942 -63675 141013 43229 358937 80635 214259 -160948 17481 -65139
20567 -201379 -65949 -222953 114005 110664 -53923 60823 267441 -186551 -46231 -59323 -10849
20555 -247983 57301 25684 -74773 14131 157618 657 305082 -34038 -362305 -21485 -155861
20544 -155861 -184273 -341141 -40789 -195812 -422907 -101398 -146011 -62932 -129191 -210746 -59081
20532 -371265 -205313 25643 128247 -187217 101503 -197087 -112176 153443 -60826 -111769
20522 -111769 -72780 187436 -32369 -153818 303862 -53680 -14035 -59404 32476 137544 77703
20511 77703 1782 -132326 -19885 -89068 -288095 -157389 -2521 -24914 -418449 150724 -31590
20499 -75802 302259 138064 189961 -50168 194343 61690 -187216 -331529 -5930 -382243 -43778
20487 215101 -149097 69535 -112154 -211566 -85705 19715 -123122 -90893 -13883 -157149 -20538
20475 -143723 -88950 -161113 102772 -5077 -24207 48336 -48838 59867 266654 138508 -242492
20463 -111336 -47202 -46220 -138835 -111784 -8484 51868 -101470 74542 -42713 -115618 171691 -85170
20450 398379 -33460 -100012 -2762 -80882 -54162 -66821 -276762 -68671 224659 -214645 -76520
20438 -145128 -228543 55683 113834 -263969 -25810 -6318 -16972 -326640 40170 -287586 -236252
20427 -236252 -264584 65684 -262660 -140624 -325360 -375045 -116806 -327077 32745 -265239
20416 -33989 -82687 -93941 19399 273308 26512 82240 70197 187092 -292789 43946 -382420
20404 138488 -73095 -64576 296926 223860 130133 304524 111563 16300 -166821 -44255 116717
20392 174263 -521712 29431 -138434 761 84990 35710 -106311 88927 134325 -177012 -451013
20381 -451013 230763 264413 -26271 -86874 -132479 141010 55940 -15398 -32967 249410 178903
20370 178903 -214991 -198387 89079 -282379 -183340 -50212 67630 -193148 -105399 -279109 -138638
20358 -201083 242759 -172097 -271113 255976 255316 54 -23353 -144051 48073 -129764 -218511
20347 -218511 215876 -82815 279247 -276748 -346618 17923 -143467 -145344 281494 101199
20336 -327020 221622 105221 -166846 109089 -151643 -38221 -401909 -154339 -194388 78657
20325 74384 -248420 -228800 -83594 -204586 -171406 49443 44692 262743 -44248 -182335 -275082
20314 -275082 -397275 -165614 30692 459531 -135514 -245385 156654 -29713 -155802 54163
20303 -385428 -248131 -38912 -364919 48247 36166 -132667 134246 261321 196346 270499
20293 270499 -96552 -76261 192181 -5676 -168569 -163464 -112154 -64872 38483 -152976 206636
20281 -212830 181598 -17909 -85533 -239335 -355990 -27328 -135714 -53879 -192758 -160935
20271 -160935 -184286 -56314 -116621 -80100 -247815 -67456 263338 -140424 -255089 -199757 -217654
20260 -217654 102916 -170922 -85590 -129756 8012 -161491 -192670 -54673 -55664 -213706 -130081
20249 -130081 -174180 -360608 -76188 108872 -98528 -70394 197423 -13607 -354038 -127004
20238 -3027 -182865 -98584 23769 152365 -227194 -144627 105174 817 -175116 -17052 -93295
20227 -93295 100756 216685 -163212 -289570 -126521 -32373 -394655 16375 95494 -172996
20216 -43546 -320690 -214464 -271676 -594 57277 -278735 262152 -9626 103783 358971 131408
20204 -241773 -176563 -284477 60188 -244730 -35810 -358062 -397318 -73774 145490 63639 -500690
20192 -155881 -150271 184658 -299018 -268855 20154 216946 431618 84686 -38630 -135964 20531
20180 7099 276865 -40875 -160982 -7000 294001 279263 334689 -327628 133120 93377 -471763
20168 -109558 131767 -156552 -76800 116783 -10146 -209238 -5274 -44997 -168451 130554
20157 -6823 -45448 -69394 252893 -67803 -311402 145143 100403 21573 428323 203846 -162567
20145 249974 -132056 101625 -15661 215524 31580 -18757 -56879 8880 -147945 331016 73599
20133 466007 241119 530629 486295 299786 -168401 124944 342128 67598 271363 116535
20122 542213 575392 383714 -43212 -75109 -179587 -39972 38847 -156910 -464277 14023 19861
20111 19861 -555189 -270199 -114806 -42275 17525 -164921 -322589 91981 277067 12694
20100 191759 -426996 -292873 -221579 -50558 -166694 -230570 51400 167259 -66379 -247033
20090 -247033 265490 -20072 96468 -117889 -98324 73287 32633 -237308 -108945 23164 -94061
20078 231090 7351 -189397 -487672 -83440 -201170 -153607 -44408 -32142 -236511 -205839 116924
20066 -127537 -78781 78239 138973 -88927 -246116 34214 233574 35819 89760 -197021 -265214
20055 -265214 -59778 -229477 182734 -98548 34719 -135976 68355 -234265 -289075 -93621 -36761
20043 4980 -247698 -95221 -264160 224600 -127730 266565 -283524 145968 -35807 23422
20032 109705 -269285 341823 147607 49660 -261232 17310 -176552 -107992 244917 98567
20021 -58292 -7212 113774 72527 -260373 -63200 193049 -241385 165606 -59718 90255 291182
20010 291182 -264956 -88199 -377570 -79100 -265640 56301 33379 -201033 -324424 -105776
19999 -246803 79786 -24207 436282 -274505 39791 -17691 -17401 -137412 -36956 -31318 66515
19987 82615 161890 83284 61396 173379 359240 240992 29590 77893 186722 50090 209878
19976 209878 156738 60603 386845 4462 351061 120263 220549 210324 106600 58452 191284
19965 191284 142718 -180094 -119089 -193173 -206016 344298 -320563 120810 60190 181385
19955 181385 78087 -39209 -31982 413785 72151 -49502 58200 61166 173826 160500 -74508
19943 -70214 136639 141679 -536 116232 36488 492302 161475 30500 -66665 -24427 -5819 83825
19930 139225 -287058 -404922 -25414 -40711 -34378 -239771 -163746 -73784 14293 -87561 -145893
19919 -145893 -32293 -154952 -75338 -13834 -34535 9892 -432115 -186058 13534 -39917 62714
19907 -233602 76712 80253 -72900 -31141 23299 -6230 5923 -100474 65067 198824 77967 -120495
19894 -92267 122385 -51770 73033 -48919 -142369 -135218 -54371 -150390 176674 -75505 276914
19882 51392 145379 -93741 -164402 -179785 80985 -270487 288802 -49712 -178892 41322 -111059
19870 61321 -68905 -41879 -261451 -139485 -60126 -158839 121262 -90223 -304473 -130281 -212907
19859 -212907 -27542 -63865 272748 135561 -183533 -89148 76979 -149320 -241161 -165647 -47473
19847 -192793 38137 -21264 -419167 -103841 -104136 -284477 13741 -7311 -208382 -202582 -260983
19836 -260983 -89430 -107207 25437 -208135 -194387 -109315 -230327 -316013 -257835 -513485 -229820
19824 -320817 150890 -242518 -229212 120496 110426 103637 -161422 -284082 194280 131564
19814 131564 -74802 65373 43546 5677 -127087 135668 130887 78008 -373547 -207129 -566776
19803 -566776 -221984 -112052 -171260 143611 -154008 102603 128571 104139 -167835 -85973
19793 -85973 -49282 60676 -312660 -47461 59519 -234478 120386 51197 -119694 89050 -127987
19781 123823 -90006 91715 -19643 43176 -43463 -380970 -164665 -243450 -120997 -1639 164240
19769 -72441 -107344 -126641 230769 44445 137020 177651 107033 -22269 -201163 -169341 167988
19757 -258298 -24952 126585 83359 -72975 -306861 -163255 137759 122807 239355 -63916
19746 -149475 18220 101606 -56571 -193984 -164361 206070 -24499 -409132 37294 99457 -122784
19734 -158930 116644 -225901 -48740 134004 -116218 347560 37818 -95598 -152019 134087
19723 221228 -183855 117983 65945 -222388 71275 -55886 254433 56808 760189 431543
19713 431543 379878 257695 150537 16678 194523 -232409 -261671 -97245 -86544 -266037
19703 -266037 -163912 -172229 -70620 252484 -47493 -111691 194828 -294657 -297238 6028 542756
19692 542756 279197 -106035 180836 15208 -179187 -159045 338426 -20848 -39765 310880
19681 615951 515417 304690 133152 58875 233542 -143019 -274085 -310577 40748 192803
19671 192803 -105205 -253490 368436 269960 333589 -155200 -173165 -200091 288602 107665
19660 -146484 -134030 292722 -141935 241854 -58974 -261237 441335 276750 -174102 -230943
19650 -230943 196279 -34691 30671 20186 -214628 -74062 -153531 16810 191127 -201934 -38088
19638 177938 -60272 -379767 -395677 43584 -187888 -23119 -121687 83207 -41641 -49216 -242835
19627 -242835 -190394 55642 -371466 -163732 158589 94508 -70115 -87751 -17283 19007 31666
19616 31666 33114 86367 -94090 165511 -165302 -127478 -208246 7632 -39082 -91528 9503 -390668
19603 252689 -120247 -186607 -292029 -155423 -586676 184983 -347785 -177049 -195267 -79175
19592 -289113 303202 -408806 -184231 -193447 -57878 -161928 -2334 -34153 225612 62817 4120
19580 -385849 -54107 124670 -95515 -111315 -99917 24332 180616 -171267 -73864 -314900 33258
19568 -179836 100693 135260 201208 -227220 121543 -187171 49541 -327335 64595 96053
19558 96053 -144842 -34372 -195385 47147 -100699 202017 -413215 -112540 -99630 -229416
19548 -229416 36841 -224810 194019 318067 -339650 -89682 -363095 262814 20229 -114828
19537 107758 -100764 4158 -154725 162104 103091 72124 -66538 -88531 26120 -215261 -24311
19525 -122066 -47900 28536 74530 -104170 -85955 -219144 -92769 145695 57565 -7419 -9264
19514 -9264 -156624 -457975 99716 26396 -98990 -137667 175519 -80791 43515 -107426 -85468
19503 -85468 -188990 -141080 -12012 -171181 -14772 -189885 -130079 30118 -104720 -27290 -65191
19492 -65191 -66407 -66378 -159273 -4413 147548 -55860 119320 -163467 106630 -97078 -425079 -67163
19479 59424 136994 -46870 -367153 -240602 3127 -284572 -56595 -338294 -253336 66112 -184757
19467 69562 173571 -138038 184748 -254028 74584 109627 -407235 -154194 -58711 -131603
19457 -131603 29626 -131130 -149416 -100161 112867 94041 -56865 309608 -273126 -374638
19447 -374638 35234 55749 -253713 5076 -199183 -243017 -82517 170356 -27341 -149805 -96198
19436 -96198 138024 -147890 198652 -116290 -284931 -317722 -218283 -69691 -64646 -177199 -185864
19425 -185864 -198016 202785 -156038 188165 -79166 -138912 -185503 -61513 56078 -150794 -349343
19414 -349343 -20210 104986 56115 -544816 85690 148533 -130572 -105470 -78092 97693 -98621
19402 -151744 -91188 -41598 53861 -31624 -221565 -141767 -265701 -226813 88487 108559 -169686
19390 -504713 -283537 -34374 160096 194915 -92008 -22748 240887 -108344 188383 -185347
19379 -218780 -68608 9103 -179414 -193656 115184 323278 173015 -221078 13142 169017
19369 169017 151735 31650 -79665 -28224 -165141 -100242 78372 -377456 239845 -277063 -57018
19357 -73426 -31699 -58744 53481 86332 80948 -186276 -180445 -130641 223459 -57253 -170976
19346 -170976 -205761 -78794 -197201 9995 -118925 -40812 -107355 -427189 37772 -111211 -265135
19335 -265135 60551 -183598 204344 -223697 -116193 136151 1017 172035 -56743 -240301
19325 -240301 -215444 -72422 66264 16932 -267477 -227889 -206404 -362632 -173284 24580 63157
19314 63157 -122247 -374177 165699 -262993 -176418 -18962 -80150 56631 -35119 -82630 299836
19302 35165 22147 864 -555897 230367 -257688 206364 36515 11649 7141 -103875 -374549
19291 -374549 -396473 60371 -560843 63352 -81535 28461 -60332 198812 -271076 198560 -26954
19279 -25434 -168730 -212373 -46508 -9050 -50317 -198657 -38346 -74854 360013 99474 -260501
19267 184506 -257903 26028 -135925 318269 81312 -131680 -52799 -20025 -177237 -188383
19257 -188383 -293077 220075 -190806 275204 -349417 124842 -45372 -16727 -135885 -119413
19247 -119413 40143 63283 -81230 -156552 -140963 8730 -276039 -444051 -218064 -264387 -80062
19235 -105857 304683 -340042 47576 -282831 -27964 245500 -89662 -209598 10130 -235450
19224 -283532 29048 -294501 -137095 56239 -211583 -123275 -282401 -1831 -146619 111983
19213 -70434 26259 455517 -91205 -244799 -255329 -7963 -184871 -20103 114611 103228 162872
19202 162872 85924 -361170 -169604 -156225 110686 -217800 39551 -201168 -187123 173471
19191 -16122 34141 -139833 148130 311722 133947 -298344 -268072 123568 14868 192970
19181 192970 54502 -137868 -281740 -186377 144505 10996 -119741 -60037 -9399 121372 97763
19170 97763 -91825 -117782 -74629 -280946 95041 -265052 -96569 -154205 -109086 -181827 -82977
19158 -267574 91958 -188656 24889 -196276 263675 -51449 -66672 186166 -24820 -332477
19148 -332477 69913 56443 -184589 149650 15630 -95875 17487 -149239 -54426 -166662 -153374
19137 -153374 -49004 154403 -76590 17218 31018 -64663 -42015 5049 177418 48480 -15179
19125 2558 -119558 131154 51900 -135572 -17388 -150630 -141440 -78586 -50505 30097 446236
19114 446236 -143762 66111 -416056 -184772 -184461 -115519 -132144 -104578 -148875 -290562 -50557
19102 -4949 48829 -100343 -142632 -377599 -173294 18261 -146841 -207671 -69729 53580 -353881
19090 61907 -306995 -161901 164976 177087 7349 -275500 -112633 -22747 -137157 -62729 218868
19078 41500 -28172 -316405 17270 133896 61614 -76692 -181709 80209 -3150 -55183 6177
19066 58543 -206332 -37146 -77906 94722 -218437 -268326 -75900 329607 104001 -171338 92069
19054 -236641 -133740 151612 -147080 -161866 247835 -247948 254922 -122497 -81927 160093
19043 -88188 -373869 -74882 -31011 -147509 -193584 -117352 125689 -214399 -287111 46992 -47173
19031 -77025 -286837 48030 -87500 -70911 -19626 -44368 -86812 240022 -152204 78085 3287
19019 -334596 -70824 182032 -108633 163607 76414 -19832 -286460 -211788 -101866 -81213
19009 -81213 255479 -142890 -42877 11738 -489129 -84548 47466 -409952 207011 160442 77475
18997 -51507 -59553 -83417 131716 150012 173430 -25182 171782 -128328 14860 -97607 39206
18985 -6307 -102754 -195366 -163594 -250582 -49073 189223 -5052 -389664 6897 -53048 151271 350685
18973 350685 291820 7192 -301631 93253 35945 179930 151824 -150048 -40112 113964 142607
18962 142607 293918 244837 222204 43921 243400 77032 590812 330080 -4815 146819 -28463
18950 -9770 -445755 -92779 -23173 237149 161404 -286191 44876 -267625 -194887 168691 -194524
18938 -1174 -210449 107472 -79247 29556 -85238 -49769 3933 -95089 2546 -13982 421623 11853
18925 -34766 -158118 -131237 -177450 -195039 -115568 72086 308223 81768 234993 212605 156136
18914 156136 -151543 60566 -3882 40298 -91576 -222388 -9642 -92440 -268356 -53947 -232314
18903 -232314 -440699 -176423 -89099 124581 9129 53030 116354 -404553 517493 540054 284271
18892 284271 657048 481633 217734 3025 -109856 -177182 -18045 -186353 58801 -69731 62530
18880 15187 -143834 -28835 75417 192064 -151356 -61218 3918 249183 -315453 -194953 -357440
18869 -357440 -92045 -191311 -146168 -338542 129894 -432154 -122666 -136672 -291425 128303
18858 -228404 -112298 17222 -416060 -105666 -97600 -84628 -317110 -256406 -170775 -69727 10333
18846 -171535 -269149 177479 78889 -46667 11332 209029 -147395 188692 -92787 416052
18835 296346 214472 146613 165920 58642 160111 35738 -105996 -64606 43858 -260892 135810
18823 -149092 -25788 3152 -308245 412143 -123617 -309895 -258191 49117 -96637 -143245 157671
18811 -125174 -45265 147450 -154814 -152256 -194795 65161 90610 22294 116085 -173743 59783
18799 215862 -103362 155649 -149932 81414 246584 40702 204536 -65900 71667 -191377
18788 318514 38673 66678 -144175 269620 -147848 -231076 -164401 -191019 303454 77310 -61561
18776 -88428 -58827 -30568 -97571 -130574 66502 -302457 6688 28892 -46683 -126797 -34113 -221988
18764 -221988 153103 189589 66619 -77492 -136275 126721 -118666 -471145 5985 28057 -295695
18752 106081 -284337 135933 -46787 182512 -369330 -197946 748 -187566 30786 222435
18742 222435 -32158 -34355 -100883 -313520 -12849 6555 -4295 284450 -81657 154448 -288784
18730 341883 300628 -90650 81547 -289279 -13871 -273489 180542 -30935 -536039 -24932 -128466
18719 -128466 16242 -224084 -111054 129477 -92594 -110504 -224101 -29942 5913 -13932 -110960
18708 -110960 -287529 -268097 -166387 -90836 -291265 -48548 100865 177773 -276976 -310146
18698 -310146 199269 122848 51255 81375 59790 1741 -167950 67390 -44507 -169383 -143028
18687 -143028 -273533 -146945 126599 -300143 163415 72829 33432 9170 -23196 72748 -195859
18675 -25699 -144159 141387 -24682 -1007 -152836 194633 153127 -100867 92338 -373079 171037
18663 -262022 7118 -204914 18495 -44976 -21143 -89630 -171504 -62078 -295399 100077 -23175
18651 -146235 -33201 -86279 122446 -103464 148634 40315 -162684 -212016 144364 -85539
18640 229835 -129876 -232560 9606 -12161 -396316 -205197 3211 124245 -289766 -250766 -230017
18629 -230017 -376590 -123901 79355 -36263 254060 -153677 -93752 -291929 -248006 -145708
18619 -145708 284731 -96567 -65367 -214812 -100956 192189 -220023 -132725 -210254 -167820
18609 -167820 -452710 34211 -75968 49630 230290 86905 -157654 19831 -50547 67704 -327235
18597 -296586 -53113 28971 -196632 -11223 -166806 204051 -92311 -58596 -128781 -182231 -13521
18585 234757 -119565 104338 32244 -78040 -179434 -128943 -74371 -239508 -176103 -20540 -385838
18574 -385838 -209796 -47051 -30502 8239 -12806 -73012 134613 -342045 492003 -47327 49325
18562 878 -411743 -163942 211986 -68093 -56692 -147188 -372599 -319599 -244773 -282062 -215551
18551 -215551 -19244 162816 138744 11065 -35485 255787 -149734 -56374 -280705 50908 310515
18540 310515 153309 22212 -196490 -203916 -243013 -214366 -34140 173160 -133785 -240646 -30394
18528 -65930 -204182 95497 -35027 -397330 -459315 -89732 -258843 -259199 -9593 -232331 81608
18516 -28907 -42491 -56902 274658 -144334 35528 65904 -193840 -175759 19337 -196410 -432262
18505 -432262 92923 5513 -240835 72744 80503 192015 -23258 -382589 -117965 -127731 -92273
18494 -92273 106577 -232150 315815 62945 -76152 -110671 339437 118121 -10427 -19122 -85967
18483 -85967 -75535 -144501 132705 -392348 -274502 223574 -170648 54387 7422 -248541 -3246
18471 -142674 32320 160415 -22809 -57296 -174057 110028 -174077 175043 36337 214732
18461 214732 221890 -192618 -18429 182521 -110800 201966 -283854 99518 -61292 -145456 -186629
18450 -186629 48949 225264 38523 -59362 -174904 128432 -94909 148152 -207859 236432
18439 27117 -249080 -67832 -130344 -81859 -97872 -230964 -29156 45874 153243 -54024 -184120
18428 -184120 -207065 -135477 -175448 57806 -6049 174097 -35886 -171165 -227946 -120274 -370212
18417 -370212 -229083 -8024 25930 210015 -37243 -176727 233190 70693 5837 128837 -178896
18405 79303 62141 95865 150317 -76725 171774 192082 -59912 -76494 38096 -39731 -84231
18394 -84231 -302290 -182654 182663 -67494 306017 -77563 -197287 198119 -269215 50508
18383 -6309 379324 228157 -75576 298448 95172 10427 -61937 -133208 146923 -106804 71104
18371 -363027 -473991 98714 -202078 56006 -36711 -207545 31799 112363 -503790 167049
18360 -132244 -185786 -116955 -205900 -232845 -104586 -143799 -209268 -185089 -171449 -165896 -263654
18349 -263654 -28456 -148153 122986 76877 330895 -88886 45548 -219313 63004 -12571 -287726
18338 -287726 62699 154242 126368 92327 1980 252765 35596 -154965 115422 -7840 126173
18326 -98074 38990 -226671 42559 40425 147954 -123328 214123 -252159 -211487 97194 222614
18315 222614 311280 -89442 -31764 -12935 -125306 -381800 -139204 -98858 75639 -236304 -6992
18303 -83411 -214145 58048 312684 32814 -233695 151292 27069 -490255 -25274 -161344
18293 -161344 -183893 -434200 263769 -197831 36612 -135523 -7953 -137175 -152987 -251582 -30297
18281 38407 225982 -159987 -345502 -74257 168750 -337992 70281 107146 26137 -227511
18270 -14481 45084 -21690 -99956 -48988 -61839 212670 -77873 -307111 -64797 51975 -221966
18258 64114 -435744 22481 -103212 18489 -94330 -96612 -70663 10287 -277251 42001 47290
18247 47290 -9434 49032 -4415 -161736 -3933 172960 -231943 -99876 132346 -158151 -36219
18235 -145386 -210262 64977 82627 -234920 -283255 30543 172522 138518 -367652 20725 -26480
18223 252208 -210046 153015 -169472 -218851 -30049 -50503 -277162 21153 -231637 8540 -41476
18211 -395937 -200912 230859 -185433 316570 -142216 -169525 4030 94686 -98003 183758
18200 -137299 25704 17830 -168870 -8228 -278460 -59402 49595 -11252 -91254 -85799 159004
18188 -281606 -24575 -2349 34330 -144120 -114304 19566 18636 -311555 29694 -104152 -64401
18177 -64401 -914 -45085 190550 27846 -60251 -45613 101062 -205229 23789 -116174 -29278
18165 146287 41772 96853 -70613 253843 1593 154028 -26540 -75496 -110776 -145490 -305358
18154 -305358 139779 -38391 -33016 178261 -53910 164242 -73030 124543 158561 -130093 -191222
18143 -191222 183224 283873 38649 -283961 151642 -122933 -234537 235026 35254 -52935
18132 1320 143996 -309686 107393 -146975 -265538 -294669 39231 228506 -41524 112696
18121 -53704 -494839 -73442 -103750 -275510 -83309 -435517 -16907 -96696 44341 231253 -58640
18109 -5099 2891 -131073 -90488 71770 -31294 101051 64217 -30860 -19173 33664 -125972
18097 -12541 -109594 -199386 -195669 -103989 -3307 -140960 310709 -43584 48302 199833 -150484
18085 215746 -77454 125418 290284 -937 -201084 -117799 64812 -126220 18652 -148455 180155
18073 -176903 -383236 -82077 -147952 -68113 225466 -117316 -70229 -135346 -58005 -158314 -72432
18061 256226 -237776 -124902 -44907 185322 -318308 -111424 -8493 1844 17670 146670 150630
18050 150630 -104179 -216417 391059 -351805 -143178 -97505 -168965 358020 119917 473816
18040 473816 61625 -224246 326384 121667 -114704 -282667 -11269 162501 219402 -6604
18029 16131 40460 35043 69535 300354 -53528 -72846 147717 -131761 348842 374 204340
18018 204340 -107092 214075 -4347 -249103 118867 142087 -58038 155012 -100890 -6070 -213518
18007 -213518 -160608 100527 -152371 20135 -7718 -143488 50789 -61001 -135443 154930 159809
17996 159809 71912 -139734 148167 -114905 161361 -384021 153418 -77402 -69064 241223
17985 -14857 250202 -48957 -288262 -45822 61430 -27854 -76983 15512 -211365 550 -40257
17973 -15180 160015 182543 182035 6948 204144 257388 221978 20562 339912 208641 -324417
17961 64563 191290 112246 369065 -143609 82219 -5141 -2686 -241143 -311805 -35521 23819
17949 -192289 -73673 28172 -384097 -11599 187671 -334658 6119 223107 18243 -70524 -162910
17938 -162910 21271 -26844 -107896 80228 -91008 65456 -105907 -202579 -81845 -69486 -183265
17927 -183265 -85206 228066 100482 306224 171455 -287082 -99509 174693 70896 -65487
17916 19553 226509 -67667 280167 -50394 -223429 134494 60801 106464 -172914 251465
17905 392150 -117882 186986 75688 -371704 296959 -170486 116335 12020 60289 30769
17895 30769 170134 91131 -55268 -63939 -128488 153296 21631 -75554 -107308 197508 -17209
17883 9077 297034 293122 110335 331544 347 128942 130046 -61649 -42584 -51691 112201 37113
17870 -27885 -180340 52161 -6918 22776 21692 106428 113741 -6506 -108872 284448 157498 114603
17858 114603 206710 223532 -52159 -83498 -547773 112235 62634 321673 -103274 -18548 -179162
17847 -179162 35589 113753 -16383 258438 63979 87244 95382 55160 -263588 169373 -42037
17835 -55498 125198 -35505 280147 144613 -341163 -60884 348263 42689 232265 -118214
17824 -107202 235577 176975 -340026 61691 -54854 65663 66282 -5394 -83648 -74514 -255281 271655
17811 -52818 81922 -17616 -96656 -222678 112743 -28881 -118469 7340 -63116 13975 110141
17800 110141 13372 393110 -116501 -11648 -2262 199642 56165 120963 139693 85335 -158170
17788 123795 -124174 37665 -14984 -36668 216959 -134812 -124056 -180886 -21259 46221 271727
17777 271727 139619 -132157 128362 -123169 422250 436813 -102201 170912 -102527 85650
17766 4863 -97187 -146679 156713 -127999 55504 181569 15721 57319 302941 124531 -92475
17754 230608 39628 152078 -412722 -45560 -70926 205570 234881 28395 -97060 13838 385091
17743 385091 -13319 38266 46044 -41380 57121 121615 203232 -19389 -102207 -39937 86373 -16879
17730 197998 295476 9822 34666 167588 -61197 188864 262555 174109 256747 -214431 291137
17718 -17443 124297 3330 -2106 137420 -37725 219869 -123310 336166 135818 297915 229084
17707 229084 268307 -46806 52000 -50160 127978 120713 3118 143319 66191 -41539 267 -9766
17694 4512 125777 291883 -280986 -301610 119855 -15836 51805 14001 -285939 121045 -33313
17682 141016 270478 276632 243698 345824 129675 480838 -120547 86516 20373 -24947 275731
17670 -95889 163629 -84891 -160958 201984 -93258 204842 183110 71110 -262985 -133152 131310
17658 258550 249567 142930 48684 304039 -154627 332044 86849 -20598 162198 109988 389301
17647 389301 119520 -37583 -161413 -126751 179105 315481 207126 65956 29180 -130660
17636 95024 -68172 243276 53112 -104842 131881 159996 370716 70574 192996 71965 74427
17625 74427 -6016 -102312 199074 107063 -67634 77841 347590 183342 46159 33159 -129941
17613 86728 239598 -8672 221783 177542 125076 66459 139692 -2378 49786 -292211 142963
17601 277504 -34059 -41833 92681 89369 356335 -22073 -80779 30038 135196 25380 259238
17590 259238 -25135 -96123 16005 -262047 7171 -129490 -405503 73081 5616 123124 461738
17579 461738 -133276 60974 -131393 90982 61123 -7111 276909 24291 -146291 144534 146527
17568 146527 367561 17712 -25264 388476 5683 38512 310351 237067 257686 -156788 256747
17556 363356 67641 211031 417507 152505 -54979 182084 -129822 293709 243563 332623
17546 332623 183251 79965 48359 147540 326331 92322 266005 -5499 260033 -42438 319928
17534 471092 306247 409401 -36691 187889 36208 49122 322266 311767 273902 -166887
17523 -103190 297326 15790 16822 350861 199280 -47284 256537 -40094 410210 -5087 306671
17511 461178 840744 675512 943781 621788 705527 885455 337360 469517 506904 544585
17501 544585 561779 392366 -34896 519387 492066 434839 877329 726570 748501 829304 495568
17490 495568 829382 491389 274260 110210 286027 282817 300578 407915 342976 311897
17480 311897 200471 125705 385676 -249157 612870 523517 699007 607310 403813 358693
17470 358693 313208 455786 46109 517592 280790 360985 67962 117202 165207 128322 308386
17459 308386 193123 296915 289136 332462 19518 337171 529962 443144 -16109 -13184 214514
17447 328639 471144 347186 422464 470781 183213 620412 476647 556031 -8744 754598
17436 398953 154295 251400 450301 241605 374586 570844 230929 394319 269729 495308
17426 495308 571871 244833 213953 185407 439121 207156 148450 448750 425257 -10474 256119
17414 406375 313593 159986 333610 227630 141610 341537 440007 385718 476822 155580
17403 471037 388696 634159 499942 335102 286876 209403 381198 154340 -83345 317220
17392 343023 116893 257981 103133 206263 462685 371011 188172 184078 294360 341955
17382 341955 226634 301962 195970 97084 268495 55920 361141 350760 167932 241000
17372 241000 344446 241726 82450 158632 339818 272904 -199431 158223 475133 151192
17361 330563 216109 857251 62791 341280 312425 169119 299792 122370 194282 167253
17351 167253 63433 238406 69397 354799 342378 477469 145199 365270 478653 296277
17341 296277 64301 290356 322721 212829 336632 434805 273391 155576 201415 427441
17331 427441 391006 110663 301105 13636 544204 137614 65436 116746 44176 166715
17321 166715 262008 183296 105799 218553 466535 610238 530514 175101 235687 273166 409720
17310 409720 431376 141032 -83607 748977 134176 103571 305774 478018 164132 241587
17300 241587 300306 -68675 350778 -385590 342164 599207 191830 348556 319503 125209
17289 232671 332530 118128 346619 366888 671790 238196 441851 -12005 234500 212146
17279 212146 31276 93666 562179 -4931 187649 460482 230973 456405 558971 162375
17268 26560 200478 257748 277309 290233 199412 283149 288082 122923 474235 209576 366040
17257 366040 255675 520103 147236 508507 133904 113682 540902 -62846 301663 298389
17247 298389 656939 399605 386286 331556 509680 147642 478773 84281 451026 200295
17236 405618 334859 401162 479857 301030 273710 89822 145304 219496 169137 546514 231425
17224 322895 398566 345668 367733 232331 235881 345697 589809 216779 221237 434719 452007
17213 452007 400430 284184 400566 101748 485987 645393 495777 -1509 307946 295889
17203 295889 451530 387422 401191 427433 401798 184894 550865 555768 330155 318497 698997
17192 698997 586898 -60472 577861 165577 64181 228051 202351 297998 459154 456807 368818
17181 368818 530535 466094 406022 127421 350016 840460 321314 279151 614303 319126
17171 319126 671793 373127 592033 199163 102882 416822 208010 526098 89542 594223
17161 594223 441705 752818 611861 422542 496083 494716 532828 461853 382576 262538 530771
17150 530771 525871 908026 480780 600818 513527 337004 633809 732551 561017 600000
17140 600000 543877 909270 692421 396686 450604 734901 506880 243914 709625 73495
17129 521845 249163 639318 615182 347904 587818 33317 619521 586307 398953 333223
17119 333223 408916 735488 666532 489909 785303 290735 761168 727165 396991 1079323
17109 1079323 977995 672336 422626 428858 923080 903871 470780 613229 286813 474648
17099 474648 776350 772144 629397 626218 536200 564309 596928 761507 330247 674466 599122
17088 599122 556078 445584 768057 872861 627876 514545 350426 658498 516847 660016
17078 660016 543290 952896 724743 589953 831354 799541 382114 725178 618335 567810
17068 567810 781675 548409 714323 540630 423505 620758 538118 798041 734319 660417
17058 660417 689955 688048 544631 854466 501777 751511 776007 593071 605896 624715 770669
17047 770669 787820 481844 661027 798081 701851 599576 956164 942557 907861 1118833
17037 1118833 1039158 689175 782775 711909 614377 681955 875831 1103096 849232 1019872
17027 1019872 1095801 938551 793568 546114 912119 831730 914298 827348 926280 1048898
17017 1048898 1184063 1068137 825113 1214502 727700 969882 1003204 853812 819940 938023
17007 938023 1276984 904044 1129023 1437455 1051921 943808 1179810 880786 1456051 1103583
16997 1103583 735366 1281200 1344074 1055061 906447 1040630 954717 1198240 1072477 1105936
16987 1105936 1071999 1231898 1058806 978076 1161254 877739 1074872 1127526 965487 1248665
16977 1248665 1033903 1389743 1241463 1274562 1391784 1321733 1155874 1332210 1158039 1301945
16967 1301945 1214553 1226151 1463763 1241711 1502813 1448160 1452147 1238294 1226053 1650856
16957 1650856 1401414 1607842 1162194 1277951 1556611 1345408 1317154 1471528 1858762 1764301
16947 1764301 1635605 1735362 1232051 1240156 1414290 1659386 1570390 1611069 1625582 1688993 1786342
16936 1786342 1716418 1578623 1848805 1430834 1643984 1740073 1513165 1507766 1272843 1933136
16926 1933136 1706956 1710135 2014454 1859089 2265570 1773515 1887112 1653007 1718659 2017456
16916 2017456 1915481 2144155 2092849 1977401 2306502 2024654 2195496 2131188 2271369 2362142
16906 2362142 2128038 2219236 2173795 2252542 2158859 2475400 2259657 2177812 2353679 2433988
16896 2433988 2177485 2382932 2493372 2881232 2502647 2615099 2379428 2660941 2622194 2248785
16886 2248785 2809248 2672865 2772765 2748723 2650516 2874079 2936830 2770847 3010307 3059202
16876 3059202 3052065 3120447 3185049 3059660 3628109 2873439 3283649 3165576 3207642 3680695
16866 3680695 3303415 3441687 3474776 3499464 3579308 3492537 3592430 3883867 3690267 3797239
16856 3797239 3903873 3840289 3979587 4020003 4069861 4161528 3772658 4455219 4294759 4540137
16846 4540137 4485720 4630048 4575814 4458230 4516669 4334426 5024360 4910719 5076599 5118174
16836 5118174 5110751 5227087 5212750 4978464 5653934 5833559 5657446 5718577 5636721 5706998
16826 5706998 5550199 6073420 6320758 6444216 6600200 6343961 6487443 6590029 6896426
16817 6896426 7013248 7202256 7443387 7661008 7153801 7358781 7928205 7601834 8109528
16808 8109528 8110983 8166979 8332618 8905593 8673500 8728768 9161715 9250280 9400996 9499335
16798 9499335 9987013 10019675 10289327 10232636 10714255 10678368 11214290 11163731 11729079 11976965
16788 11976965 12270057 12489075 12542054 12705442 13168194 13705406 14065748 14568223 14438773
16779 14438773 15188223 15725612 15651123 16133673 16688276 17100930 17453547 18049095 18421007
16770 18421007 19125544 19351734 20070276 20653062 21251491 21830852 22208364 23068129 23787038
16761 23787038 24664678 25268787 25942088 27027784 27990222 28849736 30096542 30808115 32074512
16752 32074512 33094347 33973903 35196037 36692825 38375260 39284009 41056346 42520110
16744 42520110 43688346 45583164 47754027 49503156 51205260 53328480 55411148 57392320
16736 57392320 59559085 62640796 64996331 67432203 70654465 73391004 76121803 79629231
16728 79629231 82650474 86036476 89233894 92403850 96348719 99908866 103531051 107199691
16720 107199691 110888357 114367516 118065389 121660447 124313788 127464610 130116171 132946013
16712 132946013 134800160 136829069 138457923 139572207 140231667 140386246 140563222 139778532
16704 139778532 138728410 137436262 135436254 133078505 130373736 127906524 124721674 122015752
16696 122015752 118562907 114845304 111357898 107545722 104094985 100203302 96616357 93117257
16688 93117257 89387679 86020992 82634520 79064201 76238552 72837221 70081508 67303077
16680 67303077 64519645 61630022 59258768 57055523 54576901 52280373 50292593 48572375
16672 48572375 46662064 44784404 43019371 41395115 39738616 38335503 36835661 35568154
16664 35568154 34510095 33203804 31958702 30736155 29844648 29118498 27778370 27132254
16656 27132254 26088056 25447532 24212850 23671643 23060242 22316079 21436221 20992568 20296088
16647 20296088 19883392 19187295 18522065 17993108 17609656 17159108 16648117 15987727 15916572
16638 15916572 15228188 14950533 14547905 13930494 13905151 13430389 12983678 12864545 12561798
16629 12561798 12498056 11880411 11558306 11247162 11048105 10898171 10567755 10351010 10342139 10063137
16619 10063137 9783307 9540394 9052777 9042226 8540022 8594332 8622641 8610266 8234093 8094044
16609 8094044 8283829 7654778 7649751 7592805 7517330 6820820 7069141 6864043 6897041 6676829
16599 6676829 6597513 6507922 6131920 6375261 5913100 6120855 5893284 5870796 5790657 5635575
16589 5635575 5104085 5394597 5118120 5271653 5154912 5000247 4969236 5249106 4817591 4729476
16579 4729476 4453088 4576402 4346915 4497827 4448901 4271577 4003261 4557013 4265283 3902201
16569 3902201 4021442 4101448 3868044 3996137 3912994 3707645 3871979 3701911 3684593 3478029
16559 3478029 3968258 3232116 3398968 3390212 3688873 3185398 3588933 3460255 3246470 2902030
16549 2902030 3154787 2773768 3142314 3164495 2710627 2808584 2850758 2817689 2758196 2657558
16539 2657558 2921396 2668072 2530519 2288910 2732574 3045768 2502262 2373322 2812244
16530 2812244 2571142 2634813 2265139 2414071 2265418 2757219 2401258 2303934 2390876 2078818
16520 2078818 2086746 2368505 2259095 2281289 1797195 2172334 2018512 1796265 2369665 1894855
16510 1894855 1928985 1926750 2112607 1992217 1578719 1962388 1941360 1573523 1830369 1823677
16500 1823677 1765369 1945133 1716735 1858780 1614254 1687764 1866366 1263900 1615422 1562212
16490 1562212 1777598 1621688 1406579 1582035 1575549 1272269 1617967 1508191 1466050 1671807
16480 1671807 1446931 1142896 1463590 1345609 1204698 1368123 1012368 1506703 1224598
16471 1224598 1301807 1360566 1514632 1177782 1486498 1346052 1333204 1180319 1486429 1222513
16461 1222513 975144 1295426 1227425 972228 949023 1288281 1090260 1128546 1333102 1171910
16451 1171910 1479062 936698 984102 1314072 970124 1032124 844710 973353 1091093 995142
16441 995142 1119674 1236208 1323366 1190000 1288710 1286137 762053 841708 896498 666207 767905
16430 767905 765999 1040276 740770 1148148 978607 1074256 957048 650828 853527 947167
16420 947167 948513 864064 1139768 545633 930873 944327 534620 721799 1124693 727494
16410 727494 751634 682248 795863 601003 921915 822062 864206 786278 851098 721498 764187
16399 764187 796950 791322 988624 885567 724280 783593 495889 474161 710040 614330 886676
16388 886676 569581 656047 689598 1021423 1018706 727189 768609 866385 718077 696651 554849
16377 554849 683725 838475 541887 806687 924692 654503 625139 640009 544039 844782
16367 844782 485414 568241 601424 964429 746596 406411 662624 658855 728110 657870 581889
16356 581889 718972 449505 494671 635563 825724 362609 819487 311318 403101 573820
16346 573820 584870 397926 458336 419152 613618 634324 397390 452260 576852 258415
16335 549955 795995 668880 505984 511986 544673 620596 194625 551208 699033 811524
16325 811524 709447 302134 444933 468837 472074 701286 125860 378851 617181 589379
16315 589379 581415 541645 509573 776008 412908 412162 561517 488731 467650 281494 139801
16303 595101 385914 412700 622281 450044 507037 456840 207409 301599 461720 417075
16293 417075 392009 335982 312526 551662 -4825 319671 232223 450279 75625 292523 366300
16282 366300 627199 325501 361629 141624 235895 183168 299844 94448 278792 359512
16272 359512 440020 325414 356697 336390 55790 480843 124082 546763 591450 377949
16262 377949 425459 322868 551100 126160 821980 378767 347507 124850 256690 351009
16252 351009 385976 220462 138313 214911 509982 104113 578429 109908 199744 -4787 377997
16240 367807 144789 265329 216129 296248 3549 322168 410941 329700 322369 296407 298923
16229 298923 77500 372962 259007 387239 181773 82077 430965 330733 59207 -49749
16218 438017 519759 180671 349449 306100 126367 324859 94777 68620 374656 -187204
16207 292602 237653 296033 313213 -128966 197031 228563 334572 -73218 -274295 380150
16196 284580 337507 469528 162816 45749 -102504 146024 169487 -161723 115522 361681
16186 361681 245740 -64934 2442 281678 339775 436848 83508 331664 380523 132117 204829
16175 204829 -164779 454303 269115 -21661 80642 426095 58385 109435 569423 -232242
16164 201208 59021 458317 325919 219006 -160915 25273 466199 130454 288563 179214
16154 179214 373194 138407 250786 -7991 75968 360718 221990 311905 140596 251979
16144 251979 -141775 176251 290957 -18874 420584 69750 476739 6683 14225 204671 -126703
16132 -117896 -112949 126831 -13603 246637 122149 85070 119883 -50412 -211417 372448 77720
16120 -226567 186788 404527 219049 343409 302530 119591 23013 -285843 318155 -219206
16109 483584 -22762 93756 -141291 -95776 26807 281986 252705 310662 267866 175173 188962
16098 188962 -369895 195771 229004 60169 108707 108169 -34837 -108315 36206 102240 -95017
16086 421546 111954 -143383 -72408 38438 168059 187050 17882 121935 42713 -229828
16075 92114 -231605 -109878 101197 -9739 121512 -68463 106201 188558 105268 150207 53348
16063 169569 387065 -248404 -76481 126757 119766 113579 -14518 303892 -35482 74110 145427
16052 145427 42005 -125346 117589 -154136 70193 -137238 -129743 -238808 -87066 189101
16041 39063 -8636 72718 -73124 29314 212105 33821 -69992 105474 197719 -268517 271698
16029 69723 -47402 148574 -86186 6739 114115 -119437 -121239 302452 14874 -267300 -297581
16018 -297581 211942 -201926 285005 46262 103426 -188208 106236 -64715 259104 22081
16007 156952 -104937 111934 462957 -249271 18180 -28797 206038 272647 102107 -42871
15996 -134706 143512 151566 72173 -51795 -54848 268502 -229178 -358745 25012 -432576 -48807
15984 114208 291276 174514 83904 108505 -13479 16870 2582 183676 302551 256662 213187
15973 213187 140027 386246 687059 1067313 1175036 723255 742563 859610 482028 422612
15963 422612 178905 225429 397205 256950 -50537 298531 104055 -54826 24030 -952 -70797
15952 -70797 -6773 -29130 -24165 -64387 -58570 -18580 -8231 -231590 106696 -178355 -72784 58365
15939 -15788 -298105 -711025 -144759 155443 -360756 199136 75853 133037 9946 -195727
15928 -477662 151456 22867 -55133 -38111 151390 -268349 -161278 -4112 -2514 64335 130437
15917 130437 372072 180387 191747 308597 88818 140302 191968 -193652 -202458 58756 1649
15905 -168676 -66444 258684 -402584 215087 -8615 23928 -420819 -219304 314387 -39710
15894 388875 -419986 -23475 -121028 -307389 -92274 66800 191853 -431122 115491 79996
15884 79996 61404 103535 -78763 -328268 -75701 35127 -250666 -19032 100888 74803 -32113
15872 250962 66071 -68340 40519 -174318 -98501 83309 92094 -120834 165443 -97915 -308427
15861 -308427 315725 94623 -64553 -128128 -468245 -74147 194305 104034 1755 31318 -31206
15849 209552 -153048 -109797 -160287 -87867 -249413 -220410 -232610 -32932 126843 120537 -143889
15837 -168999 184109 -260322 -220302 9085 308832 6080 -120848 -154448 -55978 122688 -94359
15825 -82477 16065 -173928 164959 -41738 -11602 168644 -160082 31478 829 -21144 -145058
15814 -145058 729 75267 -41973 167720 228542 -120207 91828 -41855 -190037 228385 -223058
15802 91046 -103339 197951 72848 41612 -142002 -318588 156600 -253333 -115646 -293510
15792 -293510 84034 228724 -78698 -243443 -246830 -87428 48751 13400 -60696 260629 122155
15780 -260154 -26388 -79374 -130445 -131031 -144947 159960 180065 -177444 87691 97147 -64334 342089
15767 -78897 293514 -207732 -97172 -160447 345681 78835 -80290 32658 -90182 -117727 -73023
15756 -73023 281679 -134396 14482 12298 -288161 -85372 -208863 118195 -371034 -154202
15745 47069 3896 118561 234179 -80076 -149679 229758 -314774 -167205 -52997 -219796 -4083
15733 40042 -53816 104227 312877 -8896 181266 -211194 127719 -52556 65676 -229229 -238049
15722 -238049 -190313 -111254 -209225 75879 -71850 47662 51377 -166111 -138001 -301089 4914
15710 -439964 233045 -419676 -309731 -217545 32954 -113805 -235976 -135750 -86882 -355410
15700 -355410 44075 -238792 61298 82966 38274 -94492 -214592 -24606 -116292 810 -63021
15688 38998 -228890 -420948 -222931 25557 -295174 73425 -297907 -371188 -61096 126233
15677 197641 -20209 -86948 109768 54898 142084 70726 -305888 100037 111921 123768 -175713
15665 107657 123783 -41475 -112768 -12860 -310968 49779 -142672 352744 -89983 -58936 -37962
15654 -37962 88864 -393441 -135682 129118 -22672 218101 -151836 -178791 63659 -177898
15643 -79295 -13342 163335 46194 -79405 -112851 -248537 -165704 19393 -53547 54032 173367
15632 173367 122930 -73112 13914 31849 36859 -63066 51338 -17708 264428 -179605 -291218
15621 -291218 -166501 12440 -87275 138737 81743 -422358 63931 -142376 54047 206800
15611 206800 -136698 -190266 35154 156459 -45482 -84574 130234 -165338 -148556 415039
15600 -49046 -73688 -34857 -26477 -235462 25481 -2063 -407069 -315073 -74182 -7095 -142975 293373
15587 58664 33193 -150890 -17119 4551 -275277 -206222 -195798 -211987 -13617 134222 -217368
15575 -68916 273141 -39766 -161940 98953 251729 -190750 -51689 -101539 -114279 354124 -115756
15563 -100165 -299510 230007 -65161 40882 -125470 -12096 140147 -237365 24432 40861
15553 40861 54974 118423 120017 42126 -69402 -11508 77334 -250089 -183226 -55976 -58003 -207292
15541 -207292 165094 203840 120740 -229944 -77630 14559 -283652 -181822 -37773 81042 203682
15530 203682 441840 48563 219990 115291 137714 -79669 -125531 459151 27299 -37794 106451
15518 430678 -39388 -376044 354953 101846 -185300 14335 197134 81750 163760 124074
15508 124074 231149 50736 -91607 45104 -195317 -242786 -123502 -7363 126787 144708 -60619
15496 -15973 163606 187206 121820 132529 190280 193151 93182 305267 138349 403361 97042
15484 261592 222631 226687 113519 12321 311877 79789 -189296 289423 183970 -49890 321340
15472 23224 167489 -164167 -63605 177102 319461 113535 95439 102841 301862 -25153 318776
15460 9117 302955 53603 643824 255934 588980 349041 259705 171446 -154342 -233653 63468
15448 94215 147317 157617 237086 189036 -212747 123145 -82404 143654 -113766 -151331 -231095
15437 -231095 31876 4909 -22430 -13260 216935 467531 43444 151083 -60729 526600 738709
15426 738709 518986 1182935 900049 902328 535978 242273 295423 84087 39652 81958 -65646
15414 -2764 88783 -262330 -161576 90993 20197 -399475 -282133 34597 3973 9235 7159 121451
15402 121451 116022 134808 10731 -27977 147890 -138294 242327 -134364 -254848 1847 221470
15391 221470 25213 32987 99432 77428 -83858 -135408 -83986 232476 -204417 55103 -131942
15379 -97730 -163066 -381976 -277923 145861 284605 59490 20063 -132496 173538 -10576
15368 -154952 -161897 203353 115374 -166384 138056 50743 36611 -108413 26011 -19313 85156
15356 120024 146714 100478 -128767 77276 151221 -49241 245213 -3227 225861 375407 32107
15344 435973 -43206 31388 70268 211430 5635 -101376 189031 60490 60526 -79483 275909
15332 -180572 -13249 -103646 171742 313979 261878 434538 148513 418952 165061 217498
15322 217498 133319 -490718 301139 172094 56658 -124329 428314 -204228 318407 225908
15312 225908 -10347 453273 205664 -18037 135760 280890 98166 453330 158057 195637
15302 195637 -35509 84306 -15766 109589 -80849 232434 435830 309930 107930 182536
15292 182536 70499 -78725 120808 164423 113720 355472 91938 257388 383267 -105054
15281 116754 -7377 -14906 125944 -85842 72317 -456410 -279147 93516 67447 63452 26213
15269 101270 -155587 40526 27933 -4889 324661 28209 352094 -268265 -30686 14914 -221456
15257 -146359 -45686 -115439 -69918 -153676 -222376 70291 -30817 -176944 213350 -386279 216663
15245 9544 -80019 -13978 375917 -82059 170447 13819 13014 265191 -143391 183773 244691
15234 244691 22678 -15788 314758 -330856 238494 563901 977542 1546275 1551152 995983
15224 995983 1625027 950982 -89102 296832 177053 304957 317548 124942 -118531 458792
15213 32225 308955 112741 88895 131989 303986 149573 -223939 70039 -365147 99208
15202 114383 523992 107692 104769 170507 -123831 16718 -239006 146617 -15002 443414
15191 -142320 51243 163983 -8564 246319 170200 89754 -138492 -59472 36246 61367 112445
15180 112445 306721 -48595 30251 200886 440832 -398162 48400 104503 165197 128802 320768
15169 320768 77199 109784 -27682 96451 282086 234071 171241 123359 119163 143565 -25736
15157 64406 235908 382277 159482 355580 285611 471711 12882 139396 356465 245876
15147 245876 -60861 -27812 16584 -107625 254621 23852 -6589 120954 110727 2419 147551
15136 147551 15944 180614 -31827 90955 -125769 -102398 352590 193887 190272 299619 -228819
15124 105046 131886 1230 -81403 -168639 238021 215425 407947 181323 290108 411973 15011
15112 -110181 -149113 266546 26713 293966 337912 138647 565219 126852 20460 148749
15102 148749 -17875 224612 321786 -22910 501386 -287007 249635 33141 138182 260686
15092 260686 69150 240468 155737 63884 -71019 -63763 815 -47795 55417 306499 178534
15081 178534 96456 128281 243446 -40231 158537 -164357 -37577 179152 20978 340518
15071 340518 -400258 20441 383631 395716 -181216 122906 215677 145268 -175440 -61236
15060 110236 113879 289888 249866 -10728 174942 503453 81227 137189 -37808 105616 -118968
15048 234158 242900 123484 148845 359876 148046 36621 246715 317407 592212 335402
15038 335402 370990 276826 247524 124560 526753 148918 35515 264385 265935 -37590 404448
15026 214033 513043 510552 1841 434695 392392 468184 309244 357635 518739 335021 833776
15015 833776 535173 457133 556102 574320 611540 358860 328017 610889 101107 375162
15005 375162 365927 686796 473163 314688 505126 505120 417837 292291 462963 569921 492093
14994 492093 485193 307659 366884 319047 383214 292708 182762 136652 -22920 431697 322058
14983 322058 490115 154737 335911 -5380 464335 876806 -203849 384451 434588 231757
14973 231757 458576 269368 866567 360943 282690 695857 695162 671482 690765 634799 687035
14962 687035 589417 644575 466035 240886 532983 599783 625724 633212 881841 412576 247575
14951 247575 397589 535978 706458 532816 662073 232387 201504 370546 585452 375593
14941 375593 353825 -29679 427902 519452 187961 232376 455582 463048 451563 166384 235431
14930 235431 286132 524023 551431 688399 576264 726416 856095 787168 397647 602941
14920 602941 479624 468007 450950 609089 761912 645723 1090432 1157834 1344086 1187702
14910 1187702 1526678 1396863 1442408 1456782 1326139 1178608 1370105 1463548 1489143 1615652
14900 1615652 1670741 1786526 1477480 1100590 1121965 1081374 837748 1039411 287392 773162
14890 773162 1086193 589934 434758 349792 575781 533811 161022 575830 503453 516730
14880 516730 572909 436444 506829 502108 454917 417882 638514 342979 401502 649872 558550
14869 558550 824761 765866 755337 571401 383707 1014949 826934 435514 677629 712999
14859 712999 643919 569389 429113 487194 552051 642399 297286 345052 996883 521582 523056
14848 523056 555014 561424 527213 658979 263599 512337 488485 383043 379974 154938 499136
14837 499136 431587 740207 241274 502031 698860 411782 449311 639614 589567 572498
14827 572498 1093579 935073 1016159 692162 1067696 976423 840054 1069286 805300 1127523
14817 1127523 870377 799326 368280 622835 304740 1023029 552095 814796 408847 559389
14807 559389 715419 625686 689444 650247 968727 873895 971427 657461 859577 757900
14797 757900 667285 649961 731220 569842 473569 808953 945575 501573 1185326 943969
14787 943969 808564 1086942 759463 630742 669047 812849 454238 680285 446513 547040
14777 547040 659222 559195 400379 436620 475752 617234 820940 698052 708798 666013
14767 666013 623511 812976 800273 359697 761021 605173 724644 665483 834254 1081958
14757 1081958 855830 656521 713882 633707 917694 677071 886243 502372 890676 696647
14747 696647 689787 195511 694504 751202 766816 482898 936667 761871 716185 768275 682850
14736 682850 628437 517654 502619 895995 427561 450600 1080155 513862 934075 847058
14726 847058 883842 566327 777695 915163 646380 1042434 1142367 716044 934952 598153
14716 598153 1008282 971116 1320007 1340640 1275678 1195815 1633603 1682059 1066673 1442169
14706 1442169 1283790 1038151 789603 878283 1042973 725025 921888 1208672 667973 974618
14696 974618 702833 984663 840337 980496 1137476 1043504 1052158 1208225 1222829 1317316
14686 1317316 1246690 1751338 1537623 1745368 1366201 1231431 1394816 1429342 909402 1174183
14676 1174183 1072457 930977 1108670 722143 1172949 958338 1155978 939463 1098562
14667 1098562 865891 1018332 965951 636031 1018833 915048 1121898 933342 950570 1283596
14657 1283596 1253046 923556 1269655 1111906 1022179 1094347 1353779 1093012 951704 1106614
14647 1106614 1480144 1073851 819741 1088551 1356856 968643 1009062 1264782 1221087 1623378
14637 1623378 1389889 1375173 1422351 1656765 1400024 1056290 1325838 1531121 1545823 1314961
14627 1314961 1521321 1331749 1264910 1075042 1286415 1046582 1236777 1284366 1313509 1343774
14617 1343774 1556876 1185187 1430526 1352946 1751268 1222748 1377514 1189158 1228597 1358451
14607 1358451 1401925 1538328 1441044 1573425 1233114 1144637 1418047 1446830 1370710 1407256
14597 1407256 1608071 1770247 1808517 1701674 1869996 1609150 1395939 1649939 1621612 1483152
14587 1483152 1427751 1831323 1519110 1737058 1524445 1617169 1633408 1899172 1684951 1769266
14577 1769266 1506929 1717627 1711503 2000249 1921872 1752423 1604279 1709642 1858534 2193426
14567 2193426 2083395 2186862 2291821 1666733 2115349 2242449 2108958 2249471 2034390
14558 2034390 2279166 2300165 2323739 2230004 2322171 2419784 2192666 2247021 2605790 2602205 2916823
14547 2916823 2875967 2878076 3014682 3288808 3116160 3357593 4027991 4150193 4302269 4876662
14537 4876662 5438799 6891712 8256268 10673750 14452836 21359059 32084356 31768674
14529 31768674 19285133 11239182 6619371 4874835 4309731 4219722 4775845 5153329 3762004
14520 3762004 3010874 2644824 2600768 2601054 2378330 2387661 2319210 2393842 2235982 2203173 2476042
14509 2476042 2171335 2713710 2536102 2450084 2675589 2590158 2381721 2882550 2796742 2668942
14499 2668942 3009729 2721119 2825294 3145962 3169422 2863427 3116890 2865669 2988483 3341895
14489 3341895 3460737 3210933 3338091 3269387 3352345 3491491 3266266 3473712 3562589 3555346
14479 3555346 3540361 3860639 3282027 3296891 3684565 3988221 3617454 3745019 3749907 3954017
14469 3954017 3740952 4085963 4011002 4147986 3908451 3956338 4213073 4367975 4889852 4355389
14459 4355389 4383442 4114623 4543413 4453144 4394121 4162990 4798003 4673866 5018918 4692863
14449 4692863 5085247 5013717 5254021 4826179 5294896 5302960 5240053 5063606 5256830 5333609
14439 5333609 5152331 5507108 5734514 5578396 5178932 5758892 6117203 5737923 6244645
14430 6244645 5896180 6266673 6208646 6009274 6297737 5990289 6488904 6384803 6473620 6734493
14420 6734493 6810802 6647109 6985677 7009473 7269743 7281227 7731539 7605871 7403814 7824143
14410 7824143 7983900 8038054 7937067 7919891 8540321 8499595 8680953 8732583 8922107 9455249
14400 9455249 9206714 9530628 9438833 9749498 9730734 9417754 9421322 9679653 10229094 10130515
14390 10130515 10633875 10989305 11175409 11210647 11494000 11407353 11616841 11522809 11899397 11834839
14380 11834839 12250989 12218199 12279329 12711690 13136694 13184578 13377008 13837920 13832724 14012966
14370 14012966 14671464 14737630 15175359 15488252 15692951 16228083 16422886 16643260 17247457
14361 17247457 16970564 17339709 17711626 18091011 18492618 18755659 19226469 19432916 19900960
14352 19900960 20449804 20978725 21482939 21408555 22467296 22651580 23264717 24004441 24328361
14343 24328361 25001298 25466207 25853901 26454686 26590847 27689572 28512906 29327682 30009000
14334 30009000 30460850 31226329 32081720 32803266 33879928 34789723 35787883 36738902 37938162
14325 37938162 38766412 39708159 40685864 42444012 43217138 44414686 46071365 47459714 48682166
14316 48682166 50210160 51843553 53462294 55352014 57039872 58934241 61304974 63141270
14308 63141270 65552019 67603364 70270554 72742078 75436695 78550772 81542350 84389044
14300 84389044 87436261 91130845 94672494 98661926 102679655 106887414 111524547 116199711
14292 116199711 121757718 127185150 132721722 138582410 145326339 152139103 159398167 167124951
14284 167124951 175136087 183843668 192752212 202201643 212363123 222860293 234259812
14277 234259812 246161212 258416699 271716696 285481957 299902831 314709621 328941120
14270 328941120 343470902 357510541 371065134 383158916 395207706 406779268 417990570
14263 417990570 428156961 437747264 446602372 455009689 461316903 464848693 467231788 467402655
14255 467402655 469190307 464424586 460117768 455543500 447276809 436464823 423999954 411283269
14247 411283269 397249701 384182257 370622093 356489434 341850671 328112891 314268131
14240 314268131 300368835 287450360 274471591 262409050 250123631 238981616 227750269
14233 227750269 217511961 206673787 196323063 186312409 176653146 168223933 160094918
14226 160094918 152427511 145212851 138440141 132638462 126861815 121287301 115948227 110945855
14218 110945855 106777999 102162765 98260741 94326885 90571551 87304889 83645264 80627870
14210 80627870 78124693 74726156 72288561 69872913 67518387 65174589 62991010 60809049
14202 60809049 58675481 56965577 55207716 53497710 52029372 50238735 49166017 47377459
14194 47377459 45945455 44908171 43757447 42720743 41320671 40270884 38865979 37843170
14186 37843170 37043656 36058157 34969364 34167101 33219337 32449583 31572601 30800681 30496726
14177 30496726 29745142 28608179 28151155 27196344 26871839 26639962 25700870 24957545 23946622
14168 23946622 23976026 23542138 22822967 22057241 21808161 21480749 21064436 20596320 20297144
14159 20297144 19629115 19452688 19076812 18922065 18170678 17740101 17356286 17284440 17186432 16811696
14149 16811696 16320297 16209527 15808904 15332877 15274502 15134122 14358947 14714291 14147954
14140 14147954 13831259 13746334 13603249 13287866 13250431 13034935 12391549 12694651 12184771 12062021
14130 12062021 11806028 11694305 11550619 11383827 11137781 10973958 10922327 10966523 10591218 10439640
14120 10439640 10081619 10145841 10395670 9446565 9674024 9527772 9431752 9263760 9106970 9144505
14110 9144505 8615230 8734584 8657054 8313384 8372159 8245479 8541087 8185580 7873810 8214653
14100 8214653 7701658 7654644 7474741 7274059 7531422 7247170 7163601 7240824 7051970 6957271
14090 6957271 7074345 6708968 6599981 6865416 6534312 6216324 6592362 6470480 6432079 6150697
14080 6150697 6037338 6391904 5807345 5717499 5683955 5889553 5830150 5502674 5758076 5512301
14070 5512301 5616281 5228129 4998910 5452751 5106103 5236601 5109865 5014497 4983837 5112728
14060 5112728 4824114 5201476 5105297 5127643 4486686 5021237 4344725 4503530 4750248 4317874
14050 4317874 4637536 4994887 4023427 4479772 4227029 4180114 4257647 4404821 4146001 4447876
14040 4447876 4014270 4185263 3974782 3998095 3836149 4129086 3959332 3974749 3860401 3734930
14030 3734930 3713687 3584587 3963297 3404760 3297535 3319598 3742878 3492236 3425756 3060263
14020 3060263 3470329 3489882 3462944 3260559 3523776 3243901 3634741 3375534 3391033 3144337
14010 3144337 2940824 3259407 3020888 2970110 2959487 2920728 2950516 2990838 2700633 2590510
14000 2590510 2764047 3015113 2938779 2874243 2711395 2704375 2644141 2730197 2745436 2475585 2599150
13989 2599150 2614416 2338406 2266366 2263429 2414179 2668709 2350808 2700236 2699824 2937714 3103128
13978 3103128 3492558 3554775 4100766 4583655 6681592 9792818 16007594 27135931 33476026
13969 33476026 23482245 14771587 10011282 7538438 5943582 5059184 4514996 4413008
13961 4413008 3904523 3901862 3330646 3003531 3182762 3138661 3118560 2803264 2421434 2503940
13951 2503940 2652101 2523196 2679081 2375378 2540902 2416791 2210611 2256389 2359777 2343570
13941 2343570 2249868 2194977 2124095 1964059 2159061 2111068 2239785 2358638 2268858 1885006
13931 1885006 2113102 2263945 2115039 1995674 2079106 1966120 1979814 2186167 1828960 2025862
13921 2025862 1930369 2146915 1969566 1941310 1942246 2066273 1730557 1966775 1374006 1567968
13911 1567968 1797903 1572079 1625464 1695549 1527522 1730801 1908525 1927253 1557897 1756221
13901 1756221 1615117 1801879 1564217 1584174 1539502 1334229 1685165 1604657 1422675 1481995
13891 1481995 1508325 1697449 1675697 1918966 1327105 1706490 1361531 1197764 1754079 1501695
13881 1501695 1376125 1644785 1572416 1326071 1162698 1261037 1420697 1347729 1457674 1647051
13871 1647051 1372059 1200637 1151534 1160820 1418904 1034190 1302063 1146684 1225797 1315058
13861 1315058 889746 1092383 938249 1221575 1352790 1311356 1297649 1224841 1126712 1306484
13851 1306484 841483 1115584 1300356 1158608 1423544 1081799 1042646 1271735 1184828 1056380
13841 1056380 1207432 1030961 1294810 1234447 1117343 888813 1132254 1313862 1224407 1335375
13831 1335375 693061 1196337 1110624 1059494 1220412 742736 1081818 1234090 984511 820600
13821 820600 1351576 1344350 1067573 1116751 903493 1032009 838397 709966 830921 915261
13811 915261 710527 1270103 512637 814957 1066815 1057679 1159135 1241106 610698 742085
13801 742085 949060 1050559 685226 963933 902274 870730 880940 667901 635666 983305
13791 983305 949020 1083680 679807 795369 848915 628982 1202160 1113720 866313 943720
13781 943720 863972 873407 1162607 837827 1023212 698463 866447 977226 723312 764686
13771 764686 913417 824979 986986 634083 962741 650727 825088 630675 581145 634756
13761 634756 542803 713056 881210 509181 704835 944959 641855 762967 490389 585149
13751 585149 901875 659514 638163 427298 671285 519343 832247 767768 875331 495090
13741 495090 839469 430458 614326 658238 835705 689130 432363 666681 737663 779954
13731 779954 423800 621853 788058 775952 674246 686260 638445 786534 799295 692638
13721 692638 607700 514653 754205 894202 919357 1030910 617214 597173 626073 529978 629299
13710 629299 899307 572277 687390 923870 721179 794068 690433 501747 649962 636626
13700 636626 695721 816061 1038071 909458 609221 485694 708101 424271 651159 691604
13690 691604 350839 530257 768344 631520 658534 660921 736340 598447 737821 563910
13680 563910 507175 380789 776747 946308 335175 254513 576138 679158 449320 533360
13670 533360 446908 677878 481766 417088 173912 559250 503995 740372 365514 863724
13660 863724 584786 390248 611909 132581 694837 577471 657347 260489 594053 334413
13650 334413 643299 633134 671641 445431 233959 -27913 603034 427553 375187 378407 482796
13639 482796 395293 206428 439809 532030 539142 658717 383615 426290 433985 594142 705485
13628 705485 802636 301339 365544 563173 381306 356672 431052 343110 318115 240224 449573
13617 449573 79683 638562 205059 492219 201275 397892 292904 583303 247207 592050
13607 592050 529087 190167 324459 184296 309315 779368 519991 232965 135905 318735
13597 318735 663560 448597 444040 98578 439378 168105 215222 601827 217179 130050
13587 130050 368244 361819 88566 542018 119539 547581 648358 574940 536656 348969
13577 348969 250922 449410 169098 438396 184299 287970 167730 335483 532645 265121
13566 437762 234098 84389 140938 755104 370797 623264 320541 414302 8971 196000
13556 196000 314211 412139 94428 339546 534555 595746 476236 71650 151231 275184
13546 275184 285483 389585 177581 238999 430426 267235 -3252 457054 266793 487623
13536 487623 424524 500448 550519 503119 596904 196079 591977 287123 348337 211205 183442
13525 183442 220352 339786 268140 199372 307995 462315 151866 360711 345282 293609
13515 293609 317966 483317 243309 162668 439654 455404 142863 328852 356722 246101
13505 246101 431308 583366 -128427 427960 564627 424094 170568 10765 269617 256587
13495 256587 512944 -59842 165043 362026 457489 41249 421816 195157 221241 441340
13485 441340 447250 106496 290812 234269 260790 606728 300421 369344 -19875 113751 157965
13474 157965 347053 275476 493544 277875 445054 -66566 504192 578711 21270 563873
13464 563873 38931 278506 399635 160665 310888 462278 421141 140330 148948 450082
13454 450082 239222 132442 535362 23669 127398 293292 187649 174520 169460 201769
13444 201769 87108 217502 334269 166630 455133 300803 364813 552539 528796 110711
13433 111346 109247 394156 -60329 -45317 -49527 281034 247773 429734 180550 409685 195823
13421 365102 230523 297848 87178 221144 243287 3824 271045 186400 341440 257159 164313
13410 164313 497403 -44932 386130 209230 169005 368254 467628 379988 358892 132397
13399 217236 242635 413245 150443 302892 23233 534408 459801 144425 128529 459345
13389 459345 182813 136993 324045 386843 361998 163645 -147325 79598 209119 201005 -49173
13377 384685 114359 13326 7564 346905 509831 70492 297549 118024 39246 150689
13367 150689 353973 469520 109032 -134604 109021 381446 242125 63024 242009 164215
13357 164215 165991 404450 360479 295939 651656 315107 601659 368006 -46282 591677
13346 87384 378446 207072 294384 115831 546479 369839 142831 44720 70855 510062
13336 510062 105309 -24190 66904 415374 74097 294383 145004 189689 104462 528030
13326 528030 238110 4904 312927 358145 326463 380249 246419 487324 421544 385203 435380
13315 435380 82063 272655 284051 285651 153005 34726 168814 -24690 95424 288532 375150
13304 375150 320222 64594 40591 394650 299328 137798 22586 525859 290765 98626 -35744
13292 285393 241948 280709 406774 83015 130094 161065 210545 170634 223385 441664 -31601
13280 48837 -103465 260305 73412 223607 435074 -265416 65070 53927 -20567 331973
13269 12093 326247 136280 92289 115949 118760 -62098 204603 93156 213567 154997 308770
13258 308770 118720 374637 183630 27767 8668 31487 115361 39048 363447 416905 442644
13247 442644 -105258 352394 -30824 -133340 -129689 173946 264689 25142 144217 255768
13237 255768 83001 64329 203877 -112401 483620 78371 17992 259971 44173 109646 -47972
13225 223324 414458 -54872 136758 61944 13467 127697 107959 546514 202850 269417
13215 269417 -83752 251342 99804 254647 260905 86589 235988 195447 -312243 -335678 53344
13203 97986 234797 55749 14623 -61474 98861 147718 -156939 208838 -144241 197103 -397218
13191 88183 -26292 -115769 71916 -436184 241417 192199 -222125 -92911 -116744 236288 -107944
13179 107197 -41904 -60205 208191 5294 139447 94302 361815 -148913 -68928 195788 194485
13168 194485 172941 107216 447144 38428 223737 83207 -43904 131054 -122714 45514 68760
13157 68760 -38708 -17429 142596 58417 223753 -69911 275401 -144181 -17846 -110645 211212
13145 -91678 197503 220239 -141591 -135869 114531 -24844 85220 -15041 166594 -17355 198991
13133 471820 3423 220584 -72140 -323426 172735 310066 43613 -163077 143549 279759
13123 279759 186489 74028 -49019 55343 316276 -51690 123397 -51591 -146817 105384 118974
13112 118974 208877 -12720 -174531 -3315 265044 166057 71453 -185216 -229004 218734 -58726
13100 -30529 43916 98117 244103 -167127 -209798 -79135 23180 90561 27064 -75196 560576
13088 197964 8233 456012 141383 -53426 48597 116366 100730 249670 255373 57738 26349
13076 267189 -1087 234145 283443 140538 71794 147194 25278 475024 390269 5788 -84239
13064 -49253 201169 213354 7466 55689 -13727 187523 201175 -84256 -95319 111804 72218
13053 72218 496701 -27194 -102480 291070 51678 28169 -202535 284965 158196 15659 96900
13042 96900 95227 -59294 238988 -111697 150503 28700 124168 34705 -23733 143285 202662
13031 202662 174601 190836 137920 152584 -307852 175070 -26885 -118589 61890 -61623 366200
13019 -168733 -147938 -38222 94342 181143 127766 177674 13606 -1237 37687 216590 174902
13008 174902 130433 -184946 146997 134848 139231 183272 1039 251892 332910 233702 398733
12997 398733 -65348 -57460 154430 123405 262180 -35696 -129757 183802 231910 61534 96182
12986 96182 69611 -144605 323625 330668 320343 136824 -23883 323717 171105 227086 -98464
12974 136152 -48215 -90909 -41978 -50306 84291 -62216 199062 -201871 78675 55558 306 244757
12962 244757 225269 496691 232740 -99718 -102826 131258 3573 361723 -110927 -39751 -138215
12951 -138215 32450 -174931 4303 -27796 54599 265125 253463 10898 -13875 -31619 -11995
12939 -168619 402297 -50799 304876 -146421 -117444 36788 -197454 232622 294732 61727
12928 -41712 -162463 -67487 -78384 -5552 21926 22187 -294526 284529 -273405 217121 -49071
12916 5607 -235286 362469 -106039 100840 -51653 19649 -82032 171726 70569 -27471 103303
12904 -206438 -143161 124423 34352 -133396 26282 330956 -213284 10507 -64160 64406 221920
12893 221920 -222302 -123743 -236111 -257423 -283334 122846 273194 188020 346274 -39184
12882 61649 30669 -70964 -320958 34807 140517 -37403 -230294 -67086 -40300 199051 -189059
12870 317638 54564 122440 184475 -105150 -38340 50045 -113496 -135080 -78063 -260817 -4992
12858 -69310 -186361 -174675 196984 -9583 203934 99390 -133366 141619 135329 -37420 -133338
12847 -133338 143214 198898 -65725 56034 101170 -174605 31514 -3546 -47401 8020 64139
12836 64139 -75998 199594 83123 97407 152931 -329978 -89614 -291472 108752 -248741 -242300
12825 -242300 139390 397146 74347 -362022 21271 100937 -273735 -92563 155287 -298770
12814 169760 -65152 30622 304215 -115609 -79622 -254195 -133918 -428312 48079 -164636
12803 76796 36882 -30137 -161566 59314 271630 74817 25511 393937 -203282 -15493 98394
12791 122538 -103888 202383 -26209 -27142 -33928 -1103 117005 345687 316372 -277121 310810
12779 -325276 34201 156787 19313 -4609 144513 56517 -136556 169078 -222855 -74035 -77651
12768 -77651 84636 254747 -20354 -93718 48674 -389928 48542 227624 273720 137206 -34038
12756 266956 -224218 -10646 -168943 -224565 -245500 264128 1175 261907 -82539 -182832 -211652
12745 -211652 -395849 140283 -14649 -212141 179444 -125183 -314397 255352 -306577 260849
12734 -498539 89452 -314940 74910 258849 -41835 74356 -199816 -140218 50352 258726 8158
12722 212129 -14349 245270 48065 251216 -66850 -118327 136085 177467 227835 219526 122470
12711 122470 27370 -102308 -52104 -137494 -37845 188893 -29766 -125298 283292 84665 -31897
12699 61780 -107736 -275816 68609 -1160 95824 220140 -50471 265723 54819 203435 181664
12688 181664 268166 123132 25111 222194 -44435 -61805 64706 -297524 -178757 -4831 -270624
12677 -270624 330079 -229201 -74209 54367 -15120 4870 -85215 61725 139037 -382174 -16671
12665 85088 306172 53903 262109 369551 -122901 48902 135975 83054 32415 227808 61638
12653 124157 256342 -525029 -9039 331492 369362 26268 -118217 426159 197779 12607
12642 234301 205676 6114 586845 169755 144889 56843 121891 77016 311660 39079 311379
12631 311379 258040 -22746 269697 -208121 446051 -355130 34779 -83495 -248846 -324409
12621 -324409 -216233 -38644 -7673 -41282 58126 9597 279763 371198 121541 114465 396438
12610 396438 73759 143123 249181 -158631 97965 297779 116506 218195 163926 -136718
12599 -50636 21495 212062 -32494 61552 -14452 -72353 203017 3595 288389 193557 314232
12588 314232 -43419 321178 -99172 -193169 195358 -47685 -173112 6093 61023 -69350 214586
12576 -45442 132645 284659 87472 202756 310046 236827 12817 -229974 101536 -207628
12565 354536 52623 305386 -128409 -60942 -91817 162617 134071 3057 -28873 230151 148910
12554 148910 -92062 -184130 -100132 402976 40568 -155377 120393 -63032 -97536 -297983 184009
12542 309130 -82132 -122936 -22425 -119245 47432 -404609 148728 399425 -105088 -91480 -418211
12531 -418211 72187 -184819 -173190 310507 -190920 -49416 -51723 -361760 -116196 94117 -318466
12519 -44132 250749 45644 -355790 -120479 -169353 82263 -138486 308319 148149 -6120 176937
12507 179389 72255 103781 61520 221633 82755 118092 -104097 -128783 121553 -54882 26943
12495 68309 -223764 245346 316326 239100 272955 -59333 60996 -138985 -68648 81549 64087
12484 64087 -49630 172281 -135802 248207 -137644 223519 -140149 140768 88027 -176825
12473 -137008 -74666 73393 158887 -71589 75729 -244110 -92807 -128872 105917 -197512 -5262
12461 -100132 119671 160528 -70140 -121571 -195369 61359 -136749 120574 -344174 -6934 -51747
12450 -51747 -357945 -77950 353295 -141857 -160800 -218731 -30298 50229 374156 304928 225124
12439 225124 -328321 24883 -188854 -324311 -178659 -473844 92693 108761 113598 165307 11949
12427 146495 -20636 457239 -26990 -6858 -152535 283270 62865 -14965 -196718 -27693 44763
12415 -90757 202152 -371159 65145 -3523 -66316 -194914 -138534 -85591 -93383 9391 -419773
12403 120500 4855 175918 141760 -58963 -166729 64520 -34816 137665 -100967 -358767 -245153
12392 -245153 -10306 330895 -134014 108530 -38120 291579 -28559 -371820 -239967 -90138
12381 57866 506715 159522 -75182 62001 49892 22069 120594 -56597 193682 55648 7142
12369 268900 273217 24068 129164 -76728 70322 -265412 -8681 81093 -33968 522131 75183
12357 -12929 55720 -81040 153043 -80467 216570 91081 -154208 195325 124856 -353260 31256
12345 75461 190322 -45118 -41881 360175 40433 -58143 160411 -122742 2613 -46770 -152903
12334 -152903 30359 324062 -33452 -378940 170692 -178586 -73650 -223719 -102017 126695
12323 -54632 -362236 -91945 -296399 -223713 107548 14862 -16752 67466 422003 449324 111647
12311 16348 25641 212698 49106 336518 -182162 56110 220886 147894 510455 171661 201324
12300 201324 106000 -60837 293294 75961 31359 22268 37071 -170550 326632 -35053 -158038
12289 -158038 -96179 -37287 260076 5472 62251 -3104 86398 -86835 155480 219634 205939
12278 205939 -22431 -184983 -200638 -45190 -142625 261639 477438 152871 141738 -28967 -179791
12267 -179791 305342 343339 42071 126826 283872 241007 183981 498906 137221 -6989 197114
12255 58820 421649 8450 187450 250795 102494 247607 342511 60156 135493 423182 88368
12243 67371 -78328 -65993 -30017 -111448 318517 222056 7812 -53005 -23135 -3109 201068 69373
12230 368597 197380 129229 34485 146947 365177 -122712 -167617 -178182 336726 -147779
12219 242098 212886 380877 24853 446888 121818 190194 -186523 90755 263281 -15997
12208 -104273 285318 367612 136100 539401 445610 232071 452011 87413 378769 277455
12198 277455 316350 99984 116744 383289 86743 232277 67156 16102 128383 140108 125690
12187 125690 137437 -168700 -9341 -7494 140247 430106 121380 269650 217731 34379 278778
12176 278778 272900 -31873 206300 186268 -121640 -129433 271020 4429 482163 65394 499713
12165 499713 204616 48777 177869 311956 116552 87096 -148293 -323147 342460 134630
12154 355203 117568 -73513 315500 117249 160026 37610 486096 170494 287402 112995
12143 -112871 15641 75526 101284 128374 168690 312949 173650 -12498 224041 -60366 33506
12131 274310 -407462 4962 -77349 101246 -106192 367159 76130 4116 -62808 2548 12351
12120 12351 -161767 47961 186561 475399 169128 -117694 61962 106273 -173674 238451
12109 452687 147619 188821 -109000 34191 315421 174161 88367 366110 127519 316950
12099 316950 280761 104044 -27961 133578 80202 331299 108608 376414 116639 51116
12088 241068 -52453 101556 2458 13418 -40216 139355 -8802 -338558 543033 266089 73179
12076 -217724 209218 25711 341792 24578 421249 212317 -150588 362012 138488 364885
12066 364885 380016 -5944 126120 -31422 34756 44596 -235273 -54746 -117571 317390 -27767
12054 353705 307982 10678 16315 169235 -123910 176502 210437 93154 99499 -39923 230877
12042 9984 -160623 362913 -160414 -269188 23735 117323 113401 74881 43341 -48585 -85065
12031 -85065 -33483 151256 -63508 -166191 -182025 -49048 -30910 195012 73426 -140339 74536
12019 -292802 -80736 -358212 -72434 45042 -163271 -117445 190424 114076 -54969 -41816 219248
12007 50857 -50686 214538 34412 -21095 -29380 -39928 342552 -75510 -93271 82520 -238375
11995 -142182 -340037 -98303 141228 146597 386073 103874 157712 -95814 -286983 149249
11984 -138810 -4233 -47460 36008 -276723 -59932 -68949 -135033 -10979 -39891 -169435 -289201
11973 -289201 -222192 -91683 -32119 -93446 -228532 -5806 -107136 -63000 -34171 -184652 -136963
11962 -136963 -65299 -720 -108030 230133 -312853 -72283 -18336 237996 287280 -110943 159134
11950 -417995 25802 260623 7956 44744 10690 34710 238392 47338 25909 2798 -462806
11938 24002 212641 42450 -145357 45073 -244701 -172120 330111 150691 -105767 -76638
11928 -76638 163975 25563 -153575 63555 80428 265602 111113 -37449 -118980 -88748 246277
11916 -59078 -134581 -75334 13664 -155899 77192 133284 21522 30420 174071 167823 -148602
11904 -263653 -247375 127553 21429 -262314 29057 130041 79415 213565 63458 -15897 88322
11892 58638 286918 26873 -182186 253421 96364 -202605 -1560 -72676 -126143 -369417 -215921
11881 -215921 -27818 78784 -57312 -331551 225404 -79217 -127358 150588 134169 392330 -1906
11869 -75952 -127167 -86214 -492016 223896 -82249 31698 -19659 -164986 -425212 -125210 -208315
11858 -208315 -20325 -292396 201550 31691 -184067 -144184 89597 129741 -111638 -82026 -73325
11847 -73325 -121677 183481 -69058 -158146 -150907 -209366 -122364 -249290 7119 -133256 64392
11835 -540439 -312825 9614 -240069 182938 -84155 283191 -30615 -42470 -181079 -14091 203899
11823 30185 42686 -85010 45430 -126230 33094 -5533 -104641 -121536 118913 -271007 153175
11811 -121756 -140638 -260448 92299 -55685 420294 -19552 145663 -47263 -52414 -72041 -167351
11800 -167351 28070 -34452 -257662 12443 16849 -11167 -80495 3179 -73559 225258 -201878
11788 27096 28134 -16616 156515 114848 -219378 -179249 -82243 85101 -11987 138779 174434
11777 174434 -313130 42719 -225179 234057 -63947 -121760 -105674 148309 -113554 -22727
11766 -18615 -199178 -149254 40175 -124795 292000 280003 670 19015 -125356 36014 -73886
11754 -54359 119482 496 75224 -75362 30495 27993 -53234 -62797 364649 51458 365404 27534
11741 -369127 -189435 -119907 -243406 72367 -129635 76494 -139619 177352 -85914 48202
11730 -134508 -68129 -6503 -39751 -129158 83417 -48581 189180 -128702 -2048 -159447 -44179
11718 248074 145849 9568 68612 -383859 132628 -54439 -222523 116572 -34408 83674 308598
11707 308598 191397 303941 -276320 43679 -85027 -427109 -40096 64230 -328081 76896
11696 -112424 20777 210733 587913 -186182 257196 88364 -161734 77652 116894 98294
11686 98294 -171312 -156747 -232673 304611 -195486 187523 -65231 63025 288303 -80646 -32162
11674 -155382 28486 99149 55608 -196526 224788 -321730 -134876 304672 -75222 -213877
11664 -213877 32736 196495 240083 223968 -141324 -151486 -88030 -49126 -3646 385534 -128912
11652 21141 -87714 180532 -134768 -219934 97796 10481 -165623 15605 -142768 -74043 54905
11640 234716 -5934 177564 161343 24337 -90290 -203539 162514 123821 -196887 -17474 103679
11628 118325 167580 -263102 59577 166973 489808 -173206 -16620 -52836 264124 -164621
11617 -83683 -293313 -345684 370351 61058 248768 84761 107452 109450 127858 -59437 5002
11605 -200097 2534 71699 91523 235613 -102077 283935 -106311 67599 -111703 -224958
11595 -224958 -79410 215605 14989 172403 -153041 -121348 129240 196487 -182071 -9565 -239661
11584 -239661 -215197 -75033 67536 55880 130815 -121081 210010 97468 -7861 472196 228238
11572 225793 -2658 163442 110197 76098 83552 143685 -142138 135876 -20227 -127072 198665
11560 57376 144397 143100 33880 47709 -58711 308233 280032 -2294 193841 89229 24521 102940
11548 102940 239407 151846 -36585 330635 -31089 152208 149099 -240193 45235 169251 172723
11537 172723 152718 92046 163253 -219684 -4654 161075 121688 288352 61186 124212 -36654
11525 113010 400844 -142941 -47862 240186 303759 27251 95038 -31126 207257 69965 95393
11514 95393 -121764 -38921 234388 -116570 148958 414167 -106399 -16550 16824 -166031
11503 309540 144957 130093 427042 -155214 64610 78205 -36814 -21785 101797 -30365 302611
11491 386804 496053 -21486 197672 50514 210450 63182 115853 -150737 310366 -202801
11480 36773 125995 -65328 69088 -102012 40697 67278 -38932 30436 125836 343382 169706
11468 -9597 -16012 281906 43711 298689 204978 157696 138412 395130 104619 112175 341575
11457 341575 226508 70303 169805 -13996 -41175 174046 -57608 -17452 18566 143324 87061
11446 87061 -199486 2309 230600 51972 -233038 154036 191571 128675 82701 -48053 -224454
11435 -224454 173187 118463 69134 -248134 343735 -47282 366832 236517 304812 39965
11424 -203966 16158 -280348 156943 430359 -893 181431 -41137 52891 -124437 -64948 628935
11412 68888 346429 122883 -194626 -160540 -318234 -24339 -12511 -155517 222754 11096
11401 235817 -157687 -132832 259990 104208 79590 56134 -577 -236799 -3938 125090 -16883
11389 -33445 -83162 308426 -153997 208388 86752 67171 -16313 -20877 77355 166947 245178
11378 245178 99977 -136809 273944 -25835 177214 228911 63213 -15783 28545 132286 -152115
11366 -239839 -7196 -340739 32733 -222792 120161 142667 -68328 -89117 171790 363620 11277
11354 213680 247462 232497 26178 236221 -212018 -21377 -261418 145154 56436 -98283 21018
11342 -140707 123918 -68811 -251050 35714 -62138 -103420 -153920 310240 -177739 140447
11331 -112001 57623 113895 -257528 33542 -2376 237501 153132 -265700 149033 -281803 -80275
11319 43051 41640 -114857 -78271 441922 -305488 211657 -117043 -412024 -199725 -33454
11308 -174000 -5024 -111662 -289992 133264 -259538 -311918 -115907 85678 -112990 -121944 229030
11296 330525 -89004 133562 63839 32825 118323 230629 -142325 -40955 -81375 -64667 279857
11284 -41415 212890 -225751 -263852 -158118 -287567 -389318 4198 111066 -140423 97591
11273 -53791 45857 72553 -38434 89095 -92460 -76612 -36791 -60371 -71260 -73510 -192849 66898
11260 152375 -71587 152636 74845 25318 104903 -61154 -307144 111460 -7212 103202 -243565
11248 -346179 -136265 -8688 -120778 -135990 666 -95473 -35607 -140885 93100 -283099 32778
11236 36561 -202398 24877 191918 -284430 81749 175703 -491271 -80345 -141853 40763 -213888
11224 -141537 -61852 -180636 115549 -331422 41378 -28242 185107 -49475 110146 50262
11213 -43747 -93828 60491 -243602 -159349 -106988 -94275 444541 178652 -101650 -359275 283574
11201 -207938 -93269 -205750 -180161 -40969 163192 -45138 90203 233200 -115682 -181186 121753
11189 205090 100711 -26266 143073 219607 -152546 -102878 -184567 45536 172660 20199 139909
11178 139909 268760 -180032 -15923 -156183 -144541 22095 -55294 -428956 -120185 -310436
11168 -310436 -210408 -238206 -80446 -142939 -65791 -124172 -173434 -124681 -59221 -160983 62395
11156 -125727 -17199 -7533 159075 -133535 -82969 -167335 70795 -186989 -204312 23573 -103983
11144 -62690 68085 1196 -203044 37062 -55496 -137916 -159814 -19766 188661 80510 185370
11133 185370 -39735 -31198 -165651 210560 128957 -269794 -248439 -91256 258407 430923 -1138
11121 -20548 157528 -47083 -187149 221695 -665 259283 216110 313704 -106870 33459 19622
11110 19622 -313164 -21708 -211865 54575 36563 -344923 323337 244927 222956 -57890 158782
11098 -32404 -160591 107992 116024 -265598 -72788 -189166 95478 -174974 285288 106489
11087 151928 247495 -103387 140572 96006 26614 -69514 110403 394512 121057 216072
11077 216072 330233 77436 -140866 287771 -179600 10983 405403 466019 -135381 224728
11066 328003 304952 229321 290659 367485 209267 294500 299846 258545 146481 224668 20123
11054 233618 325938 377122 92805 167616 403250 -97223 420612 283725 589607 216312
11043 512403 633748 405966 273649 566433 762128 742024 337742 535740 583213 329834
11033 329834 446044 555623 966152 771899 1131208 1014158 816664 1023947 791800 681316
11023 681316 754456 676668 611080 704615 666126 847272 438183 455825 549727 571399 597578
11012 597578 558245 710054 718690 575997 308551 400327 565339 775812 617188 678873
11002 678873 407434 495409 465140 448617 646026 587431 522453 664729 600852 743679 545146
10991 545146 795676 195102 632638 429055 434726 743826 741979 454980 1014353 458097
10980 610152 874759 959962 668811 721982 822598 769977 625881 960024 949502 750971
10970 750971 849061 982415 679860 963258 944695 944776 684597 1189495 1310892 1131652 1206488
10959 1206488 1293026 1494118 1822369 2253177 2147636 2344453 2809948 2483377 2498111 2536029
10949 2536029 2354200 2200357 2060167 1877128 1760206 1741306 1716039 1750530 1735765 1687620
10939 1687620 1546754 1853942 1557599 1706351 1717807 1093576 1356919 1136744 854790 820191
10929 820191 601788 378084 326750 151417 448383 336493 188350 161641 185151 321683
10919 321683 138521 143380 214794 -122840 -18399 -212276 97129 102064 98898 90716 -302798
10907 475403 1923 -227555 38611 -352949 224133 48861 77550 193543 23564 33223 213107
10896 213107 -15829 -43699 166456 67029 -60230 -136521 -22504 -92504 49179 -203051 79136
10884 19005 330081 -35205 -351329 222642 58779 199045 -229690 383608 179123 188697
10874 188697 -119551 54163 87799 -56779 -199535 46697 181762 132736 -27487 -118384 259875
10862 -99918 -180057 -58578 75063 -161767 110186 73084 -313990 76346 -49936 -77149 -125389
10851 -125389 -103319 -137558 -181122 -111034 273346 106578 101983 -72990 199701 163776 -437222
10839 127341 -316161 91923 199623 -65095 97311 309628 -291434 -293072 124584 -24093 -106409
10828 -106409 280265 -109815 -18809 131263 129019 -116066 55888 134834 -7024 -83923 -63743
10817 -63743 -168598 142825 -121799 -26209 -43548 -154585 247476 -370990 -12885 -2757 -75054
10806 -75054 -385751 -76076 53329 -86748 -260853 -84574 -20444 -139970 -133539 -321637 106238
10794 -263245 265693 -108030 251892 20119 -30570 40509 18375 61227 205142 -110197
10783 -2671 326074 263682 142201 -116459 93856 -130169 -371461 -270095 -181490 -264442 18
10771 -40130 19804 172315 -102953 -146761 224273 -21776 -72963 -39528 206661 -444772 43414
10759 -109459 -184968 -229381 80929 135923 78614 57254 30172 11603 -347054 -142964 86299
10747 227896 70655 261149 -246748 -104649 -181882 -6647 97744 -234087 -386572 78292 -200381
10735 -130669 -234002 11315 182861 89641 107041 53156 -213434 39657 254789 53278 9829
10723 -510770 362104 -107524 570024 -244701 -158748 -1006 -428343 185168 159922 -129008
10712 57144 -229374 -388616 -122940 -154709 -132727 -79256 148301 -32932 228518 -18572 -12582
10701 -12582 -165364 40467 -280839 -32314 51660 -373521 -56535 308509 303119 -110630 -52936
10689 13778 51474 3177 -46111 -332408 -80814 289971 -93312 -67048 -21761 -307526 117570
10677 -140036 -210755 80710 -29504 -111676 15851 129177 -405504 -138751 -66684 -395430 -253261
10666 -253261 52153 -276789 182500 -268700 195483 -31387 -385212 -261100 162774 -241746
10655 81347 -106369 -304277 -187197 -156493 -12222 -11336 224034 15582 -300608 -272598 255372
10643 42955 -382871 -321085 80615 -73933 -45141 -68804 39277 -54472 -400917 -80805 32264
10631 -76609 -431827 -41445 -105189 -242178 -252284 63874 108172 148642 -133207 -52480 -496598
10620 -496598 -219880 -161628 -180219 -46226 -76273 11614 -138561 -60776 -256686 -249652 -23657
10608 -141194 -47776 209012 302150 19712 146721 -38475 -211174 -146207 -146603 -151483 -210656
10597 -210656 95446 -239351 -117031 -140901 127679 76184 -160017 -58129 -75394 51503 -248884
10585 70543 -40247 -75895 -219219 -148531 -58873 76039 -193163 -21402 -93509 -54306 -181396
10574 -181396 204633 58012 -266016 66219 -152624 55544 -365209 200859 -58412 -137653
10564 -137653 176592 432394 -45705 -69831 105031 163693 91530 -259186 193272 -162293
10553 -81484 6014 -309808 27037 329008 -96635 208357 -90030 234012 -397848 47678 -64288
10541 143720 -22583 -92554 28662 16382 155050 -167577 -455093 265821 -85389 -386964
10531 -386964 52346 -159558 -148535 214698 -301720 -118733 260143 -53058 -91994 130825
10520 253258 200871 206275 -57135 -77527 134370 229347 -152362 165364 66125 -484997 -287990
10509 -287990 -351129 -231661 80353 -274958 -83786 285068 -247587 -235940 -225695 95170 -107799
10497 156856 136364 -216844 -87263 79220 6389 199413 -175712 -132951 -139684 51723 168886
10486 168886 363121 109615 116793 -408871 281631 -250680 -178868 -37423 163168 -382509
10475 -56179 -98920 146113 -237070 -82438 -69171 -136330 -446917 214171 357978 291922 34458
10463 34765 -33439 279634 355298 304004 456622 459205 -2175 82695 19994 -346703 -65191
10451 194321 -4428 -262031 242610 72271 -101650 111243 -261266 -201034 316886 -202279
10440 172925 58359 -162919 -230624 -123899 -126589 -37410 -109193 66589 -95960 -125285 -77767
10429 -77767 11355 93463 203572 213780 -18485 48802 -68958 -73123 -137096 282108 -78180
10417 -184611 -114039 -47180 -246721 -144305 -77583 333422 123968 228176 -130900 -266407
10407 -266407 -171629 -156243 -206859 -195257 -261688 97018 211476 -73091 179334 -21835 -464480
10396 -464480 133044 -80206 -305738 -232754 -75660 -12066 -116631 -226414 -12677 -176489
10386 -176489 74179 -51619 -45794 16278 -49405 -390915 -105389 63047 -181567 172193 177483
10375 177483 -104223 -254124 227779 145584 289706 28082 319411 103699 -139513 141205
10364 365932 125031 156991 209795 -56926 58361 296711 -118707 -36778 248176 -2023 434245
10352 390347 438340 287820 278682 346176 294122 621586 285941 24484 260118 131272 231802
10341 231802 346232 36056 249881 98216 304489 236025 108600 284105 502321 -9483
10330 365303 431642 -80195 134760 287211 97625 298898 192777 606812 139679 77880
10320 77880 79458 41825 161819 369327 274395 191938 104558 36416 53085 -160272 289538
10308 -146948 82795 109626 -6347 -24175 155908 173353 233763 200156 150749 360904 288839
10297 288839 19430 314568 266751 120792 303168 -383525 -221763 194453 -87420 -122065
10287 -122065 -72538 37971 -34762 68623 -72532 138491 -188700 -224239 -1575 -194672 56796
10275 -205537 138906 -105568 -22195 160799 56713 -118269 -175951 -149932 -106215 -129544 -164116
10264 -164116 -37037 -241707 -104561 -282864 -1175 92920 -64062 164772 155139 -18770 -66268
10253 -66268 106540 -365844 -192932 313847 10989 -524177 1937 -54173 149403 135944 470035
10242 470035 37384 367187 257867 61841 528046 -54249 207737 279790 47817 331874
10232 331874 214928 69156 192798 -274434 105188 199993 239337 -290882 31663 17583
10222 17583 -272468 131156 -71278 156646 -186404 171010 263876 -52211 187597 308942
10212 308942 -84071 -259576 -44105 -112341 -245211 -156882 -155982 -246815 -75876 -241973 -191317
10201 -191317 -24578 -27344 -252446 219269 -58503 274440 -96424 53423 -169711 75987 -122282
10189 15799 -93405 -123020 244916 -97835 -273596 46560 -370709 -227230 59583 168887 1686
10177 -119445 122248 -4701 -11704 -164054 -57635 -52687 -219816 385415 114509 153145 98601
10166 98601 -235889 -335664 41925 137544 118503 18386 51069 17566 -175169 -30513 193715
10154 -543545 -64404 -144086 -476106 -88864 109776 -90329 111568 159667 -328815 -308738 -114246
10142 -96770 -122639 -228692 7525 94473 129549 -13999 -57380 -97424 49999 456727 -51365
10130 -30129 -22412 -359990 -258107 238419 -9049 272842 -280037 90200 -84332 -123175 -226548
10119 -226548 110067 213559 -163247 -405542 -459892 -123481 201862 15133 -129626 -277904
10109 -277904 -106215 84990 17535 180621 194029 43605 -182241 -144938 -66093 194406 141801
10098 141801 -175237 -218713 -381375 206517 248826 -48675 170643 354556 -157590 214635
10087 -176489 170543 -33380 134386 -403093 113858 -95112 -212149 -60270 348817 -140691
10076 22709 -617913 -183454 260891 -428523 -102193 -259151 -37207 190094 -188326 -37673
10065 -416820 -213024 -175199 -376952 153128 -73025 95296 -225551 -3234 38914 -234838 29748
10053 -262440 -200335 -58645 193589 150645 -314176 -166926 21580 38942 -279178 -206481 -52653
10041 -398053 -56720 -160057 -72866 -89036 310948 -8043 -20700 -29235 -212434 96371 122700
10030 122700 162246 67353 18129 -79488 -390871 -176412 -60818 -149439 -77002 60835 168540
10019 168540 -11953 -326500 248117 -209817 -80435 105999 -68982 -437529 -11505 -138922
10009 -138922 368741 -366829 -58568 -4171 -182095 -53225 -124523 -188135 -46120 66126 -21128
9997 229690 123266 -46440 15387 -270247 -344788 116329 -369316 10525 -221890 -212871 58313
9985 -318812 -184126 -99865 -211096 -21225 -266076 -81950 117655 51703 -135499 10510 -258677
9973 -961 149753 271134 -303157 136674 -60399 -140040 38119 -179656 -268125 61737 56780
9962 56780 292518 -131919 -439153 -20463 -17208 -73382 -130428 167179 948 206815 170202
9951 170202 -339109 4363 -22884 308142 -146386 -378023 157653 83733 -212134 -226686 23264
9939 -85786 89944 -234288 2501 43605 -415205 15442 67788 -156913 -213999 -193062 -54498
9927 23764 -212432 -124468 -167497 -180025 111004 -62325 -266328 49201 264337 6519 92810
9916 92810 -17113 157588 -153904 148076 174383 74320 -13491 119905 -219257 -108942 -265246
9905 -265246 11717 -107990 -433097 -160239 -201767 -95397 8528 -61474 173423 220159 -176019
9893 -203052 168117 45327 -57346 145460 217793 -39517 -36247 -115929 144675 44591 189613
9882 189613 -37888 -19609 -129732 -234005 -296529 127803 -136084 -244490 -288967 -12092 107593
9870 -226144 -150408 -40032 -278100 64498 6575 -318322 -232594 62482 -10200 403029 105541
9858 -291331 -107788 97301 -122372 -187232 48231 -308889 -270641 -33167 -206876 4009 -35211
9846 -72322 -27454 229207 -274923 -361452 131000 -206506 85160 30444 -21383 -281406 -29082
9834 55224 -121282 230796 -34482 13626 164999 50357 -329643 -107372 277403 -122046
9823 202119 -154204 54704 -130404 -398868 -45282 -121002 -129761 -162921 -119311 120275 77950
9812 77950 -136205 -9953 -21809 216853 35050 49049 228508 -101222 -8572 -357717 -304342
9801 -304342 138897 -29687 178060 -67816 83384 -273442 -166139 -242644 -21391 -24254 203722
9789 -174977 -4311 -497175 241949 226239 -111855 166966 -19185 -96359 282140 121371 -139049
9777 -75966 -97347 -262136 -1838 138156 46434 -22988 -138016 -110294 -209395 -250883 55550
9765 -31378 -401922 -40744 -15939 19675 -144483 -252046 -472279 -126421 -36969 71552 146676
9754 146676 -107376 35098 70525 -155633 75323 189300 -44240 -231196 10341 -153569 -196846
9743 -196846 -170398 -390757 -60735 -203571 -215361 15024 -21277 240066 269205 12349 191790
9732 191790 -262321 262691 164552 3532 219117 67304 56657 -364279 -159859 -168869 -294628
9721 -294628 -390104 49550 -228661 114661 246716 -87035 -337983 9811 53208 -478787 -283316
9710 -283316 59349 -140694 -213077 -276873 169054 194583 -394630 -203841 -450335 -84329 126701
9698 -232967 -37968 52782 22472 -193698 150225 84818 -246535 -57292 -35415 108844 -380799
9686 -181788 38506 116536 -142040 -53914 -255045 -190332 27119 65822 -159047 12286 155594
9675 155594 -221384 -164254 -136392 29975 196921 -24522 -202602 6253 175085 -408188 3938
9663 -261849 40535 -157807 121665 -55555 -216553 209530 -106688 -34137 -109107 -8062 -71935
9652 -71935 -133567 -11731 152237 81309 -69964 -118622 -181284 -242103 -175798 -24821 -208332
9641 -208332 -61948 -60607 -355506 -129364 56052 144754 47679 329208 -207581 -389376 -52926
9629 -21431 45417 -47300 211047 -40102 195242 366503 -117033 -96924 243107 -270717 -270283
9618 -270283 111014 -9094 -4379 128919 50281 140821 -393329 -30510 319446 -3556 -26037
9607 -26037 -23143 -70388 3088 8620 -237894 -87992 127059 -11674 -316136 83883 7493 -213335
9594 80496 -322523 -276483 -88402 3630 -206337 -127384 -194823 -68194 -158362 -296917 -446685
9583 -446685 91754 -146466 -1434 53761 -79596 -80027 -50518 110831 -74421 43253 -201164 74061
9570 -2833 -42028 54575 124130 -12064 183596 24851 -371135 64007 -192884 212527 -177583
9558 131060 285862 239175 -219973 -44542 88756 32220 -59912 -134811 -284176 72062 -168730
9546 -502470 -146531 -77440 1974 -160375 -160941 170608 -362735 -368171 -139870 -207515 -257147
9535 -257147 21718 -219181 -314364 -288522 91441 -138673 -109288 -214593 -66670 -368076 -128317
9523 410625 -252170 -159555 -351364 -148564 -133813 -85743 -102084 202519 -239353 -154546 108557
9511 126378 57951 89550 -387939 231767 160914 -347349 -153542 5133 -145790 -234991 -271703
9500 -271703 -76624 -521370 -122911 -255150 -71396 -83351 55864 -91309 167681 -50064 135079
9488 -40641 199400 144701 -108887 -97709 -42442 104102 -121863 70430 -340601 285019 -43715
9476 19419 -233559 -325836 73561 -132891 93790 208949 55359 98461 162103 -85522 -167296
9465 -167296 -54854 -86655 52847 7720 -105430 -94699 -180205 320796 447568 -289501 -98388
9453 -278867 -320069 -130878 128933 -65657 274713 -140980 -41112 -136142 53943 76823 197725
9442 197725 96695 270264 -207244 114933 -230199 -63946 -177217 40247 78833 -264821
9431 -222622 -166268 -155835 -211767 -175150 -217323 53821 -140066 -109990 151743 68270 -155822
9419 78221 -79536 -128530 69867 122610 -313041 -309305 -265881 -149645 -22517 -8911 -253746 7628
9406 106170 103882 -50879 -225179 -131970 -86200 -129041 63131 339711 -289201 142450 323744
9395 323744 19728 -165134 78358 -445875 -168189 -83220 247562 -43479 -80837 73948 -100557
9383 68067 -42113 -132824 846 -180124 -71121 177975 102967 -53483 -115538 -10285 -75136 101351
9370 -72095 -16583 40411 7681 -154865 258130 -130431 -220558 -133238 -45004 -377168 -120031
9358 73722 -230388 -116923 150943 -40144 -106397 64994 -39717 -74176 214652 144218 -220863
9346 -374237 139337 -150175 -230545 -35079 134013 -232257 101997 -365258 -151066 -51685
9335 -209615 111997 -207041 135515 6283 91408 236409 -152386 -253971 -21948 -178462
9325 -178462 -12096 -25937 -229716 -358027 -183908 -24160 570718 -93414 -9892 -231541 -170207
9314 -170207 -40682 -301891 -8203 -86481 -66656 -103868 -24397 -112736 -45639 -89489 145492
9302 19368 294179 -281024 -144181 -129975 -179993 -64142 46916 -322128 -212473 39410 -273062
9290 -106176 94639 -60248 -22214 39381 -82669 73608 -104018 -87077 3399 325011 29221
9278 -87817 -52209 -140040 322197 162147 -51519 -245347 -311450 -176059 -297561 -302885 -60909
9266 -240883 -205209 245119 -79658 -58049 -59329 22282 152680 -31329 -278114 -352088 -265341
9255 -265341 -247441 231501 -14773 -65003 -38025 -122196 -23228 -251453 128867 -105480 138044
9243 -319830 111665 69429 -122760 -58688 -136386 -7395 -164162 27744 -230301 -267250 -200346
9232 -200346 -23130 -162551 19539 254647 -91854 -242466 -22844 172828 -181839 66766 -207391
9220 -71094 159379 59624 -171749 -152357 -37495 -166558 42388 -80168 -143580 4324 -333676
9208 -30100 5987 -389655 175350 -158578 -112971 -126252 -39055 -158660 -151513 -116663 118402
9196 -80351 66671 -312809 -210218 -340846 314970 18433 -30316 197719 -351729 67281 15169
9184 2983 -41126 -185060 -40371 -201580 55180 -25498 -4127 263779 -151033 -95054 335953
9172 -207637 -251269 -35382 -169017 -271849 99300 225510 -258211 -108652 -148042 -135950 -28090
9160 -210866 -272171 -270462 119817 107035 -114436 109558 11611 -229778 284237 -368864 -129511
9148 -299913 -55026 -119541 43492 -123448 -29300 -70931 -15870 47339 -325173 -214997 90244
9136 -77719 88064 -57944 207117 -181765 -124317 157634 47941 -90515 172581 -15784 -38001
9125 -38001 -32499 -32997 -96921 71827 -50066 -35932 3638 -318339 -84795 -51616 138111 116810
9113 116810 123438 -61105 284725 -226073 -65730 -247094 -48983 98998 108712 -88725 -8896 -105801
9101 -105801 140233 -55262 -17638 -192251 45993 -372515 -199149 -146661 48029 69212 -154825
9089 -269348 -202829 144654 -44689 -151404 -238453 -2997 -119279 79740 -25389 76317 26291
9077 -73379 -22101 60488 -42111 42570 -322791 -149676 -43904 -305864 -124062 57507 -264703
9065 -276526 -576308 -171504 -96158 -317196 -129799 -219536 101513 -426402 -320479 86860
9054 -280373 -144825 -99245 -180022 -109842 44392 -148015 101606 -66612 -70663 14807 86615
9043 86615 -283529 216193 -4815 -54469 103698 -225380 152202 -193182 -47540 -98243 3067
9031 -140958 -162586 -26980 12022 277041 -4478 130491 171171 -7255 -44305 -78092 -227093
9020 -227093 -77962 360879 179018 101922 -22579 225357 -155322 -453360 -25339 -145296
9010 -145296 -111333 -217926 -39572 -121155 166709 -87913 -236772 -32894 62925 17933 -84472
8998 -286533 -187114 -77165 205799 -73301 -185299 -58352 -38706 -43492 12085 79291 142366
8987 142366 71865 -92927 -241036 131200 -483097 40162 -82976 -64210 -180932 215975 -21686
8975 -18922 -56516 65066 -285179 -280078 237951 104193 113415 28741 -145173 -23464 -145609
8964 -145609 176207 326109 -119550 -342755 -388672 -6905 -329321 -38284 -77825 333866 -25864
8952 207929 -77513 144324 -147259 -172793 -116634 263041 15814 235817 119956 79795 -234883
8940 -204290 -63865 -356237 -496898 -133507 -146880 -60768 11615 -257328 270156 61249 78347
8929 78347 169127 -321823 -26179 -122745 -188372 -222989 11607 -301399 257702 388231 62333
8917 128760 293825 98439 157889 -82399 195198 174027 315592 353703 725965 220822 1155293
8906 1155293 1425053 2047053 4041996 8504182 6187209 2947202 1453836 811606 757728
8897 757728 394149 388235 117315 -151192 -235319 387456 -6285 82579 -62051 357518 -190744
8885 143441 61099 1044 65303 207032 173060 -35197 -112145 -243748 -67902 -90556 -269567
8874 -269567 -183111 -85108 -192269 -187403 -15097 157595 286177 141289 -44793 -101161 -54625
8863 -54625 223406 209429 -208749 -59720 41128 -194028 -113384 -330716 -41016 165577 -121026
8851 74910 -337108 -408202 74067 129282 -86385 -252538 -9369 -22863 -55295 -82040 -224205
8840 -224205 -228384 216111 -33940 130072 -15557 -87137 -104259 -123027 52881 -279144 75140
8828 -344315 -136483 -224392 -238459 -49385 -194034 -144780 204642 -141961 -51773 155189 -98841
8816 112434 -216375 -224214 -167269 -132559 33374 -143093 283448 -123195 -19665 -115598 -152785
8805 -152785 -153240 -19287 163165 4683 -127346 144812 -122203 155321 13648 -131077 -291296
8794 -291296 103118 40674 38531 -109194 -96229 155508 -452990 36107 -375303 -333542 29801
8782 120084 -82034 -53177 -119235 124593 99130 -231059 -367269 -10547 88551 -16233 -156087
8771 -156087 93954 -142019 200275 -174792 -259461 -30218 133056 4206 412733 -220805 51244
8759 -108274 -7078 -6414 -268471 -21677 -195258 190171 -71991 -25864 214711 17429 -6061 -214393
8747 -214393 -213553 -77779 -387123 -140425 -419487 55880 -264331 41861 -228032 -29463 24713
8735 41992 19569 -119444 36436 -99547 -213031 56239 -263129 -181838 -82779 80173 -342188
8723 -191295 164343 85037 -285496 77613 381299 -65646 127127 74982 -100102 -175939 81577
8711 291965 -148505 -272690 -33872 -128058 -193725 -130752 -242660 27459 -95850 -146550 2981
8699 -162585 370630 -113847 243329 6317 -170893 -63423 -58103 125546 114213 -97003 91222
8687 -24602 -84583 -124973 -127013 58902 120799 -86125 -53899 -51844 -215927 -7473 -47303 3189
8674 -12554 163162 -67381 215845 72595 -126018 -156067 -111386 -78923 -316900 -168123 -321430
8663 -321430 318845 -13154 99530 -3664 -15623 -14227 249736 -356923 -220973 4957 -284729
8651 -85799 98525 -160215 4945 118501 49189 -393937 -80006 547786 -148428 -254793 -293073
8640 -293073 -182034 -186054 68390 -30120 -168219 -70308 -136373 13385 -8381 -15209 -173812 222757
8627 -164466 -13965 -252586 127594 88600 -117073 127618 123851 20212 109894 -298232 -252809
8616 -252809 174451 32414 -22224 24388 -478100 65438 340808 282589 -125763 -91436 -55844
8605 -55844 129805 -307606 113632 -220118 69733 261749 52793 81077 -98825 29274 -47084
8593 28003 -224616 47513 -108756 -220286 166431 -198246 -157610 -415932 -141856 72050
8582 -175990 181894 14926 -201696 -333633 -57761 -368270 -106266 105200 -44724 153657
8571 -29695 118015 -146014 -157108 -197491 194741 -296409 -271394 -277205 -54604 -120615 -192173
8560 -192173 -301722 28221 29553 -297874 -448241 117379 -16934 337566 -72394 34036 -144372
8548 -50851 204468 8148 141374 101496 -64022 79723 171416 -117404 111980 140734 -97145
8536 -350822 96335 203100 299285 -274730 -79226 221288 57998 -70681 -14626 -96140 -16739
8524 22491 -14514 -31010 18147 52316 39535 32276 -334225 -41922 -153572 -125922 -246767
8513 -246767 -61212 -354155 58177 -230399 -77896 26400 -166026 27909 -127641 -99240 -29657
8501 -40314 -235110 33595 103518 143931 100438 -244641 44637 212038 -90911 76440 -132585
8489 -195050 112811 -305712 204354 -107839 -16317 58645 347815 -205260 -200506 -322288
8479 -322288 -318593 -148745 133984 33033 -93710 94889 -154794 143022 -138124 249261 -266573
8467 283872 -321684 -170707 -105199 5489 -164386 -37585 162158 184395 109707 -27493 80372
8455 -196137 -23985 -385597 -124932 -141582 -39136 276656 -161881 -106512 -26516 130181 -90494
8443 206115 -13066 -32843 -37462 -129968 -130045 -122329 -443148 49861 -77106 -322389 129587 208945
8431 208945 -6498 -179641 137338 35128 23941 192434 -82185 -73301 -104410 -143378 -237703
8420 -237703 -173440 13986 167182 -85671 108571 227459 -121799 33492 -433532 26405 67118
8409 67118 -26809 -230885 -62895 -142152 -321939 292818 -171241 207058 13767 117678 -175521
8397 273140 -8577 203724 -310441 -540566 143487 23143 -67256 -85829 -306189 -96045 124866
8385 -203866 -230391 -218097 92819 33315 -88927 -1124 -271434 -33120 -38880 387998 -159791
8373 63951 -217446 -370321 214110 47028 178212 -40890 -53824 91803 45194 -220036 -101345
8361 236598 51331 199922 -131527 86097 -104503 144282 -39140 -198486 -170871 78051 104260
8350 104260 169835 -140936 -74177 -100996 -9210 -158668 111972 -99430 -345963 -101980 -296047
8339 -296047 52529 158903 -2482 -179827 -171310 58768 44489 76430 -196791 -82282 -88352 -224850
8327 -224850 -57116 60657 85599 -107930 91664 -141562 -29377 -122516 -154862 139411 -204871
8315 25729 -124604 35375 -204845 -211399 165662 -185195 -179860 -76097 -502678 377151 147271
8303 -8702 -86374 24000 -133535 -173373 -315916 -107139 144204 -45792 104503 87974 -137174
8291 -302999 -141028 51551 -146584 -90883 -249028 -42103 -47308 -43832 123849 -373141 254086
8279 -19451 -278981 294795 65917 -21680 -118487 25393 166461 -235451 -107687 -307065 -132041
8267 -101964 -156043 -12359 -112918 -182186 127 -178746 -75363 -140687 5464 102081 -234608 75335
8254 -115019 113448 -15060 -33016 81386 55714 -216356 112040 -61553 310370 188009 -61360
8242 -97764 -90234 -194591 73608 -129705 -198743 85284 74911 -407342 -162486 -203877 251483
8230 -131955 -97385 -231865 -157731 -254742 -19145 -46308 -82086 -74340 131648 -40072 -76827
8219 -76827 64715 176931 -303303 15143 222103 -68945 -7673 -80433 101765 92421 -315270
8207 145 -5715 213725 -139201 5179 107446 -25632 -48915 135068 -93706 -31975 -227629 -291145
8195 -291145 -71336 -292131 -139970 210491 -181590 -36685 21511 242253 -58577 74899 359980
8184 359980 44293 127341 -133207 -160191 251203 -33630 225110 -89907 80537 -178261 -278314
8173 -278314 34630 -299892 -103136 176145 70724 20853 226839 -286065 -79605 -20735 -118956
8162 -118956 297713 -72975 127893 247928 -41670 -132638 -156871 21474 -115073 -28188 -212744
8151 -212744 -181907 -184046 72675 77654 -140366 26089 58208 9301 -42894 -187377 198448 -39013
8138 -19937 -113062 -14413 30547 313266 -12081 -132520 54312 53319 63485 -410888 -86189 44081
8125 -229689 -36073 32763 -52965 -72082 -172220 -229057 176808 -167705 -229340 -418649 -141676
8113 -72334 -60780 -85185 98308 61820 62021 300566 -32975 86500 -241957 -217188 -263825 78418
8100 -54255 -297987 -101103 161589 -182295 44655 -98243 2761 -92882 172240 169298 449128
8089 449128 -110993 94726 -47194 -145524 -47971 -281534 197620 5774 -54354 -183401 -95289
8078 -95289 -189884 150268 -49508 -1716 -150716 189868 20492 99140 -198143 118108 8003
8066 -71821 82223 -76111 -5760 -354675 -26236 -109059 -259420 -188786 -311936 -45483 -99655
8055 -99655 98185 -275651 -132141 -230985 84710 -234917 -60978 -49317 -23559 -31944 -116852
8044 -116852 -35849 119169 -366 -202570 -204464 -140895 185024 -239986 -125433 -78110 -118178
8033 -118178 95196 -102203 -42405 -305431 102020 129874 -156058 -285222 -137510 -69352
8023 -69352 -165135 -202553 245627 72613 -162428 59107 -131526 -293693 -50532 -78351 -159395
8012 -159395 18125 -105064 321835 -96489 -195163 54485 -78825 243 -161204 -87958 -74445
8001 -74445 62642 -121103 -393011 -320806 45716 -47070 -42700 -50252 72659 -67358 -153547 176843
7988 250950 -36693 1020 -59622 -24047 1168 434814 -166075 -41390 -255396 -14130 220526
7976 -97647 100223 37741 30298 -153630 -205833 126379 -36212 -97640 4898 -339813 -111695
7964 -161465 -204723 -156210 -7318 -208871 -95979 -122681 -109955 32614 -55703 -239742 54678
7952 79205 -65362 71618 -81724 -286173 262661 -123994 248216 55589 -374528 -229911 37739
7940 53116 -129396 15722 -139486 -189558 -366828 -56411 150988 34867 -259471 -49242 -186968
7929 -186968 -275762 71596 29584 -69761 19828 -96742 -51500 221220 -114764 114764 19826
7917 -297073 -72436 82880 -249220 51182 -91066 53210 66774 43662 184515 -243666 -262019
7906 -262019 -298375 -28763 -240394 276458 -54037 -222841 122633 91841 -280401 -105108
7895 -25336 -45651 -140422 -70399 74888 -580028 313216 357292 -85793 251083 -112643 62268
7883 156383 -34603 -73282 -96236 4388 129263 373021 240584 -69813 -528132 182510 -200050
7871 -137450 -77494 114842 -100411 -39370 -150753 67811 83537 -17634 42479 123615 -199494
7859 -87610 39300 -206956 -408128 -7470 56542 -89774 82372 -179091 -223645 61495 326840
7848 326840 -127456 -30965 -131531 -437399 70751 -304944 -60847 -274608 -137234 55361
7837 121376 18739 -408912 -89702 31816 -72385 -180035 -62217 -160644 44243 71369 165786
7826 165786 222520 -41556 -101424 37881 -277160 141847 -35695 -481372 -100108 36086 5787
7814 -205935 116240 -135286 -306313 20756 -110623 103296 -338699 -121937 174470 130715
7804 130715 26797 -37280 -94798 216983 146183 -66676 -73268 133943 -143412 -183127 192646
7792 -189109 -50621 177915 72916 29366 217356 -26150 -199931 -76899 50434 3087 124126
7781 124126 -275824 -137001 245078 296810 15174 28147 252508 -164551 199489 -28301
7770 -30380 42875 -41624 -129716 99854 -169834 -137218 19286 131800 45098 -16583 107028
7758 -465135 -77062 3963 -244037 -11646 277358 -431422 -164209 31786 231862 263573 -127083
7746 -177078 160573 -180419 -271725 167077 445263 -260318 271937 -273545 -191447 -133737
7736 -133737 -78900 88238 60586 166297 155166 -69395 53299 -25571 57009 11533 15259 -9114
7723 14131 9167 -394972 44376 -148934 61827 10596 -88187 28829 -188873 -23237 105588
7711 -17388 -258227 8780 -64018 -32255 67585 131524 -52801 193095 -19241 186468 -49947
7699 -13666 -140019 -148245 -51748 127913 -260272 -77208 -92425 131589 -242336 -187381 -260899
7688 -260899 6918 64513 -63629 -325639 -47533 -364746 -301872 -76686 -459495 -82628 -120485
7677 -120485 -91818 -174676 -249888 100264 224709 -80000 162415 -135646 34151 -88871 83620
7665 223036 146079 85974 -37416 -42166 38251 -211882 -172379 -178302 -30772 74744 226271 48451
7652 -160660 -86549 -50770 -122151 28232 -190703 -222277 -33581 -4131 140717 -147412 144238
7640 -75362 141379 -218279 118777 -237004 31765 56070 -101279 -116493 49421 324066 -50141
7628 26385 96715 -90218 93981 -326582 -151972 16369 104271 117943 348707 -237083 153938
7616 146812 177696 -57405 -85029 -283823 -141125 -13066 293183 -101459 -165639 -25714 14499
7604 178245 -20987 -16352 -122179 -155927 -19794 42420 -173187 -161173 -99226 -146321 244215
7592 34986 -12581 -2331 -3391 -108917 -4693 324219 -329457 44770 -11709 296986 207306 -158458
7579 166362 30630 -202299 -423081 -241711 -277300 15731 175085 405724 -159415 37676
7568 -44363 -95648 -163286 -181354 -33517 -139441 103340 236352 -471953 -4835 -61227 232057
7556 97883 -96220 237838 -19766 -154783 -57594 117527 -229328 37577 -310025 243105 -80529
7544 -64841 219325 -113461 -139182 -188370 263585 -286875 54134 75337 -115422 -41588 -23487
7533 -23487 68975 -248020 33283 35699 -171908 13547 -161420 -78650 -252171 -210612 -56987
7521 -183032 103086 -133829 -266853 -213028 -280998 -255054 167403 -314738 -116165 -68519
7511 -68519 184762 223967 18195 -82162 97687 255159 -183713 257378 -706 -137907 48237
7499 -223578 237782 -37903 -77414 2602 -343160 -214540 17287 -187133 -209510 -155195 143911
7487 -315683 -53715 344438 15939 64193 340616 67150 122900 224144 -79039 146020 20553
7475 -47974 122602 121965 -412959 43249 -264596 -110651 -241617 -70716 -16161 -204909 68279
7463 81789 100096 103351 12941 -182004 -135871 -178760 -125481 162036 37733 -98443 134909
7451 91356 179227 38049 4199 -78753 -100272 85099 20066 -113283 -75580 86929 -22701 -221216
7439 -221216 -103719 95449 4220 -218301 95169 155296 17135 364324 333501 -13389 -59787
7428 -59787 -54644 264894 -144232 -203915 211568 140664 238819 -70648 -47378 -169680 132064
7416 71637 258045 28653 -510149 -195625 -2318 -118200 -41423 12673 43378 238962 -25982
7404 -101892 -77112 -117441 -83972 -379948 -166793 -147558 79171 146557 -104791 -121107 -94324
7393 -94324 3701 -255669 -86634 -126337 134231 -144963 288592 134280 135179 -194294 -31168
7381 154326 51202 -68815 193980 70296 -325011 -22249 53964 -366688 79269 105687 -21583
7369 -180485 -63264 14984 369050 -24486 -172387 72691 108295 -26688 73036 83050 -244104
7357 -327310 -240262 -47553 -211984 133612 -156325 -33071 -184558 -288562 57778 43353 -304264
7345 -113628 -83012 -26760 -117689 -21846 -236154 -93582 85515 221029 -292754 408342 -205604
7333 211115 219554 192664 -392079 82939 329442 34325 28005 -67631 -242281 -129300 270150
7321 -268632 -282416 23430 -24495 -132752 -235385 256267 92293 25780 -45411 212171 -53400
7309 -70369 -350507 139354 12339 111937 -347 26314 540 -163821 -582913 -197374 -212813 50422
7296 110217 97703 -140302 -18735 116032 212916 -316066 -102777 -29847 135067 -229348
7285 23990 -24794 -151565 -7071 -159646 64955 -23277 112182 35139 8114 -177714 -46918
7273 101101 102427 153675 183136 -50267 36267 -97353 -240676 18286 106011 25233 -28721 -165914
7261 -165914 -205467 -53103 -158405 35799 -37337 -289143 -10355 -410608 -146330 196784 229357
7250 229357 -148200 -196863 111491 107433 46300 62080 -224660 -183839 123874 -62201 185281
7238 -119276 3748 174781 150052 46321 -84604 -93158 278470 -99873 -2389 -185707 -150954 -104923
7226 -104923 337700 -19994 -151367 -320107 203078 -155760 180775 -391257 -39530 159796
7215 13818 -90533 -6685 -21197 -135126 -364232 -111427 -210908 -47226 -187853 4466 -134984
7203 -99690 -9268 146591 46861 63813 429577 -58559 -103694 -165275 -150823 128021 202077
7192 202077 14756 66464 -119020 -108324 -214486 -177564 9886 -100637 -68728 -339621 78786
7180 99162 144375 83439 183082 278063 25241 -132526 -97867 -52149 -225094 -347320 -420892
7169 -420892 -22193 -4716 41376 -316760 -65647 -83790 -35127 -66336 353896 -61711 7524 124974
7157 124974 -191263 386121 65339 -44344 -95758 56476 -247646 128040 58054 -137561 258394
7145 67895 -19988 -80034 -142441 -254930 -99444 -119838 -71801 172660 342596 -107220 125879
7133 418131 33661 -406863 47373 52243 7390 -118018 -68758 110610 -71990 371203 -22872
7121 19746 -57924 -82987 -29154 -37938 -299815 35116 194487 128006 -177379 156295 -127702
7109 -192768 -67712 -169632 31986 -145627 276296 -137212 102935 117287 -111919 -225804
7099 -225804 -184797 -101307 -29926 -298956 -178564 -92190 48338 -310318 -5408 261732 -108724
7087 359408 -335932 60295 -195806 -92494 -60819 -23109 213149 97553 113348 117462 -57889
7075 223655 -60725 -53553 74086 -133156 -40075 -55755 64704 -130931 93290 169471 -91368
7063 -150010 -131748 -143198 233908 234135 -29557 188189 -71617 -218735 -72880 -9090 172634
7051 -201829 181933 97112 -187906 -260816 -283635 -123902 -196035 -314139 209744 125285 43975
7039 -141263 -31148 -187805 -290688 72355 89707 42977 -27632 -38543 156010 -58266 -112235
7028 -112235 -62557 -240891 -112788 102287 349683 -225989 -219622 69040 -87702 -1006 121609
7016 -198370 145255 -484715 -12854 179861 -76037 135647 -191892 -331306 -156338 -324169
7006 -324169 -446988 -129680 296567 -156264 44042 -3867 -8784 -235466 -94677 -215333 -16962
6994 -101763 162029 290211 152216 -135945 -23627 8255 -100301 303629 -98633 -139179 -250780
6983 -250780 77860 -206421 -34709 -145287 -170050 112245 -91719 277359 -46482 -112296 97821
6971 294759 -72116 311691 306697 158797 164242 -74247 17645 -96921 -381938 -188937 134710
6959 74575 252191 -183065 193340 122976 -52984 172291 -301683 12138 -35818 122103 362118
6948 362118 46100 47400 189493 -83121 -95 -26433 -55615 -92573 84231 -139987 -216049 57105
6935 -17605 117698 -53902 -441320 -203220 -4002 -83157 239552 109024 85474 -41289 -292510
6924 -292510 -4161 29347 -44644 -15807 15509 -369723 -106404 431700 -81585 127534 45160
6912 31967 -14512 -23902 -54023 153495 -105962 271558 -16161 187371 -74119 -189392 140555
6900 -181348 -107204 133492 -106978 -37677 -20504 -44467 -369575 -232019 177418 106120 223891
6889 223891 185896 134905 -270227 -66619 158960 -79367 15681 -251898 91698 76412 95456
6878 95456 96995 -231143 -155150 262628 305436 -152684 -321384 112794 -155900 90197 134235
6867 134235 144444 155606 -83567 -81667 -252664 -110253 -24137 -109359 -209288 -235486 13707
6855 48046 -180187 135557 -391907 164684 -165581 -187956 -122540 -290801 -188372 -593 -211710
6844 -211710 -154204 129239 -6230 -236536 -49652 -115000 -149460 108587 191492 -350027 118367
6832 233187 99859 -160437 -144948 147577 -42633 -92192 60739 -302629 -94406 -183752 46044
6820 -154492 52162 -345337 63415 -393015 -160439 -98893 -76583 35325 -15671 -87965 28633
6808 189924 -146782 24487 222714 59136 -170512 320839 97625 -190191 -28416 305579
6797 -264244 25052 -144247 -57441 -280440 -120861 288344 41272 -93899 56805 149471 -117571
6785 -21517 108309 -80787 -17728 263351 -72366 17559 62170 -135591 -135471 -19708 -33751 122929
6772 -5333 -61491 -44170 -174093 -64671 -121005 -38860 -139685 -248715 -214621 351212 -178883
6760 -64052 -256441 -394550 -315552 24260 205911 -196766 -391480 -155337 98864 546405
6750 546405 -184603 -130236 -57819 20225 -190473 -187092 -128050 -79847 15743 -134514 -13150
6738 -200458 -28234 244518 152791 13193 203320 -137086 -47838 33269 -48039 -205775 -24660
6726 -180777 -315162 -147004 211030 46923 -98822 -141825 -117446 -43 -193411 72387 -129443
6714 20963 -47574 39833 5362 -168424 158432 93155 -32101 -381813 -18790 16030 16546 -88346
6701 -44861 -62608 -170145 -178799 -185828 -248126 -172867 -270484 106814 -198051 -60702 25005 -94863
6688 -182354 109124 166930 -339079 34641 -152266 -239659 -31183 -192154 80915 -53456 122203
6676 -71473 51001 45537 115228 429904 -50560 16069 -39176 55292 161032 10008 206218
6665 206218 -260105 -131961 31033 207750 167913 204791 147890 69946 183308 360612 -101272
6653 11721 4163 52101 17683 -126377 38249 -48628 -92454 257239 -152373 -98571 247166
6641 3264 -242884 335 19660 34519 -333208 139802 -279277 -86619 -97674 157522 195191
6630 195191 226042 104948 -193025 380106 -225772 116343 10325 -59034 -171441 54569
6619 45886 -301389 -118196 -200879 -44424 -161318 -104349 224003 -107034 -201141 -188486 -253879
6608 -253879 -254727 243825 185843 -330893 -272200 -130427 142671 -160790 -36248 -49354 -7572
6596 65247 -350479 -113825 -71648 125868 -23536 190996 136912 -199294 -163094 42240 44692
6585 44692 -41721 44291 59286 -173200 -23943 -48013 22812 -74301 52211 64089 -177327
6573 208468 176696 102332 425874 -142504 -174116 -95096 -28719 -293320 207988 35920 138094
6562 138094 167107 297862 -375346 -211114 198784 -142422 112859 -165390 285573 192199
6552 192199 70320 -49051 62846 -165155 -75676 -103345 -213647 -172691 16888 -14873 -68424
6541 -68424 -67626 127291 73820 -131897 67232 119066 -87221 -45082 37685 -318039 73242 -113194
6528 -85168 -38835 -18588 -121523 40903 -24710 51883 260187 172421 -41734 79738 -23584
6516 16936 -145368 58299 135830 -224243 -267585 275505 -61386 -53321 2582 361411 -106284
6504 -9241 11722 20924 208984 -250073 -74860 -161894 -4729 418310 110807 -164039 123937
6492 133875 37973 178420 303180 -291834 -73760 -129070 -4084 -288900 -64209 126953 -254978
6480 298327 507424 -114854 -7918 22781 -256742 -28623 130094 -132170 -64913 262436 -50337
6468 -17146 -189641 -17749 -317398 -75411 -46888 73342 -127420 -215683 109965 -72235 83791
6456 -193622 -24760 115865 -62791 -59562 -316953 -194260 -320934 -85343 -6607 -295232 193513
6444 135016 365815 47954 396607 -104880 159275 155443 87191 -86250 126343 131109 -249823
6432 -89497 125827 -253776 57735 -160165 223425 76722 -34371 125988 -152852 -44628 211726
6420 75522 -165395 -98616 148503 -94711 41741 -116527 29637 6100 -505098 80833 9069
6408 -156523 -138277 -126586 -91416 -153820 14336 -147716 32746 -261153 128508 53577 184745
6397 184745 200616 174563 -50619 184395 -100164 107755 -119256 323079 149508 -201651
6386 129159 -496259 77272 -31945 92839 144242 -13437 -36508 -46701 51694 -41873 -244050
6375 -244050 249307 45142 294842 62742 -40208 -27168 -128152 190447 -235911 -390261
6365 -390261 4968 -63798 -303663 -102001 -13153 182838 -55127 -12580 25041 -126456 -107541
6354 -107541 110572 8109 18130 -69511 -130634 -167043 106582 -179694 -9967 -291256 97684
6342 -89707 46155 -195424 29553 -62308 -79918 -129803 -215285 121869 -378245 163099 -110733
6330 -8169 185873 -30371 12954 38007 -182301 14494 128783 -121136 -382436 -195791 -2265
6318 -103974 -213235 -176984 52337 171013 246030 -296282 90866 -5928 -39780 -150954 -16728
6306 -54973 -364410 -45074 -143234 -16014 -107718 -31062 156164 151534 206616 120696 -237426
6294 -275925 141109 -114194 39286 -51299 -32195 100550 -302468 339432 -22380 -286379
6284 -286379 -125083 -14543 117704 -84128 -115605 179134 23045 242931 210184 166170 93725
6273 93725 96245 245203 314601 -125852 -80006 -205176 -19730 -19733 -319627 50187 -168181 93739
6260 81802 -146571 -78378 -76140 -283532 61495 -189234 24613 113059 87897 32714 24156 163890
6248 163890 -34674 -205049 -114156 43305 7430 8559 -183617 162007 58333 -208177 123128
6236 326197 -183872 -49748 -127132 -43317 -50357 -268883 2311 88002 264603 -195418 105925
6224 51990 -190309 -396290 -30592 173392 2015 157773 114865 145629 69128 -135250 -20381
6212 -190008 -40183 -83672 77181 -9265 -117676 166346 -236800 -12474 81155 60478 51363
6201 51363 194970 -265171 19589 -273587 49234 -119823 -56407 -84012 -17237 321714 -165668
6189 -118560 -215965 -252378 -90897 57878 6903 177884 79923 -177406 121520 137781 -226213
6177 -49613 -166041 430210 72633 112991 -142496 172920 -12979 120810 -128384 -498190
6167 -498190 -22631 42593 -9879 173612 -92838 229869 -219170 -166247 205750 -9290 -309413
6156 -309413 354035 -287437 -89761 153784 347087 86683 -147434 -23954 -167297 -115477
6146 -115477 133929 -400820 -43885 4769 143416 -290328 234001 -110273 -123661 -19194 -10175
6135 -10175 -44664 -45456 35177 -35529 -95508 -162351 39827 -131386 -175628 188211 -90795 -194791
6123 -194791 155333 -174912 52166 132135 -114982 87878 208344 -73917 -108608 -49014 133990
6111 -42507 -436833 -149028 -272470 -163040 -106927 205397 7293 -87711 247064 -127373 12398
6099 208911 84831 -178696 357947 -31663 102986 -137679 -84430 -30313 289513 39526 -237051
6087 195134 -245662 -18426 139180 -374615 -150138 -108150 411869 194361 349250 75897
6076 -108151 94787 -92614 -161670 -100467 -93075 -227288 -20044 -73380 20954 -32668 -42757 -76836
6064 -76836 -301179 118493 -36538 -29241 -35249 -83853 222580 -7002 -57685 -132853 -41460 390167
6051 85819 154781 10818 -107061 48794 124256 31850 71816 -127699 -39800 218518 -42780
6039 -29741 -262192 -75248 58024 -272203 52034 84171 -275514 270605 309000 -333005 -66862
6027 289623 -127245 -73964 76846 259518 -42183 -235123 124531 -119661 141900 -119588
6016 94287 -71344 4145 -49358 133860 -67882 -131224 132801 237507 219522 -60223 242368
6004 -62236 -296621 122215 -174163 181089 253099 -101627 26521 -111293 -3263 163495 -49653
5992 86386 121221 233790 -277281 -12978 -27699 -235033 79282 33428 -352397 -99738 30780
5980 -82567 -43019 171133 105678 49639 -8700 18694 -337865 -300097 220854 81859 -3560 -168436
5968 -168436 114388 -33149 -136297 -160575 182500 -3351 -73082 -107247 84440 -13973 197052
5956 -327296 89355 82028 35537 261929 312356 25042 705 268017 -65395 109260 -185595
5944 139637 44191 -341448 -94245 -249853 193105 10345 -98927 223587 -117359 91937 -239143
5932 -198222 -271999 -224868 29977 -143751 -9200 -28804 -309715 -215048 326694 114297 -98377
5920 -86989 33251 -220147 249823 30073 -20588 307396 -402272 -129127 -185729 -771 161815
5908 -133645 -66198 -17230 198316 -51566 80995 -283670 -56757 83356 95256 -13014 -138331
5897 -138331 144168 -136906 -121011 -121529 -26376 -56039 -205277 88300 260948 -111918 -152737
5886 -152737 -172913 154202 164033 167437 -34061 78526 -161463 -58234 217127 89650 -9875 150200
5873 325875 -247503 4461 262794 -32045 185852 108308 33825 -315221 309463 121053 -116207
5861 -16447 -244600 -220357 -21783 -47744 -204366 -7640 193436 198731 -132109 -118557 -236002
5850 -236002 -105151 136003 307621 15371 122831 19390 230278 -606403 -204314 -166354
5840 -166354 -125261 145639 -17783 108141 53555 266518 -205896 -258428 5642 -164131 -168003
5829 -168003 144601 157555 -157206 78485 141095 186502 30577 46368 126961 42963 -23170
5817 -48984 -28709 61587 -134352 28012 -31396 -339810 157598 -137652 111222 -15045 257635
5805 62467 346847 -222036 -179502 -165332 36194 105513 394815 99950 -312954 -183301 175899
5793 -226451 -26671 -151320 -4837 42668 -22333 321830 131992 355513 68967 -65681 338567
5781 -85234 -115798 -149835 -215041 -159466 -339962 16244 73857 121836 42212 -228007 -136727
5770 -136727 -100985 -17035 -35605 364034 211822 -250669 7746 56001 -16682 -30084 -62102
5759 -62102 -21810 -44829 -33839 247750 -358740 201725 -63935 89206 -82233 209046 -77963
5747 176418 435 327254 324598 284881 -143549 36194 53724 -158979 138470 -131609 280747
5735 101543 -65170 52259 9995 -113028 -313733 454528 177213 -182393 71014 -60315 408749
5723 -127312 -110574 248815 -359457 -231353 -106154 74493 -121291 -73492 111798 58197
5713 58197 -27122 -81960 -26802 -8519 -65755 -288255 41886 -1224 259538 -105802 128399
5701 -162563 58611 -64203 66638 -114709 -12906 -324080 -4445 60739 -149407 35094 -74080
5689 125298 -24387 -76642 -301183 -214346 -52221 88764 -90500 -234825 47988 -72999 -120944
5678 -120944 69297 105647 -158483 -85424 -82879 -46163 53886 -237897 194574 -75418 203431
5666 155688 -63890 -113382 -210979 71352 -135739 172280 -37038 -190934 -84205 17598 -283703
5654 195420 -18274 324824 188193 209182 506637 -92866 -112803 77314 104091 -26187 -180630
5643 -180630 -245002 -124099 84759 -293948 42385 28356 115207 -281905 -260954 155734 183222
5632 183222 -141143 11612 -123075 356013 130386 -262224 -10918 271933 -5542 -20367 98781
5620 215131 180696 74788 38461 131091 55785 233866 71152 -79814 27616 -125215 -167012
5609 -167012 246093 79881 -11734 -9586 244855 53393 88054 -317066 -491244 111842 -237373
5597 -185331 -209487 238912 20101 -87940 3247 -86171 262822 330309 -129420 -379546 77168
5585 173348 -57174 368619 11704 38621 102922 84405 -316955 -10792 446130 -117687 183512
5573 -37960 -62292 -380722 -129141 -60704 -129604 93803 -226746 380054 -183606 50764 59681
5562 59681 111880 -33048 204035 148520 -214847 -109265 -64818 188976 314693 224865 -104229
5550 421109 178083 112880 -214410 19978 52360 31011 -183157 -134586 -160649 -107094 -73871
5539 -73871 -69888 155703 -38837 -134579 463704 -16002 -187334 57014 -80661 -62098 192526
5527 -231189 70227 181916 -270802 -2956 111319 -167427 59019 -271735 391011 100996
5516 -127982 69523 -48533 270576 178737 -163333 -13995 151676 67677 64527 -104643 -128141
5505 -128141 -141812 -123605 -28741 -93107 181306 72045 126629 50845 66247 114240 -12078
5493 -208429 198907 214100 189909 241596 -291360 30205 89697 -148463 -123841 119660 35793
5481 16548 -86141 -86163 149216 -133779 -218711 77736 -295213 -123900 -96495 -212903 -17446
5469 -155981 30840 4724 -8176 -35800 -169384 233398 -32120 69060 366940 172159 178802
5458 178802 -181309 127382 281620 -179848 109046 146457 -49671 307503 164899 312943
5448 312943 -404984 256116 -199144 271254 40225 187919 -65410 11127 431293 178089
5437 -18618 262355 -3526 -409796 -295658 227501 255079 67597 -268692 58862 -461188 -114730
5425 -124006 -98906 178771 -64954 -171322 253119 39341 -23170 131833 -317087 -222568 36435
5413 -272898 -180813 -274861 -323932 128648 -42722 57819 -22743 -106662 195215 -89876 -166280
5402 -166280 -23499 -61109 54985 31273 -141420 -269498 -107390 159909 -41359 -234546 -68896
5390 -157453 120646 -400762 -107415 196816 -67144 -150623 -722 -100342 219725 -422346 -16207
5378 21153 12657 41633 63133 7266 -140924 -47183 247983 -151442 43985 219765 -120777
5366 149530 -124804 -221430 -200482 -21952 126564 -166258 -45314 199593 262940 29807 -269891
5354 -130295 33026 -91679 47059 170412 104224 14074 -247306 55877 -287118 19876 -55836
5342 -340051 28652 51231 8405 -2692 -4378 -174711 29472 55025 73440 237030 141745 27037
5329 360369 88123 174960 -272723 99423 1306 -315639 -250190 318228 -239896 27205 -72663
5317 67917 -120142 -6991 -27946 28345 61772 -10571 395239 104966 304113 -9553 220179
5305 90897 489387 66565 -14718 -80221 177474 46944 151793 165623 -135704 -200379 120222
5293 -153243 -30410 -13036 -112785 158342 -261142 -299056 57090 118302 -59599 11358 -174257
5281 -76955 -47308 -10625 54421 12669 137653 158452 -37121 66076 -76152 103606 199306
5270 199306 -64521 75043 -104687 -185473 -32354 185623 143897 136683 -86161 -464364 146249
5258 171804 131057 101210 -70347 325458 -314934 43613 176342 241841 -48838 161255 -96770
5246 -240232 38292 -8734 108628 160640 230622 186975 205463 -243840 161711 200407 176948
5235 176948 257232 -40127 -113141 282042 420790 145506 193763 183181 -299892 178821 82049
5223 52032 125931 185908 118238 -49311 -45460 306535 94476 124756 26739 297025 127666
5211 -25200 124744 -107603 53060 5559 -258834 -154981 148436 -286955 -109655 -36704 27911
5199 127809 246659 -75897 -135274 -404390 -98751 -167538 7863 -271842 51558 134971 -36229
5187 -113218 34667 139778 -252246 -244064 -194422 49582 -106160 165567 8075 35868 -211963
5175 -143146 189089 146555 33280 -126576 189212 356415 -159755 218831 51052 -210949
5164 -125127 162279 10087 233177 -125364 81259 82957 -7035 127013 404036 466336 239321
5153 239321 12106 -275291 360869 -69651 -191646 82599 174399 -108223 80543 -54506 84815
5141 -72066 -156551 235787 297238 345890 175554 22813 -342925 -90389 -194356 -194476 -68908
5129 -88845 29491 207447 70003 303235 -35779 -211737 58560 -32354 5051 -128302 30642
5117 -124614 -74602 158114 -213872 -230735 257580 -182367 -146267 138651 83719 -119718
5106 56426 118899 315019 -141417 229568 62141 20020 212605 55995 -166399 17946 -64856
5094 -184163 186667 -102203 115686 -35890 -76392 121645 15195 27871 -36961 19825 -22533
5082 -117717 146894 -48311 -335719 14105 8733 -161548 244273 91920 82473 -43781 -169750
5071 -169750 -5405 -346030 33323 112278 12735 -30467 -242151 112812 -174151 199167 -131087
5059 157498 52427 -32546 -132611 13728 991 -65480 -70642 -288235 -83381 27113 -366060 183857
5046 16591 -472222 -90440 -62921 151746 10257 -149700 199186 -77044 144751 -164681 -67546
5034 68914 -43816 260338 -210399 381870 -220366 -46765 -85888 228161 365755 221890
5024 221890 183223 322837 -396618 -177928 132076 354971 120812 -293847 233579 -21873
5013 -105164 -360299 -103037 71356 -78612 234028 -7139 76855 58635 -72125 36666 158861
5002 158861 -221737 13078 35110 24961 18802 -271194 35861 -92999 -133352 -64523 -47563
4991 -47563 -244236 120644 -242258 133597 27468 -242128 -177911 -307375 49334 29086 95847
4980 95847 11245 187550 -167610 -11619 -36093 -127292 -31859 23620 -19472 498785 -7745
4968 -174919 -340317 -5805 -20891 -158108 -1289 65168 245006 15318 -165683 -188275 -344942
4957 -344942 108939 43398 20157 167146 -36915 87886 153984 -265518 -76352 -65908 -21744
4945 -152616 183 2543 181660 -162641 -97192 -300044 151117 272831 119922 -168590 283712
4933 -26616 149279 76299 -84196 -93543 7220 -152369 121583 -16899 -115071 142051 -175917
4921 -365640 4016 -60505 -6534 -34916 -339093 124947 -125779 -69265 -381894 122583 -27978
4909 -24312 -208773 -6685 104137 141420 214746 270963 -126537 112760 -415681 68664 169183
4898 169183 147940 -143960 -79237 340051 254678 2903 153185 168844 -18598 198282 267420
4887 267420 98969 254688 -435731 59224 -109199 254317 220730 100075 -37212 -68516 108995
4875 -70659 -139908 113372 -30264 283014 218868 -192502 125011 -147666 95050 -41208 185622
4863 -263766 121775 -111940 756 35729 237432 152211 -50656 -192316 -123116 394114 280824
4852 280824 9312 57881 36415 119809 -18125 287219 204572 262644 172358 358826 -337427
4840 147613 20908 15605 -7304 57040 -102527 199258 -68267 -75025 145513 -44439 138071
4828 184503 -268617 36663 275087 -27472 -305949 118930 62765 51628 202209 -142469
4817 103779 703 95886 -75574 -150108 183523 -171000 -269277 167732 -192480 34929 217712
4806 217712 -9660 252355 145932 361573 88945 -58409 -53418 303220 309604 10008 103578
4795 103578 -85810 -51390 191723 -182306 -42338 -259301 -152434 4056 47844 -71267 366648
4783 -198297 -249302 68701 98708 118696 -394846 -149230 82253 -154603 -294449 -57570 17876
4771 -153795 -66409 70905 2362 175840 -47686 -93448 -32855 -22304 -83537 227550 -63872
4759 1935 90041 -138693 253845 -19990 -60572 6418 106520 -53365 82155 56083 -155127
4747 -71548 10009 265152 124584 -137956 -120421 243295 -188993 -247148 429377 133492
4736 -19348 300494 131628 -293460 23558 74667 -31914 56165 85141 -39956 -145669 -215695
4725 -215695 146492 20274 166362 51209 27039 -13109 32682 107619 167309 -186927 38286
4713 -99126 -78870 -74280 -193331 -303238 235780 -197672 153107 -107532 138023 183418 110336
4702 110336 -27150 -7154 -144978 316182 64576 162081 -55528 -17670 -166104 -23647 -128797
4691 -128797 100675 113120 -98799 -24472 -2286 -103411 144653 -72063 11359 165247 99589
4680 99589 88934 183698 -490886 51929 -330307 10667 23703 -130981 200738 337753 223433
4669 223433 23900 -352397 210814 -228798 433863 -14427 -382046 -240345 -46480 -69581
4659 -69581 220536 -5910 -167753 -178867 -50480 -217119 31538 -245364 -310652 -201379 121780
4647 163211 252127 -149805 190874 -25137 -71477 -486 407614 -133197 251130 -356185 85713
4635 -329738 51161 214390 -306491 -39285 -22532 157320 -56884 262974 112252 44943 -123458
4623 201822 22285 67479 105974 -7034 87255 -148033 61735 281403 56953 21848 -362774
4611 22003 36898 42708 288892 -176968 -10623 162630 -98836 93849 204925 -159204 137393
4599 198804 242981 -26891 217843 -248091 -40083 198473 -83124 123839 -96457 -24768 -5564
4587 30270 85857 -105191 -153899 101307 -262718 172069 -144117 -197472 61959 232857 -405530
4575 207897 128219 -200993 13664 -103599 -57886 -261111 315380 -99128 -54468 19822 -168992
4563 45451 97445 187599 767 335172 -167045 110589 410475 -155218 -126262 243434 205187
4552 205187 -271867 -93495 200125 104888 -164823 26599 -27091 -131682 -22032 -14879 -428626
4541 -428626 69849 -140799 -17732 114673 -554631 112448 -39321 -96347 106527 -190227
4530 145327 51021 86663 -122846 127986 300419 292533 119321 -57617 244370 -396146 228020
4518 -58529 172894 180159 146522 -170508 -9991 -73230 -198677 133136 43613 -133386 193538
4506 -199210 -358785 -192406 -149744 32767 160876 -29954 87400 -143461 202790 -57997 149898
4494 184775 -70101 -203453 376815 66843 -189588 -83414 219822 -21490 205024 154955 75977
$$ [...]
##END NTUPLES=NMR SPECTRUM
##END=
