
##TITLE=AC1067_TOPA01_5819214_63GCd5k7ek
##JCAMPDX= 6.0         $$ Bruker NMR JCAMP-DX V2.0
##DATA TYPE= NMR SPECTRUM
##DATA CLASS= NTUPLES
##ORIGIN= BRUKER
##OWNER= Administrator
$$ 1.72 TOPSPIN		Version 2.1
$$ 2012-03-24 19:10:53.125 -0500  Administrator@TOPSPIN
$$ Compression mode = diff/dup
##.OBSERVE FREQUENCY= 400.13188235
##.OBSERVE NUCLEUS= ^1H
##.ACQUISITION MODE= SIMULTANEOUS (DQD)
##.ACQUISITION SCHEME= undefined
##.AVERAGES= 64
##.DIGITISER RES= 22
##SPECTROMETER/DATA SYSTEM= spect
##.PULSE SEQUENCE= noesygpps1d.comp
##.SOLVENT NAME= COFFEE_meoh
##.SHIFT REFERENCE= INTERNAL, COFFEE_meoh, 1, 14.9685
##AUDIT TRAIL= $$ (NUMBER, WHEN, WHO, WHERE, PROCESS, VERSION, WHAT)
$$ ##TITLE= Audit trail, TOPSPIN		Version 2.1
$$ ##JCAMPDX= 5.01
$$ ##ORIGIN= Bruker BioSpin GmbH
$$ ##OWNER= Administrator
$$ $$ C:\Bruker\TOPSPIN/data/COFFEE/nmr/AC1067_TOPA01_5819214_63GCd5k7ek/12/pdata/1/auditp.txt
$$ ##AUDIT TRAIL=  $$ (NUMBER, WHEN, WHO, WHERE, PROCESS, VERSION, WHAT)
(   1,<2012-03-24 19:10:48.187 -0500>,<Administrator>,<TOPSPIN>,<go>,<TOPSPIN 2.1>,
      <created by zg
	started at 2012-03-24 18:59:16.515 -0500,
	POWCHK enabled, PULCHK disabled,
       configuration hash MD5:
       1A 1E CE 29 27 FD 77 03 67 4E F0 E3 C4 B2 CB 90
       data hash MD5: 64K
       C5 FD 50 F4 6F 20 80 B4 B8 99 F0 43 E4 BE 9D 65>)
(   2,<2012-03-24 19:10:51.015 -0500>,<Administrator>,<TOPSPIN>,<proc1d>,<TOPSPIN 2.1>,
      <Start of raw data processing
       efp LB = 0.3 FT_mod = 6 PKNL = 1 PHC0 = 0 PHC1 = 0 SI = 128K 
       data hash MD5: 128K
       00 31 8C 34 D3 E9 49 2B 78 44 41 D8 28 A4 94 70>)
(   3,<2012-03-24 19:10:52.328 -0500>,<Administrator>,<TOPSPIN>,<proc1d>,<TOPSPIN 2.1>,
      <pk PHC0 = 34.66187 PHC1 = 0 
       data hash MD5: 128K
       AF AA C6 4A 56 96 FA F9 88 3B 1B A2 47 BE F7 25>)
(   4,<2012-03-24 19:10:52.796 -0500>,<Administrator>,<TOPSPIN>,<proc1d>,<TOPSPIN 2.1>,
      <abs ABSG = 1 
       data hash MD5: 128K
       C8 98 BE D8 05 8C 71 81 DE AF A7 C5 12 58 5E DF>)
(   5,<2012-03-24 19:10:52.875 -0500>,<Administrator>,<TOPSPIN>,<proc1d>,<TOPSPIN 2.1>,
      <abs ABSG = 2 
       data hash MD5: 128K
       9E 5F 24 DB B5 4F EE D9 5C 00 CD B8 F4 42 84 4C>)
(   6,<2012-03-24 19:10:52.921 -0500>,<Administrator>,<TOPSPIN>,<proc1d>,<TOPSPIN 2.1>,
      <abs ABSG = 3 
       data hash MD5: 128K
       3E 89 13 70 C0 41 03 55 C1 79 02 2C D3 E5 56 42>)
(   7,<2012-03-24 19:10:52.984 -0500>,<Administrator>,<TOPSPIN>,<proc1d>,<TOPSPIN 2.1>,
      <abs ABSG = 4 
       data hash MD5: 128K
       43 9B 11 6F 5D 39 38 C3 A7 E8 86 07 27 9E B3 C7>)
(   8,<2012-03-24 19:10:53.046 -0500>,<Administrator>,<TOPSPIN>,<proc1d>,<TOPSPIN 2.1>,
      <abs ABSG = 5 
       data hash MD5: 128K
       2D 24 80 9B 36 1E 8A 9F AF B4 2C 4B 72 3E 03 5E>)
$$ ##END=
$$ 
$$ $$ hash MD5
$$ $$ F6 5E 6C 26 45 62 FF 8B 09 32 0E 4D 56 E9 99 F8
##$RELAX= 
##$RELAX= 
##$RELAX= 
##$RELAX= 
##$RELAX= 
##$RELAX= 
##$RELAX= 
##$RELAX= 
$$ Bruker specific parameters
$$ [...]
##$TP07= 0
##$TPNAME0= <>
##$TPNAME1= <>
##$TPNAME2= <>
##$TPNAME3= <>
##$TPNAME4= <>
##$TPNAME5= <>
##$TPNAME6= <>
##$TPNAME7= <>
##$TPOAL= (0..7)
0.5 0.5 0.5 0.5 0.5 0.5 0.5 0.5
##$TPOFFS= (0..7)
0 0 0 0 0 0 0 0
##$TUNHIN= 0
##$TUNHOUT= 0
##$TUNXOUT= 0
##$USERA1= <user>
##$USERA2= <user>
##$USERA3= <user>
##$USERA4= <user>
##$USERA5= <user>
##$V9= 5
##$VALIST= <valist>
##$VCLIST= <CCCCCCCCCCCCCCC>
##$VD= 0
##$VDLIST= <DDDDDDDDDDDDDDD>
##$VPLIST= <PPPPPPPPPPPPPPP>
##$VTLIST= <TTTTTTTTTTTTTTT>
##$WBST= 2048
##$WBSW= 25
##$XGAIN= (0..3)
0 0 0 0
##$XL= 0
##$YL= 0
##$YMAX_a= 15704362
##$YMIN_a= -6722295
##$ZGOPTNS= <>
##$ZL1= 120
##$ZL2= 120
##$ZL3= 120
##$ZL4= 120
##$ABSF1= 14.9685
##$ABSF2= -5.58403
##$ABSG= 5
##$ABSL= 3
##$ALPHA= 0
##$AQORDER= 0
##$ASSFAC= 0
##$ASSFACI= 0
##$ASSFACX= 0
##$ASSWID= 0
##$AUNMP= <proc_prof1d_extract.lims>
##$AXLEFT= 0
##$AXNAME= <>
##$AXNUC= <1H>
##$AXRIGHT= 0
##$AXTYPE= 0
##$AXUNIT= <>
##$AZFE= 0.1
##$AZFW= 0.1
##$BCFW= 0
##$BC_mod= 0
##$BYTORDP= 0
##$COROFFS= 0
##$CY= 15
##$DATMOD= 1
##$DC= 0
##$DFILT= <>
##$DTYPP= 0
##$F1P= 0
##$F2P= 0
##$FCOR= 0.5
##$FTSIZE= 131072
##$FT_mod= 6
##$GAMMA= 0
##$GB= 0
##$INTBC= 1
##$INTSCL= 1
##$ISEN= 128
##$LB= 0.3
##$LEV0= 0
##$LPBIN= 0
##$MAXI= 10000
##$MC2= 0
##$MEAN= 0
##$ME_mod= 0
##$MI= 0
##$NCOEF= 0
##$NC_proc= -3
##$NLEV= 6
##$NOISF1= 0
##$NOISF2= 0
##$NSP= 0
##$NTH_PI= 0
##$NZP= 0
##$OFFSET= 14.9685
##$PC= 1
##$PHC0= 34.66187
##$PHC1= 0
##$PH_mod= 1
##$PKNL= yes
##$PPARMOD= 0
##$PPDIAG= 0
##$PPIPTYP= 0
##$PPMPNUM= 2147483647
##$PPRESOL= 1
##$PSCAL= 4
##$PSIGN= 0
##$PYNMP= <proc.py>
##$REVERSE= no
##$SF= 400.130004845449
##$SI= 131072
##$SIGF1= 0
##$SIGF2= 0
##$SINO= 400
##$SIOLD= 131072
##$SPECTYP= <>
##$SREGLST= <1H.CDCl3>
##$SSB= 0
##$STSI= 131072
##$STSR= 0
##$SW_p= 8223.68421052632
##$SYMM= 0
##$S_DEV= 0
##$TDeff= 65536
##$TDoff= 0
##$TI= <>
##$TILT= no
##$TM1= 0
##$TM2= 0
##$TOPLEV= 0
##$USERP1= <user>
##$USERP2= <user>
##$USERP3= <user>
##$USERP4= <user>
##$USERP5= <user>
##$WDW= 1
##$XDIM= 131072
##$YMAX_p= 521583853
##$YMIN_p= -52466919
##$CURPLOT= <Network HP LaserJet P1505>
##$CURPRIN= <$Network HP LaserJet P1505>
##$DFORMAT= <normdp>
##$LAYOUT= <+/1D_H.xwp>
##$LFORMAT= <normlp>
##$PFORMAT= <normpl>
##$SURQMSG= 1
$$ End of Bruker specific parameters
$$ ---------------------------------
##NTUPLES= NMR SPECTRUM
##VAR_NAME=  FREQUENCY,     SPECTRUM/REAL,   SPECTRUM/IMAG
##SYMBOL=    X,             R,               I
##VAR_TYPE=  INDEPENDENT,   DEPENDENT,       DEPENDENT
##VAR_FORM=  AFFN,          ASDF,            ASDF
##VAR_DIM=   131072,        131072,          131072
##UNITS=     HZ,            ARBITRARY UNITS, ARBITRARY UNITS
##FACTOR=    0.0627417313425165, 1,          1
##FIRST=     8223.62146879498, -1061,        -115860
##LAST=      0,             1903,            -116841
##MIN=       0,             -52466919,       0
##MAX=       8223.62146879498, 521583853,    0
$$ Real data points
##PAGE= N=1
##DATA TABLE= (X++(R..R)), XYDATA
$$ [...]
60708A438348K0813K2275K2110K0476J8738J7715J6587J4433J2082J0995J0971
60697A625543J0570R657R670J1039J1974J0852Q652P777Q980J0569J0619R150
60685A745052P736P356P257O184M211K577J727N61j845m682o415o639o064n395
60671A751621n247o395q661j0123r267p635q364j1883j5033j5141j3199j1963
60659A628710j2415j3285j3099j1367q528n670l969l629l856m147m773n686o205
60646A532081o393p411r502j1005j0549r116q446q445p864o639n752n135l766
60633A432058j754n02l90P3K098M769O021M772J685j626l915n279o866r353j2139
60618A409652j4532j6946j9811k2077k2365k1172k0216j9722j8341j5926j4205
$$ y = [1438348, 1459161, 1481436, 1503546, 1524022, 1542760, 1560475, 1577062, 1591495, 1603577, 1614572, 1625543, 1636113, 1645770, 1655440, 1666479, 1678453, 1689305, 1697957, 1705734, 1714714, 1725283, 1735902, 1745052, 1752788, 1760144, 1767401, 1773585, 1777796, 1780373, 1782100, 1782661, 1780816, 1776134, 1769719, 1763080, 1757016, 1751621, 1746374, 1739979, 1731318, 1721195, 1711928, 1704293, 1695929, 1684046, 1669013, 1653872, 1640673, 1628710, 1616295, 1603010, 1589911, 1578544, 1570016, 1564346, 1560377, 1556748, 1552892, 1548745, 1543972, 1538286, 1532081, 1525688, 1518277, 1508775, 1497770, 1487221, 1478105, 1469659, 1461214, 1453350, 1446711, 1440959, 1435824, 1432058, 1430304, 1429802, 1429412, 1429485, 1431583, 1436352, 1442373, 1447145, 1448830, 1447204, 1443289, 1438010, 1431144, 1421791, 1409652, 1395120, 1378174, 1358363, 1336286, 1313921, 1292749, 1272533, 1252811, 1234470, 1218544, 1204339]
60607A204339j3871j3049j0108o407m463m445m292k786q35L08O19P38R56J239
60593A147943J719K638L959N202N783N624N334N429N453M519K802J714K235L704
60579A204058M740M700L862K869K506L275M689N714O350P788J0321J2411J2928
60566A286211J3075J4494J6540J7540J8061K0392K4670K8019K8428K7367K7372
60555A522169K8759L0118L0704L0590K9449K6805K3118J9227J5118J0499O179
60544A772735L364J650q82n260j0437j4765j7702j9762k1645k3737k5729k6500
60532A611330k5188k2660k1056k1374k2268k1724j9182j5549j1852q786o858o016
60520A408817n289l624j103J278K730L118K576J567J103J932L296L457J875J77
$$ y = [1204339, 1190468, 1177419, 1167311, 1160904, 1156441, 1151996, 1147704, 1144918, 1144083, 1144391, 1145010, 1145748, 1146704, 1147943, 1149662, 1152300, 1156259, 1161461, 1167244, 1172868, 1178202, 1183631, 1189084, 1193603, 1196405, 1198119, 1200354, 1204058, 1208798, 1213498, 1217360, 1220229, 1222735, 1226010, 1230699, 1236413, 1242763, 1250551, 1260872, 1273283, 1286211, 1299286, 1313780, 1330320, 1347860, 1365921, 1386313, 1410983, 1439002, 1467430, 1494797, 1522169, 1550928, 1581046, 1611750, 1642340, 1671789, 1698594, 1721712, 1740939, 1756057, 1766556, 1772735, 1776099, 1777749, 1776867, 1771607, 1761170, 1746405, 1728703, 1708941, 1687296, 1663559, 1637830, 1611330, 1586142, 1563482, 1542426, 1521052, 1498784, 1477060, 1457878, 1442329, 1430477, 1421691, 1414833, 1408817, 1403528, 1399904, 1398801, 1400079, 1402809, 1405927, 1408503, 1410070, 1411173, 1413105, 1416401, 1419858, 1421733, 1421910]
60506A421910M00K695N298O558O490O345P236R254J1682J3640J4546J4237J3036
60493A533327J1674J0747J0163R459Q845R386J1638J4591J6689J7743J9067K1746
60481A695075K5577K9879L4472L9388M4245M8431N1600N3492N3578N1162M5756
60470B172655L7178K5726J2547n36j1936k0874k7033l0178l0574k9247k7153k4162
60458B046413j9372j2522m693K471Q196J3160J8574K4513K9448L1931L2641L4001
60446B204761L7608M2862M8407N4056O0553O8227P6901Q6802R8737J13292J30294
60435C022500J48993J68438J88053K08150K29506K52082K74831K97127L19532
60426E109212L42447L64914L85624M03862M17587M21115M06661L68679L05857
$$ y = [1421910, 1422310, 1425005, 1430303, 1436861, 1443351, 1449696, 1456932, 1466186, 1477868, 1491508, 1506054, 1520291, 1533327, 1545001, 1555748, 1565911, 1575370, 1584215, 1593601, 1605239, 1619830, 1636519, 1654262, 1673329, 1695075, 1720652, 1750531, 1785003, 1824391, 1868636, 1917067, 1968667, 2022159, 2075737, 2126899, 2172655, 2209833, 2235559, 2248106, 2247570, 2235634, 2214760, 2187727, 2157549, 2126975, 2097728, 2070575, 2046413, 2027041, 2014519, 2009826, 2012297, 2020493, 2033653, 2052227, 2076740, 2106188, 2138119, 2170760, 2204761, 2242369, 2285231, 2333638, 2387694, 2448247, 2516474, 2593375, 2680177, 2778914, 2892206, 3022500, 3171493, 3339931, 3527984, 3736134, 3965640, 4217722, 4492553, 4789680, 5109212, 5451659, 5816573, 6202197, 6606059, 7023646, 7444761, 7851422, 8220101, 8525958]
60417H525958K19743J14030m062j23786k34169l27307l98731m46389m70798m75296
60407F379193m64745m43820m16518l86207l54950l23298k91500k60744k32617
60398C204794k07859j86257j67365j50638j35280j20757j07443r6204q7368q0283
60388A865340p3767o6776n9082n1563m5578m1801l9763l8397l6656l3909l0469
60377A347579k7578k5938k4496k1874j8866j7706j8543j8661j6170j2688j0941
60366A134118j1262j2121j2699j2966j2231r967p505o604o505m635m60L441M664
60353A045268L674K579K676L879N272N630M518L387M309P153R302Q890P080O106
60339A119723O314O267N175L884L673M849O507P394P183O995Q007R617R927Q297
$$ y = [8525958, 8745701, 8859731, 8855669, 8731883, 8497714, 8170407, 7771676, 7325287, 6854489, 6379193, 5914448, 5470628, 5054110, 4667903, 4312953, 3989655, 3698155, 3437411, 3204794, 2996935, 2810678, 2643313, 2492675, 2357395, 2236638, 2129195, 2032991, 1945623, 1865340, 1791573, 1724797, 1665715, 1614152, 1568574, 1526773, 1487010, 1448613, 1411957, 1378048, 1347579, 1320001, 1294063, 1269567, 1247693, 1228827, 1211121, 1192578, 1173917, 1157747, 1145059, 1134118, 1122856, 1110735, 1098036, 1085070, 1072839, 1062872, 1055367, 1048763, 1042258, 1037623, 1037163, 1040604, 1045268, 1048942, 1051521, 1054197, 1058076, 1063348, 1068978, 1073496, 1076883, 1081192, 1088345, 1097647, 1106537, 1113617, 1119723, 1126037, 1132304, 1137479, 1141363, 1145036, 1149885, 1156392, 1163786, 1170969, 1177964, 1185971, 1195588, 1205515, 1213812]
60325A213812O344N732N984N388L279N89j439k317k450k795m010n526n978m903
60311A211710l272j984q63K45N54l64j270o25J282K821L201K979K704K484K795
60296A222397M327O799Q925R872R925R768R949J1030J3095J4927J4865J2899J0929
60283A359707J0504J1077J1032R613P216M606K527J586J692J937J581Q99N59N53
60269A425089L90M5R4R99K668M651O221O499N157L060J636J331J140j58k627n343
60253A450852p472q756r162q674p588o511n824n434n291n652o350o280m489j717
60239A361652J37K96o5K50P48L79m28k24J290K937L912M658N571O122N956N728
60223A398919O128O887P655Q907J0938J2610J2539J1242J0693J1774J3399J4422
$$ y = [1213812, 1220156, 1225888, 1231872, 1237260, 1240539, 1241128, 1239689, 1237372, 1234922, 1232127, 1228117, 1222591, 1216613, 1211710, 1208438, 1206454, 1205591, 1205836, 1206390, 1206026, 1204756, 1204131, 1205413, 1208234, 1211435, 1214414, 1217118, 1219602, 1222397, 1226724, 1233523, 1242448, 1252320, 1262245, 1272013, 1281962, 1292992, 1306087, 1321014, 1335879, 1348778, 1359707, 1370211, 1381288, 1392320, 1401933, 1409149, 1413755, 1416282, 1417868, 1419560, 1421497, 1423078, 1423977, 1424536, 1425089, 1425479, 1425524, 1425618, 1426617, 1429285, 1433936, 1440157, 1446656, 1451813, 1454873, 1456509, 1457840, 1458980, 1458822, 1456195, 1450852, 1443380, 1434624, 1425462, 1416788, 1409200, 1402689, 1396865, 1391431, 1386140, 1380488, 1374138, 1367858, 1363369, 1361652, 1361789, 1362085, 1362020, 1362270, 1363018, 1363397, 1362969, 1362745, 1364035, 1366972, 1370884, 1375542, 1381113, 1387235, 1393191, 1398919, 1405047, 1411934, 1419589, 1428496, 1439434, 1452044, 1464583, 1475825, 1486518, 1498292, 1511691, 1526113]
60211A526113J5028J5724J6205J6156J6202J7019J8083J8433J8323J9108K1562
60200A717956K5148K8887L2200L5013L7859M1750M7017N2292N5827N7994O1177
60189B193120O6638P2888P8145Q3185R0237R9681J09486J17779J24601J31005
60179C166765J37760J45214J53137J60194J64616J66069J65938J65122J62489
60170D587304J56413J47013J35697J23061J08600R2375P5584N9140M2697K5790
60160E553674R180n603j7732k7377l4586l8652l8880l5666l0317k3802j6011o452
60148E287776M691J6599K8868M2002N6574P2256Q7919J02469J15343J26456J36108
60137F077061J44805J52647J58521J60221J55860J45518J31291J15465R8622P9825
$$ y = [1526113, 1541141, 1556865, 1573070, 1589226, 1605428, 1622447, 1640530, 1658963, 1677286, 1696394, 1717956, 1743104, 1771991, 1804191, 1839204, 1877063, 1918813, 1965830, 2018122, 2073949, 2131943, 2193120, 2259758, 2332646, 2410791, 2493976, 2584213, 2683894, 2793380, 2911159, 3035760, 3166765, 3304525, 3449739, 3602876, 3763070, 3927686, 4093755, 4259693, 4424815, 4587304, 4743717, 4890730, 5026427, 5149488, 5258088, 5350463, 5426047, 5485187, 5527884, 5553674, 5562854, 5557251, 5539519, 5512142, 5477556, 5438904, 5400024, 5364358, 5334041, 5310239, 5294228, 5287776, 5292467, 5309066, 5337934, 5379936, 5436510, 5508766, 5596685, 5699154, 5814497, 5940953, 6077061, 6221866, 6374513, 6533034, 6693255, 6849115, 6994633, 7125924, 7241389, 7340011, 7419836]
60127G419836N8488L5438J1892j1729l5171n7106p5613q9898j00502j07805j11361
60116F936469j10964j07211j00418q9990p5739n9133m2206k5551q187J0779L0971
60105F358820N0936O9086Q4537R7384J07737J14518J16155J12858J06973J00128
60095G319132R1161P8329O2635M7203L3704K1430J0099J537k365j978R76N920
60083G667783J4132K7261M5655O7845R1272J14019J36296J60037J86942K17033
60073H728275K48966K81172L12812L44125L75842M07733M38039M64971M88272
60064A2090207N08216N23512N31728N31617N23356N06519M79893M43857M00738
60055A6539643L51644K94958K29621J58131Q4250R127o7775j44726k17385k82522
$$ y = [7419836, 7478324, 7513762, 7525654, 7513925, 7478754, 7421648, 7346035, 7256137, 7155635, 7047830, 6936469, 6825505, 6718294, 6617876, 6527886, 6452147, 6393014, 6350808, 6325257, 6317070, 6327849, 6358820, 6409756, 6478842, 6563379, 6660763, 6768500, 6883018, 6999173, 7112031, 7219004, 7319132, 7410293, 7488622, 7551257, 7598460, 7632164, 7653594, 7663693, 7665230, 7662865, 7660887, 7661863, 7667783, 7681915, 7709176, 7754831, 7822676, 7913948, 8027967, 8164263, 8324300, 8511242, 8728275, 8977241, 9258413, 9571225, 9915350, 10291192, 10698925, 11136964, 11601935, 12090207, 12598423, 13121935, 13653663, 14185280, 14708636, 15215155, 15695048, 16138905, 16539643, 16891287, 17186245, 17415866, 17573997, 17658247, 17667374, 17599599, 17454873, 17237488, 16954966]
60045A6954966l39738l88771m27235m52207m63054m61688m50694m31812m05726
60036A3134041l72796l34202k92269k49212k05757j61716j17653p5120l5544P0
60026A1289842L0375N3923P0322Q0094Q3371P9974P0679N6914L8997J6519q987
60015A1862023l3824n5790p6279r7239j17682j35395j50904j66959j84241j99972
60005A0643738k11362k18460k22801k24796k23691k19103k11405k01022j88222
59996H722876j73343j56714j38409j18395r6670p3184m8038k2041L390K7155M9129
59985G975756O9844Q9820J09073J26768J41307J51319J56677J57922J54678J45532
59975I278696J29855J08932Q4823N8713L0959K023k7363n6625q5122j11823j35754
$$ y = [16954966, 16615228, 16226457, 15799222, 15347015, 14883961, 14422273, 13971579, 13539767, 13134041, 12761245, 12427043, 12134774, 11885562, 11679805, 11518089, 11400436, 11325316, 11289772, 11289842, 11320217, 11374140, 11444462, 11524556, 11607927, 11687901, 11758580, 11815494, 11854491, 11871010, 11862023, 11828199, 11772409, 11696130, 11598891, 11481209, 11345814, 11194910, 11027951, 10843710, 10643738, 10432376, 10213916, 9991115, 9766319, 9542628, 9323525, 9112120, 8911098, 8722876, 8549533, 8392819, 8254410, 8136015, 8039345, 7966161, 7918123, 7896082, 7899472, 7926627, 7975756, 8045600, 8135420, 8244493, 8371261, 8512568, 8663887, 8820564, 8978486, 9133164, 9278696, 9408551, 9517483, 9602306, 9661019, 9691978, 9694001, 9666638, 9610013, 9524891, 9413068, 9277314]
59964I277314j56513j73745j86374j92969j92878j86614j75467j61217j45587
59955G705950j29215j11234r0655o7878m4200k0087M884L0388N4848P7115R7905
59944G507821J18887J40847J63196J84766K04279K20238K31137K36146K35415
59935I242732K29370K17793J99939J75811J46994J15621Q2547M7388J0613k5559
59925A0443249n9094r0032j19136j45296j65846j79303j86195j87072j81470j69544
59915H960261j53223j34601j14132r1344o6517m0653j4517J1340L6165N9545Q1871
59904H534195J03329J22885J39168J51964J61872J68853J72158J71535J67553
59895I893512J60842J51858J41372J30313J19146J08172R8238R0360Q4719Q1099
$$ y = [9277314, 9120801, 8947056, 8760682, 8567713, 8374835, 8188221, 8012754, 7851537, 7705950, 7576735, 7465501, 7374846, 7306968, 7262768, 7242681, 7247565, 7277953, 7332801, 7409916, 7507821, 7626708, 7767555, 7930751, 8115517, 8319796, 8540034, 8771171, 9007317, 9242732, 9472102, 9689895, 9889834, 10065645, 10212639, 10328260, 10410807, 10458195, 10468808, 10443249, 10384155, 10294123, 10174987, 10029691, 9863845, 9684542, 9498347, 9311275, 9129805, 8960261, 8807038, 8672437, 8558305, 8466961, 8400444, 8359791, 8345274, 8356614, 8392779, 8452324, 8534195, 8637524, 8760409, 8899577, 9051541, 9213413, 9382266, 9554424, 9725959, 9893512, 10054354, 10206212, 10347584, 10477897, 10597043, 10705215, 10803453, 10893813, 10978532, 11059631]
59885A1059631Q0347Q4300R3835J07952J25335J46193J71914K03200K39046K77452
59875A2589205L16667L55685L93781M29777M62002M88821N08626N19040N16604
59866A6580208M97843M60584M04359L30448K42179J44346M1252o4245j68856k66793
59856A8201325l51291m18489m68700n03833n24814n31807n25584n07859m80941
59847A3888007m47489m09821l68839l24341k76847k28496j81541j36601r2842
59838A1421190m9524o894L3922P1461J04695J33516J57975J76843J87589J88080
59828A2418853J77816J57268J26891Q7273L9652j4357p3013j34011j94275k50739
59818A2341358l00967l42911l74928l96803m10036m16275m15836m08458l95021
$$ y = [11059631, 11139978, 11224278, 11318113, 11426065, 11551400, 11697593, 11869507, 12072707, 12311753, 12589205, 12905872, 13261557, 13655338, 14085115, 14547117, 15035938, 15544564, 16063604, 16580208, 17078051, 17538635, 17942994, 18273442, 18515621, 18659967, 18701219, 18636974, 18468118, 18201325, 17850034, 17431545, 16962845, 16459012, 15934198, 15402391, 14876807, 14368948, 13888007, 13440518, 13030697, 12661858, 12337517, 12060670, 11832174, 11650633, 11514032, 11421190, 11371666, 11364772, 11398694, 11470155, 11574850, 11708366, 11866341, 12043184, 12230773, 12418853, 12596669, 12753937, 12880828, 12968101, 13007753, 12993396, 12920383, 12786372, 12592097, 12341358, 12040391, 11697480, 11322552, 10925749, 10515713, 10099438, 9683602, 9275144, 8880123]
59809H880123l77513l57471l35297l11189k85992k60943k36985k14336j92376
59800F308021j70024j46846j23994j03654q7331p4718o4359n5233m7503m1820
59790E392539l8198l5913l4370l3483l3096l2596l1627l0570k9579k7807k4721
59779E040579k1827k1639k4714k9081l3031l7166m2837m9632n5554n8997n9631
59768D606470n7710n3611m7974m1638l5144k8535k1555j4144o997j359K425N949
59756D306177J1352J8846K6721L3924M1220M9327N7311O3844O8922P3356P7398
59745D828398Q0833Q3488Q4768Q3573P9797P4957P0248O4922N7960N0365M4158
59734E603467L9627L5486L1561K9736L1853L7964M6816N7090O8033P9671R2641
$$ y = [8880123, 8502610, 8145139, 7809842, 7498653, 7212661, 6951718, 6714733, 6500397, 6308021, 6137997, 5991151, 5867157, 5763503, 5676172, 5601454, 5537095, 5481862, 5434359, 5392539, 5354341, 5318428, 5284058, 5250575, 5217479, 5184883, 5153256, 5122686, 5093107, 5065300, 5040579, 5018752, 4997113, 4972399, 4943318, 4910287, 4873121, 4830284, 4780652, 4725098, 4666101, 4606470, 4548760, 4495149, 4447175, 4405537, 4370393, 4341858, 4320303, 4306159, 4299162, 4297803, 4300228, 4306177, 4317529, 4336375, 4363096, 4397020, 4438240, 4487567, 4544878, 4608722, 4677644, 4751000, 4828398, 4909231, 4992719, 5077487, 5161060, 5240857, 5315814, 5386062, 5450984, 5508944, 5559309, 5603467, 5643094, 5678580, 5710141, 5739877, 5771730, 5809694, 5856510, 5913600, 5981633, 6061304, 6153945]
59723F153945J07384J23835J42307J63811J88528K14855K41271K68438K97843
59714G902217L29105L60448L91467M22981M53694M78761M92186M89001M64734
59705A1784594M15225L39220K40976J29478J5432r1033j81587k50860k97247l22367
59695A1781831l29590l22575l04410k77659k45098k09765j73779j37595j01203
59686I680157o5455l1291J694L4453O6620R7008J25696J54038J82704K11436K40690
59675A0697750K71511L03546L35355L67219M01488M39199M78615N18387N60047
59666A4373117O05489O53779P02660P51919Q02824Q54832R05222R51758R93645
59657B1595245J029668J057256J073885J078273J069982J049403J018710R81842
$$ y = [6153945, 6261329, 6385164, 6527471, 6691282, 6879810, 7094665, 7335936, 7604374, 7902217, 8231322, 8591770, 8983237, 9406218, 9859912, 10338673, 10830859, 11319860, 11784594, 12199819, 12539039, 12780015, 12909493, 12924925, 12833892, 12652305, 12401445, 12104198, 11781831, 11452241, 11129666, 10825256, 10547597, 10302499, 10092734, 9918955, 9781360, 9680157, 9614702, 9583411, 9585105, 9619558, 9686178, 9783186, 9908882, 10062920, 10245624, 10457060, 10697750, 10969261, 11272807, 11608162, 11975381, 12376869, 12816068, 13294683, 13813070, 14373117, 14978606, 15632385, 16335045, 17086964, 17889788, 18744620, 19649842, 20601600, 21595245, 22624913, 23682169, 24756054, 25834327, 26904309, 27953712, 28972422, 29954264]
59649B9954264R42992R05718Q73450Q49423Q35012Q28652Q27001Q26892Q25682
59640C7669086Q20180Q06080P78759P34591O71880N91128M94756L86422K70378
59631D3223260J51507L5897o9228j57221k24217k69543k93792k97129k79762k43128
59621D1576644j89559j21034l9253N3499J54527K61762L73555M87666O01572P13543
59611D3872922Q21814R22346J008600J073779J111944J116837J081553J000508
59603E2010303Q70794O91502M64245J96343r7698l99714o92872r63046j197917
59594E0881940j387915j528571j620635j667706j674517j646766j591059j514773
59586C8249998j426468j335657j250834j178111j122676j090323j084974j104078
$$ y = [29954264, 30897256, 31802974, 32676424, 33525847, 34360859, 35189511, 36016512, 36843404, 37669086, 38489266, 39295346, 40074105, 40808696, 41480576, 42071704, 42566460, 42952882, 43223260, 43374767, 43410664, 43341436, 43184215, 42959998, 42690455, 42396663, 42099534, 41819772, 41576644, 41387085, 41266051, 41226798, 41280297, 41434824, 41696586, 42070141, 42557807, 43159379, 43872922, 44694736, 45617082, 46625682, 47699461, 48811405, 49928242, 51009795, 52010303, 52881097, 53572599, 54036844, 54233187, 54135489, 53735775, 53042903, 52079857, 50881940, 49494025, 47965454, 46344819, 44677113, 43002596, 41355830, 39764771, 38249998, 36823530, 35487873, 34237039, 33058928, 31936252, 30845929, 29760955, 28656877]
59578B8656877j137829j173524j200438j211754j204679j180119j141263j091316
59570A9315955j032691r68112r01087q34525p69575p06407o45616n88344n35348
59561A2334250m86492m41124l98853l60101l25604k95192k67522k41555k17772
59552I300035j97137j79409j63753j50721j42069j38233j37291j37020j37083
59543G917319j38397j41192j44449j46878j47813j47365j46102j44340j41632
59534F619151j37228j31005j23421j14571j04099r2361q0736p0260o0537n0640
59524E654293m0563l1000k2025j2803k761P516J6849K4683L1581L8433M5258N1014
59512E760475N4856N7322N9775O2794O5832O8663P2300P7946Q5439R3460J01102
$$ y = [28656877, 27519048, 26345524, 25145086, 23933332, 22728653, 21548534, 20407271, 19315955, 18283264, 17315152, 16414065, 15579540, 14809965, 14103558, 13457942, 12869598, 12334250, 11847758, 11406634, 11007781, 10647680, 10322076, 10026884, 9759362, 9517807, 9300035, 9102898, 8923489, 8759736, 8609015, 8466946, 8328713, 8191422, 8054402, 7917319, 7778922, 7637730, 7493281, 7346403, 7198590, 7051225, 6905123, 6760783, 6619151, 6481923, 6350918, 6227497, 6112926, 6008827, 5916466, 5835730, 5765470, 5704933, 5654293, 5613730, 5582730, 5560705, 5547902, 5545141, 5552657, 5569506, 5594189, 5625770, 5664203, 5709461, 5760475, 5815331, 5872653, 5932428, 5995222, 6061054, 6129717, 6202017, 6279963, 6365402, 6458862, 6559964]
59501F559964J08692J17259J27702J40447J55298J71404J87837K04441K21827
59492G994871K40392K59666K78956K98236L17901L37714L56546L73177L86867
59483A0844326L97174M03879M07220M07407M03397L93102L75735L53352L28897
59474A4314489L03050K74282K41837K07187J72355J38351J06058P7283N3706L5490
59464A5924088K1960J3196J0200J3888K4600M1960O4433Q9418J14466J37770J56868
59453A6612847J67788J66942J53489J28649R2975M5683j3317q1829j56141k32432
59443A6884654l07286l77660m40829m94134n34902n61344n73542n73067n61707
59434A2460183n41173n13622m81418m46137m08551l69572l30479k92204k55158
$$ y = [6559964, 6668656, 6785915, 6913617, 7054064, 7209362, 7380766, 7568603, 7773044, 7994871, 8235263, 8494929, 8773885, 9072121, 9390022, 9727736, 10084282, 10457459, 10844326, 11241500, 11645379, 12052599, 12460006, 12863403, 13256505, 13632240, 13985592, 14314489, 14617539, 14891821, 15133658, 15340845, 15513200, 15651551, 15757609, 15834892, 15888598, 15924088, 15946048, 15959244, 15969444, 15983332, 16007932, 16049892, 16114325, 16203743, 16318209, 16455979, 16612847, 16780635, 16947577, 17101066, 17229715, 17322690, 17368373, 17355056, 17273227, 17117086, 16884654, 16577368, 16199708, 15758879, 15264745, 14729843, 14168499, 13594957, 13021890, 12460183, 11919010, 11405388, 10923970, 10477833, 10069282, 9699710, 9369231, 9077027, 8821869]
59425H821869k19881j87089j56744j27814r9281p0983m3268j6313R991L5796O1136
59414H007419Q5941J10189J34214J58478J82837K06462K28760K49749K68993K84869
59404I917911K95705L00873K99986K91760K74916K49516K16077J74018J22765
59395A2143527O4104J619o2092j25707j86720k41163k86683l23962l53998l75762
59385A0253163l88018l91896l89878l83177l71850l56856l40097l22466l03295
59376G005630k82047k59583k37453k16588j96970j78067j59563j41904j26033
59367E207422j12343j00160q8453p6690o4785n2760m1015l0264k0629j1196j276
59356D607851Q307J5990K1493K6280L2067L9477M8094N6909O4325O8384O7839
$$ y = [8821869, 8601988, 8414899, 8258155, 8130341, 8031060, 7960077, 7916809, 7900496, 7910487, 7946283, 8007419, 8093360, 8203549, 8337763, 8496241, 8679078, 8885540, 9114300, 9364049, 9633042, 9917911, 10213616, 10514489, 10814475, 11106235, 11381151, 11630667, 11846744, 12020762, 12143527, 12207631, 12209250, 12147158, 12021451, 11834731, 11593568, 11306885, 10982923, 10628925, 10253163, 9865145, 9473249, 9083371, 8700194, 8328344, 7971488, 7631391, 7308925, 7005630, 6723583, 6464000, 6226547, 6009959, 5812989, 5634922, 5475359, 5333455, 5207422, 5095079, 4994919, 4906466, 4829776, 4764991, 4712231, 4671216, 4640952, 4620323, 4609127, 4607851, 4616158, 4632148, 4653641, 4679921, 4711988, 4751465, 4799559, 4856468, 4920793, 4989177, 5057016]
59345E057016O3344N7468N3388N3277N7513O5110P4795Q5838R8132J11552J25135
59334E902568J36997J45576J51356J57068J65749J78746J95794K16398K40323
59325G490575K66980K95432L25206L56556L89818M25140M62818N03129N45644
59316A1061298N89358O33534O77617P20062P58067P88746Q09954Q19816Q16490
59307A7674942P99115P68499P26517O75443O18207N58387M98760M40135L82232
59298B3142237L25556K71431K20062J69217J15582N7518l841o6568j30726j98188
59288B3902280k69339l40821m07640m67191n20116n67537o08753o42198o67624
59279A9411061o86567p00927p11218p15962p13081p02428o86569o68164o46917
$$ y = [5057016, 5120360, 5177828, 5231216, 5284493, 5342006, 5407116, 5481911, 5567749, 5665881, 5777433, 5902568, 6039565, 6185141, 6336497, 6493565, 6659314, 6838060, 7033854, 7250252, 7490575, 7757555, 8052987, 8378193, 8734749, 9124567, 9549707, 10012525, 10515654, 11061298, 11650656, 12284190, 12961807, 13681869, 14439936, 15228682, 16038636, 16858452, 17674942, 18474057, 19242556, 19969073, 20644516, 21262723, 21821110, 22319870, 22760005, 23142237, 23467793, 23739224, 23959286, 24128503, 24244085, 24301603, 24297762, 24231194, 24100468, 23902280, 23632941, 23292120, 22884480, 22417289, 21897173, 21329636, 20720883, 20078685, 19411061, 18724494, 18023567, 17312349, 16596387, 15883306, 15180878, 14494309, 13826145, 13179228]
59270A3179228o20393n87789n51483n14671m78834m43937m09690l75820l42188
59261H854423l09389k78554k50028k23177j97746j74273j52617j31540j10577
59252G026522r1049p4128n9004m4148k9450j5784l070R787K3346L7032M9962O1621
59240F891637P2066Q2086R2768J04301J15705J26207J36114J45722J54180J60462
59230H081248J64771J68043J70524J71592J70514J66779J60341J52387J44995
59221I551194J39143J33777J27728J21714J17323J14854J13555J13194J13861
59212A0646343J14543J13502J09917J03660R3479P6962N2974K3174r179m1255
59202A1284120p1452r9053j23686j44792j61480j73056j79402j80729j77361j70007
$$ y = [13179228, 12558835, 11971046, 11419563, 10904892, 10426058, 9982121, 9572431, 9196611, 8854423, 8545034, 8266480, 8016452, 7793275, 7595529, 7421256, 7268639, 7137099, 7026522, 6935473, 6861345, 6802341, 6758193, 6728743, 6712959, 6709889, 6719676, 6743022, 6780054, 6830016, 6891637, 6963703, 7045789, 7138557, 7242858, 7358563, 7484770, 7620884, 7766606, 7920786, 8081248, 8246019, 8414062, 8584586, 8756178, 8926692, 9093471, 9253812, 9406199, 9551194, 9690337, 9824114, 9951842, 10073556, 10190879, 10305733, 10419288, 10532482, 10646343, 10760886, 10874388, 10984305, 11087965, 11181444, 11258406, 11311380, 11334554, 11325375, 11284120, 11212668, 11113615, 10989929, 10845137, 10683657, 10510601, 10331199, 10150470, 9973109, 9803102]
59192I803102j59488j45789j28281j07500q5702o4721m4289k3527l052J5840L3179
59181I089772M9771O5157P7952Q8050R6805J04961J11929J17305J21651J25535
59171A0048888J29075J32796J37756J44578J53318J64462J79042J97507K19395
59162A1506817K44139K71230K99542L27451L53608L76535L93502M00987L96425
59153A4570236L78456L45620K96389K30905J51550O1550l5909j36988k37024l31696
59143A5293089m17536m91275n49981n92375o18954o30604o28249o14043n91357
59134A0158715n62831n29755m93872m58093m24224l91304l57787l24494k93920
59125F322435k67201k43335k21271k01235j83700j68118j53378j39048j25609
$$ y = [9803102, 9643614, 9497825, 9369544, 9262044, 9176342, 9111621, 9067332, 9043805, 9040753, 9056593, 9089772, 9139543, 9204700, 9282652, 9370702, 9467507, 9572468, 9684397, 9801702, 9923353, 10048888, 10177963, 10310759, 10448515, 10593093, 10746411, 10910873, 11089915, 11287422, 11506817, 11750956, 12022186, 12321728, 12649179, 13002787, 13379322, 13772824, 14173811, 14570236, 14948692, 15294312, 15590701, 15821606, 15973156, 16034706, 15998797, 15861809, 15624785, 15293089, 14875553, 14384278, 13834297, 13241922, 12622968, 11992364, 11364115, 10750072, 10158715, 9595884, 9066129, 8572257, 8114164, 7689940, 7298636, 6940849, 6616355, 6322435, 6055234, 5811899, 5590628, 5389393, 5205693, 5037575, 4884197, 4745149, 4619540]
59116D619540j13528j02552r2083q2197p3794o7326o1752n5356m7540l9222l1417
59105C852773k4218j7299j0721m699J067P336J4712K3017L1200L8012M3137M7531
59093D001848N2371N8017O4272P1140P8591Q6078R3060R9638J05924J11475J16278
59082D938692J21639J28620J36148J42321J47183J52336J57867J61817J63080
59073F249703J62671J61370J58246J52665J45887J39038J31105J20601J08136
59064G529422R5540Q3438P1652O1501N5494N4406N6154N8165O0018O3417P0248
59053H259455Q0918R4100J07888J21325J34799J48946J63711J78642J93262K06491
59043I689537K16349K21134K20540K14881K03557J85195J59169J26190Q7472M4204
$$ y = [4619540, 4506012, 4403460, 4311377, 4229180, 4155386, 4088060, 4026308, 3970952, 3923412, 3884190, 3852773, 3828555, 3811256, 3800535, 3795836, 3796903, 3804239, 3818951, 3841968, 3873168, 3911180, 3954317, 4001848, 4054219, 4112236, 4176508, 4247648, 4326239, 4412317, 4505377, 4605015, 4710939, 4822414, 4938692, 5060331, 5188951, 5325099, 5467420, 5614603, 5766939, 5924806, 6086623, 6249703, 6412374, 6573744, 6731990, 6884655, 7030542, 7169580, 7300685, 7421286, 7529422, 7624962, 7708400, 7780052, 7841553, 7897047, 7951453, 8007607, 8065772, 8125790, 8189207, 8259455, 8340373, 8434473, 8542361, 8663686, 8798485, 8947431, 9111142, 9289784, 9483046, 9689537, 9905886, 10127020, 10347560, 10562441, 10765998, 10951193, 11110362, 11236552, 11324024, 11368228]
59033A1368228j907m8193r1608j29698j61055j85180k02199k12772k18080k19445
59023I898091k17567k12322k03979j94448j86579j81922j79773j78704j78388
59014H164409j79568j82872j88132j94436k00355k04587k06984k08677k10716
59005F388082k12677k12980k10556k05873k00283j94508j87969j79816j70450
58996D612970j61350j53123j44645j34924j25076j17146j11370j06009r9881r3507
58986C365939q7565q1767p5896p0781o7340o5318o3541o0830n6583n1260m6361
58975B638697m2862l9710l5198k9796k5798k3738k1207j6243j0004m837j389R32
58963B388847K237K752L754N920P635O931M307J840K73j002j822j516r04j497
$$ y = [11368228, 11366321, 11318128, 11226520, 11096822, 10935767, 10750587, 10548388, 10335616, 10117536, 9898091, 9680524, 9468202, 9264223, 9069775, 8883196, 8701274, 8521501, 8342797, 8164409, 7984841, 7801969, 7613837, 7419401, 7219046, 7014459, 6807475, 6598798, 6388082, 6175405, 5962425, 5751869, 5545996, 5345713, 5151205, 4963236, 4783420, 4612970, 4451620, 4298497, 4153852, 4018928, 3893852, 3776706, 3665336, 3559327, 3459446, 3365939, 3278374, 3196607, 3120711, 3049930, 2982590, 2917272, 2853731, 2792901, 2736318, 2685058, 2638697, 2595835, 2556125, 2520927, 2491131, 2465333, 2441595, 2420388, 2404145, 2394141, 2389304, 2387915, 2388847, 2391084, 2393836, 2397590, 2403510, 2411145, 2418076, 2422383, 2424223, 2424496, 2423494, 2421672, 2420156, 2419252, 2417755]
58949B417755k655k108K11J453J34j198N98M792P782P705N991M595L558J890m04
58934B450099k097k177q28Q97K134K893L944O033R105J2320J4875J6729J8314
58921B532241J9652K0365K0687K1761K4235K7182K9311L0762L2589L4738L6111
58910B829634L6672L7909M0596M3680M6088M8193N0584N2788N4543N6893O0474
58899C358054O3741O4701O3813O3403O4729O7299P0650P4820P9070Q2170Q4438
58888D136888Q7986R4212J02197J10125J17191J23755J30546J38338J47455J57296
58878E345989J67046J77075J88685K02193K16354K30164K44199K59514K76232
58869G307451K94118L13770L36037L60604L86183M12175M39491M69529N02771
$$ y = [2417755, 2415100, 2412992, 2413203, 2414656, 2414790, 2413592, 2414190, 2418982, 2426764, 2434469, 2440460, 2445055, 2448613, 2450503, 2450099, 2448002, 2445825, 2444997, 2445894, 2448028, 2450921, 2454865, 2460898, 2470003, 2482323, 2497198, 2513927, 2532241, 2551893, 2572258, 2592945, 2614706, 2638941, 2666123, 2695434, 2726196, 2758785, 2793523, 2829634, 2866306, 2904215, 2944811, 2988491, 3034579, 3082772, 3133356, 3186144, 3240687, 3297580, 3358054, 3421795, 3486496, 3550309, 3613712, 3678441, 3745740, 3816390, 3891210, 3970280, 4052450, 4136888, 4224874, 4319086, 4421283, 4531408, 4648599, 4772354, 4902900, 5041238, 5188693, 5345989, 5513035, 5690110, 5878795, 6080988, 6297342, 6527506, 6771705, 7031219, 7307451, 7601569, 7915339, 8251376, 8611980, 8998163, 9410338, 9849829, 10319358, 10822129]
58860A0822129N38584N76055O14827O55116O97061P40166P83330Q25248Q64665
58851A7117181R00463R31591R56586R72792R76204R62496R28333Q71784P91995
58842B5409425O89073N64325M20353K61066R1788q0958k50285m09758n53722o77752
58832B5463555p79380q58165r14689r49907r65691r65167r51443r26417q91550
58823A7261146q49508q03882p57216p10187o62923o16389n72164n31365m94075
58814A1263437m59541m26865l95852l67329l42338l20958l02077k84272k66720
58805H097485k49307k32151k15152j98051j80908j64335j48886j34489j20928
58796F453278j08559r7703q7512p6717o5547n5546m6977l7965k7042j5258m515
$$ y = [10822129, 11360713, 11936768, 12551595, 13206711, 13903772, 14643938, 15427268, 16252516, 17117181, 18017644, 18949235, 19905821, 20878613, 21854817, 22817313, 23745646, 24617430, 25409425, 26098498, 26662823, 27083176, 27344242, 27436030, 27355072, 27104787, 26695029, 26141307, 25463555, 24684175, 23826010, 22911321, 21961414, 20995723, 20030556, 19079113, 18152696, 17261146, 16411638, 15607756, 14850540, 14140353, 13477430, 12861041, 12288877, 11757512, 11263437, 10803896, 10377031, 9981179, 9613850, 9271512, 8950554, 8648477, 8364205, 8097485, 7848178, 7616027, 7400875, 7202824, 7021916, 6857581, 6708695, 6574206, 6453278, 6344719, 6247016, 6159504, 6082787, 6017240, 5961694, 5914717, 5876752, 5849710, 5834452, 5829937]
58785E829937N039J4630K4905L5849M7843O1113P4558Q6724R7750J08897J20533
58774F507778J32075J43748J56742J71430J86916K02587K18885K36261K54552
58765H210974K73626K93596L14269L35546L58455L84574M14063M45414M77430
58756A1507947N10446N45309N82354O21760O63808P07907P52084P93935Q31690
58747A7517240Q64240Q90691R09898R19559R15559Q93091Q48663P80606O88129
58738B5227676N71424M33036K78023J12351n8154k27319l88606n36304o66180
58729B4745947p74813q59619r20122r58318r77274r79959r69410r48632r19565
58720A6438235q83206q41160p96013p49655p02574o55658o11366n71747n36167
$$ y = [5829937, 5834976, 5849606, 5874511, 5910360, 5958203, 6019316, 6093874, 6180598, 6278348, 6387245, 6507778, 6639853, 6783601, 6940343, 7111773, 7298689, 7501276, 7720161, 7956422, 8210974, 8484600, 8778196, 9092465, 9428011, 9786466, 10171040, 10585103, 11030517, 11507947, 12018393, 12563702, 13146056, 13767816, 14431624, 15139531, 15891615, 16685550, 17517240, 18381480, 19272171, 20182069, 21101628, 22017187, 22910278, 23758941, 24539547, 25227676, 25799100, 26232136, 26510159, 26622510, 26564356, 26337037, 25948431, 25412127, 24745947, 23971134, 23111515, 22191393, 21233075, 20255801, 19275842, 18306432, 17357800, 16438235, 15555029, 14713869, 13917856, 13168201, 12465627, 11809969, 11198603, 10626856, 10090689]
58711A0090689n02384m69468m38379m09979l83862l59292l36268l15164k95811
58702F580082k77348k58833k40157k22357k06814j93861j82292j70515j57992
58693D669913j45409j33685j23103j13189j03248r3146q3711p6166p0985o7356
58683C659915o3890n9773n5223n1041m7643m4696m1771l9293l8180l8349l8465
58672C141591l7650l6695l6600l6699l5526l3245l1813l2618l5096l7919m0453
58661B747277m2715m4732m6457m7898m9014m9847n0553n0945n0349m8683m7142
58650B218942m6752m6539m4596m0852l7424l5933l5758l5264l3600l0916k7948
58639A803360k5879k5552k6360k6781k6314k5839k5866k5586k4295k2558k1264
$$ y = [10090689, 9588305, 9118837, 8680458, 8270479, 7886617, 7527325, 7191057, 6875893, 6580082, 6302734, 6043901, 5803744, 5581387, 5374573, 5180712, 4998420, 4827905, 4669913, 4524504, 4390819, 4267716, 4154527, 4051279, 3958133, 3874422, 3798256, 3727271, 3659915, 3596025, 3536252, 3481029, 3429988, 3382345, 3337649, 3295878, 3256585, 3218405, 3180056, 3141591, 3103941, 3067246, 3030646, 2993947, 2958421, 2925176, 2893363, 2860745, 2825649, 2787730, 2747277, 2704562, 2659830, 2613373, 2565475, 2516461, 2466614, 2416061, 2365116, 2314767, 2266084, 2218942, 2172190, 2125651, 2081055, 2040203, 2002779, 1966846, 1931088, 1895824, 1862224, 1831308, 1803360, 1777481, 1751929, 1725569, 1698788, 1672474, 1646635, 1620769, 1595183, 1570888, 1548330, 1527066]
58628A527066k0409j9429j7983j5949j3448j1244j0155r703q404n910l670k757
58616A388005k184l03L053O726R649J1120J0587Q308N719M075L141K053R83Q53
58602A451785J675K219J488k23j872k813l217l526l581k491J91L321M972M720
58588A452648M435O297J0476J5225J8822K0955K2516K4615K7680L1294L4741L7699
58576A707403M0291M2746M5304M8224N1527N5018N8878O3630O8970P3592P7185
58565B332768Q1794Q9656J00154J10574J19716J28963J39777J51994J65011J78835
58555C599242J93175K07014K19988K32988K46474K59213K69462K76308K79029
58546E782893K76056K65377K45514K15786J76514J29481P7429K2878l1940q4181
$$ y = [1527066, 1506657, 1487228, 1469245, 1453296, 1439848, 1428604, 1418449, 1408746, 1400342, 1394432, 1390762, 1388005, 1385821, 1385518, 1388571, 1395297, 1404946, 1416066, 1426653, 1434961, 1440680, 1444755, 1447896, 1449949, 1450932, 1451785, 1453460, 1455679, 1457167, 1456944, 1455072, 1452259, 1449042, 1445516, 1441935, 1439444, 1439635, 1442956, 1447928, 1452648, 1457083, 1463380, 1473856, 1489081, 1507903, 1528858, 1551374, 1575989, 1603669, 1634963, 1669704, 1707403, 1747694, 1790440, 1835744, 1883968, 1935495, 1990513, 2049391, 2113021, 2181991, 2255583, 2332768, 2414562, 2504218, 2604372, 2714946, 2834662, 2963625, 3103402, 3255396, 3420407, 3599242, 3792417, 3999431, 4219419, 4452407, 4698881, 4958094, 5227556, 5503864, 5782893, 6058949, 6324326, 6569840, 6785626, 6962140, 7091621, 7169050, 7191928, 7159988, 7075807]
58536G075807j30843j70347k02454k26651k42240k50247k53259k52663k47616
58527E099487k37563k24035k09191j94105j79399j65769j52707j38423j22607
58518C475688j07805r6388q7405p8189o8319o0151n5724n4559n4527n3929n2682
58507B706010n1781n1556n0782m8325m5236m3514m2928m1151l7452l4031l2774
58496B226480l3008l3583l4859l7079l8900l9475m0030m1289m1281l8186l3799
58485A814991l1426l1376l1203k9636k7610k5778k3659k1260j9299j7689j5761
58474A540294j4037j3739j4366j3744j1021q035p027q107r456r216o966m105k806
58461A417669l980o395q359r698j1301j3347j5041j5749j5461j4626j4233j5289
$$ y = [7075807, 6944964, 6774617, 6572163, 6345512, 6103272, 5853025, 5599766, 5347103, 5099487, 4861924, 4637889, 4428698, 4234593, 4055194, 3889425, 3736718, 3598295, 3475688, 3367883, 3271495, 3184090, 3105901, 3037582, 2977431, 2921707, 2867148, 2812621, 2758692, 2706010, 2654229, 2602673, 2551891, 2503566, 2458330, 2414816, 2371888, 2330737, 2293285, 2259254, 2226480, 2193472, 2159889, 2125030, 2087951, 2049051, 2009576, 1969546, 1928257, 1886976, 1848790, 1814991, 1783565, 1752189, 1720986, 1691350, 1663740, 1637962, 1614303, 1593043, 1573744, 1556055, 1540294, 1526257, 1512518, 1498152, 1484408, 1473387, 1465352, 1458325, 1450218, 1440762, 1431546, 1424580, 1420475, 1417669, 1413689, 1407294, 1398935, 1389237, 1377936, 1364589, 1349548, 1333799, 1318338, 1303712, 1289479, 1274190]
58449A274190j7306j8212j6872j4685j3525j3078j1758r316o812m664k623j202
58437A144137j248k160k316j216K14J248J875J747L46j703k883k605j647p72l1
58422A132986M90M30o2l68l54n00j061j848k753l603l654k234J3J466J292M24
58406A120664M92K083M063M593L086J106P35K116L501L695L210K872K735K835
58392A157786L501M213L630J571m52j452k128k957k989j777p08r33j569j578j715
58377A152443k834l687k504K95K838M212M531L697J792k80j974l818n612n623
58363A143476l235o52N3k5J174L101L914L916M821O421O898O021N551O710R315
58348A197459J2813J6213J7731J6671J5046J5288J7144J8636J9037J8661J6939
$$ y = [1274190, 1256884, 1238672, 1221800, 1207115, 1193590, 1180512, 1168754, 1159438, 1152626, 1147962, 1145339, 1144137, 1142889, 1140729, 1138413, 1137197, 1137411, 1138659, 1140534, 1142281, 1142627, 1140924, 1138041, 1135436, 1133789, 1133017, 1132986, 1133476, 1133906, 1133844, 1133476, 1133122, 1132622, 1131561, 1129713, 1126960, 1123357, 1119703, 1117469, 1117482, 1118948, 1120240, 1120664, 1121156, 1123239, 1127302, 1131895, 1134981, 1136087, 1136822, 1138938, 1142439, 1146134, 1149344, 1152216, 1154951, 1157786, 1161287, 1165500, 1169130, 1170701, 1170249, 1168797, 1166669, 1163712, 1160723, 1158946, 1158238, 1157305, 1155736, 1154158, 1152443, 1149609, 1145922, 1143418, 1143713, 1146551, 1150763, 1155294, 1158991, 1160783, 1160503, 1158529, 1154711, 1149099, 1143476, 1140241, 1139589, 1139642, 1139617, 1140791, 1143892, 1147806, 1151722, 1156543, 1162964, 1169862, 1175883, 1181434, 1188144, 1197459, 1210272, 1226485, 1244216, 1260887, 1275933, 1291221, 1308365, 1327001, 1346038, 1364699, 1381638]
58337A381638J3320R248O609M915K409q02l132m265m956m950l766k816l978o485
58323A382989p789p067n535l996k543j882k296k020O91M564O995P813Q573R194
58309A387691Q538P494Q072R877J0811J0800J1546J2987J3407J2892J3133J3967
58297A521215J3611J2387J2601J4369J5023J3304J1092J0232J0465J1009J1581
58286A656889J1387R635P346O353O501O206N466N700O845P471P518Q211R534J0530
58272A765592J1693J4137J6812J7568J6669J6342J7269J8423J9725K1844K4055
58261A960129K5353K6792K9517L1615L0563K7742K6606K7471K8127K8559L0449
58250B272923L2745L2521L0051K8576K9171L0023L0391L1021L1111K9334K7456
$$ y = [1381638, 1394958, 1404206, 1410815, 1415730, 1418139, 1417337, 1414205, 1409940, 1404984, 1400034, 1396268, 1393452, 1389474, 1382989, 1375200, 1368133, 1362598, 1358602, 1356059, 1354177, 1351881, 1349861, 1350552, 1355116, 1362111, 1369924, 1378497, 1387691, 1396229, 1403723, 1411795, 1421672, 1432483, 1443283, 1454829, 1467816, 1481223, 1494115, 1507248, 1521215, 1534826, 1547213, 1559814, 1574183, 1589206, 1602510, 1613602, 1623834, 1634299, 1645308, 1656889, 1668276, 1677911, 1685257, 1691610, 1698111, 1704317, 1709783, 1715483, 1722328, 1729799, 1737317, 1745528, 1755062, 1765592, 1777285, 1791422, 1808234, 1825802, 1842471, 1858813, 1876082, 1894505, 1914230, 1936074, 1960129, 1985482, 2012274, 2041791, 2073406, 2103969, 2131711, 2158317, 2185788, 2213915, 2242474, 2272923, 2305668, 2338189, 2368240, 2396816, 2425987, 2456010, 2486401, 2517422, 2548533, 2577867, 2605323]
58239B605323K8453L1561L3606L4448L6304L8715L9421L9518M2180M6781M9747
58228C026057N0726N2469N5130N6534N7383O0233O3968O5558O6464P0578P6629
58217C701729P9859Q0686Q3951Q9828R3571R4468R6756J01066J03529J04339J08402
58206D738184J16117J22195J25414J30755J39855J48276J54766J64299J78859
58197F018720J93628K05555K17613K31503K44253K55085K67755K83297K98232
58188H215641L12401L30217L52067L73195L93393M18435M49508M80755N09811
58179A1835423N40824N74384O04877O30713O56781O84101P08014P29336P55636
58170A7720089P88683Q22834Q58607R04502R62123J023493J086738J159751J244138
$$ y = [2605323, 2633776, 2665337, 2698943, 2733391, 2769695, 2808410, 2847831, 2887349, 2929529, 2976310, 3026057, 3076783, 3129252, 3184382, 3240916, 3298299, 3358532, 3422500, 3488058, 3554522, 3625100, 3701729, 3781588, 3862274, 3946225, 4036053, 4129624, 4224092, 4320848, 4421914, 4525443, 4629782, 4738184, 4854301, 4976496, 5101910, 5232665, 5372520, 5520796, 5675562, 5839861, 6018720, 6212348, 6417903, 6635516, 6867019, 7111272, 7366357, 7634112, 7917409, 8215641, 8528042, 8858259, 9210326, 9583521, 9976914, 10395349, 10844857, 11325612, 11835423, 12376247, 12950631, 13555508, 14186221, 14843002, 15527103, 16235117, 16964453, 17720089, 18508772, 19331606, 20190213, 21094715, 22056838, 23080331, 24167069, 25326820, 26570958]
58161B6570958J331034J417400J510351J610494J708301J802762J906222K025127
58153C9882649K154748K298532K471729K679054K911196L171915L485752L870044
58145F2925619M322848M845549N448660O125143O849599P619314Q470036R444558
58137A16051326J0581217J1937607J3571905J5475939J7566926J9761739K2030969
58130B26977628K4425917K7157858L0553053L4533388L7841798L8017748L2758558
58123D52265948K1751286P222039p379423j9291934k7373490l1797174l3349667
58116C62047585l2966331l1481318k9457754k7168273k4735886k2258436j9816388
58109A74163199j7456683j5222571j3168766j1328274r694821q247988o967570
$$ y = [26570958, 27901992, 29319392, 30829743, 32440237, 34148538, 35951300, 37857522, 39882649, 42037397, 44335929, 46807658, 49486712, 52397908, 55569823, 59055575, 62925619, 67248467, 72094016, 77542676, 83667819, 90517418, 98136732, 106606768, 116051326, 126632543, 138570150, 152142055, 167617994, 185184920, 204946659, 226977628, 251403545, 278561403, 309114456, 343647844, 381489642, 419507390, 452265948, 474017234, 481239273, 473859850, 454567916, 427194426, 395397252, 362047585, 329081254, 297599936, 268142182, 240973909, 216238023, 193979587, 174163199, 156706516, 141483945, 128315179, 116986905, 107292084, 99044096, 92076526]
58102I2076526n821859m774950l812057k937543k155706j470162q69511k79371
58094F9955367M12101J179576J719515J604814O57488q60340k446779l705403
58086F8516339m492026m836703m838028m621055m304304l958813l607848l262954
58078C4594608k938503k637990k354889k090609j854312j646655j460119j293611
58070A8317920j152053j033991r32774q46953p77809p20331o67887o21774n85627
58061A0978721n54872n22084m88232m58656m32282m04599l76722l52253l29557
58052G059464l06194k86398k75025k68372k59748k49890k43158k37665k28261
58043D704753k15876k05303j96745j87421j78388j71983j65469j54780j41882
$$ y = [92076526, 86254667, 81479717, 77667660, 74730117, 72574411, 71104249, 70234738, 69955367, 70367468, 71547044, 73266559, 74871373, 75528861, 74668521, 72221742, 68516339, 64024313, 59187610, 54349582, 49728527, 45424223, 41465410, 37857562, 34594608, 31656105, 29018115, 26663226, 24572617, 22718305, 21071650, 19611531, 18317920, 17165867, 16131876, 15199102, 14352149, 13574340, 12854009, 12186122, 11564348, 10978721, 10423849, 9901765, 9413533, 8954877, 8522595, 8117996, 7741274, 7389021, 7059464, 6753270, 6466872, 6191847, 5923475, 5663727, 5413837, 5170679, 4933014, 4704753, 4488877, 4283574, 4086829, 3899408, 3721020, 3549037, 3383568, 3228788, 3086906]
58034C086906j31369j22609j12205j01321r3555q8087q1779p5624p2598p1408
58024B136351o8622o4810o2501o0422n5859n0583m8348m8378m7082m4401m2856
58013A542489m2000l9328l5398l2924l2016l0825k9442k8871k7848k4886k1715
58002A197236k0574k0008j7384j3660j1688j1700j2222j3249j4795j4682j1632
57991A035642q341p735q617q583q438r694j0642r198p156p173q086p459o354o995
57977I21171q114p188n126m236l587j048K002K610J214J98p48l202n556m749j469
57962H82172P10M87p12k271m451n904m995k841j806k045k529l784o372q400q116
57947H29143p218q149r900j0144r510r877j0341r053p314p519q539p425m448k293
$$ y = [3086906, 2955537, 2832928, 2720723, 2619402, 2525847, 2437760, 2355981, 2280357, 2207759, 2136351, 2067729, 2002919, 1940418, 1879996, 1824137, 1773554, 1725206, 1676828, 1629746, 1585345, 1542489, 1500489, 1461161, 1425763, 1392839, 1360823, 1329998, 1300556, 1271685, 1243837, 1218951, 1197236, 1176662, 1156654, 1139270, 1125610, 1113922, 1102222, 1090000, 1076751, 1061956, 1047274, 1035642, 1027301, 1019566, 1010949, 1002366, 993928, 984234, 973592, 964394, 957238, 950065, 941979, 934520, 928166, 921171, 913057, 905869, 900743, 896507, 892920, 891872, 893874, 896484, 897698, 897896, 897148, 893946, 888390, 883641, 882172, 882882, 883369, 882657, 880386, 875935, 870031, 865036, 862195, 860389, 858344, 855815, 852031, 845659, 837259, 829143, 821925, 813776, 803876, 793732, 784222, 774345, 764004, 754951, 747637, 740118, 731579, 724154, 719706, 717413]
57933G17413j390k96M92o42k680l179k438k547l234k631j266j086j323M85L836
57918F99514N719N362M630M094K698J071J158K446K289J58j815k549l053l703
57904G18019l631k969k833l171l129l140m039m840m184l124l587m968n312m834
57890F64258n043n381m141j945q00n96O5N14p39k291j395J307K614J886J376J714
57874F51403J142o97k108k717l861n542o508p280r422j1963j2442j1410j1763
57861E66832j3414j3046r797o824o166o080m737k833j156R76L387M396L945M310
57847E19793O304P756P093N735N573O625Q273J0290J1586J0584P832N817N304
57834F18565M498K601J221J266J201k31k255m109o220q121p963n606l761m465
$$ y = [717413, 716023, 715727, 716219, 715577, 712897, 709718, 707280, 704733, 701499, 698868, 697602, 696516, 695193, 695678, 699514, 705233, 710595, 715225, 719319, 722017, 723088, 724246, 726692, 728981, 729139, 727324, 724775, 721722, 718019, 714388, 711419, 708586, 705415, 702286, 699146, 695107, 690267, 686083, 682959, 679372, 674404, 669092, 664258, 659215, 653834, 649693, 647748, 646948, 646352, 646417, 646931, 646192, 643901, 642506, 643813, 646427, 648313, 649689, 651403, 652545, 651848, 649740, 647023, 643162, 637620, 631112, 623832, 614410, 602447, 590005, 578595, 566832, 553418, 540372, 530575, 523751, 517585, 511505, 506768, 503935, 502779, 503755, 507142, 511538, 515483, 519793, 526097, 533853, 540946, 546681, 552254, 558879, 567152, 577442, 589028, 599612, 607444, 613261, 618565, 623063, 625664, 626885, 628151, 629352, 629121, 626866, 622757, 616537, 608416, 600453, 594847, 591086, 586621]
57820E86621o569q103q915r487r205p498n119l040j467o33q83j248L1K893N282
57805E32660O354P587R830J1585J1445J0148Q879P383N179L074K191K586L588
57792F22489M324L651J035k181m079m825o084p885q462p434o454o289o021n699
57778E66086o756q771q996o627m724n937q817j0377j0036q908p252n201m410o434
57764D62840j0160j2818j3032j1570r849q912r098r656r321q054p234p482p652
57751C38002o692n304m815n397o228o392n129k417L15J336Q95R21K149L274L451
57736C07969L721N104O994Q419R242R262P822N291L353K816K631J956J559K157
57722C78296K970L122L015L126K773J256q50k614l863m629m632m082l820m005
$$ y = [586621, 580052, 571949, 563034, 553547, 544342, 536844, 531725, 528685, 527218, 526585, 525702, 524454, 524485, 527378, 532660, 539014, 546601, 556431, 568016, 579461, 589609, 598488, 605871, 611050, 614124, 616315, 618901, 622489, 626813, 630464, 631499, 629318, 625239, 620414, 614330, 606445, 597983, 590549, 584095, 577806, 571785, 566086, 559330, 550559, 541563, 534936, 530212, 524275, 515458, 505081, 495045, 486137, 478885, 473684, 469274, 462840, 452680, 439862, 426830, 415260, 405411, 396499, 387401, 377745, 368424, 360370, 353136, 345654, 338002, 331310, 326006, 321191, 315794, 309566, 303174, 298045, 295628, 295943, 297279, 298174, 299095, 301244, 304518, 307969, 311690, 316794, 323788, 332207, 341449, 350711, 358533, 363824, 367177, 369993, 372624, 374580, 376139, 378296, 381266, 384388, 387403, 390529, 393302, 394558, 393708, 391094, 387231, 382602, 377970, 373888, 370068, 366063]
57708C66063l874l323l308m030m302l454k396j933j521n58M57R51J255J838K694
57693C44559L886N503O846P113O956P560Q220P132M789L909N304O567N935M758
57679D29037M677N040M840M792N514N795M787L979M832O243O578O622Q174J0929
57665E11839J3076J4027J4500J4762J4691J4860J5807J6839J7054J6830J7081
57654F81366J7974J9526K2155K5206K6426K4733K2405K2549K5315K8414L0467
57643I46536L1940L3482L5343L7969M1452M4755M7029M9255N3037N8295O3667
57632A442760O8773P4339Q0381Q5982R1085R7088J05287J15543J26691J37774
57622B425703J48991J61648J76804J93664K10095K24956K38935K52455K63999
$$ y = [366063, 362189, 358866, 355558, 351528, 347226, 343772, 341376, 339443, 337922, 337364, 337821, 338772, 340027, 341865, 344559, 348445, 353948, 360794, 367907, 374863, 382423, 390643, 397775, 402564, 406473, 411777, 418344, 424279, 429037, 433714, 438754, 443594, 448386, 453900, 459695, 464482, 468461, 473293, 479536, 486114, 492736, 500910, 511839, 524915, 538942, 553442, 568204, 582895, 597755, 613562, 630401, 647455, 664285, 681366, 699340, 718866, 741021, 766227, 792653, 817386, 839791, 862340, 887655, 916069, 946536, 978476, 1011958, 1047301, 1085270, 1126722, 1171477, 1218506, 1267761, 1320798, 1379093, 1442760, 1511533, 1585872, 1666253, 1752235, 1843320, 1940408, 2045695, 2161238, 2287929, 2425703, 2574694, 2736342, 2913146, 3106810, 3316905, 3541861, 3780796, 4033251, 4297250]
57613D297250K71300K73146K69094K58612K41577K18731J90346J55107J11314
57604F286477N8731j121o5201j28542j84896k29368k60273k78141k84208k80589
57594D632869k70464k56577k40186k22144k03699j85231j65611j44354j23379
57585B821224j05265r0679p8693o8543n9686n1014m1747l2509k4337j7067r794
57574B241890k219N454J3183K0734K7478L3549M0266M8372N6890O4866P3133Q3022
57562B706618R4225J05371J15973J26461J36855J46716J55959J64562J71691J75820
57552D100251J75405J69069J55956J36243J10432P8153L9327l235m4452q1030
57542D836119j13058j40873j62911j78235j88672j96146j99768j98041j92300
$$ y = [4297250, 4568550, 4841696, 5110790, 5369402, 5610979, 5829710, 6020056, 6175163, 6286477, 6345208, 6344087, 6278886, 6150344, 5965448, 5736080, 5475807, 5197666, 4913458, 4632869, 4362405, 4105828, 3865642, 3643498, 3439799, 3254568, 3088957, 2944603, 2821224, 2715959, 2625280, 2546587, 2478044, 2418358, 2367344, 2325597, 2293088, 2268751, 2251684, 2241890, 2239671, 2245125, 2258308, 2279042, 2306520, 2340069, 2380335, 2428707, 2485597, 2550463, 2623596, 2706618, 2800843, 2906214, 3022187, 3148648, 3285503, 3432219, 3588178, 3752740, 3924431, 4100251, 4275656, 4444725, 4600681, 4736924, 4847356, 4925509, 4964836, 4961601, 4917149, 4836119, 4723061, 4582188, 4419277, 4241042, 4052370, 3856224, 3656456, 3458415, 3266115]
57533C266115j85310j77596j67873j56423j45379j35805j26673j16852j06524
57524A947680r6604q8042q1346p5904p0298o4111n8449n3821m9088m3773l9566
57513A226678l7713l6481l3434k8843k4640k1198j7655j4494j3094j3219j3247
57502I72660j2526j1425r638o713l732k225j688l78J827L606M857O768R356J1261
57488I62010J2268J3858J6866K0380K3229K5031K5745K5768K6535K9405L3873
57477A214968L8246M1908M5504M9276N2876N6584O1151O6649P2842Q0101Q8475
57466A868580R6619J03560J10638J19562J29188J36786J41860J45953J48823J47857
57456C149426J41668J31389J17513R8148P1770L9907O004k6854n6419q1329j01719
$$ y = [3266115, 3080805, 2903209, 2735336, 2578913, 2433534, 2297729, 2171056, 2054204, 1947680, 1851076, 1763034, 1681688, 1605784, 1535486, 1471375, 1412926, 1359105, 1310017, 1266244, 1226678, 1188965, 1152484, 1119050, 1090207, 1065567, 1044369, 1026714, 1012220, 999126, 985907, 972660, 960134, 948709, 939071, 932358, 928626, 926401, 924713, 924335, 926162, 929768, 934625, 941393, 950749, 962010, 974278, 988136, 1005002, 1025382, 1048611, 1073642, 1099387, 1125155, 1151690, 1181095, 1214968, 1253214, 1295122, 1340626, 1389902, 1442778, 1499362, 1560513, 1627162, 1700004, 1780105, 1868580, 1965199, 2068759, 2179397, 2298959, 2428147, 2564933, 2706793, 2852746, 3001569, 3149426, 3291094, 3422483, 3539996, 3638144, 3709914, 3749821, 3755825, 3728971, 3672552, 3591223, 3489504]
57445C489504j18449j31073j38011j39281j37328j34238j29612j22273j12812
57436B326427j03230r4918q7944q1606p4858o6809n7623m8604m0935l4551k8505
57425A606844k2096j5545r736n285j736K021O515J1422J6528K1909K6882L0279
57413A668002L2424L5393M0265M5637N0173N4918O1402O9019P6341Q3495R0963
57402B308032R7522J02066J06266J12255J18390J20422J16568J08309R6354P9199
57392C365383N6316K9676J161k8764n8898q6265j08589j25872j38706j46923j50916
57381B607603j52259j51851j48991j43291j35982j28419j20679j12442j03889
57372A409800r5092q5807p6622o8939o3177n8263n3486m9515m6875m4671m1656
$$ y = [3489504, 3371055, 3239982, 3101971, 2962690, 2825362, 2691124, 2561512, 2439239, 2326427, 2223197, 2128279, 2040335, 1958729, 1883871, 1817062, 1759439, 1710835, 1669900, 1635349, 1606844, 1584748, 1569203, 1559467, 1554182, 1552446, 1554467, 1560982, 1572404, 1588932, 1610841, 1637723, 1668002, 1700426, 1735819, 1776084, 1821721, 1871894, 1926812, 1988214, 2057233, 2133574, 2217069, 2308032, 2405554, 2507620, 2613886, 2726141, 2844531, 2964953, 3081521, 3189830, 3286184, 3365383, 3421699, 3451375, 3452536, 3423772, 3364874, 3278609, 3170020, 3044148, 2905442, 2758519, 2607603, 2455344, 2303493, 2154502, 2011211, 1875229, 1746810, 1626131, 1513689, 1409800, 1314708, 1228901, 1152279, 1083340, 1020163, 961900, 908414, 858899, 812024, 767353, 725697]
57361G25697l7691l3541k9895k7018k4729k2657k1009k0586k1286k1449j9911
57350D45925j7787j6609j5735j3635j0958r695r771r254p879p534q814r853r398
57337B99003q417p819o869n099l577l133l142l139l825n272n829m202j378O63
57323B37965J108L62r61k269l045l201k781j421P80K289J571o00k042k146k031
57308B23578j930q09J195K383K139J768K098K294J776J210R38M32%R12L161M983
57292B46128N311M839M185L264K939M777Q242J0524J0180Q765P973P660P692R030
57278C41509J1493J2904J2189J1176J1550J2212J1524J0383J0916J3487J6666
57267D76009J9100K0121J9721J8974J9135J9645J8831J7134J7207J9673K1535
$$ y = [725697, 688006, 654465, 624570, 597552, 572823, 550166, 529157, 508571, 487285, 465836, 445925, 428138, 411529, 395794, 382159, 371201, 361506, 351735, 342481, 334602, 327068, 318254, 308401, 299003, 290586, 282767, 275898, 270799, 267222, 264089, 260947, 257808, 253983, 248711, 242882, 238680, 237302, 237965, 239073, 239435, 238474, 236205, 233160, 229959, 227178, 225757, 226537, 228826, 230397, 229797, 227755, 225609, 223578, 221648, 220839, 222034, 224417, 226556, 228324, 230422, 232716, 234492, 235702, 236640, 237072, 237072, 237984, 241145, 246128, 251439, 256278, 260463, 263727, 266666, 271443, 279685, 290209, 300389, 309154, 317127, 324787, 332479, 341509, 353002, 365906, 378095, 389271, 400821, 413033, 424557, 434940, 445856, 459343, 476009, 495109, 515230, 534951, 553925, 573060, 592705, 611536, 628670, 645877, 665550, 687085]
57256F87085K0508J8290J7452J7545J6904J6221J7329J9900K2174K4047K6722
57245I04177K9919L1927L2208L1911L1949L2281L2827L3559L3855L3163L2093
57234A259869L1822L2676L4096L5526L6553L6923L7123L8225M0522M3131M5374
57223A671840M7404M9036M9534M9212M9641N1146N1786N0015M6926M4371M2202
57212B203113L8959L4311K9301K4831K1077J7845J4574J0619O146K183m87j568
57200B400904m99K884O821Q777Q696R206J1793J4710J5571J4141J1648R201P875
57187B521728Q419R872J0319R904J0978J4325J7700J9445K1166K5058L0783L6795
57175B736492M2831M9173N5078N9810O3815O7380O9642P0238P0313P0726P0990
$$ y = [687085, 707593, 725883, 743335, 760880, 777784, 794005, 811334, 831234, 853408, 877455, 904177, 934096, 966023, 998231, 1030142, 1062091, 1094372, 1127199, 1160758, 1194613, 1227776, 1259869, 1291691, 1324367, 1358463, 1393989, 1430542, 1467465, 1504588, 1542813, 1583335, 1626466, 1671840, 1719244, 1768280, 1817814, 1867026, 1916667, 1967813, 2019599, 2069614, 2116540, 2160911, 2203113, 2242072, 2276383, 2305684, 2330515, 2351592, 2369437, 2384011, 2394630, 2400776, 2402959, 2402472, 2400904, 2400405, 2403289, 2410110, 2418887, 2427583, 2436789, 2448582, 2463292, 2478863, 2493004, 2504652, 2513853, 2521728, 2530147, 2540019, 2550338, 2560242, 2571220, 2585545, 2603245, 2622690, 2643856, 2668914, 2699697, 2736492, 2779323, 2828496, 2883574, 2943384, 3007199, 3074579, 3144221, 3214459, 3284772, 3355498, 3426488]
57164C426488P0981P1568P2576P2603P2064P3387P6597P7935P5348P2320P3131
57153D234998P6875P9590Q0313Q1369Q3904Q6585Q8191Q8628Q7781Q5668Q3210
57142E157112Q0958P7870P3208O8610O6156O5361O4179O2227O0966O1283O2642
57131E900572O4234O5563O6374O6956O7701O7808O5662O1278N6812N3923N2342
57120F589225N1630N2153N3442N3894N3226N2864N3004N1844M8850M5822M3461
57109G149415L9917L4345K8739K4463K0256J5598J2886J3911J7239K1156K6009
57098G403934L1572L5694L8132M2204M9857N8343O4396O8149P0187O8710O3105
57087G994283N6722N2372M8165M1246L2412K3779J5341P264K171J405K337K603
$$ y = [3426488, 3497469, 3569037, 3641613, 3714216, 3786280, 3859667, 3936264, 4014199, 4089547, 4161867, 4234998, 4311873, 4391463, 4471776, 4553145, 4637049, 4723634, 4811825, 4900453, 4988234, 5073902, 5157112, 5238070, 5315940, 5389148, 5457758, 5523914, 5589275, 5653454, 5715681, 5776647, 5837930, 5900572, 5964806, 6030369, 6096743, 6163699, 6231400, 6299208, 6364870, 6426148, 6482960, 6536883, 6589225, 6640855, 6693008, 6746450, 6800344, 6853570, 6906434, 6959438, 7011282, 7060132, 7105954, 7149415, 7189332, 7223677, 7252416, 7276879, 7297135, 7312733, 7325619, 7339530, 7356769, 7377925, 7403934, 7435506, 7471200, 7509332, 7551536, 7601393, 7659736, 7724132, 7792281, 7862468, 7931178, 7994283, 8051005, 8103377, 8151542, 8192788, 8225200, 8248979, 8264320, 8271584, 8273755, 8275160, 8277497, 8280100]
57075H280100L229M135Q18j0455k8100m9635p6113j07904j40612j70028j97215
57064G508220k24300k49747k72320k94870l19193l42177l62048l83324m10266
57055D649975m40888m72697n08256n49200n91531o33463o81236C2448g75282q81365
57045a656647r67269j071349j191592j328397j493283j696424j933585k195006
57037a3533552k476191k766646l036454l244783l353148l326842l143362k802257
57029c7683235k291110j545078n42684M64044Q94202K30517j397763l085679l741524
57020d8698310k880804q87805J410244L361538M775128N783131O531085O974584
57012b3631209O911115O187995M885382b343447e56774A7690b05623n85179n62290
$$ y = [8280100, 8283329, 8287464, 8288282, 8277827, 8249727, 8200092, 8123979, 8016075, 7875463, 7705435, 7508220, 7283920, 7034173, 6761853, 6466983, 6147790, 5805613, 5443565, 5060241, 4649975, 4209087, 3736390, 3228134, 2678934, 2087403, 1453940, 772704, 32448, -775282, -1656647, -2623916, -3695265, -4886857, -6215254, -7708537, -9404961, -11338546, -13533552, -16009743, -18776389, -21812843, -25057626, -28410774, -31737616, -34880978, -37683235, -39974345, -41519423, -42062107, -41598063, -40703861, -40473344, -41871107, -44956786, -48698310, -51579114, -52466919, -51056675, -47695137, -42920009, -37136878, -30605793, -23631209, -16720094, -10532099, -5646717, -2343447, -556774, 17690, -205623, -790802, -1353092]
57003a353092k73285J35840N45587f1492A053279J235055J264477J231244J156001
56994E940056J053667R40056Q26645P14584O02321M94564L97162L09143K27416
56985A1505614J54521R4651M6286N607k6546m7392n8752o5159o8440o9247p0909
56974A1400234p6590q4919r2807j00123j07652j13244j14283j11755j08067j03172
56964A0387622r6448r0090q6830q6145q6002q6471q8438r0680r1439r1414r2337
56953I401328r4107r5858r8228j01986j05840j08211j09903j12581j15666j17031
56943H341917j15746j11670j02662q4614n6076k3973m978j8442p3136j58757k51915
56932G339948l31435l87657m19910m30879m25179m08779l85867l57430l24359
$$ y = [-1353092, -1626377, -1490537, -944950, -61492, 1053279, 2288334, 3552811, 4784055, 5940056, 6993723, 7933779, 8760424, 9475008, 10077329, 10571893, 10969055, 11278198, 11505614, 11660135, 11754786, 11801072, 11806679, 11780133, 11732741, 11673989, 11608830, 11540390, 11471143, 11400234, 11323644, 11238725, 11145918, 11045795, 10938143, 10824899, 10710616, 10598861, 10490794, 10387622, 10291174, 10201084, 10114254, 10028109, 9942107, 9855636, 9767198, 9676518, 9585079, 9493665, 9401328, 9307221, 9211363, 9113135, 9011149, 8905309, 8797098, 8687195, 8574614, 8458948, 8341917, 8226171, 8114501, 8011839, 7927225, 7871149, 7847176, 7842198, 7823756, 7750620, 7591863, 7339948, 7008513, 6620856, 6200946, 5770067, 5344888, 4936109, 4550242, 4192812, 3868453]
56923C868453k89947k57821k29427k05110j85652j71032j59386j48799j39020
56914B082259j30324j22028j13115j03203r2367q1180p0830o1642n1846l9986
56904A215738k7943j8835j2188m640M485J1907J5506J6924J7893J7429J4360R509
56892A260145L682l489j1078j6201j7824j8451k0128k1404k0232j7315j4395j1659
56880A091651q931p190o618n256j716K675O494J0776J6647K2249K4414K2101J6108
56867A183404O997m455j6019k5426l2315l7303m0277m1020m0199l8286l4866l0373
56855H49862k6839k5293k3956k0940j7239j5127j4777j4504j3593j2895j3068
56844F51631j3736j4147j3647j2029r964q478p568o410n087m573m543l094M92
$$ y = [3868453, 3578506, 3320685, 3091258, 2886148, 2700496, 2529464, 2370078, 2221279, 2082259, 1951935, 1829907, 1716792, 1613589, 1521222, 1440042, 1369212, 1307570, 1255724, 1215738, 1187795, 1168960, 1156772, 1152132, 1156617, 1168524, 1184030, 1200954, 1218847, 1236276, 1250636, 1260145, 1263827, 1260338, 1249260, 1233059, 1215235, 1196784, 1176656, 1155252, 1135020, 1117705, 1103310, 1091651, 1082720, 1075530, 1068912, 1063656, 1061940, 1064615, 1071109, 1081885, 1098532, 1120781, 1145195, 1167296, 1183404, 1190401, 1185946, 1169927, 1144501, 1112186, 1074883, 1034606, 993586, 953387, 915101, 880235, 849862, 823023, 797730, 773774, 752834, 735595, 720468, 705691, 691187, 677594, 664699, 651631, 637895, 623748, 610101, 598072, 588108, 579630, 572062, 565652, 560565, 555992, 551449, 548355, 548847]
56831E48847M494P311R673J3233J8399K4443L0157L3668L3397L0208K6911K4818
56819H05559K2570J9136J5740J3737J2680J1746J0982J0011P810N177N090Q841
56807I49079J3884J7142J8544J9685K1329K3941K8359L3672L6429L4213K8312
56796A224589K0920J1848M14j1522k1129k7697l1690l2402k9412k4941k1628j8840
56784A038510j3980o745P05P197J3490K0058K6389L2480L8813M4877M9445N2068
56772A303307N2498M9052L9579K4173N518j3058k8725l9264m4214m5639m6146
56761A257081m6105m4118l9706l4040k8379k3098j8031j2639o251Q98P482J2868
56749A025962J8110K4078K9616L2695L2220K7646J8350N104q995k0972l0305l7425
$$ y = [548847, 553341, 560652, 570325, 583558, 601957, 626400, 656557, 690225, 723622, 753830, 780741, 805559, 828129, 847265, 863005, 876742, 889422, 901168, 912150, 922161, 929971, 935148, 940238, 949079, 962963, 980105, 998649, 1018334, 1039663, 1063604, 1091963, 1125635, 1162064, 1196277, 1224589, 1245509, 1257357, 1257771, 1246249, 1225120, 1197423, 1165733, 1133331, 1103919, 1078978, 1057350, 1038510, 1024530, 1017785, 1018490, 1025687, 1039177, 1059235, 1085624, 1118104, 1156917, 1201794, 1251239, 1303307, 1355805, 1404857, 1444436, 1468609, 1474127, 1461069, 1432344, 1393080, 1348866, 1303227, 1257081, 1210976, 1166858, 1127152, 1093112, 1064733, 1041635, 1023604, 1010965, 1004714, 1005612, 1013094, 1025962, 1044072, 1068150, 1097766, 1130461, 1162681, 1190327, 1208677, 1213781, 1204786, 1183814, 1153509, 1116084]
56737A116084m1497m1798l9904l8006l5881l1872k6074k0201j4940r815n186j887
56725H09023Q31M551R064J2751J5391J8007J9897J8424J2574M544k965r270j4785
56712H98037j9337k2496k4368k5204k4972k3826k2268k0554j8607j6609j4989
56701F64807j3824j2872j2089j1450j0560r205p829o794n669m132k815k313k021
56688E63234j133r6J51k42m86o14j150j814j962j811j890j764p97K16k08j994
56672E47640l431l446k751k632l553m904n616n200m592n186o624o763m732k576
56658D85634k481l738m115l113j928j189p68j147k732m242l869j976p92j397k646
56643D49501l077k452j340m99n89j531k381k590k683k841k065kJ821K257K554
$$ y = [1116084, 1074587, 1032789, 992885, 954879, 918998, 887126, 861052, 840851, 825911, 816096, 810910, 809023, 809854, 814405, 823469, 836220, 851611, 869618, 889515, 907939, 920513, 925057, 922092, 912822, 898037, 878700, 856204, 831836, 806632, 781660, 757834, 735566, 715012, 696405, 679796, 664807, 650983, 638111, 626022, 614572, 604012, 594807, 586978, 580184, 574515, 570383, 567568, 565255, 563234, 562101, 562005, 562156, 561914, 561428, 560814, 559664, 557850, 555888, 554077, 552187, 550423, 549626, 549842, 549634, 547640, 544209, 540763, 538012, 535380, 531827, 526923, 521307, 516107, 511515, 506329, 499705, 492942, 488210, 485634, 483153, 479415, 475300, 472187, 470259, 469070, 468302, 467155, 464423, 460181, 456312, 454336, 453544, 452147, 449501, 446424, 443972, 442632, 442133, 441544, 440013, 437632, 435042, 432359, 429518, 427453, 427451, 429272, 431529, 434083]
56628D34083M046N282M114J580O89J929K920K421J717J908K500L122M161N237
56614D75709N328M832N250O462O588N092L678L542L927M153M873O306P163O508
56600E49411N101M128L917M481N716O552N657L598K595L506M731M746L815K416
56586F10370k7l584o634p714p517p831r380j1544j3380j4136j3634j2694j2451
56573D89844j2768j2302j0430q138o623o005n650m879l286j255%L0K90K115M166
56558D25109L940J548m72r81j146j203M94L953O053M493J075r12p89p5L88Q16
56542D42291J091J007J143J951K699K583K068J846J452K48j082j486j159q70m17
56527D53365P63K035K123Q49p96j951k240j404K72J656J960J839K287K919K511
$$ y = [434083, 438129, 443411, 447525, 449105, 449794, 451723, 454643, 457064, 458781, 460689, 463189, 466311, 470472, 475709, 481037, 485869, 491119, 497581, 504169, 509261, 512939, 516481, 520408, 524561, 529434, 535740, 542903, 549411, 554512, 558640, 562557, 567038, 572754, 579306, 584963, 588561, 591156, 594662, 599393, 604139, 607954, 610370, 610343, 606759, 600125, 592411, 584894, 577063, 567683, 556139, 542759, 528623, 514989, 502295, 489844, 477076, 464774, 454344, 446206, 439583, 433578, 427928, 423049, 419763, 418508, 418508, 418538, 418828, 420943, 425109, 429049, 430597, 430125, 429144, 427998, 426795, 427289, 431242, 437295, 441788, 442863, 441951, 441162, 441087, 441475, 442291, 443382, 444389, 445532, 447483, 450182, 452765, 454833, 456679, 458131, 458379, 457297, 455811, 454652, 453782, 453365, 454128, 456163, 458286, 459135, 458339, 456388, 454148, 452744, 453016, 454672, 456632, 458471, 460758, 463677, 466188]
56512D66188R03o81j007K52K643N086O321O054N401N478O093O642P452Q934R952
56497E35711Q783N789L663M477P515J0435J1622J0875Q725O151M510M604N634
56484F28494N724L909J126j058k297l399m758n798o180o558p492q386q386p752
56470E77189p405p415p033o132n490n438n189l966k178j053j372k784m209m883
56456E12642n021n249n420m672k911j358r99j338j478j565k104k687k614k166
56442D73060j962j697q58k3N3K9R04J885J377k49r49j62N57K95JL73O36L42M73
56423D74085J601K644K586K160K512L396L783L419K672J689P08O08K116M800P432
56408E16211R014R155Q077O648N971O573Q163J0042J1230J0674Q317N687M494
$$ y = [466188, 467091, 466410, 465403, 465655, 468298, 473384, 479705, 485759, 491160, 496638, 502731, 509373, 516825, 525759, 535711, 544494, 550283, 553946, 558423, 565938, 576373, 587995, 598870, 607595, 613746, 618256, 622860, 628494, 634218, 638127, 639253, 638195, 635898, 632499, 627741, 621943, 615763, 609205, 601713, 593327, 584941, 577189, 569784, 562369, 555336, 549204, 543714, 538276, 533087, 529121, 526943, 525890, 524518, 521734, 517525, 512642, 507621, 502372, 496952, 492280, 489369, 488011, 487012, 485674, 484196, 482631, 480527, 477840, 475226, 473060, 471098, 469401, 468543, 468520, 468573, 468602, 469506, 471391, 472768, 472519, 471570, 471408, 471965, 472260, 472261, 472634, 473270, 473612, 474085, 475686, 478330, 480916, 483076, 485588, 488984, 492767, 496186, 498858, 500547, 501255, 501863, 503979, 508779, 516211, 525225, 534380, 542457, 549105, 555076, 561649, 569812, 579854, 591084, 601758, 610075, 615762, 620256]
56395F20256M811N636O556P489P430N441K675J280J244M18j979m169m667m202
56381F48219l851l282k116j250j508k315k896l553m685n722o066o032n965n449
56367E93529m303l222k658k129j436j415k652m451n784o235n580l734j701j109
56353E47120k016k561j576j71J70n23j546k791l978m027k550q44k07j94K67J051
56337E25624J249N56o81k060k969k672j291J11Q70J215J174K92j120j966k065
56322E16267k322k715j992j06J132R31J022K833N033N606M795M202M235M270M288
56307E47479M650M955M563L696L002K725L048M147N251M977L385K224K424L054
56293E99580L576M916P074P889O043L251J716J290J096J809L866N293M259K389
$$ y = [620256, 625067, 630703, 637259, 644748, 652178, 657619, 660294, 661574, 662818, 663236, 661257, 657088, 652421, 648219, 644368, 641086, 638970, 637720, 636212, 633897, 631001, 627448, 622763, 617041, 610975, 604943, 598978, 593529, 589226, 586004, 583346, 581217, 579781, 578366, 575714, 571263, 565479, 559244, 553664, 549930, 548229, 547120, 545104, 542543, 540967, 540796, 540966, 540443, 538897, 536106, 532128, 528101, 525551, 524707, 524500, 524306, 524573, 525624, 526873, 527429, 526748, 524688, 521719, 519047, 517756, 517867, 518737, 519952, 521126, 521418, 520298, 518332, 516267, 513945, 511230, 509238, 509132, 510264, 511195, 512217, 515050, 520083, 525689, 530484, 534686, 538921, 543191, 547479, 552129, 557084, 561647, 565343, 568345, 571070, 574118, 578265, 583516, 588493, 591878, 594102, 596526, 599580, 603156, 608072, 615146, 623035, 629078, 632329, 634045, 635335, 636431, 638240, 642106, 647399, 651658, 654047]
56279F54047K613M759O200O081N838O013N532M337M019N222O570O766O081N430
56265G29508N343O104P563Q797R016Q706Q721Q796Q282P875Q968J1404J3517J4318
56251H56918J4350J4351J4437J4616J5005J5401J5471J5267J4811J3584J1282
56240A015493Q633O749O073O515P892R450R831Q562O860O144O533P556R286J1735
56226A127312J4111J5820J7342J9145K0753K1914K3533K6377K9814L2833L5279
56215A384233L7228L8523L9805M2514M6860N1417N5626O0699O6897P2420P6624
56204A972846Q1803Q9585R8038J05062J12299J22393J34300J45008J54631J65900
56194C181865J79237J91999K02636K12215K21391K28751K32817K33451K30690
$$ y = [654047, 656660, 661419, 667619, 673700, 679538, 685551, 691083, 695420, 699439, 704661, 711231, 717997, 724078, 729508, 734851, 740955, 748518, 757315, 766331, 775037, 783758, 792554, 800836, 808711, 817679, 829083, 842600, 856918, 871268, 885619, 900056, 914672, 929677, 945078, 960549, 975816, 990627, 1004211, 1015493, 1024126, 1030875, 1036948, 1043463, 1051355, 1060805, 1070636, 1079198, 1086058, 1092202, 1098735, 1106291, 1115577, 1127312, 1141423, 1157243, 1174585, 1193730, 1214483, 1236397, 1259930, 1286307, 1316121, 1348954, 1384233, 1421461, 1459984, 1499789, 1542303, 1589163, 1640580, 1696206, 1756905, 1823802, 1896222, 1972846, 2054649, 2144234, 2242272, 2347334, 2459633, 2582026, 2716326, 2861334, 3015965, 3181865, 3361102, 3553101, 3755737, 3967952, 4189343, 4418094, 4650911, 4884362, 5115052]
56185E115052K23987K12967J97537J77482J53267J26693R9151P0108L9074P956
56175F423274k0689m6662p0823r1779j06958j16635j23981j30890j36339j39166
56165E439352j40060j40338j40717j41720j43709j46242j48592j50631j52133
56156D135210j52006j49839j47287j46026j45168j42572j37877j32289j26359
56147B855787j20034j13953j08358j01869r3693q5823q0460p6383p0784o3706
56137A940724n7566n3117m9045m5015m1808l8853l4839l0540k7847k6248k3519
56126A512327j9692j7018j5942j4484j1834r265p176m360q06J771K714L195L915
56113A423345M633N915Q578J1420J2547J2756J4428J7174J8354J8047J9556K4016
$$ y = [5115052, 5339039, 5552006, 5749543, 5927025, 6080292, 6206985, 6306136, 6376244, 6415318, 6423274, 6402585, 6355923, 6285100, 6193321, 6086363, 5969728, 5845747, 5714857, 5578518, 5439352, 5299292, 5158954, 5018237, 4876517, 4732808, 4586566, 4437974, 4287343, 4135210, 3983204, 3833365, 3686078, 3540052, 3394884, 3252312, 3114435, 2982146, 2855787, 2735753, 2621800, 2513442, 2411573, 2317880, 2232057, 2151597, 2075214, 2004430, 1940724, 1883158, 1830041, 1780996, 1735981, 1694173, 1655320, 1620481, 1589941, 1562094, 1535846, 1512327, 1492635, 1475617, 1459675, 1445191, 1433357, 1424092, 1416916, 1412556, 1411750, 1413521, 1416235, 1419430, 1423345, 1427978, 1433893, 1442471, 1453891, 1466438, 1479194, 1493622, 1510796, 1529150, 1547197, 1566753, 1590769]
56101A590769K8302K9642K8945K8122K7189K5744K4630K4375K4045K2980K1962
56090A876705K1773K2342K3705K6027K8559L0595L3310L8319M4696N0179N5037
56079B251247O1818P1439Q2640R5137J09736J25207J38730J49812J60100J68831
56069C414697J72292J68784J60567J50094J37897J25102J14094J05054R5005Q1805
56059D725391O6125M8578K8328O011j5100l2387m5878n6425o4922p3953q6589
56048D499179j02370j17571j30214j41349j50794j55659j54490j49135j41125
56039C256472j29863j15766j01495q8465p5763o3733n4676m8381m1270l2008k4098
56028B480954k0497j9451j8014j6182j4970j3647j1590r968r268p777m661j859
$$ y = [1590769, 1619071, 1648713, 1677658, 1705780, 1732969, 1758713, 1783343, 1807718, 1831763, 1854743, 1876705, 1898478, 1920820, 1944525, 1970552, 1999111, 2029706, 2063016, 2101335, 2146031, 2196210, 2251247, 2313065, 2384504, 2467144, 2562281, 2672017, 2797224, 2935954, 3085766, 3245866, 3414697, 3586989, 3755773, 3916340, 4066434, 4204331, 4329433, 4443527, 4548581, 4643586, 4725391, 4791516, 4840094, 4868422, 4874433, 4859333, 4826946, 4781068, 4724643, 4659721, 4585768, 4499179, 4396809, 4279238, 4149024, 4007675, 3856881, 3701222, 3546732, 3397597, 3256472, 3126609, 3010843, 2909348, 2820883, 2745120, 2681387, 2626711, 2578330, 2537060, 2505052, 2480954, 2460457, 2441006, 2422992, 2406810, 2391840, 2378193, 2366603, 2356635, 2347367, 2339590, 2334929, 2333070]
56016B333070r17n75Q12L083N989J0229J5237J8765J9982K0306K0425J9740J9377
56003B485523K1817K6494K9734L0227L0483L1838L2656L2765L4769L9032M2097
55992B837435M2228M2052M3631M5480M6596M8634N1879N3723N3609N4877N9150
55981C379294O3564O6035O8555P2768P6938P9904Q3428Q8102R1501R2848R4797
55970D257734R8587J02278J05498J10540J17015J21544J24651J31331J42531J53119
55960E464828J60964J70530J84243J98069K09447K21858K37136K51001K60970
55951G359046K71347K85551L00819L15157L31793L51918L71242L88949M11485
55942A0387307M41599M72401M98647N25056N56471N88617O16204O41827O69117
$$ y = [2333070, 2332153, 2331578, 2332390, 2335473, 2341462, 2351691, 2366928, 2385693, 2405675, 2425981, 2446406, 2466146, 2485523, 2507340, 2533834, 2563568, 2593795, 2624278, 2656116, 2688772, 2721537, 2756306, 2795338, 2837435, 2879663, 2921715, 2965346, 3010826, 3057422, 3106056, 3157935, 3211658, 3265267, 3320144, 3379294, 3442858, 3508893, 3577448, 3650216, 3727154, 3807058, 3890486, 3978588, 4070089, 4162937, 4257734, 4356321, 4458599, 4564097, 4674637, 4791652, 4913196, 5037847, 5169178, 5311709, 5464828, 5625792, 5796322, 5980565, 6178634, 6388081, 6609939, 6847075, 7098076, 7359046, 7630393, 7915944, 8216763, 8531920, 8863713, 9215631, 9586873, 9975822, 10387307, 10828906, 11301307, 11799954, 12325010, 12881481, 13470098, 14086302, 14728129, 15397246]
55933A5397246O95405P18933P44985P77140Q11142Q45043Q85978R38514R96290
55924B2810676J054053J118022J194685J279597J367068J460252J561326J662958
55916C3508637J760983J864678J983589K115928K261095K430095K631361K861116
55908E1417482L121568L433548L816610M272769M803954N425126O142081O937988
55900H9371126P803902Q762841R845412J1069874J2471228J4118245J6070621
55893A69513249J8349921K0977210K3987027K7365095L1031422L4890194L8667065
55886C64781183M1422914M1323166L6396051K5999853J1660686l634159j7054870
55879E00894824k7050217l3364547l6483217l7178918l6263506l4394876l1975390
$$ y = [15397246, 16092651, 16811584, 17556569, 18333709, 19144851, 19989894, 20875872, 21814386, 22810676, 23864729, 24982751, 26177436, 27457033, 28824101, 30284353, 31845679, 33508637, 35269620, 37134298, 39117887, 41233815, 43494910, 45925005, 48556366, 51417482, 54539050, 57972598, 61789208, 66061977, 70865931, 76291057, 82433138, 89371126, 97175028, 105937869, 115783281, 126853155, 139324383, 153442628, 169513249, 187863170, 208840380, 232827407, 260192502, 291223924, 326114118, 364781183, 406204097, 447527263, 483923314, 509923167, 521583853, 517949694, 500894824, 473844607, 440480060, 403996843, 366817925, 330554419, 296159543, 264184153]
55872B64184153k9225744k6317290k3405220k0596505j7961371j5568330j3468755
55865A17640938j1662112j0112660q791291p677003o735481n928510n237580m655324
55857E6840977m162850l736869l370021l063122k804191k573782k364666k178840
55849C2586636k010988j851496j701108j567163j448735j338700j236724j147581
55841B0284141j069942r98280r32759q76683q27298p78897p31865o89516o49549
55832A2729352o07656n66324n31140n01263m71801m42800m17792l96052l74132
55823H420392l52943l36080l22881l09586k95414k81740k67641k52012k37496
55814E764599k26876k17931k07163j95872j87411j81135j74226j66810j60392
$$ y = [264184153, 234958409, 208641119, 185235899, 164639394, 146678023, 131109693, 117640938, 105978826, 95866166, 87074875, 79397872, 72662391, 66733881, 61496301, 56840977, 52678127, 48941258, 45571237, 42508115, 39703924, 37130142, 34765476, 32586636, 30575648, 28724152, 27023044, 25455881, 24007146, 22668446, 21431722, 20284141, 19214199, 18215919, 17283160, 16406477, 15579179, 14800282, 14068417, 13378901, 12729352, 12121696, 11555372, 11024232, 10522969, 10051168, 9608368, 9190576, 8794524, 8420392, 8067449, 7731369, 7408488, 7098902, 6803488, 6521748, 6254107, 6002095, 5764599, 5537723, 5319792, 5112629, 4916757, 4729346, 4548211, 4373985, 4207175, 4046783]
55805D046783j53989j46565j40338j37073j34089j28621j22672j18700j14086
55796B850650j05305r4429q5989q0168p4578o9889o8208o8091o6621o4433o3614
55785B009325o2842n9557n4851n1234m7660m1858l5482l1722k9636k5972k1115
55774A547396j8043j6707j4459j1062q692p909p860r297j3141j7345j9338k0369
55762A383174k3245k7177k9211k9394l0047l1129l0808k9596k9273k8763k5746
55751A068785k1674k0295k1478k1258j8143j4875j3356j2055r387o147l573j776
55739I04768p56n93l82P67J888J550M67L26P44J09j357k234k952n115q242j0147
55723H78841j0376j0494j1235j1996j2755j3848j4284j2821j0408r106r167r587
$$ y = [4046783, 3892794, 3746229, 3605891, 3468818, 3334729, 3206108, 3083436, 2964736, 2850650, 2745345, 2650916, 2564927, 2484759, 2410181, 2340292, 2272084, 2203993, 2137372, 2072939, 2009325, 1946483, 1886926, 1832075, 1780841, 1733181, 1691323, 1655841, 1624119, 1594483, 1568511, 1547396, 1529353, 1512646, 1498187, 1487125, 1478433, 1470524, 1462664, 1453367, 1440226, 1422881, 1403543, 1383174, 1359929, 1332752, 1303541, 1274147, 1244100, 1212971, 1182163, 1152567, 1123294, 1094531, 1068785, 1047111, 1026816, 1005338, 984080, 965937, 951062, 937706, 925651, 916264, 910117, 906544, 904768, 904012, 903419, 903037, 903804, 905692, 907242, 907709, 908035, 908779, 908888, 907531, 905297, 902345, 897230, 888988, 878841, 868465, 857971, 846736, 834740, 821985, 808137, 793853, 781032, 770624, 761518, 752351, 742764]
55711G42764j0725j3600j7206j9332j9740j9984k0575k0760k0459j9892j8073
55700E42418j4323j0508q990r190q880p976q001q754q840q815j0155j1702j0879
55687D15405q347p593r507j1100j0327q778q485r016r032q289p041n425m164m077
55673C04224m516m093k962k387k333j801j342k560n033o467o109n405n059m230
55659B49927l110l360n127o207n212l263j689k55J344K314K182J683J478J472
55645B32177J934L470N504O491O086N368M678L243J248J10R8j60j096j215N45
55630B68481L251N687P778R492J0050R280Q383Q416R117R706R743Q891P084N085
55616C80444L661K332M68q23O4K244K980J400o90j959k868l324j903J449M307
$$ y = [742764, 732039, 718439, 701233, 681901, 662161, 642177, 621602, 600842, 580383, 560491, 542418, 528095, 517587, 508597, 499407, 490527, 482551, 474550, 465796, 456956, 448141, 437986, 426284, 415405, 407058, 399465, 389958, 378858, 368531, 359753, 351268, 342252, 333220, 324931, 317890, 312465, 308301, 304224, 299708, 295615, 292653, 290266, 287933, 286132, 284790, 282230, 277197, 270730, 264621, 259216, 254157, 249927, 246817, 243457, 238330, 232123, 226911, 223648, 221959, 221704, 223048, 225362, 227544, 229227, 230705, 232177, 234111, 237581, 243085, 249576, 255662, 261030, 265708, 268951, 270199, 270309, 270407, 270247, 269151, 267936, 268481, 271732, 277419, 285197, 294689, 304739, 314019, 322402, 330818, 339935, 349641, 359384, 368275, 375359, 380444, 384105, 386437, 386905, 386082, 386146, 388390, 391370, 392770, 392080, 390121, 387253, 383929, 382026, 383475, 387782]
55601C87782M826L992L588L845M312N086N768N024K659N89K81P02K65p07j021
55586D26991q15j030j662k157k705l785n108o216p354q729r686r733r633j0243
55572C48135j1071j1217j0996j1335j1945j1614j0157q856q728r256r156p924
55560B25880o363n713o381p541q098p766o969o011m886l646k355r73J22L7j377
55545A57960k770k923k476k641k893j770L03J205K48j010j495j997l027l352k012
55530A31350k37J51r08k229l172l761l800l161k364j940j708j361j125j202j241
55515A03292r54o14l83K7N07K41q87j543m38J914L834M383L941L273K648J757
55499A20998R2k231m049m039k232q8J018P61n15k102k854k000l78K44n13j157
$$ y = [387782, 392608, 396600, 400188, 404033, 408345, 413431, 419199, 424223, 426882, 427471, 427752, 428454, 428719, 428012, 426991, 426176, 425146, 423484, 421327, 418622, 414837, 409729, 403513, 396159, 387430, 377744, 368011, 358378, 348135, 337064, 325847, 314851, 303516, 291571, 279957, 269800, 260944, 252216, 242960, 233804, 225880, 219517, 213804, 207423, 199882, 191784, 184018, 177049, 171038, 166152, 162506, 160151, 159178, 159300, 159337, 157960, 155190, 152267, 149791, 147150, 144257, 142487, 142790, 143995, 144243, 143233, 141738, 139741, 136714, 133362, 131350, 131113, 131264, 130356, 128127, 124955, 121194, 117394, 114233, 111869, 109929, 108221, 106860, 105735, 104533, 103292, 102338, 101724, 101341, 101368, 101875, 102116, 101229, 99686, 99248, 101162, 104996, 109379, 113320, 116593, 119241, 120998, 121090, 118859, 114810, 110771, 108539, 108451, 109469, 110230, 109715, 107613, 104759, 102759, 102381, 102625, 102112, 100955]
55483A00955n78M46O60J57r7L31J223K351L391L846L616L335L627M547N843P107
55467A40760P489O248L988K288J864J992K124K771M175N334N322M570L914L283
55453A96122K358J748K273L411L568J859j032l654n019n227n150n460n961o284
55439A73552o850q163r394r006p109n769o254p248o751m734k842k186k540l235
55425I1471l849m220m423m537m265l185j656p32p99j095r14m71n5N81J343J339
55409F4533J87j042j243q85j067j608j409l96K64l6n20l91n7l31r83r12K43J338
55391E5685J114n1n25L89J483J340O1j357k543l520l691k511q61k12n32n07J95
55374D3957M64k07q62p77m08j72L26J163J625J560J801K396J980O7j532j008Q20
$$ y = [100955, 100377, 100823, 101483, 101640, 101543, 101874, 103097, 105448, 108839, 112685, 116301, 119636, 123263, 127810, 133653, 140760, 148249, 154497, 158485, 160773, 162637, 164629, 166753, 169524, 173699, 179033, 184355, 188925, 192839, 196122, 198480, 200228, 202501, 205912, 209480, 211339, 210307, 206653, 201634, 196407, 191257, 185797, 179836, 173552, 166702, 158539, 149145, 140139, 133030, 127261, 121007, 113759, 107008, 102274, 99432, 97246, 94706, 91471, 87622, 83402, 78979, 74442, 70177, 66992, 65336, 64604, 63805, 62710, 61796, 61325, 61270, 61851, 63194, 64533, 64720, 63678, 62435, 61550, 60483, 58875, 57466, 57070, 57334, 57298, 56778, 56387, 56330, 55999, 55016, 54104, 54347, 55685, 56799, 56748, 56223, 56612, 58095, 59435, 59496, 58139, 55596, 52076, 48385, 45874, 45013, 44801, 44269, 43762, 43957, 44421, 44214, 43352, 42575, 42167, 41995, 42321, 43484, 45109, 46669, 48470, 50866, 52846, 52913, 51381, 50373, 51193]
55357E1193J737J205N36M90M47o4l59K27J150J252L39m21Q2J354J790R40L06J069
55339F3273K035J277p73j792j017j96p13j775k241k379k665k394r46P18J090M6
55323E1548j240j690j040P6L28j008k717k740r81M59L03m13n19n41j190j758j363
55306C5514l97N03J543K660K845J880J228J716J939N44j407k207k179k613l353
55291C8216l477l252l247k588m03J919K252Q45l05m97m25J5J365K466J459j004
55275C3339k169j087L39N99L99N66M94j79l77O09J601J169l22j310r01N69K082
55258C5421K562J735P49J014K220K539J122p76j707j804j932k081j654p55j77
55243C6476j88j21P15J990K626K121J224R08R69N91J36R27K757L286J080k098
$$ y = [51193, 52930, 54135, 54671, 55161, 55608, 55544, 55185, 55412, 56562, 57814, 58153, 57732, 57814, 59168, 60958, 61898, 62204, 63273, 65308, 66585, 65812, 64020, 63003, 62807, 62094, 60319, 58078, 55699, 53034, 50640, 49694, 50412, 51502, 51548, 50308, 48618, 47578, 47654, 47982, 46974, 44257, 41517, 40536, 40995, 41298, 40885, 40366, 39825, 38635, 36877, 35514, 35117, 35620, 37163, 39823, 42668, 44548, 45776, 47492, 49431, 49975, 48568, 46361, 44182, 41569, 38216, 34739, 31487, 28240, 25652, 25249, 27168, 29420, 30265, 29960, 29463, 29038, 29053, 30418, 32884, 34343, 33339, 31170, 30083, 30422, 31021, 31420, 31986, 32480, 32301, 31924, 32533, 34134, 35303, 34981, 33671, 32770, 33339, 35421, 37983, 39718, 40467, 41481, 43701, 46240, 47362, 46586, 44879, 43075, 41143, 39062, 37408, 36653, 36476, 36288, 36167, 36882, 38872, 41498, 43619, 44843, 45751, 46720, 47311, 47447, 48374, 51131, 54417, 55497, 53399]
55227E3399l455k625j332p01o34j061j793j709j61J285O25j331j842k60J258J287
55211D0950Q61R81Q33k72j237r64k20l09j030j279p90q3N08Q29O49J95K09P52
55193D0583Q17j56j296j606j370j316j138k3J748K741J895m06k614l140j584Q36
55177C3971K412K689K573K752K776K041Q15k07q57j396j910k181j858o43J323
55162D2300L169L905L385K222R01l43r71n16M30O05k54j124j283j145j152r27
55146D9202j88M15K00m31m74M23J781K917L366K955J933Q21q5q72j671k358k635
55129E5299k063m26J520K136O30j611k391j276K66J043J238J286J017M21J04M66
55113E7659J105J509J638J621J528J574J679R03j530m531n676l963j062O20L03
$$ y = [53399, 49944, 47319, 45987, 45286, 44652, 43591, 41798, 40089, 39928, 41213, 41838, 40507, 38665, 38405, 39663, 40950, 41811, 42792, 43625, 43353, 42116, 41152, 40932, 40623, 39593, 38314, 37524, 37441, 37949, 38778, 39427, 39622, 39831, 40583, 41400, 41244, 39948, 38342, 36972, 35656, 34518, 34495, 36243, 38984, 40879, 40473, 37859, 34719, 33135, 33971, 36383, 39072, 41645, 44397, 47173, 49214, 50029, 49822, 48965, 47569, 45659, 43478, 41620, 40977, 42300, 45469, 49374, 52759, 54981, 55882, 55539, 54568, 54052, 54482, 55087, 54833, 53709, 52426, 51281, 50129, 49202, 49014, 49429, 49629, 49198, 48724, 49147, 50928, 53845, 57211, 60166, 62099, 62920, 62835, 61963, 60292, 57934, 55299, 53236, 52810, 54330, 56466, 57096, 55485, 53094, 51818, 52084, 53127, 54365, 55651, 56668, 57089, 57193, 57659, 58764, 60273, 61911, 63532, 65060, 66634, 68313, 69216, 67686, 63155, 57479, 53516, 52454, 53074, 53377]
55098E3377j070k098j872m21J250K137K316K468K495J717K43r78j544j781j595
55083E4644n96O06Q26K53L19J285J778J182N24L22l46j551j516M99K305J707j69
55066F2072o49N36J352P55k10m27J40J236K681L838M024L490L000K604J866J040
55050H7348Q53J256J468J212P98J40j157k646l062j862p2P93K40p77p84P06K430
55033H6884K622J171j78k26J24m47j423j216L18J656J798J404J452J832J786J150
55017I8707O90J230K648L739L322J483o28k115k805k544j164N87J369J071J018
55002A06608J674J546m03k659l085j909j062j227j432j118p12k48P25J748J662
54987A00108M78l83r4O84J202J541J693J074l11j358j232m58N2K15L67L91On37
$$ y = [53377, 52307, 50209, 48337, 47916, 49166, 51303, 53619, 56087, 58582, 60299, 60542, 59564, 58020, 56239, 54644, 54048, 54654, 55480, 55733, 56052, 57337, 59115, 60297, 60821, 61143, 60797, 59246, 57730, 58229, 60534, 62241, 62072, 61423, 61959, 63311, 64066, 63856, 63429, 63569, 64805, 67486, 71324, 75348, 78838, 81838, 84442, 86308, 87348, 88201, 89457, 90925, 92137, 92935, 93075, 91918, 89272, 86210, 84348, 84276, 85069, 85309, 84532, 83748, 84454, 86884, 89506, 90677, 90499, 90273, 90397, 89950, 88527, 87311, 87629, 89285, 91083, 92487, 93939, 95771, 97557, 98707, 99397, 100627, 103275, 107014, 110336, 111819, 111191, 109076, 106271, 103727, 102563, 103150, 104519, 105590, 106608, 108282, 109828, 109425, 106766, 103681, 101772, 100710, 99483, 98051, 96933, 96221, 95973, 96698, 98446, 100108, 100586, 100203, 100109, 100793, 101995, 103536, 105229, 106303, 105992, 104634, 103402, 102944, 102996, 103211, 103578, 103969, 103975, 103438]
54969A03438o53j08Q27J598J552M08j185k107j985j455j046m81M91J295J156K64
54953A02009m03j92P18J780K607L009K983K755K635K698K743K650K550K461J930
54938A32933N46j137j758p40O55N45j399l698m743m014j846P89K185J018j776
54923A17560l427k519o63o2m89j60J348K720L113K980K654J752M17k55L39J361
54907A26669J741J557J663K461L603M501M800M523M034L517K661J316L88J233
54893A64667L839O379P195O694O523P299Q058Q069Q077R092J0604J1136J0512
54880B68144J0326J1600J3221J3657J3314J3492J3537J1018N102k063q004j2369
54868C50975j5705j7530j7133j5305j3575j2396j1417j0839j0993j1018r688p359
$$ y = [103438, 102785, 102677, 103504, 105102, 106654, 107062, 105877, 103770, 101785, 100330, 99284, 98803, 99294, 100589, 101745, 102009, 101606, 101414, 102132, 103912, 106519, 109528, 112511, 115266, 117901, 120599, 123342, 125992, 128542, 131003, 132933, 133479, 132342, 130584, 129844, 130499, 131044, 129645, 125947, 121204, 117190, 115344, 116133, 118318, 119336, 117560, 114133, 111614, 110951, 110889, 110400, 110240, 111588, 114308, 117421, 120401, 123055, 124807, 125224, 124969, 125308, 126669, 128410, 129967, 131630, 134091, 137694, 142195, 146995, 151518, 155552, 159069, 161730, 163046, 163434, 164667, 168506, 174885, 182080, 188774, 195297, 202596, 210654, 218723, 226800, 235892, 246496, 257632, 268144, 278470, 290070, 303291, 316948, 330262, 343754, 357291, 368309, 373411, 371348, 363344, 350975, 335270, 317740, 300607, 285302, 271727, 259331, 247914, 237075, 226082, 215064, 205376, 198017]
54856A98017n701n440n758n742n155l698j028K181M409M996M750M648M904N524
54842A96907O688Q214R552J0688J2148J3873J5024J5292J5321J5381J4521J1805
54830C45414P712L560r6l797q132j2720j6174j7192j5979j4422j4174j4781j4475
54817B24744j2734j0849r814r043p811o663o334o204n232l815l332l871l853k333
54803A32856m34J94m26r01m78K65O99R87J300J147K75m67j88M65jj691k991k848
54785A27763k176k393l432l995l207j401L04O70p27k831l911l449k487j819j028
54770I5881R8P53O64J072K649L797K850Q75J00M39N9r65m67K019L951L393J618
54753A18786Q11J064J232J230J662K170K015J714K446L948M590L726K808L505
$$ y = [198017, 192316, 186876, 181118, 175376, 170221, 166523, 165495, 167676, 172085, 177081, 181831, 186479, 191383, 196907, 203595, 211809, 221361, 232049, 244197, 258070, 273094, 288386, 303707, 319088, 333609, 345414, 353126, 356686, 356590, 352793, 344661, 331941, 315767, 298575, 282596, 268174, 254000, 239219, 224744, 212010, 201161, 191347, 182304, 174493, 167830, 161496, 155292, 150060, 146245, 142913, 139042, 135189, 132856, 132422, 132616, 132190, 131289, 130811, 131076, 131775, 132762, 134062, 135209, 135484, 135017, 134829, 135294, 135293, 133602, 130611, 127763, 125587, 123194, 119762, 115767, 112560, 111159, 111463, 112133, 111406, 108575, 104664, 101215, 98728, 96909, 95881, 95979, 96732, 97396, 98468, 101117, 104914, 107764, 108639, 108739, 109178, 109237, 108272, 107805, 109824, 113775, 117168, 118786, 119597, 120661, 121893, 123123, 124785, 126955, 128970, 130684, 133130, 137078, 141668, 145394, 148202, 151707]
54739A51707N630P451P710O757N851N916P093Q972J0785J1668J1474J1381J2864
54726B65259J5757J8165J8761J8212J7655J6686J4054R759N183J371j695m361
54714C94806o795r103j1007j1674j0792r491r131r470r114p576n703m300l446
54701B87204k970k517j421L32J569J568J545K990N188O400O897Q424J0904J2380
54687C38493J2550J3574J6491J9427K0650K1074K2033K2581K0906J7147J2922
54676E37848Q941M637m51o045j1429j5724j8529k0685k3275k5531k5385k2615
54664C81757j9715j8545j7965j6150j3522j1670j0730r717q418p250o045m554
54652B37476l429l325l804m402n716p830q835o872l042k75K49j15j2M32N90K29
$$ y = [151707, 157337, 164788, 172498, 179255, 185106, 191022, 198115, 207087, 217872, 229540, 241014, 252395, 265259, 281016, 299181, 317942, 336154, 353809, 370495, 384549, 394308, 399491, 400862, 399167, 394806, 388011, 378908, 367901, 356227, 345435, 335944, 326813, 317343, 308229, 300653, 294950, 290650, 287204, 284234, 281717, 280296, 280628, 282197, 283765, 285310, 288300, 293488, 299888, 306785, 315209, 326113, 338493, 351043, 364617, 381108, 400535, 421185, 442259, 464292, 486873, 507779, 524926, 537848, 546789, 551426, 550975, 544930, 533501, 517777, 499248, 478563, 455288, 429757, 404372, 381757, 362042, 343497, 325532, 309382, 295860, 284190, 273460, 263743, 255325, 248075, 242030, 237476, 234047, 230722, 226918, 222516, 216800, 208970, 200135, 193263, 190221, 189946, 190195, 190080, 190068, 190500, 191090, 191319]
54636A91319o17j483j307L38K094K180O95o66q78l64K70Q09Q98K34o10p19r7O31
54618A92727J517K942M220M029K411J009R66J720K207K334K781M072O046P767
54604B36748P882N846K824Q36R78K762M824N871N461M529M545N513N687M150K562
54589C01018K914M485N090M714N577Q380J0814J0737R053Q194R002J0440J1614
54576D02032J2720J4158J5768J7144J8201J9002J9191J7941J4764J0139M802j346
54564E64516q594j5675k0020k0630j9439j8848j8916j8338j7104j6416j6413j5877
54552C58246j4177j2068j0453r543r183q877p668n160k521j299j433j727j838
54539B72299k264k731k419j885k783n222p189p230o165n380m874l950k761k084
$$ y = [191319, 190702, 189219, 187912, 188250, 190344, 192524, 193219, 192553, 191675, 191311, 191581, 192390, 193288, 193522, 192912, 192193, 192096, 192727, 194244, 197186, 201406, 205435, 207846, 208855, 209821, 211541, 213748, 216082, 218863, 222935, 228981, 236748, 244630, 250476, 253300, 254136, 255114, 257876, 262700, 268571, 274032, 278561, 283106, 288619, 294306, 298456, 301018, 303932, 308417, 313507, 318221, 323798, 332178, 342992, 353729, 362782, 370976, 379978, 390418, 402032, 414752, 428910, 444678, 461822, 480023, 499025, 518216, 536157, 550921, 561060, 565862, 564516, 555922, 540247, 520227, 499597, 480158, 461310, 442394, 424056, 406952, 390536, 374123, 358246, 344069, 332001, 321548, 312005, 302822, 293945, 286277, 281117, 278596, 277297, 275864, 274137, 272299, 270035, 267304, 264885, 263000, 260217, 254995, 247806, 240576, 234411, 229031, 224157, 220207, 217446, 215362]
54525B15362k254k942l593l745l531l824n058o061n201k750p13k17m64o20j045
54510A73344k056k939l154l218l543l549k807j967j555q94N99J974J889O65p1
54495A52718M64J400J448K51j460k537k266q65Q99K567M055N007M836L627K285
54480A72429J493J145J030J295J896K281K122K009K872M927P214Q224P319N831
54466B22087O015Q250J0230R981Q595Q238Q467O952L515N43r18k600n612q273
54452B75470q912q517q802r436r202q343p821p443o630n840n550m917l367k279
54438A78411k924l759k226J365M132M548L628K326K32k535m419m356l180k156
54424A69087j470p28J17J004K015K866L036K726K721L067K814J508p6j095j535
$$ y = [215362, 213108, 210166, 206573, 202828, 199297, 195473, 190415, 184354, 179153, 176403, 175690, 175473, 175009, 174389, 173344, 171288, 168349, 165195, 161977, 158434, 154885, 152078, 150111, 148556, 147662, 148261, 150235, 152124, 152789, 152718, 153182, 154582, 156030, 156281, 154821, 152284, 150018, 149153, 150052, 152619, 156674, 161681, 166517, 170144, 172429, 173922, 175067, 176097, 177392, 179288, 181569, 183691, 185700, 188572, 193499, 200713, 208937, 216256, 222087, 228102, 236352, 246582, 256563, 265158, 273396, 281863, 288815, 292330, 292873, 291955, 289355, 283743, 275470, 266558, 258041, 249239, 239803, 230601, 222258, 214437, 206994, 200364, 194524, 188974, 184057, 180690, 178411, 175487, 171728, 169502, 170867, 174999, 179547, 183175, 185501, 185733, 183198, 178779, 174423, 171243, 169087, 167617, 166889, 167006, 168010, 170025, 172891, 175927, 178653, 181374, 184441, 187255, 188763, 188687, 187592, 186057]
54409A86057j506p09P83K002K241K091K603L769M512L978K354N79m82o47m54n44
54393B06627r84j409j627j693j582j243r87j139j383j127n30m16r91j449j250
54378A88817j052j738l051l873l624k811k165j823j470r97o78p27q89p47l39j56
54362A62677m69r66j212j028k17J475L566M538L329R30m41J86J679K522K503K358
54346A81430K573L127L810M241M023L417L387M365N447N530M850M530M815M876
54332B40421M399M272N035N688M929L068J678J523J767J241l00k291l935m544
54318B62951m015l268l460m517n207n024m977n899o983o953n920m802l646j847
54304A96433K31J361J182O06L47K15o2m75j329k898m313m130k411q98n45k95R05
$$ y = [186057, 184551, 183842, 184625, 186627, 188868, 190959, 193562, 197331, 201843, 205821, 208175, 208754, 208272, 207625, 207171, 206627, 205643, 204234, 202607, 200914, 199332, 198089, 197102, 195963, 194580, 193453, 192923, 192507, 191516, 190067, 188817, 187765, 186027, 182976, 179103, 175479, 172668, 170503, 168680, 167210, 166213, 165535, 164808, 163919, 163172, 162833, 162677, 162208, 161242, 160030, 159002, 158785, 160260, 163826, 168364, 171693, 172623, 172182, 172368, 174047, 176569, 179072, 181430, 184003, 187130, 190940, 195181, 199204, 202621, 206008, 210373, 215820, 221350, 226200, 230730, 235545, 240421, 244820, 249092, 254127, 259815, 264744, 267812, 269490, 271013, 272780, 274021, 273721, 271430, 267495, 262951, 258936, 255668, 252208, 247691, 242484, 237460, 232483, 226584, 219601, 212648, 206728, 201926, 198280, 196433, 196664, 198025, 199207, 199813, 200160, 200375, 200313, 199838, 198509, 195611, 191298, 187168, 184757, 183859, 183314, 183019, 183924]
54287A83924K228K311J444J091J789K740L156L031K784K822L334L966M016L227
54273B21863K040R08J3j66Q39K229K179J19k282l312l279l375l689l687l675m247
54257B02478m857m564l674l213l195k896k497k877m013n080n878o611o480m393
54243A42250j165Q78Q81L50N83R56N35k79q41j589k953l994l487j829n13k07l77
54226A29199n22o51o42k08L16J1j367k733k784j505j54K68J51O41K009L180K949
54209A28158J415j74o22L61K168L659L869K839J613J008O30l99j992k966k357
54194A37210l95J770L033L203L080L359L430K012o54k407j853l77k06j200j335
54179A48670jJ092M73j233k540k886k592k068j623j250m10J227K661K291J1k501
$$ y = [183924, 186152, 188463, 189907, 190998, 192787, 195527, 198683, 201714, 204498, 207320, 210654, 214620, 218636, 221863, 223903, 224811, 224824, 224658, 225497, 227726, 229905, 230024, 227742, 224430, 221151, 217776, 214087, 210400, 206725, 202478, 197621, 193057, 189383, 186170, 182975, 180079, 177582, 174705, 170692, 165612, 159734, 153123, 146643, 142250, 141085, 141963, 142844, 143194, 143777, 144733, 145268, 144989, 144148, 142559, 139606, 135612, 132125, 130296, 129783, 129576, 129199, 128677, 128026, 127384, 127176, 127492, 127503, 126136, 123403, 120619, 119114, 118960, 119228, 119379, 120020, 122029, 125209, 128158, 129573, 129399, 128777, 129138, 131306, 134965, 138834, 141673, 143286, 144294, 144924, 144525, 142533, 139567, 137210, 136815, 138585, 141618, 144821, 147901, 151260, 154690, 156702, 156048, 153641, 151788, 151411, 151205, 150005, 148670, 148669, 149761, 150234, 149001, 146461, 143575, 140983, 138915, 137292, 136042, 135632, 136859, 139520, 141811, 141822, 139321]
54163A39321l813l899l005r25J823L494L002J459P65J299K014K185J989J706J377
54148A48792J107J037J052J011J061J350J706J954K130K123J569M24p81j670k353
54133A60512k803k624k014k010l018l875l354k017j396j687j575l90P93O88n05
54118A34725j548j760j400p61K70J511J951P64j239k057q49Q50J021k37j030k74
54102A29937J136J883J703R22k86j498j798p15J015K210K229R84j143k943k985
54087A30651j433l80j338l153l613k466j409j365j322k10J395K072J362J17n36
54072A18372k33M80O93J03o41o24K44J184J490J237R17O58K8j338k989l742k817
54055A13022q37O90R44N15L75O03M37o20j986k385j226K81K9k367m436l502j86
$$ y = [139321, 135508, 131609, 128604, 127679, 129502, 132996, 135998, 137457, 138222, 139521, 141535, 143720, 145709, 147415, 148792, 149899, 150936, 151988, 152999, 154060, 155410, 157116, 159070, 161200, 163323, 164892, 165316, 164535, 162865, 160512, 157709, 155085, 153071, 151061, 148043, 144168, 140814, 138797, 137401, 135714, 134139, 133749, 134542, 135230, 134725, 133177, 131417, 130017, 129256, 129526, 131037, 132988, 133752, 132513, 130456, 129607, 130457, 131478, 131241, 130211, 129937, 131073, 132956, 134659, 135581, 135295, 133797, 131999, 131284, 132299, 134509, 136738, 137722, 136579, 133636, 130651, 129218, 128838, 127500, 124347, 120734, 118268, 116859, 115494, 114172, 113962, 115357, 117429, 118791, 118908, 118372, 118139, 118619, 119312, 119415, 118774, 118150, 118394, 119578, 121068, 122305, 123222, 123880, 123908, 122570, 119581, 115839, 113022, 112185, 112875, 113819, 114334, 114709, 115312, 115749, 115129, 113143, 110758, 109532, 109813, 109842, 107475, 103039, 99537, 99351]
54038I9351K236K038Q79Q31J491J252Q3p42p52m38J04J122K124K297J994K216
54022A16086K758K268M07j418j805q15O05J679J942J321M11K9K20L68K31N1k41
54005A24097q32j105k09J300J835J228J179K534L690L059J730J881L372L972K780
53990A50511J455J521K144J666K25m64M77K141L418M446N926P595Q315P688O715
53975B03779O456O673O464N805N607O269P137P525P451P054O235N526O332R197
53961B97510J2318J3027J0762P507N232M056L275K900L161L351K427O78m57l18
53947C65429R0m33j818l224m342n388o253o564o554p036q211r120q680o881m667
53932B86348k953k101k140k846l609l726l106k534k857l927m684m397l580l272
$$ y = [99351, 101587, 103625, 104504, 105335, 106826, 108078, 108161, 107419, 106667, 106229, 106333, 107455, 109579, 111876, 113870, 116086, 118844, 121112, 121519, 120101, 118296, 117481, 118086, 119765, 121707, 123028, 123439, 123468, 123688, 124056, 124287, 124338, 124097, 123265, 122160, 121951, 123251, 125086, 126314, 127493, 130027, 133717, 136776, 138506, 140387, 143759, 147731, 150511, 151966, 153487, 155631, 157297, 157522, 157058, 157535, 159676, 163094, 167540, 173466, 181061, 189376, 197064, 203779, 210235, 216908, 223372, 229177, 234784, 241053, 248190, 255715, 263166, 270220, 276455, 281981, 288313, 297510, 309828, 322855, 333617, 341124, 346356, 350412, 353687, 356587, 359748, 363099, 365526, 366204, 365747, 365429, 365519, 365086, 363268, 360044, 355702, 350314, 344061, 337497, 330943, 323907, 315696, 306576, 297896, 291015, 286348, 283395, 281294, 279154, 276308, 272699, 268973, 265867, 263333, 260476, 256549, 251865, 247468, 243888, 240616]
53918B40616l677m001l581k520j098N97K043K188P87p75r53J91J666L192M791
53903B39466N321L538P03j62J682L405K570M43l23M30R95J040J549K222J660K42
53887B64781Q7J559K408J502R32K662N122N567M481M741O873Q096O746M954N429
53872C25940P418Q044O627N282N287N215L589J578J418L172M763M941M473M291
53858C92038M121L591L365M111N322O142O629P208P623P537P600Q541R663R698
53844D83189Q982R064J0069J0174Q330N871M378L357J423j171k892l347l813n249
53830E28365p068q221q486q273p941p806q294r433j0531j0778j0105r198q822
53817D13409r325j0544j1908j2687j2377j1010r169p716p313p816q185p438n829
$$ y = [240616, 236939, 232938, 229357, 226837, 225739, 226336, 228379, 230567, 231354, 230579, 229626, 229817, 231483, 234675, 239466, 244787, 248325, 249028, 248866, 250548, 253953, 256523, 256966, 256643, 257073, 258068, 259108, 260657, 262879, 264539, 264781, 264868, 266427, 268835, 270337, 271269, 273931, 279053, 284620, 289101, 293842, 300715, 308811, 315557, 320511, 325940, 333358, 341402, 348029, 353311, 358598, 363813, 367402, 368980, 370398, 373570, 378333, 383274, 387747, 392038, 396159, 399750, 403115, 407226, 412548, 418690, 425319, 432527, 440150, 447687, 455287, 463828, 473491, 483189, 492171, 501235, 511304, 521478, 529808, 535679, 540057, 543414, 544837, 543666, 540774, 537427, 533614, 528365, 521297, 513076, 504590, 496317, 488376, 480570, 472276, 462843, 452312, 441534, 431429, 422231, 413409, 404084, 393540, 381632, 368945, 356568, 345558, 336389, 328673, 321360, 313544, 305359, 297921, 292092]
53804B92092m684m824n662o122n941n511m990m434m433n495o725o313l829j094
53790B22035j57j217l021m488n082m454k873j441q77n87Q0L46p88k451k856k090
53774A90079j880k475k017K01K051J566j22n32O92J842J785R03o1n08J78J932
53758A93634L426L550K978K970L220K529J183O92J260J542J224J722L609N197
53744B28736M907L605L193L861M257L800L385L794M604N077N466O680Q799J0403
53730C00567R984P920O356O730Q029Q274O965N148L512J890N38L40J378K433K478
53715C72542J649M00j272l136m301m254l634l317l371l461l633l962m021l439
53701C32790k643k507l425m968o098n725l669j333n68j666l177l940m280m728
$$ y = [292092, 287408, 282584, 276922, 270800, 264859, 259348, 254358, 249924, 245491, 239996, 233271, 226958, 223129, 222035, 221878, 220661, 217640, 213152, 208070, 203616, 200743, 199302, 198425, 197838, 197918, 198264, 197476, 195025, 192169, 190079, 188199, 185724, 183707, 183908, 185959, 187525, 187403, 186871, 187563, 189405, 191190, 192093, 192032, 191524, 191702, 193634, 197060, 200610, 203588, 206558, 209778, 212307, 213490, 214182, 215442, 216984, 218208, 219930, 223539, 228736, 233643, 237248, 240441, 244302, 248559, 252359, 255744, 259538, 264142, 269219, 274685, 281365, 290164, 300567, 310551, 318471, 324827, 331557, 339586, 347860, 354825, 359973, 363485, 365375, 365913, 366253, 367631, 370064, 372542, 374191, 374591, 373319, 370183, 365882, 361628, 357994, 354677, 351306, 347845, 344212, 340250, 336229, 332790, 330147, 327640, 324215, 319247, 313149, 307424, 303755, 302422, 301854, 300188, 297011, 293071, 288791, 284063]
53687B84063m833m002k642j426k44J090J746O87j724l953m870m388k805n20J664
53672B57843K796K475R84j044k799l580l397k977k660j950n86O05Q23M72L85M77
53656B47867L78Q12K798N547O657M902J718m79o92K70J079J067O19P82K224M482
53640B80031O337O868N883L849J981J849L956O811Q393Q375Q028Q002P498N833
53626C63694L655K076J490J721K438L003K711J738J019Q11L88k68J95K294M051
53611C91016L255O73p70o3P07l52k318l145k534j679j143o05k36p09j680j848
53595C78569q63N0o1m68r4O90O65m06j566k004j697r20n3K58l04r99p10N61J765
53576C72413K292K452K424J850Q37K59M37N30n3n10K93K146L794M419M183L670
$$ y = [284063, 279230, 275228, 272586, 271160, 270916, 272006, 273752, 274439, 272715, 268762, 263892, 259504, 256699, 256179, 257843, 260639, 263114, 264098, 263054, 260255, 256675, 253278, 250301, 247641, 245691, 245105, 245710, 246533, 247005, 247390, 247867, 248245, 249057, 251855, 257402, 264059, 268961, 270679, 270200, 269508, 269778, 270857, 271924, 272543, 273325, 275549, 280031, 286368, 293236, 299119, 302968, 304949, 306798, 310754, 317565, 325958, 334333, 342361, 350363, 357861, 363694, 367349, 369425, 370915, 372636, 375074, 378077, 380788, 382526, 383545, 384356, 384744, 384476, 384671, 386965, 391016, 394271, 394944, 394174, 394111, 394818, 394466, 392148, 389003, 386469, 384790, 383647, 383042, 382806, 382097, 380417, 378569, 377706, 377756, 377695, 377227, 377133, 377823, 378488, 378082, 376516, 374512, 372815, 371895, 371842, 372100, 371796, 370797, 370087, 370648, 372413, 374705, 377157, 379581, 381431, 382268, 382527, 382964, 383494, 383441, 382931, 383224, 385370, 389164, 393583, 397766, 401436]
53560D01436L539M268N498N987M941L158K218K789M246N636O380O370O014O025
53546D68505O655P419P951Q496R070Q904P645O343O134O588O589O378P142Q744
53532E72563R605R067Q199P815P191N661M253M503O274P780P578N847L908L024
53518F63268L448M290M510M148M128M736N041M273L109K874L777M637M333L015
53504G19587J838J686K376L065L371L781M613N000L677Q03j845k700j820k41J281
53489G44472K424K843K402J647J484K384M071N765O561N887M123K586K607M523
53475G93779P475J0019J0959J0116Q492P425P503Q556J0368J2711J4717J5340
53463I17460J4775J4507J5397J6657J7408J8241K0143K2573K4041K4402K5074
$$ y = [401436, 404975, 409243, 414741, 420728, 425669, 428827, 431045, 433834, 438080, 443716, 450096, 456466, 462480, 468505, 475160, 482579, 490530, 499026, 508096, 517000, 524645, 530988, 537122, 543710, 550299, 556677, 563819, 572563, 582168, 591235, 599434, 607249, 614440, 620101, 624354, 628857, 635131, 642911, 650489, 656336, 660244, 663268, 666716, 671006, 675516, 679664, 683792, 688528, 693569, 697842, 700951, 703825, 707602, 712239, 716572, 719587, 721425, 723111, 725487, 728552, 731923, 735704, 740317, 745317, 748994, 749797, 747952, 745252, 743432, 743191, 744472, 746896, 749739, 752141, 753788, 755272, 757656, 761727, 767492, 774053, 779940, 784063, 786649, 789256, 793779, 801254, 811273, 822232, 832348, 840840, 848265, 855768, 864324, 874692, 887403, 902120, 917460, 932235, 946742, 962139, 978796, 996204, 1014445, 1034588, 1057161, 1081202, 1105604, 1130678]
53452A130678K6894K8984L0204L0702L1345L2462L3890L5723L8095M0468M1930
53441A501375M2353M2666M3797M5706M7587M8802M9375M9727N0118N0329M9869
53430B021704M8626M7294M6840M7445M8185M8137M7542M7401M7993M8378M7532
53419B547077M5503M3197M1533M1064M1803M2884M2889M1214L8780L6730L4900
53408B997574L2499K9915K8409K7912K6562K3083J8478J4532J1582Q803N899L149
53396C228397J33m139r613j4788j8397k0696k2665k4627k6294k7682k9251l1125
53384B999253l2801l3800l4334l5119l6659l8780m0741m1746m1548m0739m0284
53373B582702m0478m0494l9297l6956l4518l2586l0606k7911k4758k1826j9245
$$ y = [1130678, 1157572, 1186556, 1216760, 1247462, 1278807, 1311269, 1345159, 1380882, 1418977, 1459445, 1501375, 1543728, 1586394, 1630191, 1675897, 1723484, 1772286, 1821661, 1871388, 1921506, 1971835, 2021704, 2070330, 2117624, 2164464, 2211909, 2260094, 2308231, 2355773, 2403174, 2451167, 2499545, 2547077, 2592580, 2635777, 2677310, 2718374, 2760177, 2803061, 2845950, 2887164, 2925944, 2962674, 2997574, 3030073, 3059988, 3088397, 3116309, 3142871, 3165954, 3184432, 3198964, 3210546, 3219349, 3225248, 3228397, 3228530, 3224391, 3214778, 3199990, 3181593, 3160897, 3138232, 3113605, 3087311, 3059629, 3030378, 2999253, 2966452, 2932652, 2898318, 2863199, 2826540, 2787760, 2747019, 2705273, 2663725, 2622986, 2582702, 2542224, 2501730, 2462433, 2425477, 2390959, 2358373, 2327767, 2299856, 2275098, 2253272, 2234027]
53362B234027j6874j4974j3626j1858q708m999k690k049r05K566P470J1555J4022
53349B192957J5897J8273K1299K4578K7599L0033L2364L5678M0036M3685M5307
53338B527706M6424M9800N5447O0234O2131O2983O5738P0384P4508P7025P9294
53327C231674Q2441Q5595Q7593Q8979R1037R3627R5428R6003R6331R7007R7229
53316D242944R6248R4894R4569R5071R4622R1993Q7723Q2942P8039P2868O7485
53305E199398O2027N6304N0124M3554L6388K8049J8716R899K745l737j1627k1264
53293E470576l0724l8237m3941m8881n3557n8178o3311o9185p4865p9187q2210
53282D828300q4897q7531q9302q9464q8212q6428q5013q4518q4869q5430q5595
$$ y = [2234027, 2217153, 2202179, 2188553, 2176695, 2167987, 2162988, 2160298, 2158249, 2157344, 2159910, 2167380, 2178935, 2192957, 2208854, 2227127, 2248426, 2273004, 2300603, 2330636, 2363000, 2398678, 2438714, 2482399, 2527706, 2574130, 2623930, 2679377, 2739611, 2801742, 2864725, 2930463, 3000847, 3075355, 3152380, 3231674, 3314115, 3399710, 3487303, 3576282, 3667319, 3760946, 3856374, 3952377, 4048708, 4145715, 4242944, 4339192, 4434086, 4528655, 4623726, 4718348, 4810341, 4898064, 4981006, 5059045, 5131913, 5199398, 5261425, 5317729, 5367853, 5411407, 5447795, 5475844, 5494560, 5504459, 5507204, 5503467, 5491840, 5470576, 5439852, 5401615, 5357674, 5308793, 5255236, 5197058, 5133747, 5064562, 4989697, 4910510, 4828300, 4743403, 4655872, 4566570, 4477106, 4388894, 4302466, 4217453, 4132935, 4048066, 3962636, 3877041]
53271C877041q5199q4060q1638p7875p3976p1346o9917o8435o6347o4114o1636
53260C072498n7803n2377m6989m3309m1136l9415l7946l6871l5328l2482k9421
53249B619421k7995k7807k6400k2779j8847j6407j4663j2072r129p456o964n841
53237B423061l100N05M024P293J0195J2279J3688J5494J8472K2128K5349K7679
53225B577067K9630L2008L4978L7741L9334L9882M0493M1574M2125M1492M0837
53214B997161M1458M2347M1198L7694L3962L1563K9760K7200K3612J9285J4496
53203C339736J0173P458N745K767k164o768r031j0167j2588j6381j9929k2851
53191C266000k5900k8729l0426l1958l5358m0257m3779m4570m4527m5554m6845
$$ y = [3877041, 3791842, 3707782, 3626144, 3548269, 3474293, 3402947, 3333030, 3264595, 3198248, 3134134, 3072498, 3014695, 2962318, 2915329, 2872020, 2830884, 2791469, 2753523, 2716652, 2681324, 2648842, 2619421, 2591426, 2563619, 2537219, 2514440, 2495593, 2479186, 2464523, 2452451, 2443322, 2435866, 2428902, 2423061, 2419961, 2420466, 2424490, 2431783, 2441978, 2454257, 2467945, 2483439, 2501911, 2524039, 2549388, 2577067, 2606697, 2638705, 2673683, 2711424, 2750758, 2790640, 2831133, 2872707, 2914832, 2956324, 2997161, 3038619, 3080966, 3122164, 3159858, 3193820, 3225383, 3255143, 3282343, 3305955, 3325240, 3339736, 3349909, 3357367, 3363112, 3365879, 3363715, 3356947, 3347916, 3337749, 3325161, 3308780, 3288851, 3266000, 3240100, 3211371, 3180945, 3148987, 3113629, 3073372, 3029593, 2985023, 2940496, 2894942, 2848097]
53180B848097m6785m5754m5274m5545m5536m4786m3778m2940m2367m2048m1664
53169B361620m0644l9096l7845l6982l5566l3614l2933l4424l5886l4521l0918
53158A969191k8248k7814k7775k6595k5302k5246k5625k4819k2970k1635k1481
53147A691681k1783k1954k2493k4253k7454l1208l3692l3245l0027k6283k4320
53136A394969k4367k4973k5056k4830k4977k5779k7012k8035k8039k6865k5518
53125A109518k5164k5730k6197k6093k5784k5336k4303k2912k2267k2747k3173
53114H39812k2338k0617j9207j8428j7680j6636j5598j4891j4634j4827j5046
53103F49910j4473j3013j1873j2086j2886j2687j1359j0178r659r048q137p945
$$ y = [2848097, 2801312, 2755558, 2710284, 2664739, 2619203, 2574417, 2530639, 2487699, 2445332, 2403284, 2361620, 2320976, 2281880, 2244035, 2207053, 2171487, 2137873, 2104940, 2070516, 2034630, 2000109, 1969191, 1940943, 1913129, 1885354, 1858759, 1833457, 1808211, 1782586, 1757767, 1734797, 1713162, 1691681, 1669898, 1647944, 1625451, 1601198, 1573744, 1542536, 1508844, 1475599, 1445572, 1419289, 1394969, 1370602, 1345629, 1320573, 1295743, 1270766, 1244987, 1217975, 1189940, 1161901, 1135036, 1109518, 1084354, 1058624, 1032427, 1006334, 980550, 955214, 930911, 907999, 885732, 862985, 839812, 817474, 796857, 777650, 759222, 741542, 724906, 709308, 694417, 679783, 664956, 649910, 635437, 622424, 610551, 598465, 585579, 572892, 561533, 551355, 541696, 532648, 524511, 516566]
53091E16566q835r499q802p502o929o873o167m743l626l189k794k208k131l045
53077D40223m482n766o704p168o770n383l575k029q76N6O76N44o26k604m556n395
53061C85565m557k646j095r44j876k550j958n37J36r80l139m592m606m002l522
53046C48697k666r31P32R49Q5m2J282K636K372N86j304k118j576j40J204J641
53030C51407J472J829K950L523K417M45n64p6P07N66m18j374j829k161l122m916
53014C50856o605o834n409l730l107l300l480l915n340o937o616l961j362j278
53000B88982l241m692m207k705j725j706k187k758l270l453k854j267P23J785
52986B57425Q98j366l017k609o85J085J760J482N05r59k138k100j074l09l86o48
$$ y = [516566, 507731, 498232, 489430, 481928, 474999, 468126, 461959, 457216, 453590, 450401, 447607, 445399, 443268, 440223, 435741, 429975, 423271, 416103, 409333, 403950, 400375, 398346, 397470, 397526, 398202, 398746, 398120, 395516, 390960, 385565, 381008, 378362, 377267, 376323, 374447, 371897, 369939, 369402, 369538, 368558, 365419, 360827, 356221, 352219, 348697, 346031, 345100, 345832, 346781, 346866, 346824, 348106, 350742, 353114, 353700, 352396, 350278, 348702, 348562, 349766, 351407, 352879, 354708, 357658, 361181, 363598, 364043, 363479, 363403, 364110, 364676, 364258, 362884, 361055, 358894, 355772, 350856, 344251, 337417, 332008, 328278, 325171, 321871, 318391, 314476, 309136, 302199, 295583, 291622, 290260, 288982, 285741, 281049, 276842, 274137, 272412, 270706, 268519, 265761, 262491, 259038, 256184, 254917, 255640, 257425, 258323, 256957, 253940, 251331, 250646, 251731, 253491, 254973, 255478, 254519, 252381, 250281, 249207, 248898, 248512, 247864]
52970B47864o65j102k292l074k212l11R53J009O54L90j01q84j381j409j569k228
52954B33642k881k947k561k133j678q45O31K540L907L447J099j238j623m95J56
52939B29021r3M01K314L804L156J330K62l5p99j828j572K52K032K464J917J293
52923B43919Q47N62O10R77J284J321J086M87k82k36J317L274L556J787j75o61
52907B59673%O39R19J084J104J023J427K655M109M946M936M146K769J861L052
52892B94343O358R197R082O678M737M447M571M106L785M323M912M654M297N053
52878C70543O322O148L935J430N13J006J364R13L13j2q04k725m894n577m248k214
52862C72013r72p33q76j210j985k969l350k826k173k257k773k516r86P56J221
$$ y = [247864, 247199, 246097, 243805, 240731, 238519, 238208, 239161, 240170, 240824, 241214, 241113, 240229, 238848, 237439, 235870, 233642, 230761, 227814, 225253, 223120, 221442, 220597, 221228, 223768, 227675, 231122, 232221, 230983, 229360, 228865, 229021, 228928, 229329, 231643, 235447, 238603, 239933, 240195, 240160, 239361, 237533, 235961, 236213, 238245, 240709, 242626, 243919, 244766, 245328, 245938, 246915, 248199, 249520, 250606, 251093, 250811, 250575, 251892, 255166, 258722, 260509, 260334, 259673, 259673, 260312, 261231, 262315, 263419, 264442, 265869, 268524, 272633, 277579, 282515, 286661, 289430, 291291, 294343, 300701, 309898, 318980, 325658, 330395, 334842, 339413, 343519, 347304, 351627, 356539, 361193, 365490, 370543, 376865, 383013, 386948, 388378, 388891, 389897, 391261, 392174, 392487, 392475, 391671, 388946, 384052, 378475, 374227, 372013, 371041, 370308, 369432, 368222, 366237, 363268, 359918, 357092, 354919, 352662, 349889, 347373, 346387, 347143, 348364]
52847C48364L33m54N2J442K456K513J843O17j070k499k641j457RJ058J882K350
52831C54798J500q99l204l541k039l31P14J462K014J734N67n23q19o74m82J31
52815C50408J362K338K081Q77p8j22M84J234J731J575P86K23P25J778J908O92
52799C68002n40m98L61P85O81R34J516J203l94j762j393J01R61Q25Q86J583J772
52782C75023Q12L4R91L143M545M309L097J549k13j462q93J489L720M018K808J746
52766D04716J458J283P73K64O3M6J34L88O08N27L91O39Q64Q9j761l417l781l203
52748D00081k784l049l842m919n961o410n931m876l884l352l586m864o706p684
52734C32233o847n055m011m196m697m801m711m620m237l494k853k512k140j660
$$ y = [348364, 348697, 348243, 348295, 349737, 352193, 354706, 356549, 357166, 356096, 353597, 350956, 349499, 349508, 350566, 352448, 354798, 356298, 355399, 352195, 348654, 346615, 346284, 346998, 348460, 350474, 352208, 352775, 352252, 351433, 350759, 350277, 350408, 351770, 354108, 356189, 357066, 356988, 356866, 357350, 358584, 360315, 361890, 362676, 362899, 363624, 365402, 367310, 368002, 367462, 366964, 367325, 368110, 368791, 369725, 371241, 372444, 372050, 370288, 368895, 368996, 369957, 370782, 371668, 373251, 375023, 375835, 375869, 376860, 380003, 384548, 388857, 391954, 393503, 393290, 391828, 390935, 392424, 396144, 400162, 402970, 404716, 406174, 407457, 408230, 408494, 408557, 408603, 408737, 409125, 409733, 410260, 410651, 411290, 412154, 412243, 410482, 407065, 403284, 400081, 397297, 394248, 390406, 385487, 379526, 373116, 367185, 362309, 358425, 355073, 351487, 346623, 339917, 332233, 325386, 320331, 316320, 312124, 307427, 302626, 297915, 293295, 289058, 285564, 282711, 280199, 278059, 276399]
52720B76399j499j798k102k205k391k549k056j050p52j781l124l701l986m935
52706B42470o081o128m966l686k798j777m93K47q4j019j923k675l186l087k402
52691B02412j797j766j963j844j484j423j874k398k320j460o09j003k932n043
52677A74496n617m394k676j693j522j580j432r80m15j30k82m67k34K17L23n0p37
52660A52827j854l377m414l913k146n23J78L76M72K44k29k87J60K39m96j237j111
52643A34909m03J51M66Q02J008P88K93j54l98j75Q71K332L073K714K336K946M031
52626A55590M476M200L832L382K433J352J120J972L034L474L321L091L132L448
52612A97857L750L644K969J854M58r42j577p66Q36J405N5j917k680k161j827k636
$$ y = [276399, 274900, 273102, 271000, 268795, 266404, 263855, 261799, 260749, 259997, 258216, 255092, 251391, 247405, 242470, 236389, 230261, 225295, 221609, 218811, 217034, 216541, 216788, 216704, 215685, 213762, 211087, 207901, 204814, 202412, 200615, 198849, 196886, 195042, 193558, 192135, 190261, 187863, 185543, 184083, 183474, 182471, 179539, 174496, 168879, 164485, 161809, 160116, 158594, 157014, 155582, 154602, 154187, 154057, 153775, 153308, 153074, 153291, 153614, 153564, 152827, 150973, 147596, 143182, 139269, 137123, 136600, 136778, 137154, 137626, 137870, 137641, 137354, 137514, 137753, 137257, 136020, 134909, 134506, 134657, 135123, 135925, 136933, 137721, 138014, 137860, 137462, 137287, 138158, 140490, 143563, 146277, 148613, 151559, 155590, 160066, 164266, 168098, 171480, 173913, 175265, 176385, 178357, 181391, 184865, 188186, 191277, 194409, 197857, 201607, 205251, 208220, 210074, 210532, 209590, 208013, 207247, 208083, 209488, 209543, 207626, 204946, 202785, 200958, 198322]
52596A98322m078n039m817l510k032j494k093k927l277l500l983l992k568j90
52582A54822J487J358l06k416l759l554k116p29k11p6L41P23N60K12P6m75j875
52565A44062k820j650J077L095L302K495J429J50o19M05K785M038K636K7j456
52550A58956j473j304j570j697j158j29R51J722J889J490J052J011J078N29r43
52535A60404k706l522k608n70R79J155P78J058J896K337K189J992J760J183R30
52520A67255J995L660L914K451J399K242L656L675K517J687J482J217J193K422
52506B00765M533N657M715K595P33k86l71O49K445L683L155J295r7K15J675K829
52490B34190L035K799K581K090J063J18J08R45J754K060K095K117K144K257K428
$$ y = [198322, 194244, 189205, 184388, 180878, 178846, 177352, 175259, 172332, 169055, 165555, 161572, 157580, 155012, 154822, 156309, 157667, 157361, 154945, 151186, 147632, 145516, 144787, 144576, 144500, 144841, 145564, 146124, 146336, 146412, 145937, 144062, 141242, 139592, 140669, 143764, 147066, 149561, 150990, 151140, 150521, 150926, 153711, 157749, 160385, 160412, 158956, 157483, 156179, 154609, 152912, 151754, 151625, 152576, 154298, 156187, 157677, 158729, 159740, 160818, 161347, 160404, 157698, 154176, 151568, 150998, 151977, 153132, 153910, 154968, 156864, 159201, 161390, 163382, 165142, 166325, 167255, 169250, 172910, 176824, 179275, 180674, 182916, 186572, 190247, 192764, 194451, 195933, 197150, 198343, 200765, 205298, 210955, 215670, 218265, 218998, 218712, 218341, 218990, 221435, 225118, 228273, 229568, 229471, 229686, 231361, 234190, 237225, 240024, 242605, 244695, 245758, 245876, 245984, 246929, 248683, 250743, 252838, 254955, 257099, 259356, 261784]
52475B61784K167J231N45J288L000L833L035J974K069K828K810J708M44j76q4
52460B88456M79J235J847K120K094J784J181N15k2q28k295l530k875k69K040K031
52444B93963L27q75o38j5l21j660l090l623l047k162j995k633l160k814j695l55
52428B66207O11M85r23k350k041m7J705K193K599L883M815L974K240J447J507
52413B86305R84j6K37K161L859L566J714O2k73M97J298J105qp78l25N48M39o16
52395C00759j333j084l94L09J135J813J673P64j0q8K93Q89J615J872J002l98q50
52378C07967o0O01J46o83q15m36k67j38O01J683J937O85j369k750k517j219m60
52361C02906j201k480k460p12J205J699Q03l26r01r48q15p43o87k60Q35K141K633
$$ y = [261784, 263951, 265182, 265727, 267015, 270015, 273848, 276883, 278857, 280926, 283754, 286564, 288272, 288716, 288540, 288456, 288935, 290170, 292017, 294137, 296231, 298015, 299196, 299711, 299689, 298861, 296566, 293036, 290161, 289892, 291932, 293963, 294290, 293415, 292777, 292762, 292441, 290781, 287691, 284068, 281021, 278859, 276864, 274231, 271071, 268257, 266562, 266207, 266818, 267303, 266380, 264030, 261989, 261942, 263647, 265840, 268439, 272322, 277137, 281111, 283351, 284798, 286305, 287289, 287273, 287510, 289671, 293530, 297096, 298810, 298872, 298599, 299096, 300394, 301499, 301491, 300713, 300388, 300936, 301375, 300759, 299426, 298342, 297948, 298257, 299392, 301205, 302878, 303642, 303632, 303544, 303837, 304726, 306341, 308213, 309215, 308817, 307967, 307907, 308508, 308654, 307971, 307156, 306720, 306453, 306315, 306916, 308599, 310536, 311221, 309852, 307102, 304585, 303366, 302906, 301705, 299225, 296765, 296053, 297258, 298957, 299760, 299434, 298533, 297585, 296770, 296027, 295340, 295080, 295915, 298056, 300689]
52344C00689J837M53k96J92J345J735K27k613m559l866j267J016J959K383K932
52329C02167K938J841M67j06j51p53k014k750j887L25K479L125K024M44MJ011
52313C09164K277K545J630K32p52n91P84K493L542M101N145O704P520O838N472
52298C57104M525M100L875L941M200M025L478L865N811P749P846O724O436P148
52284D30827O959N199L792M483O277P018O306N562N788O551P003O851O228N404
52270E14248M707M265L925L787M518O450Q596R468Q909Q208Q270Q608Q587Q673
52256F11219R549J0776J1438J1716J2517J3704J4018J3226J3075J5142J8568K0939
52244G75887K1109K0226K0090K1338K3445K5715K7750K9188K9551K8835K8030
$$ y = [300689, 302526, 302979, 302683, 302875, 304220, 305955, 306182, 303569, 299010, 295144, 293877, 294893, 296852, 299235, 302167, 305105, 306946, 307413, 307307, 307156, 306403, 304389, 301639, 299752, 300077, 302556, 305681, 307705, 308149, 308153, 309164, 311441, 313986, 315616, 315848, 315096, 314505, 315289, 317782, 321324, 325425, 330570, 337274, 344794, 351632, 357104, 361629, 365729, 369604, 373545, 377745, 381770, 385248, 389113, 394924, 402673, 410519, 417243, 423679, 430827, 437786, 442985, 446777, 451260, 457537, 464555, 470861, 476423, 482211, 488762, 495765, 502616, 508844, 514248, 518955, 523220, 527145, 530932, 535450, 541900, 550496, 559964, 568873, 577081, 585351, 593959, 602546, 611219, 620768, 631544, 642982, 654698, 667215, 680919, 694937, 708163, 721238, 736380, 754948, 775887, 796996, 817222, 837312, 858650, 882095, 907810, 935560, 964748, 994299, 1023134, 1051164]
52233A051164K8450L0109L1335L0781K9413K9418L1243L3041L3245L2242L0935
52222A391376K9269K7256K6000K6117K6237K4769K2383K0875K0196J8723J6290
52211A649491J4692J4712J4703J2914R769O882N015L877L044K336J915K336L772
52198A745458N020M564K837K108L550N737O842P026P606Q946J0307J1072J1098
52185A832171J0574J0312J1551J4452J7456J8983J9188J9291J9797K0335K0607
52174B014717K0518J9848J8717J7935J8036J8379J8066J7251J6574J5693J3506
52163B209240R757N594K473R74N25r8j718l815n147n543o218p839r432j0033j0444
52148B168276j1959j4259j5881j6233j5815j4961j3828j3215j3754j4389j3373
$$ y = [1051164, 1079614, 1109723, 1141058, 1171839, 1201252, 1230670, 1261913, 1294954, 1328199, 1360441, 1391376, 1420645, 1447901, 1473901, 1500018, 1526255, 1551024, 1573407, 1594282, 1614478, 1633201, 1649491, 1664183, 1678895, 1693598, 1706512, 1716281, 1723163, 1728178, 1732055, 1735099, 1737435, 1739350, 1741686, 1745458, 1750478, 1755042, 1757879, 1759987, 1763537, 1769274, 1776116, 1783142, 1790748, 1799694, 1810001, 1821073, 1832171, 1842745, 1853057, 1864608, 1879060, 1896516, 1915499, 1934687, 1953978, 1973775, 1994110, 2014717, 2035235, 2055083, 2073800, 2091735, 2109771, 2128150, 2146216, 2163467, 2180041, 2195734, 2209240, 2218997, 2224591, 2227064, 2228038, 2228563, 2228465, 2226747, 2222932, 2217785, 2212242, 2206024, 2198185, 2188753, 2178720, 2168276, 2156317, 2142058, 2126177, 2109944, 2094129, 2079168, 2065340, 2052125, 2038371, 2023982, 2010609]
52137B010609j0875r078r352j0614j0937r532o822l720j455j021k103l258l490
52124A928352l031k373j533o73l87p88j185j289j867l309m424l774j788m34r65
52109A900532k855n007o878q087p921o153m008l293m395n885o433o412o895p726
52095A818584p741o794o296p319r128j0165r767q332o567n200m791n157n474n385
52081A720468n316n284m544l226k939m617o698p033n748m552l947l064j917j721
52067A659862k828m085m542m293l480k105j099j777l756m924m127k407j095j71
52053A619173Q57K016L568O061Q870J0266R951R951J1832J4453J5981J6735J8268
52040A747982K0690K2784K4143K5449K7017K8600L0367L2637L4841L6099L6540
$$ y = [2010609, 1999734, 1990656, 1981304, 1970690, 1959753, 1950221, 1943399, 1939679, 1938224, 1937203, 1935100, 1931842, 1928352, 1925321, 1922948, 1921415, 1920742, 1920355, 1919567, 1918382, 1917093, 1915226, 1911917, 1907493, 1903719, 1901931, 1901497, 1900532, 1897677, 1892670, 1885792, 1877705, 1869784, 1863631, 1859623, 1856330, 1851935, 1846050, 1839617, 1833205, 1826310, 1818584, 1810843, 1804049, 1797753, 1790434, 1781306, 1771141, 1761374, 1753042, 1746475, 1741275, 1736484, 1731327, 1725853, 1720468, 1715152, 1709868, 1705324, 1702098, 1699159, 1694542, 1687844, 1680811, 1675063, 1670511, 1666564, 1663500, 1661583, 1659862, 1657034, 1652949, 1648407, 1644114, 1640634, 1638529, 1637430, 1635653, 1631897, 1626973, 1622846, 1620439, 1619344, 1619173, 1620030, 1622046, 1625614, 1631675, 1640545, 1650811, 1660762, 1670713, 1682545, 1696998, 1712979, 1729714, 1747982, 1768672, 1791456, 1815599, 1841048, 1868065, 1896665, 1927032, 1959669, 1994510, 2030609, 2067149]
52029B067149L6825L6712L5553L3938L3307L3862L4305L3702L2146K9539K5399
52018B432437K0397J6456J4485J3271J1417R163P249N060J532k643n268n323m324
52005B513909m561o727r764j2406j4206j5127j4819j2922j0068p957p846q931
51993B388575q867o343k765q07j323k337j429J543M675O539P382P828P676O654
51979B407001N485N060N100M769M270M502N177M823L050J392J131J393M54j896
51965B451711m324n751o213o413p173r036j1608j3740j5035j6639j9608k3120
51953B313051k5379k5975k6161k6995k8366k9817l1146l2015l2029l1548l1578
51942A992042l2578l4078l5589l7025l8081l8067l6892l5536l5164l6138l8027
$$ y = [2067149, 2103974, 2140686, 2176239, 2210177, 2243484, 2277346, 2311651, 2345353, 2377499, 2407038, 2432437, 2452834, 2469290, 2483775, 2497046, 2508463, 2517626, 2524875, 2529935, 2531467, 2528824, 2523556, 2518233, 2513909, 2509348, 2502621, 2492857, 2480451, 2466245, 2451118, 2436299, 2423377, 2413309, 2405352, 2397506, 2388575, 2379708, 2373365, 2370600, 2369793, 2368470, 2366133, 2364704, 2366247, 2370922, 2377461, 2384843, 2392671, 2400347, 2407001, 2412486, 2417546, 2422646, 2427415, 2431685, 2436187, 2441364, 2446187, 2449237, 2450629, 2451760, 2453153, 2453607, 2451711, 2447387, 2441636, 2435423, 2429010, 2421837, 2412801, 2401193, 2387453, 2372418, 2355779, 2336171, 2313051, 2287672, 2261697, 2235536, 2208541, 2180175, 2150358, 2119212, 2087197, 2055168, 2023620, 1992042, 1959464, 1925386, 1889797, 1852772, 1814691, 1776624, 1739732, 1704196, 1669032, 1632894, 1594867]
51931A594867l9890m0550l9470l7681l6989l7847l8800l8466l7175l6035l5192
51920A176772l3983l2355l1027l0401l0052k9390k8313k7103k6030k5120k4074
51909H58924k2543k0695j9321j9166k0085k1025k0744j8731j5700j3126j1795
51898F55993j1010r775q577q936j1007j2894j2984j1852j0890j0013q166n497
51886E34392l456k825l023l514m528n951o678n939m502l719l874m105l723k981
51872D75574k644l112l888l872k549q31k26j013j997k284k355k830l083k228q93
51857D41769p26k220m168n436o068o341n812m205k447j814k274k602k077j334
51843C94245j265j738j891j436j097j602k603l009k390j618j715k376k238o71
$$ y = [1594867, 1554977, 1514427, 1474957, 1437276, 1400287, 1362440, 1323640, 1285174, 1247999, 1211964, 1176772, 1142789, 1110434, 1079407, 1049006, 1018954, 989564, 961251, 934148, 908118, 882998, 858924, 836381, 815686, 796365, 777199, 757114, 736089, 715345, 696614, 680914, 667788, 655993, 644983, 635208, 626631, 617695, 606688, 593794, 580810, 568958, 558068, 548055, 539889, 534392, 530936, 528111, 525088, 521574, 517046, 511095, 504417, 498478, 493976, 490257, 486383, 482278, 478555, 475574, 472930, 469818, 465930, 462058, 459509, 458678, 458452, 457439, 455442, 453158, 450803, 447973, 444890, 442662, 441769, 441043, 438823, 434655, 429219, 423151, 416810, 410998, 406793, 404346, 402532, 400258, 397656, 395579, 394245, 392980, 391242, 389351, 387915, 386818, 385216, 382613, 379604, 377214, 375596, 373881, 371505, 369267, 368596]
51829C68596J253J887O91j576l836n284n267l460m68K199L239K626J377M37o3
51814C62351m87q85p31M78K402L834L702K183P45Q91K616M150L573R66j377j287
51798C83124Q68K778L072K714L131L945L592J733j25n31K45R10P52Q7n32r64j237
51781D03562j103k07J296K540K801K408K303K613K349R61n53q15J35J050J197
51766D20537Q97N76L37M83J381K692L556L720L586L129J984P67Q14K042K508J031
51750D50040r99j708j388j478j868j155N89J443L60j324j828j073j10O13J429
51735D41543K403K998K707J684P23O99J635K462K183J227R22J596K166J918J598
51720D68464J929K160J278J19O73L238N563N511L570J974J846K159J348p35k702
$$ y = [368596, 369849, 371736, 372427, 370851, 367015, 361731, 356464, 353004, 352536, 354735, 357974, 360600, 361977, 362414, 362351, 361864, 360979, 360248, 360726, 363128, 366962, 370664, 372847, 373592, 374483, 377099, 381249, 384822, 385788, 384411, 383124, 383992, 386770, 389842, 392556, 395687, 399632, 403224, 404957, 404832, 404301, 404546, 405456, 406208, 406295, 405763, 404799, 403562, 402459, 402252, 403548, 406088, 408889, 411297, 413600, 416213, 418562, 419523, 418970, 418155, 418290, 419340, 420537, 421434, 422010, 422347, 422830, 424211, 426903, 430459, 434179, 437765, 440894, 442878, 443645, 444459, 446501, 449009, 450040, 449041, 447333, 445945, 444467, 442599, 441444, 442033, 443476, 443836, 442512, 440684, 439611, 439501, 440114, 441543, 443946, 446944, 449651, 451335, 452058, 452757, 454392, 456854, 459037, 460264, 461186, 462782, 464948, 466866, 468464, 470393, 472553, 473831, 473950, 474623, 477861, 483424, 488935, 492505, 494479, 496325, 498484, 499832, 499097, 496395]
51705D96395k966j155J514L200L139K378K463L405L739K800K013K941M700M844
51691E29410K770Q62J481M043O068O424O148O398O953P028O499N665M504K872
51677E97125J141l2n66j042j880k748l114l129l464m266m846m797m874n870o916
51662E50722o119l253o13l24j699k484k082k070l521n328n858n060m088l531l044
51647E01648k444k211k596k904k247r26n06k134m924o553n639l116q90K82R24
51632D65764J222L84j945m328m433j452K765N310M997L323K588L539N271O970
51618D89975Q542R448Q406N091J160j464k582k962k538r11R34J283M6j146j478
51603E11804j917l279m832n711o279p163p977q015p382o502n252l548k191k121
$$ y = [496395, 493429, 492274, 493788, 496988, 500127, 502505, 504968, 508373, 512112, 514912, 516925, 519866, 524566, 529410, 532180, 533042, 534523, 538566, 544634, 551058, 557206, 563604, 570557, 577585, 584084, 589749, 594253, 597125, 598266, 598234, 597668, 596626, 594746, 591998, 588884, 585755, 582291, 578025, 573179, 568382, 563508, 557638, 550722, 544603, 541350, 540737, 540413, 538714, 536230, 534148, 532078, 528557, 523229, 517371, 512311, 508223, 504692, 501648, 499204, 496993, 494397, 491493, 489246, 488320, 487814, 485680, 480756, 474203, 468564, 465448, 464558, 464840, 465764, 466986, 467370, 465425, 461097, 456664, 455212, 457977, 463287, 468284, 471607, 474195, 477734, 483005, 489975, 498517, 507965, 516371, 521462, 522622, 521158, 518576, 515614, 513076, 512165, 513099, 514382, 514428, 513282, 511804, 509887, 506608, 501776, 496065, 489786, 482623, 474646, 466631, 459249, 452747, 447495, 443947, 441756, 439635]
51589D39635l208m507n390n790n775n474n070m337k860j192r51k844n281n967
51575C80989m457k179m64L85L70n32j739k128j078R35K752L261J989m02k436l180
51559C72086l059k833k410j355l0P42Q81R02Q76N00p3m11n65o29N4J870L534L348
51541C73428J812J216K343L522L556L541M561N396M373K302J542K731M327N099
51527D19749N273N156M465L547L688N274O833O849N718M836M462L708K398J468
51513D83424J307R19n81k418l165k796k573l001l090k080p92m28p23m44O95J766
51497D66020K255K847M151N557N942N138M047L584L849M216M033L360L054L773
51483E21826M910N082L785J992Q38L31j45o06n20J54P38P80P16J405L138N221
$$ y = [439635, 436427, 431920, 426530, 420740, 414965, 409491, 404421, 400084, 397224, 396032, 395081, 392237, 386956, 380989, 376532, 374353, 373889, 374274, 374644, 374112, 372373, 370245, 369167, 370102, 372854, 376115, 378104, 377702, 375266, 372086, 369027, 366194, 363784, 362429, 362399, 363141, 364022, 364924, 365800, 366300, 366227, 365816, 365251, 364622, 364676, 366546, 370080, 373428, 375240, 376456, 378799, 382321, 385877, 389418, 393979, 399375, 403748, 406050, 407592, 410323, 414650, 419749, 425022, 430178, 434643, 438190, 441878, 447152, 453985, 460834, 466552, 471388, 475850, 479558, 481956, 483424, 484731, 485650, 485069, 482651, 479486, 476690, 474117, 471116, 468026, 465946, 465154, 464726, 464003, 463559, 464254, 466020, 468275, 471122, 475273, 480830, 486772, 491910, 495957, 499541, 503390, 507606, 511639, 514999, 518053, 521826, 526736, 531818, 535603, 537595, 538433, 538764, 538619, 538013, 537493, 537647, 538385, 539165, 539881, 541286, 544424, 549645]
51467E49645O463O193M892L710L262L122K587J685J090J191J563J448O28k08j91
51452E87080N43O18j093l874n738n739m931m743n150n196m627m101l952l808l408
51437E31881k985k667k202j649j584k078k023l02K487M219L475J115q59j613k015
51422E23200k858l540l036j559k64M86J459L063M548N191N267N211M645L291K221
51407E47325K885N095P101P669P114O167N015L859L346L651L813K863J231J30
51393F07264j73o97k182l913m508l577k115j300j212j017k42N71P01L26J87M36
51377E88549M29k49j178j885k616l763m961n428n188n283o522q470r903j0100
51363E23432r413q699q440q407p990o815n143l761l379m048n115n893o252o427
$$ y = [549645, 556108, 562301, 567193, 570903, 574165, 577287, 579874, 581559, 582649, 583840, 585403, 586851, 587479, 587271, 587080, 587623, 588241, 587148, 583274, 577536, 571797, 566866, 562123, 556973, 551777, 547150, 543049, 539097, 535289, 531881, 528896, 526229, 524027, 522378, 520794, 518716, 516693, 516391, 518878, 523097, 526572, 527687, 526828, 525215, 523200, 520342, 516802, 513766, 512207, 511943, 512429, 513888, 516951, 521499, 526690, 531957, 537168, 541813, 545104, 547325, 550210, 555305, 562406, 570075, 577189, 583356, 588371, 592230, 595576, 599227, 603040, 605903, 607134, 607264, 607091, 606394, 604212, 600299, 595791, 592214, 590099, 588799, 587587, 586570, 586328, 586899, 587600, 587926, 588113, 588549, 588978, 588729, 587551, 585666, 583050, 579287, 574326, 568898, 563710, 558427, 551905, 543435, 533532, 523432, 514019, 505320, 496880, 488473, 480483, 473668, 468525, 464764, 461385, 457337, 452222, 446329, 440077, 433650]
51349D33650o221m857j912J752M426N041M066K871K501L081M029M540M078K833
51335D59878J744J764K913M034L641J130k667o108q032q621q966r735j0431j0143
51321D10401q856p625p358p857q296q291q029p618o937o199n917o044n757m543
51307C11074l001j984j506j158j202k126l324l407k204j283j977l736m950m735
51293B74481l259j138O80J148Q4j438k318k585k643k263j203j79P8J14P95J565
51277B61919J262L07K92J401K217K296K845M186M668L307J628J289J612J247R11
51262B91387K110M070M510L286K807M425O482O846N651M520M230M330M251L760
51248C52665K663R33j041k677l647m000m221m960o243p026o355m883m185m582
$$ y = [433650, 427429, 422572, 420660, 422412, 426838, 431879, 435945, 438816, 441317, 444398, 448427, 452967, 457045, 459878, 461622, 463386, 466299, 470333, 473974, 475104, 472437, 466329, 458297, 449676, 440710, 430975, 420544, 410401, 401545, 393920, 386562, 378705, 370409, 362118, 354089, 346471, 339534, 333335, 327418, 321374, 315617, 311074, 308073, 306089, 304583, 303425, 302223, 300097, 296773, 293366, 291162, 289879, 287902, 284166, 279216, 274481, 271222, 270084, 270764, 271912, 271996, 270558, 268240, 265655, 263012, 260749, 259546, 259367, 259445, 259559, 260354, 261919, 263181, 263488, 263780, 265181, 267398, 269694, 272539, 276725, 281393, 284700, 286328, 287617, 289229, 290476, 291387, 293497, 297567, 302077, 305363, 308170, 312595, 319077, 325923, 331574, 336094, 340324, 344654, 348905, 352665, 355328, 356261, 355220, 352543, 348896, 344896, 340675, 335715, 329472, 322446, 316091, 311208, 307023, 302441]
51234C02441m901m668m941o167o724n058k250p55j112j687j440j162j639k210
51220B57727j925r88j46M36Q61Q35K52j76Q4J63j279m008o244o749n862m235j899
51203B26847Q23K585K430J271P67J140J248O59K77P18J305J177M30m48j324j976
51187B37929j723l40J266K049J971J457M49j062k246k304j678j283r08K38J740
51172B35555K258J634J138J371J462Q71L58M17J99q33j462m19J435K187J691J636
51156B49498K917M363M372K760O30q34j071l66L62L39k28m67J1P03R71P71M75
51139B65206L70N55J075J954L124M195M400L124P44j324j934j282m26N6M60J144
51123B81441J894K128J480K04r53j483j767k516l449l289j620J22L06p83j497
$$ y = [302441, 297540, 292872, 287931, 281764, 275040, 269982, 267732, 266977, 265865, 264178, 262738, 261576, 259937, 257727, 255802, 254814, 254668, 255104, 255965, 256800, 257052, 256876, 256960, 257123, 255844, 251836, 245592, 238843, 232981, 228746, 226847, 227670, 230255, 232685, 233956, 234723, 235863, 237111, 237770, 238047, 238765, 240070, 241247, 241677, 241229, 239905, 237929, 236206, 235866, 237132, 239181, 241152, 242609, 243058, 241996, 239750, 237446, 235768, 234485, 233577, 233815, 235555, 237813, 239447, 240585, 241956, 243418, 244289, 244647, 245064, 245263, 244430, 242968, 242549, 243984, 246171, 247862, 249498, 252415, 256778, 261150, 263910, 264540, 263706, 262635, 262269, 262631, 262970, 262742, 262275, 262286, 262989, 263960, 264731, 265206, 265576, 266131, 267206, 269160, 272284, 276479, 280879, 284003, 284747, 283423, 281489, 280207, 279781, 279837, 280297, 281441, 283335, 285463, 286943, 287147, 286194, 284711, 282944, 280428, 276979, 273690, 272070, 272192, 272498, 271715, 270218]
51108B70218j099l52j31o33j887l735n043m268j493J047J237o61k591k952j779
51093B45878k62L02o57k496l911m137l423k213n86J140J943J080p62k072k195
51078B27629j718j230m66Q60K050K025R77N15J707L429L588J853J24K6R94J585
51062B43948J608J842K228J935R51K27M3l79j426k441k935l143k982j801J34J265
51046B39074Q37J51M96R15l05k681l838k671n08J027J925K990M328N342N537M786
51030B57405L189J338K93Q16K582M331M851L878K235J132J147J857K400K246J449
51015B91149M09l86p34q82j048p31Q68L548N798O231M794K344k29j943j790J48
50999C07546K259L045K773K585K569J930O78l22q51j534k327k276j211m38r27
$$ y = [270218, 269119, 268767, 268636, 268003, 266116, 262381, 257338, 253070, 251577, 252624, 253861, 253200, 250609, 247657, 245878, 245616, 245918, 245261, 242765, 238854, 234717, 231294, 229081, 228495, 229635, 231578, 232658, 231896, 229824, 227629, 225911, 224681, 224215, 225075, 227125, 229150, 230127, 230642, 232349, 235778, 239366, 241219, 241343, 241369, 242363, 243948, 245556, 247398, 249626, 251561, 252512, 252739, 252782, 252403, 250977, 248536, 245601, 242458, 239476, 237675, 237809, 239074, 239911, 240062, 240558, 241473, 241168, 238487, 234649, 231978, 231470, 232497, 234422, 237412, 241740, 247082, 252619, 257405, 260594, 261932, 262225, 263041, 265623, 269954, 274805, 278683, 280918, 282050, 283197, 285054, 287454, 289700, 291149, 291558, 291172, 290438, 289556, 288508, 287777, 288645, 292193, 297991, 304222, 309016, 311360, 311131, 309188, 307398, 307546, 309805, 312850, 315623, 318208, 320777, 322707, 323385, 323063, 322212, 320678, 318351, 316075, 314864, 314426, 313499]
50984C13499j732j116J250L885N065M318K535Q88k49j270k245k464j469M7J145
50969C22087J829K383K248J029J15J382M243N937N169L535K639J938O39k02O80
50954C55651K479L541L959M926O278O701O088N756O286O775O452N592M726M158
50940D29368M335N435O527O620O457P708J0108J1313J0310R198J0413J3497J6012
50927E47301J6796J6866J7494J8771J9970K0581K0838K1540K3218K5341K6934
50916G75650K8114L0020L2937L5615L7316L9325M3135M8011N1994N4894N8462
50905A235473O3636O9310P4247P8717Q3447Q8222R2412R6059R9469J02261J03766
50894B187019J03982J03242J01261R7456R2203Q6772Q1620P5526O7031N6443M5749
$$ y = [313499, 311767, 310651, 311901, 315786, 320851, 325169, 327704, 328592, 328343, 327073, 324828, 322364, 320895, 320942, 322087, 323916, 326299, 328547, 329576, 329691, 331073, 335316, 341253, 346422, 349957, 352596, 354534, 355173, 354971, 355651, 358130, 361671, 365630, 370556, 376834, 383535, 389623, 395379, 401665, 408440, 414892, 420484, 425210, 429368, 433703, 439138, 445665, 452285, 458742, 466450, 476558, 487871, 498181, 507379, 517792, 531289, 547301, 564097, 580963, 598457, 617228, 637198, 657779, 678617, 700157, 723375, 748716, 775650, 803764, 833784, 866721, 902336, 939652, 978977, 1022112, 1070123, 1122117, 1177011, 1235473, 1299109, 1368419, 1442666, 1521383, 1604830, 1693052, 1785464, 1881523, 1980992, 2083253, 2187019, 2291001, 2394243, 2495504, 2592960, 2685163, 2771935, 2853555, 2929081, 2996112, 3052555, 3098304]
50883C098304L6550K8838K2027J6389J2522R752O340J739k420m348m344m037m217
50870C213095m741o261j0251j6984k4926l2744m0716m9424n8352o6792p5067q3504
50858B743333r0877r5380r6935r7246r7619r7810r6945r4601r0885q6376q2019
50847A716640p8189p3885o7918o0819n4415m9377m4551l9001l3357k8528k4436
50836A162164k0843j8226j6780j5479j3313j0627q122n542k626m22J47L82K381
50823A053094N671P607P411P478R587J2004J2139J0561J0205J2372J5622J8373
50811A182124K0500K2154K3062K3806K6132L0639L5324L7891L8777M0333M3395
50800A524137M6516M8856N1994N7777O5580P3204P9845Q6647R4402J02357J09909
$$ y = [3098304, 3134854, 3163692, 3185719, 3202108, 3214630, 3224382, 3230722, 3232461, 3230041, 3225693, 3221349, 3217312, 3213095, 3208354, 3202093, 3191842, 3174858, 3149932, 3117188, 3076472, 3027048, 2968696, 2901904, 2826837, 2743333, 2652456, 2557076, 2460141, 2362895, 2265276, 2167466, 2070521, 1975920, 1885035, 1798659, 1716640, 1638451, 1564566, 1496648, 1435829, 1381414, 1332037, 1287486, 1248485, 1215128, 1186600, 1162164, 1141321, 1123095, 1106315, 1090836, 1077523, 1066896, 1058774, 1053232, 1050606, 1050184, 1050331, 1050713, 1053094, 1058765, 1066372, 1073783, 1081261, 1090848, 1102852, 1114991, 1125552, 1135757, 1148129, 1163751, 1182124, 1202624, 1224778, 1247840, 1271646, 1297778, 1328417, 1363741, 1401632, 1440409, 1480742, 1524137, 1570653, 1619509, 1671503, 1729280, 1794860, 1868064, 1947909, 2034556, 2128958, 2231315, 2341224]
50789B341224J18156J28620J40988J53213J63785J73091J82484J92619K02873
50780C797053K11913K18648K22984K25746K27466K27101K22318K11518J95447
50771E760194J76482J56416J35308J12646Q9083O6411M5958K7797J1960m08q032
50760F573815j1343j2207j1751r636n881k184n72j592n112j2218k4756m2833o4023
50747F369707q5607j06880j28768j51704j74417j94577k10315k21186k27898k31166
50737D637189k31116k27701k21147k11636j99190j84546j69513j55519j42047
50728B894774j27614j12168r7389q4477p2872o1545n0569m0842l2970k6935k2251
50717B165142j8138j4172j1102j0295j1944j4500j6227j6710j6486j6118j6061
$$ y = [2341224, 2459380, 2588000, 2728988, 2882201, 3045986, 3219077, 3401561, 3594180, 3797053, 4008966, 4227614, 4450598, 4676344, 4903810, 5130911, 5353229, 5564747, 5760194, 5936676, 6093092, 6228400, 6341046, 6430129, 6496540, 6542498, 6570295, 6582255, 6581847, 6573815, 6562472, 6550265, 6538514, 6528878, 6522997, 6520813, 6520241, 6518649, 6513537, 6501319, 6476563, 6433730, 6369707, 6284100, 6177220, 6048452, 5896748, 5722331, 5527754, 5317439, 5096253, 4868355, 4637189, 4406073, 4178372, 3957225, 3745589, 3546399, 3361853, 3192340, 3036821, 2894774, 2767160, 2654992, 2557603, 2473126, 2400254, 2338709, 2288140, 2247298, 2214328, 2187393, 2165142, 2147004, 2132832, 2121730, 2111435, 2099491, 2084991, 2068764, 2052054, 2035568, 2019450, 2003389]
50706B003389j6713j7997j9365k0586k1804k2630k2239k0739j9338j8496j7264
50695A786218j5190j3449j2792j1678q193k885K199O532J1249J6586K1430K5437
50683A805464K9538L3953L7529L9759M1934M5395M9927N4557N8891O3040O7277
50672B327264P2353P9033Q6806R4113J00415J06684J13318J19038J22853J25596
50662C347473J28157J29489J28008J23945J18474J11300J01138Q8235P4409O0493
50652D411121M5567K9073J2129l799j7975k9601l7377m0831m1075l9418l6123
50641D251691l1225k5548k0016j4761r989p048p426j1129j7183k5452l6704n0781
50629C994429o5995q0648r4226j06541j16528j22799j25129j24730j22909j19759
$$ y = [2003389, 1986676, 1968679, 1949314, 1928728, 1906924, 1884294, 1862055, 1841316, 1821978, 1803482, 1786218, 1771028, 1757579, 1744787, 1733109, 1724916, 1722031, 1724230, 1730762, 1742011, 1758597, 1780027, 1805464, 1835002, 1868955, 1906484, 1946243, 1988177, 2033572, 2083499, 2138056, 2196947, 2259987, 2327264, 2399617, 2478650, 2565456, 2659569, 2759984, 2866668, 2979986, 3099024, 3221877, 3347473, 3475630, 3605119, 3733127, 3857072, 3975546, 4086846, 4187984, 4276219, 4350628, 4411121, 4456688, 4485761, 4497890, 4494091, 4476116, 4446515, 4409138, 4368307, 4327232, 4287814, 4251691, 4220466, 4194918, 4174902, 4160141, 4150152, 4143104, 4135678, 4124549, 4107366, 4081914, 4045210, 3994429, 3928434, 3847786, 3753560, 3647019, 3530491, 3407692, 3282563, 3157833, 3034924, 2915165]
50619B915165j14246j05650r4772q3558p3341o3830n4089m4060l4327k4635j3872
50608B208785j940R293J7805K3676K8810L4721M1241M7160N1225N2598N1250M8286
50596B612910M5345M3190M1134L8082L3959K9915K7337K6853K8098L0208L2449
50585B989480L4399L5756L6389L6846L8313M1523M5886N0150N3808N7147O0098
50574C479795O2019O2752O3057O3502O3581O2451O0046N6897N3073M7989M1173
50563D116335L2964K4493J6948J0516M050l536j1419j7239j9747k0242k0585k0712
50551D091826j9208j5723j1393p015k329K554O356P937P489N742K754j670o976
50538D060344j2461j8805k7891m0442n4474o6887p6557q5057r4021j02579j08333
$$ y = [2915165, 2800919, 2695269, 2600497, 2516939, 2443598, 2379768, 2325679, 2281619, 2247292, 2222657, 2208785, 2206845, 2216138, 2233943, 2257619, 2286429, 2321150, 2362391, 2409551, 2460776, 2513374, 2564624, 2612910, 2658255, 2701445, 2742579, 2780661, 2814620, 2844535, 2871872, 2898725, 2926823, 2957031, 2989480, 3023879, 3059635, 3096024, 3132870, 3171183, 3212706, 3258592, 3308742, 3362550, 3419697, 3479795, 3541814, 3604566, 3667623, 3731125, 3794706, 3857157, 3917203, 3974100, 4027173, 4075162, 4116335, 4149299, 4173792, 4190740, 4201256, 4205306, 4201770, 4190351, 4173112, 4153365, 4133123, 4112538, 4091826, 4072618, 4056895, 4045502, 4038487, 4036158, 4038712, 4045068, 4053005, 4060494, 4066236, 4068990, 4067320, 4060344, 4047883, 4029078, 4001187, 3960745, 3906271, 3839384, 3762827, 3677770, 3583749, 3481170, 3372837]
50527C372837j10551j11074j11744j12105j10455j06304j00725r4788q8843q3007
50517B343241p7169p0510o2284n3241m5327l9650l5535l1702k7430k2330j6172
50506A861891r578m040l90K281N552J0022J5143K0147K4545K8105L1079L4302
50494B019059L8495M3523M8583N3047N6976O0933O5338O9718P2808P3996P4574
50483B677050P6641Q0580Q4509Q6475Q6262Q4675Q2366Q0177P9445Q0718Q2822
50472C581720Q4425Q5976Q8920R3541R8823J04166J09804J15616J20931J25767
50462D609689J31049J37207J43480J48921J53180J55988J56780J55424J52514
50453E944232J48295J41852J31968J18421J01938Q3159O2209L9197J4775r874
$$ y = [3372837, 3262286, 3151212, 3039468, 2927363, 2816908, 2710604, 2609879, 2515091, 2426248, 2343241, 2266072, 2195562, 2133278, 2080037, 2034710, 1995060, 1959525, 1927823, 1900393, 1878063, 1861891, 1852313, 1848273, 1847883, 1850164, 1855716, 1865738, 1880881, 1901028, 1925573, 1953678, 1984757, 2019059, 2057554, 2101077, 2149660, 2202707, 2259683, 2320616, 2385954, 2455672, 2528480, 2602476, 2677050, 2753691, 2834271, 2918780, 3005255, 3091517, 3176192, 3258558, 3338735, 3418180, 3498898, 3581720, 3666145, 3752121, 3841041, 3934582, 4033405, 4137571, 4247375, 4362991, 4483922, 4609689, 4740738, 4877945, 5021425, 5170346, 5323526, 5479514, 5636294, 5791718, 5944232, 6092527, 6234379, 6366347, 6484768, 6586706, 6669865, 6732074, 6771271, 6786046, 6776172]
50443F776172l3624n6025p7177r6830j13926j27465j37382j43802j45777j41845
50433E702319j32023j18217j02461q5562o7811m9922l2620j6221j384J0343J7533
50422E123974J9927J7711J0420k486k0334m1487o4619q8730j12196j32957j49916
50411D559307j63173j72649j77596j77865j74809j70142j64526j57824j50100
50402C050623j41469j31453j19704j07269r6052q6717p8008o8687n9258n1027
50392B110979m4144l7595l0870k4613j9405j4884j0319n423k25N170J0243J4174
50380A953088J6896J9551K3135K7104L0097L1752L3005L4774L7164L9867M2451
50369B288884M4263M4874M4850M5219M5951M5828M4192M2020M0714M0490M0550
$$ y = [6776172, 6742548, 6686523, 6609346, 6512516, 6398590, 6271125, 6133743, 5989941, 5844164, 5702319, 5570296, 5452079, 5349618, 5264056, 5196245, 5146323, 5113703, 5097482, 5096098, 5106441, 5123974, 5143901, 5161612, 5172032, 5169546, 5149212, 5107725, 5043106, 4954376, 4842180, 4709223, 4559307, 4396134, 4223485, 4045889, 3868024, 3693215, 3523073, 3358547, 3200723, 3050623, 2909154, 2777701, 2657997, 2550728, 2454676, 2367959, 2289951, 2221264, 2162006, 2110979, 2066835, 2029240, 1998370, 1973757, 1954352, 1939468, 1929149, 1923726, 1923501, 1928671, 1938914, 1953088, 1969984, 1989535, 2012670, 2039774, 2069871, 2101623, 2134628, 2169402, 2206566, 2246433, 2288884, 2333147, 2378021, 2422871, 2468090, 2514041, 2559869, 2604061, 2646081, 2686795, 2727285, 2767835]
50358B767835M0305L9871L9657M0077M1385M3367M5404M7059M8475N0000N1941
50347C255376N4681N8493O2993O7395P1477P5386P8174P7880P3923O8444O3925
50336D008147O0224N5199M7620L7950K6632J3488j023j5532k9404m3422n8209
50325D101670p2907q6075r7094j06008j12602j16289j16627j13627j07816j00045
50315C072580r0777p9724o6902n3797m2306l2459k2499j1682j678N377R047R962
50303B695142Q218L491m010j3572k4297l4730m3264m9892n6362o3472o9250p1362
50291B276640p0289o8419o6820o4928o2749o0955n8922n5148m9937m5362m2013
50280A631098l8160l3107k8966k7423k6797k4368k0230j6511j3741j0414n914
$$ y = [2767835, 2808140, 2848011, 2887668, 2927745, 2969130, 3012497, 3057901, 3104960, 3153435, 3203435, 3255376, 3310057, 3368550, 3431543, 3498938, 3570415, 3645801, 3723975, 3801855, 3875778, 3944222, 4008147, 4068371, 4123570, 4171190, 4209140, 4235772, 4249260, 4248237, 4232705, 4203301, 4159879, 4101670, 4028763, 3942688, 3845594, 3739586, 3626984, 3510695, 3394068, 3280441, 3172625, 3072580, 2981803, 2902079, 2835177, 2781380, 2739074, 2706615, 2684116, 2672434, 2670756, 2676133, 2685180, 2695142, 2703360, 2706851, 2702841, 2689269, 2664972, 2630242, 2586978, 2537086, 2480724, 2417252, 2348002, 2276640, 2206351, 2137932, 2071112, 2006184, 1943435, 1882480, 1823558, 1768410, 1718473, 1673111, 1631098, 1592938, 1559831, 1530865, 1503442, 1476645, 1452277, 1432047, 1415536, 1401795, 1391381, 1385467]
50269A385467j635J164K839M206N371O473Q327J1399J4856J7490J9222K0887K2730
50256A518796K3879K3620K2772K3075K5109K7367K8003K7128K6481K7062K8204
50245A801496K9192L0258L1242L0673K7672K3866K1811K1866K2053K0833J8370
50234B079332J5097J0754N535Q85j912l257m552o463q541j0373j2452j5707k0135
50221B028211k4201k6126k6040k6161k8129l0834l1842l0492k8385k7096k6778
50210A722127k6944k7168k6733k5005k2539k0652j9548j8236j6495j5318j4755
50199A488734j3093r334m913j639O39K739L915L054J322J301L479N521N296L115
50185A490136O61r10j405j355j794l419n616p099p646q184r071r350q294o612
$$ y = [1385467, 1383832, 1384996, 1387835, 1392041, 1397412, 1403885, 1412212, 1423611, 1438467, 1455957, 1475179, 1496066, 1518796, 1542675, 1566295, 1589067, 1612142, 1637251, 1664618, 1692621, 1719749, 1746230, 1773292, 1801496, 1830688, 1860946, 1892188, 1922861, 1950533, 1974399, 1996210, 2018076, 2040129, 2060962, 2079332, 2094429, 2105183, 2110718, 2111603, 2109691, 2106434, 2101882, 2095419, 2086878, 2076505, 2064053, 2048346, 2028211, 2004010, 1977884, 1951844, 1925683, 1897554, 1866720, 1834878, 1804386, 1776001, 1748905, 1722127, 1695183, 1668015, 1641282, 1616277, 1593738, 1573086, 1553538, 1535302, 1518807, 1503489, 1488734, 1475641, 1466307, 1461394, 1459755, 1460394, 1463133, 1467048, 1470102, 1471424, 1472725, 1476204, 1481725, 1487021, 1490136, 1490797, 1489887, 1488482, 1487127, 1485333, 1481914, 1476298, 1469199, 1461553, 1453369, 1444298, 1434948, 1426654, 1420042]
50171A420042n643n998p432r297j0734j1067j0373r232p793n890m098l484l975
50158A325026m088k939j409m77M15K266M621O126O436O294O114N766N447N373
50144A364971M691K265j362m260n749p198r510j1418j1492j0532j0396j1355j2324
50131A276331j3168j4738j6681j7295j6181j5162j5515j5954j4755j2561j1320
50120A113001j1268j0915r647q364p568o784o216o970q725r147p047m680n040
50107A010630p791r871r703q690q397q243o918m726l162k849l066l178l632n147
50093I25257p516r674j0907j1462j1699j1110q991o133m635n388o570n820l431
50080H21921j964k708l951l407j268K15l39j903k455j149J139K994L711L420K504
$$ y = [1420042, 1414399, 1408401, 1400969, 1391672, 1380938, 1369871, 1359498, 1350266, 1342473, 1336583, 1332485, 1329001, 1325026, 1320938, 1317999, 1316590, 1316113, 1316528, 1318794, 1323415, 1329541, 1335977, 1342271, 1348385, 1354151, 1359598, 1364971, 1369662, 1371927, 1370565, 1366305, 1360556, 1353358, 1343848, 1332430, 1320938, 1310406, 1300010, 1288655, 1276331, 1263163, 1248425, 1231744, 1214449, 1198268, 1183106, 1167591, 1151637, 1136882, 1124321, 1113001, 1101733, 1090818, 1081171, 1072807, 1065239, 1058455, 1052239, 1045269, 1036544, 1027397, 1020350, 1015670, 1010630, 1002839, 992968, 983265, 974575, 966178, 957935, 951017, 946291, 943129, 940280, 937214, 934036, 930404, 925257, 917741, 908067, 897160, 885698, 873999, 862889, 853898, 847765, 843130, 837742, 831172, 825352, 821921, 819957, 817249, 813298, 809891, 808623, 808838, 808499, 806596, 804141, 802992, 804131, 807125, 810836, 814256, 816760]
50065H16760J417Q93J624L381N037N931O751Q499J1067J3506J5319J6551J6910
50052I23646J5913J3976J2261J1271J0502R775R841J1114J2635J3056J2155J0811
50040A066956R835R357R101Q821Q492Q238P989P375O366N762O377P860R080R700
50026A181309J0364J1310J1862J1725J1518J1525J1002R593Q362Q410R319J0020
50014A306319J0532J1690J3636J5765J7734J9503K0683K0983K1132K2167K3919
50003A504063K5236K5750K6345K7722K9464L0774L1312L1151L0557L0082L0111
49992A822567L0242K9608K7917K5523K2757J9984J8038J7322J6566J3880R416
49981B053820N587L977L343J578j494m439o356p360p537o794n521m232k673l03
$$ y = [816760, 818177, 819070, 820694, 824075, 829112, 835043, 841794, 850293, 861360, 874866, 890185, 906736, 923646, 939559, 953535, 965796, 977067, 987569, 997344, 1007185, 1018299, 1030934, 1043990, 1056145, 1066956, 1076791, 1086148, 1095249, 1104070, 1112562, 1120800, 1128789, 1136164, 1142530, 1148292, 1154669, 1162529, 1171609, 1181309, 1191673, 1202983, 1214845, 1226570, 1238088, 1249613, 1260615, 1270208, 1278570, 1286980, 1296299, 1306319, 1316851, 1328541, 1342177, 1357942, 1375676, 1395179, 1415862, 1436845, 1457977, 1480144, 1504063, 1529299, 1555049, 1581394, 1609116, 1638580, 1669354, 1700666, 1731817, 1762374, 1792456, 1822567, 1852809, 1882417, 1910334, 1935857, 1958614, 1978598, 1996636, 2013958, 2030524, 2044404, 2053820, 2059407, 2063384, 2066727, 2068305, 2066811, 2062372, 2056016, 2048656, 2041119, 2034325, 2028804, 2024572, 2021899, 2021596]
49967B021596K608N531Q962J3769J9281K3689K6703L0182L5314M0599M3921M5285
49955B317440M5903M5404M2119L6097K9799K5135K1333J6766J1685P799N822M731
49943B610033L284J005k437p747j5224k3982l2583m0341m7676n5139o2350o8063
49931B258780p1379p2701p3206p3471p2998p1184o8143o4207n9361n3871m8968
49920A529291m5777m3715m0919l6529l1653k7748k4952k2578k0542j9346j8833
49909A196699j7944j5971j3614j2265j2330j2611j1671r549p646p022p403q120
49897A060553r080j0188j0622r782q498q075q428q411p896p879q337p624m987
$$ y = [2021596, 2024204, 2029735, 2038697, 2052466, 2071747, 2095436, 2122139, 2152321, 2187635, 2228234, 2272155, 2317440, 2363343, 2408747, 2450866, 2486963, 2516762, 2541897, 2563230, 2579996, 2591681, 2599480, 2605302, 2610033, 2613317, 2614322, 2611885, 2604138, 2588914, 2564932, 2532349, 2492008, 2444332, 2389193, 2326843, 2258780, 2187401, 2114700, 2041494, 1968023, 1895025, 1823841, 1755698, 1691491, 1632130, 1578259, 1529291, 1483514, 1439799, 1398880, 1362351, 1330698, 1302950, 1277998, 1255420, 1234878, 1215532, 1196699, 1178755, 1162784, 1149170, 1136905, 1124575, 1111964, 1100293, 1090744, 1083098, 1076076, 1068673, 1060553, 1051473, 1041285, 1030663, 1020881, 1012383, 1004308, 995880, 987469, 979573, 971694, 963357, 955733, 950746]
$$ [...]
##END NTUPLES=NMR SPECTRUM
##END=
