
##TITLE=AC1068_TOPL01_5906499_UAK4SZTnLg
##JCAMPDX= 6.0         $$ Bruker NMR JCAMP-DX V2.0
##DATA TYPE= NMR SPECTRUM
##DATA CLASS= NTUPLES
##ORIGIN= BRUKER
##OWNER= Administrator
$$ 1.72 TOPSPIN		Version 2.1
$$ 2012-04-10 10:15:56.093 -0500  Administrator@TOPSPIN
$$ Compression mode = diff/dup
##.OBSERVE FREQUENCY= 400.13188235
##.OBSERVE NUCLEUS= ^1H
##.ACQUISITION MODE= SIMULTANEOUS (DQD)
##.ACQUISITION SCHEME= undefined
##.AVERAGES= 8
##.DIGITISER RES= 22
##SPECTROMETER/DATA SYSTEM= spect
##.PULSE SEQUENCE= zg30
##.SOLVENT NAME= COFFEE_meoh
##.SHIFT REFERENCE= INTERNAL, COFFEE_meoh, 1, 14.98061
##AUDIT TRAIL= $$ (NUMBER, WHEN, WHO, WHERE, PROCESS, VERSION, WHAT)
$$ ##TITLE= Audit trail, TOPSPIN		Version 2.1
$$ ##JCAMPDX= 5.01
$$ ##ORIGIN= Bruker BioSpin GmbH
$$ ##OWNER= Administrator
$$ $$ C:\Bruker\TOPSPIN/data/COFFEE/nmr/AC1068_TOPL01_5906499_UAK4SZTnLg/10/pdata/1/auditp.txt
$$ ##AUDIT TRAIL=  $$ (NUMBER, WHEN, WHO, WHERE, PROCESS, VERSION, WHAT)
(   1,<2012-04-04 13:09:35.937 -0500>,<Administrator>,<TOPSPIN>,<go>,<TOPSPIN 2.1>,
      <created by zg
	started at 2012-04-04 13:08:29.000 -0500,
	POWCHK enabled, PULCHK disabled,
       configuration hash MD5:
       1A 1E CE 29 27 FD 77 03 67 4E F0 E3 C4 B2 CB 90
       data hash MD5: 64K
       35 F3 C8 E5 13 B3 8F 31 80 AB 8E 84 DD 81 BC 3C>)
(   2,<2012-04-04 13:09:39.343 -0500>,<Administrator>,<TOPSPIN>,<proc1d>,<TOPSPIN 2.1>,
      <Start of raw data processing
       efp LB = 0 FT_mod = 6 PKNL = 1 PHC0 = 0 PHC1 = 0 SI = 32K 
       data hash MD5: 32K
       83 06 88 59 C6 96 70 A9 1D 40 0A C7 D9 A1 05 1E>)
(   3,<2012-04-04 13:09:39.687 -0500>,<Administrator>,<TOPSPIN>,<proc1d>,<TOPSPIN 2.1>,
      <pk PHC0 = 213.2831 PHC1 = 0 
       data hash MD5: 32K
       9C 1C 2A F6 74 04 86 C1 63 83 40 73 D6 90 6B 0A>)
(   4,<2012-04-04 13:09:39.765 -0500>,<Administrator>,<TOPSPIN>,<proc1d>,<TOPSPIN 2.1>,
      <abs ABSG = 1 
       data hash MD5: 32K
       06 9D 77 E9 56 8C 3E D5 45 E0 09 CB 9B E7 B0 7B>)
(   5,<2012-04-04 13:09:39.796 -0500>,<Administrator>,<TOPSPIN>,<proc1d>,<TOPSPIN 2.1>,
      <abs ABSG = 2 
       data hash MD5: 32K
       6A 8C C7 97 17 D0 E6 FB F4 17 9C 7B 63 F4 31 E5>)
(   6,<2012-04-04 13:09:39.828 -0500>,<Administrator>,<TOPSPIN>,<proc1d>,<TOPSPIN 2.1>,
      <abs ABSG = 3 
       data hash MD5: 32K
       2B 10 EF 64 93 27 99 F2 39 34 B8 8C D0 A9 A2 E1>)
(   7,<2012-04-04 13:09:39.859 -0500>,<Administrator>,<TOPSPIN>,<proc1d>,<TOPSPIN 2.1>,
      <abs ABSG = 4 
       data hash MD5: 32K
       60 26 A9 DD 40 8F 98 23 A1 FF 0E 0F 5F C7 5A 0E>)
(   8,<2012-04-04 13:09:40.078 -0500>,<Administrator>,<TOPSPIN>,<proc1d>,<TOPSPIN 2.1>,
      <abs ABSG = 5 
       data hash MD5: 32K
       D8 E3 FD 06 71 6B 7B EF 3D BF B1 F1 D3 7D A2 21>)
(   9,<2012-04-04 13:09:44.062 -0500>,<Administrator>,<TOPSPIN>,<audit>,<TOPSPIN 2.1>,
      <user comment:
       ICON-NMR User ID: COFFEE
       data hash MD5: 32K
       D8 E3 FD 06 71 6B 7B EF 3D BF B1 F1 D3 7D A2 21>)
$$ ##END=
$$ 
$$ [...]
##$TP= (0..7)
150 150 150 150 150 150 150 150
##$TP07= 0
##$TPNAME0= <>
##$TPNAME1= <>
##$TPNAME2= <>
##$TPNAME3= <>
##$TPNAME4= <>
##$TPNAME5= <>
##$TPNAME6= <>
##$TPNAME7= <>
##$TPOAL= (0..7)
0.5 0.5 0.5 0.5 0.5 0.5 0.5 0.5
##$TPOFFS= (0..7)
0 0 0 0 0 0 0 0
##$TUNHIN= 0
##$TUNHOUT= 0
##$TUNXOUT= 0
##$USERA1= <user>
##$USERA2= <user>
##$USERA3= <user>
##$USERA4= <user>
##$USERA5= <user>
##$V9= 5
##$VALIST= <valist>
##$VCLIST= <CCCCCCCCCCCCCCC>
##$VD= 0
##$VDLIST= <DDDDDDDDDDDDDDD>
##$VPLIST= <PPPPPPPPPPPPPPP>
##$VTLIST= <TTTTTTTTTTTTTTT>
##$WBST= 2048
##$WBSW= 25
##$XGAIN= (0..3)
0 0 0 0
##$XL= 0
##$YL= 0
##$YMAX_a= 533291
##$YMIN_a= -652223
##$ZGOPTNS= <>
##$ZL1= 120
##$ZL2= 120
##$ZL3= 120
##$ZL4= 120
##$ABSF1= 14.98061
##$ABSF2= -5.57192
##$ABSG= 5
##$ABSL= 3
##$ALPHA= 0
##$AQORDER= 0
##$ASSFAC= 0
##$ASSFACI= 0
##$ASSFACX= 0
##$ASSWID= 0
##$AUNMP= <proc_prof1d_extract_pilot.lims>
##$AXLEFT= 0
##$AXNAME= <>
##$AXNUC= <1H>
##$AXRIGHT= 0
##$AXTYPE= 0
##$AXUNIT= <>
##$AZFE= 0.1
##$AZFW= 0.1
##$BCFW= 0
##$BC_mod= 0
##$BYTORDP= 0
##$COROFFS= 0
##$CY= 15
##$DATMOD= 1
##$DC= 0
##$DFILT= <>
##$DTYPP= 0
##$F1P= 0
##$F2P= 0
##$FCOR= 0.5
##$FTSIZE= 32768
##$FT_mod= 6
##$GAMMA= 0
##$GB= 0
##$INTBC= 1
##$INTSCL= 1
##$ISEN= 128
##$LB= 0
##$LEV0= 0
##$LPBIN= 0
##$MAXI= 10000
##$MC2= 0
##$MEAN= 0
##$ME_mod= 0
##$MI= 0
##$NCOEF= 0
##$NC_proc= -8
##$NLEV= 6
##$NOISF1= 0
##$NOISF2= 0
##$NSP= 0
##$NTH_PI= 0
##$NZP= 0
##$OFFSET= 14.98061
##$PC= 1
##$PHC0= 213.2831
##$PHC1= 0
##$PH_mod= 1
##$PKNL= yes
##$PPARMOD= 0
##$PPDIAG= 0
##$PPIPTYP= 0
##$PPMPNUM= 2147483647
##$PPRESOL= 1
##$PSCAL= 4
##$PSIGN= 0
##$PYNMP= <proc.py>
##$REVERSE= no
##$SF= 400.13
##$SI= 32768
##$SIGF1= 0
##$SIGF2= 0
##$SINO= 400
##$SIOLD= 32768
##$SPECTYP= <>
##$SREGLST= <1H.CDCl3>
##$SSB= 0
##$STSI= 32768
##$STSR= 0
##$SW_p= 8223.68421052632
##$SYMM= 0
##$S_DEV= 0
##$TDeff= 65536
##$TDoff= 0
##$TI= <>
##$TILT= no
##$TM1= 0
##$TM2= 0
##$TOPLEV= 0
##$USERP1= <user>
##$USERP2= <user>
##$USERP3= <user>
##$USERP4= <user>
##$USERP5= <user>
##$WDW= 1
##$XDIM= 32768
##$YMAX_p= 470746689
##$YMIN_p= -695795
##$CURPLOT= <Network HP LaserJet P1505>
##$CURPRIN= <$Network HP LaserJet P1505>
##$DFORMAT= <normdp>
##$LAYOUT= <+/1D_H.xwp>
##$LFORMAT= <normlp>
##$PFORMAT= <normpl>
##$SURQMSG= 1
$$ End of Bruker specific parameters
$$ ---------------------------------
##NTUPLES= NMR SPECTRUM
##VAR_NAME=  FREQUENCY,     SPECTRUM/REAL,   SPECTRUM/IMAG
##SYMBOL=    X,             R,               I
##VAR_TYPE=  INDEPENDENT,   DEPENDENT,       DEPENDENT
##VAR_FORM=  AFFN,          ASDF,            ASDF
##VAR_DIM=   32768,         32768,           32768
##UNITS=     HZ,            ARBITRARY UNITS, ARBITRARY UNITS
##FACTOR=    0.250966925370066, 1,           1
##FIRST=     8223.43324360095, -97694,       -126966
##LAST=      0,             -187798,         28714
##MIN=       0,             -695795,         0
##MAX=       8223.43324360095, 470746689,    0
$$ Real data points
##PAGE= N=1
##DATA TABLE= (X++(R..R)), XYDATA
$$ [...]
$$ plain form
19466 -240028 159314 23698 7559 -262161 -255783 -81197 17887 -172346 -22914 68376 -41872
19454 -60577 -288313 -291738 28191 -195873 -212641 -133000 -144053 137593 21065 -188541 -167902
19443 -167902 -13257 250004 -20096 -178862 -340907 -217477 5635 33104 -194617 -122896 -248039
19432 -248039 81977 124178 -8804 -35970 -367475 -72956 56661 39122 62614 -77945 -294277
19421 -294277 3533 -186737 260585 94851 -585065 -341325 -276971 176879 172977 173033 -136394
19409 127236 26440 -283036 -58899 139581 -45828 -109605 -324 -72598 51816 -158140 -92531
19398 -92531 12655 -213479 -155913 70124 -330955 -175838 213944 -84332 127972 52971 220434
19387 220434 -42983 10614 -404635 -89870 -9807 91825 -22021 9886 -151889 -69253 -252108
$$ packed form
19466b40028A59314B3698G559b62161O378h1197A7887a72346b2914F8376d1872
19454f0577k27736l425B8191a95873j6768P9641j1053A37593B1065a88541K0639
19443a67902a3257B50004b0096j58766j62045J23430E635K7469a94617P1721j25143
19432b48039H1977M2201h804k7166l31505g2956E6661j7539K3492g7945k16332
19421b94277C533a86737B60585I4851e85065K43740O4354A76879l902N6a36394
19409A27236B6440b83036e8899A39581d5828o3777c24p2274E1816a58140O5609
19398i2531A2655b13479N7566G0124c30955J55117B13944h4332A27972E2971J67463
19387B20434d2983A0614d04635h9870i807I1825b2021I886a51889f9253j82855
$$ plain form
19376 -252108 -226 154487 -187636 -274115 3644 55889 -124227 -27693 243787 13748 -239848
19364 321766 -149581 -39277 141871 -66858 -32411 -139667 -67729 -2480 -484146 -206151 -378912
19353 -378912 -5162 -37401 -11956 -151118 -170079 35591 -71022 -141542 47346 -196328 117000
19341 -234899 -57230 -149971 -112610 -287739 -228401 -389972 37538 -142216 7050 -401905 -23361
19329 -234609 168717 59963 -31616 -362601 -68551 -27257 -199674 56275 31450 -183625 26033
19317 -220131 -122659 148672 -5335 -216732 -200807 -12917 242688 139652 -89353 -414944 -316073
19306 -316073 -178436 -36978 -294266 -125149 244989 -184484 -288669 -95220 -164037 -134934
19296 -134934 121699 -160355 -125188 -137846 -230744 263774 184912 -225678 85595 39738 120777
$$ packed form
19376b52108b26A54487a87636q6479C644N2245a24227b7693B43787A3748b39848
19364C21766a49581c9277A41871f6858c2411j07256f7729b480m81666b06151j72761
19353c78912e162l2239a1956j39162j8961C5591g1022p0520D7346a96328A17000
19341b34899e7230r2741L7361j75129N9338j61571C7538a42216G050d01905b3361
19329b34609A68717E9963c1616l30985f8551b7257j72417E6275k4825a83625B6033
19317b20131R7472A48672e335k11397J5925a2917B42688j03036h9353l25591R8871
19306c16073J37637c6978k57288a25149B44989a84484j04185i5220o8817K9103
19296a34934A21699a60355L5167j2658r2898B63774p8862b25678H5595C9738Q1039
$$ plain form
19285 120777 -144759 -246019 -160891 39680 -49331 8120 -73223 89576 -321708 -216550 224032
19273 -96861 97433 -18674 62822 -234620 -34566 -128685 -113245 147105 -200225 -281869 -167465
19262 -167465 -148240 70744 -215849 -23694 135591 64448 78531 55899 -86819 -126242 9417
19250 34780 103286 -61473 102802 -204699 -373905 -294374 -9429 -123552 32039 20150 -156202
19238 108258 -284805 81928 1355 -90648 -91769 -88740 49037 -386892 -207325 -71838 63465
19226 -153417 -66920 105479 -188426 -93478 -43662 -312417 -58869 -133205 -232657 23362 -56319
19214 320539 292980 -242520 -230567 68275 -242057 197760 -220655 -212231 -55676 -123581 198048
19202 57621 -164984 -199326 -102933 -269189 -19770 28387 100130 59548 121737 13304 -226027
$$ packed form
19285A20777a44759j01260Q5128C9680d9331H120g3223H9576c21708J05158B24032
19273i6861I7433a8674F2822b34620c4566r4119J5440A47105b00225q1644J14404
19262a67465J9225G0744b15849b3694A35591F4448J4083k2632h6819l9423I417
19250C4780O8506f1473A02802b04699j69206P9531i429j14123C2039j1889a56202
19238A08258b84805H1928A355i0648j121L029D9037c86892J79567g1838F3465
19226a53417f6920A05479a88426i3478d3662k68755e8869p4336r9452B3362e6319
19214C20539k7559b42520J1953F8275b42057A97760b20655Q424e5676o7905A98048
19202E7621a64984l4342R6393j66256a9770B8387P1743m0582O2189A3304b26027
$$ plain form
19190 -255288 -307517 -399204 275453 127391 -103279 197884 -93239 -139076 -4222 100480 64915
19179 64915 -165468 -24796 -111228 -68990 -46041 -43563 -129273 -71370 -94036 -243410 -156225
19168 -156225 -190188 -127139 -402062 13223 -76618 -105662 -32860 -44320 -365051 -98917 -161510
19157 -161510 74256 -289757 -372417 -161503 14363 -213927 -36978 -16553 68905 135043 -150761
19145 381020 -349312 -346047 -422619 -129187 -152273 96940 116450 -138007 -171429 -88324 -33448
19133 -169329 80434 -145116 104587 -33625 31764 -75500 248568 -65162 -12590 -367474 225309
19121 -289676 -165142 149632 -63117 -265070 74765 57331 341555 -28492 -288777 141544
19110 228010 -30811 -20726 190184 142824 -231997 -168101 69978 -250216 64100 10521 231933
$$ packed form
19190b55288n2229r1687B75453A27391a03279A97884i3239m5837d222A00480l5565
19179F4915a65468b4796q6432M2238K2949K478q5710N7903k2666j49374Q7185
19168a56225l3963O3049k74923A3223g6618k9044c2860j1460l20731i8917o2593
19157a61510G4256b89757q2660a61503A4363b13927c6978a6553F8905O6138a50761
19145C81020c49312L265p6572a29187k3086I6940J9510a38007l3422Q3105c3448
19133a69329H0434a45116A04587c3625C1764g5500B48568f5162a2590l54884B25309
19121b89676J24534A49632f3117k01953G4765j7434K84224b8492k60285A41544
19110B28010c0811J0085A90184m7360b31997O3896F9978b50216F4100A0521K21412
$$ plain form
19099 231933 -237830 -163901 -183458 15520 -391166 -386921 151524 -1676 -185110 -86920 74334
19087 102710 -391335 239992 -156420 -61089 -195531 87702 100499 -101683 103648 119930
19077 119930 -53895 15835 -492476 -5468 -96137 -224377 -54676 -292317 -175730 -144421 -118642
19066 -118642 26597 -295657 -217897 150522 -268148 -52015 -26921 -36684 245317 -86798 184925
19054 16625 -176 -116006 213327 100405 183506 -311793 -11973 -98120 53126 -105729 -190604
19043 -190604 45783 -116389 -47471 144148 -96431 -138413 -46300 163915 331803 38292 -53903
19031 -119039 61997 -219146 226371 -234446 -39109 -343905 112180 10791 -305737 -65243
19020 -128525 -248487 238649 -395248 187447 38913 -37516 182075 -2254 -152501 -161096 67764
$$ packed form
19099B31933b37830P3929j9557A5520c91166M245A51524a676j83434h6920G4334
19087A02710c91335B39992a56420f1089j34442H7702J2797a01683A03648J6282
19077A19930e3895A5835d92476e468r0669j28240e4676k37641J16587L1309K5779
19066a18642B6597b95657P7760A50522b68148e2015K5094r763B45317h6798A84925
19054A6625a76j15830B13327A00405Q3101c11793a1973q6147E3126a05729q4875
19043a90604D5783a16389d7471A44148i6431m1982d6300A63915J67888C8292e3903
19031a19039F1997b19146B26371b34446c9109l04796A12180A0791c05737f5243
19020a28525j19962B38649c95248A87447C8913c7516A82075b254j50247q595F7764
$$ plain form
19008 -72971 150268 247521 -172030 -133747 68072 -23691 -86787 185661 -80777 90674 -52774
18996 -88218 -127300 -18377 -81578 -233390 -175540 -202164 295015 -44893 26896 -67706 340924
18984 22785 -156218 103563 -126893 -343974 48677 -218885 75753 7317 39116 -156036 -111637
18973 -111637 -163561 133330 224233 -234470 -111393 -260498 -228705 -181184 -302550 -136621
18962 -72749 197656 -96830 156849 -7422 226241 474171 608759 551202 -13773 -94833 -188423
18951 -188423 -48711 -17451 -117734 222322 -193894 -202181 166101 -86949 -161722 -3663 73375
18939 -22713 -180420 237274 392918 -88767 7857 130071 109198 139607 -32453 -82517 -34606
18927 12195 -80509 67513 109799 162531 -376998 -345285 -35707 63130 -71161 -79993 -10152 67079
$$ packed form
19008g2971A50268R7253a72030L8283F8072b3691o3096A85661h0777I0674e2774
18996h8218l9082a8377o3201j51812N7850k6624B95015d4893B6896f7706C40924
18984B2785a56218A03563a26893k17081D8677b18885G5753G317L1799a56036M4399
18973a11637n1924A33330R0903b34470a11393j49105L1793M7521j21366a36621
18962g2749A97656i6830A56849g422B26241K47930J34588n7557a3773q1060r3590
18951a88423d8711a7451j00283B22322a93894q287A66101h6949p4773c663G3375
18939b2713j57707B37274J55644h8767G857J22214k0873L0409c2453n0064c4606
18927A2195h0509F7513M2286N2732c76998L1713c5707F3130g1161q832a0152F7079
$$ plain form
18914 -327718 -79733 -107258 -39018 -295761 -105893 -88403 -273942 -187444 -154699 161627 -280298
18902 -291677 219237 84709 54790 218563 -141246 15721 356007 360726 405833 263696 112999
18890 38058 49945 67673 58092 42061 -147209 34869 170752 -105675 5491 -132935 -71430
18879 -71430 -304317 20670 81569 -41249 -45425 236628 -87750 -176839 -400122 -270190 -260633
18868 -260633 16160 47721 360978 142051 139156 -261706 71020 -253767 -109428 90972 -345198
18856 -166661 -470037 26894 24891 121060 370710 -283185 -151198 46922 73570 98088 351211
18845 351211 234564 -218531 201055 254829 237396 -328053 -195923 -121142 123319 -187830
18834 -143612 181835 143415 -1441 -209991 -62809 147985 -283797 -311081 167745 -97539 49587
$$ packed form
18914c27718g9733k7525c9018k56743a05893J7490j85539Q6498L2745A61627b80298
18902b91677B19237H4709k9919J63773a41246A5721L40286M719M5107j42137A12999
18890C8058J1887J7728r581j6031a47209C4869J35883a05675E491a32935O1505
18879g1430k32887B0670O0899d1249m176B36628h7750q9089k23283J29932R557
18868b60633A6160L1561L13257A42051k895b61706G1020b53767a09428I0972c45198
18856a66661l03376B6894k003R6169K49650b83185J31987D6922K6648K4518K53123
18845C51211j16647b18531B01055N3774j7433c28053J32130P4781A23319a87830
18834a43612A81835l8420a441k08550f2809A47985b83797k7284A67745i7539D9587
$$ plain form
18822 -108657 -190387 91740 51159 -93704 12253 -28095 -295347 -121954 66047 -101937 -207028
18811 -207028 104385 27316 -103313 -45445 -180631 -212601 -167261 84413 -335271 -233150
18801 -233150 -321941 -156643 -49040 -68051 41465 34289 -38572 266244 34453 182844 11433
18789 138286 112668 -149376 -166890 -110328 -67878 -66490 -246028 -152385 93672 -148066 -360984
18778 -360984 -344728 -83376 130627 -238154 -446556 20397 384534 149011 73673 154951
18768 154951 -101080 -87380 -71741 -168677 -149575 -172109 -33525 -27809 12932 51302 124372
18757 124372 -241519 70309 72919 -433090 -83738 -124055 -184126 223382 113637 3392 -25427
18745 199485 -297578 -296104 -60061 -475024 -156654 -98219 -486662 -6302 -148386 -81085 -185695
$$ packed form
18822a08657q1730I1740m0581i3704A2253b8095k67252a21954F6047a01937j05091
18811b07028A04385B7316a03313d5445j35186l1970M5340H4413c35271J02121
18801b33150q8791a56643d9040j9011D1465p176c8572B66244C4453J48391A1433
18789A38286k5618a49376j7514N6562M2450J388j79538R3643I3672a48066k12918
18778c60984J6256h3376A30627b38154k08402B0397L64137A49011G3673Q1278
18768A54951a01080J3700J5639r6936J9102k2534c3525N716A2932L8370P3070
18757A24372b41519G0309K610d33090h3738m0317o0071B23382j09745C392b5427
18745A99485b97578J474f0061m14963a56654N8435l88443f302j42084O7301j04610
$$ plain form
18734 -185695 -32091 153494 -22361 -100235 71319 142919 -393819 -95946 230012 120621 208219
18723 208219 -337484 -316361 100730 2768 -114185 130772 -364596 -488950 -309971 35373
18712 -86620 -83126 54981 111710 -174215 192247 -2875 -121924 -2155 45133 -264653 10808
18700 -305317 -531 216741 -158370 -40625 -34359 49906 14327 -304839 -31566 70073 263363
18689 263363 87497 73711 -302883 -174010 131035 -235672 -85153 -187031 83532 75235 42809
18678 42809 70601 -76093 279618 175768 16465 24095 82076 67698 220769 -78843 38857
18666 -346848 127855 116978 -119975 -294635 180920 -36403 -75245 227434 185451 -68813
18655 -185884 49774 -311545 -373793 -14211 -211906 -234098 -177322 -325877 28073 -127494 20362
$$ packed form
18734a85695c2091A53494b2361p7874G1319P1600c93819i5946B30012j09391Q7598
18723B08219c37484K1123A00730B768a14185A30772c64596j24354J78979C5373
18712h6620L494E4981N6729a74215A92247b875j19049b155D5133b64653A0808
18700c05317e31B16741a58370d0625O266D9906A4327c04839c1566G0073J93290
18689B63363H7497j3786c02883J28873A31035b35672h5153j01878H3532q297l2426
18678D2809K7792g6093B79618j03850A6465P630N7981j4378J53071g8843C8857
18666c46848A27855j0877a19975j74660A80920c6403l8842B27434m1983f8813
18655a85884D9774c11545o2248a4211j97695k2192N6776j48555B8073a27494B0362
$$ plain form
18643 122885 -118834 144139 152079 235662 -122918 78879 -78860 -93067 -164934 -142273 280449
18631 -289913 146870 -72297 367384 -165143 -259373 103526 153431 58357 15645 83630 -247776
18619 -294149 -43418 -292987 174076 -56231 -343936 -223961 94501 12066 -197523 1551 -12506
18607 -49569 286386 38936 -89609 -160428 376445 2870 70618 -72729 -161851 -61505 -106342
18596 -106342 -52940 107264 214731 109841 -253730 -72916 49849 -148987 137806 -165192
18585 2772 -42424 -391584 -142389 -111585 -132512 25110 67634 -33915 12400 -240246 288729
18573 -66850 -191838 -237292 60410 -47434 160695 98953 357552 -198692 -288745 121196 -130303
18561 2949 -232909 79127 140387 -135958 -117956 118725 -10909 -329498 -236711 -237274 -21281
$$ packed form
18643A22885a18834A44139P940Q3583a22918G8879g8860j4207p1867K2661B80449
18631b89913A46870g2297C67384a65143r4230A03526M9905E8357A5645O7985b47776
18619b94149d3418k49569A74076e6231k87705J19975I4501A2066a97523A551a2506
18607d9569B86386C8936h9609p0819C76445B870O7748g2729q9122f1505m4837
18596a06342e2940A07264J07467j04890b53730g2916D9849a48987A37806a65192
18585B772d2424l49160a42389L0804k0927B5110M2524c3915A2400b40246B88729
18573f6850j24988m5454F0410d7434A60695o1742K58599a98692r0053A21196a30303
18561B949b32909G9127O1260a35958J8002A18725a0909l18589R2787n63b1281
$$ plain form
18549 -7215 -161503 -216665 -249166 -49155 -228300 132424 -297745 13416 257488 110729 -72909
18537 33571 48696 -141847 -331511 -328659 6838 -130658 -204106 -47178 265279 46365 -69313
18525 -226609 -224237 -53798 -75067 127198 -334259 -228755 62685 -17423 148804 12187 -252660
18513 -187626 -151252 -298408 52479 366827 -1177 -19651 85176 -134814 -290176 -233428 -347114
18502 -347114 -134089 -214410 -232311 43071 -49492 35798 -58359 174288 55779 -42565 -19317
18490 169858 263515 73556 230316 235261 -27035 -288648 105128 -107161 -120371 -116078 -225195
18479 -225195 -24719 -316161 -56712 290667 -122241 -26598 251277 240535 -275402 -282207 -533073
18468 -533073 -84 168256 -289406 2187 6920 195239 -164139 91166 -82416 -213355 96395
$$ packed form
18549g215j54288n5162l2501d9155j79145A32424b97745A3416K44072A10729g2909
18537C3571J5125a41847j89664K852F838a30658p3448d7178B65279D6365f9313
18525b26609K372e3798k1269A27198c34259J05504F2685a7423A48804A2187b52660
18513a87626L6374j47156E2479L14348a177j8474H5176a34814j55362N6748j13686
18502c47114a34089q0321j7901D3071d9492C5798e8359A74288E5779d2565a9317
18490A69858R3657G3556J56760M945b7035k61613A05128a07161j3210M293j09117
18479b25195b4719k91442e6712B90667a22241b6598B51277j0742b75402o805k50866
18468e33073h4A68256b89406B187M733J88319a64139I1166h2416j30939I6395
$$ plain form
18456 -35680 -165595 -289383 -26716 60877 61486 144693 -141949 -28800 281240 -273621 65573
18444 -177636 253543 93079 -141268 -115771 -71198 -91661 187152 -125527 -106382 -240406
18434 -240406 -109742 -318344 -260661 -37944 -87008 -181598 26195 -95961 -285694 -277632 70637
18422 -34099 67723 -81355 72239 -79315 -227753 -237066 84987 216839 116238 55363 -570949
18410 35628 -135909 163005 11831 -61796 -83909 16335 -26288 23480 -326303 130743 -235692
18398 -77746 -136201 4997 48162 -23746 36526 78404 -24142 -168480 -20631 -142765 195085
18386 342263 -44709 519850 -307799 -108139 -93651 -47854 48295 46149 -332875 86705 125751
18375 125751 143296 153227 128390 -122434 44544 -18265 -120650 -246068 114400 -140943 170265
$$ packed form
18456c5680j29915j23788b6716F0877O09Q3207a41949b8800B81240b73621F5573
18444a77636B53543I3079a41268K5497M4573k0463A87152a25527J9145j34024
18434b40406a09742k08602N7683c7944m9064r4590B6195i5961j89733Q062G0637
18422c4099F7723h1355G2239g9315j48438r313H4987J31852j00601E5363e70949
18410C5628a35909A63005A1831f1796k2113A6335b6288B3480c26303A30743b35692
18398g7746n8455D997M3165b3746C6526M1878b4142j44338b0631j22134A95085
18386C42263d4709E19850c07799a08139J4488M5797D8295k146c32875H6705L9046
18375A25751J7545R931k4837a22434D4544a8265j02385j25418A14400a40943A70265
$$ plain form
18363 -34167 198869 -227307 -62655 -168140 46710 195438 -151531 -166986 -178992 179505
18352 -55334 -86847 38301 -196308 -48188 -196048 1822 63383 -47260 310828 175645 95124
18341 95124 142105 86645 -237417 193534 -47369 -282413 15777 -395914 -261028 128488
18330 -58235 149635 -143902 -314662 36950 59044 6415 -154554 6519 -173655 160456 78870
18318 80206 -78192 98965 33248 280059 -695795 -177762 214296 -118813 -202057 -158363 62565
18306 -254480 -185866 18081 -135992 121271 -91455 11976 -243736 -36577 -22689 -64223 -112096
18295 -112096 62554 -168581 -71505 -18519 248452 63428 -183249 -100753 355758 81708 -181987
18283 -123711 13690 -44475 301684 -176963 -330274 -96851 -14295 129019 223737 -162228
$$ packed form
18363c4167A98869b27307f2655j05485D6710J48728a51531j5455j2006A79505
18352e5334l1513C8301a96308d8188j47860A822O1561d7260C10828j35183q0521
18341I5124M6981n5460b37417A93534d7369k35044A5777c95914J34886A28488
18330e8235A49635a43902j70760C6950K2094F415a54554F519a73655A60456G8870
18318H0206g8192I8965C3248K46811f95795a77762B14296a18813q3244M3694F2565
18306b54480O8614A8081a35992A21271i1455A1976b43736c6577J3888m1534m7873
18295a12096F2554a68581g1505a8519B48452F3428a83249Q2496C55758H1708a81987
18283a23711A3690d4475C01684a76963j53311i6851a4295A29019R4718a62228
$$ plain form
18272 -166542 2344 -364102 37634 112239 -172543 186150 -235746 -26731 -14326 -149763 -131431
18261 -131431 -155189 -204102 66781 230540 45322 -189879 -144780 -160315 124595 -65192 -21759
18249 -111819 -248640 -144172 -22037 168322 -483125 -85267 -65205 -91622 8131 -68019 62011
18237 58873 -327598 -188045 6716 -207866 -105623 -21599 144889 -121564 185027 144047
18227 144047 342505 -341485 -117250 -372784 -197543 -110213 -195283 -243574 -188780 -66898
18216 235856 -296773 -2915 -170509 104946 -115829 -53475 181734 -3283 108915 -246316
18205 -391004 130795 -182942 -197726 62215 -143430 103773 -103865 146202 -130873 -207062
18195 -207062 192736 51849 56833 -23656 -277157 274930 -235124 16805 147073 4075 81834
$$ packed form
18272a66542B344c64102C7634P4605a72543A86150b35746b6731J2405j35437J8332
18261a31431k3758m8913F6781J63759D5322a89879M5099j5535A24595f5192b1759
18249a11819j36821J04468b2037A68322d83125h5267K0062k6417H131f8019F2011
18237E8873c27598J39553F716b07866J02243b1599A44889a21564A85027m0980
18227A44047J98458c41485a17250k55534J75241Q7330q5070m8291N4794f6898
18216B35856b96773b915j67594A04946a15829e3475A81734c283A08915b46316
18205c91004A30795a82942j4784F2215a43430A03773a03865A46202a30873p6189
18195b07062A92736E1849M984b3656k53501B74930b35124A6805J30268D075P7759
$$ plain form
18184 81834 140536 -52290 -30653 79505 98897 145247 -99920 -53216 -71775 19119 65251 -283580
18171 67575 278411 -254455 135120 -90040 157263 216840 -72925 115166 -237367 29121
18160 -116041 -253651 -16799 293205 -269804 -142447 -94335 185214 212162 -75877 49017
18149 118305 524019 49848 -160864 27943 103806 129125 -37579 -102827 -65794 -118628 68678
18137 -236736 -77002 46212 -164477 -23203 -492 -128264 -186311 -31912 15380 -620654 98690
18125 -64970 -259927 56398 -49444 -11713 -205206 8 37226 42230 -63710 -278140 144839 137942
18113 137942 -102466 -64863 156697 -225183 282127 86919 317265 -32213 -41268 136794
18102 80124 -60080 151967 204351 131301 -48587 -31002 80858 -133733 -70018 -291798 60382
$$ packed form
18184H1834N8702e2290K1637G9505J9392M6350i9920M6704j8559A9119M6132b83580
18171F7575K10836b54455A35120i0040A57263N9577g2925A15166b37367B9121
18160a16041j37610a6799B93205b69804J27357M8112A85214K6948g5877D9017
18149A18305M05714D9848a60864B7943P5863K5319c7579o5248L7033n2834F8678
18137b36736g7002D6212a64477b3203d92j27772n8047c1912A5380f20654I8690
18125f4970j94957E6398d9444a1713j93493HL7218N004f3710k14430A44839o897
18113A37942a02466L7603A56697b25183B82127H6919K30346c2213r055A36794
18102H0124f0080A51967N2384p3050d8587J7585H0858a33733O3715k21780F0382
$$ plain form
18090 31474 -5809 -109754 121178 43554 38929 103333 137817 -42434 128358 4682 -119812
18078 37342 -120615 99266 -124098 -23536 129314 97553 -83507 -61437 -152969 -168412 -210497
18067 -210497 -242694 -129947 100411 -12343 56745 -38744 -246602 124923 -102048 -125988
18057 -125988 193110 11053 -88627 172981 245904 365565 1647 171740 -46804 85611 -44509
18045 38966 -209265 97582 -326197 -8933 122014 61877 -83464 260436 36827 -117671 161113
18033 77476 48747 -136605 183930 7544 167551 222289 -14206 -58733 -183587 266993 29721
18021 -368173 10156 121354 92923 -56668 23241 -13344 378712 203624 -73609 -324922 -64607
18009 -73508 3729 220660 -179668 -57033 303455 -200471 295046 -167465 60211 123894 211573
$$ packed form
18090C1474e809j03945A21178D3554m625O4404L4484d2434A28358D682a19812
18078C7342a20615I9266a24098b3536A29314l1761h3507K2070r1532j5443m2085
18067b10497l2197J12747A00411a2343E6745c8744k07858A24923a02048k3940
18057a25988A93110A1053h8627A72981P2923J19661A647J70093d6804H5611d4509
18045C8966b09265I7582c26197h933A22014o0137h3464B60436C6827a17671A61113
18033G7476k8729a36605A83930G544J60007N4738a4206m4527j24854B66993B9721
18021c68173A0156J11198k8431e6668B3241a3344C78712j75088g3609k51313f4607
18009g3508C729K16931a79668e7033C03455b00471B95046a67465F0211O3683Q7679
$$ plain form
17998 211573 -331126 62834 4433 -58811 -123943 12326 84052 21227 27456 -11048 -75124 -165083
17986 -165083 91483 -149694 -173334 -153839 -91502 -167229 82840 129278 -168545 133174 99832
17975 99832 66244 189952 -182014 73778 39017 199572 -288298 -45794 118675 -178873
17964 244007 136604 -8117 58756 -335982 -91470 49179 153348 181386 -224883 86695 320738
17953 320738 36939 37066 -57930 -75828 45837 206472 44659 76453 112583 -265367 319685
17941 211968 -50166 -246778 75446 -293392 -28455 159535 -155164 78260 -328660 53530
17930 -79981 13943 197354 -10975 -84249 -8699 -79319 106688 131548 31242 39224 264379
17919 264379 -473135 -34368 -248037 -96423 -44992 29089 339401 177336 53384 -235351
$$ packed form
17998B11573c31126F2834D433e8811o5132A2326P1726B1227O229a1048o4076q9959
17986a65083I1483a49694k3640J9495O2337p5727H2840M6438a68545A33174l3342
17975I9832l3588J23708a82014G3778l4761J60555b88298d5794A18675a78873
17964B44007j07403h117E8756c35982i1470D9179J04169K8038b24883H6695K34043
17953C20738C6939J27e7930j7898D5837J60635D4659L1794L6130b65367C19685
17941B11968e0166j96612G5446b93392b8455A59535a55164G8260c28660E3530
17930g9981A3943J83411a0975p3274h699p0620A06688K4860C1242P982K25155
17919B64379d73135c4368k13669i6423d4992B9089L10312j62065E3384b35351
$$ plain form
17908 31036 -455904 -192672 -9369 452102 90611 84645 -113155 443389 -78735 -124034 -311126
17897 -311126 -147231 -93834 191837 80258 -20647 96299 237172 39033 61819 146608 133657
17886 133657 142707 95027 71827 312343 106599 -257644 217474 133169 228540 190279 66220
17874 281397 65 88120 -9636 -165431 81694 135898 -568524 -181953 350455 -85073 216230
17862 -78639 293424 226256 -348237 -58198 3815 72342 395732 286001 -175434 86685 120817
17851 120817 -55770 158082 100816 240076 221468 -126334 163587 -53869 -216545 211385
17840 -172382 60458 -247212 -125934 -20015 1501 -192137 254007 -28570 -205008 -229815 158696
17828 -252935 -130832 39385 -20543 -132943 -263796 149442 53964 5377 114981 205496 -90427
$$ packed form
17908C1036d55904a92672i369D52102I0611n966a13155D43389g8735m5299j87092
17897c11126a47231N3397A91837H0258b0647I6299J40873C9033K2786Q4789j2951
17886A33657R050m7680k3200K40516A06599b57644B17474q4305R5371l8261F6220
17874B81397F5Q8055i636j55795H1694N4204e68524a81953C50455h5073B16230
17862g8639B93424o7168c48237e8198C815O8527L23390j09731a75434H6685L4132
17851A20817e5770A58082n7266J39260j8608a26334A63587e3869j62676B11385
17840a72382F0458b47212J21278b0015A501a92137B54007b8570j76438k4807A58696
17828b52935J22103C9385b0543j12400j30853A49442E3964E377J09604R0515i0427
$$ plain form
17816 -164223 -189893 223651 -161249 320584 -137691 169352 -43511 -253474 240698 -18890
17805 -260089 102538 121050 -114925 342133 -61959 67514 128469 150040 302720 -206778
17794 -5746 -175940 -233543 262839 -125274 39661 100583 94847 218540 -171226 154143 276023
17783 276023 -118331 -276960 -25464 -84311 215546 -201461 101497 -31286 3237 45030 -109431
17771 34346 -137954 104077 67917 75958 306953 -188603 71990 -24366 79025 -37769 -134920
17760 -134920 200411 78917 232898 262200 99069 267513 424674 65392 45110 355582
17750 355582 274822 15636 142998 162150 90758 335891 28295 -33462 398744 -81376 50624
17738 17656 -50113 87648 168830 146443 -158338 -136348 198306 91015 354744 16042 234180
$$ packed form
17816a64223k5670B23651a61249C20584a37691A69352d3511k09963B40698a8890
17805b60089A02538J8512a14925C42133f1959F7514O0955K1571J52680b06778
17794e746j70194n7603B62839a25274C9661O0922n736J23693a71226A54143J21880
17783B76023a18331j58629b5464n8847B15546b01461A01497c1286C237M1793a09431
17771C4346a37954A04077l6160Q041K30995a88603G1990b4366G9025c7769r7151
17760a34920B00411G8917J53981K9302I9069J68444J57161F5392k0282L10472
17750C55582q0760A5636J27362J9152p1392K45133B8295c3462C98744h1376E0624
17738A7656e0113H7648Q1182k2387a58338K1990A98306I1015K63729A6042K18138
$$ plain form
17727 234180 131122 312720 -599 246818 -189245 -160626 -427050 83229 108972 -149662 106071
17715 162461 12739 359754 76548 73618 -154422 -58413 165056 123910 15573 200741 141611
17704 141611 140603 194968 53676 453700 -46634 -65659 189011 69133 132620 -84013 -57572
17693 -57572 40716 135754 400026 -168172 155979 1738 159967 23528 83936 -41888 247492
17681 35841 148126 -195200 -185794 173310 236590 -37900 -64196 -197956 195769 -133507 -161651
17670 -161651 -113109 125070 27043 -112296 10828 84758 170891 151526 -64631 -75967 136482
17658 -13112 293996 209808 51247 590260 177179 229341 259719 96627 269372 -168990 72474
17646 -35083 10476 362458 168044 -233979 -164424 -204382 -6114 243344 159334 84771 112285
$$ packed form
17727B34180j03058J81598e99B46818a89245K8619k66424H3229K5743a49662A06071
17715A62461A2739L47015G6548k930a54422e8413A65056m1146A5573J85168n9130
17704A41611j008N4365E3676M00024d6634j9025A89011F9133O3487h4013K6441
17693e7572D0716R5038K64272a68172A55979A738J58229B3528O0408d1888B47492
17681C5841J12285a95200R406A73310O3280c7900k6296j33760A95769a33507k8144
17670a61651M8542A25070B7043a12296A0828P3930Q6133j9365f4631j1336A36482
17658a3112B93996q4188E1247N39013A77179N2162L0378I6627J72745a68990G2474
17646c5083A0476L51982A68044b33979O9555l9958f114B43344q4010p4563K7514
$$ plain form
17635 112285 92109 -11641 85255 91935 -31305 396549 147780 -18929 462217 -111998 340294
17623 46372 112850 -50229 81615 -2849 19173 8980 121755 116815 230797 17915 21680 -69256
17610 19429 181853 -9893 247122 -174474 285150 135538 84246 8757 248651 493656 -51598
17598 101894 -168413 150939 49831 51645 138923 224158 157323 -37741 373985 -202875 159376
17586 42054 77737 285797 261069 59373 -246980 -144536 -159474 250407 -1409 239355 -25205
17574 248265 210936 -67964 -23505 -168776 -71371 324566 47411 -150479 46019 100839 324253
17563 324253 116673 61576 162406 355921 125329 249645 83577 81174 -247563 -61696
17552 147557 168786 98668 130983 -325758 -69925 39870 87083 268208 1384 318708 456791
$$ packed form
17635A12285k0176a1641H5255O680c1305C96549A47780a8929D62217a11998C40294
17623D6372O6478e0229H1615b849A9173H980J12775m940J13982A7915L765f9256
17610A9429J62424i893B47122a74474B85150A35538n1292H757K39894K45005e1598
17598A01894a68413A50939D9831J814Q7278Q5235o6835c7741C73985b02875A59376
17586D2054L5683K08060k4728E9373b46980J02444j4938B50407a409B39355b5205
17574B48265l7329f7964b3505j45271g1371C24566D7411a50479D6019N4820K23414
17563C24253A16673n5097J00830J93515A25329J24316H3577k403b47563f1696
17552A47557K1229p0118L2315c25758f9925C9870M7213J81125A384L17324J38083
$$ plain form
17541 456791 120344 308220 465295 219668 -55818 34889 75706 302651 -70166 266123
17530 367892 206256 145028 393573 199838 340917 -53477 206828 260142 551659 227087
17519 221112 161705 267679 94620 341492 200765 198047 370538 699735 893458 782346
17509 782346 681658 793934 687185 491171 473515 616707 737689 416257 582606 392887
17499 392887 584395 470915 576458 963636 903243 953195 728947 818575 773727 460847
17489 460847 511340 135519 402344 436319 466054 164324 408534 165923 22627 -13532
17478 504652 276063 398036 380220 198480 110782 -43327 425629 386023 473842 319884
17468 319884 235093 237395 511615 183575 413281 156804 468037 353928 -103004 316890
$$ packed form
17541D56791A20344J87876J57075B19668e5818C4889M0817K26945g0166B66123
17530C67892j61636o1228K48545j93735J41079e3477B06828N3314K91517B27087
17519B21112n9407J05974I4620K46872j40727k718J72491L29197J93723j11112
17509G82346j00688J12276j06749j96014j7656J43192J20982l21432J66349j89719
17499C92887J91508j13480J05543L87178o0393M9952k24248Q9628m4848l12880
17489D60847N0493A35519K66825L3975K9735A64324K44210A65923B2627a3532
17478E04652k28589J21973j7816j81740q7698d3327D25629l9606Q7819j53958
17468C19884q4791K302K74220A83575K29706A56804L11233j14109a03004C16890
$$ plain form
17457 339456 92864 245778 206618 196321 419628 194124 214584 404239 446823 66295 270655
17446 270655 99312 166730 367552 194606 561899 308718 345499 752436 423623 338906
17436 338906 195171 482875 254543 356462 653251 512376 134507 429913 477094 124487
17425 -63642 481484 433997 534485 812096 700568 531105 409890 531423 450881 337817
17415 337817 192843 38561 356035 192200 233070 205118 225215 431847 335267 410169 699306
17404 699306 151543 293308 110844 483789 451968 690431 326957 752609 190009 352601
17394 352601 337843 44445 612401 409473 257470 202514 -58668 250119 243661 402970 475371
17383 475371 78838 356097 75341 31001 148776 382576 168022 221479 364001 113399
$$ packed form
17457C39456I2864J52914l9160j0297K23307A94124K0460J89655M2584F6295K04360
17446B70655I9312O7418K00822j72946L67293k53181L6781M06937l28813q4717
17436C38906j43735K87704k28332J01919K96789j40875A34507K95406M7181A24487
17425f3642D81484m7487J00488K77611j11528j69463j21215J21533q0542j13064
17415C37817j44974C8561L17474j63835M0870k7952K0097K06632r6580P4902K89137
17404F99306A51543J41765A10844L72945l1821K38463C26957M25652A90009J62592
17394C52601j4758D4445N67956k02928j52003n4956e8668B50119o458J59309P2401
17383D75371G8838K77259G5341C1001J17775K33800A68022N3457J42522A13399
$$ plain form
17372 207836 -70576 97706 12307 289204 300412 620187 252964 226310 54699 650284 647483
17361 647483 345053 148461 508693 200469 169763 329737 224159 169419 458089 386318
17351 386318 405228 -310 345440 522254 330893 129592 257093 502550 192502 572083
17341 572083 147245 568649 159541 -53796 -165242 525462 355321 236346 53057 48794
17331 48794 464320 233797 350649 448385 350411 272989 352977 330799 394707 228556 323575
17320 323575 262903 82304 256737 549594 329413 420003 145636 239113 14121 362151
17310 362151 230783 254072 451069 183545 -13125 238807 133141 198838 462482 653257
17300 653257 271640 562988 218555 218095 8079 262429 367341 36907 159447 439376 149777
$$ packed form
17372B07836g0576I7706A2307K76897J1208L19775B52964k6654E4699N95585k801
17361F47483l02430A48461L60232B00469l0706J59974j05578n4740K88670p1771
17351C86318J8910c10C45440J76814j91361A29592J27501K45457A92502L79581
17341E72083A47245M21404A59541e3796j11446E25462j70141j18975E3057m263
17331D8794M15526k30523J16852R7736r7974p7422P9988k2178O3908j66151R5019
17320C23575o0672H2304J74433K92857k20181R0590A45636R3477A4121L48030
17310C62151j31368K3289J96997A83545a3125B38807j05666O5697K63644J90775
17300F53257B71640K91348B18555m60H079K54350J04912C6907J22540K79929A49777
$$ plain form
17288 323225 211837 366341 339845 229116 606444 636974 159094 366354 142583 188675
17278 188675 278571 272541 491068 198992 387596 182126 360592 165007 95397 368129
17268 368129 415670 96845 269115 -5755 418718 -100381 446242 140626 99409 288276
17258 288276 380052 356232 335884 201288 530785 240425 296185 505885 481491 565336 -145500
17246 554395 435379 37182 575165 382104 436381 444741 640291 383445 412768 198318
17235 595510 -13237 487077 366430 110101 122425 401895 550221 770899 119495 322087
17225 322087 597293 213504 322732 423306 263659 419497 101543 723205 305284 416753
17215 416753 448585 339939 170874 441421 406462 631276 248680 277158 226106 146763
$$ packed form
17288C23225j11388J54504k6496j10729L77328L0530A59094K07260A42583M6092
17278A88675Q9896o030K18527A98992J88604A82126J78466A65007o9610K72732
17268C68129M7541I6845J72270e755D18718a00381D46242A40626m1217J88867
17258B88276R1776k3820k0348j34596L29497B40425N5760K09700k4394Q3845a45500
17246E54395j19016C7182N37983j93061N4277Q360J95550k56846K9323A98318
17235E95510a3237D87077j20647A10101J2324K79470J48326K20678A19495K02592
17225C22087K75206B13504J09228J00574j59647J55838A01543O21662C05284J11469
17215D16753L1832j08646j69065K70547l4959K24814B48680K8478n1052p9343
$$ plain form
17205 146763 356366 379576 181084 621707 425645 366167 269005 673526 573784 560175
17195 560175 111909 352978 568568 189309 574909 402764 36131 403401 712789 376818
17185 376818 580133 800578 536158 632027 404676 108879 499128 617773 298515 626294
17175 626294 622522 527894 473306 424370 361826 366113 718334 297353 151246 690541 504042
17164 504042 446754 782260 230725 454138 585291 506772 389194 703028 554788 400800
17154 400800 699697 433816 684246 269843 523981 351747 408464 678781 1028603 439561
17143 530403 290286 336083 419464 641834 558522 400599 408355 431375 692787 693450 552683
17132 552683 670416 667093 578027 491929 450668 309290 618663 714094 595988 361902 589504
$$ packed form
17205A46763K09603K3210A81084M40623j96062n9478r7162M04521r9742j3609
17195E60175A11909K41069K15590A89309L85600j72145C6131L67270L09388l35971
17185C76818K03315K20445k64420R5869k27351A08879L90249J18645B98515L27779
17175F26294l772r4628n4588m8936o2544M287L52221B97353j46107N39295j86499
17164E04042n7288L35506B30725K23413J31153p8519j17578L13834j48240j53988
17154D00800K98897k65881K50430B69843K54138j72234N6717K70317L49822D39561
17143E30403k40117M5797Q3381K22370q3312j57923P756K3020K61412O63j40767
17132E52683J17733l323q9066q6098m1261j41378L09373R5431j18106k34086K27602
$$ plain form
17121 589504 191011 603286 838087 522561 732234 1106924 681732 590546 563063 887265
17111 887265 815610 642594 540998 800176 491305 439901 439802 609325 550211 332477 483596
17100 483596 877607 580372 818055 871114 678279 491653 568225 865935 637068 1070192
17090 1070192 925187 820855 858388 849933 757997 603351 523889 684344 594144 776634
17080 776634 580548 654364 494704 986315 893803 828008 762563 716445 1018747 578938
17070 578938 635731 558808 1017105 687625 916483 522450 522980 1041254 639163 765804
17060 765804 842804 1209626 1222894 1012566 986996 915102 864338 1045243 698629 797109 928922
17049 928922 865267 838743 880382 1194174 722035 1068124 808501 974370 699374 767214
$$ packed form
17121E89504A91011M12275K34801l15526K09673L74690m25192r1186k7483L24202
17111H87265p1655j73016j01596K59178l08871n1404r9J69523n9114k17734J51119
17100D83596L94011k97235K37683N3059j92835j86626P6572K97710k28867M33124
17090A070192j45005j04332L7533q455r1936j54646p9462J60455r0200J82490
17080G76634j96086P3816j59660M91611r2512o5795o5445m6118L02302m39809
17070E78938N6793p6923M58297l29480K28858l94033N30N18274m02091J26641
17060G65804P7000L66822J3268k10328k5570p1894n0764J80905l46614R8480J31813
17049I28922o3655k6524M1639L13792m72139L46089k59623J65869k74996O7840
$$ plain form
17039 767214 963935 876318 753129 820356 1085930 586757 1064412 785584 879755 807327
17029 807327 913455 858370 1122508 1021730 946706 1119624 1186655 916477 906664 1419205
17019 1419205 908403 1013481 939273 1237408 1114970 1182058 1105023 1091151 779319 1042750
17009 1042750 1106584 1193594 1319602 1179430 1335697 1173171 1195113 1096242 918654 1312813
16999 1312813 1134809 1123107 1249328 1179713 1278385 1164122 1131898 1216530 1159049 1229431 1114866
16988 1114866 1234726 1377771 1459305 1463198 1377447 1294228 1269836 1586034 1105068 1396228
16978 1396228 1479431 1628580 1805869 1588299 1349761 1476363 1377787 1446221 1280438 1376898
16968 1376898 1896424 1000787 1658988 1457692 1450439 1764051 1566450 1653674 1303554 1617055
$$ packed form
17039G67214J96721q7617j23189O7227K65574m99173M77655k78828R4171p2428
17029H07327J06128n5085K64138j00778p5024J72918O7031k70178r813N12541
17019A419205n10802J05078p4208K98135j22438O7088p7035j3872l11832K63431
17009A042750O3834Q7010J26008j40172J56267j62526K1942r8871j77588L94159
16999A312813j78004j1702J26221o9615R8672j14263l2224Q4632n7481P0382j14565
16988A114866J19860J43045Q1534L893q5751q3219k4392L16198m80966K91160
16978A396228Q3203J49149J77289k17570k38538J26602r8576O8434j65783R6460
16968A376898N19526q95637O58201k01296p253L13612j97601Q7224l50120L13501
$$ plain form
16958 1617055 1443359 1804916 1662261 1689651 1488481 1549814 1771053 2024780 1982942 1740787
16948 1740787 1720858 1806842 1635592 1870417 1888215 2030225 2079865 1714799 1957044 2458540
16938 2458540 1886035 2007191 2102689 1929553 2203743 2222320 2070699 1628581 1844050 1796360
16928 1796360 1967289 2167636 2155398 2346478 2164677 2271115 2145737 1905307 1892723 2342952
16918 2342952 2387840 2137792 2229829 2394461 2538167 2430185 2435820 2423671 2123394 2502938
16908 2502938 2697177 2616870 2648635 2569224 2792673 2834525 2608787 2644868 2791945 2783662 2702392
16897 2702392 2786744 2915316 2827444 2807588 2566140 3079827 2687844 3269046 2955849 2911147
16887 2911147 3221215 2735056 3013624 3253820 3404682 3402792 3044262 3356230 3157318 3454900
$$ packed form
16958A617055j73696L61557j42655K7390k01170O1333K21239K53727m1838k42155
16948A740787j9929Q5984j71250K34825J7798J42010M9640l65066K42245N01496
16938B458540n72505J21156R5498j73136K74190J8577j51621m42118K15469m7690
16928A796360J70929K00347j2238J91080j81801J06438j25378k40430j2584M50229
16918B342952M4888k50048R2037J64632J43706j07982N635j2149l00277L79544
16908B502938J94239q0307L1765p9411K23449M1852k25738L6081J47077q283q1270
16897B702392Q4352J28572q7872j9856k41448N13687l91983N81202l13197m4702
16887B911147L10068m86159K78568K40196J50862j890l58530L11968j98912K97582
$$ plain form
16877 3454900 3345301 3469721 3668733 3556060 3620552 3732438 3320693 3746624 3615718 4160383
16867 4160383 3925866 4211341 4085380 4023373 4010886 3827927 4266373 4187008 4355180 4355975
16857 4355975 4404781 4264311 4319759 4449671 4729149 4614811 4717092 4809466 4816808 4818804 5011212
16846 5011212 4787187 5166047 5543614 5285406 5386162 5398435 5517968 5641313 5781681 6122984
16836 6122984 5648153 6018100 5679880 5790664 6139553 6338094 6346587 6401182 6690605 6577216
16826 6577216 6877400 6886913 6683248 7217996 7247037 7483702 7462735 8016132 7902533 7546591
16816 7546591 8638134 8112780 8075008 8381993 8747485 8908314 8673319 8922680 9251344
16807 9251344 9332961 9670640 10149335 9832888 10293663 10411624 10616185 10609092 10871057 11214204
$$ packed form
16877C454900j09599J24420J99012j12673O4492J11886m11745M25931j30906N44665
16867D160383k34517K85475j25961o2007j2487j82959M38446p9365J68172P95
16857D355975M8806j40470N5448J29912K79478j14338J02281R2374P342J996J92408
16846E011212k24025L78860L77567k58208J00756J2273J19533J23345J40368L41303
16836F122984m74831L69947l38220J10784L48889J98541Q493N4595K89423j13389
16826F577216L00184R513k03665N34748K9041K36665k0967N53397j13599l55942
16816G546591J091543n25354l7772L06985L65492J60829k34995K49361L28664
16807I251344Q1617L37679M78695l16447M60775J17961K04561p093K61965L43147
$$ plain form
16797 11214204 11472163 11842176 12151934 12553539 12533761 12487870 12638634 13026358 13616049 14197638
16787 14197638 13917325 14415603 14946271 15171893 15528157 15931713 16253983 16623004 17209326
16778 17209326 17177273 17813667 18118015 18815228 19571473 19783148 20278603 20628420 21303320
16769 21303320 21861609 22711818 23118938 23820427 24175540 25193698 25923475 26318208 27233736
16760 27233736 28009770 29236867 30320295 30668718 31756590 32570347 33681242 34916209
16752 34916209 35938811 37127969 38294978 39435264 40740057 42531342 43690959 45301737
16744 45301737 47013643 48604624 50088060 51492752 53703418 55327196 57486056 59160935
16736 59160935 61517311 63733736 65844224 67937954 70723967 73309481 75183650 78324710
$$ packed form
16797A1214204K57959L70013L09758M01605j9778m5891J50764L87724N89691N81589
16787A4197638k80313M98278N30668K25622L56264M03556L22270L69021N86322
16778A7209326l2053O36394L04348O97213P56245K11675M95455L49817O74900
16769B1303320N58289Q50209M07120P01489L55113J018158P29777L94733R15528
16760B7233736P76034J227097J083428L48423J087872Q13757J110895J234967
16752C4916209J022602J189158J167009J140286J304793J791285J159617J610778
16744D5301737J711906J590981J483436J404692K210666J623778K158860J674879
16736E9160935K356376K216425K110488K093730K786013K585514J874169L141060
$$ plain form
16728 78324710 80553038 83810623 86176119 88954295 91507444 94426874 97136447 99747181
16720 99747181 102623142 105152703 107652990 109379967 111960650 113958696 116073100 117723727
16712 117723727 119039352 120337630 121359894 122038857 122368150 122274890 122307283 121585807 121104022
16703 121104022 120002332 118923437 117181342 115286074 113463213 111570921 108946336 106438972
16695 106438972 103897989 101144354 98897119 95627245 93087604 89919440 87305353 84365914
16687 84365914 81848848 79250472 76563256 73565752 71318991 69216207 66323089 64246838
16679 64246838 61837059 59680645 57588597 55645258 53610967 51907736 50008280 48181763
16671 48181763 46525774 44879783 43407191 41765093 40408446 39023012 37796457 36679332
$$ packed form
16728G8324710K228328L257585K365496K778176K553149K919430K709573K610734
16720I9747181K875961K529561K500287J726977K580683J998046K114404J650627
16712A17723727J315625J298278J022264O78963L29293r3260L2393p21476m81785
16703A21104022j101690j078895j742095j895268j822861j892292k624585k507364
16695A06438972k540983k753635k247235l269874k539641l168164k614087k939439
16687H4365914k517066k598376k687216k997504k246761k102784k893118k076251
16679F4246838k409779k156414k092048j943339k034291j703231j899456j826517
16671D8181763j655989j645991j472592j642098j356647j385434j226555j117125
$$ plain form
16663 36679332 35601338 34407355 32777280 32148210 31143126 30281017 29297628 28469678 27543771
16654 27543771 26797055 25890339 25209340 24200492 23639851 22660831 22465877 21609805 21240825
16645 21240825 20801541 19866453 19463398 19064840 18442638 17795947 17357297 17221854 16649337
16636 16649337 16074042 15862030 15425262 15396319 14804445 14296481 13912119 13725254 13402174
16627 13402174 13158776 12826028 12337988 12450165 12087579 11691161 11427621 10964661 10848145
16618 10848145 10669767 10365893 10412797 10033494 9902983 9850834 9571873 9399459 9037577 8738662
16608 8738662 8698522 8369127 8322591 8361977 8029894 7960302 7805783 8043588 7614451 7316105
16598 7316105 7293222 7274719 7076050 6678621 7122834 6806841 6496319 6660548 6408373 6561823
$$ packed form
16663C6679332j077994j193983j630075o29070j005084q62109r83389q27950r25907
16654B7543771p46716r06716o80999j008848n60641r79020j94954q56072l68980
16645B1240825m39284r35088m03055l98558o22202o46691m38650j35443n72517
16636A6649337n75295k12012m36768k8943n91874n07964l84362j86865l23080
16627A3402174k43398l32748m88040J12177l62586l96418k63540m62960j16516
16618A0848145j78378l03874M6904l79303j30511n2149k78961j72414l61882k98915
16608H738662m0140l29395m6536L9386l32083o9592j54519K37805m29137k98346
16598G316105k2883j8503j98669l97429M44213l15993l10522J64229k52175J53450
$$ plain form
16588 6561823 6127175 6354531 5848378 5639459 5941072 5642047 5438691 5432279 5401073 5523231
16578 5523231 5256332 5300007 4973609 5237823 4858609 5110771 4896923 4755413 4577179 4574868
16568 4574868 4630521 4627575 4410243 4656127 4234436 4238974 4149145 4027420 4188382 3573173
16558 3573173 3727590 3514897 4215520 4044092 3871232 3762672 3876506 3934986 3623899 3314683
16548 3314683 3897296 3856321 3385594 3520954 3442869 3254496 3107130 3310446 2664878 2943318
16538 2943318 3362072 3135170 3067413 2785310 2888777 2940770 2850023 2963079 2655228 2457794
16528 2457794 2338709 2763127 2783058 2842013 2396051 2847801 2687375 2790265 2464402 2598861
16518 2598861 2596341 2363060 2499715 2161972 2451112 2338452 2286856 2583049 2133663 1889679
$$ packed form
16588F561823m34648K27356n06153k08919L01613k99025k03356o412l1206J22158
16578E523231k66899M3675l26398K64214l79214K52162k13848j41510j78234k311
16568D574868N5653k946k17332K45884m21691M538q9829j21725J60962o15209
16558C573173J54417k12693P00623j71428j72860j08560J13834N8480l11087l09216
16548C314683N82613m0975m70727J35360p8085j88373j47366K03316o45568K78440
16538B943318M18754k26902o7757k82103J03467N1993r0747J13056l07851j97434
16528B457794j19085M24418J9931N8955m45962M51750j60426J02890l25863J34459
16518B598861k520k33281J36655l37743K89140j12660n1596K96193m49386k43984
$$ plain form
16508 1889679 2201285 2285098 2168909 2043553 2271569 1901905 2209592 2353540 1790469 1848035
16498 1848035 1952206 2012899 2142487 2087397 1509823 1779239 1914446 1739686 1865416 1940776
16488 1940776 1512674 1531018 1719160 1815289 1346975 1350625 1636145 1644445 1894227 1574935
16478 1574935 1674307 1757956 1453029 1883467 1562830 1669257 1632320 1400509 1318660 1333985
16468 1333985 1341022 1511206 1348670 1650839 1545245 1432099 1320042 1176278 1147672 1506619
16458 1506619 1221591 1482004 1304016 1439540 1631369 1598529 1080335 1052059 1178370 1375553
16448 1375553 1184979 1121677 1130080 1550266 1074348 1132273 1410912 1405177 991097 1455270
16438 1455270 1175413 1017496 878974 1173483 1044268 862451 787260 1368019 1308041 978171
$$ packed form
16508A889679L11606Q3813j16189j25356K28016l69664L07687J43948n63071N7566
16498A848035J04171O0693J29588n5090n77574K69416J35207j74760J25730P5360
16488A940776m28102J8344J88142R6129m68314L650K85520Q300K49782l19292
16478A574935R9372Q3649l04927M30438l20637J06427l6937k31811q1849J5325
16468A333985P037J70184j62536L02169j05594j13146j12057j43764k8606L58947
16458A506619k85028K60413j77988J35524J91829l2840n18194k8276J26311J97183
16448A375553j90574o3302Q403M20186m75918N7925K78639n735m14080M64173
16438A455270k79857j57917j38522K94509j29215j81817p5191N80759n9978l29870
$$ plain form
16428 978171 852906 1133522 1278425 991546 1024102 1291028 1101388 1296036 1206162 1079649
16418 1079649 1064302 1081001 947354 831183 1290264 976482 776672 755031 627336 914150
16408 914150 752186 748902 895121 709097 837455 577885 865775 706080 1027183 850544
16398 850544 831242 896695 822583 534819 871348 963095 976014 787606 819699 842704 994442
16387 994442 640211 980341 497150 822133 879513 406566 583779 792768 843217 743628
16377 743628 505701 990993 762104 665643 859002 895994 600447 550712 479555 1035362
16367 1035362 806690 632591 328718 387534 399224 383547 560304 366193 676689 659762
16357 659762 600951 650178 774880 641799 432142 751515 230615 545654 719842 647675
$$ packed form
16428I78171j25265K80616J44903k86879L2556K66926j89640J94648q9874j26513
16418A079649j5347J6699j33647j16171M59081l13782j99810k1641j27695K86814
16408I14150j61964l284J46219j86024J28358k59570K87890j59695L21103j76639
16398H50544j9302O5453p4112k87764L36529R1747J2919j88408L2093K3005J51738
16387I94442l54231L40130m83191L24983N7380D06566J77213K08989N0449r9589
16377G43628k37927M85292k28889r6461J93359L6992k95547m9735p1157N55807
16367A035362k28672j74099l03873N8816J1690j5677J76757j94111L10496j6927
16357F59762n8811M9227J24702j33081k09657L19373B30615L15039J74188p2167
$$ plain form
16347 647675 428112 456988 352797 559074 816921 306355 619486 702907 577949 692720
16337 692720 532098 744800 537088 615390 853371 698336 344187 855323 726488 346225
16326 367082 807486 552261 639714 602882 501336 669450 794065 510452 476976 550529
16316 550529 32285 795175 643929 433626 209204 542135 205229 475862 410181 608647
16306 608647 548414 315820 378011 433682 106956 337183 582871 486832 290595 601820
16296 601820 262132 386259 287644 333558 860910 157793 691889 355550 291551 380605
16286 380605 465657 7225 327081 734156 299200 170561 467980 177639 216596 220784 365902
16275 365902 200309 518864 592767 630341 76861 302347 409014 722658 548911 831548
$$ packed form
16347F47675k19563K8876j04191K06277K57847C06355L13131Q3421j24958J14771
16337F92720j60622K12702k07712P8302K37981j55035C44187N11136j28835C46225
16326C67082M40404k55225Q7453l6832j01546J68114J24615k83613l3476P3553
16316E50529C2285P62890j51246k10303B09204L32931B05229K70633o5681J98466
16306F08647o0233k32594O2191N5671A06956K30227K45688r6039j96237L11225
16296F01820B62132J24127r8615M5914N27352A57793N34096l36339o3999Q9054
16286C80605Q5052G225L19856M07075B99200j28639K97419A77639L8957M188J45118
16275C65902j65593L18555P3903L7574G6861K25486J06667L13644j73747K82637
$$ plain form
16265 831548 277601 512413 660294 -22605 449418 251224 320146 253760 405391 -30773
16254 357070 252152 80737 274942 322375 503547 224145 538647 365948 168892 364945
16244 364945 204776 502087 -17265 540072 245804 440761 337314 47638 -34603 265455
16233 192534 374000 518603 479999 46267 601926 227550 444556 366665 236575 289671
16223 289671 187457 202339 397241 254930 280650 223267 244647 452087 437694 220207
16213 220207 413105 237410 5583 -91487 252716 283650 -24890 51319 347131 133652 159336
16202 159336 194167 383962 464444 -61242 210758 356008 165356 180032 152948 329238
16192 329238 80752 601626 205719 463639 305724 184784 -67142 -126347 367597 41724
$$ packed form
16265H31548B77601K34812J47881b2605D49418j98194O8922o6386J51631c0773
16254C57070j04918H0737J94205M7433J81172B24145L14502j72699A68892J96053
16244C64945j60169K97311a7265E40072B45804J94957j03447D7638c4603B65455
16233A92534J81466J44603l8604D6267N55659B27550K17006p7891j30090N3096
16223B89671j02214J4882J94902j42311K5720n7383K1380K07440j4393k17487
16213B20207J92898j75695E583i1487B52716L0934b4890E1319K95812A33652K5684
16202A59336L4831J89795Q0482f1242B10758J45250A65356J4676k7084J76290
16192C29238H0752N20874B05719K57920j57915j20940f7142n9205C67597D1724
$$ plain form
16181 249083 299783 368092 246802 82619 134598 260946 189349 114087 -41828 -66438 124084
16169 148359 218982 99694 -190405 156937 368517 -174115 387042 579362 343535 262077
16159 262077 149875 324803 -188855 184951 51450 394883 -88321 64549 448019 115966
16148 17356 185781 -134971 240238 3855 52875 365529 220374 279329 235971 309725 385455
16137 385455 171507 237569 315330 102407 -52630 14092 348563 -194295 300976 -54586
16126 83321 132080 135283 281685 351474 247102 -37624 319506 325620 252221 -19565 -87994
16115 -87994 13799 209092 204938 380303 204512 72809 -81441 116082 280477 67979 159501
16104 159501 9463 174856 -33001 39643 109317 445747 226760 136209 -67249 228802 338099
$$ packed form
16181B49083N0700O8309j21290H2619N1979J26348p1597p5262d1828k4610A24084
16169A48359P0623I9694a90405A56937K11580a74115C87042J92320k35827q1458
16159B62077j12202J74928a88855A84951E1450L43433h8321F4549L83470A15966
16148A7356J68425a34971B40238C855M9020L12654j45155N8955m3358P3754P5730
16137C85455A71507O6062P7761A02407e2630A4092L34471a94295C00976e4586
16126H3321M8759L203J46402O9789j04372c7624C19506O114p3399a9565o8429
16115h7994A3799J95293m154J75365j75791G2809h1441A16082J64395F7979R1522
16104A59501I463J65393c3001C9643O9674L36430k18987r0551f7249B28802J09297
$$ plain form
16093 338099 -126492 254070 67479 -287879 196039 274102 -169132 122970 301251 -94323
16082 -162727 42689 16844 -43191 -88172 102105 -370389 204328 -29552 168598 207773 -9325
16070 -265355 30749 -22713 -212853 429315 108941 149867 -163296 172386 51406 -267815
16059 197942 160086 -110951 118319 251186 -51997 -74738 203114 296333 29656 -167369
16048 139446 78593 194102 -79321 -39906 -64994 -58502 -147188 16117 240994 -337096 156959
16036 372485 -85966 117485 473699 374615 -63008 259617 4758 -297638 180181 -193462
16025 -209610 42640 61064 11789 -44702 88756 22833 -104053 326074 40582 -201387 60914
16013 230803 451517 -55134 -158620 105576 85904 149926 18081 -167901 -31032 -138758
$$ packed form
16093C38099a26492B54070F7479b87879A96039P8063a69132A22970J78281i4323
16082a62727D2689A6844d3191m4981A02105c70389B04328b9552A68598L9175i325
16070b65355C0749b2713j90140D29315A08941M0926a63296A72386E1406b67815
16059A97942l7856a10951A18319J32867e1997k2741B03114R3219B9656a67369
16048A39446o0853J15509g9321L9415k5088O492q8686A6117K24877c37096A56959
16036C72485h5966A17485L56214r9084f3008B59617D758b97638A80181a93462
16025b09610D2640J8424A1789d4702H8756B2833a04053C26074D0582b01387F0914
16013B30803K20714e5134j03486A05576j9672O4022A8081a67901c1032j07726
$$ plain form
16003 -138758 322212 222918 -72034 -57459 192674 115453 -75939 8990 19070 47691 17635
15991 -261535 69233 81139 15167 156765 -71733 124850 -75308 -49313 16397 254516 315285
15980 315285 121773 242662 27979 312553 108285 329781 173049 413427 657842 934476
15970 934476 1242345 1167486 808870 941687 658427 298714 321790 156530 -4484 -108388
15960 -108388 21454 237529 235361 -262886 -25301 -239809 316208 20682 110380 106169 400073
15949 400073 -292724 -203901 208449 38455 -648 3823 3556 -32079 -86177 121723 125923 -110689
15936 79583 173346 -31827 -6356 -59644 54396 -27875 353740 133528 -424096 -83972 181504
15924 26789 -80682 165789 -110980 282328 183092 224402 203057 237169 -100408 -70721 298551
$$ packed form
16003a38758C22212r9294g2034J4575A92674p7221g5939H990J0080K8621A7635
15991b61535F9233J1906A5167J41598g1733A24850g5308K5995A6397K38119O0769
15980C15285A21773J20889B7979K84574A08285K21496j56732K40378K44415K76634
15970I34476L07869p4859l58616J32817k83260B98714K3076A56530d484j03904
15960a08388B1454K16075k168b62886b5301k14508C16208B0682Q9698m211K93904
15949D00073b92724Q8823B08449C8455f48C823k67c2079n4098A21723M200a10689
15936G9583R3763c1827f356n3288E4396b7875C53740A33528d24096h3972A81504
15924B6789h0682A65789a10980B82328r9236M1310k1345L4112a00408K9687B98551
$$ plain form
15912 -7739 -79969 39532 53473 157119 111119 -62618 354153 -317329 -27012 226428 -269237
15900 281763 -38379 -125523 -65709 147712 113198 295260 226421 25089 -127078 -255463 -187783
15889 -187783 -93146 -31859 -257988 -59403 -56143 -137831 152206 163570 180444 -58734 195081
15877 -95091 -322328 -39445 -151567 633 -79607 -164815 -156601 169864 -85815 -162362 -96590 -235729
15865 -235729 169500 78227 280265 -245122 -3188 -209629 -229340 -102438 -40702 -266323
15855 -266323 537607 -112942 -144283 -297026 -8889 -333402 360824 -68067 -531309 135521
15844 -160408 -74481 149770 -128053 -241150 24940 61936 311523 29730 53743 400318
15834 400318 -147728 246671 -443505 -233886 174390 -342132 -69759 44293 -24330 -120034
$$ packed form
15912g739p2230C9532J3941J03646m6000f2618C54153c17329b7012B26428b69237
15900B81763c8379q7144N9814A47712l4514J82062o8839B5089a27078j28385O7680
15889a87783i3146c1859k26129e9403L260q1688A52206J1364J6874e8734A95081
15877i5091k27237c9445j12122F33g9607q5208Q214A69864h5815p6547O5772j39139
15865b35729A69500G8227K02038b45122c188k06441j9711a02438d0702k25621
15855b66323E37607a12942l1341j52743h889l24513C60824f8067m63242A35521
15844a60408g4481A49770a28053j13097B4940L6996K49587B9730K4013L46575
15834D00318a47728B46671d43505K09619A74390c42132f9759D4293b4330r5704
$$ plain form
15824 -120034 200780 -2361 128230 46982 72313 -3257 -17329 -7587 -97573 -284528 -88709
15812 90074 -24673 -67421 52827 -146108 140523 -112195 103477 -141875 -120106 -8841 51448
15800 234047 -101370 -72527 10914 34526 -374157 -148243 -11088 188505 -152458 -179661
15790 -179661 6397 -3011 176885 -31428 160673 -25186 42193 113762 -64274 -520833 48091
15778 -30135 -28909 184154 31383 25975 -202841 98846 236671 183503 -11036 192958 -234143
15766 -21124 201602 178925 -223309 1899 -106228 117276 161627 -83885 -19284 -108439 -129779
15755 -129779 42218 -284140 -264386 160795 32191 366546 -242265 132512 -7269 354498
15744 -47721 194866 184692 62840 -39548 211987 43903 -20759 193886 -468501 -373475 134912
$$ packed form
15824a20034B00780b361A28230D6982K5331c257j4072g587q9986j86955h8709
15812I0074b4673m2748E2827a46108A40523a12195A03477a41875K1769h841E1448
15800B34047a01370K8843A0914K3612c74157a48243a1088A88505a52458k7203
15790a79661F397c011A76885c1428A60673b5186D2193P1569f4274m56559D8091
15778c0135J226A84154C1383n408b02841I8846J37825n3168a1036A92958b34143
15766b1124B01602k2677b23309A899a06228A17276M4351h3885a9284q9155k1340
15755a29779D2218b84140J9754A60795C2191L34355b42265A32512g269C54498
15744d7721A94866j0174F2840c9548B11987D3903b0759A93886d68501R5026A34912
$$ plain form
15732 108781 98509 105265 -111364 131233 70024 -178414 45939 127736 -254335 -155000 -203236
15721 -203236 -209521 13173 -224864 -58161 35489 -269341 197538 34656 -82308 43112 25457
15710 25457 -403079 107933 188004 -250315 119555 -53825 -188934 -61119 -284003 -52707
15699 -38674 -270273 88829 -64717 116386 75403 160162 92829 -227679 -346 -198773 -33578
15687 -52667 -256089 -148536 -432246 -59038 3754 -61891 -4314 26588 -214325 -49656 -147106
15676 -147106 -24838 -13203 79777 267941 -136512 200586 27610 172480 352002 55157
15665 -507487 5858 167175 -180336 -306611 294912 -14968 -46849 3745 8952 235556 21862
15653 14908 -123552 44213 -34815 -131445 -64249 337708 59413 53235 -28137 25306 55328
$$ packed form
15732A08781j0272O756a11364A31233o1209a78414D5939Q1797b54335R9335m8236
15721b03236o285A3173b24864e8161C5489b69341A97538C4656h2308D3112j7655
15710B5457d03079A07933Q0071b50315A19555e3825j35109f1119k22884e2707
15699c8674k31599H8829f4717A16386m0983Q4759o7333b27679c46j98427c3578
15687e2667k03422J07553k83710e9038C754f1891d314B6588b14325d9656r7450
15676a47106b4838J1635G9777J88164a36512B00586B7610J44870J79522E5157
15665e07487E858J61317a80336j26275B94912a4968l1881C745N207K26604B1862
15653A4908a23552D4213c4815r6630f4249C37708E9413o178b8137B5306L0022
$$ plain form
15642 55328 54924 -246187 178647 -256311 88848 51316 159322 52545 318577 58355 22825
15630 -42169 -209249 313460 483709 22440 98911 183039 258 -106568 -59271 218613 22833
15618 219795 23161 -25570 -306690 -38016 270866 -135966 -115007 171306 -10182 54090 151956
15607 151956 83581 -23033 183843 -142708 13276 -97948 -3241 -209390 -33629 -78570 211460
15595 321482 -69446 -235340 132654 56208 355 -53808 36688 199505 -8110 -341196 -193232
15584 -193232 106677 -16873 9889 -162559 157940 36497 -64070 -146379 101134 107742 9787
15572 235470 109700 -143901 -75772 279698 120257 -57644 66151 -83307 182623 121302
15562 121302 155422 46834 255856 -128261 40853 -169436 -115560 -26125 -43453 -959 196569
$$ packed form
15642E5328m04b46187A78647b56311H8848l7532J08006E2545K66032E8355B2825
15630d2169j67080C13460J70249B2440P6471Q4128B58a06568M7297B18613B2833
15618B19795B3161b5570k81120c8016B70866a35966K0959A71306a0182E4090R7866
15607A51956o8375b3033A83843a42708A3276i7948c241k06149c3629m4941B11460
15595C21482f9446j65894A32654E6208C55e3808C6688J62817h110l33086J47964
15584a93232A06677a6873I889a62559A57940C6497f4070q2309A01134O608I787
15572B35470A09700a43901O8129B79698A20257e7644F6151h3307A82623o1321
15562A21302L4120D6834K09022a28261D0853a69436N3876b6125j7328i59A96569
$$ plain form
15550 -29196 159634 -74689 42410 -80785 -136962 -86913 -78972 174610 -117886 -86981 100747
15538 115689 -227228 -223256 47450 47509 -97660 -43269 -131151 -78644 -185311 -145045 -187012 92828
15525 -105673 -293570 92669 -176653 121807 -227932 -148894 98177 -110653 152868 -237177
15514 -179044 205499 292960 -3799 -50845 20187 28868 -84478 77253 122376 206962 41289 -4430
15501 140321 217136 292740 -82465 176911 163226 -4758 45041 20184 189076 149777 70214
15489 60126 215451 267939 238540 309269 230195 150320 100272 8570 60895 488000 -163065
15477 88723 266045 29888 90953 43713 107921 393906 125025 184096 168630 178705 264719
15466 264719 16553 419371 31464 107169 10476 500589 207608 440172 473605 206611
$$ packed form
15550b9196A59634g4689D2410h0785n6177N0049P941A74610a17886L0905A00747
15538A15689b27228L972D7450N9i7660d3269q7882N2507j06667M0266m1967I2828
15525a05673j87897I2669a76653A21807b27932P9038I8177a10653A52868b37177
15514a79044B05499Q7461c799m7046B0187Q681h4478G7253M5123Q4586D1289d430
15501A40321P6815P5604h2465A76911j3685d758D5041B0184J68892l9299G0214
15489F0126J55325N2488k9399P0729p9074p9875n0048H570N2325M27105a63065
15477H8723J77322B9888O1065D3713O4208K85985A25025N9071j5466J0075Q6014
15466B64719A6553M02818C1464P5705A0476M90113B07608K32564L3433B06611
$$ plain form
15455 196374 448369 164951 243758 17921 299243 121635 -20320 22214 352783 205706
15445 205706 -271546 -198352 90711 -14106 -20961 -69370 158281 80394 111812 -171650 96807
15433 283335 313088 202061 292361 330363 517854 317314 783224 588449 1362183 901577
15423 901577 325636 257330 647443 435929 215914 199254 147865 -65073 146164 255761
15413 255761 132761 162046 59296 133525 -70838 236425 -33448 179621 8885 -201846 309956
15401 84792 280060 46947 140718 77186 151136 8815 109844 96933 -75113 117484 6166
15389 -64302 183022 43932 124000 115100 -191553 -400983 161159 18523 -95520 -29214 276043
15377 -7744 175804 57453 -180993 280897 100132 -152570 183925 42386 228102 86711
$$ packed form
15455A96374K51995A64951P8807A7921K81322A21635b0320B2214L30569j47077
15445B05706b71546P3194I0711a4106o855m8409A58281p7887L1418a71650I6807
15433B83335K9753j11027R0300L8002J87491k00540M65910j94775P73734m60606
15423I01577C25636o8306L90113k11514B15914j6660n1389f5073A46164J09597
15413B55761j23000K9285E9296P4229g0838B36425c3448A79621H885b01846C09956
15401H4792J95268D6947R3771o3532P3950H815J01029j2911g5113A17484F166
15389f4302A83022D3932Q0068q900a91553k09430A61159A8523i5520b9214B76043
15377g744A75804E7453a80993B80897A00132a52570A83925D2386J85716H6711
$$ plain form
15366 103238 -97013 -2277 -66399 58905 21323 514086 79267 322695 242396 296617 266299
15355 266299 -56512 329359 45216 521270 112234 34916 195108 18399 -34240 131190
15344 -160398 292891 263147 289849 -54273 -103164 67009 327111 -156799 128573 146468 360302
15333 360302 38073 356816 231680 491542 25897 238996 394529 254346 272182 194837
15323 194837 -37719 396483 22701 -116394 194787 87424 408712 149829 159031 103694 62493
15312 62493 106908 272605 161099 259847 163967 297965 69798 185107 118986 230066 117665
15301 117665 196580 436132 52108 19910 213237 162009 7602 -18846 122441 367627 -282290
15289 328210 74053 -364357 42164 143263 -146068 419373 194231 -23119 -156767 6199
$$ packed form
15366A03238i7013b277o4122E8905B1323M92763G9267K43428q0299N4221l0318
15355B66299e6512C29359D5216M76054A12234C4916J60192A8399c4240A31190
15344a60398B92891k9744K6702e4273m8891F7009K60102a56799A28573J7895K13834
15333C60302C8073L18743j25136K59862B5897K13099J55533j40183J7836p7345
15323A94837c7719C96483B2701a16394A94787H7424L21288A49829R202n5337m1201
15312F2493M4415J65697j11506R8748r5880J33998F9798J15309o6121J11080j12401
15301A17665P8915K39552E2108A9910J93327n1228G602a8846A22441K45186b82290
15289C28210G4053c64357D2164J01099a46068D19373A94231b3119j33648F199
$$ plain form
15278 334258 -133142 127275 119758 114852 192586 -152738 248328 -198457 134877 -25188 -37170
15267 -37170 110601 167534 347836 -83303 -11795 247071 285225 -154173 76958 152069 39393
15255 -76607 -266886 267102 10010 198704 133545 63229 -202099 -57438 -90693 265478 145867
15244 145867 -59264 74127 -65487 49068 143300 133194 583446 -4282 138858 20687 145657
15233 145657 -45263 376038 247077 205612 721510 719344 1312506 967491 1084818 1472744
15223 1472744 829483 530239 214093 302836 138218 219836 244552 -49628 311071 -71932
15212 -60027 -171217 29981 -13377 -143823 -92348 -63428 18422 293711 22272 272452 24951
15200 -190180 -161779 -188482 85135 340556 12349 338761 203234 51592 -147445 355199
$$ packed form
15278C34258a33142A27275p517m906P7734a52738B48328a98457A34877b5188j1982
15267c7170A10601N6933J80302h3303a1795B47071L8154a54173G6958P5111C9393
15255g6607j90279B67102A0010J88694o5159F3229b02099e7438l3255B65478j19611
15244A45867e9264G4127f5487D9068R4232j0106M50252d282A38858B0687J24970
15233A45657d5263C76038j28961m1465N15898k166N93162l45015J17327L87926
15223A472744o43261k99244B14093Q8743A38218Q1618K4716d9628C11071g1932
15212f0027j11190B9981a3377j30446N1475K8920A8422K75289B2272K50180B4951
15200a90180K8401k6703H5135K55421A2349L26412j35527E1592a47445C55199
$$ plain form
15189 155180 207743 -95988 -17559 46163 255686 134308 294348 -50766 51221 -104715 221612
15177 150732 163640 -147846 -154079 -230489 217878 -56676 141982 13505 299066 87546 -53619
15165 151557 -147744 -55422 155912 268792 -22161 64797 254038 -82730 208567 72716
15154 -287965 76532 174477 340412 -132087 -183179 86273 180410 -247497 6748 332599 74397
15142 -24354 147608 69415 439423 45145 166837 -49734 193740 321804 150437 -37486
15131 21055 4452 363844 213832 69513 -11438 5258 -107809 44238 -9846 187050 154537
15120 154537 208936 -7976 -15113 308985 238546 100981 66053 303636 -5083 265362 180931
15109 180931 252898 243236 -21652 175807 416492 345960 463703 109133 54788 19405 -224
$$ packed form
15189A55180N2563i5988a7559D6163K09523j21378J60040e0766E1221a04715B21612
15177A50732J2908a47846o233p6410B17878e6676A41982A3505K85561H7546e3619
15165A51557a47744e5422A55912J12880b2161F4797J89241h2730B08567G2716
15154b87965G6532R7945J65935a32087n1092H6273R4137b47497F748L25851G4397
15142b4354A47608F9415L70008D5145J21692d9734A93740J28064A50437c7486
15131B1055D452L59392j50012F9513a1438E258a07809D4238i846A87050l2513
15120A54537N4399g976p137C08985p0439A00981l4928K37583e083B65362q4431
15109A80931P1967r662b1652A75807K40685p0532J17743A09133n4345A9405b24
$$ plain form
15097 307978 -59766 230377 230632 208716 6258 144885 334997 -69756 53025 150155 123983
15086 123983 3643 135032 349677 129649 254645 180360 58973 -226647 201017 142708
15076 142708 228233 178934 -39786 -7539 -145789 166606 356 548568 67258 28314 204525
15065 204525 240087 -15641 281813 270845 95812 180314 257384 -4958 -21074 -1709 95727 225059
15053 225059 32865 8899 309053 207780 271552 173543 317951 308833 104785 116581 364540
15042 364540 271737 215911 299760 609257 12083 188387 289140 375222 360515 645858 265620
15030 527071 85819 179242 143753 52989 136212 57492 398283 684649 358346 215213 231850
15019 231850 374652 500978 580902 528306 607610 766289 817691 494460 794076 653645
$$ packed form
15097C07978e9766B30377K55k1916F258J38627J90112f9756E3025R7130k6172
15086A23983C643J31389K14645A29649J24996p4285E8973b26647B01017n8309
15076A42708Q5525m9299c9786g539j38250A66606C56N48212F7258B8314J76211
15065B04525L5562a5641B81813j0968I5812Q4502P7070d958j6116a709I5727J29332
15053B25059C2865H899L00154j01273O3772r8009J44408r118A04785J1796K47959
15042C64540r2803n5826Q3849L09497A2083J76304J00753Q6082j4707K85343B65620
15030E27071H5819R3423l5489E2989Q3223E7492L40791K86366l26303j43133J6637
15019B31850J42802J26326P9924n2596P9304J58679N1402l23231K99616j40431
$$ plain form
15009 653645 332267 434374 393455 460715 377009 534950 390475 376954 238446 488587
14999 488587 310406 375465 -73155 125484 411925 331823 709715 511814 387580 376008
14989 376008 364352 430724 464429 306250 336388 787647 385802 227765 678190 471982
14979 471982 677931 348065 429952 371628 652868 326569 400215 696273 241471 505903
14969 505903 715825 562881 682921 969376 1022068 749224 743726 378430 558933 477478
14959 477478 545754 357153 615049 425542 598906 556282 232940 594721 169808 44333
14948 516893 839019 110979 446204 314959 235812 425043 494134 533812 -32899 519524
14937 564145 421995 626952 436090 210714 162540 599116 529674 601444 396916 750384
$$ packed form
15009F53645l21378J02107m0919O7260q3706J57941j44475j3521j38508K50141
14999D88587j78181O5059g3155A25484K86441q0102L77892j97901j24234j1572
14989C76008j1656O6372L3705j58179L0138M51259C85802j58037M50425k06208
14979D71982K05949l29866Q1887n8324K81240l26299P3646K96058B41471K64432
14969E05903K09922j52944J20040K86455N2692k72844n498l65296J80503q1455
14959D77478O8276j88601K57896j89507J73364m2624B32940L61781A69808D4333
14948E16893L22126A10979L35225j31245p9147J89231O9091L9678c2899E19524
14937E64145j42150K04957j90862B10714m8174M36576o9442P1770k04528L53468
$$ plain form
14927 750384 684730 658571 140435 301756 410717 575121 339864 680266 541815 489210
14917 489210 993152 939403 1047621 749380 1198158 1817980 1228173 1618056 1695050 1605532
14907 1605532 1581991 1395940 1460381 1850970 1718405 1942712 2129195 1841650 1766836 1068523
14897 1068523 1200930 864446 922930 822617 860612 498255 480923 495764 785548 301958
14886 581510 375446 476604 268793 259871 400370 354843 80252 738511 404811 283435
14876 283435 535691 554425 456440 594924 392302 629097 843252 818745 928347 830600
14866 830600 883447 810116 738562 961546 545507 992997 675379 660394 459283 434986
14856 434986 437880 615847 429497 694069 653794 1024581 956215 524227 619879 865436
$$ packed form
14927G50384o5654k6159A40435J61321J08961J64404k35257L40402j38451n2605
14917D89210N03942n3749J08218k98241M48778O19822n89807L89883P6994q9518
14907A605532k3541j86051O4441L90589j32565K24307J86483k87545p4814o98313
14897A068523J32407l36484N8484j00313L7995l62357j7332J4841K89784C01958
14886E81510k06064J01158k07811q922J40499m5527H0252O58259l33700j21376
14876B83435K52256J8734r7985J38484k02622K36795K14155k4507J09602r7747
14866H30600N2847p3331p1554K22984m16039M47490l17618j4985k01111k4297
14856D34986K894J77967j86350K64572m0275L70787o8366m31988R5652K45557
$$ plain form
14846 865436 699375 364809 440879 661041 644782 345701 376756 601633 348844 583824
14836 583824 168821 583131 658991 637666 865313 983643 696756 921720 689722 1061892
14826 1061892 1034087 917990 1139711 1393755 731993 1087318 893753 749262 873916 460179
14816 460179 725677 500466 566323 444203 512079 590743 603608 803685 904043 454957
14806 454957 900030 539025 1135906 613347 493366 950579 519829 576593 475607 605332
14796 605332 699102 712121 474505 745287 752263 1199978 465168 1042082 1163946 1063345
14786 1063345 696311 798239 734233 575168 802078 414019 470292 422879 496276 766428
14776 766428 397341 427029 651352 828234 164878 602128 826479 749723 789583 787283
$$ packed form
14846H65436j66061l34566P6070K20162j6259k99081L1055K24877k52789K34980
14836E83824A68821M14310P5860k1325K27647J18330k86887K24964k31998L72170
14826A061892k7805j16097K21721K54044o61762L55325j93565j44491J24654m13737
14816D60179K65498k25211O5857j22120O7876P8664J2865K00077J00358m49086
14806D54957M45073l61005N96881n22559j19981M57213m30750N6764j00986J29725
14796F05332R3770J3019k37616K70782O976M47715D65168N76914J21864j00601
14786A063345l67034J01928o4006j59065K26910l88059N6273m7413P3397K70152
14776G66428l69087K9688K24323J76882A64878M37250K24351p6756L9860k300
$$ plain form
14766 787283 472095 463967 485953 1008017 1050402 811589 1044807 1114729 931588 988358 1100566
14755 1100566 673741 884542 815739 597247 1074553 826799 661941 618456 916047 840522
14745 840522 587013 865152 666623 727262 779558 627946 851232 628795 561730 954020
14735 954020 558191 655888 642591 561002 632272 1012051 893010 947091 658822 1056409
14725 1056409 936250 722695 996782 649907 774128 1041431 1057032 1070396 1108975 1280926
14715 1280926 1396661 1213652 1570958 1328288 1911228 1867998 1360592 968134 900643 1134713
14705 1134713 1243567 1287848 1173760 757258 763258 1105311 851923 588848 1103918 923006
14695 923006 876490 1191296 949276 831346 1066202 1152292 1149468 1687564 1525468 1661872
$$ packed form
14766G87283l15188q128K1986N22064M2385k38813K33218O9922j83141N6770J12208
14755A100566m26825K10801o8803k18492M77306k47754j64858m3485K97591p5525
14745H40522k53509K78139j98529O0639N2296j51612K23286k22437o7065L92290
14735I54020l95829R7697j3297q1589P1270L79779j19041N4081k88269L97587
14725A056409j20159k13555K74087l46875J24221K67303J5601J3364L8579J71951
14715A280926J15735j83009L57306k42670N82940m3230n07406l92458o7491K34070
14705A134713J08854M4281j14088m16502O000L42053k53388k63075N15070j80912
14695I23006m6516L14806k42020j17930K34856Q6090k824N38096j62096J36404
$$ plain form
14685 1661872 1845477 1909142 1737600 1571054 1574570 1232386 1159838 1067244 945042 995121
14675 995121 704210 1357329 836248 1243955 1201671 1020814 1025669 1201847 1395704 887935
14665 887935 976358 897263 1352596 1004527 955396 816326 980987 1161302 1171587 1071668
14655 1071668 1129773 1035221 1153009 1211478 990900 957589 1112428 993318 1182561 1200021
14645 1200021 1145784 1202592 1396899 1172943 1166375 1422324 1240557 1520009 1304184 1630814
14635 1630814 1227217 1284652 1356290 1388721 1165886 1396973 1180572 1171213 1362378 1033596
14625 1033596 1330251 1380587 1594522 1076669 1045446 1215216 1256063 1136243 1444403 1281347
14615 1281347 992005 1433572 1318375 1221205 1374658 1398136 1178811 1426735 1349998 1521089
$$ packed form
14685A661872J83605O3665j71542j66546L516l42184p2548r2594j22202N0079
14675I95121k90911O53119n21081M07707m2284j80857M855J76178J93857n07769
14665H87935Q8423p9095M55333l48069m9131j39070J64661J80315J0285r9919
14655A071668N8105r4552J17788N8469k20578l3311J54839j19110J89243J7460
14645A200021n4237N6808J94307k23956o568K55949j81767K79452k15825L26630
14635A630814m03597N7435P1638L2431k22835K31087k16401r359J91165l28782
14625A033596K96655N0336K13935n17853l1223J69770M0847j19820L08160j63056
14615A281347k89342M41567j15197r7170J53453K3478k19325K47924p6737J71091
$$ plain form
14605 1521089 1646086 1737389 1422745 1366936 1108032 1473940 1821847 1257688 1554084 1570273
14595 1570273 1694307 1498615 1586165 1565248 1221939 1984915 1924468 1512412 1546790 1446515
14585 1446515 1690916 1659846 1560277 1654830 1563149 1754588 1646320 1730409 1572294 1964903
14575 1964903 1874509 2375406 2085902 1576569 1787433 1608948 1872063 1818832 1747849 1944722
14565 1944722 2335497 2318658 2080645 1969004 1900216 1973605 2436400 2392134 2280465 2598276
14555 2598276 2097774 2265596 2513862 2567143 2541834 2628557 2463379 2708173 2542520 2664877
14545 2664877 3106079 2890632 2884212 3551879 3692561 3631035 4003648 4513292 4785589 5912322
14535 5912322 6718868 9187412 13368371 19671616 30930829 36115061 20516772 11788724
$$ packed form
14605A521089J24997R1303l14644n5809k58904L65908L47907n64159K96396J6189
14595A570273J24034j95692Q7550k0917l43309P62976o0447m12056L4378j00275
14585A446515K44401l1070r9569R4553r1681J91439j08268Q4089j58115L92609
14575A964903r0394N00897k89504n09333K10864j78485K63115n3231p0983J96873
14565A944722L90775j6839k38013j11641o8788P3389M62795m4266j11669L17811
14555B598276n00502J67822K48266N3281k5309Q6723j65178K44794j65653J22357
14545B664877M41202k15447o420O67667J40682o1526L72613N09644K72297J126733
14535E912322Q06546K468544M180959O303245J1259213N184232j5598289q728048
$$ plain form
14527 11788724 6798344 5262386 4038201 3927959 4363625 5294118 3723944 2950043 2850689
14518 2850689 2465150 2320329 2334440 2136643 2255271 2337948 2544862 2410560 2498117 2302380
14508 2302380 2273609 2450984 2371700 2470082 2434277 2486292 2743382 2572791 2680378 2312893
14498 2312893 2576861 2766271 3111182 2628330 2741113 3104620 3293676 3207338 3227227 3025265
14488 3025265 3132739 3367721 3017087 3333453 3250541 3162409 3569785 3336471 3257386 3087743
14478 3087743 3278932 3549005 3657575 3705408 3556094 3567325 3584371 3875556 3577207 3407531
14468 3407531 3955299 3924978 4029498 4144973 3816186 3949102 4123109 4121836 4359419 4340972
14458 4340972 4497026 4501662 4674671 4927131 4699422 5002260 4567214 4412471 4658726 4619407
$$ packed form
14527A1788724m990380j535958j224185j10242M35666R30493j570174p73901r9354
14518B850689l85539j44821J4111j97797J18628Q2677K06914j34302Q7557j95737
14508B302380k8771J77375p9284R8382l5805N2015K57090j70591J07587l67485
14498B312893K63968J89410L44911m82852J12783L63507J89056q6338J9889k01962
14488C025265J07474K34982l50634L16366q2912q8132M07376k33314p9085j69643
14478C087743J91189K70073J08570M7833j49314J1231J7046K91185k98349j69676
14468C407531N47768l0321J04520J15475l28787J32916J74007j273K37583j8447
14458D340972J56054M636J73009K52460k27709L02838m35046j54743K46255l9319
$$ plain form
14448 4619407 4928023 4889013 4972433 4708520 5055170 5080945 4897736 5008546 5378537 5479243
14438 5479243 5488480 5282597 5365171 5461975 5686209 5668905 5758387 5754436 5676273 6113504 6052381
14427 6052381 6168591 6263826 5976053 6426457 6335944 6338318 6593977 6708296 6864000 6907662
14417 6907662 6648730 6977407 7242231 7456532 7772013 7548896 7700352 7580619 7776166
14408 7776166 7958820 8150633 8445247 8537727 8830335 9095451 8813646 9014798 8871281 8917540
14398 8917540 9187863 9327112 9311229 9337916 9789672 9837685 9867976 9697192 10592368 10529487
14388 10529487 10838186 10872636 10767678 11174086 11179070 11322467 11364954 11576586 11785784 11842064
14378 11842064 12225600 12502642 13100959 12670257 12691548 13275433 13525292 13717267 14036898
$$ packed form
14448D619407L08616l9010Q3420k63913L46650K5775j83209J10810L69991J00706
14438E479243R237k05883Q2574R6804K24234j7304Q9482l951p8163M37231o1123
14427F052381J16210R5235k87773M50404r0513K374K55659J14319J55704M3662
14417F907662k58932L28677K64824K14301L15481k23117J51456j19733J95547
14408G776166J82654J91813K94614R2480K92608K65116k81805K01152j43517M6259
14398H917540K70323J39249j5883K6687M51756M8013L0291j70784Q95176o2881
14388A0529487L08699L4450j04958M06408M984J43397M2487K11632K09198N6280
14378A1842064L83536K77042N98317m30702K1291N83885K49859J91975L19631
$$ plain form
14369 14036898 14329182 14513228 15199989 15287105 15663856 15953328 16094388 16348335 16581733
14360 16581733 16961795 17083666 17652462 18253907 18324887 18745017 19123412 19501307 20048391
14351 20048391 20384866 20696078 21217848 21630746 22142893 22372800 22836429 23327827 23872977
14342 23872977 24460534 24987877 25513579 26369387 26672795 27631648 28254543 28958944 29557899
14333 29557899 30442290 31305433 32178702 32422301 33178704 34320324 35510742 36450427 37437543
14324 37437543 38501666 39500323 40908506 42064888 42882055 44293866 45749365 47325824
14316 47325824 48836856 50190497 51678565 53907680 55632985 57082577 59191249 61058204
14308 61058204 63465817 65789176 68048349 70480442 72932837 75737540 78648035 81487779
$$ packed form
14369A4036898K92284J84046O86761Q7116L76751K89472J41060K53947K33398
14360A6581733L80062J21871N68796O01445P0980M20130L78395L77895N47084
14351B0048391L36475L11212N21770M12898N12147K29907M63629M91398N45150
14342B3872977N87557N27343N25702Q55808L03408R58853O22895P04401N98955
14333B9557899Q84391Q63143Q73269K43599P56403J141620J190418R39685R87116
14324C7437543J064123R98657J408183J156382Q17167J411811J455499J576459
14316D7325824J511032J353641J488068K229115J725305J449592K108672J866955
14308F1058204K407613K323359K259173K432093K452395K804703K910495K839744
$$ plain form
14300 81487779 84648058 87989534 91383355 95220892 99241085 103312288 107632499 112471568
14292 112471568 117304151 122467635 128220950 134074882 140177124 147126790 153657988 161046623
14284 161046623 168946314 177089000 185601471 194961024 205000474 214982430 225808316 237461997
14276 237461997 249402063 262484905 275571106 289499582 303758204 318317063 332853357
14269 332853357 347460260 361965997 376348068 389453140 402352028 414707022 425589771
14262 425589771 436313038 445899888 454585135 461928710 466704261 468174193 469262735 470746689
14254 470746689 469838914 462147720 457785498 449348900 439984387 428381445 415203581 401949969
14246 401949969 388337034 374392338 360295244 345197122 330538403 316797989 302927595
$$ packed form
14300H1487779L160279L341476L393821L837537M020193M071203M320211M839069
14292A12471568M832583N163484N753315N853932O102242O949666O531198P388635
14284A61046623P899691Q142686Q512471R359553J0039450R981956J0825886J1653681
14276B37461997J1940066J3082842J3086201J3928476J4258622J4558859J4536294
14269C32853357J4606903J4505737J4382071J3105072J2898888J2354994J0882749
14262D25589771J0723267R586850Q685247P343575M775551J469932J088542J483954
14254D70746689r07775p691194m362222q436598r364513j1602942j3177864j3253612
14246D01949969j3612935j3944696j4097094j5098122j4658719j3740414j3870394
$$ plain form
14239 302927595 289247530 275751767 263193412 250894825 239317802 227490670 215985598
14232 215985598 205169548 194235859 184218604 175240274 166354458 158162947 150451478
14225 150451478 143803818 136870429 130946045 125447028 119598065 114094222 109408830 104771682
14217 104771682 100634717 97054630 92813360 88988141 85972475 82280797 79563658 76466606
14209 76466606 73581361 71161875 68315449 66052029 63712415 61791843 59892694 57857268
14201 57857268 55985604 53961606 52662322 51124761 49372961 47868838 46359804 45169484
14193 45169484 44006687 42767322 42030474 40582374 39155416 38147545 37166315 35761964
14185 35761964 35576286 34443462 33477614 32467906 31899840 31002314 30123715 29605542 28614394
$$ packed form
14239C02927595j3680065j3495763j2558355j2298587j1577023j1827132j1505072
14232B15985598j0816050j0933689j0017255q978330q885816q191511p711469
14225A50451478o647660o933389n924384n499017n848963n503843m685392m637148
14217A04771682m136965l580087m241270l825219l015666l691678k717139l097052
14209G6466606k885245k419486k846426k263420k339614j920572j899149k035426
14201E7857268j871664k023998j299284j537561j751800j504123j509034j190320
14193D5169484j162797j239365p36848j448100j426958j007871r81230j404351
14185C5761964j85678j132824r65848j009708n68066q97526q78599n18173r91148
$$ plain form
14176 28614394 28099961 27364360 26764809 26294720 25172806 24728509 24065140 24021669 23249503
14167 23249503 22739793 22715000 21910463 21310311 21043225 20581685 20126977 19198201 19273881 19269238
14157 19269238 18629565 18105902 17804378 17760521 16956706 16799906 16514882 16464621 16022198 15338328
14147 15338328 15556947 15049860 15098424 14404051 14014718 14194909 14096183 13613394 13592380 13192870
14137 13192870 12827751 12482685 12422143 12187844 11876566 12083568 12029069 11415286 11399406 11182762
14127 11182762 10972186 10851381 10863340 10306647 10257065 10056926 10019614 9685546 9773409 9884514
14117 9884514 9439190 9044267 8897485 9207819 9099260 8820498 8863384 8921706 8422586 8407944
14107 8407944 8418932 8027568 8261759 7969815 7893709 7569104 7481118 7698149 7363721 7587171
$$ packed form
14176B8614394n14433p35601n99551m70089j121914m44297o63369m3471p72166
14167B3249503n09710k4793q04537o00152k67086m61540m54708r28776P5680m643
14157A9269238o39673n23663l01524m3857q03815j56800k85024n0261m42423o83870
14147A5338328K18619n07087M8564o94373l89333J80191r8726m82789k1014l99510
14137A3192870l65119l45066o0542k34299l11278K07002n4499o13783j5880k16644
14127A1182762k10576j20805J1959n56693m9582k00139l7312l34068Q7863J11105
14117I884514m45324l94923j46782L10334j08559k78762M2886N8322m99120j4642
14107H407944J0988l91364K34191k91944p6106l24605q7986K17031l34428K23450
$$ plain form
14097 7587171 7242842 7169863 6948516 7052886 7023036 6784618 6827514 6411118 6539967 6283401
14087 6283401 6373664 6420310 6370381 6177325 6227855 6371367 5639571 5871299 6144068 6164178
14077 6164178 5731492 5535774 5498162 5204850 5531288 5159306 5332576 5221416 5237274 5180597
14067 5180597 5556655 4902206 4890726 5031479 4894783 4807912 5226938 4831717 4638269 4398570
14057 4398570 4455365 4399609 4391115 4504137 4753059 4397421 4492090 4405134 4188719 4350523
14047 4350523 4388887 3861297 4168185 4151645 3982916 4203882 3856006 4097301 4339574 4023150
14037 4023150 4009946 3749879 4048793 3677336 3629656 3291573 3896583 3650018 3719146 3434383
14027 3434383 3210023 3435680 3183133 3232289 3221298 3498246 3338252 3398602 3171099 3366255
$$ packed form
14097G587171l44329p2979k21347J04370k9850k38418M2896m16396J28849k56566
14087F283401R0263M6646m9929j93056N0530J43512p31796K31728K72769K0110
14077F164178m32686j95718l7612k93312L26438l71982J73270j11160J5858n6677
14067E180597L76058o54449j1480J40753j36696q6871M19026l95221j93448k39699
14057D398570N6795n5756q494J13022K48922l55638R4669q6956k16415J61804
14047D350523L8364n27590L06888j6540j68729K20966l47876K41295K42273l16424
14037D023150j3204k60067K98914l71457m7680l38083O05010k46565O9128k84763
14027C434383k24360K25657k52547M9156j0991K76948j59994O0350k27503J95156
$$ plain form
14017 3366255 2877110 3193347 2966652 3317140 3144327 2885576 3151917 3039956 2859575
14008 2859575 2952837 2781126 3002113 2763133 2843257 2838133 2631211 2526063 2747208 2601883
13998 2601883 2971245 2345515 2594393 2798637 2398948 2572201 2276015 2346189 2256818 2246253
13988 2246253 2630705 2346496 2296527 2262536 2548556 2171909 2011870 2402885 2812398 2938201
13978 2938201 2783408 3249712 3659850 4388820 5670133 8989300 13970029 24959188 37777002
13969 37777002 25252940 16305837 10683050 7788505 6044000 5141023 4275578 4007559
13961 4007559 3519134 3338553 3082973 3048994 2947884 2806217 2682158 2630510 2856403 2199071
13951 2199071 2334002 2196025 2347219 2487522 2255522 2433866 2093875 2377521 2125054
$$ packed form
14017C366255m89145L16237k26695L50488j72813k58751K66341j11961j80381
14008B859575R3262j71711K20987k38980Q0124n124k06922j05148K21145j45325
13998B601883L69362o25730K48878K04244l99689J73253k96186P0174q9371j0565
13988B246253L84452k84209m9969l3991K86020l76647j60039L91015M09513J25803
13978B938201j54793M66304M10138P28970J281313L319167M980729J0989159J2817814
13969C7777002j2524062q947103n622787k894545j744505r02977q65445k68019
13961D007559m88425j80581k55580l3979j01110j41667j24059n1648K25893o57332
13951B199071J34931j37977J51194J40303k32000J78344l39991K83646k52467
$$ plain form
13942 2125054 2171097 1965701 1751534 2074542 1895970 2240881 2040975 1714442 2056871 2293968
13932 2293968 1820561 2168964 1953811 1863549 1574152 1809408 1761316 1692721 1609208 2239189
13922 2239189 1787909 1694222 1536980 1969356 1817889 1984851 1716856 1661746 1664162 1419290
13912 1419290 1855079 1644213 1628676 1568581 1711579 1545054 1394306 1334640 1401462 1783324
13902 1783324 1195761 1507660 1422798 1163070 1978111 1651918 1661834 1362255 1469312 1346947
13892 1346947 1200241 1836630 1392004 1387345 1551443 1411393 1543998 1528957 1336890 1439031
13882 1439031 1516032 1571545 1530560 1409824 1447047 1177329 1439139 1168615 1281785 1692165
13872 1692165 1383912 1367553 1565868 985402 1174320 1174927 1409989 1319074 1138443 1388195
$$ packed form
13942B125054M6043k05396k14167L23008j78572L44911j99906l26533L42429K37097
13932B293968m73407L48403k15153r0262k89397K35256m8092o8595q3513O29981
13922B239189m51280r3687j57242M32376j51467J66962k67995n5110K416k44872
13912A419290M35789k10866j5537o0095J42998j66525j50748n9666O6822L81862
13902A783324n87563L11899q4862k59728Q15041l26193R916k99579J07057j22365
13892A346947j46706O36389m44626m659J64098j40050J32605j5041j92067J02141
13882A439031P7001N5513m0985j20736L7223k69718K61810k70524J13170M10380
13872A692165l08253j6359J98315n80466J88918O07K35062r0915j80631K49752
$$ plain form
13862 1388195 1163318 1481850 1281960 1231423 959774 1046526 1104880 1154358 1184172 1385184
13852 1385184 1219500 1098913 973392 1568323 1133928 1092763 926582 1039053 1267322 1272761
13842 1272761 1378499 891328 1216419 1125448 1216698 997184 1136167 1330172 961442 1191815
13832 1191815 1076424 1226687 1013438 1273232 1090502 975886 1141819 1076856 1106804 946127
13822 946127 1043815 1126345 791168 1055124 977709 949795 866422 1003206 983246 998706 1176489
13811 1176489 774011 932031 638957 757484 942636 607315 1034063 856201 1101982
13802 1101982 669335 909034 630757 857130 1267234 1037934 782335 685287 726688 632005
13792 632005 772301 619467 911684 766206 1042713 856306 916964 569333 1083976 1010998
$$ packed form
13862A388195k24877L18532j99890n0537k71649Q6752N8354M9478K9814K01012
13852A385184j65684j20587j25521N94931m34395m1165j66181J12471K28269N439
13842A272761J05738m87171L25091r0971R1250k19514J38983J94005l68730K30373
13832A191815j15391J50263k13249K59794j82730j14616J65933o4963K9948j60677
13822I46127R7688Q2530l35177K63956p7415k7914q3373J36784j9960J5460J77783
13811A176489m02478J58020k93074J18527J85152l35321M26748j77862K45781
13802A101982m32647K39699k78277K26373M10104k29300k55599r7048M1401r4683
13792F32005J40296j52834K92217j45478K76507j86407O0658l47631N14643p2978
$$ plain form
13782 1010998 802221 771000 1046701 905715 849133 780459 950848 859795 662769 975033
13772 975033 1021466 999405 823838 923473 796387 510374 437224 804099 654195 788492
13762 788492 763890 879509 714155 780137 805849 829457 723684 720794 638421 267978 603794
13751 603794 769772 547298 772113 558873 626234 569049 660898 691886 737566 690381 433240
13740 433240 873764 720099 963432 573573 710485 962333 847004 635667 616986 733898
13730 733898 526150 638237 765554 593189 346590 826672 344560 483984 391756 739465
13720 739465 580261 747428 747347 621480 665617 895534 635836 704815 676676 735134 527444
13709 527444 417935 461672 544097 777521 480692 56346 578334 614634 844285 648704
$$ packed form
13782A010998k08777l1221K75701j40986n6582o8674J70389r1053j97026L12264
13772I75033M6433k2061j75567R9635j27086k86013p3150L66875j49904J34297
13762G88492k4602J15619j65354O5982K5712K3608j05773k890q2373B67978L35816
13751F03794J65978k22474K24815k13240O7361n7185R1849L0988M5680m7185k57141
13740D33240M40524j53665K43333l89859J36912K51848j15329k11337j8681J16912
13730G33898k07748J12087J27317j72365k46599M80082C44560J39424r2228L47709
13720G39465j59204J67167q1j25867M4137K29917k59698O8979k8139N8458k07690
13709E27444j09509M3737Q2425K33424k96829E6346N21988L6300K29651j95581
$$ plain form
13699 648704 713278 570972 913137 304952 655210 628591 529759 444683 718088 452966
13689 452966 762571 420610 283017 421982 563078 543666 550369 449471 559112 544197
13679 544197 770418 310946 511278 513558 525226 417736 323023 307572 456921 524331 719350
13668 719350 589674 647723 601948 359897 535549 628770 662775 651087 634161 622788 445206
13657 445206 511107 666796 382269 771152 419570 394419 427163 715706 529034 358448
13647 358448 290327 363916 603969 484104 715132 657199 432601 290569 278139 800282
13637 800282 580144 649177 530695 560209 772317 719701 153511 239383 481332 659539
13627 659539 654850 134700 517990 379429 382642 565769 394305 449472 235316 237520 537004
$$ packed form
13699F48704O4574j42306L42165C04952L50258k6619r8832q5076K73405k65122
13689D52966L09605l41961j37593J38965J41096j9412O703j00898J09641j4915
13679E44197K26221C10946K00332K280J1668j07490r4713j5451J49349O7410J95019
13668G19350j29676N8049m5775k42051J75652R3221L4005j1688j6926j1373j77582
13657D45206O5901J55689k84527L88883l51582k5151L2744K88543j86672j70586
13647C58448o8121P3589K40053j19865K31028n7933k24598j42032j2430N22143
13637H00282k20138O9033j18482K9514K12108n2616A53511Q5872K41949J78207
13627F59539m689A34700L83290j38561L213J83127j71464N5167k14156K204K99484
$$ plain form
13616 537004 406956 304367 496962 465555 387982 204231 400449 335252 624589 485576
13606 485576 278413 308171 400970 540254 528649 574195 222387 585511 499761 386326
13596 386326 40073 189072 397281 253833 205391 178818 590049 359201 292972 330873
13586 330873 699479 503719 338063 311134 316802 154431 1021332 142313 467231 449286
13576 449286 327098 401731 444963 132604 545290 299460 299311 305153 338141 360753 225172
13565 225172 396024 598970 501300 173365 68949 417404 -56775 277070 245393 650299
13555 650299 202028 342517 358415 234425 145264 366147 400271 357871 216283 559264
13545 559264 -106749 332696 217576 188113 83296 381049 236045 349722 924757 466530
$$ packed form
13616E37004j30048j02589J92595l1407p7573j83751J96218o5197K89337j39013
13606D85576k07163K9758R2799J39284j1605M5546B22387L63124q5750j13435
13596C86326D0073J48999K08209j43448m8442k6573M11231k30848o6229L7901
13586C30873L68606j95760j65656k6929N668A54431Q66901A42313L24918j7945
13576D49286j22188P4633M3232A32604M12686k45830j49N842L2988K2612j35581
13565B25172J70852K02946r7670A73365F8949L48455e6775B77070l1677M04906
13555F50299B02028J40489J5898j23990q9161K20883L4124m2400j41588L42981
13545E59264a06749C32696j15120k9463H3296K97753j45004J13677N75035m58227
$$ plain form
13535 466530 219197 406066 302102 226794 192424 204492 440622 503140 393279 86433
13524 537846 504978 377584 178895 442715 -160601 278765 466231 476213 41688 341667
13514 341667 293436 28545 247651 364567 316129 304155 517536 108362 544120 49361
13503 209131 298882 567340 225245 552066 27935 388667 269242 277209 239022 590994
13493 590994 276188 351761 355719 86890 -39941 452106 -43483 19356 200001 288863 46363
13481 182480 257658 339834 250008 381286 119851 597542 373606 166705 264596 33221
13470 -32998 -71124 447256 167373 226104 -105451 -51824 111198 120187 346803 440191 -90202
13458 223391 87823 230484 28129 -52477 159543 544421 298892 216203 451093 38578
$$ packed form
13535D66530B19197J86869j03964p5308l4370J2068K36130O2518j09861H6433
13524E37846l2868j27394A78895K63820a60601B78765J87466R982D1688K99979
13514C41667m8231B8545K19106J16916m8438j1974K13381A08362M35758D9361
13503B09131Q9751K68458B25245L26821B7935L60732j19425P967l8187L51972
13493E90994B76188P5573L958H6890c9941D52106d3483A9356J80645Q8862D6363
13481A82480P5178Q2176q9826J31278A19851M77691k23936A66705R7891C3221
13470c2998l8126D47256A67373N8731a05451e1824A11198Q989K26616R3388i0202
13458B23391H7823J42661B8129e2477A59543L84878k45529q2689K34890C8578
$$ plain form
13447 298992 209662 280227 -27881 78297 198370 259298 533301 -28167 301759 343488 174965
13436 174965 423118 250985 -22910 455627 299034 618070 204980 353939 406244 110250
13425 295492 46569 86774 204617 99799 -338364 144602 314399 94479 488239 58558
13414 140489 288702 63221 -79700 206410 252908 524602 301439 76136 176001 141933 94125
13403 94125 56521 218965 260720 324977 552410 -175551 11148 436531 127583 114184 147988
13392 147988 268591 353111 392505 308857 234688 314785 14861 212524 198039 102132 141488
13381 141488 322757 610839 222996 338287 186540 264196 -104635 405754 -8408 383061
13370 298047 155529 144784 69308 238242 213689 148158 107462 398673 -5669 -20933 54294
$$ packed form
13447B98992q9330P0565b7881G8297J20073O0928K74003b8167C01759M1729j68523
13436A74965K48153j72133b2910D55627j56593L19036B04980J48959N2305A10250
13425B95492D6569M0205J17843I9799c38364A44602J69797I4479L93760E8558
13414A40489J48213F3221g9700B06410M6498K71694k23163G6136R9865l4068m7808
13403I4125l7604J62444M1755O4257K27433a75551A1148M25383A27583j3399L3804
13392A47988J20603Q4520L9394q3648p4169Q0097A4861J97663j4485r5907L9356
13381A41488J81269K88082B22996J15291j51747P7656a04635D05754h408C83061
13370B98047j42518j0745F9308J68934k4553o5531m0696K91211e669j5264E4294
$$ plain form
13358 277870 202746 253227 351954 221036 232764 370211 475022 -35121 101116 138712 112687
13347 112687 287996 70721 234135 539713 263283 333768 -99924 284559 77450 56709
13337 56709 159556 225451 169739 332454 249674 246360 518182 494912 446116 372552 44635
13325 427627 398499 178064 464840 304945 184077 180270 234910 511467 -36882 230032
13314 170971 149942 59657 134714 327440 465879 504133 -45007 432356 279279 231381 38344
13302 -1980 82797 246685 -11423 69641 57086 182772 60444 339220 -138925 284415 -24383
13290 -31980 92854 398856 282479 427462 356333 184457 160522 8762 154033 302743 294982
13279 294982 122698 103748 -38816 23061 112873 -69047 -103143 189444 -26106 257107 87290
$$ packed form
13358B77870p5124N0481R8727j30918J1728J37447J04811c5121A01116L7596k6025
13347A12687J75309G0721J63414L05578B63283P0485i9924B84559G7450k0741
13337E6709J02847O5895n5712J62715q2780l314K71822k3270m8796p3564D4635
13325D27627k9128A78064K86776j59895j20868l807N4640K76557c6882B30032
13314A70971k1029E9657P5057J92726J38439L8254d5007D32356j53077m7898C8344
13302a980H2797J63888a1423F9641j2555J25686F0444K78776a38925B84415b4383
13290c1980I2854L06002j16377J44983p1129j71876k3935H762J45271J48710p761
13279B94982A22698j8950c8816B3061Q9812f9047l4096A89444b6106B57107H7290
$$ plain form
13267 8743 158499 -17575 25768 150492 138192 82645 61089 92283 4512 182869 -4716 138660
13254 12853 -149 232341 -39494 182791 -93654 -30145 389508 -8958 19604 74566 315937
13243 315937 585395 231743 -314740 114868 271816 -113549 49243 190680 129310 399205
13233 399205 199916 94936 -169683 -160515 177133 -225531 27150 312039 182417 203554
13223 203554 5205 221791 -161792 -23141 173649 -140157 509392 -97236 293987 66114
13212 122886 -81143 85168 186549 14219 -420845 -176289 -69586 272283 41982 72675 -284758
13200 258822 98472 -89334 46217 -63032 24019 -30338 196734 473522 206769 149297 -13874
13188 351937 -28883 120493 306595 269683 -62980 63435 252850 104373 229840 -19038
$$ packed form
13267H743J49756a7575B5768J24724j2300n5547k1556L1194D512J78357d716A38660
13254A2853a49B32341c9494A82791i3654c0145C89508h958A9604N4962K41371
13243C15937K69458B31743c14740A14868J56948a13549D9243J41437o1370K69895
13233C99205j99289I4936a69683R168A77133b25531B7150K84889j29622K1137
13223B03554E205K16586a61792b3141A73649a40157E09392i7236B93987F6114
13212A22886h1143H5168J01381A4219d20845a76289f9586B72283D1982L0693b84758
13200B58822I8472h9334D6217f3032B4019c0338A96734K76788B06769n7472a3874
13188C51937b8883A20493J86102l6912f2980F3435J89415A04373J25467a9038
$$ plain form
13177 -24694 -241905 253201 122585 -38622 194604 101642 73602 196085 527685 304452
13167 304452 264310 59612 26787 63050 58764 74545 22683 328797 126219 94821 162839
13156 162839 198931 -73937 214497 77942 234276 18608 -111910 -99990 124267 -176059
13145 438439 -19379 26686 -90798 267322 9609 -128794 186436 182304 212135 92064 297883
13134 297883 19799 396555 -192740 180333 -125975 174519 -9183 -382158 88915 134333
13124 134333 137977 27625 97609 113813 -46902 287702 43525 258191 269910 -21840 -121638
13113 -121638 360758 -82922 215954 -120741 -184903 -13375 -65274 279030 223788 -103046
13102 152366 34263 298933 55924 385695 12467 300821 211084 180309 87274 -917 93195
$$ packed form
13177b4694k17211B53201A22585c8622A94604r2962k8040J22483L31600k23233
13167C04452m0142E9612B6787L6263m286J5781B2683L06114A26219l1398O8018
13156A62839L6092g3937B14497G7942J56334A8608a11910J1920A24267a76059
13145D38439a9379B6686i0798B67322I609a28794A86436m132K9831I2064K05819
13134B97883A9799L76756a92740A80333a25975A74519i183l72975H8915M5418
13124A34333L644B7625O9984J6204d6902B87702D3525K14666J1719b1840r9798
13113a21638C60758h2922B15954a20741o4162a3375n1899B79030n5242a03046
13102A52366C4263K64670E5924L29771A2467K88354q9737l0775H7274i17I3195
$$ plain form
13090 145355 272283 171508 234894 -185060 -193400 577313 527202 449534 228119 180542 -239568
13078 207176 100975 -49970 169546 -133820 296507 70252 -203269 -123588 186949 -112302
13067 97532 -94946 103385 -286178 186176 109406 182522 292292 -88795 51085 185449 -72098
13055 185534 -16050 83146 -135386 218188 178713 324689 -486950 -217520 138756 -40079
13044 54060 212033 59635 222317 81801 -119600 185172 192057 -92653 -80773 213588 163624
13033 163624 346060 186882 -72791 9510 89520 128089 -43816 450652 220701 -209770 193960
13021 -2937 -162963 -152950 68752 -4917 -186788 -319803 513606 6985 231506 260327 -231143
13009 -191371 292762 110862 63466 125004 -258121 16399 -89151 60789 62063 116089 92276
$$ packed form
13090A45355J26928j00775O3386a85060q340E77313n0111p7668k21415m7577b39568
13078B07176A00975d9970A69546a33820B96507G0252b03269P9681A86949a12302
13067I7532i4946A03385b86178A86176p6770P3116J09770h8795E1085J34364g2098
13055A85534a6050H3146a35386B18188l9475J45976d86950b17520A38756d0079
13044E4060J57973E9635J62682H1801a19600A85172O885i2653J1880B13588m9964
13033A63624J82436j59178g2791I510Q0010L8569d3816D50652B20701b09770A93960
13021b937j60026J0013F8752d917j81871j33015E13606F985K24521K8821b31143
13009a91371B92762A10862m7396O1538b58121A6399h9151F0789J274N4026k3813
$$ plain form
12998 92276 109713 129852 83937 475377 -25250 -18645 95150 -55972 -9443 22798 73047 170425
12986 170425 -11421 37576 134761 22982 162847 54085 54732 -64255 -168740 148433 27028
12974 101525 29446 -22972 -46442 257341 -144857 -84344 103463 -23606 128719 -57402 369768
12962 111810 189342 107621 168301 -28907 281367 -169740 -105150 41028 47669 139610 -157138
12950 73163 125367 49798 198945 -27467 108826 -257102 23731 6686 -103168 -107454 -105486
12939 -105486 -146022 312738 -177229 -239157 171067 -92765 7836 42849 -63656 104902 -3058
12927 3924 32096 47633 181119 -111318 121104 12706 152326 -87891 -437289 -90761 361636
12915 -10016 -211555 47655 -98610 -162334 -155929 -70153 77961 27808 5155 80438 -88702 -104918
$$ packed form
12998I2276J7437K0139m5915L91440b5250O605I5150e5972i443B2798N0249R7378
12986A70425a1421C7576R7185B2982J39865E4085O47f4255j04485A48433B7028
12974A01525B9446b2972k3470B57341a44857O0513A03463b3606A28719e7402C69768
12962A11810P7532q1721O0680b8907B81367a69740O4590D1028O641R1941a57138
12950G3163N2204D9798J49147b7467A08826b57102B3731F686a03168m286J968
12939a05486m0536C12738a77229o1928A71067i2765G836L5013f3656A04902c058
12927C924K8172J5537J33486a11318A21104A2706J39620h7891l49398i0761C61636
12915a0016k01539D7655i8610o3724O405g0153G7961B7808E155P5283h8702j6216
$$ plain form
12903 -104918 -224921 137845 45909 -43425 -59709 184481 -167583 -58109 -67532 -291056 -207412
12892 -207412 -7160 49994 143458 53377 69514 -214546 -9320 254634 70984 147547 -44565
12880 -45122 286842 -2878 -23510 148501 -77134 161539 286584 77316 -131774 17820 182603
12869 182603 197398 -400517 -134646 -45565 305804 99824 -140492 64545 269509 -48957
12858 -212505 -58741 118326 -146360 121133 -257434 -326496 -185310 114236 -181559 -107967
12848 -107967 90911 134089 -28275 -50365 -40799 263908 43438 -52504 -168435 -23739 -16413
12837 -16413 148431 193755 103725 -65497 267261 -26202 -111242 140777 -166941 -120994 44764
12825 -121740 245593 -36144 -35738 -79143 -317573 -80569 407316 109377 -9834 142902 -293643
$$ packed form
12903a04918j20003A37845D5909d3425j6284A84481a67583e8109r423k23524Q3644
12892b07412g160D9994R3464E3377J6137b14546i320B54634G0984P6563d4565
12880d5122B86842b878k0632A48501g7134A61539J25045G7316a31774A7820J64783
12869A82603J4795d00517a34646d5565C05804I9824a40492F4545K04964d8957
12858b12505e8741A18326a46360A21133b57434o9062J41186A14236a81559P3592
12848a07967I0911M3178b8275k2090R566B63908D3438e2504j15931b3739P326
12837a6413A48431M5324r0030f5497B67261b6202q5040A40777a66941M5947D4764
12825a21740B45593c6144M06m3405k38430h0569D07316A09377i834A42902b93643
$$ plain form
12813 160813 193523 90216 266441 -30908 15318 300449 -296030 208724 -346789 -51975
12802 58163 -34405 155943 -69486 372845 -217231 -72023 319437 -44193 234473 -268897
12791 -143887 265277 48889 364538 179353 -99415 5850 180763 -281612 154347 303342
12781 303342 -187811 54383 197812 -218044 125156 50401 237999 54577 -46976 -54553 -182667
12770 -182667 -125118 -150959 -41285 229558 45619 -92902 -101506 -236573 58971 -332443 113934
12758 40872 -240760 -28817 -122048 -344872 -163693 320820 183109 -81392 -41795 92678 105719
12747 105719 -27995 127899 28511 -356364 -96293 182324 374 321719 309556 28344 -136125
12735 -88869 -171636 -6323 200255 -163283 -96567 82580 136320 98446 302251 53768 -22956
$$ packed form
12813A60813L2710I0216J76225c0908A5318K85131b96030B08724c46789e1975
12802E8163c4405A55943f9486C72845b17231g2023C19437d4193B34473b68897
12791a43887B65277D8889L15649A79353i9415E850J74913b81612A54347J48995
12781C03342a87811E4383J43429b18044A25156E0401J87598E4577d6976p577j28114
12770a82667N7549k5841d1285B29558D5619i2902q604j35067E8971c32443A13934
12758D0872b40760b8817r3231k22824a63693C20820j37711h1392L9597I2678J3041
12747A05719b7995A27899B8511c56364i6293A82324C74L21345j2163B8344a36125
12735h8869q2767f323B00255a63283O6716H2580N3740l7874K03805E3768b2956
$$ plain form
12723 240338 147851 77980 151586 -138533 50592 282304 -122744 109885 -135604 -59166
12712 372983 -29381 -103963 49610 -124830 -206012 18301 -315411 -238700 91212 198257 186106
12701 186106 331213 3410 239168 -111630 -92056 262596 -189395 175940 -119905 450042
12690 548609 146254 93773 165830 116286 182042 -39944 -196938 140409 -200537 43346 110061
12679 110061 -195169 -2711 103344 -185283 -164965 92814 97494 85712 40577 276201 -102246
12667 44742 263749 -65933 -87990 100046 320681 384251 4194 -156350 -147990 69272 113861
12656 113861 -372175 -33680 176055 234436 197024 -38475 -59254 -129647 115610 207556 134164
12645 134164 -68876 33008 223871 -4635 15532 131318 -223114 68526 -387978 68990 362373
$$ packed form
12723B40338r2487o9871P3606a38533E0592K31712a22744A09885a35604e9166
12712C72983b9381p4582D9610a24830q1182A8301c15411P6711I1212J07045j2151
12701A86106J45107C410K35758a11630J9574B62596a89395A75940a19905D50042
12690E48609A46254n2481P2057m9544O5756c9944j56994A40409b00537D3346O6715
12679A10061a95169b711A03344a85283K0318I2814M680j1782D0577K35624a02246
12667D4742K19007f5933k2057A00046K20635O3570D194a56350Q360F9272M4589
12656A13861c72175c3680A76055N8381l7412c8475k0779p0393A15610R1946p3392
12645A34164f8876C3008J90863d635A5532J15786b23114F8526c87978F8990K93383
$$ plain form
12634 362373 -210849 118404 178710 42585 201786 -72744 30027 -335651 -295010 204973
12623 111893 -24111 -31283 150464 141720 -82536 188537 134353 458818 153913 413283 146324
12611 199635 283740 175335 159597 382814 302488 317213 50507 -257407 196813 348859
12601 348859 -20309 -25015 104169 -123732 84741 -263048 -70625 -304212 -29909 -68594 -146315
12590 -146315 -142095 -280411 127780 49566 -202790 5857 39380 36810 409023 18687 179950
12579 179950 -230193 -21100 67897 13224 -71440 369952 -280117 285984 -193940 131358
12568 111871 283680 -274661 -21384 -186667 -189571 143517 -93912 38691 357962 -92212 -58101
12557 -58101 333703 -42547 -98085 -241573 -206418 -364458 -279889 90357 -258311 -150565 -113955
$$ packed form
12634C62373b10849A18404O0306D2585J59201g2744C0027c35651M0641B04973
12623A11893b4111p172A50464q744h2536A88537n4184L24465A53913K59370A46324
12611A99635Q4105j08405j5738K23217q0326J4725E0507b57407A96813J52046
12601C48859b0309m706A04169a23732H4741b63048g0625k33587b9909l8685p7721
12590a46315M220j38316A27780D9566b02790E857L3523k570L72213A8687J61263
12579A79950b30193b1100F7897A3224g1440C69952b80117B85984a93940A31358
12568A11871J71809b74661b1384j65283k904A43517i3912C8691L19271i2212L4111
12557e8101C33703d2547n5538j43488L5155j58040Q4569I0357b58311J07746L6610
$$ plain form
12546 -113955 8979 316814 -5438 -155675 -145609 -138733 -26552 57359 256898 -131239 40685
12534 -222264 -42008 416780 195522 234607 -186228 -89130 -231224 -133104 -219925 -443409
12524 -443409 267462 110070 -65174 37991 192072 232978 93425 -64671 -101556 -64341 107979
12512 185263 -176552 -68593 16131 -295835 14186 280115 35436 -367098 -274271 176603
12501 -296033 169517 -135243 26674 361272 380829 18488 230091 240990 -5918 -501947 215009
12489 123576 270264 -66161 71178 -167393 -305361 -204288 -97993 323267 -335014 269253
12478 -94346 42627 13007 -8846 460579 -242879 66648 -1192 105581 -103840 101861 -18427
12466 89649 -49473 -286602 133602 -19904 143590 -27698 172085 397629 378559 183740
$$ packed form
12546a13955H979L07835e438j50237J0066O876b6552E7359J99539a31239D0685
12534b22264d2008D16780A95522L9085a86228h9130j42094R8120q6821k23484
12524d43409B67462A10070f5174C7991J54081M0906I3425f4671l6885L7215A07979
12512A85263a76552f8593A6131b95835A4186K65929C5436c67098R2827A76603
12501b96033A69517a35243B6674L34598J9557A8488K11603J0899e918m96029B15009
12489A23576J46688f6161G1178a67393j37968J01073i7993C23267c35014B69253
12478i4346D2627A3007h846D60579b42879F6648a192A05581a03840A01861a8427
12466H9649d9473k37129A33602a9904A43590b7698A72085K25544j9070A83740
$$ plain form
12455 126202 192960 -9341 221465 128434 97149 106227 -125071 72344 -165197 -126308 -18981
12443 -111338 77757 -155964 -112169 255954 26118 -5692 236425 229031 -131548 110748 -5044
12431 43651 -265129 -274797 175286 110644 -74767 -137272 -201203 349759 -551685 104817 -12264
12419 -16347 133553 219122 132913 -192308 124893 6960 160165 148016 252031 -240344 91215
12407 -201155 42413 -359395 -141980 156664 173043 99003 93473 -190102 122050 -21191 226109
12395 35066 -170281 -215423 16053 254191 -144868 -24305 -123757 159417 77485 40220 6372
12383 -47910 43458 -19275 -197087 13226 -21206 -121455 178288 -176073 252104 -76258 363745
12371 269932 -74452 -58705 117320 61666 279699 -15645 93366 134862 25831 7458 61221
$$ packed form
12455A26202O6758i341B21465r3031l1285R078a25071G2344a65197L8889a8981
12443a11338G7757a55964M3795B55954B6118e692B36425p394a31548A10748e044
12431D3651b65129r668A75286o4642g4767o2505o3931C49759e51685A04817a2264
12419a6347A33553Q5569q6209a92308A24893F960J53205j2149J04015b40344I1215
12407b01155D2413c59395a41980A56664J6379p4040n530a90102A22050b1191B26109
12395C5066a70281m5142A6053K38138a44868b4305r9452A59417G7485l7265F372
12383d7910D3458a9275j77812A3226b1206j00249A78288a76073B52104g6258C63745
12371B69932g4452J5747A17320n5654K18033a5645I3366M1496B5831G458N3763
$$ plain form
12360 61221 -7334 261594 137073 216753 -109031 -97164 -18620 311511 -58536 318627 -180089
12348 193245 -139745 141182 316357 105232 270153 -186137 -27381 41844 188228 -40028
12337 -282603 72892 -219216 66568 -188935 136154 -53679 -437691 -42896 337185 -175636
12326 -36240 112817 -130879 55701 -39110 184113 -40533 -55410 112443 -81032 149493 156543
12315 156543 319727 -40268 129854 421489 297061 9502 11686 32566 427343 167073 169670
12304 169670 -41795 144167 148824 439213 243982 267375 259815 201679 256649 -295481 24568
12292 98150 199101 -95549 149644 384 -264672 120394 141192 -225578 159939 109002 58067
12281 58067 -113760 214056 125088 126940 237212 -112928 -158932 154152 359692 280809 -47248
$$ packed form
12360F1221g334B61594j24521P9680a09031J1867a8620C11511e8536C18627a80089
12348A93245a39745A41182J75175A05232J64921a86137b7381D1844J46384d0028
12337b82603G2892b19216F6568a88935A36154e3679l84012d2896C37185a75636
12326c6240A12817a30879E5701c9110A84113d0533j4877A12443h1032A49493P050
12315A56543J63184d0268A29854K91635j24428I502K184K0880L94777A67073K597
12304A69670d1795A44167M657K90389j95231K3393p560n8136N4970b95481B4568
12292I8150J00951i5549A49644C84b64672A20394K0798b25578A59939n0937n0935
12281E8067a13760B14056q8968J852J10272a12928m6004A54152K05540p8883d7248
$$ plain form
12269 94403 -167905 220444 -234571 66131 398773 188043 171288 -74737 268831 339208
12259 339208 36571 -93213 -22946 156496 307792 64035 381296 -46959 204682 -11203 26735
12247 334507 436227 328332 28727 8049 19922 263349 312655 44732 11127 131221 -212927
12235 359115 132094 501590 345739 -2456 494886 -95673 190089 -213414 -283348 105013
12224 38450 20602 -149072 243492 405281 -285615 113753 236922 22793 -183272 298254
12213 352479 43479 215966 149262 265236 484627 134343 319327 297261 202007 129531
12203 129531 395366 269060 166608 235179 106605 94593 126793 352372 290040 466611
12193 466611 293394 59164 46284 -36140 561023 -66942 323514 -2774 177641 113864 137252
$$ packed form
12269I4403a67905B20444b34571F6131L32642A88043j6755g4737B68831P0377
12259C39208C6571i3213b2946A56496J51296F4035L17261d6959B04682a1203B6735
12247C34507J01720j07895B8727H049J1873K43427M9306D4732A1127J20094b12927
12235C59115A32094L69496j55851b456D94886i5673A90089b13414o9934A05013
12224C8450j7848a49072B43492J61789b85615A13753J23169B2793a83272B98254
12213C52479D3479J72487o6704J15974K19391A34343J84984k2066r5254p2476
12203A29531K65835j26306j02452O8571A06605j2012L2200K25579o2332J76571
12193D66611j73217E9164j2880c6140E61023f6942C23514b774A77641o3777K3388
$$ plain form
12182 137252 365317 191567 297335 420236 459779 200524 187037 172244 250007 247981 220845
12171 220845 28638 118198 101484 153487 231761 49106 204790 199191 -57622 -33898 334955
12159 241750 136118 263891 44961 199007 298242 344023 158989 144642 360958 701568
12149 701568 97272 459143 372377 -70808 141611 1218 116214 306624 454625 65678 112420
12138 112420 402942 -94313 -174505 -112692 139927 -105408 184452 48319 146515 125573 135367
12127 135367 365900 -220058 33844 34971 50745 319041 22541 -118495 270021 264021 78002
12115 282107 154848 -64900 30102 736 -75317 -89565 254621 134180 97409 182888 328314
12104 328314 -17829 -30950 360717 29558 155718 -26520 -344261 218480 157993 -103636
$$ packed form
12182A37252K28065j73750J05768J22901L9543B00524j3487j4793P7763k026k7136
12171B20845B8638Q9560j6714N2003P8274D9106J55684n599e7622K3724C34955
12159B41750j05632J27773D4961J54046R9235M5781A58989j4347K16316L40610
12149G01568I7272L61871q6766g0808A41611A218J14996J90410J48001F5678M6742
12138A12420K90522i4313q0192O1813A39927a05408A84452D8319R8196k0942R794
12127A35367K30533b20058C3844J127J5774K68296B2541a18495B70021o000G8002
12115B82107j27259f4900C0102G36g5317j4248B54621j20441l6771Q5479J45426
12104C28314a7829j3121C60717B9558J26160b6520l17741B18480o0487a03636
$$ plain form
12093 175443 214623 318429 -161255 377255 162808 136090 -33193 -82959 246268 148739
12083 148739 298948 118218 195091 140771 -36899 247711 320883 33747 -63388 108322 173692
12072 173692 554855 457127 202088 66687 30738 245131 9764 328672 213520 -72687 71767
12060 176943 155461 463631 97981 89589 270424 190561 294107 171473 226075 126743 53098
12048 -97854 7472 22833 -62593 323405 365735 152698 45140 -35163 157508 189110 145398
12037 145398 84966 270024 -227090 66816 239565 150423 -208497 -49326 -295479 42933
12026 96764 387535 137720 -155131 -32621 -220959 -189657 67233 214347 -321866 107092
12015 60388 -29725 -343684 26838 -231554 96343 -312625 -13651 -138722 8517 179936 292896
$$ packed form
12093A75443L9180J03806a61255C77255A62808k6718c3193m9766B46268r7529
12083A48739J50209A18218P6873n4320c6899B47711P3172C3747f3388A08322O5370
12072A73692L81163r7728B02088F6687C0738K14393I764L18908j15152g2687G1767
12060A76943k1482L08170I7981q392J80835p9863J03546j22634N4602r9332E3098
12048i7854G472J5361f2593C23405M2330A52698D5140c5163A57508L1602m3712
12037A45398o0432J85058b27090F6816J72749q9142b08497d9326k46153D2933
12026I6764K90771A37720a55131c2621j88338L1302F7233J47114c21866A07092
12015F0388b9725l13959B6838b31554I6343c12625a3651j25071H517J71419J12960
$$ plain form
12004 292896 -132106 46953 33519 199437 145581 21156 11586 71112 -125984 237717 86294
11992 149573 -104165 -289438 -41350 401491 41445 44189 235823 209453 51212 111170 229991
11981 229991 -265734 -83482 39809 183123 88241 -6346 -240495 -86478 -190267 -71999 -9613
11969 -219310 -28243 64367 -119818 -81360 131007 73787 166570 -78438 -75611 63249 -83069
11957 1868 -173709 81870 -213689 213663 88224 204936 -21880 -315744 -130622 -129421 12947
11945 -48959 6167 33651 -357006 29500 -561985 -154831 -108399 -61368 -96917 -132022 13862
11933 42196 91671 -151995 -66217 -119715 -64487 217632 233891 -149830 -95307 9542 247713
11922 247713 9527 540026 -65449 286985 93084 -194057 -168302 196969 -85848 -20873 -273986
$$ packed form
12004B92896a32106D6953j3434J65918n3856B1156r570N9526a25984B37717H6294
11992A49573a04165j85273d1350D01491D1445K744J91634k6370E1212N9958J18821
11981B29991b65734h3482C9809J43314H8241f346k34149h6478j03789g1999i613
11969b19310b8243F4367a19818L8458A31007n7220R2783g8438K827F3249h3069
11957A868a73709H1870b13689B13663H8224J16712b1880k93864a30622J201A2947
11945d8959F167K7484c57006B9500e61985a54831M6432M7031l5549l5105A3862
11933D2196M9475a51995f6217n3498N5228B17632J6259a49830N4523I542K38171
11922B47713I527N30499f5449B86985I3084a94057K5755A96969h5848b0873k53113
$$ plain form
11911 -273986 360846 51431 96881 123717 54603 13910 62864 -95207 -241264 -116196 -278485
11900 -278485 319317 -194968 -221096 -118301 43674 -200311 -242464 17457 -243707 -71900
11889 212866 99478 46855 46559 140315 99946 -74 53342 71430 -194386 18381 333082 -514742
11876 93817 174823 -112442 133784 -2851 -45664 -59249 5090 -134837 -140759 -160284 -199583 -102784
11864 -102784 -179177 254291 56655 82527 178087 -224399 -266984 41147 -169259 -79712 131307
11852 -77359 -217546 -31627 17060 -232273 126857 -235993 158956 -33840 -166253 -35335
11841 -222078 47721 120780 -164057 -141353 98751 -99403 125263 45066 124268 -279655 235809
11829 -90969 -80798 91114 247253 -91557 -81955 108013 -167238 -137740 -139522 25922 62768
$$ packed form
11911b73986C60846E1431M5450K6836E4603A3910M8954i5207j46057a16196j62289
11900b78485C19317a94968k6128J02795D3674b00311m2153A7457b43707g1900
11889B12866I9478D6855k96R3756m0369g4E3342J8088a94386A8381L14701e14742
11876I3817Q1006a12442A33784b851m2813j3585E090a34837n922j9525l9299R6799
11864a02784p6393B54291E6655K5872R5560b24399m2585D1147a69259g9712A31307
11852g7359j40187c1627A7060b32273A26857b35993A58956c3840j32413c5335
11841b22078D7721P3059a64057K2704I8751i9403A25263D5066P9202b79655B35809
11829i0969J0171I1114J56139i1557R602A08013a67238K9498j782B5922L6846
$$ plain form
11818 62768 35407 -82420 120452 109954 249070 93745 35750 367288 -218394 -218966 -53759
11806 -43090 29955 5352 82468 100763 -18309 19260 -72375 -192236 -106788 -79148 -82114 14606
11793 -44392 279146 -25929 23337 -120937 420125 87576 38828 91 206171 285088 -112376
11781 94656 276686 121338 -382422 252161 246268 198557 -83944 -110103 -90529 251171 85784
11769 -444539 88433 -72579 139013 -73515 201686 -30199 -48012 -64518 -40345 107336 -254828
11757 -146095 -101445 -27625 -48629 -144904 -15118 -44517 108345 -176215 -218448 28458 -270324
11745 -189821 13835 -54160 -22817 -180836 -88965 -10104 237390 -65569 -62866 -250589 -59260
11733 42984 -137790 -344409 9103 168833 92220 207795 108758 -3053 148996 -152342 -238576
$$ packed form
11818F2768k7361h2420A20452j0498J39116I3745C5750L31538b18394n72e3759
11806d3090B9955E352P7116J8295a8309A9260g2375j19861Q5448K7640k966A4606
11793d4392B79146b5929B3337a20937D20125H7576C8828I1K06080P8917a12376
11781I4656J82030A21338c82422B52161n893m7711h3944k6159J9574B51171H5784
11769d44539H8433g2579A39013g3515B01686c0199j7813j6506K4173A07336b54828
11757a46095M4650b7625k1004r6275a5118k9399A08345a76215m2233B8458b70324
11745a89821A3835e4160b2817j58019h8965a0104B37390f5569K703j87723e9260
11733D2984a37790k06619I103J59730p6613J15575r9037c053A48996a52342q6234
$$ plain form
11722 -238576 -122649 129253 -42212 -5769 229044 45271 -124118 -239026 -136014 5662 48336
11711 48336 -57725 -373090 141781 -86637 -107932 279047 -95314 210020 -244284 -80539 -75977
11700 -75977 4039 -750 19934 -127435 135680 91301 -155752 107896 -57136 262721 -15851
11688 125002 -496716 86287 114160 237717 109964 184690 -24737 -83310 -93953 -279838 81108
11676 -267039 4485 -29129 406960 -28107 36069 -6170 178238 -108260 -135227 44057 29 222540
11664 222540 -137728 -186250 5969 14788 62686 118643 134349 214508 4209 280185 119678
11652 -96553 63486 129940 145825 228511 -2133 -10617 43014 252354 -147991 135908 71418
11641 71418 359224 -63477 69575 117352 219680 182859 73907 2944 116506 -60062 -45063
$$ packed form
11722b38576J15927A29253d2212e769B29044D5271a24118j14908J03012E662M2674
11711D8336e7725l15365A41781h6637k1295B79047i5314B10020b44284h0539M562
11700g5977D039g50A9934a27435A35680m4379a55752A07896e7136B62721a5851
11688A25002d96716H6287K7873J23557A09964P4726b4737n8573j0643j85885H1108
11676b67039D485b9129D06960b8107C6069f170A78238a08260k6967D4057B9K22511
11664B22540a37728m8522E969Q819M7898N5957J5706Q0159D209K75976A19678
11652i6553F3486O6454J5885Q2686b133q484D3014K09340a47991A35908o4490
11641G1418K87806f3477F9575M7777J02328l6821G3907B944J13562f0062J4999
$$ plain form
11630 -45063 -51092 -94635 218270 26476 196050 -353333 -368273 175550 100337 176484 -268379
11618 -57537 66763 71670 111187 116169 -81602 -277997 50881 -36496 -57680 164403 -10077 100318
11605 364030 -22463 -25229 -104674 -163191 430643 -26652 -54107 -123985 106541 60946 -68769
11593 -160449 100964 -258458 138176 78995 -153734 37156 -3057 70419 118738 -103896 -202121
11582 -202121 -59503 60198 79937 97511 193793 340 56201 16399 4942 -74619 147690 39328
11569 44514 -67077 47253 114610 158694 74555 102714 222597 118653 89898 23227 -320492
11557 265208 114480 121382 -188393 -280535 115131 -55369 121726 -27420 108480 -174130
11546 -187415 273589 -43743 174176 419297 4546 -306894 236001 307459 160627 14282
$$ packed form
11630d5063o029m3543B18270B6476J69574c53333j4940A75550p5213P6147b68379
11618e7537F6763M907L9517M982h1602j96395E0881c6496k1184A64403a0077A00318
11605C64030b2463k766p9445n8517D30643b6652k7455o9878A06541m5595f8769
11593a60449A00964b58458A38176n9181a53734C7156c057G0419M8319a03896r8225
11582b02121e9503F0198J9739J7574R6282C40N5861A6399D942g4619A47690C9328
11569D4514f7077D7253O7357M4084G4555K8159J19883j03944k8755B3227c20492
11557B65208A14480O902a88393r2142A15131e5369A21726b7420A08480a74130
11546a87415B73589d3743A74176K45121D546c06894B36001P1458j46832A4282
$$ plain form
11535 240186 -24809 -54258 56270 104180 110033 -210300 311961 -6908 75427 300710 79022
11523 -148533 3036 -255470 -70863 134091 23969 21487 -34608 -37981 -19824 250512 142777
11512 142777 31401 99112 138757 116433 321704 228641 -161027 -277534 243205 288874 37261
11500 61189 206754 1700 161616 -24622 -110682 208612 209464 269900 144125 75585 269008
11489 269008 21412 -67988 356028 20271 35226 -37497 -157868 96509 289516 171827 449096
11478 449096 111497 25706 250551 -20328 122594 179922 77243 134346 242411 145279 359718
11467 359718 -180606 -163312 9550 74791 233699 360340 177232 84627 366834 -21757 222228
11455 374582 265931 84310 142126 211703 142724 102286 143628 305889 510869 234500 84966
$$ packed form
11535B40186b4809k9449E6270M7910N853b10300C11961f908G5427K25283G9022
11523a48533C036b55470g0863A34091B3969k482c4608l373J8157B50512j07735
11512A42777C1401O7711L9645k2324K05271r3063a61027j16507B43205M5669C7261
11500F1189J45565A700J59916b4622q6060B08612Q52O0436j25775o8540J93423
11489B69008B1412f7988C56028B0271J4955c7497j20371I6509J93007j17689K77269
11478D49096A11497B5706K24845b0328A22594N7328G7243N7103J08065r7132K14439
11467C59718a80606J7294I550O5241J58908J26641A77232H4627K82207b1757B22228
11455C74582j08651H4310N7816O9577o8979m0438M1342J62261K04980B34500H4966
$$ plain form
11443 -249488 304074 -7325 153387 176489 427671 84784 206486 118689 213970 101286 -43978
11431 -231408 137272 269541 10676 -124848 108003 129488 266930 46906 416473 43843
11420 301478 -60489 105635 -122383 -28973 68547 -71830 192006 103210 84539 363218 -232283
11408 307065 198499 78950 -138332 -197952 -163158 -118099 -44278 264543 -22030 91540 -22628
11396 -31560 170014 -51284 237948 211341 6085 -153740 -327724 52253 153094 56049 58952
11385 58952 -113685 15290 -344753 -282323 -101018 189497 150469 145204 77425 186061 -16983
11373 -154998 -106625 -122147 -117526 -118253 55545 145275 -103590 82556 73631 151466 61167 -106910
11360 10553 175963 160026 -115600 104392 -137160 -15877 -84148 241272 -223496 -269381
$$ packed form
11443b49488C04074g325A53387K3102K51182H4784J21702q7797R5281A01286d3978
11431b31408A37272J32269A0676a24848A08003K1485J37442D6906L69567D3843
11420C01478f0489A05635a22383b8973F8547g1830A92006q8796j8671K78679b32283
11408C07065j08566G8950a38332n9620L4794M5059d4278B64543b2030I1540b2628
11396c1560A70014e1284B37948k6607F085a53740j73984E2253J00841E6049K903
11385E8952a13685A5290c44753O2430a01018A89497l9028n265o7779J08636a6983
11373a54998M8373j5522M621p27E5545Q9730a03590H2556q925P7835F1167a06910
11360A0553J65410j5937a15600A04392a37160a5877o8271B41272b23496m5885
$$ plain form
11350 -269381 -272526 -5788 -442429 285226 317130 -169648 -29591 134458 -306805 -104644 77535
11338 -16068 338317 99360 -109336 -151357 345787 -125568 72952 -32382 -173683 86199 -117221
11326 126601 -3694 27643 69144 -47850 304559 -49693 -175219 -220798 -29435 -138876 -103407
11315 -103407 161801 -109056 291716 -201554 88632 -378518 89600 -45248 14381 317921
11305 317921 -92812 98539 133824 -227068 184935 -113847 -99632 169106 21431 -212352
11294 92762 701 130761 -29130 -172657 250195 120455 -262135 -119088 110730 -200646
11283 12523 77512 98591 -69130 -179306 -83181 411609 -357854 -224591 -100843 -167010 -271177
11272 -271177 -117261 -4128 -31182 -68893 98416 37655 -47551 -101377 -291452 89841 126997
$$ packed form
11350b69381l145e788m36641B85226L1904a69648b9591A34458c06805a04644G7535
11338a6068C38317I9360a09336m2021C45787a25568G2952c2382j41301H6199a17221
11326A26601c694B7643M1501d7850C04559d9693j25526m5579b9435j09441L5469
11315a03407A61801a09056B91716b01554H8632c78518H9600d5248A4381L03540
11305C17921i2812I8539L5285b27068A84935a13847J4215A69106B1431b12352
11294I2762G01J30060b9130j43527B50195A20455b62135a19088A10730b00646
11283A2523O4989K1079f9130j10176h3181D11609c57854J33263a00843o6167j04167
11272b71177a17261d128k7054l7711I8416C7655d7551n3826j90075H9841L7156
$$ plain form
11261 126997 -50428 103677 21950 -204413 -98914 -310463 -178468 14278 -212371 -105154
11250 48397 -34153 -292765 -205543 -100292 -136740 -297372 -11211 -19662 288452 -176149 75024
11238 47870 225960 -109631 -92244 119841 24874 -173285 134986 -76198 90586 23826 -250931
11226 -16630 -149174 -120740 -100145 -325924 -72200 -255612 -362847 -154999 217652 -263125
11215 -93727 330469 -32077 -264240 -289817 -450903 -216129 -53267 -257864 -56882 -259705
11205 -259705 -89426 -3927 253668 -153934 -227864 31439 -55633 131503 -19398 230942 40176
11193 -57189 45428 -25677 -67602 55086 23644 -6857 54915 221988 -332717 152319 -3293
11181 95543 196626 -96798 -454517 -122430 -55172 -409392 100138 209220 102031 139457
$$ packed form
11261A26997e0428A03677B1950b04413i8914k11549J31995A4278b12371a05154
11250D8397c4153k58612Q7222a00292l6448j60632a1211q451B88452a76149G5024
11238D7870J78090a09631J7387A19841B4874a73285A34986g6198I0586B3826b50931
11226a6630j32544K8434K0595k25779g2200j83412j07235a54999B17652b63125
11215i3727C30469c2077k32163k5577j61086b16129e3267k04597e6882k02823
11205b59705h9426c927B53668a53934p3930C1439e5633A31503a9398B30942D0176
11193e7189D5428b5677m1925E5086B3644f857E4915J67073c32717A52319c293
11181I5543J01083i6798l57719a22430e5172l54220A00138J09082A02031L7426
$$ plain form
11171 139457 -401068 73671 249661 220100 -183524 -140591 -14984 -150639 -90368 -154158 -22279
11159 -373787 -102470 -1320 47766 -77805 -51916 133 62759 22898 -169394 -60563 -121139 -219211
11147 -219211 103160 -142590 37523 -54738 -595692 -169232 61112 236503 109575 11870
11136 -76671 277721 70616 -137015 153556 155801 79957 256083 62773 -162887 63614 -196317
11124 -170512 138401 -56895 112526 260427 178603 144632 315689 202943 -35330 -28403 96542
11112 -142321 -22775 214271 123568 242662 118623 -91775 -24712 73306 274298 260527 -235782
11100 -54712 178166 -44900 -45021 159727 371878 280875 252522 35419 10954 18402 -61856 -92198
11088 -92198 -8621 465961 375946 575504 246287 -68053 -15416 458783 333432 102033 469944
$$ packed form
11171A39457d01068G3671J75990k9561a83524M2933a4984j35655O0271o3790b2279
11159c73787a02470a320D7766g7805K5889A33O2626B2898a69394f0563o0576r8072
11147b19211A03160a42590C7523e4738n40954a69232F1112J75391A09575A1870
11136g6671B77721G0616a37015A53556K245p5844J76126F2773a62887F3614a96317
11124a70512A38401e6895A12526J47901q1824l3971J71057j12746c5330O927I6542
11112a42321b2775B14271r0703J19094A18623i1775b4712G3306K00992j3771b35782
11100e4712A78166d4900j21A59727K12151r1003k8353C5419A0954P448f1856l0342
11088i2198h621D65961r0015J99558B46287f8053a5416D58783j25351A02033L67911
$$ plain form
11077 469944 16595 393249 387114 335513 -19071 256386 444237 194099 173903 106109 136203
11066 136203 27157 292901 120113 213598 -25285 59552 283102 346804 451668 356133 395789
11055 395789 106533 251034 528664 286680 421108 428004 234100 252127 270672 655631
11045 655631 616665 607829 398864 400520 243614 907489 842829 966489 500789 704168 607086
11034 607086 771485 921706 825337 994537 723605 976320 644574 988732 1151700 920107
11024 920107 1098304 1060348 1069020 922496 1134058 1334738 892762 880538 908299 1024043
11014 1024043 722779 678627 692513 605403 864626 1165591 867022 679684 932636 887200
11004 887200 934472 759718 726508 910983 624804 765237 556716 746860 346046 591949
$$ packed form
11077D69944A6595L76654o135n1601a9071B56386J87851A94099k0196o7794L0094
11066A36203B7157K65744A20113R3485b5285E9552K23550O3702J04864r5535L9656
11055C95789A06533J44501K77630k41984J34428O896j93904J8027J8545L84959
11045F55631l8966q836k08965J656j56906O63875o4660J23660m65700K03379r7082
11034F07086J64399J50221r6369J69200k70932K52715l31746L44158J62968k31593
11024I20107J78197l7956Q672j46524K11562K00680m41976j2224K7761J15744
11014A024043l01264m4152J3886q7110K59223L00965k98569j87338K52952m5436
11004H87200M7272j74754l3210J84475k86179J40433k08521J90144C46046K45903
$$ plain form
10994 591949 801839 759910 895064 841221 830598 817948 689546 686513 795638 806403 1020841
10983 1020841 604391 646776 664343 809226 536499 818040 727448 881208 603078 640215
10973 640215 791542 872947 904277 863620 623852 576322 964060 943551 1057664 1160882
10963 1160882 1324469 1240569 1203517 1286702 1781409 1585933 1855167 2074162 2196947 2739710
10953 2739710 2658994 2947113 2942242 3023175 2950353 3036557 3025241 2614700 2263595 1779927 2277659
10942 2277659 2017980 1625244 1318331 1547207 1571860 1801365 1689920 1336354 1315558 1058715
10932 1058715 584688 1110819 839963 535177 392865 588528 535749 555479 84088 -97102
10921 236206 248747 173327 -89956 303840 59807 -172990 27467 -6263 -466597 14023 69273
$$ packed form
10994E91949K09890m1929J35154n3843j0623j2650j28402l033J09125J0765K14438
10983A020841m16450M2385J7567J44883k72727K81541r0592J53760k78130L7137
10973F40215J51327Q1405L1330m0657k39768m7530L87738k0509J14113J03218
10963A160882J63587q3900l7052Q3185M94707j95476K69234K18995J22785N42763
10953B739710q0716K88119m871Q0933p2822Q6204j1316m10541l51105m83668M97732
10942B277659k59679l92736l06913K28876K4653K29505j11445l53566k0796k56843
10932A058715m74027N26131k70856l04786j42312J95663n2779J9730H4088i7102
10921B36206J2541p5420h9956C03840E9807a72990B7467f263m60334A4023N5250
$$ plain form
10910 69273 8073 178571 216041 208541 92931 438953 -325373 -150928 15723 -83483 149980
10898 100723 -98829 123693 351759 -14025 -102001 204524 -11491 321283 -174778 20202
10887 49233 -15572 -431420 52157 -46082 226062 39181 -278156 -297856 -144189 -236802 186737
10875 -183324 123044 -201160 490637 279514 -122476 311322 76476 190891 140001 -80828
10864 159042 158516 371327 7292 44699 -28195 -260201 -82368 36496 70945 -198495 -185005
10853 -185005 -27628 -102140 -177660 -55166 88490 128554 18585 -59056 91120 25957 51408
10842 51408 -322527 -85415 -32772 -13312 163884 -277384 -17438 90384 33504 -85026 77796
10830 21784 -147037 -303945 -166515 130289 27348 -69520 -78391 -346959 -531227 -174113
$$ packed form
10910F9273H073J70498L7470p500I2931L46022c25373a50928A5723h3483A49980
10898A00723i8829A23693K28066a4025q7976B04524a1491C21283a74778B0202
10887D9233a5572m15848E2157d6082B26062C9181b78156j9700a44189r2613A86737
10875a83324A23044b01160D90637k11123a22476C11322G6476J14415n0890h0828
10864A59042n26K12811G292L7407b8195k32006h2368C6496L4449a98495J3490
10853a85005b7628p4512p5520e5166H8490M0064A8585e9056I1120B5957K5451
10842E1408c22527h5415c2772a3312A63884b77384a7438I0384C3504h5026G7796
10830B1784a47037j56908J37430A30289B7348f9520q871k68568j84268a74113
$$ plain form
10819 -124186 -93717 183165 183129 -140341 -111268 -431710 253220 -71798 40539 52647 181852
10808 181852 -96596 -57967 -62304 -276585 -156648 -131551 -311624 -103354 57949 28813 -224588
10796 -192151 -20972 372232 -243938 -50141 875 121147 -191533 -290426 -100650 -69301 -296908
10785 -296908 32138 409176 309822 105798 -110519 -146660 -208907 -158123 226533 -401770
10774 -106794 118818 -40784 63838 -12535 -6412 -184087 -325121 -56727 -268390 -161790 -45047
10762 -65789 85011 61334 -120124 -209613 87649 -4638 -129126 -51831 116016 382742 -205883
10750 -107486 282051 -66978 26951 -230062 -191795 -63470 297927 -268090 33422 -101595
10739 66596 230713 -209542 317328 72593 -42953 -163360 14677 243354 -181441 -97534
$$ packed form
10819a24186L0469A83165l6a40341K9073l20442B53220g1798D0539J2108J29205
10808A81852i6596L8629m337k14281J19937K5097j80073a03354E7949B8813b24588
10796a92151b0972C72232b43938e0141H75J20272a91533r8893a00650L1349k27607
10785b96908C2138L77038r9354A05798a10519l6141o2247N0784B26533d01770
10774a06794A18818d0784F3838a2535O123j77675j41034e6727k11663J06600d5047
10762f5789H5011k3677a20124q9489H7649d638j24488e1831A16016K66726b05883
10750a07486B82051f6978B6951b30062L8267f3470B97927b68090C3422a01595
10739F6596J64117b09542C17328G2593d2953j20407A4677K28677a81441Q3907
$$ plain form
10729 -97534 40887 8623 204489 202344 -72064 160551 34771 70216 -347917 -164330 -85477
10718 -85477 -106871 -243376 -140194 -41175 120070 19739 3499 -138234 -277794 -2560 96900
10706 -31688 -219220 23471 131007 34869 482788 -8110 -16977 -58470 176508 61408 -19757
10694 98568 -291601 -7194 166379 177416 127995 94922 -126389 203602 -143381 180935 112726
10683 112726 -343393 270670 105454 -131932 -95506 -83022 1209 301990 -15509 -122028
10673 -122028 -90649 -25767 96689 -55745 77516 -72873 -305370 -75816 -327169 -144745 -242660
10662 -242660 63545 11892 75351 170055 129338 53698 81297 136000 176204 -129760 -85005
10651 -85005 -41577 -175612 92262 -185905 75355 -18827 -245466 -3820 63019 -111052 415659
$$ packed form
10729i7534D0887H623J95866k145g2064A60551C4771L5445c47917a64330P8853
10718h5477k1394j36505J03182d1175A20070A9739C499a38234j39560b560I6900
10706c1688j87532B3471J07536C4869M47919h110q867m1493A76508F1408a9757
10694I8568b91601g194A66379J1037m9421l3073a26389B03602a43381A80935o8209
10683A12726c43393B70670A05454a31932L6426J2484A209L00781a5509j06519
10673a22028L1379b5767I6689e5745G7516g2873k32497g5816k51353a44745r7915
10662b42660F3545A1892O3459R4704m0717E3698K7599N4703M0204a29760M4755
10651h5005d1577j34035I2262a85905G5355a8827k26639c820F3019a11052D15659
$$ plain form
10639 -5996 -165592 -199486 -472409 -58940 90330 29421 -351229 -148521 -128805 110544 71170
10628 71170 -469705 -61108 -38938 -21057 -121432 19647 -219085 32081 -224437 186254 177902
10617 177902 2023 138501 -479331 -243251 -174462 -519947 -177259 76501 -248343 -97270
10606 7265 -167519 -110261 -280709 -357132 -193333 -190278 -57737 106901 -370996 90307 -94979
10594 -18974 74273 -78993 -238682 102914 44835 -167269 -86678 -212921 -9180 -156201 -344930
10583 -344930 -50869 -103729 -289890 -232193 26692 -285710 -255748 122557 -335549 71803 -96798
10571 29682 -171752 -80953 -245186 -18254 -57350 156188 -389955 -51231 -223346 23273 -231729
10559 -149408 -209085 -158050 104720 103087 -5739 -225393 -254523 67394 66293 -76102 -165734 41178
$$ packed form
10639e996j59596l3894k72923e8940I0330B9421c51229a48521J9716A10544l9374
10628G1170d69705f1108K2170J7881j00375A9647b19085C2081b24437A86254q352
10617A77902B023J36478d79331K36080O8789l45485a77259G6501b48343i7270
10606G265a67519N7258j70448p6423J63799L055e7737A06901c70996I0307i4979
10594a8974G4273g8993j59689A02914D4835a67269Q0591j26243i180j47021j88729
10583c44930e0869n2860j86161N7697B6692b85710K9962A22557c35549G1803i6798
10571B9682a71752h0953j64233a8254l9096A56188c89955e1231j72115B3273b31729
10559a49408n9677N1035A04720j633e739k19654k9130F7394j101g6102q9632D1178
$$ plain form
10546 -1765 -39734 -99271 222405 287769 -130573 -51875 -112280 -225073 67030 -211146 -32451
10534 -238806 -172452 100059 -43983 -207869 270732 88866 -56564 -215294 -208625 -72760 144336
10522 -40764 105076 54603 264304 -250362 -151616 -140385 -122007 277715 -67059 21285 -48803
10510 64365 -155092 -39827 -19384 -197976 -204496 -203620 25969 -16709 154841 5238 -23700 124278
10497 -16476 -17862 -233440 -320524 -87703 31897 261769 -50146 -106831 -134293 -347009 -172646
10485 -326789 -97819 221844 -374301 -374359 155174 16402 163772 -160228 -83798 246369 -66239
10473 2557 207386 -212204 -74102 -136341 -11224 -109479 39707 -141172 -368043 -32258 -25031
10462 -25031 -62916 39231 398029 208294 193398 465504 4316 467666 111207 244181 137039
$$ packed form
10546a765l7969n9537B22405O5364a30573e1875o0405j12793F7030b11146c2451
10534b38806O6354A00059d3983j63886B70732H8866e6564j58730O669g2760A44336
10522d0764A05076n0473K09701b50362R8746J1231J8378B77715f7059B1285d8803
10510F4365a55092c9827a9384j78592o520Q76B5969a6709A54841E238b3700A24278
10497a6476j386k15578q7084h7703C1897K29872e0146n6685k7462k12716a72646
10485c26789i7819B21844c74301n8A55174A6402J47370a60228P6430B46369f6239
10473B557K04829b12204g4102o2239a1224r8255C9707a41172k26871c2258P227
10462b5031l7885C9231L58798j89735j4896K72106D316M63350A11207J32974j07142
$$ plain form
10451 137039 363186 -103393 15961 -194496 -156279 -1809 59426 221131 -161140 -120644 -349365
10440 -349365 -135507 -180009 127779 -227494 -445964 -62904 147037 167774 -179359 -53800
10429 -105134 -131384 295697 -121104 -116439 46576 -330752 59338 -437490 88761 69025 113286
10418 113286 -142121 193418 -206624 177472 -99085 -2311 -86529 68121 -10888 -82358 -212279
10407 -212279 56379 -166606 -310014 -84990 -176246 -108948 -221611 65979 -122035 -289596
10397 -289596 -198090 -84826 35826 -18416 -458101 -224168 -176517 -77849 6163 153049 -120323
10385 20411 -70488 -41532 -154013 -83936 194820 153270 -314 213684 -169527 227033 149704
10374 149704 57213 296658 197951 239251 441209 54806 217821 407522 121841 37186
$$ packed form
10451A37039K26147a03393A5961a94496L8217a809E9426J61705a61140M0496k28721
10440c49365a35507m4502A27779b27494k18470f2904A47037K0737a79359e3800
10429a05134k6250B95697a21104M665D6576c30752E9338d37490H8761j9736M4261
10418A13286a42121A93418b06624A77472i9085b311q4218F8121a0888p1470j29921
10407b12279E6379a66606j43408h4990r1256O7298j12663F5979a22035j67561
10397b89596R1506h4826C5826a8416m39685b24168M7651g7849F163J46886a20323
10385B0411g0488K8956j12481P0077A94820m1550c14B13684a69527B27033p7329
10374A49704E7213K39445r8707M1300K01958E4806J63015J89701A21841C7186
$$ plain form
10363 -30136 -81279 13265 318521 112714 -116625 88642 326897 467121 257042 328673
10353 328673 190197 -25173 125176 326748 554229 489631 651257 412782 542782 321638
10343 321638 683313 336088 217997 351654 548363 489082 -41616 61099 513505 501420
10333 501420 211834 651492 469377 343687 305147 250735 206043 279326 536435 342434
10323 342434 169335 -2058 5733 22904 70901 277904 86178 13874 287303 232251 202726
10312 202726 -216339 -106798 -21931 158971 108911 224639 344300 282647 270325 234075
10302 234075 242984 61713 -63030 -238659 192174 25500 345667 -185122 -21542 -289821 -58861
10290 -48953 168512 212763 -121028 -390930 368896 -200461 -74292 -441619 363281 -118020
$$ packed form
10363c0136n1143A3265L05256A12714a16625H8642K38255J40224k10079P1631
10353C28673j38476b5173A25176K01572K27481o4598J61626k38475J30000k21144
10343C21638L61675C36088j18091J33657J96709n9281d1616F1099M52406j2085
10333E01420B11834M39658j82115j25690l8540n4412m4692P3283K57109j94001
10323C42434A69335b058E733J7171M7997K07003H6178A3874K73429n5052k9525
10312B02726b16339a06798b1931A58971n0060J15728J19661o1653j2322l6250
10302B34075Q909F1713f3030j75629A92174B5500L20167a85122b1542k68279e8861
10290d8953A68512M4251a21028k69902C68896b00461g4292l67327C63281a18020
$$ plain form
10279 -123306 183997 -108522 119687 -193998 127183 140927 -290223 28082 -310902 -127726
10268 -1086 88828 165985 -58078 -77611 -202322 -318367 -149638 -152817 26790 119398 35287
10256 116734 136641 -96443 -378176 -106766 -128943 223889 -117797 -201595 -328374 91244
10245 -20554 38534 -15515 439104 91008 152715 -65909 -70962 168838 185037 75610 304513
10234 304513 273537 521794 373768 15904 135409 -176507 75405 93336 30253 -94201 38526
10222 -211629 -105894 149249 70894 34220 167901 200645 -50197 148924 128935 58432 5741
10210 -197400 -160477 -49609 100036 -27640 -90995 -106173 -109174 56413 20433 -13529 -160613
10199 -160613 -132403 47889 -326561 161459 75885 -35402 157041 -408018 -55363 -277833
$$ packed form
10279a23306A83997a08522A19687a93998A27183J3744b90223B8082c10902a27726
10268a086H8828P7157e8078j9533j24711j16045a49638l179B6790R2608C5287
10256A16734J9907i6443k81733a06766k2177B23889a17797q3798j26779I1244
10245b0554C8534a5515D39104I1008O1707f5909n053A68838J6199G5610K28903
10234C04513l0976K48257j48026A5904J19505a76507G5405J7931C0253i4201C8526
10222b11629J05735A49249G0894C4220J33681L2744e0197A48924j9989E8432E741
10210a97400L6923d9609A00036b7640o3355j5178l001E6413B0433a3529j47084
10199a60613K8210D7889c26561A61459G5885c5402A57041d08018e5363k22470
$$ plain form
10189 -277833 145039 -364905 -4742 77203 -126224 -119771 53981 -302194 223734 -122285 -227230
10178 -227230 146092 -450180 28315 100738 -21112 207871 122718 -37759 8569 102846 -209754
10166 17270 -475891 -34891 229700 -308894 -337617 134236 -275734 -177160 99095 -339389
10155 120063 39633 -261368 -238251 -191823 -269635 -111674 -99049 -24878 -228941 -82146 -138524
10144 -138524 -227905 -102045 -49414 -284471 -35576 46795 248421 -102624 343482 -104481
10133 -87816 -94446 77239 -95806 -141541 -84485 20685 -411412 -167032 -87616 -37219 -321052
10122 -321052 -135802 -29161 -137606 -238743 10096 -68219 -163326 -251944 -115417 -466865
10112 -466865 -202633 77227 -75774 -88464 32358 -10724 -37070 -93771 -86023 36441 29314 -241217
$$ packed form
10189b77833A45039c64905d742G7203a26224O453E3981c02194B23734a22285j04945
10178b27230A46092d50180B8315P2423b1112B07871q5153c7759H569R4277b09754
10166A7270d75891c4891B29700c08894k8723A34236b75734R8574I9095c39389
10155A20063C9633b61368K3117M6428p7812a11674J2625b4878k04063h2146n6378
10144a38524q9381a02045d9414k35057c5576D6795K01626a02624C43482a04481
10133h7816o630G7239i5806m5735N7056B0685d11412a67032P9416c7219k83833
10122c21052a35802b9161j08445j01137A0096f8219r5107q8618a15417l51448
10112d66865b02633G7227g5774j2690C2358a0724k6346n6701P748C6441p127b41217
$$ plain form
10099 -189571 38455 -85131 -203649 -252618 -105163 183825 76104 18239 28839 14044 -97037
10087 -36829 -409613 -31912 -123476 -202575 22617 -87421 -110938 50391 -498401 -94760 -102175
10076 -102175 -161935 -113883 -172726 61756 -194151 -22205 77137 -18859 -136027 -158664 123167
10064 -231883 -283697 47361 6973 60555 -33827 -86260 -272017 63407 58569 -385320 122868
10052 -546877 60883 -141938 -94472 47076 -51488 -312889 -152702 98538 50038 -240729 -284969
10041 -284969 53180 -175865 240441 58130 -281652 -314207 14778 -105193 -903 9706 77821
10030 77821 -209672 143065 72953 -279134 -56773 101281 -92662 31738 -224394 147835
10019 -295952 59273 -186296 -63387 160079 -51814 -85330 153981 105802 -178248 -242643 -259221
$$ packed form
10099a89571C8455h5131j18518m8969a05163A83825G6104A8239J0600A4044i7037
10087c6829l72784c1912r1564p9099B2617h7421k3517E0391d98401i4760p415
10076a02175n9760M8052n8843F1756a94151b2205G7137a8859j17168k2637A23167
10064b31883n1814D7361F973N3582c3827n2433j85757F3407m838c85320A22868
10052e46877F0883a41938M7466D7076e1488k61401a52702I8538m8500b40729m4240
10041b84969E3180a75865B40441E8130b81652l2555A4778a05193i03I706O8115
10030G7821b09672A43065p0112b79134e6773A01281i2662C1738b24394A47835
10019b95952E9273a86296f3387A60079e1814l3516A53981m8179a78248o4395j6578
$$ plain form
10008 -259221 -285657 -2540 -111882 29926 -141499 18463 -88911 -53017 48740 -150149 -117146
9997 -117146 -156537 -122046 -125587 -112619 -142399 52130 62684 -459775 -302719 9568 78195 -6386
9984 -179151 120001 -245116 209356 -179386 -91101 -18385 220287 -71969 140936 -291531
9973 2778 -128002 59747 -153533 -344753 147771 -26021 -2364 35327 -110277 -226653 304220
9961 -6836 -109682 -213753 -302896 135518 179275 -187709 208427 -153005 56819 98820 26368
9949 93967 -28367 -89108 134364 457148 176 -147757 -303299 -114764 -244782 91623 92986
9938 92986 -171922 169165 -239024 -96767 136272 66161 145381 -172697 -180962 -97937 177601
9926 -13195 -225530 -327398 -10913 306158 68433 -119567 239643 -262153 -51356 -115899 1492
$$ packed form
10008b59221k6436b540j09342B9926a41499A8463h8911L5894D8740a50149L3003
9997a17146l9391L4491l541J2968k9780E2130J0554d59775J57056I568O8627f386
9984a79151A20001b45116B09356a79386Q8285a8385B20287g1969A40936b91531
9973B778a28002E9747a53533j91220A47771b6021b364C5327a10277j16376C04220
9961f836j02846j04071q9143A35518M3757a87709B08427a53005E6819M2001B6368
9949I3967b8367o0741A34364L22784A76a47757j55542a14764j30018I1623J363
9938I2986a71922A69165b39024i6767A36272F6161P9220a72697q265Q3025A77601
9926a3195k12335j01868a0913C06158F8433a19567B39643b62153e1356o4543A492
$$ plain form
9914 -17868 136015 -138980 -151408 -161594 -22586 44351 59614 7535 72474 324802 106615
9902 -429015 -133644 -93429 -157950 -138158 -24357 336519 50258 -54624 29021 -360576 -129315
9890 43065 -184882 -154894 -172162 -172622 -248980 298668 -16530 202373 -288573 -384029 105705
9878 -228268 -202470 173328 194146 -12363 -221173 94491 -176359 -155040 -157849 -183136 -77237
9866 -164816 5187 233734 213032 -232881 -441679 -290888 -245516 -55420 -236751 -274141 -59964
9854 16648 -290140 -124251 -392922 133875 -59110 -319267 -13857 284723 -115352 -209714
9844 -209714 -48635 -99167 37057 -6903 -135713 168893 -223177 232558 -283036 -272457 181617
9832 6058 -328774 -108234 -249505 -121870 -41945 -286319 -49999 -69131 -124457 -186673 14475
$$ packed form
9914a7868A36015a38980j2428j0186b2586D4351J5263G535O4939K52328A06615
9902d29015a33644M0215o4521J9792b4357C36519E0258e4624B9021c60576a29315
9890D3065a84882K9988j7268m60p6358B98668a6530B02373b88573r5456A05705
9878b28268K5798A73328K0818a2363k08810I4491a76359K1319k809k5287g7237
9866a64816E187K28547k0702b32881k08798J50791M5372e5420j81331l7390e9964
9854A6648b90140a24251k68671A33875e9110k60157a3857B84723a15352r4362
9844b09714d8635n0532C7057f903j28810A68893b23177B32558b83036J0579A81617
9832F058c28774a08234j41271a21870d1945k44374d9999j9132n5326o2216A4475
$$ plain form
9820 -410937 182232 305022 -128658 138873 -117159 -5052 -99088 154021 22339 -216971
9809 -140911 123013 179516 76255 -66776 -66251 -110913 -195590 -227478 -110044 -102899 -43977 -184311
9797 -184311 -77800 50982 -89686 -72169 372349 137871 -354315 -206105 -2807 -11444 -35721
9786 -35721 -183653 91779 114851 -254294 158311 -72258 333835 116511 -33740 111776 -364200
9774 56606 -48937 131921 -83634 -139540 -284558 -323884 -208386 65117 -149043 68058 -241343
9762 -261388 125568 29808 -132440 -48909 -15758 -21560 -196595 37574 -19472 -197670 -225494
9751 -225494 280722 -229955 -503141 -78551 -120195 221260 2186 31171 -82 232458 -271227
9739 -50770 -127350 65229 211926 109797 -189738 219326 136584 -198523 219632 -114883
$$ packed form
9820d10937A82232J22790a28658A38873a17159e052r4036A54021B2339b16971
9809a40911A23013N6503G6255f6776N25m4662q4677l1888a10044P145d3977j40334
9797a84311g7800E0982h9686J7517C72349A37871c54315J48210b807q637k4277
9786c5721j47932I1779K3072b54294A58311g2258C33835A16511c3740A11776c64200
9774E6606d8937A31921h3634n5906j45018l9326J15498F5117a49043F8058b41343
9762b61388A25568B9808a32440d8909a5758n802j75035C7574a9472j78198k7824
9751b25494B80722b29955k73186g8551m1644B21260B186K8985h2B32458b71227
9739e0770p6580F5229J46697j02129a89738B19326q2742a98523B19632a14883
$$ plain form
9728 -102203 109718 -86016 345058 31989 24558 -54672 -194812 -275311 -142779 -473879 -192723
9716 151844 -269592 93642 -19946 -162015 173919 22938 26931 -192412 286939 -119622 -174997
9705 -174997 94152 -281809 -260405 286663 122851 27820 -198150 63875 28148 -47666 -312300
9694 -312300 -173105 -71944 -24152 55297 -97405 -188141 -219427 -119158 -398248 -22660 -332657
9683 -332657 -86248 -49270 -123532 -182542 49495 8127 -301536 59759 34859 -31171 -98500 -18396
9670 -232387 305402 -21771 -65313 308233 -68912 158659 -250689 153402 39426 210187
9660 210187 50352 210653 -119743 -163415 364902 99692 -39665 110209 -261945 -134977
9650 -134977 120409 -405396 -220074 -296313 -39879 -107120 -104024 -46173 975 344799 -48985
$$ packed form
9728a02203A09718h6016C45058C1989p431e4672j40140q0499J32532l31100a92723
9716A51844b69592I3642a9946j42069A73919B2938L993a92412B86939a19622n5375
9705a74997I4152b81809K1404B86663A22851B7820a98150F3875B8148d7666k64634
9694c12300J39195g1944b4152E5297i7405r0736l1286J00269k79090b2660l09997
9683c32657h6248L6978p4262n9010D9495H127c01536E9759k4900c1171o7329a8396
9670b32387C05402b1771m3542C08233f8912A58659b50689A53402C9426J70761
9660B10187E0352J60301a19743m3672C64902I9692c9665A10209b61945J26968
9650a34977A20409d05396J85322p6239c9879o7241L096d6173I75L43824d8985
$$ plain form
9638 58962 -16693 -186512 -247167 -4017 -98652 -127592 -290940 48873 -24538 -396331 103323
9626 207163 -139539 -23848 195307 177380 178800 -345850 112987 129208 -231962 -423911 -208074
9614 -339034 176075 -192681 -144764 113235 -186940 373304 -166320 -331634 -268215 -124318
9603 75188 -71978 -123839 49175 187752 -129892 -49026 -246307 -167608 123783 55776 -53002
9591 -95866 -176208 -183665 -171436 -236101 -48545 -51963 -45065 32050 140859 -396012 -348359 -381803
9579 -381803 -94844 -46559 -109837 -136578 -113106 -17002 -190254 -194250 395053 -161385 -229073
9568 -229073 -321045 -13281 82146 7827 -171361 -251247 210153 -349253 -230038 -295918 53372
9556 202072 34078 -40431 -215805 104636 -264913 -62887 137983 19721 -67651 -311768 -91649
$$ packed form
9638E8962a6693j69819o0655d017r4635k8940j63348D8873b4538l71793A03323
9626B07163a39539b3848A95307j7927J420c45850A12987J6221b31962j91949b08074
9614c39034A76075a92681M7917A13235a86940C73304a66320j65314O3419a24318
9603G5188g1978n1861D9175J38577a29892d9026j97281P8699A23783E5776e3002
9591i5866q0342p457J2229o4665d8545l418O898C2050J08809c96012M7653l3444
9579c81803i4844d6559o3278k6741K3472a7002j73252l996C95053a61385o7688
9568b29073r1972a3281H2146G827a71361p9886B10153c49253J19215o5880E3372
9556B02072C4078d0431j75374A04636b64913f2887A37983A9721f7651k44117i1649
$$ plain form
9544 -53513 -209602 32145 -34929 -211477 -49031 -81043 -240932 128957 18825 7438 -28087
9532 -135242 -150649 -374819 -195247 -79712 -107547 53953 -350618 -199344 -89722 -237326 -313788
9521 -313788 -136298 -332120 55936 -2886 -61848 75389 2842 -121029 -177918 213310 -105100
9509 -201941 -69113 -2018 40957 -16066 -188619 -193716 -462939 -289931 -245396 -36528 -31419 -109450
9497 -109450 -186282 -374670 92181 37427 -80935 -220502 -3969 -205652 81585 -56916 -66666
9486 -66666 -310890 -86016 133471 19605 -401302 -334169 108364 -99847 8598 -79815 1319
9474 50677 -123934 19738 -169522 -67458 282630 -311454 -102671 -124423 289444 -79401 16338
9462 -70344 224998 76895 -219339 -25640 -13398 -322204 -125497 -132630 -100122 -23669 -220819
$$ packed form
9544e3513j56089C2145c4929j76548d9031l2012j59889A28957A8825G438b8087
9532a35242j5407k24170J79572g9712k7835E3953c50618J51274h9722j47604p6462
9521c13788a36298j95822E5936b886n8962G5389B842a21029n6889B13310a05100
9509b01941f9113b018D0957a6066j72553n097k69223J73008M4535c6528N109p8031
9497a09450p6832j88388I2181C7427h0935j39567c969k01683H1585e6916r750
9486f6666k44224h6016A33471A9605d01302O7133A08364i9847H598g9815A319
9474E0677a23934A9738a69522f7458B82630c11454a02671k1752B89444g9401A6338
9462g0344B24998G6895b19339b5640J2242l08806a25497p133L2508b3669j97150
$$ plain form
9451 -220819 -80553 -30288 -101637 -331269 41309 -239587 -147823 183259 -201503 -182939 -52972
9439 80596 -147224 168609 -151190 -224058 109252 69991 99104 8153 -7487 -297231 222157
9427 -116737 -96353 -106969 302529 91384 11641 -39497 -113235 -173593 -310839 -60100 -184322
9416 -184322 -90875 191063 43235 18973 -70032 -73005 -253684 -259460 -201678 -12809 110872
9404 75733 -110933 54679 -151939 132533 -47139 -393125 141249 -25247 68760 -276256 -11170
9392 -96247 -79274 -393502 169789 -88099 155271 -256232 -79003 -353524 67253 14317 38335
9381 38335 -164400 212235 123885 -254800 85605 -22697 -420250 64069 -131111 -74922 -344594
9370 -344594 19529 -116417 -23434 -220337 -96580 -235725 69156 -161982 -10944 -132303 18589
$$ packed form
9451b20819h0553c0288p1349k29632D1309b39587R1764A83259b01503J8564e2972
9439H0596a47224A68609a51190p2868A09252l9261K9113H153g487k89744B22157
9427a16737K0384j0616C02529I1384A1641c9497p3738o0358j37246f0100j24222
9416a84322i0875A91063D3235A8973g0032k973j80679n776N7782a2809A10872
9404G5733a10933E4679a51939A32533d7139l45986A41249b5247F8760b76256a1170
9392i6247J6973l14228A69789h8099A55271b56232g9003k74521F7253A4317K4018
9381C8335a64400B12235q8350b54800H5605b2697l97553F4069a31111N6189k69672
9370c44594A9529a16417b3434j96903i6580j39145F9156a61982a0944j21359A8589
$$ plain form
9358 -147826 119143 -8143 -212395 151365 -152731 -9834 -129910 -171051 9477 104503 160015
9347 160015 131486 -50421 119696 -304826 -82029 -32169 196579 -40130 -109427 171471 201543
9336 201543 11456 25084 220539 -143524 -185016 24085 -123579 -219611 199352 -163591 -12606
9324 -128518 93507 58088 -138260 -433859 -252321 -73810 -205746 -224587 -205087 54172 -292306
9312 6684 -268783 -85925 -182343 -131529 135979 90749 -74425 -85768 179461 -53993 -367466
9301 -367466 -181283 115703 -301899 205264 -68683 58983 -339209 -89222 -290951 -114494
9290 -133203 -156506 -263299 -170806 -1830 -16227 -177162 25665 -243340 -79009 -20829 192781
9278 -115125 -14761 -224980 3581 -307941 170836 -103918 51523 -90724 -314334 -72853 -215221
$$ packed form
9358a47826A19143h143k04252A51365a52731i834j20076m1141I477R5026N5512
9347A60015k8529e0421A19696c04826h2029c2169A96579d0130o9297A71471L0072
9336B01543A1456J3628J95455a43524m1492B4085a23579r6032A99352a63591a2606
9324a28518I3507l5419a38260k95599J81538g3810j31936j8841J9500E4172b92306
9312F684b68783h5925r6418N0814A35979m5230g4425j1343A79461e3993l13473
9301c67466a81283A15703c01899B05264f8683E8983c39209h9222k01729a14494
9290a33203k3303j06793R2493a830j4397j60935B5665b43340g9009b0829A92781
9278a15125a4761k10219C581c07941A70836a03918E1523i0724k23610g2853j42368
$$ plain form
9267 -215221 -67135 9209 -200128 -46482 71367 270981 -272721 -301426 118800 -219426 -90525
9255 -154934 -140900 85360 -292573 -147368 -481558 -3127 -144575 -16031 283011 135753 -196190
9243 -207787 -177665 -5775 -13287 -161489 -34782 -275836 -38553 138373 -168229 -84674 57503
9231 -152099 163807 213990 -161332 -34855 -268701 10710 -77151 -124479 51098 -218426 169919
9219 -365662 -330106 -20265 353963 10327 79862 -560806 75695 -6562 -271492 -7464 -104840
9208 -104840 32680 -181006 -112502 -190534 37475 219691 -234832 -188431 15105 -6171 77488
9196 -46176 -325094 -26465 -126320 -282660 -262218 -25599 -144489 -9141 44488 268391 -109031
9184 -292012 -200078 190983 -138249 45952 9465 -129534 10484 20432 -251346 -259632 -402 -453690
$$ packed form
9267b15221f7135I209b00128d6482G1367J99614b72721k8705A18800b19426i0525
9255a54934J4034H5360b92573J45205l34190c127j41448a6031B83011A35753a96190
9243b07787L0122e775p512j48202c4782k41054c8553A38373a68229Q3555E7503
9231a52099A63807N0183a61332c4855k33846A0710g7151m7328E1098b18426A69919
9219c65662L5556b0265C53963A0327O9535e60806G5695f562k64930g464r7376
9208a04840C2680a81006O8504p8032C7475J82216b34832M6401A5105f171G7488
9196d6176k78918b6465r9855j56340K0442b5599j18890i141D4488K23903a09031
9184b92012R1934A90983a38249D5952I465a29534A0484R948b51346q286d02m53288
$$ plain form
9172 -453690 -111313 40373 15770 -312395 -73552 -164584 -143534 -329741 53674 5075 -210966
9160 -114862 -167588 84496 29308 -229335 -185775 77888 -34211 -6509 292740 254597 -133298
9148 -363683 184500 109674 -18717 -257067 85029 115268 -55470 -315940 -185163 212849 128068
9137 128068 -96177 -64449 38183 -99905 -70504 -85213 -348038 334175 -97312 130679 130740 188357
9125 188357 -73022 -129383 -130867 108027 -190654 -6966 -67325 20846 -298086 24450 -269326
9113 53632 -37920 68305 -174223 -17509 -47968 -299470 -361220 -274954 22680 -96138 -19787
9101 -166694 -127935 247477 -101540 -107683 -173671 36455 207383 -71422 107698 -353482 -25078
9089 -160042 -12781 -56506 -144797 -21263 -132872 234605 76612 -48472 84828 -22585 59452
$$ packed form
9172d53690a11313D0373A5770c12395g3552r1032K1050j86207E3674E075b10966
9160a14862n2726H4496B9308b29335M3560G7888c4211f509B92740l8143a33298
9148c63683A84500p4826a8717k38350H5029L0239e5470k60470J30777B12849q4781
9137A28068i6177L1728C8183i9905K9401j4709k62825C34175i7312A30679O1N7617
9125A88357g3022n6361j484A08027a90654f966o0359B0846b98086B4450b69326
9113E3632c7920F8305a74223a7509l0459k51502o1750Q6266B2680i6138a9787
9101a66694L8759B47477a01540o143o5988C6455J70928g1422A07698c53482b5078
9089a60042a2781m3725q8291b1263j11609B34605G6612d8472H4828b2585E9452
$$ plain form
9077 -50305 158304 -205780 -125567 199259 -126845 -151534 -436299 -31820 -128658 -355115 104490
9065 89075 -105092 -294065 -260474 -58660 -75862 58942 -331953 -173251 152247 -28021 14377
9053 -120664 -52625 145813 261821 26889 16831 149405 -14666 -291890 -82682 -92068 3658
9041 230436 -28729 -64793 26301 107365 -11051 197234 -152793 -119560 -162294 -253743 -110810
9029 -130883 -443958 74378 -173758 -52701 234824 -149696 -183598 166161 -75491 -76897 -226440
9018 -226440 147920 57388 3790 38211 -38582 -20215 -229022 -221484 35205 -457320 -139053
9006 -128721 -82387 101594 24139 -66863 31043 -225682 -13695 -78547 -82627 -95533 142873
8994 -119639 -78851 -3037 -50164 -314421 -57769 301583 263210 -61726 -122188 -161957 178681
$$ packed form
9077e0305A58304b05780Q0213A99259a26845k4689k84765c1820r6838k26457A04490
9065H9075a05092j88973L3591e8660j7202E8942c31953J58702A52247b8021A4377
9053a20664e2625A45813J16008B6889j0058J32574a4666k77224h2682r386C658
9041B30436b8729l6064B6301Q1064a1051A97234a52793L3233m2734r1449a10810
9029a30883l13075G4378a73758e2701B34824a49696l3902A66161g5491j406j49543
9018b26440A47920E7388C790L4421c8582J8367k08807P538C5205d57320a39053
9006a28721M6334A01594B4139f6863C1043b25682a3695o4852m080j2906A42873
8994a19639M0788c037m7127k64257e7769C01583l8373f1726o0462l9769A78681
$$ plain form
8982 307566 -169725 -252796 -229038 44876 13215 -145304 -126134 -351953 246621 7157 -233562
8970 -113880 -272427 -341875 -369402 -91870 43368 -69246 68639 96634 123093 -132260 108538
8958 3121 -351593 111029 -219306 223230 -28416 10885 -206655 151724 -247422 52073 88485
8947 88485 -421431 30314 -75269 -362462 1439 -344084 -10705 -224917 103890 -101385 -164729
8936 -164729 -10121 -287062 -9666 42799 28339 220922 285181 -402432 -186423 -184233 26562
8924 231309 67631 -99451 -409051 136788 165020 -205904 14512 -265518 42737 83046 118470
8913 118470 121496 -29144 229634 147612 -11201 -63852 420111 413303 1164398 2201214 4447169
8902 4447169 5944618 3218268 1269194 848243 449605 168715 -54329 323202 298930
$$ packed form
8982C07566a69725q3071K3758D4876A3215a45304J9170k25819B46621G157b33562
8970a13880j58547o9448k7527i1870D3368f9246F8639K7995K6459a32260A08538
8958C121c51593A11029b19306B23230b8416A0885b06655A51724b47422E2073L6412
8947H8485d21431C0314g5269k87193A439c44084a0705k14212A03890a01385o3344
8936a64729a0121k76941i666D2799j4460J92583O4259d02432a86423K190B6562
8924B31309F7631i9451l09600A36788K8232b05904A4512b65518D2737M0309L5424
8913A18470L026b9144B29634q2022a1201n2651D20111o808P51095J036816K245955
8902D447169J497449k726350A269194m20951l98638A68715e4329C23202k4272
$$ plain form
8893 298930 110302 -276591 -13506 317072 212109 -166304 -75970 250402 23440 -273891
8882 -107377 -29603 -68295 -37255 -269565 -93205 123605 37456 134080 -79318 -299910 -120930
8870 -314680 114522 -116118 -43269 -198974 -99897 -263023 -151389 -113067 101444 -56200
8859 40277 -128789 28121 119937 -252287 -14200 -175383 -63745 -39862 -347455 -143767 20706
8847 -193891 23362 88117 -21729 14140 -201167 -75352 -55350 -53256 -149881 -16315 53105 -61053
$$ packed form
8893B98930A10302b76591a3506C17072j04963a66304g5970B50402B3440b73891
8882a07377b9603l8692L1040k32310i3205A23605C7456R6624g9318k20592a20930
8870c14680A14522a16118d3269j55705R9077j63126J11634L8322A01444e6200
8859D0277a28789B8121R1816b52287a4200j61183f3745K3883l07593a43767B0706
8847a93891B3362O4755b1729A4140b01167g5352K0002K094r6625a6315E3105f1053
$$ [...]
##END NTUPLES=NMR SPECTRUM
##END=
