
##TITLE=AC1068_TOPL01_5906499_UAK4SZTnLg
##JCAMPDX= 6.0         $$ Bruker NMR JCAMP-DX V2.0
##DATA TYPE= NMR SPECTRUM
##DATA CLASS= NTUPLES
##ORIGIN= BRUKER
##OWNER= Administrator
$$ 1.72 TOPSPIN		Version 2.1
$$ 2012-04-10 10:16:02.890 -0500  Administrator@TOPSPIN
$$ Compression mode = diff/dup
##.OBSERVE FREQUENCY= 400.13188235
##.OBSERVE NUCLEUS= ^1H
##.ACQUISITION MODE= SIMULTANEOUS (DQD)
##.ACQUISITION SCHEME= undefined
##.AVERAGES= 64
##.DIGITISER RES= 22
##SPECTROMETER/DATA SYSTEM= spect
##.PULSE SEQUENCE= noesygpps1d.comp
##.SOLVENT NAME= COFFEE_meoh
##.SHIFT REFERENCE= INTERNAL, COFFEE_meoh, 1, 14.96878
##AUDIT TRAIL= $$ (NUMBER, WHEN, WHO, WHERE, PROCESS, VERSION, WHAT)
$$ ##TITLE= Audit trail, TOPSPIN		Version 2.1
$$ ##JCAMPDX= 5.01
$$ ##ORIGIN= Bruker BioSpin GmbH
$$ ##OWNER= Administrator
$$ $$ C:\Bruker\TOPSPIN/data/COFFEE/nmr/AC1068_TOPL01_5906499_UAK4SZTnLg/12/pdata/1/auditp.txt
$$ ##AUDIT TRAIL=  $$ (NUMBER, WHEN, WHO, WHERE, PROCESS, VERSION, WHAT)
(   1,<2012-04-04 13:23:12.828 -0500>,<Administrator>,<TOPSPIN>,<go>,<TOPSPIN 2.1>,
      <created by zg
	started at 2012-04-04 13:11:41.187 -0500,
	POWCHK enabled, PULCHK disabled,
       configuration hash MD5:
       1A 1E CE 29 27 FD 77 03 67 4E F0 E3 C4 B2 CB 90
       data hash MD5: 64K
       FC D4 00 37 32 61 A0 06 98 56 9D 85 D9 E6 66 4C>)
(   2,<2012-04-04 13:23:15.656 -0500>,<Administrator>,<TOPSPIN>,<proc1d>,<TOPSPIN 2.1>,
      <Start of raw data processing
       efp LB = 0.3 FT_mod = 6 PKNL = 1 PHC0 = 0 PHC1 = 0 SI = 128K 
       data hash MD5: 128K
       98 6C F5 B1 EB 87 B2 9F 80 81 AA 3A E4 4A 5B 58>)
(   3,<2012-04-04 13:23:16.859 -0500>,<Administrator>,<TOPSPIN>,<proc1d>,<TOPSPIN 2.1>,
      <pk PHC0 = 35.23315 PHC1 = 0 
       data hash MD5: 128K
       C1 3A 04 98 E4 72 25 7D 3E 6B F4 A8 BC 54 93 82>)
(   4,<2012-04-04 13:23:17.390 -0500>,<Administrator>,<TOPSPIN>,<proc1d>,<TOPSPIN 2.1>,
      <abs ABSG = 1 
       data hash MD5: 128K
       D7 68 79 CD CB B6 59 DD 5D DD 01 90 DB 05 85 F9>)
(   5,<2012-04-04 13:23:17.453 -0500>,<Administrator>,<TOPSPIN>,<proc1d>,<TOPSPIN 2.1>,
      <abs ABSG = 2 
       data hash MD5: 128K
       53 10 5E 76 3A C6 3B C9 54 82 8A 0D 5C 8C 91 20>)
(   6,<2012-04-04 13:23:17.515 -0500>,<Administrator>,<TOPSPIN>,<proc1d>,<TOPSPIN 2.1>,
      <abs ABSG = 3 
       data hash MD5: 128K
       38 BF C8 6D 0A BE E0 E5 A9 1F A7 86 51 3B 1A 9C>)
(   7,<2012-04-04 13:23:17.578 -0500>,<Administrator>,<TOPSPIN>,<proc1d>,<TOPSPIN 2.1>,
      <abs ABSG = 4 
       data hash MD5: 128K
       BC 69 44 44 7F CE 52 F5 00 C5 7E 50 7B C5 F1 03>)
(   8,<2012-04-04 13:23:17.625 -0500>,<Administrator>,<TOPSPIN>,<proc1d>,<TOPSPIN 2.1>,
      <abs ABSG = 5 
       data hash MD5: 128K
       9C F6 5A BE FA 4E 73 AE 1D F5 7C 9E AE A5 39 89>)
(   9,<2012-04-04 13:23:17.828 -0500>,<Administrator>,<TOPSPIN>,<audit>,<TOPSPIN 2.1>,
      <user comment:
       ICON-NMR User ID: COFFEE
       data hash MD5: 128K
$$ [...]
##$TP07= 0
##$TPNAME0= <>
##$TPNAME1= <>
##$TPNAME2= <>
##$TPNAME3= <>
##$TPNAME4= <>
##$TPNAME5= <>
##$TPNAME6= <>
##$TPNAME7= <>
##$TPOAL= (0..7)
0.5 0.5 0.5 0.5 0.5 0.5 0.5 0.5
##$TPOFFS= (0..7)
0 0 0 0 0 0 0 0
##$TUNHIN= 0
##$TUNHOUT= 0
##$TUNXOUT= 0
##$USERA1= <user>
##$USERA2= <user>
##$USERA3= <user>
##$USERA4= <user>
##$USERA5= <user>
##$V9= 5
##$VALIST= <valist>
##$VCLIST= <CCCCCCCCCCCCCCC>
##$VD= 0
##$VDLIST= <DDDDDDDDDDDDDDD>
##$VPLIST= <PPPPPPPPPPPPPPP>
##$VTLIST= <TTTTTTTTTTTTTTT>
##$WBST= 2048
##$WBSW= 25
##$XGAIN= (0..3)
0 0 0 0
##$XL= 0
##$YL= 0
##$YMAX_a= 12727560
##$YMIN_a= -12220341
##$ZGOPTNS= <>
##$ZL1= 120
##$ZL2= 120
##$ZL3= 120
##$ZL4= 120
##$ABSF1= 14.96878
##$ABSF2= -5.583751
##$ABSG= 5
##$ABSL= 3
##$ALPHA= 0
##$AQORDER= 0
##$ASSFAC= 0
##$ASSFACI= 0
##$ASSFACX= 0
##$ASSWID= 0
##$AUNMP= <proc_prof1d_extract.lims>
##$AXLEFT= 0
##$AXNAME= <>
##$AXNUC= <1H>
##$AXRIGHT= 0
##$AXTYPE= 0
##$AXUNIT= <>
##$AZFE= 0.1
##$AZFW= 0.1
##$BCFW= 0
##$BC_mod= 0
##$BYTORDP= 0
##$COROFFS= 0
##$CY= 15
##$DATMOD= 1
##$DC= 0
##$DFILT= <>
##$DTYPP= 0
##$F1P= 0
##$F2P= 0
##$FCOR= 0.5
##$FTSIZE= 131072
##$FT_mod= 6
##$GAMMA= 0
##$GB= 0
##$INTBC= 1
##$INTSCL= 1
##$ISEN= 128
##$LB= 0.3
##$LEV0= 0
##$LPBIN= 0
##$MAXI= 10000
##$MC2= 0
##$MEAN= 0
##$ME_mod= 0
##$MI= 0
##$NCOEF= 0
##$NC_proc= -1
##$NLEV= 6
##$NOISF1= 0
##$NOISF2= 0
##$NSP= 0
##$NTH_PI= 0
##$NZP= 0
##$OFFSET= 14.96878
##$PC= 1
##$PHC0= 35.23315
##$PHC1= 0
##$PH_mod= 1
##$PKNL= yes
##$PPARMOD= 0
##$PPDIAG= 0
##$PPIPTYP= 0
##$PPMPNUM= 2147483647
##$PPRESOL= 1
##$PSCAL= 4
##$PSIGN= 0
##$PYNMP= <proc.py>
##$REVERSE= no
##$SF= 400.13000473369
##$SI= 131072
##$SIGF1= 0
##$SIGF2= 0
##$SINO= 400
##$SIOLD= 131072
##$SPECTYP= <>
##$SREGLST= <1H.CDCl3>
##$SSB= 0
##$STSI= 131072
##$STSR= 0
##$SW_p= 8223.68421052632
##$SYMM= 0
##$S_DEV= 0
##$TDeff= 65536
##$TDoff= 0
##$TI= <>
##$TILT= no
##$TM1= 0
##$TM2= 0
##$TOPLEV= 0
##$USERP1= <user>
##$USERP2= <user>
##$USERP3= <user>
##$USERP4= <user>
##$USERP5= <user>
##$WDW= 1
##$XDIM= 131072
##$YMAX_p= 128087792
##$YMIN_p= -526252093
##$CURPLOT= <Network HP LaserJet P1505>
##$CURPRIN= <$Network HP LaserJet P1505>
##$DFORMAT= <normdp>
##$LAYOUT= <+/1D_H.xwp>
##$LFORMAT= <normlp>
##$PFORMAT= <normpl>
##$SURQMSG= 1
$$ End of Bruker specific parameters
$$ ---------------------------------
##NTUPLES= NMR SPECTRUM
##VAR_NAME=  FREQUENCY,     SPECTRUM/REAL,   SPECTRUM/IMAG
##SYMBOL=    X,             R,               I
##VAR_TYPE=  INDEPENDENT,   DEPENDENT,       DEPENDENT
##VAR_FORM=  AFFN,          ASDF,            ASDF
##VAR_DIM=   131072,        131072,          131072
##UNITS=     HZ,            ARBITRARY UNITS, ARBITRARY UNITS
##FACTOR=    0.0627417313425165, 1,          1
##FIRST=     8223.62146879498, 200,          -21291
##LAST=      0,             760,             -21074
##MIN=       0,             -526252093,      0
##MAX=       8223.62146879498, 128087792,    0
$$ Real data points
##PAGE= N=1
##DATA TABLE= (X++(R..R)), XYDATA
$$ [...]
$$ plain form
62228 229029 229979 231659 233889 236058 237942 240033 242904 246556 250599 254848 259477 264618 270107 275680
62214 275680 281304 287154 293354 299869 306643 313691 320993 328477 336320 345081 355326 367105 380064
62201 380064 393995 408954 424905 441613 459023 477347 496528 515887 534479 551536 566380
62190 566380 578304 586935 592495 595342 595426 592485 586557 577933 566779 553245 537890 521576 504953
62177 504953 488305 471830 455704 439922 424447 409547 395630 382770 370821 360010 350942 343794
62165 343794 337896 332449 327339 322944 319396 316397 313692 311325 309375 307718 306196 304825 303674 302668
62151 302668 301680 300802 300334 300437 300971 301806 303161 305388 308523 312245 316293 320679 325473 330643 336230 342408
62135 342408 349242 356564 364261 372490 381440 391066 401205 411802 422795 433902 444673 454644 463402
$$ packed form
62228B29029R50J680K230K169J884K091K871L652M043M249M629N141N489N573
62214B75680N624N850O200O515O774P048P302P484P843Q761J0245J1779J2959
62201C80064J3931J4959J5951J6708J7410J8324J9181J9359J8592J7057J4844
62190E66380J1924Q631N560K847Q4k941n928q624j1154j3534j5355j6314j6623
62177E04953j6648j6475j6126j5782j5475j4900j3917j2860j1949j0811r068p148
62165C43794n898n447n110m395l548k999k705k367j950j657j522j371j151j006
62151C02668r88q78m68J03N34Q35J355K227L135L722M048M386M794N170N587O178
62135C42408O834P322P697Q229Q950R626J0139J0597J0993J1107J0771R971Q758
$$ plain form
62122 463402 470696 476686 481881 486673 491081 495036 498641 501983 505060 508165 512043 517270 523717 530953
62108 530953 538967 548095 558405 569577 581237 593028 604406 614770 623803 631396 637387 641656 644368
62095 644368 645725 645625 643918 640848 636787 631688 625356 618143 610777 603486 595944 588169 580854 574563
62081 574563 569127 564112 559403 554990 550617 546087 541648 537707 534315 531209 528233 525462 523079 521347
62067 521347 520576 520901 522149 524058 526503 529480 532999 537124 541984 547616 553922 560840 568398 576537 585061
62052 585061 593856 602976 612437 622060 631664 641316 651365 662254 674260 687259 700798 714582 728819
62039 728819 743878 759773 776310 793659 812321 832493 853888 876269 899689 923962 948332
62028 948332 972035 994983 1017638 1040408 1063464 1086967 1111143 1136040 1161300 1186152 1209692
$$ packed form
62122D63402P294N990N195M792M408L955L605L342L077L105L878N227O447P236
62108E30953Q014R128J0310J1172J1660J1791J1378J0364R033P593N991M269K712
62095F44368J357j00j707l070m061n099o332p213p366p291p542p775p315o291
62081E74563n436n015m709m413m373m530m439l941l392l106k976k771k383j732
62067E21347p71L25J248J909K445K977L519M125M860N632O306O918P558Q139Q524
62052E85061Q795R120R461R623R604R652J0049J0889J2006J2999J3539J3784J4237
62039G28819J5059J5895J6537J7349J8662K0172K1395K2381K3420K4273K4370
62028I48332K3703K2948K2655K2770K3056K3503K4176K4897K5260K4852K3540
$$ plain form
62017 1209692 1231403 1251490 1270537 1288828 1306257 1322899 1339321 1356085 1373252 1390557 1407886
62006 1407886 1425348 1443040 1460946 1478931 1496661 1513644 1529480 1544001 1557142 1568937 1579720
61995 1579720 1590037 1600151 1609827 1618832 1627433 1636168 1645252 1654423 1663280 1671572 1679294 1686725 1694325
61982 1694325 1702436 1711081 1720166 1729769 1740094 1751174 1762717 1774250 1785410 1796152 1806665 1817000
61970 1817000 1826807 1835595 1843190 1849744 1855328 1859773 1862924 1864779 1865345 1864616 1862770 1860116 1856803 1852838
61956 1852838 1848434 1843999 1839683 1835300 1830840 1826681 1823127 1820145 1817793 1816513 1816685 1818214 1820916 1824966
61942 1824966 1830510 1837071 1843864 1850650 1857798 1865475 1873122 1879822 1884918 1888227 1889905 1890236 1889416 1887451
61928 1887451 1884292 1880090 1875279 1870404 1865846 1861572 1857167 1852294 1847108 1841991 1836856 1831036 1824067 1816233
$$ packed form
62017A209692K1711K0087J9047J8291J7429J6642J6422J6764J7167J7305J7329
62006A407886J7462J7692J7906J7985J7730J6983J5836J4521J3141J1795J0783
61995A579720J0317J0114R676R005Q601Q735R084R171Q857Q292P722P431P600
61982A694325Q111Q645R085R603J0325J1080J1543J1533J1160J0742J0513J0335
61970A817000R807Q788P595O554N584M445L151J855N66p29j846k654l313l965
61956A852838m404m435m316m383m460m159l554k982k352j280J72J529K702M050
61942A824966N544O561O793O786P148P677P647O700N096L309J678L31q20j965
61928A887451l159m202m811m875m558m274m405m873n186n117n135n820o969p834
$$ plain form
61914 1816233 1808104 1799768 1790843 1781050 1770467 1759300 1747695 1735770 1723625 1711364 1699192 1687316
61902 1687316 1675606 1663602 1651064 1638336 1625878 1613716 1601709 1590229 1580077 1571664 1564669 1558625
61890 1558625 1553586 1550032 1548323 1548438 1550227 1553771 1559398 1567289 1577126 1588256 1600254 1613188 1627292
61877 1627292 1642541 1658622 1675202 1692044 1709047 1726265 1743782 1761481 1779074 1796439 1813780
61866 1813780 1831356 1849313 1867916 1887757 1909535 1933820 1961135 1992065 2027125 2066783 2111792
61855 2111792 2163214 2221904 2288214 2362488 2445548 2538349 2641405 2754931 2879386 3015486
61845 3015486 3163871 3325182 3500349 3690263 3895017 4113666 4344442 4584513 4829067
61836 4829067 5070562 5298683 5500806 5663105 5772665 5820101 5801352 5717904 5575976 5385274
$$ packed form
61914A816233q129q336q925r793j0583j1167j1605j1925j2145j2261j2172j1876
61902A687316j1710j2004j2538j2728j2458j2162j2007j1480j0152q413o995o044
61890A558625n039l554j709J15J789L544N627P891R837J1130J1998J2934J4104
61877A627292J5249J6081J6580J6842J7003J7218J7517J7699J7593J7365J7341
61866A813780J7576J7957J8603J9841K1778K4285K7315L0930L5060L9658M5009
61855B111792N1422N8690O6310P4274Q3060R2801J03056J13526J24455J36100
61845C015486J48385J61311J75167J89914K04754K18649K30776K40071K44554
61836D829067K41495K28121K02123J62299J09560M7436j8749q3448j41928j90702
$$ plain form
61826 5385274 5157450 4904413 4637003 4364350 4093711 3830537 3578734 3340961 3118772
61817 3118772 2912778 2722996 2549117 2390467 2245998 2114675 1995869 1889140 1793700 1708368
61807 1708368 1632034 1563907 1503336 1449691 1402483 1361353 1325889 1295646 1270369 1249956 1234150
61796 1234150 1222486 1214611 1210378 1209538 1211480 1215404 1220625 1226677 1233278 1240225 1247149 1253292 1257692 1259730
61782 1259730 1259416 1257118 1253159 1247805 1241521 1235060 1229219 1224492 1221000 1218731 1217778 1218252 1219998 1222585 1225615
61767 1225615 1228801 1231603 1233035 1232130 1228511 1222318 1213696 1202706 1189721 1175562 1161040 1146531 1132156
61754 1132156 1118266 1105605 1094983 1086855 1081269 1078208 1077880 1080584 1086389 1095170 1106963 1122083 1140786
61741 1140786 1163020 1188632 1217591 1249892 1285477 1324516 1367616 1415447 1468235 1525807 1588114
$$ packed form
61826E385274k27824k53037k67410k72653k70639k63174k51803k37773k22189
61817C118772k05994j89782j73879j58650j44469j31323j18806j06729r5440q5332
61807A708368p6334o8127o0571n3645m7208m1130l5464l0243k5277k0413j5806
61796A234150j1664p875m233q40J942L924N221O052O601O947O924O143M400K038
61782A259730l14k298l959n354o284o461n841m727l492k269r53M74J746K587L030
61767A225615L186K802J432r05l619o193q622j0990j2985j4159j4522j4509j4375
61754A132156j3890j2661j0622q128n586l061l28K704N805Q781J1793J5120J8703
61741A140786K2234K5612K8959L2301L5585L9039M3100M7831N2788N7572O2307
$$ plain form
61730 1588114 1655497 1728538 1807843 1894046 1987948 2090577 2203102 2326626 2462143 2610849
61720 2610849 2774412 2954664 3153144 3371322 3611234 3875339 4165526 4482662 4827262
61711 4827262 5199933 5600599 6027435 6476627 6942200 7414879 7880750 8321163 8713904
61702 8713904 9035019 9261694 9376551 9371551 9249061 9020097 8701743 8314731 7880708 7419467
61692 7419467 6947451 6477783 6020579 5583001 5169614 4783187 4425143 4095478 3792988
61683 3792988 3516044 3263144 3032866 2823756 2634372 2463124 2308085 2167307 2039391
61674 2039391 1923448 1818544 1723578 1637605 1559839 1489324 1425087 1366614 1313636 1265401 1220700
61663 1220700 1178710 1139272 1102224 1067064 1033545 1002021 972856 945902 920862 897732 876535
$$ packed form
61730A588114O7383P3041P9305Q6203R3902J02629J12525J23524J35517J48706
61720B610849J63563J80252J98480K18178K39912K64105K90187L17136L44600
61711D827262L72671M00666M26836M49192M65573M72679M65871M40413L92741
61702H713904L21115K26675J14857n000j22490k28964l18354l87012m34023m61241
61692G419467m72016m69668m57204m37578m13387l86427l58044l29665l02490
61683C792988k76944k52900k30278k09110j89384j71248j55039j40778j27916
61674B039391j15943j04904r4966q5973p7766p0515o4237n8473n2978m8235m4701
61663A220700m1990l9438l7048l5160l3519l1524k9165k6954k5040k3130k1197
$$ plain form
61652 876535 856979 838731 821726 805962 791267 777562 765024 753665 743038 732625 722288
61641 722288 712048 701773 691369 681027 670916 660827 650432 639786 629261 619114 609313 599682
61629 599682 590045 580362 570864 561881 553464 545389 537598 530315 523622 517302 511325 506087 501830 498182
61615 498182 494631 491231 488458 486536 485312 484642 484546 485011 485919 487101 488270 489022 489153 488884 488570 488312 488072
61598 488072 487967 488150 488501 488733 488763 488800 489111 489882 491181 492828 494346 495283 495587 495516 495235 494668 493663 492137
61580 492137 490072 487554 484817 482176 479932 478321 477455 477273 477669 478700 480502 482970 485757 488651 491687
61565 491687 494803 497663 500000 501875 503363 504235 504212 503376 502098 500667 499199 497757 496280 494553 492437
61550 492437 490084 487755 485515 483275 481031 478847 476677 474383 471891 469195 466285 463134 459739 456152
$$ packed form
61652H76535j9556j8248j7005j5764j4695j3705j2538j1359j0627j0413j0337
61641G22288j0240j0275j0404j0342j0111j0089j0395j0646j0525j0147r801r631
61629E99682r637r683r498q983q417q075p791p283o693o320n977n238m257l648
61615D98182l551l400k773j922j224o70r6M65R08J182J169P52J31k69l14k58k40
61598D88072j05J83L51K32L0L7L11P71J299J647J518R37L04p1k81n67j005j526
61580D92137k065k518k737k641k244j611q66j82L96J031J802K468K787K894L036
61565D91687L116K860K337J875J488Q72k3q36j278j431j468j442j477j727k116
61550D92437k353k329k240k240k244k184k170k294k492k696k910l151l395l587
$$ plain form
61536 456152 452594 449493 447107 445116 442859 440130 437415 435196 433370 431590 429868 428518 427781 427814 428835
61521 428835 430885 433646 436818 440592 445394 451276 457892 464996 472629 480876 489797 499615 510636 522904
61507 522904 536155 550142 564832 580236 596258 612701 629244 645397 660658 674792 687850
61496 687850 699953 711148 721455 730922 739631 747689 755192 762135 768420 773976 778721 782372 784504
61483 784504 784956 784036 782151 779374 775520 770573 764823 758653 752319 745884 739368 732995 727294 722787 719565
61468 719565 717411 716310 716524 718064 720551 723836 728459 735137 744030 754833 767445 782187 799456
61455 799456 819418 842037 867277 895329 926770 962292 1002216 1046493 1095242 1148941 1207916
61444 1207916 1272020 1341088 1415328 1494924 1579559 1668663 1761669 1857437 1953606 2047008 2134575
$$ packed form
61536D56152l558l101k386j991k257k729k715k219j826j780j722j350p37L3J021
61521D28835K050K761L172L774M802N882O616P104P633Q247Q921R818J1021J2268
61507E22904J3251J3987J4690J5404J6022J6443J6543J6153J5261J4134J3058
61496F87850J2103J1195J0307R467Q709Q058P503O943O285N556M745L651K132
61483G84504M52r20j885k777l854m947n750o170o334o435o516o373n701m507l222
61468G19565k154j101K14J540K487L285M623O678Q893J0803J2612J4742J7269
61455G99456J9962K2619K5240K8052L1441L5522L9924M4277M8749N3699N8975
61444A207916O4104O9068P4240P9596Q4635Q9104R3006R5768R6169R3402Q7567
$$ plain form
61433 2134575 2213426 2280423 2332461 2367451 2384777 2384934 2369209 2339625 2298511 2247945 2189851 2126565
61421 2126565 2060742 1994561 1929367 1866130 1805826 1749279 1697050 1649641 1607457 1570507 1538516
61410 1538516 1511506 1489890 1473825 1462818 1456202 1453688 1455230 1460624 1469539 1481746 1497033 1514959
61398 1514959 1534911 1556337 1578792 1601838 1625041 1648084 1670759 1692928 1714509 1735516 1756072
61387 1756072 1776399 1796732 1817206 1837816 1858473 1879005 1899123 1918605 1937600 1956497 1975317
61376 1975317 1993460 2010233 2025349 2038638 2049551 2057477 2062427 2064919 2065162 2062783 2057455 2049376 2039015
61363 2039015 2026713 2012694 1997234 1980632 1963199 1945410 1927935 1911478 1896646 1883922 1873514
61352 1873514 1865246 1858812 1854108 1851141 1849718 1849526 1850428 1852284 1854513 1856201 1856831 1856556 1855685 1854212 1852013
$$ packed form
61433B134575P8851O6997N2038L4990J7326J57j5725k9584m1114n0566n8094o3286
61421B126565o5823o6181o5194o3237o0304n6547n2229m7409m2184l6950l1991
61410A538516k7010k1616j6065j1007o616k514J542N394Q915J2207J5287J7926
61398A514959J9952K1426K2455K3046K3203K3043K2675K2169K1581K1007K0556
61387A756072K0327K0333K0474K0610K0657K0532K0118J9482J8995J8897J8820
61376A975317J8143J6773J5116J3289J0913P926M950K492K43k379n328q079j0361
61363B039015j2302j4019j5460j6602j7433j7789j7475j6457j4832j2724j0408
61352A873514q268o434m704k967j423j92R02J856K229J688O30k75q71j473k199
$$ plain form
61337 1852013 1849244 1846345 1843866 1842479 1842971 1846049 1852255 1862167 1876560 1896270 1922000 1954228 1993134
61324 1993134 2038607 2090554 2149245 2215158 2288437 2368724 2455501 2548271 2646179 2747687 2850725
61313 2850725 2952967 3051762 3143943 3225945 3294267 3346048 3379615 3394718 3392217 3373458 3339920
61302 3339920 3293202 3234912 3166404 3088870 3003777 2913060 2818702 2722325 2625261 2528774 2433960
61291 2433960 2341522 2251872 2165503 2083137 2005486 1932973 1865706 1803681 1746906 1695314 1648683
61280 1648683 1606817 1569807 1537905 1511087 1488964 1471191 1457719 1448483 1443128 1441310 1443014 1448238
61268 1448238 1456516 1467118 1479575 1493696 1509143 1525405 1542088 1558890 1575364 1591119 1606199
61257 1606199 1620842 1634878 1647784 1659317 1669670 1678983 1687174 1694341 1700767 1706339 1710423 1712545 1712820
$$ packed form
61337A852013k769k899k479j387M92L078O206R912J4393J9710K5730L2228L8906
61324A993134M5473N1947N8691O5913P3279Q0287Q6777R2770R7908J01508J03038
61313B850725J02242R8795R2181Q2002O8322N1781L3567J5103k501j8759l3538
61302C339920m6718n8290o8508p7534q5093r0717r4358r6377r7064r6487r4814
61291B433960r2438q9650q6369q2366p7651p2513o7267o2025n6775n1592m6631
61280A648683m1866l7010l1902k6818k2123j7773j3472r236n355j818J704N224
61268A448238Q278J0602J2457J4121J5447J6262J6683J6802J6474J5755J5080
61257A606199J4643J4036J2906J1533J0353R313Q191P167O426N572M084K122K75
$$ plain form
61244 1712820 1711450 1708209 1702723 1694992 1685302 1673865 1660806 1646319 1630553 1613482 1595078 1575466
61232 1575466 1554810 1533223 1511000 1488745 1467077 1446359 1426837 1408827 1392607 1378260 1365796
61221 1365796 1355281 1346712 1339912 1334691 1330959 1328593 1327352 1326994 1327287 1327816 1328060 1327787 1327221 1326665 1326196 1325838
61205 1325838 1325720 1325825 1325772 1325175 1324134 1323147 1322621 1322669 1323389 1325216 1329003 1335779 1346345 1361005 1379715 1402447
61189 1402447 1429255 1460017 1494266 1531365 1570673 1611430 1652556 1692481 1729077 1759813 1782258
61178 1782258 1794580 1795619 1784722 1761880 1727972 1684609 1633717 1577406 1517962 1457406 1396968
61167 1396968 1337333 1279372 1224174 1172363 1123933 1078959 1037969 1001330 968647 939099 912092
61156 912092 887391 864935 844801 827115 811749 798350 786800 777368 770193 764968 761369 759463
$$ packed form
61244A712820j370l241n486p731r690j1437j3059j4487j5766j7071j8404j9612
61232A575466k0656k1587k2223k2255k1668k0718j9522j8010j6220j4347j2464
61221A365796j0515q569o800n221l732k366j241l58K93N29K44k73n66n56m69l58
61205A325838j18J05n3n97j041r87n26M8P20J827L787O776J0566J4660J8710K2732
61189A402447K6808L0762L4249L7099L9308M0757M1126L9925L6596L0736K2445
61178A782258J2322J039j0897k2842l3908m3363n0892n6311n9444o0556o0438
61167A396968n9635n7961n5198n1811m8430m4974m0990l6639l2683k9548k7007
61156I12092k4701k2456k0134j7686j5366j3399j1550r432p175n225l599j906
$$ plain form
61144 759463 759382 760915 763735 767766 772976 778993 785277 791527 797607 803258 808172 812250 815525 817921 819304
61129 819304 819672 819111 817666 815391 812386 808609 803876 798129 791534 784164 775852 766501 756298 745402
61115 745402 733748 721342 708479 695405 682078 668495 654952 641684 628519 615237 601974
61104 601974 588910 575856 562589 549377 536695 524552 512579 500749 489545 479363 470111 461403
61092 461403 452866 444177 435106 425624 415896 406140 396578 387377 378533 369922 361629 354057 347527 341972
61078 341972 337222 333383 330636 328794 327410 326288 325616 325568 326027 326724 327570 328826 330944 334122 338005 342022
61062 342022 345997 350202 354806 359654 364690 370121 375941 381732 387254 392837 398836 405024 410925 416394
61048 416394 421499 426112 430050 433339 435915 437347 437329 436245 434738 432937 430534 427457 423954 420200 416311
$$ packed form
61144G59463q1J533K820M031N210O017O284O250O080N651M914M078L275K396J383
61129H19304L68n61j445k275l005l777m733n747o595p370q312r351j0203j0896
61115G45402j1654j2406j2863j3074j3327j3583j3543j3268j3165j3282j3263
61104F01974j3064j3054j3267j3212j2682j2143j1973j1830j1204j0182r252q708
61092D61403q537q689r071r482r728r756r562r201q844q611q293p572o530n555
61078C41972m750l839k747j842j384j122o72m8M59O97Q46J256K118L178L883M017
61062C42022L975M205M604M848N036N431N820N791N522N583N999O188N901N469
61048D16394N105M613L938L289K576J432j8j084j507j801k403l077l503l754l889
$$ plain form
61033 416311 412571 409118 405547 401303 396383 391162 385694 379762 373522 367498 361916 356595 351438 346517
61019 346517 341643 336514 331371 326975 323723 321253 319041 316983 315248 313993 313331 313218 313227 312841 312073 311454
61003 311454 311312 311480 311766 312271 313106 314178 315420 316849 318295 319438 320285 321231 322514 323958 325388 326944
60987 326944 328802 330944 333346 336108 339228 342577 346222 350476 355456 360920 366729 373129 380389 388397
60973 388397 396754 405121 413362 421608 430272 439713 449747 459748 469350 478871 488969 500082 512196
60960 512196 524899 537690 550512 563939 578560 594310 610814 628220 647105 667682 689726
60949 689726 713363 739171 767335 797422 829316 863746 901473 942476 986309 1032824 1082165
60938 1082165 1134588 1190670 1251321 1317193 1388475 1465547 1549341 1640796 1740580 1849731 1969968
$$ packed form
61033D16311l740l453l571m244m920n221n468n932o240o024n582n321n157m921
61019C46517m874n129n143m396l252k470k212k058j735j255o62j13Rl86p68o19
61003C11454j42J68K86N05Q35J072J242J429J446J143Q47R46J283J444J430J556
60987C26944J858K142K402K762L120L349L645M254M980N464N809O400P260Q008
60973C88397Q357Q367Q241Q246Q664R441J0034J0001R602R521J0098J1113J2114
60960E12196J2703J2791J2822J3427J4621J5750J6504J7406J8885K0577K2044
60949F89726K3637K5808K8164L0087L1894L4430L7727M1003M3833M6515M9341
60938A082165N2423N6082O0651O5872P1282P7072Q3794R1455R9784J09151J20237
$$ plain form
60927 1969968 2103010 2250462 2414984 2600722 2811738 3050821 3320775 3625998 3971746
60918 3971746 4363156 4806892 5312711 5890981 6549813 7297753 8145289 9089296 10082723
60909 10082723 11022197 11783381 12287102 12540019 12615321 12600425 12564822 12561831 12629409 12764294
60899 12764294 12895827 12904766 12687304 12211935 11523260 10701358 9820536 8934458 8079739 7280238
60889 7280238 6548162 5886904 5295738 4772158 4311513 3907330 3553032 3242791 2970931
60880 2970931 2731677 2519922 2331648 2163527 2012684 1876950 1754670 1644006 1542822
60871 1542822 1449464 1363265 1284116 1211851 1146129 1086442 1031887 981193 933335 887976 845128
60860 845128 804587 765991 729296 694850 662965 633653 606761 582117 559490 538599 519259
$$ packed form
60927A969968J33042J47452J64522J85738K11016K39083K69954L05223L45748
60918C971746L91410M43736N05819N78270O58832P47940Q47536R44007R93427
60909A0082723R39474P61184N03721K52917P5302j4896l5603k991O7578J34885
60899A2764294J31533Q939k17462m75369o88675q21902q80822q86078q54719p99501
60889G280238p32076o61258n91166n23580m60645m04183l54298l10241k71860
60880B970931k39254k11755j88274j68121j50843j35734j22280j10664j01184
60871A542822r3358q6199p9149p2265o5722n9687n4555n0694m7858m5359m2848
60860H45128m0541l8596l6695l4446l1885k9312k6892k4644k2627k0891j9340
$$ plain form
60849 519259 501405 484940 469709 455612 442624 430643 419474 409033 399400 390589 382433 374800
60837 374800 367817 361706 356475 351899 347771 344048 340788 338054 335871 334203 332979 332184 331879 332067 332634
60822 332634 333469 334526 335698 336772 337618 338353 339107 339729 339900 339473 338549 337251 335619 333714 331632 329391
60806 329391 326896 324058 320834 317264 313592 310275 307672 305708 303970 302121 300112 298119 296511 295757
60792 295757 296063 297088 298309 299664 301591 304400 307926 311920 316447 321691 327587 333885 340433 347172
60778 347172 353899 360228 365844 370772 375399 380205 385360 390615 395678 400618 405687 410818 415539 419457
60764 419457 422539 424873 426432 427262 427694 428141 428778 429512 430113 430332 430049 429454 428874 428283 427158 425000 421861
60747 421861 418188 414261 409981 405144 399728 393949 388123 382452 376910 371392 365975 360925 356424 352461
$$ packed form
60849E19259j7854j6465j5231j4097j2988j1981j1169j0441r633q811q156p633
60837C74800o983o111n231m576m128l723l260k734k183j668j224p95l05J88N67
60822C32634Q35J057J172J074Q46P35P54O22J71m27r24j298j632j905k082k241
60806C29391k495k838l224l570l672l317k603j964j738j849k009j993j608p54
60792B95757L06J025J221J355J927K809L526L994M527N244N896O298O548O739
60778C47172O727O329N616M928M627M806N155N255N063M940N069N131M721L918
60764D19457L082K334J559Q30M32M47O37P34O01K19k83n95n80n91j125k158l139
60747D21861l673l927m280m837n416n779n826n671n542n518n417n050m501l963
$$ plain form
60733 352461 349060 346381 344438 342978 341831 341230 341569 342923 345075 347892 351367 355310 359295 363054 366742
60718 366742 370672 374904 379168 383133 386657 389818 392808 395770 398661 401272 403487 405549 407970 411049
60704 411049 414531 417868 420791 423440 425967 428338 430670 433425 436921 440816 444464 447676 450789 454015
60690 454015 457163 460097 462999 465986 468752 470935 472604 474078 475388 476199 476272 475761 475006 474198 473306 472249
60674 472249 471057 469838 468614 467252 465565 463424 460738 457429 453558 449403 445249 441162 437112 433189
60660 433189 429498 425912 422184 418323 414610 411223 408044 404835 401378 397485 393129 388607 384329 380437
60646 380437 376840 373566 370768 368374 366133 364063 362536 361806 361755 362220 363233 364802 366766 368979 371340
60631 371340 373536 375095 375843 375954 375428 373938 371446 368498 365565 362426 358563 353882 348660 343083 337277
$$ packed form
60733C52461l401k679j943j460j147o01L39J354K152K817L475L943L985L759L688
60718C66742L930M232M264L965L524L161K990K962K891K611K215K062K421L079
60704D11049L482L337K923K649K527K371K332K755L496L895L648L212L113L226
60690D54015L148K934K902K987K766K183J669J474J310Q11P3n11p55q08q92j057
60674D72249j192j219j224j362j687k141k686l309l871m155m154m087m050l923
60660D33189l691l586l728l861l713l387l179l209l457l893m356m522m278l892
60646C80437l597l274k798k394k241k070j527p30n1M65J013J569J964K213K361
60631C71340K196J559P48J11n26j490k492k948k933l139l863m681n222n577n806
$$ plain form
60616 337277 331592 326372 321528 316708 311902 307534 303973 301195 298929 296963 295330 294348 294355 295269 296567
60601 296567 297799 298917 299956 300732 301131 301408 301811 302132 302065 301825 301978 302744 303889 305257 306934 308879 310797
60584 310797 312504 314085 315613 317008 318285 319654 321223 322864 324520 326435 328936 332082 335668 339502
60570 339502 343591 348097 353165 358734 364560 370489 376632 383202 390190 397290 404087 410255 415665 420447
60556 420447 424894 429182 433210 436766 439739 442052 443540 444071 443750 442819 441393 439437 436930 433932 430557
60541 430557 427018 423606 420488 417509 414283 410458 405912 400820 395634 390828 386582 382788 379366 376408
60527 376408 373999 372125 370825 370151 369895 369707 369619 370103 371313 372648 373399 373574 373684 373936 374097 373992 373726
60510 373726 373404 373067 372920 373289 374314 375815 377470 378939 379915 380302 380243 379819 378860 377267 375355 373593 372178
$$ packed form
60616C37277n685n220m844m820m806m368l561k778k266j966j633r82PR14J298
60601B96567J232J118J039P76L99K77M03L21o7k40J53P66J145J368J677J945J918
60584C10797J707J581J528J395J277J369J569J641J656J915K501L146L586L834
60570C39502M089M506N068N569N826N929O143O570O988P100O797O168N410M782
60556D20447M447M288M028L556K973K313J488N31l21r31j426j956k507k998l375
60541D30557l539l412l118k979l226l825m546n092n186m806m246l794l422k958
60527C76408k409j874j300o74k56j88q8M84J210J335P51J75J10K52J61j05k66
60510C73726l22l37j47L69J025J501J655J469R76L87n9m24r59j593j912j762j415
$$ plain form
60493 372178 371110 370498 370448 370826 371537 372873 375186 378292 381663 385134 389029 393651 399148 405880 414381
60478 414381 424776 436623 449432 463016 477114 491035 503886 514996 523972 530517 534320 535096
60466 535096 532784 527861 521367 514401 507665 501604 496747 493468 491604 490761 491032 492931 496644 501771 507912
60451 507912 515031 523104 531878 541199 551230 562150 573952 586732 600842 616618 634277 654270
60439 654270 677343 704041 734453 768728 807555 851848 902191 958842 1022039 1091944 1168451
60428 1168451 1251409 1340988 1437557 1541196 1651357 1766582 1883947 1998578 2103948 2192930
60418 2192930 2258895 2296481 2302165 2274784 2215899 2129779 2022888 1902776 1776604 1650007 1526803
60407 1526803 1409439 1299593 1198447 1106536 1023544 948469 880307 818611 763346 714225 670431
$$ packed form
60493C72178j068o12n0L78P11J336K313L106L371L471L895M622N497O732Q501
60478D14381J0395J1847J2809J3584J4098J3921J2851J1110Q976O545L803P76
60466E35096k312m923o494o966o736o061m857l279j864q43K71J899L713N127O141
60451E07912P119Q073Q774R321J0031J0920J1802J2780J4110J5776J7659J9993
60439F54270K3073K6698L0412L4275L8827M4293N0343N6651O3197O9905P6507
60428A168451Q2958Q9579R6569J03639J10161J15225J17365J14631J05370Q8982
60418B192930O5965L7586N684k7381n8885q6120j06891j20112j26172j26597j23204
60407A526803j17364j09846j01146r1911q2992p5075o8162o1696n5265m9121m3794
$$ plain form
60396 670431 631042 595524 563667 535217 509729 486755 465996 447238 430201 414501 399850
60385 399850 386305 374254 363990 355297 347501 339893 332123 324290 316820 310191 304581 299730 295217
60372 295217 290857 286748 283046 279808 277015 274557 272261 270045 268019 266326 264963 263882 263159 262817 262624
60357 262624 262289 261896 261880 262540 263730 265060 266290 267540 269163 271325 273641 275395 276274 276696 277272 278191
60341 278191 279358 280792 282517 284297 285950 287768 290098 292654 294800 296491 298354 300705 303087 304953
60327 304953 306299 307369 308189 308765 309331 310057 310729 311068 311134 311085 310750 309779 308173 306369 304831 303785 303330
60310 303330 303568 304505 305899 307336 308539 309593 310785 312178 313497 314555 315584 316957 318722 320655 322663
60295 322663 324835 327194 329678 332315 335107 337820 340196 342353 344626 347102 349618 352158 354816 357408
$$ packed form
60396F70431l9389l5518l1857k8450k5488k2974k0759j8758j7037j5700j4651
60385C99850j3545j2051j0264q693p796p608p770p833p470o629n610m851m513
60372B95217m360m109l702l238k793k458k296k216k026j693j363j081p23l42j93
60357B62624l35l93j6O60J190J330J230J250J623K162K316J754Q79M22N76R19
60341B78191J167J434J725J780J653J818K330K556K146J691J863K351K382J866
60327C04953J346J070Q20N76N66P26O72L39O6m9l35r71j606j804j538j046m55
60310C03330K38R37J394J437J203J054J192J393J319J058J029J373J765J933K008
60295C22663K172K359K484K637K792K713K376K157K273K476K516K540K658K592
$$ plain form
60281 357408 359587 361370 363088 364778 366059 366718 366943 366887 366477 365867 365574 365951 366905 368340 370442 373258
60265 373258 376420 379566 382676 385717 388334 390209 391378 391897 391520 390075 387894 385510 383123 380684 378239
60250 378239 375868 373454 370880 368320 366072 364197 362578 361211 360192 359506 359047 358792 358850 359377 360494 362087
60234 362087 363730 365057 366237 367750 369622 371306 372457 373397 374599 376161 378030 380327 383012 385588
60220 385588 387591 389160 390788 392722 394945 397480 400310 403205 405998 408950 412506 416850 421937 427762
60206 427762 434296 441402 449150 457975 468162 479342 490886 502648 514963 528140 542383 558092
60194 558092 575716 595314 616586 639398 663974 690621 719500 750652 783999 819406 856969
60183 856969 897089 939995 985283 1032219 1080335 1129417 1179042 1228495 1277099 1324253 1369203
$$ packed form
60281C57408K179J783J718J690J281O59K25n6m10o10k93L77R54J435K102K816
60265C73258L162L146L110L041K617J875J169N19l77j445k181k384k387k439k445
60250C78239k371k414k574k560k248j875j619j367j019o86m59k55N8N27J117J593
60234C62087J643J327J180J513J872J684J151R40J202J562J869K297K685K576
60220C85588K003J569J628J934K223K535K830K895K793K952L556M344N087N825
60206D27762O534P106P748Q825J0187J1180J1544J1762J2315J3177J4243J5709
60194E58092J7624J9598K1272K2812K4576K6647K8879L1152L3347L5407L7563
60183H56969M0120M2906M5288M6936M8116M9082M9625M9453M8604M7154M4950
$$ plain form
60172 1369203 1411101 1449321 1483469 1513115 1537816 1557388 1571911 1581529 1586457 1587101 1583899 1577117
60160 1577117 1567104 1554686 1541086 1527493 1514888 1504114 1495754 1490033 1487169 1487744 1492438 1501491 1514812
60147 1514812 1532554 1555163 1582828 1615226 1651833 1692118 1735375 1780749 1827526 1875085 1922450
60136 1922450 1968190 2010890 2049484 2083060 2110678 2131573 2145372 2151953 2151280 2143517 2129150 2108908
60124 2108908 2083691 2054643 2023063 1990092 1956598 1923460 1891822 1862881 1837537 1816406 1800095
60113 1800095 1789232 1784202 1784996 1791421 1803367 1820791 1843469 1870882 1902273 1936589 1972311 2007623
60101 2007623 2041022 2071692 2099101 2122432 2140767 2153828 2162127 2166361 2167009 2164580 2159812 2153426 2146076
60088 2146076 2138850 2133481 2131699 2134467 2142122 2155038 2173861 2199256 2231781 2271986 2320429 2377604
$$ packed form
60172A369203M1898L8220L4148K9646K4701J9572J4523R618M928O44l202o782
60160A577117j0013j2418j3600j3593j2605j0774q360n721k864N75M694R053J3321
60147A514812J7742K2609K7665L2398L6607M0285M3257M5374M6777M7559M7365
60136A922450M5740M2700L8594L3576K7618K0895J3799O581o73p763j4367k0242
60124B108908k5217k9048l1580l2971l3494l3138l1638k8941k5344k1131j6311
60113A800095j0863n030P94O425J1946J7424K2678K7413L1391L4316L5722L5312
60101B007623L3399L0670K7409K3331J8335J3061Q299M234O48k429m768o386p350
60088B146076p226n369j782K768P655J2916J8823K5395L2525M0205M8443N7175
$$ plain form
60076 2377604 2443951 2519799 2605229 2700159 2804633 2918781 3042335 3174490 3314353 3461121
60066 3461121 3613539 3769459 3926305 4081692 4233292 4378450 4514444 4638946 4749840
60057 4749840 4844798 4921603 4978851 5015898 5032159 5026927 4999963 4951913 4884070 4798106 4696174
60046 4696174 4581078 4456167 4325080 4191449 4058571 3929297 3806194 3691612 3587389
60037 3587389 3494647 3414074 3346305 3291846 3250833 3223116 3208412 3206051 3214716 3232709 3258373 3290035
60025 3290035 3325684 3363006 3399697 3433570 3462572 3485002 3499654 3505646 3502340 3489654 3468153 3438534
60013 3438534 3401211 3356644 3305711 3249355 3188121 3122462 3053330 2982050 2909776 2837473 2766206
60002 2766206 2697056 2630912 2568741 2511818 2461217 2417218 2379628 2348492 2324043 2306238 2294975
$$ packed form
60076B377604O6347P5848Q5430R4930J04474J14148J23554J32155J39863J46768
60066C461121J52418J55920J56846J55387J51600J45158J35994J24502J10894
60057D749840R4958P6805N7248L7047J6261n232k6964m8050o7843q5964j01932
60046D696174j15096j24911j31087j33631j32878j29274j23103j14582j04223
60037C587389r2742q0573o7769n4459m1013k7717j4704k361Q665J7993K5664L1662
60025C290035L5649L7322L6691L3873K9002K2430J4652N992l306j2686k1501k9619
60013C438534l7323m4567n0933n6356o1234o5659o9132p1280p2274p2303p1267
60002B766206o9150o6144o2171n6923n0601m3999l7590l1136k4449j7805j1263
$$ plain form
59991 2294975 2290638 2293852 2304685 2322608 2347110 2377791 2413873 2454153 2497424 2542477 2587721 2631345
59979 2631345 2671821 2707794 2737636 2759772 2773409 2778395 2774417 2761042 2738585 2708195 2670947 2627518
59967 2627518 2578941 2526933 2473156 2418669 2364423 2311754 2262055 2216346 2175467 2140220 2111033
59956 2111033 2087777 2070255 2058659 2053452 2055121 2064125 2080719 2104687 2135615 2173455 2218401 2270125
59944 2270125 2327656 2390112 2456953 2527225 2599053 2670170 2738531 2802193 2859166 2907866 2947453
59933 2947453 2977438 2997197 3006132 3004016 2990955 2967299 2933838 2891817 2842595 2787563 2728570 2667976
59921 2667976 2608022 2550407 2496569 2447936 2405593 2370078 2341793 2321289 2308861 2304223 2306937 2316899
59909 2316899 2334104 2358179 2388424 2424065 2464191 2507733 2553789 2601720 2650642 2699071 2745444
$$ packed form
59991B294975m337L214J0833J7923K4502L0681L6082M0280M3271M5053M5244M3624
59979B631345M0476L5973K9842K2136J3637M986l978j3375k2457l0390l7248m3429
59967B627518m8577n2008n3777n4487n4246n2669m9699m5709m0879l5247k9187
59956B111033k3256j7522j1596n207J669R004J6594K3968L0928L7840M4946N1724
59944B270125N7531O2456O6841P0272P1828P1117O8361O3662N6973M8700L9587
59933B947453K9985J9759Q935k116j3061k3656l3461m2021m9222n5032n8993o0594
59921B667976n9954n7615n3838m8633m2343l5515k8285k0504j2428m638K714R962
59909B316899J7205K4075L0245L5641M0126M3542M6056M7931M8922M8429M6373
$$ plain form
59898 2745444 2788849 2829005 2865713 2898600 2927288 2951609 2971797 2988644 3003348 3017021 3030465
59887 3030465 3044522 3060474 3079963 3104695 3136283 3176114 3225256 3284615 3355216 3438127 3534056
59876 3534056 3643246 3765625 3900659 4047044 4202930 4366428 4535279 4705818 4872752
59867 4872752 5030211 5172634 5294602 5390609 5455760 5486756 5482227 5442695 5370642 5270226 5146414
59856 5146414 5004317 4849304 4687052 4522882 4361039 4204736 4056499 3918205 3791150
59847 3791150 3676466 3575290 3488352 3415722 3357294 3313206 3283480 3267530 3264410 3273320 3293612
59836 3293612 3324519 3365130 3414339 3470489 3531216 3593782 3655281 3712400 3761443 3798964 3822153
59825 3822153 3828575 3816119 3783712 3731738 3661471 3574529 3473269 3361127 3241813 3118252 2992679
$$ packed form
59898B745444M3405M0156L6708L2887K8688K4321K0188J6847J4704J3673J3444
59887C030465J4057J5952J9489K4732L1588L9831M9142N9359P0601Q2911R5929
59876C534056J09190J22379J35034J46385J55886J63498J68851J70539J66934
59867D872752J57459J42423J21968R6007O5151L0996m529l9532p2053j00416j23812
59856E146414j42097j55013j62252j64170j61843j56303j48237j38294j27055
59847C791150j14684j01176q6938p2630n8428m4088k9726j5950l120Q910K0292
59836C293612L0907M0611M9209N6150O0727O2566O1499N7119M9043L7521K3189
59825C822153O422j2456l2407n1974p0267q6942j01260j12142j19314j23561j25573
$$ plain form
59814 2992679 2867389 2744747 2626660 2514522 2409528 2312485 2223425 2141941 2067905 2001469
59804 2001469 1942461 1890219 1844032 1803323 1767416 1735415 1706367 1679334 1653413 1628007 1603022
59793 1603022 1578673 1555194 1532860 1512007 1492786 1475176 1459429 1446166 1435660 1427339 1420304 1413984
59781 1413984 1407813 1400730 1391684 1380464 1367435 1352616 1335762 1317299 1298464 1280266 1262886 1246313
59769 1246313 1231060 1217943 1207489 1199874 1195283 1193974 1196009 1201091 1208718 1218479 1230192 1243749 1258948
59756 1258948 1275668 1294155 1314825 1337693 1362308 1388354 1415891 1444686 1473596 1501008 1525751
59745 1525751 1547350 1565687 1580818 1593016 1602638 1609982 1615446 1619682 1623427 1627426 1632625 1640134 1650683
59732 1650683 1664459 1681727 1703263 1729862 1761836 1799468 1843597 1895232 1954897 2022860 2099764
$$ packed form
59814B992679j25290j22642j18087j12138j04994r7043q9060q1484p4036o6436
59804B001469n9008n2242m6187m0709l5907l2001k9048k7033k5921k5406k4985
59793A603022k4349k3479k2334k0853j9221j7610j5747j3263j0506q321p035o320
59781A413984o171p083r046j1220j3029j4819j6854j8463j8835j8198j7380j6573
59769A246313j5253j3117j0454p615m591j309K035N082P627R761J1713J3557J5199
59756A258948J6720J8487K0670K2868K4615K6046K7537K8795K8910K7412K4743
59745A525751K1599J8337J5131J2198R622P344N464M236L745L999N199P509J0549
59732A650683J3776J7268K1536K6599L1974L7632M4129N1635N9665O7963P6904
$$ plain form
59721 2099764 2186425 2283221 2390213 2507635 2635561 2773041 2917858 3066672 3214363 3353178
59711 3353178 3473436 3565920 3624073 3644867 3628960 3580532 3506330 3414089 3311343 3204877 3100142
59700 3100142 3000691 2908531 2825140 2751814 2689100 2636661 2594112 2561595 2539273 2526713 2523160
59689 2523160 2528187 2541699 2563532 2593444 2631426 2677680 2732276 2795018 2865763 2944769 3032634
59678 3032634 3129894 3236780 3353471 3480534 3618854 3769146 3931807 4107347 4296599 4500232
59668 4500232 4718300 4950526 5196680 5456288 5728115 6010256 6300441 6595702 6891945
59659 6891945 7184496 7469320 7743676 8005942 8255552 8493288 8721404 8943299 9163063
59650 9163063 9384860 9612081 9846865 10090428 10343427 10605377 10873750 11144008 11410385
$$ packed form
59721B099764Q6661R6796J06992J17422J27926J37480J44817J48814J47691J38815
59711C353178J20258R2484N8153K0794j5907m8428p4202r2241j02746j06466j04735
59700C100142r9451r2160q3391p3326o2714n2439m2549l2517k2322j2560l553
59689B523160N027J3512K1833K9912L7982M6254N4596O2742P0745P9006Q7865
59678C032634R7260J06886J16691J27063J38320J50292J62661J75540J89252K03633
59668D500232K18068K32226K46154K59608K71827K82141K90185K95261K96243
59659F891945K92551K84824K74356K62266K49610K37736K28116K21895K19764
59650I163063K21797K27221K34784K43563K52999K61950K68373K70258K66377
$$ plain form
59641 11410385 11666270 11904231 12116745 12297471 12441824 12546741 12610835 12635214 12623752 12582316
59631 12582316 12517852 12437987 12350639 12263363 12183026 12115944 12067816 12043258 12045713 12078012 12142846
59620 12142846 12242601 12379044 12553176 12765114 13013925 13297744 13613809 13957813 14322899
59611 14322899 14699351 15075029 15435539 15764074 16042129 16251553 16376811 16406458 16334222 16160148
59601 16160148 15891105 15539735 15122270 14656377 14159622 13648434 13137228 12637651 12158074
59592 12158074 11703658 11276742 10876897 10500400 10140130 9786856 9431487 9067031 8689800
59583 8689800 8300089 7901955 7501683 7105720 6719595 6347907 5994339 5661264 5349740
59574 5349740 5060048 4792027 4544978 4317794 4109397 3918821 3744848 3586011 3441085
$$ packed form
59641A1410385K55885K37961K12514J80726J44353J04917O4094K4379j1462m1436
59631A2582316o4464p9865q7348q7276q0337o7082m8128k4558K455L2299O4834
59620A2142846R9755J36443J74132K11938K48811K83819L16065L44004L65086
59611A4322899L76452L75678L60510L28535K78055K09424J25258K9647p2236j74074
59601A6160148k69043l51370m17465m65893m96755n11188n11206m99577m79577
59592A2158074m54416m26916l99845l76497l60270l53274l55369l64456l77231
59583H689800l89711l98134m00272l95963l86125l71688l53568l33075l11524
59574E349740k89692k68021k47049k27184k08397j90576j73973j58837j44926
$$ plain form
59565 3441085 3309243 3189624 3081165 2982977 2894512 2815162 2743970 2679881 2622013 2569547 2521626
59554 2521626 2477536 2436701 2398349 2361371 2324637 2287264 2248600 2208235 2166163 2122692 2078103
59543 2078103 2032564 1986364 1940011 1894081 1849242 1806345 1766141 1728839 1694194 1662079 1632746
59532 1632746 1606581 1583949 1565217 1550520 1539471 1531418 1526076 1523602 1524085 1527273 1532796 1540295 1549375
59519 1549375 1559790 1571607 1584798 1598767 1612803 1626918 1641732 1657539 1674159 1691782 1711216
59508 1711216 1733087 1757413 1784271 1814293 1848120 1885901 1927724 1974075 2025389 2081528 2142213
59497 2142213 2207773 2279067 2356883 2441689 2533715 2632830 2738444 2849874 2966779 3089013
59487 3089013 3216099 3346967 3480062 3613619 3746034 3876099 4002743 4124478 4239477
$$ packed form
59565C441085j31842j19619j08459r8188q8465p9350p1192o4089n7868n2466m7921
59554B521626m4090m0835l8352l6978l6734l7373l8664m0365m2072m3471m4589
59543B078103m5539m6200m6353m5930m4839m2897m0204l7302l4645l2115k9333
59532A632746k6165k2632j8732j4697j1049q053n342k474M83L188N523P499R080
59519A549375J0415J1817J3191J3969J4036J4115J4814J5807J6620J7623J9434
59508A711216K1871K4326K6858L0022L3827L7781M1823M6351N1314N6139O0685
59497B142213O5560P1294P7816Q4806R2026R9115J05614J11430J16905J22234
59487C089013J27086J30868J33095J33557J32415J30065J26644J21735J14999
$$ plain form
59478 4239477 4346467 4445398 4536943 4621354 4697922 4765542 4823744 4873319 4915981 4953504 4987300
59467 4987300 5018808 5049884 5082355 5117266 5154871 5195005 5236889 5278519 5316752 5348030 5368713
59456 5368713 5374997 5363395 5331646 5278739 5204013 5106934 4988056 4849697 4695274 4528337 4352429
59445 4352429 4171295 3988587 3807444 3630509 3460065 3297908 3145300 3003223 2872468
59436 2872468 2753367 2645760 2549335 2463727 2388259 2322078 2264752 2216326 2176607 2144775 2119966
59425 2119966 2101916 2090815 2086848 2090083 2100512 2117960 2142206 2173306 2211531 2256895 2309092 2367988
59413 2367988 2433782 2506551 2586008 2671756 2763308 2859662 2959200 3060093 3160306 3257142 3347334
59402 3347334 3427805 3495857 3548600 3583002 3596996 3590085 3562599 3515006 3448415 3365197 3268506
$$ packed form
59478D239477J06990R8931R1545Q4411P6568O7620N8202M9575M2662L7523L3796
59467D987300L1508L1076L2471L4911L7605M0134M1884M1630L8233L1278K0683
59456E368713O284j1602l1749n2907p4726r7079j18878j38359j54423j66937j75908
59445D352429j81134j82708j81143j76935j70444j62157j52608j42077j30755
59436B872468j19101j07607r6425q5608p5468o6181n7326m8426l9719l1832k4809
59425B119966j8050j1101l967L235J0429J7448K4246L1100L8225M5364N2197N8896
59413B367988O5794P2769P9457Q5748R1552R6354R9538J00893J00213R6836R0192
59402C347334Q0471O8052N2743L4402J3994o911k7486m7593o6591q3218r6691
$$ plain form
59391 3268506 3161417 3046800 2927477 2805921 2684044 2563644 2446691 2334770 2228616
59382 2228616 2128579 2035161 1948680 1868810 1795053 1727382 1665942 1610328 1559720 1513657 1472287
59371 1472287 1435887 1404423 1377513 1354557 1335051 1318871 1306118 1296582 1289710 1285215 1283326 1284211
59359 1284211 1287535 1292846 1300059 1309248 1320323 1333219 1348128 1365317 1384887 1406735 1430307 1454318
59347 1454318 1477374 1499196 1520910 1543964 1569316 1597760 1630264 1667575 1710106 1758476 1813335
59336 1813335 1874172 1939140 2006897 2078128 2154705 2238099 2329423 2430304 2542487 2666763 2803201
59325 2803201 2952295 3115063 3292094 3483241 3688164 3906373 4136569 4376367 4622511
59316 4622511 4870867 5116407 5353996 5579440 5789640 5982156 6155278 6308434 6441897
$$ packed form
59391C268506j07089j14617j19323j21556j21877j20400j16953j11921j06154
59382B228616j00037r3418q6481p9870p3757o7671o1440n5614n0608m6063m1370
59371A472287l6400l1464k6910k2956j9506j6180j2753r536o872m495j889Q85
59359A284211L324N311P213R189J1075J2896J4909J7189J9570K1848K3572K4011
59347A454318K3056K1822K1714K3054K5352K8444L2504L7311M2531M8370N4859
59336A813335O0837O4968O7757P1231P6577Q3394R1324J00881J12183J24276J36438
59325B803201J49094J62768J77031J91147K04923K18209K30196K39798K46144
59316D622511K48356K45540K37589K25444K10200J92516J73122J53156J33463
$$ plain form
59307 6441897 6556144 6651840 6730146 6792302 6838847 6869615 6884259 6882172 6862099 6822605 6763107
59296 6763107 6684083 6586479 6471659 6342045 6201219 6053085 5901061 5747890 5595501 5444695
59286 5444695 5295139 5145777 4995268 4842327 4686089 4526311 4363229 4197456 4030162
59277 4030162 3862967 3697367 3534512 3375782 3223103 3078203 2941801 2813930 2694723
59268 2694723 2584439 2483056 2390431 2306637 2231650 2164874 2105451 2052860 2006864 1967152 1933495
59257 1933495 1905908 1884169 1867465 1855023 1846813 1843134 1843864 1848674 1857605 1870765 1887730 1907944
59245 1907944 1931438 1958515 1989003 2022533 2059220 2099215 2141742 2185457 2229678 2274438 2319284
59234 2319284 2362873 2403875 2441675 2476125 2507201 2535030 2559738 2581295 2599996 2616934 2633438
$$ packed form
59307F441897J14247R5696P8306O2156M6545L0768J4644k087k0073l9494n9498
59296F763107p9024r7604j14820j29614j40826j48134j52024j53171j52389j50806
59286E444695j49556j49362j50509j52941j56238j59778j63082j65773j67294
59277D030162j67195j65600j62855j58730j52679j44900j36402j27871j19207
59268B694723j10284j01383r2625q3794p4987o6776n9423n2591m5996l9712l3657
59257A933495k7587k1739j6704j2442q210l679P30M810Q931J3160J6965K0214
59245A907944K3494K7077L0488L3530L6687L9995M2527M3715M4221M4760M4846
59234B319284M3589M1002L7800L4450L1076K7829K4708K1557J8701J6938J6504
$$ plain form
59223 2633438 2650196 2667542 2686381 2707981 2732949 2761198 2792851 2828285 2867142 2908120 2949882
59212 2949882 2991463 3031639 3068688 3100961 3127033 3145071 3152898 3149165 3134096 3108932 3075278 3035164
59200 3035164 2991068 2945277 2899447 2854919 2813078 2775205 2742346 2715407 2695056 2681372 2674011
59189 2674011 2672718 2677344 2687391 2702017 2720552 2742566 2767417 2794214 2822256 2851149 2880567 2910463
59177 2910463 2941484 2974626 3010486 3049408 3092330 3140849 3196443 3260199 3333269 3416761 3510909
59166 3510909 3614949 3727883 3848720 3975604 4105177 4232962 4353925 4462633 4553614 4622059
59156 4622059 4664099 4676579 4657258 4605429 4522014 4409125 4270084 4109681 3933551 3746987
59146 3746987 3554653 3361151 3170835 2986810 2810838 2644367 2488865 2344941 2212036
$$ packed form
59223B633438J6758J7346J8839K1600K4968K8249L1653L5434L8857M0978M1762
59212B949882M1581M0176L7049L2273K6072J8038P827l733j5069k5164l3654m0114
59200C035164m4096m5791m5830m4528m1841l7873l2859k6939k0351j3684p361
59189B674011j293M626J0047J4626J8535K2014K4851K6797K8042K8893K9418K9896
59177B910463L1021L3142L5860L8922M2922M8519N5594O3756P3070Q3492R4148
59166C510909J04040J12934J20837J26884J29573J27785J20963J08708R0981O8445
59156D622059M2040J2480j9321n1829q3415j12889j39041j60403j76130j86564
59146C746987j92334j93502j90316j84025j75972j66471j55502j43924j32905
$$ plain form
59137 2212036 2089464 1977139 1874935 1782051 1697548 1620972 1551991 1489860 1433677 1382794 1336653
59126 1336653 1294628 1256321 1221621 1190214 1161411 1134698 1110054 1087547 1067050 1048596 1032506
59115 1032506 1018958 1007771 998789 991997 987114 983644 981517 981166 982813 986223 991371 998724 1008505 1020287
59101 1020287 1033596 1048442 1064967 1083097 1102873 1124589 1148302 1173687 1200713 1229898 1261594
59090 1261594 1295533 1331437 1369519 1409947 1452277 1495906 1540690 1586667 1633547 1680849 1728181
59079 1728181 1775001 1820396 1863463 1903642 1940460 1973300 2001748 2025825 2045632 2061157 2072739
59068 2072739 2081328 2088013 2093621 2099036 2105495 2114190 2125875 2141125 2160684 2185336 2215691 2252332
59056 2252332 2295842 2346472 2404044 2468238 2538690 2614780 2695727 2780885 2869394 2959458 3048446
$$ packed form
59137B212036j22572j12325j02204r2884q4503p6576o8981o2131n6183n0883m6141
59126A336653m2025l8307l4700l1407k8803k6713k4644k2507k0497j8454j6090
59115A032506j3548j1187q982o792m883l470k127l51J647L410N148P353R781J1782
59101A020287J3309J4846J6525J8130J9776K1716K3713K5385K7026K9185L1696
59090A261594L3939L5904L8082M0428M2330M3629M4784M5977M6880M7302M7332
59079A728181M6820M5395M3067M0179L6818L2840K8448K4077J9807J5525J1582
59068B072739Q589O685N608N415O459Q695J1685J5250J9559K4652L0355L6641
59056B252332M3510N0630N7572O4194P0452P6090Q0947Q5158Q8509R0064Q8988
$$ plain form
59045 3048446 3133720 3212731 3282368 3339148 3380514 3405410 3413497 3404643 3379615 3340573 3290352 3231701
59033 3231701 3167394 3100216 3032135 2963916 2895941 2828883 2763171 2698408 2633896 2569333 2504571
59022 2504571 2439135 2372512 2304568 2235304 2164629 2092663 2019861 1946553 1872842 1799240 1726816
59011 1726816 1656357 1587938 1521627 1457945 1397157 1338845 1282795 1229748 1180617 1135438 1093629
59000 1093629 1054824 1018842 985284 953804 924459 897274 871800 847588 824745 803526 783751
58989 783751 765059 747362 730599 714496 699077 684980 672757 662229 653007 645161 638853 633711
58977 633711 629204 625297 622256 620085 618652 618034 618298 619287 621017 623852 627912 632719 637815 643161 648518
58962 648518 653115 656530 659302 661982 664146 665096 665053 664843 664803 664778 664895 665547 666833 668693 671349 674963 679106
$$ packed form
59045C048446Q5274P9011O9637N6780M1366K4896Q087q854k5028l9042n0221n8651
59033C231701o4307o7178o8081o8219o7975o7058o5712o4763o4512o4563o4762
59022B504571o5436o6623o7944o9264p0675p1966p2802p3308p3711p3602p2424
59011A726816p0459o8419o6311o3682o0788n8312n6050n3047m9131m5179m1809
59000A093629l8805l5982l3558l1480k9345k7185k5474k4212k2843k1219j9775
58989G83751j8692j7697j6763j6103j5419j4097j2223j0528r222p846o308n142
58977F33711m507l907l041k171j433o18K64R89J730K835M060M807N096N346N357
58962F48518M597L415K772K680K164R50m3k10m0k5J17O52J286J860K656L614M143
$$ plain form
58945 679106 683178 687119 691103 694850 697872 700154 701932 703022 703067 702280 701301 700463 699660 698806 697905 696907
58929 696907 695960 695652 696519 698552 701502 705311 709857 714774 719997 726048 733249 741137 749199 757604 766571
58914 766571 775645 784462 793701 804391 816580 829570 843149 857689 873300 889798 907361 926354
58902 926354 946576 967489 989036 1011506 1034761 1058387 1082454 1107335 1132937 1158988 1185982
58891 1185982 1214986 1246427 1279858 1314980 1352166 1391897 1434402 1479986 1529053 1581678 1637675
58880 1637675 1697179 1760695 1828573 1900934 1978139 2060842 2149564 2244638 2346502 2455702 2572717
58869 2572717 2698216 2833264 2978846 3135393 3303220 3483147 3676222 3883134 4104376
58860 4104376 4340596 4592075 4858132 5137625 5429645 5732913 6044651 6360636 6675989
$$ packed form
58945F79106M072L941L984L747L022K282J778J090M5p87r79q38q03q54r01r98
58929F96907r47l08Q67K033K950L809M546M917N223O051P201P888Q062Q405Q967
58914G66571R074Q817R239J0690J2189J2990J3579J4540J5611J6498J7563J8993
58902I26354K0222K0913K1547K2470K3255K3626K4067K4881K5602K6051K6994
58891A185982K9004L1441L3431L5122L7186L9731M2505M5584M9067N2625N5997
58880A637675N9504O3516O7878P2361P7205Q2703Q8722R5074J01864J09200J17015
58869B572717J25499J35048J45582J56547J67827J79927J93075K06912K21242
58860D104376K36220K51479K66057K79493K92020L03268L11738L15985L15353
$$ plain form
58851 6675989 6985042 7280630 7554434 7798070 8003423 8162540 8268561 8317223 8307221 8239521
58841 8239521 8117239 7945933 7732911 7485818 7212190 6919864 6616555 6308721 6001355
58832 6001355 5698803 5404939 5122463 4852856 4597196 4356486 4131145 3920967 3725725
58823 3725725 3545222 3378666 3224641 3081932 2949936 2828160 2715764 2611641 2514641 2423798
58813 2423798 2338719 2259607 2186557 2119089 2056721 1999518 1947486 1899853 1855674 1814817 1777644
58802 1777644 1744023 1713535 1686264 1662529 1642025 1624157 1609002 1597062 1588224 1581946 1578364 1578215
58790 1578215 1581666 1588149 1597387 1609731 1625424 1644364 1666630 1692495 1721871 1754540 1790856 1831421
58778 1831421 1876133 1924394 1976244 2032434 2093407 2159099 2229730 2305897 2387838 2475486 2569310
$$ packed form
58851F675989L09053K95588K73804K43636K05353J59117J06021M8662j0002o7700
58841H239521j22282j71306k13022k47093k73628k92326l03309l07834l07366
58832F001355l02552k93864k82476k69607k55660k40710k25341k10178j95242
58823C725725j80503j66556j54025j42709j31996j21776j12396j04123r7000r0843
58813B423798q5079p9112p3050o7468o2368n7203n2032m7633m4179m0857l7173
58802A777644l3621l0488k7271k3735k0504j7868j5155j1940q838o278l582j49
58790A578215L451O483R238J2344J5693J8940K2266K5865K9376L2669L6316M0565
58778A831421M4712M8261N1850N6190O0973O5692P0631P6167Q1941Q7648R3824
$$ plain form
58767 2569310 2670315 2779230 2896511 3023046 3159901 3307417 3465591 3635359 3818424
58758 3818424 4015701 4226991 4452292 4692274 4947036 5215321 5495273 5785011 6081891
58749 6081891 6381777 6679263 6967895 7239981 7486956 7700366 7872294 7995364 8063672 8074233
58739 8074233 8027109 7924356 7769760 7569440 7331355 7063659 6773981 6469949 6159009 5847170
58729 5847170 5538693 5237122 4945718 4666741 4401292 4150169 3914039 3692682 3485125
58720 3485125 3290824 3109854 2941836 2785677 2640529 2506048 2381482 2265553 2157442
58711 2157442 2056858 1962938 1874260 1790233 1711353 1637773 1568773 1504003 1443979 1388845 1337768
58700 1337768 1290099 1246041 1205614 1168110 1133153 1101226 1072521 1046302 1022046 1000175 980907
$$ packed form
58767B569310J01005J08915J17281J26535J36855J47516J58174J69768J83065
58758C818424J97277K11290K25301K39982K54762K68285K79952K89738K96880
58749F081891K99886K97486K88632K72086K46975K13410J71928J23070O8308J0561
58739H074233m7124j02753j54596k00320k38085k67696k89678l04032l10940l11839
58729E847170l08477l01571k91404k78977k65449k51123k36130k21357k07557
58720C485125j94301j80970j68018j56159j45148j34481j24566j15929j08111
58711B157442j00584r3920q8678q4027p8880p3580o9000o4770o0024n5134n1077
58700A337768m7669m4058m0427l7504l4957l1927k8705k6219k4256k1871j9268
$$ plain form
58689 980907 963395 946819 931421 917635 905054 893065 881764 871440 861783 852350 843178 834312
58677 834312 825274 815607 805334 794415 782474 769566 756483 743766 731127 718331 705827 693914
58665 693914 682052 669663 656907 644093 631050 617697 604495 591709 578866 565549 552124
58654 552124 539155 526689 514650 503252 492570 482369 472755 464220 456658 449205 441569 434588 428898
58641 428898 423922 418858 413786 409130 404801 400561 396499 392566 388386 384122 380645 378263 376180 373846
58627 373846 371876 370860 370251 369287 368071 366830 364957 361893 358216 354833 351716 348476 345565 343809 343184
58612 343184 343010 343028 343445 344190 344971 345779 346708 347565 348246 349098 350404 351938 353475 355214 357198 358925 360111
58595 360111 361227 362793 364735 366954 369855 373756 378399 383543 389404 396053 403131 410639 419212 429145
$$ packed form
58689I80907j7512j6576j5398j3786j2581j1989j1301j0324r657r433r172q866
58677H34312r038r667j0273j0919j1941j2908j3083j2717j2639j2796j2504j1913
58665F93914j1862j2389j2756j2814j3043j3353j3202j2786j2843j3317j3425
58654E52124j2969j2466j2039j1398j0682j0201r614q535p562p453p636o981n690
58641D28898m976n064n072m656m329m240m062l933m180m264l477k382k083k334
58627C73846j970j016o09r64j216j241j873l064l677l383l117l240k911j756o25
58612C43184j74J8M17P45P81Q08R29Q57O81Q52J306J534J537J739J984J727J186
58595C60111J116J566J942K219K901L901M643N144N861O649P078P508Q573R933
$$ plain form
58581 429145 439980 451550 464456 478946 494356 510327 527551 546585 566974 588390 611613
58570 611613 637452 665624 695696 728212 763947 802930 845193 891668 943278 999907 1061212
58559 1061212 1127651 1199772 1277275 1359692 1447109 1539122 1633816 1728717 1821890 1911095 1992786
58548 1992786 2063140 2119387 2159213 2180009 2180167 2160557 2123621 2071722 2007428 1934331 1855997 1774572
58536 1774572 1691551 1609150 1529582 1453605 1381072 1312338 1247909 1187405 1130280 1077032 1028458
58525 1028458 984277 943800 907286 875245 846983 821252 797922 777585 760001 744335 730495
58514 730495 718840 708880 699635 690926 683007 675300 666863 657838 649117 640888 632695 624546 616605 608149
58500 608149 598193 586900 575182 563223 550646 537726 525133 512841 500560 488909 478778 469923
$$ packed form
58581D29145J0835J1570J2906J4490J5410J5971J7224J9034K0389K1416K3223
58570F11613K5839K8172L0072L2516L5735L8983M2263M6475N1610N6629O1305
58559A061212O6439P2121P7503Q2417Q7417R2013R4694R4901R3173Q9205Q1691
58548A992786P0354N6247L9826K0796J58j9610l6936n1899o4294p3097p8334q1425
58536A774572q3021q2401p9568p5977p2533o8734o4429o0504n7125n3248m8574
58525A028458m4181m0477l6514l2041k8262k5731k3330k0337j7584j5666j3840
58514G30495j1655r960r245q709p919p707q437r025q721q229q193q149p941q456
58500F08149r956j1293j1718j1959j2577j2920j2593j2292j2281j1651j0131q855
$$ plain form
58488 469923 461499 453638 447111 441766 436781 432174 428593 425791 422749 419213 415806 412704 409485 406091
58474 406091 402679 398732 393599 387706 381967 376243 369699 362433 355371 348732 341958 334973 328167 321340
58460 321340 314016 306664 300255 294759 289356 283956 279234 275379 272065 269397 267578 265952 263769 261662
58446 261662 260856 261204 261469 261352 261721 262925 264433 266089 268297 270942 273478 276055 279290 283033 286616
58431 286616 290068 293843 297671 301027 304323 308209 312084 314867 316843 319125 321682 323632 325146 327154
58417 327154 329421 330805 331347 332154 333210 333226 331776 329734 327364 323805 318745 312957 306944 300561 294125
58402 294125 288357 283068 277460 271762 267050 263428 259994 256604 253969 252015 249825 247322 245338 244032
58388 244032 242894 242237 242875 244340 245285 245691 246832 248997 251248 253493 256759 261131 265403 269112 273038
$$ packed form
58488D69923q424p861o527n345m985m607l581k802l042l536l407l102l219l394
58474D06091l412l947n133n893n739n724o544p266p062o639o774o985o806o827
58460C21340p324p352o409n496n403n400m722l855l314k668j819j626k183k107
58446B61662q06L48K65j17L69J204J508J656K208K645K536K577L235L743L583
58431B86616L452L775L828L356L296L886L875K783J976K282K557J950J514K008
58417C27154K267J384N42Q07J056J6j450k042k370l559n060n788o013o383o436
58402B94125n768n289n608n698m712l622l434l390k635j954k190k503j984j306
58388B44032j138o57O38J465R45M06J141K165K251K245L266M372M272L709L926
$$ plain form
58373 273038 277348 281093 283873 286204 287998 288537 288204 288340 289127 289477 289241 289596 290957 292491 294021 296413
58357 296413 299710 302850 305594 308762 312271 314965 316785 319022 321975 324444 325966 327513 329415 330704
58343 330704 331008 331120 331178 330264 328265 326107 323762 320149 315428 311210 308007 304664 300792 297492 295143
58328 295143 292815 290433 289198 289235 289167 288665 288994 290301 290892 290084 289410 290044 291300 292582 294487 297013 298957
58311 298957 300073 301671 304255 306775 308922 311770 315367 318173 319794 321792 324920 328045 330702 334109
58297 334109 338638 342930 346560 350900 356272 360977 364347 367998 372746 377026 379739 381961 384409 385949
58283 385949 386126 386475 387790 388687 388402 388391 389609 390877 391481 392729 395302 397757 399329 401569 405497 409755
58267 409755 413258 417024 421747 426283 430230 435281 442256 449489 455864 462693 470889 479167 486773 495029
$$ packed form
58373B73038M310L745K780K331J794N39l33J36P87L50k36L55J361J534J530K392
58357B96413L297L140K744L168L509K694J820K237K953K469J522J547J902J289
58343C30704L04J12N8r14j999k158k345l613m721m218l203l343l872l300k349
58328B95143k328k382j235L7o8n02L29J307N91q08o74O34J256J282J905K526J944
58311B98957J116J598K584K520K147K848L597K806J621J998L128L125K657L407
58297C34109M529M292L630M340N372M705L370L651M748M280K713K222K448J540
58283C85949J77L49J315Q97k85j1J218J268O04J248K573K455J572K240L928M258
58267D09755L503L766M723M536L947N051O975P233O375O829Q196Q278P606Q256
$$ plain form
58253 495029 504356 512720 518938 524549 530590 535608 538834 542093 546484 550376 552773 555483 559790 564259
58239 564259 568078 573183 580686 588599 595497 603082 612661 622582 631706 641870 654246 666784 677984
58226 677984 689571 702685 715190 725715 736646 750011 764175 777753 792916 811424 831169
58215 831169 850136 870100 892918 916873 940146 964152 989944 1015221 1038461 1062038 1087708
58204 1087708 1113260 1137250 1162598 1191558 1221713 1251131 1282794 1319458 1358821 1398427 1440646
58193 1440646 1487959 1538052 1588593 1642166 1701368 1763867 1827475 1895118 1969346 2047056 2125365
58182 2125365 2207424 2296591 2390230 2485487 2585703 2694711 2810423 2930700 3059787 3201947
58172 3201947 3354544 3514468 3685157 3869758 4063889 4263165 4471484 4693799 4927752
$$ packed form
58253D95029R327Q364O218N611O041N018L226L259M391L892K397K710M307M469
58239E64259L819N105P503P913O898P585R579R921R124J0164J2376J2538J1200
58226F77984J1587J3114J2505J0525J0931J3365J4164J3578J5163J8508J9745
58215H31169J8967J9964K2818K3955K3273K4006K5792K5277K3240K3577K5670
58204A087708K5552K3990K5348K8960L0155K9418L1663L6664L9363L9606M2219
58193A440646M7313N0093N0541N3573N9202O2499O3608O7643P4228P7710P8309
58182B125365Q2059Q9167R3639R5257J00216J09008J15712J20277J29087J42160
58172C201947J52597J59924J70689J84601J94131J99276K08319K22315K33953
$$ plain form
58163 4927752 5171136 5430191 5711083 6010567 6324900 6660313 7024531 7416123 7833015
58154 7833015 8282819 8773138 9300895 9863559 10471144 11133982 11849360 12614942 13444608
58145 13444608 14356418 15358259 16463047 17704741 19120401 20731091 22561006 24658660
58137 24658660 27076351 29848993 33020247 36665274 40852645 45606661 50943391 56917411
58129 56917411 63610605 71157325 79849169 90040786 101596016 113258049 122775904 128003591
58121 128003591 128087792 123701606 116304113 107291312 97669899 88122174 79087347 70785494
58113 70785494 63286053 56596990 50690612 45497320 40934617 36940395 33460219 30427120
58105 30427120 27781288 25492003 23539021 21890545 20517515 19408990 18553859 17924372
$$ packed form
58163D927752K43384K59055K80892K99484L14333L35413L64218L91592M16892
58154G833015M49804M90319N27757N62664O07585O62838P15378P65582Q29666
58145A3444608R11810J001841J104788J241694J415660J610690J829915K097654
58137B4658660K417691K772642L171254L645027M187371M754016N336730N974020
58129E6917411O693194P546720Q691844J0191617J1555230J1662033R517855N227687
58121A28003591Q4201m386186p397493r012801r621413r547725r034827q301853
58113G0785494p499441o689063n906378n193292m562703l994222l480176l033099
58105C0427120k645832k289285j952982j648476j373030j108525q55131o29487
$$ plain form
58097 17924372 17492039 17241069 17159088 17246422 17544145 18096309 18829064 19489394 19764597 19482849
58087 19482849 18689241 17552281 16239851 14874090 13539426 12287477 11140271 10105389
58079 10105389 9185926 8375761 7659505 7024092 6462629 5965593 5519150 5114909 4751942
58070 4751942 4427217 4132917 3864513 3622491 3404580 3204405 3018925 2849310 2693719
58061 2693719 2546915 2407666 2278987 2160541 2048083 1940824 1842059 1751915 1666543 1585033
58051 1585033 1510290 1442261 1376862 1312376 1250828 1192437 1134783 1078050 1025234 976522 928989
58040 928989 882323 839310 800285 762569 725873 692900 664065 636786 610427 586889 565894
58029 565894 544761 523344 504228 487525 470321 451865 434450 418538 401787 383693 366675
$$ packed form
58097A7924372m32333k50970q1981Q7334K97723N52164P32755O60330K75203k81748
58087A9482849p93608j136960j312430j365761j334664j251949j147206j034882
58079A0105389r19463q10165p16256o35413n61463m97036m46443m04241l62967
58070D751942l24725k94300k68404k42022k17911k00175j85480j69615j55591
58061B693719j46804j39249j28679j18446j12458j07259r8765r0144q5372q1510
58051A585033p4743o8029o5399o4486o1548n8391n7654n6733n2816m8712m7533
58040I28989m6666m3013l9025l7716l6696l2973k8835k7279k6359k3538k0995
58029E65894k1133k1417j9116j6703j7204j8456j7415j5912j6751j8094j7018
$$ plain form
58018 366675 351710 337244 323174 311568 302570 293676 283954 275131 267827 260569 253148 247085 242109
58005 242109 236046 228814 222778 218468 213776 208059 203177 199659 195587 190248 185303 181405 177103 172034
57991 172034 167834 164929 161686 157679 154585 152917 151051 148410 146549 146092 145632 144580 144158 144609 144375
57976 144375 143048 142331 143095 144215 145139 146860 149418 151173 151512 151661 152049 151551 150173 149694 150639 151320 150886
57959 150886 150673 151482 152131 151890 151854 152660 153164 152583 151732 151055 149603 147052 144623 142944 141092 138701 136874
57942 136874 136052 135098 133478 132255 131898 131237 129634 128138 127401 126460 124709 123102 122263 121237 119278 117121
57926 117121 115416 113644 111627 110379 110389 110667 110499 110548 111304 112119 112667 113733 115558 117053 117584 117972 118805
57909 118805 119368 119149 118822 118771 118148 116406 114289 112454 110498 108158 106035 104309 102181 99342 96557 94126
$$ packed form
58018C66675j4965j4466j4070j1606q998q894r722q823p304p258p421o063m976
58005B42109o063p232o036m310m692n717m882l518m072n339m945l898m302n069
57991A72034m200k905l243m007l094j668j866k641j861m57m60j052m22M51k34
57976A44375j327p17P64J120R24J721K558J755L39J49L88m98j378m79R45O81m34
57959A50886k13Q09O49k41l6Q06N04n81q51o77j452k551k429j679j852k391j827
57942A36874q22r54j620j223l57o61j603j496p37r41j751j607q39j026j959k157
57926A17121j705j772k017j248J0K78j68M9P56Q15N48J066J825J495N31L88Q33
57909A18805N63k19l27n1o23j742k117j835j956k340k123j726k128k839k785k431
$$ plain form
57893 94126 91324 88075 85551 84337 83575 82670 82182 82260 81927 80850 80127 80340 80516 79967 79469 79562 79335 78100
57875 78100 76687 75818 74682 72416 69665 67369 65242 62665 59963 57586 55147 52364 49904 48258 46854
57860 46854 45241 44067 43934 44383 44942 46013 47816 49586 50796 52075 54000 56094 57900 59897 62478
57845 62478 65171 67717 70690 74168 77095 78903 80471 82484 84191 84884 85273 86157 86970 86882 86251 85728
57829 85728 84987 83581 82045 80927 79652 77539 74999 72648 70206 67388 64905 63380 62224 60724 59349
57814 59349 58802 58702 58346 57921 57822 57698 57331 57534 58954 60856 62274 63447 64896 66070 66288 66180 66808
57797 66808 68026 69045 69867 70836 71464 71165 70560 70635 71084 70805 69625 68203 66675 64690 62467 60589 58983
57780 58983 57169 55228 53504 51705 49330 46624 44190 42044 39951 38127 36665 34823 31930 28508
$$ packed form
57893I4126k802l249k524j214p62r05m88P8l33j077p23K13J76n49m98R3k27j235
57875G8100j413q69j136k266k751k296k127k577k702k377k439k783k460j646j404
57860D6854j613j174j33M49N59J071J803J770J210J279J925K094J806J997K581
57845F2478K693K546K973L478K927J808J568K013J707O93L89Q84Q13q8o31n23
57829H5728p41j406j536j118j275k113k540k351k442k818k483j525j156j500j375
57814E9349n47j00l56m25r9j24l67K03J420J902J418J173J449J174K18j08O28
57797F6808J218J019Q22R69O28k99o05P5M49k79j180j422j528j985k223j878j606
57780E8983j814j941j724j799k375k706k434k146k093j824j462j842k893l422
$$ plain form
57766 28508 25455 22670 19515 16099 12942 9900 6595 3436 1063 -844 -3076 -5585 -7852 -10047 -12642
57751 -12642 -15229 -16982 -18040 -19255 -20786 -22073 -22975 -23815 -24468 -24516 -24159 -23918 -23605 -22588 -20890 -19039
57735 -19039 -17062 -14614 -11914 -9485 -7191 -4605 -2131 -663 -228 -12 312 341 -28 -355 -471 -664 -1054 -1567
57717 -1567 -2434 -3867 -5411 -6476 -7353 -8778 -10638 -12054 -12683 -13020 -13486 -14092 -14940 -16158 -17386 -18134 -18568
57700 -18568 -19144 -19609 -19244 -17987 -16438 -14862 -13087 -11236 -9657 -8171 -6286 -4115 -2184 -463 1527
57684 3720 5553 7008 8635 10560 12371 14021 15950 18230 20442 22445 24510 26690 28865 31338 34548
57669 34548 38223 41725 45137 49137 53792 58478 62975 67691 72759 77960 83622 90529 98681 107113
57655 107113 115231 123451 132232 141386 150693 160412 170805 181818 193519 206226 219957 234402 249620
$$ packed form
57766B8508l053k785l155l416l157l042l305l159A063h44k232k509k267k195k595
57751a2642k587j753j058j215j531j287r02q40o53m8L57K41L13J017J698J851
57735a9039J977K448K700K429K294K586b131f63b28a2C12K9b8l27j16j93l90n13
57717a567q67j433j544j065q77j425j860j416o29l37m66o06q48j218j228p48m34
57700a8568n76m65L65J257J549J576J775J851J579J486J885K171J931d63A527
57684C720J833J455J627J925J811J650J929K280K212K003K065K180K175K473L210
57669C4548L675L502L412M000M655M686M497M716N068N201N662O907Q152Q432
57655A07113Q118Q220Q781R154R307R719J0393J1013J1701J2707J3731J4445J5218
$$ plain form
57642 249620 266175 284414 304226 325626 348891 374053 400971 430024 462008 497263 535637
57631 535637 577379 623221 673401 727481 785375 847706 914774 985888 1060042 1136498 1214244
57620 1214244 1291434 1365676 1434383 1494662 1543596 1579142 1600561 1608071 1602834 1587401 1565411 1540334
57608 1540334 1514702 1490087 1466564 1441732 1411224 1371170 1320258 1259730 1192288 1121326 1050244
57597 1050244 981612 916969 857386 803641 755729 712963 674911 641789 613756 590452 571426
57586 571426 556363 544642 535401 528416 524282 523335 525072 529021 535484 544962 557404 572574 590666
57573 590666 612005 636583 664373 695737 731002 769971 812307 858141 907804 961116 1017279
57562 1017279 1075293 1134138 1192586 1248885 1300501 1344223 1376990 1396870 1403126 1395498 1374004 1339501
$$ packed form
57642B49620J6555J8239J9812K1400K3265K5162K6918K9053L1984L5255L8374
57631E35637M1742M5842N0180N4080N7894O2331O7068P1114P4154P6456P7746
57620A214244P7190P4242O8707O0279M8934L5546K1419P510n237j5433k1990k5077
57608A540334k5632k4615k3523k4832l0508m0054n0912o0528o7442p0962p1082
57597A050244o8632o4643n9583n3745m7912m2766l8052l3122k8033k3304j9026
57586E71426j5063j1721r241o985m134r47J737L949O463R478J2442J5170J8092
57573E90666K1339K4578K7790L1364L5265L8969M2336M5834M9663N3312N6163
57562A017279N8014N8845N8448N6299N1616M3722L2767J9880O256p628k1494l4503
$$ plain form
57550 1339501 1293879 1239496 1178740 1114114 1047992 981973 916870 853498 792946 735944 682519
57539 682519 632518 586003 542910 502893 465744 431516 400022 370762 343591 318872 296674
57528 296674 276358 257300 239533 223319 208576 195087 182835 171788 161730 152583 144506 137408
57516 137408 130797 124384 118450 113345 109040 105380 102356 99916 97953 96664 96380 96878 97432 97771 98390
57501 98390 99696 101496 103633 106446 110169 114479 119091 124215 129998 136122 142416 149330 157295 166140
57487 166140 175643 186056 197583 209922 222949 237320 253737 272083 291951 313613 337708 364366
57475 364366 393338 424724 458903 495931 535662 578164 623343 670304 717681 764481 809996
57464 809996 852977 891466 923378 946853 960259 962483 953334 933390 903654 865745 821997 774746
$$ packed form
57550A339501m5622n4383o0756o4626o6122o6019o5103o3372o0552n7002n3425
57539F82519n0001m6515m3093m0017l7149l4228l1494k9260k7171k4719k2198
57528B96674k0316j9058j7767j6214j4743j3489j2252j1047j0058r147q077p098
57516A37408o611o413n934n105m305l660l024k440j963j289k84M98N54L39O19
57501I8390J306J800K137K813L723M310M612N124N783O124O294O914P965Q845
57487A66140R503J0413J1527J2339J3027J4371J6417J8346J9868K1662K4095K6658
57475C64366K8972L1386L4179L7028L9731M2502M5179M6961M7377M6800M5515
57464H09996M2981L8489L1912K3475J3406K224r149j9944k9736l7909m3748m7251
$$ plain form
57452 774746 725512 675269 625224 576717 530507 486737 445562 407324 372200 340195 311485
57441 311485 286260 264250 244868 227828 213260 201195 191335 183361 177092 172370 169104 167414 167442
57428 167442 169055 172005 176276 181980 189032 197292 206903 218132 230954 245157 260830 278368 298043
57415 298043 319908 344158 371264 401599 435054 470992 508574 547261 587097 628210 669861
57404 669861 710209 747127 778892 803877 820120 825827 820198 803471 776472 740549 697643 649805
57392 649805 598653 545563 492079 439611 388851 339990 293400 249663 209038 171390 136612
57381 136612 104691 75394 48311 23206 53 -21206 -40650 -58234 -74093 -88753 -102696 -115870
57369 -115870 -127982 -139082 -149426 -159016 -167809 -176235 -184875 -193668 -202014 -209641 -216813 -223687 -230023
$$ packed form
57452G74746m9234n0243n0045m8507m6210m3770m1175l8238l5124l2005k8710
57441C11485k5225k2010j9382j7040j4568j2065r860p974o269m722l266j690K8
57428A67442J613K950M271N704P052Q260R611J1229J2822J4203J5673J7538J9675
57415B98043K1865K4250K7106L0335L3455L5938L7582L8687L9836M1113M1651
57404F69861M0348L6918L1765K4985J6243N707n629j6727k6999l5923m2906m7838
57392F49805n1152n3090n3484n2468n0760m8861m6590m3737m0625l7648l4778
57381A36612l1921k9297k7083B3206E3b1206j9444j7584j5859j4660j3943j3174
57369a15870j2112j1100j0344r590q793q426q640q793q346p627p172o874o336
$$ plain form
57356 -230023 -235682 -240902 -245933 -250762 -255316 -259586 -263469 -266857 -269915 -272933 -275906 -278628 -281228 -284156
57342 -284156 -287531 -290921 -293868 -296322 -298472 -300461 -302367 -304175 -305718 -306945 -308230 -310094 -312587 -315267
57328 -315267 -317797 -320175 -322408 -324354 -325982 -327442 -328795 -329989 -331154 -332634 -334639 -337149 -340131 -343554
57314 -343554 -347197 -350788 -354364 -358217 -362499 -367146 -372063 -377000 -381381 -384754 -387390 -389979 -392757 -395372
57300 -395372 -397578 -399496 -401162 -402409 -403343 -404379 -405656 -406885 -407915 -408972 -410166 -411312 -412425 -413872
57286 -413872 -415752 -417638 -419217 -420731 -422497 -424419 -426293 -428213 -430334 -432587 -434871 -437201 -439411 -441140
57272 -441140 -442346 -443426 -444600 -445631 -446464 -447592 -449321 -451155 -452416 -453126 -453706 -454146 -454041 -453242 -451912 -450019
57256 -450019 -447330 -443845 -439832 -435474 -430870 -426298 -422093 -418338 -414968 -412058 -409628 -407297 -404490 -400998
$$ packed form
57356b30023n659n220n031m829m554m270l883l388l058l018k973k722k600k928
57342b84156l375l390k947k454k150j989j906j808j543j227j285j864k493k680
57328c15267k530k378k233j946j628j460j353j194j165j480k005k510k982l423
57314c43554l643l591l576l853m282m647m917m937m381l373k636k589k778k615
57300c95372k206j918j666j247r34j036j277j229j030j057j194j146j113j447
57286d13872j880j886j579j514j766j922j874j920k121k253k284k330k210j729
57272d41140j206j080j174j031q33j128j729j834j261p10n80m40J05P99J330J893
57256d50019K689L485M013M358M604M572M205L755L370K910K430K331K807L492
$$ plain form
57242 -400998 -397022 -392770 -388316 -383703 -378853 -373482 -367492 -361285 -355327 -349466 -343117 -335992 -328176 -319541
57228 -319541 -309653 -298332 -285818 -272225 -257302 -240981 -223774 -206357 -189020 -171798 -154930 -138927
57216 -138927 -124355 -111797 -101958 -95547 -92976 -94234 -99030 -107058 -118115 -132010 -148368 -166615 -186212
57203 -186212 -206732 -227639 -248162 -267663 -285988 -303249 -319332 -333876 -346643 -357573 -366531 -373327
57191 -373327 -378025 -380937 -382278 -382130 -380803 -378872 -376775 -374673 -372818 -371786 -372125 -374032 -377537 -382819 -390145
57176 -390145 -399608 -411038 -424029 -437984 -452265 -466384 -479902 -492215 -502788 -511718 -519679 -527100
57164 -527100 -533643 -538735 -542301 -544628 -545720 -545242 -543076 -539560 -535080 -529696 -523327 -516185 -508840 -501836
57150 -501836 -495292 -488971 -482729 -476769 -471375 -466630 -462631 -459822 -458718 -459327 -461304 -464732 -470266 -478263
$$ packed form
57242d00998L976M252M454M613M850N371N990O207N958N861O349P125P816Q635
57228c19541R888J1321J2514J3593J4923J6321J7207J7417J7337J7222J6868J6003
57216a38927J4572J2558R839O411K571j258m796q028j1057j3895j6358j8247j9597
57203a86212k0520k0907k0523j9501j8325j7261j6083j4544j2767j0930q958o796
57191c73327m698k912j341J48J327J931K097K102J855J032l39j907l505n282p326
57176c90145r463j1430j2991j3955j4281j4119j3518j2313j0573q930p961p421
57164e27100o543n092l566k327j092M78K166L516M480N384O369P142P345P004
57150e01836O544O321O242N960N394M745L999K809J104o09j977l428n534p997
$$ plain form
57136 -478263 -488230 -499467 -511849 -525636 -540828 -557198 -574721 -593477 -613190 -633292 -653386 -673379
57124 -673379 -693279 -713206 -733502 -754523 -776356 -798987 -822638 -847642 -874166 -902326 -932366
57113 -932366 -964390 -998161 -1033570 -1071176 -1111823 -1155885 -1203218 -1253625 -1306852 -1362425 -1420091
57102 -1420091 -1480326 -1543795 -1610383 -1679407 -1750707 -1824835 -1902089 -1982062 -2064284 -2148692 -2235288
57091 -2235288 -2323926 -2414728 -2508316 -2605491 -2707077 -2814071 -2927465 -3047929 -3176106 -3313147
57081 -3313147 -3460323 -3618226 -3787010 -3967294 -4160082 -4365828 -4584515 -4816739 -5063902
57072 -5063902 -5327370 -5608441 -5909216 -6232390 -6579901 -6952816 -7352774 -7782469 -8244531
57063 -8244531 -8741242 -9275870 -9853215 -10478518 -11157133 -11895787 -12702851 -13586817 -14555767
$$ packed form
57136d78263r967j1237j2382j3787j5192j6370j7523j8756j9713k0102k0094j9993
57124f73379j9900j9927k0296k1021k1833k2631k3651k5004k6524k8160l0040
57113i32366l2024l3771l5409l7606m0647m4062m7333n0407n3227n5573n7666
57102a420091o0235o3469o6588o9024p1300p4128p7254p9973q2222q4408q6596
57091b235288q8638r0802r3588r7175j01586j06994j13394j20464j28177j37041
57081c313147j47176j57903j68784j80284j92788k05746k18687k32224k47163
57072e063902k63468k81071l00775l23174l47511l72915l99958m29695m62062
57063h244531m96711n34628n77345o25303o78615p38654q07064q83966r68950
$$ plain form
57054 -14555767 -15618967 -16787701 -18074178 -19491500 -21055828 -22787416 -24709076 -26845713
57046 -26845713 -29226632 -31886919 -34866069 -38208189 -41966254 -46206113 -51007307 -56464711
57038 -56464711 -62693300 -69830454 -78031931 -87466482 -98312937 -110754096 -124963988 -141097337
57030 -141097337 -159288311 -179647816 -202242944 -227060213 -253973675 -282741411 -313039342
57023 -313039342 -344505703 -376722302 -409065682 -440481049 -469380609 -493852420 -512132570
57016 -512132570 -523059910 -526252093 -521984677 -510952594 -494077667 -472395339 -446980115
57009 -446980115 -418882857 -389080110 -358440506 -327712191 -297530272 -268427451 -240827032
57002 -240827032 -215023662 -191181505 -169363680 -149571826 -131769826 -115890827 -101840683
$$ packed form
57054a4555767j063200j168734j286477j417322j564328j731588j921660k136637
57046b6845713k380919k660287k979150l342120l758065m239859m801194n457404
57038e6464711o228589p137154q201477r434551j0846455j2441159j4209892j6133349
57030a41097337j8190974k0359505k2595128k4817269k6913462k8767736l0297931
57023c13039342l1466361l2216599l2343380l1415367k8899560k4471811j8280150
57016e12132570j0927340l192183M267416J1032083J6874927K1682328K5415224
57009d46980115K8097258K9802747L0639604L0728315L0181919K9102821K7600419
57002b40827032K5803370K3842157K1817825J9791854J7802000J5878999J4050144
$$ plain form
56995 -101840683 -89502077 -78736922 -69390427 -61300817 -54310131 -48270060 -43044925 -38515632
56987 -38515632 -34581519 -31156612 -28164797 -25539427 -23224874 -21175149 -19351133 -17720174
56979 -17720174 -16256357 -14938379 -13747223 -12666703 -11684461 -10790181 -9973505 -9225094 -8538474
56970 -8538474 -7908949 -7331430 -6800878 -6313827 -5867603 -5458580 -5082759 -4737417 -4420600
56961 -4420600 -4129578 -3861272 -3613719 -3385686 -3175261 -2980142 -2798936 -2630983 -2475346
56952 -2475346 -2331133 -2198371 -2077391 -1967758 -1868816 -1780723 -1703794 -1637309 -1580042 -1531527
56942 -1531527 -1491857 -1460853 -1438544 -1425886 -1423768 -1431493 -1446836 -1466717 -1486877 -1502090 -1508604 -1506313
56930 -1506313 -1497480 -1483800 -1465794 -1444229 -1420353 -1394820 -1367745 -1339690 -1311352 -1282454 -1252197
$$ packed form
56995a01840683J2338606J0765155R346495Q089610O990686O040071N225135M529293
56987c8515632L934113L424907K991815K625370K314553K049725J824016J630959
56979a7720174J463817J317978J191156J080520R82242Q94280Q16676P48411O86620
56970h538474O29525N77519N30552M87051M46224M09023L75821L45342L16817
56961d420600K91022K68306K47553K28033K10425J95119J81206J67953J55637
56952b475346J44213J32762J20980J09633R8942Q8093P6929O6485N7267M8515
56942a531527L9670L1004K2309J2658K118p725j5343j9881k0160j5213o514K291
56930a506313Q833J3680J8006K1565K3876K5533K7075K8055K8338K8898L0257
$$ plain form
56919 -1252197 -1220696 -1188881 -1157123 -1125139 -1093100 -1061665 -1031034 -1001063 -972225 -945314 -920228
56908 -920228 -896090 -872473 -849525 -827046 -804549 -782180 -760471 -739225 -717687 -695734 -673840
56897 -673840 -651939 -629433 -606322 -583231 -560331 -537336 -514568 -492865 -472347 -452362 -432794
56886 -432794 -414298 -397093 -380629 -364700 -349819 -336187 -323245 -310526 -298000 -285372 -272047
56875 -272047 -258154 -244625 -231848 -219056 -205463 -191211 -176850 -162759 -149497 -137978 -128721 -121433
56863 -121433 -115644 -111225 -108062 -105792 -104116 -102876 -101716 -100296 -98895 -98117 -97890 -97483 -96556 -95432 -94217
56848 -94217 -92554 -90467 -88545 -86913 -84813 -81591 -77394 -72566 -67076 -60904 -54273 -47126 -38992 -29724
56834 -29724 -19751 -9265 2170 14892 28542 42616 56950 71428 85795 100022 114160 127469
$$ packed form
56919a252197L1501L1815L1758L1984L2039L1435L0631K9971K8838K6911K5086
56908i20228K4138K3617K2948K2479K2497K2369K1709K1246K1538K1953K1894
56897f73840K1901K2506K3111K3091K2900K2995K2768K1703K0518J9985J9568
56886d32794J8496J7205J6464J5929J4881J3632J2942J2719J2526J2628J3325
56875b72047J3893J3529J2777J2792J3593J4252J4361J4091J3262J1519R257P288
56863a21433N789M419L163K270J676J240J160J420J401P78K27M07R27J124J215
56848i4217J663K087J922J632K100L222M197M828N490O172O631P147Q134R268
56834b9724R973i265B170J2722J3650J4074J4334J4478J4367J4227J4138J3309
$$ plain form
56822 127469 138371 145726 149604 150564 148907 145079 140104 134939 129840 124791 120098 116120 112853 110238
56808 110238 108500 107858 108281 109824 112737 116976 122056 127755 134502 142757 152385 162814 173214 182274
56794 182274 188489 191264 191353 189899 187493 184454 181422 179119 177852 177619 178370 179857 181676 183821 186842
56779 186842 191187 196819 203696 212083 222083 233321 245537 258906 273238 287117 298309 304921
56767 304921 306125 302252 294584 284752 273987 263015 252511 243118 234948 227704 221463 216724 213537
56754 213537 211329 209915 209925 211836 215266 219728 225416 232717 241388 250671 259633 266884 270600 269651 264514
56739 264514 256702 247574 238004 228617 219749 211412 203655 196724 190634 185145 180398 177004 175167 174303
56725 174303 173975 174562 176506 179557 183378 188282 194618 201783 208447 213418 215891 215392 212159 207187 201370
$$ packed form
56822A27469J0902P355L878R60j657l828m975n165n099n049m693l978l267k615
56808A10238j738o42M23J543K913M239N080N699O747Q255R628J0429J0400R060
56794A82274O215K775Q9j454k406l039l032k303j267k33P51J487J819K145L021
56779A86842M345N632O877Q387J0000J1238J2216J3369J4332J3879J1192O612
56767C04921J204l873p668r832j0765j0972j0504r393q170p244o241m739l187
56754B13537k208j414J0J911L430M462N688P301Q671R283Q962P251L716r49n137
56739B64514p812r128r570r387q868q337p757o931o090n489m747l394j837q64
56725A74303l28N87J944L051L821M904O336P165O664M971K473m99l233m972n817
$$ plain form
56710 201370 194927 188068 181574 176088 171343 166831 162758 159602 157180 154918 152743 150941 149402 147750
56696 147750 146024 144581 143537 142877 142819 143434 144169 144398 144199 144015 143864 143580 143487 144062 145078 145861 146267 146716
56678 146716 147393 148105 148844 149805 150874 151675 152131 152410 152389 151740 150503 149117 147916 147015 146548 146509 146470 145966
56660 145966 145061 144155 143349 142480 141570 140803 140188 139715 139660 140267 141295 142248 142865 143054 142688 141964 141574 141953 142635
56641 142635 142881 142671 142520 142676 143108 143941 145211 146456 147214 147687 148298 148874 148974 148768 148827 149301 150019 151144
56623 151144 152928 155036 156930 158753 160975 163301 164862 165465 165782 166256 166636 166697 166612 166497 166260 165984 165793
56606 165793 165355 164225 162706 161621 161176 160773 160031 159209 158494 157668 156705 156046 155976 156279 156708 157227 157663 157656 157171
56587 157171 156538 155815 154625 152784 150629 148583 146748 145015 143163 140864 138040 135189 132914 131163 129452
$$ packed form
56710B01370o443o859o494n486m745m512m073l156k422k262k175j802j539j652
56696A47750j726j443j044o60n8O15P35K29j99j84j51k84r3N75J016P83M06M49
56678A46716O77P12P39R61J069Q01M56K79k1o49j237j386j201r01m67l9l9n04
56660A45966r05r06q06q69r10p67o15m73n5O07J028R53O17J89l66p24l90L79O82
56641A42635K46k10j51J56M32Q33J270J245P58M73O11N76J00k06N9M74P18J125
56623A51144J784K108J894J823K222K326J561O03L17M74L80O1q5j15k37k76j91
56606A65793m38j130j519j085m45m03p42q22p15q26r63o59p0L03M29N19M36pm85
56587A57171o33p23j190j841k155k046j835j733j852k299k824k851k275j751j711
$$ plain form
56572 129452 127725 126375 125485 124675 123754 122910 122239 121654 121279 121361 121724 121903 121847 121923 122243 122578 122958 123709 124813
56553 124813 125795 126340 126518 126424 126103 125819 125872 126200 126662 127513 128970 130521 131410 131679 131946 132306 132329 132109 132375
56534 132375 133445 134841 136034 136799 136894 136267 135626 135906 137048 138120 138678 139122 139659 139992 140178 140747 141676
56517 141676 142239 142213 142237 142624 142828 142533 142311 142661 143269 143782 144529 145818 147261 148359 149197 150052 150915 151823
56499 151823 153106 154864 156739 158529 160439 162457 164143 165374 166569 167894 168931 169518 170099 170879 171418
56484 171418 171480 171504 171736 171671 170919 169887 169039 168207 167172 166308 165995 165972 165811 165540 165315 165003 164543 164174 163892
56465 163892 163303 162379 161694 161487 161208 160460 159678 159332 159164 158740 158108 157379 156361 155147 154408 154487 154884 155118
56447 155118 155431 156002 156260 155685 154643 153719 152856 151827 150929 150476 150140 149556 149000 148791 148564 147872 147020 146587
$$ packed form
56572A29452j727j350q90q10r21q44o71n85l75Q2L63J79n6P6L20L35L80P51J104
56553A24813R82N45J78r4l21k84N3L28M62Q51J457J551Q89K69K67L60K3k20K66
56534A32375J070J396J193P65R5o27o41K80J142J072N58M44N37L33J86N69R29
56517A41676N63k6K4L87K04k95k22L50O08N13P47J289J443J098Q38Q55Q63R08
56499A51823J283J758J875J790J910K018J686J231J195J325J037N87N81P80N39
56484A71418O2K4K32o5p52j032q48q32j035q64l13k3j61k71k25l12m60l69k82
56465A63892n89r24o85k07k79p48p82l46j68m24o32p29j018j214p39P9L97K34
56447A55118L13N71K58n75j042r24q63j029q98m53l36n84n56k09k27o92q52m33
$$ plain form
56429 146587 146593 146774 147217 148044 148969 149786 150791 152128 153279 153874 154379 155272 156145 156399 156260 156313 156542 156673 156960
56410 156960 157777 158787 159372 159558 159794 160154 160457 160792 161228 161403 161125 160977 161609 162781 163796 164499 165160 165768
56392 165768 166139 166377 166586 166537 166197 166109 166613 167201 167324 167287 167625 168156 168443 168667 169209 169879 170337 170800 171458 171752
56372 171752 171097 169886 168861 167993 166889 165777 165085 164449 163230 161689 160638 160118 159401 158153 156714 155462
56356 155462 154617 154396 154577 154295 153026 151389 150201 149242 147876 146342 145371 144981 144704 144624 145090 145752 146007
56339 146007 146136 146906 148260 149454 150247 150899 151297 151190 151041 151539 152460 153136 153747 154918 156278 156769 156340
56322 156340 156046 156410 156930 157328 158073 159452 161158 162993 165016 166908 168109 168735 169496 170649 171861 173044
56306 173044 174378 175564 176044 175999 176147 176607 176890 176975 177363 178055 178579 179056 180159 181896 183441 184367 185086 185908
$$ packed form
56429A46587OJ81M43Q27R25Q17J005J337J151N95N05Q93Q73K54j39N3K29J31K87
56410A56960Q17J010N85J86K36L60L03L35M36J75k78j48O32J172J015P03O61O08
56392A65768L71K38K09m9l40q8N04N88J23l7L38N31K87K24N42O70M58M63O58K94
56372A71752o55j211j025q68j104j112o92o36j219j541j051n20p17j248j439j252
56356A55462q45k21J81k82j269j637j188r59j366j534r71l90k77q0M66O62K55
56339A46007J29P70J354J194P93O52L98j07j49M98R21O76O11J171J360M91m29
56322A56340k94L64N20L98P45J379J706J835K023J892J201O26P61J153J212J183
56306A73044J334J186M80m5J48M60K83Q5L88O92N24M77J103J737J545R26P19Q22
$$ plain form
56288 185908 186614 187142 187795 188608 189299 189928 190838 191868 192512 192833 193413 194417 195537 196783 198477 200535 202627
56271 202627 204902 207624 210319 212314 213950 216175 219050 221840 224443 227502 231070 234431 237368 240428
56257 240428 243752 246783 249309 251795 254495 257197 259870 262598 264917 266279 267136 268449 270184 271462
56243 271462 272118 272857 273891 274730 275365 276433 278071 279847 281807 284349 287128 289512 292060 296019 301242
56228 301242 306229 310438 314957 320579 326866 333539 341166 349877 358878 367858 377550 388319 399566 411076
56214 411076 423614 437623 452621 468494 486082 505863 527320 550185 575064 602264 631264
56203 631264 661981 695332 731947 771559 814197 860665 911181 964805 1020883 1079820 1141735
56192 1141735 1205586 1270333 1335738 1401241 1465157 1525751 1582064 1633094 1677256 1713357 1741147
$$ packed form
56288A85908P06N28O53Q13O91O29R10J030O44L21N80J004J120J246J694K058K092
56271B02627K275K722K695J995J636K225K875K790K603L059L568L361K937L060
56257B40428L324L031K526K486K700K702K673K728K319J362Q57J313J735J278
56243B71462O56P39J034Q39O35J068J638J776J960K542K779K384K548L959N223
56228C01242M987M209M519N622O287O673P627Q711R001Q980R692J0769J1247J1510
56214D11076J2538J4009J4998J5873J7588J9781K1457K2865K4879K7200K9000
56203F31264L0717L3351L6615L9612M2638M6468N0516N3624N6078N8937O1915
56192A141735O3851O4747O5405O5503O3916O0594N6313N1030M4162L6101K7790
$$ plain form
56181 1741147 1760453 1770845 1772602 1766860 1754350 1735234 1710538 1682318 1651874 1619163 1584423 1548831
56169 1548831 1512891 1475779 1437065 1397618 1358026 1317607 1275869 1233446 1190717 1146994 1102099
56158 1102099 1057329 1013779 971009 928393 886528 846247 807493 770179 734967 702198 671216
56147 671216 641671 614320 589633 566852 545366 525700 508202 492049 476610 462546 450480
56136 450480 439789 429693 420394 412173 404594 397516 391634 387113 383001 378839 375448 373210 371121 368578
56122 368578 366563 365870 365711 365316 365400 366738 368687 370485 372625 375631 378801 381484 384310 387847 391371
56107 391371 394265 397275 401075 404956 408227 411489 415182 418309 420061 421360 423355 425720 427794 430019
56093 430019 432831 435591 438051 441400 446443 452228 457955 464655 473413 483552 494244 506354 520953
$$ packed form
56181A741147J9306J0392J757n742j2510j9116k4696k8220l0444l2711l4740l5592
56169A548831l5940l7112l8714l9447l9592m0419m1738m2423m2729m3723m4895
56158A102099m4770m3550m2770m2616m1865m0281l8754l7314l5212l2769l0982
56147F71216k9545k7351k4687k2781k1486j9666j7498j6153j5439j4064j2066
56136D50480j0691j0096r299q221p579p078n882m521m112m162l391k238k089k543
56122C68578k015o93j59l95Q4J338J949J798K140L006L170K683K826L537L524
56107C91371K894L010L800L881L271L262L693L127J752J299J995K365K074K225
56093D30019K812K760K460L349N043N785N727O700Q758J0139J0692J2110J4599
$$ plain form
56080 520953 537574 555723 576586 601365 629421 659853 693421 730922 771107 812089 853322
56069 853322 894307 932965 967498 998546 1027513 1054127 1077577 1098441 1117240 1132464 1142208 1146554
56057 1146554 1146413 1141623 1132318 1120509 1107894 1093441 1075410 1054175 1030731 1004116 973094 939061
56045 939061 904631 870591 836802 804692 776038 750441 726596 704952 686521 670312 654651
56034 654651 639867 627014 615201 602957 591060 581203 572984 564956 557501 551859 547454 543002 539092
56021 539092 536912 535650 533971 532734 533345 534790 535348 535790 537769 540477 542201 543766 546983 551047 553986
56006 553986 556432 560336 565160 569024 572489 577507 583688 589321 594990 602450 611004 618801 626556 636114
55992 636114 646549 655710 664441 675070 686893 697480 707322 718687 730951 741683 751469 762960
$$ packed form
56080E20953J6621J8149K0863K4779K8056L0432L3568L7501M0185M0982M1233
56069H53322M0985L8658L4533L1048K8967K6614K3450K0864J8799J5224R744M346
56057A146554j41m790r305j1809j2615j4453j8031k1235k3444k6615l1022l4033
56045I39061l4430l4040l3789l2110k8654k5597k3845k1644j8431j6209j5661
56034F54651j4784j2853j1813j2244j1897r857q219q028p455n642m405m452l910
56021E39092k180j262j679j237O11J445N58M42J979K708J724J565L217M064K939
56006E53986K446L904M824L864L465N018O181N633N669P460Q554P797P755R558
55992F36114J0435R161Q731J0629J1823J0587R842J1365J2264J0732R786J1491
$$ plain form
55980 762960 775971 788297 800573 815428 832410 848724 864479 882300 902247 922046 941891
55969 941891 964050 988141 1011752 1035276 1061113 1088765 1115830 1143213 1173993 1207789 1241709
55958 1241709 1276099 1313685 1353817 1393529 1433628 1477565 1524896 1572236 1620123 1672341 1728994
55947 1728994 1787021 1847114 1913034 1984371 2057236 2131907 2212393 2298636 2386858 2477548 2575244
55936 2575244 2680453 2789904 2904819 3030520 3167762 3312946 3466696 3633157 3810902
55927 3810902 3994161 4183200 4383688 4596006 4815787 5045025 5291287 5555568 5832800
55918 5832800 6124908 6440922 6783583 7149026 7540482 7968215 8434949 8936234 9476242
55909 9476242 10067116 10711416 11402941 12147252 12963546 13865161 14859393 15969361 17233569
$$ packed form
55980G62960J3011J2326J2276J4855J6982J6314J5755J7821J9947J9799J9845
55969I41891K2159K4091K3611K3524K5837K7652K7065K7383L0780L3796L3920
55958A241709L4390L7586M0132L9712M0099M3937M7331M7340M7887N2218N6653
55947A728994N8027O0093O5920P1337P2865P4671Q0486Q6243Q8222R0690R7696
55936B575244J05209J09451J14915J25701J37242J45184J53750J66461J77745
55927C810902J83259J89039K00488K12318K19781K29238K46262K64281K77232
55918E832800K92108L16014L42661L65443L91456M27733M66734N01285N40008
55909I476242N90874O44300O91525P44311Q16294R01615R94232J109968J264208
$$ plain form
55900 17233569 18680487 20327711 22209077 24374587 26860110 29690395 32918994 36630699
55892 36630699 40901084 45798750 51432391 57937288 65409688 73934217 83656321 94581714
55884 94581714 106041842 116389101 123523341 125997505 123733357 117774025 109497003 100057056
55876 100057056 90289558 80782399 71897862 63800581 56544355 50136595 44537793 39663524
55868 39663524 35422608 31737966 28529884 25713232 23224822 21031491 19103773 17402685
55860 17402685 15897349 14572461 13409311 12377434 11451952 10622506 9878854 9203497 8584753
55851 8584753 8022319 7513424 7046374 6612990 6214586 5850096 5510151 5188424 4887988
55842 4887988 4611241 4353600 4111886 3889202 3686678 3499170 3323399 3161844 3014657
$$ packed form
55900A7233569J446918J647224J881366K165510K485523K830285L228599L711705
55892C6630699M270385M897666N633641O504897P472400Q524529R722104J0925393
55884I4581714J1460128J0347259P134240K474164k264148n959332q277022r439947
55876A00057056r767498r507159q884537q097281p256226o407760n598802m874269
55868C9663524m240916l684642l208082k816652k488410k193331j927718j701088
55860A7402685j505336j324888j163150j031877r25482q29446p43652o75357o18744
55851H584753n62434n08895m67050m33384l98404l64490l39945l21727l00436
55842D887988k76747k57641k41714k22684k02524j87508j75771j61555j47187
$$ plain form
55833 3014657 2876029 2742379 2616226 2498466 2384727 2273021 2167338 2069995 1977649 1888353
55823 1888353 1805355 1730274 1659403 1590382 1525947 1467501 1411335 1354896 1300755 1250841 1202556
55812 1202556 1154099 1108049 1066121 1025676 984869 946219 911668 878884 845684 813524 783594
55801 783594 754007 723897 695950 671935 649920 628576 609962 595306 582262 569105 557455
55790 557455 548136 538413 526235 513372 501624 489721 476621 464106 453371 442653 430906 420264
55778 420264 412222 404862 396486 388499 382038 375193 366413 357465 350269 343791 336672 329915 324326 318269
55764 318269 310635 303218 297556 292187 285552 278878 273585 268497 262254 255995 251123 246779 242031 238145
55750 238145 236236 234919 232745 230775 230407 230807 230775 231058 232498 233949 234208 234049 234287 233876 231966 229716
$$ packed form
55833C014657j38628j33650j26153j17760j13739j11706j05683r7343r2346q9296
55823A888353q2998p5081p0871o9021o4435n8446n6166n6439n4141m9914m8285
55812A202556m8457m6050m1928m0445m0807l8650l4551l2784l3200l2160k9930
55801G83594k9587l0110k7947k4015k2015k1344j8614j4656j3044j3157j1650
55790E57455r319r723j2178j2863j1748j1903j3100j2515j0735j0718j1747j0642
55778D20264q042p360q376p987o461o845q780q948p196o478p119o757n589o057
55764C18269p634p417n662n369o635o674n293n088o243o259m872m344m748l886
55750B38145j909j317k174j970l68M00l2K83J440J451K59j59K38m11j910k250
$$ plain form
55734 229716 227984 225389 220776 215516 211221 207205 202371 197553 193782 190226 186058 182431 180377 178644
55720 178644 175872 173085 171801 171438 170766 170194 170311 169887 167646 164508 161902 159308 155639 151543 148149
55705 148149 144940 140980 136934 133794 130943 127462 124038 121604 119434 116550 113647 111693 109913 107159
55691 107159 103958 101278 98642 95430 92655 91405 90753 89291 87515 86653 86317 85404 84259 83868 83892 83448
55675 83448 82911 83043 83318 82918 82453 82872 83703 84086 84482 85497 86198 85519 84291 83911 83969 83179 81714 80616
55657 80616 79772 78462 77123 76633 76559 75963 75202 75166 75509 75463 75572 76785 78600 79963 81219 83279 85638
55640 85638 87126 87952 89105 90408 91089 91632 93069 94966 96039 96318 96845 97682 98090 98280 99116 100395 101181
55623 101181 101522 102174 102946 103039 102700 102864 103477 103754 103775 104262 105094 105611 106040 107053 108312 109001 109417 110409 111658
$$ packed form
55734B29716j732k595m613n260m295m016m834m818l771l556m168l627k054j733
55720A78644k772k787j284l63o72n72J17m24k241l138k606k594l669m096l394
55705A48149l209l960m046l140k851l481l424k434k170k884k903j954j780k754
55691A07159l201k680k636l212k775j250o52j462j776q62l36r13j145l91K4m44
55675H3448n37J32K75m00m65M19Q31L83L96J015P01o79j228l80N8p90j465j098
55657H0616q44j310j339m90p4n96p61l6L43m6J09J213J815J363J256K060K359
55640H5638J488Q26J153J303O81N43J437J897J073K79N27Q37M08J90Q36J279P86
55623A01181L41O52P72R3l39J64O13K77K1M87Q32N17M29J013J259O89M16R92J249
$$ plain form
55604 111658 112145 112009 112259 112947 113244 113124 113334 113886 114110 114036 114244 114538 114249 113604 113385 113467 113114 112419 111981
55585 111981 111459 109969 107635 105270 102782 99454 95565 92179 89473 86730 83795 81121 78581 75745
55571 75745 73079 71422 70462 69173 67515 66215 65184 63725 62022 60803 59734 57863 55499 53943 53389
55556 53389 52824 51946 51480 51467 50993 49855 48947 48676 48462 48033 47807 47783 47390 46651 46205 46048 45548 44763 44395
55537 44395 44377 43921 43049 42650 42886 42978 42763 42980 43752 44170 43761 43111 42730 42492 42420 42822 43437 43575 43305 43383
55517 43383 43946 44418 44682 45086 45341 44829 44014 44039 44813 45063 44459 44102 44562 45055 45079 45291 46191 47250 48010
55498 48010 48789 49711 50202 50050 49838 49835 49529 48712 47978 47657 47340 46858 46697 46994 47194 47096 47213 47733 48193 48502
55478 48502 49180 50228 50924 51106 51506 52384 53031 53100 53257 54019 55027 55967 57087 58251 58643 58015 57190 56752
$$ packed form
55604A11658M87j36K50O88K97j20K10N52K24p4K08K94k89o45k19Q2l53o95m38
55585A11981n22j490k334k365k488l328l889l386k706k743k935k674k540k836
55571G5745k666j657r60j289j658j300j031j459j703j219j069j871k364j556n54
55556E3389n65q78m66j3m74j138r08k71k14m29k26k4l93p39m46j57n00p85l68
55537D4395j8m56q72l99K36R2k15K17P72M18m09o50l81k38p2M02O15J38k70P8
55517D3383N63M72K64M04K55n12q15K5P74K50o04l57M60M93K4K12R00J059P60
55498D8010P79R22M91j52k12ll06q17p34l21l17m82j61K97K00r8J17N20M60L09
55478D8502O78J048O96J82M00Q78O47O9J57P62J008R40J120J164L92o28q25m38
$$ plain form
55460 56752 56285 55409 54486 53705 52556 50876 49356 48345 47183 45414 43654 42499 41539 40246 38991 38337
55444 38337 38075 37743 37393 37146 36673 35785 34963 34665 34656 34527 34251 33793 32876 31621 30736 30571 30617 30387 30094 30026
55424 30026 29936 29542 28960 28270 27330 26366 25994 26273 26487 26256 26033 26149 26252 26105 26087 26393 26604 26508 26490 26660
55404 26660 26499 25891 25514 25648 25563 24742 23770 23281 22978 22468 22192 22620 23258 23377 23114 23017 23081 23056 23188 23811
55384 23811 24604 24977 24862 24519 24043 23564 23479 23926 24440 24617 24637 24718 24645 24300 24067 24188 24339 24326 24565 25376 26422
55363 26422 27359 28368 29508 30264 30340 30219 30316 30258 29708 29180 29308 29857 30187 30132 29755 28809 27233 25709 24985
55344 24985 25024 25402 26059 27017 27903 28411 28768 29129 29062 28297 27427 27130 27192 27045 26790 26886 27205 27242 26987 26856 26965
55323 26965 27111 27247 27401 27362 26930 26239 25412 24334 23132 22412 22480 22815 22841 22747 22994 23526 24064 24667 25361 25731
$$ packed form
55460E6752m67q76r23p81j149j680j520j011j162j769j760j155r60j293j255o54
55444C8337k62l32l50k47m73q88q22k98rj29k76m58r17j255q85j65M6k30k93o8
55424C0026r0l94n82o90r40r64l72K79K14k31k23J16J03j47j8L06K11r6j8J70
55404B6660j61o08l77J34q5q21r72m89l03n10k76M28O38J19k63r7O4k5J32O23
55384B3811P93L73j15l43m76m79q5M47N14J77K0Q1p3l45k33J21J51j3K39Q11J046
55363B6422R37J009J140P56P6j21R7n8n50n28J28N49L30n5l77r46j576j524p24
55344B4985L9L78O57R58Q86N08L57L61o7p65q70k97O2j47k55R6L19L7k55j31J09
55323B6965J46J36J54l9m32o91q27j078j202p20O8L35K6r4K47N32N38O03O94L70
$$ plain form
55303 25731 25533 25291 25597 26280 26898 27572 28569 29463 29536 28760 27684 26605 25470 24395 23641 23231 23074 23204
55285 23204 23512 23604 23345 23137 23221 23260 23027 22947 23311 23626 23427 23123 23276 23596 23513 23292 23665 24662 25659 26300 26582
55264 26582 26325 25433 24407 23857 23675 23360 22914 22684 22607 22360 22019 21812 21504 20808 20221 20592 21944 23396
55246 23396 24217 24336 23973 23425 23110 23238 23529 23664 23777 24022 24072 23671 23277 23445 23936 24160 24134 24221 24290 24030
55226 24030 23795 24182 24928 25203 24901 24727 24991 25248 25169 24975 24848 24669 24471 24524 24835 25109 25231 25315 25308 25082 24780
55205 24780 24558 24152 23343 22601 22566 23014 23152 22849 22757 23181 23650 23735 23598 23535 23588 23766 24106 24421 24472 24454 24812
55184 24812 25562 26256 26619 26760 26768 26613 26395 26235 26013 25670 25577 26030 26563 26453 25789 25341 25395 25471 25249 25057 25261
55163 25261 25783 26373 26884 27164 27131 27001 27037 27146 27139 27269 27922 28873 29482 29621 29788 30272 30763 30861 30460 29629 28580
$$ packed form
55303B5731j98k42L06O83O18O74R97Q94P3p76j076j079j135j075p54m10j57J30
55285B3204L08R2k59k08Q4L9k33q0L64L15j99l04J53L20q3k21L73R97R97O41K82
55264B6582k57q92j026n50j82l15m46k30p7k47l41k07l08o96n87L71J352J452
55246B3396Q21J19l63n48l15J28K91J35J13K45N0m01l94J68M91K24k6Q7O9k60
55226B4030k35L87P46K75l02j74K64K57p9j94j27j79j98N3L11K74J22Q4pk26l02
55205B4780k22m06q09p42l5M48J38l03r2M24M69Q5j37o3N3J78L40L15N1j8L58
55184B4812P50O94L63J41Qj55k18j60k22l43r3M53N33j10o64m48N4P6k22j92K04
55163B5261N22N90N11K80l3j30L6J09pJ30O53R51O09J39J67M84M91R8m01q31j049
$$ plain form
55142 28580 27753 27473 27543 27602 27717 28109 28499 28334 27590 26704 25887 25116 24652 24800 25230 25298 25056 25140 25664 26013
55122 26013 25877 25704 25914 26378 26890 27515 28208 28646 28686 28519 28253 27834 27450 27465 27836 28112 28069 27871 27605 27253
55102 27253 27051 27269 27573 27300 26443 25690 25402 25259 25035 24978 25211 25457 25605 25926 26492 26963 27184 27379 27565
55083 27565 27388 26796 26249 26019 25867 25658 25672 25963 26044 25598 25023 24862 25131 25523 25878 26165 26360 26637 27316 28378
55063 28378 29375 29995 30353 30638 30898 31267 31950 32825 33553 34130 34823 35472 35518 34906 34292 34076 33869 33294 32686
55044 32686 32521 32649 32597 32327 32251 32702 33702 35002 36148 36741 36805 36705 36630 36502 36403 36607 37074 37359 37220 36903
55024 36903 36716 36723 36979 37533 38113 38312 38246 38479 39120 39597 39559 39440 39767 40411 40882 40941 40620 40040 39503 39371 39590
55003 39590 39677 39403 39056 38912 38866 38816 38908 39191 39448 39634 39987 40497 40756 40576 40271 40091 39854 39413 38977 38674
$$ packed form
55142B8580q27k80P0N9J15L92L90j65p44q86q17p71m64J48M30O8k42Q4N24L49
55122B6013j36j73K10M64N12O25O93M38M0j67k66m19l84J5L71K76m3j98k66l52
55102B7253k02K18L04k73q57p53k88j43k24n7K33K46J48L21N66M71K21J95J86
55083B7565j77n92n47k30j52k09J4K91Q1m46n75j61K69L92L55K87J95K77O79J062
55063B8378R97O20L58K85K60L69O83Q75P28N77O93O49M6o12o14k16k07n75o08
55044C2686j65J28n2k70p6M51J000J300J146N93O4j00p5j28r9K04M67K85j39l17
55024C6903j87PK56N54N80J99o6K33O41M77l8j19L27O44M71N9l21n80n37j32K19
55003C9590Q7k74l47j44m6n0R2K83K57J86L53N10K59j80l05j80k37m41m36l03
$$ plain form
54983 38674 38303 37809 37487 37436 37337 37099 37143 37688 38265 38382 38192 38048 37886 37542 37233 37225 37357 37373 37415 37745 38286
54962 38286 38861 39564 40469 41232 41423 41065 40516 40016 39643 39448 39341 39090 38687 38419 38377 38256 37868 37469 37291
54943 37291 37169 36962 36925 37326 38018 38741 39457 40092 40333 40045 39554 39173 38826 38446 38310 38568 38857 38850 38801 39131
54923 39131 39750 40253 40509 40674 40879 41284 42134 43370 44494 45175 45688 46385 47126 47637 48094 48842 49843 50884
54905 50884 52077 53624 55329 56782 57931 59026 60204 61513 63178 65429 68122 70890 73581 76320
54891 76320 79306 82771 86924 91693 96689 101610 106380 110783 114281 116457 117272 116729 114711 111417 107494
54876 107494 103403 99077 94492 90071 86119 82374 78536 74798 71411 68240 65214 62713 60967 59539
54862 59539 58017 56752 56286 56458 56753 57148 57868 58660 59141 59630 60819 62733 64792 66852 69450 72959
$$ packed form
54983C8674l71m94l22n1r9k38M4N45N77J17j90j44j62l44l09qJ32J6M2L30N41
54962C8286N75P03R05P63J91l58n49n00l73j95j07k51m03k68m2j21l88l99j78
54943C7291j22k07l7M01O92P23P16O35K41k88m91l81l47l80j36K58K89pm9L30
54923C9131O19N03K56J65K05M05Q50J236J124O81N13O97P41N11M57P48J001J041
54905E0884J193J547J705J453J149J095J178J309J665K251K693K768K691K739
54891G6320K986L465M153M769M996M921M770M403L498K176Q15n43k018l294l923
54876A07494m091m326m585m421l952l745l838l738l387l171l026k501j746j428
54862E9539j522j265m66J72K95L95P20P92M81M89J189J914K059K060K598L509
$$ plain form
54846 72959 77139 81633 86308 91021 95498 99537 102953 105381 106469 106235 104878 102400 98816 94548 90131
54831 90131 85665 81008 76351 72087 68260 64689 61519 59103 57372 55862 54372 53047 51878 50616
54817 50616 49260 48193 47704 47660 47659 47289 46382 45284 44685 44790 44939 44423 43403 42498 41748 40677 39203 37789
54799 37789 36698 35752 34875 34272 33982 33808 33750 34012 34482 34732 34619 34436 34368 34292 34179 34205 34337 34249 33829 33371
54779 33371 33117 32994 32947 33139 33634 34173 34473 34541 34564 34694 34993 35416 35820 36155 36577 37179 37725 37953 38001 38231
54759 38231 38709 39235 39817 40704 41961 43367 44764 46173 47557 48758 49700 50418 50929 51306 51803 52658 53867
54742 53867 55411 57518 60409 63920 67702 71620 75641 79552 83251 87144 91748 96950 102067 106502
54728 106502 109956 112163 112949 112549 111397 109651 107272 104426 101346 97957 94148 90305 87025 84349 81856
$$ packed form
54846G2959M180M494M675M713M477M039L416K428J088k34j357k478l584m268m417
54831I0131m466m657m657m264l827l571l170k416j731j510j490j325j169j262
54817E0616j356j067m89m4jl70r07j098n99J05J49n16j020r05p50j071j474j414
54799C7789j091r46q77o03k90j74n8K62M70K50j13j83o8p6j13K6J32q8m20m58
54779C3371k54j23m7J92M95N39L00O8K3J30K99M23M04L35M22O02N46K28M8K30
54759C8231M78N26N82Q87J257J406J397J409J384J201R42P18N11L77M97Q55J209
54742E3867J544K107K891L511L782L918M021L911L699L893M604N202N117M435
54728A06502L454K207P86m00j152j746k379k846l080l389l809l843l280k676k493
$$ plain form
54713 81856 79488 77635 76366 75187 73742 72333 71510 71538 72299 73371 74202 74594 75028 76140 77952 80022
54697 80022 82252 84979 88361 92293 96923 102595 109122 115722 121880 127762 133626 139278 144321 148412
54683 148412 151090 151825 150524 147682 143823 139106 133590 127529 121246 115009 109091 103654 98528 93483
54669 93483 88692 84523 80894 77353 73844 70837 68541 66520 64325 62087 60247 59044 58443 58235 58057
54654 58057 57583 56809 55904 54854 53608 52497 51999 52082 52292 52473 52832 53271 53321 52883 52446 52344 52352 52265 52291 52622
54634 52622 53114 53658 54399 55324 56103 56612 57136 57783 58173 58022 57613 57379 57419 57680 58202 58859 59289 59384 59522 60063
54614 60063 60949 62015 63234 64426 65194 65500 65916 66979 68645 70611 72708 74735 76369 77624 78992
54599 78992 80774 82705 84527 86438 88546 90404 91630 92597 93920 95598 97208 98715 100500 102727 105238
$$ packed form
54713H1856k368j853j269j179j445j409q23K8P61J072Q31L92M34J112J812K070
54697H0022K230K727L382L932M630N672O527O600O158N882N864N652N043M091
54683A48412K678P35j301k842l859m717n516o061o283o237n918n437n126n045
54669I3483m791m169l629l541l509l007k296k021k195k238j840j203o01k08j78
54654E8057m74p74r05j050j246j111m98Q3K10J81L59M39N0m38m37j02Qq7K6L31
54634E2622M92N44P41R25P79N09N24O47L90j51m09k34M0K61N22O57M30R5J38N41
54614F0063Q86J066J219J192P68L06M16J063J666J966K097K027J634J255J368
54599G8992J782J931J822J911K108J858J226R67J323J678J610J507J785K227K511
$$ plain form
54584 105238 107936 110832 113793 116704 119807 123463 127638 131936 136083 139986 143419 145986 147430 147685
54570 147685 146658 144266 140721 136507 132010 127308 122328 117080 111743 106621 101982 97877 94187 90832
54556 90832 87825 85166 82858 80993 79605 78485 77439 76699 76674 77296 78060 78737 79563 80590 81377 81598 81466
54539 81466 81237 80745 79782 78596 77585 76771 75898 74850 73632 72205 70633 69146 67817 66411 64831 63401
54523 63401 62434 61775 61089 60285 59377 58200 56675 55130 53990 53319 52944 52815 52915 53005 52747 52013 50883 49546
54505 49546 48365 47758 47759 47941 47957 47874 47805 47615 47263 47014 46969 46769 46208 45778 46116 47160 48298 49099 49465 49349
54485 49349 48866 48503 48707 49331 49915 50378 51019 51969 53102 54385 55908 57577 59192 60763 62437 64182
54469 64182 65900 67763 70053 72699 75274 77440 79074 80068 80319 79917 79086 77934 76476 74753 72747
$$ packed form
54584A05238K698K896K961K911L103L656M175M298M147L903L433K567J444K55
54570A47685j027k392l545m214m497m702m980n248n337n122m639m105l690l355
54556I0832l007k659k308j865j388j120j046p40k5O22P64O77Q26J027P87K21j32
54539H1466k29m92r63j186j011q14q73j048j218j427j572j487j329j406j580j430
54523F3401r67o59o86q04r08j177j525j545j140o71l75j29J00R0k58p34j130j337
54505D9546j181o07JJ82J6q3o9j90l52k49m5k00n61m30L38J044J138Q01L66j16
54485D9349m83l63K04O24N84M63O41R50J133J283J523J669J615J571J674J745
54469F4182J718J863K290K646K575K166J634R94K51m02q31j152j458j723k006
$$ plain form
54454 72747 70356 67708 65308 63524 62130 60655 59030 57515 56148 54738 53314 52161 51427 51011 50787
54439 50787 50641 50329 49650 48749 47959 47386 46932 46675 46833 47360 47856 47979 47788 47653 47934 48633 49239 49140 48374
54420 48374 47776 48108 49267 50584 51630 52354 52678 52469 51888 51337 51038 50948 51057 51448 52087 52800 53427 53829
54402 53829 53902 53802 53920 54349 54579 54116 53186 52419 51991 51599 51174 51049 51348 51698 51719 51445 51128 50879 50658 50437
54382 50437 50257 50218 50348 50420 50047 49151 48166 47556 47292 47075 46852 46789 46856 46829 46610 46261 45782 45198 44784 44879 45505
54361 45505 46399 47340 48211 48915 49469 50030 50546 50659 50278 49990 50410 51369 52231 52851 53638 54778 55977 57026
54343 57026 58057 59184 60341 61553 62921 64264 65227 65860 66705 68165 70114 72188 74151 75897 77431
54328 77431 78908 80427 81745 82482 82611 82388 81896 80981 79669 78230 76799 75316 73856 72648 71715 70857
$$ packed form
54454G2747k391k648k400j784j394j475j625j515j367j410j424j153p34m16k24
54439E0787j46l12o79r01p90n73m54k57J58N27M96J23j91j35K81O99O06r9p66
54420D8374n98L32J159J317J046P24L24k09n81n51k99r0J09L91O39P13O27M02
54402E3829P3j00J18M29K30m63r30p67m28l92m25j25K99L50K1k74l17k49k21k21
54382E0437j80l9J30P2l73q96r85o10k64k17k23o3O7k7k19l49m79n84m14R5O26
54361D5505Q94R41Q71P04N54N61N16J13l81k88M20R59Q62O20P87J140J199J049
54343E7026J031J127J157J212J368J343R63O33Q45J460J949K074J963J746J534
54328G7431J477J519J318P37J29k23m92r15j312j439j431j483j460j208r33q58
$$ plain form
54312 70857 70022 69312 68612 67632 66429 65379 64554 63538 62074 60513 59377 58753 58376 58050 57763 57559 57463
54295 57463 57456 57438 57310 57124 57035 57157 57583 58415 59566 60684 61569 62505 63876 65566 67151 68523 69921 71367
54277 71367 72568 73411 74098 74760 75354 75972 76830 77838 78581 78836 78744 78416 77726 76621 75250 73727 72077
54260 72077 70477 69153 68004 66690 65152 63634 62145 60375 58276 56261 54610 53105 51488 49914
54246 49914 48677 47795 47106 46528 46019 45479 44884 44301 43724 43072 42413 41902 41470 40862 40072 39385 38902 38358 37547
54227 37547 36651 35982 35644 35578 35684 35782 35655 35223 34562 33804 33227 33249 34033 35182 36175 36983 37848 38626 38946 38918
54207 38918 39054 39440 39653 39569 39616 40068 40710 41418 42420 43721 44827 45388 45593 45652 45415 44835 44309 44156 44190
54188 44190 44112 43922 43654 43178 42579 42264 42356 42453 42298 42218 42510 42922 43148 43326 43578 43541 42931 42132 41671 41434 40998
$$ packed form
54312G0857q35p10p00r80j203j050q25j016j464j561j136o24l77l26k87k04r6
54295E7463pj8j28j86q9J22M26Q32J151J118Q85R36J371J690J585J372J398J446
54277G1367J201Q43O87O62N94O18Q58J008P43K55r2l28o90j105j371j523j650
54260G2077j600j324j149j314j538j518j489j770k099k015j651j505j617j574
54246D9914j237q82o89n78n09n40n95n83n77o52o59n11m32o08p90o87m83n44q11
54227C7547q96o69l38o6J06R8j27m32o61p58n77K2P84J149R93Q08Q65P78L20k8
54207C8918J36L86K13q4M7M52O42P08J002J301J106N61K05N9k37n80n26j53L4
54188D4190p8j90k68m76n99l15R2R7j55q0K92M12K26J78K52l7o10p99m61k37m36
$$ plain form
54167 40998 40395 39967 39728 39447 39157 39024 38929 38696 38556 38813 39242 39393 39328 39508 40035 40577 40976 41395 41835 42049
54147 42049 41975 41828 41671 41299 40630 39868 39201 38670 38346 38352 38648 39022 39323 39511 39561 39539 39657 39985 40254 40195 39967
54126 39967 39912 40031 40038 39844 39619 39415 39107 38706 38398 38223 38024 37755 37578 37622 37831 38059 38158 38016 37753 37703 38002
54105 38002 38284 38109 37573 37150 37010 36904 36721 36712 37022 37351 37283 36783 36196 35880 35893 35965 35739 35135 34467 34095 34044
54084 34044 34106 34243 34650 35410 36281 36908 37114 36981 36718 36467 36218 35923 35696 35729 35975 36090 35822 35311 34878 34651
54064 34651 34555 34510 34483 34455 34479 34620 34730 34491 33835 33098 32603 32298 32040 31967 32301 32974 33757 34642 35776 37083
54044 37083 38184 38667 38329 37338 36285 35858 36193 36743 37001 37113 37488 38071 38401 38238 37738 37103 36423 35828
54026 35828 35484 35402 35465 35573 35599 35363 34889 34467 34261 34024 33520 32964 32734 32861 33171 33686 34446 35113 35298 35175
$$ packed form
54167D0998o03m28k39k81k90j33r5k33j40K57M29J51o5J80N27N42L99M19M40K14
54147D2049p4j47j57l72o69p62o67n31l24OK96L74L01J88N0k2J18L28K69n9k28
54126C9967n5J19Pj94k25k04l08m01l08j75j99k69j77M4K09K28R9j42k63n0K99
54105C8002K82j75n36m23j40j06j83rL10L29o8n00n87l16J3P2k26o04o68l72n1
54084C4044O2J37M07P60Q71O27K06j33k63k51k49k95k27L3K46J15k68n11m33k27
54064C4651r6m5k7k8K4J41J10k39o56p37m95l05k58p3L34O73P83Q85J134J307
54044C7083J101M83l38r91j053m27L35N50K58J12L75N83L30j63n00o35o80n95
54026C5828l44q2O3J08K6k36m74m22k06k37n04n56k30J27L10N15P60O67J85j23
$$ plain form
54006 35175 35293 35826 36458 36966 37442 37937 38385 38910 39753 40803 41618 42006 42213 42456 42680 42856 43149 43629 44122
53987 44122 44461 44625 44615 44500 44601 45246 46288 47231 47887 48508 49243 49944 50666 51818 53559 55457 57095 58634
53969 58634 60485 62698 65079 67631 70458 73379 75998 78164 80050 81809 83424 84911 86450 88205
53955 88205 90136 92051 93773 95228 96407 97293 97836 97995 97774 97213 96417 95633 95125 94877 94545 93861 92986
53938 92986 92236 91576 90668 89350 87784 86137 84427 82733 81254 80016 78753 77235 75549 73940 72517
53923 72517 71237 70055 68961 67942 67052 66444 66209 66217 66177 65866 65313 64734 64297 63966 63659 63509 63760 64364 64923
53904 64923 65148 65175 65252 65359 65390 65513 65992 66785 67610 68342 69044 69701 70230 70737 71399 72141 72701 73050 73437 73991
53884 73991 74590 75166 75877 76884 78166 79618 81148 82646 84045 85437 86956 88589 90273 92055 93917
$$ packed form
54006C5175J18N33O32N08M76M95M48N25Q43J050Q15L88K07K43K24J76K93M80M93
53987D4122L39J64j0j15J01O45J042R43O56O21P35P01P22J152J741J898J638J539
53969E8634J851K213K381K552K827K921K619K166J886J759J615J487J539J755
53955H8205J931J915J722J455J179Q86N43J59k21n61p96p84n08k48l32o84q75
53938I2986p50o60r08j318j566j647j710j694j479j238j263j518j686j609j423
53923G2517j280j182j094j019q90o08k35Qm0l11n53n79m37l31l07j50K51O04N59
53904F4923K25K7P7J07L1J23M79P93Q25P32P02O57N29N07O62P42N60L49L87N54
53884G3991N99N76P11J007J282J452J530J498J399J392J519J633J684J782J862
$$ plain form
53869 93917 95504 96368 96448 96059 95480 94862 94447 94492 94944 95566 96348 97423 98600 99472 100080 100975 102460 104192
53851 104192 105759 107260 109013 111031 113093 115166 117418 119948 122671 125367 127745 129604 130977 131982
53837 131982 132520 132423 131928 131627 131765 131907 131539 130711 129815 128995 128066 126886 125502 124010 122445 120749 118722
53820 118722 116175 113239 110355 107776 105301 102664 100020 97727 95784 93793 91489 89057 86864 85004
53806 85004 83233 81279 79149 77122 75476 74256 73324 72504 71633 70607 69494 68511 67725 66876 65717 64430
53790 64430 63423 62770 62147 61333 60468 59778 59290 58899 58467 57798 56787 55661 54849 54511 54410 54275 54059 53782
53772 53782 53455 53224 53335 53762 54127 54128 53887 53717 53736 53815 53807 53716 53756 54200 55036 55805 56040 55837 55712 55935 56293 56527
53750 56527 56642 56746 56916 57285 57904 58503 58789 59035 59889 61498 63309 64943 66695 68887 71215 73141 74585
$$ packed form
53869I3917J587Q64Q0l89n79o18m15M5M52O22P82J075J177Q72O08Q95J485J732
53851A04192J567J501J753K018K062K073K252K530K723K696K378J859J373J005
53837A31982N38r7m95l01J38J42l68q28q96q20r29j180j384j492j565j696k027
53820A18722k547k936k884k579k475k637k644k293j943j991k304k432k193j860
53806H5004j771j954k130k027j646j220r32q20q71j026j113r83p86q49j159j287
53790F4430j007o53o23q14q65o90m88l91m32o69j011j126q12l38j01j35k16k77
53772E3782l27k31J11M27L65Jk41j70J9P9qr1M0M44Q36P69K35k03j25K23L58K34
53750E6527J15J04J70L69O19N99K86K46Q54J609J811J634J752K192K328J926J444
$$ plain form
53733 74585 75811 76991 78268 79942 82104 84345 86251 88014 90075 92360 94287 95514 96226 96763 97329
53718 97329 98036 98863 99506 99575 98985 97996 96922 96000 95459 95387 95496 95284 94483 93254 91964 90913 90225 89796
53700 89796 89357 88666 87672 86441 85072 83752 82748 82148 81731 81253 80738 80344 80048 79704 79318 79053 78972 78949
53682 78949 78844 78667 78561 78678 79001 79287 79282 79015 78764 78742 78982 79495 80244 80896 80974 80414 79699 79255 78944 78386
53662 78386 77504 76529 75680 75090 74879 75037 75355 75661 76016 76528 77177 77952 78935 80031 80857 81125 80959 80672 80485
53643 80485 80624 81376 82729 84236 85555 86853 88356 89837 90990 92049 93520 95427 97314 98943 100517
53628 100517 102216 103966 105697 107465 109230 110796 112057 113110 114122 115303 116901 118957 121123 123002
53614 123002 124587 126086 127440 128362 128820 129097 129401 129729 130116 130612 130955 130645 129517 128025 126832 126276 126240
$$ packed form
53733G4585J226J180J277J674K162K241J906J763K061K285J927J227P12N37N66
53718I7329P07Q27O43O9n90r89j074r22n41p2J09k12q01j229j290j051o88m29
53700H9796m39o91r94j231j369j320j004o00m17m78n15l94k96l44l86k65q1k3
53682G8949j05j77j06J17L23K86nk67k51k2K40N13P49O52P8n60p15m44l11n58
53662G8386q82r75q49n90k11J58L18L06L55N12O49P75R83J096Q26K68j66k87j87
53643H0485J39P52J353J507J319J298J503J481J153J059J471J907J887J629J574
53628A00517J699J750J731J768J765J566J261J053J012J181J598K056K166J879
53614A23002J585J499J354R22M58K77L04L28L87M96L43l10j128j492j193n56l6
$$ plain form
53597 126240 126340 126156 125517 124656 123978 123664 123587 123502 123175 122413 121253 120062 119223 118751 118448 118311 118498 118921 119265
53578 119265 119402 119504 119658 119664 119358 118897 118594 118620 118951 119453 119942 120251 120364 120419 120613 121113 121967 123020 124026
53559 124026 124928 125886 126942 127901 128712 129695 131125 132814 134433 136042 137937 140130 142399 144732 147262
53544 147262 149833 152101 154079 156173 158574 161015 163192 165124 167035 169192 171875 175146 178610 181708
53530 181708 184346 186902 189631 192436 195264 198279 201489 204564 207216 209524 211740 214052 216630 219558
53516 219558 222596 225279 227404 229156 230687 231880 232650 233172 233673 234281 235193 236605 238331 239829 240813 241480
53500 241480 241994 242149 241887 241698 242081 242837 243371 243561 243868 244628 245596 246320 246664 246890 247317 247943 248379 248199 247404
53481 247404 246467 245886 245822 246193 246841 247534 248056 248503 249260 250488 251852 252997 254117 255713 257951 260555 263307
$$ packed form
53597A26240J00j84o39q61o78l14p7q5l27p62j160j191q39m72l03j37J87M23L44
53578A19265J37J02J54Ol06m61l03K6L31N02M89L09J13N5J94N00Q54J053J006
53559A24026R02R58J056R59Q11R83J430J689J619J609J895K193K269K333K530
53544A47262K571K268J978K094K401K441K177J932J911K157K683L271L464L098
53530A81708K638K556K729K805K828L015L210L075K652K308K216K312K578K928
53516B19558L038K683K125J752J531J193P70N22N01O08R12J412J726J498R84O67
53500B41480N14J55k62j89L83P56N34J90L07P60R68P24L44K26M27O26M36j80p95
53481B47404r37n81o4L71O48O93N22M47P57J228J364J145J120J596K238K604K752
$$ plain form
53464 263307 266268 269490 272816 276101 279443 283056 287039 291396 296179 301516 307437 313792 320356 327068
53450 327068 334112 341691 349755 358071 366549 375379 384768 394685 404977 415625 426771 438510 450759
53437 450759 463341 476178 489406 503282 517926 533153 548602 564013 579323 594596 610006
53426 610006 625816 642131 658629 674743 690181 705177 720125 735167 750208 765196 780200
53415 780200 795242 810201 824909 839337 853640 867960 882113 895575 907911 919173 929736
53404 929736 939781 949125 957554 965096 971894 977986 983333 987951 991923 995314 998117 1000197 1001337 1001360
53390 1001360 1000210 997837 994151 989201 983300 976788 969742 962077 953758 944702 934626 923343 911146
53377 911146 898520 885554 871994 857844 843485 829159 814774 800308 785996 771984 758219
$$ packed form
53464B63307K961L222L326L285L342L613L983M357M783N337N921O355O564O712
53450C27068P044P579Q064Q316Q478Q830R389R917J0292J0648J1146J1739J2249
53437D50759J2582J2837J3228J3876J4644J5227J5449J5411J5310J5273J5410
53426F10006J5810J6315J6498J6114J5438J4996J4948J5042J5041J4988J5004
53415G80200J5042J4959J4708J4428J4303J4320J4153J3462J2336J1262J0563
53404I29736J0045R344Q429P542O798O092N347M618L972L391K803K080J140K3
53390A001360j150k373l686m950n901o512p046p665q319r056j0076j1283j2197
53377I11146j2626j2966j3560j4150j4359j4326j4385j4466j4312j4012j3765
$$ plain form
53366 758219 744816 732138 720278 708923 697984 687923 679065 670963 662902 654776 647052 640081 633952
53353 633952 628926 625480 623830 623689 624594 626290 628812 632380 637226 643351 650510 658528 667521 677655
53339 677655 688858 700962 713977 727959 742716 757963 773756 790506 808503 827619 847521
53328 847521 868036 889277 911505 934903 959452 985072 1011880 1040136 1069851 1100606 1131887
53317 1131887 1163460 1195315 1227473 1260064 1293336 1327261 1361262 1394656 1427340 1459734 1492081
53306 1492081 1524030 1554923 1584239 1611713 1637257 1660895 1682695 1702688 1720885 1737270 1751695
53295 1751695 1763898 1773730 1781308 1786764 1789958 1790608 1788590 1783917 1776536 1766426 1753812 1738975 1721833
53282 1721833 1701960 1679073 1653338 1625202 1595198 1563912 1531843 1499185 1465914 1432187 1398417
$$ packed form
53366G58219j3403j2678j1860j1355j0939j0061q858q102q061q126p724o971o129
53353F33952n026l446j650j41R05J696K522L568M846O125P159Q018Q993J0134
53339F77655J1203J2104J3015J3982J4757J5247J5793J6750J7997J9116J9902
53328H47521K0515K1241K2228K3398K4549K5620K6808K8256K9715L0755L1281
53317A131887L1573L1855L2158L2591L3272L3925L4001L3394L2684L2394L2347
53306A492081L1949L0893K9316K7474K5544K3638K1800J9993J8197J6385J4425
53295A751695J2203R832P578N456L194O50k018m673p381j0110j2614j4837j7142
53282A721833j9873k2887k5735k8136l0004l1286l2069l2658l3271l3727l3770
$$ plain form
53271 1398417 1364858 1331353 1297707 1264195 1231475 1200034 1169846 1140542 1111797 1083539 1055896
53260 1055896 1029040 1003106 978224 954578 932385 911786 892777 875174 858653 842960 828149
53249 828149 814486 802004 790329 779158 768795 759928 752816 746995 741898 737514 734235 732209 731164
53236 731164 730813 731171 732313 734017 735848 737590 739461 741869 745043 748956 753502 758674 764623 771572 779666
53221 779666 788836 798874 809721 821531 834315 847601 860724 873478 886251 899484 913228 927290
53209 927290 941491 955577 969136 981931 994208 1006352 1018263 1029342 1039107 1047618 1055243 1062205
53197 1062205 1068482 1074001 1078775 1082842 1086084 1088138 1088548 1087074 1083812 1078953 1072521 1064504 1055141 1044803
53183 1044803 1033562 1021105 1007229 992258 976760 960945 944527 927207 909088 890563 871931
$$ packed form
53271A398417l3559l3505l3646l3512l2720l1441l0188k9304k8745k8258k7643
53260A055896k6856k5934k4882k3646k2193k0599j9009j7603j6521j5693j4811
53249H28149j3663j2482j1675j1171j0363q867p112n821n097m384l279k026j045
53236G31164l51L58J142J704J831J742J871K408L174L913M546N172N949O949Q094
53221G79666R170J0038J0847J1810J2784J3286J3123J2754J2773J3233J3744J4062
53209I27290J4201J4086J3559J2795J2277J2144J1911J1079R765Q511P625O962
53197A062205O277N519M774M067L242K054M10j474l262m859o432q017r363j0338
53183A044803j1241j2457j3876j4971j5498j5815j6418j7320j8119j8525j8632
$$ plain form
53172 871931 853304 834829 816782 799358 782482 765948 749683 733785 718311 703162 688202
53161 688202 673385 658748 644340 630207 616403 603007 590126 577854 566148 554763 543402
53150 543402 531944 520538 509492 499070 489331 480110 471218 462650 454451 446363 437857 428716 419384
53137 419384 410468 402016 393596 384974 376391 368154 360319 352821 345580 338356 330821 322938 315062 307520
53123 307520 300287 293184 286134 279082 271921 264655 257495 250613 243976 237506 231191 224914 218480 211973
53109 211973 205874 200542 195752 191052 186410 182244 178813 175880 172973 169823 166493 163201 160089 157191
53095 157191 154579 152426 150751 149172 147197 144767 142270 139987 137830 135716 133857 132451 131350 130278
53081 130278 129180 128150 127202 126305 125451 124524 123292 121760 120333 119446 119177 119369 119880 120540 121108 121528 121986
$$ packed form
53172H71931j8627j8475j8047j7424j6876j6534j6265j5898j5474j5149j4960
53161F88202j4817j4637j4408j4133j3804j3396j2881j2272j1706j1385j1361
53150E43402j1458j1406j1046j0422r739r221q892q568q199q088q506r141r332
53137D19384q916q452q420q622q583q237p835p498p241p224p535p883p876p542
53123C07520p233p103p050p052p161p266p160o882o637o470o315o277o434o507
53109B11973o099n332m790m700m642m166l431k933k907l150l330l292l112k898
53095A57191k612k153j675j579j975k430k497k283k157k114j859j406j101j072
53081A30278j098j030r48q97q54r27j232j532j427q87k69J92N11O60N68M20M58
$$ plain form
53064 121986 122559 123056 123394 123796 124361 124806 125015 125442 126536 128055 129400 130358 131005 131190 130726 129980 129550 129368
53046 129368 128714 127180 125067 122788 120467 118234 116336 114706 112884 110640 108289 106158 104151 102106
53032 102106 100189 98563 96975 95061 92907 90954 89443 88239 87179 86311 85711 85254 84654 83745 82676
53017 82676 81793 81251 80810 80097 79030 77860 76839 75998 75217 74416 73644 73051 72723 72489 72053 71409 70944 70922
52999 70922 71097 71076 70843 70633 70468 70236 70098 70344 70890 71340 71522 71553 71394 70843 70058 69570 69581 69688 69513 69211
52979 69211 69091 69107 69015 68757 68372 67805 67118 66663 66707 66978 66924 66392 65819 65760 66387 67395 68267 68605 68364 67802
52959 67802 67234 66857 66743 66829 66915 66795 66465 66087 65820 65783 66070 66565 66846 66577 65983 65597 65588 65709 65901 66451 67392
52938 67392 68220 68526 68554 68774 69176 69350 69099 68641 68314 68328 68715 69295 69747 69913 70004 70394 71298 72748 74655
$$ packed form
53064A21986N73M97L38M02N65M45K09M27J094J519J345R58O47J85m64p46m30j82
53046A29368o54j534k113k279k321k233j898j630j822k244k351k131k007k045
53032A02106j917j626j588j914k154j953j511j204j060q68o00m57o00r09j069
53017H2676q83n42m41p13j067j170j021q41p81q01p72n93l28k34m36o44m65k2
52999G0922J75k1k33k10j65k32j38K46N46M50J82L1j59n51p85m88J1J07j75l02
52979F9211j20J6r2k58l85n67o87m55M4K71n4n32n73n9O27J008Q72L38k41n62
52959F7802n68l77j14Q6Q6j20l30l78k67l7K87M95K81k69n94l86rJ21J92N50R41
52938F7392Q28L06K8K20M02J74k51m58l27J4L87N80M52J66R1L90R04J450J907
$$ plain form
52919 74655 76706 78385 79421 80162 81272 83082 85404 87887 90364 92806 95201 97538 99772 101697 102976
52904 102976 103389 103102 102605 102327 102288 102216 101955 101610 101208 100509 99380 98201 97498 97245 96849 95915 94673 93638
52886 93638 93129 93219 93778 94376 94488 94011 93367 92843 92133 90783 88955 87391 86722 86998 87828 88710 89247 89257 88864
52867 88864 88407 88260 88567 89105 89435 89322 88965 88709 88621 88536 88424 88351 88180 87667 86932 86415 86267 86155 85821 85477
52847 85477 85413 85554 85672 85745 85841 85849 85665 85445 85438 85652 85920 86163 86426 86763 87198 87674 87947 87770 87262 86833 86659
52826 86659 86525 86353 86446 86970 87571 87849 87934 88198 88646 88982 89063 88969 88777 88600 88656 88976 89226 89187 89179 89617 90351 90882
52804 90882 91043 91055 91027 90988 91271 92273 93770 94986 95543 95910 96770 98290 100165 102008 103544 104655 105477
52787 105477 106279 107188 108140 109104 110094 111000 111690 112300 113121 114143 115021 115556 115879 116021 115682 114644 113153 111633
$$ packed form
52919G4655K051J679J036P41J110J810K322K483K477K442K395K337K234J925J279
52904A02976M13k87m97k78l9p2k61l45m02o99j129j179p03k53l96r34j242j035
52886I3638n09R0N59N98J12m77o44n24p10j350j828j564o69K76Q30Q82N37J0l93
52867H8864m57j47L07N38L30j13l57k56q8q5j12p3j71n13p35n17j48j12l34l44
52847H5477o4J41J18P3R6Qj84k20pK14K68K43K63L37M35M76K73j77n08m29j74
52826H6659j34j72R3N24O01K78Q5K64M48L36Q1r4j92j77N6L20K50l9qM38P34N31
52804I0882J61J2k8l9K83J002J497J216N57L67Q60J520J875J843J536J111Q22
52787A05477Q02R09R52R64R90R06O90O10Q21J022Q78N35L23J42l39j038j491j520
$$ plain form
52769 111633 110230 108883 107638 106587 105630 104591 103543 102726 102075 101088 99347 97063 94910 93335 92168
52754 92168 90934 89424 87845 86478 85376 84389 83350 82227 81208 80636 80638 80812 80512 79546 78405 77689 77525
52737 77525 77656 77809 77771 77348 76578 75823 75386 75126 74688 74038 73440 73018 72621 72100 71468 70779 70058 69312 68472
52718 68472 67400 66119 64924 64051 63414 62851 62435 62236 61962 61266 60300 59523 59004 58387 57554 56878 56640 56626
52700 56626 56478 56111 55624 55078 54554 54169 53831 53227 52250 51247 50669 50602 50803 51027 51148 51065 50671 49885 48706
52681 48706 47274 45881 44793 44025 43433 43026 42977 43306 43739 43965 43901 43678 43523 43649 44039 44318 44079 43414 42875
52662 42875 42847 43200 43643 44115 44658 45149 45414 45454 45352 45073 44580 44077 43954 44474 45630 47202 48843 50180
52644 50180 51017 51495 51998 52857 54139 55683 57303 58958 60657 62228 63310 63741 63812 63946 64139 63946 63049
$$ packed form
52769A11633j403j347j245j051r57j039j048q17o51r87j741k284k153j575j167
52754I2168j234j510j579j367j102r87j039j123j019n72KJ74l00r66j141p16j64
52737G7525J31J53l8m23p70p55m37k60m38o50n98m22l97n21o32o89p21p46q40
52718F8472j072j281j195q73o37n63m16j99k74o96r66p77n19o17q33o76k38j4
52700E6626j48l67m87n46n24l85l38o04r77j003n78o7K01K24J21q3l94p86j179
52681D8706j432j393j088p68n92m07m9L29M33K26o4k23j55J26L90K79k39o65n39
52662D2875k8L53M43M72N43M91K65M0j02k79m93n03j23N20J156J572J641J337
52644E0180Q37M78N03Q59J282J544J620J655J699J571J082M31P1J34J93j93q97
$$ plain form
52627 63049 61621 60100 58789 57748 56878 56024 55142 54427 54102 54014 53616 52445 50556 48380 46336 44674
52611 44674 43512 42847 42566 42565 42793 43122 43269 42932 42056 40924 39985 39511 39344 39037 38323 37399 36648 36218 36005
52592 36005 35949 36100 36419 36775 37159 37628 38074 38239 38070 37812 37696 37717 37764 37729 37469 36887 36151 35615 35417 35393 35420
52571 35420 35612 36013 36398 36573 36671 36933 37352 37733 37948 37938 37612 36960 36173 35468 34880 34388 34163 34432 35106 35741
52551 35741 35968 35862 35809 36062 36501 36861 37087 37346 37683 37889 37828 37703 37800 38111 38477 38936 39601 40302 40761 41082
52531 41082 41615 42266 42452 41892 41038 40498 40427 40743 41496 42632 43736 44423 44794 45163 45562 45885 46291 47016 47925
52512 47925 48667 49194 49702 50166 50379 50448 50785 51522 52327 52911 53359 53841 54340 54895 55730 56885 57926 58381 58332
52493 58332 58340 58796 59601 60460 61264 62095 62992 63854 64545 65009 65279 65422 65506 65549 65524 65431 65426 65782 66602 67540 67995 67711
$$ packed form
52627F3049j428j521j311j041q70q54q82p15l25q8l98j171j889k176k044j662
52611D4674j162o65k81jK28L29J47l37q76j132r39m74j67l07p14r24p51m30k13
52592C6005n6J51L19L56L84M69M46J65j69k58j16K1M7l5k60n82p36n36j98k4K7
52571C5420J92M01L85J75R8K62M19L81K15j0l26o52p87p05n88m92k25K69O74O35
52551C5741K27j06n3K53M39L60K26K59L37K06o1j25R7L11L66M59O65P01M59L21
52531D1082N33O51J86n60q54n40p1L16P53J136J104O87L71L69L99L23M06P25R09
52512D7925P42N27N08M64K13O9L37P37Q05N84M48M82M99N55Q35J155J041M55m9
52493E8332QM56Q05Q59Q04Q31Q97Q62O91M64K70J43Q4M3k5r3nL56Q20R38M55k84
$$ plain form
52471 67711 67109 66909 67445 68425 69304 69762 69823 69652 69396 69220 69302 69657 70013 70012 69621 69167 68874 68551 67931 67187
52451 67187 66841 67140 67807 68405 68697 68601 68092 67309 66549 65985 65550 65200 65059 65128 65093 64692 64144 63939 64238 64748
52431 64748 65141 65379 65582 65751 65744 65461 64998 64625 64582 64907 65490 66275 67266 68323 69116 69383 69182 68847 68763 69167
52411 69167 69974 70782 71229 71396 71655 72097 72422 72462 72502 72833 73307 73625 73850 74263 74833 75207 75210 75063 75081 75399 75976
52390 75976 76685 77348 77876 78372 78977 79633 80168 80567 80998 81563 82185 82766 83297 83811 84317 84757 84993 84903 84582
52371 84582 84321 84280 84300 84179 83961 83770 83528 83058 82334 81389 80129 78535 76953 75811 75050 74204 73048 71839
52353 71839 70849 70014 69172 68348 67604 66882 66197 65779 65779 66013 66175 66237 66399 66731 67044 67140 67015 66814 66688 66720 66951
52332 66951 67424 68181 69174 70177 70889 71164 71092 70859 70590 70423 70546 71052 71741 72248 72435 72562 73013 73867 74838
$$ packed form
52471F7711o02k00N36R80Q79M58O1j71k56j76Q2L55L56jl91m54k93l23o20p44
52451F7187l46K99O67N98K92r6n09p83p60n64m35l50j41O9l5m01n48k05K99N10
52431F4748L93K38K03J69pk83m63l73m3L25N83P85R91J057P93K67k01l35q4M04
52411F9167Q07Q08M47J67K59M42L25M0M0L31M74L18K25M13N70L74Lj47J8L18N77
52390G5976P09O63N28M96O05O56N35L99M31N65O22N81N31N14N06M40K36r0l21
52371H4582k61m1K0j21k18j91k42m70p24r45j260j594j582j142p61q46j156j209
52353G1839r90q35q42q24p44p22o85m18%K34J62O2J62L32L13R6j25k01j26L2K31
52332F6951M73P57R93J003P12K75p2k33k69j67J23N06O89N07J87J27M51Q54R71
$$ plain form
52313 74838 75587 76026 76296 76600 77143 78119 79548 81137 82455 83312 83896 84536 85440 86628 87968 89230 90302
52296 90302 91389 92852 94742 96698 98361 99723 100938 102020 102926 103765 104663 105555 106358 107250 108511 110117
52280 110117 111755 113225 114592 115922 117106 118052 118877 119741 120646 121475 122178 122857 123652 124606 125653 126758
52264 126758 128013 129530 131228 132848 134244 135548 136966 138553 140243 141972 143653 145219 146811 148790
52250 148790 151329 154118 156711 159059 161485 164193 167081 170045 173225 176865 181083 185847 191040 196517
52236 196517 202197 208094 214211 220446 226697 232979 239329 245663 251907 258154 264606 271369 278486 286048
52222 286048 294070 302285 310311 318007 325564 333198 340917 348499 355613 362036 367912 373722 379782 385860
52208 385860 391443 396277 400440 403981 406796 408854 410312 411365 412184 412929 413640 414150 414338 414358 414432 414519 414453
$$ packed form
52313G4838P49M39K70L04N43R76J429J589J318Q57N84O40R04J188J340J262J072
52296I0302J087J463J890J956J663J362J215J082R06Q39Q98Q92Q03Q92J261J606
52280A10117J638J470J367J330J184R46Q25Q64R05Q29P03O79P95R54J047J105
52264A26758J255J517J698J620J396J304J418J587J690J729J681J566J592J979
52250A48790K539K789K593K348K426K708K888K964L180L640M218M764N193N477
52236A96517N680N897O117O235O251O282O350O334O244O247O452O763P117P562
52222B86048Q022Q215Q026P696P557P634P719P582P114O423N876N810O060O078
52208C85860N583M834M163L541K815K058J458J053Q19P45P11N10J88K0P4Q7o6
$$ plain form
52191 414453 414320 414332 414458 414542 414778 415594 417030 418603 419933 421131 422508 424239 426465 429340 432770 436405
52175 436405 440075 443975 448251 452741 457276 461921 466632 471057 474988 478792 483015 487706 492421 496756
52161 496756 500569 503798 506421 508548 510306 511640 512436 512796 512941 512848 512224 510870 508907 506618 504243 501921
52145 501921 499657 497209 494177 490313 485767 481007 476505 472459 468741 465049 461148 457048 453025 449439
52131 449439 446456 443907 441511 439254 437386 435964 434587 432841 430828 429001 427548 426269 425035 423980
52117 423980 423151 422328 421369 420429 419606 418629 417139 415206 413360 412185 411925 412324 412728 412519 411637 410544 409625
52100 409625 408839 408025 407233 406485 405537 404239 402924 402048 401465 400522 398884 396924 395135 393497 391641 389458
52084 389458 387261 385365 383751 382197 380650 379299 378293 377481 376514 375183 373571 371877 370196 368468 366605
$$ packed form
52191D14453j33J2J26Q4K36Q16J436J573J330J198J377J731K226K875L430L635
52175D36405L670L900M276M490M535M645M711M425L931L804M223M691M715M335
52161D96756L813L229K623K127J758J334P96L60J45r3o24j354j963k289k375k322
52145E01921k264k448l032l864m546m760m502m046l718l692l901m100m023l586
52131D49439k983k549k396k257j868j422j377j746k013j827j453j279j234j055
52117D23980q29q23r59r40q23r77j490j933j846j175k60L99M04k09q82j093r19
52100D09625p86q14p92p48r48j298j315q76n83r43j638j960j789j638j856k183
52084C89458k197j896j614j554j547j351j006q12r67j331j612j694j681j728j863
$$ plain form
52069 366605 364655 362816 361248 359838 358292 356562 355017 353998 353333 352542 351468 350401 349625 349145 348854
52054 348854 348653 348352 347832 347400 347655 348795 350370 351854 353185 354595 356243 358251 360792 363837 367031
52039 367031 370129 373369 377173 381685 386831 392564 398700 404814 410702 416798 423687 431323 439182 447048
52025 447048 455196 463761 472422 480842 489017 497021 504739 512038 518962 525548 531631 536997 541591 545488
52011 545488 548745 551424 553624 555435 556867 557846 558198 557703 556370 554594 552841 551128 549012 546160 542718
51996 542718 539079 535494 532061 528925 526296 524289 522847 521763 520769 519654 518382 517041 515690 514339
51982 514339 513078 512118 511621 511582 511923 512630 513719 515112 516618 518069 519476 520994 522696 524450 526070 527583
51966 527583 529157 530764 532117 533062 533818 534605 535251 535427 535155 534757 534340 533630 532384 530618 528349 525416
$$ packed form
52069C66605j950j839j568j410j546j730j545j019o65p91j074j067p76m80k91
52054C48854k01l01n20m32K55J140J575J484J331J410J648K008K541L045L194
52039C67031L098L240L804M512N146N733O136O114N888O096O889P636P859P866
52025D47048Q148Q565Q661Q420Q175Q004P718P299O924O586O083N366M594L897
52011E45488L257K679K200J811J432R79L52m95j333j776j753j713k116k852l442
51996E42718l639l585l433l136k629k007j442j084r94j115j272j341j351j351
51982E14339j261r60m97l9L41P07J089J393J506J451J407J518J702J754J620J513
51966E27583J574J607J353R45P56P87O46J76k72l98m17p10j246j766k269k933
$$ plain form
51950 525416 521786 517771 513689 509445 504723 499509 494118 488703 483004 476704 469829 462586 454999 446957
51936 446957 438641 430566 423034 415715 407996 399637 390856 381880 372730 363468 354304 345314 336289 327087
51922 327087 317921 309147 300901 293123 285721 278532 271293 263921 256699 249911 243445 237033 230764 224962
51908 224962 219625 214377 209050 203929 199277 194929 190557 186142 181971 178282 175093 172288 169749 167386
51894 167386 165113 162774 160205 157499 155126 153557 152711 152034 151175 150334 149827 149551 149104 148233 146972 145478
51878 145478 143987 142800 141996 141206 139950 138317 136994 136497 136539 136390 135684 134642 133570 132485 131362 130463
51862 130463 130113 130233 130342 130076 129504 128864 128181 127261 125968 124412 122915 121810 121162 120633 119781 118529 117242
51845 117242 116248 115502 114820 114254 113980 113922 113733 113166 112338 111595 111203 111145 111158 111040 110914 111067 111498 111847 111893 111876
$$ packed form
51950E25416l630m015m082m244m722n214n391n415n699o300o875p243p587q042
51936D46957q316q075p532p319p719q359q781q976r150r262r164q990r025r202
51922C27087r166q774q246p778p402p189p239p372p222o788o466o412o269n802
51908B24962n337n248n327n121m652m348m372m415m171l689l189k805k539k363
51894A67386k273k339k569k706k373j569q46o77q59q41n07k76m47q71j261j494
51878A45478j491j187q04p90j256j633j323m97M2j49p06j042j072j085j123q99
51862A30463l50J20J09k66n72o40o83r20j293j556j497j105o48n29q52j252j287
51845A17242r94p46o82n66k74n8j89n67q28p43l92n8J3j18j26J53M31L49M6j7
$$ plain form
51825 111876 112112 112497 112693 112634 112552 112583 112625 112553 112283 111721 110901 110170 109924 110179 110637 111130 111695 112267 112657 112873
51805 112873 113157 113616 114132 114687 115442 116425 117437 118422 119605 121061 122475 123532 124322 125112 125916 126558 127005
51788 127005 127407 127896 128539 129404 130522 131826 133227 134652 135920 136724 136905 136650 136314 136085 135920 135671 135212
51771 135212 134545 133871 133431 133214 132994 132704 132555 132654 132742 132541 132199 132124 132474 133042 133589 134084 134617 135224 135827 136229
51751 136229 136272 136071 135995 136279 136742 137039 137102 137118 137157 137036 136580 135841 135025 134328 133891 133755 133786 133717 133361 132795 132300
51730 132300 132098 132118 132069 131774 131381 131181 131245 131404 131554 131779 132117 132426 132600 132727 132891 132965 132797 132476 132221 132126
51710 132126 132179 132398 132744 132981 132897 132620 132464 132446 132223 131571 130730 130143 130020 130262 130668 131080 131414 131652 131814 131897
51690 131897 131906 131957 132241 132826 133583 134384 135264 136298 137379 138272 138870 139200 139209 138712 137693 136473 135414 134499 133445
$$ packed form
51825A11876K36L85J96n9q2L1M2p2k70n62q20p31k46K55M58M93N65N72L90K16
51805A12873K84M59N16N55P55R83J012R85J183J456J414J057P90P90Q04O42M47
51788A27005M02M89O43Q65J118J304J401J425J268Q04J81k55l36k29j65k49m59
51771A35212o67o74m40k17k20k90j49R9Q8k01l42p5L50N68N47M95N33O07O03M02
51751A36229M3k01p6K84M63K97O3J6L9j21m56p39q16o97m37j36L1o9l56n66m95
51730A32300k02K0m9k95l93k00O4J59J50K25L38L09J74J27J64P4j68l21k55r5
51710A32126N3K19L46K37q4k77j56j8k23o52q41n87j23K42M06M12L34K38J62Q3
51690A31897RN1K84N85P57Q01Q80J034J081Q93N98L30Rm97j019j220j059r15j054
$$ plain form
51671 133445 132188 131053 130340 129981 129781 129788 130171 130835 131432 131772 131979 132138 132006 131209 129698 127890 126372 125439
51653 125439 124858 124110 122948 121610 120429 119380 118221 116980 115968 115285 114637 113737 112615 111406 110122
51638 110122 108835 107858 107459 107476 107459 107135 106623 106224 106146 106394 106785 107157 107580 108311 109469 110865 112260 113638
51620 113638 115108 116698 118356 120045 121688 123132 124317 125361 126355 127214 127890 128575 129492 130628 131860
51605 131860 133276 135082 137249 139456 141361 142768 143604 143993 144270 144662 144867 144245 142538 140250 138189 136705
51589 136705 135454 133860 131689 129175 126614 123983 121100 118122 115605 113910 112798 111768 110653 109624
51575 109624 108787 108072 107435 106884 106302 105492 104404 103122 101708 100296 99244 98828 98769 98469 97779 97196 97134 97392
51557 97392 97539 97529 97580 97685 97623 97394 97285 97454 97700 97781 97803 98155 99094 100476 101866 102891 103429 103575 103507 103460
$$ packed form
51671A33445j257j135p13l59k00PL83O64N97L40K07J59j32p97j511j808j518r33
51653A25439n81p48j162j338j181j049j159j241j012o83o48r00j122j209j284
51638A10122j287r77l99J7j7l24n12l99p8K48L91L72M23P31J158J396J395J378
51620A13638J470J590J658J689J643J444J185J044R94Q59O76O85R17J136J232
51605A31860J416J806K167K207J905J407Q36L89K77L92K05o22j707k288k061j484
51589A36705j251j594k171k514k561k631k883k978k517j695j112j030j115j029
51575A09624q37p15o37n51n82q10j088j282j414j412j052m16n9l00o90n83o2K58
51557I7392J47j0N1J05o2k29j09J69K46Q1K2L52R39J382J390J025N38J46o8m7
$$ plain form
51537 103460 103678 104259 105062 105916 106870 108133 109783 111685 113678 115691 117709 119783 122080 124758 127784
51522 127784 131057 134635 138600 142654 146243 149214 152020 155068 158160 160834 162997 164832 166264 166997
51508 166997 167047 166840 166663 166321 165517 164310 163028 161894 160920 160077 159410 158999 158909 159187 159882 161076 162841 165095
51490 165095 167548 169924 172212 174550 176890 179009 180864 182707 184732 186851 188958 191147 193420 195367
51476 195367 196512 196922 197132 197465 197748 197736 197486 197146 196705 196157 195690 195467 195390 195345 195494 196082 197002 197851 198327
51457 198327 198338 197769 196557 194963 193469 192253 191053 189619 187982 186111 183681 180534 177135 174189 171835
51442 171835 169569 166974 164240 161860 160052 158611 157167 155474 153518 151496 149716 148463 147875 147816 147827
51427 147827 147318 146019 144270 142778 142012 141870 141894 141715 141318 140958 140867 141035 141274 141514 141948 142784 143927 145099
$$ packed form
51537A03460K18N81Q03Q54R54J263J650J902J993K013K018K074K297K678L026
51522A27784L273L578L965M054L589K971K806L048L092K674K163J835J432P33
51508A66997N0k07j77l42q04j207j282j134r74q43o67m11r0K78O95J194J765K254
51490A65095K453K376K288K338K340K119J855J843K025K119K107K189K273J947
51476A95367J145M10K10L33K83j2k50l40m41n48m67k23p7m5J49N88R20Q49M76
51457A98327J1n69j212j594j494j216j200j434j637j871k430l147l399k946k354
51442A71835k266k595k734k380j808j441j444j693j956k022j780j253n88n9J1
51427A47827n09j299j749j492p66j42K4j79l97l60r1J68K39K40M34Q36J143J172
$$ plain form
51409 145099 146243 147655 149599 151942 154319 156580 158926 161575 164411 167104 169555 172081 175075 178474
51395 178474 181701 184169 185792 186975 188162 189475 190743 191774 192477 192812 192722 192252 191693 191429 191541 191684
51379 191684 191477 190938 190378 189924 189448 188909 188448 188013 187180 185586 183371 180964 178514 175796 172617 169096
51363 169096 165522 162109 158918 155886 152907 149937 147028 144251 141683 139521 138053 137374 137218 137214 137197 137152
51347 137152 137035 136900 137094 138006 139587 141359 142943 144347 145748 147235 148872 150766 152895 154978 156643
51332 156643 157681 158072 157851 156999 155413 153002 149861 146339 142769 139134 135133 130636 125947 121550 117663
51317 117663 114110 110597 107091 103926 101496 99824 98474 96940 95030 92850 90590 88468 86689 85215
51303 85215 83715 82028 80577 79977 80224 80619 80555 80051 79417 78724 77818 76643 75318 74083 73261 73127 73596
$$ packed form
51409A45099J144J412J944K343K377K261K346K649K836K693K451K526K994L399
51395A78474L227K468J623J183J187J313J268J031P03L35r0m70n59k64J12J43
51379A91684k07n39n60m54m76n39m61m35q33j594k215k407k450k718l179l521
51363A69096l574l413l191l032k979k970k909k777k568k162j468o79j56mj7m5
51347A37152j17j35J94R12J581J772J584J404J401J487J637J894K129K083J665
51332A56643J038L91k21q52j586k411l141l522l570l635m001m497m689m397l887
51317A17663l553l513l506l165k430j672j350j534j910k180k260k122j779j474
51303H5215j500j687j451o00K47L95o4n04o34o93r06j175j325j235q22j34M69
$$ plain form
51286 73596 74213 74592 74736 74802 74767 74558 74377 74556 75129 75771 76205 76501 76899 77472 78048 78453 78779 79352 80389
51267 80389 81741 83083 84321 85677 87397 89526 91981 94626 97201 99425 101299 103169 105303 107580
51253 107580 109720 111691 113714 115929 118228 120306 121740 122133 121363 119683 117490 115061 112573 110199 107995
51238 107995 105826 103576 101328 99161 96919 94404 91734 89276 87254 85662 84487 83720 83135 82365 81317
51223 81317 80279 79485 78771 77832 76694 75745 75339 75447 75685 75627 75121 74354 73598 72948 72337 71742 71187 70619 69947
51204 69947 69272 68891 68998 69492 70130 70739 71160 71209 70867 70432 70294 70587 71144 71735 72214 72485 72512 72386 72219 71959
51184 71959 71457 70743 70089 69688 69434 69114 68691 68245 67728 67025 66224 65615 65371 65358 65330 65184 64975 64822 64846 65055
51164 65055 65215 64989 64317 63511 62865 62335 61783 61324 61158 61167 61064 60917 61188 62118 63389 64498 65216 65524 65403
$$ packed form
51286G3596O17L79J44O6l5k09j81J79N73O42M34K96L98N73N76M05L26N73J037
51267H0389J352J342J238J356J720K129K455K645K575K224J874J870K134K277
51253A07580K140J971K023K215K299K078J434L93p70j680k193k429k488k374k204
51238A07995k169k250k248k167k242k515k670k458k022j592j175p67n85p70j048
51223H1317j038p94p14r39j138r49m06J08K38n8n06p67p56o50o11n95n55n68o72
51204F9947o75l81J07M94O38O09M21M9l42m35j38K93N57N91M79K71K7j26j67k60
51184G1959n02p14o54m01k54l20m23m46n17p03q01o09k44j3k8j46k09j53K4K09
51164F5055J60k26o72q06o46n30n52m59j66Rj03j47K71R30J271J109P18L08j21
$$ plain form
51145 65403 64990 64711 64973 65757 66733 67674 68501 69018 69006 68630 68450 68824 69508 70012 70179 70176 70064 69701 69111 68655
51125 68655 68651 68975 69254 69365 69509 69781 69923 69641 69027 68474 68274 68467 69002 69835 70790 71555 71917 71971 72031 72323
51105 72323 72782 73099 73012 72613 72310 72391 72639 72536 71844 70858 70060 69678 69598 69531 69194 68484 67582 66825 66378 66105
51085 66105 65831 65583 65492 65552 65618 65606 65604 65761 66089 66377 66343 65983 65723 66080 67145 68533 69823 70861 71660 72237
51065 72237 72679 73140 73622 73920 73922 73789 73668 73405 72726 71613 70330 69169 68335 67942 67906 67941 67828 67669 67654 67684
51045 67684 67455 66878 66179 65621 65292 65190 65259 65316 65159 64843 64706 65005 65631 66266 66729 67112 67635 68434 69449
51026 69449 70476 71350 72067 72683 73160 73376 73293 73031 72795 72734 72823 72831 72516 71954 71608 71900 72742 73630 74171 74403
51006 74403 74598 74907 75295 75698 76135 76641 77158 77567 77848 78128 78504 78885 79155 79457 80072 80960 81666 81879 81861
$$ packed form
51145F5403m13k79K62P84R76R41Q27N17j2l76j80L74O84N04J67lj12l63n90m56
51125F8655mL24K79J11J44K72J42k82o14n53k00J93N35Q33R55P65L62N4O0K92
51105G2323M59L17q7l99l03Q1K48j03o92r86p98l82q0o7l37p10r02p57m47k73
51085F6105k74k48r1O0O6j2kJ57L28K88l4l60k60L57J065J388J290J038P99N77
51065G2237M42M61M82K98Kj33j21k63o79j113j283j161q34l93l6L5j13j59j5L0
51045F7684k29n77o99n58l29j02O9N7j57l16j37K99O26O35M63L83N23P99J015
51026F9449J027Q74P17O16M77K16q3k62k36o1Q9Ql15n62l46K92Q42Q88N41K32
51006G4403J95L09L88M03M37N06N17M09K81K80L76L81K70L02O15Q88P06K13j8
$$ plain form
50987 81861 82145 82919 83988 85173 86444 87688 88649 89189 89363 89216 88708 87957 87332 87156 87403 87786 88051 88145
50969 88145 88148 88178 88279 88349 88182 87681 87044 86716 87040 87930 88914 89556 89821 89949 90113 90382 90938 91990 93400 94715
50949 94715 95698 96606 97724 98943 100033 101108 102441 104000 105546 107092 108918 111142 113609 116151 118675
50934 118675 120996 122931 124646 126647 129370 132920 137171 141840 146558 151119 155665 160393 165218 170030
50920 170030 175171 181151 187894 194829 201827 209508 218401 228304 238792 249927 262039 275133 289017
50907 289017 303814 319912 337432 356110 375669 396035 417224 439272 462234 486035 510293
50896 510293 534444 558033 580766 602380 622597 641146 657723 672034 683980 693687 701222 706465
50884 706465 709414 710461 710173 708884 706689 703696 700100 696119 692020 688079 684270 680173 675375 669860
$$ packed form
50987H1861K84P74J069J185J271J244R61N40J74j47n08p51o25j76K47L83K65R4
50969H8145LL0J01P0j67n01o37l28L24Q90R84O42K65J28J64K69N56J052J410J315
50949I4715R83R08J118J219J090J075J333J559J546J546J826K224K467K542K524
50934A18675K321J935J715K001K723L550M251M669M718M561M546M728M825M812
50920A70030N141N980O743O935O998P681Q893R903J0488J1135J2112J3094J3884
50907B89017J4797J6098J7520J8678J9559K0366K1189K2048K2962K3801K4258
50896E10293K4151K3589K2733K1614K0217J8549J6577J4311J1946R707P535N243
50884G06465K949J047k88j289k195k993l596l981m099l941l809m097m798n515
$$ plain form
50870 669860 663720 656682 648275 638417 627431 615480 602283 587524 571273 553867 535591 516597
50858 516597 497007 476978 456774 436835 417647 399492 382389 366277 351159 337066 324007
50847 324007 312008 301110 291338 282716 275261 268849 263191 258069 253547 249791 246763 244295 242374 241052
50833 241052 240119 239203 238255 237639 237585 237854 238118 238430 239066 240107 241451 243137 245339 248052 251033 254129 257415
50816 257415 260950 264591 268274 272312 277176 282921 289037 295021 300974 307498 315024 323449 332457 341997
50802 341997 352329 363785 376627 391030 406950 424106 442345 462043 483906 508284 534951
50791 534951 563664 594689 628513 665206 704393 745861 789854 836613 885821 936738 988763
50780 988763 1041609 1094891 1147801 1199324 1248596 1294786 1336775 1373240 1403230 1426549 1443575
$$ packed form
50870F69860o140p038q407r858j0986j1951j3197j4759j6251j7406j8276j8994
50858E16597j9590k0029k0204j9939j9188j8155j7103j6112j5118j4093j3059
50847C24007j1999j0898r772q622p455o412n658n122m522l756l028k468j921j322
50833B41052r33r16r48o16n4K69K64L12O36J041J344J686K202K713K981L096L286
50816B57415L535L641L683M038M864N745O116N984N953O524P526Q425R008R540
50802C41997J0332J1456J2842J4403J5920J7156J8239J9698K1863K4378K6667
50791E34951K8713L1025L3824L6693L9187M1468M3993M6759M9208N0917N2025
50780I88763N2846N3282N2910N1523M9272M6190M1989L6465K9990K3319J7026
$$ plain form
50769 1443575 1454876 1461073 1462803 1460615 1454963 1446500 1436227 1425214 1414235 1403828 1394514 1386631 1379981
50756 1379981 1373900 1367740 1361001 1352978 1342608 1328890 1311297 1289696 1264075 1234549 1201474 1165297
50744 1165297 1126376 1085091 1042124 998433 954995 912676 872282 834429 799317 766768 736660
50733 736660 709281 685233 665024 648769 636204 626913 620602 617214 616810 619290 624279 631308 640050
50720 640050 650237 661328 672410 682610 691562 699334 705914 710931 713950 714861 713860 711207 707150
50707 707150 701942 695696 688293 679639 669938 659483 648231 635905 622546 608646 594693 580898
50695 580898 567572 555389 544945 536244 528943 522952 518500 515743 514657 515281 517699 521732 526978 533237
50681 533237 540618 549205 558901 569723 581949 595814 611327 628548 647801 669342 693016 718549
$$ packed form
50769A443575J1301O197J730k188n652q463j0273j1013j0979j0407r314p883o650
50756A379981o081o160o739q023j0370j3718j7593k1601k5621k9526l3075l6177
50744A165297l8921m1285m2967m3691m3438m2319m0394l7853l5112l2549l0108
50733G36660k7379k4048k0209j6255j2565r291o311l388m04K480M989P029Q742
50720F40050J0187J1091J1082J0200Q952P772O580N017L019R11j001k653m057
50707G07150n208o246p403q654r701j0455j1252j2326j3359j3900j3953j3795
50695E80898j3326j2183j0444q701p301n991m452k757j086O24K418M033N246O259
50681E33237P381Q587R696J0822J2226J3865J5513J7221J9253K1541K3674K5533
$$ plain form
50669 718549 746009 775643 807328 840464 874422 908778 943029 976370 1007906 1036964 1063096
50658 1063096 1085881 1104827 1119418 1129229 1134091 1134186 1129916 1121684 1109961 1095553 1079614 1063228 1047047
50645 1047047 1031418 1016713 1003364 991629 981450 972594 964858 958106 952089 946201 939479 931009 920384
50632 920384 907661 892862 875759 856295 835038 812950 790796 768954 747774 727776 709456
50621 709456 693070 678766 666783 657435 650991 647661 647617 650927 657564 667518 680836 697458 717149
50608 717149 739737 765362 794257 826259 860663 896574 933245 969951 1005706 1039365 1070089
50597 1070089 1097583 1121815 1142629 1159824 1173515 1184220 1192440 1198287 1201628 1202524 1201311 1198270 1193406
50584 1193406 1186666 1178266 1168635 1158118 1146955 1135600 1124827 1115269 1106938 1099467 1092844 1087664 1084492
$$ packed form
50669G18549K7460K9634L1685L3136L3958L4356L4251L3341L1536K9058K6132
50658A063096K2785J8946J4591R811M862R5m270q232j1723j4408j5939j6386j6181
50645A047047j5629j4705j3349j1735j0179q856p736o752o017n888o722q470j0625
50632I20384j2723j4799j7103j9464k1257k2088k2154k1842k1180j9998j8320
50621G09456j6386j4304j1983r348o444l330m4L310O637R954J3318J6622J9691
50608G17149K2588K5625K8895L2002L4404L5911L6671L6706L5755L3659L0724
50597A070089K7494K4232K0814J7195J3691J0705Q220N847L341Q96j213l041m864
50584A193406o740q400r631j0517j1163j1355j0773r558q331p471o623n180l172
$$ plain form
50571 1084492 1083196 1083132 1083868 1085434 1087881 1090908 1093988 1096613 1098328 1098749 1097764 1095614 1092652 1089163 1085466
50556 1085466 1081996 1079076 1076779 1075244 1074984 1076588 1080097 1084930 1090393 1096077 1101721 1106894 1110964 1113324
50542 1113324 1113668 1112082 1108782 1103675 1096253 1086015 1072852 1056834 1037797 1015469 990029 962224
50530 962224 932905 902661 871936 841149 810589 780383 750726 722040 694813 669383 645897
50519 645897 624329 604518 586353 569954 555525 543039 532264 523092 515613 509854 505724 503222
50507 503222 502382 502943 504458 506842 510531 515907 522897 531328 541307 552966 566145 580666 596691 614473
50493 614473 633972 655064 677942 702906 729895 758622 789016 821121 854601 888783 923158
50482 923158 957414 990942 1022798 1052346 1079622 1104926 1128392 1150129 1170483 1189857 1208424
$$ packed form
50571A084492j296o4P36J566K447L027L080K625J715M21r85k150k962l489l697
50556A085466l470k920k297j535k60J604L509M833N463N684N644N173M070K360
50542A113324L44j586l300n107p422j0238j3163j6018j9037k2328k5440k7805
50530I62224k9319l0244l0725l0787l0560l0206k9657k8686k7227k5430k3486
50519F45897k1568j9811j8165j6399j4429j2486j0775r172p479n759m130k502
50507E03222q40N61J515K384L689N376O990Q431R979J1659J3179J4521J6025J7782
50493F14473J9499K1092K2878K4964K6989K8727L0394L2105L3480L4182L4375
50482I23158L4256L3528L1856K9548K7276K5304K3466K1737K0354J9374J8567
$$ plain form
50471 1208424 1226200 1243282 1259799 1275710 1290829 1305066 1318623 1331973 1345668 1360069 1375268
50460 1375268 1391321 1408467 1426955 1446654 1467055 1487620 1507915 1527415 1545447 1561421 1574868
50449 1574868 1585144 1591408 1593072 1590101 1582665 1570687 1553991 1532793 1507838 1480040 1450203 1419058
50437 1419058 1387432 1356320 1326843 1300064 1276734 1257207 1241601 1229946 1222108 1217717 1216322 1217551
50425 1217551 1220975 1225874 1231247 1235994 1238947 1238855 1234572 1225338 1210752 1190555 1164685 1133618 1098429
50412 1098429 1060309 1020097 978402 936029 894047 853414 814660 777978 743429 711034 680801
50401 680801 652842 627361 604412 583756 565136 548639 534567 522894 513086 504600 497386 491746
50389 491746 487846 485605 484960 485947 488377 491728 495540 499877 505199 511821 519631 528315 537665 547529 557647
$$ packed form
50471A208424J7776J7082J6517J5911J5119J4237J3557J3350J3695J4401J5199
50460A375268J6053J7146J8488J9699K0401K0565K0295J9500J8032J5974J3447
50449A574868J0276O264J664k971p436j1978j6696k1198k4955k7798k9837l1145
50437A419058l1626l1112k9477k6779k3330j9527j5606j1655p838m391j395J229
50425A217551L424M899N373M747K953r2m283r234j4586k0197k5870l1067l5189
50412A098429l8120m0212m1695m2373m1982m0633l8754l6682l4549l2395l0233
50401F80801k7959k5481k2949k0656j8620j6497j4072j1673r808q486p214n640
50389D91746l900k241o45R87K430L351L812M337N322O622P810Q684R350R864J0118
$$ plain form
50374 557647 567847 578427 590079 603163 617241 631518 645669 659903 674319 688633 702648
50363 702648 716552 730486 744157 757215 769783 782178 794330 805894 816874 827677 838542
50352 838542 849377 860306 871881 884487 897777 911044 923913 936494 948972 961371 973616
50341 973616 985558 996883 1007150 1015944 1022963 1028011 1030990 1031853 1030452 1026453 1019477 1009308 995948
$$ packed form
50374E57647J0200J0580J1652J3084J4078J4277J4151J4234J4416J4314J4015
50363G02648J3904J3934J3671J3058J2568J2395J2152J1564J0980J0803J0865
50352H38542J0835J0929J1575J2606J3290J3267J2869J2581J2478J2399J2245
50341I73616J1942J1325J0267Q794P019N048K979Q63j401l999o976j0169j3360
$$ [...]
##END NTUPLES=NMR SPECTRUM
##END=
