
##TITLE=AC1069_TOPL02_5906258_YoTkPcJFFM
##JCAMPDX= 6.0         $$ Bruker NMR JCAMP-DX V2.0
##DATA TYPE= NMR SPECTRUM
##DATA CLASS= NTUPLES
##ORIGIN= BRUKER
##OWNER= Administrator
$$ 1.72 TOPSPIN		Version 2.1
$$ 2012-04-10 10:09:31.625 -0500  Administrator@TOPSPIN
$$ Compression mode = diff/dup
##.OBSERVE FREQUENCY= 400.13188235
##.OBSERVE NUCLEUS= ^1H
##.ACQUISITION MODE= SIMULTANEOUS (DQD)
##.ACQUISITION SCHEME= undefined
##.AVERAGES= 8
##.DIGITISER RES= 22
##SPECTROMETER/DATA SYSTEM= spect
##.PULSE SEQUENCE= zg30
##.SOLVENT NAME= COFFEE_meoh
##.SHIFT REFERENCE= INTERNAL, COFFEE_meoh, 1, 14.98061
##AUDIT TRAIL= $$ (NUMBER, WHEN, WHO, WHERE, PROCESS, VERSION, WHAT)
$$ ##TITLE= Audit trail, TOPSPIN		Version 2.1
$$ ##JCAMPDX= 5.01
$$ ##ORIGIN= Bruker BioSpin GmbH
$$ ##OWNER= Administrator
$$ $$ C:\Bruker\TOPSPIN/data/COFFEE/nmr/AC1069_TOPL02_5906258_YoTkPcJFFM/10/pdata/1/auditp.txt
$$ ##AUDIT TRAIL=  $$ (NUMBER, WHEN, WHO, WHERE, PROCESS, VERSION, WHAT)
(   1,<2012-04-04 10:33:23.312 -0500>,<Administrator>,<TOPSPIN>,<go>,<TOPSPIN 2.1>,
      <created by zg
	started at 2012-04-04 10:32:16.843 -0500,
	POWCHK enabled, PULCHK disabled,
       configuration hash MD5:
       1A 1E CE 29 27 FD 77 03 67 4E F0 E3 C4 B2 CB 90
       data hash MD5: 64K
       8B 34 53 5B C9 14 0A EC 78 F9 47 BD B0 56 B0 E3>)
(   2,<2012-04-04 10:33:26.187 -0500>,<Administrator>,<TOPSPIN>,<proc1d>,<TOPSPIN 2.1>,
      <Start of raw data processing
       efp LB = 0 FT_mod = 6 PKNL = 1 PHC0 = 0 PHC1 = 0 SI = 32K 
       data hash MD5: 32K
       08 12 62 A8 37 9C 98 62 5D AD AE EE 39 81 EC 0C>)
(   3,<2012-04-04 10:33:26.515 -0500>,<Administrator>,<TOPSPIN>,<proc1d>,<TOPSPIN 2.1>,
      <pk PHC0 = 212.6624 PHC1 = 0 
       data hash MD5: 32K
       C6 BD C0 56 3C 5B EB 7C CF C0 2E CD 65 40 85 1C>)
(   4,<2012-04-04 10:33:26.578 -0500>,<Administrator>,<TOPSPIN>,<proc1d>,<TOPSPIN 2.1>,
      <abs ABSG = 1 
       data hash MD5: 32K
       F6 3F D8 F3 CE 7C A0 00 7F 5A 7D 9E DE 1C B6 06>)
(   5,<2012-04-04 10:33:26.609 -0500>,<Administrator>,<TOPSPIN>,<proc1d>,<TOPSPIN 2.1>,
      <abs ABSG = 2 
       data hash MD5: 32K
       B5 43 AF 3A A8 60 60 D4 73 9D A7 CD 0D 21 0B 3E>)
(   6,<2012-04-04 10:33:26.640 -0500>,<Administrator>,<TOPSPIN>,<proc1d>,<TOPSPIN 2.1>,
      <abs ABSG = 3 
       data hash MD5: 32K
       E2 4D 65 2D 58 3A 3D E1 21 82 E2 A4 8A F8 27 86>)
(   7,<2012-04-04 10:33:26.671 -0500>,<Administrator>,<TOPSPIN>,<proc1d>,<TOPSPIN 2.1>,
      <abs ABSG = 4 
       data hash MD5: 32K
       F9 72 B1 B0 ED 63 91 B8 C1 F0 85 66 A7 CA 19 06>)
(   8,<2012-04-04 10:33:26.703 -0500>,<Administrator>,<TOPSPIN>,<proc1d>,<TOPSPIN 2.1>,
      <abs ABSG = 5 
       data hash MD5: 32K
       4E 20 61 E1 FE 87 27 B7 5E 7D B5 57 80 62 2F 37>)
(   9,<2012-04-04 10:33:30.734 -0500>,<Administrator>,<TOPSPIN>,<audit>,<TOPSPIN 2.1>,
      <user comment:
       ICON-NMR User ID: COFFEE
       data hash MD5: 32K
       4E 20 61 E1 FE 87 27 B7 5E 7D B5 57 80 62 2F 37>)
$$ ##END=
$$ 
$$ [...]
150 150 150 150 150 150 150 150
##$TP07= 0
##$TPNAME0= <>
##$TPNAME1= <>
##$TPNAME2= <>
##$TPNAME3= <>
##$TPNAME4= <>
##$TPNAME5= <>
##$TPNAME6= <>
##$TPNAME7= <>
##$TPOAL= (0..7)
0.5 0.5 0.5 0.5 0.5 0.5 0.5 0.5
##$TPOFFS= (0..7)
0 0 0 0 0 0 0 0
##$TUNHIN= 0
##$TUNHOUT= 0
##$TUNXOUT= 0
##$USERA1= <user>
##$USERA2= <user>
##$USERA3= <user>
##$USERA4= <user>
##$USERA5= <user>
##$V9= 5
##$VALIST= <valist>
##$VCLIST= <CCCCCCCCCCCCCCC>
##$VD= 0
##$VDLIST= <DDDDDDDDDDDDDDD>
##$VPLIST= <PPPPPPPPPPPPPPP>
##$VTLIST= <TTTTTTTTTTTTTTT>
##$WBST= 2048
##$WBSW= 25
##$XGAIN= (0..3)
0 0 0 0
##$XL= 0
##$YL= 0
##$YMAX_a= 527684
##$YMIN_a= -647084
##$ZGOPTNS= <>
##$ZL1= 120
##$ZL2= 120
##$ZL3= 120
##$ZL4= 120
##$ABSF1= 14.98061
##$ABSF2= -5.57192
##$ABSG= 5
##$ABSL= 3
##$ALPHA= 0
##$AQORDER= 0
##$ASSFAC= 0
##$ASSFACI= 0
##$ASSFACX= 0
##$ASSWID= 0
##$AUNMP= <proc_prof1d_extract_pilot.lims>
##$AXLEFT= 0
##$AXNAME= <>
##$AXNUC= <1H>
##$AXRIGHT= 0
##$AXTYPE= 0
##$AXUNIT= <>
##$AZFE= 0.1
##$AZFW= 0.1
##$BCFW= 0
##$BC_mod= 0
##$BYTORDP= 0
##$COROFFS= 0
##$CY= 15
##$DATMOD= 1
##$DC= 0
##$DFILT= <>
##$DTYPP= 0
##$F1P= 0
##$F2P= 0
##$FCOR= 0.5
##$FTSIZE= 32768
##$FT_mod= 6
##$GAMMA= 0
##$GB= 0
##$INTBC= 1
##$INTSCL= 1
##$ISEN= 128
##$LB= 0
##$LEV0= 0
##$LPBIN= 0
##$MAXI= 10000
##$MC2= 0
##$MEAN= 0
##$ME_mod= 0
##$MI= 0
##$NCOEF= 0
##$NC_proc= -8
##$NLEV= 6
##$NOISF1= 0
##$NOISF2= 0
##$NSP= 0
##$NTH_PI= 0
##$NZP= 0
##$OFFSET= 14.98061
##$PC= 1
##$PHC0= 212.6624
##$PHC1= 0
##$PH_mod= 1
##$PKNL= yes
##$PPARMOD= 0
##$PPDIAG= 0
##$PPIPTYP= 0
##$PPMPNUM= 2147483647
##$PPRESOL= 1
##$PSCAL= 4
##$PSIGN= 0
##$PYNMP= <proc.py>
##$REVERSE= no
##$SF= 400.13
##$SI= 32768
##$SIGF1= 0
##$SIGF2= 0
##$SINO= 400
##$SIOLD= 32768
##$SPECTYP= <>
##$SREGLST= <1H.CDCl3>
##$SSB= 0
##$STSI= 32768
##$STSR= 0
##$SW_p= 8223.68421052632
##$SYMM= 0
##$S_DEV= 0
##$TDeff= 65536
##$TDoff= 0
##$TI= <>
##$TILT= no
##$TM1= 0
##$TM2= 0
##$TOPLEV= 0
##$USERP1= <user>
##$USERP2= <user>
##$USERP3= <user>
##$USERP4= <user>
##$USERP5= <user>
##$WDW= 1
##$XDIM= 32768
##$YMAX_p= 470376551
##$YMIN_p= -758647
##$CURPLOT= <Network HP LaserJet P1505>
##$CURPRIN= <$Network HP LaserJet P1505>
##$DFORMAT= <normdp>
##$LAYOUT= <+/1D_H.xwp>
##$LFORMAT= <normlp>
##$PFORMAT= <normpl>
##$SURQMSG= 1
$$ End of Bruker specific parameters
$$ ---------------------------------
##NTUPLES= NMR SPECTRUM
##VAR_NAME=  FREQUENCY,     SPECTRUM/REAL,   SPECTRUM/IMAG
##SYMBOL=    X,             R,               I
##VAR_TYPE=  INDEPENDENT,   DEPENDENT,       DEPENDENT
##VAR_FORM=  AFFN,          ASDF,            ASDF
##VAR_DIM=   32768,         32768,           32768
##UNITS=     HZ,            ARBITRARY UNITS, ARBITRARY UNITS
##FACTOR=    0.250966925370066, 1,           1
##FIRST=     8223.43324360095, 18254,        -336887
##LAST=      0,             -7450,           -145331
##MIN=       0,             -758647,         0
##MAX=       8223.43324360095, 470376551,    0
$$ Real data points
##PAGE= N=1
##DATA TABLE= (X++(R..R)), XYDATA
$$ [...]
19461b28405C11342b4164k97636a52133N9101p6072G7806a49349G9604K6262j8706
$$ -228405 311342 -24164 -321800 -152133 -93032 -169104 77806 -149349 79604 105866 87160
19450H7160M3585c1695j47068j03741J36608L8022a1246d397n0528b591q290k74419
$$ 87160 130745 -31695 -178763 -282504 -145896 -107874 -11246 -4397 -54925 -2591 -10881 -285300
19438b85300g1579A66548c73678J58144H544J86932a0483C1056R3938a72958H5088
$$ -285300 -71579 166548 -373678 -215534 8544 195476 -10483 31056 124994 -172958 85088
19426B7101c9789j67541q0727R0753B42083b6340j75898i5110j1610k445D3013
$$ 27101 -39789 -207330 -288057 -197304 242083 -26340 -202238 -95110 -106720 -109165 43013
19414i1085G9246K66344c7514l4434j8686j6282L5753K8875l5279B08307I0114
$$ -91085 79246 345590 -37514 -71948 -90634 -106916 -71163 -42288 -77567 208307 90114
19402C3090a70505j78371a68317B54092A3366a32936q5589o9287h834j19545A94035
$$ 33090 -170505 -348876 -168317 254092 13366 -132936 -218525 -287812 -8834 -128379 194035
19390b60504M0092g9206q313k9052P030D5458K4670a75243B23375k8654f5211
$$ -260504 -220412 -79206 -87519 -116571 -109541 45458 70128 -175243 223375 194721 -65211
19378a28068p2767g8479A60374h5068E3708j6716b89770F5287d2956q6127l9808
$$ -128068 -200835 -78479 160374 -85068 53708 36992 -289770 65287 -42956 -129083 -168891
19367a68891j66852a7100l89813A67169c35297q261a39430e4938p1112A00715
$$ -168891 -335743 -17100 -406913 167169 -335297 -343558 -139430 -54938 -126050 100715
19356c70398J81978h0307b4979j84157p8179D9071P1799J74101b00851k57069
$$ -370398 -188420 -80307 -24979 -209136 -287315 49071 120870 294971 -200851 -457920
19346d57920b340E9167a03630m3317q7052c5056k70247N3661B2607N7943l0561
$$ -457920 -2340 59167 -103630 -146947 -233999 -35056 -305303 -251642 22607 80550 49989
19335D9989e8384J3590k84141J27210f5341b8964j43679B93975g7333E93281b75739
$$ 49989 -58384 -44794 -328935 -201725 -65341 -28964 -172643 293975 -77333 593281 -275739
19323a34124J2961A53086a44460i24o1360k94473N8331a26877A13969c50777a20272
$$ -134124 -121163 153086 -144460 -924 -62284 -356757 -298426 -126877 113969 -350777 -120272
19311b29250a8393J326F0159a78138j23901R1687A14666h0643A93377p1297h3217
$$ -229250 -18393 -17067 60159 -178138 -302039 -210352 114666 -80643 193377 122080 -83217
19299a59530M5162d1702A80573B7685a50865j56678b928j41553e1812k18723B50092
$$ -159530 -114368 -41702 180573 27685 -150865 -307543 -2928 -144481 -51812 -270535 250092
19287I919c4554j79717G3222C2040N728i84j06126N2662o9115D1312j5973P1665
$$ 9919 -34554 -214271 73222 32040 37768 -984 -107110 -54448 -123563 41312 25339 97004
19275I7004L6472a6996o480p0526k50502A34291f6302B25159O104E3439L02e96890
$$ 97004 133476 -16996 -23476 -94002 -344504 134291 -66302 225159 231263 53439 53741 -596890
19262B21219c63999a990k7362B1350P7591f2268j8201N39b2366l54439b5504j33978
$$ 221219 -363999 -1990 -29352 21350 98941 -62268 -80469 -79930 -22366 -376805 -25504 -159482
19250a59482e1852b3351m3617B34225h2594r0110A59299G599J57639d46159j35175
$$ -159482 -51852 -23351 -66968 234225 -82594 -172704 159299 7599 165238 -446159 -581334
19239e81334i8725A8433K57232r8130b74673G3885e07092A25112Q3217c66294
$$ -581334 -98725 18433 275665 177535 -274673 73885 -507092 125112 208329 -366294
19228a05242k10961B15909b35634Q4888g3799n3175o1732A19788c5623k93472
$$ -105242 -316203 215909 -235634 -150746 -73799 -126974 -188706 119788 -35623 -329095
19218c29095O1429Q3026g5738K0303A68756h9516J6127j82861a12522E0148b1696
$$ -329095 -267666 -184640 -75738 -55435 168756 -89516 -73389 -256250 -112522 50148 -21696
19206B64795b48690G3955a23679M1265j6814I4933b55698A40378n5466c58307
$$ 264795 -248690 73955 -123679 -82414 -99228 94933 -255698 140378 84912 -358307
19195a89785O7336d3189k1696j22978d3189q306B84808A00218i2954B55633a98911
$$ -189785 -122449 -43189 -64885 -187863 -43189 -51495 284808 100218 -92954 255633 -198911
19183a33917d338A101K64886c1787j35013e0867j14082C19081b07993A32896a35320
$$ -133917 -4338 1101 265987 -31787 -166800 -50867 -164949 319081 -207993 132896 -135320
19171A07033h9122b3757A13988b22218A49821F7854d3566D3956a23856j49387
$$ 107033 -89122 -23757 113988 -222218 149821 67854 -43566 43956 -123856 -273243
19161b73243R9330C6119g6734k41304L6239a11697A653a00235j50958J01696B56446
$$ -273243 -173913 36119 -76734 -318038 -281799 -111697 1653 -100235 -251193 -149497 256446
19149I2781c05453E3785a91160g3100j77385d6254l3257B21829D5823d13384a87518
$$ 92781 -305453 53785 -191160 -73100 -250485 -46254 -79511 221829 45823 -413384 -187518
19137D03667j57639a65299b7730o7206m5349j21540c3354k17784C23982b12747
$$ 403667 246028 -165299 -27730 -94936 -140285 -261825 -33354 -251138 323982 -212747
19126F4996J65126H9L4900a22628G7227Q9875F2733b64806O5415K7290Q4899j2496
$$ 64996 230122 89 34989 -122628 77227 167102 62733 -264806 -199391 -172101 -87202 -99698
19114i9698j55318f7707J8856p2069j31738f7048j26020r1422A76520E4822h8464
$$ -99698 -255016 -67707 -48851 -120920 -252658 -67048 -193068 -284490 176520 54822 -88464
19102A24491b5291A71495a33027E2611g6851b1192j10438D6880J85780b1965A75581
$$ 124491 -25291 171495 -133027 52611 -76851 -21192 -131630 46880 232660 -21965 175581
19090a5778A74362a08132B11381b9531G4206f8101m63213a68547k45488A6571
$$ -15778 174362 -108132 211381 -29531 74206 -68101 -531314 -168547 -414035 16571
19079c77764C25068g3021A17524M795l8636J22812M9088a35000C2667b5366p2618
$$ -377764 325068 -73021 117524 122319 83683 206495 255583 -135000 32667 -25366 -97984
19068i7984a5109j79673P5516M4265K6619k31988A4529J88486a39419A0561a87695
$$ -97984 -15109 -194782 -119266 -75001 -48382 -280370 14529 203015 -139419 10561 -187695
19056A25589a19608N5354F0959a51853a3280A65445b22141M8905A42295l7282
$$ 125589 -119608 -64254 60959 -151853 -13280 165445 -222141 -173236 142295 105013
19046A05013m6345a92935Q4680e0858J9704B34910a42224A28831j1746c0221l39871
$$ 105013 58668 -192935 -108255 -50858 -31154 234910 -142224 128831 117085 -30221 -370092
19035c70092i6433G5593b17556A79382a31016D4733K52328a53224C06290c61720
$$ -370092 -96433 75593 -217556 179382 -131016 44733 297061 -153224 306290 -361720
19024a34406b5655I9715k4660f6370j77568B23111g636F8498g7620q9336a4524
$$ -134406 -25655 99715 75055 -66370 -243938 223111 -7636 68498 -77620 -166956 -14524
19012B68466k7407b36440J05978n1668f8330C60301C8254J73834P5602a8692A38791
$$ 268466 241059 -236440 -130462 -182130 -68330 360301 38254 212088 287690 -18692 138791
19000a74070A4006M9277P3416a55867K8823G8762C4689b96181j3346B0819N6334
$$ -174070 14006 63283 136699 -155867 -127044 78762 34689 -296181 -309527 20819 77153
18989G7153i1900A53955a71269l9292I6747a89423C52683A52082a78398B22498
$$ 77153 -91900 153955 -171269 -210561 96747 -189423 352683 152082 -178398 222498
18978c1239k68337C64828h1499I8472a60420A3901c94073C9742k284R7872e0407
$$ -31239 -299576 364828 -81499 98472 -160420 13901 -394073 39742 37458 135330 -50407
18966C72666a09755o1521j29448q7927l0399a8429B43081j9700m1067l6244L02163
$$ 372666 -109755 -171276 -300724 -388651 -419050 -18429 243081 223381 182314 146070 448233
18955D48233K48219j85809B36616q3566b56336J18644f1286H0705h427p6223j49710
$$ 448233 696452 510643 236616 153050 -256336 -137692 -61286 80705 -8427 -84650 -234360
18944b34360a16180M2844A40628b82128B5154b31021Q6000f0481j87500A62740
$$ -234360 -116180 -73336 140628 -282128 25154 -231021 -145021 -60481 -247981 162740
18933b99523A71319Q0726B3084d9560C23325a64376b0521j78977d4228A62591
$$ -299523 171319 252045 23084 -49560 323325 -164376 -20521 -199498 -44228 162591
18922A70093P5698g7682J2552k22230A09272a38467m1234j58134d5738l7496a3395
$$ 170093 245791 -77682 -65130 -287360 109272 -138467 -179701 -337835 -45738 -83234 -13395
18910B51179G0553K28670k3111a23303E951a88330O0658r5675c6622A10992a9349
$$ 251179 70553 299223 276112 -123303 5951 -188330 -127672 -223347 -36622 110992 -19349
18898a17018q1954P0858D3886L46265C793L01571K0522l3973k3452A04440f0859
$$ -117018 -198972 -128114 43886 390151 3793 305364 325886 291913 268461 104440 -60859
18886a65995e4356k50323P1151A4926b30077R2332M7533k23962a2521A22352a12912
$$ -165995 -54356 -304679 -233528 14926 -230077 -137745 -90212 -314174 -12521 122352 -112912
18874a92739j3270q7912K1157N4729j21073A05350b41608D01940A46826d68900
$$ -192739 -206009 -293921 -272764 -218035 -339108 105350 -241608 401940 146826 -468900
18863A29726a82997f8401j29267E2236L17419F4501K3273a40480k50428A43720
$$ 129726 -182997 -68401 -197668 52236 369655 64501 87774 -140480 -390908 143720
18852g2139B22400h4382E672K7191b87197O0313c9436j1445n931I813J35139b17311
$$ -72139 222400 -84382 5672 32863 -287197 -226884 -39436 -50881 -56812 9813 144952 -217311
18839a62177d9943l34722a71220P5632A98355a38989o4895j15472n1680b3584
$$ -162177 -49943 -384665 -171220 -95588 198355 -138989 -203884 -319356 -371036 -23584
18828C4937J39886a48799b6703j3726F068f4176I1894a04037k5357A23238g8422
$$ 34937 174823 -148799 -26703 -40429 6068 -64176 91894 -104037 -129394 123238 -78422
18816b25201j22064I7738g133D5279c54934A33322c44661a52217a5662j99814
$$ -225201 -347265 97738 -7133 45279 -354934 133322 -344661 -152217 -15662 -215476
18806b15476h7095A68348b48421A20159M1952c7936A84414i4294k5248B51197
$$ -215476 -87095 168348 -248421 120159 162111 -37936 184414 -94294 -119542 251197
18795A27449F2440k1792K67553a68139P1613A77869g449B9347R2938n5342P3057
$$ 127449 62440 40648 308201 -168139 -96526 177869 -7449 29347 122285 66943 140000
18784A40000o1758C1943a14732H3214b48891j6832d0284B8611N1173c65500J62554
$$ 140000 78242 31943 -114732 83214 -248891 -265723 -40284 28611 79784 -365500 -202946
18773b02946K0590n4860K7668C00178G4115a70150D8678f1314p3037l05645J94731
$$ -202946 -182356 -237216 -209548 300178 74115 -170150 48678 -61314 -134351 -439996 -245265
18762b45265a14568k00353a25912o8997j84925G127e2435o8800j1847l14016F0640
$$ -245265 -114568 -314921 -125912 -194909 -379834 7127 -52435 -121235 -133082 -447098 60640
18750b12186R6190j50772A3395a60728k52544J78996h3834A98000K03779a15824
$$ -212186 -115996 -266768 13395 -160728 -413272 -234276 -83834 198000 401779 -115824
18739a07786k81646E318M8696K7404d6167I8693a0652B64065f1993A86398G4341
$$ -107786 -389432 5318 54014 81418 -46167 98693 -10652 264065 -61993 186398 74341
18727C11172c7072A56593e9334p7070A42831f6610B10669a73218q656b5269k80881
$$ 311172 -37072 156593 -59334 -136404 142831 -66610 210669 -173218 -181874 -25269 -306150
18716c06150J23926G0980a63004L9029j59904M2306a2581l08997J30232b3231
$$ -306150 -182224 70980 -163004 -123975 -283879 -241573 -12581 -321578 -191346 -23231
18705a35767J1835A18777P9167D4266c6551E9718h5433G2773L0928h3982H0717
$$ -135767 -123932 118777 197944 44266 -36551 59718 -85433 72773 103701 -83982 80717
18693b47267a05702N05C6549a3003j34996B03642B6248a89725E8006Q540b89418
$$ -247267 -105702 -105197 36549 -13003 -147999 203642 26248 -189725 58006 66546 -289418
18681b95224H1169J40b47313C40507a06216A21665f8947j04258G1529g8010p6466
$$ -295224 81169 81309 -247313 340507 -106216 121665 -68947 -173205 71529 -78010 -154476
18670a54476k68509o1459A63602a28607C1402b25873e2237B58226a57385p1180
$$ -154476 -422985 -484444 163602 -128607 31402 -225873 -52237 258226 -157385 -228565
18660b28565b8452j83338b989m38687e1075p4521o2974h9261l3961D991i9789
$$ -228565 -28452 -211790 -2989 -441676 -51075 -125596 -188570 -89261 -123222 4991 -99789
18648c8415k28298A03269b12541l5832a10890j1521H8695R206P350b64866G686
$$ -38415 -266713 103269 -212541 -248373 -110890 -122411 88695 97901 105251 -264866 7686
18636h8363A68723c56859D6240a64426B8033a15755j24433A0265J41227a46048
$$ -88363 168723 -356859 46240 -164426 28033 -115755 -240188 10265 151492 -146048
18625d5165j13535G9983d71887A35803a24197j23301M4403A35106a89478j98628
$$ -45165 -158700 79983 -471887 135803 -124197 -247498 -203095 135106 -189478 -388106
18615c88106J51290f4006k13668q9531A22033n5616a03348c2471j26594e7624
$$ -388106 -236816 -64006 -277674 -367205 122033 66417 -103348 -32471 -159065 -57624
18604c38565A11455i9392p9687B89171G1528J25798I806a24746A85302i4322l0076
$$ -338565 111455 -99392 -179079 289171 71528 197326 9806 -124746 185302 -94322 -124398
18593a24398r4875B1856J81252m1074c09144p1541e2322l471B71132c12236A38944
$$ -124398 -219273 21856 203108 162034 -309144 -380685 -52322 -55793 271132 -312236 138944
18581b80731l2171B13431R024b17286B6611c59369i8982j28361c6980E1263J4239
$$ -280731 -312902 213431 222455 -217286 26611 -359369 -98982 -227343 -36980 51263 65502
18570F5502b64667c7837I3640b4208j53288g9356E6894a10200e4712j03204G8492
$$ 65502 -264667 -37837 93640 -24208 -177496 -79356 56894 -110200 -54712 -157916 78492
18558c92379A49283f5650A8837i6641A66261f6113k7443p5614P9744A07399a65444
$$ -392379 149283 -65650 18837 -96641 166261 -66113 -93556 -169170 -89426 107399 -165444
18546d14247l5017e1305k20817g1305A44110a02845H4358k6252a01914J1088J7341
$$ -414247 -449264 -51305 -272122 -71305 144110 -102845 84358 58106 -101914 -90826 -73485
18535g3485k8181D0448a42036q4380e9249A0023b94274J46831j10945A0377g0584
$$ -73485 -101666 40448 -142036 -226416 -59249 10023 -294274 -147443 -258388 10377 -70584
18523a68246K6119L4987B06586e8340l29782H7820A3479i1790j3163p1229A29407
$$ -168246 -142127 -107140 206586 -58340 -388122 87820 13479 -91790 -104953 -176182 129407
18511h9808P878k17735a875j50514p239A06638a28614J7865A11432L1113D3935
$$ -89808 -81930 -299665 -1875 -152389 -159628 106638 -128614 -110749 111432 142545 43935
18499A81059b38382J9685j38481a00672c8616k85727f2305b7007k83456e6910
$$ 181059 -238382 -218697 -357178 -100672 -38616 -324343 -62305 -27007 -310463 -56910
18488f0535J1595j89618A04445a28269K5275i61m78081a32252D9097b40256O4895
$$ -60535 -48940 -238558 104445 -128269 -102994 -961 -479042 -132252 49097 -240256 -175361
18477a75361A32558K1372b50210c4476A07350A0669c25546J35643C4749J00701
$$ -175361 132558 153930 -250210 -34476 107350 10669 -325546 -189903 34749 135450
18467A35450c6088e824r669E280h4187F3074J31729a03483I5198c11193D5355
$$ 135450 -36088 -5824 -15493 5280 -84187 63074 194803 -103483 95198 -311193 45355
18455A0274N59857B50217j05632a00858j04503g6624q1434B36567a6558I2637
$$ 10274 570131 250217 144585 -100858 -205361 -76624 -158058 236567 -16558 92637
18444a84295A52678a77345I4177a59469d8110m0685L8523D5164a64721d778B76092
$$ -184295 152678 -177345 94177 -159469 -48110 -88795 -50272 45164 -164721 -4778 276092
18432a59666I6128d01518h6983j14843B49233b765j46565j22926C136a34390m1085
$$ -159666 96128 -401518 -86983 -201826 249233 -2765 -149330 -272256 3136 -134390 -175475
18421a75475g5100j24897M2905F7969d8758m75729h0641p3419A67330e8976B43069
$$ -175475 -75100 -199997 -157092 67969 -48758 -524487 -80641 -154060 167330 -58976 243069
18409a51390O2629L8345m13807I7349l8385c1360F5567a95648g5355A00749b37280
$$ -151390 -88761 -50416 -464223 97349 58964 -31360 65567 -195648 -75355 100749 -237280
18397d7104r6741C9815a02949A04447a90463A2349L7920b71j40012f9042m9071
$$ -47104 -143845 39815 -102949 104447 -190463 12349 50269 -271 -140283 -69042 -118113
18386a18113I4855j6080b0541j2070j36617e0978A92228A0872f1118A94464a77495
$$ -118113 94855 78775 -20541 -32611 -169228 -50978 192228 10872 -61118 194464 -177495
18374B84760a47259b3773j46441M9012c7808n0840j78617B71609l4819c1316R036
$$ 284760 -147259 -23773 -170214 -121202 -37808 -88648 -267265 271609 236790 -31316 -22280
18363b2280m52579f1341k46534C04179j05168a06106n6655j55588A30559b40811
$$ -22280 -474859 -61341 -307875 304179 199011 -106106 -162761 -318349 130559 -240811
18352c4048k44529J00892e0E8875J31483b45414J9405A71185A4K56841q8975b9377
$$ -34048 -278577 -177685 -50 58875 190358 -245414 -226009 171185 14 256855 167880 -29377
18339C552f2712A53930p1452I138e4128k70057A58438C7362a51493A6243g953
$$ 3552 -62712 153930 82478 9138 -54128 -324185 158438 37362 -151493 16243 -7953
18327a57665q7838C206f819n00C37870a46106F6113m240b51750j21921J39120
$$ -157665 -245503 3206 -6819 -7319 337870 -146106 66113 61873 -251750 -373671 -234551
18316b34551a8934n0675k67150B5659A1815cm14078d1904k60484a08589A43657
$$ -234551 -18934 -69609 -336759 25659 11815 -3 -414081 -41904 -302388 -108589 143657
18304D7310a59323k1040C5992h1327C40430c3996B03406I9014m7651K631J42913
$$ 47310 -159323 -180363 35992 -81327 340430 -33996 203406 99014 51363 53994 196907
18293A96907a35911A52218m9551h8838L4120r3096A23859e5031l0472A56339d1272
$$ 196907 -135911 152218 102667 -88838 -54718 -147814 123859 -55031 -85503 156339 -41272
18281c64660C1567e8547J5856j77317p0160J40271k26950a11635C01408c3140
$$ -364660 31567 -58547 -42691 -220008 -290168 -149897 -376847 -111635 301408 -33140
18270b49672A39863N2100b8204A76362C6870f9444p0955A32557b57664O5457e586
$$ -249672 139863 191963 -28204 176362 36870 -69444 -140399 132557 -257664 -192207 -5586
18258a76202j35084a9515k0419B50556d3568m22058b31883d222A67512o6507c12802
$$ -176202 -311286 -19515 -39934 250556 -43568 -465626 -231883 -4222 167512 101005 -312802
18246G4996a31762k4996j2686L8573N0882D8864A0208h8365A76857a05641M2683
$$ 74996 -131762 -156758 -169444 -130871 -79989 48864 10208 -88365 176857 -105641 -62958
18235f2958k8660F8189K20404C5467J04195j0553h1862H8997i0973c3113A31215
$$ -62958 -91618 68189 288593 35467 139662 129109 -81862 88997 -90973 -33113 131215
18223E7568c637k53270H2108A0116a37157e9956C67681e245p769j71555B1822
$$ 57568 -3637 -256907 82108 10116 -137157 -59956 367681 -5245 -13014 -184569 21822
18211a71346g6393I545C995a93895j99281D1692a744j26201K1052F2555a53199
$$ -171346 -76393 9545 3995 -193895 -393176 41692 -1744 -127945 -106893 62555 -153199
18199A08102N4060J6463A094M6713c38411A03132f6274l6957m4830A58418a87948
$$ 108102 162162 178625 1094 47807 -338411 103132 -66274 -103231 -148061 158418 -187948
18187E282M764c1235I6250b0375A07247j0815O8383a94180h144j05760p5857m3132
$$ 5282 10046 -31235 96250 -20375 107247 96432 164815 -194180 -8144 -113904 -189761 -232893
18175b32893j30226h6333o0063b3650n6279j15333g0766B09689I3593j6527b61664
$$ -232893 -363119 -86333 -146396 -23650 -79929 -195262 -70766 209689 93593 77066 -261664
18163C0705J4008a58351B52149L8191D0891f531n0744D11478d4830A43097a63485
$$ 30705 44713 -158351 252149 290340 40891 -6531 -57275 411478 -44830 143097 -163485
18151A32529a08458I3381k5459b28869j1902a16112B5837N175N3198p019d778
$$ 132529 -108458 93381 67922 -228869 -240771 -116112 25837 31012 84210 77191 -4778
18139h2725I8073d48825G801i4352j9778J8039E6661a41881e6875j12103J7065
$$ -82725 98073 -448825 7801 -94352 -114130 -96091 56661 -141881 -56875 -168978 -151913
18128a51913A16527c66025B9080L0565J76716c70644A80631K7367F8411a09372
$$ -151913 116527 -366025 29080 59645 236361 -370644 180631 207998 68411 -109372
18117A8105K17018P7580a96098r8841c0937o1999j33408A48485b18888e2332n8539
$$ 18105 235123 312703 -196098 -294939 -30937 -92936 -226344 148485 -218888 -52332 -110871
18106a10871C4153e54330h1943A89206l8653b8059A32287E2775a58485A02957
$$ -110871 34153 -554330 -81943 189206 150553 -28059 132287 52775 -158485 102957
18095a45745A08503K29591h0621B84629a11033H8484J27842I9320a11236m6031
$$ -145745 108503 338094 -80621 284629 -111033 88484 216326 99320 -111236 -157267
18085a57267H3093b22816C1387c24523E9134b17191I7780R6301f8357b841A01238
$$ -157267 83093 -222816 31387 -324523 59134 -217191 97780 194081 -68357 -2841 101238
18073a43247A03850K2566a69354C146J63484p5384h1218j85971h963k14091m1788
$$ -143247 103850 126416 -169354 3146 166630 91246 -81218 -267189 -8963 -223054 -264842
18062b64842Q3472B1914Q8883N8564a71050B22979i9015q4279c0096A30706k1199
$$ -264842 -181370 21914 110797 169361 -171050 222979 -99015 -183294 -30096 130706 109507
18051A09507a59341B12440q8304i8484I5723M2282a8002n4911D4561K4828Q3588
$$ 109507 -159341 212440 124136 -98484 95723 138005 -18002 -72913 44561 69389 152977
18040A52977a7364M389j40904a8331A1339J68440o2843a26571A05926a06161D02307
$$ 152977 -17364 -12975 -153879 -18331 11339 179779 116936 -126571 105926 -106161 402307
18028a11004K9520n4735A28745g903B24953a10742f659a397j9732m1204A0478
$$ -111004 -81484 -136219 128745 -7903 224953 -110742 -6659 -1397 -21129 -62333 10478
18016h3164j07620A29716a60724H1692J02014Q561O790d9119E3771J8164a05917
$$ -83164 -190784 129716 -160724 81692 183706 192267 199057 -49119 53771 71935 -105917
18004H2541O723a35856a4945k40873O3643A14510N1912g6358m306C466N6315J5112
$$ 82541 89264 -135856 -14945 -255818 -192175 114510 166422 -76358 -80664 3466 59781 74893
17992G4893j470a83888A03748c24470G1013h2942A087J36581h2868B69684D1717
$$ 74893 73423 -183888 103748 -324470 71013 -82942 1087 137668 -82868 269684 41717
17980a39234a9076A45798I587a96247d5605F0472Q5215c4869l10717A24980d1334
$$ -139234 -19076 145798 9587 -196247 -45605 60472 145687 -34869 -345586 124980 -41334
17968a28958k2833c8173J8562O743A9294N5703f0708b9609B9032J02516c7474
$$ -128958 -151791 -38173 -19611 -12868 19294 74997 -60708 -29609 29032 131548 -37474
17956a88330J1963e447j89165K0765D5258P156a31546l774B37592b75153B68720
$$ -188330 -176367 -5447 -194612 -173847 45258 52414 -131546 -135320 237592 -275153 268720
17944A08685f9694I813M8040J327B6671K375c2368B75957c2299m8869J2356A2371
$$ 108685 -69694 9813 57853 59180 26671 29046 -32368 275957 -32299 -81168 -68812 12371
17931I7317a99912A01641i5410F3635a10746b0595a0022l53514B43056p6391o7746
$$ 97317 -199912 101641 -95410 63635 -110746 -20595 -10022 -363536 243056 166665 98919
17920I8919b11518I5775L6150m0680m4609b21842F7808n279g9066A70606B6707
$$ 98919 -211518 95775 131925 91245 46636 -221842 67808 62529 -79066 170606 26707
17908A16117M4949a73991I4774c1295n6244L6591D5315Q7812g4655A41061a34084
$$ 116117 161066 -173991 94774 -31295 -87539 -50948 45315 133127 -74655 141061 -134084
17896A48574N6562c51442N6643D6670h3444C69299a37290c8381A2826a13686C852
$$ 148574 205136 -351442 -294799 46670 -83444 369299 -137290 -38381 12826 -113686 3852
17884a01768j4116c4844C623J78732d75A04166d56990B936b96888e1140A39819
$$ -101768 -115884 -34844 3623 182355 -475 104166 -456990 2936 -296888 -51140 139819
17872A66699o2561J2854O805L8989a44564D5351R2865H278O4105J46b3269E7372
$$ 166699 104138 116992 123797 162786 -144564 45351 138216 8278 72383 72529 -23269 57372
17859e276A17836b52939k31673I7356f2693G5275b10357K5733A11169N5271J83245
$$ -5276 117836 -252939 -484612 97356 -62693 75275 -210357 -184624 111169 166440 349685
17848C49685A31749A5186J22469a05689B10403D6608a40760A46600B1817b34513
$$ 349685 131749 15186 137655 -105689 210403 46608 -140760 146600 21817 -234513
17837c7772B05443a87691F0968j7281J0891g325C54032n2414I209L09724E5253
$$ -37772 205443 -187691 60968 43687 54578 -7325 354032 301618 9209 318933 55253
17825B15759J5190q5697K7772g9535j15041D4894b59617D6150J12940j8534J73275
$$ 215759 230949 145252 173024 -79535 -194576 44894 -259617 46150 159090 140556 313831
17814C13831a56584B04418h0484B60084a90168A89205A1430h9137B31484e3194
$$ 313831 -156584 204418 -80484 260084 -190168 189205 11430 -89137 231484 -53194
17803A08005Q367J39003f1898n8812R111A06119C2047J34411M917g3906A96498
$$ 108005 116372 255375 -61898 -120710 -111599 106119 32047 166458 171375 -73906 196498
17791b16240c6747B8433a50150a8252c191A23891b73955D3048J30393m7524n0584
$$ -216240 -36747 28433 -150150 -18252 -3191 123891 -273955 43048 173441 125917 75333
17780G5333O080d0239B31180a56038r5029A55982a03937F0644c08208I2439a29489
$$ 75333 81413 -40239 231180 -156038 -251067 155982 -103937 60644 -308208 92439 -129489
17768H9818f6730F4871c7242e844k32223A05639a18778C90859A00508a05216A49588
$$ 89818 -66730 64871 -37242 -5844 -238067 105639 -118778 390859 100508 -105216 149588
17756B79900b77079A51064i0483A45926D3583J17156G2079N22672j25781c01300
$$ 279900 -277079 151064 -90483 145926 43583 160739 72079 594751 468970 -301300
17745d894C34994h4975D18480c29275a06126A99043F4901a84984C26644h5623
$$ -4894 334994 -84975 418480 -329275 -106126 199043 64901 -184984 326644 -85623
17734f0154o9992A40263d7698k28172h7083k9066d7329I9780k7052l566f7857
$$ -60154 -130146 140263 -47698 -275870 -87083 -116149 -47329 99780 72728 69162 -67857
17722F8412c1442j84700A27666B1870a16855B29743c83670a21747I0431g9784
$$ 68412 -31442 -216142 127666 21870 -116855 229743 -383670 -121747 90431 -79784
17711A67005G925L0286L95153j60389M3184B6808A2250M4414K58846A06995h4450
$$ 167005 7925 38211 433364 272975 316159 26808 12250 56664 315510 106995 -84450
17699E0917L97384c2788B75596H2295A5650J63728d7787j44679C04963c11182
$$ 50917 448301 -32788 275596 82295 15650 179378 -47787 -192466 304963 -311182
17688B17304d0283k000M291A01194h3740E5257J71032b34123C03571a11660n6662
$$ 217304 -40283 -42283 -37992 101194 -83740 55257 226289 -234123 303571 -111660 -168322
17677a68322B72090o8797j7497o8767L830g769B0141b46593P9572A2700L52139
$$ -168322 272090 203293 185796 117029 120859 -7769 20141 -246593 -167021 12700 364839
17666C64839H2792B0433J3245L29558a63609B22712c6282A30386a06770A37564
$$ 364839 82792 20433 33678 363236 -163609 222712 -36282 130386 -106770 137564
17655C64435A13018f6683A14601K7071o7423B1160J24961a29884j52223H0668
$$ 364435 113018 -66683 114601 141672 74249 21160 146121 -129884 -282107 80668
17644B5620a17789B60376e7833e777A06534J68288F250J44636A2004b1728n0028
$$ 25620 -117789 260376 -57833 -5777 106534 274822 6250 150886 12004 -21728 -71756
17633g1756c3797D29534A92043J12580k5754I9061K10526m6440a89008G9340R4051
$$ -71756 -33797 429534 192043 304623 278869 99061 309587 263147 -189008 79340 173391
17622A73391f774p2032C9626J19548c62200a77163B29548I1020c64658B70083
$$ 173391 -6774 -78806 39626 159174 -362200 -177163 229548 91020 -364658 270083
17611B18054a50785j0086B407a60551A10501B4759J68139A8985K3884j5965A1249
$$ 218054 -150785 -160871 2407 -160551 110501 24759 192898 18985 42869 26904 11249
17599F2119K01185j03934F4090K5122C0802Q1071K9124a94580A29883K2986j3842
$$ 62119 263304 159370 64090 89212 30802 111873 140997 -194580 129883 152869 139027
17588A39027a18770L6814B2340a16775B80803A10903i4594j62981A35510m4733
$$ 139027 -118770 -81956 22340 -116775 280803 110903 -94594 -257575 135510 90777
17578I0777L20840A76685J11282j38855K8481H0755J01685G554K21808M4510j34207
$$ 90777 411617 176685 287967 149112 177593 80755 182440 7554 229362 273872 139665
17567A39665a36942H211a63885I0310K04461H8456J31195e3750m6150A68939J47960
$$ 139665 -136942 8211 -163885 90310 294771 88456 219651 -53750 -99900 168939 316899
17556C16899K78291n472A58830m8983a3224A63478L07774a73805C12132O2837
$$ 316899 595190 589718 158830 109847 -13224 163478 471252 -173805 312132 374969
17546C74969c2254G7313d106D6361K33728E0680L424o785g003C2625h8191C39715
$$ 374969 -32254 77313 -4106 46361 280089 50680 54104 47319 -7003 32625 -88191 339715
17533A76867J25523r260O9330A60339R6897J71797B07117K0037a04136B57782
$$ 176867 302390 293130 362460 160339 257236 429033 207117 227154 -104136 257782
17522i2247E3043K13563j27546L61966C0078N88612J35965A90927L53294K04413
$$ -92247 53043 266606 139060 501026 30078 618690 754655 190927 544221 748634
17512G48634j38120N01453J658O0585l58900Q5362k06500k85687o2438J66463
$$ 748634 610514 1111967 1113625 1174210 815310 900672 694172 408485 346047 512510
17502E12510L80680k91731R0054j4438K93839J4789l6508r9757o8654L04544j48765
$$ 512510 893190 601459 691513 677075 970914 985703 949195 849438 780784 1085328 936563
17491I36563k83276j84472k05434q1983J63776P3148j01327J15031m5580m0153
$$ 936563 653287 468815 263381 181398 345174 418322 316995 432026 386446 346293
17481C46293J6041o8158j28206K83669A00879N65598C32602j52203G4760J72708
$$ 346293 362334 294176 165970 449639 100879 666477 332602 180399 74760 247468
17471B47468J78561j61083O6430b5137C72230M1947p0281m4421J61441m4986A77868
$$ 247468 426029 264946 331376 -25137 372230 414177 343896 299475 460916 415930 177868
17459A89918J5590M3128K05493A41360K42987j45859K26935k22249R3103q8525
$$ 189918 205508 248636 454129 141360 384347 238488 465423 243174 336277 247752
17449B47752K80546j66462j47052L9789K34910j84674Q3051j66930L21474j34572
$$ 247752 528298 361836 214784 254573 489483 304809 387860 220930 542404 407832
17439D07832J62505k29398q4877J77960p2524l7273j54080M34928Q2570k22886
$$ 407832 570337 340939 256062 434022 361498 324225 170145 605073 687643 464757
17429D64757O6634k23638K93401j17101q9219m2888o213K30510J14155k18326
$$ 464757 531391 307753 601154 484053 394834 351946 345733 576243 690398 472072
17419D72072O8659j56512a9168D19348J54646R6980j27988k15381m602M13369
$$ 472072 540731 384219 -19168 419348 573994 670974 542986 327605 323003 736372
17409G36372l44128R8988L00065j44832J50993l32214P4117O0550J25817J8382
$$ 736372 392244 491232 791297 646465 797458 465244 539361 599911 725728 744110
17399G44110k99776M13882k22155k3101P0339k8809B70835K34839b548E47666
$$ 744110 444334 858216 636061 612960 683299 654490 270835 505674 -2548 547666
17388C50857J28360q6230N4695B21354q7854Q7836J61572r2931q4201A02784G279
$$ 350857 479217 392987 447682 221354 133500 221336 382908 289977 205776 102784 7279
17376C74689a05275C48510r3153r1496L58119A54107K27131m4029P2401O8492
$$ 374689 -105275 348510 255357 163861 521980 154107 381238 337209 409610 478102
17366D78102A75416K33374J5002B09390O6043A07718K59636j20220n8253l2855
$$ 478102 175416 408790 423792 209390 275433 107718 367354 247134 188881 156026
17356A56026L94474k73815G4672J60130J59172H5012K23378R6784p1199p6267
$$ 156026 550500 276685 74672 234802 393974 85012 308390 405174 333975 257708
17346B57708D3063a81250A67203L01918l0582A00565L53462k14954d83335G0087
$$ 257708 43063 -181250 167203 469121 438539 100565 454027 239073 -483335 70087
17335A03632J74328R0696j24236K28058r5288J87071r6647A91814M27775j96620
$$ 103632 277960 368656 244420 472478 377190 564261 467614 191814 619589 422969
17325D22969C0556K50323C61R6341K05318J16048R2735B23516K03979A71946K93039
$$ 422969 30556 280879 361 96702 302020 418068 510803 223516 427495 171946 464985
17314D64985j30154Q5769A47656M5188J7299k6568b65999F9772J84810K37872
$$ 464985 334831 420600 147656 192844 210143 183575 -265999 69772 254582 492454
17304D92454j90150j44644K99853J96938C19390o2287j5527K1699E5330L96600
$$ 492454 302304 157660 457513 654451 319390 257103 241576 263275 55330 451930
17294D51930j8642A02216K25130r2586o769k7056D2676L34814n0956A14660K90216
$$ 451930 433288 102216 327346 234760 227991 200935 42676 377490 326534 114660 404876
17283D04876A26925J02189P0985H773N70891B66226j16361F6132J45940J59493
$$ 404876 126925 229114 300099 8773 579664 266226 149865 66132 212072 371565
17273C71565L5121J0591j18400r4636J39665r8016L1822J03044M2486B09644J698
$$ 371565 406686 417277 298877 204241 343906 245890 277712 380756 423242 209644 211342
17262B11342B9449M64052B43388K41649j43891J02846J19986j9296k51084k3318
$$ 211342 29449 493501 243388 485037 341146 443992 563978 544682 293598 270280
17252B70280j25001N75959j43958k48349P6177H5515J96400G7070L70996q7043
$$ 270280 145279 721238 577280 328931 405108 85515 281915 77070 448066 361023
17242C61023o5422L5930A32072i4638D55613A78339M0270J41414j7158l8331Q0873
$$ 361023 295601 331531 132072 -94638 455613 178339 218609 360023 342865 304534 385407
17231C85407O5382M7926R5626B91237n6814o1018K55814p509l4429n6117n5331
$$ 385407 450789 498715 594341 291237 234423 173405 429219 421710 387281 331164 275833
17220B75833K02745o8114j81178K7204L74694j02320j55294K7983j6940P7854
$$ 275833 478578 410464 229286 256490 631184 528864 373570 401553 384613 462467
17210D62467B28483K74337j43533m0429K78195L6263C07977K38722j41398A43824
$$ 462467 228483 502820 359287 318858 597053 633316 307977 546699 405301 143824
17199E09021j74338p4009M08541r7039j85723P2368N8212J72341C13133l1467
$$ 509021 334683 260674 669215 572176 386453 458821 517033 689374 313133 281666
17189B81666k6257M10684B92752J9235J57333o2501N3529l738K82781C47358N7748
$$ 281666 255409 666093 292752 311987 469320 406819 460348 456610 739391 347358 405106
17178D05106J81657K9546B89619M0830P795J9762J89285o2634R792m2340j08854
$$ 405106 586763 616309 289619 330449 338244 358006 547291 484657 494449 452109 343255
17167C43255L85668k69602o5886j60701L53276N1122m9690j05549m2595M7971
$$ 343255 728923 459321 393435 232734 586010 637132 587442 481893 439298 487269
17157D87269j42178K65960o3396j53007K29745k62065K32532k5754K89972M9347
$$ 487269 345091 611051 547655 394648 624393 362328 594860 569106 859078 908425
17147I08425D02735J67313j53495J04835M48996D35182M83235l15806m5152k7099
$$ 908425 402735 570048 416553 521388 970384 435182 918417 602611 557459 530360
17137E30360K5843J8107O7774k48728r8332L77630C31793M94954H836Q01931j38134
$$ 530360 556203 574310 642084 393356 295024 672654 331793 826747 8836 810767 672633
17126F72633n1537N4570R9807J92509m05693J83134Q283k38505J43726k48989
$$ 672633 621096 675666 775473 967982 562289 745423 753706 515201 658927 409938
17116D09938Q7094n256L9308K48981l27806J61764j19825L75190l67527A51860
$$ 409938 497032 491776 531084 780065 452259 614023 494198 869388 501861 151860
17105H10662k11773L70902m59574K24047j69946J45436N237j28086J18693l27520
$$ 810662 598889 969791 510217 734264 564318 709754 714991 586905 705598 378078
17095C78078J32237j88385M38200l34316L23885J7023j00728j85193N1039K25994
$$ 378078 510315 321930 760130 425814 749699 766722 665994 480801 531840 757834
17085G57834j46550J5069N01541m98133K20989p9627k46289J80526N1903K37357
$$ 757834 611284 626353 1127894 629761 850750 771123 524834 705360 757263 994620
17075I94620l17367K77648r6394j31179J48304j96914n8676o4686M82572n12788
$$ 994620 677253 954901 858507 727328 875632 678718 620042 555356 1037928 525140
17065E25140J25751j19381L3337K28137R491o5818O0376J28620m30384J57258
$$ 525140 650891 531510 564847 792984 802475 736657 797033 925653 495269 652527
17055F52527K86618D09104N50103k21955J27383Q315J9621k16788K88446j4540
$$ 652527 939145 409104 959207 737252 864635 872950 892571 675783 964229 949689
17045I49689j61406J52913O0824j07558O7555P0802j50855J16427j18910K12231
$$ 949689 788283 941196 1002020 894462 962017 1032819 881964 998391 879481 1091712
17035A091712l28127L10208q9680k05556J18777o8126R6348J6777L97820n68477
$$ 1091712 763585 1073793 984113 778557 897334 829208 925556 942333 1340153 771676
17025G71676O05909l32783k24749Q0491o8465K75625J53322O8576k16335k0008
$$ 771676 1377585 1044802 820053 900544 832079 1107704 1261026 1329602 1113267 1093259
17015A093259Q5983k34086J21169j47269J32565r6107M6331Q8391l205K52638
$$ 1093259 1179242 945156 1066325 919056 1051621 955514 1001845 1090236 1087031 1339669
17005A339669k86907j21117K43742P2181j08391q2562J04731J75260J16319j26687
$$ 1339669 1052762 931645 1175387 1247568 1139177 1056615 1161346 1336606 1452925 1326238
16995A326238K82832m01082l3411K8344R459Q4606L03618k27288L3459J88481
$$ 1326238 1609070 1207988 1174577 1202921 1212380 1296986 1600604 1373316 1406775 1595256
16985A595256l29393K48628k05236J50474j46584J93434J2191K18531l35146L0870
$$ 1595256 1265863 1514491 1309255 1459729 1313145 1506579 1518770 1737301 1402155 1433025
16975A433025N5681j98292M44862k47914j92476N22196k79240j5453O9378j9861
$$ 1433025 1488706 1290414 1735276 1487362 1294886 1817082 1537842 1522389 1591767 1571906
16965A571906p7745K34660J08665l30269J01819o5478J21022l64069M32175k68081
$$ 1571906 1494161 1728821 1837486 1507217 1609036 1543558 1664580 1300511 1732686 1464605
16955A464605m4509K82989K50762N5593k40060o1581K727Q6986J84136l44544
$$ 1464605 1420096 1703085 1953847 2009440 1769380 1707799 1710526 1797512 1981648 1637104
16945A637104K67886N5896p1206j71130Q7092N9468K24862j09008p5168N4112
$$ 1637104 1904990 1960886 1889680 1718550 1805642 1865110 2089972 1980964 1905796 1959908
16935A959908j44209J96944j99966J15914K41874k00468j34924O19312m35786
$$ 1959908 1815699 2012643 1812677 1928591 2170465 1969997 1835073 2454385 2018599
16926B018599m940K86696K16192j64337Q8117m03352J69243J3042n76r0379L93388
$$ 2018599 2013659 2300355 2516547 2352210 2440327 2036975 2206218 2219260 2218684 2128305 2521693
16915B521693L289J42499k59629o8164J36360K4776J41509o8380J48858k69496
$$ 2521693 2524982 2667481 2407852 2339688 2476048 2500824 2642333 2573953 2722811 2453315
16905B453315J55770l5538n8536M11750j77847O3522Q5202j36407L31738p6775
$$ 2453315 2609085 2573547 2515011 2926761 2748914 2812436 2897638 2761231 3092969 3016194
16895C016194j28709j95092K29250J3810K95624j56329k84588K15904j05772L17061
$$ 3016194 2887485 2692393 2921643 2935453 3231077 3074748 2790160 3006064 2900292 3217353
16885C217353J84511j42748Q2014j14380K23000m1399j59069k28425Q23252n0366
$$ 3217353 3401864 3259116 3341130 3226750 3449750 3408351 3249282 3020857 3844109 3793743
16875C793743l7844J35291o62789M58888o7390N7686k45764L03387L85810m6844
$$ 3793743 3755899 3891190 3228401 3687289 3619899 3677585 3431821 3735208 4121018 4074174
16865D074174O25382o81934L60652j69502r9846M27902l17152J72351K01826l785
$$ 4074174 4699556 4017622 4378274 4208772 4108926 4536828 4219676 4392027 4593853 4590068
16855D590068N26704m46052j00906P0114J6548m7319L86247K10435j19603l456
$$ 4590068 5116772 4670720 4569814 4639928 4656476 4609157 4995404 5205839 5086236 5082780
16845E082780J45455k2319K77554J45078k34102M323M17255l91437N09219J20205
$$ 5082780 5228235 5205916 5483470 5628548 5394446 5398769 5816024 5424587 5933806 6054011
16835F054011k06416L95638k83122N42642J14773l90923K13053m0520N1850J80754
$$ 6054011 5847595 6243233 5960111 6502753 6617526 6226603 6439656 6399136 6450986 6631740
16825F631740J85722K38590N30439l67524O5965K41368L308P4181L80062J60861
$$ 6631740 6817462 7056052 7586491 7218967 7284932 7526300 7529608 7603789 7983851 8144712
16815H144712K18612N4756K33584M2010O466N0592L99232J05926K44723M91162
$$ 8144712 8363324 8418080 8651664 8693674 8700140 8750732 9149964 9255890 9500613 9991775
16805I991775l12874M08132J10608K14420M13216j56768M71992Q0247J87878J41604
$$ 9991775 9678901 10087033 10197641 10412061 10825277 10668509 11140501 11220748 11408626 11550230
16795A1550230K37758L72311P7999L81507N35709j0054M71095J75398K89781M52850
$$ 11550230 11787988 12160299 12238298 12619805 13155514 13145460 13616555 13791953 14081734 14534584
16785A4534584O80534k76556M12451O67461J62376L36572N61068O94940n5414
$$ 14534584 15215118 14938562 15351013 16018474 16180850 16517422 17078490 17773430 17718016
16776A7718016O81833J09073Q05153J77624O45777M75896O54173Q30245N36446
$$ 17718016 18399849 18508922 19314075 19491699 20137476 20613372 21267545 22097790 22634236
16767B2634236L96464Q36466N86672P51833M70858N16313J010376P47349O94205
$$ 22634236 23030700 23867166 24453838 25205671 25676529 26192842 27203218 27950567 28644772
16758B8644772Q49110J304709P70756Q73501J279109J047419J099007R63391J135465
$$ 28644772 29493882 30798591 31569347 32442848 33721957 34769376 35868383 36831774 37967239
16749C7967239J690517J063447J196156J681729J435768J248035J458346J846518
$$ 37967239 39657756 40721203 41917359 43599088 45034856 46282891 47741237 49587755
16741D9587755J784149J357085K430704J783967J737501J956301K400729K014497
$$ 49587755 51371904 52728989 55159693 56943660 58681161 60637462 63038191 65052688
16733F5052688K530242K260214K662073K353761K321019K865242K736362K654715
$$ 65052688 67582930 69843144 72505217 74858978 77179997 80045239 82781601 85436316
16725H5436316K449989K937572K425882K861319K375076K857524K184919K507228
$$ 85436316 87886305 90823877 93249759 96111078 98486154 101343678 103528597 106035825
16717A06035825K667293K000788K073103J600550J822981J250424J334604Q40451
$$ 106035825 108703118 110703906 112777009 114377559 116200540 117450964 118785568 119626019
16709A19626019P79980N77028j46904j78763k27270r03472p87653j449772j421106
$$ 119626019 120405999 120983027 120836123 120657360 120430090 119526618 118738965 117289193 115868087
16700A15868087j870800j863533k274391k024858k330688k964658k247579k942856
$$ 115868087 113997287 112133754 109859363 107834505 105503817 102539159 100291580 97348724
16692I7348724k579820k800975k763738k839916k436678l061586k488483k662147
$$ 97348724 94768904 91967929 89204191 86364275 83927597 80866011 78377528 75715381
16684G5715381k331367k769113k709147j953270k478965k141750k257197k320710
$$ 75715381 73384014 70614901 67905754 65952484 63473519 61331769 59074572 56753862
16676E6753862k138811j603463j802526k009544j326401j762287j503117j768632
$$ 56753862 54615051 53011588 51209062 49199518 47873117 46110830 44607713 42839081
16668D2839081j366636j690595r80318j541590j092240j301265j114317j233926
$$ 42839081 41472445 39781850 38801532 37259942 36167702 34866437 33752120 32518194
16660C2518194j348021p87273o95105p77675r61274j146943j062743j39275j034322
$$ 32518194 31170173 30382900 29687795 28910120 27948846 26801903 25739160 25599885 24565563
16651B4565563q91738n00771n72769n38170j002697j53331q81460l93242n15852
$$ 24565563 23673825 23173054 22600285 22062115 21059418 20906087 20024627 19631385 19115533
16642A9115533o40973l72600m41905l59731m44336l63591r30019J1583o19491
$$ 19115533 18474560 18101960 17660055 17300324 16855988 16492397 15562378 15573961 14954470
16633A4954470l93246j67188l98596k70588k44418m33090k80138k77950m42915
$$ 14954470 14561224 14394036 13995440 13724852 13480434 13047344 12767206 12489256 12046341
16624A2046341k13043k9777n54388r3173k7240q1901m44991j55607l55559l07809
$$ 12046341 11833298 11803521 11249133 11155960 11128720 11046819 10601828 10446221 10090662 9782853
16614I782853j33755j3123o60048J63825j52248q8859k54512n09550j58846q9919
$$ 9782853 9649098 9635975 8975927 9139752 8987504 8898645 8644133 8134583 7975737 7885818
16604G885818Q8742k26273m96936M12950l21547J0332l85476l65553M83904m14845
$$ 7885818 7974560 7748287 7251351 7664301 7342754 7353086 6967610 6602057 7085961 6671116
16594F671116k01148Q3865k79203L7996j40206k67551j44610K02030l3930j74723
$$ 6671116 6469968 6553833 6274630 6312626 6172420 5904869 5760259 5962289 5928359 5753636
16584E753636j98848l2361l84523L86625l18944K7473j72845q5023l07240K94684
$$ 5753636 5554788 5522427 5137904 5524529 5205585 5233058 5060213 4975190 4667950 4962634
16574D962634R4491j93966l12456l18664M18167k1120k99616j58236n2735K16769
$$ 4962634 5057125 4863159 4550703 4232039 4650206 4629086 4329470 4171234 4118499 4335268
16564D335268m1576j00864k05985l52048K52962l96148j07523N11993j85221j90089
$$ 4335268 4293692 4192828 3986843 3634795 3887757 3491609 3384086 3896079 3710858 3520769
16554C520769J70462m47861L67854k48831J8539q2432j09589J68743j91690m4473
$$ 3520769 3691231 3243370 3611224 3362393 3380932 3298500 3188911 3357654 3165964 3121491
16544C121491K21685R9850k98072j13461o403J2850k19769j20495J63371q8408
$$ 3121491 3343176 3443026 3144954 3031493 3025090 3037940 2818171 2697676 2861047 2772639
16534B772639J44249l01486j05669M63354o92667J31753l4720r976k4929R0572
$$ 2772639 2916888 2615402 2509733 2973087 2280420 2412173 2377453 2367477 2342548 2433120
16524B433120J32437n31116M55043k65827J89924o8585k48450K56767r4250l18640
$$ 2433120 2565557 2034441 2489484 2223657 2413581 2344996 2096546 2353313 2259063 1940423
16514A940423n3504L0838J03698J32037l83635J98770j72471K10757M3686j30040
$$ 1940423 1886919 1917757 2021455 2153492 1769857 1968627 1796156 2006913 2050599 1920559
16504A920559k07635N3560L5981J79674q2595j20642L4439K06856k20635j0233
$$ 1920559 1712924 1766484 1802465 1982139 1899544 1778902 1813341 2020197 1799562 1789329
16494A789329n7673k4131L7917J62842r8746l9543j70217j75527k93033P4718
$$ 1789329 1731656 1707525 1745442 1908284 1809538 1769995 1599778 1424251 1131218 1205936
16484A205936P39895m76920K74420l16995M7490r8039K97328J24655k38249k34471
$$ 1205936 1945831 1468911 1743331 1426336 1473826 1375787 1673115 1797770 1559521 1325050
16474A325050k23732M61636j90673j32157J23121J75457J27882j60497k43353
$$ 1325050 1101318 1562954 1372281 1240124 1363245 1538702 1666584 1506087 1262734
16465A262734m3539j55638M47638m43058J82187J85180k84432J91050q7463q9735
$$ 1262734 1219195 1063557 1511195 1068137 1250324 1435504 1151072 1342122 1254659 1164924
16455A164924P506J25784D74685O80814K7417J17923o9529J43789n55656J95308
$$ 1164924 1172430 1298214 474685 1155499 1182916 1300839 1231310 1375099 819443 1014751
16445A014751j20852J57094k5297R7827l02199o0265L64112P4186j37320m6151
$$ 1014751 893899 1050993 1025696 1123523 821324 761059 1125171 1199357 1062037 1015886
16435A015886p6086J25402p4372M8583o9287j9543j79485K37437K5744J7871l09625
$$ 1015886 939800 1065202 990830 1039413 970126 950583 771098 1008535 1034279 1052150 742525
16424G42525M4700J76714l05897K89257j07434P8037K7962J79255q6093M5052
$$ 742525 787225 963939 658042 947299 839865 917902 945864 1125119 1039026 1084078
16414A084078j67956j86438l02250L72626K36296l71519N9159L3180R4585L8266
$$ 1084078 916122 729684 427434 800060 1036356 664837 723996 757176 851761 890027
16404H90027q5604k21419L56971l79770J64447Q7563k47047J13706Q1920l55826
$$ 890027 804423 583004 939975 560205 724652 812215 565168 678874 760794 404968
16394D04968L10129o749j13375Q1057L96483n31418R8682P196j74236K63785l0235
$$ 404968 715097 708348 594973 676030 1072513 541095 639777 646973 472737 736522 706287
16383G06287J49304l01799J04389k52525M04376q0038q9112q0916J33616k79017
$$ 706287 855591 553792 658181 405656 810032 729994 640882 559966 693582 414565
16373D14565L93405k07997q1683l0329J37376J41569r3293K8182j63244J47989
$$ 414565 807970 599973 518290 487961 625337 766906 673613 701795 538551 686540
16363F86540R1013k62139O3556k766K51821k74110J22171j27918m1049J50247
$$ 686540 777553 515414 578970 576204 828025 553915 676086 548168 507119 657366
16353F57366k6322p3173L571k0572L8692j03059r4319J72936j07582j23232J13766
$$ 657366 631044 557871 561442 540870 579562 476503 382184 555120 447538 324306 438072
16342D38072j69658L85614j3232j27703k00760A40460P9077L21997A00142K49863
$$ 438072 268414 654028 640796 513093 312333 140460 219537 541534 100142 350005
16332C50005N9735K18147q8906J5018L50090A99691L46497j46131P1076K10441
$$ 350005 409740 627887 538981 553999 904089 199691 546188 400057 471133 681574
16322F81574l19058J18310B33579R2171K61J84466j4236G0167K73930M1704j0402
$$ 681574 362516 480826 233579 325750 326011 510477 496241 70167 344097 385801 375399
16311C75399j8968j00543K4715p3803J42887J38785k10667q3907J1736J4501K88345
$$ 375399 356431 255888 280603 206800 349687 488472 277805 193898 205634 220135 508480
16300E08480j54580d5060C25402J90675B36116N0462J28262M3861K9603k39518
$$ 508480 353900 -45060 325402 516077 236116 286578 414840 458701 488304 248786
16290B48786J15171j74588K0994Q4900q7459M0657j06190A6243e7576E95529A82736
$$ 248786 363957 189369 210363 295263 207804 248461 142271 16243 -57576 595529 182736
16278A56072L67027j33658a47400B04466K83483K08633k94362j58786H1580J93251
$$ 156072 523099 389441 -147400 204466 487949 696582 402220 243434 81580 274831
16268B74831n7978k4777I5685M26716k57496q1635M3735O4558l3717O2583p1707
$$ 274831 216853 192076 95685 522401 264905 183270 227005 291563 257846 320429 248722
16257B48722K39326A36149O6403J9302J60527I1788J46720a8585C89811J45875
$$ 248722 488048 136149 202552 221854 382381 91788 238508 -18585 389811 535686
16247E35686H6492M5652P3345j2017D4256J69938l2467K43686j6391B5644J83491
$$ 535686 86492 132144 205489 193472 44256 214194 181727 425413 409022 25644 209135
16236B09135O7250e3838E5869J56662P7144j32566b33173B66960n3278a67203
$$ 209135 276385 -53838 55869 212531 289675 157109 -233173 266960 213682 -167203
16225B25349e2550B55301a37556A07171L97239a31147C89770p8203K36153j95997
$$ 225349 -52550 255301 -137556 107171 504410 -131147 389770 311567 547720 351723
16215C51723e216C0395K60273j32289J7852J56236E5104M35683A36945P233m6215
$$ 351723 -5216 30395 290668 158379 176231 332467 55104 490787 136945 144178 97963
16204I7963J940P4641f4531g858j50574L2319D21155H8539J3139d6515D57804
$$ 97963 99903 174544 -64531 -7858 -158432 -126113 421155 88539 101678 -46515 457804
16192B75399H1690K75116F6455K92578L12413k29655a59590B77232A33657L90509
$$ 275399 81690 356806 66455 359033 671446 441791 -159590 277232 133657 524166
16182E24166c7231H0882K42283e8929A57128K54966f4059B86632I0603k2503P1236
$$ 524166 -37231 80882 323165 -58929 157128 412094 -64059 286632 90603 68100 139336
16171A39336j6178B6637K41109N8848r0220a2302D3222a3143B42687A15221a63413
$$ 139336 123158 26637 267746 326594 236374 -12302 43222 -13143 242687 115221 -163413
16159A53491G0155h976D09334n3858A25304C982i4347A38806N454K04357c7838
$$ 153491 70155 -8976 409334 355476 125304 3982 -94347 138806 144260 348617 -37838
16147A40791R4896R7930e8077G2120h1824m4568A96961H6096M2268i6759C43741
$$ 140791 235687 333617 -58077 72120 -81824 -126392 196961 86096 128364 -96759 343741
16135g5713A0279J26892K2824f9708c1773l55284a5038r8735I3648a21220B41085
$$ -75713 10279 137171 159995 -69708 -31773 -387057 -15038 -113773 93648 -121220 241085
16123C31564J34103H8288B4812J38133G1783J98822d04A67923G157K4081a35975
$$ 331564 465667 88288 24812 162945 71783 270605 -404 167923 7157 31238 -135975
16111E5511h2985A98499n8024a59837b399A52789p0861i2560H1178k9571M62688
$$ 55511 -82985 198499 140475 -159837 -2399 152789 81928 -92560 81178 51607 514295
16100E14295A00364J10477i4383a622B81776J05730a57150I0507O8886L17127
$$ 514295 100364 210841 -94383 -1622 281776 387506 -157150 90507 159393 476520
16090D76520B3350b2904C38719g121I1515K81412A62907M1827G0696e3265q4104
$$ 476520 23350 -22904 338719 -7121 91515 372927 162907 204734 70696 -53265 -137369
16079a37369j3350I5698P3597G7683b21289A51063r936b28731A19324J23651a28825
$$ -137369 -150719 95698 169295 77683 -221289 151063 141127 -228731 119324 242975 -128825
16067B7753K24173B2557K2417d3826o4688E8900a7120j89819A48415P9202H2188
$$ 27753 251926 22557 44974 -43826 -108514 58900 -17120 -206939 148415 227617 82188
16055D6377j5337H5J5908J59517a23636P953G6778R7298a11792B78945k458o2045
$$ 46377 31040 85 15993 175510 -123636 -115683 76778 174076 -111792 278945 276487 214442
16043B14442a86417B20833b981B41370J15797g3698B53068k0440f5008b5813p7585
$$ 214442 -186417 220833 -2981 241370 357167 -73698 253068 232628 -65008 -25813 -103398
16032a03398n8559e3261B67399H0619J03476o6955N5019P2654l5810r3395J5914
$$ -103398 -161957 -53261 267399 80619 184095 117140 172159 244813 209003 115608 131522
16021A31522a71551H1331J62449j19068D1502A1227b02358l8012C93624d015l0150
$$ 131522 -171551 81331 243780 124712 41502 11227 -202358 -240370 393624 -4015 -34165
16010c4165E1143b09192H6984a62419J08j85658B7748b37435a095C30646c29457
$$ -34165 51143 -209192 86984 -162419 -162311 -347969 27748 -237435 -1095 330646 -329457
15998a56819B41615B9885R8911f7240A85632L9067c1852B58678e3063k9848b6226
$$ -156819 241615 29885 128796 -67240 185632 224699 -31852 258678 -53063 -82911 -26226
15986B63723L9827a21699A03592b31173G7212K20161a20958E6735J6952J40571
$$ 263723 303550 -121699 103592 -231173 77212 297373 -120958 56735 73687 214258
15976B14258D8038M78517B08502L99478J47115J20259l6415K22854j33589k86535
$$ 214258 48038 526555 208502 607980 755095 875354 838939 1061793 928204 641669
15966F41669J87946k00405k38705G1732a89602A93466q3271N5251b8458F2724
$$ 641669 829615 629210 390505 71732 -189602 193466 110195 165446 -28458 62724
15955i6637K4706r9148B79891C892J20102b2724D304N3759j6584d9506k52930
$$ -96637 -71931 -171079 279891 3892 123994 -22724 4304 58063 41479 -49506 -302436
15944c02436e0275n2712j49144G711L0621h4435A30316J59932j35864B9503b40110
$$ -302436 -50275 -102987 -252131 7711 38332 -84435 130316 290248 154384 29503 -240110
15932d8230k1028B63621h3109A30217O5622a11992C16406a25318d327k6622E2020
$$ -48230 -69258 263621 -83109 130217 195839 -111992 316406 -125318 -4327 -30949 52020
15920a0882j16959A45712a08055m9092B20779g3031G1697a21480A12708R3214
$$ -10882 -127841 145712 -108055 -157147 220779 -73031 71697 -121480 112708 205922
15910B05922I381M2761A5348a38067j46873A18857e3054G0121b6076j2745m4803
$$ 205922 9381 52142 15348 -138067 -284940 118857 -53054 70121 -26076 -38821 -83624
15899h3624b8432G6301o892K9315J92252A7154b22719A03875b93220k9485A86342
$$ -83624 -28432 76301 69409 98724 290976 17154 -222719 103875 -293220 -322705 186342
15887b01742i7171b8171A64271c29139b0100C8338h2197j529J5229A15416j6644
$$ -201742 -97171 -28171 164271 -329139 -20100 38338 -82197 -83726 -68497 115416 98772
15876I8772r457J36335G3130J69244a31971J2009A42559O578c01723f5007F5112
$$ 98772 89315 225650 73130 242374 -131971 -119962 142559 149137 -301723 -65007 65112
15864H9553b49242g4059k6583k3944D1160b45089J18119L3655L3933A74010g8151
$$ 89553 -249242 -74059 -100642 -124586 41160 -245089 -126970 -93315 -59382 174010 -78151
15852B82637a95226A07235E213f1716A89592b03914N6465O4556j98216A60526
$$ 282637 -195226 107235 5213 -61716 189592 -203914 -147449 -82893 -281109 160526
15841B9533g4745B35888D0654J61006c3699k07398J10726C97970g5006P033A21816
$$ 29533 -74745 235888 40654 201660 -33699 -241097 -130371 397970 -75006 -67973 121816
15829a2898k042k81979D8432b89884i3978B49088B9638I393b78378D7098P0849
$$ -12898 -14940 -296919 48432 -289884 -93978 249088 29638 9393 -278378 47098 117947
15818A17947b2855r9C8724b59544A02169Q7859D3001L9597a00109d3696F5048
$$ 117947 -22855 -22954 38724 -259544 102169 190028 43001 82598 -100109 -43696 65048
15806f3838H4376b945k19683N0823k1557I5415b68644j73910B01944g5041I538
$$ -63838 84376 -2945 -222628 -171805 -193362 95415 -268644 -442554 201944 -75041 9538
15794b7291k95315A7057c36452b5730j38569A66859L6479r7419a25804D1221J55293
$$ -27291 -322606 17057 -336452 -25730 -164299 166859 203338 105919 -125804 41221 196514
15783A96514A0803K0892A5626b08994j8048A75201a44425F4295f0126o1234D66907
$$ 196514 10803 31695 15626 -208994 -227042 175201 -144425 64295 -60126 -121360 466907
15771G5479b39575i6512k43137B30700q9923E7477J46901a2468A28650a08057
$$ 75479 -239575 -96512 -339649 230700 140777 57477 204378 -12468 128650 -108057
15760C11857B7510J84772a90579D13305a6813c960A24496b11355f6989l3777A67047
$$ 311857 27510 212282 -190579 413305 -16813 -3960 124496 -211355 -66989 -100766 167047
15748f4977I8455a92391G0448L92936c11174a5293j73751h8040C25122A54418
$$ -64977 98455 -192391 70448 463384 -311174 -15293 -189044 -88040 325122 154418
15737h7509c8278j96039F25015d8733A56148J59234F7960C219K31522h1771j72247
$$ -87509 -38278 -234317 625015 -48733 156148 315382 67960 3219 234741 -81771 -254018
15726b54018n5239D43663A05089i7518r7932C12516f2167m59453A34265l1124
$$ -254018 -309257 443663 105089 -97518 -195450 312516 -62167 -521620 134265 103141
15716A03141k2740a24307B22031o2234j2009a66614B7537a55531o0939A01642
$$ 103141 80401 -124307 222031 159797 147788 -166614 27537 -155531 -216470 101642
15705a74752l4162B63745e117j20211j13236I1005b56545k04756B53516e3579
$$ -174752 -208914 263745 -5117 -125328 -238564 91005 -256545 -461301 253516 -53579
15694b67305J15366k5804a5445A90577J3155E6206a50282C51848b4763j9560A40246
$$ -267305 -151939 -177743 -15445 190577 203732 56206 -150282 351848 -24763 -44323 140246
15682A85709b42016B01539b61099L692H899N0690b8462k35708B1923b07341A69594
$$ 185709 -242016 201539 -261099 -257407 8899 59589 -28462 -264170 21923 -207341 169594
15670I5672K0785b11201B8986P2742a86737e5452o4687b637m3768k0550I4357
$$ 95672 116457 -211201 28986 101728 -186737 -55452 -120139 -2637 -46405 -66955 94357
15658c2087D9128O8303a59617K9363L7666d3677j86768A19960a42202A27778b3671
$$ -32087 49128 117431 -159617 -130254 -92588 -43677 -230445 119960 -142202 127778 -23671
15646A29048o1195a58056G4511J45565d01662L8421g4211m28889K51022B16526
$$ 129048 67853 -158056 74511 220076 -401662 -363241 -74211 -503100 -252078 216526
15635c546A09760J7741J2699n3639a38859j37986B81667b85440N8642A32582J8153
$$ -3546 109760 127501 140200 86561 -138859 -276845 281667 -285440 -226798 132582 150735
15624A50735b3738H1667p624B2242J73585A4904i4546k48303A26270f4332i686
$$ 150735 -23738 81667 74043 22242 195827 14904 -94546 -342849 126270 -64332 -9686
15612a92358A0112J23278O9066B3063J26821b2862j116j53266L1537j28754G1828
$$ -192358 10112 133390 202456 23063 149884 -22862 -23978 -177244 -145707 -274461 71828
15600G14M03736a29692D8340a55801k27559J60233A2836g5754j26046C1863K26260
$$ 714 404450 -129692 48340 -155801 -383360 -223127 12836 -75754 -201800 31863 258123
15589B58123b44137P4087A41936D3274J55137j32i445F9810K488Q9766a15698
$$ 258123 -244137 -170050 141936 43274 198411 198279 -9445 69810 72298 162064 -115698
15577E838d6359A04579k8556a08844B32442b3560A1692J00621L0549b18555C39529
$$ 5838 -46359 104579 76023 -108844 232442 -23560 11692 112313 142862 -218555 339529
15565E5181M68463d8152C23115c0637j20783M9895D00959D7162a60204A00018
$$ 55181 523644 -48152 323115 -30637 -151420 -101525 400959 47162 -160204 100018
15554i7664p1076A1841K99138A38062b10005A50655i6405j2871B1945K3576a25760
$$ -97664 -168740 11841 310979 138062 -210005 150655 -96405 -109276 21945 45521 -125760
15542a09555c8908n6493r2700o0593B3189r1L5149b22996h1640G0421J74299m9353
$$ -109555 -38908 -95401 -188101 -248694 23189 23098 58247 -222996 -81640 70421 244720 195367
15530A95367a28207F9237K7732B8375c5735B29760p3144m1115a24667r2615G0878
$$ 195367 -128207 69237 96969 28375 -35735 229760 156616 115501 -124667 -217282 70878
15518A3962P2154j1679B7294J13417o7382Q4094b73105B44792l1656A00031L5494
$$ 13962 86116 74437 27294 140711 73329 157423 -273105 244792 213136 100031 135525
15507A35525e9671R04A35771N8781J31454J29554j9110E6263J43245R2288f4146
$$ 135525 -59671 -58767 135771 194552 326006 455560 436450 56263 199508 291796 -64146
15495C13764A8761N9302L88893C8222J90010D8555i1405E0509e4307D36364j67380
$$ 313764 18761 78063 466956 38222 228232 48555 -91405 50509 -54307 436364 268984
15484B68984A28245K89685e4922A92433n0995c631k66290D83127k33066b63283
$$ 268984 128245 417930 -54922 192433 141438 -3631 -269921 483127 250061 -263283
15473A49515J20010a93881h7454n6120C63712A63709e147k34477J18496B46263
$$ 149515 269525 -193881 -87454 -143574 363712 163709 -5147 -239624 -121128 246263
15462C5070L19929P4766p0132O3581K66007j16343B38451N94532I7140N1446m1317
$$ 35070 354999 429765 359633 423214 689221 572878 238451 832983 97140 148586 107269
15451A07269K6474O6019n5976a8092C04262A10769a27179I4528c3993n799C5886
$$ 107269 133743 199762 143786 -18092 304262 110769 -127179 94528 -33993 -39792 35886
15439B07072a68450A04009M7716d3697A51905G3639L4694R9905n6538M2248K01538
$$ 207072 -168450 104009 151725 -43697 151905 73639 108333 208238 151700 193948 395486
15428C95486p0729N71990K18438k08902o6640L8124C23402g1994D69156k24592
$$ 395486 324757 896747 1115185 906283 839643 877767 323402 -71994 469156 244564
15418B44564p3241p2353R8277G1848B2544a8989B27827g4734a0901E6942K65757
$$ 244564 171323 98970 197247 71848 22544 -18989 227827 -74734 -10901 56942 322699
15407C22699A35788a12099j93655C23329H2297J36706m3340c2723B31981b24208
$$ 322699 135788 -112099 -305754 323329 82297 219003 175663 -32723 231981 -224208
15396B48357d102j59895B78296j31138a33068A5398b41908e393F337J28934g967
$$ 248357 -4102 -163997 278296 147158 -133068 15398 -241908 -5393 6337 135271 -7967
15384b21794G3643L56769a78088A01009M67773A63086f7812q7861M5845B15875
$$ -221794 73643 430412 -178088 101009 568782 163086 -67812 -155673 -109828 215875
15373B71468a04552B9718K00487b32757A73157c04189A46140a4632C07607n6590
$$ 271468 -104552 29718 230205 -232757 173157 -304189 146140 -14632 307607 251017
15363B51017A7984b90009n2355J67511B41169A01135K40484j20606J38633j34603
$$ 251017 17984 -290009 -342364 -174853 241169 101135 341619 221013 359646 225043
15353B25043b68301C82813A24395R8549j2026l3465D3355J80600p9137N0555r1732
$$ 225043 -268301 382813 124395 222944 210918 177453 43355 223955 144818 195373 103641
15342A03641O1416c52C17678B828M7255e197A58973N3918J74088q2081A50894
$$ 103641 165057 -352 317678 2828 50083 -5197 158973 212891 386979 304898 150894
15330B85850j33428L10966B26675J87456j54879K33389k09469N0629N0652I2841
$$ 285850 152422 463388 226675 414131 259252 492641 283172 333801 384453 92841
15319a55196A94060J28973M4153H0149O7305J79824C4287M14902o9856k9883j37801
$$ -155196 194060 323033 367186 80149 147454 327278 34287 449189 379333 349450 211649
15308B11649g4479I8862P6814g3734A82452k6909M9040d1363B40490Q7814m4139
$$ 211649 -74479 98862 175676 -73734 182452 155543 204583 -41363 240490 328304 284165
15297B84165g5999A95797J23474L8161f5137A04570j0430b38504A67090E1530
$$ 284165 -75999 195797 319271 357432 -65137 104570 94140 -238504 167090 51530
15286B58634G2232L6817a50098G0298b12747A93887q5979J48972A13680q710J63788
$$ 258634 72232 109049 -150098 70298 -212747 193887 107908 256880 113680 104970 268758
15275B68758b14594N4569C29420I9260h5497A08508C9614K10063G1117K34866
$$ 268758 -214594 -160025 329420 99260 -85497 108508 39614 249677 71117 305983
15265C05983I4430J39382n886m3415J70146a97047M4133H510i1972B59817c65265
$$ 305983 94430 233812 227926 184511 354657 -197047 -152914 8510 -91972 259817 -365265
15253g9078j21996n6095A48280J64282j31969I706b44041A80830K8821a20902
$$ -79078 -201074 -257169 148280 312562 180593 9706 -244041 180830 209651 -120902
15242B04384a75270e2085K5236C59308a36159C5317J77092k4780r672B2034O4406
$$ 204384 -175270 -52085 -26849 359308 -136159 35317 212409 187629 177957 22034 86440
15231H6440m501M11448j74018J39497L78006O47031Q9190j14826J23730m61045
$$ 86440 81939 493387 319369 458866 836872 1483903 1573093 1458267 1581997 1120952
15221A120952E47029J65259k51985k04294b333j20930c9507B41361A16347P3074
$$ 1120952 547029 712288 460303 256009 -2333 -123263 -39507 241361 116347 189421
15211A89421a37791B53718H3069a1135B65994A04304j1826B2766b564k062A14801
$$ 189421 -137791 253718 83069 -11135 265994 104304 92478 22766 -2564 -4626 114801
15199b0478A79129a6125B59260A876h4422G6419K82567j18202B588K19671G3961
$$ -20478 179129 -16125 259260 1876 -84422 76419 358986 240784 2588 222259 73961
15187D5535L85628B09990a1445A4492L17178A05439A6537J54718P5638a38500
$$ 45535 431163 209990 -11445 14492 331670 105439 16537 171255 246893 -138500
15176A3791g1092j19777C03485A14485L0339b22487A48884a05967G7791d1039
$$ 13791 -71092 -190869 303485 114485 144824 -222487 148884 -105967 77791 -41039
15165A099K817J97399F0841i1768K5238G1210P8050o3568b04061A41391b6979
$$ 1099 3916 201315 60841 -91768 -66530 71210 149260 85692 -204061 141391 -26979
15153A30252K520J53264a43977C85872F6249A5157N1540J41669J3137f851F3034
$$ 130252 132772 286036 -143977 385872 66249 15157 66697 208366 221503 -6851 63034
15141A44276a69459A14046i6148E5762L040h1923C87003a09932A15919d178E1788
$$ 144276 -169459 114046 -96148 55762 58802 -81923 387003 -109932 115919 -4178 51788
15129A54917J58829j36363A9544P4064J55285a36987G9620J183K54772h2691A9555
$$ 154917 313746 177383 19544 93608 248893 -136987 79620 80803 335575 -82691 19555
15117B79266j8209j8964P984M094r9711a97602A89555G3979K82925A64095A7720
$$ 279266 261057 242093 250077 254171 154460 -197602 189555 73979 356904 164095 17720
15105A04138K56302k3871r0785J40606j31838e7806H0632K71980B2182J59771
$$ 104138 360440 336569 245784 386390 254552 -57806 80632 352612 22182 181953
15095A81953q5453b04005B17884E9699j0183M1460J56125O8537B4849K08352C8924
$$ 181953 96500 -204005 217884 59699 49516 90976 247101 315638 24849 233201 38924
15083A97426J5948e6634C02016j31973a17060C71122a05380A58272l3460F0537
$$ 197426 213374 -56634 302016 170043 -117060 371122 -105380 158272 124812 60537
15072G409a49221E0705K12575G1285h4299B81339n0199J04333C8152K67602p2107
$$ 7409 -149221 50705 263280 71285 -84299 281339 231140 335473 38152 305754 233647
15061B33647k9828a50518A71362R4a12207A45519M187R7602J14269A21070B0004
$$ 233647 203819 -150518 171362 171456 -112207 145519 149706 247308 361577 121070 20004
15049C22820I3769l1536R3687J54672L4686B8955K62707A00082J68336r2247l6466
$$ 322820 93769 62233 155920 310592 345278 28955 291662 100082 268418 176171 139705
15038A39705J30702A01670P7552o4962J55239K83748k66955Q5196H355M06783
$$ 139705 270407 101670 179222 114260 269499 553247 286292 371488 8355 415138
15028D15138p3493L41205l10116L11608M3430B18939M53925k30867M8643k40539
$$ 415138 341645 682850 372734 684342 727772 218939 672864 441997 490640 250101
15018B50101R8197M66881l01055p2770L92551j27135j05003q1791P3945J17751
$$ 250101 348298 815179 514124 441354 833905 706770 601767 519976 593921 711672
15008G11672J40933p5358B37641K86070k4498J37227k05295J34805J65742G8279
$$ 711672 852605 777247 237641 523711 499213 636440 431145 565950 731692 78279
14997A49153J7595K85090p191A56310K46645J74376r8260k09083K924K41578j0751
$$ 149153 166748 451838 444647 156310 402955 577331 479071 269988 272912 514490 503739
14986E03739j69911O6312l1626J91409M6635j19833j40729J02834I8245L61030
$$ 503739 333828 400140 368514 559923 606558 486725 345996 448830 98245 459275
14976D59275M3107J29586K7688l04154J26092j25309j5571L15185k10450L95559
$$ 459275 502382 631968 659656 355502 481594 356285 340714 655899 445449 841008
14966H41008K19849l51590k8489j35870q8523K04859N6877r3582p8220L1879j21333
$$ 841008 1060857 709267 680778 544908 456385 661244 718121 624539 546319 578198 456865
14955D56865k23347o2850J90228N1660k1503J97950A82814J58634J30886J59307
$$ 456865 233518 170668 360896 412556 391053 589003 182814 341448 472334 631641
14945F31641q0459A99216N42032H7301L49697B08876M23753j72361J16482j64645
$$ 631641 551182 199216 741248 87301 436998 208876 632629 460268 576750 412105
14935D12105p8698O2578J18268K14859j79102k02000J22276o1850J06579o0512
$$ 412105 333407 395985 514253 729112 550010 348010 470286 408436 515015 454503
14925D54503q5400k9864L60055j88799p71P2681j54009K02511j6398K21706J45598
$$ 454503 369103 339239 699294 510495 509724 582405 428396 630907 614509 836215 981813
14914I81813L94705k46081Q03042m14176j48122M34073j61566j27258Q8539k58319
$$ 981813 1376518 1130437 1933479 1519303 1371181 1805254 1643688 1516430 1604969 1346650
14904A346650M01358N82356j02238J02492n18532q3703l45330n002m35969j1167
$$ 1346650 1748008 2330364 2228126 2330618 1812086 1728383 1383053 1378051 942082 930915
14894I30915l44258J48341l06278J21437k60066K34141m7418J4461l8911j77395
$$ 930915 586657 734998 428720 550157 290091 524232 476814 491275 452364 274969
14884B74969L23513j6632k09466n5878m9052K32101M3208j67854K09293M1343
$$ 274969 598482 581850 372384 316506 267454 499555 542763 374909 584202 625545
14874F25545j94452K66333q1271R5081j21953P0548M31334k25530M7916k18894
$$ 625545 431093 697426 616155 711236 589283 659831 1091165 865635 913551 694657
14864F94657O4655j30628j35371M6271j13893J78040j52814J50286k81792L93960
$$ 694657 759312 628684 493313 539584 425691 603731 450917 601203 319411 713371
14854G13371l5176K44020k79208N0564j30182J58120J98892m51531R8909q8787
$$ 713371 678195 922215 643007 693571 563389 721509 920401 468870 567779 478992
14844D78992r9032J15953q0861k3509K2092L1848j58309K07289J39466A02955
$$ 478992 379960 495913 415052 391543 413635 445483 287174 494463 633929 102955
14833G34162k01766J48996L64864k36764q7052M01734r2265L90371n46592L00293
$$ 734162 532396 681392 1046256 809492 722440 1124174 1031909 1422280 875688 1175981
14823A175981m82817J91764J11209J6977D15086K60146N7503C57334o140K31480
$$ 1175981 693164 884928 996137 1013114 415086 675232 732735 357334 351194 582674
14813E82674O0703J26423Q480j54081K2980K77693m39337B12224N05002R3253
$$ 582674 643377 769800 778280 624199 647179 924872 485535 212224 717226 810479
14803H10479K35419j62029k96849K91025J51863k67448k45329K71350j14104k36576
$$ 810479 1045898 883869 587020 878045 1029908 762460 517131 788481 674377 437801
14793D37801J10764M11074l48661M57312l33231M6119j21372j898k2161k67568
$$ 437801 548565 959639 610978 1068290 735059 781178 659806 657908 635747 368179
14783C68179K79088q1963L40090B15792O62158k24066k89882J11205k8327K81783
$$ 368179 647267 565304 905394 215792 877950 653884 364002 475207 446880 728663
14773G28663L9551K00692k61998j00966J44374j54223N20697o6718k67115j96153
$$ 728663 768214 968906 706908 605942 750316 596093 1116790 1050072 782957 586804
14763E86804L63286p5619J89375j97629O3395K2521l19206K28194j05212J53030
$$ 586804 950090 874471 1063846 866217 929612 952133 632927 861121 755909 908939
14753I08939m05006L701Q7974J9394k37528L84859B44577L05060J51712j48067
$$ 908939 503933 507634 595608 615002 377474 762333 244577 549637 701349 553282
14743E53282j37324M2793J97069K2793j39182L24234j97874k50201J05492r836
$$ 553282 415958 458751 655820 678613 539431 863665 665791 415590 521082 511246
14733E11246K45228L27042n20709L69472l19579J03525J02472l17043K82308R0171
$$ 511246 756474 1083516 562807 932279 612700 716225 818697 501654 783962 874133
14723H74133k23051K00495J58456k24156J90379Q4656q0272L21219k24867M31675
$$ 874133 651082 851577 1010033 785877 976256 1060912 980640 1301859 1076992 1508667
14713A508667J9991K83459l46754j5092j48595l90446J41779q6488k01437K05396
$$ 1508667 1528658 1812117 1465363 1450271 1301676 911230 1053009 966521 765084 970480
14703I70480j71409J79865k37591J72096m1500M6126Q315K29497m32047L94256
$$ 970480 799071 978936 741345 913441 871941 918067 926382 1155879 723832 1118088
14693A118088k03409J35608R317K66334N0846k704L01849L82772q4806n07530
$$ 1118088 914679 1050287 1059604 1325938 1376784 1374080 1675929 2058701 1973895 1466365
14683A466365j8804m75067L00004j11008k69091Q7727K2495l45197M03111J66493
$$ 1466365 1447561 972494 1272498 1161490 892399 980126 1002621 657424 1060535 1227028
14673A227028n9083j20613J00975L7460l6383l58020M52993k94825R8062p8326
$$ 1227028 1167945 1047332 1148307 1185767 1149384 791364 1244357 949532 1047594 969268
14663I69268p2897l4008l0982L41393n3005j31692L7946j54821K8045k1535k40492
$$ 969268 896371 862363 831381 1172774 1119769 988077 1026023 871202 899247 877712 637220
14652F37220L51332N2965l6190k13288K11952K23423j50752k6663m38890N68037
$$ 637220 988552 1041517 1005327 792039 1003991 1227414 1076662 1049999 611109 1179146
14642A179146K40716l24386k60338M94214k69089N41580j23899k42731K43425
$$ 1179146 1419862 1095476 835138 1329352 1060263 1601843 1477944 1235213 1478638
14633A478638n36893N16993k39742k15233J32761n3246L03434l85718K88054j02213
$$ 1478638 941745 1458738 1218996 1003763 1136524 1083278 1386712 1000994 1289048 1186835
14623A186835J89936l23829J27433K30967k09653K5604n066l59893N69959l24566
$$ 1186835 1376771 1052942 1180375 1411342 1201689 1227293 1222227 862334 1432293 1107727
14613A107727N21723m64920J5222N73791m44159l4459L37987m07283J12188P652
$$ 1107727 1629450 1164530 1179752 1753543 1309384 1274925 1612912 1205629 1317817 1325469
14603A325469L04370j8299l58237k65442L99944j19006J10020o5173K35226J64738
$$ 1325469 1629839 1611540 1253303 987861 1387805 1268799 1378819 1313646 1548872 1713610
14593A713610k3912j996j67072j6200j47806J38721k72055O05527j54478l300
$$ 1713610 1689698 1687702 1520630 1504430 1356624 1495345 1223290 1828817 1674339 1671039
14583A671039o8085J07606L2853r6213J61598N6167k20638L3098k7619n195J38644
$$ 1671039 1602954 1710560 1743413 1647200 1808798 1864965 1644327 1677425 1649806 1644611 1783255
14572A783255k29514M05668l95440N19273l44978k21823K34204j09130J87946
$$ 1783255 1553741 1959409 1563969 2083242 1738264 1516441 1750645 1641515 1829461
14563A829461K32307l38898L61251o2072J91112k27991J08170j45502M71670J51852
$$ 1829461 2061768 1722870 2084121 2022049 2213161 1985170 2093340 1947838 2419508 2571360
14553B571360l92972j69226M41881k96005M00445J52487p9773L06077j88801j04054
$$ 2571360 2178388 2009162 2451043 2155038 2555483 2707970 2628197 2934274 2745473 2641419
14543B641419N88221K20582o2207K9226O40465l5418O52030Q89830J261437J841251
$$ 2641419 3229640 3450222 3388015 3417241 4057706 4022288 4674318 5564148 6825585 8666836
14533H666836L709819O393080J1736726O241459j6743320r206724l675248k094067
$$ 8666836 12376655 18769735 30506461 36747920 20004600 10797876 7122628 5028561
14525E028561j353431k78346N0692N96989R79225l58784j429914l50259k15095
$$ 5028561 3675130 3396784 3447476 4044465 5023690 4664906 3234992 2884733 2669638
14516B669638j25467j06926n9022r8070J07260l17674J90202j18010L21009j79203
$$ 2669638 2544171 2437245 2378223 2280153 2387413 2069739 2259941 2141931 2462940 2283737
14506B283737Q6738J31333r4979k11844L49487J34504k53256R4826L6901K80481
$$ 2283737 2370475 2501808 2406829 2194985 2544472 2678976 2425720 2520546 2557447 2837928
14496B837928k89813j3671R7720M13098k48480M4141J51496n5170P1936L0909
$$ 2837928 2548115 2534444 2632164 3045262 2796782 2840923 2992419 2937249 3009185 3040094
14486C040094j59747O90686p04708J01208L5590J11566Q0033l2467J60437j21137
$$ 3040094 2880347 3571033 2866325 2967533 3003123 3114689 3194722 3162255 3322692 3201555
14476C201555L33040p7898J0650J2696K8986Q5029K1077L122J96733m67642K20457
$$ 3201555 3534595 3456697 3467347 3480043 3509029 3594058 3615135 3618257 3814990 3347348 3567805
14465C567805j11741K62002P04605n05244J77700o2472K6082j13498K49844K76826
$$ 3567805 3456064 3718066 4422671 3917427 4095127 4032655 4058737 3945239 4195083 4471909
14455D471909k38775K27137J24783P4195j82941o5332J03305K07246k39732K06301
$$ 4471909 4233134 4460271 4585054 4659249 4476308 4410976 4514281 4721527 4481795 4688096
14445D688096l6942J16268K64863j28781l6910M6352L36753p2509k23106L46008
$$ 4688096 4651154 4767422 5032285 4903504 4866594 4912946 5249699 5177190 4954084 5300092
14435E300092L3994K90729k74980J75557j63263N30933j89960K08687K72394m26802
$$ 5300092 5334086 5624815 5349835 5525392 5362129 5893062 5703102 5911789 6184183 5757381
14425E757381K35200K70750P1344k7699N5489n1563L62730k48815N60005m6587
$$ 5757381 5992581 6263331 6334675 6306976 6362465 6310902 6673632 6424817 6984822 6938235
14415F938235n4584J21652j00485M28222J54730J26869P0359p428L21407M80235
$$ 6938235 6883651 7005303 6904818 7333040 7487770 7614639 7684998 7677570 7998977 8479212
14405H479212k95218J91311L0763p8077r9732K96972M13054j10821K218L71264
$$ 8479212 8183994 8375305 8406068 8327991 8228259 8525231 8938285 8827464 8829682 9200946
14395I200946o0352j98337N46780L76599J09182K7365N27586Q9920k79271J62726
$$ 9200946 9140594 8942257 9489037 9865636 9974818 10002183 10529769 10619689 10340418 10503144
14385A0503144M301N991K24804J73268L29866k5776J86913J14887M40929m3750
$$ 10503144 10507445 10513436 10738240 10911508 11241374 11215598 11402511 11517398 11958327 11914577
14375A1914577P63298N1852L50393J88210J07594K37429K83610j7873O55149N29607
$$ 11914577 12677875 12729727 13080120 13268330 13375924 13613353 13896963 13879090 14534239 15063846
14365A5063846K97472J62579J29377J24537N76388j87991K36748L78997O36447
$$ 15063846 15361318 15523897 15653274 15777811 16354199 16166208 16402956 16781953 17418400
14356A7418400P0008J45692J162213L36872J56699N79122L94484L40161J39679
$$ 17418400 17488408 17634100 18796313 19133185 19289884 19869006 20263490 20603651 20743330
14347B0743330N04350K73575Q90016L89139M12393M72593Q00286J09155N47683
$$ 20743330 21247680 21521255 22411271 22800410 23212803 23685396 24485682 24594837 25142520
14338B5142520P62142O22579N55661J288602L08965O12715O81976J130949N09949
$$ 25142520 25904662 26527241 27082902 28371504 28680469 29293184 29975160 31106109 31616058
14329C1616058R12129R92460P72979P25327R81260J248147J175817O13028J344049
$$ 31616058 32528187 33520647 34293626 35018953 36000213 37248360 38424177 39037205 40381254
14320D0381254J350051R91381J651734J552107J178959J739794J371782J707289
$$ 40381254 41731305 42722686 44374420 45926527 47105486 48845280 50217062 51924351
14312E1924351J479287J637666K171981K250985J665700K389269K413830K699767
$$ 51924351 53403638 55041304 57213285 59464270 61129970 63519239 65933069 68632836
14304F8632836K239277K862291K754787K724566L041812L159622L160348M163486
$$ 68632836 70872113 73734404 76489191 79213757 82255569 85415191 88575539 92739025
14296I2739025L674629M254333M333667M553436M546753N663981N123079O233597
$$ 92739025 96413654 100667987 105001654 109555090 114101843 119765824 124888903 131122500
14288A31122500O154973O506170O582414P287521P841088Q359070R046938Q933126
$$ 131122500 137277473 143783643 150366057 157653578 165494666 173853736 182900674 191833800
14280A91833800J0174568J0434665J0950048J1715118J2156626J2798426J3390340
$$ 191833800 202008368 212443033 223393081 235108199 247264825 260063251 273453591
14273B73453591J4174584J4411573J4573450J4337313J4922037J4836299J4362784
$$ 273453591 287628175 302039748 316613198 330950511 345872548 360708847 375071631
14266C75071631J3093172J2155002J1081753J1434007J0187735Q963503Q405900
$$ 375071631 388164803 400319805 411401558 422835565 433023300 441986803 450392703
14259D50392703P885607O752091K768821J137195J440134m08950q065185o919313
$$ 450392703 458278310 465030401 467799222 468936417 470376551 469967601 461902416 454983103
14251D54983103q734892j1436172j0076369j2840222j4211928j3698868j4588943
$$ 454983103 446248211 434812039 424735670 411895448 397683520 383984652 369395709
14244C69395709j5122775j3890654j4764316j4711572j3956008j3141993j3353985
$$ 369395709 354272934 340382280 325617964 310906392 296950384 283808391 270454406
14237B70454406j2659543j1877996j1585630j0975599j1253062j0443446r369874
$$ 270454406 257794863 245916867 234331237 223355638 212102576 201659130 192289256
14230A92289256r893900q854903q794870q430293p634443p070137o492969o241777
$$ 192289256 182395356 173540453 164745583 156315290 148680847 141610710 135117741 128875964
14222A28875964n399468n757238n405874m726978m585379m274398l919409l534968
$$ 128875964 123476496 117719258 112313384 107586406 103001027 98726629 94807220 91272252
14214I1272252l937087l389075l132088l105603k899941k671388k857808k361692
$$ 91272252 87335165 83946090 80814002 77708399 74808458 72137070 69279262 66917570
14206F6917570k525688k275305j505441k344470k024883j642967j756289j551151
$$ 66917570 64391882 62116577 60611136 58266666 56241783 54598816 52842527 51291376
14198E1291376j331429j468891j665594j415221j326562r16997r34991j325729
$$ 51291376 49959947 48491056 46825462 45410241 44083679 43166682 42231691 40905962
14190D0905962j407223j390537n93404j154561j067955o00037j055838r25246
$$ 40905962 39498739 38108202 37514798 36360237 35292282 34692245 33636407 32711161
14182C2711161r75281m03459j229239p42294n89693m88632j028687n56148o83988
$$ 32711161 31735880 31332421 30103182 29360888 28771195 28282563 27253876 26697728 26013740
14173B6013740l09702o72695o15869n85730m87719o32309k17293m74202l15220
$$ 26013740 25704038 25031343 24415474 23829744 23342025 22709716 22492423 22018221 21703001
14164B1703001r05436l55659j73764o72008l06712l59673l75550n07753j46474
$$ 21703001 20797565 20441906 20268142 19596134 19289422 18929749 18554199 18046446 17899972
14155A7899972l20555m73088n1433o15049l83855L18269m06643r12729M80755
$$ 17899972 17579417 17106329 17054896 16439847 16055992 16374261 15967618 15054889 15535644
14146A5535644p80330m03100m451m16985j42598l77096q2543j05624m02482K7940
$$ 15535644 14755314 14352214 14347763 13930778 13788180 13411084 13328541 13222917 12820435 12848375
14136A2848375o1195o27403k57740N4883l57149J28889n08546k7250j84037l0002
$$ 12848375 12787180 12159777 11902037 11956920 11599771 11728660 11220114 11192864 11008827 10978825
14126A0978825l63281K7822p7869j63811l19876J1966l59992J9639q9639l05253
$$ 10978825 10615544 10643366 10565497 10401686 10081810 10093776 9733784 9753423 9663784 9358531
14116I358531r6444j68913O2569n15757K51001k33446j86923o5876k5944l45965
$$ 9358531 9262087 9093174 9155743 8639986 8890987 8657541 8470618 8404742 8378798 8032833
14106H032833o4551j56894M60267o03013J10787j87707k57886n1379j15755n350
$$ 8032833 7968282 7811388 8271655 7668642 7779429 7591722 7333836 7282457 7166702 7161352
14096G161352m6946q181j52712l01850J36836K4170k72125J97027p70617L60913
$$ 7161352 7114406 7106225 6953513 6651663 6788499 6812669 6540544 6737571 5966954 6327867
14086F327867k85881L78260m95807R1784j23135R3406j73749n49529J75377r3507
$$ 6327867 6041986 6420246 5924439 6016223 5893088 5986494 5812745 5263216 5438593 5345086
14076E345086K53885j65611j4541j25617l85175J85001K33978n35983L00674l35580
$$ 5345086 5598971 5433360 5418819 5293202 4908027 5093028 5327006 4791023 5091697 4756117
14066D756117L32360k58787j9499m0186L47876j29131n64217L51090j20295N4835
$$ 4756117 5088477 4829690 4810191 4770005 5117881 4988750 4424533 4775623 4655328 4710163
14056D710163Q9628m26729O1925j37582L4835j31017K56233j07522J38922l63431
$$ 4710163 4799791 4373062 4434987 4297405 4332240 4201223 4457456 4349934 4488856 4125425
14046D125425j18271L42892j34310j78389K07804l76620J95106j84405j30410
$$ 4125425 4007154 4350046 4215736 4037347 4245151 3868531 4063637 3879232 3748822
14037C748822j41271J64977J59931j44126n72105L14874r9782M3036k19844M34821
$$ 3748822 3607551 3772528 3932459 3788333 3216228 3531102 3431320 3474356 3254512 3689333
14027C689333o95183J76241L98357k57787Q786J37669p2653n9786K7201R6197
$$ 3689333 2994150 3170391 3568748 3310961 3319747 3457416 3384763 3324977 3352178 3448375
14017C448375j68618P1440k52551J46259j19063J52242n93353K60142k71178J5169
$$ 3448375 3279757 3351197 3098646 3244905 3125842 3278084 2684731 2944873 2673695 2688864
14007B688864L98980n03297J6346L82076l92518J95164m5357M1210L46701k44027
$$ 2688864 3087844 2584547 2600893 2982969 2590451 2785615 2740258 2781468 3128169 2884142
13997B884142n54864L29802l70428J85957K54990k46509J38055j17162k74139
$$ 2884142 2329278 2659080 2288652 2474609 2729599 2483090 2621145 2503983 2229844
13988B229844J35411j18787J65324J30605j33405J49999L13208l66753l8397K97769
$$ 2229844 2365255 2246468 2411792 2542397 2408992 2558991 2872199 2505446 2467049 2764818
13978B764818P298N50741K21079O83908J152458L085330M721994J0778462J4484739
$$ 2764818 2772116 3322857 3543936 4227844 5380302 8465632 13187626 23966088 38450827
13969C8450827j4198464q710933n370576k383969j638004r00073p55023m28188
$$ 38450827 24252363 15541430 10170854 7786885 6148881 5248808 4493785 4065597
13961D065597n25153Q2784k20706n58423K76399j76346j27723m90200K54545q6524
$$ 4065597 3540444 3623228 3402522 2844099 3120498 2944152 2816429 2326229 2580774 2494250
13951B494250k27506L36337L395k47648j84203K351K45709k98216M2839J10473
$$ 2494250 2266744 2603081 2606476 2358828 2174625 2176976 2422685 2124469 2167308 2277781
13941B277781J60253j52523m15857J64432j73593M16235k92451J58825l02438
$$ 2277781 2438034 2285511 1869654 2034086 1860493 2276728 1984277 2143102 1840664
13932A840664J43886K14955j90943l53868M12660k42998J4376j02228J43785O2709
$$ 1840664 1984550 2199505 2008562 1654694 2067354 1824356 1838732 1736504 1880289 1942998
13922A942998r6461j3537R2312p3665J03787k65708p6768K9829j85885L31727
$$ 1942998 1846537 1833000 1925312 1851647 1955434 1689726 1612958 1642787 1456902 1788629
13912A788629j05705n6711j02857j94968L82863n7904k43998J43614n6308j99170
$$ 1788629 1682924 1626213 1523356 1328388 1711251 1653347 1409349 1552963 1496655 1297485
13902A297485N58094l49315j31373J56729J46586m51577N31646k26044j27471
$$ 1297485 1855579 1506264 1374891 1531620 1678206 1226629 1758275 1532231 1404760
13893A404760K72957l7508k82614Q5103L3819n650p5094K30483j81894P6464j98112
$$ 1404760 1677717 1640209 1357595 1442698 1476517 1470867 1395773 1626256 1444362 1520826 1322714
13882A322714L15134j67206L70163j71630m46477j39976K93579r5158L9132j32497
$$ 1322714 1637848 1470642 1840805 1669175 1222698 1082722 1376301 1281143 1320275 1187778
13872A187778K349L10980l29741L1168k5175k59635K33656j41716L29343j67562
$$ 1187778 1190127 1501107 1171366 1202534 1177359 917724 1151380 1009664 1339007 1171445
13862A171445o2456J95973k20359K65057K47838n66424j0154K95638m02414K06668
$$ 1171445 1108989 1304962 1084603 1349660 1597498 1031074 1020920 1316558 914144 1120812
13852A120812J09094j43485J72259j07790j99838j8610J57664J54544k2947k09019
$$ 1120812 1229906 1086421 1258680 1150890 951052 932442 1090106 1244650 1221703 1012684
13842A012684j56631L18467n4608k03475K57561L21924l944l80086n1802L22533
$$ 1012684 856053 1174520 1119912 916437 1173998 1495922 1491978 1111892 1060090 1382623
13832A382623j67538N3799n08780K20802j57321K82734j07346J47578j24480r6554
$$ 1382623 1215085 1268884 760104 980906 823585 1106319 998973 1146551 1022071 925517
13822I25517J89215q4739l01891J88585N6748o1845L03074l74085J16532K85624
$$ 925517 1114732 1029993 728102 916687 973435 911590 1214664 840579 957111 1242735
13812A242735k80629Q4984r1278J11777j84149J79341j99530J69402l73015K34974
$$ 1242735 962106 1047090 955812 1067589 883440 1062781 863251 1032653 659638 894612
13802H94612K15754k78071K31492m19745J39430J4253R4256M10697k98197l7244
$$ 894612 1110366 832295 1063787 644042 783472 797725 891981 1302678 1004481 967237
13792I67237m71347K41312k56562K40527P0835J78666k75661J34045J52092j94414
$$ 967237 495890 737202 480640 721167 792002 970668 695007 829052 981144 786730
13782G86730K52611k70536l51335M17858j35407j33273M0002K44168q014n1325
$$ 786730 1039341 768805 417470 835328 699921 566648 606650 850818 842804 791479
13772G91479j51097O7583J90231D34911M21878j11068k6677J23335n3939J02281
$$ 791479 640382 707965 898196 434911 856789 745721 719044 842379 788440 890721
13762H90721p9964j40715J00192p1837o2752l0798K07461k25162J61722j48580
$$ 890721 810757 670042 770234 698397 635645 604847 812308 587146 748868 600288
13752F00288k83590L81534K70832C92538L31697J94625D27063M21106K11410k98640
$$ 600288 316698 698232 969064 392538 724235 918860 427063 848169 1059579 760939
13742G60939q7964j61539J27853B42361M43248o4241J66535j84220r7530N16P5694
$$ 760939 672975 511436 639289 242361 685609 621368 787903 603683 506153 506669 582363
13731E82363m2506J20660P2167J25184k17511L53907D36245Q6713j11755N2289
$$ 582363 539857 660517 732684 857868 640357 994264 436245 522958 411203 463492
13721D63492N53216B96309L76453J2110p9280J89784K63723H6171N44463J17540
$$ 463492 1016708 296309 672762 684872 605592 795376 1059099 86171 630634 748174
13711G48174p5216r8123q2984n591O13944D71771j20406M32236l13112l0575M8169
$$ 748174 672958 574835 491851 486260 1100204 471771 351365 783601 470489 439914 488083
13700D88083A68026K81948N9321J39965O0155n5283J01899j21311j13185L8843
$$ 488083 168026 449974 509295 649260 709415 654132 756031 634720 521535 560378
13690E60378J37690B63842J703L90202B99091J49231K90232l03842J47359k58635
$$ 560378 698068 263842 265545 655747 299091 448322 738554 434712 582071 323436
13680C23436N6259J56814L04131C17614J73087J8335k8492K49603B18303K13639
$$ 323436 379695 536509 840640 317614 490701 509036 480544 730147 218303 431942
13670D31942j07117M26319B56980J09989j57837K20229l7666J36443O6558J13118
$$ 431942 324825 751144 256980 366969 209132 429361 391695 528138 594696 707814
13660G07814J96923B85615K5285N71313C98956j37230L06113j65016K1639A11532
$$ 707814 904737 285615 310900 882213 398956 261726 567839 402823 424462 111532
13649E60263J72705j46311k26016j49512J55061N19865l80552J39072G7335N00308
$$ 560263 732968 586657 360641 211129 366190 886055 505503 644575 77335 577643
13639E77643B29792J07099L99440B70510K99513k16820K45567j12711B6447N01707
$$ 577643 229792 336891 736331 270510 570023 353203 598770 486059 26447 528154
13629E28154p140j17213Q0594K99924l82005n5816J53822p4884j66543K11373
$$ 528154 521014 403801 484395 784319 402314 346498 500320 425436 258893 470266
13619D70266k10309J34502o3476O0225M1401K77706j79533J28856k55724p5646
$$ 470266 259957 394459 330983 391208 432609 710315 530782 659638 403914 328268
13609C28268L234j12094M47795k15689o2642R5780B04453Q8667M7838K27589J84319
$$ 328268 331502 219408 667203 451514 388872 484652 204453 293120 340958 568547 752866
13598G52866B67757p3915M55885j90745r3624K55171B55523K12306p5385K0187
$$ 752866 267757 193842 649727 458982 365358 620529 255523 467829 392444 412631
13588D12631k183K77634k88591n9784N8075O8837A10801M8152J58639K48554j25473
$$ 412631 410448 688082 399491 339707 397782 466619 110801 158953 317592 566146 440673
13577D40673A88636K1612K19256m8068J59645B10179J27483l2342o8959J5006
$$ 440673 188636 210248 429504 381436 541081 210179 337662 305320 236361 251367
13567B51367M91349B45413L08732k61203A44828K62284A91383R4685j1765K93834
$$ 251367 742716 245413 554145 292942 144828 407112 191383 286068 274303 568137
13557E68137j76123L8574M32869D09956j56467L76286k39081Q6143j82124A08650
$$ 568137 392014 430588 863457 409956 253489 629775 390694 476837 294713 108650
13546H1399K16031K54875r0339j38388n523J58576J4158i4336C61666n5940J81060
$$ 81399 297430 552305 461966 323578 318055 476631 490789 -94336 361666 305726 486786
13535D86786A20789K36752j27804r814k6918J33218F8299M61028B44887k2933
$$ 486786 120789 357541 229737 219923 193005 326223 68299 529327 244887 221954
13525B21954O4820j13483P8649l0672L9614E6288J47073K51061h9018E3003N39114
$$ 221954 286774 173291 251940 221268 260882 56288 203361 454422 -89018 53003 592117
13514E92117k14958A18598K06959A42225J7560i9853d1856F19134C06785o8732
$$ 592117 377159 118598 325557 142225 159785 -99853 -41856 619134 306785 238053
13504B38053F6575K79503N3009l011I3477J44860r9246J22282L00968B16087J58713
$$ 238053 66575 346078 399087 396076 93477 238337 139091 261373 562341 216087 374800
13493C74800j7414J67694k135F6945L28719j56723k6814K65858E1404L50642j23767
$$ 374800 357386 525080 522945 66945 395664 238941 212127 477985 51404 402046 278279
13482B78279G0635J01583A6306K62538J16484m8583n9867d0296D61952B0036K88783
$$ 278279 70635 172218 16306 278844 395328 346745 286878 -40296 461952 20036 308819
13471C08819J87167k09419R1290K5590H0600L03897P3163N4253j56197q5076M1758
$$ 308819 495986 286567 377857 403447 80600 384497 457660 511913 355716 270640 312398
13460C12398A20787J9368M9752o5592K49746k2296q5818p1054a0648C72836j55180
$$ 312398 120787 140155 189907 124315 374061 351765 265947 194893 -10648 372836 217656
13449B17656J18730A763J55228l3698J59241j16750L617J74765A4002L40660F2838
$$ 217656 336386 1763 156991 123293 282534 165784 169401 344166 14002 354662 62838
13437B82687l4822h9546A83530n881L3027a54135C18487J2050E9468K32566I4747
$$ 282687 247865 -89546 183530 177649 210676 -154135 318487 330537 59468 292034 94747
13425C2191K19254K6715p9772G4290g2274B25837D6542J06439O560d1547B42876
$$ 32191 251445 278160 198388 74290 -72274 225837 46542 152981 159541 -41547 242876
13413a21883B46796N0659k3463O0890j02481k6252K78337B21739M10780k77411
$$ -121883 246796 297455 273992 334882 232401 206149 484486 221739 632519 355108
13403C55108r1049P551P8976p6950m7060J636d4842A79873P5737o66F4726J38150
$$ 355108 264059 271610 350586 273636 226576 228212 -44842 179873 255610 254944 64726 202876
13391B02876M08639B58554O5390b32387H9902P1856K80419A90078l8491Q9011
$$ 202876 611515 258554 323944 -232387 89902 161758 442177 190078 151587 240598
13381B40598K19012e329E23843a15663A20634P4534f0834G7773K52824A46627
$$ 240598 459610 -5329 523843 -115663 120634 195168 -60834 77773 330597 146627
13370B35344L6425J27875j81530o8424o228K94546D3663A8701q281O4725H222
$$ 235344 271769 399644 218114 149690 143462 438008 43663 18701 10420 75145 8222
13358C16740p6137N3906Q5787D505a29845I4006R7577p4502J98979J59271k12411
$$ 316740 240603 294509 380296 4505 -129845 94006 191583 117081 316060 475331 262920
13347B62920J78593j18423R9766m4566j51382p6070K07793N6185H7554K62571
$$ 262920 441513 323090 422856 378290 226908 150838 358631 414816 87554 350125
13337C50125c1643A25647J48307m3832J3410H4033J13643P6079j4502K56644k29663
$$ 350125 -31643 125647 273954 230122 243532 84033 197676 273755 259253 515897 286234
13326B86234J66631j99205P5229J29246J05643A81767L71914p6305C4900J74530
$$ 286234 452865 253660 328889 458135 563778 181767 553681 477376 34900 209430
13316B09430m1709M2141D774M74163k16704E7511L71280A4717R6870M4662j2336
$$ 209430 167721 209862 4774 478937 262233 57511 428791 14717 111587 156249 143913
13305A43913J65702L8550E7578K0857Q8626K70810p6953K19583m5582A54628L89544
$$ 143913 309615 348165 57578 78435 167061 437871 360918 580501 534919 154628 544172
13294E44172E1353N11921k60502j37389P9933K8385m0461R1959a21030E45566
$$ 544172 51353 563274 302772 165383 245316 273701 233240 325199 -121030 545566
13283B92621o8112L15687A42630a7738A79524J4511b4092j9798B57368K75215
$$ 292621 224509 540196 142630 -17738 179524 194035 -24092 -43890 257368 532583
13273E32583b1272j21034B23568n498I861f7449C00284b3728E7569P732K71802
$$ 532583 -21272 -142306 223568 218070 9861 -67449 300284 -23728 57569 65301 337103
13262C37103H4382K59268j31367a77178F6940E822M6184c21311a26013e6962C2261
$$ 337103 84382 343650 212283 -177178 66940 5822 52006 -321311 -126013 -56962 32261
13250B65276M5299A31742l9743L3907Q8976a35219A99141F7116Q5883J02723j21521
$$ 265276 310575 131742 91999 125906 214882 -135219 199141 67116 152999 255722 134201
13239A34201M5193E1578L05947E9943b14977C1615j5373c7381A2546M29808E5854
$$ 134201 179394 51578 357525 59943 -214977 31615 16242 -37381 12546 442354 55854
13227A61365d2078n5129F2386J28433q8165d8747m8643C5739M9514f1458C1631
$$ 161365 -42078 -97207 62386 190819 102654 -48747 -97390 35739 85253 -61458 31631
13215a4802o7881A02295R7699a77957b437j28224A81740M2265m1365k9329m4503
$$ -14802 -82683 102295 199994 -177957 -2437 -130661 181740 224005 182640 153311 108808
13204A08808J28538b391B82153a01379H9197J56456j3751I3831D5056M991J61274
$$ 108808 237346 -2391 282153 -101379 89197 245653 231902 93831 45056 50047 211321
13193B11321K42197a11226B36707H407J68886a08842l7107b0933q3287B9886M5631
$$ 211321 453518 -111226 236707 8407 177293 -108842 -145949 -20933 -104220 29886 75517
13182G5517C2279a90935C7179j5504K53203n7964G2127P9758b4606D09264H1458
$$ 75517 32279 -190935 37179 21675 274878 216914 72127 151885 -24606 409264 81458
13170A93196N949R8586a068D4841J18469b90783C35539A31193B6403L20247a28309
$$ 193196 199145 297731 -1068 44841 163310 -290783 335539 131193 26403 346650 -128309
13158A6221a77840B76299F600Q614b3135q1605c2960b807j50685A35469k4841
$$ 16221 -177840 276299 6600 15214 -23135 -104740 -32960 -2807 -153492 135469 110628
13147A10628J95136a3412j06383C4457O7159O041L2175a49670f2036a630B68064
$$ 110628 305764 -13412 -119795 34457 101616 107657 139832 -149670 -62036 -1630 268064
13135c75516e4407A85760E7413J26779c3686A25200P5535D6540b3176B5980J1976
$$ -375516 -54407 185760 57413 184192 -33686 125200 200735 46540 -23176 25980 37956
13124C7956c1389B33042g7054r8528A19694J82044j15725Q7047q6016K72636A16820
$$ 37956 -31389 233042 -77054 -175582 119694 301738 186013 273060 187044 459680 116820
13112a78099j04338f3748A41924a80687Q4580c1666F8295b02003A6631L4971L80494
$$ -178099 -282437 -63748 141924 -180687 -96107 -31666 68295 -202003 16631 51602 432096
13101D32096b10996C32346a12845C68988j04952I8106D721O8641L6092C9758P8623
$$ 432096 -210996 332346 -112845 368988 264036 98106 4721 73362 109454 39758 118381
13090A18381b8395D6910c4674I9983L20852a65697I3156a31733C71154j2364A71412
$$ 118381 -28395 46910 -34674 99983 420835 -165697 93156 -131733 371154 358790 171412
13078b70874B1442J09321D9157a21490o4542A00535J8367P0392o7509L14488G8265
$$ -270874 21442 130763 49157 -121490 -186032 100535 118902 189294 121785 436273 78265
13066e4313A21741C3960K15063L66276A4422i8306C98920k7635m453j50522i9500
$$ -54313 121741 33960 249023 615299 14422 -98306 398920 371285 366832 216310 -99500
13054B35998n424a56203C0982M39340A16957a68542A29652i2382C53095j55767
$$ 235998 230574 -156203 30982 470322 116957 -168542 129652 -92382 353095 197328
13044A97328a57446A99545q8072K9298N9591b85210L2475B42308j10964J28875
$$ 197328 -157446 199545 111473 140771 200362 -285210 -252735 242308 131344 260219
13034B60219j03887e7310B04935a0767A27856a7913N527j03851C01037a53339
$$ 260219 156332 -57310 204935 -10767 127856 -17913 -12386 -116237 301037 -153339
13023A81150G0850l545K42979B6294b7835F2788K7465a6419A20385k1457b21616
$$ 181150 70850 67305 310284 26294 -27835 62788 90253 -16419 120385 98928 -221616
13011B3428i304L034j65551F4827f7543A33693J14208q4105f6473A4632L1036
$$ 23428 -9304 -6270 -171821 64827 -67543 133693 247901 163796 -66473 14632 45668
13000D5668m378d15272a89938G8081e6491C37855j43104a48246d0109A14859J88937
$$ 45668 41290 -415272 -189938 78081 -56491 337855 194751 -148246 -40109 114859 303796
12989C03796a98615C08722a9681C0196b13195C03199o1390a62864A82422f615
$$ 303796 -198615 308722 -19681 30196 -213195 303199 241809 -162864 182422 -6615
12978A61696J94209F9908e6270A7739J72456H0314a1465l7099J4658j49318B83156
$$ 161696 355905 69908 -56270 17739 190195 80314 -11465 -48564 -33906 -183224 283156
12966D4999b04821A99889d9971a8244j21920i049l47995A40806a7373A45873a22549
$$ 44999 -204821 199889 -49971 -18244 -140164 -9049 -357044 140806 -17373 145873 -122549
12954B95210A26688K94303j40758d49018D62527H5650A1270K856J5032R9341a93140
$$ 295210 126688 420991 280233 -449018 462527 85650 11270 14126 29158 128499 -193140
12942I6775l6539i525k21689E8536k7604b97209A00828Q4644D7377J70768A1524
$$ 96775 60236 -9525 -231214 58536 30932 -297209 100828 185472 47377 218145 11524
12930b8997m046j9207E51076k70295A26311b89593M4893B5673a60669k7107f1284
$$ -28997 -33043 -52250 551076 280781 126311 -289593 -244700 25673 -160669 -187776 -61284
12918a11095E4239a04468k19244C19903a93603n3217D8463i4589B7603R0647P769
$$ -111095 54239 -104468 -323712 319903 -193603 -246820 48463 -94589 27603 118250 126019
12907A26019C5537d7915k48980G6759b95167g7353a7826B21043a30978F2506c8348
$$ 126019 35537 -47915 -296895 76759 -295167 -77353 -17826 221043 -130978 62506 -38348
12895g8662B41433i0663j38129B58404f1659k5958k817B45105A12466K45903b14481
$$ -78662 241433 -90663 -228792 258404 -61659 -87617 -90434 245105 112466 358369 -214481
12883f9045G0074M3544J50350a1655j4030k9657n0495A92040M0235o7864k5510
$$ -69045 70074 113618 263968 -11655 -25685 -55342 -105837 192040 232275 164411 138901
12872A38901o6258N8764a67472A84754c7890C26816A09193a14281H89a28913A09108
$$ 138901 72643 131407 -167472 184754 -37890 326816 109193 -114281 889 -128913 109108
12860B53353L9349a76693A04951d1346I6517K33861B176L16473a02648c9257H8098
$$ 253353 292702 -176693 104951 -41346 96517 330378 2176 318649 -102648 -39257 88098
12848I549J69872a77882h918A20648c2631A1655a78896A53666j7663b52396H6858
$$ 9549 179421 -177882 -8918 120648 -32631 11655 -178896 153666 136003 -252396 86858
12836F5820K71649A1819K96353R87a0542j11921G6091K01541I4337g3488k91829
$$ 65820 337469 11819 308172 309159 -10542 -122463 76091 277632 94337 -73488 -365317
12825c65317B17108N7494H966b66228i8651G5606h8047B93683a3476D1221b11254
$$ -365317 217108 274602 8966 -266228 -98651 75606 -88047 293683 -13476 41221 -211254
12813B18542c1107j31605M5932I2540L8505B6919L86397j77260A5078b99719J44216
$$ 218542 -31107 -162712 -116780 92540 131045 26919 413316 236056 15078 -299719 -155503
12802a55503d6759B41154e6605B10632i4259k1631D26221I1858K29753D2069L20866
$$ -155503 -46759 241154 -56605 210632 -94259 -115890 426221 91858 321611 42069 362935
12791C62935j63777i9766o2055E5301b06397j2954A27g800C5239e3419C3202a67854
$$ 362935 199158 -99766 -161821 55301 -206397 -219351 127 -7800 35239 -53419 33202 -167854
12778b66867h5674E9992d89566F3048q139g9356J0743l2110r3625l0415B00015
$$ -266867 -85674 59992 -489566 63048 54909 -79356 -68613 -100723 -194348 -224763 200015
12766a9100F3922L6640j6210C188a70544C3630b94438d2316B55091j26401k3451
$$ -19100 63922 100562 84352 3188 -170544 33630 -294438 -42316 255091 128690 105239
12755A05239d3898a2039B6697h823A3645E167c48567e8862j05495b7089N952C5010
$$ 105239 -43898 -12039 26697 -8823 13645 5167 -348567 -58862 -164357 -27089 -21137 35010
12742A75317j3997g497A66203b32226J07068d0733j30245h4295k34487J26015
$$ 175317 161320 -7497 166203 -232226 -125158 -40733 -170978 -84295 -318782 -192767
12732a92767d0840n9429m7244B05475L0147e1132q4776B38198h824j01366B62384
$$ -192767 -40840 -100269 -147513 205475 235622 -51132 -135908 238198 -8824 -110190 262384
12720F9698J11887a81650B20194D0001b05703G986J13417J33714b7574r0725N1156
$$ 69698 181585 -181650 220194 40001 -205703 7986 121403 255117 -27574 -118299 -67143
12709f7143B06909n8598J17838j8035E24c17074e4136E7892a1871r6099k7809
$$ -67143 206909 148311 266149 248114 524 -317074 -54136 57892 -11871 -107970 -135779
12698a35779N5419F1696p998M7846a4353A07848h1989A46974a60574O2092F88702
$$ -135779 -80360 61696 53698 101544 -14353 107848 -81989 146974 -160574 -98482 688702
12686G1266N1956E943O0564K20688a01782j76435A83362A3217K13888F2203h2332
$$ 71266 123222 5943 66507 287195 -101782 -278217 183362 13217 227105 62203 -82332
12674a90639A99937B7962a18072H3857a29851O3427A35997C3267b55E5682d9638
$$ -190639 199937 27962 -118072 83857 -129851 -66424 135997 33267 -255 55682 -49638
12662a47278A53982L3161D6946L55526j07914a06714O213H5532K33000b9811l5581
$$ -147278 153982 187143 46946 402472 294558 -106714 -100501 85532 318532 -29811 -65392
12651f5392A28074m9370J58881J58832p1014J22090E8407f7786A66461R6280J6357
$$ -65392 128074 78704 237585 396417 325403 447493 58407 -67786 166461 262741 279098
12640B79098j2743D8016R0105g9481b7428q6127J7476A26837J80493a16311A96441
$$ 279098 266355 48016 138121 -79481 -27428 -113555 -96079 126837 307330 -116311 196441
12628A68753H1381J82003n1457E9678d3379k1409j06870f6066j16741F8680J18159
$$ 168753 81381 263384 211927 59678 -43379 -64788 -171658 -66066 -182807 68680 186839
12617A86839B8955K20114E9543J34093J1841G9035L22100I3801L6144J27421E1544
$$ 186839 28955 249069 59543 193636 205477 79035 401135 93801 129945 257366 51544
12605B17275l2166q3216M42539g2950A38920e0465a5212k02858P1773A13736a11944
$$ 217275 185109 101893 544432 -72950 138920 -50465 -15212 -218070 -146297 113736 -111944
12593c7532A81245B1783K04790J05775k4018k7717l988B8744a7281j7942M114
$$ -37532 181245 21783 226573 332348 308330 280613 276625 28744 -17281 -35223 -31109
12582c1109C4037a3112A95843L24525A01877b28927A91104h0363D1536P1872G01
$$ -31109 34037 -13112 195843 520368 101877 -228927 191104 -80363 41536 113408 701
12570F6055e082k9921A07975c07086A80186b93183L7309d1659A35849P4507a30422
$$ 66055 -5082 -35003 107975 -307086 180186 -293183 -255874 -41659 135849 210356 -130422
12558a09999b7548j01771F0191b01587A98953C1271K9052a94673a1567b65A34823
$$ -109999 -27548 -129319 60191 -201587 198953 31271 60323 -194673 -11567 -265 134823
12546d0280j06543B14726A6537a86091N6463I0097O0676J4368b20344a05146A3563
$$ -40280 -146823 214726 16537 -186091 -129628 90097 150773 165141 -220344 -105146 13563
12534a01271q0669Q628B7832p087J05438a75690C29571j30211c56441A07515k6422
$$ -101271 -181940 -173312 27832 20745 126183 -175690 329571 199360 -356441 107515 81093
12523H1093J6301c08862i4268A4663b81229g4478A39861c4550C4041J13477c64467
$$ 81093 97394 -308862 -94268 14663 -281229 -74478 139861 -34550 34041 147518 -364467
12511a51904K6706E3901B0072b50712A52415i4553b4864A7629M34755j96011N6988
$$ -151904 -125198 53901 20072 -250712 152415 -94553 -24864 17629 452384 256373 313361
12500C13361A7037J85334J51885A67203J78874Q274j55835n9515b68141a7863
$$ 313361 17037 202371 354256 167203 346077 354351 198516 139001 -268141 -17863
12489D0504a609k05713D30023G4106J4676a65614c9739r0471c6500H8587C2236
$$ 40504 -1609 -207322 430023 74106 88782 -165614 -39739 -130210 -36500 88587 32236
12477b6550K168m8652d990G2246a4676D70344j45466r8006K65533k25397N03762
$$ -26550 -24382 -73034 -4990 72246 -14676 470344 324878 226872 492405 267008 770770
12466G70770B11169a70204B1745L51655j12716g5168G7948A0872R6241O2875Q9840
$$ 770770 211169 -170204 21745 373400 260684 -75168 77948 10872 107113 169988 259828
12455B59828b22133a4861l36723d9325K1063j26774q9014g1038D4101e0072B01273
$$ 259828 -222133 -14861 -351584 -49325 -28262 -155036 -244050 -71038 44101 -50072 201273
12443D4555L0049a01446B83338n3006J29059r7618j13460L17164K4346B33219
$$ 44555 74604 -101446 283338 230332 359391 261773 148313 465477 489823 233219
12432D6199P8928a57622J8342J4865F9973b5864l0457A16903a76993M1964G8909
$$ 46199 125127 -157622 -139280 -124415 69973 -25864 -56321 116903 -176993 -135029 78909
12420A89573c0128q6507K6334K7465o8587j77938M9290g9014D23873C9452j1118
$$ 189573 -30128 -116635 -90301 -62836 -131423 -309361 -260071 -79014 423873 39452 28334
12409B8334e1901a4326j61428D7858K5314A8068J55985a69613f0306A1739b33867
$$ 28334 -51901 -14326 -175754 47858 73172 18068 174053 -169613 -60306 11739 -233867
12397E2827J3852A7205c09471a53177o0507j35963i2566b7507j50537K6599k6777
$$ 52827 66679 17205 -309471 -153177 -213684 -349647 -92566 -27507 -178044 -151445 -178222
12386a78222m3422A46535J72500f3106j28061E6434J76588l6986e0224F7402c50361
$$ -178222 -221644 146535 319035 -63106 -191167 56434 233022 196036 -50224 67402 -350361
12374B54924d2859D8646J48024q6267Q0919b40450L5551A43541n6558M934J14728
$$ 254924 -42859 48646 196670 110403 191322 -240450 -204899 143541 86983 91917 206645
12363B06645b7991B72296C7632J82571o0529E0982J53719b62291B53242o076j12242
$$ 206645 -27991 272296 37632 220203 159674 50982 204701 -262291 253242 247166 134924
12352A34924d4163k29797K7946B81363f9592C89L17472j42075N7688F9680J81175
$$ 134924 -44163 -273960 -246014 281363 -69592 389 317861 175786 233474 69680 250855
12341B50855a41459O2594E012L99174f86A07040A9146i8635D7677h3087A07665
$$ 250855 -141459 -78865 5012 404186 -686 107040 19146 -98635 47677 -83087 107665
12329a71052q49J220a5562C4926J45117a3687G3817K28408l9506b0440A57842
$$ -171052 -171901 -170681 -15562 34926 180043 -13687 73817 302225 262719 -20440 157842
12317C6271J22874m451J8799e861E05514D9388J23422J06859E1825R8576K7202
$$ 36271 159145 154694 173493 -5861 505514 49388 172810 279669 51825 150401 177603
12306A77603H4811g940A11153l1118K10599I5842J74609a20874B40785j8224q0039
$$ 177603 84811 -7940 111153 80035 290634 95842 270451 -120874 240785 222561 142522
12295A42522j5564i3168B88225A37728K69975F7856a06764A67338F8259a45400
$$ 142522 126958 -93168 288225 137728 407703 67856 -106764 167338 68259 -145400
12284A20105n7001J46479G6830O4778P8921K6049G2695b45940B75794o5953H0853
$$ 120105 63104 209583 76830 141608 220529 246578 72695 -245940 275794 209841 80853
12272I0328J23649a61163b296j30252B66304A09270K90327q7876D8896h2502C48307
$$ 90328 213977 -161163 -2296 -132548 266304 109270 399597 311721 48896 -82502 348307
12260a15876A74621A9115L50415j16100m7501A01125J52783j4543j16715L1454
$$ -115876 174621 19115 369530 253430 205929 101125 253908 239365 122650 154104
12250A54104L20279A76174o9167l1327J542j5481M7427K57997A76058f8349A76818
$$ 154104 474383 176174 107007 75680 77222 61741 109168 367165 176058 -68349 176818
12238A42620J68220A35978J11032F8265N8505J08297J50385D1468N5899K70885
$$ 142620 310840 135978 247010 68265 126770 235067 385452 41468 97367 368252
12228C68252i9486B71960B3975J36285K61020j3098H4796D0399J83470a230B32405
$$ 368252 -99486 271960 23975 160260 421280 408182 84796 40399 223869 -1230 232405
12216D79210B36426a31677B09566n0977K72322A87974F7657R2398J62292o7538
$$ 479210 236426 -131677 209566 158589 430911 187974 67657 160055 322347 254809
12206B54809J09964J702k8143r0731M6265j01224M80840k81945j62417L37032
$$ 254809 364773 366475 338332 247601 293866 192642 673482 391537 229120 566152
12196E66152r4066k14994L30111j81927j96313G6822g96B40524c1077J0521A91777
$$ 566152 472086 257092 587203 405276 208963 76822 -796 240524 -31077 -20556 191777
12184C83419n2777R150P4835A71157J09180J19326J02191L7906k23566K17851
$$ 383419 330642 339792 414627 171157 280337 399663 501854 539760 316194 534045
12174E34045L675P5762j39975R7147j65758j49233J36747j39917K6014P7399j30005
$$ 534045 537720 613482 473507 570654 404896 255663 392410 252493 278507 355906 225901
12163B25901o3645J0513J66214J1717B9321K31337K6304k679J13444q4077J02408
$$ 225901 162256 172769 338983 350700 29321 260658 286962 284283 397727 313650 416058
12152D16058n9599K3778J05122D0371J62701C3419c8150D07321j06419J54887
$$ 416058 356459 380237 485359 40371 203072 33419 -38150 407321 300902 455789
12142D55789k24433a09189B96738a04937A34477b82906E8318Q9181a2224B90947
$$ 455789 231356 -109189 296738 -104937 134477 -282906 58318 147499 -12224 290947
12131A42643q297J43130r518h1120l2067A32562L20N2897l7058Q6289a62666H4313
$$ 142643 134346 277476 267958 -81120 -113187 132562 132882 185779 148721 235010 -162666 84313
12118d8521B98518j03473J31230j61190i3324B82835D4854M26839k31860a68505
$$ -48521 298518 195045 326275 165085 -93324 282835 44854 471693 239833 -168505
12107B3613J19053J19114R2795P5504e0017A31035J95177A11530D2327A8698J06969
$$ 23613 142666 261780 354575 430079 -50017 131035 326212 111530 42327 18698 125667
12096A25667C5208L24N9710D4703J27818M0879l4887C2401a87469B28373G2810
$$ 125667 35208 35532 95242 44703 172521 213400 178513 32401 -187469 228373 72810
12084A80240N4425o6733D4069a36547d8315b3941o2855A16642n7193J49782p9381
$$ 180240 234665 167932 44069 -136547 -48315 -23941 -86796 116642 59449 209231 129850
12073A29850J99387N7862B0180h836C15467c4766j39900H3827i1630I3290K95197
$$ 129850 329237 387099 20180 -8836 315467 -34766 -174666 83827 -91630 93290 388487
12062C88487A14665J72851B9103J046L94434A56066o7323K51283o6550m1131h2636
$$ 388487 114665 287516 29103 30149 424583 156066 88743 340026 273476 232345 -82636
12050H2325J27153o0622c4222C25766a89544O4639F109R0869J01387a54748j54707
$$ 82325 209478 148856 -34222 325766 -189544 -124905 6109 96978 198365 -154748 -309455
12039c09455C2683d1312k33336P9331b1190k48177I1809a02619m929j58200I7858
$$ -309455 32683 -41312 -274648 -195317 -21190 -269367 91809 -102619 -107548 -265748 97858
12027b3224f468B7892a0621o026A28629b51018B16778m1810a09891C04545c2334
$$ -23224 -6468 27892 -10621 -16647 128629 -251018 216778 174968 -109891 304545 -32334
12015b00782b7374F7685b1659A04650m7855J23452C1715e8070B73067j11498a9819
$$ -200782 -27374 67685 -21659 104650 56795 180247 31715 -58070 273067 161569 -19819
12003A11570a35871F3998b20291A40586c21015B15781N5954j22652j2162J29614
$$ 111570 -135871 63998 -220291 140586 -321015 215781 271735 149083 136921 266535
11993B66535a40473B07344J12140J28180B10901P8873k0981l6697b01962A50429
$$ 266535 -140473 207344 319484 447664 210901 289774 268793 232096 -201962 150429
11982A09716a05608c9647d25q9459c6666k56616i5843J8246B11362f0756B27369
$$ 109716 -105608 -39647 -425 -89884 -36666 -293282 -95843 -77597 211362 -60756 227369
11970a42337N0796p7736B09265Q503h5380A89683g752C49663A13232h5300d0733
$$ -142337 -91541 -169277 209265 217768 -85380 189683 -7752 349663 113232 -85300 -40733
11958E0012a24116A31543b09649B3218J24312n4028J1506d6592D013Q018a53825
$$ 50012 -124116 131543 -209649 23218 147530 93502 105008 -46592 4013 12031 -153825
11946d8892p0094c7890A10676P1531b80778H135f975l14609e7164B63165A21291
$$ -48892 -118986 -37890 110676 182207 -280778 8135 -6975 -321584 -57164 263165 121291
11934a74389A58707o1062J14073A3518a99553Q3898A08590P2250A9662N6892a78096
$$ -174389 158707 97645 211718 13518 -199553 -115655 108590 180840 19662 76554 -178096
11922A80298c33569h725B83136k0379k3421I4421b33729j9033a0646m5856k4267
$$ 180298 -333569 -8725 283136 262757 239336 94421 -233729 -252762 -10646 -56502 -80769
11911h0769c9245A5267J33010K42990a22129D16761g2667L71A12050G622M1622
$$ -80769 -39245 15267 148277 391267 -122129 416761 -72667 -72296 112050 7622 49244
11900D9244K41843A11953K04603b5592k98431K4898D45957A38016c1275k206m7441
$$ 49244 291087 111953 316556 -25592 -324023 -299125 445957 138016 -31275 -33481 -80922
11889h0922B4911J03082b40118E051c41742d5478B85079A4914K45259D7956L9050
$$ -80922 24911 127993 -240118 5051 -341742 -45478 285079 14914 260173 47956 87006
11878H7006h9951B25958K2518c58441B64540E4060c5789r1185H333K74890b52987
$$ 87006 -89951 225958 248476 -358441 264540 54060 -35789 -126974 8333 283223 -252987
11866a16567k77507A0046c1574D1594g5509o5829A05458c98865a59414I0458N4155
$$ -116567 -394074 10046 -31574 41594 -75509 -141338 105458 -398865 -159414 90458 144613
11855A44613b14646D66666a7727j0440H8161c6846A90630H5169d8978M173B5680
$$ 144613 -214646 466666 -17727 -28167 88161 -36846 190630 85169 -48978 -44805 25680
11843e52453H7811M4029Q7528a32988j68563a42038k28156J41933j3639D6280
$$ -552453 87811 131840 219368 -132988 -301551 -142038 -370194 -228261 -241900 46280
11832B7355M0198b7371A52848a43775b5125q7490d5117l57606J74619C7515M4319
$$ 27355 67553 -27371 152848 -143775 -25125 -112615 -45117 -402723 -228104 37515 81834
11821H1834a95836b2342o572k2179Q09l51678f7180A60372A1099m054e297k946
$$ 81834 -195836 -22342 -28914 -51093 -50284 -401962 -67180 160372 11099 7045 -5297 -8243
11809h243j82949J9501A43634n1338b38982a03811j31399a02991j72014o3183
$$ -8243 -191192 -171691 143634 92296 -238982 -103811 -235210 -102991 -275005 -338188
11799c38188r1038a5234A05475d18629a91663B74371a14814k39043a54170c9785
$$ -338188 -429226 -15234 105475 -418629 -191663 274371 -114814 -353857 -154170 -39785
11788a83290c880j04118r3149r7231A72428c74986c3049k42858i3285o0747A42838
$$ -183290 -3880 -107998 -201147 -298378 172428 -374986 -33049 -275907 -93285 -154032 142838
11776a81309A58317o155B884K92788h4472C5713a02906j30672B43602e5485k76123
$$ -181309 158317 152162 2884 295672 -84472 35713 -102906 -233578 243602 -55485 -331608
11765c31608E3921b30502B19085q6858C0262A763M0230J0374c21879A36073P2233
$$ -331608 53921 -230502 219085 132227 30262 1763 41993 52367 -321879 136073 208306
11754B08306F4250L8712J5941a89379M0754C09068b90357j63168h3061j09190
$$ 208306 64250 102962 118903 -189379 -148625 309068 -290357 -453525 -83061 -192251
11744a92251k3438A83716G2727a35260A62048A4174b10012a2408A61146F6649
$$ -192251 -215689 183716 72727 -135260 162048 14174 -210012 -12408 161146 66649
11733a39578l9865B77779b8888k02231R7871d9466j42088j32866a55250A00365
$$ -139578 -179443 277779 -28888 -231119 -133248 -49466 -191554 -324420 -155250 100365
11722h225n23526A52849n5523Q6178b16806A24051n4443k3378j0605A5459h6539
$$ -8225 -531751 152849 97326 183504 -216806 124051 69608 46230 35625 15459 -86539
11710I442a06141F6485Q0310l8904a48489b1076B66690B7679b31512A43039B6637
$$ 9442 -106141 66485 146795 107891 -148489 -21076 266690 27679 -231512 143039 26637
11698b34894b038j70715C7202b07593a9519l4562A36456a59549A96063J9351J94064
$$ -234894 -2038 -172753 37202 -207593 -19519 -54081 136456 -159549 196063 215414 409478
11687D09478a20364a3245n5688A58254P8269c8626E3244J63810p158c8185j82757
$$ 409478 -120364 -13245 -68933 158254 236523 -38626 53244 217054 209896 -38185 -220942
11676b20942L0571H1893h1541D45573b27008B55410B510L9681J2281b17628B18160
$$ -220942 -190371 81893 -81541 445573 -227008 255410 2510 42191 54472 -217628 218160
11664F6682B5559J61059F2785N8632a30884E8273A0657N775a5356A2772M35839
$$ 66682 25559 186618 62785 121417 -130884 58273 10657 16432 -15356 12772 448611
11653D48611a36813j19865f1512l50378C12315b7987n52j64480a9630B05032l8935
$$ 448611 -136813 -256678 -61512 -411890 312315 -27987 -28539 -193019 -19630 205032 166097
11642A66097a58874L5130A04716b05912J4468a771A73250J26558A25824F0552
$$ 166097 -158874 -123744 104716 -205912 -191444 -1771 173250 299808 125824 60552
11631a14364A24219a13749A42897a96645D5819a33620H6855a87073G5608c3539
$$ -114364 124219 -113749 142897 -196645 45819 -133620 86855 -187073 75608 -33539
11620C22176A18367J00807a64507P454N7252k15515A37337j6236N2893B5130c23779
$$ 322176 118367 219174 -164507 -157053 -99801 -315316 137337 121101 173994 25130 -323779
11608g3685J8737G0132a22806G6182L12625F0255J98184A17948A0552a3679A63686
$$ -73685 -54948 70132 -122806 76182 388807 60255 258439 117948 10552 -13679 163686
11596D11818F2659a3865A16346c90915A51945a07385E7384n434M4898K9868b11038
$$ 411818 62659 -13865 116346 -390915 151945 -107385 57384 51950 96848 126716 -211038
11584A03513J55135d315j13370I5305M3691j4297D6160K45470A13652a8828A74574
$$ 103513 258648 -4315 -117685 95305 138996 124699 46160 291630 113652 -18828 174574
11572A55993e24D70642C9890a01784m1812G0240J0664i116B63869I3956M65459
$$ 155993 -524 470642 39890 -101784 -143596 70240 80904 -9116 263869 93956 559415
11561E59415I5346N4147Q748a2326A43127a47593D32246j48633b1538m1372a8917
$$ 559415 95346 149493 158241 -12326 143127 -147593 432246 283613 -21538 -62910 -18917
11549B34181q4879a41540A16500J5392B5827a20791L3094j43132C4658J07123
$$ 234181 149302 -141540 116500 131892 25827 -120791 -87697 -230829 34658 141781
11539A41781A6556f423E5909L36856A48541j4019Q9831B8699D256K99283a49486
$$ 141781 16556 -6423 55909 392765 148541 134522 224353 28699 4256 303539 -149486
11527A56532k425a91196e6976D1841f8364E04750e3007E4132J02616a56335Q95
$$ 156532 154107 -191196 -56976 41841 -68364 504750 -53007 54132 156748 -156335 -155440
11516a55440A64332a02040k9921A76839P2902C9735a60989A7540a86620B28364
$$ -155440 164332 -102040 -131961 176839 249741 39735 -160989 17540 -186620 228364
11505C4370b3174j93223C3572J27673K05132A40919a06615A39206R3077b49473
$$ 34370 -23174 -216397 33572 161245 366377 140919 -106615 139206 232283 -249473
11494B57807a027I1758L3710J31851a9813G1587M1948C4243g1134I0022J52279
$$ 257807 -1027 91758 125468 257319 -19813 71587 113535 34243 -71134 90022 242301
11483B42301o7484g9751B00515J62022j77300H1627N050a01496A68656Q4869k3078
$$ 242301 174817 -79751 200515 362537 185237 81627 86677 -101496 168656 253525 230447
11472B30447K67577j21894j08728L7532j41979K1426n8005J24950N1555J0311
$$ 230447 498024 376130 267402 304934 162955 184381 126376 251326 302881 313192
11462C13192p2218l7895K2065M8837l872j20150m2326Q7123J58430J15021j09553
$$ 313192 240974 203079 225144 273981 270109 149959 107633 194756 353186 468207 358654
11451C58654D1473M11530H6718L70687A59967J66171J41662o2669q7371j44055
$$ 358654 41473 453003 86718 457405 159967 326138 467800 405131 317760 173705
11441A73705J03332J21646b21928C471J9514K12503L2281A1745g503j6921E7053
$$ 173705 277037 398683 -221928 3471 22985 235488 267769 11745 -7503 -24424 57053
11429B66740c2808B97750q9919e0952D6682L01024A49052m5904J46073Q3978r9360
$$ 266740 -32808 297750 207831 -50952 46682 347706 149052 103148 249221 333199 233839
11418B33839K9724j05195P8477R2741j03173p8310O3971G4077O038N5055c2019
$$ 233839 263563 158368 236845 329586 226413 148103 212074 74077 80115 135170 -32019
11406B04706d9133C13946p3655D3992a13156m686D23843A63095p5866R9370a11165
$$ 204706 -49133 313946 240291 43992 -113156 -117842 423843 163095 87229 186599 -111165
11394a62337M5361k46009C79151G1940M6237a29846N0883B5416h9316j7762B56239
$$ -162337 -116976 -362985 379151 71940 118177 -129846 -78963 25416 -89316 -107078 256239
11382a76949B93493J19920d42868F8891b43648e4648e691A92344i634A16605a60202
$$ -176949 293493 413413 -442868 68891 -243648 -54648 -5691 192344 -9634 116605 -160202
11370a68107E0490a33979E7455K13034B4953b07966H3922e5813a6024j27158D2238
$$ -168107 50490 -133979 57455 270489 24953 -207966 83922 -55813 -16024 -143182 42238
11358B46868d5999B65586c4995j05504G8271j10k6271J37118B304Q2764a93387
$$ 246868 -45999 265586 -34995 -140499 78271 78161 51890 189008 2304 85068 -193387
11346A9070b57749C4742b59244C2851i2083C2339b85048c4480m0295B231c37266
$$ 19070 -257749 34742 -259244 32851 -92083 32339 -285048 -34480 -74775 2231 -337266
11334A14739l6330B512c34502G188i0967A11278f0584A33811b554A04365c3141
$$ 114739 78409 2512 -334502 7188 -90967 111278 -60584 133811 -2554 104365 -33141
11322G0345a22115a2335j26507O6649p4920r0201I8453l2544g011j14467m0926
$$ 70345 -122115 -12335 -138842 -72193 -147113 -237314 98453 65909 -7011 -121478 -162404
11311a62404A47356a49359A48843c87175a7718A61055J30742J2627b70443g8190
$$ -162404 147356 -149359 148843 -387175 -17718 161055 291797 304424 -270443 -78190
11300a33770B27381a04386b4372A51940a4313j39401m0475H9373b03809j2585
$$ -133770 227381 -104386 -24372 151940 -14313 -153714 -194189 89373 -203809 -216394
11290b16394H8622c62731B9002e3105l44208a92321a8594j68373I4912a87119
$$ -216394 88622 -362731 29002 -53105 -397313 -192321 -18594 -186967 94912 -187119
11279B2900B34b59987a11103K2482C33678p4384b94081a4889j38050B3766K3482
$$ 22900 234 -259987 -111103 -88621 333678 259294 -294081 -14889 -152939 23766 47248
11268D7248b93330a25170b9218j03988G8187J28710d0328j62706A60391a48793
$$ 47248 -293330 -125170 -29218 -133206 78187 206897 -40328 -203034 160391 -148793
11257A52746P6619C3967b78405k08364A63232i7048M5117A3848K05355b05014
$$ 152746 229365 33967 -278405 -486769 163232 -97048 -51931 13848 219203 -205014
11246a9484D9442a72662D0155O8889c27829A87047a04700o0828B02142F3156a15697
$$ -19484 49442 -172662 40155 109044 -327829 187047 -104700 -165528 202142 63156 -115697
11234c8911n011j46352j34267L1289F7088a80282d204m06818J41253B03589a42065
$$ -38911 -43922 -190274 -324541 -293252 67088 -180282 -4204 -411022 -269769 203589 -142065
11222H9078j0717a78338k80922C54577a56888e0317k54580O9810D4674B0555c66228
$$ 89078 78361 -178338 -459260 354577 -156888 -50317 -304897 -235087 44674 20555 -366228
11210a29867C6520c87385e6992j66289j77201f4679j29719d306B13202e1131B7494
$$ -129867 36520 -387385 -56992 -223281 -400482 -64679 -194398 -4306 213202 -51131 27494
11198b02539f0326D36612b28659F1630c14315a07299b966C9865L9338b95267d6288
$$ -202539 -60326 436612 -228659 61630 -314315 -107299 -2966 39865 79203 -295267 -46288
11186D5515a28454A09324j6919b17255b6122B30539E441L434N0164e0961k34960
$$ 45515 -128454 109324 92405 -217255 -26122 230539 5441 8875 59039 -50961 -285921
11175b85921j03938a81193I4640g0468r3112q0573I5381A7711c64350J04431B3068
$$ -285921 -389859 -181193 94640 -70468 -163580 -244153 95381 17711 -364350 -259919 23068
11163A06612a19474c4688j81407I6004l9680b24327B30754c47707f8342j93957
$$ 106612 -119474 -34688 -216095 96004 56324 -224327 230754 -347707 -68342 -262299
11153b62299A68351d4845l41288J20270A66284b09717c1998B44021B1385J07694
$$ -262299 168351 -44845 -386133 -265863 166284 -209717 -31998 244021 21385 129079
11143A29079j7168j5276c9710l6231I0074J10334d75446J74887J27127O794I2895
$$ 129079 111911 96635 -39710 -75941 90074 200408 -475446 -300559 -173432 -166638 92895
11131a60193a402j08627p9008B99854a49689L3802m2084A97919o3900n3882c59625
$$ -160193 -1402 -110029 -189037 299854 -149689 -115887 -157971 197919 134019 80137 -359625
11119f5453b870m63419a77487I5034K6791q710C6539M67567L5876k23183E6159
$$ -65453 -2870 -466289 -177487 95034 121825 113115 36539 504106 539982 316799 56159
11107B3503h807m9804B42196j20088J06823A9428J68939b43863B55968j25821
$$ 23503 -8807 -58611 242196 122108 228931 19428 188367 -243863 255968 130147
11097A30147J82571L9329j55223C2843J52969a40758G0265J69348J20964j03193
$$ 130147 312718 352047 196824 32843 185812 -140758 70265 239613 360577 257384
11087B57384J4796A06091J38123n4122K64243A91334J54778A44852R9521m6475
$$ 257384 272180 106091 244214 190092 454335 191334 346112 144852 244373 197898
11077A97898q6478J8691J97202A27601M79434A92698j859J81790R3136A07380
$$ 197898 111420 130111 327313 127601 607035 192698 190839 372629 465765 107380
11066A06942O7923l4003J64469L8956N6743J18155B30133R623O6J04607k7945
$$ 106942 174865 140862 305331 344287 401030 519185 230133 239756 239822 344429 316484
11055C16484J70941J23255J50793C50200K41822j53677n8071M9448L52934K31490
$$ 316484 487425 610680 761473 350200 592022 438345 380274 429722 782656 1014146
11045A014146B00878M64059O9697M6153P3722k12773L18186J03734k6717N7786
$$ 1014146 200878 664937 734634 780787 854509 641736 959922 1063656 1036939 1094725
11035A094725k76348J09990j47674M95024J01117m8892L2027j00897L13769N2792
$$ 1094725 818377 928367 780693 1275717 1376834 1327942 1359969 1259072 1572841 1625633
11025A625633p5305k78208M20752J11279m12070J39527j66996k28331j4044L24605
$$ 1625633 1550328 1272120 1692872 1804151 1392081 1531608 1364612 1136281 1122237 1446842
11015A446842J82214l19831K9770P4894m29165K53142j8772j40484K56078n4778
$$ 1446842 1629056 1309225 1338995 1413889 984724 1237866 1219094 1078610 1334688 1279910
11005A279910L3704m7180k4671J28515o7958m05532L12690l112j59918J27554
$$ 1279910 1313614 1266434 1241763 1370278 1302320 896788 1209478 1206366 1046448 1174002
10995A174002j110r4312M948J15547J77563l34419j134R3396o1977j78419J88043
$$ 1174002 1172892 1078580 1083528 1199075 1376638 1042219 1041085 1134481 1072504 894085 1082128
10984A082128j48653J14737J77103k10935J71814j94l30674K09743K86838L8325
$$ 1082128 933475 1048212 1225315 1014380 1186194 1186000 855326 1065069 1351907 1390232
10974A390232l25247P201j93067L58160k11927L07720q3940Q2055M02445k36593
$$ 1390232 1064985 1072186 879119 1237279 1025352 1333072 1249132 1331187 1733632 1497039
10964A497039k23983O48215k99581M16084J0582P532K18983L88636J91642O5011
$$ 1497039 1273056 1921271 1621690 2037774 2048356 2055888 2274871 2663507 2855149 2920160
10954B920160M28668M33764L76006L78391J40143n4384N62864m4694l43506r59733
$$ 2920160 3348828 3782592 4158598 4536989 4677132 4622748 5185612 5140918 4797412 3837679
10944C837679o16152k05985l76374m24712k03612J21698k17583J84571J48085
$$ 3837679 3221527 3015542 2639168 2214456 2010844 2132542 1914959 2099530 2247615
10935B247615j04464o52699Q6903j59463K1679m05404j54148k4409l03746r3662
$$ 2247615 2143151 1490452 1577355 1417892 1439571 1034167 880019 855610 551864 458202
10925D58202r0003P3669l1199j23625A6435P5825F896J17266m2173J21357J39070
$$ 458202 368199 441868 410669 287044 16435 92260 6896 124162 81989 203346 342416
10914C42416E8631j383c726A56980b0146A09042a45227I2114O6943A4624d1194
$$ 342416 58631 57248 -3726 156980 -20146 109042 -145227 92114 159057 14624 -41194
10902A35985m3355l0765c21164J10389B82185E6003A0654J07624b7274q3952A12672
$$ 135985 92630 61865 -321164 -210775 282185 56003 10654 118278 -27274 -111226 112672
10890a90628P0613m5451b93I8362h3763f855j85326c0236g893A4292K70383d27185
$$ -190628 -120015 -165466 -293 98362 -83763 -6855 -192181 -30236 -7893 14292 284675 -427185
10877A7118K98378c6998D9995a33369B06820h0362C58441h1531d0130A32217H81
$$ 17118 315496 -36998 49995 -133369 206820 -80362 358441 -81531 -40130 132217 881
10865e3376A79016d7968n0960k81055J88659A45483g3311m8537A2234d4112B5522
$$ -53376 179016 -47968 -98928 -379983 -191324 145483 -73311 -121848 12234 -44112 25522
10853B4302P5745c92082B86674a93523R820e9263n7009l7949e5291j32335P751
$$ 24302 100047 -392082 286674 -193523 -183703 -59263 -116272 -154221 -55291 -187626 -179875
10842a79875G7604j2848d2554l20091e7410l0153m32518A848J65543k4933J7859
$$ -179875 77604 64756 -42554 -362645 -57410 -87563 -520081 1848 167391 142458 160317
10831A60317a06566A48553L6216b81100I5507a82225k27068A29448a28982L4867
$$ 160317 -106566 148553 184769 -281100 95507 -182225 -409293 129448 -128982 -94115
10821i4115l37181h7020A71587a27655M5659D747L10843j48320b33925A52814
$$ -94115 -431296 -87020 171587 -127655 -81996 4747 315590 167270 -233925 152814
10810H0420l0146j8242O9623R2001a84002G9912a07177m087A07960c52171a24820
$$ 80420 50274 32032 101655 193656 -184002 79912 -107177 -111264 107960 -352171 -124820
10798a77033j59552a24762a9599M099I1509b08008C61433a65236d5098A56820
$$ -177033 -336585 -124762 -19599 -15500 91509 -208008 361433 -165236 -45098 156820
10787a64330M7472E0369L2496a31281k6188A59654c49097j4424A57679m0775e4753
$$ -164330 -116858 50369 82865 -131281 -157469 159654 -349097 -363521 157679 116904 -54753
10775A7191P4221b14022e4215m9122p6069f1839k82948B3178J75818C3467f5405
$$ 17191 91412 -214022 -54215 -103337 -179406 -61839 -344787 23178 198996 33467 -65405
10763C4530a58275E4751B3350d7887j48646n1633A66919p0840l7831c741C42882
$$ 34530 -158275 54751 23350 -47887 -196533 -248166 166919 96079 58248 -3741 342882
10751a37100m0786B39558k4594i8148F4785a10217B17224G5873c44375H7577j0511
$$ -137100 -177886 239558 214964 -98148 64785 -110217 217224 75873 -344375 87577 77066
10740G7066B5261a8919C6095c54849a50303A00408J55456I7152a53605M0484K1597
$$ 77066 25261 -18919 36095 -354849 -150303 100408 255864 97152 -153605 -113121 -91524
10729i1524A66113a6664A78712J5238b58968B10924A055J20924J06407b9840B94800
$$ -91524 166113 -16664 178712 193950 -258968 210924 1055 121979 228386 -29840 294800
10717a88954f1305J4269l7086l4127M5253p4279K395A24558a73753P090F5561
$$ -188954 -61305 -47036 -84122 -118249 -72996 -147275 -144880 124558 -173753 -166663 65561
10705b48285f9738L3347o0970k19720F042a13378c440A10759J88877a19866A59226
$$ -248285 -69738 -36391 -97361 -317081 6042 -113378 -3440 110759 299636 -119866 159226
10693H3258a25203D4978Q0547a39630c2819B7464a98397K3856B55685a49276b8934
$$ 83258 -125203 44978 125525 -139630 -32819 27464 -198397 -174541 255685 -149276 -28934
10681H8863k6252b75146J4548p6010B5926a45317j74p7968g9522A06755A0579
$$ 88863 62611 -275146 -260598 -336608 25926 -145317 -145491 -223459 -79522 106755 10579
10669A55788d36034a75049j51888O3876A07073b44941B73461a35232B3564K6997
$$ 155788 -436034 -175049 -326937 -263061 107073 -244941 273461 -135232 23564 50561
10659E0561b75034G9103a68826P3903b0922q64C5150b78472A11140f9469m17393
$$ 50561 -275034 79103 -168826 -94923 -20922 -21786 35150 -278472 111140 -69469 -486862
10648d86862K37212F164d8836B37903h0404E4922J95024F788b45434J06194o4108
$$ -486862 -249650 6164 -48836 237903 -80404 54922 249946 6788 -245434 -139240 -203348
10637b03348G7512C8739a10585B14366a54101j37775b4446A42670a0894m6298
$$ -203348 77512 38739 -110585 214366 -154101 -291876 -24446 142670 -10894 -57192
10627e7192j37348Q1317i84H5812b69711h7147B31339a29980q8760B4610b92455
$$ -57192 -194540 -113223 -984 85812 -269711 -87147 231339 -129980 -218740 24610 -292455
10615i9830B3970i7843D1725c00606a17092F0443e7039A48343H830a26402B8063
$$ -99830 23970 -97843 41725 -300606 -117092 60443 -57039 148343 8830 -126402 28063
10603C76977e1927j28005A09043a16906j18182k4688A75322R3014a45621j02750
$$ 376977 -51927 -179932 109043 -116906 -235088 -259776 175322 268336 -145621 -248371
10593b48371e1922A763K5741P2655D078b43370B13635a37563k88138h7659j19317
$$ -248371 -51922 1763 27504 100159 4078 -243370 213635 -137563 -425701 -87659 -206976
10582b06976B18198a49862D1949J81718F2083L07886a84137K6438e9519C04238
$$ -206976 218198 -149862 41949 223667 62083 369969 -184137 -157699 -59519 304238
10571C36123c11847A29070b71449q9447E7191b18480p02o170c1340A97727b4445
$$ 336123 -311847 129070 -271449 -360896 57191 -218480 -219182 -225352 -31340 197727 -24445
10559C2410b4909k34574O1204I9636B2963e8131k44144A61666d305A44606E6844
$$ 32410 -24909 -259483 -198279 99636 22963 -58131 -302275 161666 -4305 144606 56844
10547A29623a50740j88084A20050f8793j4294Q102A04450b72358B87826j00158
$$ 129623 -150740 -338824 120050 -68793 -83087 -74985 104450 -272358 287826 187668
10537A87668D2240L6464a43823J5818A05842O4240c1291A03844e6684A05062c968
$$ 187668 42240 78704 -143823 -128005 105842 170082 -31291 103844 -56684 105062 -3968
10525g0885j00824A36508i4694A83905a14472A3128K41957i343A04139h1582K2223
$$ -70885 -171709 136508 -94694 183905 -114472 13128 255085 -9343 104139 -81582 -59359
10514e9359F276c38207i2911C1585a26795B96236c47459g1865D6164c72784C1804
$$ -59359 6276 -338207 -92911 31585 -126795 296236 -347459 -71865 46164 -372784 31804
10502a30488j78552a978j35847E3592a3552B0652a43138A10101j0352a66583c3426
$$ -130488 -309040 -1978 -137825 53592 -13552 20652 -143138 110101 99749 -166583 -33426
10490b25784D67528b71949J23313m4713E1743b56872e3220b2836k40320F4736
$$ -225784 467528 -271949 -148636 -193349 51743 -256872 -53220 -22836 -263156 64736
10479D1905a02937B17385h2906j4641n6137M5022C34830a14913k77752B89743
$$ 41905 -102937 217385 -82906 -97547 -153684 -108662 334830 -114913 -392665 289743
10468b33380d2676M835k3316B05781a11155p384A38515b43008B02079K10926J12345
$$ -233380 -42676 -37841 -61157 205781 -111155 -118539 138515 -243008 202079 413005 525350
10457E25350j50170j28527O0985M6665h3486n7154B31025c8972j21196A52126
$$ 525350 375180 246653 307638 354303 -83486 -140640 231025 -38972 -160168 152126
10446G1196a50199c9406m2811j51348Q8435A43462M966b09408E5903d5732I3508
$$ 71196 -150199 -39406 -82217 -233565 -145130 143462 148428 -209408 55903 -45732 93508
10434b15387B01001a2548B7137R9002D8810K11015i0607B352Q4515c46751C2802
$$ -215387 201001 -12548 27137 126139 48810 259825 -90607 2352 86867 -346751 32802
10422b77827I6703q615a20026E061b37519f7030j0389k24481B03950a81678N7520
$$ -277827 96703 88088 -120026 5061 -237519 -67030 -77419 -301900 203950 -181678 -124158
10411a24158j50012J25705B65692b3874A30825d51963a57695A56165J14271A923
$$ -124158 -274170 -148465 265692 -23874 130825 -451963 -157695 156165 270436 1923
10400B37203c78047C1697N7855c86558D794a39896k05877g5332l79320b13292
$$ 237203 -378047 31697 89552 -386558 4794 -139896 -345773 -75332 -454652 -213292
10389C02259a5366A28084a41033D7018e6339j31963B91367A29857b37508g2009
$$ 302259 -15366 128084 -141033 47018 -56339 -188302 291367 129857 -237508 -72009
10378a20279r162A43535B3027N2738c0408A293J73783K7228N6293b2612B80323
$$ -120279 -129441 143535 23027 75765 -30408 1293 175076 202304 258597 -22612 280323
10366C76231n6214A47325m7498J15140J57451k1068a1736G94278k97708R5025
$$ 376231 320017 147325 99827 214967 372418 351350 -11736 794278 496570 591595
10356E91595o4858j07910J76370q3491n4679k13345J38360o0395O83401k09932
$$ 591595 526737 418827 595197 511706 457027 243682 382042 321647 1005048 795116
10346G95116M574j75442o939K21391k35521P3213A78248M47762C899L75616B8107
$$ 795116 799690 624248 617309 838700 603179 676392 178248 626010 3899 379515 28107
10334A57572M24341p6620j09949M96557k63081N0740j46066B06698K7945L72275
$$ 157572 581913 505293 395344 891901 628820 679560 533494 206698 234643 606918
10324F06918o2422A07168P8234K88856j86983J87961B32160m9156o6566J91883
$$ 606918 544496 107168 185402 474258 287275 475236 232160 183004 116438 308321
10314C08321g2673D36164j86934F2573O7866K44960j61951C2858J52446L2864
$$ 308321 -72673 436164 249230 62573 130439 375399 213448 32858 185304 218168
10304B18168k8812P37311A1185K77677N5633D3300J2506K31080j41806m2561a52579
$$ 218168 189356 926667 11185 288862 344495 43300 55806 286886 145080 102519 -152579
10292E2210O0284Q1164B5330c72851B12615l7369b36235J08857e0868j47312B93295
$$ 52210 112494 193658 25330 -372851 212615 175246 -236235 -127378 -50868 -198180 293295
10280B64107a42361j85387J34401A25436e8059F7830N8676M026b01221A06891
$$ 264107 -142361 -327748 -193347 125436 -58059 67830 126506 130532 -201221 106891
10269c0121j03370e5594B6209a68309k05277a46181H7735d0736A16445g4055a5289
$$ -30121 -133491 -55594 26209 -168309 -373586 -146181 87735 -40736 116445 -74055 -15289
10257C2339M3995K11717i2658C01303b11972A42281J07588r6541l5864L5459a79606
$$ 32339 76334 288051 -92658 301303 -211972 142281 249869 153328 117464 152923 -179606
10245A37640L2761L1934A1681d3953l7575L2573l50839d0021B59883o3571K09460
$$ 137640 170401 202335 11681 -43953 -81528 -48955 -399794 -40021 259883 196312 405772
10234D05772j02195J14111A53794k4216d9469K057l93532B19017h6752n4819g269
$$ 405772 303577 417688 153794 129578 -49469 -47412 -440944 219017 -86752 -141571 -7269
10222G1296A7302L05431i4238k03343B3195N3779i1728k64135O5788B46717e7649
$$ 71296 17302 322733 -94238 -297581 23195 76974 -91728 -355863 -290075 246717 -57649
10210a65104b0721j4124h147j96052E2866c15827b6836r8756N444O652b893p2052
$$ -165104 -20721 -34845 -8147 -204199 52866 -315827 -26836 -125592 -120148 -113496 -2893 -74945
10198g4945G1262a97799L0601F385J28212b06097J0214G1378a48521j25035B77391
$$ -74945 71262 -197799 -167198 6385 134597 -206097 -195883 71378 -148521 -273556 277391
10186c28834f3156k7158p8904f6682o894m8723N4568g888H6753J09378a34201
$$ -328834 -63156 -90314 -169218 -66682 -73576 -122299 -67731 -7888 86753 196131 -134201
10174A82680E6493f6149J8462j13810C4614b43662J18737N5961G9777C8799A6245
$$ 182680 56493 -66149 -47687 -161497 34614 -243662 -124925 -68964 79777 38799 16245
10162b71391e1892j69750p2210A88217a17215A60401M0341M6071A10810b4878
$$ -271391 -51892 -221642 -293852 188217 -117215 160401 200742 246813 110810 -24878
10151A35992e9954A70026a61886C54449a95319a4786j6665D060a2334o3003I6672
$$ 135992 -59954 170026 -161886 354449 -195319 -14786 -31451 4060 -12334 -75337 96672
10139a14281j09564d0629A23221g3284L1465N613k54013j9760H4148a26646k4935
$$ -114281 -223845 -40629 123221 -73284 -41819 -36206 -290219 -309979 84148 -126646 -151581
10128a51581A24517g8625j31556O7476M3257G2318A344R6167a28636j2958j86881
$$ -151581 124517 -78625 -210181 -142705 -99448 72318 1344 97511 -128636 -141594 -328475
10117c28475e0497K4167k65370J10605B49120E4553J72406b95394H8893a47356
$$ -328475 -50497 -26330 -291700 -181095 249120 54553 226959 -295394 88893 -147356
10106B04629c20081a19370q612A99595a66479k45653I4499R4810a00272E3875
$$ 204629 -320081 -119370 -127982 199595 -166479 -412132 94499 189309 -100272 53875
10095h1900F4297e847C5781f4004H1204d19687A60754h5405E5439b4955A3607
$$ -81900 64297 -5847 35781 -64004 81204 -419687 160754 -85405 55439 -24955 13607
10083a28369G6483C6968j3303a51824j85978I925a49488A77881N0788a68875A69253
$$ -128369 76483 36968 23665 -151824 -337802 9925 -149488 177881 228669 -168875 169253
10071f2329D4951c38106J37958m4641J4356j21545a3287C5677a1237j24756e1700
$$ -62329 44951 -338106 -200148 -244789 -230433 -351978 -13287 35677 -11237 -135993 -51700
10059A58014J21108H0150a36621A19712K4807b3628A5342a05687B77850c87146
$$ 158014 279122 80150 -136621 119712 144519 -23628 15342 -105687 277850 -387146
10048c02601h2345J3876E9749i8062l49466B20899a00174l935l21646f2325k97816
$$ -302601 -82345 -68469 59749 -98062 -447528 220899 -100174 -104109 -425755 -62325 -360141
10037c60141B7615b42975f5099k2002c1487D2051J00002f878j55006l30090a5236
$$ -360141 27615 -242975 -65099 -87101 -31487 42051 142053 -6878 -161884 -491974 -15236
10025a18875j985E2478b00406b4270F1808b23377k4094A27653b16975K4074B29242
$$ -118875 -120860 52478 -200406 -24270 61808 -223377 -247471 127653 -216975 -192901 229242
10013a74730B22929A8853a41444k45021A65639E1671J35373g8916p1760c7856
$$ -174730 222929 18853 -141444 -386465 165639 51671 187044 -78916 -150676 -37856
10002h1079j18107b489B44472b39532r2043P7796J01190p8732A63496q1193c3018
$$ -81079 -199186 -2489 244472 -239532 -331575 -253779 -152589 -231321 163496 82303 -33018
9990a48494j09749b938m1357k2869C112b57034k41199A76069b5517j27979P6180
$$ -148494 -258243 -2938 -44295 -67164 3112 -257034 -498233 176069 -25517 -153496 -77316
9979g7316q2481n1438a5145C7074d59801A52511f1896B5491e2729j61895p1203
$$ -77316 -159797 -211235 -15145 37074 -459801 152511 -61896 25491 -52729 -214624 -285827
9968b85827o0326a7234g211E6664J57663a88539L2711A36909b86675B83679A9036
$$ -285827 -346153 -17234 -7211 56664 214327 -188539 -155828 136909 -286675 283679 19036
9956b36018j48241a01261k09046N0638a04112A5996h7858j02312b2083n5949B3214
$$ -236018 -384259 -101261 -310307 -259669 -104112 15996 -87858 -190170 -22083 -78032 23214
9944a96440g7222I285a15544d2766j30090e5670j91935B29435a63882j34224a31659
$$ -196440 -77222 9285 -115544 -42766 -172856 -55670 -247605 229435 -163882 -298106 -131659
9932h4685c6573E5789e0982k4232j20022g8103D5657b10454A18623l8363b8185
$$ -84685 -36573 55789 -50982 -75214 -195236 -78103 45657 -210454 118623 80260 -28185
9920E5906a3024b015A41712b67626b093j17062j10292f240I2262b04580A8376
$$ 55906 -13024 -2015 141712 -267626 -2093 -119155 -229447 -6240 92262 -204580 18376
9908A05718c1725L395j87481f3217j99938B59720e0005a5758A74132c11082a31581
$$ 105718 -31725 -28330 -215811 -63217 -263155 259720 -50005 -15758 174132 -311082 -131581
9896B5712b83638F8539c8448k1506K6420l9243m9793l81859K40427R8531p6470
$$ 25712 -283638 68539 -38448 -59954 -33534 -72777 -122570 -504429 -264002 -165471 -241941
9885b41941i295C8114a85793j02907A18039m9554K1559i9462A52126b87661P3510
$$ -241941 -9295 38114 -185793 -288700 118039 68485 90044 -99462 152126 -287661 -214151
9874b14151B96388a82514j41106A6674c36682E7708P0349F2078L4878a59471L2570
$$ -214151 296388 -182514 -323620 16674 -336682 57708 128057 62078 96956 -159471 -126901
9863a26901j36652i2998K8593j85351B93516f01C24216c62001J27773a6673q40
$$ -126901 -263553 -92998 -64405 -249756 293516 -601 324216 -362001 -234228 -16673 -17513
9852a7513G49L1864g7307k23633a27807r7250h1730B21754b00526K5159B2730
$$ -17513 749 32613 -77307 -300940 -127807 -225057 -81730 221754 -200526 -175367 22730
9840I1143b3884n1384k7467H376J06009M0050a72956A53105a78419C08997A24105
$$ 91143 -23884 -75268 -102735 8376 114385 154435 -172956 153105 -178419 308997 124105
9828F010a80421L4565j32865a26833F1170J69078j6365g5179c0714A13705a48936
$$ 6010 -180421 -145856 -278721 -126833 61170 230248 213883 -75179 -30714 113705 -148936
9816b64381A76369n2787C8789R630c8734a8848k09510E5463j4164c08438a38473
$$ -264381 176369 123582 38789 48419 -38734 -18848 -228358 55463 41299 -308438 -138473
9804c12857M7034J05300b8179l1765j33967A9086a34399I813a86280a4791A62661
$$ -312857 -265823 -160523 -28179 -59944 -193911 19086 -134399 9813 -186280 -14791 162661
9792a0684B25728i2163p3650A3220a2055k60852A6213f5240k97143A19822a40330
$$ -10684 225728 -92163 -165813 13220 -12055 -272907 16213 -65240 -362383 119822 -140330
9780a30217b474j37501D9107O3364L64d3998A03128b70080E153K28644E8926J79009
$$ -130217 -2474 -139975 49107 112471 112835 -43998 103128 -270080 5153 233797 58926 237935
9768B37935e608B01971d05354J64890A56988b23372B10044a62649N1295C84740
$$ 237935 -5608 201971 -405354 -240464 156988 -223372 210044 -162649 -111354 384740
9757f68424d2746n7464A78244b84508B05215d06122O8637h1149G6652K0815l5611
$$ -668424 -42746 -100210 178244 -284508 205215 -406122 -337485 -81149 76652 97467 61856
9746F1856a42989I0933q572a06772p9549j74723J20256B8956a02362E2491J62995
$$ 61856 -142989 90933 82361 -106772 -186321 -361044 -240788 28956 -102362 52491 215486
9735B15486c5656m2840G7826a35143q4130b6813H7780a90954r833f2621K3659
$$ 215486 -35656 -78496 77826 -135143 -219273 -26813 87780 -190954 -200787 -62621 -38962
9724c8962l21213A6736a90731R0643I4487a33564A0507J95671b94880e3685n828
$$ -38962 -360175 16736 -190731 -100088 94487 -133564 10507 206178 -294880 -53685 -59513
9713e9513r3364p169B25243H5782a71288l7377q2709b78l63968J65564L8771G971
$$ -59513 -152877 -160046 225243 85782 -171288 -208665 -291374 -278 -364246 -198682 -159911 7971
9700d5334J3637k290k47025a34028j1233P0577L2253p2446l3616e3794C04338
$$ -45334 -31697 -33987 -281012 -134028 -145261 -74684 -42431 -114877 -148493 -53794 304338
9688c04447a33838B13809g1530C29044a97563B6057b92330i6216b2007K456r0438
$$ -304447 -133838 213809 -71530 329044 -197563 26057 -292330 -96216 -22007 -19551 -109989
9677a09989f964j8676j94607A28659b24563b5466p8929q0330B93003c3193n5757
$$ -109989 -6964 -25640 -220247 128659 -224563 -25466 -104395 -184725 293003 -33193 -88950
9666h8950j1826K2549A15950a26896k06421a0783k42502p8822L2059e9299A81990
$$ -88950 -100776 -78227 115950 -126896 -333317 -10783 -253285 -332107 -300048 -59299 181990
9654c4356L877Q180B47890b4966l72550E2188f5106b8960C0324c4331G8235a31520
$$ -34356 -30479 -22299 247890 -24966 -397516 52188 -65106 -28960 30324 -34331 78235 -131520
9641A02192B8170b20925f1416D4851c20049G7241B3933a30130A50289K54524k8607
$$ 102192 28170 -220925 -61416 44851 -320049 77241 23933 -130130 150289 404813 376206
9630C76206j64387e5270p9071F0710e8450k43774J27571p7304J25852L0257A06321
$$ 376206 211819 -55270 -134341 60710 -58450 -302224 -174653 -251957 -126105 -95848 106321
9618D4863b08247i8490p4494f182A62526D4398Q4039i2649p8638g2542n4288G8056
$$ 44863 -208247 -98490 -172984 -6182 162526 44398 128437 -92649 -171287 -72542 -126830 78056
9605h3697D2120f8697D1244c36331e7679F0688a16365H9809a9958D5782b36155
$$ -83697 42120 -68697 41244 -336331 -57679 60688 -116365 89809 -19958 45782 -236155
9593H2393b67810j04551i2433g981r1480p5616j2074j13847C09935H4354b27108
$$ 82393 -267810 -372361 -92433 -7981 -99461 -175077 -187151 -300998 309935 84354 -227108
9581i0254j49824a3402I6014h4344A61766A2581N5390R3766b79241b4991j6798
$$ -90254 -240078 -13402 96014 -84344 161766 12581 67971 161737 -279241 -24991 -41789
9570d1789n4563K4773j91306J19679B861a92703N4607e5039j43288K0698B11371
$$ -41789 -96352 -71579 -262885 -143206 2861 -192703 -138096 -55039 -198327 -177629 211371
9558a29285k0269J0040l7442j96902J63064g7770A09165b70301d8248F6154c79660
$$ -129285 -149554 -139514 -176956 -373858 -210794 -77770 109165 -270301 -48248 66154 -379660
9546a15717k9304B91388h3837p8510J9122k03820e5134E4081a06972d1331F7128
$$ -115717 -145021 291388 -83837 -162347 -143225 -347045 -55134 54081 -106972 -41331 67128
9534c89228E4049K34911j12707a72079k10769J50733l7263J12467m0791D379a41676
$$ -389228 54049 288960 176253 -172079 -382848 -232115 -269378 -156911 -197702 4379 -141676
9522A80198a07454M4693F1885b22411A81232d0624j00324M1953B86290i916k86787
$$ 180198 -107454 -62761 61885 -222411 181232 -40624 -140948 -98995 286290 -9916 -296703
9511b96703J36933j81138J61745q541A7629c41951L6697i7747j90968M4109l6683
$$ -296703 -159770 -340908 -179163 -187704 17629 -341951 -305254 -97747 -288715 -244606 -281289
9500b81289B2139e8747j99739N7696i5031D6423J5011E79c16110i3087B7788d2961
$$ -281289 22139 -58747 -258486 -200790 -95031 46423 61434 579 -316110 -93087 27788 -42961
9487b61134D2365a86661k0161g9042m9773c1821E1200i5968H433b44858d2169
$$ -261134 42365 -186661 -206822 -79042 -128815 -31821 51200 -95968 8433 -244858 -42169
9475b59697A20525E4951a76111B02942c15966a01602e092k43644A28548a18869
$$ -259697 120525 54951 -176111 202942 -315966 -101602 -5092 -248736 128548 -118869
9464a08213hC1132Q9095m9488h9810M2990A88517K81108I7838a53545c279A24672
$$ -108213 -8 31132 120227 70739 -89810 -46820 188517 469625 97838 -153545 -3279 124672
9451e379k64498e4001l29676J71496E5400J62180e2742r1133j4334f3130l05939
$$ -5379 -269877 -54001 -383677 -212181 55400 217580 -52742 -143875 -158209 -63130 -369069
9440c69069g593k16620b2587C3J15192a2941E809c25686h8864A33399a42343k51358
$$ -369069 -7593 -224213 -22587 33 115225 -12941 5809 -325686 -88864 133399 -142343 -393701
9428c93701B94197h1597L6248E8420f6778I1714b8719p5211C0907J041d0474C6666
$$ -393701 294197 -81597 -45349 58420 -66778 91714 -28719 -103930 30907 31948 -40474 36666
9415a74230l3203N2096B84031n3520b43651j10831J69907B4478a77153A68796
$$ -174230 -207433 -155337 284031 230511 -243651 -354482 -184575 24478 -177153 168796
9404d00310a49862o8046F7423d4181A2163K09440d1380G320a65718d7860B9950
$$ -400310 -149862 -217908 67423 -44181 12163 221603 -41380 7320 -165718 -47860 29950
9392f0295K8485H1812J29167d9587A9777a07060e2559j71993j86813A23380b8294
$$ -60295 -31810 81812 210979 -49587 19777 -107060 -52559 -224552 -411365 123380 -28294
9380A26568P0830b82149Q8665N5464j59256I534a04554k85340j02466a78804d4018
$$ 126568 197398 -282149 -193484 -138020 -297276 9534 -104554 -389894 -492360 -178804 -44018
9368A4454j214h6642M1240j65047M087M508B65054b50819a6337j99553d0901l9569
$$ 14454 13240 -86642 -45402 -210449 -206362 -201854 265054 -250819 -16337 -215890 -40901 -80470
9356h0470K4004k0690b0144B36804J70195a71274E1746N6078b13357n958j64659
$$ -80470 -56466 -77156 -20144 236804 406999 -171274 51746 107824 -213357 -219315 -383974
9345c83974g2630L1356k69699A6635a71757k7772o7398B71058a01310C4324a57574
$$ -383974 -72630 -41274 -310973 16635 -171757 -199529 -266927 271058 -101310 34324 -157574
9333a1420r5491j45939P4727h875p2906q9558j80327d0689I2825c54875m1104
$$ -11420 -106911 -252850 -178123 -8875 -81781 -171339 -351666 -40689 92825 -354875 -395979
9322c95979N6392a60955A19836c38164N1530P2729M1692l9470b6384l24938g7020
$$ -395979 -339587 -160955 119836 -338164 -286634 -213905 -172213 -211683 -26384 -351322 -77020
9310a21748k62063J06506c7381r6032n8941F726a99862A811d6386A77736D596
$$ -121748 -383811 -277305 -37381 -133413 -192354 6726 -199862 1811 -46386 177736 4596
9298g7072C741e2580B63887a5595B40201A4571J6518a2489F2064a06198k0524
$$ -77072 3741 -52580 263887 -15595 240201 14571 31089 -12489 62064 -106198 -126722
9287a26722M2053B48180C7661b46104f7044r0130n9528A21943J36806n6114b21715
$$ -126722 -84669 248180 37661 -246104 -67044 -157174 -216702 121943 258749 202635 -221715
9275b43900G4302c46368a49594f3088O127B5386P0526a78903A11003a53362a0568
$$ -243900 74302 -346368 -149594 -63088 -56961 25386 95912 -178903 111003 -153362 -10568
9263B79204i3248j05460i9350I8629e6894F2547P6599b00248H8977M4099J85216
$$ 279204 -93248 -198708 -99350 98629 -56894 62547 139146 -200248 88977 133076 318292
9252C18292c01586b8142G3194g185B21767c52811a40698M1819k30094J52971a399
$$ 318292 -301586 -28142 73194 -7185 221767 -352811 -140698 -98879 -328973 -176002 -1399
9240d2476j47000h1925m696j77065a3257B26093a99128k0325O8685b4580j74301
$$ -42476 -189476 -81925 -86621 -263686 -13257 226093 -199128 -219453 -150768 -24580 -198881
9229a98881d0083F4958A7990a55351A4471c41277R2560a02590E1395N532i9570
$$ -198881 -40083 64958 17990 -155351 14471 -341277 -248717 -102590 51395 56927 -99570
9217f5937l40598I7069b8386k79441J09849K3820A14162b4470k69682A85959c67562
$$ -65937 -406535 97069 -28386 -307827 -197978 -174158 114162 -24470 -294152 185959 -367562
9205b44166C5938a779m6519A13017a35035A47291J26054o7905b33745g9056c2376
$$ -244166 35938 -1779 -48298 113017 -135035 147291 273345 205440 -233745 -79056 -32376
9193A04986P6551a65634A47824n008J60847H9115c12158e5806F441b45566i2473
$$ 104986 181537 -165634 147824 142816 303663 89115 -312158 -55806 6441 -245566 -92473
9181a07820H0697D0296J14241a62918e7558D1798a2395r5531a4225C30480i0726
$$ -107820 80697 40296 154537 -162918 -57558 41798 -12395 -107926 -14225 330480 -90726
9169c5085F7077c98926g8527J7346o806j59236H9625J22300b78716a25023B87876
$$ -35085 67077 -398926 -78527 -61181 -67987 -227223 89625 211925 -278716 -125023 287876
9157a51225K3949B23978a45749A64457C018d61682b7270o9129k4127b0591C3695
$$ -151225 -127276 223978 -145749 164457 3018 -461682 -27270 -96399 -120526 -20591 33695
9145C65676j39656b04484h4346j91779B93013a21438a4737j66657B09139a40995
$$ 365676 226020 -204484 -84346 -276125 293013 -121438 -14737 -181394 209139 -140995
9134b90375a03475k6906j07167g6340m8539J5016j75247q0084A02151j5289f1093
$$ -290375 -103475 -130381 -237548 -76340 -124879 -109863 -285110 -365194 102151 86862 -61093
9122I9066a84824n9934d6501k585C12830F9191I503a27038C47728A00391b60449
$$ 99066 -184824 -244758 -46501 -49086 312830 69191 9503 -127038 347728 100391 -260449
9110H7051c5704E0312b81971k5838E2449Q2427a5042j60034C74699e15667C8010
$$ 87051 -35704 50312 -281971 -307809 52449 134876 -15042 -175076 374699 -515667 38010
9098I7877i4502j4489q1324k0012N6586f4599m3764B07438H0136C0800i260k32500
$$ 97877 -94502 -108991 -190315 -210327 -153741 -64599 -108363 207438 80136 30800 -9260 -241760
9086b41760I9985b13686P2329N7009k55032E2381A0801d52975e4580F2459c52486
$$ -241760 99985 -213686 -141357 -84348 -339380 52381 10801 -452975 -54580 62459 -352486
9074c79087b1527m3477j93440J18446L5950B62146d16816D8103a55990A95607
$$ -379087 -21527 -65004 -258444 -139998 -104048 262146 -416816 48103 -155990 195607
9063A7941J00255b89870o1822h6653k55979A35939b26685N1470A03369b24062
$$ 17941 118196 -289870 -351692 -86653 -342632 135939 -226685 -175215 103369 -224062
9052b18883J00376a9320A55377a24347M9272K753n0737A01891C5890J28958c12855
$$ -218883 -118507 -19320 155377 -124347 -75075 -72322 -123059 101891 35890 164848 -312855
9040B94924F8159L4454c40806a12522A9902J64191K5457B9049J70945o8945c30731
$$ 294924 68159 102613 -340806 -112522 19902 184093 209550 29049 199994 131049 -330731
9028B41371a14885m8917j4543A20480C2726e2201i289j91381A42285c16574j18375
$$ 241371 -114885 -163802 -178345 120480 32726 -52201 -9289 -200670 142285 -316574 -434949
9017d34949D1006e6772j25483P2743A09792b6531A29863a69940B82590b03412
$$ -434949 41006 -56772 -182255 -109512 109792 -26531 129863 -169940 282590 -203412
9006B53368b80694f3591a0613I5055a01939j65629H6650A4818G138a95088n2055
$$ 253368 -280694 -63591 -10613 95055 -101939 -267568 86650 14818 7138 -195088 -247143
8995b47143K4364g329D0147K20181a27745l44326a18853c0806N674D234b95198
$$ -247143 -222779 -7329 40147 260328 -127745 -472071 -118853 -30806 -25132 4234 -295198
8983A03596a29571E2916g7955p8605C7894J7641P2117n0972c38172a03490j32408
$$ 103596 -129571 52916 -77955 -156560 37894 55535 127652 76680 -338172 -103490 -235898
8972b35898p138a06348k56693H4596a9578D1282a07487j8827L046N0827l07503
$$ -235898 -243036 -106348 -363041 84596 -19578 41282 -107487 -126314 -123268 -72441 -379944
8961c79944N7251D3866k123d9271m4450j08185m8397B35993b29420f8087F0018
$$ -379944 -322693 43866 41743 -49271 -93721 -201906 -250303 235993 -229420 -68087 60018
8949b4358B67708a5151j82312N4265A11930h8051A7235O2916B6841r361a34481
$$ -24358 267708 -15151 -197463 -143198 111930 -88051 17235 80151 26841 17480 -134481
8937A08579L2060a11101a2513j30780f6193B7947a18038J8646e393o3367j52580
$$ 108579 140639 -111101 -12513 -143293 -66193 27947 -118038 -99392 -5393 -68760 -221340
8926b21340f4052q4577B8301J41398a04302A79330k5827C8364J48973F4850d4585
$$ -221340 -64052 -148629 28301 169699 -104302 179330 153503 38364 187337 64850 -44585
8914A64762R172J05458p3912J08175f2272A52711l4687L72489k7685O89222Q45150
$$ 164762 173934 279392 205480 313655 -62272 152711 118024 490513 462828 1152050 1997200
8903A997200K705381J370290B669466r73124E93807J28047k70801p3696m3291
$$ 1997200 4702581 6072871 2669466 1696342 593807 721854 451053 377357 334066
8894C34066I7511J10297C9619J12214a10922D46991A35807E2183a32572B03445
$$ 334066 97511 207808 39619 151833 -110922 446991 135807 52183 -132572 203445
8883A9813M038a01705j1431j20232J02650A08417j2369P229a85943c1232d169
$$ 19813 23851 -101705 -113136 -233368 -130718 108417 96048 103277 -185943 -31232 -4169
8871I1389a8378A14725a51956f1235A66810m5138a31472l3548j0639j52340c1723
$$ 91389 -18378 114725 -151956 -61235 166810 121672 -131472 -165020 -175659 -327999 -31723
8859A22891b22854O31j47354a6048k57733D14466a21811o3800A3575h8475A08928
$$ 122891 -222854 -222223 -369577 -16048 -273781 414466 -121811 -185611 13575 -88475 108928
8847C14960a83098B00654c38440N4465K6729M4218N5531b9050j22299n9507j09932
$$ 314960 -183098 200654 -338440 -283975 -257246 -213028 -157497 -29050 -151349 -210856 -320788
$$ [...]
##END NTUPLES=NMR SPECTRUM
##END=
