
##TITLE=AC1070_TOPL03_5906700_HWW9BtLfFD
##JCAMPDX= 6.0         $$ Bruker NMR JCAMP-DX V2.0
##DATA TYPE= NMR SPECTRUM
##DATA CLASS= NTUPLES
##ORIGIN= BRUKER
##OWNER= Administrator
$$ 1.72 TOPSPIN		Version 2.1
$$ 2012-04-10 10:13:27.812 -0500  Administrator@TOPSPIN
$$ Compression mode = diff/dup
##.OBSERVE FREQUENCY= 400.13188235
##.OBSERVE NUCLEUS= ^1H
##.ACQUISITION MODE= SIMULTANEOUS (DQD)
##.ACQUISITION SCHEME= undefined
##.AVERAGES= 64
##.DIGITISER RES= 22
##SPECTROMETER/DATA SYSTEM= spect
##.PULSE SEQUENCE= noesygpps1d.comp
##.SOLVENT NAME= COFFEE_meoh
##.SHIFT REFERENCE= INTERNAL, COFFEE_meoh, 1, 14.96884
##AUDIT TRAIL= $$ (NUMBER, WHEN, WHO, WHERE, PROCESS, VERSION, WHAT)
$$ ##TITLE= Audit trail, TOPSPIN		Version 2.1
$$ ##JCAMPDX= 5.01
$$ ##ORIGIN= Bruker BioSpin GmbH
$$ ##OWNER= Administrator
$$ $$ C:\Bruker\TOPSPIN/data/COFFEE/nmr/AC1070_TOPL03_5906700_HWW9BtLfFD/12/pdata/1/auditp.txt
$$ ##AUDIT TRAIL=  $$ (NUMBER, WHEN, WHO, WHERE, PROCESS, VERSION, WHAT)
(   1,<2012-04-04 15:59:30.671 -0500>,<Administrator>,<TOPSPIN>,<go>,<TOPSPIN 2.1>,
      <created by zg
	started at 2012-04-04 15:47:59.093 -0500,
	POWCHK enabled, PULCHK disabled,
       configuration hash MD5:
       1A 1E CE 29 27 FD 77 03 67 4E F0 E3 C4 B2 CB 90
       data hash MD5: 64K
       0B 32 BD E1 40 35 17 19 5B 52 8B CB 1D 04 59 A3>)
(   2,<2012-04-04 15:59:33.468 -0500>,<Administrator>,<TOPSPIN>,<proc1d>,<TOPSPIN 2.1>,
      <Start of raw data processing
       efp LB = 0.3 FT_mod = 6 PKNL = 1 PHC0 = 0 PHC1 = 0 SI = 128K 
       data hash MD5: 128K
       70 A8 D2 7A 04 E7 0C 50 3A 23 5F CE 27 0B 32 8B>)
(   3,<2012-04-04 15:59:34.671 -0500>,<Administrator>,<TOPSPIN>,<proc1d>,<TOPSPIN 2.1>,
      <pk PHC0 = 34.32678 PHC1 = 0 
       data hash MD5: 128K
       3D 49 5F E5 1D F1 A2 FA 11 2E F5 09 CB 7D 9A F4>)
(   4,<2012-04-04 15:59:35.109 -0500>,<Administrator>,<TOPSPIN>,<proc1d>,<TOPSPIN 2.1>,
      <abs ABSG = 1 
       data hash MD5: 128K
       9D 0A 3A 20 9B 0F F2 36 85 97 FB 1B 5C E8 1E 1C>)
(   5,<2012-04-04 15:59:35.187 -0500>,<Administrator>,<TOPSPIN>,<proc1d>,<TOPSPIN 2.1>,
      <abs ABSG = 2 
       data hash MD5: 128K
       53 EC 9A 04 A2 07 22 F6 7F 0B E2 7A A7 69 0D 4A>)
(   6,<2012-04-04 15:59:35.250 -0500>,<Administrator>,<TOPSPIN>,<proc1d>,<TOPSPIN 2.1>,
      <abs ABSG = 3 
       data hash MD5: 128K
       9B B1 0B FD E8 CC DD 48 4D 6A 53 0A CD 8F 2A 1D>)
(   7,<2012-04-04 15:59:35.312 -0500>,<Administrator>,<TOPSPIN>,<proc1d>,<TOPSPIN 2.1>,
      <abs ABSG = 4 
       data hash MD5: 128K
       6D 72 CD C0 94 F7 6B 8D C5 82 9D A9 05 EA 08 EC>)
(   8,<2012-04-04 15:59:35.359 -0500>,<Administrator>,<TOPSPIN>,<proc1d>,<TOPSPIN 2.1>,
      <abs ABSG = 5 
       data hash MD5: 128K
       7C BC 90 F8 76 53 ED BD 80 85 76 9F 9E 34 DE CC>)
(   9,<2012-04-04 15:59:35.593 -0500>,<Administrator>,<TOPSPIN>,<audit>,<TOPSPIN 2.1>,
      <user comment:
       ICON-NMR User ID: COFFEE
       data hash MD5: 128K
$$ [...]
##$TP07= 0
##$TPNAME0= <>
##$TPNAME1= <>
##$TPNAME2= <>
##$TPNAME3= <>
##$TPNAME4= <>
##$TPNAME5= <>
##$TPNAME6= <>
##$TPNAME7= <>
##$TPOAL= (0..7)
0.5 0.5 0.5 0.5 0.5 0.5 0.5 0.5
##$TPOFFS= (0..7)
0 0 0 0 0 0 0 0
##$TUNHIN= 0
##$TUNHOUT= 0
##$TUNXOUT= 0
##$USERA1= <user>
##$USERA2= <user>
##$USERA3= <user>
##$USERA4= <user>
##$USERA5= <user>
##$V9= 5
##$VALIST= <valist>
##$VCLIST= <CCCCCCCCCCCCCCC>
##$VD= 0
##$VDLIST= <DDDDDDDDDDDDDDD>
##$VPLIST= <PPPPPPPPPPPPPPP>
##$VTLIST= <TTTTTTTTTTTTTTT>
##$WBST= 2048
##$WBSW= 25
##$XGAIN= (0..3)
0 0 0 0
##$XL= 0
##$YL= 0
##$YMAX_a= 15587348
##$YMIN_a= -7145795
##$ZGOPTNS= <>
##$ZL1= 120
##$ZL2= 120
##$ZL3= 120
##$ZL4= 120
##$ABSF1= 14.96884
##$ABSF2= -5.583691
##$ABSG= 5
##$ABSL= 3
##$ALPHA= 0
##$AQORDER= 0
##$ASSFAC= 0
##$ASSFACI= 0
##$ASSFACX= 0
##$ASSWID= 0
##$AUNMP= <proc_prof1d_extract.lims>
##$AXLEFT= 0
##$AXNAME= <>
##$AXNUC= <1H>
##$AXRIGHT= 0
##$AXTYPE= 0
##$AXUNIT= <>
##$AZFE= 0.1
##$AZFW= 0.1
##$BCFW= 0
##$BC_mod= 0
##$BYTORDP= 0
##$COROFFS= 0
##$CY= 15
##$DATMOD= 1
##$DC= 0
##$DFILT= <>
##$DTYPP= 0
##$F1P= 0
##$F2P= 0
##$FCOR= 0.5
##$FTSIZE= 131072
##$FT_mod= 6
##$GAMMA= 0
##$GB= 0
##$INTBC= 1
##$INTSCL= 1
##$ISEN= 128
##$LB= 0.3
##$LEV0= 0
##$LPBIN= 0
##$MAXI= 10000
##$MC2= 0
##$MEAN= 0
##$ME_mod= 0
##$MI= 0
##$NCOEF= 0
##$NC_proc= -3
##$NLEV= 6
##$NOISF1= 0
##$NOISF2= 0
##$NSP= 0
##$NTH_PI= 0
##$NZP= 0
##$OFFSET= 14.96884
##$PC= 1
##$PHC0= 34.32678
##$PHC1= 0
##$PH_mod= 1
##$PKNL= yes
##$PPARMOD= 0
##$PPDIAG= 0
##$PPIPTYP= 0
##$PPMPNUM= 2147483647
##$PPRESOL= 1
##$PSCAL= 4
##$PSIGN= 0
##$PYNMP= <proc.py>
##$REVERSE= no
##$SF= 400.130004711632
##$SI= 131072
##$SIGF1= 0
##$SIGF2= 0
##$SINO= 400
##$SIOLD= 131072
##$SPECTYP= <>
##$SREGLST= <1H.CDCl3>
##$SSB= 0
##$STSI= 131072
##$STSR= 0
##$SW_p= 8223.68421052632
##$SYMM= 0
##$S_DEV= 0
##$TDeff= 65536
##$TDoff= 0
##$TI= <>
##$TILT= no
##$TM1= 0
##$TM2= 0
##$TOPLEV= 0
##$USERP1= <user>
##$USERP2= <user>
##$USERP3= <user>
##$USERP4= <user>
##$USERP5= <user>
##$WDW= 1
##$XDIM= 131072
##$YMAX_p= 540573598
##$YMIN_p= -538426956
##$CURPLOT= <Network HP LaserJet P1505>
##$CURPRIN= <$Network HP LaserJet P1505>
##$DFORMAT= <normdp>
##$LAYOUT= <+/1D_H.xwp>
##$LFORMAT= <normlp>
##$PFORMAT= <normpl>
##$SURQMSG= 1
$$ End of Bruker specific parameters
$$ ---------------------------------
##NTUPLES= NMR SPECTRUM
##VAR_NAME=  FREQUENCY,     SPECTRUM/REAL,   SPECTRUM/IMAG
##SYMBOL=    X,             R,               I
##VAR_TYPE=  INDEPENDENT,   DEPENDENT,       DEPENDENT
##VAR_FORM=  AFFN,          ASDF,            ASDF
##VAR_DIM=   131072,        131072,          131072
##UNITS=     HZ,            ARBITRARY UNITS, ARBITRARY UNITS
##FACTOR=    0.0627417313425165, 1,          1
##FIRST=     8223.62146879498, 6102,         -122322
##LAST=      0,             10893,           -121463
##MIN=       0,             -538426956,      0
##MAX=       8223.62146879498, 540573598,    0
$$ Real data points
##PAGE= N=1
##DATA TABLE= (X++(R..R)), XYDATA
$$ [...]
61707B7984209J829702J830577J766937J620923J379932J042507O21752J45180
61699C8221719l48755q17858j225993j550598j783683j927867j992365j990920
61691B6583680j939667j853987j746187j625456j499003j372438j249525j132436
61683A4164981j022766r22276q32224p52080o79443o12043n49760m94112m45838
61674G854439m03767l66157l32159l01228k72187k44109k17935j95843j78706
61665E342348j65065j53147j43008j35808j31478j28248j24617j20704j17092
61656D123181j13271j08360j02904r8509r5383r1632q5724p8717p2893o8785o4948
61645C142055o0462n6275n3655n2281n0683m8087m5309m3840m4273m5520m5696
$$ y = [27984209, 29813911, 31644488, 33411425, 35032348, 36412280, 37454787, 38076539, 38221719, 37872964, 37055106, 35829113, 34278515, 32494832, 30566965, 28574600, 26583680, 24644013, 22790026, 21043839, 19418383, 17919380, 16546942, 15297417, 14164981, 13142215, 12219939, 11387715, 10635635, 9956192, 9344149, 8794389, 8300277, 7854439, 7450672, 7084515, 6752356, 6451128, 6178941, 5934832, 5716897, 5521054, 5342348, 5177283, 5024136, 4881128, 4745320, 4613842, 4485594, 4360977, 4240273, 4123181, 4009910, 3901550, 3798646, 3700137, 3604754, 3513122, 3427398, 3348681, 3275788, 3207003, 3142055, 3081593, 3025318, 2971663, 2919382, 2868699, 2820612, 2775303, 2731463, 2687190, 2641670, 2595974]
61634B595974m4006m1514l9672l8430l6511l3354k9846k6978k4817k3162k2256
61623B235428k2102k1745k0187j7643j5239j3642j2682j2188j2322j2846j2821
61612B062011j1517r422p856p592q110q202p200n605m665n239o919q314q582q522
61598A954266r618j1791j2877j1035p053l448j544n54O28J972L018L729M243M593
61584A914529N214O640Q271Q576P271O127O663Q163R118R515J0318J1600J2878
61571B024883J4554J7245K0177K1939K2479K2509K1260J7050J0222L323k212p540
61559B185889j3896k0438k5625k9084l0991l1015k9189k6758k4911k3584k2433
61548A907965k1918k2258k2335k1044j8991j7559j6981j6637j6590j7206j7682
$$ y = [2595974, 2551968, 2510454, 2470782, 2432352, 2395841, 2362487, 2332641, 2305663, 2280846, 2257684, 2235428, 2213326, 2191581, 2171394, 2153751, 2138512, 2124870, 2112188, 2100000, 2087678, 2074832, 2062011, 2050494, 2041072, 2033216, 2025624, 2017514, 2009312, 2002112, 1996507, 1991842, 1986603, 1979684, 1971370, 1962788, 1954266, 1944648, 1932857, 1919980, 1908945, 1901892, 1898444, 1896900, 1896346, 1896974, 1898946, 1901964, 1905693, 1909936, 1914529, 1919743, 1926383, 1934654, 1943230, 1950501, 1956628, 1963291, 1971454, 1980572, 1990087, 2000405, 2012005, 2024883, 2039437, 2056682, 2076859, 2098798, 2121277, 2143786, 2165046, 2182096, 2192318, 2195641, 2193429, 2185889, 2171993, 2151555, 2125930, 2096846, 2065855, 2034840, 2005651, 1978893, 1953982, 1930398, 1907965, 1886047, 1863789, 1841454, 1820410, 1801419, 1783860, 1766879, 1750242, 1733652, 1716446, 1698764]
61537A698764j6552j3746j0737q437o280l637r22J329L347N433P148Q072Q793
61524A672575J0334J2846J5676J8494K1549K4686K7115K8657L0449L3560L7325
61513A933266M0202M2043M4166M6947M8893M9068M9089N1121N4706N7327N7737
61502B474565N6914N5737N3685N0467M7092M4369M1620L8083L4581L2547L2045
61491B961705L1850L1056K9566K7400K4504K1050J7153J2370O350j73n748r762
61479C147321j2996j6375j9585k1352k0972j9237j7456j5784j3206r232m763n93
61467B975770M020J0138J7177K3586K9230L5455M2923N0984N9311O8342P7788
61456C394724Q6721R5814J07338J21761J36427J49401J62734J79724K00089K20317
$$ y = [1698764, 1682212, 1668466, 1657729, 1649292, 1643012, 1639375, 1638453, 1639782, 1643129, 1648562, 1655710, 1663782, 1672575, 1682909, 1695755, 1711431, 1729925, 1751474, 1776160, 1803275, 1831932, 1862381, 1895941, 1933266, 1973468, 2015511, 2059677, 2106624, 2155517, 2204585, 2253674, 2304795, 2359501, 2416828, 2474565, 2531479, 2587216, 2640901, 2691368, 2738460, 2782829, 2824449, 2862532, 2897113, 2929660, 2961705, 2993555, 3024611, 3054177, 3081577, 3106081, 3127131, 3144284, 3156654, 3163004, 3162831, 3157083, 3147321, 3134325, 3117950, 3098365, 3077013, 3056041, 3036804, 3019348, 3003564, 2990358, 2981126, 2976363, 2975770, 2979790, 2989928, 3007105, 3030691, 3059921, 3095376, 3138299, 3189283, 3248594, 3316936, 3394724, 3481445, 3577259, 3684597, 3806358, 3942785, 4092186, 4254920, 4434644, 4634733, 4855050]
61446D855050K38255K55171K73366K93663L15210L36089L53828L66669L74426
61437G661727L76962L72021L55826L25812K81772K24958J57864Q4947J1734n7402
61427I796221j19628j72234k12784k41186k59822k70766k74168k70041k60080
61418G715512k46484k30095k10901j89644j67711j45932j24383j03145q2343o1781
61408F153093m1326k1642l874J1377K4565L6778M8942O1013P1825Q0123Q5888
61397F506762R0177R3497R5146R4517R2262Q9553Q6857Q4220Q2242Q1785Q2854
61386G479872Q4474Q5661Q6013Q5441Q3974Q1839P9313P6382P2837O8496O3033
61375H347335N5999M7544L8809L0745K2644J2773P12j1860k3076l2877m2388n1931
$$ y = [4855050, 5093305, 5348476, 5621842, 5915505, 6230715, 6566804, 6920632, 7287301, 7661727, 8038689, 8410710, 8766536, 9092348, 9374120, 9599078, 9756942, 9841889, 9853623, 9796221, 9676593, 9504359, 9291575, 9050389, 8790567, 8519801, 8245633, 7975592, 7715512, 7469028, 7238933, 7028032, 6838388, 6670677, 6524745, 6400362, 6297217, 6214874, 6153093, 6111767, 6090125, 6086251, 6097628, 6122193, 6158971, 6207913, 6268926, 6340751, 6420874, 6506762, 6596939, 6690436, 6785582, 6880099, 6972361, 7061914, 7148771, 7232991, 7315233, 7397018, 7479872, 7564346, 7650007, 7736020, 7821461, 7905435, 7987274, 8066587, 8142969, 8215806, 8284302, 8347335, 8403334, 8450878, 8489687, 8520432, 8543076, 8555849, 8556561, 8544701, 8521625, 8488748, 8446360, 8394429]
61363H394429o0539o7134p1323p3023p2205o9284o5093o0053n3779m5877l6690
61352G719429k6894j6877p095J358P295J0558J2052J2596J2255J0762Q111M571
61340G748121O03l061n551o117m097J043R141J9124L0289M3646O0876Q1869J04454
61327H080340J27113J50717J76726K04676K32753K60176K87512L14748L40447
61318A0175208L63072L81939L96174M03619M01607L88527L63947L27255K77214
61309A3478562K13697J39954O2379j2739q2162j45271k01463k49487k89351l23034
61299A2591085l52063l75343l90717l97986l99000l95165l86507l73246l56857
61290I164201l39050l20713l02168k83518k64360k44135k23301k03324j84910
$$ y = [8394429, 8333890, 8266756, 8195433, 8122410, 8050205, 7980921, 7915828, 7855775, 7801996, 7756119, 7719429, 7692535, 7675658, 7668563, 7669921, 7677216, 7687774, 7699826, 7712422, 7724677, 7735439, 7743550, 7748121, 7748724, 7745663, 7740112, 7733995, 7729898, 7730941, 7740082, 7759206, 7789495, 7833141, 7894017, 7975886, 8080340, 8207453, 8358170, 8534896, 8739572, 8972325, 9232501, 9520013, 9834761, 10175208, 10538280, 10920219, 11316393, 11720012, 12121619, 12510146, 12874093, 13201348, 13478562, 13692259, 13832213, 13894592, 13881853, 13799691, 13654420, 13452957, 13203470, 12914119, 12591085, 12239022, 11863679, 11472962, 11074976, 10675976, 10280811, 9894304, 9521058, 9164201, 8825151, 8504438, 8202270, 7918752, 7654392, 7410257, 7186956, 6983632, 6798722]
61281F798722j67030j48227j28172j07452q6660o6481m7878l1231j5797q75J2881
61270F011800K4285L3268M0744M7114N2189N6430O0824O5148O7653O7089O4095
61259F590639N9969N5183M9950M5161M1397L7668L2725K7305K3458K1558J9540
61248G004553J5572R973L797l039j1053j9663k7818l5577m3678n1889n9103o4976
61236F717099p0249p5375p9919q3456q5999q7301q6810q4651q1700p8312p3812
61225E829515o7737o0675n3266m5247l6300k7306j9851j4636j0953p633m149r63
61213E480799R70J148R2j246k424l297l094q43L003O376P695P463P174P582Q801
61198E520199J1387J6097K2867L1006M0414N1877O6017Q2273R8886J13879J26452
$$ y = [6798722, 6631692, 6483465, 6355293, 6247841, 6161181, 6094700, 6046822, 6015591, 5999794, 5998919, 6011800, 6036085, 6069353, 6110097, 6157211, 6209400, 6265830, 6326654, 6391802, 6459455, 6526544, 6590639, 6650608, 6705791, 6755741, 6800902, 6842299, 6879967, 6912692, 6939997, 6963455, 6985013, 7004553, 7020125, 7030098, 7033895, 7030856, 7019803, 7000140, 6972322, 6936745, 6893067, 6841178, 6782075, 6717099, 6646850, 6571475, 6491556, 6408100, 6322101, 6234800, 6147990, 6063339, 5981639, 5903327, 5829515, 5761778, 5701103, 5647837, 5602590, 5566290, 5538984, 5519133, 5504497, 5493544, 5485911, 5481762, 5480799, 5481769, 5482917, 5483009, 5481763, 5479339, 5476042, 5472948, 5472105, 5475108, 5481484, 5489179, 5496642, 5503816, 5511398, 5520199, 5531586, 5547683, 5570550, 5601556, 5641970, 5693847, 5759864, 5842137, 5941023, 6054902, 6181354]
61187F181354J37521J48075J56678J59620J54215J41001J21566R5264N9847J5269
61177G370410l4736q5143j32397j74368k09037k34504k50021k56313k54963k47820
61167E491108k36812k23756k10081j96479j82688j67842j51553j34714j18866
61158C868317j04798r2240q0990p1660o4663n8931n2605m5143l7904l2066k6723
61147C200594k0147j2578o220k047J813P483J4294J9879K3445K6069K8017K7895
61135C308497K4990K0658J6465J2303P394K090k513o167r735j4061j9161k4285
61123C316475k8481l1522l4230l7428m0761m3390m5597m8391n1629n4071n5422
61112B845553n6640n7935n8331n7808n7714n8152n7137n3779n0293m8962m8883
$$ y = [6181354, 6318875, 6466950, 6623628, 6783248, 6937463, 7078464, 7200030, 7295294, 7355141, 7370410, 7335674, 7250531, 7118134, 6943766, 6734729, 6500225, 6250204, 5993891, 5738928, 5491108, 5254296, 5030540, 4820459, 4623980, 4441292, 4273450, 4121897, 3987183, 3868317, 3763519, 3671279, 3590289, 3518629, 3453966, 3395035, 3342430, 3297287, 3259383, 3227317, 3200594, 3180447, 3167869, 3161649, 3159602, 3161415, 3168898, 3183192, 3203071, 3226516, 3252585, 3280602, 3308497, 3333487, 3354145, 3370610, 3382913, 3390307, 3392397, 3389884, 3383717, 3373982, 3359921, 3340760, 3316475, 3287994, 3256472, 3222242, 3184814, 3144053, 3100663, 3055066, 3006675, 2955046, 2900975, 2845553, 2788913, 2730978, 2672647, 2614839, 2557125, 2498973, 2441836, 2388057, 2337764, 2288802, 2239919]
61101B239919m7758m5507m3709m2576m0879l8307l5669l3121l0225k7572k6554
61090A828042k7474k9424l1700l3905l5020l4102l1688k9215k7228k5457k3934
61079A498895k2564k0213j5932j0667o110k570M05K281K646L263O327J0947J3964
61066A460672J4330J4137J5019J6112J6208J5581J4904J4446J4991J7482K0854
61055A634736K2373K1091J9195J8885J9680J9800J8609J6467J3563J0095O643
61044A821137L399k2l620o889r975j3520j6911j8327j7272j5577j5132j5968j7261
61031A674062j8809k0624k2284k3473k4170k3972k2531k0954k1042k2600k3266
61020A430337k1739j9382j7738j6332j4128j1459r018o439l393q86O2J58Q65K365
$$ y = [2239919, 2192161, 2146654, 2102945, 2060369, 2019490, 1981183, 1945514, 1912393, 1882168, 1854596, 1828042, 1800568, 1771144, 1739444, 1705539, 1670519, 1636417, 1604729, 1575514, 1548286, 1522829, 1498895, 1476331, 1456118, 1440186, 1429519, 1423409, 1420839, 1421244, 1423525, 1426171, 1429434, 1435761, 1446708, 1460672, 1475002, 1489139, 1504158, 1520270, 1536478, 1552059, 1566963, 1581409, 1596400, 1613882, 1634736, 1657109, 1678200, 1697395, 1716280, 1735960, 1755760, 1774369, 1790836, 1804399, 1814494, 1821137, 1824536, 1824514, 1820894, 1814005, 1804030, 1790510, 1773599, 1755272, 1738000, 1722423, 1707291, 1691323, 1674062, 1655253, 1634629, 1612345, 1588872, 1564702, 1540730, 1518199, 1497245, 1476203, 1453603, 1430337, 1408598, 1389216, 1371478, 1355146, 1341018, 1329559, 1320541, 1314102, 1310709, 1309823, 1309885, 1310043, 1310908, 1313273]
61006A313273L666M198M331M627N225N612M887L028J756K867N682P650P614O828
60992A381244O541O620O987Q196R806J0318R808J0527J3587J7046J8669J8794
60980A518143J9033J9910K1339K3772K7233L0501L2669L4180L5366L5667L5404
60969A833217L6217L8436M0075M0024L9972M1366M2826M2918M3255M6113N0673
60958B295092N4477N7246O0506O4582O8676P3064P8652Q5038R1253R7738J05576
60947C131900J14722J24790J36285J49060J61142J71426J81935J94929K09384
60938D575573K23129K36611K51482K67270K83014L00742L23303L49922L78044
60929G189090M08586M44859M86627N29897N73005O18996O71871P34321Q08975
$$ y = [1313273, 1316939, 1321137, 1325468, 1330095, 1335320, 1340932, 1345819, 1348847, 1350603, 1353470, 1359152, 1366802, 1374416, 1381244, 1387785, 1394405, 1401392, 1409588, 1419394, 1429712, 1439520, 1450047, 1463634, 1480680, 1499349, 1518143, 1537176, 1557086, 1578425, 1602197, 1629430, 1659931, 1692600, 1726780, 1762146, 1797813, 1833217, 1869434, 1907870, 1947945, 1987969, 2027941, 2069307, 2112133, 2155051, 2198306, 2244419, 2295092, 2349569, 2406815, 2467321, 2531903, 2600579, 2673643, 2752295, 2837333, 2928586, 3026324, 3131900, 3246622, 3371412, 3507697, 3656757, 3817899, 3989325, 4171260, 4366189, 4575573, 4798702, 5035313, 5286795, 5554065, 5837079, 6137821, 6461124, 6811046, 7189090, 7597676, 8042535, 8529162, 9059059, 9632064, 10251060, 10922931, 11657252, 12466227]
60920A2466227Q97663R99550J114309J246689J403210J585725J794542K035861
60912B3543776K316884K634866K983310L363747L756661M054534M050738L561041
60904E0265557K600285J430282M03816k51575n07925m46518j65350J98471M13922
60895E3940965K22121m83771j547206k638646l466729l916847m030994l909093
60887C4169800l642997l304728k948053k603948k283243j989626j727205j497283
60879A4172717j296288j120579r69888q44555p42461o59943n92994n36752m86540
60870F922717m40561l99642l63878l31513l01417k74241k50320k28643k08877
60861D123625j92413j80207j70992j62806j54899j47091j38476j28256j17194
$$ y = [12466227, 13363890, 14363440, 15477749, 16724438, 18127648, 19713373, 21507915, 23543776, 25860660, 28495526, 31478836, 34842583, 38599244, 42653778, 46704516, 50265557, 52865842, 54296124, 54699940, 54448365, 53940440, 53493922, 53328572, 53527043, 53940965, 54163086, 53679315, 52132109, 49493463, 46026734, 42109887, 38078893, 34169800, 30526803, 27222075, 24274022, 21670074, 19386831, 17397205, 15670000, 14172717, 12876429, 11755850, 10785962, 9941407, 9198946, 8539003, 7946009, 7409257, 6922717, 6482156, 6082514, 5718636, 5387123, 5085706, 4811465, 4561145, 4332502, 4123625, 3931212, 3751005, 3580013, 3417207, 3262308, 3115217, 2976741, 2848485, 2731291]
60852B731291j06997r8371r0558q2683p4916o8212o3184n9338n5449n0692m5252
60841A935639l9774l4677l0245k6857k4462k2271j9741j7482j6409j6115j5068
60830A672538j2380q597m761j636j8p09l402o231p367p105p700j0826j5544j9217
60816A567045k0353k0022k0220k1474k2685k2991k2687k2223k1376j9920j8325
60805A334769j7134j6080j4477j2108r234o088k829J94K663M572O046P117Q000
60792A285411R290J1552J4819J8544K1819K3743K4257K4632K6355K9277L1604
60781A521303L2026L1113L0201K9664K8873K7218K4542K1099J7534J4464J1641
60770A789678Q272M498J787J111J559J465L25j310l200n562q228j0587j2342j3716
$$ y = [2731291, 2624294, 2525923, 2435365, 2352682, 2277766, 2209554, 2146370, 2087032, 2031583, 1980891, 1935639, 1895865, 1861188, 1830943, 1804086, 1779624, 1757353, 1737612, 1720130, 1703721, 1687606, 1672538, 1660158, 1651561, 1646800, 1645164, 1645146, 1644437, 1641035, 1634804, 1627437, 1620332, 1612632, 1601806, 1586262, 1567045, 1546692, 1526670, 1506450, 1484976, 1462291, 1439300, 1416613, 1394390, 1373014, 1353094, 1334769, 1317635, 1301555, 1287078, 1274970, 1265736, 1259648, 1256819, 1257013, 1259676, 1264248, 1270294, 1277411, 1285411, 1294701, 1306253, 1321072, 1339616, 1361435, 1385178, 1409435, 1434067, 1460422, 1489699, 1521303, 1553329, 1584442, 1614643, 1644307, 1673180, 1700398, 1724940, 1746039, 1763573, 1778037, 1789678, 1797950, 1802448, 1804235, 1805346, 1806905, 1808370, 1808695, 1807385, 1804185, 1798623, 1790395, 1779808, 1767466, 1753750]
60756A753750j5052j6722j9026k1561k3180k3248k2577k2359k2639k2577k1819
60745A522990k0715j9458j7936j6234j4413j1982q561m995k824k415k330q46K397
60732A402678O372R682J1525J2167J2650J3806J5550J7314J8840K0084K0628J9891
60720A581187J8010J5944J4547J3901J3580J3291J3119J3260J3507J3166J1876
60709A735388J0605J1079J3773J7002J8532J7732J5625J3447J1956J1559J2056
60698A888754J2233J0726P475L836J191r3n37r40j874l141l767l136j989j709
60684A907029k692m157n494o967q818j0548j1573j2206j3385j5509j7775j8858
60672A779047j8182j6542j5203j4424j3345j1566j0089j0097j1233j1945j1308
$$ y = [1753750, 1738698, 1721976, 1702950, 1681389, 1658209, 1634961, 1612384, 1590025, 1567386, 1544809, 1522990, 1502275, 1482817, 1464881, 1448647, 1434234, 1422252, 1413691, 1408696, 1405872, 1403457, 1401127, 1400281, 1402678, 1409050, 1418732, 1430257, 1442424, 1455074, 1468880, 1484430, 1501744, 1520584, 1540668, 1561296, 1581187, 1599197, 1615141, 1629688, 1643589, 1657169, 1670460, 1683579, 1696839, 1710346, 1723512, 1735388, 1745993, 1757072, 1770845, 1787847, 1806379, 1824111, 1839736, 1853183, 1865139, 1876698, 1888754, 1900987, 1911713, 1919188, 1923024, 1924215, 1924122, 1923585, 1922645, 1920771, 1917630, 1913863, 1910727, 1908738, 1907029, 1904337, 1900180, 1894686, 1887719, 1878901, 1868353, 1856780, 1844574, 1831189, 1815680, 1797905, 1779047, 1760865, 1744323, 1729120, 1714696, 1701351, 1689785, 1679696, 1669599, 1658366, 1646421, 1635113]
60661A635113r749q099o896o524p155q247q807q487p702o637m953k855j520j711
60647A545771k559k510j174M36J307J360J054P76O74O43K28j048l161n595p962
60632A528240j0263j2441j4187j5394j6431j7600j8687j9488k0385k1710k2762
60621A338892k2319k0255j7807j5968j4369j2274r892p947o524n085l305j176
60609A201971J280L669N076N233N466P231R882J1232J0460R091Q679Q768P961
60596A295999N991L951L079L895N945P917Q668Q576R041J0308J0940J0113R189
60583A393612R865J1741J3184J3836J4664J5891J6646J6716J7014J7945J8718
60572A559832J8912J9436K0979K2514K2514K1092J9705J8823J7210J3862R689
$$ y = [1635113, 1625364, 1617265, 1610369, 1603845, 1596690, 1588443, 1579636, 1571149, 1563447, 1556810, 1551857, 1549002, 1547482, 1545771, 1543212, 1540702, 1539528, 1539964, 1541271, 1542631, 1543685, 1544461, 1545135, 1545778, 1546006, 1544958, 1541797, 1536202, 1528240, 1517977, 1505536, 1491349, 1475955, 1459524, 1441924, 1423237, 1403749, 1383364, 1361654, 1338892, 1316573, 1296318, 1278511, 1262543, 1248174, 1235900, 1226008, 1218061, 1211537, 1206452, 1203147, 1201971, 1203251, 1206920, 1211996, 1217229, 1222695, 1229926, 1239808, 1251040, 1261500, 1270591, 1279270, 1288038, 1295999, 1301990, 1305941, 1309020, 1312915, 1318860, 1326777, 1335445, 1344021, 1353062, 1363370, 1374310, 1384423, 1393612, 1403477, 1415218, 1428402, 1442238, 1456902, 1472793, 1489439, 1506155, 1523169, 1541114, 1559832, 1578744, 1598180, 1619159, 1641673, 1664187, 1685279, 1704984, 1723807, 1741017, 1754879, 1764568]
60561A764568O349M011J328k408o264r220j1678j4509j7306j8906j9361k0022
60549A656582k1398k2145k0747j7273j2937q817n667m114m082m383l753k070j04
60536A529092J434K118J571j07j921k704k213j080J23J306K585M074N811P541
60522A547630Q675Q771P882O375M794L852L779L603J974r02l144l638l477m093
60508A582081n063n094m455m792o664q839j0141j0814j1652j2706j3405j3322
60496A475134j2513j1384j0274q912o430k451J970N124O453P162Q925J2240J5996
60483A481040J8575J9615K0722K3820K8695L3013L5317L6993M0449M6119N2301
60472A836659N7203N9853N9509N5703M8890L9862K8577J4775j11j2967k1376k5257
$$ y = [1764568, 1770917, 1774928, 1776256, 1773848, 1767584, 1758364, 1746686, 1732177, 1714871, 1695965, 1676604, 1656582, 1635184, 1613039, 1592292, 1575019, 1562082, 1553265, 1547598, 1543484, 1539402, 1535019, 1531266, 1529196, 1529092, 1530526, 1532644, 1534215, 1534108, 1532187, 1529483, 1527270, 1526190, 1526313, 1527619, 1530204, 1534278, 1540089, 1547630, 1556305, 1565076, 1572958, 1579333, 1584127, 1587979, 1591758, 1595361, 1597335, 1596433, 1593289, 1589651, 1586174, 1582081, 1577018, 1571924, 1567469, 1562677, 1556013, 1547174, 1537033, 1526219, 1514567, 1501861, 1488456, 1475134, 1462621, 1451237, 1440963, 1432051, 1425621, 1423170, 1425140, 1430264, 1436717, 1443879, 1452804, 1465044, 1481040, 1499615, 1519230, 1539952, 1563772, 1592467, 1625480, 1660797, 1697790, 1738239, 1784358, 1836659, 1893862, 1953715, 2013224, 2068927, 2117817, 2157679, 2186256, 2201031, 2200920, 2187953, 2166577, 2141320]
60460B141320k5994k4757k1976j7598j1447l808M209J1370J7344K2458K6621K9436
60448B147178L1311L3381L6057L8579M0372M2094M4828M8998N4596O1888P1238
60437B650520Q2450R4727J07267J19824J32874J47210J63109J79986J97237K15227
60427D090431K34784K55836K77285K98401L19826L42919L68564L96373M23847
60418G008266M45343M52133M34732L86558L06634J99668P3930o1042j95115l17278
60408H733829m16660m85574n22226n30694n18446m93217m60724m23995l84820
60399D497473l45642l09288k76773k46934k18987j94127j73419j55480j38123
60390B438700j21471j07532r6934q8063p9430p1159o3814n7354n1628m6771m2672
$$ y = [2141320, 2115326, 2090569, 2068593, 2050995, 2039548, 2035740, 2039949, 2051319, 2068663, 2091121, 2117742, 2147178, 2178489, 2211870, 2247927, 2286506, 2326878, 2368972, 2413800, 2462798, 2517394, 2579282, 2650520, 2732970, 2827697, 2934964, 3054788, 3187662, 3334872, 3497981, 3677967, 3875204, 4090431, 4325215, 4581051, 4858336, 5156737, 5476563, 5819482, 6188046, 6584419, 7008266, 7453609, 7905742, 8340474, 8727032, 9033666, 9233334, 9307264, 9246222, 9051107, 8733829, 8317169, 7831595, 7309369, 6778675, 6260229, 5767012, 5306288, 4882293, 4497473, 4151831, 3842543, 3565770, 3318836, 3099849, 2905722, 2732303, 2576823, 2438700, 2317229, 2209697, 2112763, 2024700, 1945270, 1874111, 1810297, 1752943, 1701315, 1654544, 1611872]
60379A611872l9101l6414l4962l3885l1844k8963k6493k4558k2001j8826j6706
60368A298119j6220j5479j2854r480p537p203o992o289n789n748n386m136k387
60355A192619p60N55J608K375K825L010L120L500M481N862O909O974O019M531
60341A243628L349L316M492N820O334O566P767R771J0920J0454R522R159Q542
60328A339640O366K973j2j547j661p69M41R14J26j169j956k366l122m007l990
60313A329861k875j704j384j741k125k169j761q52L73J622K934M512N967O346
60299A337004N452M614N400P632R410R415Q563Q722J0145J1197J0673R327Q578
60286A446132Q715R338J0660J2968J5163J5418J3435J0908R431R071R158R268
$$ y = [1611872, 1572771, 1536357, 1501395, 1467510, 1435666, 1406703, 1380210, 1355652, 1333651, 1314825, 1298119, 1281899, 1266420, 1253566, 1244086, 1236549, 1229346, 1222354, 1216065, 1210276, 1204528, 1199142, 1195006, 1192619, 1191859, 1192414, 1194022, 1196397, 1199222, 1202232, 1205352, 1208852, 1213333, 1219195, 1226104, 1233078, 1239097, 1243628, 1246977, 1250293, 1254785, 1260605, 1266939, 1273505, 1281272, 1291043, 1301963, 1312417, 1321939, 1331098, 1339640, 1346006, 1348979, 1348967, 1347420, 1345759, 1344990, 1345431, 1346345, 1346471, 1345302, 1343346, 1340980, 1337858, 1333851, 1329861, 1326986, 1325282, 1323898, 1322157, 1320032, 1317863, 1316102, 1315250, 1315623, 1317245, 1320179, 1324691, 1330658, 1337004, 1342456, 1347070, 1352470, 1360102, 1369512, 1378927, 1387490, 1396212, 1406357, 1417554, 1428227, 1437554, 1446132, 1454847, 1464185, 1474845, 1487813, 1502976, 1518394, 1531829, 1542737, 1552168, 1561239, 1570397, 1579665]
60274A579665Q950P701N968N076N548O425P042Q294J1191J4859J7369J7963J7369
60261A713420J6112J3835J0251N843J269l184p448j1367j4728j7293j8744j8930
60249A669036j8113j6845j5637j4782j4148j3077j0906p788m640k135k12J260
60237A552013K088K404L035M559O522Q107R188J0067J0690J0813J0637J0445R885
60224A650453Q468O812O448Q064J0518J2017J1989J1405J1425J2259J3470J5021
60212A778349J7246J9830K1675K2403K3339K6006K9993L3546L6103L8876M2562
60201B089928M6025M8238N0365N4582O1270O8583P4723P9744Q5009R1576R9252
60190B849295J07002J14176J21381J29745J39368J49139J58324J67462J76992
$$ y = [1579665, 1588615, 1596316, 1602284, 1607360, 1612908, 1619333, 1626375, 1634669, 1645860, 1660719, 1678088, 1696051, 1713420, 1729532, 1743367, 1753618, 1759461, 1760730, 1757546, 1750098, 1738731, 1724003, 1706710, 1687966, 1669036, 1650923, 1634078, 1618441, 1603659, 1589511, 1576434, 1565528, 1557740, 1553100, 1550965, 1550753, 1552013, 1554101, 1556505, 1559540, 1564099, 1570621, 1578728, 1587916, 1597983, 1608673, 1619486, 1630123, 1640568, 1650453, 1658921, 1665733, 1672181, 1680245, 1690763, 1702780, 1714769, 1726174, 1737599, 1749858, 1763328, 1778349, 1795595, 1815425, 1837100, 1859503, 1882842, 1908848, 1938841, 1972387, 2008490, 2047366, 2089928, 2135953, 2184191, 2234556, 2289138, 2350408, 2418991, 2493714, 2573458, 2658467, 2750043, 2849295, 2956297, 3070473, 3191854, 3321599, 3460967, 3610106, 3768430, 3935892, 4112884]
60181D112884J85769J92060J95663J97931J99544J99188J94842J85879J73494
60172E837254J59299J43868J26715J07454Q6611O5169M3797K2984L555j3769k9135
60161F553802m2799n3492n8782n7766n2487m5883l8922l0546j9618n860J0625
60150F158272K9405M9229O8511Q6595J03949J20982J37356J52667J66991J80088
60140G254045J90404J95639J94603J88058J77434J63021J44247J21576R7053P2206
60130H798286M6350J8245j1072l8608o2643q4043j03864j20963j32967j38720
60120H170001j38828j34301j25654j13033r6585p6777n4605l1275p486J6520M0174
60109G448151O2514Q3028J01715J18063J30863J39400J43910J44426J40182J30908
$$ y = [4112884, 4298653, 4490713, 4686376, 4884307, 5083851, 5283039, 5477881, 5663760, 5837254, 5996553, 6140421, 6267136, 6374590, 6461201, 6526370, 6570167, 6593151, 6596706, 6582937, 6553802, 6511003, 6457511, 6398729, 6340963, 6288476, 6242593, 6203671, 6173125, 6153507, 6147647, 6158272, 6187677, 6236906, 6305417, 6392012, 6495961, 6616943, 6754299, 6906966, 7073957, 7254045, 7444449, 7640088, 7834691, 8022749, 8200183, 8363204, 8507451, 8629027, 8726080, 8798286, 8844636, 8862881, 8851809, 8813201, 8750558, 8666515, 8562651, 8441688, 8308721, 8170001, 8031173, 7896872, 7771218, 7658185, 7561600, 7484823, 7430218, 7398943, 7391457, 7407977, 7448151, 7510665, 7593693, 7695408, 7813471, 7944334, 8083734, 8227644, 8372070, 8512252, 8643160]
60099H643160J17844J02716Q6334O8890N0871L3061J6293J812q890j5065j6797
60088I080229j3682m694R953K8206M8503P1540R8400J28173J58979J90351K22952
60077A0018910K56703K91085L26764L64821M04450M43219M79746N14440N47349
60068A3647487N76831O00776O17849O27026O27005O16670N95401N62739N18612
60059A8990396M64080M01010L30935K54860J74027Q9773K826q6003j74214k58034
60049B0189656l34650m02917m61518n07759n38984n54374n54936n42495n19112
60040A5772911m86568m45905l98122l45398k90600k35302j79632j24537p2608
60031A3194239k5635J7304N7687R4295J23719J43641J53998J55048J46091J26735
$$ y = [8643160, 8761004, 8863720, 8950054, 9018944, 9069815, 9102876, 9119169, 9120981, 9112091, 9097026, 9080229, 9066547, 9061853, 9071806, 9100012, 9148515, 9220055, 9318455, 9446628, 9605607, 9795958, 10018910, 10275613, 10566698, 10893462, 11258283, 11662733, 12105952, 12585698, 13100138, 13647487, 14224318, 14825094, 15442943, 16069969, 16696974, 17313644, 17909045, 18471784, 18990396, 19454476, 19855486, 20186421, 20441281, 20615308, 20705081, 20707907, 20621904, 20447690, 20189656, 19855006, 19452089, 18990571, 18482812, 17943828, 17389454, 16834518, 16292023, 15772911, 15286343, 14840438, 14442316, 14096918, 13806318, 13571016, 13391384, 13266847, 13194239, 13168604, 13185908, 13243595, 13337890, 13461609, 13605250, 13759248, 13914296, 14060387, 14187122]
60021A4187122R8275O3226K4383j5320n3236q8421j21905j54580j85125k11036
60011A3543383k31384k47530k61046k72070k79896k84062k84227k79960k71472
60002A1131736k59864k45673k27830k05227j79031j52218j26766j02319p7508
59993I555300n1525k4158M443L3444O1497Q7677J11705J33085J50888J64621J74373
59982A0401350J79644J78904J70863J55543J33775J06479P4892M0646M952l1630
59972A1415418o8308j03696j36586j66085j90670k08434k19043k24098k24706
59963I873792k19847k08441j91869j72935j52920j31109j06850q0708n3643k6143
59953H529327J782L0249N8998Q7021J13481J39365J66804J95743K22660K44110
$$ y = [14187122, 14285397, 14348623, 14373006, 14357686, 14304450, 14216029, 14094124, 13939544, 13754419, 13543383, 13311999, 13064469, 12803423, 12531353, 12251457, 11967395, 11683168, 11403208, 11131736, 10871872, 10626199, 10398369, 10193142, 10014111, 9861893, 9735127, 9632808, 9555300, 9503775, 9479617, 9484060, 9517504, 9579001, 9666678, 9778383, 9911468, 10062356, 10226977, 10401350, 10580994, 10759898, 10930761, 11086304, 11220079, 11326558, 11401450, 11442096, 11447048, 11415418, 11347110, 11243414, 11106828, 10940743, 10750073, 10541639, 10322596, 10098498, 9873792, 9653945, 9445504, 9253635, 9080700, 8927780, 8796671, 8689821, 8609113, 8555470, 8529327, 8531109, 8561358, 8620356, 8707377, 8820858, 8960223, 9127027, 9322770, 9545430, 9789540]
59943I789540K60459K74103K84784K88972K83948K70298K49701K22145J86721
59934A2110671J44324R8351N2499Q423l4347p6334j16361j52190j82394k06567
59924A1646075k23876k32933k33648k27765k16653j99919j77243j50318j21532
59915I862188r1760o0800k9021K858L4619O5668R4329J19551J42299J63515J81690
59904A0485136J94471K01758K05049K04568J99508J90555J79522J66697J51118
59895A2178382J33551J16505J01073Q6434P3149O4191O1548O4188P0738Q2152
59885A3031911J00036J23993J52433J85054K22828K65934L12887L61555M10378
59876A5167009M58806N06712N53107N95488O30721O56003O68087O62487O35142
$$ y = [9789540, 10049999, 10324102, 10608886, 10897858, 11181806, 11452104, 11701805, 11923950, 12110671, 12254995, 12353346, 12405845, 12414268, 12379921, 12303587, 12187226, 12035036, 11852642, 11646075, 11422199, 11189266, 10955618, 10727853, 10511200, 10311281, 10134038, 9983720, 9862188, 9770428, 9709628, 9680607, 9683465, 9718084, 9783752, 9878081, 9997632, 10139931, 10303446, 10485136, 10679607, 10881365, 11086414, 11290982, 11490490, 11681045, 11860567, 12027264, 12178382, 12311933, 12428438, 12529511, 12615945, 12689094, 12753285, 12814833, 12879021, 12949759, 13031911, 13131947, 13255940, 13408373, 13593427, 13816255, 14082189, 14395076, 14756631, 15167009, 15625815, 16132527, 16685634, 17281122, 17911843, 18567846, 19235933, 19898420, 20533562]
59867B0533562N84612N11320M15366K97485J62308J8403j25506k62693l86931
59858B1747926m91773n72894o29778o64042o77533o72609o52557o20386n78248
59849A6188106n28614m74585m18276l60316l01571k43791j87762j32590p7884
59840A3462717k5164K4092P0241J13930J53972J88126K15002K34028K44263K44339
59830A4925546K32807K07926J68119J13558M6584k9741j12166j96043k75633l46806
59820A4734151m08088m58175m94448n15456n23220n21089n10497m91716m66577
59811A0344885m38144m08026l75986l42200l08269k75894k45712k17643j91557
59802G541454j67518j45905j27357j12350j01219r4380r1593r0954q9977q8108
$$ y = [20533562, 21118174, 21629494, 22044860, 22342345, 22504653, 22523056, 22397550, 22134857, 21747926, 21256153, 20683259, 20053481, 19389439, 18711906, 18039297, 17386740, 16766354, 16188106, 15659492, 15184907, 14766631, 14406315, 14104744, 13860953, 13673191, 13540601, 13462717, 13437553, 13461645, 13531886, 13645816, 13799788, 13987914, 14202916, 14436944, 14681207, 14925546, 15158353, 15366279, 15534398, 15647956, 15694540, 15664799, 15552633, 15356590, 15080957, 14734151, 14326063, 13867888, 13373440, 12857984, 12334764, 11813675, 11303178, 10811462, 10344885, 9906741, 9498715, 9122729, 8780529, 8472260, 8196366, 7950654, 7733011, 7541454, 7373936, 7228031, 7100674, 6988324, 6887105, 6792725, 6701132, 6610178, 6520201, 6432093]
59792F432093q6666q5747q2923p6117o6329n6046m6305l6852k8099k1318j7496
59781E828195j7269k1089k8326l7098m6157n5819o5723p3125p5313p2840o8413
59770E267023o3288n6772m8575l9431k9420j7843n036P406J8705K9875M2115N5267
59758E160026O8166P9698Q9196R6527J02007J05995J08802J11249J14487J18444
59748F154597J20995J19524J12892J01431Q6084O8706N2237L8977K9047K1617
59738F906107J7091J6794K1003K8650L8763N1014O5223Q1528J00691J23015J47242
59727G597121J71725J96465K22899K52127K84416L19993L58833L99791M41130
59718A0244500M81731N20637N55476N81976N94293N84613N43682M64666L48132
$$ y = [6432093, 6345427, 6259680, 6176757, 6100640, 6034311, 5978265, 5931960, 5895108, 5867009, 5845691, 5828195, 5810926, 5789837, 5761511, 5724413, 5678256, 5622437, 5556714, 5483589, 5408276, 5335436, 5267023, 5203735, 5146963, 5098388, 5058957, 5029537, 5011694, 5006658, 5014064, 5032769, 5062644, 5104759, 5160026, 5228192, 5307890, 5397086, 5493613, 5595620, 5701615, 5810417, 5921666, 6036153, 6154597, 6275592, 6395116, 6508008, 6609439, 6695523, 6764229, 6816466, 6855443, 6884490, 6906107, 6923198, 6939992, 6960995, 6989645, 7028408, 7079422, 7144645, 7226173, 7326864, 7449879, 7597121, 7768846, 7965311, 8188210, 8440337, 8724753, 9044746, 9403579, 9803370, 10244500, 10726231, 11246868, 11802344, 12384320, 12978613, 13563226, 14106908, 14571574, 14919706]
59709A4919706K03423M5843j07101k39165l39290m04223m37015m43065m28166
59700A2770947l98847l61439l19640k74367k26456j78251j32096q8737m7920r439
59690A0733755K7022O2119R6181J29030J60909J92917K26073K60484K95617L30861
59680A2514968L65830M00849M37219M76273N18012N61289O05368O50676O98078
59671A7228562P48137Q00973Q56112R12355R68328J022891J074484J120535J158257
59662B5890634J185601J200529J200193J182313J147442J099122J042503R84012
59654C4932349R31245Q90816Q65786Q56446Q63185Q86436R23526R67769J011695
59645D3129253J049707J076900J087011J073216J030451R56482Q52013P20894
$$ y = [14919706, 15123129, 15168972, 15061871, 14822706, 14483416, 14079193, 13642178, 13199113, 12770947, 12372100, 12010661, 11691021, 11416654, 11190198, 11011947, 10879851, 10791114, 10743194, 10733755, 10760777, 10822896, 10919077, 11048107, 11209016, 11401933, 11628006, 11888490, 12184107, 12514968, 12880798, 13281647, 13718866, 14195139, 14713151, 15274440, 15879808, 16530484, 17228562, 17976699, 18777672, 19633784, 20546139, 21514467, 22537358, 23611842, 24732377, 25890634, 27076235, 28276764, 29476957, 30659270, 31806712, 32905834, 33948337, 34932349, 35863594, 36754410, 37620196, 38476642, 39339827, 40226263, 41149789, 42117558, 43129253, 44178960, 45255860, 46342871, 47416087, 48446538, 49403020, 50255033, 50975927]
59637E0975927N69729M06380K39119P7239o8962j90340k81163l39207l64420l58121
59627E0666181l22933k62387j80350q0671L2969J57197K88918M25457N65130P07261
59617E1996772Q50723R92433J127649J250990J355891J433208J471798J460749
59609F1940213J390331J251584J037973P49603L96076m583m28660q48895j237363
59600F4246279j570290j832300k017126k125745k164443k143413k075188j973264
59592D8344510j851556j723988j603852j503517j434233j404103j414167j455861
59584C5953233j512928j566772j601963j609758j588839j543241j478670j400138
59576B3650924j312230j219976j128170j039687r55214q74586p98085p26563o60832
$$ y = [50975927, 51545656, 51952036, 52191155, 52268394, 52199432, 52009092, 51727929, 51388722, 51024302, 50666181, 50343248, 50080861, 49900511, 49819840, 49852809, 50010006, 50298924, 50724381, 51289511, 51996772, 52847495, 53839928, 54967577, 56218567, 57574458, 59007666, 60479464, 61940213, 63330544, 64582128, 65620101, 66369704, 66765780, 66761197, 66332537, 65483642, 64246279, 62675989, 60843689, 58826563, 56700818, 54536375, 52392962, 50317774, 48344510, 46492954, 44768966, 43165114, 41661597, 40227364, 38823261, 37409094, 35953233, 34440305, 32873533, 31271570, 29661812, 28072973, 26529732, 25051062, 23650924, 22338694, 21118718, 19990548, 18950861, 17995647, 17121061, 16322976, 15596413, 14935581]
59567A4935581o01117n46931m97352m51418m08321l67589l29425k94749k64370
59558A1174309k38058k14832j94129j76341j62188j52075j46004j43538j43644
59549I603500j45209j48072j53036j60454j69129j77007j82682j85793j86196
59540H095922j83457j77367j68514j57870j45940j32780j18915j05486r3005q0465
59530F732123o6534n1400l6517k2588q997M518J6839K6799L4654M1408M7487N2802
59518F770594N7424O1324O4100O5834O7568P0071P2852P5562P9622Q7020R7735
59507G569706J09827J22078J35196J50201J66823J84056K01564K19977K40134
59498I099562K62316K85983L10226L34551L59116L84160M09655M35492M61122
$$ y = [14935581, 14334464, 13787533, 13290181, 12838763, 12430442, 12062853, 11733428, 11438679, 11174309, 10936251, 10721419, 10527290, 10350949, 10188761, 10036686, 9890682, 9747144, 9603500, 9458291, 9310219, 9157183, 8996729, 8827600, 8650593, 8467911, 8282118, 8095922, 7912465, 7735098, 7566584, 7408714, 7262774, 7129994, 7011079, 6905593, 6812588, 6732123, 6665589, 6614189, 6577672, 6555084, 6546087, 6550605, 6567444, 6594243, 6628897, 6670305, 6717792, 6770594, 6828018, 6889342, 6953442, 7019276, 7086844, 7156915, 7229767, 7305329, 7384951, 7471971, 7569706, 7679533, 7801611, 7936807, 8087008, 8253831, 8437887, 8639451, 8859428, 9099562, 9361878, 9647861, 9958087, 10292638, 10651754, 11035914, 11445569, 11881061, 12342183]
59489A2342183M84817N04401N19307N30764N39032N41785N36508N23548N05314
59480A7027659M83220M57092M27125L94831L62057L30086K99286K68590K36113
59471B0286059K01876J69528J43919J27262J18831J17370J21686J29369J37153
59462B1553053J42618J43727J36736J16884Q1644L1646l1796j07956j94823k87829
59452B1583904l81411m70795n52004o21801o78464p21355p49179p60187p54767
59443A5893941p36429p09223o75159o34807n89245n40518m90914m42379l95994
59434A0679273l51588l08583k67311k28781j93216j60007j28973j00201p2580
59425H868033m4252j4996J3356L9594O4743R0234J15804J40335J63889J87824
$$ y = [12342183, 12827000, 13331401, 13850708, 14381472, 14920504, 15462289, 15998797, 16522345, 17027659, 17510879, 17967971, 18395096, 18789927, 19151984, 19482070, 19781356, 20049946, 20286059, 20487935, 20657463, 20801382, 20928644, 21047475, 21164845, 21286531, 21415900, 21553053, 21695671, 21839398, 21976134, 22093018, 22174662, 22206308, 22174512, 22066556, 21871733, 21583904, 21202493, 20731698, 20179694, 19557893, 18879429, 18158074, 17408895, 16648708, 15893941, 15157512, 14448289, 13773130, 13138323, 12549078, 12008560, 11517646, 11075267, 10679273, 10327685, 10019102, 9751791, 9523010, 9329794, 9169787, 9040814, 8940613, 8868033, 8823781, 8808785, 8822141, 8861735, 8926478, 9016712, 9132516, 9272851, 9436740, 9624564]
59415I624564K13315K40304K67531K93482L17682L40769L62458L80065L90406
59406A2430576L92718L87813L74466L48908L08511K54072J87963J12082K8815
59397A4825924n7869j43789k25903l01344l66550m18877m58223m85932n02718
59388A1864719n08618n04245m91193m71590m47685m21321l93435l64641l36217
59379G925774l09409k83810k57843k31327k06132j83840j64055j45643j28221
59370F015494j11806r6113q0996o6492n2182l7605k3564j1530j405Q493J8805
59359E561099K8241L5948M2944N0340N7919O5469P3943Q4107R5359J06643J17020
59348F319032J24653J27235J24924J21503J21508J27243J39108J56651J78117
$$ y = [9624564, 9837879, 10078183, 10345714, 10639196, 10956878, 11297647, 11660105, 12040170, 12430576, 12823294, 13211107, 13585573, 13934481, 14242992, 14497064, 14685027, 14797109, 14825924, 14768055, 14624266, 14398363, 14097019, 13730469, 13311592, 12853369, 12367437, 11864719, 11356101, 10851856, 10360663, 9889073, 9441388, 9020067, 8626632, 8261991, 7925774, 7616365, 7332555, 7074712, 6843385, 6637253, 6453413, 6289358, 6143715, 6015494, 5903688, 5807575, 5726579, 5660087, 5607905, 5570300, 5546736, 5535206, 5533801, 5542294, 5561099, 5589340, 5625288, 5668232, 5718572, 5776491, 5841960, 5915903, 6000010, 6095369, 6202012, 6319032, 6443685, 6570920, 6695844, 6817347, 6938855, 7066098, 7205206, 7361857, 7539974]
59339G539974K00953K24304K49418K76320L02109L24400L44659L66371L91487
59330A0219995M20742M55560M97045N43979N94133O46738P01740P57639Q12335
59321A5649906Q65127R15217R58577R88737J000940R93880R67849R23568Q63219
59312B4127020P90714P10139O24896N38445M54488L75752L03031K35446J71240
59303B8331171J08642M6445j6686q3367j56542k36358l19070l99770m74788n40468
59293B6259209n91849o25220o41365o44314o37552o23421o05571n89464n79783
59284B0720670n78482n85102n97447o12058o25557o35880o41626o40897o32140
59275A5171481o15714n93177n65434n32895m97029m59932m22477l84351l45967
$$ y = [7539974, 7740927, 7965231, 8214649, 8490969, 8793078, 9117478, 9462137, 9828508, 10219995, 10640737, 11096297, 11593342, 12137321, 12731454, 13378192, 14079932, 14837571, 15649906, 16515033, 17430250, 18388827, 19377564, 20378504, 21372384, 22340233, 23263801, 24127020, 24917734, 25627873, 26252769, 26791214, 27245702, 27621454, 27924485, 28159931, 28331171, 28439813, 28486258, 28469572, 28386205, 28229663, 27993305, 27674235, 27274465, 26799677, 26259209, 25667360, 25042140, 24400775, 23756461, 23118909, 22495488, 21889917, 21300453, 20720670, 20142188, 19557086, 18959639, 18347581, 17722024, 17086144, 16444518, 15803621, 15171481, 14555767, 13962590, 13397156, 12864261, 12367232, 11907300, 11484823, 11100472, 10754505]
59266A0754505l08839k73815k40406k08133j77410j48679j21577r5448p0106m5981
59256I064111k3785l940J4158L1910N0067O7807Q3750R7151J07502J13783J15291
59245I717805J12703J07232R8985Q7300P2456N6027L9394K2656N351j2050k7616
59234A0280243l9146m6015m9329m9747m5912l6396k2438o817R798K9059N1356
59223A0074656P4606R7338J20367J44257J67577J89159K09620K28728K43631K51870
59213A1801809K54203K52106K44306K28415K04606J75192J41834J05592O8432
59204A3476495L2049l909m0013p4148j02626j23267j35558j39243j35367j27535
59194A2626878j19460j11919j04344r7883r4144r2151q9821q7477q6652q6164
$$ y = [10754505, 10445666, 10171851, 9931445, 9723312, 9545902, 9397223, 9275646, 9180198, 9110092, 9064111, 9040326, 9036386, 9050544, 9082454, 9132521, 9200328, 9284078, 9381229, 9488731, 9602514, 9717805, 9830508, 9937740, 10036725, 10124025, 10196481, 10252508, 10291902, 10314558, 10319909, 10307859, 10280243, 10241097, 10195082, 10145753, 10096006, 10050094, 10013698, 9991260, 9984443, 9994241, 10023300, 10074656, 10149262, 10246600, 10366967, 10511224, 10678801, 10867960, 11077580, 11306308, 11549939, 11801809, 12056012, 12308118, 12552424, 12780839, 12985445, 13160637, 13302471, 13408063, 13476495, 13508544, 13504635, 13464622, 13390474, 13287848, 13164581, 13029023, 12889780, 12754413, 12626878, 12507418, 12395499, 12291155, 12193272, 12099128, 12006977, 11917156, 11829679, 11743027, 11656863]
59184A1656863q2961p6387o8007n7449m2056k1037L534L0383O0472R4273J30759
59173A1628387J69941K13247K60382L08565L55854M02625M48694M91559N28280
59164A4807534N56509N72571N71288N49148N05736M41280L55392K49521J28342
59155A8737321k569j38411k73571m01021n14925o12035o89509p43949p74288p83482
59145A3803561p75557p52852p17817o75174o29692n83051n35002m86543m39936
59136H207937l96514l56366l19667k86592k56577k29101k04695j83851j65463
59127E809111j47768j30508j14948j02003r1229q1526p1917o1836n1365m1154
59117D914857l1708k2910j4301n488L734J3152K2022K9883L7374M5446N3989O2147
$$ y = [11656863, 11573902, 11497515, 11429508, 11372059, 11330003, 11308966, 11312500, 11342883, 11403355, 11497628, 11628387, 11798328, 12011575, 12271957, 12580522, 12936376, 13339001, 13787695, 14279254, 14807534, 15364043, 15936614, 16507902, 17057050, 17562786, 18004066, 18359458, 18608979, 18737321, 18734752, 18596341, 18322770, 17921749, 17406824, 16794789, 16105280, 15361331, 14587043, 13803561, 13028004, 12275152, 11557335, 10882161, 10252469, 9669418, 9134416, 8647873, 8207937, 7811423, 7455057, 7135390, 6848798, 6592221, 6363120, 6158425, 5974574, 5809111, 5661343, 5530835, 5415887, 5313884, 5222655, 5141129, 5069212, 5007376, 4956011, 4914857, 4883149, 4860239, 4845938, 4840450, 4844184, 4857336, 4879358, 4909241, 4946615, 4992061, 5046050, 5108197]
59105E108197O9719P7104Q4166R0730R8003J07545J18564J28207J35198J41392
59095F158825J48753J56416J62075J64945J65948J65770J63956J59523J51599
59086G597810J39873J25052J08473R0819P1664N0675K8786P939j0012k4112l4551
59075H152416m2148m7146m8701m6022l9425k9571j6390Q8J8491L7202N6235P6666
59063H071695R8642J21545J45566J71226J97605K23008K47336K71862K96556L19690
59053A0164731L40378L59499L77569L93510M06000M14260M16815M10900L93818
59044A3677480L63901L20174K62606J93131J15242L2731n0141j28067j96668k55191
59034A4335198l05387l47965l82136m08311m28445m43462m52866m57303m58833
$$ y = [5108197, 5177916, 5255020, 5339186, 5429916, 5527919, 5635464, 5754028, 5882235, 6017433, 6158825, 6307578, 6463994, 6626069, 6791014, 6956962, 7122732, 7286688, 7446211, 7597810, 7737683, 7862735, 7971208, 8062027, 8133691, 8184366, 8213152, 8221091, 8211079, 8186967, 8152416, 8110268, 8063122, 8014421, 7968399, 7928974, 7899403, 7883013, 7883101, 7901592, 7938794, 7995029, 8071695, 8170337, 8291882, 8437448, 8608674, 8806279, 9029287, 9276623, 9548485, 9845041, 10164731, 10505109, 10864608, 11242177, 11635687, 12041687, 12455947, 12872762, 13283662, 13677480, 14041381, 14361555, 14624161, 14817292, 14932534, 14965265, 14915124, 14787057, 14590389, 14335198, 14029811, 13681846, 13299710, 12891399, 12462954, 12019492, 11566626, 11109323, 10650490]
59025A0650490m58054m53387m44090m31531m16829l99661l80347l60614l41220
59016F964757l21095k99894k79184k60049k41838k24353k08861j95657j82942
59007D750884j69587j56749j45339j34165j22255j10946j01837r4479q7822q2080
58997C545625p7535p3079o7810o2621n8706n5744n2898n0219m7808m5082m1950
58986B912173l9187l6708l3183k8366k3728j9794j5223r811n867m776m582l113
58974B687835j351j231j872o09L406Q838J4333J9177K2747K5067K6953K8293K7416
58961B859002K3547J8394J3874R842N560J723o36j750j853oM092Q623J1744J3708
58947B965864J5453J6761J7438J8379J9590J9039J5369J0032M898j06m983p796
$$ y = [10650490, 10192436, 9739049, 9294959, 8863428, 8446599, 8046938, 7666591, 7305977, 6964757, 6643662, 6343768, 6064584, 5804535, 5562697, 5338344, 5129483, 4933826, 4750884, 4581297, 4424548, 4279209, 4145044, 4022789, 3911843, 3810006, 3715527, 3627705, 3545625, 3468090, 3395011, 3327201, 3264580, 3205874, 3150130, 3097232, 3047013, 2999205, 2954123, 2912173, 2872986, 2836278, 2803095, 2774729, 2751001, 2731207, 2715984, 2706173, 2700306, 2695530, 2690948, 2687835, 2686484, 2685253, 2683381, 2682772, 2686178, 2695016, 2709349, 2728526, 2751273, 2776340, 2803293, 2831586, 2859002, 2882549, 2900943, 2914817, 2924659, 2930219, 2931942, 2931306, 2929556, 2927703, 2927697, 2931789, 2940412, 2952156, 2965864, 2981317, 2998078, 3015516, 3033895, 3053485, 3072524, 3087893, 3097925, 3102823, 3102717, 3097734, 3089938]
58935C089938p474o331o835p756o551l697j274J064N035R754J2729J4231J6973
58922C109806K1596K5905K8676L1008L3563L5490L6735L8783M2380M6558N0516
58911C501016N4594N8996O3284O7380P1635P5816P9386Q2681Q6379R0191R3555
58900D324913R7001J01192J05269J08088J10556J14695J20722J27010J32729J38625
58890E480800J45456J53461J63106J74501J86270J96826K06750K18275K32620
58881G158065K49246K67228K85876L04391L22724L42348L64766L89666M16007
58872A0100317M44059M74695N07561N41825N78091O17667O60521P05721P53115
58863A5383572Q02744Q53576R04794R57291J011530J064912J113726J156545J192785
$$ y = [3089938, 3082464, 3076133, 3069298, 3061542, 3054991, 3051294, 3050020, 3051084, 3056119, 3065873, 3078602, 3092833, 3109806, 3131402, 3157307, 3185983, 3216991, 3250554, 3286044, 3322779, 3361562, 3403942, 3450500, 3501016, 3555610, 3614606, 3677890, 3745270, 3816905, 3892721, 3972107, 4054788, 4141167, 4231358, 4324913, 4421914, 4523106, 4628375, 4736463, 4847019, 4961714, 5082436, 5209446, 5342175, 5480800, 5626256, 5779717, 5942823, 6117324, 6303594, 6500420, 6707170, 6925445, 7158065, 7407311, 7674539, 7960415, 8264806, 8587530, 8929878, 9294644, 9684310, 10100317, 10544376, 11019071, 11526632, 12068457, 12646548, 13264215, 13924736, 14630457, 15383572, 16186316, 17039892, 17944686, 18901977, 19913507, 20978419, 22092145, 23248690, 24441475]
58854B4441475J218705J228102J216506J181431J118730J022630Q90473P24720
58846C3042772N29909L11026P6097j62829l93690o07982p99409r61498j089020
58837B9945376j180881j239913j270045j274630j257106j222165j175591j122400
58829B0202645j064848j002833r36941q70166q05852p44964o86822o31629n80669
58820A2877921n34625m93341m56657m24036l94096l65985l40411l17658k95782
58811I255330k72812k49728k28837k10244j92512j75895j61780j49367j36166
58802G477989j21931j08897r7702q6194p3127o0095m8512l7222k4595j0953K478
58791F811239J5494K8451M1325N4299O8179Q3248R8567J13099J26714J39990J53915
$$ y = [24441475, 25660180, 26888282, 28104788, 29286219, 30404949, 31427579, 32318052, 33042772, 33572681, 33883707, 33959804, 33796975, 33403285, 32795303, 31995894, 31034396, 29945376, 28764495, 27524582, 26254537, 24979907, 23722801, 22500636, 21325045, 20202645, 19137797, 18134964, 17198023, 16327857, 15522005, 14777041, 14090219, 13458590, 12877921, 12343296, 11849955, 11393298, 10969262, 10575166, 10209181, 9868770, 9551112, 9255330, 8982518, 8732790, 8503953, 8293709, 8101197, 7925302, 7763522, 7614155, 7477989, 7356058, 7247161, 7149459, 7063265, 6990138, 6930043, 6881531, 6844309, 6819714, 6808761, 6811239, 6826733, 6855184, 6896509, 6950808, 7018987, 7102235, 7200802, 7313901, 7440615, 7580605, 7734520]
58780G734520J69702J87538K05622K21931K37076K53777K73366K94411L15124
58771I893067L35606L57273L81457M08820M38977M70486N02522N36460N74441
58762A3899109O16375O60062P04394P50716Q00496Q53246R07197R60700J012225
58753B1164520J059943J101700J134656J154816J157620J138983J095032J021431
58745C0028701R14413P72735N98295L95605J71937o2695k97226n21424p26016
58736C1274325r02627j045619j153659j228293j271766j287309j280054j255447
58728B1849551j217193j168123j111911j052039r90071r26985q65243q07295p52795
58719A2957896o99675o47452n97548n51106n08608m70784m37604m07224l78283
$$ y = [7734520, 7904222, 8091760, 8297382, 8519313, 8756389, 9010166, 9283532, 9577943, 9893067, 10228673, 10585946, 10967403, 11376223, 11815200, 12285686, 12788208, 13324668, 13899109, 14515484, 15175546, 15879940, 16630656, 17431152, 18284398, 19191595, 20152295, 21164520, 22224463, 23326163, 24460819, 25615635, 26773255, 27912238, 29007270, 30028701, 30943114, 31715849, 32314144, 32709749, 32881686, 32818991, 32521765, 32000341, 31274325, 30371698, 29326079, 28172420, 26944127, 25672361, 24385052, 23104998, 21849551, 20632358, 19464235, 18352324, 17300285, 16310214, 15383229, 14517986, 13710691, 12957896, 12258221, 11610769, 11013221, 10462115, 9953507, 9482723, 9045119, 8637895, 8259612]
58710H259612l52319l31349l13932k96538k78060k59969k42641k24898k07153
58701E752753j91649j79034j67366j54995j42104j29310j17021j06273r7809r0238
58691D376954q1338p1296o2541n6428n2048m7934m3080l6974l0762k7292k7659
58680C839602k9070k8852k8846l2466l8997m4974m9932n5831o1504o3029o0133
58669C345968n7220n6999n7617n7319n7371n8600n9335n8782n8917o0757o2022
58658B701029o0616n7706n5451n4142n3119n2094n0295m6679m2187l9276l8178
58647B151286l6287l2288k8178k6084k5741k6086k6705k6679k4740k1684j9989
58636A856825k0118j9918j8325j6740j5790j4033j1176r518j0649j3194j5093
$$ y = [8259612, 7907293, 7575944, 7262012, 6965474, 6687414, 6427445, 6184804, 5959906, 5752753, 5561104, 5382070, 5214704, 5059709, 4917605, 4788295, 4671274, 4565001, 4467192, 4376954, 4295616, 4224320, 4161779, 4105351, 4053303, 4005369, 3962289, 3925315, 3894553, 3867261, 3839602, 3810532, 3781680, 3752834, 3720368, 3681371, 3636397, 3586465, 3530634, 3469130, 3406101, 3345968, 3288748, 3231749, 3174132, 3116813, 3059442, 3000842, 2941507, 2882725, 2823808, 2763051, 2701029, 2640413, 2582707, 2527256, 2473114, 2419995, 2367901, 2317606, 2270927, 2228740, 2189464, 2151286, 2114999, 2082711, 2054533, 2028449, 2002708, 1976622, 1949917, 1923238, 1898498, 1876814, 1856825, 1836707, 1816789, 1798464, 1781724, 1765934, 1751901, 1740725, 1731207, 1720558, 1707364, 1692271]
58625A692271j5780j5353j4087j3409j4611j6138j5157j2022r741q727o064q33
58613A550349M069O650Q316J0139J0731R696R363J1001J2770J3324J3939J5311
58601A675658J5735J4507J3612J4047J3927J2178J0641J0467J0151R267J0346
58590A810536J4544J9043K1460K3475K7442L2578L7238M1829M6831N0909N3627
58579B179512N7074O2399O7686P1683P6380Q3404R1122R7968J05412J14885J24933
58568C132458J34302J44802J58193J73051J87505K02256K18401K35176K52310
58559D838454K71449K92781L13507L31900L49220L64988L74511L74056L64332
58550G875198L45466L12956K62863J97467J21905L9158m7366j30223k02218k61644
$$ y = [1692271, 1676491, 1661138, 1647051, 1633642, 1619031, 1602893, 1587736, 1575714, 1565973, 1557246, 1551182, 1550349, 1554418, 1561068, 1569384, 1579523, 1590254, 1599950, 1609313, 1620314, 1633084, 1646408, 1660347, 1675658, 1691393, 1705900, 1719512, 1733559, 1747486, 1759664, 1770305, 1780772, 1790923, 1800190, 1810536, 1825080, 1844123, 1865583, 1889058, 1916500, 1949078, 1986316, 2028145, 2074976, 2125885, 2179512, 2236586, 2298985, 2366671, 2438354, 2514734, 2598138, 2689260, 2787228, 2892640, 3007525, 3132458, 3266760, 3411562, 3569755, 3742806, 3930311, 4132567, 4350968, 4586144, 4838454, 5109903, 5402684, 5716191, 6048091, 6397311, 6762299, 7136810, 7510866, 7875198, 8220664, 8533620, 8796483, 8993950, 9115855, 9155013, 9107647, 8977424, 8775206, 8513562]
58540H513562l08942l41776l58387l62739l60643l52950l37789l17139k95652
58531E477545k74667k52769k30893k11562j94158j76088j57850j42156j28692
58522C708710j14572r9393q5444p3366o1933n1728m4721m0328l5902l1116k8091
58511C042116k7261k6649k5301k4029k2678j9881j5769j2321j0935j1767j5079
58500B830446k0996k8537l6757m5788n4924o1296o2915o1524o0064n8912n7054
58489B281679n5018n3756n2275m9316m5954m3884m2643m1052l9555l8648l7055
58478A782523l4069l1599l1080l0673k8365k5412k3736k2403j9913j7356j6094
58467A501823j4990j3309j3320j6240j8695j7569j5293j5639j7016j5300j1002
$$ y = [8513562, 8204620, 7862844, 7504457, 7141718, 6781075, 6428125, 6090336, 5773197, 5477545, 5202878, 4950109, 4719216, 4507654, 4313496, 4137408, 3979558, 3837402, 3708710, 3594138, 3494745, 3409301, 3335935, 3274002, 3222274, 3177553, 3137225, 3101323, 3070207, 3042116, 3014855, 2988206, 2962905, 2938876, 2916198, 2896317, 2880548, 2868227, 2857292, 2845525, 2830446, 2809450, 2780913, 2744156, 2698368, 2643444, 2582148, 2519233, 2457709, 2397645, 2338733, 2281679, 2226661, 2172905, 2120630, 2071314, 2025360, 1981476, 1938833, 1897781, 1858226, 1819578, 1782523, 1748454, 1716855, 1685775, 1655102, 1626737, 1601325, 1577589, 1555186, 1535273, 1517917, 1501823, 1486833, 1473524, 1460204, 1443964, 1425269, 1407700, 1392407, 1376768, 1359752, 1344452, 1333450]
58456A333450q117p420o230l807j989j165j31Q26P84J114L590O846Q566R631J2137
58441A348085J5090J6360J7127J9758K3002K4018K3703K5192K8352L0556L1682
58430A602925L3470L4859L2811K7037J9786J1860L088m862j0493j5808k3020k9599
58418A682054l1555l0151l0174l2637l4321l3616l1723k8907k4567k0353j8590
58407A365460j8324j7304j6484j7874j9444j7463j2688r054p357n415l347l158
58395A217548l939k874m28N56J29P90K751M480O520R877J2381J2072J2132J6551
58381A288546K2810K5422K5028K6892L1509L4057L2759L0555K8373K3691J6365
58370A586007R484L839k443q618j1700j2327j4262j7898k0002j9818j9534j8946
$$ y = [1333450, 1325333, 1317913, 1311683, 1307876, 1305887, 1304722, 1304591, 1305417, 1306201, 1307315, 1310905, 1317751, 1326317, 1335948, 1348085, 1363175, 1379535, 1396662, 1416420, 1439422, 1463440, 1487143, 1512335, 1540687, 1571243, 1602925, 1636395, 1671254, 1704065, 1731102, 1750888, 1762748, 1765836, 1760974, 1750481, 1734673, 1711653, 1682054, 1650499, 1620348, 1590174, 1557537, 1523216, 1489600, 1457877, 1428970, 1404403, 1384050, 1365460, 1347136, 1329832, 1313348, 1295474, 1276030, 1258567, 1245879, 1236825, 1229468, 1224053, 1220706, 1217548, 1213609, 1210735, 1210307, 1210863, 1210992, 1211782, 1214533, 1219013, 1225533, 1235410, 1247791, 1259863, 1271995, 1288546, 1311356, 1336778, 1361806, 1388698, 1420207, 1454264, 1487023, 1517578, 1545951, 1569642, 1586007, 1595491, 1599330, 1596887, 1588269, 1576569, 1564242, 1549980, 1532082, 1512080, 1492262, 1472728, 1453782]
58358A453782j5794j1223q622p359l891J110L401K747L233O010Q397J0207J4068
58345A456066J9029K0692J8195J4716J0912M568l113p924r729j2361j6127j7374
58333A477550j5854j5308j6195j5019j1506r428r508q533o109n269n935m909k681
58320A351296k808m156j646M642R076J0027J1815J6077J9056J8959J8332J7932
58308A468602J5755J3046J3583J6193J5876J3043J3287J7389K0135J9844K0089
58297A646842K1117J9029J4828J4627J9047K2035K1884K3434K7128K6402J9114
58286A875487J1552P504L019m151r353r501q017p415n155n10K643L193M957Q778
58272A873031J0710J0416J2525J7335J9510J8384J9795K5078K8245K7071K6777
$$ y = [1453782, 1437988, 1426765, 1418143, 1410784, 1406893, 1408003, 1411404, 1414151, 1417384, 1423394, 1431791, 1441998, 1456066, 1475095, 1495787, 1513982, 1528698, 1539610, 1544178, 1541065, 1533141, 1523412, 1511051, 1494924, 1477550, 1461696, 1446388, 1430193, 1415174, 1403668, 1394240, 1384732, 1376199, 1370090, 1364821, 1358886, 1353977, 1351296, 1348488, 1344332, 1342686, 1347328, 1356404, 1366431, 1378246, 1394323, 1413379, 1432338, 1450670, 1468602, 1484357, 1497403, 1510986, 1527179, 1543055, 1556098, 1569385, 1586774, 1606909, 1626753, 1646842, 1667959, 1686988, 1701816, 1716443, 1735490, 1757525, 1779409, 1802843, 1829971, 1856373, 1875487, 1887039, 1894543, 1897562, 1893411, 1884058, 1874557, 1866540, 1859125, 1853970, 1853460, 1856103, 1859296, 1864253, 1873031, 1883741, 1894157, 1906682, 1924017, 1943527, 1961911, 1981706, 2006784, 2035029, 2062100, 2088877]
58261B088877K9617L1169L0249L1914L7049L9564L7696L7373M0652M1585L7571
58250B483316L3708L1923K7024J7956J1507J0427R212O015O817J3044J7347J6940
58238B685236J8770K6048L1921L2475L3595L8797M2582M2176M3554M9326N2973
58227C097453N1590N2070N7991O2853O2907O4083O9821P4736P6652Q1735R1368
58216C843259R7772R8966J03499J13685J19393J15775J11486J11610J08482R8016
58206D921943Q8927Q6936Q5895Q3355Q7933J01905J14010J19375J28692J47428
58196E966399J64660J73495J83406K00432K14979K22153K34192K58464K82888
58187G901068K97847L12821L36038L57831L70563L85126M10936M39097M62203
$$ y = [2088877, 2118494, 2149663, 2179912, 2211826, 2248875, 2288439, 2326135, 2363508, 2404160, 2445745, 2483316, 2517024, 2548947, 2575971, 2593927, 2605434, 2615861, 2625073, 2631088, 2637905, 2650949, 2668296, 2685236, 2704006, 2730054, 2761975, 2794450, 2828045, 2866842, 2909424, 2951600, 2995154, 3044480, 3097453, 3149043, 3201113, 3259104, 3321957, 3384864, 3448947, 3518768, 3593504, 3670156, 3751891, 3843259, 3941031, 4039997, 4143496, 4257181, 4376574, 4492349, 4603835, 4715445, 4823927, 4921943, 5010870, 5097806, 5183701, 5267056, 5354989, 5456894, 5570904, 5690279, 5818971, 5966399, 6131059, 6304554, 6487960, 6688392, 6903371, 7125524, 7359716, 7618180, 7901068, 8198915, 8511736, 8847774, 9205605, 9576168, 9961294, 10372230, 10811327, 11273530]
58178A1273530M90654N32222N75888O13428O55962P11315P66876Q13260Q62312
58169A7295447R22801R82127J031942J087150J158756J233610J302416J380383
58161B6394632J476941J573427J655540J739010J837931J938826K033189K143368
58153D0792864K287309K451050K625401K833546L091328L379796L690621M055860
58145F5207775M496777M990094N524194O136502O850360P631404Q457658R375405
58137A18670169J0436206J1649553J3054692J4752257J6786873J9082477K1572659
58130B26004886K4311083K7423956L1133243L5805675M1385162M6169125M6467071
58123D78700201L8618085K2183017J072295j8847801l3372967m1515722m4437083
$$ y = [11273530, 11764184, 12296406, 12872294, 13485722, 14141684, 14852999, 15619875, 16433135, 17295447, 18218248, 19200375, 20232317, 21319467, 22478223, 23711833, 25014249, 26394632, 27871573, 29445000, 31100540, 32839550, 34677481, 36616307, 38649496, 40792864, 43080173, 45531223, 48156624, 50990170, 54081498, 57461294, 61151915, 65207775, 69704552, 74694646, 80218840, 86355342, 93205702, 100837106, 109294764, 118670169, 129106375, 140755928, 153810620, 168562877, 185349750, 204432227, 226004886, 250315969, 277739925, 308873168, 344678843, 386064005, 432233130, 478700201, 517318286, 539501303, 540573598, 521725797, 488352830, 446837108, 402400025]
58116D02400025m3769043m0895489l6931886l2673376k8524604k4658170k1208257
58109A73739200j8253066j5741658j3569828j1683507j0052235q618389p340546
58102H8479971o228824n283813m452238l682621k971513k322007j711021j125990
58094F0701944n78065n0291N19886J189584J977202K839529L569229L728444K873817
58085G6771279R84985j388370l498444m898090n566644n687154n447145n009135
58077D6261282m509988m020957l552946l115299k732077k406686k119082j861623
58069B1942624j641801j453080j278885j122262r98813r04573q20991p45574o88150
58060A2288495o43580n97573n53283n23827n04175m77605m44262m17023l94668
$$ y = [402400025, 358630982, 317735493, 280803607, 248130231, 219605627, 194947457, 173739200, 155486134, 139744476, 126174648, 114491141, 104438906, 95820517, 88479971, 82251147, 76967334, 72515096, 68832475, 65860962, 63538955, 61827934, 60701944, 60123879, 60073588, 60593474, 61783058, 63760260, 66599789, 70169018, 73897462, 76771279, 77756264, 76367894, 72869450, 67971360, 62404716, 56717562, 51270417, 46261282, 41751294, 37730337, 34177391, 31062092, 28330015, 25923329, 23804247, 21942624, 20300823, 18847743, 17568858, 16446596, 15447783, 14543210, 13722219, 12976645, 12288495, 11644915, 11047342, 10494059, 9970232, 9466057, 8988452, 8544190, 8127167, 7732499]
58051G732499l65077l30103l02184k80548k54761k27869k12764k08817k04061
58042E346315j97177j96180j98464j93018j80139j69741j62668j51875j39193
58033C757860j32885j31367j26443j19717j19148j22572j20910j14655j11343
58024B658820j10099j04163r5315r0602q8264q1638p3174o9823o8665o2031n2770
58013A762276m9319m9699m5574l8395l6132l7391l4244k7958k6572k9312k8375
58002A359305k4088k3547k5970k4052j8499j7143k0560k2052k0778k1746k3979
57991A116891k1819j6945j6252j8789j7415j2333j0390j1774j0146n362l610n115
57979I66941l946P3J122j045p98K091K257j38N93M435N420K918K394M625M717
$$ y = [7732499, 7367422, 7037319, 6735135, 6454587, 6199826, 5971957, 5759193, 5550376, 5346315, 5149138, 4952958, 4754494, 4561476, 4381337, 4211596, 4048928, 3897053, 3757860, 3624975, 3493608, 3367165, 3247448, 3128300, 3005728, 2884818, 2770163, 2658820, 2548721, 2444558, 2349243, 2258641, 2170377, 2088739, 2015565, 1945742, 1877077, 1815046, 1762276, 1712957, 1663258, 1617684, 1579289, 1543157, 1505766, 1471522, 1443564, 1416992, 1387680, 1359305, 1335217, 1311670, 1285700, 1261648, 1243149, 1226006, 1205446, 1183394, 1162616, 1140870, 1116891, 1095072, 1078127, 1061875, 1043086, 1025671, 1013338, 1002948, 991174, 981028, 975666, 972056, 966941, 962995, 963068, 964190, 963145, 962347, 964438, 966695, 966557, 967150, 971585, 977005, 979923, 982317, 986942, 991659]
57964I91659K265K094M489M747K823L411O146N699J989M86K037K186P83K303O113
57949A039230O441K789P30J610J110j252j007J799J732j984l961k745l224p160
57935A034108j0259j0606j1494j3773j3710j0607q798r932j0615r336q566q540
57923I07872o281k104M6j77R10L352L049m8q36K373N438N859N687N763M139J367
57907I36409L78J61l269q732j0250o838m464o606j0071j1808j2733j3084j0958
57894H38135p496o929r603j1211j0241r775j0627r560n902l262l046k663j501
57881G46319k033l750k929J13N12k823n386n345o347r963j2527j2046j1502j2590
57867F59703j2755j1134j0919j3122j4252j2948j2475j3848j2920p672k234j51
$$ y = [991659, 993924, 996018, 1000507, 1005254, 1008077, 1011488, 1017634, 1023333, 1025322, 1025808, 1027845, 1030031, 1030814, 1033117, 1039230, 1045671, 1048460, 1049190, 1050800, 1051910, 1050658, 1049651, 1051450, 1053182, 1051198, 1047237, 1044492, 1041268, 1034108, 1023849, 1013243, 1001749, 987976, 974266, 963659, 954861, 944929, 934314, 924978, 916412, 907872, 901591, 899487, 899533, 899356, 900266, 903618, 906667, 906619, 905783, 908156, 913594, 919453, 925140, 930903, 935042, 936409, 936787, 936948, 933679, 924947, 914697, 907859, 903395, 896789, 886718, 874910, 862177, 849093, 838135, 830639, 823710, 814107, 802896, 792655, 782880, 772253, 762693, 756791, 753529, 750483, 747820, 746319, 744286, 740536, 737607, 737720, 738232, 735409, 730023, 724678, 718331, 708368, 695841, 683795, 672293, 659703, 646948, 635814, 624895, 611773, 597521, 584573, 572098, 558250, 545330, 537658, 535424, 535273]
57855E35273O40K624M083L339K572L809N494O200P360R569J0645J0064J0714J3605
57841F25991J5390J3840J1357J0388R736P995O402N801M717K733J695J730K99
57828G18074l058n539o290p962j1197j2651j0763q540q201p889o163m966n488
57815F19367n664m344l435l526k057J623M074L371K253K973L633K570J911L524
57801F26273N583O208O578P534P106M388J990J820K158J543J634L388M377K852
57787F83432P47j55j316l952o104o031n131m838m098k391j689k936m153m224m812
57772F32349o432o739n088m569o866r336r816r998j1271j1776j0682j0802j3480
57759E15494j5355j4006j2389j3559j5215j3966j1262j0243r967p695m346k937
$$ y = [535273, 535913, 538537, 542620, 545959, 548531, 552340, 557834, 564034, 571394, 580963, 591608, 601672, 612386, 625991, 641381, 655221, 666578, 676966, 686702, 694697, 701099, 706900, 711617, 714350, 716045, 717775, 718074, 715016, 709477, 703187, 695225, 684028, 671377, 660614, 652074, 643873, 635984, 629821, 624855, 619367, 613703, 609359, 605924, 602398, 600341, 601964, 606038, 609409, 611662, 614635, 618268, 620838, 622749, 626273, 631856, 638064, 644642, 652176, 659282, 663670, 665660, 667480, 669638, 671181, 672815, 676203, 680580, 683432, 684179, 684024, 682708, 678756, 672652, 666621, 661490, 656652, 652554, 650163, 648474, 645538, 641385, 637161, 632349, 625917, 619178, 614090, 609521, 602655, 593319, 583503, 573505, 562234, 550458, 539776, 528974, 515494, 500139, 486133, 473744, 460185, 444970, 431004, 419742, 409499, 399532, 391837, 387491, 384554]
57747C84554l563m175m459n017m546j673J971L877M327M955N497N023M589N606
57733C96966P186Q006R032J1601J4296J4499J1854P974M221J528O90R97L79j643
57719D87586l223l479l809m749m686l284k814m289n706n969o804q593q485n293
57705D16403k295k062k426r03Q05M59k09J155K917K496J330K411N187P019P666
57690D39953Q468Q973Q232P571Q477R494Q678P243P331Q135P772P134Q218J0267
57676E55946J1187J1348J2450J4036J4508J4426J5589J7921J9986K1428K2503
57665G31328K2761K2572K3864K7041K9497K9844L0700L4059L6984L6111L3838
57654A058599L5309M0922M6511M9834N2311N5052N7445N9640O2763O6627P0209
$$ y = [384554, 380991, 376816, 372357, 367340, 362794, 361121, 363092, 366969, 371296, 376251, 381748, 386771, 391360, 396966, 404152, 412158, 421190, 432791, 447087, 461586, 473440, 481414, 485635, 487163, 487853, 488850, 489229, 487586, 484363, 480884, 477075, 472326, 467640, 464356, 461542, 457253, 451547, 445578, 438774, 430181, 421696, 416403, 414108, 412046, 409620, 408717, 409522, 409981, 409772, 410927, 413844, 416340, 417670, 420081, 425268, 432287, 439953, 448421, 457394, 465626, 473197, 481674, 491168, 499846, 507089, 514420, 522555, 530327, 537461, 545679, 555946, 567133, 578481, 590931, 604967, 619475, 633901, 649490, 667411, 687397, 708825, 731328, 754089, 776661, 800525, 827566, 857063, 886907, 917607, 951666, 988650, 1024761, 1058599, 1093908, 1134830, 1181341, 1231175, 1283486, 1338538, 1395983, 1455623, 1518386, 1585013, 1655222]
57643A655222P4108P9719Q6559R3118R9724J07816J17166J26586J36530J48301
57633B724849J61461J74728J88618K04524K21871K38789K54848K70837K86459
57624D726984L00355L11450L18254L17962L08241K88582K58212K14997J59084
57615G204121R5792L2207k7200p9205j18896j42374j51123j50178j43224j33032
57605F386888j25443j28398j46245j76850k13343k46418k67008k71110k62267
57596D549806k47004k28487k06735j83103j60644j40549j21551j02778q4608o7196
57586C007151n0595l5801k3293j1442J283J3593K3504L2041M1988N3885O6048
57575C118362P7905R0411J03776J17172J30392J43766J57191J71054J86667K03760
$$ y = [1655222, 1729330, 1809049, 1895608, 1988726, 2088450, 2196266, 2313432, 2440018, 2576548, 2724849, 2886310, 3061038, 3249656, 3454180, 3676051, 3914840, 4169688, 4440525, 4726984, 5027339, 5338789, 5657043, 5975005, 6283246, 6571828, 6830040, 7045037, 7204121, 7299913, 7332120, 7304920, 7225715, 7106819, 6964445, 6813322, 6663144, 6519920, 6386888, 6261445, 6133047, 5986802, 5809952, 5596609, 5350191, 5083183, 4812073, 4549806, 4302802, 4074315, 3867580, 3684477, 3523833, 3383284, 3261733, 3158955, 3074347, 3007151, 2956556, 2920755, 2897462, 2886020, 2887303, 2900896, 2924400, 2956441, 2998429, 3052314, 3118362, 3196267, 3286678, 3390454, 3507626, 3638018, 3781784, 3938975, 4110029, 4296696, 4500456]
57565D500456K19089K29870K36865K41611K42400K35766K19954J94140J56416
57556F476567J06373M8212j2237p2252j30710j83707k26034k56220k76376k87722
57546E185894k90062k85033k76017k64821k51357k36140k20201k03413j85823
57537B973027j69628j56650j45063j32046j18509j07554r9414r1808q4316p8313
57527A789726p3234o7083o0167n4480m9804m4458l9213l6321l4928l1929k7250
57516A270859k3870k2477k0549j7134j4142j2179r496o016m229m705m514j639
57504A129909K454N986R445J3454J7061J9563K1661K3684K4913K5461K6547K8455
57492A348593L0470L3012L7153M2020M5445M7476N0328N4813O0008O6397P5657
$$ y = [4500456, 4719545, 4949415, 5186280, 5427891, 5670291, 5906057, 6126011, 6320151, 6476567, 6582940, 6631152, 6618915, 6546663, 6415953, 6232246, 6006212, 5749992, 5473616, 5185894, 4895832, 4610799, 4334782, 4069961, 3818604, 3582464, 3362263, 3158850, 2973027, 2803399, 2646749, 2501686, 2369640, 2251131, 2143577, 2044163, 1952355, 1868039, 1789726, 1716492, 1649409, 1589242, 1534762, 1484958, 1440500, 1401287, 1364966, 1330038, 1298109, 1270859, 1246989, 1224512, 1203963, 1186829, 1172687, 1160508, 1151012, 1144996, 1140767, 1136062, 1131548, 1129909, 1132363, 1138349, 1147794, 1161248, 1178309, 1197872, 1219533, 1243217, 1268130, 1293591, 1320138, 1348593, 1379063, 1412075, 1449228, 1491248, 1536693, 1584169, 1634497, 1689310, 1749318, 1815715, 1891372]
57481A891372Q6701R5731J01384J06647J14434J24351J34910J45847J56844J66758
57471C124979J75503J84352J93044J98979K00182J96785J88630J73839J50734
57462D787027J19033P8777L0867k0523o8896j10187j44427j72055j91541k02011
57452D106064k05541k04849k00478j91837j79533j65398j51179j37891j25345
57443B544013j12290r8338q5414p5499o7383n8171m7676l8571l2104k6644k0764
57432A881159j4775q558j029P239J3779J7858K1914K8068L5451M2253M8293N4292
57420B125944O0402O6794P4150Q2674R1738J01002J10609J20294J29844J40167
57410C103618J51878J63042J70571J73696J73726J70430J61258J44174J18752
$$ y = [1891372, 1978073, 2073804, 2175188, 2281835, 2396269, 2520620, 2655530, 2801377, 2958221, 3124979, 3300482, 3484834, 3677878, 3876857, 4077039, 4273824, 4462454, 4636293, 4787027, 4906060, 4984837, 5015704, 4995181, 4926285, 4816098, 4671671, 4499616, 4308075, 4106064, 3900523, 3695674, 3495196, 3303359, 3123826, 2958428, 2807249, 2669358, 2544013, 2431723, 2333385, 2247971, 2172472, 2105089, 2046918, 1999242, 1960671, 1928567, 1901923, 1881159, 1866384, 1857826, 1856797, 1864036, 1877815, 1895673, 1917587, 1945655, 1981106, 2023359, 2071652, 2125944, 2186346, 2253140, 2327290, 2409964, 2501702, 2602704, 2713313, 2833607, 2963451, 3103618, 3255496, 3418538, 3589109, 3762805, 3936531, 4106961, 4268219, 4412393, 4531145]
57401D531145Q4609M1858o506n5417j01481j43411j78924k04694k20113k27973
57391C519093k30496k27643k20094k10596k00821j89630j76002j61310j47323
57382A755178j34235j21931j11151j02062r3516q4841p6769o9876o3830n8569
57372H38398n4460n0982m7173m3347m0338l7396l3389k9709k8770k9715k9065
57361D14054k5973k3256k2635k2545k1737k1333k1980k2290k1540k0910k0626
57350A69229j9167j6664j5700j6978j7498j5064j1527r411q426p601p878r733
57338A3582B817e961n430l921m583n267m944m356l931l330k663k434k641l018
57324e2479l646m423m639l847k492j287p04j169k587l761l639k911k803k718j148
$$ y = [4531145, 4615754, 4657612, 4651106, 4595689, 4494208, 4350797, 4171873, 3967179, 3747066, 3519093, 3288597, 3060954, 2840860, 2630264, 2429443, 2239813, 2063811, 1902501, 1755178, 1620943, 1499012, 1387861, 1285799, 1192283, 1107442, 1030673, 960797, 896967, 838398, 783938, 732956, 685783, 642436, 602098, 564702, 531313, 501604, 472834, 443119, 414054, 388081, 364825, 342190, 319645, 297908, 276575, 254595, 232305, 210765, 189855, 169229, 150062, 133398, 117698, 100720, 83222, 68158, 56631, 47220, 38794, 31193, 23315, 13582, 2817, -5961, -11391, -15312, -19895, -25162, -30106, -34462, -38393, -41723, -44386, -46820, -49461, -52479, -56125, -60548, -65187, -69034, -71526, -72813, -73517, -74686, -77273, -81034, -84673, -87584, -90387, -93105, -94253]
57309i4253J460L079L246L152K868J331o45n81J729L405K545M27j156k107k662
57294g8162k494k155k891m032l168R3L067L632K538J296L24PR58K241J885J52
57278g6709l23J504L612M252M017L583K278J84r54k43J175K348L601M697M541
57263d2437L532L582N043O137O078N949O050e46D566O950J0682J3260J3463J3335
57249F2256J4194J4831J4810J5811J8116J9271J8047J6634J7330J9936K3693K8537
57237B83466L3218L5428L5185L4949L5407L4663L2536L1608L2643L2936L1009
57226F53048K9012K8606K8321K6930K5688K5099K3107J8640J3727J0251P968P009
57214H97406Q451J0821J0207N619J23m860j1650k0738k8149l1187l2022l2719
$$ y = [-94253, -92793, -89714, -86468, -83316, -80448, -79117, -79762, -80343, -78614, -75209, -72664, -72237, -73393, -75500, -78162, -80656, -82811, -85702, -89734, -92902, -92809, -89742, -86110, -83572, -82276, -81952, -81945, -80987, -78746, -76861, -76709, -77032, -75528, -71916, -67664, -63647, -60064, -57786, -57602, -58556, -58799, -57624, -55276, -51675, -46978, -42437, -38905, -35323, -30280, -24143, -18065, -12116, -6066, -546, 4566, 11516, 22198, 35458, 48921, 62256, 76450, 91281, 106091, 121902, 140018, 159289, 177336, 193970, 211300, 231236, 254929, 283466, 316684, 352112, 387297, 422246, 457653, 492316, 524852, 556460, 589103, 622039, 653048, 682060, 710666, 738987, 765917, 791605, 816704, 839811, 858451, 872178, 882429, 890397, 897406, 905857, 916678, 926885, 932504, 932627, 927767, 916117, 895379, 867230, 836043, 804021, 771302]
57202G71302l1431k6771k1438j8007j5196j1719r521r528q329l230L053O596P774
57189F33555Q932R973J0122J0835J3169J5192J5298J5131J6138J6637J5500J5110
57177G95592J7205J9398J9332J8695J9409J9575J7084J3813J2173J0874Q083N541
57165I76774N545P068Q689J1992J8067K3991K7067K9317L3625L8602M1641M3839
57153A266217M7422N1127N2646N2997N4171N4847N2631M8197M3458L8276L2500
57142A794489K8495K7767K7731K5476K2066J9860J8680J7934J9105K2732K6379
57131B050714K9003L3515M1514M9432N3801N6145N8769N9985N7977N5194N4155
57120B600204N2794M8487M2983L8799L4562K8327K1735J6457J0462K068o273j2328
$$ y = [771302, 739871, 713100, 691662, 673655, 658459, 646740, 637219, 627691, 619362, 616132, 619185, 625781, 633555, 642487, 652460, 662582, 673417, 686586, 701778, 717076, 732207, 748345, 764982, 780482, 795592, 812797, 832195, 851527, 870222, 889631, 909206, 926290, 940103, 952276, 963150, 971233, 976774, 982319, 989387, 998076, 1010068, 1028135, 1052126, 1079193, 1108510, 1142135, 1180737, 1222378, 1266217, 1313639, 1364766, 1417412, 1470409, 1524580, 1579427, 1632058, 1680255, 1723713, 1761989, 1794489, 1822984, 1850751, 1878482, 1903958, 1926024, 1945884, 1964564, 1982498, 2001603, 2024335, 2050714, 2079717, 2113232, 2154746, 2204178, 2257979, 2314124, 2372893, 2432878, 2490855, 2546049, 2600204, 2652998, 2701485, 2744468, 2783267, 2817829, 2846156, 2867891, 2884348, 2894810, 2896878, 2890605, 2878277]
57108B878277j7866k4168k8481k9092k9063l0762l2006l1680l3256l8069m1353
57097B542481m0025l8067l8828l8676l4001k7834k3483j8635j2269j0106j5917
57086B244640k4238k9079l2903l9688m6643n1121n8345p3409r2318j09519j27339
57075A560038j49330j71730j90675k10440k35188k60363F0466b45262l38719l76922
57065i60903m14551m55346n04645n58962o14745o78409p55972q42011r30805j028222
57055g744571j140194j260682j385002j523659j688465j877074k086637k329776
57047b1036060k620278k956538l336810l776577m292470m885419n559901o341618
57039e4805671p253315q292476r456896j0768153j2238834j3837922j5518981
$$ y = [2878277, 2860411, 2836243, 2807762, 2778670, 2749607, 2718845, 2686839, 2655159, 2621903, 2583834, 2542481, 2502456, 2464389, 2425561, 2386885, 2352884, 2325050, 2301567, 2282932, 2270663, 2260557, 2244640, 2220402, 2191323, 2158420, 2118732, 2072089, 2020968, 1962623, 1889214, 1796896, 1687377, 1560038, 1410708, 1238978, 1048303, 837863, 602675, 342312, 60466, -245262, -583981, -960903, -1375454, -1830800, -2335445, -2894407, -3509152, -4187561, -4943533, -5785544, -6716349, -7744571, -8884765, -10145447, -11530449, -13054108, -14742573, -16619647, -18706284, -21036060, -23656338, -26612876, -29949686, -33726263, -38018733, -42904152, -48464053, -54805671, -62058986, -70351462, -79808358, -90576511, -102815345, -116653267, -132172248]
57032a32172248j7260595j9058974k0924179k2901028k4990780k6965062k8379851
57025b92652717k8989672k9140337k9503772l0276804l0757115k9825065k6746999
57018d97892481k1424328j4076545n033602N084452J5228473K4192411L1078063
57011d62843557L5535548L7696371L7981794L6911389L4944899L2411208K9545148
57004b17817200K6546852K3584632K0775129J8195317J5898630J3899294J2163573
56997h6753773J0644571R316705Q164323P159377O273633N498295M830860M254309
56989c0611700L746822L300598K914241K577103K276919K013371J789184J596300
56981a0397162J424187J273192J146690J038230R38962Q50315P77224P15662O57891
$$ y = [-132172248, -149432843, -168491817, -189415996, -212317024, -237307804, -264272866, -292652717, -321642389, -350782726, -380286498, -410563302, -441320417, -471145482, -497892481, -519316809, -533393354, -538426956, -533342504, -518114031, -493921620, -462843557, -427308009, -389611638, -351629844, -314718455, -279773556, -247362348, -217817200, -191270348, -167685716, -146910587, -128715270, -112816640, -98917346, -86753773, -76109202, -66792497, -58628174, -51468797, -45195164, -39696869, -34866009, -30611700, -26864878, -23564280, -20650039, -18072936, -15796017, -13782646, -11993462, -10397162, -8972975, -7699783, -6553093, -5514863, -4575901, -3725586, -2948362, -2232700, -1574809]
56972a574809O03746d14676I8586M71131M33786M05489L82360L59033L37760L22503
56962B810648L09969K94872K78319K62978K45755K23365J99782J80248J62987
56953D968923J44137J25630J10643R6165P7658N6907L8430K2317P097m752j0631
56942E632524j3263j6285j8229j6518j3504j2963j3720j1436l937P720J8068J4272
56930E552729j8140q0245j54852k21145k69599k99787l12026l08141k94565k77292
56920C316937k57377k35855k17537k04528j91913j75869j60447j50099j41303
56911A582009j28666j14166j02794r3504q2102o9539n9913n3300m7218m2257l9688
56900G48862l6452k9160k0447j5082j2323q412m167l830q176j4373k0837k6917
$$ y = [-1574809, -971063, -414676, 98586, 569717, 1003503, 1408992, 1791352, 2150385, 2488145, 2810648, 3120617, 3415489, 3693808, 3956786, 4202541, 4425906, 4625688, 4805936, 4968923, 5113060, 5238690, 5349333, 5445498, 5523156, 5580063, 5618493, 5640810, 5647907, 5643155, 5632524, 5619261, 5602976, 5584747, 5568229, 5554725, 5541762, 5528042, 5516606, 5512669, 5520389, 5538457, 5552729, 5534589, 5454344, 5299492, 5078347, 4808748, 4508961, 4196935, 3888794, 3594229, 3316937, 3059560, 2823705, 2606168, 2401640, 2209727, 2033858, 1873411, 1723312, 1582009, 1453343, 1339177, 1236383, 1142879, 1060777, 991238, 931325, 878025, 830807, 788550, 748862, 712410, 683250, 662803, 647721, 635398, 626986, 622819, 618989, 610813, 596440, 575603, 548686]
56888E48686l0116k8988k6660k6262k5399k0369j3168q508o236k817J766M823
56876C66752P130J2037J9157K4649K7558L0716L5413L9313L9543L4334K2879P198
56864F66679p177j6104k1077k5322k8149k7207k4002k2100k1537j9750j6825j5173
56852D22256j5044j4753j4382j5137j6056j5348j3956j3937j4529j3670j2168
56841B63276j2236j3150j2469j0503r544r613r038q308r272j1086j0861p982m521
56828A34693j885j23N57O84K667P689J2732J4074J2458J1408J1995J2908J4160
56815B34017J6572J8739J8580J7174J7255J8810J9915K0839K3275K6362K7726
56804D59264K7943K9869L3807L7443M0402M4664M9979N2513M8988L9305K5001
$$ y = [548686, 518570, 489582, 462922, 436660, 411261, 390892, 377724, 369216, 362980, 360163, 361929, 366752, 373882, 385919, 405076, 429725, 457283, 487999, 523412, 562725, 602268, 636602, 659481, 666679, 659502, 643398, 622321, 596999, 568850, 541643, 517641, 495541, 474004, 454254, 437429, 422256, 407212, 392459, 378077, 362940, 346884, 331536, 317580, 303643, 289114, 275444, 263276, 251040, 237890, 225421, 214918, 205374, 195761, 186723, 178415, 169143, 158057, 147196, 139214, 134693, 132808, 132685, 133242, 133926, 136593, 144282, 157014, 171088, 183546, 194954, 206949, 219857, 234017, 250589, 269328, 287908, 305082, 322337, 341147, 361062, 381901, 405176, 431538, 459264, 487207, 517076, 550883, 588326, 628728, 673392, 723371, 775884, 824872, 864177, 889178]
56793H89178Q122p898j9171k4305k4860k2922j9731j6007j1734o122N59O292J0133
56780G61534J4162K0590K8559L6035M2909M9718N5362N9011O2024O4472O1672
56769A256048M8208K4619k904k8049m6740n6454n7687n5036n2803n0249m4446
56758I34507l6153k8763k2783j5989q317k035K696Q136J4983K1978K9165L7456
56746I34881M4925M7560M3769L4687K0547J281j9211l4181m0767m2103m1999m0986
56734I08403l8451l4977l1138k6760k2400j9142j6335j2089o396j227K651O254
56722G08393R811J2600J5227J8766K1307J8800J0265q26j0976j9396k5707k8477
56710G29787k7606k5522k4319k3678k2683k1530k0395j8544j5778j3149j1444
$$ y = [889178, 897300, 889402, 870231, 845926, 821066, 798144, 778413, 762406, 750672, 744550, 745109, 751401, 761534, 775696, 796286, 824845, 860880, 903789, 953507, 1008869, 1067880, 1129904, 1194376, 1256048, 1304256, 1328875, 1325971, 1297922, 1251182, 1194728, 1137041, 1082005, 1029202, 978953, 934507, 898354, 869591, 846808, 830819, 822502, 820467, 823163, 831299, 846282, 868260, 897425, 934881, 979806, 1027366, 1071135, 1105822, 1126369, 1127650, 1108439, 1074258, 1033491, 991388, 949389, 908403, 869952, 834975, 803837, 777077, 754677, 735535, 719200, 707111, 700715, 699488, 702139, 708393, 718204, 730804, 746031, 764797, 786104, 804904, 815169, 814343, 803367, 783971, 758264, 729787, 702181, 676659, 652340, 628662, 605979, 584449, 564054, 545510, 529732, 516583, 505139]
56699E05139j0318r478r248r504r446q760p790o617n187m069l579k861j414p54
56685D16114k421m993n445l218o50L23j01r49j405o78J004J718L4k643l859l434
56669C89397k893k601j986j604k253k782j699k64q71k876l196j011J273J864J465
56654C69963J078N97Q5P5L33J68j56j59o30k215l443k557n22L03m38j680l602
56637C57200o553q466o999l592j849k526l597m414n751o349l878O08L468L972
56623C11274M815O934Q217Q021Q438R936J0094Q086O392O373O019L895J809J550
56609D01853K061J881J518J608J393P51J094K587L160J850N75Q74J397N53p25
56594D22430p58J84P21M43l08j291k020j975j773k552l840l976k878k231k543
$$ y = [505139, 494821, 485343, 476095, 466591, 457145, 448385, 440595, 433978, 428791, 424722, 421143, 418282, 416868, 416114, 413693, 408700, 403255, 400037, 399387, 399710, 399609, 398660, 397255, 396577, 397581, 399299, 399333, 396690, 392831, 389397, 386504, 383903, 381917, 380313, 378060, 375278, 373579, 373315, 372444, 369568, 366372, 365361, 366634, 368498, 369963, 371041, 371638, 371723, 371798, 372131, 372299, 372143, 371984, 371354, 369139, 365696, 363139, 362617, 362920, 362482, 360802, 357200, 350647, 342181, 335182, 331590, 329741, 327215, 323618, 319204, 313453, 307104, 303226, 303834, 307302, 311274, 316089, 323023, 331240, 339261, 347699, 357635, 367729, 375815, 382207, 388580, 394599, 398494, 400303, 401853, 403914, 405795, 407313, 408921, 410314, 411065, 412159, 414746, 417906, 419756, 420331, 421205, 422602, 423155, 422430, 421672, 421856, 422577, 423020, 422712, 421421, 419401, 417426, 415653, 413101, 409261, 405285, 402407, 400176, 397633]
56579C97633k437j305k57J48N78R75L83o99n02R02J373K26q84j256k271m212n040
56562C83355l692j915j409j616j628j850k502k646j922j200o64N40K136K587J844
56547C69418J540J880J251l76q06N16J241J07r75m11M40P3m77K50J680K686L400
56530C81437L897L210J274k33m40n31j226j274QJ035N04m07q5J088J895K264K714
56513C95130L289L972M819N206M587M012M728N517M286K118K237M658N861M642
56499D55062L972N524O634N046K776K525L614M389N506P700Q966P241L896J558
56485E24409K95j256k635k303n84O04J74j554l792n486n884n729o360p120n943
56470D76836l209k044l602n084m135k136j199q95l37p60l110n465n483l802k546
$$ y = [397633, 395196, 393891, 393634, 393782, 394360, 395335, 395718, 395019, 394517, 395419, 396792, 397018, 396134, 394878, 392607, 388395, 383355, 379663, 377748, 376339, 374723, 373095, 371245, 368743, 366097, 364175, 362975, 362311, 362851, 364987, 367574, 369418, 370958, 372838, 374089, 373713, 372907, 373423, 374664, 374771, 373796, 373385, 373825, 373898, 373421, 373671, 375351, 378037, 381437, 385334, 388544, 389818, 389585, 389145, 388614, 387388, 386114, 386122, 387157, 387661, 387254, 387169, 388257, 390152, 392416, 395130, 398419, 402391, 407210, 412416, 417003, 421015, 425743, 431260, 435546, 437664, 439901, 444559, 450420, 455062, 459034, 464558, 471192, 476238, 479014, 481539, 485153, 489542, 495048, 502748, 511714, 518955, 522851, 524409, 524704, 523448, 520813, 518510, 517926, 518530, 518704, 517150, 513358, 507872, 501988, 496259, 489899, 482779, 476836, 473627, 471583, 467981, 462897, 458762, 456626, 455427, 454532, 454195, 453435, 450325, 444860, 439377, 435575, 433029]
56455D33029k246k261k556l045k890k144k107k655j744P27J450j445m827m570
56441D02716j021K349L653L241J558p37j885q87Q24J549J782K638L503L344K701
56426D25328K431K058J288J333K843M244M131L482L628L958L562L229L797M401
56412D69713M324M594N718N982M194K161K178L795N138N610N353L933J693N26
56398E24912J427K915L434L198K464O77j152m25K732M337K126j031j745p81k61
56383E42827L46J864K295k7k672k427j80J125J237J587J622O5j934k552k622l784
56367E36770n077m841m236n271o891o746n263m490m354l554k767l299l914k581
56353D73486k37N29n31j701k385k838k374q80l30j718k549n98K009K171R15J131
$$ y = [433029, 430783, 428522, 425966, 422921, 420031, 417887, 415780, 413125, 411381, 412108, 413558, 412113, 407286, 402716, 401695, 404044, 407697, 410938, 412496, 411759, 409874, 408987, 409811, 411360, 413142, 415780, 419283, 422627, 425328, 427759, 429817, 431105, 432438, 435281, 439525, 443656, 447138, 450766, 454724, 458286, 461515, 465312, 469713, 474037, 478631, 484349, 490331, 494525, 496686, 498864, 502659, 507797, 513407, 518760, 522693, 524386, 524912, 526339, 529254, 532688, 535886, 538350, 539027, 537875, 537450, 540182, 544519, 546645, 545614, 543869, 543088, 542827, 543173, 545037, 547332, 547305, 544633, 542206, 542026, 543151, 544388, 545975, 547597, 547662, 545728, 543176, 540554, 536770, 531693, 526852, 522616, 517345, 510454, 503708, 498445, 493955, 489601, 486047, 483280, 479981, 476067, 473486, 473249, 473778, 473247, 471546, 469161, 466323, 463949, 463069, 462739, 461021, 458472, 457874, 459883, 462054, 462969, 464100]
56337D64100K389K466K030L089M398L326R96O23J839J636K02O04L063M467L688
56322D98916K675K199J082j09P60L089L797K499K179L894M932L478J270L19J79
56307E31159p5m5N69R93Q58Q09J179J713K519L455L298J574K05R26K212J646J46
56290E53141N93L135N296N974N887M821K192o5Q95M398O896P024O623O830O769
56275F20409O398P239R595J1873J2992J3116J2120J0020Q572R645J2229J3695
56263G47903J3625J3692J4392J4693J4498J4558J4480J3405J2021J1321J0453
56252H95041Q463O777O858P017M925J823N87J161J627K230M172N928N344M107
56238I56060N415Q330R333Q564R289J1800J3200J3128J4383J7526J9964K0842
$$ y = [464100, 466489, 468955, 470985, 474074, 478472, 481798, 482794, 483417, 485256, 486892, 487094, 487698, 490761, 495228, 498916, 501591, 503790, 504872, 504763, 505523, 508612, 512409, 514908, 517087, 520981, 525913, 529391, 530661, 530980, 531159, 531084, 531039, 531608, 532601, 533459, 534268, 535447, 537160, 539679, 543134, 546432, 548006, 548211, 549137, 551349, 552995, 553141, 553734, 556869, 562165, 568139, 574026, 578847, 581039, 580974, 581869, 586267, 593163, 600187, 606810, 613640, 620409, 626807, 634046, 643641, 655514, 668506, 681622, 693742, 703762, 712334, 721979, 734208, 747903, 761528, 775220, 789612, 804305, 818803, 833361, 847841, 861246, 873267, 884588, 895041, 903504, 910281, 917139, 924156, 929081, 930904, 931491, 932652, 934279, 936509, 940681, 946609, 951953, 956060, 961475, 969805, 979138, 987702, 996991, 1008791, 1021991, 1035119, 1049502, 1067028, 1086992, 1107834]
56226A107834K2119K4237K5523K6367K9388L4601L8928M1247M3655M7139N0255
56215A491293N2724N6028N9878O2373O4286O8788P6272Q3768R0098R7225J05760
56204B308493J13771J20937J29569J40384J51442J62179J74323J87818K00047
56195C688963K10071K19559K28595K34749K37340K38369K37995K33093K21665
56186E750399K05036J84531J59613J30424R8808O5927L2105o38k9390n3981p6177
56175F466657r5412j09256j18139j25331j31975j36395j38383j39938j41599j42429
56165E187800j43537j47078j51856j54752j56320j59715j64276j65821j63629
56156C780816j61333j60296j57918j53352j48944j44801j37744j27319j17324
$$ y = [1107834, 1129953, 1154190, 1179713, 1206080, 1235468, 1270069, 1308997, 1350244, 1393899, 1441038, 1491293, 1544017, 1600045, 1659923, 1722296, 1786582, 1855370, 1931642, 2015410, 2105508, 2202733, 2308493, 2422264, 2543201, 2672770, 2813154, 2964596, 3126775, 3301098, 3488916, 3688963, 3899034, 4118593, 4347188, 4581937, 4819277, 5057646, 5295641, 5528734, 5750399, 5955435, 6139966, 6299579, 6430003, 6528811, 6594738, 6626843, 6626205, 6596815, 6542834, 6466657, 6371245, 6261989, 6143850, 6018519, 5886544, 5750149, 5611766, 5471828, 5330229, 5187800, 5044263, 4897185, 4745329, 4590577, 4434257, 4274542, 4110266, 3944445, 3780816, 3619483, 3459187, 3301269, 3147917, 2998973, 2854172, 2716428, 2589109, 2471785]
56147B471785j09869j02886r4882q7041p9620p1478o4059o0307n8762n4552m7234
56136A641095m1591l9429l7016l2150k7440k4594k1670j8004j5886j5283j2854
56125A355178q069m485l172j187J897K778J593L096Q179J1558J0829J0594J4033
56112A402822J7488J7369J5850J5458J4352J1269R185R764R697O746M092M625
56100A538717O268O737P587R798J0708R170Q483J0512J2294J2011J2829J7149
56088A662263K2516K6843L2093L9167M4912M7949N1836N8729O5677P0837P7344
56077B200166Q7396R8513J09484J23576J41621J58121J68441J73909J75914J71636
56067C608777J60025J45577J31658J16523J00099Q7516Q0756P3509N9581M0350
$$ y = [2471785, 2361916, 2259030, 2164148, 2077107, 1997487, 1926009, 1861950, 1801643, 1742881, 1688329, 1641095, 1599504, 1560075, 1523059, 1490909, 1463469, 1438875, 1417205, 1399201, 1383315, 1368032, 1355178, 1347109, 1342624, 1339452, 1338265, 1340162, 1342940, 1344533, 1347629, 1355808, 1367366, 1378195, 1388789, 1402822, 1420310, 1437679, 1453529, 1468987, 1483339, 1494608, 1503793, 1513557, 1523254, 1530000, 1534092, 1538717, 1544985, 1551722, 1559309, 1569107, 1579815, 1588985, 1597468, 1607980, 1620274, 1632285, 1645114, 1662263, 1684779, 1711622, 1743715, 1782882, 1827794, 1875743, 1927579, 1986308, 2051985, 2122822, 2200166, 2287562, 2386075, 2495559, 2619135, 2760756, 2918877, 3087318, 3261227, 3437141, 3608777, 3768802, 3914379, 4046037, 4162560, 4262659, 4350175, 4430931, 4504440, 4564021, 4604371]
56057D604371J9386l273k6384m4439n5013o2870p1678p8800q3433r1910j08271
56046C997686j26691j39742j47385j51614j49844j40781j29881j21573j12570
56037B777605r9683q7214p9380p2517o2650n3829n0715m9387m4079l7011l3025
56026B108115l0251k4536j7919j4394j2299q597n564n658n229q16L839M430M025
56013A995146O841J0194J0188R460J1702J4542J5145J6385K0194K1965J9106J7565
56001B168433K1793K6316K5871K5374L0265L5419L4215L0746L2125L6040L6955
55990B503552L7414M1977M6737M6227M4183M6394M9616M8546M6864N0032N4179
55979C015721N3594N2232N6262O2391O5164O8178P6093Q3586Q4726Q5240R2324
$$ y = [4604371, 4623757, 4620484, 4594100, 4549661, 4494648, 4431778, 4360100, 4281300, 4197867, 4105957, 3997686, 3870995, 3731253, 3583868, 3432254, 3282410, 3141629, 3011748, 2890175, 2777605, 2677922, 2590708, 2511328, 2438811, 2376161, 2322332, 2271617, 2222230, 2178151, 2141140, 2108115, 2077864, 2053328, 2035409, 2021015, 2008716, 2000119, 1994555, 1988897, 1983668, 1982852, 1986691, 1991121, 1995146, 2001987, 2012181, 2022369, 2031829, 2043531, 2058073, 2073218, 2089603, 2109797, 2131762, 2150868, 2168433, 2190226, 2216542, 2242413, 2267787, 2298052, 2333471, 2367686, 2398432, 2430557, 2466597, 2503552, 2540966, 2582943, 2629680, 2675907, 2720090, 2766484, 2816100, 2864646, 2911510, 2961542, 3015721, 3069315, 3121547, 3177809, 3240200, 3305364, 3373542, 3449635, 3533221, 3617947, 3703187, 3795511]
55968C795511J00567J01689J00011J04114J11073J13606J15101J22637J32609
55959D796918J38132J43135J54260J66671J73015J78010J88909K00482K05655
55950F345187K11560K27945K48980K63962K76497K94955L14241L26246L38352
55941H847925L61481L89838M12690M35784M69872N09090N42975N78510O26748
55932A3174913O79147P21771P61144Q10477Q62753R05038R46841J005167J073613
55923B0940864J136437J200200J279247J363111J432821J497051J576452J665496
55915C2091679J747751J835465J953569K097758K250403K423501K641046K894426
55907D9935598L163917L468182L840401M272973M742670N271109N896678O605974
$$ y = [3795511, 3896078, 3997767, 4097778, 4201892, 4312965, 4426571, 4541672, 4664309, 4796918, 4935050, 5078185, 5232445, 5399116, 5572131, 5750141, 5939050, 6139532, 6345187, 6556747, 6784692, 7033672, 7297634, 7574131, 7869086, 8183327, 8509573, 8847925, 9209406, 9599244, 10011934, 10447718, 10917590, 11426680, 11969655, 12548165, 13174913, 13854060, 14575831, 15336975, 16147452, 17010205, 17915243, 18862084, 19867251, 20940864, 22077301, 23277501, 24556748, 25919859, 27352680, 28849731, 30426183, 32091679, 33839430, 35674895, 37628464, 39726222, 41976625, 44400126, 47041172, 49935598, 53099515, 56567697, 60408098, 64681071, 69423741, 74694850, 80591528, 87197502]
55899H7197502P362794Q186162R127496J0198981J1412018J2856878J4643837
55892A60985668J6797418J9315603K2271886K5709457K9516679L3597484L7935078
55885C46129273M1872742M3179150L8604838K6346096Q201629j1072890k6776395
55878D66484443l6722409m1269071m1851711l9879604l6496761l2574875k8627074
55871B09062938k4867201k1421768j8408433j5851417j3674332j1808617j0230478
55864I2800692q899978p754745o769671n951188n271719m673499m135128l674975
55856D5669789l291352k955135k658652k417665k224333k046856j876375j729617
55848B6469804j605230j480382j351482j237914j143771j053042r64056q92776
$$ y = [87197502, 94560296, 102746458, 111873954, 122072935, 133484953, 146341831, 160985668, 177783086, 197098689, 219370575, 245080032, 274596711, 308194195, 346129273, 388002015, 431181165, 469786003, 496132099, 504333728, 493260838, 466484443, 429762034, 388492963, 346641252, 306761648, 270264887, 237690012, 209062938, 184195737, 162773969, 144365536, 128514119, 114839787, 103031170, 92800692, 83900714, 76145969, 69376298, 63425110, 58153391, 53479892, 49344764, 45669789, 42378437, 39423302, 36764650, 34346985, 32122652, 30075796, 28199421, 26469804, 24864574, 23384192, 22032710, 20794796, 19651025, 18597983, 17633927, 16741151]
55840A6741151q39767p87309p31666o86947o54853o20422n80197n46391n20850
55831A0772749m91557m57085m29152m08949l85241l57542l37523l25894l10839
55822G268967k90879k76883k69816k58348k40581k27122k20522k11846j99618
55813E073352j92241j89540j81209j66056j54210j47887j38180j23518j13465
55804C667046j11179j08956j04215j03408j07035j06604r9806r3854r0886q4601
55794B656502p4050o6472o3605n8780n0232m4152m2519m0966m0317m6632n7755
55783B071022o3327o0619n7473n7357n4740m7965m3569m4321m4928m2986m2715
55772A511022m4885m4263m0027l7819l8701l6773l0570k6186k6355k6582k4779
$$ y = [16741151, 15901384, 15114075, 14382409, 13695462, 13040609, 12420187, 11839990, 11293599, 10772749, 10281192, 9824107, 9394955, 8986006, 8600765, 8243223, 7905700, 7579806, 7268967, 6978088, 6701205, 6431389, 6173041, 5932460, 5705338, 5484816, 5272970, 5073352, 4881111, 4691571, 4510362, 4344306, 4190096, 4042209, 3904029, 3780511, 3667046, 3555867, 3446911, 3342696, 3239288, 3132253, 3025649, 2925843, 2831989, 2741103, 2656502, 2582452, 2515980, 2452375, 2393595, 2343363, 2299211, 2256692, 2215726, 2175409, 2128777, 2071022, 2007695, 1947076, 1889603, 1832246, 1777506, 1729541, 1685972, 1641651, 1596723, 1553737, 1511022, 1466137, 1421874, 1381847, 1344028, 1305327, 1268554, 1237984, 1211798, 1185443, 1158861, 1134082]
55761A134082k4656k7016k7356k4561k2765k2636k0212j5757j4076j4741j1999
55750I08307n710k192k720j743J920K920M54M48M059M913Q25k288j537j794n617
55735I00245q496q091q681j2386j5029j4654j5308j8574k0098j8192j7129j8281
55723G25326j6907j1645q176r148r357n456j919k326l077j108j16l587q590j1791
55709F32123j4904j9169k0906j7823j3822j2618j2161r746p022n677l765n09P46
55696D94747j658m280m604m829o159n403j303J677K46k556l257l574n883q299
55682D44865q749r037j0630j1060q643o229o252o493m619k469k047j620K90J251
55668C68558q88m021n526o195p248p479o464o634q920j0377r092p474p728q174
$$ y = [1134082, 1109426, 1082410, 1055054, 1030493, 1007728, 985092, 964880, 949123, 935047, 920306, 908307, 902597, 900405, 897685, 895942, 897862, 900782, 901236, 901684, 905743, 910656, 911481, 909193, 907656, 905862, 900245, 891749, 883658, 874977, 862591, 847562, 832908, 817600, 799026, 778928, 760736, 743607, 725326, 708419, 696774, 688598, 679450, 670093, 664637, 662718, 660392, 657315, 656207, 656091, 652504, 643914, 632123, 617219, 598050, 577144, 559321, 545499, 532881, 520720, 510974, 503952, 498275, 494510, 494001, 494747, 493089, 488809, 484205, 479376, 473217, 467814, 466511, 468188, 468434, 465878, 462621, 459047, 453164, 444865, 436116, 427079, 416449, 405389, 396746, 390517, 384265, 377772, 373153, 370684, 368637, 367017, 367307, 368558, 367670, 363649, 358123, 351928, 344680, 337201, 330737, 324103, 315183, 304806, 295714, 288240, 280512, 272338]
55654B72338o981n386m326k151J460L608L070K768M566O042N419N090P008R016
55640C01541R041Q670R179Q407N064K123K361M161M964N185N703N265L301J690
55626C76655J151l06k958l844k061r44k261l023j009J422K136K900M915N691L918
55611C82382K601L590L899J292j304j020K12J61N34K379K523n75k494K55L826
55596C98261L208K41o48l80k254m686m028j956l046o807q712q009q219j0493j2205
55581C30267j2025j1474j1476j1400j1283j1501j0863q360n815n585o835p160
55569B16490o442o017n697m798m423n546o594n930m746m572m182k284p27j456
55555A53076k699j845J02P70P55J777K759J822K34J60N19p91k438j769K68O01
$$ y = [272338, 265357, 259971, 255645, 253494, 254954, 258562, 261632, 264400, 268966, 275008, 280427, 285517, 292525, 301541, 310582, 319252, 328431, 336838, 341902, 344025, 346386, 350547, 355511, 360696, 366399, 371664, 374965, 376655, 377806, 377500, 374542, 370698, 368637, 367693, 365432, 362409, 361400, 362822, 364958, 367858, 372773, 378464, 382382, 384983, 388573, 392472, 393764, 392460, 391440, 391652, 391813, 392347, 394726, 397249, 396674, 394180, 394435, 398261, 401469, 401710, 401062, 400682, 398428, 393742, 389714, 387758, 384712, 377905, 369193, 361184, 352965, 342472, 330267, 318242, 306768, 295292, 283892, 272609, 261108, 250245, 241885, 236070, 230485, 223650, 216490, 210048, 204031, 198334, 193536, 189113, 183567, 176973, 171043, 166297, 161725, 157543, 155259, 154532, 153076, 150377, 148532, 148634, 149404, 150159, 151936, 154695, 156517, 156751, 156911, 157430, 156639, 154201, 152432, 152700, 153301]
55539A53301r08k107k758l967m828l750k056k127l144k541n37O96J106K085K905
55524A31370J960M50O62J634O47j687k169k80J290J114J77r60k566l569k420O6
55508A25719J847K955M622O070N578L892L196L481L282L002L976N030L845J066
55494A77561n40m37l77q03q38j120k864m684m101j833q37j473j379J04J181J209
55478A58769J470K213K309J838J910K194J673J293K495L873K978P46J99J212Q81
55463A86053j118j981r37o30k506m819o121p112q027p673o155n331n653n499m417
55448A18074l963m641m986m442m155m321l738k665k996m830n874n071l847l023
55434E9522j635K69Q59k69j128p41o61j733k296j210j05p47k284k873k338j657
$$ y = [153301, 152393, 150286, 147528, 143561, 138733, 134983, 132927, 130800, 127656, 125115, 124578, 125274, 126380, 128465, 131370, 133330, 133780, 134442, 136076, 136723, 135036, 132867, 132587, 133877, 134991, 135168, 134208, 131642, 128073, 125653, 125719, 127566, 130521, 135143, 141213, 146791, 150683, 153879, 157360, 160642, 163644, 167620, 172650, 176495, 177561, 177021, 176584, 176207, 175404, 174566, 173446, 170582, 165898, 161797, 159964, 159127, 157654, 156275, 156379, 157560, 158769, 160239, 162452, 164761, 166599, 168509, 170703, 172376, 173669, 176164, 180037, 183015, 183761, 183960, 185172, 186053, 184935, 182954, 182017, 181387, 178881, 174062, 167941, 160829, 152802, 145129, 138974, 133643, 127990, 122491, 118074, 114111, 109470, 104484, 100042, 95887, 91566, 87828, 85163, 82167, 77337, 71463, 66392, 62545, 59522, 57887, 58156, 59015, 58746, 57618, 56877, 56216, 54483, 52187, 50977, 50872, 50125, 47841, 44968, 42630, 40973]
55418D0973j257j065j085r29MJ382K147K152K190K359J924Q99K7o54j620k448
55402D4999k398k025k162j932j34J984K119P22K94J143J162Kj46J310J921K23
55386D7082j880k191j168l53j66n74j799l091k792o95J421K384K822L137K585
55371D4722J244N63R31Q84r8l37J197K786K327K20j539j876j103n9L20m39j521
55354D8222j575n65M25J160K335L578L407J698K27J50O40O58M34N81J210K335
55338F4920L805M624L873K266J172L39j454l738m695m120l608l578k724p16R71
55323E7337J454J315P07r08k710k941j870j716k896l236j737k38j23k02O26J227
55307D4089M97n85q61r74j707k196j556p27j035k134k673k103q56J55j30j754
$$ y = [40973, 39716, 38651, 37566, 36637, 36641, 38023, 40170, 42322, 44512, 46871, 48795, 49694, 49721, 49067, 47447, 44999, 42601, 40576, 38414, 36482, 36348, 38332, 40451, 41173, 41467, 42610, 43772, 43774, 43628, 44938, 46859, 47082, 45202, 43011, 41843, 41490, 41324, 40750, 38951, 35860, 33068, 32373, 33794, 36178, 39000, 42137, 44722, 45966, 46529, 47460, 48344, 48246, 47909, 49106, 51892, 54219, 54439, 52900, 51024, 49921, 49862, 50182, 49743, 48222, 46647, 46082, 46507, 47667, 50002, 53580, 56987, 58685, 58912, 59062, 59702, 60360, 60794, 61375, 62585, 64920, 68725, 73349, 77222, 79488, 80660, 80999, 79545, 75807, 71112, 66992, 63384, 59806, 57082, 56366, 57337, 58791, 60106, 60813, 59905, 57195, 54254, 52384, 50668, 47772, 44536, 42799, 42561, 42438, 42236, 42862, 44089, 44586, 44001, 43140, 42166, 40459, 38263, 36707, 35980, 34945, 32811, 30138, 28035, 27179, 27334, 27204, 25450]
55291B5450k779j279J595K728J455K97R14K056K387K460K743K389J342J084J919
55276D4761K044P68mQ77J622N72j117j877k358l380l638k008j36q2j009q66K14
55259C4383P24O45Q79Q76m32k065j907R6J887K214J694J122M91k38p56q89o07
55242C8117J58R94R07l84j776k107j535p99k5Q75J432J200N74L13O97J524K238
55225D2403K048Q95J28R15K134J660l63j666j404j096j470j182K44R21l76k008
55209D1783k153j521j592j967j495m23M76J432K587K726J040j102j935j661j477
55194C4718j390p46J29M85N22P89J101J095J039J014M98k46J82K153L873L598
55178D8814J732k30j473j697r03k09j074k786k844p60J088J547K676N708Q061
$$ y = [25450, 22671, 21392, 22987, 25715, 27170, 27467, 28381, 30437, 32824, 35284, 38027, 40416, 41758, 42842, 44761, 46805, 47573, 47569, 48446, 50068, 50640, 49523, 47646, 45288, 41908, 38270, 36262, 36126, 36044, 35035, 34169, 34383, 35107, 35752, 36631, 37507, 37075, 35010, 33103, 33199, 35086, 37300, 38994, 40116, 40607, 40369, 39613, 38724, 38117, 38275, 39269, 40176, 39792, 38016, 35909, 34374, 33575, 33550, 34425, 35857, 37057, 37631, 37944, 38641, 40165, 42403, 44451, 45346, 45474, 46389, 48523, 50183, 49820, 48154, 46750, 45654, 44184, 43002, 43246, 44167, 43791, 41783, 39630, 38109, 36517, 34550, 33055, 32632, 33108, 34540, 37127, 39853, 40893, 39791, 37856, 36195, 34718, 33328, 32582, 32711, 33196, 33718, 34507, 35608, 36703, 37742, 38756, 39254, 39008, 39190, 41343, 45216, 48814, 50546, 50316, 48843, 47146, 46243, 46034, 44960, 42174, 39330, 38570, 39658, 41205, 43881, 49589, 57650]
55163E7650P080M205K442J896R48r7l0J28j338l129k347P52K778J995J56p24p95
55146G1570j043j601j967j576j38J619K019N02j272j629j135j180j576j455j257
55131E9881j667j712l42J090N46j196j453K32J492P66q21j558j224o37m97r20
55115E1980j244n48Q54J287J01j004m30Q56R90M7p58j411k464l111k287q26l25
55098D1707o42n95k68k50L00K203L743K488p75k722j914K0J379J973J765N52p94
55081D8170r37j6Q18J452K267K299M30k001k558j348n25l82R55L716N524M970
55065F2834L533L038L440L817L513J868j127l644l562j432K29N65Q63J486J178
55050G6599k06j107j008j084j452o37J440K730K417K199L011L284J968O42P49
$$ y = [57650, 64730, 68935, 71377, 73273, 74221, 74124, 74094, 74222, 72884, 69755, 67408, 68160, 70938, 72933, 73089, 72365, 71570, 70527, 68926, 66959, 65383, 65245, 66864, 68883, 69385, 68113, 66484, 65349, 64169, 62593, 61138, 59881, 58214, 56502, 56160, 57250, 57796, 56600, 55147, 55379, 56871, 57637, 56816, 55258, 54034, 53397, 52900, 51980, 50736, 50188, 51042, 52329, 52430, 51426, 50996, 51852, 52842, 52889, 52131, 50720, 48256, 45145, 42858, 42032, 41707, 41065, 40470, 40202, 39952, 40252, 42455, 46198, 48686, 47911, 45189, 43275, 43295, 44674, 46647, 48412, 48964, 48170, 47233, 47217, 48035, 49487, 51754, 54053, 54483, 52482, 49924, 48576, 48051, 47669, 48624, 52340, 57864, 62834, 66367, 69405, 72845, 76662, 80175, 82043, 80916, 77272, 73710, 72278, 72507, 73072, 73935, 75421, 76599, 76393, 75286, 74278, 73194, 71742, 71105, 72545, 75275, 77692, 79891, 82902, 86186, 88154, 88796, 89545]
55035H9545J173N33k13M07J741K202J728J152M66m86p44M69K146K712K079J188
55019A06098L72m00n51M04J713K196J770J242J017Q15L44m49j311j653j183o30
55003A09794q94j431q18R49K195J962J153O99K57n31j042r13r03j506j988j792
54987A05191j710k523l503l336j689Q04L266M602M042K429J721K426K732J142
54973A15594j394l047l537l683l518k474q19M24Q10P10N05K51p8n78j307j861
54957I5998j585m76P29J588K236K494J824M07p11r80q11l84O70K021K428J515
54941A06963N14M95R72J048P85O01L95N0j48k52p80j478j197K92J618J733J279
54924A12890J199J361J496K123L307L774K646J024N51J211J909K263K526K416
$$ y = [89545, 90718, 91251, 91038, 91445, 93186, 95388, 97116, 98268, 98734, 98248, 97504, 97973, 100119, 102831, 104910, 106098, 106470, 106070, 105519, 105923, 107636, 109832, 111602, 112844, 113861, 114676, 115020, 114571, 113260, 111607, 110424, 109794, 108900, 107469, 106651, 107600, 109795, 111757, 112910, 113609, 113866, 113335, 112293, 111380, 110477, 108971, 106983, 105191, 103481, 100958, 97455, 94119, 92430, 93234, 96500, 101102, 105144, 107573, 109294, 111720, 114452, 115594, 114200, 111153, 107616, 103933, 100415, 97941, 97122, 97546, 98356, 99066, 99571, 99822, 99744, 99166, 97859, 95998, 94413, 93937, 94666, 96254, 98490, 100984, 102808, 103215, 102504, 101524, 100713, 100329, 100999, 103020, 105448, 106963, 107477, 107972, 108944, 109992, 110777, 111378, 111773, 111823, 111675, 111423, 110643, 109165, 107968, 108260, 109878, 111611, 112890, 114089, 115450, 116946, 119069, 122376, 126150, 128796, 129820, 130371, 131582, 133491, 135754, 138280, 140696]
54910A40696J562N91N76J686L331N007O235O388N625N265O133P260P270O336N658
54895B09619N790O750Q866J2006J4572J5029J4210J4421J6237J7694J6996J4495
54883C66685J1559Q580M926K11n038r793j3271j5514j7198j8664j9262j8046j5172
54870B60003j2131j0414j0097r972q992p400o179n509m467k485m17O43R75J673
54856A85231K836L552L548L650M522O122Q299J0772J2448J2311J1100J0735J1775
54843B86901J2980J3567J4102J4517J3228R290L865j550o858j2118j6223j8305
54831C13396j9182j9809j9394j6818j3036j0299r402r229q744p936o995n840m606
54818A62106l579k754k048j765k146k820l288l542l625l224k313j600j660k161
$$ y = [140696, 142258, 142849, 143425, 145111, 148442, 153449, 159684, 166072, 171697, 176962, 183095, 190355, 197625, 203961, 209619, 215409, 222159, 231025, 243031, 257603, 272632, 286842, 301263, 317500, 335194, 352190, 366685, 378244, 386824, 391750, 391961, 386923, 377130, 363859, 348345, 331147, 312483, 293221, 275175, 260003, 247872, 237458, 227361, 217389, 208397, 200997, 194818, 189309, 184842, 182357, 181940, 182583, 183558, 185231, 188067, 191619, 195167, 198817, 203339, 209461, 217760, 228532, 240980, 253291, 264391, 275126, 286901, 299881, 313448, 327550, 342067, 355295, 364585, 368450, 366900, 360042, 347924, 331701, 313396, 294214, 274405, 255011, 238193, 225157, 214858, 205456, 196227, 187483, 179547, 172552, 166712, 162106, 158527, 155773, 153725, 151960, 149814, 146994, 143706, 140164, 136539, 133315, 131002, 129402, 127742, 125581]
54804A25581k589k997l449l417k532j280l20J72J01o93j564j315m0M98o40j969
54788A03547j683j73Q26O55q5q60j347j059j06N02M24Q36K477M035M080L363L246
54771A18678L077J459o95j092J83N30j239l144k913p02J790L371L755L231K621
54756A28910K610K844K663K603L796N791O671N706M290L716L641L580M286O428
54742A87535R036J0686J1458J2456J3884J4856J4979J5025J5783J7019J7901J8012
54730C58630J7507J6373J3964R674M032j357n258p848r969j1863j3146j3773j4169
54717C42797j4415j3897j2105r423o987n740n514n106l559j428j06K20J093L680
54703B69510O895Q540P978O804P025R130J1858J3444J3315J2710J3349J5440J7787
$$ y = [125581, 122992, 119995, 116546, 113129, 110597, 109317, 108997, 109169, 109270, 108577, 107013, 105698, 105658, 106156, 105516, 103547, 101864, 101691, 102517, 103172, 103087, 102227, 100880, 99821, 99715, 100217, 100641, 101477, 103954, 107989, 112069, 115432, 118678, 121755, 123214, 122519, 121427, 121610, 122140, 120901, 117757, 114844, 114142, 115932, 119303, 123058, 126289, 128910, 131520, 134364, 137027, 139630, 143426, 149217, 155888, 161594, 165884, 169600, 173241, 176821, 181107, 187535, 196571, 207257, 218715, 231171, 245055, 259911, 274890, 289915, 305698, 322717, 340618, 358630, 376137, 392510, 406474, 416148, 420180, 418823, 413565, 405717, 395748, 383885, 370739, 356966, 342797, 328382, 314485, 302380, 292957, 285970, 280230, 274716, 269610, 266051, 264623, 264517, 264737, 265830, 269510, 276405, 284945, 292923, 299727, 306752, 315882, 327740, 341184, 354499, 367209, 380558, 395998, 413785]
54690D13785J9819K2111K4323K4197K0024J3033N875m39o519j2260j6494j8908
54678D88547k0582k2354k3928k4689k4280k2344j9051j5886j4542j4671j4094
54667B72126j1697q866p426p264o919n738m515m155m492m546l743k704k560l382
54653A94119l847k936j429q49j374j757j218l30P9m9l59o40o07M3J036J534J111
54636A82527L21r5j15j49j21M82J658K443J931O17QO59J278O48k75N12K986M777
54618B00092M273K536J450J374J653K119K839L343L375L603M435N032M762M630
54604B45516N819P546Q088P397O959P391P873P844P677P616P436P215P192O911
54590C48480N811M607M740O308P941Q868R755J1281J3090J4506J5307J5423J4708
$$ y = [413785, 433604, 455715, 480038, 504235, 524259, 537292, 543167, 542728, 536209, 523949, 507455, 488547, 467965, 445611, 421683, 396994, 372714, 350370, 331319, 315433, 300891, 286220, 272126, 260429, 251563, 244137, 236873, 229954, 224216, 219701, 215546, 211054, 206508, 202765, 200061, 197501, 194119, 190272, 187336, 185907, 185058, 183684, 181927, 180709, 180379, 180458, 180409, 180050, 179410, 178803, 178846, 179882, 181416, 182527, 182848, 182753, 182638, 182489, 182368, 182850, 184508, 186951, 188882, 189499, 189507, 190166, 191444, 192092, 191817, 192329, 195315, 200092, 204365, 206901, 208351, 209725, 211378, 213497, 216336, 219679, 223054, 226657, 231092, 236124, 240886, 245516, 251335, 258881, 266969, 274366, 281325, 288716, 296589, 304433, 312110, 319726, 327162, 334377, 341569, 348480, 354291, 358898, 363638, 369946, 377887, 386755, 396510, 407791, 420881, 435387, 450694, 466117, 480825]
54577D80825J3177J0756O868J212n190j0575j4062j5874j6421j6311j6745j8403
54565C99257j9997j9527j7022j4531j3278j2465j1182r837q931p890o075l986
54553B54536k577k023j867j731j357m69P80J649J496M63o97j240r99n65o36r79
54537B43784o37M21O88r50l479n087n537n906o505o590n949n292n024m835m522
54522A84580m150l584k789k341k581k802k304j686j870k496k743k886l446l603
54508A45299k412p33P6N65J869K880J692o07q89J224K766K130R82P18L15r34j617
54491A53324p86L19O68J063J785J425j67m74J882M449M689M002N108P341P921
54476A92549O599N661N891N747M639M150N450P539Q666Q027N759K542n53k746
$$ y = [480825, 494002, 504758, 511626, 512838, 507648, 497073, 483011, 467137, 450716, 434405, 417660, 399257, 379260, 359733, 342711, 328180, 314902, 302437, 291255, 281418, 272487, 264597, 258522, 254536, 251959, 249936, 248069, 246338, 244981, 244512, 245292, 246941, 248437, 248900, 248203, 246963, 245964, 245399, 244763, 243784, 243147, 243568, 244256, 243306, 239827, 234740, 229203, 223297, 216792, 210202, 204253, 198961, 193937, 189102, 184580, 180430, 176846, 174057, 171716, 169135, 166333, 164029, 162343, 160473, 157977, 155234, 152348, 148902, 145299, 142887, 142154, 142230, 142795, 144664, 147544, 149236, 148629, 147740, 148964, 151730, 153860, 154842, 155560, 155875, 154941, 153324, 152538, 152857, 153525, 154588, 156373, 157798, 157631, 157157, 159039, 163488, 168177, 172179, 177287, 184628, 192549, 199148, 204809, 210700, 216447, 221086, 225236, 230686, 238225, 246891, 254918, 260677, 263219, 262666, 259920]
54462B59920m197n398o303o729o941p058o682n961n994p020p333n460k646j559
54448A80639l075n583o950n986k827O85J900J25k039j758M02J575P13m42l16N84
54432A57647J056Q42L62m9j81P1N91J376K605L817L711J825k51n06J023K632L249
54415A79820L167K843K352J818J320N59l94n88M63J542J224%n94n08r90k135k530
54398A87369j539k49K65J97J27Q7k8j85n62j327j963j851j427j619k278k397j917
54381A70703j752k001j669n90M5l29o01J37R77N64q35j877k091k108k227j879
54365A54467o51Q98J832J957J953K325K593J957P37K90J166K186K127J539J754
54350A77130K601K579J234n0j1R62J865K653L923N534O465O071N019M650N438
$$ y = [259920, 255723, 250325, 244022, 237293, 230352, 223294, 216612, 210651, 204657, 197637, 190304, 184844, 182198, 180639, 177564, 171981, 165031, 159045, 156218, 156903, 158803, 158928, 156889, 155131, 155533, 157108, 157821, 157379, 157063, 157647, 158703, 159545, 159907, 159858, 159677, 159748, 160339, 161715, 164320, 168137, 171848, 173673, 173422, 172916, 173939, 176571, 179820, 182987, 185830, 188182, 190000, 191320, 191879, 191485, 190897, 191360, 192902, 194126, 194126, 193532, 193024, 192034, 189899, 187369, 185830, 185581, 185846, 186043, 186170, 186257, 186229, 186044, 185482, 184155, 182192, 180341, 178914, 177295, 175017, 172620, 170703, 168951, 166950, 165281, 164691, 164736, 164407, 163806, 163943, 164920, 165484, 164649, 162772, 160681, 158573, 156346, 154467, 153816, 154714, 156546, 158503, 160456, 162781, 165374, 167331, 168068, 168358, 169524, 171710, 173837, 175376, 177130, 179731, 182310, 183544, 183494, 183483, 184445, 186310, 188963, 192886, 198420, 204885, 210956, 215975, 220625, 226063]
54335B26063O314N861M108K556K266K698K855K739K774K562J315p90k690l746
54321B54885m163m321m488m965n648n689m519k938k328k879l546l536k940k053
54307B00872j112o45j129k185k880k785k129j197k82J10m8J38J257K430K476J718
54291A94609J222Q16l78j758j617J77J839K469L231M941O385O192M979M316M643
54276B32066N348N939O077N293L712K291J396k3k720n458o517o198o254p050p062
54261B20840n594m391n467q182r687q147m620j622o02j262k689m187n076m716
54247A54598l251j828j420j799k101j998j748j481j175j059j383j877k072k003
54233A29403k050k158j865r94J33R97J089J55j293k253k454k625k966k364j72
$$ y = [226063, 232377, 238238, 242346, 244902, 247168, 249866, 252721, 255460, 258234, 260796, 262111, 261321, 258631, 254885, 250722, 246401, 241913, 236948, 231300, 225611, 221092, 218154, 215826, 212947, 209401, 205865, 202925, 200872, 199760, 199115, 197986, 195801, 192921, 190136, 188007, 186810, 186528, 186638, 186590, 186728, 187985, 190415, 192891, 194609, 195831, 196647, 196269, 194511, 192894, 193071, 194910, 197379, 200610, 205551, 211936, 218128, 223107, 227423, 232066, 237414, 243353, 249430, 254723, 258435, 260726, 262122, 262099, 259379, 253921, 247404, 241206, 234952, 227902, 220840, 215246, 210855, 205388, 197206, 187519, 179372, 174752, 173130, 172528, 171266, 168577, 164390, 159314, 154598, 151347, 149519, 148099, 146300, 144199, 142201, 140453, 138972, 137797, 136738, 135355, 133478, 131406, 129403, 127353, 125195, 123330, 122336, 122469, 123466, 124555, 124710, 123417, 121164, 118710, 116085, 113119, 110755, 110583]
54218A10583K191K802J740N69l2m29m71L01J117Q15J16P78K415K594P95l67R55
54201A26472L002L175J729P40R05J349J655K018K068J321M05K62N02Q5p72q68
54185A44048lQ43J201J512J795J383K86m82l59Pj20o28j175j827k559k795k080
54168A39047p58M44J049Q84K9q62q88k0N32k31j709k419j870r27m63n34r60j782
54150A28562k612k332l22K328L643K815Q26q13j278o03N55J202Q17Q1P8O84O65
54133A34296m57j695k236k600l360l723k544j25K040K944K575J266m45j737k157
54118A22042k107j960j282K03J564J751J144P98O69p3j388k387k696k460j377
54103A12441O35K176J678j7l24J508L228K628K34j835k331j481j15J077J907K677
$$ y = [110583, 112774, 115576, 117316, 117885, 117853, 117424, 116953, 117254, 118371, 119186, 119302, 120080, 122495, 125089, 125884, 125517, 126472, 129474, 132649, 134378, 135118, 136023, 137372, 139027, 141045, 143113, 144434, 144839, 145101, 145603, 145688, 144916, 144048, 144045, 144888, 146089, 147601, 149396, 150779, 151065, 150583, 150224, 150231, 150111, 149483, 148308, 146481, 143922, 141127, 139047, 138289, 138733, 139782, 140666, 140695, 139833, 138945, 138925, 139457, 139226, 137517, 135098, 133228, 132301, 131838, 131304, 130344, 128562, 125950, 123618, 123296, 125624, 129267, 132082, 132908, 132095, 130817, 130214, 130769, 131971, 132788, 132869, 132947, 133631, 134296, 133839, 132144, 129908, 127308, 123948, 120225, 117681, 117556, 119596, 122540, 125115, 126381, 125936, 124199, 122042, 119935, 117975, 116693, 116896, 118460, 120211, 121355, 122153, 122822, 122749, 121361, 118974, 116278, 113818, 112441, 113076, 115252, 116930, 116913, 116589, 118097, 121325, 123953, 124187, 122352, 120021, 118540, 118425, 119502, 121409, 124086]
54087A24086L340L076J530o8l79l4n96j913k526k351k644l220k413k86P28n00
54071A15830j957j505L57J986K726K338M63j840k198k94J000l54k462k606j284
54056A10200o83q34k59Q57J073M32J02q6j053k035j464Q4N99R3N44K303L299K363
54038A15535P72j65o83j012n23N41N88r19k359k408j851j804j790j070m13q28
54022A01611j474o50J594L386L431K305J268R63J364K195K918K845J737J89q89
54007A22793j199j165j078n19P95J978J850P83M67J387J961J090J52R36K766L544
53991A36541K949K500K735K586J667J166J778K645L093L737M956N798N481M779
53977A82411M669M700L918K704K371L348M888O303P503Q469R030R306R712J0415
$$ y = [124086, 127426, 130502, 132032, 131964, 131585, 131551, 130955, 129042, 126516, 124165, 121521, 118301, 115888, 115602, 116330, 115830, 113873, 112368, 112725, 114711, 117437, 119775, 120238, 118398, 116200, 115906, 116906, 116552, 114090, 111484, 110200, 109517, 108683, 108424, 109281, 110354, 110786, 110888, 110802, 109749, 107714, 106250, 106334, 106933, 107026, 107570, 109873, 113172, 115535, 116307, 116142, 115459, 114447, 113924, 114465, 115053, 114134, 111775, 109367, 107516, 105712, 103922, 102852, 102439, 101611, 100137, 99487, 101081, 104467, 107898, 110203, 111471, 112434, 113798, 115993, 118911, 121756, 123493, 123682, 122793, 121594, 120429, 119351, 118832, 119627, 121605, 123455, 124238, 124705, 126092, 128053, 129143, 129295, 130231, 132997, 136541, 139490, 141990, 144725, 147311, 148978, 150144, 151922, 154567, 157660, 161397, 166353, 172151, 177632, 182411, 187080, 191780, 195698, 198402, 200773, 204121, 209009, 215312, 222815, 231284, 240314, 249620, 259332, 269747]
53963B69747J1055J1052J0071Q376O752N739N008L937K776K519L392M309M238
53950C48971L414K553J524l47k841m540m264k528j340k361n193p695q247p332
53936C09774o421n893n020l875l764n285p074p358n989m124k567j386p35q98j427
53921B47958j229J36J703K063Q26j024k158k085j398r47r59j011p42k16M02J171
53905B42490K115K858K792J749L87k37L08J242J261K0j304j286J52J746K358K003
53889B58654J463J342J688K202K575K628K300J633R51R62K180M158N711O248O422
53874C01117P051P873P972P116N945M927L796K065k12k288l123k283o29K62j07
53859C39482m48O59K863M558N040N154N844O924P668P969Q459R580J0829J1195
$$ y = [269747, 280802, 291854, 301925, 310301, 317053, 322792, 327800, 331737, 334513, 337032, 340424, 344733, 348971, 352385, 354938, 356462, 356115, 353274, 348734, 344470, 341942, 340602, 338241, 333048, 325353, 317106, 309774, 303353, 297460, 292440, 288565, 284801, 279516, 272442, 265084, 259095, 254971, 252404, 251018, 250283, 249385, 247958, 246729, 246865, 248568, 250631, 251457, 250433, 248275, 246190, 244792, 243845, 242886, 241875, 241133, 240917, 241319, 242490, 244605, 247463, 250255, 252004, 252391, 252154, 252462, 253704, 254965, 254985, 253681, 252395, 252547, 254293, 256651, 258654, 260117, 261459, 263147, 265349, 267924, 270552, 272852, 274485, 275436, 276398, 278578, 282736, 288447, 294695, 301117, 308168, 316041, 324013, 331129, 337074, 342001, 345797, 347862, 347650, 345362, 342239, 339956, 339327, 339589, 339482, 339034, 339693, 342556, 347114, 352154, 357308, 363152, 370076, 377744, 385713, 394172, 403752, 414581, 425776]
53845D25776J0532J0101J1052J2534J2444J0210P546N864M461K269o5j330j817
53832E09577k556l335l395l247l840m481l842k720l393o115q661r715j0346j1523
53818D32408j2441j2404j2184j2262j1494r119o619o006p193q382q261o865n165
53805C14013m571n868p905q467p234o374p301q502p943o102m896m777m804m651
53791B24618m689m605l792k711k318k412k054j320j170j749k239k259k113j890
53777A89297j467j223j541j873j528r62r97j233p12K29M58J62O14J825K418K094
53761A85561K174L119L461K175M47j39K83P90J484K842M141M132K917J875J839
53746B17101K395K838K894K644K549L430N564P807Q496P381N889N254N220N026
$$ y = [425776, 436308, 446409, 457461, 469995, 482439, 492649, 500195, 506059, 510520, 512789, 512724, 511394, 509577, 507021, 503686, 500291, 497044, 493204, 488723, 484881, 482161, 478768, 472653, 463992, 454277, 443931, 432408, 419967, 407563, 395379, 383117, 371623, 362504, 355885, 349879, 342686, 334304, 326043, 319178, 314013, 309442, 303574, 295669, 287202, 279968, 273594, 266293, 257791, 249848, 243746, 238850, 234073, 229269, 224618, 219929, 215324, 211532, 208821, 206503, 204091, 202037, 200717, 199547, 197798, 195559, 193300, 191187, 189297, 187830, 186607, 185066, 183193, 181665, 180703, 179706, 178473, 177761, 177990, 178448, 178610, 179224, 181049, 183467, 185561, 187735, 190854, 194315, 196490, 196937, 196798, 197081, 197871, 199355, 202197, 206338, 210470, 213387, 215262, 217101, 219496, 222334, 225228, 227872, 230421, 233851, 239415, 247222, 255718, 263099, 268988, 274242, 279462, 284488]
53732B84488M856N429O515O909O176N415N797O928P543P337O945O257M276J268
53718C66139m89O10K873L131Q46j308j208L5j3j828l775m556m431m144l819l335
53702C44728l021l386m355n200n280m623l707k898k261j759j344q60k70q4j049
53687C04631k979m358l738j409Q16J473O01q81k217l045l223k878k495k460k652
53672B75186k596k031j185o16p63j608k553k776j938n85K87L36M28J641L585M418
53656B69230L116J150P79K037K816K201J961L710O151O744N263L741L362L294
53642C15555K767K411K800L299L323L658N287P615Q975Q636P515O998P690R170
53628C95699J0457J0814J0285R406Q317O797N231M588M944M901L371J287M18R45
$$ y = [284488, 289344, 294773, 301288, 308197, 314373, 319788, 325585, 332513, 340056, 347393, 354338, 360595, 364871, 366139, 365650, 366260, 369133, 372264, 373110, 371802, 370594, 370629, 370616, 368788, 365013, 360457, 356026, 351882, 348063, 344728, 341707, 338321, 333966, 328766, 323486, 318863, 315156, 312258, 309997, 308238, 306894, 306034, 305764, 305680, 304631, 301652, 297294, 293556, 292147, 292963, 294436, 295037, 294156, 291939, 288894, 285671, 282793, 280298, 277838, 275186, 272590, 270559, 269374, 268758, 267995, 266387, 263834, 261058, 259120, 258535, 258822, 259158, 259586, 261227, 264812, 269230, 272346, 273496, 274275, 276312, 279128, 281329, 283290, 287000, 293151, 299895, 305158, 308899, 312261, 315555, 318322, 320733, 323533, 326832, 330155, 333813, 339100, 346715, 355690, 364326, 371841, 378839, 386529, 395699, 406156, 416970, 427255, 436661, 444978, 451775, 457006, 461594, 466538, 471439, 474810, 476097, 476515, 477460]
53614D77460J557J716K260L426L902K777J222R13J562J531N85L34J527K487J247
53599E04506j626l576l096j192J02k10j618k831k724j217N09R98J1j352j952j611
53583D83121q13j64k70j315k490k585j532o05o57j084j122j080j343j123M10K422
53567D69770L391L374L747M727M946L798K601K634L397L767L843M487N727O699
53553E26908O896O688O725P431Q780J0076J0252R050P588P172P748Q205Q080Q213
53539F39812R533J1714J3403J3581J2550J1594J1623J2234J2273J1366J0487J0749
53527G80919J1948J2851J2751J2292J2518J3464J3980J3075J1183R843R924J0594
53515I25342J0346Q831P112O165N855N623N480N787O331O286N204L765L245M068
$$ y = [477460, 479017, 480733, 482993, 486419, 490321, 493098, 494320, 495233, 496795, 498326, 498911, 499245, 500772, 503259, 504506, 502880, 499304, 496208, 495016, 495118, 494908, 493290, 490459, 487735, 486518, 487027, 488025, 488036, 486684, 484732, 483121, 482308, 482144, 481874, 480559, 478069, 475484, 473952, 473347, 472690, 471606, 470484, 469404, 468061, 466938, 467348, 469770, 473161, 476535, 480282, 485009, 489955, 493753, 496354, 498988, 502385, 506152, 509995, 514482, 520209, 526908, 533804, 540492, 547217, 554648, 563428, 573504, 583756, 592806, 600394, 607566, 615314, 623519, 631599, 639812, 649345, 661059, 674462, 688043, 700593, 712187, 723810, 736044, 748317, 759683, 770170, 780919, 792867, 805718, 818469, 830761, 843279, 856743, 870723, 883798, 894981, 904824, 914748, 925342, 935688, 944519, 951631, 957796, 963651, 969274, 974754, 980541, 986872, 993158, 998362, 1002127, 1005372, 1009440]
53501A009440M953L952P34k605l656k348o78K2L47J180K092K168J487P07j52j452
53485A016191k796l269k726j961j483q92K82J721K677K878K817L212M311N684
53471A026646O715P269P610P914Q296R125J0580J1951J2380J2470J3866J6675
53459A151497J8838J9174J9605K2659K7693L1663L3067L3002L2518L1481L0453
53448A451650L1236L4318L7659L9502M0783M3205M6321M8451M9548N1069N3378
53437A927120N5344N6561N8106O0596O3054O4466O5268O6416O7781O8487O8323
53426B621522O7900O7508O6630O4841O2745O1510O1633O2568O3661O4865O6073
53415C331456O6280O4563O1801O0103N9962N9272N6131N1551M7953M5826M3633
$$ y = [1009440, 1014393, 1018345, 1019079, 1016474, 1012818, 1010470, 1009792, 1009814, 1010161, 1011341, 1013433, 1015601, 1017088, 1017795, 1017643, 1016191, 1013395, 1010126, 1007400, 1005439, 1003956, 1003064, 1003346, 1005067, 1007744, 1010622, 1013439, 1016651, 1020962, 1026646, 1033361, 1040630, 1048240, 1056154, 1064450, 1073575, 1084155, 1096106, 1108486, 1120956, 1134822, 1151497, 1170335, 1189509, 1209114, 1231773, 1259466, 1291129, 1324196, 1357198, 1389716, 1421197, 1451650, 1482886, 1517204, 1554863, 1594365, 1635148, 1678353, 1724674, 1773125, 1822673, 1873742, 1927120, 1982464, 2039025, 2097131, 2157727, 2220781, 2285247, 2350515, 2416931, 2484712, 2553199, 2621522, 2689422, 2756930, 2823560, 2888401, 2951146, 3012656, 3074289, 3136857, 3200518, 3265383, 3331456, 3397736, 3462299, 3524100, 3584203, 3644165, 3703437, 3759568, 3811119, 3859072, 3904898, 3948531]
53404C948531M0639L7807L5629L2963K8859K4138K0167J7255J5166J4134J4076
53393D229364J3570J1006O398R25m870j1165j7321k1923k4823k7893l2824l8854
53381D081590m3633m6082m7520m9780n2952n5551n6601n6800n7428n8740o0027
53370C496476o0848o1420o1798o1453n9925n7371n4257n0993m8007m5557m3305
53359B891542m0653l7611l4594l1286k6736k0995j5438j0836o319j161L649P068
53347B676630J0187J4961K1283K7166L1651L5693M0144M4649M9018N3843N9063
53336C064288O3329O5893O7936P1097P5558Q0442Q5255Q9911R4060R7504J00823
53325C956096J04686J08856J12753J16605J21087J25996J30212J33185J35817
$$ y = [3948531, 3989170, 4026977, 4062606, 4095569, 4124428, 4148566, 4168733, 4185988, 4201154, 4215288, 4229364, 4242934, 4253940, 4260338, 4261263, 4256393, 4245228, 4227907, 4205984, 4181161, 4153268, 4120444, 4081590, 4037957, 3991875, 3944355, 3894575, 3841623, 3786072, 3729471, 3672671, 3615243, 3556503, 3496476, 3435628, 3374208, 3312410, 3250957, 3191032, 3133661, 3079404, 3028411, 2980404, 2934847, 2891542, 2850889, 2813278, 2778684, 2747398, 2720662, 2699667, 2684229, 2673393, 2667074, 2665913, 2669562, 2676630, 2686817, 2701778, 2723061, 2750227, 2781878, 2817571, 2857715, 2902364, 2951382, 3005225, 3064288, 3127617, 3193510, 3261446, 3332543, 3408101, 3488543, 3573798, 3663709, 3757769, 3855273, 3956096, 4060782, 4169638, 4282391, 4398996, 4520083, 4646079, 4776291, 4909476, 5045293]
53316E045293J39356J43647J46822J47130J45089J43306J43567J44579J43593
53307F342382J39919J35534J32029J28409J22676J14411J04936R5797Q7837Q0969
53297G484899P4149O6235N7514M9423M2161L3918K3464J2128J790p957j8760l0546
53285G788418m1767n2336o4246p8978r5837j12946j28292j39866j46640j49900
53275F777610j52135j54126j54596j52963j50681j49079j47786j46251j45189
53266E424804j44920j43730j39724j33682j28349j25191j23251j20904j17316
53257D247737j12161j05374r7701r0549q4586p8972p2431o4949n8036n3208n0276
53246C379494m7334m2823l7297l2414k8360k3519j7159j1080p424n691l492J07
$$ y = [5045293, 5184649, 5328296, 5475118, 5622248, 5767337, 5910643, 6054210, 6198789, 6342382, 6482301, 6617835, 6749864, 6878273, 7000949, 7115360, 7220296, 7316093, 7403930, 7484899, 7559048, 7625283, 7682797, 7732220, 7774381, 7808299, 7831763, 7843891, 7845681, 7837724, 7818964, 7788418, 7746651, 7694315, 7630069, 7551091, 7455254, 7342308, 7214016, 7074150, 6927510, 6777610, 6625475, 6471349, 6316753, 6163790, 6013109, 5864030, 5716244, 5569993, 5424804, 5279884, 5136154, 4996430, 4862748, 4734399, 4609208, 4485957, 4365053, 4247737, 4135576, 4030202, 3932501, 3841952, 3757366, 3678394, 3605963, 3541014, 3482978, 3429770, 3379494, 3332160, 3289337, 3252040, 3219626, 3191266, 3167747, 3150588, 3139508, 3132084, 3126393, 3122901, 3123008]
53234C123008L624N592O559Q055J0630J3589J5990J7384J8096J9408K2812K8380
53222C293127L4228L8260M0460M2739M6590N1392N5289N7334N8309N9560O1405
53211C838693O2912O3083O1937O0268N8667N7169N5666N4219N2724N0612M7298
53200D463248M2917L8397L4678L1848K9088K5525K1153J6701J2484P714J437o143
53188D719047j3863k1216k8826l6861m4003m9007n2732n7244o2968o8243p2051
53177D212033p5562p9935q3891q5259q4249q3267q3394q3034q0746p7755p6287
53166C318654p6426p6156p4272p1873p0811p1523p2820p3337p2783p1812p0816
53155B516025o9152o5949o1622n7806n5437n3690n1370m8756m7043m6499m6175
$$ y = [3123008, 3126632, 3132224, 3138783, 3146838, 3157468, 3171057, 3187047, 3204431, 3222527, 3241935, 3264747, 3293127, 3327355, 3365615, 3406075, 3448814, 3495404, 3546796, 3602085, 3659419, 3717728, 3777288, 3838693, 3901605, 3964688, 4026625, 4086893, 4145560, 4202729, 4258395, 4312614, 4365338, 4415950, 4463248, 4506165, 4544562, 4579240, 4611088, 4640176, 4665701, 4686854, 4703555, 4716039, 4723753, 4725190, 4719047, 4705184, 4683968, 4655142, 4618281, 4574278, 4525271, 4472539, 4415295, 4352327, 4284084, 4212033, 4136471, 4056536, 3972645, 3887386, 3803137, 3719870, 3636476, 3553442, 3472696, 3394941, 3318654, 3242228, 3166072, 3091800, 3019927, 2949116, 2877593, 2804773, 2731436, 2658653, 2586841, 2516025, 2446873, 2380924, 2319302, 2261496, 2206059, 2152369, 2100999, 2052243, 2005200, 1958701, 1912526]
53144A912526m5324m4110m2808m1270l9454l7882l7203l7665l8928l9998l9574
53133A468310l7177l4005l1941l1583l1917l1918l1652l1585l1653l1469l0920
53122A112490l0152k9393k8955k8921k8725k7714k6259k5509k5684k5500k3862
53111H11816k1388j9501j8618j7998j7054j5891j4761j3715j2879j2505j2666
53100F34840j3096j3389j3144j2153j0719r578r170r036q277o583m653l621m034
53087E17387n192n594m494k896k437l252l882l564l476m821o599o639m486j882
53073D58173l91J66M83M07l33q57P3K168L643L331J965R86Q48J159J904L468N392
53056D82585O133M699J944l75j614k590m096n799o829o939o611o363o276o252
$$ y = [1912526, 1867202, 1823092, 1780284, 1739014, 1699560, 1661678, 1624475, 1586810, 1547882, 1507884, 1468310, 1431133, 1397128, 1365187, 1333604, 1301687, 1269769, 1238117, 1206532, 1174879, 1143410, 1112490, 1082338, 1052945, 1023990, 995069, 966344, 938630, 912371, 886862, 861178, 835678, 811816, 790428, 770927, 752309, 734311, 717257, 701366, 686605, 672890, 660011, 647506, 634840, 621744, 608355, 595211, 583058, 572339, 562761, 553591, 544555, 536278, 529695, 525042, 521421, 517387, 512195, 506601, 502107, 499211, 496774, 493522, 489640, 486076, 482600, 477779, 471180, 464541, 460055, 458173, 457782, 457948, 458431, 458838, 458505, 457648, 457721, 459889, 463532, 466863, 468828, 469814, 470662, 471821, 473725, 477193, 482585, 488718, 493417, 495361, 494986, 493372, 490782, 486686, 480887, 474058, 467119, 460508, 454145, 447869, 441617]
53042D41617o373o680o712n784m145l364m718p253q600p995p321q372j0302j0938
53028C43060r693p595n192k352Q2M94j121k673k581j471o94n16o13j122k122k996
53012C02895l241l171l024k246n41J193J970K068K233K241J258o72k404k859j840
52997B93860j28R37N93l89o16k00o57k213k927j597R6N2j091j225j33N98M14J72
52979B85546l5j114k908l978l788l249k737j546K09J082M54m18m91m81j264k134
52963B63148j921q32RJ07l36j154k100k596k434k186k227k104j468q81q57r26
52947B41242n57j74k55j27R55K085J580m70j938j335L92J294P61k00m91N1J001
52930B43814K041K956L366K888J769R92J384K714L984M603M911N550O653P686
$$ y = [441617, 435244, 428564, 421852, 416068, 411923, 408559, 403841, 396588, 387988, 379993, 372672, 364300, 353998, 343060, 333367, 325772, 320580, 318228, 318310, 318804, 317683, 315010, 312429, 310958, 310264, 309748, 309135, 308013, 305891, 302895, 299654, 296483, 293459, 291213, 290672, 291865, 293835, 295903, 298136, 300377, 301635, 300963, 298559, 295700, 293860, 293732, 294669, 295262, 294873, 294257, 294057, 293400, 291187, 288260, 286663, 286759, 286811, 285720, 284495, 284362, 284960, 285374, 285546, 285511, 284397, 281489, 277511, 273723, 270474, 267737, 266191, 266400, 267482, 267936, 267518, 267027, 266546, 265282, 263148, 261227, 260395, 260404, 260511, 260175, 259021, 256921, 254325, 251891, 249705, 247478, 245374, 243906, 243025, 242168, 241242, 240685, 240511, 240256, 240129, 241084, 243169, 244749, 244279, 242341, 241006, 241398, 242692, 243453, 243253, 242762, 242813, 243814, 245855, 248811, 252177, 255065, 256834, 257826, 259210, 261924, 265908, 270511, 275422, 280972, 287625, 295311]
52916B95311P863O776M963L654L555M126M613N216O323O929N431K182k13r0J088
52901C57727P91j230l003l158k372j998k381k847k692j870j060j097k117l348
52887C29345l927l662k826j632l85L44K57j87l58k57l69r31j784k547k620j456
52871C07005N44J975K012J541J788K258J268j379l630l590j801m97r72k347k758
52856C01417j404O81J824J602J250J898K925K788J158n53r26L1J299J932J533
52841C17455M23l31J39J112O83j678l778k944O24L940M562K925J139N51R73J577
52825C27372J635P45q24j959j543K84K087K611K012J458J766K721L534L603K830
52810C48332J566M73K18J024K320K998K300O14o56l53J346L250M524N298N803
$$ y = [295311, 303174, 309950, 314913, 318567, 322122, 326248, 330861, 336077, 342400, 349329, 354760, 356942, 356729, 356639, 357727, 358518, 357288, 354285, 351127, 348755, 346757, 344376, 341529, 338837, 336967, 335907, 334810, 332693, 329345, 325418, 321756, 318930, 317298, 316913, 317257, 317514, 317327, 316969, 316712, 316343, 315412, 313628, 311081, 308461, 307005, 307549, 309524, 311536, 313077, 314865, 317123, 318391, 317012, 313382, 309792, 307991, 307494, 306522, 304175, 301417, 300013, 300694, 302518, 304120, 305370, 307268, 310193, 312981, 314139, 313586, 312660, 312691, 313990, 315922, 317455, 317878, 317547, 317686, 318798, 319481, 317803, 314025, 311081, 311705, 315645, 320207, 323132, 324271, 324822, 325795, 327372, 329007, 329752, 328928, 326969, 325426, 325710, 327797, 330408, 332420, 333878, 335644, 338365, 341899, 345502, 348332, 349898, 350371, 350589, 351613, 353933, 356931, 359231, 359845, 359189, 358836, 360182, 363432, 367956, 373254, 379057]
52795C79057N639M503L164K888L790M626M426L630L142K923K183P77m34o74j32
52780D19508M69P99J036J245J131N27k62q81j524k682m237n340n522n469o075
52765C92723o994o866n145k959j836k066k834l535m276n203n939n967n120l584
52751C30399j787m68m06j556k670k431j080k56r63k368l188l530m289n177m790
52736B95440k817p41K25N93J067R42n89k513l089k464k390l515m606m660m086
52721B66797l516k984k748l374m286l790j473O80O71j137l060m282m818m425l137
52706B25118k065k061k115p51J404K140O84j434k659l032l176l148k930k905l195
52691A99875l332l148l079l178k725j472m41o85j846k687k629k038j406r45q63
$$ y = [379057, 384696, 389199, 392363, 395251, 399041, 403667, 408093, 411723, 414865, 417788, 419971, 420748, 420314, 419640, 419508, 419977, 420776, 421812, 423057, 424188, 424715, 424453, 423572, 422048, 419366, 415129, 409789, 404267, 398798, 392723, 385729, 378863, 373718, 370759, 368923, 366857, 364023, 360488, 356212, 351009, 345070, 339103, 333983, 330399, 328612, 328144, 327738, 326182, 323512, 321081, 320001, 319745, 318782, 316414, 313226, 309696, 305407, 300230, 295440, 292623, 291882, 292107, 292700, 293767, 294709, 294120, 291607, 288518, 286054, 283664, 280149, 275543, 270883, 266797, 263281, 260297, 257549, 254175, 249889, 246099, 244626, 245306, 245977, 244840, 241780, 237498, 232680, 228255, 225118, 223053, 220992, 218877, 218126, 219530, 221670, 222354, 220920, 218261, 215229, 212053, 208905, 205975, 203070, 199875, 196543, 193395, 190316, 187138, 184413, 182941, 182500, 181815, 179969, 177282, 174653, 172615, 171209, 170264, 169401]
52676A69401j275j927k325k216j618o41M33J006O37l85j172j037o5R77J205M11
52660A61409n43m26Q94K100K004J171J166K298L107K509J452J578K817L551L040
52645A88127K358K570L125L037K623K842L414L014J358j98n00jQ5p92k343l900
52629B04819m620m039k925k780l922m853m188k465j238j164j695k114j904q18
52615A66094N13O44r06k587k680j639j211j696j836j192q13j337k026k305k639
52600A44384l267l343k290q87k86p30j796k947l283k013J16J060K30l18J238L457
52584A29325L404P95j573j531J19J405J705J552J157K39j047j923j746n61J045
52569A32365K343K920K892K629K263J677R78N84O69Q40N87o1o05o99n09l37q2
$$ y = [169401, 168126, 166199, 163874, 161658, 160040, 159399, 159832, 160838, 161475, 161090, 159918, 158881, 158816, 159793, 160998, 161409, 160866, 160440, 161334, 163434, 165438, 166609, 167775, 170073, 173180, 175689, 177141, 178719, 181536, 185087, 188127, 190485, 193055, 196180, 199217, 201840, 204682, 208096, 211110, 212468, 212270, 211770, 211769, 211854, 211062, 208719, 204819, 200199, 196160, 193235, 190455, 186533, 181680, 177492, 175027, 173789, 172625, 170930, 168816, 166912, 166094, 166607, 167251, 166345, 163758, 161078, 159439, 158228, 156532, 154696, 153504, 152691, 151354, 149328, 147023, 144384, 141117, 137774, 135484, 134597, 134311, 133581, 131785, 128838, 125555, 123542, 123658, 124718, 124948, 124630, 125868, 129325, 132729, 133524, 131951, 130420, 130539, 131944, 133649, 135201, 136358, 136597, 135550, 133627, 131881, 131320, 132365, 134708, 137628, 140520, 143149, 145412, 147089, 148067, 148651, 149320, 150160, 150747, 150686, 150081, 149382, 148873, 148536, 148454]
52552A48454O10J570J826O00j418k506j786j50J073J701K243K445J561J3n05P97
52536A56528K521K912K277K374L550L977K250l38j256L1J516J396J34o72m82P3
52520A76791O75J680L071M052M061L546L327L648M126M245L621K300J026Q55K071
52505B19095L729M565M094K698J135K19M24J336J831J410R59J570K984L921L808
52490B53778L314L133L095K707J869O92p29j951k084q14Q55J478Q21n1k79j77
52474B65657m54j062j370j175q51n53K3R37J646J785J756J948J863Q42o18j280
52458B69094r82q60j439j638n92O12K71j302k054j034M46R59Q61J129J399N37
52442B65407j144j811n09J378J847Q19N3O71J724J666O63M31J693K860K052j30
$$ y = [148454, 149064, 150634, 152460, 153060, 151642, 149136, 147350, 147200, 148273, 149974, 152217, 154662, 156223, 156236, 155731, 156528, 159049, 161961, 164238, 166612, 170162, 174139, 176389, 176051, 174795, 174826, 176342, 177738, 177872, 177200, 176718, 176791, 177466, 179146, 182217, 186269, 190330, 193876, 197203, 200851, 204977, 209222, 212843, 215143, 216169, 217024, 219095, 222824, 227389, 231483, 234181, 235316, 235535, 235959, 237295, 239126, 240536, 241495, 243065, 246049, 249970, 253778, 257092, 260225, 263320, 266027, 267896, 268588, 267859, 265908, 263824, 263010, 263865, 265343, 266164, 266113, 265834, 265657, 265203, 264141, 262771, 261596, 260745, 260192, 260215, 261152, 262798, 264583, 266339, 268287, 270150, 270992, 270374, 269094, 268112, 267252, 265813, 264175, 263583, 264195, 264466, 263164, 261110, 260076, 260522, 261481, 262342, 263471, 264870, 265407, 264263, 262452, 261943, 263321, 265168, 265987, 266040, 266711, 268435, 270101, 270764, 271195, 272888, 275748, 277800, 277670]
52426B77670j035N89K880L286J839P55J216K044J848R98N74M71j81j117j057K93
52410B91073J601J795J424J469J743J497J031J389K542L205K737K207K848M248
52396C20809M849L981K433J190M06k22q11j418k288l363l918l342k120j396j550
52381C13240j966k245k747l494l602k706k096l151n007n398l797k097j796k169
52367B70969j980j459j290j011l8P01q6j787k496j649l39P19J820K828L050K694
52351B70646K718K802J468j142k663j800k55M5k76K01Q78M90j3J354M068N426
52335B83947M434K877K160J593N54j2N23J060P80Q27K168L182J766q87j115K363
52319C06220O483P604N775M057M493O087O623N374L582K734L028L625L993M442
$$ y = [277670, 276635, 277224, 280104, 283390, 285229, 285984, 287200, 289244, 291092, 292090, 292664, 293135, 292954, 291837, 290780, 291073, 292674, 294469, 295893, 297362, 299105, 300602, 301633, 303022, 305564, 308769, 311506, 313713, 316561, 320809, 325658, 329639, 332072, 333262, 333668, 333446, 332635, 331217, 328929, 325566, 321648, 318306, 316186, 314790, 313240, 311274, 309029, 306282, 302788, 299186, 296480, 294384, 291233, 286226, 280828, 277031, 274934, 273138, 270969, 268989, 267530, 266240, 265229, 265191, 265892, 265806, 264019, 261523, 259874, 259535, 260254, 262074, 264902, 267952, 270646, 273364, 276166, 277634, 276492, 273829, 272029, 271774, 271819, 271543, 271744, 272622, 273112, 273099, 274453, 278521, 283947, 288381, 291258, 293418, 295011, 295565, 295553, 296076, 297136, 297916, 298743, 300911, 304093, 305859, 304972, 303857, 306220, 312703, 320307, 326082, 330139, 334632, 340719, 347342, 352716, 356298, 359032, 362060, 365685, 369678, 374120]
52305C74120N284N957N509L806J802N74M70J255K623M285N810O840P408P749P729
52290D41221O876N195L606L139L729M281M016L285K846K875L177L902N265O733
52276E00146P306O862O442O811P277O610M777L066K584L187M003M543M995N678
52262E74287O512P029O875O228N598N204M778M271M463O218R134J1543J2214J1634
52248F75988J1152J1311J1747J2497J4270J7155J9920K1395K1881K2303K2498
52237H62117K1554J9809J9092K0426K2554K3622K3488K3415K4088K5073K5934
52226A111172K6577K6589K5512K4010K3540K4339K4891K4119K2988K2930K3643
52215A380310K3787K3209K2887K2889K2008J9868J7857J7180J7165J6386J4637
$$ y = [374120, 379404, 385361, 390870, 394676, 396478, 397052, 397522, 398777, 401400, 405685, 411495, 418335, 425743, 433492, 441221, 448097, 453292, 456898, 460037, 463766, 468047, 472063, 475348, 478194, 481069, 484246, 488148, 493413, 500146, 507452, 514314, 520756, 527567, 534844, 541454, 546231, 549297, 551881, 555068, 559071, 563614, 568609, 574287, 580799, 587828, 594703, 600931, 606529, 611733, 616511, 620782, 625245, 631463, 640597, 652140, 664354, 675988, 687140, 698451, 710198, 722695, 736965, 754120, 774040, 795435, 817316, 839619, 862117, 883671, 903480, 922572, 942998, 965552, 989174, 1012662, 1036077, 1060165, 1085238, 1111172, 1137749, 1164338, 1189850, 1213860, 1237400, 1261739, 1286630, 1310749, 1333737, 1356667, 1380310, 1404097, 1427306, 1450193, 1473082, 1495090, 1514958, 1532815, 1549995, 1567160, 1583546, 1598183]
52204A598183J2753J1085R304P443O069N467N368N512N681N389M337L088K384
52191A682063J882N53j525l009l185k877k846k494j023J059K733M010N496P062
52177A687899Q130Q921J0119J1549J2452J3024J4354J6729J9170K0813K1533K1067
52165A865760J8986J6033J4222J4643J6177J7066J6834J5942J4590J2796J0976
52154B034025R422P857O225N108M521L226L80k884m888n798p067q918j0033r775
52140B021401r095r023r577j0589j2155j3709j3861j2095r758q533q550q739q478
52127A887239p997p542p013o427o085o090o038n399m096k650j700j446j735k589
52113A820432m153n959o910o559n821n662n678n015m183m501n829o513n861n233
$$ y = [1598183, 1610936, 1622021, 1631325, 1638768, 1644837, 1650304, 1655672, 1661184, 1666865, 1672254, 1676591, 1679679, 1682063, 1683945, 1684498, 1682973, 1679964, 1676779, 1673902, 1671056, 1668562, 1667539, 1668598, 1671331, 1675341, 1680837, 1687899, 1696029, 1704950, 1715069, 1726618, 1739070, 1752094, 1766448, 1783177, 1802347, 1823160, 1844693, 1865760, 1884746, 1900779, 1915001, 1929644, 1945821, 1962887, 1979721, 1995663, 2010253, 2023049, 2034025, 2043447, 2051304, 2057529, 2062637, 2067158, 2070384, 2070764, 2067880, 2062992, 2057194, 2050127, 2041209, 2031176, 2021401, 2012306, 2003283, 1993706, 1983117, 1970962, 1957253, 1943392, 1931297, 1921539, 1913006, 1904456, 1895717, 1887239, 1879242, 1871700, 1864687, 1858260, 1852175, 1846085, 1840047, 1834648, 1830552, 1827902, 1826202, 1824756, 1823021, 1820432, 1816279, 1810320, 1803410, 1796851, 1791030, 1785368, 1779690, 1774675, 1770492, 1765991, 1760162, 1753649, 1747788, 1742555]
52099A742555n900p191p733p428p080o854o371n830n841o356o687o490o017n530
52085A651247n134n036n307n504n127m372m007m633o337q637j0410j0437q819
52072A567487p284p326q418q942q424p741p362o788n805n091n152n666o391p602
52058A469495r075r555q190n881m326l970l707k471l90J649K905L172K854K884
52044A435394M147O561Q944J0198J0572J1364J3320J5712J7386J8297J9446K1353
52032A592694K3360K4734K5748K7151K9013L0785L2114L2977L3157L2503L1559
52021A915795L1100L0990L0390K9251K8564K8726K8691K7587K6232K5797K5503
52010B228626K3129J7998J2207Q205O215M756K952J228q4j468l276m929n774o171
$$ y = [1742555, 1736655, 1729464, 1721731, 1714303, 1707223, 1700369, 1693998, 1688168, 1682327, 1675971, 1669284, 1662794, 1656777, 1651247, 1646113, 1641077, 1635770, 1630266, 1625139, 1620767, 1616760, 1612127, 1605790, 1597153, 1586743, 1576306, 1567487, 1560203, 1552877, 1544459, 1535517, 1527093, 1519352, 1511990, 1505202, 1499397, 1494306, 1489154, 1483488, 1477097, 1469495, 1460420, 1450865, 1442675, 1436794, 1432468, 1428498, 1424791, 1422320, 1421930, 1423579, 1426484, 1429656, 1432510, 1435394, 1439541, 1446102, 1455046, 1465244, 1475816, 1487180, 1500500, 1516212, 1533598, 1551895, 1571341, 1592694, 1616054, 1640788, 1666536, 1693687, 1722700, 1753485, 1785599, 1818576, 1851733, 1884236, 1915795, 1946895, 1977885, 2008275, 2037526, 2066090, 2094816, 2123507, 2151094, 2177326, 2203123, 2228626, 2251755, 2269753, 2281960, 2290165, 2296380, 2301136, 2304088, 2305316, 2305232, 2303764, 2300488, 2295559, 2289785, 2283614]
51996B283614p032q524r856j0365j0109r463q735q312q530r026q798p350n347
51983B172167l689k462j304m45l98q45o62O76K374L279L189K938L557N397P788
51968B191560R405R323P924O472N736N375M735L708K543J219m37k207l441l682
51954B238233l238l187m668p812j1387j3896j5154j6335j8344k0809k2987k5007
51942B075409k7438l0024l1750l2168l1940l1870l2011l2096l2405l3661l6114
51931A723932l9026m1213m2062m2005m1934m2188m2239m1463m0057l8850l8297
51920A274598l7938l7048l5492l3748l2208l0805k9366k8010k6946k6107k5255
51909I31675k4514k4239k4204k3465k1560j9446j8404j8151j7067j4631j2526
$$ y = [2283614, 2276582, 2268058, 2258202, 2247837, 2237728, 2228265, 2219530, 2211218, 2202688, 2193662, 2184864, 2177514, 2172167, 2168478, 2166016, 2164712, 2164267, 2163869, 2163024, 2162362, 2163038, 2165412, 2168691, 2171880, 2174818, 2178375, 2183772, 2191560, 2200965, 2210288, 2218212, 2224684, 2230420, 2235795, 2240530, 2244238, 2246781, 2248000, 2247563, 2245356, 2241915, 2238233, 2234995, 2231808, 2227140, 2219328, 2207941, 2194045, 2178891, 2162556, 2144212, 2123403, 2100416, 2075409, 2047971, 2017947, 1986197, 1954029, 1922089, 1890219, 1858208, 1826112, 1793707, 1760046, 1723932, 1684906, 1643693, 1601631, 1559626, 1517692, 1475504, 1433265, 1391802, 1351745, 1312895, 1274598, 1236660, 1199612, 1164120, 1130372, 1098164, 1067359, 1037993, 1009983, 983037, 956930, 931675, 907161, 882922, 858718, 835253, 813693, 794247, 775843, 757692, 740625, 725994, 713468]
51898G13468j2410j3348j2720r612o104m845o194q255r085q229o508n012m400
51885F06746m654n312n868o003n492m287k809j913k224l587n304o677p242o836
51871E38538n862n232n479o033n886n000m374m614n065m893m340m192m390m078
51857D69100l106k475k936l891m323m212m230m411m077l029j919j277r72q99j291
51842D26052j880j650k00J280J361K61o21p60r01j451j794j576j394j542j205
51827D13980O8R96k6k454l907l035r53L62K15p27j627k103k160k042k006k002
51811C92579j771j389j188r23L12K786N161N684M235K440J733J870J705Q67K05
51796D14306O82K194L661M213M018L805L696L060J740Q21J481L207M024K725K65
$$ y = [713468, 701058, 687710, 674990, 665378, 659274, 654429, 648235, 639980, 630895, 622666, 616158, 611146, 606746, 602092, 596780, 590912, 584909, 579417, 575130, 572321, 570408, 568184, 564597, 559293, 552616, 545374, 538538, 532676, 527444, 521965, 515932, 510046, 505046, 500672, 496058, 490993, 486100, 481760, 477568, 473178, 469100, 465994, 463519, 460583, 456692, 452369, 448157, 443927, 439516, 435439, 432410, 430491, 429214, 428242, 427343, 426052, 424172, 422522, 422322, 423602, 424963, 425224, 424603, 423843, 422942, 421491, 419697, 418121, 416727, 415185, 413980, 414048, 415044, 415018, 412564, 408657, 405622, 404669, 405031, 405246, 404519, 402892, 400789, 398629, 396587, 394581, 392579, 390808, 389419, 388231, 387308, 387620, 390406, 395567, 401251, 405486, 407926, 409659, 411529, 413234, 414101, 414306, 414988, 417182, 420843, 425056, 429074, 432879, 436575, 439635, 441375, 442196, 443677, 446884, 450908, 453633, 453898]
51781D53898j451j700j304j159j186q37j26K95N0l99k00Q46J997K380K017J785
51765D54906K314L190L468K914K386K852M189N207M906L423J713N36P4K74J035
51750D93387J928K378K302K150J999J235k98j453j044L88J063J99j300k350k802
51735D97782k695j703R3J825K986L972M780M333K365P56J391L266L707K128N45
51720E25531K73K98k98n00O57J855J153r70k022o37J981L696L382J466n07r67
51704E34391J00R13K07o63O70M085O646O150L577J408Q59J608L010M338M501K945
51688E74745O39r33j661k738m619o096n901m431l206k885k657j724o75p39j897
51673E35222k697k207j356j498k294k242j104m29j240k519k807k322k459l730
$$ y = [453898, 452447, 450747, 449443, 448284, 447098, 446261, 446135, 446430, 446480, 446081, 445881, 446727, 448724, 451104, 453121, 454906, 457220, 460410, 463878, 466792, 469178, 472030, 476219, 481426, 486332, 489755, 491468, 492004, 492078, 492352, 493387, 495315, 497693, 499995, 502145, 504144, 505379, 505081, 503628, 502584, 502972, 504035, 504234, 502934, 500584, 497782, 495087, 493384, 493477, 495302, 498288, 502260, 507040, 511373, 513738, 514494, 515885, 519151, 522858, 524986, 525531, 525804, 526102, 525804, 525304, 525961, 527816, 528969, 527999, 525977, 525340, 527321, 531017, 534399, 535865, 535358, 534391, 534491, 535404, 535611, 534948, 535618, 539703, 546349, 552499, 556076, 557484, 558343, 559951, 562961, 567299, 571800, 574745, 575384, 574451, 572790, 570052, 565433, 559337, 553436, 549005, 545799, 542914, 540257, 538533, 537858, 537119, 535222, 532525, 530318, 528962, 527464, 525170, 522928, 521824, 521395, 520155, 517636, 514829, 512507, 510048, 506318]
51659E06318n296o229o240n394m081l220l487m315m480l778l245l505l865l453
51645D45730k491j829j758j911j912j590r40k95l27j256k309k441j539l48O54
51630D25438J728L007L870L662K746K250K749L748M699N879P680R387R660Q318
51616D94821O770O149N876M849L308K361J999J064o65j721j071J22j77k317m731
51601E16637o009o268o475p162q117q774q678p876o925o316n814m832l490k925
51587D26976m070o288p749p297n623m210l421k286k99J362J083j056l180l701
51573C80241k833j909j805k318k692k353j427o69n81n92L35K079L111K305M39
51558C71331p60p26m93j065k007j928j51K340L710L066J329P1j34J83O21J295
$$ y = [506318, 501022, 494793, 488553, 483159, 479078, 475858, 472371, 468056, 463576, 459798, 456553, 453048, 449183, 445730, 443239, 441410, 439652, 437741, 435829, 434239, 433299, 433004, 432677, 431421, 429112, 426671, 425132, 424784, 425438, 427166, 430173, 434043, 437705, 440451, 442701, 445450, 449198, 453897, 459776, 467456, 476843, 486503, 494821, 501591, 507740, 513616, 518465, 521773, 524134, 526133, 527197, 526532, 524811, 523740, 523862, 523685, 521368, 516637, 510628, 504360, 497885, 490723, 482606, 473832, 465154, 457278, 450353, 444037, 438223, 433391, 429901, 426976, 422906, 416618, 408869, 401572, 395949, 391739, 388318, 386032, 385733, 387095, 388178, 387122, 383942, 380241, 377408, 375499, 373694, 371376, 368684, 366331, 364904, 364235, 363654, 363062, 363397, 365476, 368587, 370892, 371331, 370571, 369845, 369352, 368287, 366280, 364352, 364201, 366541, 370251, 373317, 374646, 374717, 374583, 374766, 375387, 376682]
51542C76682K045K413K739M106O531Q328Q181O927O134N874N329M923N947Q204
51528D54363R832R899R654J0534J2142J2989J2330J0546Q355O474N485N291N003
51515E72897L867K134O23k60q30j713l265m990n526l848o64K045L135L188L187
51500E69980L260L386M238O203Q257R079Q962R398J0706J1367J0142P854O322
51487F69154O092O057N116L485K180J614J196K50j001j680j385o77k89k01J23
51472F90034P32R07J09j147j733j291p83j379l001m394m746m579m729n006m624
51457F54370l661l205l886n047n781o139o740p497p448o024l980k813l188m263
51443E84698m709m228l676l704l987m075m251m806n016l946j976n25k57n99r86
$$ y = [376682, 378727, 381140, 383879, 387985, 394516, 402844, 411025, 417952, 424086, 429960, 435289, 440212, 446159, 454363, 464195, 474094, 483748, 494282, 506424, 519413, 531743, 542289, 550644, 557118, 562603, 567894, 572897, 576764, 578898, 579521, 579261, 578431, 576718, 573453, 568463, 562937, 559089, 558425, 560470, 563605, 566793, 569980, 573240, 576626, 580864, 587067, 595324, 604403, 613365, 622763, 633469, 644836, 654978, 662832, 669154, 675246, 681303, 686419, 689904, 692084, 693698, 694894, 695144, 694143, 692463, 691078, 690401, 690112, 689911, 690034, 690766, 691673, 691782, 690635, 688902, 687611, 686828, 685449, 682448, 678054, 673308, 668729, 664000, 658994, 654370, 650709, 647504, 643618, 638571, 632790, 626651, 619911, 612414, 604966, 598942, 594962, 592149, 588961, 584698, 579989, 575761, 572085, 568381, 564394, 560319, 556068, 551262, 546246, 542300, 540324, 539799, 539542, 538943, 537957]
51428E37957j423j628q58P91K046K136J848K075K249J378N2L5J927M281N341M963
51412E63170M494N141O712P914P882P273P447Q656R709R661R107R238J0212J0989
51398F77605J0420Q148M866K137J297J982K311J122n34q80J16P08m61k960n260
51383G00617o173n705n004n482p597j0586j3343j5112j5350j3856j1461r672r060
51370E72216q841q435q303q559q209o895n991o399o636m955k321r63q01J21K032
51355D97061L072K637K404L267L824L046K197K708L833L965K847J150q66k952
51341E28193m463n561p578j0804j3226j3115j1593j0850j0814r785p736o690p692
51328D08286r406j0151r727q731p475o263n698n955o416o499o336o252o198n923
$$ y = [537957, 536534, 534906, 534048, 534839, 536885, 539021, 540869, 542944, 545193, 546571, 546623, 546658, 548585, 552866, 558207, 563170, 567664, 572805, 579517, 587431, 595313, 602586, 610033, 618689, 628398, 638059, 647166, 656404, 666616, 677605, 688025, 696173, 701039, 703176, 704473, 706455, 708766, 709888, 709354, 708474, 708590, 709298, 708837, 705877, 700617, 694444, 688739, 683735, 678253, 670656, 660070, 646727, 631615, 616265, 602409, 590948, 581276, 572216, 563375, 554940, 546637, 538078, 529869, 522974, 516983, 510584, 503948, 498993, 496672, 495709, 494908, 495029, 497061, 500133, 502770, 505174, 508441, 512265, 515311, 517508, 520216, 524049, 528014, 530861, 532011, 531145, 528193, 523730, 518169, 510591, 499787, 486561, 473446, 461853, 451003, 440189, 430404, 422668, 415978, 408286, 398880, 388729, 379002, 370271, 362796, 356533, 350835, 344880, 338464, 331965, 325629, 319377, 313179, 307256]
51314C07256n359m527l489k426j599j220j610l056m988n695l881m97J867J648
51300B72424k83j916k115j062M31J527J710J089K81k35m54n26l59J89J030J898
51284B73629K563K936L060L083L091L003K786K700L185M403N978P065O913N659
51270C30054M621N266P559R844J0596R798Q238O254L953K113J674K340K606J404
51256D06320r19l291n072o349p584r008j0073r805q154o583o530p591q220p896
51242C09245p413p059o040m189k830l122m522n703o111n681m022j138J606K610
51228B55631J921R14K67n12j629k308k009j348j202j538j589q49N36J985K739
51213B51009K262P07j142k597l429l524k705j158L97J356J682J572J032J36p15
$$ y = [307256, 301897, 297370, 293881, 291455, 289856, 288636, 287026, 283970, 278982, 273287, 269406, 268909, 270776, 272424, 272141, 270225, 268110, 267048, 267479, 269006, 270716, 271805, 272086, 271851, 271397, 270871, 270512, 270701, 271731, 273629, 276192, 279128, 282188, 285271, 288362, 291365, 294151, 296851, 300036, 304439, 310417, 317482, 324395, 330054, 334675, 339941, 347500, 357344, 367940, 377738, 385976, 392230, 396183, 398296, 399970, 402310, 404916, 406320, 405401, 402110, 397038, 390689, 383105, 374097, 364024, 354219, 346065, 339482, 332952, 325361, 317141, 309245, 301832, 294773, 288733, 284544, 281714, 278592, 274070, 268367, 262256, 256575, 252553, 251415, 253021, 255631, 257552, 258466, 258733, 258221, 256592, 254284, 252275, 250927, 249725, 248187, 246598, 245749, 246285, 248270, 251009, 253271, 253978, 252836, 250239, 246810, 243286, 240581, 239423, 239820, 241176, 242858, 244430, 245462, 245598, 244883]
51198B44883j243j703k423l185l524l419l115k439r37J198K877L006J475q16k633
51183B28002l215k674j631m01J116K584K981J852L07k72j19n26j460j323N12K421
51167B28154K631J508N92K60k92j278j860j484n88J61O42J190K126L266L703K619
51151B41350O90k69K28L50j264k861j660J916M470M140K668K210K395J936J344
51136B57643K086L883M739L512J220k98k02P69J045k15j969k213m08J775K675
51121B74042K692L167M067M042K463J92j658k721l083k779j912q33q5k83j734
51106B75577l871n492n903n496m817l774k217o54L68J013J607J864J429O53L9
51091B50326n30j243j580j105m56n08r66q55j2R91J985L069L729L376K543K242
$$ y = [244883, 243640, 241937, 239514, 236329, 232805, 229386, 226271, 223832, 222895, 224093, 226970, 229976, 231451, 230635, 228002, 224787, 222113, 220482, 220081, 221197, 223781, 226762, 228614, 228921, 228649, 228530, 228004, 226544, 225221, 225733, 228154, 230785, 232293, 232885, 233145, 232853, 231575, 229715, 228231, 227643, 227804, 228446, 229636, 231762, 235028, 238731, 241350, 242040, 241771, 241999, 242349, 241085, 238224, 236564, 238480, 242950, 247090, 249758, 251968, 254363, 256299, 257643, 259729, 263612, 268351, 271863, 273083, 272785, 272583, 273352, 274397, 274182, 272213, 270000, 269592, 271367, 274042, 276734, 279901, 283968, 288010, 290473, 290665, 289007, 286286, 283203, 280424, 278512, 277679, 277594, 277311, 275577, 271706, 266214, 260311, 254815, 249998, 246224, 244007, 243353, 243721, 244734, 246341, 248205, 249634, 250287, 250326, 249796, 248553, 246973, 245868, 245412, 244904, 243938, 243083, 243071, 244062, 246047, 249116, 252845, 256221, 258764, 261006]
51075B61006K327J796N45m85q67j052j280j475k114l600m843m235k298j517k946
51060B38962m777m943l559j975r47p29j403k082j210J155K716J899Q6m61L53J207
51044B24292J892L077M222L947K355J129J244K109L044L914M163K831K63j582
51030B56900j349J14J052R25N33N43Q19R86J174J881L184M247L980K424J068J212
51014B79693K344K830K084J178J196J795J879J277J106K347M332N166L899J863
$$ y = [261006, 263333, 265129, 265674, 265189, 264322, 263270, 261990, 260515, 258401, 254801, 249958, 245723, 243425, 241908, 238962, 234185, 229242, 225683, 223708, 222761, 222032, 220629, 218547, 217337, 218492, 221208, 223107, 223193, 222732, 223085, 224292, 226184, 229261, 233483, 237430, 239785, 240914, 242158, 244267, 247311, 251225, 255388, 258219, 258482, 256900, 255551, 255665, 256717, 257642, 258175, 258718, 259537, 260523, 261697, 263578, 266762, 271009, 274989, 277413, 278481, 279693, 282037, 284867, 286951, 288129, 289325, 291120, 292999, 294276, 295382, 297729, 302061, 307227, 311126, 312989]
$$ [...]
##END NTUPLES=NMR SPECTRUM
##END=
