
##TITLE=AC1070_TOPL03_5906700_HWW9BtLfFD
##JCAMPDX= 6.0         $$ Bruker NMR JCAMP-DX V2.0
##DATA TYPE= NMR SPECTRUM
##DATA CLASS= NTUPLES
##ORIGIN= BRUKER
##OWNER= Administrator
$$ 1.72 TOPSPIN		Version 2.1
$$ 2012-04-10 10:13:19.625 -0500  Administrator@TOPSPIN
$$ Compression mode = diff/dup
##.OBSERVE FREQUENCY= 400.13188235
##.OBSERVE NUCLEUS= ^1H
##.ACQUISITION MODE= SIMULTANEOUS (DQD)
##.ACQUISITION SCHEME= undefined
##.AVERAGES= 8
##.DIGITISER RES= 22
##SPECTROMETER/DATA SYSTEM= spect
##.PULSE SEQUENCE= zg30
##.SOLVENT NAME= COFFEE_meoh
##.SHIFT REFERENCE= INTERNAL, COFFEE_meoh, 1, 14.98061
##AUDIT TRAIL= $$ (NUMBER, WHEN, WHO, WHERE, PROCESS, VERSION, WHAT)
$$ ##TITLE= Audit trail, TOPSPIN		Version 2.1
$$ ##JCAMPDX= 5.01
$$ ##ORIGIN= Bruker BioSpin GmbH
$$ ##OWNER= Administrator
$$ $$ C:\Bruker\TOPSPIN/data/COFFEE/nmr/AC1070_TOPL03_5906700_HWW9BtLfFD/10/pdata/1/auditp.txt
$$ ##AUDIT TRAIL=  $$ (NUMBER, WHEN, WHO, WHERE, PROCESS, VERSION, WHAT)
(   1,<2012-04-04 15:45:53.156 -0500>,<Administrator>,<TOPSPIN>,<go>,<TOPSPIN 2.1>,
      <created by zg
	started at 2012-04-04 15:44:46.578 -0500,
	POWCHK enabled, PULCHK disabled,
       configuration hash MD5:
       1A 1E CE 29 27 FD 77 03 67 4E F0 E3 C4 B2 CB 90
       data hash MD5: 64K
       6D A3 61 F2 7E C4 00 0A 17 F6 18 94 FC C9 01 B4>)
(   2,<2012-04-04 15:45:56.484 -0500>,<Administrator>,<TOPSPIN>,<proc1d>,<TOPSPIN 2.1>,
      <Start of raw data processing
       efp LB = 0 FT_mod = 6 PKNL = 1 PHC0 = 0 PHC1 = 0 SI = 32K 
       data hash MD5: 32K
       B2 5F AA 75 10 A6 D4 5A 0B 7A 2B 23 94 FD 36 0B>)
(   3,<2012-04-04 15:45:56.843 -0500>,<Administrator>,<TOPSPIN>,<proc1d>,<TOPSPIN 2.1>,
      <pk PHC0 = 211.9427 PHC1 = 0 
       data hash MD5: 32K
       B3 BE 23 CD 5C 7F A5 D1 21 7F C9 49 BE 1B F2 81>)
(   4,<2012-04-04 15:45:56.984 -0500>,<Administrator>,<TOPSPIN>,<proc1d>,<TOPSPIN 2.1>,
      <abs ABSG = 1 
       data hash MD5: 32K
       E7 A9 93 FE FE D9 E8 78 11 FC 0E F6 6B 12 3E E6>)
(   5,<2012-04-04 15:45:57.093 -0500>,<Administrator>,<TOPSPIN>,<proc1d>,<TOPSPIN 2.1>,
      <abs ABSG = 2 
       data hash MD5: 32K
       EA 42 47 65 48 CF 16 9D 7A E7 0D 84 30 9A 10 64>)
(   6,<2012-04-04 15:45:57.125 -0500>,<Administrator>,<TOPSPIN>,<proc1d>,<TOPSPIN 2.1>,
      <abs ABSG = 3 
       data hash MD5: 32K
       E8 07 65 CF 62 5A 92 7E 9A 72 C5 E5 A6 C0 B7 58>)
(   7,<2012-04-04 15:45:57.156 -0500>,<Administrator>,<TOPSPIN>,<proc1d>,<TOPSPIN 2.1>,
      <abs ABSG = 4 
       data hash MD5: 32K
       5D B5 22 F7 46 27 B6 B4 FA 40 AA FB 6F 15 5F 55>)
(   8,<2012-04-04 15:45:57.187 -0500>,<Administrator>,<TOPSPIN>,<proc1d>,<TOPSPIN 2.1>,
      <abs ABSG = 5 
       data hash MD5: 32K
       50 DA 38 8E 21 5A 0B 5D AF AF 68 96 66 D3 7F E6>)
(   9,<2012-04-04 15:46:01.484 -0500>,<Administrator>,<TOPSPIN>,<audit>,<TOPSPIN 2.1>,
      <user comment:
       ICON-NMR User ID: COFFEE
       data hash MD5: 32K
       50 DA 38 8E 21 5A 0B 5D AF AF 68 96 66 D3 7F E6>)
$$ ##END=
$$ 
$$ [...]
##$TP= (0..7)
150 150 150 150 150 150 150 150
##$TP07= 0
##$TPNAME0= <>
##$TPNAME1= <>
##$TPNAME2= <>
##$TPNAME3= <>
##$TPNAME4= <>
##$TPNAME5= <>
##$TPNAME6= <>
##$TPNAME7= <>
##$TPOAL= (0..7)
0.5 0.5 0.5 0.5 0.5 0.5 0.5 0.5
##$TPOFFS= (0..7)
0 0 0 0 0 0 0 0
##$TUNHIN= 0
##$TUNHOUT= 0
##$TUNXOUT= 0
##$USERA1= <user>
##$USERA2= <user>
##$USERA3= <user>
##$USERA4= <user>
##$USERA5= <user>
##$V9= 5
##$VALIST= <valist>
##$VCLIST= <CCCCCCCCCCCCCCC>
##$VD= 0
##$VDLIST= <DDDDDDDDDDDDDDD>
##$VPLIST= <PPPPPPPPPPPPPPP>
##$VTLIST= <TTTTTTTTTTTTTTT>
##$WBST= 2048
##$WBSW= 25
##$XGAIN= (0..3)
0 0 0 0
##$XL= 0
##$YL= 0
##$YMAX_a= 531212
##$YMIN_a= -654881
##$ZGOPTNS= <>
##$ZL1= 120
##$ZL2= 120
##$ZL3= 120
##$ZL4= 120
##$ABSF1= 14.98061
##$ABSF2= -5.57192
##$ABSG= 5
##$ABSL= 3
##$ALPHA= 0
##$AQORDER= 0
##$ASSFAC= 0
##$ASSFACI= 0
##$ASSFACX= 0
##$ASSWID= 0
##$AUNMP= <proc_prof1d_extract_pilot.lims>
##$AXLEFT= 0
##$AXNAME= <>
##$AXNUC= <1H>
##$AXRIGHT= 0
##$AXTYPE= 0
##$AXUNIT= <>
##$AZFE= 0.1
##$AZFW= 0.1
##$BCFW= 0
##$BC_mod= 0
##$BYTORDP= 0
##$COROFFS= 0
##$CY= 15
##$DATMOD= 1
##$DC= 0
##$DFILT= <>
##$DTYPP= 0
##$F1P= 0
##$F2P= 0
##$FCOR= 0.5
##$FTSIZE= 32768
##$FT_mod= 6
##$GAMMA= 0
##$GB= 0
##$INTBC= 1
##$INTSCL= 1
##$ISEN= 128
##$LB= 0
##$LEV0= 0
##$LPBIN= 0
##$MAXI= 10000
##$MC2= 0
##$MEAN= 0
##$ME_mod= 0
##$MI= 0
##$NCOEF= 0
##$NC_proc= -8
##$NLEV= 6
##$NOISF1= 0
##$NOISF2= 0
##$NSP= 0
##$NTH_PI= 0
##$NZP= 0
##$OFFSET= 14.98061
##$PC= 1
##$PHC0= 211.9427
##$PHC1= 0
##$PH_mod= 1
##$PKNL= yes
##$PPARMOD= 0
##$PPDIAG= 0
##$PPIPTYP= 0
##$PPMPNUM= 2147483647
##$PPRESOL= 1
##$PSCAL= 4
##$PSIGN= 0
##$PYNMP= <proc.py>
##$REVERSE= no
##$SF= 400.13
##$SI= 32768
##$SIGF1= 0
##$SIGF2= 0
##$SINO= 400
##$SIOLD= 32768
##$SPECTYP= <>
##$SREGLST= <1H.CDCl3>
##$SSB= 0
##$STSI= 32768
##$STSR= 0
##$SW_p= 8223.68421052632
##$SYMM= 0
##$S_DEV= 0
##$TDeff= 65536
##$TDoff= 0
##$TI= <>
##$TILT= no
##$TM1= 0
##$TM2= 0
##$TOPLEV= 0
##$USERP1= <user>
##$USERP2= <user>
##$USERP3= <user>
##$USERP4= <user>
##$USERP5= <user>
##$WDW= 1
##$XDIM= 32768
##$YMAX_p= 468524247
##$YMIN_p= -724107
##$CURPLOT= <Network HP LaserJet P1505>
##$CURPRIN= <$Network HP LaserJet P1505>
##$DFORMAT= <normdp>
##$LAYOUT= <+/1D_H.xwp>
##$LFORMAT= <normlp>
##$PFORMAT= <normpl>
##$SURQMSG= 1
$$ End of Bruker specific parameters
$$ ---------------------------------
##NTUPLES= NMR SPECTRUM
##VAR_NAME=  FREQUENCY,     SPECTRUM/REAL,   SPECTRUM/IMAG
##SYMBOL=    X,             R,               I
##VAR_TYPE=  INDEPENDENT,   DEPENDENT,       DEPENDENT
##VAR_FORM=  AFFN,          ASDF,            ASDF
##VAR_DIM=   32768,         32768,           32768
##UNITS=     HZ,            ARBITRARY UNITS, ARBITRARY UNITS
##FACTOR=    0.250966925370066, 1,           1
##FIRST=     8223.43324360095, -102479,      95086
##LAST=      0,             -193981,         -63718
##MIN=       0,             -724107,         0
##MAX=       8223.43324360095, 468524247,    0
$$ Real data points
##PAGE= N=1
##DATA TABLE= (X++(R..R)), XYDATA
$$ [...]
19457f9969p5382a4810d125A0090c00617K4629g265l23296a54101L4437C1010
$$ -69969 -145351 -14810 -4125 10090 -300617 -275988 -7265 -330561 -154101 -119664 31010
19445A31607b32029C1351c12257a44905c6751k45890j23578J54292M4594C4748
$$ 131607 -232029 31351 -312257 -144905 -36751 -282641 -406219 -251927 -207333 34748
19434d61406d4845p0518c7716j26630g6315A3958c6302A35056c7229m56350i1467
$$ -461406 -44845 -115363 -37716 -164346 -76315 13958 -36302 135056 -37229 -493579 -91467
19422a27305C6892i9624D5757P8556j5805b03092C62582b14233j98778i598o15188
$$ -127305 36892 -99624 45757 124313 108508 -203092 362582 -214233 -413011 -9598 -624786
19411f24786F2021J51793C3297e3845r1487B34703f0837n3149j18195l2387a0505
$$ -624786 62021 213814 33297 -53845 -145332 234703 -60837 -113986 -232181 -264568 -10505
19399B6026d27376J76650e8283F5968c81724D89a41468p8775O4756D5178b51557
$$ 26026 -427376 -250726 -58283 65968 -381724 489 -141468 -220243 -155487 45178 -251557
19387f7891o4141c2704B09307b06897p3821d5664A48060k3723a7980D56645a50883
$$ -67891 -132032 -32704 209307 -206897 -280718 -45664 148060 124337 -17980 456645 -150883
19375a10083j23886a00377G1409a02155a9592k0233A40107I911c52801J59320
$$ -110083 -233969 -100377 71409 -102155 -19592 -39825 140107 9911 -352801 -193481
19365a93481i6570j42638O9142A30363o3813d99502J9597a72015H6174b57933
$$ -193481 -96570 -239208 -170066 130363 66550 -499502 -479905 -172015 86174 -257933
19354b40372Q4155M7645o1098a7854B52340n1558b50031A74756h8147D42242a05275
$$ -240372 -156217 -108572 -169670 -17854 252340 200782 -250031 174756 -88147 442242 -105275
19342f8928D4619K13908b24895C41510c12138B0451L67518A26739b59432a28587
$$ -68928 44619 258527 -224895 341510 -312138 20451 387969 126739 -259432 -128587
19331d6324l06927D5200a78393A12759b09555B23880L826b14078O1607I5234e0961
$$ -46324 -353251 45200 -178393 112759 -209555 223880 227706 -214078 -152471 95234 -50961
19319d06618d6400H1126b13059h2758E9353e7949a1054A76588a37627i023q8494
$$ -406618 -46400 81126 -213059 -82758 59353 -57949 -11054 176588 -137627 -9023 -97517
19308i7517N718j45785f085l62695J38690m2036r5665J81216K3994A02138b32701
$$ -97517 -91799 -237584 -6085 -368780 -230090 -272126 -367791 -186575 -162581 102138 -232701
19296b30927A12321J31262C0956K87b05067d3814F0113P0090a4853G6768a95935
$$ -230927 112321 243583 30956 31243 -205067 -43814 60113 130203 -14853 76768 -195935
19284h5135J8740o5602j251A55565b69855i3663j54506R0346D27380i8916D4951
$$ -85135 -66395 -131997 -133248 155565 -269855 -93663 -248169 -157823 427380 -98916 44951
19272A30267i619j9591j47377Q754j28740g1580l1575m3795H3641P878a44052
$$ 130267 -9619 -29210 -176587 -167833 -296573 -71580 -103155 -146950 83641 91519 -144052
19260a69440h2573j32066P7198o1811j9198D2137a91620N7652j1620B65886h8004
$$ -169440 -82573 -214639 -137441 -199252 -218450 42137 -191620 -133968 -145588 265886 -88004
19248a26684G2871L32738a24853p0890i068p5542k3559H353b23727l8148R2640
$$ -126684 72871 405609 -124853 -195743 -9068 -84610 -108169 8353 -223727 -261875 -169235
19237a69235J0196E0215a5109k37663b6742Q269j54136b9385q1921A9867a72917
$$ -169235 -159039 50215 -15109 -252772 -26742 -18473 -172609 -29385 -111306 19867 -172917
19225b88709d7941m8491D0317K5680H746b46470A19431a53067B01126M3957a98811
$$ -288709 -47941 -96432 40317 65997 8746 -246470 119431 -153067 201126 245083 -198811
19213E3810A3218b22880h91k72854a0911A60424a7039H7537b22756I7619A2490
$$ 53810 13218 -222880 -891 -273745 -10911 160424 -17039 87537 -222756 97619 12490
19201a51978c8858l80943f5423k82795L4036E081N9488a51773j59022J16478e5583
$$ -151978 -38858 -419801 -65423 -348218 -314182 5081 64569 -151773 -310795 -194317 -55583
19189A38915a76852j23640G7376R2959o8340c32005A14608g2457J7697j25676
$$ 138915 -176852 -300492 77376 170335 101995 -332005 114608 -72457 -54760 -180436
19179a80436e7938N139J5745B83783c29777c2137b370l51605h5021r8054k14914
$$ -180436 -57938 -52799 -37054 283783 -329777 -32137 -2370 -353975 -85021 -183075 -397989
19168c97989G6074P0926b11757e4167c700A06514g6048J4164K0871Q437A95093
$$ -397989 76074 147000 -211757 -54167 -3700 106514 -76048 -61884 -41013 -32576 195093
19156b04798b697j90903O6776k5872G7013b59950R816a21710j26522A29131K6257
$$ -204798 -2697 -193600 -126824 -152696 77013 -259950 -250134 -121710 -248232 129131 155388
19145A55388J55629G5399J01959h3956p9279A34786j9103a80659A30816b30989
$$ 155388 311017 75399 177358 -83956 -163235 134786 115683 -180659 130816 -230989
19134d8792B31791c62056k9508A26958a56172A04649b66369k5928j64745C551
$$ -48792 231791 -362056 -391564 126958 -156172 104649 -266369 -292297 -457042 3551
19123A89210d34517a80254O3688k15261i7914k73602B27632D9381a38385j76113
$$ 189210 -434517 -180254 -116566 -331827 -97914 -371516 227632 49381 -138385 -314498
19113c14498a50679m7592A41640C0207L69143d04737e974j13283m1968g7601c8050
$$ -314498 -150679 -198271 141640 30207 399350 -404737 -5974 -119257 -161225 -77601 -38050
19101B90047g2785k14343A39529M1860D7934b86820J14504h3641I8531N2393a54657
$$ 290047 -72785 -287128 139529 181389 47934 -286820 -172316 -83641 98531 150924 -154657
19089c5608j01370f5382G7748a57017A54772B8509b65529a0796j07432l24330
$$ -35608 -136978 -65382 77748 -157017 154772 28509 -265529 -10796 -118228 -442558
19079d42558A78317a37335L531J6872n9010A634J06300d4941a7091r665j90534
$$ -442558 178317 -137335 -133804 -116932 -175942 1634 107934 -44941 -17091 -26756 -217290
19068b17290A97774a11715d1644j13345a7828G4579i5123A02044L8841a47266
$$ -217290 197774 -111715 -41644 -154989 -17828 74579 -95123 102044 140885 -147266
19057a67759r5163B24515a527A2142g7927B65902a31498A37682c34658Q1521M8399
$$ -167759 -262922 224515 -1527 12142 -77927 265902 -131498 137682 -334658 -253137 -204738
19046b04738a3819j91604G7183a49707B80263G2948d4370C123a57306M7481a7701
$$ -204738 -13819 -205423 77183 -149707 280263 72948 -44370 3123 -157306 -109825 -17701
19034G9046e3953j208m1097G3769i9158d5631k73935q4943e4380l81182A00579
$$ 79046 -53953 -55161 -96258 73769 -99158 -45631 -319566 -404509 -54380 -435562 100579
19022a61700A2081N9758L3618b88479h598j1790C8490a45885k5354j09796I9172
$$ -161700 12081 71839 105457 -288479 -8598 -20388 38490 -145885 -171239 -281035 99172
19010a65274A04990A4737M6304K819b36282E04336I1100a54925A77907O6288d17982
$$ -165274 104990 14737 61041 63860 -236282 504336 91100 -154925 177907 244195 -417982
18998b12646B51633e92o8516j01075A30135c178I6775K3440m9628J8690B6096
$$ -212646 251633 -592 -69108 -170183 130135 -3178 96775 120215 70587 89277 26096
18986A68023b35807G6538c7853k21581J28750D1398J86887J51073j32176B3742
$$ 168023 -235807 76538 -37853 -259434 -130684 41398 228285 379358 247182 23742
18975B84287g1412n6296r080c7360C09195a23632C2772f8044c1215E2556i1368
$$ 284287 -71412 -127708 -136788 -37360 309195 -123632 32772 -68044 -31215 52556 -91368
18963d4095k11072B9921O2066b8391H7048O1897L77995j17501j15771A21882J00368
$$ -44095 -255167 29921 91987 -28391 87048 148945 526940 409439 293668 121882 222250
18952B22250A04585b86134M1988d2911B09768d0807A68757k8955h1233A24414
$$ 222250 104585 -286134 -244146 -42911 209768 -40807 168757 139802 -81233 124414
18941a22401A50218h1884k80691a10182m355l8811l1804b333j72111G3625b48450
$$ -122401 150218 -81884 -362575 -110182 -114537 -153348 -185152 -2333 -174444 73625 -248450
18929H3736a67745K2357B14100a45274l26616d7498A50325K087O6886a82063h0668
$$ 83736 -167745 -145388 214100 -145274 -471890 -47498 150325 152412 219298 -182063 -80668
18917a05879o7304e732k37865P0717O9357o2998F6299q583a50925f8222k64050
$$ -105879 -173183 -5732 -243597 -172880 -103523 -166521 66299 57716 -150925 -68222 -332272
18906c32272E4837b27011g0874m1337L7095n3151p7541g1579E2143g5558B47666
$$ -332272 54837 -227011 -70874 -112211 -75116 -128267 -205808 -71579 52143 -75558 247666
18894B42551N7244J84397Q5386B83662J09215B9189a56215P5317C7382O8110E931
$$ 242551 299795 484192 569578 283662 392877 29189 -156215 -80898 37382 105492 5931
18882b17205P2493B79505E5401J7441i7526j97755J19535A32519a33368A19551
$$ -217205 -144712 279505 55401 72842 -97526 -295281 -175746 132519 -133368 119551
18871a99827B63292A4638i8611I03a77122E7283c5470D1942b71706J21378l33458
$$ -199827 263292 14638 -98611 903 -177122 57283 -35470 41942 -271706 -150328 -483786
18860d83786g3498r7022k8538A32150f4252j27277A00293b2815j86114n8160Q540
$$ -483786 -73498 -170520 -199058 132150 -64252 -191529 100293 -22815 -208929 -267089 -258549
18849b58549f7535k1175B21412a7278F0245a61210K9801e3149b3843k8479j25128
$$ -258549 -67535 -88710 221412 -17278 60245 -161210 -131409 -53149 -23843 -52322 -177450
18838a77450A27999n6327O0572b05002e1674b2795j48805P9184j61584a18840
$$ -177450 127999 71672 132244 -205002 -51674 -22795 -171600 -92416 -254000 -118840
18827A20068a38369O1036J1356A59665a0076A9419e0630A29881A0181a21491F3536
$$ 120068 -138369 -77333 -65977 159665 -10076 19419 -50630 129881 10181 -121491 63536
18815C17060b81605C6669M050f1113n4008D7657K07731b27093g6301F7104a44510
$$ 317060 -281605 36669 40719 -61113 -115121 47657 255388 -227093 -76301 67104 -144510
18803d1412I0813a77933h1373l6369H9922a35525F916c5473A3139K910J13114
$$ -41412 90813 -177933 -81373 -117742 89922 -135525 6916 -35473 13139 16049 129163
18792A29163D7998N2749b09170B6969c59300A11543C6223b1450A3088D190a90137
$$ 129163 47998 100747 -209170 26969 -359300 111543 36223 -21450 13088 4190 -190137
18780F8999h2128B64703I3185d3828p7910E7057J5773a3959H7347g788j09450
$$ 68999 -82128 264703 93185 -43828 -121738 57057 72830 -13959 87347 -7788 -117238
18769a17238l4200o5899e5902m0917l651B49112G1432b74964L6699a14376A88142
$$ -117238 -151438 -217337 -55902 -96819 -100470 249112 71432 -274964 -238265 -114376 188142
18757a56888l17629a4445B07599l6263F1531b25876j48606c3261k61777J26282
$$ -156888 -474517 -14445 207599 171336 61531 -225876 -374482 -33261 -295038 -168756
18747a68756j39914H5819e27350e7882k56966A14619a8521C31826A19455c473
$$ -168756 -308670 85819 -527350 -57882 -314848 114619 -18521 331826 119455 -3473
18736c61972d5452j88306P6986A1465a36453A87850j1689G5724M0785a48672f4303
$$ -361972 -45452 -233758 -156772 11465 -136453 187850 176161 75724 116509 -148672 -64303
18724B53766i1027I7820a69032P960J4905A4599a04483a7788l64934A13612J56327
$$ 253766 -91027 97820 -169032 -161072 -146167 14599 -104483 -17788 -382722 113612 269939
18713B69939a72395A9309i6533A05543a04030B8331b30067h684B785J67025b8033
$$ 269939 -172395 19309 -96533 105543 -104030 28331 -230067 -8684 2785 169810 -28033
18701d8333p6644A2597c52040a01355I3229g1908k24908J9805b1384E5273N6923
$$ -48333 -124977 12597 -352040 -101355 93229 -71908 -296816 -277011 -21384 55273 112196
18690A12196a45415a1624j36326c4421a533p6882B2560a78711L667g2619k5987
$$ 112196 -145415 -11624 -147950 -34421 -1533 -78415 22560 -178711 -175044 -72619 -98606
18679i8606m6334A67474g5276p8211l4876R2579o1678N2232d1432A08713B6376
$$ -98606 -144940 167474 -75276 -153487 -188363 -95784 -157462 -105230 -41432 108713 26376
18667a77354A92377h5655l7789C6504J85167a40264B13e2790l18465a8841n650
$$ -177354 192377 -85655 -123444 36504 221671 -140264 213 -52790 -371255 -18841 -24491
18656b4491m6757G2237i3362j38004Q8844A9643J25500b52114e4482G7598a1783
$$ -24491 -71248 72237 -93362 -231366 -142522 19643 145143 -252114 -54482 77598 -11783
18644d69386G8480j8490p284d13752P0663R8233A09564a33855B79946a47033n1939
$$ -469386 78480 59990 52706 -413752 -343089 -244856 109564 -133855 279946 -147033 -198972
18633a98972E0114a15320r0323M9569r7399k5982B8351f4568j02685F813d9285
$$ -198972 50114 -115320 -205643 -156074 -253473 -279455 28351 -64568 -167253 6813 -49285
18621A20364E5664d0947C7593H882b10367l2542n6716C4516A6540d573j68615
$$ 120364 55664 -40947 37593 8882 -210367 -242909 -299625 34516 16540 -4573 -173188
18610a73188A7396d4777p301l9350A42291m3178a94140a5972C1381K28300E7911
$$ -173188 17396 -44777 -52078 -91428 142291 99113 -194140 -15972 31381 259681 57911
18598D899b22179R3447b917l69890B5179f7114A69744b86044a09871N832E5343
$$ 4899 -222179 -128732 -2917 -372807 25179 -67114 169744 -286044 -109871 -104039 55343
18586B38619a57313A18541a1074k27179h5011F7933J6526e7746l26819b6524P524
$$ 238619 -157313 118541 -11074 -238253 -85011 67933 84459 -57746 -384565 -26524 -19000
18575a9000A7963a3574A0377a22701l26055H4857g828j4080i990B33276i3495
$$ -19000 17963 -13574 10377 -122701 -448756 84857 -7828 -21908 -9990 233276 -93495
18563d21363C8692J19639E565c71990J36409a16930M6834A95599c31544N2607
$$ -421363 38692 158331 5565 -371990 -235581 -116930 -70096 195599 -331544 -278937
18553b78937f8608c400I0054c447B39626b44661A95860b04943a2426I5661J66365
$$ -278937 -68608 -3400 90054 -3447 239626 -244661 195860 -204943 -12426 95661 262026
18542B62026i7885M2947k30882M4779h0067D39316B13902a06357C23748A21879
$$ 262026 -97885 -54938 -285820 -241041 -80067 439316 213902 -106357 323748 121879
18531b94910M7845H3288c65492i4864a7313l53312H1631R369e6056C9605a23480
$$ -294910 -247065 83288 -365492 -94864 -17313 -370625 81631 91000 -56056 39605 -123480
18519A90469j1685J9086b2590D9488b29263b3805m6204D7476N344A5842J1632
$$ 190469 178784 197870 -22590 49488 -229263 -23805 -70009 47476 52820 15842 27474
18508B7474g1996p3208H6774N2384HQ2958C2856e57841b10368b1139l647D8599
$$ 27474 -71996 -145204 86774 139158 8 82966 32856 -557841 -210368 -21139 -24786 48599
18495a98780R0373n4984j3387k10739F3637L128g9125r7988n8024C59243F6478
$$ -198780 -108407 -163391 -176778 -387517 63637 66765 -79125 -177113 -235137 359243 66478
18483c28791e8810f859r7273A27442b01672A35772a05185G9596J52048Q8890B0295
$$ -328791 -58810 -6859 -104132 127442 -201672 135772 -105185 79596 231644 320534 20295
18471d562A06289d537l26589g5963m1972J6056B25895I232P2626a36005j65664
$$ -4562 106289 -4537 -331126 -75963 -117935 -101879 225895 9232 81858 -136005 -301669
18460c01669B0243J79025j9419C5691h8563P077A89979h530A52543i3226M5374
$$ -301669 20243 199268 179849 35691 -88563 -81486 189979 -8530 152543 -93226 -47852
18449d7852G1130a27288A37797l4902j3513a77181G6456B8568a10916A43049a42423
$$ -47852 71130 -127288 137797 102895 89382 -177181 76456 28568 -110916 143049 -142423
18437a0641F7936c64689J48601h5681L0794A967i8218A900J79684c04590I8141
$$ -10641 67936 -364689 -216088 -85681 -54887 1967 -98218 1900 181584 -304590 98141
18425B326a58548f5576A16140a2859k76168B88776o4552c2277p2591c0254a3808
$$ 2326 -158548 -65576 116140 -12859 -289027 288776 224224 -32277 -104868 -30254 -13808
18413b1000k32980J9506j09618G7325B249c49045c5664A94820H6836g8140j4902
$$ -21000 -253980 -234474 -344092 77325 2249 -349045 -35664 194820 86836 -78140 -93042
18402i3042p5751p2816e4334D184a11710J0455n4467i512k70461a20218C11136
$$ -93042 -168793 -241609 -54334 4184 -111710 -101255 -155722 -9512 -279973 -120218 311136
18390b3590l10141f8509j58264H5253B1543P1330g5126C04817b63645C21560F0250
$$ -23590 -333731 -68509 -226773 85253 21543 92873 -75126 304817 -263645 321560 60250
18378E4812J38504c50072A51362c36038E0604b4686n4637k67732I2714a41043
$$ 54812 193316 -350072 151362 -336038 50604 -24686 -79323 -347055 92714 -141043
18367A71156a18962r4889d6526C35031b18189A2113d19986a51174j49992C1592
$$ 171156 -118962 -213851 -46526 335031 -218189 12113 -419986 -151174 -301166 31592
18356g7843A36570a11210o2179A7630M5090J1142c88665k793B5082C728a48262
$$ -77843 136570 -111210 -173389 17630 62720 73862 -388665 -391458 25082 3728 -148262
18344a36526L2350A96299g1798o5735j27912g4655B36871f5755A53793A4499K91018
$$ -136526 -104176 196299 -71798 -137533 -265445 -74655 236871 -65755 153793 14499 305517
18333C05517a35636A49659b69893a15298L1680A6793J46651a60929A35084a17858
$$ 305517 -135636 149659 -269893 -115298 -83618 16793 163444 -160929 135084 -117858
18322A04877c41786B52604a85167f6130A19516a11126I3449e4313j35141A12621
$$ 104877 -341786 252604 -185167 -66130 119516 -111126 93449 -54313 -189454 112621
18311a70884O4096F1220A4473b42223Q6339b6601A27902d8663A21285J4014b47449
$$ -170884 -106788 61220 14473 -242223 -155884 -26601 127902 -48663 121285 135299 -247449
18299e9081B46585j22818C9051a26425d3244E7961d0073A98286a09848q2425k2186
$$ -59081 246585 123767 39051 -126425 -43244 57961 -40073 198286 -109848 -192273 -214459
18288b14459A55875b67328f5891A5773a44197l0399d9508A04864e3123m18595
$$ -214459 155875 -267328 -65891 15773 -144197 -174596 -49508 104864 -53123 -471718
18278d71718b09878I1856i0328B17515d7172k01721L6592h4282j52249h0129B652
$$ -471718 -209878 91856 -90328 217515 -47172 -248893 -212301 -84282 -236531 -80129 2652
18266A27257N2970M4697j0753a13736o031A38931A1472L2028O6931P2727a3171
$$ 127257 180227 224924 214171 -113736 -119767 138931 11472 43500 110431 183158 -13171
18254e2096j53627a2260n3240B07548b56789b5432A2139c2308o3319c3017m6370
$$ -52096 -205723 -12260 -65500 207548 -256789 -25432 12139 -32308 -95627 -33017 -79387
18243g9387j3790k2200A63004a02486J8652j19138j0349l6582J2007J13168b3745
$$ -79387 -93177 -115377 163004 -102486 -83834 -202972 -213321 -249903 -237896 -124728 -23745
18231D14543a47915B44379q6070a10757g956G9611a88849D8328J67559A05475
$$ 414543 -147915 244379 158309 -110757 -7956 79611 -188849 48328 215887 105475
18220b00163c5567J6839j13963B22860b0911H6658J25117E1649L9281K9307a35060
$$ -200163 -35567 -18728 -132691 222860 -20911 86658 211775 51649 90930 120237 -135060
18208G1021I705h7559f98j20412j7516l9639P9176L1117A64970J6099c32630P1655
$$ 71021 9705 -87559 -698 -121110 -138626 -178265 -99089 -67972 164970 181069 -332630 -260975
18196b60975A43872R2116A8836J59903a45330A35808b04211I5513A9553K04334
$$ -260975 143872 235988 18836 178739 -145330 135808 -204211 95513 19553 223887
18186B23887J0780c8516B48027b10933G7925g8722j16295b2932A15784c20199
$$ 223887 234667 -38516 248027 -210933 77925 -78722 -195017 -22932 115784 -320199
18175a87659m3960n4615h0529b3250C65371B6355O2544b06848g0216D36614A09178
$$ -187659 -231619 -286234 -80529 -23250 365371 26355 88899 -206848 -70216 436614 109178
18163a27902D2798a58994A58046a66757b6888j71101L8583d8279r3422K0594c6177
$$ -127902 42798 -158994 158046 -166757 -26888 -197989 -159406 -48279 -141701 -121107 -36177
18151b32865A9142c00136R5677Q4577j95585J07015C7664J79738B6733b17171
$$ -232865 19142 -300136 -204459 -119882 -315467 -208452 37664 217402 26733 -217171
18140C5964A6946K2320a76111N1929E992a41349r282f1634l03311J78767C90377
$$ 35964 16946 39266 -176111 -124182 5992 -141349 -150631 -61634 -364945 -186178 390377
18128b41104A01433K6002E66g355o585k8311D89879c29852J51765e2172B63956
$$ -241104 101433 127435 566 -7355 -13940 -42251 489879 -329852 -178087 -52172 263956
18116a37354L6178l7197d5980F0791b7262m819E6309a39941J4253b301j72710
$$ -137354 -101176 -138373 -45980 60791 -27262 -32081 56309 -139941 -125688 -2301 -175011
18105a75011A13350L15099A89137J77434a8719A00189b9409A4064c3262j19167
$$ -175011 113350 428449 189137 366571 -18719 100189 -29409 14064 -33262 -152429
18095a52429a9279j48013C1697J6591J70959d54644a05669j50011H7854H555P3849
$$ -152429 -19279 -167292 31697 48288 219247 -454644 -105669 -255680 87854 8555 82404
18084H2404f2293n6942d7631j74366J08415r8662A25927b33475c527p4448l1968
$$ 82404 -62293 -119235 -47631 -221997 -113582 -212244 125927 -233475 -3527 -77975 -109943
18073a09943L5139G5275A8192d3350J0668p8833B39393A00956k0948a96636J4253
$$ -109943 -74804 75275 18192 -43350 -32682 -111515 239393 100956 80008 -196636 -182383
18062a82383A68834F0981B000a58300j13935f010j2081p3287l0167m7141A5790
$$ -182383 168834 60981 2000 -158300 -272235 -6010 -18091 -91378 -121545 -168686 15790
18050e23450F3983a06932j38958C9800c28745B6967L4646c7280B05414b7370J2180
$$ -523450 63983 -106932 -245890 39800 -328745 26967 61613 -37280 205414 -27370 -15190
18039a5190I2158M591e4451A05235K42390a92913g2575A24778a40149l37134B0752
$$ -15190 92158 96749 -54451 105235 347625 -192913 -72575 124778 -140149 -477283 20752
18027d7426A35707f6523p3971C05289B4091J2695i4733A34458b49073E7298a60787
$$ -47426 135707 -66523 -140494 305289 24091 36786 -94733 134458 -249073 57298 -160787
18015h4089A9812L4926B0798i6912q6614j1701N1074k575r1864E14329A45899
$$ -84089 19812 54738 20798 -96912 -183526 -195227 -144153 -146728 -238592 514329 145899
18003B5550J0594L5750J9805M7756b25194j26220d5010k59896B24237A0513a848
$$ 25550 36144 71894 91699 139455 -225194 -351414 -45010 -304906 224237 10513 -1848
17991g8081q6223j01429E0246R691J82677A07656J18207l741c14039k3176E5256
$$ -78081 -164304 -265733 50246 59937 242614 107656 225863 222122 -314039 -337215 55256
17979B54065A15235P7703a84633A7808a25482A70976J13435A2503Q1075a0738
$$ 254065 115235 192938 -184633 17808 -125482 170976 284411 12503 93578 -10738
17968g584p6552B73681j19908E8451f7167j13225p4715A14894f6312l9385D73437
$$ -7584 -84136 273681 153773 58451 -67167 -180392 -255107 114894 -66312 -105697 473437
17956D71862a35996C8965f0327B15372A8675K47830b9582l31298A10740h619j89932
$$ 471862 -135996 38965 -60327 215372 18675 266505 -29582 -360880 110740 -8619 -198551
17945a98551P3076A52174E8932Q8335D2434a08496A64990B1978b09914B01501
$$ -198551 -125475 152174 58932 147267 42434 -108496 164990 21978 -209914 201501
17934H2453K09596b1609k21260A82816p5885J39574f4285p6226E7480e9883l8246
$$ 82453 292049 -21609 -242869 182816 106931 246505 -64285 -140511 57480 -59883 -98129
17923i8129A54725e1119a2276A25188b38658L0935j4038F4579a02639I2677M898
$$ -98129 154725 -51119 -12276 125188 -238658 -207723 -221761 64579 -102639 92677 97575
17912I7575l2796f8983L4203B11263b02964A56739N5468F5688h044A05544k4135
$$ 97575 64779 -68983 -34780 211263 -202964 156739 212207 65688 -8044 105544 81409
17901H1409c19707I0944a34831B21675E4639a05332A22574d3520A32579a46137
$$ 81409 -319707 90944 -134831 221675 54639 -105332 122574 -43520 132579 -146137
17890a7481j39934K8429e0163A01412k2971K3824j984a18729A60965i8003B95783
$$ -17481 -157415 -128986 -50163 101412 78441 102265 100281 -118729 160965 -98003 295783
17878A53705E8743K82535a05166C04861A26270a31321A42872a91616e4992A82787
$$ 153705 58743 341278 -105166 304861 126270 -131321 142872 -191616 -54992 182787
17867a22753A23420K15790d3291j36025j82086A05960m3564k1736g6533q879C05223
$$ -122753 123420 339210 -43291 -179316 -361402 105960 62396 40660 -76533 -85412 305223
17855a55319e3481o9043l3959C7773a16591n3038b6720B71879e5610B23930J02238
$$ -155319 -53481 -122524 -156483 37773 -116591 -169629 -26720 271879 -55610 223930 326168
17844C26168a04031j83471F8834J84575i7273G4407e9536r1540B00986D8255R5254
$$ 326168 -104031 -287502 68834 253409 -97273 74407 -59536 -151076 200986 48255 143509
17833A43509a09985B92930j17109C4595J6466J722K5176O7862J83743a9636C1827
$$ 143509 -109985 292930 175821 34595 51061 52783 77959 145821 329564 -19636 31827
17821b05953R902h1745j39932L4486A7624O421J08349g4168B96945O9809D9780
$$ -205953 -196051 -81745 -221677 -187191 17624 24045 132394 -74168 296945 366754 49780
17809E3975J16127a34034j4317D3232e446C0200a63567E8673J35516m8390Q6485
$$ 53975 170102 -134034 -148351 43232 -5446 30200 -163567 58673 194189 145799 232284
17798B32284K1522j05943m7610J15307a01654A24471E9979e2865b3074A3426K34214
$$ 232284 253806 147863 100253 215560 -101654 124471 59979 -52865 -23074 13426 247640
17787B47640C1539d7660A93199j5565k4919F0861J4240c92870B18859J43293F9962
$$ 247640 31539 -47660 193199 177634 152715 60861 75101 -392870 218859 362152 69962
17775i5536m2375B6694K1720g7906d646A98973L4789k2826a38268I7908j5754
$$ -95536 -137911 26694 48414 -77906 -4646 198973 233762 210936 -138268 97908 82154
17764H2154c7530C4415L2257P7132j9219k5485b4478B40899r7667k3850a0289
$$ 82154 -37530 34415 66672 143804 124585 99100 -24478 240899 143232 119382 -10289
17752A20155c3477j34014A00894g180D65826h7753b3423J0292B25516c0948G6753
$$ 120155 -33477 -167491 100894 -7180 465826 -87753 -23423 -13131 225516 -30948 76753
17740A05791J1447D4759f0775F2715J92826d8533C48036D5096a11225C69788A78272
$$ 105791 117238 44759 -60775 62715 255541 -48533 348036 45096 -111225 369788 178272
17728C8590e3437I479f3318m8365N986C78402F5581J55230G2989b15640C2849
$$ 38590 -53437 9479 -63318 -111683 -105697 378402 65581 220811 72989 -215640 32849
17716c3582j18290p3645f8619l3018o156C23597e8829B09157I0438g7193j975
$$ -33582 -151872 -225517 -68619 -101637 -107793 323597 -58829 209157 90438 -77193 -79168
17705g9168C52591n6546A32775A4680J63405A2691e7462B87484b10646A17042
$$ -79168 352591 296045 132775 14680 178085 12691 -57462 287484 -210646 117042
17694i8903B05405J68533j80134a5384p8874H8709B7770J10100c8892f916I1976
$$ -98903 205405 373938 193804 -15384 -94258 88709 27770 137870 -38892 -6916 91976
17682A15831J78244J84810A90658q9469L36360b00604A5638d8598j78228H7645
$$ 115831 294075 478885 190658 101189 437549 -200604 15638 -48598 -226826 87645
17671A76878D7368J40080f3120D05910a02152B15954J26417j15241D2806J89540
$$ 176878 47368 187448 -63120 405910 -102152 215954 342371 227130 42806 232346
17661B32346O7453F0646J35175c0529H99R7067J34499H2697h7179d3548B8730
$$ 232346 299799 60646 195821 -30529 899 97966 232465 82697 -87179 -43548 28730
17649F699c6637k5647m2153r2855D4828P6362K57547a1548A54177Q4481K4272
$$ 6699 -36637 -62284 -104437 -197292 44828 121190 378737 -11548 154177 238658 262930
17638B62930f9112c1253j1807D4342O215a28137A85854K1766J77020d3641B8643
$$ 262930 -69112 -31253 -43060 44342 50557 -128137 185854 207620 384640 -43641 28643
17626C39555i2391A91861b24452C49367C0036I246K45453q7941B3678R9195L31598
$$ 339555 -92391 191861 -224452 349367 30036 9246 254699 166758 23678 122873 454471
17615D54471C4459c83441A32878e3686r3879a4079C12750I2236R7267g3848G0327
$$ 454471 34459 -383441 132878 -53686 -147565 -14079 312750 92236 189503 -73848 70327
17603c3281A30643h45A40051C7460L06441j69844H4090b6707C25193C2159R5613
$$ -33281 130643 -845 140051 37460 343901 174057 84090 -26707 325193 32159 127772
17592A27772P2847J7813C5660R4167K8865a45984q8529J337H4456a20197D5436
$$ 127772 200619 218432 35660 129827 158692 -145984 -234513 -233176 84456 -120197 45436
17580C64510I5736H957J26535L799L9792C8462M1420C7757a6218B26024j01102
$$ 364510 95736 8957 135492 139291 179083 38462 79882 37757 -16218 226024 124922
17569A24922j8433a34244A48150a50570C42247A66073J29373J61369A95443O6901
$$ 124922 106489 -134244 148150 -150570 342247 166073 295446 456815 195443 262344
17559B62344j07348a2944B24595i1213D65318A82852J34425J49943A79260K3943
$$ 262344 154996 -12944 224595 -91213 465318 182852 317277 467220 179260 203203
17549B03203r7863b66359A38651Q8721M2071a65986C02396J37176G2832c0432
$$ 203203 105340 -266359 138651 227372 269443 -165986 302396 439572 72832 -30432
17538B96616a3061H1507K8825h7447A73961J75824N4487A32130a6956A11495J80908
$$ 296616 -13061 81507 110332 -87447 173961 349785 404272 132130 -16956 111495 292403
17527B92403J790r6809p1965b89463d4261C42578j53941J08767j02848J10904
$$ 292403 294193 197384 125419 -289463 -44261 342578 188637 297404 194556 305460
17517C05460M7474n3227A34617N60517p5833K06449j11723L48428o8772q1498
$$ 305460 352934 299707 134617 695134 619301 825750 714027 1062455 993683 912185
17507I12185j41308j32368q4570j78943j28099N72224C03134Q1566K17431j34179
$$ 912185 770877 638509 553939 374996 246897 819121 303134 384700 602131 467952
17497D67952M2966M28194k04717J1137K02257J15143n11654j00288K42610l9475
$$ 467952 510918 939112 734395 745532 947789 1062932 551278 450990 693600 654125
17487F54125A81320G3508L56260j31024A14174K87646A25879L19476K73336k48382
$$ 654125 181320 73508 429768 298744 114174 401820 125879 445355 718691 470309
17477D70309K16976l12521j48898J06123A44979J43193J48812j11462n4852J9229
$$ 470309 687285 374764 225866 331989 144979 288172 436984 325522 270670 289899
17467B89899J8124n372R3172j68453c9852B21598M12853C03107L68354B02561
$$ 289899 308023 302651 395823 227370 -39852 221598 634451 303107 671461 202561
17456A06524J99307K8279j16069j2205o8442Q6758J79706a6823A85287K04577
$$ 106524 305831 334110 218041 205836 137394 224152 403858 -16823 185287 389864
17446C89864j66114D9506L28658Q0520j90973m5527J86944A10687K62362J50362
$$ 389864 223750 49506 378164 458684 267711 222184 409128 110687 373049 523411
17436E23411k56968J54688A48934J65273o901K24276J20576p8868n0747j46846
$$ 523411 266443 421131 148934 314207 307306 531582 652158 573290 522543 375697
17426C75697K85748K4032B96547J78397j14059K7296j57407K35575k3988j43795
$$ 375697 661445 685477 296547 474944 360885 388181 230774 466349 442361 298566
17416B98566L84200C33852j49079L80161G967K88110M21511j53547j11201q2071
$$ 298566 682766 333852 184773 564934 7967 296077 717588 564041 452840 370769
17406C70769K02486j9564n2898A19178l3746L11671J33695Q6873B74536J81316
$$ 370769 573255 553691 500793 119178 85432 397103 530798 617671 274536 455852
17396D55852j56184K06985J29983B48707O9729J2508q8933J81389n7141o1279
$$ 455852 299668 506653 636636 248707 318436 330944 242011 423400 366259 304980
17386C04980K2972a02090C29561j60607K911J37513j49069Q3991K09435a9723
$$ 304980 327952 -102090 329561 168954 171865 309378 160309 244300 453735 -19723
17375D8783K46046R0989O6720j83638J09023d4458D61828M1395A98606K35353
$$ 48783 294829 385818 452538 268900 377923 -44458 461828 503223 198606 433959
17365D33959A42483L90390k62290r5934J87833i8936D87416k41254J12600C8312
$$ 433959 142483 532873 270583 174649 362482 -98936 487416 246162 358762 38312
17354C15619P4521K5485j06362k863A15252M70211k37478J14833A72998E8941
$$ 315619 390140 415625 309263 306400 115252 585463 347985 462818 172998 58941
17343D89901j49393j29408J78770A08109M0949C8824M15669k22684r7156K13079
$$ 489901 340508 211100 389870 108109 149058 38824 454493 231809 134653 347732
17333C47732p6117q6538M25240B40430k5631O8202K37622k26935j36245M12588
$$ 347732 271615 185077 610317 240430 214799 283001 520623 293688 157443 570031
17323E70031A35637m3945J25742C9679K1869C0626a30654C20824N0151j48263
$$ 570031 135637 91692 217434 39679 61548 30626 -130654 320824 370975 222712
17313B22712O5634E4377J67185K07539q0585L95337A67636G2906J26405J8765
$$ 222712 288346 54377 221562 429101 348516 743853 167636 72906 199311 218076
17303B18076J33719L3884r081F4919K00291j3826J11928p6466J05256j6420P344
$$ 218076 351795 385679 376598 64919 265210 251384 363312 286846 392102 375682 383026
17292C83026q6266F909J26244J70871A42350g5761D931O32184H3082O0088K38968
$$ 383026 296760 6909 133153 304024 142350 -75761 4931 637115 83082 143170 382138
17281C82138A42984m2734N7530K5147M11323o9126q4805j07126J88163j10795
$$ 382138 142984 100250 157780 182927 594250 525124 440319 333193 521356 410561
17271D10561j00534n6511J81254A91837J17339J83507p5798l0991J81207d9783
$$ 410561 310027 253516 434770 191837 309176 492683 416885 385894 567101 -49783
17260B72337K07599k8616K82178E9949A5333J42381J18446N5224o3687j00159
$$ 272337 479936 451320 733498 59949 15333 157714 276160 331384 267697 167538
17250A67538J93910M0240A44444L37710j02748F6160K52089J37259E2838K43154
$$ 167538 361448 401688 144444 482154 379406 66160 318249 455508 52838 295992
17240B95992O6m0497K13879C3046K84271J1140O8018A21495N06697A75019K95982
$$ 295992 296058 255561 469440 33046 317317 328457 396475 121495 628192 175019 471001
17229D71001A54764M18888B60646K07776j86821J57397K45894k19807J0881j86947
$$ 471001 154764 573652 260646 468422 281601 438998 684892 465085 475966 289019
17219B89019n4666N27704k34972J69372p8604B83427J35193P5439j07820j91041
$$ 289019 234353 762057 527085 696457 617853 283427 418620 494059 386239 195198
17209A95198M51676L0722j17942k22197q5989J75199K38048l22732j37016Q7600
$$ 195198 646874 677596 559654 337457 251468 426667 664715 341983 204967 292567
17199B92567J29020o0040R3656b188A10725L47571A12782L22476m8371K57211
$$ 292567 421587 361547 455203 -2188 110725 458296 112782 435258 386887 644098
17189F44098B58693N5035j40356L43714j12514K20054k44277j66910m7561K27690
$$ 644098 258693 313728 173372 517086 404572 624626 380349 213439 165878 393568
17179C93568j88110L40081q4672j89026J06200D3532M07118R1091k58438q7530
$$ 393568 205458 545539 460867 271841 378041 43532 450650 541741 283303 195773
17169A95773P6802K43079B37543J13909B2543M14982K05871A39784L11080A54284
$$ 195773 272575 515654 237543 351452 22543 437525 643396 139784 450864 154284
17158D55590J50450L34048D28098N9875j62749J03238J7555N1320R1572J19991
$$ 455590 606040 940088 428098 487973 325224 428462 446017 497337 588909 708900
17148G08900K12668k36839j0092k34009K7374j2048K27905l13767m2123K46997
$$ 708900 921568 684729 674637 440628 468002 455954 683859 370092 327969 574966
17138E74966k41012K81128M08579m49825J05569L71127D94732L0108j98466J0356
$$ 574966 333954 615082 1023661 573836 679405 1050532 494732 524840 326374 336730
17128C36730M11569q2876K58062l69051p7897L91708k09169j52843O7152K18510
$$ 336730 748299 665423 923485 554434 476537 868245 659076 506233 573385 791895
17118G91895j01125j65507Q7584J71474k8736l68002K46251k06584N0796L15070
$$ 791895 690770 525263 612847 784321 755585 387583 633834 427250 478046 793116
17108G93116l83851K88212r7510r1933L6044J88295j81495p003K45367J22684
$$ 793116 409265 697477 599967 508034 544078 732373 550878 543875 789242 911926
17098I11926k04714r5774K4740N9984O803N5777k6191q9781m0481L13446D40545
$$ 911926 707212 611438 636178 696162 702965 758742 732551 642770 602289 915735 440545
17086E78664j06602K81447L02024k05668M6684m06229J92474j36180p8924N925
$$ 578664 472062 753509 1055533 849865 896549 490320 682794 546614 467690 473615
17076D73615M22875j48552k4243j22936P4872L34746k12822j47986Q2683M7123
$$ 473615 896490 747938 723695 600759 675631 1010377 797555 649569 732252 779375
17066G79375J397J77943j77390j04080O11011m18748j2818j77492J30741j07271
$$ 779375 780772 958715 781325 677245 1288256 869508 856690 679198 809939 702668
17056G02668J82152o2351j00470J98574l11593J89043L5359O2995J71689l10978
$$ 702668 884820 822469 721999 920573 608980 798023 833382 896377 1068066 757088
17046G57088J72300K4566J21072k23441J51173N6115m43719M68511j89945P7855
$$ 757088 929388 953954 1075026 851585 1002758 1058873 615154 1083665 893720 971575
17036I71575n673j3174J25105m1798l89307J68849L58895k64132J61650K06570
$$ 971575 965902 952728 1077833 1036035 646728 815577 1174472 910340 1071990 1278560
17026A278560m06401k24637K1246L44024L8066J24575o2381J00542J87413l17785
$$ 1278560 872159 647522 668768 1012792 1050858 1175433 1113052 1213594 1401007 1083222
17016A083222k07488L17474N0119j76021k11366N42447k90334j0373R6140j7959
$$ 1083222 875734 1193208 1243327 1067306 855940 1398387 1108053 1097680 1193820 1175861
17006A175861r9881K50469j68487K68443k44916J61590k52100M1848K68823j85239
$$ 1175861 1075980 1326449 1157962 1426405 1181489 1343079 1090979 1132827 1401650 1216411
16996A216411J33088K36920k08733r4512l99471l6248M07388L997J25150L1168
$$ 1216411 1349499 1586419 1377686 1283174 883703 847455 1254843 1258840 1383990 1415158
16986A415158J59720m31134L47098n5994j91415m3334K9924k1322m0292J54278
$$ 1415158 1574878 1143744 1490842 1434848 1243433 1200099 1230023 1208701 1168409 1322687
16976A322687J6035m4033P9037l9336L31031j27065k46411J58460m2029k79761
$$ 1322687 1338722 1294689 1373726 1334390 1665421 1538356 1291945 1450405 1408376 1128615
16966A128615L82827l64016J54051K57096P1391K29190l22690j33797J16603M5889
$$ 1128615 1511442 1147426 1301477 1558573 1629964 1859154 1536464 1402667 1519270 1565159
16956A565159n0274k76871J46551M46275k72966P5886q3641m3101K66934N6063
$$ 1565159 1514885 1238014 1384565 1830840 1557874 1633760 1550119 1507018 1773952 1830015
16946A830015J5700L4450k36163K2778J61802k91851L24692O9815j94923L91479
$$ 1830015 1845715 1880165 1644002 1666780 1828582 1536731 1861423 1931238 1736315 2127794
16936B127794k82007j08812K27820k09245m0248K12343L10652j76242J4149j85397
$$ 2127794 1845787 1736975 1964795 1755550 1715302 1927645 2238297 2062055 2076204 1890807
16926A890807J35847R1276J42069l97197R7379J02487L45764l63950M16772J83471
$$ 1890807 2026654 2117930 2259999 1862802 1960181 2062668 2408432 2044482 2461254 2644725
16916B644725n71091K16164M0655Q9675J46721l60562J10781J22093r2106j53761
$$ 2644725 2073634 2289798 2330453 2420128 2566849 2206287 2317068 2439161 2347055 2193294
16906B193294K38739L66459j59926k6193j5400k0767M14957n22450N1031j1421
$$ 2193294 2432033 2798492 2638566 2612373 2596973 2576206 2991163 2468713 2519744 2508323
16896B508323M95202j23408O4795n07637M66671j51275J70993q4374J34292K49582
$$ 2508323 3003525 2880117 2944912 2437275 2903946 2752671 2923664 2839290 2973582 3223164
16886C223164j23297J23026J30161m72821J43107L70632k39497K4945N06151j51189
$$ 3223164 3099867 3222893 3353054 2880233 3023340 3393972 3154475 3179420 3685571 3534382
16876C534382j08811J95207k06633j9562K14300O4532J34815l31074M91364m75225
$$ 3534382 3425571 3620778 3414145 3394583 3608883 3673415 3808230 3477156 3968520 3493295
16866C493295N03237l11928K96172J79870j4621j49035j509J52457K50443r0406
$$ 3493295 3996532 3684604 3980776 4160646 4146025 3996990 3995481 4147938 4398381 4307975
16856D307975j16157O59090n60188L35226m35860L23024N22974l49564L35647
$$ 4307975 4191818 4850908 4290720 4625946 4190086 4513110 5036084 4686520 5022167
16847E022167k23882M0461j93045K61028J37883J28864K89198k14981L1478K57618
$$ 5022167 4798285 4838746 4645701 4906729 5044612 5173476 5462674 5247693 5279171 5536789
16837E536789L8221K36947q3445L80376j29660N4612L21187m77890N61141R5697
$$ 5536789 5575010 5811957 5728512 6108888 5979228 6033840 6355027 5877137 6438278 6533975
16827F533975j58205K55423k4162K45426J17859M26393l97044L45020L84753r6919
$$ 6533975 6375770 6631193 6607031 6852457 6970316 7396709 6999665 7344685 7729438 7632519
16817G632519j81929L23943K14952L80157M4034o269J10857J26232J95124L75947
$$ 7632519 7450590 7774533 7989485 8369642 8413676 8407407 8518264 8644496 8839620 9215567
16807I215567K50278J42751n696J76672J98375L54366J1762Q9928J39952O26159
$$ 9215567 9465845 9608596 9602900 9779572 9977947 10332313 10344075 10434003 10573955 11200114
16797A1200114K05802k82242N98360J18353R0759P06329L384N33902J18072L37580
$$ 11200114 11405916 11123674 11722034 11840387 11931146 12637475 12640859 13174761 13292833 13630413
16787A3630413L36653l1332N76399K32965M95437J97556K71599N87766K52231
$$ 13630413 13967066 13935734 14512133 14745098 15240535 15438091 15709690 16297456 16549687
16778A6549687M66773M72514L09907P25986J23162P27241N83791N62233J20375
$$ 16549687 17016460 17488974 17798881 18524867 18648029 19375270 19959061 20521294 20641669
16769B0641669Q45408M57837N37973O08012P27992R36763O46766O13734R30336
$$ 20641669 21487077 21944914 22482887 23090899 23818891 24755654 25402420 26016154 26946490
16760B6946490M20052R22616J188012N65233J105553P57745R08055J227667J424921
$$ 26946490 27366542 28289158 29477170 30042403 31147956 31905701 32813756 34041423 35466344
16751C5466344Q99006Q71583J474105J565355J280687J496885J106663J542214
$$ 35466344 36365350 37236933 38711038 40276393 41557080 43053965 44160628 45702842
16743D5702842J403761J993474J654906J901596J692753J851617K083503K017644
$$ 45702842 47106603 49100077 50754983 52656579 54349332 56200949 58284452 60302096
16735F0302096K365678K006601K770126J955562K315905K662227K766620K811939
$$ 60302096 62667774 64674375 67444501 69400063 71715968 74378195 77144815 79956754
16727G9956754K431698K545236L000806K532958L094900K079756L212368K577563
$$ 79956754 82388452 84933688 87934494 90467452 93562352 95642108 98854476 101432039
16719A01432039K832322K386682K809006K032617K199826J978053J825539J253551
$$ 101432039 104264361 106651043 109460049 111492666 113692492 115670545 117496084 118749635
16711A18749635J611283R98154J055325L7803N26099j9429p86413m14499j111198
$$ 118749635 120360918 121359072 122414397 122452200 122978299 122958870 122172457 121757958 120646760
16702A20646760p81433j586662j755210j856032k524098k038071k437387k587474
$$ 120646760 119865327 118278665 116523455 114667423 112143325 110105254 107667867 105080393
16694A05080393k592135k512553l139955k607787l166710k311082l387085k602064
$$ 105080393 102488258 99975705 96835750 94227963 91061253 88750171 85363086 82761022
16686H2761022k479561k982539k459019k400926k552698k570254k615315k060328
$$ 82761022 80281461 77298922 74839903 72438977 69886279 67316025 64700710 62640382
16678F2640382k330895k207357k040116j638284k146035j962054j891060j672622
$$ 62640382 60309487 58102130 56062014 54423730 52277695 50315641 48424581 46751959
16670D6751959j784733j000087j636500j363129j757142r80328j468279q71326
$$ 46751959 44967226 43967139 42330639 40967510 39210368 38230040 36761761 35890435
16662C5890435j430024j095243r81061j391605n55459j171183p15243p87524j104510
$$ 35890435 34460411 33365168 32384107 30992502 30437043 29265860 28550617 27763093 26658583
16653B6658583p55885q41266r52482o05334n13463j93858j201820m29432o85741
$$ 26658583 25902698 25061432 24108950 23503616 22990153 22796295 21594475 21165043 20479302
16644B0479302m73949l01694p39609n24849n00785m79017j99089p33526j13889
$$ 20479302 20005353 19703659 18964050 18439201 17938416 17459399 17260310 16526784 16412895
16635A6412895p54064n44239j6344n26441j89105m75532m09821k08646l04892
$$ 16412895 15658831 15114592 15098248 14571807 14382702 13907170 13497349 13288703 12983811
16626A2983811j73815k23042q17925K31895l99609l24557R4265q27971J47403
$$ 12983811 12809996 12586954 11769029 12000924 11601315 11276758 11371023 10543052 10690455
16617A0690455j04688j00089N0847q61276J19270o90278J11545L4308j80088k41655
$$ 10690455 10585767 10485678 10536525 9675249 9794519 9104241 9215786 9250094 9070006 8828351
16607H828351l0178l69561m0463m03540k12482K60646n02668J32252l28187k15543
$$ 8828351 8798173 8428612 8388149 7984609 7772127 8032773 7530105 7662357 7334170 7118627
16597G118627K94721m21052o8653k58570J44404n46728J38631j98279K86766m23142
$$ 7118627 7413348 6992296 6923643 6665073 6809477 6262749 6401380 6203101 6489867 6066725
16587F066725J80587n71740K53290l29299k79632N75215p23738N94911n22750
$$ 6066725 6247312 5675572 5928862 5599563 5319931 5895146 5171408 5766319 5243569
16578E243569j6999o4216j28950K08468l58173m65784L99160J5807m15000m9849
$$ 5243569 5226570 5162354 5033404 5241872 4883699 4417915 4817075 4832882 4417882 4368033
16568D368033K44088l53293K30991k89508L66553k98851l00468K8780R6768l08559
$$ 4368033 4612121 4258828 4489819 4200311 4566864 4268013 3967545 3996325 4093093 3784534
16558C784534J53070k20792L75301M2201k15643o78j0710l68881K53931l65289
$$ 3784534 3937604 3716812 4092113 4134314 3918671 3917993 3907283 3538402 3792333 3427044
16548C427044o9777k24002l507J31073N0021l2833p6479r64j48914J09131j07984
$$ 3427044 3357267 3133265 3129758 3260831 3310852 3278019 3201540 3200576 3051662 3160793 3052809
16537C052809k13550K44353m88472L44149k03311O7520k49774K44110j01727j42362
$$ 3052809 2839259 3083612 2595140 2939289 2735978 2803498 2553724 2797834 2696107 2553745
16527B553745K35157m61947N39166l46248l4177q044j1660k93126L01477k24968
$$ 2553745 2788902 2326955 2866121 2519873 2485696 2477652 2465992 2172866 2474343 2249375
16517B249375p5483j9854L7784j37280J68350J69899J20121l61897L03169n11317
$$ 2249375 2173892 2154038 2191822 2054542 2222892 2392791 2512912 2151015 2454184 1942867
16507A942867P1523J56533j6828Q7320m68133J62876J34285l37973K22383l03395
$$ 1942867 2014390 2170923 2154095 2241415 1773282 1936158 2070443 1732470 1954853 1651458
16497A651458K17817L7862J11504l5517J37207m82720M6527K32071r39K7203R3172
$$ 1651458 1869275 1907137 2018641 1983124 2120331 1637611 1684138 1916209 1915270 1942473 2035645
16486B035645o48760N01526O6597j59145j36242j20743K88280n14154M73166m12600
$$ 2035645 1386885 1888411 1955008 1795863 1659621 1538878 1827158 1313004 1786170 1373570
16476A373570j05440P1648J70580J71798k73604p0659J1880K11896l0521M2507
$$ 1373570 1268130 1339778 1510358 1682156 1408552 1337893 1349773 1561669 1531148 1573655
16466A573655l16718J29914J35652L930r7033K83447l84073j42273Q3189J09408
$$ 1573655 1256937 1386851 1522503 1526433 1429400 1712847 1328774 1186501 1269690 1379098
16456A379098q6664J82352n7965j89991j09120J233L29963m24089K41764J89996
$$ 1379098 1292434 1474786 1416821 1226830 1117710 1118943 1448906 1024817 1266581 1456577
16446A456577j50574K6721l14428J19312j4143m3863k2314j44275J42125j45622
$$ 1456577 1306003 1332724 1018296 1137608 1123465 1079602 1057288 913013 1055138 909516
16436I09516K54737p7385R8684k95363J90295M887R947k33769J75027n395L18925
$$ 909516 1164253 1086868 1185552 890189 1080484 1085371 1095318 861549 1036576 1031181 1350106
16425A350106k47684p1917j43447k5256Q7542J09932j19587L83229l68902P3449
$$ 1350106 1102422 1030505 887058 861802 949344 1059276 939689 1322918 954016 1027465
16415A027465J37349k73946m1588R4640k87354L13860J02125j76123j5663J21860
$$ 1027465 1164814 890868 849280 943920 656566 970426 1072551 896428 880765 1002625
16405A002625k58072J16295j67411K43635k49275N1069q193j39752M75933K6890
$$ 1002625 744553 860848 693437 937072 687797 738866 730673 590921 1066854 1093744
16395A093744j02876k85153M15395l60981N2986j73879o0631o048J81886O7597
$$ 1093744 990868 705715 1121110 760129 813115 639236 578605 572557 754443 822040
16385H22040k44104K00780N7273K85143k11303l69243K09912j33499N5978L2523
$$ 822040 577936 778716 835989 1121132 909829 540586 750498 616999 672977 705500
16375G05500l3028q8067k23995Q706j30213M72765q6440m0333L1634j95427K40370
$$ 705500 672472 584405 360410 369116 238903 711668 625228 584895 616529 421102 661472
16364F61472N2613k13972L98525D35608R8949k1342P6027J35369j95480A60675
$$ 661472 714085 500113 898638 435608 534557 513215 589242 724611 529131 160675
16353G03460p5643K38415j20153L1313B50016L39188L15754l59912k772N3669
$$ 703460 627817 866232 746079 777392 250016 589204 904958 545046 542274 595943
16343E95943O6387o1047J43156p3244j15694L8909j97762K24413k41888L20950
$$ 595943 662330 601283 744439 671195 555501 594410 396648 621061 379173 700123
16333G00123j49737J16914P6936C46112L57586C27862J70726B46386J16239K76643
$$ 700123 550386 667300 744236 346112 703698 327862 498588 246386 362625 639268
16323F39268k21213A15566N10925B75889j07731J51246R7451K37657B34326J52837
$$ 639268 418055 115566 626491 275889 168158 319404 416855 654512 234326 387163
16313C87163C3442M05875J6604Q444m282J29170n8846J88548C42307D7750M41234
$$ 387163 33442 439317 455921 464365 460083 589253 530407 718955 342307 47750 488984
16302D88984j33654L52795l13215q6280L8069j61165N3040J01992J36436q1883
$$ 488984 355330 708125 394910 308630 346699 185534 238574 340566 477002 395119
16292C95119J61793B28973M927N2797j41449N1588J85302o448K09745F8992M13906
$$ 395119 556912 228973 233900 286697 145248 196836 382138 375690 585435 68992 482898
16281D82898k17610c5992D00839j79113M96217k35256A64326M34242j56991B01820
$$ 482898 265288 -35992 400839 221726 717943 482687 164326 598568 441577 201820
16270D58232A25715L18161J12460B30186J24276j47561K87393j50532J47251b6355
$$ 458232 125715 443876 556336 230186 354462 206901 494294 343762 491013 -26355
16259A87656n3377J60393J16054K68372k29969k20980K04468b698C2196M86097
$$ 187656 134279 294672 410726 679098 449129 228149 432617 -2698 32196 518293
16249E18293q9287p9667l5070K98376B97707p9110L66988j81636J8958j10995
$$ 518293 429006 349339 314269 612645 297707 218597 585585 403949 422907 311912
16239C11912j46863l2849M52525k09573P6325o7190C9954M38739l7905A60175
$$ 311912 165049 132200 584725 375152 451477 384287 39954 478693 440788 160175
16228B62276E1886K70552K497P4357m507H1379K18445D7973L8111L93579A93586
$$ 262276 51886 322438 324935 399292 394785 81379 299824 47973 86084 479663 193586
16216A67256J74795E3150N03955k17430O1710j65961J13029J58026B28787L2148
$$ 167256 342051 53150 557105 339675 401385 235424 348453 506479 228787 260935
16206B60935J35177q1832j55682o5891B1423L25432P0672A46240O9110r1437k3303
$$ 260935 396112 314280 158598 92707 21423 346855 417527 146240 215350 123913 100610
16195A00610K12475j07259r93k2744N5787C1848a03092I8840K55136A26988N7361
$$ 100610 313085 205826 204833 182089 237876 31848 -103092 98840 353976 126988 184349
16184A84349j6301O7410b6555D88010A58529a1654A53928J42606E049K79687L6452
$$ 184349 168048 235458 -26555 488010 158529 -11654 153928 296534 5049 284736 321188
16173C21188A05216K93697M64A06842k5695J95642C7475M09305B02875M2098I0550
$$ 321188 105216 398913 399377 106842 81147 276789 37475 446780 202875 244973 90550
16161E7587P3169Q8657r8410i640A89510F6686c31668B18023L05460B40021e9674
$$ 57587 130756 219413 121003 -9640 189510 66686 -331668 218023 523483 240021 -59674
16149A77484p6786l5140B5021i2793b1906A55189K75956A57709m8317L3555E897
$$ 177484 100698 65558 25021 -92793 -21906 155189 431145 157709 109392 142947 5897
16137B11942j8482J4834h3521A17638J09268E567M35333A26537K11913q7637r2875
$$ 211942 193460 208294 -83521 117638 226906 5567 440900 126537 338450 250813 157938
16126A57938a49633A91252H2058m480L7630e6206A43759J94850K3637k2461n8988
$$ 157938 -149633 191252 82058 77578 115208 -56206 143759 338609 362246 339785 280797
16115B80797j8971A9157K09685R8155j02196D3242g1386j7404A2453K51373a91870
$$ 280797 261826 19157 228842 326997 224801 43242 -71386 -88790 12453 263826 -191870
16103A43132a73258B35335K11603g9084J1994l7239A00013c39612B56730i7290
$$ 143132 -173258 235335 446938 -79084 -67090 -104329 100013 -339612 256730 -97290
16092G9913Q1902a39919A72331a10144C15453P8358p9246a5838L57n431m7664
$$ 79913 161815 -139919 172331 -110144 315453 393811 314565 -15838 -15481 -20912 -68576
16081f8576a4412B396K24533O518Q5032b48579I0994a49966A43746L5604d62450
$$ -68576 -14412 2396 226929 233447 318479 -248579 90994 -149966 143746 179350 -462450
16069F30787B02082a17200F9137a19454j83213A29800J22364a84598G4270R8768
$$ 630787 202082 -117200 69137 -119454 -302667 129800 252164 -184598 74270 173038
16059A73038j9526a35432B41231H1508k4238C365L1676b70119I0582a0414A05641
$$ 173038 153512 -135432 241231 81508 57270 3365 35041 -270119 90582 -10414 105641
16047A20048O6432M7015a40507K9398L4276p9859B73199D257a00809A56886a62858
$$ 120048 186480 233495 -140507 -111109 -76833 -156692 273199 4257 -100809 156886 -162858
16035b3749m54086A58716G2594g4114B38699E928a0649j49262o0989m5242D03401
$$ -23749 -477835 158716 72594 -74114 238699 5928 -10649 -159911 -220900 -266142 403401
16023i3486I3963g1003B62620f0179l03889A60950b10861A42560c29306a18653
$$ -93486 93963 -71003 262620 -60179 -364068 160950 -210861 142560 -329306 -118653
16012e6768j98227i6959B5068d3881B5436K5028b43722A85325a46234G9418n349
$$ -56768 -254995 -96959 25068 -43881 25436 50464 -243722 185325 -146234 79418 74069
16001G4069L9438a2770A50422k4626J00559N7922j5001j23322K15837g401B27258
$$ 74069 113507 -12770 150422 125796 226355 284277 269276 145954 361791 -7401 227258
15989C6885P1069P1161a16121A67951C8616A0732b8659A36272K6674h431A48625
$$ 36885 107954 179115 -116121 167951 38616 10732 -28659 136272 162946 -8431 148625
15977A33122m6621a46690A51555J45095L64476L2355Q6067L16045j14188J37698
$$ 133122 86501 -146690 151555 296650 661126 693481 779548 1095593 981405 1119103
15967A119103q7739B15311L79641k75986a01416A16758K47664A8143P3936a53945
$$ 1119103 1031364 215311 594952 318966 -101416 116758 364422 18143 92079 -153945
15956I5008b4224A22647J14475h3769E6083R2435c3212A72030b38308C02966B0027
$$ 95008 -24224 122647 237122 -83769 56083 148518 -33212 172030 -238308 302966 20027
15944i8686L1901A23751E0361j7645a63519i527B26645E035K48144f7424j31003
$$ -98686 -66785 123751 50361 32716 -163519 -9527 226645 5035 253179 -67424 -198427
15933a98427k4108L4302A51943a50184A54890a31641N9361C06850b66531A12705
$$ -198427 -222535 -188233 151943 -150184 154890 -131641 -72280 306850 -266531 112705
15922g9392F8722J75269r3570M674a25688n9280D0285j9365a35595k48118A81022
$$ -79392 68722 243991 150421 155095 -125688 -184968 40285 20920 -135595 -383713 181022
15910b37396A70550P8898a97033G634a22690D4271J5140B6178a40006b980A75115
$$ -237396 170550 249448 -197033 7634 -122690 44271 59411 26178 -140006 -2980 175115
15898F46360h3679K7601j91548i5410b6726A63331b12869d0695a0311j72896N0450
$$ 646360 -83679 -56078 -247626 -95410 -26726 163331 -212869 -40695 -10311 -183207 -132757
15887a32757A25241L5732a78342A92428I2354b46695M1776p892L871c7418a7712
$$ -132757 125241 160973 -178342 192428 92354 -246695 -204919 -212811 -208940 -37418 -17712
15875B56286h3659o0823j43440B908f142m6268P31k4864A27508G139a4772F1222
$$ 256286 -83659 -144482 -287922 2908 -6142 -52410 -51679 -76543 127508 7139 -14772 61222
15862d9298I638a08038G737K15195c21850a28234d5486j1578k43983b2356k0248
$$ -49298 9638 -108038 7737 222932 -321850 -128234 -45486 -57064 -301047 -22356 -42604
15851d2604A92898P5247c3212r1568N7293I3563J68708a11563j19883p9346A73266
$$ -42604 192898 268145 -33212 -124780 -67487 93563 262271 -111563 -231446 -310792 173266
15839A21925a85024j26813Q5092F9260r209g6464K1980A17224a35221d8233D06778
$$ 121925 -185024 -311837 -226745 69260 60051 -76464 -54484 117224 -135221 -48233 406778
15827a73027b4708j2179j49641I9364b12131B9166a87394f2935k7059M1177E6392
$$ -173027 -24708 -36887 -186528 99364 -212131 29166 -187394 -62935 -89994 -48817 56392
15815b576r107E5567J03684f5111q3734A89226a24697L8359H6365b67084E4834
$$ -2576 -11683 55567 159251 -65111 -148845 189226 -124697 -86338 86365 -267084 54834
15803a7599j9124A36266a1567k20564a05733f979l196k01650A17943A1751a25473
$$ -17599 -36723 136266 -11567 -232131 -105733 -6979 -10175 -211825 117943 11751 -125473
15791D0137b60121a18771c0556B04717H6983d3019B35038R5319A42553b33668
$$ 40137 -260121 -118771 -30556 204717 86983 -43019 235038 330357 142553 -233668
15780B7585c69221J60455A00574e4829A61619L2082q0415g3040k23406A62697
$$ 27585 -369221 -208766 100574 -54829 161619 193701 113286 -73040 -296446 162697
15769b22115o4921C13175j35710A2685f8701k8014D3104J8337a17198l93400F3010
$$ -222115 -287036 313175 177465 12685 -68701 -96715 43104 61441 -117198 -510598 63010
15757h6440A09050M5758l9003g4793l87159E838a20188a7500k26833e386A49546
$$ -86440 109050 154808 115805 -74793 -461952 5838 -120188 -17500 -244333 -5386 149546
15745f8768A80450c8431l84361D6323Q8048C9619a95223o0267l7740C12977G1369
$$ -68768 180450 -38431 -422792 46323 134371 39619 -195223 -255490 -293230 312977 71369
15733a2279k5589A84572E9064J91450D4819Q6142D9168j3607c1657j4652A06378
$$ -12279 -37868 184572 59064 250514 44819 130961 49168 35561 -31657 -46309 106378
15721F1644a21717C09349a37169A19899a59911A35886a78282h5982A6772a92959
$$ 61644 -121717 309349 -137169 119899 -159911 135886 -178282 -85982 16772 -192959
15710b96609a5716A65085P2888p2571b18696e5299j32077A08334A7281a53668
$$ -296609 -15716 165085 237973 165402 -218696 -55299 -187376 108334 17281 -153668
15699A97605a50618m1024A22767C9755R9705a1621m06547i882B72180i1232K8002
$$ 197605 -150618 -191642 122767 39755 139460 -11621 -418168 -9882 272180 -91232 -63230
15688f3230j33170d6482j93782C74395a49004A20760c5962i872j75139C65159
$$ -63230 -196400 -46482 -240264 374395 -149004 120760 -35962 -9872 -185011 365159
15677E1422a56917B05311C0519J44175G3999C5085K60161q3998a11911A28043
$$ 51422 -156917 205311 30519 174694 73999 35085 295246 211248 -111911 128043
15666A60619b04631f9021a3663k42163a23791F5437a1672A53008A5308K92409
$$ 160619 -204631 -69021 -13663 -255826 -123791 65437 -11672 153008 15308 307717
15656C07717o3814a90330B1564Q1098a03054A34607f5225m5143A40468h0562l4205
$$ 307717 243903 -190330 21564 102662 -103054 134607 -65225 -110368 140468 -80562 -114767
15645a14767J6440I1645j3274b71930d8987k76223B32604D5717J23428a68449
$$ -114767 -98327 91645 78371 -271930 -48987 -325210 232604 45717 169145 -168449
15634C9064b9691j6864D4510a47719d4282j02794K4722A46809N7717c12060J11597
$$ 39064 -29691 -46555 44510 -147719 -44282 -147076 -122354 146809 204526 -312060 -200463
15623b00463G2763f3647b5435B67254b20269c9997A48292h0286c4211j42641K4514
$$ -200463 72763 -63647 -25435 267254 -220269 -39997 148292 -80286 -34211 -176852 -152338
15612a52338L2387F0604c82477F5282d3982m1058n0296M1493A15050a61088f7096
$$ -152338 -119951 60604 -382477 65282 -43982 -85040 -135336 -93843 115050 -161088 -67096
15600B44351e0866m50342G7505f1556j65859a3176k37497E7807b79568B22066
$$ 244351 -50866 -501208 77505 -61556 -227415 -13176 -250673 57807 -279568 222066
15589C11397p5902a24197l2266A57276J42907e1900n90612A5922a99843g0872
$$ 311397 235495 -124197 -156463 157276 300183 -51900 -642512 15922 -199843 -70872
15578c8445o5228L5513B5379M7684b0750B73892a64183f0737j15707e9191B56846
$$ -38445 -103673 -68160 25379 73063 -20750 273892 -164183 -60737 -176444 -59191 256846
15566g3227m4942j75908n092C13878A07906B253b15416b2124E6239K46765b43003
$$ -73227 -118169 -294077 -299169 313878 107906 2253 -215416 -22124 56239 303004 -243003
15554B25396f878A58663J28943E4965b4015l09611a37311l2230B40457c51501
$$ 225396 -6878 158663 287606 54965 -24015 -333626 -137311 -169541 240457 -351501
15543b2582C34516C5057a62504P0212A47475J5835a35881m546A66055l5558h4712
$$ -22582 334516 35057 -162504 -92292 147475 163310 -135881 -140427 166055 130497 -84712
15531A86229b19838B16554B2587M49692b12510g5795A23015j183b59395J04914
$$ 186229 -219838 216554 22587 472279 -212510 -75795 123015 121832 -259395 -154481
15521a54481c1795E03697e63575B5226i4564j75269G1617b06111H4527J7402a4589
$$ -154481 -31795 503697 -563575 25226 -94564 -269833 71617 -206111 84527 101929 -14589
15509A26764b0240D1076J51503L2656H7732n147J17632G2427J40170N3639J16033
$$ 126764 -20240 41076 192579 225235 87732 82585 200217 72427 212597 266236 382269
15498C82269A41259e3246F75949l02000c7454D0820R7098d5817o4761c5087A0272
$$ 382269 141259 -53246 675949 373949 -37454 40820 137918 -45817 -110578 -35087 10272
15486C31893a32604F5420k2392O7032N899J67265k4466B9713K04410j9325D2769
$$ 331893 -132604 65420 43028 110060 115959 283224 258758 29713 234123 214798 42769
15474B44824o7358g903D6357K75035A01283O0905L6101b0781j07724C35590K3528
$$ 244824 177466 -7903 46357 321392 101283 162188 198289 -20781 -128505 335590 359118
15463C59118h120r7831B22079P2251j27772M48878K00857B04734M04082A28375
$$ 359118 -8120 -105951 222079 294330 166558 615436 816293 204734 608816 128375
15452H3524J25705m3002M4011A0034J79493a20146A92220n4455n2767J76276B5648
$$ 83524 209229 166227 210238 10034 189527 -120146 192220 137765 84998 261274 25648
15440F7413J77849J53320e6795A68050J36548j16962b88379A7913K04814N46L3252
$$ 67413 245262 398582 -56795 168050 304598 187636 -288379 17913 222727 223273 256525
15429B56525o0484N10111J14660L78828m30638K46571j62710B41723j6347k9212
$$ 256525 196041 706152 820812 1199640 769002 1015573 852863 241723 225376 196164
15419A96164c7487B78858b186B2629l863a51002N7184L9052p8114e2546o3362
$$ 196164 -37487 278858 -2186 22629 18766 -151002 -93818 -54766 -132880 -52546 -115908
15408a15908A33507a8031n7558r9877A00290b24381a4993I703K22K63880G0754
$$ -115908 133507 -18031 -75589 -175466 100290 -224381 -14993 9703 9925 273805 70754
15396A66765O8421k0753m5667o6542K55102b44038L3144b4049j90131B22764k0685
$$ 166765 235186 214433 168766 102224 357326 -244038 -210894 -24049 -214180 222764 202079
15385B02079b97897a808j11996B28013n8527N3802g4503A97044J1124p9615b21998
$$ 202079 -297897 -1808 -113804 228013 169486 223288 -74503 197044 208168 128553 -221998
15373B12057c68115a430j25666j27543C03930j23685a68559C3891a44098B40791
$$ 212057 -368115 -1430 -127096 -254639 303930 180245 -168559 33891 -144098 240791
15362A00606c7059p1925C50412A23320m5579J1944L30127i6339C79135j27857
$$ 100606 -37059 -108984 350412 123320 77741 89685 419812 -96339 379135 251278
15352B51278E3757O1836a76583K7887B42442j06813b5278G6389J37121K5602l3962
$$ 251278 53757 115593 -176583 -148696 242442 135629 -25278 76389 213510 239112 205150
15341B05150j1769h0540I1470D1594a15117H4229K3852b6153A1564J10390k9991
$$ 205150 193381 -80540 91470 41594 -115117 84229 108081 -26153 11564 121954 91963
15330I1963J32248A07907J43006L09022j42991k0817c2036A82869e193m7303j4111
$$ 91963 224211 107907 250913 559935 416944 396127 -32036 182869 -5193 -52496 -66607
15319f6607D6228E953c4408A26345b34586A97108f0070j29848C6267K37322p8150
$$ -66607 46228 5953 -34408 126345 -234586 197108 -60070 -189918 36267 273589 195439
15308A95439f7768A30936K73135j26415H4850R2647K7410e2991A96690K6810q7430
$$ 195439 -67768 130936 404071 277656 84850 177497 204907 -52991 196690 223500 136070
15297A36070m9373K38973k7765J25064n1427B7166d7505C5098a1788j37026B03308
$$ 136070 86697 325670 297905 422969 371542 27166 -47505 35098 -11788 -148814 203308
15285b1752H0793f5163j56182A53090a21624B84798C4576J5844L56057A9839g40
$$ -21752 80793 -65163 -221345 153090 -121624 284798 34576 50420 406477 19839 -740
15273b18866C8330L04026a91345H9918J66689H5281b84052E56786I8507L29249
$$ -218866 38330 342356 -191345 89918 256607 85281 -284052 556786 98507 427756
15263D27756h575j17012B39995A9268d7720B2079L0696l151a7377m1490A33935
$$ 427756 -8575 -125587 239995 19268 -47720 22079 52775 49624 -17377 -58867 133935
15251f3636C4672K72804b54617C2025K3644F730J07699e3663j40392A62113c00178
$$ -63636 34672 307476 -254617 32025 55669 6730 114429 -53663 -194055 162113 -300178
15239h3156l7740j0877M9602B9017K63725A43187J56077j3110O7222D2949L12938
$$ -83156 -120896 -131773 -82171 29017 292742 143187 299264 286154 353376 42949 355887
15228C55887L68678K41115P29263k54064R1553M8925o93679D18301j80107J38222
$$ 355887 724565 965680 1694943 1440879 1532432 1581357 887678 418301 238194 376416
15218C76416a49667A99228O9674A05788p386J31772a78087A90102L0125p6046
$$ 376416 -149667 199228 268902 105788 98402 230174 -178087 190102 220227 144181
15208A44181a32144B83601K8155a02958c1655C3729N25756G5559K80641a6057
$$ 144181 -132144 283601 311756 -102958 -31655 33729 559485 75559 356200 -16057
15197A10908b66419j4080R4226j53802B57157b2252o8874A31510N0848R5223H2439
$$ 110908 -266419 -280499 -186273 -340075 257157 -22252 -91126 131510 182358 277581 82439
15185B79445c222m903C99278B0667N1500L0154K36125a97657C24191q6618i8869
$$ 279445 -3222 -8125 399278 20667 72167 102321 338446 -197657 324191 237573 -98869
15173a02284c6833C16700G4612e9098A91020J29213H075K02182D1516B0517e9138
$$ -102284 -36833 316700 74612 -59098 191020 320233 8075 210257 41516 20517 -59138
15161A94911b2124B34621K27862a88922h622q1088c0842G2974l2896b4045A95752
$$ 194911 -22124 234621 462483 -188922 -8622 -89710 -30842 72974 40078 -24045 195752
15149b63586B53J92879m8201J74332K03060A72671J2291N5794e9593A39229g4630
$$ -263586 253 193132 144931 319263 522323 172671 184962 240756 -59593 139229 -74630
15137B29916a4590A59452B9374K25655f7589K713C63164A09232j3251c02772B53195
$$ 229916 -14590 159452 29374 255029 -67589 -64876 363164 109232 95981 -302772 253195
15125I3211P4489a533A20661d4960A36896d0178j76342h87q0374A01496l0078
$$ 93211 167700 -1533 120661 -44960 136896 -40178 -216520 -887 -81261 101496 71418
15114G1418a32436A55288Q5033m718o4496e0245B12629M1057a04779B48934j20820
$$ 71418 -132436 155288 240321 235603 171107 -50245 212629 253686 -104779 248934 128114
15103A28114A3493K05885E4659O70637A20394L1238P2271j9996e8789A63176G6271
$$ 128114 13493 219378 54659 725296 120394 151632 223903 203907 -58789 163176 76271
15091C00506j5516G1857a63815A32177J81565b43142B27859a12745j2050A48290
$$ 300506 284990 71857 -163815 132177 313742 -243142 227859 -112745 -124795 148290
15080a34214F1254j130N2208J35224m9515n6932o4071L7247L10735A68951O0249
$$ -134214 61254 60124 112332 247556 198041 141109 77038 114285 425020 168951 229200
15069B29200j08799c923C40108O3038A6125K50170A33016J20669a81655A99169
$$ 229200 120401 -3923 340108 403146 16125 266295 133016 253685 -181655 199169
15058D43945H8751a15563B40899n8433K4624a98955E71660A67608j8361P3571
$$ 443945 88751 -115563 240899 182466 207090 -198955 571660 167608 149247 222818
15048B22818K2154p3041k7443D2478J00154a31946G9365K86447K93574C10132
$$ 222818 244972 171931 144488 42478 142632 -131946 79365 365812 659386 310132
15037F25047B19424J4879L6161j5480L90741j69320n8803J68803B89532J13735
$$ 625047 219424 234303 270464 254984 645725 476405 417602 586405 289532 403267
15027D03267A37887K96805j09849J45165j24628j39079c3047D73174j24165M6630
$$ 403267 137887 434692 324843 470008 345380 206301 -33047 473174 349009 395639
15017C95639J84574j0699K19182l4481l40203P4161J76355J73037k91318B33961
$$ 395639 580213 569514 788696 754215 414012 488173 664528 837565 546247 233961
15006A93854O933J18057L74631p9950k59598J81054B60530M37252B86173I0439
$$ 193854 200787 318844 693475 613525 353927 534981 260530 697782 286173 90439
14995F15956B50324k9494J25347M71341B97861K30383A78269O03882l21341q8959
$$ 615956 250324 220830 346177 817518 297861 528244 178269 782151 460810 371851
14985C71851J94287j87739J20710D9408L20365J89966j78872J22180l1560L23886
$$ 371851 566138 378399 499109 49408 369773 559739 380867 503047 471487 795373
14975G95373l71236Q1228j19546K29685J54596J18031j75322j62757K45067o1807
$$ 795373 424137 505365 385819 615504 770100 888131 712809 550052 795119 733312
14965G33312l59531J36800O39258n02390k96123K72175k08128J01507q3739K15800
$$ 733312 373781 510581 1149839 647449 351326 623501 415373 516880 433141 648941
14955F48941M45259m36052C19444J31846c2513D29336j68810K1026J29107j71641
$$ 648941 1094200 658148 319444 451290 -32513 429336 260526 281552 410659 239018
14945B39018J82533j15721J04245j27670r2378J74925a4196D53878A93948J18339
$$ 239018 421551 305830 410075 282405 190027 364952 -14196 453878 193948 312287
14935C12287r7624M420K16171A54582J53610L3730J00632L28085L7111r6639M5797
$$ 312287 214663 219083 435254 154582 308192 341922 442554 770639 807750 711111 756908
14924G56908k20209p0203J97576k06281K41176k40767J08613K99275K04917j24772
$$ 756908 536699 466496 664072 457791 698967 458200 566813 866088 1071005 946233
14914I46233N51052l89038M7292K36070J80254K29543j66762k66348J87005l8089
$$ 946233 1497285 1108247 1155539 1391609 1571863 1801406 1634644 1368296 1555301 1517212
14904A517212j08433L82580J92633O54868m52146l13811m75615j12648l19974
$$ 1517212 1408779 1791359 1983992 2638860 2186714 1872903 1397288 1284640 964666
14895I64666j37599o6342m9236m6673k98954M79060l47629j85870O77505l09633
$$ 964666 827067 760725 711489 664816 365862 844922 497293 311423 988928 679295
14885F79295C08981n1991K60099k12329L72971q6553B15894J56713A37791P1784
$$ 679295 308981 256990 517089 304760 677731 591178 215894 372607 137791 209575
14875B09575P4048G6608M82600K4527M75322l17472k33073K35320K12328l27089
$$ 209575 283623 76608 559208 583735 1059057 741585 508512 743832 956160 629071
14865F29071j48300J46274L08864j13887j08103j00251k53003K30900j16075A76127
$$ 629071 480771 627045 935909 822022 713919 613668 360665 591565 475490 176127
14854B47159K51680M6841J71448o9156n4718K85325l75065j31177K1449A39111
$$ 247159 498839 545680 717128 647972 593254 878579 503514 372337 393786 139111
14843E13179K8674M2280n7032M0547j84768K86766A87439L46005A86882L6625
$$ 513179 541853 584133 527101 567648 382880 669646 187439 533444 186882 223507
14833B23507L57839K69456k40255N18474o5766k3301P8705j05367L69206l70273
$$ 223507 581346 850802 610547 1129021 1063255 1039954 1118659 1013292 1382498 1012225
14823A012225J24721k92822q6416L8021j68086m0484r5016M03707D46601l5360
$$ 1012225 1136946 844124 757708 795729 627643 587159 492143 895850 446601 411241
14813D11241J5467K83978k8594p0630Q7166o1676K79703C95685J95175J47418
$$ 411241 426708 710686 682092 611462 698628 636952 916655 395685 590860 738278
14803G38278K47929l44088J48303J29477j74835R852Q8045C16357J88088J10239
$$ 738278 986207 642119 790422 919899 745064 754916 842961 316357 504445 614684
14793F14684n5173J01713K14270J19226j40674J21889R1100l67168k07600N2788
$$ 614684 559511 661224 875494 994720 854046 975935 1067035 699867 492267 545055
14783E45055j46572J60040r4616K2057J66266l01075P4577J52992k4030M39974
$$ 545055 398483 558523 463907 485964 652230 351155 425732 578724 554694 994668
14773I94668j77633N3528D17162K64828K26394j63227r4311L78929j85472l93147
$$ 994668 817035 870563 417162 681990 908384 745157 650846 1029775 844303 451156
14763D51156M93619k08909J25441J651q1266L93249p3097o8499l6216q0449j79757
$$ 451156 944775 735866 861307 862958 781692 1174941 1101844 1033345 997129 916680 736923
14752G36923q456J73338l11648Q2721j09589K7143m4447j0478l1936Q6076m6159
$$ 736923 728467 901805 590157 672878 563289 590432 545985 535507 503571 589647 543488
14741E43488J25066K25264l55776K62202j672j86800Q4036J47948l24603L59501
$$ 543488 668554 893818 538042 800244 798572 611772 695808 843756 519153 878654
14731H78654k20703J38886Q5818k81607N0736K24415J60221l58674K78346j21233
$$ 878654 657951 796837 882655 601048 651784 876199 1036420 677746 956092 834859
14721H34859o6060r0334p1398K94199K99732o8964K74390K26324k09645L23196
$$ 834859 768799 678465 607067 901266 1200998 1132034 1406424 1632748 1423103 1746299
14711A746299m5817l40236J91795m97809R7055j60283J00743j21215J34145q9670
$$ 1746299 1700482 1360246 1552041 1054232 1151287 991004 1091747 970532 1104677 1015007
14701A015007k50565J72848r1578r8942J36178o7875J8998K47370J64847M0592
$$ 1015007 764442 937290 845712 746770 882948 815073 834071 1081441 1246288 1286880
14691A286880J64961k90488L23643J38518j07556J37144O9249P738r8360k00195
$$ 1286880 1451841 1161353 1484996 1623514 1515958 1653102 1722351 1730089 1631729 1431534
14681A431534j88586n3086k02556J22203m59938j7435O05705o08701L53741r877
$$ 1431534 1242948 1189862 987306 1109509 649571 632136 1237841 629140 982881 973004
14671I73004j00836K80708k49317J13300N0591j15536j13670K38762l08640L61363
$$ 973004 872168 1152876 903559 1016859 1067450 951914 838244 1077006 768366 1129729
14661A129729j49694P3484j23689R0512K84026E79417J79410M29832k64978L36229
$$ 1129729 980035 1053519 929830 1020342 1304368 579417 758827 1188659 923681 1259910
14651A259910k35130N0406j81550k18638M5848L04683J47595k15321m1154M76224
$$ 1259910 1024780 1075186 893636 674998 720846 1025529 1173124 957803 916649 1392873
14641A392873j43360J60037j54842J76466K72413l77742M1670j70039j94887n6252
$$ 1392873 1249513 1409550 1254708 1431174 1703587 1325845 1367515 1197476 1002589 946337
14631I46337K86058m4958j5932K81822o39797L77864o6936r8342K41359K8778
$$ 946337 1232395 1187437 1171505 1453327 813530 1191394 1124458 1026116 1267475 1296253
14621A296253k15765M42390k10917j19241k58751L42998J96223K963j34776Q1265
$$ 1296253 1080488 1522878 1311961 1192720 933969 1276967 1473190 1476153 1341377 1422642
14611A422642k1359k56206l0203K41447l4155O2875O32416l73850m43942O39990
$$ 1422642 1401283 1145077 1114874 1356321 1322166 1385041 2017457 1643607 1199665 1839655
14601A839655m38670j69223K59487K24290k08025K62092l56978M4426j09386J43966
$$ 1839655 1400985 1231762 1491249 1715539 1507514 1769606 1412628 1457054 1347668 1491634
14591A491634j8417R5861m41011J70792K33279M8649M6889J50324m91797K15398
$$ 1491634 1473217 1569078 1128067 1298859 1532138 1580787 1627676 1778000 1286203 1501601
14581A501601L60834l63803O14187l94924l0871M81503j18917q6265l19425P291
$$ 1501601 1862435 1498632 2112819 1717895 1687024 2168527 2049610 1963345 1643920 1651211
14571A651211K10097J89923l61584P6973K21857J8065m74052M50662m2142J75036
$$ 1651211 1861308 2051231 1689647 1766620 1988477 2006542 1532490 1983152 1941010 2116046
14561B116046M4649J85034j70716o7023J09466q4929O2775k09641K21579K46551
$$ 2116046 2160695 2345729 2175013 2107990 2217456 2132527 2195302 1985661 2207240 2453791
14551B453791M3598k15126L42431r1895j40641J87176L66879N7089J35708K7634
$$ 2453791 2497389 2282263 2624694 2532799 2392158 2579334 2946213 3003302 3139010 3166644
14541C166644O17351J54420L16942L16214R50576Q05309J221869K533573L463285
$$ 3166644 3783995 3938415 4255357 4571571 5522147 6327456 7549325 10082898 13546183
14532A3546183O496510J0698673N325737j7028189r517476l678101j401371o04236
$$ 13546183 20042693 30741366 36067103 19038914 9521438 5843337 4441966 3837730
14524C837730k69411K14844M99612J219244j773888p45640k80120k37791P4654
$$ 3837730 3568319 3783163 4282775 5502019 3728131 2982491 2702371 2464580 2539234
14515B539234k57060K05248j39263l88914K97232P3412J90224l50638P4233K86943
$$ 2539234 2282174 2487422 2348159 1959245 2256477 2329889 2520113 2169475 2243708 2530651
14505B530651k38883j10104K02746r2751j241O29806j59093q2371k0202K08550
$$ 2530651 2291768 2181664 2384410 2291659 2290418 2920224 2761131 2678760 2658558 2867108
14495B867108r5649K94728l28437K68636m0784J62727J02526N4974j54568r2665
$$ 2867108 2771459 3066187 2737750 3006386 2965602 3128329 3230855 3285829 3131261 3038596
14485C038596L7342j9611K62184l55968M56166R9766k72203K07585j4017k9399
$$ 3038596 3075938 3056327 3318511 2962543 3418709 3518475 3246272 3453857 3439840 3410441
14475C410441m751r0640K55550q0091J23373K69257j90517J36784k01903K70269
$$ 3410441 3405690 3315050 3570600 3490509 3613882 3883139 3692622 3829406 3627503 3897772
14465C897772j71656J72813J79263J45839l37218L38579k26442K40301j9726K46838
$$ 3897772 3726116 3898929 4078192 4224031 3886813 4225392 3998950 4239251 4219525 4466363
14455D466363j3328J7298j83206K27582J25984M1111l27841O56792j80585k81302
$$ 4466363 4453035 4470333 4287127 4514709 4640693 4681804 4353963 5010755 4830170 4548868
14445D548868O80870K6912j49401M1586j19999N5989J7878J11056r1037K55620
$$ 4548868 5229738 5256650 5107249 5148835 5028836 5084825 5102703 5213759 5122722 5378342
14435E378342J7463J3848K8119J28397L00133k97603P3221K18315J05115R6919
$$ 5378342 5395805 5409653 5437772 5566169 5866302 5568699 5641920 5860235 5965350 6062269
14425F062269J84589l30082O83065m94480M34262K5121L4056j6237L90565q0121
$$ 6062269 6246858 5916776 6599841 6105361 6539623 6564744 6598800 6582563 6973128 6893007
14415F893007L17382M4096n9943M73262j20314J21021l4807K07283L28458k3575
$$ 6893007 7210389 7254485 7194542 7667804 7547490 7668511 7633704 7840987 8169445 8145870
14405H145870O1542N61649L54868n86060K62885M54838m75144K46127J13469J67538
$$ 8145870 8207412 8769061 9123929 8537869 8800754 9255592 8780448 9026575 9140044 9307582
14395I307582K44704K42524k17554M75575M05555j77962K12730M14366l38650
$$ 9307582 9552286 9794810 9577256 10052831 10458386 10280424 10493154 10907520 10568870
14386A0568870r205M00334K81955L7133P9538J4466K30710N46742j30595P233
$$ 10568870 10559665 10959999 11241954 11279087 11358625 11373091 11603801 12150543 12019948 12027181
14376A2027181O75040K70959K80408J0934O31089j80610K06446M45129M06879
$$ 12027181 12702221 12973180 13253588 13264522 13895611 13715001 13921447 14366576 14773455
14367A4773455M68670K87788K59614K63989L93938j29760K30316L19720L30347
$$ 14773455 15242125 15529913 15789527 16053516 16447454 16317694 16548010 16867730 17198077
14358A7198077L31623K9463N25335O82638N2939L79340O73906N40794K37332K07916
$$ 17198077 17529700 17559163 18084498 18767136 18820075 19199415 19873321 20414115 20651447 20859363
14348B0859363L95088O93844N32758J76374N78385L83870P06309M12152Q76993
$$ 20859363 21254451 21948295 22481053 22657427 23235812 23619682 24325991 24738143 25615136
14339B5615136J17533J182901N32255Q44010N15328M71453R58841N62003P87865
$$ 25615136 25732669 26915570 27447825 28291835 28807163 29278616 30237457 30799460 31587325
14330C1587325Q09229J012083J010717J027222N95242J096992J104069J216816
$$ 31587325 32396554 33408637 34419354 35446576 36041818 37138810 38242879 39459695
14322C9459695J251649J007136J316537J285190J342949J295390J676876J365169
$$ 39459695 40711344 41718480 43035017 44320207 45663156 46958546 48635422 50000591
14314E0000591J566893J688991J915304J772159K079990K080987K136868K177531
$$ 50000591 51567484 53256475 55171779 56943938 59023928 61104915 63241783 65419314
14306F5419314K626189K336258K357275L028709K999259K595602L457586L307787
$$ 65419314 68045503 70381761 72739036 75767745 78767004 81362606 84820192 88127979
14298H8127979L457591L664787M043064M169104M192826M978491N153639N438063
$$ 88127979 91585570 95250357 99293421 103462525 107655351 112633842 117787481 123225544
14290A23225544N427661O232396O346354O708168P365639P261525Q155276Q491841
$$ 123225544 128653205 134885601 141231955 147940123 155305762 162567287 170722563 179214404
14282A79214404R067292R067960J0857520J0569247J1213239J1622706J2645287
$$ 179214404 188281696 197349656 208207176 218776423 229989662 241612368 254257655
14275B54257655J3469714J3803319J4023909J4922799J4723771J5150299J4642889
$$ 254257655 267727369 281530688 295554597 310477396 325201167 340351466 354994355
14268C54994355J4425452J3488485J2593335J1480923J0739280R371158Q444601
$$ 354994355 369419807 382908292 395501627 406982550 417721830 427092988 435537589
14261D35537589Q435133P687666O586403L684223K553682K034997K004554n35051
$$ 435537589 443972722 451660388 458246791 461931014 464484696 466519693 468524247 467989196
14253D67989196n300206o883184j0236111j0338736j3619166j3370516j4692312
$$ 467989196 462688990 455805806 445569695 435230959 421611793 408241277 393548965
14246C93548965j3423825j4315086j4688544j4680437j4009740j4040073j3691004
$$ 393548965 380125140 365810054 351121510 336441073 322431333 308391260 294700256
14239B94700256j3506172j2787919j2408663j1628741j2134889j0636305j0179687
$$ 294700256 281194084 268406165 255997502 244368761 232233872 221597567 211417880
14232B11417880r196418r630843r853594q899501q719798q137441p718360o816257
$$ 211417880 202221462 192590619 182737025 173837524 165117726 156980285 149261925 142445668
14224A42445668o853433n788384o222871n237967n139073n195381m497538m208909
$$ 142445668 135592235 129803851 123580980 118343013 113203940 108008559 103511021 99302112
14216I9302112l775063l686591l561520l816121l324150k933211l070780k379765
$$ 99302112 95527049 91840458 88278938 84462817 81138667 78205456 75134676 72754911
14208G2754911k774785k402813k155322k299775k108543k053040j955821j641264
$$ 72754911 69980126 67577313 65421991 63122216 61013673 58960633 57004812 55363548
14200E5363548j707553j933994j128052j303143j752766j708928j295119j095431
$$ 55363548 53655995 51722001 50593949 49290806 47538040 45829112 44533993 43438562
14192D3438562j039248j203006j269480j345908j132987n68969j053481m71883
$$ 43438562 42399314 41196308 39926828 38580920 37447933 36878964 35825483 35353600
14184C5353600j191187r58409r30729q31923n82275j055622p20338n60915p84601
$$ 35353600 34162413 33204004 32273275 31441352 30859077 29803455 29083117 28522202 27737601
14175B7737601p10747n02202o76464n11876p20679l41675n54187p12564n66011
$$ 27737601 27026854 26524652 25848188 25336312 24615633 24273958 23719771 23007207 22441196
14166B2441196j05289p40563l76626k99691m66013n94295k90795k69527k68414
$$ 22441196 22335907 21595344 21218718 20919027 20453014 19858719 19567924 19298397 19029983
14157A9029983o14944l13461m32726j62568q18948j89999J61483n89503O3163
$$ 19029983 18415039 18101578 17668852 17506284 16687336 16497337 16658820 16069317 16132480
14148A6132480n51630k94808m75904K39698q86414j52683j61269n6354j80947
$$ 16132480 15580850 15286042 14810138 15049836 14163422 14010739 13849470 13793116 13612169
14139A3612169l81306J3244k46115m82584q5112l43195J70436l58838l26984l21835
$$ 13612169 13230863 13244107 12997992 12515408 12430296 12087101 12257537 11898699 11571715 11249880
14129A1249880n1617M5077n77392K20911p1739l54342n7147r9650m44466j78400
$$ 11249880 11198263 11243340 10665948 10886859 10815120 10460778 10403631 10303981 9859515 9681115
14119I681115k14071P4309J46793m89397j01113k2330l1037k90653j24126L04264
$$ 9681115 9467044 9541353 9688146 9198749 9097636 9075306 9044269 8753616 8629490 8933754
14109H933754k38278l33448o1861j86401o3022m39j37988J17277n1074n57263
$$ 8933754 8695476 8362028 8300167 8113766 8050744 8050305 7912317 8029594 7978520 7421257
14099G421257k67451M46335l43783j11444n2288r197j79510j41664J44084k86267
$$ 7421257 7153806 7600141 7256358 7144914 7092626 7083429 6903919 6762255 6906339 6620072
14089F620072q6231k53107p7932O4210J78765p9529k45720R5761n20028J90451
$$ 6620072 6533841 6280734 6202802 6267012 6445777 6366248 6120528 6216289 5696261 5886712
14079E886712K4097J04892k77485j10044M1708p6217o09875L65195j76429L72409
$$ 5886712 5910809 6015701 5738216 5628172 5669880 5593663 4983788 5348983 5172554 5544963
14069E544963n78313L53971N2582m67867M2818l06053J08166K18832q3096k37703
$$ 5544963 4966650 5320621 5373203 4905336 4948154 4642101 4750267 4969099 4886003 4648300
14059D648300J13643j35661J87885k25543r7191j09436L4732l47044Q2167J20561
$$ 4648300 4761943 4626282 4814167 4588624 4491433 4381997 4416729 4069685 4151852 4272413
14049D272413J16995J2359k04344K22025n54333q9492M79458R1027l20578k09951
$$ 4272413 4389408 4401767 4197423 4419448 3865115 3775623 4255081 4346108 4025530 3815579
14039C815579R4200k10399J23782k22098L4388J04263R0081l9579k20234K03402
$$ 3815579 3909779 3699380 3823162 3601064 3635452 3739715 3829796 3790217 3569983 3773385
14029C773385J6572k58920K0209k33076p8403L52745l65025K18937J09661o50016
$$ 3773385 3789957 3531037 3551246 3318170 3239767 3592512 3227487 3446424 3556085 2906069
14019B906069j6269L57045j77651M73872q327m86647p238K67606l02104M48692
$$ 2906069 2889800 3246845 3069194 3543066 3534739 3048092 3040854 3308460 3006356 3455048
14009C455048n62096j64721J97195L7912L5960j99054M6612J08395r397o16271
$$ 3455048 2892952 2728231 2925426 2963338 2999298 2800244 2846856 2955251 2945854 2329583
13999B329583N82133k07959l9848M9725k12144J74662k27017r0791M4486J62423
$$ 2329583 2911716 2703757 2663909 2713634 2501490 2676152 2449135 2358344 2402830 2565253
13989B565253O1372j50793j6107l5983K18785j72442M500k25514L71048o0837
$$ 2565253 2626625 2475832 2459725 2423742 2642527 2470085 2474585 2249071 2620119 2559282
13979B559282L28819J04851P46465L98774Q48937J561272L001945N224129R882607
$$ 2559282 2888101 2992952 3739417 4138191 4987128 6548400 9550345 14774474 24657081
13970B4657081J3108535j3106559j0324069m769536k560098j328454p64480o27884
$$ 24657081 37765616 24659057 14334988 9565452 7005354 5676900 4912420 4284536
13962D284536l28189l21476n11293k0425n3981m7235n9323j92023j08506K08791
$$ 4284536 3956347 3634871 3123578 3103153 3049172 3001937 2942614 2750591 2642085 2850876
13952B850876l09223j45451J20483J42900j11208j61593l26636N56953j83573
$$ 2850876 2541653 2396202 2516685 2659585 2548377 2386784 2060148 2617101 2433528
13943B433528k55047L50182k70632J52790l09828p5015J21522j76916J17835J69839
$$ 2433528 2178481 2528663 2258031 2410821 2100993 2025978 2147500 1970584 2088419 2258258
13933B258258l11300k95662n0075N69129n60567K79349J49259m04160K51470k5614
$$ 2258258 1946958 1651296 1601221 2170350 1609783 1889132 2038391 1634231 1885701 1860087
13923A860087k0650J56172j39023J34513j50530m0701O834m58659N47085r5190
$$ 1860087 1839437 1995609 1856586 1991099 1840569 1799868 1806702 1348043 1895128 1799938
13913A799938j09010k8771l50505N42672j63700j22514J25284l53669K45777L32260
$$ 1799938 1690928 1662157 1311652 1854324 1690624 1568110 1693394 1339725 1585502 1917762
13903A917762m27207j6811O4567R9244J13803k75502k20209K53972O2653j77838
$$ 1917762 1490555 1473744 1538311 1637555 1751358 1475856 1255647 1509619 1572272 1394434
13893A394434L61166j514k30165n013j44704M14653m08164J13857L13248l40767
$$ 1394434 1755600 1754086 1523921 1518908 1374204 1788857 1380693 1494550 1807798 1467031
13883A467031j91596j49497O0997N6180J46258J48109k37947J12636l157k4252
$$ 1467031 1275435 1125938 1186935 1243115 1389373 1537482 1299535 1412171 1409014 1384762
13873A384762J74545l00145k8037K25743k43715l90660M04665j59818j65475P07248
$$ 1384762 1559307 1259162 1231125 1456868 1213153 822493 1227158 1067340 901865 1609113
13863A609113j63754j36643j34907k1480M54819o37963O64249m14313k03815J19965
$$ 1609113 1445359 1308716 1173809 1152329 1607148 969185 1633434 1219121 1015306 1135271
13853A135271M0404K144N7687j35259J70007l8017l34310j37170K88545l0332
$$ 1135271 1175675 1177819 1235506 1100247 1270254 1232237 897927 760757 1049302 1018970
13843A018970K53699j15101j9193Q0788l07579K98928l09869J69962J71382j57334
$$ 1018970 1272669 1157568 1138375 1219163 911584 1210512 900643 1070605 1241987 1084653
13833A084653l14146L86516j96900J9430R7851P2710J8038k26761R5146l0101
$$ 1084653 770507 1157023 960123 979553 1077404 1150114 1168152 941391 1036537 1006436
13823A006436k38615L06666j21873R7165J59950k968l42585J34303j24009j46030
$$ 1006436 767821 1074487 952614 1049779 1209729 1206761 864176 998479 874470 728440
13813G28440J16187M3780n6504j02227K83779L36065k67699n8739j51866l2410
$$ 728440 844627 888407 831903 729676 1013455 1349520 1081821 1023082 871216 838806
13803H38806J42027p8807k2894K58790j35613j19556J37164j01888O0912Q6757
$$ 838806 980833 902026 879132 1137922 1002309 882753 1019917 918029 978941 1065698
13793A065698m8363O0459o9875r4761N5391j59854J25702k6187j84750j23153
$$ 1065698 1017335 1077794 1007919 913158 968549 808695 934397 908210 723460 600307
13783F00307K481N30233m51785M66400l67625K6542J90028j93662P3142K67233
$$ 600307 602788 1133021 681236 1147636 780011 806553 996581 802919 876061 1143294
13773A143294l93612k2332j4391R9041R1737r6764k94350J69818O3664n739k99948
$$ 1143294 749682 727350 712959 812000 903737 806973 512623 682441 746105 740366 440418
13762D40418J53558R886L44287l08108k3938r0253J61889M72718m94642k12817
$$ 440418 593976 603862 948149 640041 616103 525850 687739 1160457 665815 452998
13752D52998O33854k43583k15456J69162j06667L16408C31102K93672L68682C83587
$$ 452998 1086852 843269 627813 796975 690308 1006716 331102 624774 993456 383587
13741E50651K98491P5110k85145J02397m1720M3354M0554j67466j02656K67070
$$ 550651 849142 924252 639107 741504 699784 743138 783692 616226 513570 780640
13731G80640k87076L26624p8605j20052n8697l9030k6606j04484P9890j03803
$$ 780640 493564 820188 741583 621531 562834 523804 497198 392714 472604 368801
13721C68801M98976j54710R1229m6704l38002J6071L03397B39023K39890J73199
$$ 368801 867777 713067 804296 757592 419590 435661 739058 239023 478913 652112
13711F52112k4961J76143k70047K08577l51155L64588j72353M9840R8508B87103
$$ 652112 627151 803294 533247 741824 390669 755257 582904 632744 731252 287103
13700D65788L57160k79391j48626J4799M0126J32382j2182k20916M1587J48107
$$ 465788 822948 543557 394931 409730 449856 582238 570056 349140 390727 538834
13690E38834f6772F43433k51557Q4830r619k14930M17129q6755B45832L94539
$$ 538834 -66772 643433 391876 476706 467087 252157 669286 582531 245832 640371
13680F40371j47257m3877J74566k19878J56511j66454A64895K93317q381N12017
$$ 640371 493114 449237 623803 403925 560436 393982 164895 458212 449831 961848
13670I61848C28868R3388p2308j25085L47996J7060K13133k10254k25063J66737
$$ 961848 328868 422256 349948 224863 572859 589919 803052 592798 367735 534472
13660E34472o6997O7529q2529K20686A35376O63673l85832K38328l18715J89146
$$ 534472 467475 535004 452475 673161 135376 799049 413217 651545 332830 521976
13650E21976j0382K17586k74778K60096k8303j49114j43685J36390J15023j3270
$$ 521976 511594 729180 454402 714498 686195 537081 393396 529786 644809 631539
13640F31539B59194M17850m9253N50596C09226k35L81937k06174r5067j68337
$$ 631539 259194 677044 627791 1178387 309226 308991 690928 484754 389687 221350
13630B21350J90551P0881p7357A30119J20818L79836j05056j70774j02131L86223
$$ 221350 411901 482782 405425 130119 250937 630773 525717 354943 252812 639035
13620F39035j66511n2935B02914K80270J86140k4126B50153J90378j38763R8572
$$ 639035 472524 419589 202914 483184 669324 645198 250153 440531 301768 400340
13610D00340r00j68954J27520N2776A27070L12063p8154j55532L38237m7931j85192
$$ 400340 399440 230486 358006 410782 127070 439133 360979 205447 543684 495753 310561
13599C10561N8722L67195B12188L76262n4130A50514O2014q9150J70999L912J25278
$$ 310561 369283 736478 212188 588450 534320 150514 212528 123378 294377 298289 423567
13588D23567o3592j13847K23236k03976L18750k09358M5467K6489N1873o2834
$$ 423567 359975 246128 469364 265388 584138 374780 420247 446736 498609 435775
13578D35775j38960J31469o5377J43365J29792B89855K86882j18647k12689L2758
$$ 435775 296815 428284 362907 506272 636064 289855 576737 458090 245401 278159
13568B78159J7454j28332K58829m4133L17634C27111j707l4418j01709K35022
$$ 278159 295613 167281 426110 381977 699611 327111 325404 290986 189277 424299
13558D24299J2980m3717m036J87374B16343L83346L5679A78053l1059g9578B31303
$$ 424299 437279 393562 389526 576900 216343 599689 635368 178053 146994 -79578 231303
13546D02581l5413j01266J51869n722L4676O972r2570O9726A53755J86719J33821
$$ 402581 367168 265902 417771 412049 446725 453697 361127 430853 153755 340474 474295
13535D74295K942m8573B01824P0458A25089J1373L3367l9051K43919A83799K58357
$$ 474295 477237 428664 201824 272282 125089 136462 169829 130778 374697 183799 442156
13524D42156l8423A32053j3317M64263F7885M88946B51707L0665K888R4945j82277
$$ 442156 403733 132053 118736 582999 67885 556831 251707 282372 285260 380205 197928
13513A97928k2191N3604j02463L03792H6075J36047M9915K44305H2845K0627K24263
$$ 197928 175737 229341 126878 430670 86075 222122 272037 516342 82845 103472 327735
13502C27735j15741J52883j66927J69952j3388j24471I9987J67405k0802K43354
$$ 327735 211994 364877 197950 367902 354514 230043 99987 267392 246590 489944
13492D89944Q3043p1002R7085K1205E3137J04718n4554P8345K47506A08582J50085
$$ 489944 572987 501985 599070 620275 53137 157855 103301 181646 429152 108582 258667
13481B58667K3120N4339K8135A31846a4345C29356C9082J0985N8098h6951A25236
$$ 258667 281787 336126 364261 131846 -14345 329356 39082 50067 108165 -86951 125236
13469D55839A05850K53783p0819J35171b6687F80003A63096R1960R1970p6728
$$ 455839 105850 359633 288814 423985 -26687 680003 163096 255056 347026 270298
13459B70298j34006O8306J24743E5292J71112Q7885d95I5312L44467J88276j29186
$$ 270298 136292 204598 329341 55292 226404 314289 -495 95312 439779 628055 498869
13448D98869B02442N069E0843a49604A23866K00761A56317J77300A14871M82495
$$ 498869 202442 207511 50843 -149604 123866 324627 156317 333617 114871 597366
13438E97366k78408A00357J28296F6394J5933N0051R1525J7723K24706j72146
$$ 597366 318958 100357 228653 66394 82327 132378 223903 241626 466332 294186
13428B94186l8565D4221K33861L2614H1867e277C90425l6777P4372a47246m9701
$$ 294186 255621 44221 278082 310696 81867 -5277 390425 353648 428020 -147246 -196947
13417a96947B21999b141j70666G8838P0316L24587k25995k9684Q2141A35291K17325
$$ -196947 221999 -2141 -172807 78838 149154 473741 247746 218062 300203 135291 352616
13406C52616o5135o9251k9494J9409P59I8960K43673A29885a71710B34509Q3529
$$ 352616 287481 218230 188736 208145 208904 98960 342633 129885 -171710 234509 318038
13395C18038A56260f8461B10158L71918A82581M0884O2774H5795l2628j9299a31550
$$ 318038 156260 -68461 210158 582076 182581 223465 286239 85795 53167 33868 -131550
13383C11290C6962M6196j2904L44109K983j70598G2689L37056q8453B6447J55007
$$ 311290 36962 83158 70254 414363 417346 246748 72689 409745 321292 26447 181454
13372A81454a14296B71868E018J73412j4647Q8612r9225n4047J40439p7j4239
$$ 181454 -114296 271868 5018 178430 163783 252395 153170 99123 239562 239485 225246
13361B25246I3081L4528K89152o7659C7904K98772j52911J90003j62024j6883
$$ 225246 93081 127609 416761 349102 37904 336676 183765 373768 211744 194861
13351A94861E1594P8902C2514R8567J18862c5904B09806J52041c5131A06621J03584
$$ 194861 51594 130496 32514 131081 249943 -35904 209806 361847 -35131 106621 210205
13340B10205O5853L00713B16542K30732A58018K73013B15059D2004J24742P7703
$$ 210205 276058 576771 216542 447274 158018 431031 215059 42004 166746 244449
13330B44449J91156j55948O9482J8936A30061M32206j90780r2486r065L80316
$$ 244449 435605 279657 349139 368075 130061 562267 371487 279001 269936 650252
13320F50252B68117J70561l160j86835A1021K29977R0698H0461K09966F5905m546
$$ 650252 268117 438678 435518 248683 11021 240998 331696 80461 290427 65905 61359
13309F1359Q3277j6479m6803K16806A7614J11421M19379A05305N66152C31847
$$ 61359 144636 128157 81354 298160 17614 129035 548414 105305 671457 331847
13298A98849M9367o6877J10593Q8858M4696m7946m870n4181j9069b6793D2298
$$ 198849 248216 181339 291932 380790 425486 377540 372670 318489 299420 -26793 42298
13286h5580n2755B34266J74042A00996J12658B2420q713J75248J17407r8922N0847
$$ -85580 -138335 234266 408308 100996 213654 22420 13707 188955 306362 207440 258287
13275B58287j5791g5113D07295n2311E4212R1347m2463M9649J82560A17829l7132
$$ 258287 242496 -75113 407295 354984 54212 145559 103096 152745 335305 117829 80697
13264H0697J61097k7757K54520A34921K24895A35833L44332b00695B76002A11075
$$ 80697 241794 214037 468557 134921 359816 135833 480165 -200695 276002 111075
13253h6067B42334b2319B74354H609h8270A49296p0033k5922K51430e2551C84238
$$ -86067 242334 -22319 274354 8609 -88270 149296 79263 53341 304771 -52551 384238
13241i7095B0695M293L82393j62047q8885j2938a0064o5584A68738C6395R2434
$$ -97095 20695 24988 407381 245334 156449 143511 -10064 -75648 168738 36395 128829
13230A28829J26022I1728h2311c2371o8748A81394J17933j12823L0512f1952k3338
$$ 128829 254851 91728 -82311 -32371 -101119 181394 299327 186504 217016 -61952 -85290
13219h5290C63688n5642a38889A70796R2813d9181B49919j04137o4820J95501
$$ -85290 363688 308046 -138889 170796 263609 -49181 249919 145782 80962 276463
13209B76463A26185J23561A24622Q5784b23205R8719e1468H1534K44396a11638
$$ 276463 126185 249746 124622 210406 -223205 -124486 -51468 81534 325930 -111638
13198C94966j42038D2144a47385b3070B2619e7335E9100Q4296R5635J2154b5337
$$ 394966 252928 42144 -147385 -23070 22619 -57335 59100 143396 239031 251185 -25337
13186A8178O2107a17973A71704q0972a95812c5073c023j70079C42098J49067P0682
$$ 18178 80285 -117973 171704 90732 -195812 -35073 -3023 -173102 342098 491165 561847
13175E61847b42873a16976C08228A878d8785A05511i0013A14000K91834h3779
$$ 561847 -242873 -116976 308228 1878 -48785 105511 -90013 114000 405834 -83779
13164c47461A70862e9636A88487h1988j43876e8426B06445J13718a78142G5981
$$ -347461 170862 -59636 188487 -81988 -225864 -58426 206445 320163 -178142 75981
13153D8946e0052k6603m2034E0857f4782K6873B73428A8728a79881Q0862H2856
$$ 48946 -50052 -76655 -118689 50857 -64782 -37909 273428 18728 -179881 -99019 82856
13141A87481r1540K6897I886N7540J47052k4597a22859B56205A7867K47750a20243
$$ 187481 95941 122838 9886 67426 214478 189881 -122859 256205 17867 265617 -120243
13129B1238K04080g768k32202C36258d30997B84020b23731A28986m7081A3669
$$ 21238 225318 -7768 -239970 336258 -430997 284020 -223731 128986 81905 13669
13118b41555A63472a86403P7564n6230F0814J21675K17933C4497a6556D97222
$$ -241555 163472 -186403 -108839 -165069 60814 182489 400422 34497 -16556 497222
13107A06254A558g6272A58356j408j6831a30621o9149d6332D9353J97522D8344
$$ 106254 1558 -76272 158356 156948 140117 -130621 -199770 -46332 49353 246875 48344
13095B8157e373A0649J73437a30701B01860f6435A93393H1577b16603D3965a9574
$$ 28157 -5373 10649 184086 -130701 201860 -66435 193393 81577 -216603 43965 -19574
13083a14915A65049b02174B95439a7962m2690q8886A72070c39131i3351B74804
$$ -114915 165049 -202174 295439 -17962 -60652 -149538 172070 -339131 -93351 274804
13072I5305Q4799E6971M49054G0366a1882H0363M10809a73048C1178d22576C2412
$$ 95305 180104 56971 506025 70366 -11882 80363 491172 -173048 31178 -422576 32412
13060a1789m8420b412l36508A0774L31119o6765J77292a21579H1121K3142D5693
$$ -11789 -60209 -2412 -338920 10774 341893 275128 452420 -121579 81121 104263 45693
13048I9953J83707N3329j35914J19062q0161I1342a57996I6015j634a29308A15629
$$ 99953 283660 336989 201075 320137 239976 91342 -157996 96015 94381 -129308 115629
13036A67317J10264C7101J61356o7384E6438L39474G9662M1158p683L9333a78272
$$ 167317 277581 37101 198457 131073 56438 395912 79662 120820 113137 152470 -178272
13024e1053G14K35248L6083g1077A62892N2085L730G1282M24539B17370L2646
$$ -51053 714 235962 272045 -71077 162892 214977 218707 71282 495821 217370 250016
13013B50016a58093A48103a60890a8449E8945b07340A78110h4320D5363P6421
$$ 250016 -158093 148103 -160890 -18449 58945 -207340 178110 -84320 45363 121784
13003A21784j3036J10180j1325n143m4065G027d6406B17003L5407a08887j9138
$$ 121784 108748 218928 207603 202460 158395 7027 -46406 217003 252410 -108887 -128025
12992a28025B48492A01437p557J26450c5357p039p0710D55603k38e811p1103F6173
$$ -128025 248492 101437 93880 220330 -35357 -42396 -113106 455603 455365 -5811 -76914 66173
12979D8934J58142p7852C2236a4829j14847A76215O6033r2193O405D2476J37448
$$ 48934 207076 129224 32236 -14829 -129676 176215 242248 150055 156460 42476 179924
12968A79924f3100A44956a45768E9563B6389J23205f6478L0579l0523I4426j1817
$$ 179924 -63100 144956 -145768 59563 26389 149594 -66478 -35899 -66422 94426 82609
12957H2609a8455k9882G1402j7321b18284e0500A2161J61861a10894A09593a02028
$$ 82609 -18455 -48337 71402 54081 -218284 -50500 12161 174022 -110894 109593 -102028
12945b60398e3407B03843b76562b1963G9619A5186a88988b5911A70306e8213o4003
$$ -260398 -53407 203843 -276562 -21963 79619 15186 -188988 -25911 170306 -58213 -122216
12934a22216B61023c020l14121G9575o124d244E0028J45263b70796D21184C9478
$$ -122216 261023 -3020 -317141 79575 73451 -4244 50028 195291 -270796 421184 39478
12922b3411j64174B64918c20763e4996k58767a7409C9419b9823A31139i9177j21279
$$ -23411 -187585 264918 -320763 -54996 -313763 -17409 39419 -29823 131139 -99177 -220456
12911b20456J05253B37567a2823k11610F785a61144N3955d9611H9791k0428a24982
$$ -220456 -115203 237567 -12823 -224433 6785 -161144 -107189 -49611 89791 69363 -124982
12899A25310M7908k0456d4631C95392A06889a06977H9206c43013c8004l0684A74738
$$ 125310 173218 152762 -44631 395392 106889 -106977 89206 -343013 -38004 -68688 174738
12887A11389Q4139F1545K09577I1887a67638g1566C92799b06199g409k8186B33423
$$ 111389 195528 61545 271122 91887 -167638 -71566 392799 -206199 -7409 -35595 233423
12875B65910g6189A06014C4892a57843A68893F986K42096a61036A67331M7207
$$ 265910 -76189 106014 34892 -157843 168893 6986 249082 -161036 167331 214538
12865B14538D4543P8943d5335k3137C69726C6777d2591B71617j7940b25092Q0883
$$ 214538 44543 123486 -45335 -68472 369726 36777 -42591 271617 253677 -225092 -144209
12854a44209B30697m0962h8266C82500e9730l9310A27833j5019g9542A40746b7099
$$ -144209 230697 189735 -88266 382500 -59730 -99040 127833 112814 -79542 140746 -27099
12842I6178a720A06304c35504i3792A60789b18535a5259C2903R9071P2373a20574
$$ 96178 -1720 106304 -335504 -93792 160789 -218535 -15259 32903 131974 204347 -120574
12830A66916c7333k6113G5313b2748b741j73883k4412H4155J28621d0925D04447
$$ 166916 -37333 -63446 75313 -22748 -2741 -176624 -201036 84155 212776 -40925 404447
12818A66305a00304d4786G6345b18460B20395a77902j03212K5961K5778C8332
$$ 166305 -100304 -44786 76345 -218460 220395 -177902 -281114 -255153 -229375 38332
12807E0345N4914a19016H9459N8898d4584j04601a1765e805k32622B6082P470
$$ 50345 105259 -119016 89459 148357 -44584 -149185 -11765 -5805 -238427 26082 33552
12796C3552K58021a29848C13328a14664r154j15776b2361p7913q3542e5372j42734
$$ 33552 291573 -129848 313328 -114664 -123818 -239594 -22361 -100274 -183816 -55372 -198106
12785a98106I4509R3750a26843M780d6655I6673a49833A23925l3996i1726k09703
$$ -198106 94509 188259 -126843 -122063 -46655 96673 -149833 123925 89929 -91726 -301429
12774c01429A50955i1693B26994r0863f7858o7067F8007A2830M9002N4423J53607
$$ -301429 150955 -91693 226994 136131 -67858 -134925 68007 12830 61832 116255 269862
12763B69862c8153B4395M7162b14402C4414b14985h4758F9095O8661b23532N3449
$$ 269862 -38153 24395 71557 -214402 34414 -214985 -84758 69095 137756 -223532 -170083
12752a70083B636b1724l75498A27404c52704H7574L46617f2850A44512c01480
$$ -170083 2636 -21724 -397222 127404 -352704 87574 434191 -62850 144512 -301480
12741F0955b46161a16672c7296A6594L28729K792a24438h523r7167c6715A34675
$$ 60955 -246161 -116672 -37296 16594 345323 348115 -124438 -8523 -105690 -36715 134675
12729A34693c3916j63864I8812l9141B0359J81263j4368N9392M8275a16712D2281
$$ 134693 -33916 -197780 98812 59671 20359 201622 187254 246646 294921 -116712 42281
12717f8903H9417j5447A9941N6064a48402D36662b10449C18805F9136Q2145b88416
$$ -68903 89417 73970 19941 76005 -148402 436662 -210449 318805 69136 151281 -288416
12705B78322o3670M7713b83320D7035k0970h2478J2043i603o6581A33192j9035
$$ 278322 214652 262365 -283320 47035 26065 -82478 -70435 -9603 -76184 133192 114157
12694A14157J46774B4770J81524K6202D0243J08930b62474B20940J51071f3846
$$ 114157 260931 24770 206294 232496 40243 149173 -262474 220940 372011 -63846
12683B26792g7703B66938E768b7295P459j43630A67614c0508m0443B06511D5284
$$ 226792 -77703 266938 5768 -27295 -19836 -163466 167614 -30508 -70951 206511 45284
12671C41064a30070K4100D8449R538K6120a47348R564B1276R7390J64616b6604
$$ 341064 -130070 -105970 48449 57987 84107 -147348 -137784 21276 118666 283282 -26604
12659d4931q2006B26484g02A63823n9445a97480g396A78900R0715K9681j38475
$$ -44931 -126937 226484 -702 163823 104378 -197480 -7396 178900 269615 299296 160821
12648A60821L94554f8827B21605J33210P403a46689D49784A67064D046J55809
$$ 160821 555375 -68827 221605 354815 362218 -146689 449784 167064 4046 159855
12638A59855b28766A3714b2130j48377N2990C8219M8862Q5463i3416r8097A00193
$$ 159855 -228766 13714 -22130 -170507 -117517 38219 87081 172544 -93416 -191513 100193
12626d3080C1651b6874A68836b85200B90027C4363b04892C17378F9768a93007
$$ -43080 31651 -26874 168836 -285200 290027 34363 -204892 317378 69768 -193007
12615D5192K2862a34070B42268N0550I4445J94726O1764a02139D94676b31927
$$ 45192 68054 -134070 242268 292818 94445 289171 350935 -102139 494676 -231927
12604D860b11274D79711d68444A93822a09517H5203a33523e4782j1233A70237
$$ 4860 -211274 479711 -468444 193822 -109517 85203 -133523 -54782 -66015 170237
12593G7127a36767G0940J10808C9588K68175H1897a24384A58035i2632f151o2061
$$ 77127 -136767 70940 181748 39588 307763 81897 -124384 158035 -92632 -6151 -68212
12582f8212D3834J1302Q0552h5049A26742J92149A9806a20045J5990j17908Q5690
$$ -68212 43834 55136 135688 -85049 126742 318891 19806 -120045 -104055 -221963 -136273
12571a36273c0791A81042q9515C5742a28355A59950j2135G2557J4865A224a22251
$$ -136273 -30791 181042 91527 35742 -128355 159950 147815 72557 87422 1224 -122251
12559A19422H781K47205A17791E5984e6133A47068k8590b69023C9298O8120a06493
$$ 119422 8781 255986 117791 55984 -56133 147068 118478 -269023 39298 107418 -106493
12547f6232K2360F6342a00054F7767M9086l7847J85727A08265b11778B69995d36132
$$ -66232 -43872 66342 -100054 67767 116853 79006 264733 108265 -211778 269995 -436132
12535b17799M7664E1117d4282N022a0686o8295a4721B1997a73464A33698N0154
$$ -217799 -170135 51117 -44282 -39260 -10686 -78981 -14721 21997 -173464 133698 183852
12524A83852a07717b7807B34352b47136C14011c51969I5445J55723G9282l7794
$$ 183852 -107717 -27807 234352 -247136 314011 -351969 95445 251168 79282 41488
12514D1488R3980a20218E7682b43558j14952A76890e0287j45035A6001M2867Q2548
$$ 41488 135468 -120218 57682 -243558 -358510 176890 -50287 -195322 16001 58868 141416
12503A41416M4975c9182C01739j29847a28007D5419j7539O1934R3076A6254J5774
$$ 141416 186391 -39182 301739 171892 -128007 45419 27880 89814 182890 16254 32028
12492C2028J39072n1467d0671k26990J16674N2110j03517b7952H773a3456A18897
$$ 32028 171100 119633 -40671 -267661 -150987 -98877 -202394 -27952 8773 -13456 118897
12480e0068B05112D8438h4435a3931k38813B0642R717P0294O6354a77437B51642
$$ -50068 205112 48438 -84435 -13931 -252744 20642 30359 100653 167007 -177437 251642
12468a39643B75422j10046J0068K18971A11643l8347K8452K6247l440g9338E1978
$$ -139643 275422 165376 175444 394415 111643 73296 101748 127995 124555 -79338 51978
12456D2983J59505f8691E1172A9660b30284g1573B94757r2399B0122J00122b02623
$$ 42983 202488 -68691 51172 19660 -230284 -71573 294757 202358 20122 120244 -202623
12444b07474D47581b5620q5337d7788j43953G0199b54878Q050i7522B9270b04487
$$ -207474 447581 -25620 -110957 -47788 -191741 70199 -254878 -246828 -97522 29270 -204487
12432a21113B63494G2888J79670F3765c43837F799J75386e4169j04140I3211n224
$$ -121113 263494 72888 252558 63765 -343837 6799 182185 -54169 -158309 93211 87987
12421H7987K44677E656c29774B8455K77189F3466e21884A05785a21628G4383L6045
$$ 87987 332664 5656 -329774 28455 305644 63466 -521884 105785 -121628 74383 110428
12410A10428K33549A09810B7229a51565l0152k7659A17916a38067E0717c154B96134
$$ 110428 343977 109810 27229 -151565 -181717 -209376 117916 -138067 50717 -3154 296134
12398c794D3350b54454A33758a09093E60339b93457C0726a09399F600a44657j93008
$$ -3794 43350 -254454 133758 -109093 560339 -293457 30726 -109399 6600 -144657 -337665
12387c37665A36158C4569g1865k29976A29887a98045r2164c0985j3309j62319
$$ -337665 136158 34569 -71865 -301841 129887 -198045 -290209 -30985 -44294 -206613
12377b06613B97085l4708j13933o8445A7183J53722j6184C3878e2369C9546K90687
$$ -206613 297085 262377 148444 79999 17183 170905 154721 33878 -52369 39546 330233
12366C30233a5735j35643D02824b07141A56221b24299B26517a3698B57915G5828
$$ 330233 -15735 -151378 402824 -207141 156221 -224299 226517 -13698 257915 75828
12355c8152k81853D6504a53856N1280q4241e2290B35478a30354H265a05911k50726
$$ -38152 -320005 46504 -153856 -102576 -186817 -52290 235478 -130354 8265 -105911 -356637
12344c56637H0908A2387O7295Q5689n870p318b10191D3719K40091e4737A38497
$$ -356637 80908 12387 79682 165371 159501 152183 -210191 43719 283810 -54737 138497
12332A31907g1788A31510J3149a65122A26529K8643J4633g2182B56019a30055
$$ 131907 -71788 131510 144659 -165122 126529 155172 169805 -72182 256019 -130055
12321B25810m1620l4546D4303A3822c66967F4572L6437J63211b4001C32295F1114
$$ 225810 184190 149644 44303 13822 -366967 64572 101009 264220 -24001 332295 61114
12309A57640p8815K03141J88851k20571A02436f8138C41177H8952J84714F9624
$$ 157640 78825 281966 470817 250246 102436 -68138 341177 88952 273666 69624
12298B0899c6878j1268B15671J4809a38570D2790b60243B7242Q0056N55581c8178
$$ 20899 -36878 -48146 215671 230480 -138570 42790 -260243 27242 107298 662879 -38178
12286I243d010B0253O7351J05744k6858c924q4174j03783B08838D9653Q3453D8203
$$ 9243 -4010 20253 87604 193348 166490 -3924 -88098 -191881 208838 49653 133106 48203
12273A51612a58213P6431I4038J04679g167A97516I3008c21799B34770G2982J86876
$$ 151612 -158213 -81782 94038 198717 -7167 197516 93008 -321799 234770 72982 259858
12262B59858G9124J66496i9183C95449k954j50518P0179Q5392E0397O2116J03020
$$ 259858 79124 245620 -99183 395449 392495 241977 312156 397548 50397 112513 215533
12251B15533K1230m3681k2536K0491n432f1557B06189c08933C2780P7084k6371
$$ 215533 236763 193082 170546 191037 185605 -61557 206189 -308933 32780 109864 83493
12240H3493J3892R8999I1316c7935A69827p1954O8390j900k7072q483d2468C20925
$$ 83493 97385 196384 91316 -37935 169827 97873 166263 164363 137291 128808 -42468 320925
12227b03355B6615K25699n4028M3133B419L4936K0181J72513Q974K6526a34557
$$ -203355 26615 252314 198286 241419 2419 37355 57536 230049 239023 265549 -134557
12215C73546C7125K15332q3310G5143L00680j31562k9757J37757o0692r9524J28920
$$ 373546 37125 252457 169147 75143 375823 244261 214504 352261 291569 192045 320965
12204C20965h2610D42281I8077k0786Q3870L38830B29296J13616J19524B06059
$$ 320965 -82610 442281 98077 77291 161161 499991 229296 342912 462436 206059
12193a32459A56766J33409m8030N4701K6886k5510H4715d9332A87435D6877K66676
$$ -132459 156766 290175 242145 296846 323732 298222 84715 -49332 187435 46877 313553
12182C13553j0106G8017L72394Q0123A25762L4577K74173A65295M8181f8076D57202
$$ 313553 303447 78017 450411 530534 125762 160339 434512 165295 213476 -68076 457202
12170B43121K4434J37592A42678I103J29593J24030d3972C44373A55530g1789
$$ 243121 267555 405147 142678 9103 138696 262726 -43972 344373 155530 -71789
12159C87382j43487K19221q8145f9907D4498J72467J02710j33569J40662j55212
$$ 387382 243895 463116 374971 -69907 44498 216965 319675 186106 326768 171556
12149A71556D2325K70160k3971a06628B6864K46986A2391N24425b06353d6881
$$ 171556 42325 312485 288514 -106628 26864 273850 12391 536816 -206353 -46881
12138B0655J85901r8934J68789p2953H7020L60466A73682F0561Q8936h472m5431
$$ 20655 206556 107622 276411 203458 87020 447486 173682 60561 149497 -8472 -53903
12127e3903C77190I9206l3337B3304P7977K75796I945K11436b07533A2354K02983
$$ -53903 377190 99206 65869 23304 101281 377077 9945 221381 -207533 12354 215337
12116B15337f6845A88609J33780c7144A20367R9517H5495J66716q1477e9210b0010
$$ 215337 -66845 188609 322389 -37144 120367 219884 85495 252211 170734 -59210 -20010
12104C21756C3844R140Q6555O6572K91320a29895C0699J20102N0853G4306J86744
$$ 321756 33844 42984 129539 196111 487431 -129895 30699 150801 201654 74306 261050
12093B61050m846j6852j17565f4441A03239M1979b3458j02248m8976B80070L0312
$$ 261050 256204 239352 121787 -64441 103239 145218 -23458 -125706 -174682 280070 310382
12082C10382a17549A1984a98180B12878J33219A40795J17910A774K74044m6550
$$ 310382 -117549 11984 -198180 212878 346097 140795 258705 1774 275818 229268
12072B29268k4773O430P8604l1264g6797G2027k1579R2427i63A82857q702N069
$$ 229268 204495 210925 289529 258265 -76797 72027 50448 142875 -963 182857 174155 179224
12060A79224F9975B4903K21968D6460f3655I9572k5675J64399A09692K19787a26807
$$ 179224 69975 24903 246871 46460 -63655 99572 73897 238296 109692 329479 -126807
12048A82892J50040b67007E5647L3766N7296a83623C337R331K7232L17124b23932
$$ 182892 332932 -267007 55647 89413 146709 -183623 3337 12668 39900 357024 -223932
12036B0442b26995B30330f6150a7056A64840C6528K15261m9467P087d3829A37827
$$ 20442 -226995 230330 -66150 -17056 164840 36528 251789 202322 209409 -43829 137827
12024A18317b22834j22731h3661B72514a0865C05853F5913a42658A64101f1030
$$ 118317 -222834 -345565 -83661 272514 -10865 305853 65913 -142658 164101 -61030
12013f2193C38167A09498J38887m0885F1474a04667c2087D19954J15164I2151
$$ -62193 338167 109498 248385 207500 61474 -104667 -32087 419954 535118 92151
12002A38003e4105A60724n027J15628p2963E370L26718I3244b39108A91360b67915
$$ 138003 -54105 160724 155697 271325 198362 5370 332088 93244 -239108 191360 -267915
11990B19429a624A57936n2845D26b62118A2030J57751c1288C6128M2860l8664
$$ 219429 -1624 157936 105091 426 -262118 12030 169781 -31288 36128 78988 40324
11979D0324J08112g3271A119M96597i1269p5847k52204a35635k54779c1280A35867
$$ 40324 148436 -73271 1119 497716 -91269 -167116 -419320 -135635 -390414 -31280 135867
11967b06235E7922R9767d110A15753B9744d25401K11330c7643j17862P0364j07700
$$ -206235 57922 157689 -4110 115753 29744 -425401 -214071 -37643 -155505 -85141 -192841
11956a92841g1349F5435f5904q6891B95062e6444A54236a10456H2054C3127O6767
$$ -192841 -71349 65435 -65904 -152795 295062 -56444 154236 -110456 82054 33127 99894
11945I9894a00356l349m7963k7108m1355B25171b30108G6458r685f0609j39251
$$ 99894 -100356 -103705 -151668 -178776 -220131 225171 -230108 76458 66773 -60609 -199860
11934a99860E8534Q6276i9835M0733a2976C2426M17169f6270A32223c30560b3226
$$ -199860 58534 144810 -99835 -59102 -12976 32426 449595 -66270 132223 -330560 -23226
11922A86334i3332B51768j09237a64774r3474A32250E7708K9152C5195J42653
$$ 186334 -93332 251768 142531 -164774 -258248 132250 57708 86860 35195 177848
11912A77848J40920a22402I640d9085r5290G118i5170B61455a07435A23140N9040
$$ 177848 318768 -122402 9640 -49085 -144375 7118 -95170 261455 -107435 123140 182180
11901A82180H0994b56003B57571c3318B00134a02695k79345C9502A2593a43708
$$ 182180 80994 -256003 257571 -33318 200134 -102695 -382040 39502 12593 -143708
11890A29203Q8287p4918k7887J29414i6407M4385A80702a18897C2466K79788H514
$$ 129203 217490 142572 114685 244099 -96407 -52022 180702 -118897 32466 312254 8514
11878E4679J45234j2929c32208c6564J6989A07617a80510e5886B0180P329j2138
$$ 54679 199913 186984 -332208 -36564 -19575 107617 -180510 -55886 20180 27509 15371
11867A5371K0828Q6855a37097A02269L02204e7835K2138j70111E9024c05901B09969
$$ 15371 36199 123054 -137097 102269 404473 -57835 -35697 -205808 59024 -305901 209969
11855c2564j65605C5398c27469C37641g0654G9900a22320B0019b14695K5260O7300
$$ -32564 -198169 35398 -327469 337641 -70654 79900 -122320 20019 -214695 -189435 -122135
11844a22135B24948J9999c7239l3367j34287J1959E0163Q9647l3622h431F6381
$$ -122135 224948 244947 -37239 -70606 -204893 -192934 50163 139810 106188 -8431 66381
11832A18994b5979k59640n9170a62980m3019Q4260r9927j06530Q0152E7736O2861
$$ 118994 -25979 -285619 -344789 -162980 -205999 -121739 -221666 -328196 -248044 57736 120597
11821A20597b5014o9366j45245b1281D2238A1633a33070D951h7157n8674k51041
$$ 120597 -25014 -94380 -239625 -21281 42238 11633 -133070 4951 -87157 -145831 -396872
11810c96872m6922B3788a22776k90480a38572l1820N7391A18219j2305n375a09987
$$ -396872 -443794 23788 -122776 -413256 -138572 -170392 -113001 118219 105914 100539 -109987
11798b45168j36253B3749i3817B15180l5325e6913F990b83110f5853I7532a05734
$$ -245168 -381421 23749 -93817 215180 179855 -56913 6990 -283110 -65853 97532 -105734
11786C46541c2561j26131K7539a9776k22813j55546D4704d30900A99514g5184
$$ 346541 -32561 -158692 -131153 -19776 -242589 -398135 44704 -430900 199514 -75184
11775C0984L36095B9157K82949A2638J39506J76004a47381k45654a8624A77989
$$ 30984 367079 29157 312106 12638 152144 328148 -147381 -393035 -18624 177989
11764G020f9385r537j3124p0779A08350a1751B6548D225c9669F6254J69374j15207
$$ 7020 -69385 -78922 -92046 -162825 108350 -11751 26548 4225 -39669 66254 235628 120421
11752A20421J97647B4636K6203b27292j2093A33078F5970d12155a27398j21917
$$ 120421 318068 24636 50839 -227292 -239385 133078 65970 -412155 -127398 -249315
11742b49315a07748L9760l1352r4279d971k25743j555D5005a62067b2325r6754
$$ -249315 -107748 -67988 -99340 -193619 -4971 -230714 -232269 45005 -162067 -22325 -119079
11731a19079L2304G4590L1577J39942d4825A15506M372k0199D3946c31406J50269
$$ -119079 -86775 74590 106167 246109 -44825 115506 119878 99679 43946 -331406 -181137
11720a81137b4251G6466N3246b71452j0028J26615A94851J29059c728m3691B2101
$$ -181137 -24251 76466 129712 -271452 -281480 -154865 194851 323910 -3728 -47419 22101
11708i5016p2459q4138Q6362B28977C7273K5583N7433j0080K8564B6534d038k11128
$$ -95016 -167475 -251613 -165251 228977 37273 62856 120289 110209 138773 26534 -4038 -215166
11696b15166A69582K43620j51611o6523a00425I991O4064Q549J39454c6512j86249
$$ -215166 169582 413202 261591 195068 -100425 9991 74055 82604 222058 -36512 -222761
11685b22761C77585D5476J64557P1469d8370j44967R1921A51875a51049F1500
$$ -222761 377585 45476 210033 281502 -48370 -193337 -101416 151875 -151049 61500
11674E6769K59062d2823A03810K23056a27853j5058A3736B512b96594A81118J0314
$$ 56769 315831 -42823 103810 326866 -127853 -142911 13736 2512 -296594 181118 191432
11663A91432i2339C23013G9635a99199C61171j08703a9377B1153j896m272N7930
$$ 191432 -92339 323013 79635 -199199 361171 252468 -19377 21153 19257 14985 72915
11652G2915b03962G1665a21809F0302f0854B3965h1165k74189b4467j72289k3807
$$ 72915 -203962 71665 -121809 60302 -60854 23965 -81165 -355354 -24467 -196756 -220563
11641b20563A40036a14312k0649C9072a7493F301a22623A47403C78h6031H0086
$$ -220563 140036 -114312 -134961 39072 -17493 6301 -122623 147403 378 -86031 80086
11629i5758k3883o1177j7271A62429a97046F3795K6938P5593d2865j89546B9047
$$ -95758 -119641 -180818 -198089 162429 -197046 63795 90733 166326 -42865 -232411 29047
11617a52767B04263r6167K752k9638a72845K7343j31403J32246k3125C02365A05881
$$ -152767 204263 108096 110848 81210 -172845 -145502 -276905 -144659 -167784 302365 105881
11605C3501c30801f2825F5103K04150h153A77395i446B42531J4935A2234D116
$$ 33501 -330801 -62825 65103 269253 -8153 177395 -9446 242531 257466 12234 4116
11593b23860K0945d7860K0563D9298a25947j60550e6565B08227F0162b08181j3753
$$ -223860 -202915 -47860 -27297 49298 -125947 -286497 -56565 208227 60162 -208181 -221934
11582b21934b9170A02712g2784M068q1901B40192K5364k2748E9613B8719d2263
$$ -221934 -29170 102712 -72784 -68716 -150617 240192 265556 242808 59613 28719 -42263
11570B33990N9353b86429a0727A34247O0658p9699j9736a24625j05157A13311
$$ 233990 293343 -286429 -10727 134247 194905 115206 95470 -124625 -229782 113311
11559b79464h8180C32816a04385R231D07179A20159C8484J34857K24831J14254
$$ -279464 -88180 332816 -104385 -95154 407179 120159 38484 173341 398172 512426
11549E12426B54559d2292H7260O0471K5102p8476l0447K63771j54977c60106h0644
$$ 512426 254559 -42292 87260 147731 172833 94357 63910 327681 172704 -360106 -80644
11537B37970k49H9734f5213G6228P6655J7374a49192f3272A45139e3117A13914
$$ 237970 237721 89734 -65213 76228 152883 170257 -149192 -63272 145139 -53117 113914
11525D3621L16162e7266C25654h0394C9388b97723a14808G0675a62083A96908
$$ 43621 359783 -57266 325654 -80394 39388 -297723 -114808 70675 -162083 196908
11514C58177G3649C4284b32516i5713D2936d3723r2649C65437c067j14184L4214
$$ 358177 73649 34284 -232516 -95713 42936 -43723 -136372 365437 -3067 -117251 -83037
11503h3037A71675A2144K60819A09228g2863o1353B41604H4214B979a0551k287
$$ -83037 171675 12144 272963 109228 -72863 -134216 241604 84214 2979 -10551 -12838
11492a2838A63922K34126j27697J72016E876a36657j3561a0763q3437p7132B37125
$$ -12838 163922 398048 270351 442367 5876 -136657 -150218 -10763 -94200 -171332 237125
11480B30153N135J5335d8974A38073K63341A55175A3471a0846B01720M1880C2298
$$ 230153 235288 250623 -48974 138073 401414 155175 13471 -10846 201720 243600 32298
11468g0718H8195l6371P6802L1646o7222Q5137L88135B82052A09236l2058J8709
$$ -70718 88195 51824 128626 160272 93050 178187 566322 282052 109236 77178 95887
11457I5887L06502j08957J40078j56245B0548K40282o9269l6452J17449q872b69740
$$ 95887 402389 293432 433510 277265 20548 260830 191561 155109 272558 263686 -269740
11445B86118k9025A03628b06653D80315e7715F6988L91679F2128k7936K31502
$$ 286118 257093 103628 -206653 480315 -57715 66988 458667 62128 34192 265694
11435B65694q1645G8004j8703N5058K18737C3899N17746a0702A52333M8495J50671
$$ 265694 184049 78004 59301 114359 333096 33899 551645 -10702 152333 200828 351499
11424C51499r9174h0957o9793D46078G5593p779B9408L91488E9377K42406i8263
$$ 351499 252325 -80957 -150750 446078 75593 67814 29408 420896 59377 301783 -98263
11412C5456N5508K6677a84393K1043F4524M6638m7388J58634d4716D2494g8752
$$ 35456 90964 117641 -184393 -163350 64524 111162 63774 222408 -44716 42494 -78752
11400G4308e8613I1343d87138B82394F8357J96548a32851j39596c0691j9294j75477
$$ 74308 -58613 91343 -487138 282394 68357 264905 -132851 -272447 -30691 -49985 -225462
11389b25462D1736H717J49048j2670B6346c11243f3435E1673f9966B85639i2868
$$ -225462 41736 8717 157765 145095 26346 -311243 -63435 51673 -69966 285639 -92868
11377d0891k80544c2229A75578b15355m2425J26216A1302e6368A92973M9168A0299
$$ -40891 -321435 -32229 175578 -215355 -257780 -131564 11302 -56368 192973 242141 10299
11365E7779k6112R4086b64933B8639f0141B08401C1952a08800A83307q1265a40192
$$ 57779 31667 125753 -264933 28639 -60141 208401 31952 -108800 183307 102042 -140192
11353e2677j12884a9683j19237m7497B0138P6295f7640l06734C6884O0543J88550
$$ -52677 -165561 -19683 -138920 -186417 20138 96433 -67640 -374374 36884 97427 285977
11342B85977k6610n2815r1888e5351A09855g5035I7588J9657C1401b77092a4267
$$ 285977 259367 206552 114664 -55351 109855 -75035 97588 117245 31401 -277092 -14267
11330c45972a3876B89856j09689c01707J26809P1370N0945A78857o9316c50983
$$ -345972 -13876 289856 180167 -301707 -174898 -103528 -52583 178857 109541 -350983
11319b72842a10661c2048A0351L64318g4432I3206C7220J91306H792a56788j5067
$$ -272842 -110661 -32048 10351 374669 -74432 93206 37220 228526 8792 -156788 -171855
11308a71855J6767l58089A15990c84529a26876e617J021D04154h5333r5001b5102
$$ -171855 -155088 -513177 115990 -384529 -126876 -5617 -4596 404154 -85333 -180334 -25102
11296f7793o3112J2076D2424c9585B3511b04482B08a3045n95993C7521J43473
$$ -67793 -130905 -118829 42424 -39585 23511 -204482 208 -13045 -609038 37521 180994
11285A80994b72353a6638k09232A91852E3472d2041B631c4574A28772Q3841f5511
$$ 180994 -272353 -16638 -225870 191852 53472 -42041 2631 -34574 128772 212613 -65511
11273a85658l23273A63083h7583l13659G7179M8882j5005J02447a8649F5297R262
$$ -185658 -508931 163083 -87583 -401242 77179 126061 111056 213503 -18649 65297 74559
11262G4559j6861d87749a08392l35489B97058a71856B85530F7399b36953o0187
$$ 74559 57698 -487749 -108392 -443881 297058 -171856 285530 67399 -236953 -297140
11252b97140B62920b05084N9883j23435J31427e6618k0845n4819F536a07329J3455
$$ -297140 262920 -205084 -145201 -268636 -137209 -56618 -77463 -132282 6536 -107329 -93874
11241i3874m3583j6286p5209J6935E4547J2463A7862a63244j854N1751q5291c544
$$ -93874 -137457 -153743 -228952 -212017 54547 67010 17862 -163244 -165098 -113347 -198638 -3544
11228e213o1296D0106i634A42289a7309e514k80600a15458J1238o739K3342A14016
$$ -5213 -66509 40106 -9634 142289 -17309 -5514 -286114 -115458 -104220 -110959 -87617 114016
11215a62738o3162N7400j34670B70545A13207b36194i3912l6937E0983a0621B22335
$$ -162738 -225900 -168500 -303170 270545 113207 -236194 -93912 -130849 50983 -10621 222335
11203A15990a3111l8966j4256p6384C36383e326H568b39282m2799f8561p2763
$$ 115990 -13111 -52077 -66333 -142717 336383 -5326 8568 -239282 -282081 -68561 -141324
11192a41324B72951I5245f4966b6320k30047B51253c9633q25A38447J67228c51488
$$ -141324 272951 95245 -64966 -26320 -256367 251253 -39633 -40458 138447 305675 -351488
11180h9054j02679h611j3337l16521P5872N9416d320j2559m5866k2563h636A00277
$$ -89054 -191733 -8611 -21948 -338469 -262597 -203181 -4320 -16879 -62745 -85308 -8636 100277
11167c8374l12005A86244f6994j96270d2181j67967h7102o6587j85770q973I8314
$$ -38374 -350379 186244 -66994 -263264 -42181 -210148 -87102 -153689 -339459 -348432 98314
11155c3249a0193j44930A0277b43484A53192i5315i969C16123n5187A05818J7777
$$ -33249 -10193 -155123 10277 -243484 153192 -95315 -9969 316123 260936 105818 123595
11144A23595b83224B2050J8567d8771l16089A88296C6589L24120a30524e3245
$$ 123595 -283224 22050 40617 -48771 -364860 188296 36589 360709 -130524 -53245
11133a16501D2284a68832O8638d1902o1970A70682a24610b8576F8550K9098g6961
$$ -116501 42284 -168832 -100194 -41902 -103872 170682 -124610 -28576 68550 97648 -76961
11121e4551B1698b2341A01684h6053l04808A59822j2606a82214P0211j86410A5540
$$ -54551 21698 -22341 101684 -86053 -390861 159822 147216 -182214 -112003 -298413 15540
11109a89882A84357R3938q337d3011C28299c9440E95043k24974b6429C27500A23523
$$ -189882 184357 278295 269958 -43011 328299 -39440 595043 370069 -26429 327500 123523
11097A15395a72880e8973A52359i410F0735J05902D0227c5992I1862L4605J58303
$$ 115395 -172880 -58973 152359 -9410 60735 166637 40227 -35992 91862 126467 284770
11086B84770q2345h5880A9486K01548J68668B8433o265J05891J26120o7084M7202
$$ 284770 202425 -85880 19486 221034 389702 28433 22168 128059 254179 187095 234297
11075B34297e3938D02994N3887L2342a48803A38350K67902j08056d6010D54769
$$ 234297 -53938 402994 456881 489223 -148803 138350 406252 298196 -46010 454769
11064A70302K28374J43623p1978j7993A06945M12910K39680B83978q1722J64496
$$ 170302 398676 542299 470321 452328 106945 519855 759535 283978 202256 366752
11054C66752K4219J89947B77026K88442J57458B37180L85048k21374j05316M08759
$$ 366752 390971 580918 277026 565468 722926 237180 622228 400854 295538 704297
11044G04297O0564j31628L1823B97835K37197O7324J20206j88785J95803m129
$$ 704297 764861 633233 665056 297835 535032 602356 722562 533777 729580 725451
11034G25451J28036l9061P4934k7320K50052J701K6640l9656j50009K83694m09482
$$ 725451 853487 814426 889360 862040 1112092 1113793 1140433 1100777 950768 1234462 824980
11023H24980J48847K07904k74775J50371k2767l03577M72757j89925M01200j10503
$$ 824980 973827 1181731 906956 1057327 1034560 730983 1203740 1013815 1415015 1304512
11013A304512o21819O12038m1741m27475J4242k3080l7069L41915k22601R1601
$$ 1304512 682693 1294731 1252990 825515 839757 816677 779608 1121523 898922 990523
11003I90523m18997J04767j3593k922K29603L14372j24268j46682j23643j43280
$$ 990523 571526 676293 662700 659778 889381 1203753 1079485 932803 809160 665880
10993F65880K161J34807j23435j2830L45020j46037O235L15275B57828Q81901
$$ 665880 668041 802848 679413 666583 1011603 865566 871801 1187076 257828 1139729
10983A139729r0471p9438L9577l95633J61301K13933k35027J61893n2843J00321
$$ 1139729 1049258 969820 1009397 613764 775065 988998 753971 915864 863021 963342
10973I63342j37604l5497L24468l0176r2100q131J50676P0111J79055j63745m9945
$$ 963342 825738 790241 1114709 1084533 992433 984302 1134978 1205089 1384144 1220399 1170454
10962A170454L11646k66347J37509K95521k2182L17809Q8894L63358K46213L20601
$$ 1170454 1482100 1215753 1353262 1648783 1626601 1944410 2033304 2396662 2642875 2963476
10952B963476M88911n92758Q83221n11048M47380p67494j90975j35511l98240
$$ 2963476 3452387 2859629 3742850 3231802 3679182 2911688 2720713 2585202 2186962
10943B186962j83944O8430k96230J99935j60015N0491k57883J28252l47307K1625
$$ 2186962 2003018 2071448 1775218 1975153 1815138 1865629 1607746 1735998 1388691 1410316
10933A410316k27303J95221j79052k50074D30318j85064L40369K4425k26131p6828
$$ 1410316 1183013 1378234 1199182 949108 430318 245254 585623 610048 383917 307089
10923C07089A9449M10380b92416A98429m9949L7107a31298C54231G14N8536E252
$$ 307089 19449 429829 -292416 198429 148480 185587 -131298 354231 714 59250 5252
10911A80979J80322j68657c56085i6623p6002c5433B81288d840p7311A10873J86441
$$ 180979 361301 192644 -356085 -96623 -172625 -35433 281288 -4840 -82151 110873 297314
10900B97314b6257l7389A1453N5369J8739K14320C0640N534g9765j47084f9877
$$ 297314 -26257 -63646 11453 66822 85561 299881 30640 36174 -79765 -226849 -69877
10888c20760k8440Q1947a08913J7105A52332E7217b24477A48297J10861A13170
$$ -320760 -349200 -267253 -108913 -91808 152332 57217 -224477 148297 259158 113170
10877G270a39881D6390A5183Q4593a42198k0396B8910b84651j17764A11257h4970
$$ 7270 -139881 46390 15183 99776 -142198 -162594 28910 -284651 -402415 111257 -84970
10865c79843B84934A04465J38281e5018L973j33499B13131F3924a30079A10402
$$ -379843 284934 104465 242746 -55018 -51045 -184544 213131 63924 -130079 110402
10854b55960B36790H9360K1102D9270J14193C1464b13627A6904e63392G3543a6867
$$ -255960 236790 89360 110462 49270 163463 31464 -213627 16904 -563392 73543 -16867
10842C10053g107l37862i79l5923F3545d37060A21582a57770A65001d9060D41421
$$ 310053 -7107 -344969 -979 -36902 63545 -437060 121582 -157770 165001 -49060 441421
10830f0913b5921k21361c9764r4898F5525a78140j04494I6762a25059A37745i7124
$$ -60913 -25921 -247282 -39764 -134662 65525 -178140 -282634 96762 -125059 137745 -97124
10818a37962o9240M0388A4562f2829n2244j73285A22275k2353e7200I3871a01159
$$ -137962 -207202 -166814 14562 -62829 -115073 -288358 122275 99922 -57200 93871 -101159
10806d5604j61243d5291B8120L53706H343a9620p4519d6568F5275a16934b6705
$$ -45604 -206847 -45291 28120 381826 8343 -19620 -94139 -46568 65275 -116934 -26705
10794C51655E8299d0711B43017A07920b94490H9562l9722J14255p68d5558A17316
$$ 351655 58299 -40711 243017 107920 -294490 89562 49840 164095 163327 -45558 117316
10782g8544A27868E7494J0149j3481g9882A25693a01563h46r2345F6973b05238
$$ -78544 127868 57494 67643 54162 -79882 125693 -101563 -846 -93191 66973 -205238
10770B8813e2306f375k92661l2731g521j41238A57157f8079j65639a02468F8987
$$ 28813 -52306 -6375 -299036 -331767 -7521 -148759 157157 -68079 -233718 -102468 68987
10758d791k00840p1290I2506h7621r8912g5302j7708k12568P3458B23163h7604
$$ -4791 -205631 -276921 92506 -87621 -186533 -75302 -93010 -305578 -232120 223163 -87604
10746a02868A85867J25527f2724H2273K36341A26567a6786D3008e1854A66985
$$ -102868 185867 311394 -62724 82273 318614 126567 -16786 43008 -51854 166985
10735a63350o3836o60e2282j3174l71922g1948D1976O5639i0576G1729J58816
$$ -163350 -227186 -227846 -52282 -65456 -437378 -71948 41976 107615 -90576 71729 230545
10724B30545b75202e7567A46104E5956K10666a8414A30284H979a38364j79839
$$ 230545 -275202 -57567 146104 55956 266622 -18414 130284 8979 -138364 -318203
10714c18203J37451Q5920j0074J0721a1272A6673a07968B40838r9487b11861P1995
$$ -318203 -180752 -94832 -104906 -94185 -11272 16673 -107968 240838 141351 -211861 -139866
10703a39866k0867q7704B8128i3852b7722A06893C0782d68307A07628E0b57411
$$ -139866 -160733 -248437 28128 -93852 -27722 106893 30782 -468307 107628 50 -257411
10691a31953d505F5857b9106p7502b7345a1792F9433k9865j7753d30850l9239
$$ -131953 -4505 65857 -29106 -106608 -27345 -11792 69433 39568 21815 -430850 -470089
10680d70089A06094c53453o9633A21954b45081k6324b8827B4483L4655a52122
$$ -470089 106094 -353453 -423086 121954 -245081 -271405 -28827 24483 59138 -152122
10669F9948o954L4080d55989d6668o8567k6500G5223Q8048e7685n2165j26693
$$ 69948 62994 97074 -455989 -46668 -115235 -141735 75223 163271 -57685 -109850 -236543
10658b36543A38080a18061A66105a69400A32366a2470B33951c37776c6029j79491
$$ -236543 138080 -118061 166105 -169400 132366 -12470 233951 -337776 -36029 -215520
10648b15520R1853e0k0714E266i608j461k31432I1656a16594I8391K97080a36468
$$ -215520 -123667 -50 -20764 5266 -9608 -11069 -242501 91656 -116594 98391 395471 -136468
10635a27037M7249A02509b23622g9231g535j18460N2657B02895G4620f4160K3683
$$ -127037 -79788 102509 -223622 -79231 -7535 -125995 -73338 202895 74620 -64160 -40477
10624d0477j04652n682D0788P1894a57240K0389A50622a7851C6190b76712d4982
$$ -40477 -145129 -150811 40788 112682 -157240 -136851 150622 -17851 36190 -276712 -44982
10612b54777B43281j20556a74875E3253g5335A16079a88990N2467D9142J18906
$$ -254777 243281 122725 -174875 53253 -75335 116079 -188990 -136523 49142 168048
10602A68048c79381J63855j15935C9732J30116l4761a53872f0870B87375a54918
$$ 168048 -379381 -215526 -331461 39732 169848 135087 -153872 -60870 287375 -154918
10591A60630b46368j32029H6633b17418D4313a03748n9850N1271A50141c35734
$$ 160630 -246368 -378397 86633 -217418 44313 -103748 -163598 -112327 150141 -335734
10580b38079G0802b12491j55571L3034a04543E8171a10815R378A7307M1375f9878
$$ -238079 70802 -212491 -368062 -335028 -104543 58171 -110815 -101437 17307 58682 -69878
10568b9783j41465h0506C52420A14087a61664k2368O0574A74750e9173j97589
$$ -29783 -171248 -80506 352420 114087 -161664 -184032 -123458 174750 -59173 -256762
10558b56762A60341c8123J2243A00051O7845F103J25074R2791c15662H1685e5560
$$ -256762 160341 -38123 -25880 100051 167896 6103 131177 223968 -315662 81685 -55560
10546A16235a4548k46619a6395F022b7664F1376b4609A8810a8596A57606a10579
$$ 116235 -14548 -261167 -16395 6022 -27664 61376 -24609 18810 -18596 157606 -110579
10534A08392a55857j65896a5287j64988A86718a44067K9971M2537l6527C6280
$$ 108392 -155857 -321753 -15287 -180275 186718 -144067 -114096 -71559 -108086 36280
10523C11025a22870B33149G6548a94029O6761n9673h7143Q196B1917N8116a8214
$$ 311025 -122870 233149 76548 -194029 -127268 -186941 -87143 -78947 21917 80033 -18214
10511f2372o4809K400j39954o6152A39855J14896a32757A99648r6750a66058g2818
$$ -62372 -127181 -124781 -264735 -330887 139855 254751 -132757 199648 102898 -166058 -72818
10499c23399J14505C0803d56010a17031I5103l3124J80936G0311m76b93013c9926
$$ -323399 -208894 30803 -456010 -117031 95103 61979 242915 70311 69835 -293013 -39926
10487g7766A59751b81227i3300j23417B61179c14111M9985N6537F6604c10292
$$ -77766 159751 -281227 -93300 -216717 261179 -314111 -264126 -207589 66604 -310292
10476a45251B95607a76936Q5464j0537I1214P618c56734h1349o6082k97000D22416
$$ -145251 295607 -176936 -91472 -102009 91214 98832 -356734 -81349 -147431 -444431 422416
10464e4541A14039B9653J67925o22H9476a39418B75950J32672i7770B3884a61554
$$ -54541 114039 29653 197578 196956 89476 -139418 275950 408622 -97770 23884 -161554
10452A99604J32448L340B8727J79151c0579k7682j88732f0328n0497A16495L1684
$$ 199604 332052 335392 28727 207878 -30579 -58261 -246993 -60328 -110825 116495 148179
10441A48179b08657I8769b65746D3651b34997B1130a92143o3703a10447d4277
$$ 148179 -208657 98769 -265746 43651 -234997 21130 -192143 -255846 -110447 -44277
10430h7792D05563b16243B43890b92851P5368j7356j9253B0920O2457e8581k36958
$$ -87792 405563 -216243 243890 -292851 -217483 -234839 -254092 20920 83377 -58581 -295539
10419b95539a32194n2652k37569H0532a89044g2957A84815b36407A6392c05696
$$ -295539 -132194 -184846 -422415 80532 -189044 -72957 184815 -236407 16392 -305696
10408c07170a6012j39446f3613E1014b59085J26648A02130b7468B29202p0784
$$ -307170 -16012 -155458 -63613 51014 -259085 -132437 102130 -27468 229202 158418
10398A58418C7878c06751e6548A08935J73238c8074j77076A55178c797EM2720
$$ 158418 37878 -306751 -56548 108935 282173 -38074 -215150 155178 -3797 5 42725
10387D2725a72088A72972B7806i6177o074A1548f123B2275a23270k8586B51781
$$ 42725 -172088 172972 27806 -96177 -102251 11548 -6123 22275 -123270 -151856 251781
10375C97003K6919k6871b08680B49402a55749c5703o9299h071G921R2305M31214
$$ 397003 423922 397051 -208680 249402 -155749 -35703 -105002 -8071 7921 100226 531440
10364E31440A21838c95821A68798J14941R306I0532J64550I4833K00070N2863
$$ 531440 121838 -395821 168798 283739 293045 90532 255082 94833 294903 347766
10354C47766J19383j68981o09O8847N839Q1243j1614k00194J32081J50562K8713
$$ 347766 467149 298168 297559 366406 372245 453488 441874 241680 373761 524323 553036
10343E53036q8349j60993J15370l3196j1967n1939J28322A65846K22675J10791
$$ 553036 464687 303694 419064 385868 373901 321962 450284 165846 388521 499312
10333D99312J9882j22730L6502K35498m6023b4924C80476J23738m3380J77953
$$ 499312 519194 396464 432966 668464 622441 -24924 380476 504214 460834 638787
10323F38787j63325j77440j12434J46817N4554M4002m9005L6938A57936M4589
$$ 638787 475462 298022 185588 332405 386959 430961 381956 418894 157936 202525
10313B02525i6079B36654L4020B7432L9681k4921K97302N21q1080H6305Q4249
$$ 202525 -96079 236654 270674 27432 67113 42192 339494 340015 258935 86305 170554
10302A70554h378A00889J15545A9020K66780D7625O3618L178a72727A11491E3803
$$ 170554 -8378 100889 216434 19020 285800 47625 111243 114421 -172727 111491 53803
10290a47766F4132J8008b48282g5695a6293k26571c1692j67916B66500b33591
$$ -147766 64132 82140 -248282 -75695 -16293 -242864 -31692 -199608 266500 -233591
10279a05076j15372A86636a09611a194k08704E9863f6598k58307B34979B7472
$$ -105076 -220448 186636 -109611 -1194 -209898 59863 -66598 -324905 234979 27472
10268a3581n20856e1201a6646l44440A98721B6523a0999j56835r3161f5191l0589
$$ -13581 -534437 -51201 -16646 -361086 198721 26523 -10999 -167834 -260995 -65191 -95780
10257i5780A3129Q0028a7221B886J34959i0644B76795a49801B26547n4193a60178
$$ -95780 13129 93157 -17221 2886 137845 -90644 276795 -149801 226547 172354 -160178
10245c3494K894j28038J0125C37833a16350K4103F9674J03112R4600j19312J6588
$$ -33494 -30600 -158638 -148513 337833 -116350 -92247 69674 172786 267386 148074 164662
10234A64662o4357L13211E1396a70174A83482B9230J01838a02445j78013f8770
$$ 164662 100305 413516 51396 -170174 183482 29230 131068 -102445 -280458 -68770
10223A77574e8078a5165A63294b61951A41676a5162l6909j45133D3337a21326
$$ 177574 -58078 -15165 163294 -261951 141676 -15162 -52071 -197204 43337 -121326
10212f806H5729N8020e7407j29317O9835q1329G0511B4905b05913R2756A4192
$$ -6806 85729 143749 -57407 -186724 -116889 -198218 70511 24905 -205913 -113157 14192
10200A8040K04327j3536b16116Q4876e6004E7607k6033c05530C6287a7212k02804
$$ 18040 222367 208831 -216116 -131240 -56004 57607 31574 -305530 36287 -17212 -220016
10189b20016K412k4014D9000e982r68j42324H2892c77856D3489l397P7141a30092
$$ -220016 -217604 -241618 49000 -5982 -6950 -149274 82892 -377856 43489 40092 117233 -130092
10176A42499L1292B5963J42719b70699J4386f3574K9807A4596Q3428g8955G0720
$$ 142499 173791 25963 168682 -270699 -256313 -63574 -33767 14596 98024 -78955 70720
10164h6982I290d4880j55934A9568b88861o7699J1339J11214A21299b46649e1023
$$ -86982 9290 -44880 -200814 19568 -288861 -356560 -345221 -234007 121299 -246649 -51023
10152c3664j60703A65757B3862e6184k78587J51026J8591r4758J5150a12026H5359
$$ -33664 -194367 165757 23862 -56184 -334771 -183745 -165154 -259912 -244762 -112026 85359
10140e6166B40982c81059B8703J18699b49553R7664E4732K37870d15671c6019
$$ -56166 240982 -381059 28703 147402 -249553 -151889 54732 292602 -415671 -36019
10129A46595a11648o0817j93854a8956k73075l704A99632a85821d1819j07772
$$ 146595 -111648 -172465 -366319 -18956 -292031 -295735 199632 -185821 -41819 -149591
10119a49591c8671J1641A15533a97705A43173b55374a1640o49042a12221K1946
$$ -149591 -38671 -27030 115533 -197705 143173 -255374 -11640 -660682 -112221 -90275
10109i0275a4503I8257d47629a32963C21876d7133k79619A9760K59667c10835
$$ -90275 -14503 98257 -447629 -132963 321876 -47133 -326752 19760 279427 -310835
10098a62017I3862a18719k50612E8660a8545j20095l7956r4224i3703J3923j0867
$$ -162017 93862 -118719 -369331 58660 -18545 -138640 -176596 -270820 -93703 -79780 -90647
10087i0647A02894b8170C23150a90531M2530B5301b64532B77599e792G685c02801
$$ -90647 102894 -28170 323150 -190531 -148001 25301 -264532 277599 -5792 7685 -302801
10075I6616D2295i0516M1620l0598B20403p1416b35864p8464c6442G7079B5255
$$ 96616 42295 -90516 -48896 -79494 220403 148987 -235864 -314328 -36442 77079 25255
10063b4535A17568a01486A98033a94748B9360f5432j37587O2940N9311O832j1030
$$ -24535 117568 -101486 198033 -194748 29360 -65432 -203019 -140079 -80768 -73936 -84966
10052h4966j14896h2123A32791K931J06896E7230B1177e3105q6878M3220D5529
$$ -84966 -199862 -82123 132791 135722 242618 57230 21177 -53105 -139983 -96763 45529
10040B6087c2185k23333C5892c1108B9907J45948C8804c9580D8300g3698a9931
$$ 26087 -32185 -255518 35892 -31108 29907 175855 38804 -39580 48300 -73698 -19931
10028a7927j76001k8144E8438f3521p9189A50911J993A0193a94650A73547a81818
$$ -17927 -193928 -222072 58438 -63521 -142710 150911 152904 10193 -194650 173547 -181818
10016A75027l7134f3065q4704r3872A31687B4936H187a84652r6555c1682k09605
$$ 175027 137893 -63065 -147769 -241641 131687 24936 8187 -184652 -281207 -31682 -241287
10005b41287f0725F1900a37964j24645f6722K6940m6704m5901B70874b23136k8536
$$ -241287 -60725 61900 -137964 -262609 -66722 -39782 -86486 -132387 270874 -223136 -251672
9994b51672A22255b65976G432a57917d2656E8828J91986b77866C36215b38371
$$ -251672 122255 -265976 7432 -157917 -42656 58828 250814 -277866 336215 -238371
9983F6324a93971g5826c0167B59467f8716n2954n1677j05686b4127j89518A2802
$$ 66324 -193971 -75826 -30167 259467 -68716 -121670 -173347 -279033 -24127 -213645 12802
9971c60119e400m6999D364P6589a35648A02052P8173b3283j87221A27730b81870
$$ -360119 -5400 -52399 4364 80953 -135648 102052 180225 -23283 -210504 127730 -281870
9959B36407E9979J87449d7384B22695d65542A07169g4979K9485G2136a62021F8686
$$ 236407 59979 247428 -47384 222695 -465542 107169 -74979 -45494 72136 -162021 68686
9947a18442j51690g1121g382C6769A0821b8352q3880m5614O5983I5494g6122d999
$$ -118442 -270132 -71121 -7382 36769 10821 -28352 -112232 -157846 -91863 95494 -76122 -4999
9934B359L1246r340c7371H9285b23457g9014A18988h762k98246R8167E7529a10847
$$ 2359 33605 24265 -37371 89285 -223457 -79014 118988 -8762 -307008 -208841 57529 -110847
9921c12140B86857h0065k7988l2760B0382b19184C9351K03029b04647A19944a6980
$$ -312140 286857 -80065 -108053 -140813 20382 -219184 39351 242380 -204647 119944 -16980
9909b00158A49859l8716a13634B34635F7917M4960h1334k03530f8930p722f097
$$ -200158 149859 111143 -113634 234635 67917 112877 -81334 -284864 -68930 -76652 -6097
9897a08511B53376a3013m5941k7225l94465K36965K204O0060g998q9641j73195
$$ -108511 253376 -13013 -58954 -86179 -480644 -243679 -241475 -181415 -7998 -97639 -270834
9886b70834A10150b26626A90927a85177Q5339r9557A04934J0145c51838A35399
$$ -270834 110150 -226626 190927 -185177 -99838 -199395 104934 115079 -351838 135399
9875A64244D3808c66117J36726d6596m54601E6506K276c43635A48420g0354A66868
$$ 164244 43808 -366117 -229391 -46596 -501197 56506 58782 -343635 148420 -70354 166868
9863b16225H5874a95724c6152b258r7247k41104a10568A13610n4269a97199M7122
$$ -216225 85874 -195724 -36152 -2258 -99505 -340609 -110568 113610 59341 -197199 -150077
9852a50077M3246q4279B6677c69906i6736r2844n1571H9785D1944a83350f1569
$$ -150077 -106831 -191110 26677 -369906 -96736 -189580 -241151 89785 41944 -183350 -61569
9840d16407A23422a56965j14447h1811n0756j25974O9730h4466m4480j52262j8423
$$ -416407 123422 -156965 -271412 -81811 -132567 -258541 -188811 -84466 -128946 -281208 -299631
9829b99631G1485g4249r8285b1566f201k16072Q8329l62322K26969q0986A57074
$$ -299631 71485 -74249 -172534 -21566 -6201 -222273 -133944 -496266 -269297 -350283 157074
9817B31363f3604L46j6355D2043e1912l5591k45967c2944C12300b6409E2476b65372
$$ 231363 -63604 -63258 -79613 42043 -51912 -87503 -333470 -32944 312300 -26409 52476 -265372
9804c17090q0086d00l31824d4870l9115j97501A04070P6730b5409B68026e9674
$$ -317090 -397176 -400 -332224 -44870 -83985 -281486 104070 180800 -25409 268026 -59674
9792A36857D3140i3651A17454f3953D8250b45365a09544H9277a03510A04327i6087
$$ 136857 43140 -93651 117454 -63953 48250 -245365 -109544 89277 -103510 104327 -96087
9780a7870j93621M6919E9089B4732b92284A44050Q6284B2155K14493H7373g4521
$$ -17870 -211491 -164572 59089 24732 -292284 144050 230334 22155 236648 87373 -74521
9768i3014E4692K9096a20082j04763B91d4569E4812b64471j54386a64326n7765
$$ -93014 54692 83788 -120082 -224845 291 -44569 54812 -264471 -418857 -164326 -222091
9757b22091A8783L2185J62912i3480B50516F9577o23a41637B27842a00740j10612
$$ -222091 18783 50968 213880 -93480 250516 69577 68954 -141637 227842 -100740 -211352
9746b11352J01582o6253A4871J61761a20861C12813a31474j54060A58829A1689
$$ -211352 -109770 -176023 14871 176632 -120861 312813 -131474 -285534 158829 11689
9735E9169k6337J23680M7687c06839d9598k6229k41360I8350b30470j03983A29223
$$ 59169 32832 156512 204199 -306839 -49598 -75827 -317187 98350 -230470 -334453 129223
9723a56899C0716c85949E7947a53578j3744F350J88053a76070J0511G2408J7751
$$ -156899 30716 -385949 57947 -153578 -167322 6350 194403 -176070 -165559 72408 90159
9712I0159J30100b04619n5219q5282A04861a14114C5149a89968H0839a44845o7319
$$ 90159 220259 -204619 -259838 -345120 104861 -114114 35149 -189968 80839 -144845 -212164
9701b12164a00955B18953f1885A150K42219M3321a43604G3725k7612F209i9187
$$ -212164 -100955 218953 -61885 1150 243369 286690 -143604 73725 46113 6209 -99187
9689D5129b67892h5496l1251q4676Q6129j22921R9910c330n6603j3451k66458
$$ 45129 -267892 -85496 -116747 -201423 -115294 -238215 -138305 -3330 -59933 -73384 -339842
9678c39842g4291k66204i5014k69276c9518a4503I0773h0405j1206a7899F6060
$$ -339842 -74291 -340495 -95014 -364290 -39518 -14503 90773 -80405 -91611 -17899 66060
9666c96717c908C6522L9423a75279C3786c02922a27025j03304j91111J78076A5990
$$ -396717 -3908 36522 75945 -175279 33786 -302922 -127025 -230329 -421440 -243364 15990
9654A92180a96938a0457j89248k2306a7797A22148f1803j15492a2376A13421b15562
$$ 192180 -196938 -10457 -199705 -222011 -17797 122148 -61803 -177295 -12376 113421 -215562
9642a76114d0118j90624g4134l09591B6032a21132e0971j37363G9639f5343k00713
$$ -176114 -40118 -230742 -74134 -383725 26032 -121132 -50971 -188334 79639 -65343 -266056
9631b66056b7629j77134A2753a22935k00950e1680G9082a60541j91964J16418
$$ -266056 -27629 -204763 12753 -122935 -323885 -51680 79082 -160541 -352505 -236087
9621b36087h7517H1991c54091A06615b80610a065o4238E91999a10036A39406J75549
$$ -236087 -87517 81991 -354091 106615 -280610 -1065 -65303 591999 -110036 139406 314955
9610C14955a1608A8678L0059k0443J05734F315M20211a5801H8467g7057A11334
$$ 314955 -11608 18678 48737 28294 134028 6315 426526 -15801 88467 -77057 111334
9598c76351J76604f6485E0895b91662G8989h4945A29954l2496a25762K3537F7037
$$ -376351 -199747 -66485 50895 -291662 78989 -84945 129954 97458 -125762 -102225 67037
9586c27721k00254a0113E0041O495j8262c8180r3936k53460D5632J40412a46252
$$ -327721 -527975 -10113 50041 56536 38274 -38180 -132116 -385576 45632 186044 -146252
9574a94994i2793H0490L359c62278A6120g5614j31397p5460i4671j70230J27341
$$ -194994 -92793 80490 83849 -362278 16120 -75614 -207011 -282471 -94671 -264901 -137560
9563a37560d4115E5749c5785j36214f7811j5241c1597m29897K01149m577d5303
$$ -137560 -44115 55749 -35785 -171999 -67811 -83052 -31597 -461494 -260345 -264922 -45303
9551a13258C5285c1815j13877A01532a20779F6543j6340i2401q0579A88026e4555
$$ -113258 35285 -31815 -145692 101532 -120779 66543 50203 -92401 -172980 188026 -54555
9539b62201d3472o2951j19430B44422d58787A33836E9073i3433C8918g8410k9660
$$ -262201 -43472 -106423 -225853 244422 -458787 133836 59073 -93433 38918 -78410 -108070
9528a08070k2230B6262J01091b28907o5398b9094q2578k0800j33569b350A01468
$$ -108070 -130300 26262 127353 -228907 -294305 -29094 -111672 -132472 -266041 -2350 101468
9516B19532c2842k80032B26034i727j10799J9631R608p9564g4362k13814K8481
$$ 219532 -32842 -312874 226034 -9727 -120526 -100895 -91287 -170851 -74362 -288176 -259695
9505b59695F9619R3393B631J58027n2244d6322B7207J79450L7272f7414j87495
$$ -259695 69619 163012 2631 160658 108414 -46322 27207 206657 243929 -67414 -254909
9494b54909J18049C0547a14260C32426A9049o592d05476D6075b3771C29473a36063
$$ -254909 -136860 30547 -114260 332426 19049 12457 -405476 46075 -23771 329473 -136063
9482d5127B15139b89021J23122j1090R058H9313a80423f4259F0625a12054o9226
$$ -45127 215139 -289021 -165899 -176989 -167931 89313 -180423 -64259 60625 -112054 -181280
9471a81280j18910r5647b4951A73155b52172E6747d05914a09632A97986b6615
$$ -181280 -300190 -395837 -24951 173155 -252172 56747 -405914 -109632 197986 -26615
9460g1237o8966j0339d5867D2010f752G2055J52456b37239a04140b362D258g724
$$ -71237 -140203 -150542 -45867 42010 -6752 72055 224511 -237239 -104140 -2362 4258 -7724
9447h6242K3081j72515B1988a58031B08243E1681b60421e151F2680J59998d92635
$$ -86242 -63161 -235676 21988 -158031 208243 51681 -260421 -5151 62680 222678 -492635
9435a08515l03806C21810C7237a67162j13537J12667B48435a0344l5768A2549
$$ -108515 -412321 321810 37237 -167162 -280699 -168032 248435 -10344 -46112 12549
9424B10144d14189J84302L7484b5569j07892n6981i0766k69618A90311c78459
$$ 210144 -414189 -229887 -192403 -25569 -133461 -190442 -90766 -360384 190311 -378459
9413a44065c266k53917Q3877B88681d0857j37418H696b48002m8715A16909a1463
$$ -144065 -3266 -257183 -173306 288681 -40857 -178275 8696 -248002 -296717 116909 -11463
9401b41393n4347J25237a3476l5580j80324J02360E1444o122a2750k16353A09665
$$ -241393 -295740 -170503 -13476 -49056 -229380 -127020 51444 45322 -12750 -229103 109665
9389e9249k40008a26313A59131B7602a1537H8764k7738J7868b47946B75790a3481
$$ -59249 -299257 -126313 159131 27602 -11537 88764 61026 78894 -247946 275790 -13481
9377b44769a14606B20038A514c8192B53443i9636q007D9917b32685K8982j29172
$$ -244769 -114606 220038 1514 -38192 253443 -99636 -107643 49917 -232685 -203703 -332875
9366c32875J23698o6336a25126C78418i6162j4672B33424a11080A15248R7682
$$ -332875 -209177 -275513 -125126 378418 -96162 -110834 233424 -111080 115248 212930
9356B12930g5229b269k40208A40672c99455h198l23409i2458K1123A45375e7473
$$ 212930 -75229 -2269 -242477 140672 -399455 -8198 -331607 -92458 -71335 145375 -57473
9344c8588A0176d5305j30152B53857d1408j26871A59457c47572g8322j77499A15575
$$ -38588 10176 -45305 -175457 253857 -41408 -168279 159457 -347572 -78322 -255821 115575
9332e4975j40921F0950d95799A66434C3014c3333C3434J59197a94619Q607K7078
$$ -54975 -195896 60950 -495799 166434 33014 -33333 33434 192631 -194619 -186012 -158934
9321a58934J1657A63222D8980a27145L4911j49343Q9900D290L8569b92136B13343
$$ -158934 -147277 163222 48980 -127145 -92234 -241577 -151677 4290 42859 -292136 213343
9309b3917A43579b3420j28274R932A54513D3902a96071m2369F733J09943m0490
$$ -23917 143579 -23420 -151694 -141762 154513 43902 -196071 -238440 6733 116676 76186
9298G6186J16759B015J24683a98747j52714d0587B13755F4306C049b43395K2572
$$ 76186 192945 2015 126698 -198747 -351461 -40587 213755 64306 3049 -243395 -220823
9287b20823A14529b71601a4437k06474A38488c13354Q0828C85136D0418L53693
$$ -220823 114529 -271601 -14437 -220911 138488 -313354 -232526 385136 40418 394111
9277C94111e6243D0893b9865l92007m7071a09565H3905A4004a40556K6989I1317
$$ 394111 -56243 40893 -29865 -421872 -468943 -109565 83905 14004 -140556 -113567 91317
9265e55B94631i180r163p7865j68941B52165F6050j578J78410g3281k24450M6343
$$ -555 294631 -9180 -18343 -96208 -265149 252165 66050 64472 242882 -73281 -297731 -251388
9253b51388A11724B3538e8122A9857f9539k1645o9688r0313N1798n9079R8687
$$ -251388 111724 23538 -58122 19857 -69539 -91184 -160872 -251185 -199387 -258466 -159779
9242a59779A99049c30459K0472A43101b47376g1463r0769O0497l408A16578b24976
$$ -159779 199049 -330459 -309987 143101 -247376 -71463 -162232 -101735 -105143 116578 -224976
9230a69176o7663H510N1424g8629l5782J9074K3564A36753c07566a40135j02066
$$ -169176 -236839 8510 59934 -78629 -114411 -95337 -71773 136753 -307566 -140135 -242201
9219b42201A17331C2394Q4678a75701N2923p2831I8294K18322q8895c04293b7264
$$ -242201 117331 32394 117072 -175701 -122778 -195609 98294 316616 227721 -304293 -27264
9207A29774B835K44291i1349A37439D7708k3652J32188f206k09084f9742G4122
$$ 129774 2835 247126 -91349 137439 47708 24056 156244 -6206 -215290 -69742 74122
9195a71008B14438C5112c73723E3348c9893j81278p5320i3447C6809g8340B46346
$$ -171008 214438 35112 -373723 53348 -39893 -221171 -296491 -93447 36809 -78340 246346
9183A58051a31567A17138R4847A3628K20534a19377j34329G8724a12705A42162
$$ 158051 -131567 117138 211985 13628 234162 -119377 -253706 78724 -112705 142162
9172a82864Q5088A51563a36375G2114j0682b77289J08470P7499C0752b18973f400
$$ -182864 -97776 151563 -136375 72114 61432 -277289 -168819 -91320 30752 -218973 -6400
9160b6677a258k19045E8585a15336C8650h3240C65425F3956L6687a35745l5834
$$ -26677 -1258 -220303 58585 -115336 38650 -83240 365425 63956 100643 -135745 -171579
9149a71579l0433Q2966j73565g9728A19904C8626J08850E2081g9175j5281m2716
$$ -171579 -202012 -119046 -292611 -79728 119904 38626 147476 52081 -79175 -94456 -137172
9138a37172l3228B33816b04258a8025k0504A93318b46015A47635L2280e4831o9987
$$ -137172 -170400 233816 -204258 -18025 -38529 193318 -246015 147635 179915 -54831 -124818
9127a24818k53599Q2331C58343d6490m31685b04466M9605C91940d78321a97690
$$ -124818 -378417 -296086 358343 -46490 -478175 -204466 -154861 391940 -478321 -197690
9116a10064R020c4276B37273G6185C3279c15269b3579k99417P2111i2787E6667
$$ -110064 -101044 -34276 237273 76185 33279 -315269 -23579 -322996 -250885 -92787 56667
9104b11735B6177a98525j15492J52621n6267k2204D2242a19857m6994b2562A22614
$$ -211735 26177 -198525 -314017 -161396 -217663 -239867 42242 -119857 -166851 -22562 122614
9092A64089h6502n2943A51107F1861N7582a1550F1487g9344j84220a10708b368
$$ 164089 -86502 -139445 151107 61861 119443 -11550 61487 -79344 -263564 -110708 -2368
9080a00141C2076a6686j87610A91345o140a30594a8669A14717h5654m8986H9155
$$ -100141 32076 -16686 -204296 191345 185205 -130594 -18669 114717 -85654 -134640 89155
9068h1214j7318A2135b7271A50540F7442N1992N4752N8393a89201N3139K4209
$$ -81214 -98532 12135 -27271 150540 67442 119434 174186 232579 -189201 -136062 -111853
9057a11853A35106R73a33780r0509A04603j0492a78369K5826N6060q5134A24976
$$ -111853 135106 136079 -133780 -224289 104603 94111 -178369 -152543 -96483 -181617 124976
9045b37942J15416a1403j58979P3055l66970a3803H2833b89878J34929I9756e7672
$$ -237942 -122526 -11403 -170382 -97327 -464297 -13803 82833 -289878 -154949 99756 -57672
9033g9193B1155a34983H0785J54910a36354B39732b00939j7694L2478A68433d10872
$$ -79193 21155 -134983 80785 235695 -136354 239732 -200939 -218633 -186155 168433 -410872
9021C5134G692g6867l62774E1869a19676p2116C1669c72745A01455P304P8757
$$ 35134 7692 -76867 -439641 51869 -119676 -191792 31669 -372745 101455 108759 187516
9010A87516b7764k72129C1928b85404d9496j4588B2214a60201l6429A19683D2393
$$ 187516 -27764 -299893 31928 -285404 -49496 -64084 22214 -160201 -196630 119683 42393
8998A41012P1141b33905D7469a33605A25080L0111C3258L0709b15411r9334a51106
$$ 141012 212153 -233905 47469 -133605 125080 155191 33258 63967 -215411 -314745 -151106
8986A11987F868P4674K8540c64678C7949h4825i986H059b74607B17120G644a53373
$$ 111987 6868 81542 110082 -364678 37949 -84825 -9986 8059 -274607 217120 7644 -153373
8973b35587l941a05719A3245d49359h9928J0725O250K3872H424M412K65556j17520
$$ -235587 -239528 -105719 13245 -449359 -89928 -79203 -72953 -49081 8424 12836 278392 160872
8961A60872a04260B21799p9995a44131K8469A32644f6882K8856B65731e0109k88660
$$ 160872 -104260 221799 141804 -144131 -115662 132644 -66882 -38026 265731 -50109 -338769
8950c38769h4448j8353A52604e1714l9546k29531f0630G6076P1422b46437e5659
$$ -338769 -84448 -102801 152604 -51714 -91260 -320791 -60630 76076 147498 -246437 -55659
8938e0334A79460b3376A95846d37728J36194B30497O7763b87427Q8269j14516
$$ -50334 179460 -23376 195846 -437728 -301534 230497 298260 -287427 -199158 -313674
8928c13674q7724B08180C0034K65867a57568b1953j32300A32558a55189A27053
$$ -313674 -401398 208180 30034 295901 -157568 -21953 -154253 132558 -155189 127053
8917a34962n1079d6018A29561J07973a46438E0432K37228j15950J02488K02794
$$ -134962 -186041 -46018 129561 237534 -146438 50432 287660 171710 274198 476992
8907D76992K799K80976K19603J365197K064884K668255B773470j304327D63090
$$ 476992 479791 760767 980370 2345567 4410451 7078706 2773470 1469143 463090
8897B49051K6037Q0611b2465j54699b1165C26247j27927b6062E1910J28041Q9706
$$ 249051 275088 355699 -22465 -177164 -21165 326247 198320 -26062 51910 179951 269657
8886B69657l8882a03141j48591A57900a41552A28252M2386a7761D9764a84190
$$ 269657 230775 -103141 -251732 157900 -141552 128252 170638 -17761 49764 -184190
8875c62146J75782j08746R8716N8122F0150c6003A87213g868j82226A56488k2193
$$ -362146 -186364 -295110 -196394 -138272 60150 -36003 187213 -7868 -190094 156488 134295
8864A34295e5611J1034e665n8363A03004L1113J00871i4050j43368a4955j2193
$$ 134295 -55611 -44577 -5665 -64028 103004 134117 234988 -94050 -237418 -14955 -27148
8853b7148l16817a06971C07107A17375b95639F9125C1148c13813h6736k94789
$$ -27148 -343965 -106971 307107 117375 -295639 69125 31148 -313813 -86736 -381525
$$ [...]
##END NTUPLES=NMR SPECTRUM
##END=
