
##TITLE=AC1071_TOPL04_5835268_LkaQr7E7HN
##JCAMPDX= 6.0         $$ Bruker NMR JCAMP-DX V2.0
##DATA TYPE= NMR SPECTRUM
##DATA CLASS= NTUPLES
##ORIGIN= BRUKER
##OWNER= Administrator
$$ 1.72 TOPSPIN		Version 2.1
$$ 2012-03-26 21:41:25.359 -0500  Administrator@TOPSPIN
$$ Compression mode = diff/dup
##.OBSERVE FREQUENCY= 400.13188235
##.OBSERVE NUCLEUS= ^1H
##.ACQUISITION MODE= SIMULTANEOUS (DQD)
##.ACQUISITION SCHEME= undefined
##.AVERAGES= 8
##.DIGITISER RES= 22
##SPECTROMETER/DATA SYSTEM= spect
##.PULSE SEQUENCE= zg30
##.SOLVENT NAME= COFFEE_meoh
##.SHIFT REFERENCE= INTERNAL, COFFEE_meoh, 1, 14.98061
##AUDIT TRAIL= $$ (NUMBER, WHEN, WHO, WHERE, PROCESS, VERSION, WHAT)
$$ ##TITLE= Audit trail, TOPSPIN		Version 2.1
$$ ##JCAMPDX= 5.01
$$ ##ORIGIN= Bruker BioSpin GmbH
$$ ##OWNER= Administrator
$$ $$ C:\Bruker\TOPSPIN/data/COFFEE/nmr/AC1071_TOPL04_5835268_LkaQr7E7HN/10/pdata/1/auditp.txt
$$ ##AUDIT TRAIL=  $$ (NUMBER, WHEN, WHO, WHERE, PROCESS, VERSION, WHAT)
(   1,<2012-03-26 21:41:18.625 -0500>,<Administrator>,<TOPSPIN>,<go>,<TOPSPIN 2.1>,
      <created by zg
	started at 2012-03-26 21:40:12.187 -0500,
	POWCHK enabled, PULCHK disabled,
       configuration hash MD5:
       1A 1E CE 29 27 FD 77 03 67 4E F0 E3 C4 B2 CB 90
       data hash MD5: 64K
       DF A9 5E F6 51 6D 88 42 86 94 C1 4C 94 FB ED 88>)
(   2,<2012-03-26 21:41:21.265 -0500>,<Administrator>,<TOPSPIN>,<proc1d>,<TOPSPIN 2.1>,
      <Start of raw data processing
       efp LB = 0 FT_mod = 6 PKNL = 1 PHC0 = 0 PHC1 = 0 SI = 32K 
       data hash MD5: 32K
       E6 14 26 51 0D 2B D8 38 98 80 84 03 26 FA D6 2D>)
(   3,<2012-03-26 21:41:21.687 -0500>,<Administrator>,<TOPSPIN>,<proc1d>,<TOPSPIN 2.1>,
      <pk PHC0 = 209.6246 PHC1 = 0 
       data hash MD5: 32K
       F3 79 DA D4 1C 10 EC 6C C2 7A 18 A4 C4 89 89 1F>)
(   4,<2012-03-26 21:41:21.765 -0500>,<Administrator>,<TOPSPIN>,<proc1d>,<TOPSPIN 2.1>,
      <abs ABSG = 1 
       data hash MD5: 32K
       9B 32 E8 62 E7 1F EB 72 7A 7A 17 A8 33 EF 44 44>)
(   5,<2012-03-26 21:41:21.796 -0500>,<Administrator>,<TOPSPIN>,<proc1d>,<TOPSPIN 2.1>,
      <abs ABSG = 2 
       data hash MD5: 32K
       EE CF E7 AD 4E D4 AF 0B 0E 0B FD B0 F1 D3 0F 60>)
(   6,<2012-03-26 21:41:21.828 -0500>,<Administrator>,<TOPSPIN>,<proc1d>,<TOPSPIN 2.1>,
      <abs ABSG = 3 
       data hash MD5: 32K
       3E 9C A5 90 61 58 F9 D4 BF 74 AF 7E C4 63 C8 5F>)
(   7,<2012-03-26 21:41:21.859 -0500>,<Administrator>,<TOPSPIN>,<proc1d>,<TOPSPIN 2.1>,
      <abs ABSG = 4 
       data hash MD5: 32K
       F9 DD D9 F7 C7 15 B5 FA 0E D1 95 5B 3A 37 AE B4>)
(   8,<2012-03-26 21:41:21.890 -0500>,<Administrator>,<TOPSPIN>,<proc1d>,<TOPSPIN 2.1>,
      <abs ABSG = 5 
       data hash MD5: 32K
       DC 04 AA 99 3A 50 E8 39 89 88 60 9F 49 D1 66 7F>)
$$ ##END=
$$ 
$$ $$ hash MD5
$$ $$ 54 7A 1B 80 AD 9E 56 0B 67 8A 53 F1 24 A5 AA 93
##$RELAX= 
##$RELAX= 
##$RELAX= 
##$RELAX= 
##$RELAX= 
##$RELAX= 
##$RELAX= 
$$ Bruker specific parameters
$$ --------------------------
$$ [...]
##$TP= (0..7)
150 150 150 150 150 150 150 150
##$TP07= 0
##$TPNAME0= <>
##$TPNAME1= <>
##$TPNAME2= <>
##$TPNAME3= <>
##$TPNAME4= <>
##$TPNAME5= <>
##$TPNAME6= <>
##$TPNAME7= <>
##$TPOAL= (0..7)
0.5 0.5 0.5 0.5 0.5 0.5 0.5 0.5
##$TPOFFS= (0..7)
0 0 0 0 0 0 0 0
##$TUNHIN= 0
##$TUNHOUT= 0
##$TUNXOUT= 0
##$USERA1= <user>
##$USERA2= <user>
##$USERA3= <user>
##$USERA4= <user>
##$USERA5= <user>
##$V9= 5
##$VALIST= <valist>
##$VCLIST= <CCCCCCCCCCCCCCC>
##$VD= 0
##$VDLIST= <DDDDDDDDDDDDDDD>
##$VPLIST= <PPPPPPPPPPPPPPP>
##$VTLIST= <TTTTTTTTTTTTTTT>
##$WBST= 1024
##$WBSW= 4
##$XGAIN= (0..3)
0 0 0 0
##$XL= 0
##$YL= 0
##$YMAX_a= 528619
##$YMIN_a= -659079
##$ZGOPTNS= <>
##$ZL1= 120
##$ZL2= 120
##$ZL3= 120
##$ZL4= 120
##$ABSF1= 14.98061
##$ABSF2= -5.57192
##$ABSG= 5
##$ABSL= 3
##$ALPHA= 0
##$AQORDER= 0
##$ASSFAC= 0
##$ASSFACI= 0
##$ASSFACX= 0
##$ASSWID= 0
##$AUNMP= <proc_prof1d_extract_pilot.lims>
##$AXLEFT= 0
##$AXNAME= <>
##$AXNUC= <1H>
##$AXRIGHT= 0
##$AXTYPE= 0
##$AXUNIT= <>
##$AZFE= 0.1
##$AZFW= 0.1
##$BCFW= 0
##$BC_mod= 0
##$BYTORDP= 0
##$COROFFS= 0
##$CY= 15
##$DATMOD= 1
##$DC= 0
##$DFILT= <>
##$DTYPP= 0
##$F1P= 0
##$F2P= 0
##$FCOR= 0.5
##$FTSIZE= 32768
##$FT_mod= 6
##$GAMMA= 0
##$GB= 0
##$INTBC= 1
##$INTSCL= 1
##$ISEN= 128
##$LB= 0
##$LEV0= 0
##$LPBIN= 0
##$MAXI= 10000
##$MC2= 0
##$MEAN= 0
##$ME_mod= 0
##$MI= 0
##$NCOEF= 0
##$NC_proc= -8
##$NLEV= 6
##$NOISF1= 0
##$NOISF2= 0
##$NSP= 0
##$NTH_PI= 0
##$NZP= 0
##$OFFSET= 14.98061
##$PC= 1
##$PHC0= 209.6246
##$PHC1= 0
##$PH_mod= 1
##$PKNL= yes
##$PPARMOD= 0
##$PPDIAG= 0
##$PPIPTYP= 0
##$PPMPNUM= 2147483647
##$PPRESOL= 1
##$PSCAL= 4
##$PSIGN= 0
##$PYNMP= <proc.py>
##$REVERSE= no
##$SF= 400.13
##$SI= 32768
##$SIGF1= 0
##$SIGF2= 0
##$SINO= 400
##$SIOLD= 32768
##$SPECTYP= <>
##$SREGLST= <1H.CDCl3>
##$SSB= 0
##$STSI= 32768
##$STSR= 0
##$SW_p= 8223.68421052632
##$SYMM= 0
##$S_DEV= 0
##$TDeff= 65536
##$TDoff= 0
##$TI= <>
##$TILT= no
##$TM1= 0
##$TM2= 0
##$TOPLEV= 0
##$USERP1= <user>
##$USERP2= <user>
##$USERP3= <user>
##$USERP4= <user>
##$USERP5= <user>
##$WDW= 1
##$XDIM= 32768
##$YMAX_p= 471877867
##$YMIN_p= -703302
##$CURPLOT= <Network HP LaserJet P1505>
##$CURPRIN= <$Network HP LaserJet P1505>
##$DFORMAT= <normdp>
##$LAYOUT= <+/1D_H.xwp>
##$LFORMAT= <normlp>
##$PFORMAT= <normpl>
##$SURQMSG= 1
$$ End of Bruker specific parameters
$$ ---------------------------------
##NTUPLES= NMR SPECTRUM
##VAR_NAME=  FREQUENCY,     SPECTRUM/REAL,   SPECTRUM/IMAG
##SYMBOL=    X,             R,               I
##VAR_TYPE=  INDEPENDENT,   DEPENDENT,       DEPENDENT
##VAR_FORM=  AFFN,          ASDF,            ASDF
##VAR_DIM=   32768,         32768,           32768
##UNITS=     HZ,            ARBITRARY UNITS, ARBITRARY UNITS
##FACTOR=    0.250966925370066, 1,           1
##FIRST=     8223.43324360095, 20546,        -78886
##LAST=      0,             33673,           -134264
##MIN=       0,             -703302,         0
##MAX=       8223.43324360095, 471877867,    0
$$ Real data points
##PAGE= N=1
##DATA TABLE= (X++(R..R)), XYDATA
$$ [...]
19477a93281M2901j9452F6079c03335a08433A11999J2232l8987a73467m3079l72253
19466e88799a88483k09304a79391A20120e8383j711m7441a6183k99095c7863a2127
19454b3781q5089p1794P4569B14403M4856d40581M2814i5239E8371b01482L6690
19443a64792A02719j1456J43541a37121j11640B22360b8569j85079M673N3537
19433a55438A13598g6753l4204a5166j15037G259J58246D1940a38083N0426b1091
19421A28789i8670a0709A10645b43794h2355L3682k98930J2103A30652Q6498a22400
19409A53300A3324h7589j21889B45937b05512B7922a5987B42375b25240d2068
19398b28237g9194F177a49970C40832G2143a00724k93292i4649I4921L0669b00309
$$ plain form
19477 -193281 -150380 -169832 66079 -303335 -108433 111999 124231 85244 -173467 -216546 -588799
19466 -588799 -188483 -397787 -179391 120120 -58383 -60094 -107535 -16183 -315278 -37863 -12127
19454 -23781 -108870 -180664 -106095 214403 259259 -440581 -397767 -95239 58371 -201482 -164792
19443 -164792 102719 91263 234804 -137121 -248761 222360 -28569 -213648 -208975 -155438
19433 -155438 113598 -76753 -110957 -15166 -130203 7259 165505 41940 -138083 -87657 -21091
19421 128789 -98670 -10709 110645 -243794 -82355 -48673 -347603 -335500 130652 217150 -122400
19409 153300 13324 -87589 -209478 245937 -205512 27922 -15987 242375 -225240 -42068
19398 -228237 -79194 6177 -149970 340832 72143 -100724 -394016 -94649 94921 125590 -200309
19386b09971A56904G0598a70272B2309K13019c15111a08497b1747j25197l9219
19376a86163q3195C5223b77662a3078n7942J884a2673A668b69861f1509k92923
19365c54432J53014E2433a09962j01274A58691D5099h1527A05816b77653g8740
19354b53775F1151b40124A81787h7523j7663c2765F6526a57051A37420a73738
19343f8075B23275a53109C7838h5119E0946L3347d9330l9532C35614f8844j81490
19332b50334B48346i0208o4792A77198E6516h2200D0415j8356c32012f9871k20701
19321b90572a25733D2612a97988f5159C6208a60838H4135Q5408h4718A75428d96806
19309g8441p5071m8241q720h1868k46380a14451c6975a0227C7057a82811A5464
$$ plain form
19386 -209971 156904 70598 -170272 22309 235328 -315111 -108497 -21747 -146944 -186163
19376 -186163 -269358 35223 -277662 -13078 -71020 -69136 -12673 1668 -269861 -61509 -354432
19365 -354432 -201418 52433 -109962 -211236 158691 45099 -81527 105816 -277653 -78740
19354 -253775 61151 -240124 181787 -87523 -105186 -32765 66526 -157051 137420 -173738
19343 -68075 223275 -153109 37838 -85119 50946 84293 -49330 -88862 335614 -68844 -250334
19332 -250334 248346 -90208 -155000 177198 56516 -82200 40415 22059 -332012 -69871 -290572
19321 -290572 -125733 42612 -197988 -65159 36208 -160838 84135 169543 -84718 175428 -496806
19309 -78441 -153512 -201753 -210473 -81868 -328248 -114451 -36975 -10227 37057 -182811 15464
19297A65470F4598J64993j00102b12692A99865b219m13861a25458k26706n4799
19287d06963f9100k04453A55795a92817h2012B7085a19510l29379K16223i6537
19276d8908j72432O1503e5224l70299f4315C97i6057k1641N3938K1519J5820J2080
19264a4341A07544R3504n2334d28032h7779B18463h1502j18189A8241d9417k05577
19253b54994E1276R807c6115k59147j34958F1635D286a72144f0695G5750a43088
19241G4119a91171A17946J68231J0616h2651B11065a70536h4765r7729O3533r4184
19230b13145Q1435O751O894B59762i6602L2302j52561l7128F9226i5942m159j5744
19218a15845A20914c21606J40987A52823R1820b03540a5303r5853m4507A87957
$$ plain form
19297 165470 64598 229591 129489 -212692 199865 -2219 -416080 -125458 -352164 -406963
19287 -406963 -69100 -273553 155795 -192817 -82012 27085 -119510 -448889 -232666 -96537
19276 -48908 -221340 -159837 -55224 -425523 -64315 397 -96057 -117698 -63760 -42241 -26421 -14341
19264 -14341 107544 201048 148714 -428032 -87779 218463 -81502 -199691 18241 -49417 -254994
19253 -254994 51276 61083 -36115 -295262 -430220 61635 4286 -172144 -60695 75750 -143088
19241 74119 -191171 117946 286177 296793 -82651 211065 -170536 -84765 -182494 -118961 -213145
19230 -213145 -131710 -124959 -118065 259762 -96602 -64300 -216861 -253989 69226 -95942 -100101 -115845
19218 -115845 120914 -321606 -180619 152823 244643 -203540 -15303 -111156 -155663 187957
19207a32469j03175A43476A3527K8983F103a67327k27922e758k91471a40807j44872
19196b85679D2944i8602j35920A93687G8110a1893n9793q1557j39749A10545c25053
19184e19755G0594a32441j8720m9578P6011A65883c51806J10091M886A90188A5335
19172b29100d6033D6084N9076J46618a09488j47070Q0934b3749H2220c6392q8238
19161a24630R269q0453L7848g1234H4033c51713E5741K18062d79191A56719G0041
19149b80823A94687g345H8732a41721J4856e9080A41287d1943B31398c54105B00087
19137e2283C121b22884B82165a14034A26444c01049b1949G1663b3607j91903k6449
19126b41959B03191i0907k8667G1235c05310A11302K08717c9208B93381c6807
$$ plain form
19207 -132469 -235644 143476 13527 42510 6103 -167327 -395249 -5758 -297229 -140807 -285679
19196 -285679 42944 -98602 -234522 193687 78110 -11893 -71686 -153243 -292992 110545 -325053
19184 -519755 70594 -132441 -151161 -200739 -124728 165883 -351806 -241715 -236829 190188 15335
19172 -229100 -46033 46084 105160 251778 -109488 -256558 -175624 -23749 82220 -36392 -124630
19161 -124630 -115361 -195814 -157966 -71234 84033 -351713 55741 273803 -479191 156719 70041
19149 -280823 194687 -7345 88732 -141721 -126865 -59080 141287 -41943 231398 -354105 200087
19137 -52283 3121 -222884 282165 -114034 126444 -301049 -21949 71663 -23607 -215510 -241959
19126 -241959 203191 -90907 -119574 71235 -305310 111302 320019 -39208 293381 -36807
19115a58898B40439F8939g6703A32943n4968b18768E3723J85858a82074o9537
19105b51611J23587r48A93962O203B5667J69857G084J53996g2437F318c03610
19093a33821p6357R4849k34680F4368K26147c09109R5404N1366n365a1427I5781
19081f3164k83244E4427c34362d7605m5757a8757j09485G6333c16213B3586a9062
19069B08105b15713F5090d38581g9284m2071A00709c11516I4738a59154B2308
19058b38198b0956G4878c47108a21009o714B19755I5203i7747n7608e7712m1998
19047i9710M4999F8486b69825B13088n0710A342g8460E3844f62478i4251k09156
19036c03407J27629j70037A68526C5270a29211p2394b6023j29738e8873A25535
$$ plain form
19115 -158898 240439 68939 -76703 132943 77975 -218768 53723 239581 -182074 -251611
19105 -251611 -128024 -128972 193962 200165 25667 195524 7084 161080 -72437 6318 -303610
19093 -133821 -210178 -115329 -350009 64368 290515 -309109 -213705 -162339 -167704 -11427 95781
19081 -63164 -346408 54427 -334362 -47605 -93362 -18757 -128242 76333 -316213 23586 -19062
19069 208105 -215713 65090 -438581 -79284 -121355 100709 -311516 94738 -159154 22308
19058 -238198 -20956 74878 -347108 -121009 -127723 219755 95203 -97747 -155355 -57712 -99710
19047 -99710 -54711 68486 -269825 213088 162378 1342 -78460 53844 -662478 -94251 -303407
19036 -303407 -175778 -345815 168526 35270 -129211 -201605 -26023 -155761 -58873 125535
19025g4395F106k29a20677j71243f2092k54920G6266c7478C12722h0639J5828
19014f4811l3345I955Q2535C0369a21563N9496C8746r262r557c4833k0147j4445
19002f9425j8303A46559a28927A10121J4816a60044C66306b38917B20507a08296
18991e3998j25108I7244a97880C6212c7591a5191j18218I459P5795b22495i1582
18979g4142C16472c076B14087d31953c7401I1255R7286a24429A1600d97535F527
18967h177k1725D4647O2431P7024a96390A51857a03390F1053b6347C40307N1593
18956C91900A16329M8356J13619i670C6983b16185a6143r3768n4728b8217F6637
18944c20600e9237j24209g1775E3835g7218C1227P7403a05677I2914b26827E4997
$$ plain form
19025 -74395 6106 5877 -120677 -291920 -62092 -317012 76266 -37478 312722 -80639 -64811
19014 -64811 -98156 9955 92490 30369 -121563 -62067 38746 29484 19927 -34833 -54980 -69425
19002 -69425 -87728 146559 -128927 110121 124937 -160044 366306 -238917 220507 -108296
18991 -53998 -179106 97244 -197880 36212 -37591 -15191 -133409 9459 85254 -222495 -91582
18979 -74142 316472 -3076 214087 -431953 -37401 91255 188541 -124429 11600 -497535 6527
18967 -8177 -29902 44647 107078 184102 -196390 151857 -103390 61053 -26347 340307 391900
18956 391900 116329 164685 278304 -9670 36983 -216185 -16143 -109911 -164639 -28217 66637
18944 -320600 -59237 -183446 -71775 53835 -77218 31227 108630 -105677 92914 -226827 54997
18932b29319G3267c23123M8152K6640b3155o1207q7508P6359l40999A7108e1227
18920h8885B79940G0162N9895D6387K3375b27016I4362b522j40648r4967G4831
18908b66857a1553B4251q614N41636b97653C1963J62829i9679J2629M0795C01407
18896f0843B06545A01960L07327A87395J56668j38256P310a15515H0017h8717
18885C7592J79301a59565B85635d199m26058A08920b40221R6378j00030h6681
18874a30077e2613C51978a47570n008a7883n6855B53947i233q5903C51377b04852
18862i1459I467b1420r6331o8416H1548Q3841e9881G1240e4066m0619J3333o7099
18850a48451n4740d7677j49701A41113P7478a87815C14179b93076a46292B0186
$$ plain form
18932 -229319 73267 -323123 -274971 -248331 -23155 -84362 -171870 -95511 -436510 17108 -51227
18920 -88885 279940 70162 130057 46387 69762 -227016 94362 -2522 -143170 -238137 74831
18908 -266857 -11553 24251 15637 557273 -297653 31963 194792 -99679 -87050 -46255 301407
18896 -60843 206545 101960 409287 187395 344063 205807 213117 -115515 80017 -88717
18885 37592 216893 -159565 285635 -4199 -430257 108920 -240221 -143843 -243873 -86681
18874 -130077 -52613 351978 -147570 -152578 -17883 -74738 253947 -9233 -95136 351377 -204852
18862 -91459 9467 -21420 -117751 -186167 81548 165389 -59881 71240 -54066 -94685 -81352 -148451
18850 -148451 -203191 -47677 -197378 141113 218591 -187815 314179 -293076 -146292 20186
18839a52698j6745A72707B3615N8684b55183f275A86093a34906l9907I1322a33217
18827b38312J10254A22476c99395B84281D3535a36539C78857a47512D8978r191
18817C9787j4743a37976C5713J20005d36096A12110a07120l04036G4653b46064
18806a88917B45592n9353J47076j3031C5455J27349b04803B48098A8804K73359
18796B92163E3978d4250l8049B08745E1645a02883A78581b05059A51170a72974
18785b68976b6027j59953B71348A678a98105f8026j66192A98740E5390f4108j62068
18774b26176N7378G1732b75583g0329k81100B2953a4324A62132J69733A24231
18763H9046b81154a14695k06584g0270j35830O1749k52894A36228D5025h0192
$$ plain form
18839 -152698 -169443 172707 23615 82299 -255183 -6275 186093 -134906 -174813 91322 -133217
18827 -238312 -128058 122476 -399395 284281 43535 -136539 378857 -147512 48978 39787
18817 39787 25044 -137976 35713 155718 -436096 112110 -107120 -411156 74653 -246064
18806 -188917 245592 186239 333315 320284 35455 162804 -204803 248098 18804 292163
18796 292163 53978 -44250 -82299 208745 51645 -102883 178581 -205059 151170 -172974
18785 -268976 -26027 -185980 271348 1678 -198105 -68026 -234218 198740 55390 -64108 -226176
18774 -226176 -168798 71732 -275583 -70329 -351429 22953 -14324 162132 331865 124231
18763 89046 -281154 -114695 -321279 -70270 -206100 -144351 -397245 136228 45025 -80192
18752B78265a68070k24554i5376a5322B52910b45450B48042b8980B47659g3449
18741B17034d7985j67149A32997m9504b01141C61834I957c0345p2482m45921i6587
18729A21823k5036l16J3982E4936K50955H5856i5756D7461a38136A50974b16089
18717a0941n7439k9740j32907B05757C2863a87557P0573r2759a03058H5086c79772
18705a66995l8653H5318P1149g8848o1452j94954A01883b22599J08224L1049j47325
18694b30651j3716C9022N2179a41970k32806h1629p4296A89331a38819k07659
18684c46478D6041g3345p7050o6668C5994K5036e54796K25494B07294f4168A29094
18672b77965A25898a17493G7380H388J45434e4812j39943C81884a04390c6423
$$ plain form
18752 278265 -168070 -392624 -95376 -15322 252910 -245450 248042 -28980 247659 -73449
18741 217034 -47985 -215134 132997 83493 -201141 361834 9957 -30345 -102827 -548748 -96587
18729 121823 96787 96471 110453 54936 305891 85856 -95756 47461 -138136 150974 -216089
18717 -10941 -68380 -98120 -231027 205757 32863 -187557 -116984 -209743 -103058 85086 -379772
18705 -166995 -205648 85318 156467 -78848 -140300 -335254 101883 -222599 -114375 -83326 -230651
18694 -230651 -244367 39022 91201 -141970 -374776 -81629 -155925 189331 -138819 -346478
18684 -346478 46041 -73345 -150395 -217063 35994 61030 -554796 -329302 207294 -64168 129094
18672 -277965 125898 -117493 77380 8388 153822 -54812 -194755 381884 -104390 -36423
18661C2486a71379b2632l6218j19636k12762P1284J55316C56250A7652M443a06438
18649i3793j77986a08536C44329c9730j45458f5276m25302c7359l11516f8620
18638a26425M9680K450A28158b9780j88064A38338a7355A8154b8934C7216R7977
18627A35193c4073r5708A69699e563j76242o7062B34646a61468k9021d8318C283
18615a43874q3068f953l1643j12550k97420a67464q1597O4962A02421b34070m9421
18604b83491J28944j27479C408J5315J27590a61485N2754p1651C7966d1352j22745
18593a64097l2140K1117C8749a69965C25342A48613c02727a3180l80434a19617
18582c01177i5973B3562a15834B54590a367A31503A7739f5649j18746H006b24276
$$ plain form
18661 32486 -171379 -22632 -58850 -178486 -391248 -319964 -164648 356250 17652 22095 -106438
18649 -93793 -271779 -108536 344329 -39730 -185188 -65276 -490578 -37359 -348875 -68620
18638 -126425 -76745 -74295 128158 -29780 -217844 138338 -17355 18154 -28934 37216 135193
18627 135193 -34073 -129781 169699 -5563 -181805 -248867 234646 -161468 -190489 -48318 3283
18615 -143874 -226942 -6953 -38596 -151146 -448566 -167464 -249061 -184099 102421 -234070 -283491
18604 -283491 -154547 -282026 3408 18723 146313 -161485 -108731 -180382 37966 -41352 -164097
18593 -164097 -196237 -175120 38749 -169965 325342 148613 -302727 -13180 -393614 -119617
18582 -301177 -95973 23562 -115834 254590 -1367 131503 17739 -65649 -184395 8006 -224276
18570b06474B5961a70164c4979J3389j0748n70197A4185J6429O7043J16942A04692
18558a7733j32846A27430a71442A50422K10021d21694d0885j44854j43199A51856
18547A30550b00577n6330N5540N5260I1269g2037l4908B7773M8743a30806G2374
18535I2711L9385j5098a16457e5894j65268D3833a02028r979D1122J65178a49858
18523a41682a201p5259k34733c6109A0810g3446B17129a86741l6963j32031H862
18511g583A3421Q4399K2322Q071O5348e7202A47499b43486B71323g8233A41501
18499b38134h7208J4500B37213b38685m3028F1282a67070G4094b52437h7665E203
18487c20704A02507C9580K3294c61447J67388A99976b36825A3411J02657b64559
$$ plain form
18570 -206474 25961 -170164 -34979 -21590 -32338 -602535 14185 30614 97657 214599 104692
18558 -17733 -150579 127430 -171442 150422 360443 -421694 -40885 -185739 -328938 151856
18547 130550 -200577 -256907 -201367 -146107 91269 -72037 -106945 27773 76516 -130806 72374
18535 92711 132096 116998 -116457 -55894 -221162 43833 -102028 -112007 41122 206300 -149858
18523 -141682 -1201 -76460 -311193 -36109 10810 -73446 217129 -186741 -223704 -355735 8862
18511 -7583 13421 97820 120142 128213 193561 -57202 147499 -243486 271323 -78233 141501
18499 -238134 -87208 -72708 237213 -238685 -281713 61282 -167070 74094 -252437 -87665 5203
18487 -320704 102507 39580 62874 -361447 -194059 199976 -236825 13411 116068 -264559
18476b15824K6662E4276Q6105a11932M4206A24942d67233A03260J27420b62144
18465a30681q4141L1171H6905f7435o31l70091J69101c8342A7769K57673g0965
18453b8956I466N7939F520O6348N7744r719a74573m7491P1337E6815a309C57137
18440D0332c11524Q4301g6796k03404i2960E17J40401L67134b81222b4369j32696
18429a57065L9883k59166B1766J9129a87221p861h0700l68172K12855k42879b26139
18417D0017K68109b49795c4297j43180A76293f0030C36698a89663A03782f0993
18406a42868b9615j66982J8770A76888a22990N9989C0514b84333A01325a64793
18395E3889k5478b13460g5586j26833C30881A8336b25933p0161d9005D25995A44117
$$ plain form
18476 -215824 -189162 54276 140381 -111932 -67726 124942 -467233 103260 230680 -262144
18465 -130681 -214822 -183651 86905 -67435 -68066 -438157 -269056 -38342 17769 275442 -70965
18453 -28956 9466 67405 6520 72868 130612 120893 -174573 -222064 -150727 56815 -1309 357137
18440 40332 -311524 -227223 -76796 -280200 -92960 517 140918 508052 -281222 -24369 -157065
18429 -157065 -117182 -376348 21766 40895 -187221 -195082 -80700 -448872 -236017 -478896 -226139
18417 40017 308126 -249795 -34297 -177477 176293 -60030 336698 -189663 103782 -60993
18406 -142868 -29615 -196597 -177827 176888 -122990 -63001 30514 -284333 101325 -164793
18395 53889 28411 -213460 -75586 -202419 330881 18336 -225933 -296094 -49005 425995 144117
18383B59127a74439A36315P6271c97213I0704a13182I3693J86011j34607J43363
18373B88460P908o2084D1251J13136E156c9012o174j88270G574J56787n8574g3261
18360i3840A94734a77644p6911g9261B41619a60936g0570r3997B69954d6322j61917
18349b08239a8945l32923A35461a4437g071k26634A3768B146b78570a7141A9037
18337d1572B28568Q6573A08289b8097k72122Q6700A65472A3265g7006B82310d3099
18325F1234c62714b4766A74136b14452P8068B4508i8285G6375d4079E9977k4500
18314C5477K41379a00381j03768A2734a64091C97950E6869b69834A08522b06174
18303i6964k0578G4991d3727R560j50842H7400J38028e7833E6051K1085c61440
$$ plain form
18383 259127 -174439 136315 212586 -397213 90704 -113182 93693 279704 145097 288460
18373 288460 296368 234284 41251 154387 5156 -39012 -45186 -233456 7574 164361 105787 -73261
18360 -93840 194734 -177644 -254555 -79261 241619 -160936 -70570 -164567 269954 -46322 -208239
18349 -208239 -18945 -351868 135461 -14437 -7071 -233705 13768 2146 -278570 -17141 19037
18337 -41572 228568 315141 108289 -28097 -300219 -213519 165472 13265 -77006 282310 -43099
18325 61234 -362714 -24766 174136 -214452 -136384 24508 -98285 76375 -44079 59977 35477
18314 35477 276856 -100381 -204149 12734 -164091 397950 56869 -269834 108522 -206174
18303 -96964 -117542 74991 -43727 -34167 -185009 87400 225428 -57833 56051 77136 -361440
18291A55992c77011F5919a57145q9662g0292O265q2804B8365a84914h4726R483
18280g5243H2068O1613d98882a08471J9000j75545A42649P9610b89433A29970
18269D9870a38463A31062i3171A17478J48484a26067A65657c2496E6622P5574
18259A32196R2111o1418a23553L3111k85094A61238d0062j5775A34210A903J42894
18248A44797n6776K11285a65865k06735c2572A12430D6895K14532n8867b52535
18237A67326b62023R5513j52715A54976a14684A46175n5864a06907B01773a92119
18226A98885p6724h6103a1209j01673c0044A48310C3913h6168b1549m37299f7868
18214d8288k42854I1460b66999A82262b06569f1467j96708G2266i6874j78699
$$ plain form
18291 155992 -377011 65919 -157145 -246807 -70292 -64027 -146831 28365 -184914 -84726 -75243
18280 -75243 82068 143681 -498882 -108471 -89471 -265016 142649 222259 -289433 129970
18269 49870 -138463 131062 -93171 117478 265962 -126067 165657 -32496 56622 132196
18259 132196 224307 162889 -123553 -90442 -375536 161238 -40062 -55837 134210 1903 144797
18248 144797 88021 299306 -165865 -372600 -32572 112430 46895 261427 202560 -252535
18237 167326 -262023 -166510 -319225 154976 -114684 146175 90311 -106907 201773 -192119
18226 198885 122161 -86103 -11209 -112882 -30044 148310 33913 -86168 -21549 -458848 -67868
18214 -48288 -291142 91460 -266999 182262 -206569 -61467 -258175 72266 -96874 -275573
18204b75573P9558c7320j56800n945A89718f1257o655j71693O6881q8808G3050
18192A86397b97954A6430b92771a00567j26539B03323G7042d1088A27067j5230
18182A11837d074k48050e6981C2045f3898n1385F2540m586a48152A93043c89329
18170b57673f1591C0993J27489J74594A206O6511d71925B5524K38916i9346o3790
18159a63136A72006a43675g55A49794c8964m0467k52510a07393A57705b47566
18148d6782k90676a12233D4331J55733F1598J50301B6890O378N4153c7974q6237
18137a24211D09455b45973A06462a70518j07715i4831m71951a39043C51071A46517
18126A33010a00812m7906A42225F6194b23023A93222a00294E9768b17900m2021
$$ plain form
18204 -275573 -196015 -37320 -194120 -200065 189718 -61257 -67912 -239605 -172724 -261532 73050
18192 186397 -297954 16430 -292771 -100567 -227106 203323 77042 -41088 127067 111837
18182 111837 -4074 -252124 -56981 32045 -63898 -115283 62540 57954 -148152 193043 -389329
18170 -257673 -61591 30993 158482 333076 1206 67717 -471925 25524 264440 -99346 -163136
18159 -163136 172006 -143675 -755 149794 -38964 -79431 -331941 -107393 157705 -247566
18148 -46782 -337458 -112233 44331 200064 61598 211899 26890 33268 87421 -37974 -124211
18137 -124211 409455 -245973 106462 -170518 -278233 -94831 -566782 -139043 351071 146517
18126 133010 -100812 -148718 142225 66194 -223023 193222 -100294 59768 -217900 -259921
18116b59921R6969C995R1114C8414d8096j81220b4322j32910F2906b09137J04561
18105a04576I4602a70736N4618A27873b85843g7318D7436b34087a04989M5109
18095e9880k21028C872b16894b8853C31454a30259B0796J1345R355Q4751c93339
18083c1101A39763e4418M937l20247a56401a6524m16528a29479B60448r1941a83255
18071b35713H0830N1895a59417b5936k78322J14720H5442Q9886D063a01935c6208
18059B92397a68097A50426J15836b5289n5399L3953r0776O7868B3934O3578a71257
18047a3318B3936K49404F6173a4231l7350D0653c35144F8232b06648B59494c62685
18035H6172c7197k0127C39710b45479A76343a42326j20560I8150J47985l0608
$$ plain form
18116 -259921 -162952 3995 95109 38414 -48096 -229316 -24322 -157232 62906 -209137 -104576
18105 -104576 94602 -170736 -116118 127873 -285843 -77318 47436 -234087 -104989 -59880
18095 -59880 -280908 3872 -216894 -28853 331454 -130259 20796 32141 41496 126247 -393339
18083 -31101 139763 -54418 -49481 -369728 -156401 -16524 -433052 -129479 260448 168507 -183255
18071 -235713 80830 132725 -159417 -25936 -304258 -189538 85442 175328 4063 -101935 -36208
18059 292397 -168097 150426 266262 -25289 -80688 -46735 -137511 -69643 23934 87512 -171257
18047 -13318 23936 273340 66173 -14231 -51581 40653 -335144 68232 -206648 259494 -362685
18035 86172 -37197 -57324 339710 -245479 176343 -142326 -262886 98150 246135 215527
18025B15527a01443A00310K28448d8456F0988p403i5132G5983l2875D20b7857
18013e3016m8444A22772D486h9404D4099e737j60593e7408B64625a23422A09395
18001A66004b97387A75208d7700B0175b11599c8509j13882C7836a39799F4993
17990a42348N1497K721L8827A36140K05620G4910a19135G4720d22002A41446a22189
17978A09050J45766a68428K651r0114F8025b8286M060G2071K2885J53252c0046
17966D23310A52311c12357i8943d8491j96887A68578b24196h3884A5749J29755
17956A45504l4882f4751A24106a09226o7013B9065d42360e1023F3560J72259f9263
17944A87091a10258E6540A0252b39107K3516b4824j83773g6887D2379b27077C71985
$$ plain form
18025 215527 -101443 100310 328758 -48456 60988 53585 -95132 75983 43108 420 -27857
18013 -53016 -101460 122772 4486 -89404 44099 -5737 -166330 -57408 264625 -123422 109395
18001 166004 -297387 175208 -47700 20175 -211599 -38509 -152391 37836 -139799 64993
17990 -142348 -90851 -88130 -49303 136140 341760 74910 -119135 74720 -422002 141446 -122189
17978 109050 254816 -168428 -165777 -255891 68025 -28286 -24226 72071 94956 248208 -30046
17966 423310 152311 -312357 -98943 -48491 -245378 168578 -224196 -83884 15749 145504
17956 145504 110622 -64751 124106 -109226 -176239 29065 -442360 -51023 63560 235819 -69263
17944 187091 -110258 56540 10252 -239107 -215591 -24824 -208597 -76887 42379 -227077 371985
17932F3591J28637c13752A52316n8383i6135B17169c38775B81321A9172a7883
17921a31387B95339b08434r3291A07390D3515e7341F1858J09202l9697K823e6303
17909g5887A33696A54J2836d6493m2686e018k765B3371a51185B45615A209c6005
17896g1098A13496d9364C5712a49151G0267a78393e9966A40199f1926k20345O5873
17885b16398a07163A23518P4016a04261q2549A71445h9432j8701I8599M1192a66112
17873A79858L702q1200b48149i6790D9353J76888L6783G8829j5301N6670b40726
17861E7762J60856a3480j85991C11266a62302C38146b15777B01299c06245c6399
17850A90280f7323B27686o8133F2155a06890C87955h1291K5178A18095a69886
$$ plain form
17932 63591 192228 -313752 152316 93933 -96135 217169 -338775 281321 19172 -17883
17921 -131387 295339 -208434 -301725 107390 43515 -57341 61858 171060 131363 134186 -56303
17909 -75887 133696 154 12990 -46493 -89179 -5018 -7783 23371 -151185 245615 1209 -36005
17896 -71098 113496 -49364 35712 -149151 70267 -178393 -59966 140199 -61926 -282271 -216398
17885 -216398 -107163 123518 197534 -104261 -186810 171445 -89432 -108133 98599 139791 -166112
17873 179858 183560 102360 -248149 -96790 49353 226241 263024 78829 63528 120198 -240726
17861 57762 218618 -13480 -199471 311266 -162302 338146 -215777 201299 -306245 -36399
17850 190280 -67323 227686 159553 62155 -106890 387955 -81291 -56113 118095 -169886
17839b66023B14577b7848p4055A17271C4620j0929N5027D2J051f8121h083B640
17826a29401A32003a72854j56624a45920c5847A93676L4247a54396G4912k3512
17816E1400I47K86416B1063a01565j43615B36146H6057e1440C3708b9480B00181
17804D5169b04859e4238E3870a00442A14535R2762c15118P8296A01383m9969P5191
17793A26605c42163b0287A7554M7150a85339K8171k5310f1091A61531G5858b01151
17781c1092H9230a11196I8855n379h6060C14653E378d2868G8311c6240E0167k4613
17769B5554p646a04814A50985g3013A72584b40585h4982J9316B13000k7939e4508
17757c06711A38201d4721B59620i2134D9476J03987B7477J44675i5183b9293j77914
$$ plain form
17839 -266023 214577 -27848 -101903 117271 34620 23691 78718 42 1093 -68121 -8083 2640
17826 -129401 132003 -172854 -329478 -145920 -35847 193676 227923 -154396 74912 51400
17816 51400 947 287363 21063 -101565 -245180 236146 86057 -51440 33708 -29480 200181
17804 45169 -204859 -54238 53870 -100442 114535 207297 -315118 -236822 101383 51414 126605
17793 126605 -342163 -20287 17554 64704 -185339 -157168 -182478 -61091 161531 75858 -201151
17781 -31092 89230 -111196 98855 93476 -86060 314653 5378 -42868 78311 -36240 50167 25554
17769 25554 17908 -104814 150985 -73013 172584 -240585 -84982 -65666 213000 185061 -54508
17757 -306711 138201 -44721 259620 -92134 49476 153463 27477 172152 -95183 -29293 -207207
17746b07207I8334c0804D03273n5668g8935B5408D261J6042c30447c8975F9844
17734b84922B1522f2398o8088N5950F6192j3733a45812A98014M5137k2057B9758
17722a04812h228B20702F3015c83654A045K2837p622M4386a12405e5289l6413
17711i1702C6458N1915J74811C2879L81220f405A91887a80544B02424l1423N8624
17700B29625k1939F3174J17099j3624K3220a35357j02982B27457C4001a50237
17689G6642a47009f203j6629C4581K3129K37093a07945D1197a46329A21947c014
17677a06022m4655A34738J18045r6125a79306B55259r4944C9933a7148F9243O4395
17666A33638J37327D9497L42736E8921b20951E876J5292R4759h3883e220A32252
$$ plain form
17746 -207207 98334 -30804 403273 347605 -78935 25408 4261 20303 -330447 -38975 69844
17734 -284922 21522 -62398 -130486 -74536 66192 52459 -145812 198014 243151 221094 29758
17722 -104812 -8228 220702 63015 -383654 1045 23882 16260 60646 -112405 -55289 -91702
17711 -91702 36458 88373 263184 32879 414099 -6405 191887 -180544 202424 171001 229625
17700 229625 207686 63174 180273 166649 189869 -135357 -238339 227457 34001 -150237
17689 76642 -147009 -6203 -22832 34581 57710 294803 -107945 41197 -146329 121947 -3014
17677 -106022 -150677 134738 252783 156658 -179306 255259 160315 39933 -17148 69243 133638
17666 133638 270965 49497 392233 58921 -220951 5876 21168 115927 -83883 -5220 132252
17654G4698k8138e0657D35516k12971M4051M962G5515a57394C09795C2659K35951
17643B68610E931c21666C99465e4902D1246K41915g7982A19274a10463n7419g5993
17631B25733c51885G6427J13397a41378C83636A54200l7430J00960H0671E889
17620d6389B67345F9382i4054r506F0594P0256F3731N3111a59126B46007b41272
17608d9178A71797h7334B91566c13622F2059a26667E8725a08034B75094a33084
17597c2604G7430O2764n8530a18479O262C42653I1273l1781j9813g257C10856
17585A00147a17446H5748g4820J1929A99652a34276A6308L52835A1840J59374
17575A71214J17668H6154m860e9152E708i4900J6753f709B25433k6001H7063K10912
$$ plain form
17654 74698 46560 -50657 435516 222545 266596 271558 75515 -157394 309795 32659 268610
17643 268610 5931 -321666 399465 -54902 41246 283161 -77982 119274 -110463 -167882 -75993
17631 225733 -351885 76427 189824 -141378 383636 154200 116770 217730 80671 5889
17620 -46389 267345 69382 -94054 -103560 60594 130850 63731 116842 -159126 246007 -241272
17608 -49178 171797 -87334 291566 -313622 62059 -126667 58725 -108034 275094 -133084
17597 -32604 77430 140194 81664 -118479 -112217 342653 91273 59492 39679 -7257 310856
17585 100147 -117446 85748 -74820 -62891 199652 -134276 16308 369143 11840 171214
17575 171214 288882 86154 81294 -59152 5708 -94900 -78147 -6709 225433 199432 87063 297975
17563B97975e3253A65327n9128f6849C69896E7174J60904P8297J32393A89664
17552I4093L08281A44192N6758F1718j6963J17287J02687A17696B0984N25980
17542E46964A71731B9139a43450D36002a56419B43776J74367j78503A11331P3716
17532A85047j3723k4091P0812L14025D8976M78780k36562c2105j68869I2794N6720
17521A49514B0711K05674o0207a7627A43254R1352b49570F99566K381p0233L91534
17510A023248k94678Q8331R7400j96372K58888k56989j40370j92276B0348L93170
17500D13518J04892k7208j19716K31275r1788K79620R1108Q130k87366L93696
17490I96161C53642J77215r4037J52729k93230R0219K4003p8385K17276B61225
$$ plain form
17563 297975 -53253 165327 106199 -66849 369896 57174 218078 296375 428768 189664
17552 94093 402374 144192 200950 61718 44755 162042 264729 117696 20984 546964
17542 546964 171731 29139 -143450 436002 -156419 243776 418143 239640 111331 185047
17532 185047 171324 147233 218045 532070 48976 527756 291194 -32105 -200974 92794 149514
17521 149514 20711 226385 166178 -17627 143254 234606 -249570 699566 701947 631714 1023248
17510 1023248 728570 816901 914301 717929 976817 719828 579458 387182 20348 413518
17500 413518 518410 491202 371486 602761 510973 790593 881701 889831 602465 996161
17490 996161 353642 530857 436820 589549 296319 386538 410541 332156 549432 261225
17479E75479k55139j36546J12708f0657j9656C18060J51710c327C1517K20004
17469B51521J52049p6456J6179A31136e316B15082o1935k8738J03855o4270J69165
17458C33159r44J21024a63890B30665L8457j26566J41418M5403o2525B4594L02306
17447C26900A29012M5990J71469Q2567a2166C09665M0136a9888D19374A94481
17436A97608L26361k19509R0008k3137j77323J51481J05311K87598C41305j70525
17426A70780L35357k51036J21642K06708K0519j63305k04236M1506g160G27635
17415E34295L8950R4529j58414k53856j77N753a20018C07714J29541M3260A4241
17403E02630j81810r5930K19355J59056j82024p6019J8862J41067B04872P0193
$$ plain form
17479 575479 320340 183794 296502 -60657 -80313 318060 469770 -3327 31517 251521
17469 251521 403570 327114 343293 131136 -5316 215082 153147 124409 228264 163994 333159
17458 333159 332215 453239 -163890 230665 269122 142556 283974 329377 266852 24594 326900
17447 326900 129012 175002 346471 429038 -12166 309665 349801 -19888 419374 194481
17436 197608 523969 304460 394468 371331 194008 345489 450800 738398 341305 170780
17426 170780 506137 255101 376743 583451 603970 440665 236429 277935 -7160 727635
17415 534295 573245 667774 509360 255504 255327 261080 -120018 307714 437255 480515 14241
17403 502630 320820 224890 444245 603301 421277 345258 364120 505187 204872 275065
17393B75065K22674B41599J77150H4746n145M8056J26324F8182K93759j20216
17383B41725K12894o1505J11802B44629J17613p1566F1221L12402j51548O6877
17373B88952J25294G140J87078P6631B8644M71877k44679G0340a42026A28718
17362F2041g853F1611j3687M73446k10168Q9973a81176D29379A41975n0881Q4498
17351A75592L13734D2878R6013M7431J62215D1124M364K50423l6356e8608H2911
17339C71966K07614k60197o6688q9719L25111B09853K69756A65576K37628j65939
17329B37265k7390N4064P0104C3694J91236R8401K28426G3654k301J05332K54728
17318D31413a63911C84302A65416J65061J90945A16140k3618L08280j98456l7712
$$ plain form
17393 275065 497739 241599 418749 84746 79601 127657 253981 68182 361941 241725
17383 241725 454619 393114 504916 244629 362242 290676 61221 373623 222075 288952
17373 288952 414246 7140 194218 270849 28644 500521 255842 70340 -142026 128718
17362 62041 -7853 61611 47924 521370 311202 401175 -181176 429379 141975 91094 175592
17351 175592 489326 42878 138891 186322 348537 41124 45488 295911 259555 -58608 82911
17339 371966 579580 319383 252695 162976 488087 209853 479609 165576 403204 237265
17329 237265 209875 263939 334043 33694 224930 323331 551757 73654 71353 176685 431413
17318 431413 -163911 384302 165416 330477 521422 116140 92522 400802 202346 164634
17308A64634J99784A41415J63350O2442a406C88679A02559b0976B94586e855m076
17297i931C31446h8866D37365E3234J67235a2113A20586K40075o7225j46326K7239
17286A74349K70412A66600j8672J21522G7638K09815D4099J92210M37146e7146
17275C96308K4859A88055J96010A18156J69279J74427j48687J0025r251A4547
17264F36854k56352J09746j96148l2546A16633C5027K97486A23902J63282L284
17254B90468K86363A61239a16463E02946B49290j05709J84553A32232L40007J3842
17244D86081p9403A87655J58897J94479B66446M9174J60342o43l9618q2337j11112
17233B42252K3671M50860l5026k94503A09435j9897K87908M6763l5828A40733
$$ plain form
17308 164634 364418 141415 304765 367207 -1406 388679 102559 -20976 294586 -5855 -9931
17297 -9931 331446 -88866 437365 53234 220469 -12113 120586 360661 293436 147110 174349
17286 174349 444761 166600 147928 269450 77638 287453 44099 236309 673455 -57146
17275 396308 421167 188055 384065 118156 287435 461862 313175 323200 313949 14547
17264 636854 380502 490248 294100 261554 116633 35027 332513 123902 287184 290468
17254 290468 576831 161239 -116463 502946 249290 143581 328134 132232 472239 486081
17244 486081 406678 187655 346552 541031 266446 315620 475962 475319 435701 353364 242252
17233 242252 265923 716783 681757 387254 109435 89538 377446 424209 388381 140733
17222C29542O9561p3240k9913J76503k24891K03073J16067n5015j50478j22818
17212B38391J41024L5485j49009J42300p8375A26519L94155j07058J85327A59417
17201G11749A49830K04689j11689Q5741J64616j94762K02565r1414K16731j66439
17191D59868A90442K0098J83428L48703k59684j42258K99254k91957O7264C7626
17180C59864R2415N5667j97308P5656Q1943A17523M94478j12953D8751N56138
17170F04889j22196m4993K18333m6308A02273N59814B21924J1697J9174J17167
17160C69962O6186J76471j26119M1587l6887A20234q790J19181N21562B23307
17149D43114j3466M4544j84336L71897j23223q2407j51342O8050L65249k98773
$$ plain form
17222 329542 399103 325863 295950 472453 247562 450635 566702 511687 361209 238391
17212 238391 379415 414900 265891 408191 329816 126519 520674 413616 598943 159417
17201 711749 149830 354519 242830 328571 493187 298425 500990 409576 626307 459868
17191 459868 190442 210540 393968 742671 482987 340729 639983 348026 415290 37626
17180 359864 452279 507946 310638 386294 468237 117523 612001 499048 48751 604889
17170 604889 482693 437700 656033 609725 102273 662087 221924 233621 252795 369962
17160 369962 436148 612619 486500 528087 491200 120234 111444 230625 752187 223307
17149 443114 429648 474192 289856 661753 538530 456123 304781 372831 738080 439307
17139D39307J03626K43584j90774p0019P6394J01459k52317j03728J61564L0045
17129E39141B38358r3834L85832N3147o8227j48390L06085j95679R6521k77026
17119B96787L59752J66543k86711o3321N6079J43591J5277l0178B52831Q5841
17109C38672Q7939p3831J28371N2597j10708K77321I6843J55115N57142l90174
17099D18926K06377p8389k02505r4122J36643J88623m6413k3998L9571J39991
17089F84704l14165J63236P6980j09629J42534j32642N56505m21686n3316m2474
17079E50047J14893J61933k6855J88497D57097K00888L45522D33342K72641o3525
17069F42458K18055M4123l37313L9759J82126k14574j15438M25480l27411O672
$$ plain form
17139 439307 542933 786517 595743 525724 602118 703577 451260 347532 509096 539141
17129 539141 238358 144524 530356 583503 515276 366886 672971 477292 573813 296787
17119 296787 656539 823082 536371 473050 529129 672720 687997 657819 252831 338672
17109 338672 426611 352780 481151 533748 423040 700361 96843 251958 809100 418926
17099 418926 625303 546914 344409 250287 386930 575553 529140 505142 544713 684704
17089 684704 370539 533775 610755 501126 643660 511018 1067523 645837 592521 550047
17079 550047 664940 826873 800018 988515 457097 657985 1003507 433342 705983 642458
17069 642458 860513 904636 567323 607082 789208 574634 459196 884676 557265 563937
17059E63937P2873J54306n8525J9984J99262R9030D78509K54761j10608J7235
17049F39897J22897j97911K73017o4624J59057j31449K3410J28438k93997L40369
17039I99104k7916J59106l79550K8365K93956k76866q0925L38479p1393r7871
17029H84489L2865J75753l36793M6520Q8157l6932J33875l67381K05458K91949
17019A117960m27460j6343L48342P2632k26400l7259J82091J35357m487n45743
17009E98690N58195k29662R4928l2678j06994L39485m3025l32941J07043J42034
16999A095075q8268K11624j19090J95010l13864L1320j10576J42454K37500l03374
16989I77811J84706l04997L56724l31881M13574J60010k21618l0533m0866j25501
$$ plain form
17059 563937 636810 791116 732591 752575 951837 1050867 478509 733270 622662 639897
17049 639897 762794 564883 837900 773276 932333 800884 824294 952732 658735 999104
17039 999104 971188 1130294 750744 779109 1073065 796199 715274 1053753 982360 884489
17029 884489 917354 1093107 756314 802834 890991 854059 987934 620553 826011 1117960
17019 1117960 690500 674157 1022499 1095131 868731 831472 1013563 1148920 1144433 598690
17009 598690 1156885 927223 1022151 989473 882479 1221964 1178939 845998 953041 1095075
16999 1095075 1006807 1218431 1099341 1294351 980487 1011807 901231 1043685 1281185 977811
16989 977811 1162517 857520 1214244 882363 1295937 1455947 1234329 1203796 1162930 1037429
16979A037429N17002l48746K052J65087r9868J3206k00021L09782p2158n4289
16969A269476j975J28203l36337N03073k94865K00668r2949j49540J23120o9453
16959A279421j84706K41868K22885k54239P0782N4899J48309K9227K39781j10079
16949A738148r3686j42070L4431R0534j98968K4112L4472L67696k71j59870j68476
16938A526052P8311J62524l7434R3757j65216M0234k78648K18360K20416k53229
16928A605127J93788j54799J81162K76873O8156q3710l64791K79573j88092j72645
16918A640642N59611j98996J40061j28379j11303K88252N685J10107k72701L83161
16908B416140r7675k54216L16111k01997P7071J23038j29500L24867p3025j01443
$$ plain form
16979 1037429 1554431 1205685 1207737 1372824 1272956 1286162 1086141 1395923 1323765 1269476
16969 1269476 1267501 1395704 1059367 1562440 1267575 1468243 1375294 1225754 1348874 1279421
16959 1279421 1094715 1336583 1559468 1305229 1376011 1430910 1579219 1608446 1848227 1738148
16949 1738148 1644462 1502392 1536823 1627357 1428389 1452501 1486973 1854669 1854398 1694528 1526052
16938 1526052 1604363 1766887 1729453 1823210 1657994 1698228 1419580 1637940 1858356 1605127
16928 1605127 1798915 1644116 1825278 2102151 2170307 2086597 1721806 2001379 1813287 1640642
16918 1640642 2200253 2001257 2141318 2012939 1901636 2189888 2195573 2305680 2032979 2416140
16908 2416140 2318465 2064249 2380360 2178363 2255434 2378472 2248972 2573839 2500814 2399371
16898B399371j75074N55571l62216m2789n2987L62132j75033N5130n2538M766
16888B516333K15022L20701k67511j6211J19441J2106J51486K40906k45380l17554
16878B729339K83205J42737P1160n8655M7970r7847n388K89426j17414L66912
16868C651445m80102p3139J47674K94102j01821K8898M15502L5115p2080M4819
16858C890413J20606m9607J10742p0567k81100O11263j21509Q7278j93853J6615
16848D120281K12683K25427j28473M85831l83365j4087L48266j79872L84743k00157
16838D871277Q0344l1547K41583K6870p0960L06906m0746K80147j78773L47301
16828E832402k08979L78942j89052O06269j29892P2866K47317j78282J42779j8177
$$ plain form
16898 2399371 2224297 2779868 2417652 2374863 2321876 2684008 2508975 2564105 2511567 2516333
16888 2516333 2731355 3052056 2784545 2768334 2887775 2899881 3051367 3292273 3046893 2729339
16878 2729339 3012544 3155281 3226441 3167786 3215756 3117909 3112521 3401947 3284533 3651445
16868 3651445 3171343 3098204 3245878 3539980 3438159 3467057 3882559 3917674 3845594 3890413
16858 3890413 4011019 3961412 4072154 4001587 3720487 4331750 4210241 4297519 4103666 4120281
16848 4120281 4332964 4558391 4429918 4915749 4532384 4518297 4866563 4686691 5071434 4871277
16838 4871277 4951621 4920074 5161657 5188527 5117567 5424473 5383727 5663874 5485101 5832402
16828 5832402 5623423 6002365 5813313 6419582 6289690 6362556 6609873 6431591 6574370 6556193
16818F556193M89430J44501R4439k2539k2034R1131L33872J87046J63518Q7550
16808H103107q7895M22606K65005K83730J2166K88329R1095l16687R33882k30209
16798I765129M792L88232J09552L23499K61753j50249K27645N96180O04452j20589
16788A2010396M5562M73632L19860J01444L22982N53126L1125L22059N32491M10304
16778A5122981K25437L93404L99994K49667N55732N13683N66192Q8642P47145
16769A8862877O93003N14200M94842Q02305K27523Q62962O54744K77384J072314
16760B4462154N38545R24346R98017R11566J000085O09761Q22972J180179R10997
16751C2358622R65779J400546J288842Q84809J482089J573958J432359J445243
$$ plain form
16818 6556193 7045623 7190124 7284563 7262024 7239990 7331121 7664993 7852039 8015557 8103107
16808 8103107 8015212 8437818 8702823 8986553 8998719 9287048 9378143 9061456 9995338 9765129
16798 9765129 9769921 10158153 10267705 10591204 10852957 10702708 10930353 11526533 12130985 12010396
16788 12010396 12055958 12529590 12849450 12950894 13273876 13827002 13858127 14180186 14712677 15122981
16778 15122981 15348418 15741822 16141816 16391483 16947215 17460898 18027090 18115732 18862877
16769 18862877 19555880 20070080 20564922 21367227 21594750 22457712 23112456 23389840 24462154
16760 24462154 25000699 25925045 26923062 27834628 28834713 29444474 30267446 31447625 32358622
16751 32358622 33324401 34724947 36013789 36898598 38380687 39954645 41387004 42832247
16743D2832247J189497J647708K039332J784822J822582J795257K217397K044275
16735E7373117K589056K368057K092752K609268K662767K523143K618025K666824
16727G7503009L525465K617663K965116L492660L032294L187624L058062L232705
16719A02614598L306949K536290L572405K553101K988699K200357K528917K135639
16711A24436955J628272J813613J063168J170159J71065N98873m90465k57960
16703A30133680j059402j126879k019551j676488k266920k232514k142150k783721
16695A14826055k969747l130183l351457k770171l343702l455761k788723l279585
16687H9736726l077468l579360k502621k789208l064060l040619k770220k192489
$$ plain form
16743 42832247 44021744 45669452 47708784 49493606 51316188 53111445 55328842 57373117
16735 57373117 59962173 62330230 64422982 67032250 69695017 72218160 74836185 77503009
16727 77503009 81028474 83646137 86611253 90103913 93136207 96323831 99381893 102614598
16719 102614598 105921547 108457837 112030242 114583343 117572042 119772399 122301316 124436955
16711 124436955 126065227 127878840 128942008 130112167 130283232 130882105 130391640 130133680
16703 130133680 129074278 127947399 125927848 124251360 121984440 119751926 117609776 114826055
16695 114826055 111856308 108726125 105374668 102604497 99260795 95805034 93016311 89736726
16687 89736726 86659258 83079898 80577277 77788069 74724009 71683390 68913170 66720681
16679F6720681l192346k176596k139378k004037k384817k179100k073148j800838
16671D8770421j682676j905074j406861k187015q97393j757673j385623j032116
16663C6515990j131926j336976j429117q07973j154694j036539r60875q00270
16655B7857620r20654j080601m82643q73788q13700p00201r02215k21331p24024
16646B1138463r29140l83504n79669n84642n27820k16359m57460o39750m94762
16637A6325357k40142m99555j51911n07311l73754l01066m42410l51787l2670
16628A3424751o47229m82610j27883k67769l01514l53364l01546L8204n43663
16619A0437377P3961l60786l17553J70844j48689k61934l40235l81832p8972m02251
$$ plain form
16679 66720681 63528335 61351739 59212361 57208324 54823507 52644407 50571259 48770421
16671 48770421 47087745 45182671 43775810 41588795 40691402 38933729 37548106 36515990
16663 36515990 35384064 34047088 32617971 31809998 30655304 29618765 28657890 27857620
16655 27857620 26936966 25856365 25373722 24499934 23686234 22986033 22083818 21862487 21138463
16646 21138463 20209323 19825819 19246150 18661508 18133688 17917329 17459869 16820119 16325357
16637 16325357 16085215 15585660 15433749 14926438 14552684 14251618 13809208 13457421 13424751
16628 13424751 12777522 12294912 12167029 11899260 11597746 11244382 10942836 10981040 10437377
16619 10437377 10511338 10150552 9832999 10003843 9855154 9593220 9252985 8871153 8792181 8389930
16609H389930J03626k46175J08258m22917o655k2952m83763J23276k19424l96187
16599F927017K16815k54640j46871j71530J34077k58992k05246k68442Q9258n9267
16589F002179n25626J34203J62959j21l76905K28590n04586K53269q3182k14677
16579E076103N4086o9262k3069k52543k95919j4562K18793m04812J79888k13393
16569D255310J62152O4859j17231k16572m65995K75881O5621K07799k47859n16575
16559C467390N30052l12178N2342K03997o68133R7742J14164P644m2895k29927
16549C220198j00036J07137j01585K94623m21203l99403L32513R7271Q443k83930
16539B754028K75548k66288K38971k00799N379k57876J62212j28336j92956J7791
$$ plain form
16609 8389930 8493556 8247381 8355639 7932722 7926067 7903115 7419352 7542628 7323204 6927017
16599 6927017 7143832 6889192 6742321 6570791 6704868 6445876 6240630 5972188 6061446 6002179
16589 6002179 5476553 5610756 5773715 5773594 5396689 5625279 5120693 5373962 5290780 5076103
16579 5076103 5130189 5060927 5037858 4785315 4489396 4474834 4693627 4288815 4468703 4255310
16569 4255310 4417462 4482321 4365090 4148518 3682523 3958404 4024025 4231824 3983965 3467390
16559 3467390 3997442 3685264 3737606 3941603 3273470 3371212 3485376 3493020 3450125 3220198
16549 3220198 3120162 3227299 3125714 3420337 2999134 2599731 2932244 3029515 3037958 2754028
16539 2754028 3029576 2763288 3002259 2801460 2806839 2548963 2711175 2582839 2389883 2407674
16529B407674j60866L16577n7614J94843j25780k73572o2549k2748k96996J77985
16519B096954L14987k43538k0411q4460J30978r2359K19825j71051j1894J6628
16509B155659k24862J81385N0671k00938j17670K13336l99657L07847K91592k81354
16499A976009k54500J5195m2028L6753J79494J69694l35537P877r350O1417J21402
16488A926426j61667N0345l19201K74382m834l45932M01256n67347o7306L42882
16478A529004J01712j81594P554J01652l40502J94590r1656L358P0837K79650
16468A674605r5295k32221j67673K01805J6109j56872n5899J29191K46145k87436
16458A272459k31765J54362k09158K42445l0437Q5157n6786m8791N1222R5004
$$ plain form
16529 2407674 2246808 2563385 2505771 2700614 2574834 2301262 2238713 2215965 1918969 2096954
16519 2096954 2411941 2168403 2147992 2063532 2194510 2102151 2321976 2150925 2139031 2155659
16509 2155659 1930797 2112182 2162853 1961915 1844245 2057581 1657924 1965771 2257363 1976009
16499 1976009 1721509 1736704 1694676 1731429 1910923 2080617 1745080 1752957 1743607 1805024 1926426
16488 1926426 1764759 1815104 1495903 1770285 1765451 1419519 1820775 1253428 1186122 1529004
16478 1529004 1630716 1449122 1456676 1558328 1217826 1412416 1320760 1324118 1394955 1674605
16468 1674605 1579310 1347089 1179416 1381221 1397330 1240458 1184559 1313750 1559895 1272459
16458 1272459 1040694 1195056 985898 1228343 1197906 1283063 1226277 1177486 1228708 1323712
16448A323712o9849k21440j1464j22926L30193P495k98298Q9225Q0401j7965l1814
16437A057270j27408K19397K2910k08487J36124J4497j0738m6437j35623M19050
16427A340555m78699N2468R3519j54212K01253Q448j56791K52953k37943k9427
16417H92124L07359p1196j71288j42948O4209p3443O0160k98327M92667m82950
16407E76367N30693j40979l03698L09645j40155K7870j56619K24527o8758j61323
16397F97570J05559n5354K6610J7155j97392L80327k57429k2953l1836L62027
16387A024284m99526N8578O6109K95548l82641m3847J01321R2296j72234L8546
16377E78434K59877p610q9916k08336k8508q2115P9656L91515C42063N14064k11041
$$ plain form
16448 1323712 1253863 1032423 1020959 898033 1228226 1235721 937423 1026648 1107049 1089084 1057270
16437 1057270 929862 1149259 1172169 963682 1099806 1114303 1103565 1057128 921505 1340555
16427 1340555 861856 914324 1007843 853631 1054884 1063332 906541 1159494 921551 892124
16417 892124 1199483 1128287 956999 814051 878260 804817 864977 566650 1059317 576367
16407 576367 1107060 966081 662383 972028 831873 859743 703124 927651 858893 697570
16397 697570 803129 747775 774385 791540 594148 974475 717046 694093 662257 1024284
16387 1024284 524758 583336 649445 944993 562352 518505 619826 712122 539888 578434
16377 578434 838311 830701 740785 532449 503941 421826 501482 892997 342063 856127 645086
16366F45086k8194m2540N1995N3199j6355r7682n8767l7763J76661J22588j04613
16355F63615l6674q7545p4652J45332p8627R6443l0321J76698l83883K08356j35386
16344D63356l0503M03679j03721j98457J02201M0102o9719P1096k5411j56712
16334D95911j49635A11707O25381C65497K85187j27700j34336N4890l2737R9125
16324E09926r9391A49656L73701j12781J95245B78607M19117k6838j70564l2043
16314D68279O9236K4170E7248K24206K21590H3786K19174J39418j51999K27375
16304E17754K8113k16212Q1470Q3906J94301K85774A05059N39140I0350L51732
16294D42082j52676b3304D33186k13191L95612H9575B2593L72089N2700r0052
$$ plain form
16366 645086 616892 574352 626347 679546 663191 565509 506742 468979 645640 768228 663615
16355 663615 626941 539396 464744 610076 531449 627892 597571 774269 390386 598742 463356
16344 463356 432853 836532 732811 534354 636555 676657 606938 678034 652623 495911
16334 495911 346276 111707 737088 365497 650684 522984 388648 443538 410801 509926
16324 509926 410535 149656 523357 410576 605821 278607 697724 670886 500322 468279
16314 468279 537515 561685 57248 281454 503044 83786 302960 442378 290379 517754
16304 517754 545867 329655 411125 495031 689332 975106 105059 644199 90350 442082
16294 442082 289406 -23304 433186 219995 615607 89575 22593 394682 447382 357330
16284C57330l8363J14182P4198B34203M52095B93699L9308L97416G7332J7062
16274I4394L21475j29400J58920N551m3593m0557M9536A65792A4973M41114c3187
16262D17229P7152K1330B25749Q7236i9095C74746K0707J9964A12199L29593K42590
16251F84382B68308q1099o8491K97148A52228J58915J24856A98132J02984P8212
16241C79328j65490K0703A16205N4980J63320j21622o0331L2907A8111K19315
16231B37426K05065C8401d352B41656n4597H5378L4958k0812J30457J75855A23300
16219A11031l4367K56552A18389L55181A40334n924K59576m4375F821J64496b3336
16207E03568B33062F9160L45111A02945N8346G5417N85809A76537J3992K32589
$$ plain form
16284 357330 318967 433149 507347 234203 686298 293699 333007 730423 77332 94394
16274 94394 415869 286469 445389 450940 407347 366790 416326 165792 14973 456087 -33187
16262 417229 494381 515711 225749 312985 -99095 374746 395453 415417 112199 441792 684382
16251 684382 268308 187209 118718 415866 152228 311143 435999 198132 301116 379328
16241 379328 213838 234541 116205 171185 334505 212883 152552 185459 18111 237426
16231 237426 442491 38401 -4352 241656 187059 85378 120336 99524 229981 405836 123300
16219 111031 76664 333216 118389 473570 140334 134410 393986 349611 6821 171317 -23336
16207 503568 233062 69160 414271 102945 161291 75417 661226 176537 190529 423118
16197D23118o6722A50103K45651p6431j48859K09229q0235p9511A02392K26833
16187C29225L2518n6762k6280A19099P7695N8693O9118K534q4878o6216K93396
16176D69441b0823B4427K20421r2438M3813q6417J21475C7743J2351a05632o9368
16165a75000B72745o0210J53421j53575Q5186A46566N9044p587N1671j19469R2281
16154B22506g1514E2864K20666a3980B86174A27494K9140a18536B8975R387j4138
16143B4224M4479L52482A27715A6430a30636D1112d979G8341C0729J32771i9793
16131A29253L2873P1889J39219A74635J09751p9930K31667b9294A28856k4976
16121A03880b10926d6626B66968K26394A5221J40810L0108a49596n007D40970
$$ plain form
16197 423118 356396 150103 395754 319323 170464 379693 299458 219947 102392 329225
16187 329225 361743 304981 278701 119099 196794 255487 324605 327139 242261 176045 469441
16176 469441 -20823 24427 244848 152410 196223 109806 231281 37743 50094 -105632 -175000
16165 -175000 272745 212535 365956 212381 297567 146566 205610 198023 249694 130225 222506
16154 222506 -71514 52864 273530 -13980 286174 127494 156634 -118536 28975 38362 24224
16143 24224 68703 421185 127715 16430 -130636 41112 -4979 78341 30729 163500 -99793
16131 129253 162126 234015 373234 174635 284386 204456 436123 -29294 128856 103880
16121 103880 -210926 -46626 266968 493362 15221 156031 186139 -149596 -154603 440970
16110A9090J13595n1204l8277K49327O6272a29723c5676G0779L11054j14299o3925
16099B03609a48165j5954A60497D1613J43970o0096l9436Q5972l5654O9965H904
16087b34958H4354k735f7311k28257A41279a29734B05071e7131A62487e2708E5634
16075c0608B66540R9575b13955H0150J49383a03010B76257H8136f1767F3930f8077
16063a68933B718g0707E6831J86094m8066B3773R5506M02505D1752b19151B55523
16051B1834L49323c22395a09312H1251A3829f3736D00021p684r4889h6529D29649
16039d33791C07942A30838f6014E1439K4293J19533K0130Q8622A0524J20403m4692
16028H6235c1754B6130M28811k12169J60251A49122R0839a29777j28583F4770
$$ plain form
16110 19090 132685 81481 43204 292531 358803 -129723 -35676 70779 381833 267534 203609
16099 203609 -148165 -164119 160497 41613 185583 125487 86051 172023 136369 206334 8904
16087 -234958 84354 81619 -67311 -295568 141279 -129734 205071 -57131 162487 -52708 55634
16075 -30608 266540 366115 -213955 80150 229533 -103010 276257 88136 -61767 63930 -68077
16063 -168933 2718 -70707 56831 242925 194859 23773 119279 521784 41752 -219151 255523
16051 21834 371157 -322395 -109312 81251 13829 -63736 400021 392337 297448 -86529 429649
16039 -433791 307942 130838 -66014 51439 75732 195265 215395 304017 10524 130927 86235
16028 86235 -31754 26130 454941 242772 403023 149122 239961 -129777 -258360 64770
16017b82755C9122R8995n6504K8028J68156j31644e3633j27883B54831L9991j26641
16006A68181d8975p6273A07599A1086L46535e3354B96212e9581j35732o1381m412
15995b61106A30802a4747k29654J19119d6310A073b29148o9873C0716J1305O50
15984D2671Q1681i7141B28236K20859A26979C9832J10564g5256A7768P5682j2625
15973H0825K78888L50285M05867k51634K34621l76683J07635m12351j82865K57772
15963D92360r0172A13752f34B49664c8537B32877R929B9251b418B49535a30800
15951b0230A2488L70770m7793b43911C7373b2976K662A6721L6928h7143k05037
15940b92180J19583A10671B2381J49613C2946a68339A27024E4029K23763b02407
$$ plain form
16017 -282755 39122 138117 81613 109641 277797 146153 -53633 -181516 254831 294822 168181
16006 168181 -48975 -125248 107599 11086 357621 -53354 296212 -59581 -195313 -256694 -261106
15995 -261106 130802 -14747 -244401 -125282 -46310 1073 -229148 -299021 30716 42021 42671
15984 42671 124352 -97141 228236 449095 126979 39832 150396 -75256 17768 93450 80825
15973 80825 359713 709998 1115865 864231 1098852 722169 829804 417453 234588 492360
15963 492360 402188 113752 -634 249664 -38537 232877 242806 29251 -2418 249535 -130800
15951 -20230 12488 383258 335465 -243911 37373 -22976 -20314 16721 53649 -87143 -292180
15940 -292180 -172597 110671 22381 171994 32946 -168339 127024 54029 277792 -202407
15929c760B09852D6657A5742J45863b29581j02713H7495e0971j76806B05492N5678
15918B61170I3394J91b19748d5129J168B29363I2277a27858k10506C0113K4961
15907E5074a58507d469j79028l5774A40306Q9290a18674d0427j20867o9881b210
15895B50658m2150M4897b40215q8692a03956l87536a3887D1720a30113e4868B11339
15883A07260J72954j20971N865a49609e9859p8472k3900k27881A2831e7481F5788
15871g1977B76969D4152f7748l2558c9456a5172j42362L7533M4123a8439l9385
15860e7824p6409A97859J43468I4457H417a12645N5976B57715b81524A37939c05017
15848E2332B2951a53338N4440C9196b1857D8738a50931H6464B5817a83634A60244
$$ plain form
15929 -3760 209852 46657 15742 161605 -229581 -332294 87495 -50971 -227777 205492 261170
15918 261170 93394 93585 -219748 -45129 -43961 229363 92277 -127858 -338364 30113 55074
15907 55074 -158507 -4469 -183497 -219271 140306 229596 -118674 -40427 -161294 -231175 -2210
15895 250658 208508 253405 -240215 -328907 -103956 -491492 -13887 41720 -130113 -54868 211339
15883 107260 280214 159243 165108 -149609 -59859 -138331 -162231 -390112 12831 -57481 65788
15871 -71977 276969 44152 -67748 -100306 -39456 -15172 -157534 -120001 -75878 -18439 -57824
15860 -57824 -134233 197859 341327 94457 8417 -112645 -56669 257715 -281524 137939 -305017
15848 52332 22951 -153338 -98898 39196 -21857 48738 -150931 86464 25817 -183634 160244
15836a72019m365j54970A26462K5210a42211M4696A34980L0955a67529b7010N547
15825b1463k52286P8728E9690h5638a6011A6517j292c20262A10077J0849e5492
15813b09451d6882m37157J10783D2442J83081b0194p9645j0137K3589j27360A06959
15801a00577J5842B4877N5551L2717a60740E1120a06504N0121j10021N2064B18441
15789b1540A30922j6542J44325a2668j37063E0567b46261C3978d74840f6846A4960
15777a54997N5952j13362J7318F2144Q391K08763I4311b08795B27719F8119K7873
15766I5992J3538h3730F006M1163b78979L5763O7578A22438B8092h5731Q750H9239
15753F9199M7169P6523a84383A0233J27641l9533a36796j25850R8626A4335M10515
$$ plain form
15836 -172019 -176384 -331354 126462 151672 -142211 -97515 134980 165935 -167529 -27010 -21463
15825 -21463 -273749 -195021 59690 -85638 -16011 16517 15225 -320262 110077 120926 -55492
15813 -209451 -46882 -484039 -373256 42442 225523 -20194 -99839 -109976 -86387 -213747 106959
15801 -100577 -84735 24877 80428 113145 -160740 51120 -106504 -56383 -166404 -114340 218441
15789 -21540 130922 114380 258705 -12668 -149731 50567 -246261 33978 -474840 -66846 14960
15777 -154997 -99045 -212407 -195089 62144 70535 279298 94311 -208795 227719 68119 95992
15766 95992 109530 -83730 6006 47169 -278979 -243216 -175638 122438 28092 -85731 -76981 89239
15753 69199 116368 192891 -184383 10233 137874 98341 -136796 -262646 -164020 14335 424850
15742D24850b54222h6063B44572a08814D18287j65556a2595E6824b54491A24880
15731B27544a11165B68308j07000a14426E4882a49939G2722J01660b59525C46205
15720g16j57178r095A94023o7805C6310q760h9316n5453B760M9651N7278d7798
15707E6092J42105L7424a713l20238a42642C87630A15792c01717N6984g8221j08295
15696a86516A1703a10632B12817b30692B16409a51669A09864b61442A68947b15172
15685a87604a6459F405O0811a25326N7278k23387f4273n8329D01903g738K28F2506
15672B13719a0497n6987D0770O6321K8439M3344o8651j4636B6099e66207B53047
15660h8100A65994o3217b2741D0148a31541B7973J93988j05790E021d20672a95288
$$ plain form
15742 424850 -254222 -86063 244572 -108814 418287 252731 -12595 56824 -254491 124880
15731 227544 -111165 268308 161308 -114426 54882 -149939 72722 174382 -259525 346205
15720 -716 -157894 -166989 194023 126218 36310 27550 -89316 -144769 2760 52411 109689 -47798
15707 56092 198197 235621 -1713 -321951 -142642 387630 115792 -301717 -244733 -78221 -186516
15696 -186516 11703 -110632 212817 -230692 216409 -151669 109864 -261442 168947 -215172
15685 -187604 -16459 6405 67216 -125326 -68048 -291435 -64273 -122602 401903 -7738 -7510 62506
15672 213719 -10497 -67484 40770 107091 135530 178874 110223 95587 26099 -566207 253047
15660 -88100 165994 102777 -22741 40148 -131541 27973 221961 116171 5021 -420672 -195288
15648b89574g1534j67752A69118a65256k5499h5840A0225J65191b42580J1200
15638b31380b7449q3404M6444C6783c2448G095K74391e6496I7244c5746m987a3118
15625a05413k0433C0860N9452b09715Q1788B20955r4296a8871p4390c6533A07408
15613b11547e9992n0020d7506A06581f8110k0735j28504h0112A6865g1213C9332
15601C0437a01819C8174a89036A05943a4540j72605G5682b71172R1876B27518
15590b18127C9705J04842c76418J60553g2197l7453j28416h3950B25811I0186
15579b17959j08135p4761g9207J8187R397q3647H5129J76803g2945l13015a48081
15567a17845A85987a36528j6320B17918d3632k9183j54561i279n30439d4591H2891
$$ plain form
15648 -289574 -71534 -239286 169118 -165256 -190755 -85840 10225 175416 -242580 -231380
15638 -231380 -27449 -110853 -64409 36783 -32448 7095 281486 -56496 97244 -35746 -40733 -13118
15625 -105413 -125846 30860 90312 -209715 -127927 220955 126659 -18871 -93261 -36533 107408
15613 -211547 -59992 -110012 -47506 106581 -68110 -88845 -217349 -80112 16865 -71213 39332
15601 30437 -101819 38174 -189036 105943 -14540 -187145 75682 -271172 -179296 227518
15590 -218127 39705 144547 -376418 -215865 -72197 -109650 -238066 -83950 225811 90186
15579 -217959 -326094 -400855 -79207 -61020 -51623 -135270 85129 261932 -72945 -385960 -148081
15567 -117845 185987 -136528 -152848 217918 -43632 -72815 -227376 -9279 -539718 -44591 82891
15555c7348r8046B36313a8614j82667E3541c99999P9929a59138A30305C4277i2301
15543d4985k9524c0076o0761n154A3224i2614B49921a29912F2287b49571Q0951
15532a68620M8081E3200J07666k6213M9901l6883c32816A67418B0414a15526J1569
15521a03957A23270d6866I3088K3127M6103J10462o8678F1532L510a35058C4777
15509b95325J08828A47258J23540m9222P6373c3307B61035i0279A12423A757J50212
15498A51969j1137n1427Q0699c17500D21877j23335q5094E3666J64877p4302a75740
15486B11089J06007l4194a39690B67839b6790B3071a20250B70130o882K60868
15476E24116c72578a7085A39689J3996D1475J20223g8445B30880B9553Q5876L0609
$$ plain form
15555 -37348 -135394 236313 -18614 -201281 53541 -399999 -320070 -159138 130305 34277 -92301
15543 -44985 -74509 -30076 -90837 -95991 13224 -92614 249921 -129912 62287 -249571 -168620
15532 -168620 -120539 53200 160866 134653 184554 147671 -332816 167418 20414 -115526 -103957
15521 -103957 123270 -46866 93088 116215 162318 272780 204102 61532 65042 -135058 34777
15509 -295325 -186497 147258 270798 221576 297949 -33307 261035 -90279 112423 1757 151969
15498 151969 140832 89405 170104 -317500 421877 298542 213448 53666 218543 144241 -175740
15486 211089 317096 282902 -139690 267839 -26790 23071 -120250 270130 263248 524116
15476 524116 -372578 -17085 139689 153685 41475 161698 -78445 230880 29553 115429 146038
15465A46038K00059m3254A48050h5135c0847D80270D9734O11005j44420N166k53617
15454B67868J5525o3921a68710I1254a53070c4329A09203J4070J7474J00055R9904
15443C40706H3389B2843J9028O3397d0683A7138J10142m0937P6001c4154D8430
15431a84935Q7961A69279f1008C87704J91078M1340K59394K84484n05508j39388
15421E19104o0057B16008L54850h9524B27900B8927N1863b28130m6906a23746
15410a26264A19142c7126G5252l2343b47397A57940d440K015B09788J9169p6054
15399A52903i788A49746F0729J08489a53461B7853b70025C47249e1557C638b4072
15387b30620C0490J84145b06723J5017A61133b00218B13768a51638A6691Q6030
$$ plain form
15465 146038 346097 302843 148050 -85135 -30847 480270 49734 660739 516319 521485 267868
15454 267868 283393 219472 -168710 91254 -153070 -34329 109203 123273 140747 240802 340706
15443 340706 83389 22843 41871 105268 -40683 17138 127280 86343 162344 -34154 48430
15431 -184935 -96974 169279 -61008 387704 578782 620122 879516 1164000 658492 519104
15421 519104 459047 216008 570858 -89524 227900 28927 80790 -228130 -275036 -123746
15410 -126264 119142 -37126 75252 42909 -247397 157940 -4440 -2425 209788 228957 152903
15399 152903 -9788 149746 60729 169218 -153461 27853 -270025 347249 -51557 3638 -24072
15387 -230620 30490 214635 -206723 -191706 161133 -200218 213768 -151638 16691 102721
15377A02721l5832L2436B9393N5054b00968Q6150B59739e1872h984j81556A44818
15365A83938f7544C15316A45304P0268c0747A62282J65201f6255A25710L28689
15355D54399j09479b9892A76223D8655Q6694J42633p3211L62748a39933B1609
15344i5568a8761B4850L16761A35252J319o27h7473B08855b6816D13621j89770
15333B23851r4358A0165R1967K96134p8911M2161k5406L12780A46425a2215j09807
15322a22022E01147j66274K12933K5798b01979A17259a34660C02598K91862d7759
15311C03158A23727M12916A85972b26566i4089b7510A42661a31954e9801B05214
15300b0546l975l7764E678M20068b72346o6437i2600d3794C35264J12264j95548
$$ plain form
15377 102721 66889 99325 29393 84447 -200968 -114818 259739 -51872 -8984 -190540 144818
15365 183938 -67544 315316 145304 215572 -30747 162282 327483 -66255 125710 454399
15355 454399 344920 -29892 176223 48655 135349 277982 204771 567519 -139933 21609
15344 -95568 -18761 24850 341611 135252 136571 135944 -87473 208855 -26816 413621 223851
15333 223851 129493 10165 102132 398266 319355 361516 336110 648890 146425 -12215 -122022
15322 -122022 501147 334873 547806 573604 -201979 117259 -134660 302598 594460 -47759
15311 303158 123727 536643 185972 -226566 -94089 -27510 142661 -131954 -59801 205214
15300 -20546 -24521 -62285 5678 425746 -272346 -338783 -92600 -43794 335264 447528 251980
15289B51980N6775j51450A0154M6414b33881b6422o6950C83885F1558a55436e9580
15277A16261Q0825c921G0217a33497c1136D2882L54190j01384E6215K12896e28850
15265d8104j8605E6196b5603j41453O8872I0398K4423a33539N9634o077k09852
15254b89834J14205A62009o9747a4316A77726g7853A79280h235A78565d4724j98681
15243b43405A55733o5777P9014J32846e3736m1104E5795a1478j27778H7920f2281
15231A15171D9634L34643P3917R56005M6691k86297J47967M0069n96069M4018
15221H10578C20919j50162a9170k9248A35763i9471m0376i946o0127C55066j23986
15210B31080n1991c88811a31258D0195h9219c6566j2277k342l36867a18064A59906
$$ plain form
15289 251980 308755 157305 10154 56568 -233881 -26422 -93372 383885 61558 -155436 -59580
15277 116261 197086 -3921 70217 -133497 -31136 42882 397072 295688 56215 269111 -528850
15265 -48104 -66709 56196 -25603 -167056 -98184 90398 114821 -133539 -73905 -79982 -289834
15254 -289834 -175629 162009 92262 -14316 177726 -77853 179280 -8235 178565 -44724 -243405
15243 -243405 155733 89956 168970 301816 -53736 -94840 55795 -11478 -139256 87920 -62281
15231 115171 49634 384277 458194 1414199 1460890 1174593 1322560 1362629 766560 810578
15221 810578 320919 170757 -19170 -48418 135763 -99471 -139847 -9946 -70073 355066 231080
15210 231080 179089 -388811 -131258 40195 -89219 -36566 -48843 -51185 -388052 -118064 159906
15198a78960e1318A10763c24341c8142j54101B28523a10662A77265l0237g2599
15187B46321b36097j30751A76081b775A95375a32682j67480A95597a22307a9568
15176D15568h4254d0903H3418A9940L26348j67830a50220e1264a0088G8249a25174
15164g2026A29339b09054E5960a00900C23324c1739k1152A39745D378d4256A52200
15152a84363I2125A8751Q1278P846O7840b91727A08863b45633A37103K116j051
15141A38168J8465L04865a29227E866L82045h2920C3954a99984h1530B80945b21424
15129B79758a04932A59306f7703j76407G4054c1400C18172e3087r5345H365b41483
15117f5145D88828I6265J99570A2442a06884j20395R9712a5993j972B48166j09955
$$ plain form
15198 -178960 -51318 110763 -324341 -38142 -192243 228523 -110662 177265 147028 -72599
15187 246321 -236097 -366848 176081 -2775 195375 -132682 -300162 195597 -122307 -19568
15176 415568 -84254 -40903 83418 19940 346288 178458 -150220 -51264 -10088 78249 -125174
15164 -72026 129339 -209054 55960 -100900 323324 -31739 -52891 139745 4378 -44256 152200
15152 -184363 92125 18751 100029 107875 175715 -291727 108863 -245633 137103 139219 138168
15141 138168 156633 461498 -129227 5866 387911 -82920 33954 -199984 -81530 280945 -221424
15129 279758 -104932 159306 -67703 -244110 74054 -31400 318172 -53087 -148432 8365 -241483
15117 -65145 488828 96265 295835 12442 -106884 -227279 -127567 -15993 -17965 248166 138211
15106A38211n2626N52466A24581L35699B16257H7458J68198j09019Q6089P7885
15096C10611j42741b05735B48088h2170j0700C3393J8150a31188A4731l061b37242
15084B34251i906l0074L824D10215I9480k8922K46388A36760a80791B4623J12727
15073A37350R1503a63964A0233K63219A0212K5828K92121m6o5398a13838D80902
15061A49741K26220I1415l7315m703i9559H5032n267J17769J10348a37024B32595
15049C7321K5549a35519A03954o988c500A6417K03457M4402b2160B38455m604
15038B33851j14514J06642r2650K10789n8241o4772J06436j52236J80415o2736
15028B92984R0703j40244b8315B71364K03142B22534L13123o6761o2560O4170
$$ plain form
15106 138211 85585 638051 124581 460280 216257 87458 255656 146637 232726 310611
15096 310611 167870 -205735 248088 -82170 -92870 33393 51543 -131188 14731 11670 -237242
15084 234251 -9906 -39980 -36156 410215 99480 70558 316946 136760 -180791 24623 137350
15073 137350 228853 -163964 10233 273452 10212 36040 328161 328115 262717 -113838 480902
15061 149741 375961 91415 54100 49397 -99559 85032 79765 197534 307882 -137024 232595
15049 37321 62870 -135519 103954 96966 -3500 16417 219874 264276 -22160 238455 233851
15038 233851 119337 225979 133329 344118 285877 221105 327541 175305 355720 292984
15028 292984 383687 243443 -28315 271364 474506 222534 535657 468896 406336 470506
15018D70506k15994N01435k18423j33344j75025N80596l96121j07876J73778j10088
15008C69444M69627C99880K21652k24276L53499l05408O8194B46764P5027G9168
14997B22965K14728o1852q2900N4775J04306K0161M58552C27971f1027B68504
14986C95879K05589j34059Q7441j42449j31848J17956J2428O1138q8308M16435
14976H00202j79226l7546A92535J86508L34790B41604O8688J44573L20443k33720
14966E41588J70529n1706P9123j70388O6153j92125k7577B03504L36145K22108
14956G61757j54769k12163n4429O8332L60125l29239A92018L10447B50070B5814
14945A81354L92467p5043J62576A98983L6623J48942n5540M2140H9942K68980
$$ plain form
15018 470506 254512 755947 537524 404180 229155 809751 413630 305754 479532 369444
15008 369444 839071 399880 621532 397256 750755 445347 513541 246764 321791 79168
14997 222965 437693 375841 292941 347716 452022 472183 930735 327971 -61027 268504
14986 395879 601468 467409 554850 412401 280553 398509 410937 472075 383767 800202
14976 800202 620976 583430 192535 379043 713833 241604 310292 454865 775308 541588
14966 541588 712117 660411 739534 569146 635299 443174 415597 203504 539649 761757
14956 761757 606988 394825 340396 408728 768853 439614 192018 502465 250070 25814
14945 181354 573821 498778 661354 198983 235606 384548 329008 371148 89942 358922
14935C58922J6004J02935j60789K27831j81184K13513A83216L78375m2838j79123
14925C39630L44179L0475B50641A04647K57715k9982K27931j07253B11942N17758
14915G29700J55649J58221M5236L14751J0550J75432J96606k77789K02149j46075
14905A564430k61967J58210K50534Q1156P7352m916j36982M1786m45931J77203
14895A500875m36696j44545k03589k21454L68389l90856K76010A43827J51157
14886B94984O4982K76500G2356M13083K83210k13778B25707Q8412J5082J05450
14876D34651A01262M39627o0663k25795J34624K80934K3658J06151j49143J01280
14866G51935J34841k45021J33445k44118P8684j11875K20321k35230K52889B05870
$$ plain form
14935 358922 374926 477861 317072 544903 363719 577232 183216 561591 518753 339630
14925 339630 683809 714284 250641 104647 362362 332380 560311 453058 211942 729700
14915 729700 885349 1043570 1088806 1403557 1414107 1589539 1786145 1508356 1710505 1564430
14905 1564430 1302463 1460673 1711207 1792363 1869715 1864799 1727817 1769603 1323672 1500875
14895 1500875 1064179 919634 716045 494591 862980 472124 748134 143827 294984
14886 294984 359966 636466 72356 485439 768649 554871 225707 314119 329201 434651
14876 434651 101262 540889 480226 254431 389055 669989 693647 799798 650655 751935
14866 751935 886776 641755 775200 531082 609766 497891 718212 482982 735871 205870
14855B38775J65718J69157Q9083k39628L70524k13189j70942K87209j81731M5179
14845E60155J2800k24532q6281L68617j97504j09130Q09L54290j71970B1383N09243
14834E30626L4809J8434k75403m8081M29007k90182M44195l1677L78953n7952
14824A132729Q7491j7247j81901n02427K31199Q8367j44274o4600A86140M03591
14814E89731j16963J56743j9018J14213j93072J45927k67570l2938L99184j9937
14804G56300j72580Q8475J59920j80919o1563k06318M45217C98081L99442J09130
14794I06653m12895K48573k58009L48420k49342K63263J86594D71415K48494J3033
14784G32942l44134K97752Q6651k30606k18824q8024M14739l1703D045K16006
$$ plain form
14855 238775 404493 573650 662733 423105 793629 580440 409498 696707 514976 560155
14845 560155 572955 348423 262142 630759 433255 324125 324934 679224 507254 21383 530626
14834 530626 565435 583869 308466 260385 689392 399210 843405 811728 1190681 1132729
14824 1132729 1220220 1202973 1021072 518645 749844 838211 693937 629337 186140 589731
14814 589731 472768 629511 610493 724706 531634 677561 409991 377053 776237 756300
14804 756300 583720 672195 832115 651196 589633 383315 828532 398081 797523 906653
14794 906653 493758 742331 484322 832742 583400 846663 1033257 471415 719909 732942
14784 732942 388808 686560 773211 542605 323781 235757 650496 618793 4045 220051
14774B20051K11223J01351L0499L37120l13469K82880k16384k3864N3314K53483
14764I36204k02022j0903J01704o0015K04420K43668l74264j45028L06671k06518
14754G93917m5792l31991Q9566O563j33483K00540r7548K09199k25055K27066
14744F92982J5404k75146L68115j61818J05377j18894j52852M19875k76893K51522
14734H67672P1767j22753j54505K35925j51347k87005K81540j39937J23084J2182
14724G36623o6805K59836k98073Q3143R2821P8571J30005k37264K72152j62923
14714H88086m3747J57871N57282j08304j1133j5478k56745L4646J37156l54807
14704I84827l6646q3539K26419l83947J10473k48J52966K03986m00629L00655
$$ plain form
14774 220051 431274 532625 563124 900244 586775 869655 653271 629407 682721 936204
14764 936204 734182 723279 824983 764968 969388 1213056 838792 693764 1000435 793917
14754 793917 748125 416134 505700 512263 378780 579320 481772 690971 465916 692982
14744 692982 708386 433240 801355 639537 744914 626020 473168 893043 616150 867672
14734 867672 939439 816686 662181 898106 746759 459754 741294 601357 724441 736623
14724 736623 669818 929654 631581 714724 807545 886116 1016121 778857 1051009 888086
14714 888086 844339 1002210 1559492 1451188 1440055 1424577 1167832 1202478 1339634 984827
14704 984827 948181 864642 1091061 707114 817587 817339 970305 1174291 773662 1074317
14694A074317m3214j11043k72752J28356L96146J85994j26276j81850O14883J26453
14684A791014k07022J60357l72031k96236j74918J65281q361o5896K6344p9900
14674I38632J35920k0409l6007J95845k75843m67715L77813L9179j72148M04995
14664A120262l10348j55492L86762k40422j64171L17803j30330J50255l79485
14655E94834J27306K31582J38197m85858N05362j82180K6025J41240J56080o21352
14645F31236J09564N94044l87594M31478j79468q6842Q1526l63992K12555K28450
14635A270957K51299k30283j42219L36313k88360L06960j17662j85348k31721
14626I69936K59946l4737j38546k4147L40620o46154O55330k83173J10244k00159
$$ plain form
14694 1074317 1031103 920060 647308 775664 1171810 1357804 1231528 1049678 1664561 1791014
14684 1791014 1583992 1744349 1372318 1076082 901164 1066445 1058084 992188 1018532 938632
14674 938632 1074552 1054143 1018136 1213981 938138 470423 848236 887415 715267 1120262
14664 1120262 809914 654422 1041184 800762 636591 954394 824064 974319 594834
14655 594834 722140 953722 1091919 606061 1111423 929243 955268 1096508 1252588 631236
14645 631236 740800 1334844 947250 1378728 1199260 1112418 1193944 829952 1042507 1270957
14635 1270957 1522256 1291973 1149754 1486067 1197707 1504667 1387005 1201657 969936
14626 969936 1229882 1195145 1056599 1032452 1373072 726918 1382248 1099075 1209319 1009160
14616A009160K86316l99291K98790K4251P7939q7774k32797M54029k81398K60366
14606A409591q7814k09937K26129m20212N24193j10306J50129p0716J65673Q756
14596A585486q156l97218L70191r3124j3357j06153j47689J99290J47627K95695
14586A832592q0997j35212J46027k72120j58126L53486j98415q9679K59650j27487
14576A529719J25968K47901k12200J75307j35625J57834r0850m7829j18093M75974
14566B108106P2406m71736K97134J30258j40524j290K70626l56712l5660J34452
14556B007060K4471K58289j24966q089L9855N5145M406M4380K21056J20108k04480
14545B437235K96876J85986K95219Q4555k52640K35025P00377L10148M10003N83413
$$ plain form
14616 1009160 1295476 896185 1194975 1219226 1297165 1209391 976594 1430623 1149225 1409591
14606 1409591 1321777 1111840 1337969 917757 1441950 1331644 1481773 1411057 1576730 1585486
14596 1585486 1577330 1180112 1550303 1457179 1443822 1337669 1189980 1389270 1536897 1832592
14586 1832592 1751595 1616383 1762410 1490290 1332164 1685650 1487235 1397556 1657206 1529719
14576 1529719 1655687 1903588 1691388 1866695 1731070 1888904 1798054 1750225 1632132 2108106
14566 2108106 2180512 1708776 2005910 2136168 1995644 1994354 2264980 1908268 1872608 2007060
14556 2007060 2031531 2289820 2164854 2156765 2196620 2251765 2256171 2300551 2521607 2641715 2437235
14545 2437235 2734111 2920097 3215316 3299871 3047231 3282256 3982633 4292781 4702784 5286197
14535E286197J319016K074778M373575O559540J0085482J142938j1082463o521039
14527A3238024l464863l042864j474701o41463M16318l00453j306576l29599m78076
14518B615747k92764Q7652J73024k42406P6034J3285k25124r0150L21288l64724
14508B071862N55310k9919m14317L9218L13916J05704n7177J6739J82822k03177
14498B580981j55302L745K90132q866O3560J31264K38179m80717L0086L57206
14488C050268j58088L1722j8767j09668K90445N5005N0645j30594J24807j19861
14478C065914N4156M41599j70607m1895K62275j54712o6766R2680K95927j20461
14468C658110m57265N46587k1137J8780J66650j34542j029R9276r0155M5947K81950
$$ plain form
14535 5286197 6605213 8679991 13053566 19613106 29698588 30841526 19759063 13238024
14527 13238024 9773161 6730297 5255596 4614133 5030451 4729998 3423422 3093823 2615747
14518 2615747 2322983 2410635 2583659 2341253 2417287 2430572 2205448 2115298 2436586 2071862
14508 2071862 2627172 2597253 2182936 2222154 2536070 2641774 2584597 2601336 2784158 2580981
14498 2580981 2425679 2429424 2719556 2710690 2774250 2905514 3143693 2662976 2693062 3050268
14488 3050268 2892180 2923902 2905135 2795467 3085912 3140917 3191562 3060968 3185775 3065914
14478 3065914 3120070 3561669 3391062 3349167 3611442 3456730 3389964 3482644 3778571 3658110
14468 3658110 3200845 3747432 3726295 3745075 3911725 3777183 3776154 3875430 3785275 3831222 4113172
14457D113172j25262K42548m8615K04417K3382k14741n1175L84500J38744P9121
14447D746091j91778k1883K23657p5844o1721Q0071K43124k6204O5037M2965J27074
14436E150589K5564R0618L0898J81256M2314R2391N7482J14210r0737J87705K89837
14425F172127N008p1312k5437M80287k34004j09810J26408K80103J504k07736
14415F417138P88142P4335l3717l3244J27188J69182J6664J87199K24358J11257
14405H048502M12127j16206M02766j93801l53N75251q8489l22986M08839j8890
14395I106760m7724J58062J43461M83368l3900O04277n25256M55353M51424j78843
14385A0616982j61432K37591K47872J70984l7426L92027K65705l9330M41315L55065
$$ plain form
14457 4113172 3987910 4230458 4181843 4386260 4409642 4194901 4143726 4528226 4666970 4746091
14447 4746091 4554313 4532430 4756087 4680243 4618522 4698593 4941717 4915513 4980550 5023515 5150589
14436 5150589 5176153 5266771 5297669 5478925 5521239 5613630 5671112 5785322 5694585 5882290 6172127
14425 6172127 6177135 6105823 6080386 6560673 6326669 6216859 6343267 6623370 6624874 6417138
14415 6417138 7205280 7279615 7245898 7212654 7339842 7509024 7525688 7712887 7937245 8048502
14405 8048502 8460629 8344423 8747189 8553388 8553035 9128286 9039797 8716811 9125650 9106760
14395 9106760 9059036 9217098 9360559 9843927 9810027 10414304 9889048 10344401 10795825 10616982
14385 10616982 10455550 10693141 10941013 11111997 11074571 11466598 11732303 11692973 12134288 12489353
14375A2489353J50852J09771L01556j6118K70380L95678q1925M81507M30727L99785
14365A4931566R1844M19266L25318j24545M64685L00271K40876L16632K78513
14356A7244426N81648j36866M62370M13624O78373N06333O15853M4938L53066
14347B0763765O11843L80065K68846N60139M22634O60161M84559P19788N43318
14338B5415118O37401N73629Q39003K94282P60976N99086R94870O99842R21017
14329C1735224J034114M63601O40320J767794O76886O42446J498009J049526R53603
14320D0461523J147950J540181J296410J291923J522094J577112J308823K128118
14312E2274134J374342J920890J808998K038878K133379K440575K178526K312460
$$ plain form
14375 12489353 12640205 12749976 13051532 13035414 13305794 13701472 13619547 14101054 14531781 14931566
14365 14931566 15023410 15442676 15767994 15643449 16108134 16408405 16649281 16965913 17244426
14356 17244426 17826074 17689208 18151578 18565202 19243575 19749908 20365761 20410699 20763765
14347 20763765 21375608 21755673 22024519 22584658 23007292 23667453 24152012 24871800 25415118
14338 25415118 26052519 26626148 27465151 27759433 28520409 29119495 30114365 30814207 31735224
14329 31735224 32769338 33232939 33873259 35641053 36317939 36960385 38458394 39507920 40461523
14320 40461523 41609473 43149654 44446064 45737987 47260081 48837193 50146016 52274134
14312 52274134 53648476 55569366 57378364 59417242 61550621 63991196 66169722 68482182
14304F8482182L069592K590592K693526K645735L433727K877430L709900M255457
14296I3758141L600256L976239M629223M796647M857629N199622N759901O077018
14288A32654676O537883O599528O869654Q109576P820841Q184137Q933885R571678
14280A95281858J0223992J0485677J1830620J1722766J2340934J3374288J3745096
14273B79005231J4380020J5178292J4911228J5366325J5057216J5224950J4879018
14266C84002280J4482548J3580247J2474678J1111146J0385505R423956Q050236
14259D63510596O188918K178353j124926j279884k923637n371018q248961p726510
14251D45202931m755675o323356r465872j3043998j3755153j4442182j4598583
$$ plain form
14304 68482182 71551774 74142366 76835892 79481627 82915354 85792784 89502684 93758141
14296 93758141 97358397 101334636 105963859 110760506 115618135 120817757 126577658 132654676
14288 132654676 139192559 145792087 152661741 160771317 168592158 176776295 185710180 195281858
14280 195281858 205505850 215991527 227822147 239544913 251885847 265260135 279005231
14273 279005231 293385251 308563543 323474771 338841096 353898312 369123262 384002280
14266 384002280 398484828 412065075 424539753 435650899 446036404 455460360 463510596
14259 463510596 469699514 471877867 470752941 469473057 466549420 461178402 452929441 445202931
14251 445202931 440447256 434123900 424658028 411614030 397858877 383416695 368818112
14244C68818112j4777214j4605428j4134362j4249816j3756235j2932600j3034064
14237B71328393j2454597j2509118j1344067j0492186j0785934j1213121j0476902
14230A92052468r608176r053074q635334q182574p597866p105826o598659n737873
14222A29533086n768512n601763n130739m842211m644207m462096l642277l750420
14214I1690861l879617l197427l360847k862571k864135k839182k862796k423272
14206F7401014k053007k531888k006045j617169k286697j661227j887635j299857
14198E2057489j676281j412706j573860j434958j329862j317029r27329j276374
14190D1109090r76080j606438l93701j585093o72781o84112j394546o97836q20958
$$ plain form
14244 368818112 354040898 339435470 325301108 311051292 297295057 284362457 271328393
14237 271328393 258873796 246364678 235020611 224528425 213742491 202529370 192052468
14230 192052468 182444292 173391218 164755884 156573310 148975444 141869618 135270959 129533086
14222 129533086 123764574 118162811 113032072 108189861 103545654 99083558 95441281 91690861
14214 91690861 87811244 84613817 81252970 78390399 75526264 72687082 69824286 67401014
14206 67401014 65348007 62816119 60810074 59192905 56906208 55244981 53357346 52057489
14198 52057489 50381208 48968502 47394642 45959684 44629822 43312793 42385464 41109090
14190 41109090 40133010 38526572 38132871 36547778 35874997 35190885 33796339 33098503 32277545
14181C2277545p44503q44352p58667o44773n49189j047881j015706K9836o55262
14172B6047048o27167o60379o34590m26223l81207q73138j23107p21935q99479
14163B0699823J60105n65622n12760m8011p96471k63554j94450l08271l90707
14154A7780082n95299l6288m22070l08240k13614m65265j5733l38895l02308m41456
14144A4640914k52426l18817r4514k47641l73044n0467j02371n23586k04113J32411
14134A2606346j06208l65823m05044J6360j64963k65357l99964k8415n19607J89673
14124A0556998J53266k75514k27271j53437p2305j10637k83467L7946l43908J16272
14114I397943m2417m57901K39095m34641j05270K5502k76148j64378J94720m72529
$$ plain form
14181 32277545 31533042 30688690 29930023 29285250 28736061 27688180 26672474 26702310 26047048
14172 26047048 25419881 24759502 24124912 23698689 23317482 22444344 22321237 21599302 20699823
14163 20699823 20859928 20294306 19781546 19733535 18937064 18673510 18479060 18170789 17780082
14154 17780082 17184783 17148495 16726425 16418185 16204571 15739306 15723573 15384678 15082370 14640914
14144 14640914 14388488 14069671 13975157 13727516 13354472 13304005 13201634 12678048 12473935 12606346
14134 12606346 12500138 12134315 11729271 11745631 11580668 11315311 10915347 10886932 10367325 10556998
14124 10556998 10710264 10434750 10207479 10054042 9981737 9871100 9587633 9625579 9281671 9397943
14114 9397943 9355526 8897625 9136720 8702079 8596809 8622311 8346163 8181785 8376505 7903976
14104G903976L2864p5944l75623K22209l78556K62203l05341j620J37092l62571
14094G058689K64562k73073k66615j01983K65006o96385L13173j06707K05999
14085F662666l09480n22801M70888l37074L10392l65720o9446j61108J22441M9284
14075E850042l14598J12373l13574L3429J23312J30446m46589J50092K8016j82705
14065E170244J7334l8459o31737M54673j85653j27256j21141K02200j21596J30852
14055D749461j90802P233P0089j13055j45201R1742j95744k46972M54942J35841
14045D617534l44466j31788K49679l52345m230k2773J98969O6465m53867J7017
14035C840195k75346J44059j86042N2107J13984Q628m02550K79949q0401K80417
$$ plain form
14104 7903976 7936840 7860896 7485273 7707482 7328926 7591129 7285788 7284168 7421260 7058689
14094 7058689 7323251 7050178 6783563 6681580 6946586 6250201 6563374 6456667 6662666
14085 6662666 6353186 5830385 6301273 5964199 6274591 5908871 5839425 5678317 5800758 5850042
14075 5850042 5535444 5647817 5334243 5367672 5490984 5621430 5174841 5324933 5352949 5170244
14065 5170244 5187578 5149119 4517382 4972055 4786402 4659146 4538005 4740205 4618609 4749461
14055 4749461 4558659 4565892 4635981 4522926 4377725 4469467 4273723 4026751 4481693 4617534
14045 4617534 4273068 4141280 4390959 4038614 4034384 4011611 4210580 4277045 3823178 3840195
14035 3840195 3564849 3708908 3522866 3574973 3688957 3697585 3295035 3574984 3494583 3775000
14025C775000l47022k43406J24542n1567j62653J56895k18734M20064m33337J87399
14015C207181l5654l03833K40379j30786L00655j96516j41266J66278k79057O8919
14005B896300j14212j75650J56238m4543k26839Q1856Q7737J85807o5704n2735
13995B728255n12970J57721J18414R7148r8269j90469K98991n55637N03243j49802
13985B396625m05851M42920l25964K21721J1169l8029M44467J2817j5696P46561
13975C490740K68000J840132L185329N681198J0853403N764946q101201o421785
13967A6560762l886636l152254k266860j821172m47203o56363k53149l99125j69180
13958C508820l66350p7843n8300k09510k0419N9017j02753l67490L82395j64074
$$ plain form
14025 3775000 3427978 3184572 3309114 3257547 3094894 3251789 3033055 3453119 3019782 3207181
14015 3207181 3171527 2867694 3108073 2977287 3277942 3081426 2940160 3106438 2827381 2896300
14005 2896300 2782088 2606438 2762676 2718133 2491294 2573150 2660887 2846694 2780990 2728255
13995 2728255 2215285 2373006 2491420 2588568 2490299 2299830 2598821 2043184 2546427 2396625
13985 2396625 1990774 2433694 2107730 2329451 2340620 2302591 2747058 2759875 2744179 3490740
13975 3490740 3758740 5598872 8784201 14465399 25318802 31083748 22982547 16560762
13967 16560762 12674126 9521872 7255012 5433840 4986637 4330274 4077125 3678000 3508820
13958 3508820 3142470 3064627 3006327 2796817 2776398 2835415 2732662 2365172 2747567 2583493
13948B583493k58263j52414L6148M6625n0281l7538K43311j56000j73454J01230
13938B182857O0353m42444k6550N05899k14243J04967j21231n11728O27654l02826
13928A862708J63652O7564n6446k12663N45452n18064L4885k30262K35143K2052
13918A914021l23020K43163K8257j6031j2748o8558k20393l77701M17857M28132
13908B012979k71807k17319K08850k27325K60072k79441j5449M16684l95696J15676
13898A607224K34290j90829J10782p99487L37284j0996J49689J15471P9267j02106
13888A530589l18385L70610k28631l7470k4799o2984P3081M086K71163n77713
13878I99547M97204K280l44164K16730k3037J35923r5306k30282l3328L45543
$$ plain form
13948 2583493 2325230 2172816 2208964 2255589 2205308 2167770 2411081 2255081 2081627 2182857
13938 2182857 2243210 1800766 1774216 2280115 2065872 2170839 2049608 1537880 2165534 1862708
13928 1862708 2026360 2093924 2037478 1824815 2370267 1852203 1887088 1656826 1891969 1914021
13918 1914021 1591001 1834164 1862421 1846390 1833642 1765084 1544691 1166990 1584847 2012979
13908 2012979 1741172 1523853 1732703 1505378 1765450 1486009 1470560 1887244 1491548 1607224
13898 1607224 1841514 1650685 1761467 961980 1299264 1288268 1437957 1553428 1632695 1530589
13888 1530589 1212204 1582814 1354183 1316713 1291914 1228930 1302011 1306097 1577260 999547
13878 999547 1496751 1499031 1154867 1371597 1348560 1484483 1389177 1158895 1125567 1471110
13868A471110l32589j82229L27916K30908p4444j54065r2902K44615k40678l11814
13858H85828M03638q4291K70839k44559P6443L09221n47587J55936q3797j18536
13848A023135M0470K90522J71311j81330k93174L76160k35234M5494k3726r1972
13838A121656Q5126k20259K5282J96951o1816l09927K91982M8167k0971j5982
13828A140209J3935k04392J44483k23123L97434l96983J32535J0172P5602j39729
13818I50143J29708r8623L3594j00044K78070j46169J40643J39312j97751j35365
13808I93518j19577K9611L64523m49341L54426k42290K68037j37872M3073j16057
13798I88051m07416K94527N5263q8697M3732J73600k75900r7538Q5610k2926L31472
$$ plain form
13868 1471110 1138521 956292 1284208 1515116 1440672 1286607 1193705 1438320 1197642 885828
13858 885828 1289466 1205175 1476014 1231455 1307898 1617119 1069532 1225468 1141671 1023135
13848 1023135 1063605 1354127 1525438 1344108 1050934 1427094 1191860 1237354 1213628 1121656
13838 1121656 1206782 986523 1011805 1208756 1146940 837013 1128995 1177162 1156191 1140209
13828 1140209 1154144 949752 1094235 871112 1268546 871563 1004098 1014270 1089872 950143
13818 950143 1079851 981228 1014822 914778 1192848 1046679 1187322 1326634 1128883 993518
13808 993518 873941 903552 1268075 818734 1173160 930870 1198907 1061035 1104108 988051
13798 988051 580635 875162 930425 841728 885460 1059060 783160 685622 771232 748306 1079778
13787A079778j59871O4321J33966j77520N801K07334m38646K48684D81770N41854
13777A023624k07057J45509k77917L15146l07903P2350k89782J85773K80527L7509
13767I77779n0504M5817j12698L0389p3942k0585k42393k06429N36579j94181
13757F89832j951K32942l00757J72303j75241K02363L1953l73661L01905N440
13747G85128J6849j24796o9269j64226K14054J3022O4975J62236k92084J05383
13737G11272k36164j49620J14962L63373q3468k7194K69707r4576k23045p3186
13727E72061M19969D10686j74495L95529n9595J19644j15906J87655j1381m5930
13717G06207j61425L43911l67281K46888l40664J75862L97130D43959M39706B55418
$$ plain form
13787 1079778 919907 984228 1118194 940674 946475 1153809 715163 963847 481770 1023624
13777 1023624 816567 962076 684159 999305 691402 763752 473970 659743 940270 977779
13767 977779 927275 973092 860394 890783 816841 796256 553863 347434 884013 689832
13757 689832 687881 920823 620066 792369 617128 819491 851444 477783 779688 785128
13747 785128 801977 677181 607912 443686 657740 670762 735737 897973 605889 711272
13737 711272 475108 325488 440450 803823 720355 693161 962868 868292 645247 572061
13727 572061 992030 410686 236191 631720 572125 691769 575863 763518 752137 706207
13717 706207 544782 888693 521412 768300 427636 603498 1000628 443959 883665 255418
13706E69952M0870j47781O6868K75969q3605K6224k71842J90225j95756J59227
13696F30351K78206l83155J22374j5613j62512L5112Q244R2220k74992K01865
13686E32100M205K59399j0985l37874J40202B49028J98259J95400r3053k56648
13676B92986K61316j0415j15771J75647j55118L62113C31622M04092C53011P2265
13666D25276M99702l43584K97766C57691M20569k80933L4085m9312K28558B41297
13655C91253j45232L20255r0238N1935k41979J55957A74080L09753j46090L4156
13645C71899K10600n2623l8460J15411B33808J43232R5545L8488k20819M08615
13635F98869Q313l29564K5426l7904j62402L7822K79713j96432L54523r1916B08022
$$ plain form
13706 569952 610822 463041 529909 805878 722273 748497 476655 666880 471124 630351
13696 630351 908557 525402 647776 632163 469651 504763 513007 605227 330235 532100
13686 532100 536305 795704 784719 446845 587047 249028 447287 642687 549634 292986
13676 292986 554302 543887 428116 603763 448645 810758 331622 735714 353011 425276
13666 425276 924978 581394 879160 357691 778260 497327 531412 482100 710658 241297
13655 391253 246021 566276 476038 527973 285994 441951 174080 483833 337743 371899
13645 371899 582499 529876 491416 606827 233808 377040 472585 511073 290254 698869
13635 698869 707182 377618 403044 365140 202738 240560 520273 323841 678364 586448 208022
13623D09647f6091D05730J48051J1747p1466o3927K15358j97674K19845k78867
13613C88797J55808k1270J4551a10082C00499J76099A82746P4857M52901k05299
13603E05205p0686J49123A38258K18937J07250k10879K99326O4029n5511J18523
13593F79933k40800J5917j95722o086M17289l18501J49966l9764j55196K32306
13583E39342J95069C53704A71492K44840n001K04140K5078B03448J56190M6720
13573D06358q3148k7138L81901k28940A81171K48954J27808N9877P6675G0130
13562C50720q3877J77578J48286r5048Q0357k12580K94737j85586j54798j42621
13552A77168K42340A50960o7339M41657L624A81489L01735m9665J08187k47745
$$ plain form
13623 409647 -66091 405730 553781 565528 494062 430135 645493 447819 667664 388797
13613 388797 544605 523335 537886 -110082 300499 476598 182746 257603 710504 505205
13603 505205 434519 583642 138258 357195 464445 253566 552892 616921 561410 679933
13593 679933 439133 455050 259328 253242 670531 352030 501996 462232 307036 539342
13583 539342 734411 353704 171492 416332 411331 615471 640549 203448 359638 406358
13573 406358 323210 296072 677973 449033 181171 430125 557933 617810 694485 70130
13562 350720 266843 444421 592707 497659 578016 365436 660173 474587 319789 177168
13552 177168 419508 150960 83621 525278 528902 181489 483224 433559 541746 294001
13542B94001J38605B11292B101K60591J27837A44732L88260k37788K3683J27555
13532D46442j73801J41887N3212O4906q0512C8808M07143Q2825A65779a0270D52956
13520A61543R6002J02704O5823B10781L15437A16293J86694K18668j64302A04561
13509B18915J22095n121R1736B2993M22989a49288A38681a56040B03967J20879
13499C24846G3073R7589C3660J93840p3202M10204A65595O5824D3865K45479N5362
13488C44706q2287L46750A05127K71637Q3252j38248p3234J65343j86176K10783
13478D38484A32160P9493J23044L8273m9054A52188o6399M13461j1187k27385
13468B60678K39205D8394K74969j07865R8729k8166P1127p8951A02570L22277
$$ plain form
13542 294001 432606 211292 2101 262692 390529 144732 532992 295204 318887 446442
13532 446442 272641 414528 467740 532646 452134 38808 445951 528776 165779 -10270 452956
13520 161543 257545 360249 426072 210781 526218 116293 302987 521655 357353 104561
13509 218915 341010 335889 427625 22993 445982 -149288 138681 -156040 203967 324846
13499 324846 73073 170662 33660 227500 154298 564502 165595 231419 43865 289344 344706
13488 344706 262419 609169 105127 376764 460016 321768 248534 413877 227701 438484
13478 438484 132160 211653 334697 372970 323916 152188 85789 499250 488063 260678
13468 260678 499883 48394 323363 215498 314227 286061 357188 278237 102570 424847
13458D24847A35934L07129A54386E6599K62869P7914K3126b8099D12062J73815
13448E85877B67123J12051K8476O6895P7039B39984Q2414d198C66032d5865C02859
13436B96239m9786J9665C1820J05903l5480K44494N5455j40377M6305E7931J29399
13425A87330p051k82a20915B00888L00558B04105P8365j02783J09249A27173b51156
13413B12454d1373C91122k823A40516K24049H5557J35668J84341K22067F415a15366
13401C12515A34614a04865B63527j20455m5332a0957k05665B8170J11802C1211
13390A15294Q4837K16855l5553j50297r8390J81978j12073P3209A13737J81312
13380B95049j14225a00783J3709A43911K10638j14117l7651o6342O2857N76l0522
$$ plain form
13458 424847 135934 443063 154386 56599 319468 397382 420508 -28099 412062 585877
13448 585877 267123 379174 407650 474545 551584 239984 322398 -4198 366032 -45865 302859
13436 296239 246453 266118 31820 137723 102243 346737 402192 261815 308120 57931 187330
13425 187330 180279 179997 -120915 200888 501446 204105 282470 179687 288936 127173 -251156
13413 212454 -41373 391122 388299 140516 364565 85557 221225 405566 627633 6415 -115366
13401 312515 134614 -104865 263527 143072 97740 -10957 -216622 28170 139972 31211
13390 115294 200131 416986 381433 231136 132746 314724 202651 275860 113737 295049
13380 295049 180824 -100783 -87074 143911 354549 240432 202781 136439 199296 199872 169350
13369A69350R2226n8912K80707h2123H2612N1922K25933A04169a28127D9249K03229
13358B52478q9247d2857G02884B46361K6279M115A02678J27832p7651J52558o9793
13347B35624m2768K65588a8333D68411G9902K32464L52852a00799d491B96738
13336D4647B0958e4415C51602L0347j69580C6776K20721J75482j79949K44912
13326D97942Q438j6711n1387n3642R8907j11063J03319k34452J40112A81007M6064
13315B27071J28821A09058d3129B89641l3275a4386A87409K51598j76048h1269
13304C64081K09198l6123A59212M8226O7825A29125K77784J29257B51013L9336
13294B90349J24083j57444o6391J61153A51894m7942K99187L3754k01902j9489
$$ plain form
13369 169350 261576 202664 483371 -82123 82612 134534 360467 104169 -128127 49249 252478
13358 252478 163231 -42857 702884 246361 272640 276755 102678 230510 152859 305417 235624
13347 235624 192856 458444 -18333 468411 79902 312366 665218 -100799 -4491 296738
13336 44647 20958 -54415 351602 381949 212369 36776 257497 432979 253030 497942
13326 497942 506380 489669 438282 384640 483547 372484 475803 241351 381463 181007 227071
13315 227071 355892 109058 -43129 289641 256366 -14386 187409 439007 262959 -81269
13304 364081 573279 537156 159212 207438 275263 129125 406909 536166 251013 290349
13294 290349 414432 256988 190597 351750 151894 103952 403139 436893 234991 215502
13284B15502M5702A18797B6523a79753a8489B32244a2189A95295f56A06836J34326
13273B41162M5946J2903g321A38695J79021o3869N4268j17463n9194a32646A63234
13261e7905A20636K4460J54443l0729F4427J27955J24628j25017L0628q1113J47942
13250B89450F0240L8663K1085C9807J73388I8824B6915L71732n4936j13449m6759
13239A83503q0668L6036m6155b98253A80374m9401J89154q1766A14136b819E9151
13227E15895A68174k1739D1641K77943j17795L1223C7686a29185F7813K02767
13217B70580J8131A24095L4588k331b2706C06580g6303C1972b81344B53341n3213
13206B00128M0795A1310L57956D531J47554c1816k62175I9577e7064A22876Q0101
$$ plain form
13284 215502 261204 118797 26523 -179753 -18489 232244 -12189 195295 -656 106836 241162
13273 241162 287108 300011 -7321 138695 317716 253847 308115 190652 131458 -132646 163234
13261 -57905 120636 145096 299539 268810 64427 192382 317010 191993 222621 141508 289450
13250 289450 60240 98903 119988 39807 213195 98824 26915 398647 343711 230262 183503
13239 183503 102835 138871 92716 -298253 180374 130973 320127 238361 114136 -2819 59151
13227 515895 168174 146435 41641 319584 201789 233012 37686 -129185 67813 270580
13217 270580 288711 124095 158683 156352 -22706 306580 -76303 31972 -281344 253341 200128
13206 200128 240923 11310 369266 4531 152085 -31816 -293991 99577 -57064 122876 202977
13195B02977J24950j8044C2467F354J65552L617B3989L8085J81603e5128B08417
13183h1760H4080K76760j33582a02647I1854h6096B27454C0032N5364K01580B350
13171A5299O0293L3088b82423C33655j19085H3446K22272D5981J02789J16216
13161B64986a72874b0128I0180J52156C1245L73534d8484C30175A37363F3268
13150D2652K0633h809B88659H0759a12436A96760m1251K68167A12165K15945m7395
13139B80715d0865a0632k66042B06179j4933J81752j49338H849a7286B82680a57081
13127A09399k1192N4570j9721R9570H9248l8841d0031A83383a17080A9076a63709
13115B47504r3207a90087e042n8728C8063j4747c22012B53955d2072C91479j90956
$$ plain form
13195 202977 327927 309883 32467 6354 171906 175523 23989 62074 243677 -55128 208417
13183 -81760 84080 360840 227258 -102647 91854 -86096 227454 30032 85396 286976 2350
13171 15299 75592 108680 -282423 333655 214570 83446 305718 45981 148770 264986
13161 264986 -172874 -20128 90180 242336 31245 404779 -48484 330175 137363 63268
13150 42652 63285 -8809 288659 80759 -112436 196760 155509 423676 112165 328110 280715
13139 280715 -40865 -10632 -276674 206179 191246 372998 223660 8849 -17286 282680 -157081
13127 109399 88207 142777 123056 222626 89248 50407 -40031 183383 -117080 19076 -163709
13115 247504 154297 -190087 -5042 -63770 38063 23316 -322012 253955 -42072 391479 200523
13104B00523Q6952a60002B24928n2048E104a31031e5156C8814K4457K5760L10847
13093C99878b5505n8345B5766R3707k2242b05112D12659D3709c1935D4576a25715
13081f040l1487C81455B5629M2174a4823k1327j34155r2711P3310j70514A62864
13069A28322J0586P759J19114k129A01222N20055E5269j26L38396j06165a33469
13057C95712A39849e16947B34811p835j5606H7745J78204j21212K9076F6977J21009
13046A87986L10054A42720J2872J3557F6763L2048D5343a48282B81432J794j8165
13035B65061j20169g7692A54835J1063a99440A34082C3115a0255C29526g7037
13024A97406J54603g992B15018C0855a3536G195b18284C15626j09932H1225b09578
$$ plain form
13104 200523 287475 -160002 224928 172880 5104 -131031 -55156 38814 63271 89031 399878
13093 399878 -25505 -83850 25766 119473 97231 -205112 412659 43709 -31935 44576 -125715
13081 -6040 -37527 381455 25629 67803 -14823 -36150 -170305 -263016 -189706 -360220 162864
13069 128322 138908 146667 265781 263652 101222 621277 55269 55143 393539 287374 -133469
13057 395712 139849 -516947 234811 226976 211370 87745 265949 144737 173813 66977 187986
13046 187986 498040 142720 155592 169149 66763 98811 45343 -148282 281432 283226 265061
13035 265061 144892 -77692 154835 165898 -199440 134082 33115 -10255 329526 -77037
13024 197406 352009 -7992 215018 30855 -13536 7195 -218284 315626 205694 81225 -209578
13012B77007a12638A75165L12652A81157Q2571I2239b1504B43851l3530a15901
13001B09443f0071B03745p3400J44315j5588a47499B40074A3844K65781k8055
12991B51570b8378A77147J08066A7412N8744J12717a09260H1680K08697a34960
12980A82880J17599E3140f6593J877j8204m2706D487N1468c9300B51749a44057
12968e4314F6983l2992q341a276B6219c0510B44640A6179E046Q9892K06215p4611
12956B26542A02037O4286d5790C8640c67991f3148B2817c889k67266g2937B21258
12944a75942F7476J5310K0740L7473J07943A5823b36127a9369j95066f8861K002
12933f6859A12787k9271K1945d9925n4313L8634I1935M7399J02699J0339R6896
$$ plain form
13012 277007 -112638 175165 487817 181157 263728 92239 -21504 243851 210321 -115901
13001 209443 -60071 203745 130345 274660 259072 -147499 240074 13844 279625 251570
12991 251570 -28378 177147 285213 17412 76156 188873 -109260 81680 290377 -134960
12980 182880 300479 53140 -66593 -64716 -82920 -125626 4487 55955 -39300 251749 -144057
12968 -54314 66983 33991 25650 -1276 26219 -30510 244640 16179 5046 94938 301153 226542
12956 226542 102037 166323 -45790 38640 -367991 -63148 22817 -3889 -271155 -72937 221258
12944 -175942 67476 82786 103526 140999 248942 15823 -236127 -19369 -214435 -68861 -66859
12933 -66859 112787 83516 105461 -49925 -104238 -65604 91935 139334 242033 252372 349268
12922C49268c32379C64911A70278E441L28923B4346K63846A09569a32765p908
12912a40673B75109H9340K3569a85950e2126m3616j53246A71755J75982j56916
12902A90821D6948d07299B02430F5739K62367a17198B44218a32380H6600b7606
12891A69105b50767C37374c18483A80911L1104h3676B42796H1425N1569l719a27005
12879D4768A1978P9993J82892J64161D703K25K12361h6594q3278n6131B89738
12867c70166B82999B6515g2828m8324j21981A94877d681C92701D6404a0278H7737
12855a51269A06133K20205c5999B1054J11519M9865c3534H0258e1302A64258A5528
12843A4252b8221A32125b4033A90728K8190a20398k12069A77191A4624J7338e9831
$$ plain form
12922 349268 -332379 364911 170278 5441 334364 24346 288192 109569 -132765 -140673
12912 -140673 275109 89340 112909 -185950 -52126 -95742 -248988 171755 347737 190821
12902 190821 46948 -407299 202430 65739 328106 -117198 244218 -132380 86600 -27606
12891 169105 -250767 337374 -318483 180911 212015 -83676 242796 81425 132994 129275 -127005
12879 44768 11978 91971 274863 439024 4703 4928 217289 -86594 -169872 -226003 289738
12867 -370166 282999 26515 -72828 -121152 -243133 194877 -4681 392701 46404 -10278 87737
12855 -151269 106133 326338 -35999 21054 132573 182438 -33534 80258 -51302 164258 15528
12843 14252 -28221 132125 -24033 190728 218918 -120398 -332467 177191 14624 31962 -59831
12831A42453b27620O6901A74829n7283G565a14281A08415M3171h6925B9563O0582
12820I0145C5720J22249a96935O8460I6102h1327o8688A85678K6953b26761N5422
12809a71339f7327A67458k183B325g1134E9883F515J90675K8731b83762F4629
12797b43211B52076j05481J6828l0709i2332A98030g8305K6343j87337h8801B95955
12785c09197G0230K7807c30711a15503a7766l60238J85236C3548b54588A22608
12774c0605j41155e2774A83519a18720M9342A28430E7625a82996F9478J12689
12764A82167a08415M4510J8475j90582E7688k6511a44088B98574a27471b3063
12753C9684K4973d24857a70636C0802j991c3387A69322l3368D6452J27822Q906
$$ plain form
12831 142453 -227620 -160719 174829 117546 7565 -114281 108415 151586 -86925 29563 90145
12820 90145 35720 157969 -196935 -128475 96102 -81327 -150015 185678 212631 -226761 -171339
12809 -171339 -67327 167458 165275 2325 -71134 59883 6515 197190 225921 -283762 64629
12797 -243211 252076 146595 163423 132714 -92332 198030 -78305 -51962 -239299 -88801 295955
12785 -309197 70230 98037 -330711 -115503 -17766 -378004 -192768 33548 -254588 122608
12774 -30605 -171760 -52774 183519 -118720 -69378 128430 57625 -182996 69478 182167
12764 182167 -108415 -63905 -45430 -236012 57688 31177 -144088 298574 -127471 -23063
12753 39684 64657 -424857 -170636 30802 28811 -33387 169322 135954 46452 174274 183180
12742A83180K65574A88916P644D7483a57732I9164b45553A89510D6381J03078
12732A49459E3490c5494q607b48H0925b44143N4594b8183m2782E7242j767a9596
12719I6997a24778c6859l34359f7779A28612b36154l0257I1391M95912H929b57697
12707b21700A97126a66193A73208b18701A27311b0710B5365L84519b5617j37380
12697a62997p1649C0635i6435c7165A68474c6685F7050j4170N6095J74765A0608
12685a58097F6238K72985j08905H0029C0392M4090O6064a37212A20056b7461B12805
12673A58508a92435A0165O4132i4316A73641k3302C6401Q9939a90250f5888B95585
12661A48974F1210K95228E5915B862b6820a1742A25152c0397A43473j119J70358
$$ plain form
12742 183180 448754 188916 196560 47483 -157732 99164 -245553 189510 46381 149459
12732 149459 53490 -35494 -44101 -248 80925 -244143 -189549 -28183 -70965 57242 55475 -19596
12719 96997 -124778 -36859 -371218 -67779 128612 -236154 -266411 91391 587303 8929 -257697
12707 -221700 197126 -166193 173208 -218701 127311 -20710 25365 409884 -25617 -162997
12697 -162997 -234646 30635 -96435 -37165 168474 -36685 67050 52880 108975 283740 10608
12685 -158097 66238 339223 230318 80029 30392 74482 140546 -137212 120056 -27461 212805
12673 158508 -192435 10165 74297 -94316 173641 150339 36401 126340 -190250 -65888 295585
12661 148974 61210 356438 55915 2862 -26820 -11742 125152 -30397 143473 142354 312712
12650C12712b74350B24189a49814M5896j8406K7811d3765e668l55054F8178N6354
12639A24532l6778k1478Q8957j070m6755C5018L7042a45404B67892h8670E3579
12627E570K59575g3208L3115j33057C2550b3074C4871K90693o0093m9823G8271
12615F8118J0800J05622L09611A21186J13679J24833j59430J9758c4576j69757
12605b04333D30098A88234j4290m5361A5351K53652a75045A5172L2451J37336
12595A84959g0223b1778j56276C8488a81171A20559O7772h2137A25142J8183m7795
12584I5530J1890C3081h3855k4834I2376K66304b55352E7798c5963A78730f7038
12572a6045A07677a21567A81838D7703J8129a26071C23645c0923k3862A64866
$$ plain form
12650 312712 -274350 224189 -149814 -103918 -122324 -94513 -43765 -5668 -360722 68178 124532
12639 124532 87754 66276 155233 154163 107408 35018 72060 -145404 267892 -88670 53579
12627 5570 265145 -73208 -40093 -173150 32550 -23074 34871 325564 265471 215648 78271
12615 68118 78918 184540 494151 121186 234865 359698 200268 220026 -34576 -204333
12605 -204333 430098 188234 173944 128583 15351 269003 -175045 15172 47623 184959
12595 184959 -70223 -21778 -178054 38488 -181171 120559 188331 -82137 125142 143325 95530
12584 95530 107420 33081 -83855 -108689 92376 358680 -255352 57798 -35963 178730 -67038
12572 -16045 107677 -121567 181838 47703 65832 -126071 323645 -30923 -54785 164866
12561A63101A9498a73299A76420b8537k51222a28432j06055H5663c06117H9419
12550A70837p1531J1361c82657f7244L660k26452A36248a52763r4164f8165d843
12538c32874a21133C52516a66512M5756F2595M9662a8905D5022b6697k74443D8498
12526c7814A53160n8918a84243G7267a05989A88368Q2185a8714C6687a31413k47790
12515c79203D8651b35955D83994A34002e182A26676e1824M168l01249B01970a10337
12503A35640b28988A09257l9331H606i2534B91737I8725J304P3328b5950B6614
12491d5969q3254H4099h1598j56476A93459i6235C22223H2550l4395g9097B1935
12479a75583J3484e6029A8547e8869A07645K1665L2438a51322r4042B14201p3300
$$ plain form
12561 163101 19498 -173299 176420 -28537 -279759 -128432 -234487 85663 -306117 89419
12550 170837 99306 110667 -382657 -67244 -63584 -290036 136248 -152763 -246927 -68165 -4843
12538 -332874 -121133 352516 -166512 -120756 62595 112257 -18905 45022 -26697 -301140 48498
12526 -37814 153160 94242 -184243 77267 -105989 188368 270553 -18714 36687 -131413 -379203
12515 -379203 48651 -235955 483994 134002 -5182 126676 -51824 -47656 -348905 201970 -110337
12503 135640 -228988 109257 69926 8606 -92534 291737 98725 100029 173357 -25950 26614
12491 -45969 -129223 84099 -81598 -238074 193459 -96235 322223 82550 48155 -79097 21935
12479 -175583 -162099 -56029 18547 -58869 107645 129310 161748 -151322 -245364 214201 140901
12468A40901i8623B50790I4113l1093n484K98830D64K9604A2518R3517h3043H9257
12455a06648B57770j00483D4094K21181C4012J09167a60309I109K54205j24324
12445A38990c8122B2101f1557A05571C0294d8874A27719d1644A93100b2823A04402
12433h9175B23860b47832A24387K3558F42P6898L59403A96076G4113J42935D7539
12421h88k66124K4877L8466B3355i9694H5654a49950C09743c11922c6144o7550
12410a03694j52021H4731K1060i2052j25731f1324k1379A81427j4773a25539A32030
12398B80640C672a01786C322O8366N4153j8017Q5929m1514E9187j3644c6085j19175
12386a55260I2857M5407a20192e423j11282k45535C1893A4408K7492a26782F7278
$$ plain form
12468 140901 -98623 250790 94113 63020 57536 356366 464 30068 12518 106035 -83043 89257
12455 -106648 257770 157287 44094 265275 34012 143179 -160309 9109 263314 138990
12445 138990 -38122 22101 -61557 105571 30294 -48874 127719 -41644 193100 -22823 104402
12433 -89175 223860 -247832 124387 147945 642 77540 436943 196076 74113 217048 47539
12421 -888 -267012 -242135 -203669 23355 -99694 85654 -149950 309743 -311922 -36144 -103694
12410 -103694 -255715 84731 105791 -92052 -217783 -61324 -82703 181427 166654 -125539 132030
12398 280640 3672 -101786 3322 71688 125841 107824 193753 152239 59187 45543 -36085 -155260
12386 -155260 92857 138264 -120192 -5423 -116705 -362240 31893 14408 41900 -126782 67278
12374G2619a9947m6573j3111j85791A50831R0464a10989a9405e830E4849B1073
12362A36547a0253B10115j5136L7607G5430J855J5281A4130i0918p5663o5530
12351b32111C8812K8172b92386a13510B0070f3393A12645N9874a41555B03150
12340e5319j67840k9566a7557B82777C2207a19071n4582B5838K5371c67919J41696
12329b26223D38712A6679K76529c7541M695j05403c3832C87281j31088f1356H9368
12317E9306L53352a43078d2829j2754A07844J30558Q0545J496j42647M3415e1148
12305A47036J54935e1192J1357D69136A64726C513K80225F5198M43850A45883
12294C20864j06725J17700a6439j40079N5890A47000C1687a53818o3927H9387
$$ plain form
12374 72619 -19947 -66520 -79631 -265422 150831 241295 -110989 -19405 -5830 54849 21073
12362 136547 -10253 210115 194979 232586 75430 77285 92566 14130 -90918 -166581 -232111
12351 -232111 38812 66984 -292386 -113510 20070 -63393 112645 172519 -141555 203150
12340 -55319 -223159 -252725 -17557 282777 32207 -119071 -173653 25838 51209 -367919 -226223
12329 -226223 438712 16679 293208 -37541 -32846 -138249 -33832 387281 256193 -61356 89368
12317 59306 412658 -143078 -42829 -55583 107844 238402 318947 320443 177796 221211 -51148
12305 147036 301971 -51192 -39835 469136 164726 3513 283738 65198 509048 145883
12294 320864 214139 331839 -16439 -156518 -100628 147000 31687 -153818 -217745 89387
12283D4743K5299j6922b19649f3051K6295j67937B15229E5784L81926f8967j62316
12272b31283D01384a18086E1056M69308B15957f4501j21081d5001h808j97752
12262b06560C81653a34706C11953E7764a75621A10066J54583J12397j22101k523
12252B52422l8138M1068O3643F7714a41452b3826F4522c134C41220A56188K05119
12241C61307a8655B08879F70L8839K13695n1747K41509B06562H9379L9026c30699
12229g4310k02440B13738Q6099A48185o5399J54001J37777b39342E5753J81611
12219B37364C2157b6653A08311b79202A87528K5057a13826B23864p671F1034M0061
12208A01095J58066O0572J55226d810B37737l8190M5096m6647J71222a2856C52725
$$ plain form
12283 44743 70042 53120 -219649 -63051 -36756 -204693 215229 55784 437710 -68967 -231283
12272 -231283 401384 -118086 51056 520364 215957 -64501 -185582 -45001 -8808 -206560
12262 -206560 381653 -134706 311953 57764 -175621 110066 264649 377046 254945 252422
12252 252422 214284 255352 318995 67714 -141452 -23826 64522 -3134 341220 156188 361307
12241 361307 -18655 208879 670 39509 253204 201457 442966 206562 89379 128405 -330699
12229 -74310 -276750 213738 299837 148185 82786 236787 374564 -239342 55753 237364
12219 237364 32157 -26653 108311 -279202 187528 212585 -113826 223864 216193 61034 101095
12208 101095 259161 319733 474959 -4810 237737 199547 244643 197996 369218 -12856 352725
12196A05786J72463i6099D32126j40435a1828A1494a32047I3115J23346f5946
12185B11373j6634J14887b2483D16884o1164j61321m5065K78958c5568B25399
12174A99746J3974L64382k65955l5036d812E34458B34221L3288E0813G654P4767
12163H2421L4611n7133J50687o9845J85441m2326n1926a48502G5480h7080B60991
12151D25798j73945J42854e6418D01307b9787A43485K67034n2818j41504e9507
12140D78868B36811k3409A04840a31660B50713Q3976a62949C15478j19784a32130
12129D4580R1544Q3168n7924L6821F4689c8165D4576J33206J12957M4890q6130
12118B49499A16150k5949a14430A48891e938H7186e6724A3090M9942A4959K0729
$$ plain form
12196 105786 278249 -96099 432126 291691 -11828 11494 -132047 93115 216461 -65946
12185 211373 194739 309626 -22483 416884 355720 194399 149334 428292 -35568 225399
12174 199746 213720 578102 312147 277111 -4812 534458 234221 267509 50813 7654 82421
12163 82421 117032 59899 210586 140741 326182 283856 231930 -148502 75480 -87080 260991
12151 425798 251853 394707 -56418 401307 -29787 143485 410519 357701 216197 -59507
12140 478868 236811 213402 104840 -131660 250713 334689 -162949 315478 195694 -132130
12129 44580 136124 219292 161368 198189 64689 -38165 44576 177782 290739 335629 249499
12118 249499 116150 90201 -114430 148891 -5938 87186 -56724 13090 63032 14959 35688
12107C5688M0505K21140A37504j0150L68314j46857n1785j16108K79043j38239
12097C21722j19752F397J12545e9333l00633H6390f346k37666B91100e3400A24034
12085b5941A14357J22649g9983G8142l3380M1716J36230a34565A8306M5731O7663
12074A31700L8035J27026b494A25452J10163b10543B3710b7050A95489J82123
12064C77612h1039A78781b02028C93635E1436J04474m5734E3271K8644M54157
12054E36072B01269i0129H5121K32300A47330r601E9835j4488b47754B00807o3727
12043A37080j1957M8508i2324B21044B1126M5935h0233q7188h1166A25482b32698
12031c847r3030j60760B88633C9960P6823l2626j0860j7158d3595A23898b82963
$$ plain form
12107 35688 76193 297333 137504 127354 495668 348811 297026 180918 459961 321722
12097 321722 201970 6397 118942 -59333 -359966 86390 -6346 -244012 291100 -53400 124034
12085 -25941 114357 237006 -79983 78142 44762 86478 222708 -134565 18306 64037 131700
12074 131700 169735 296761 -2494 125452 235615 -210543 23710 -27050 195489 377612
12064 377612 -81039 178781 -202028 393635 51436 155910 110176 53271 81915 536072
12054 536072 201269 -90129 85121 317421 147330 137729 59835 45347 -247754 200807 137080
12043 137080 125123 173631 -92324 221044 21126 67061 -80233 -167421 -81166 125482 -232698
12031 -3847 -96877 -257637 288633 39960 116783 84157 73297 56139 -43595 123898 -282963
12019b44341B80312E9510R419c19035F6847L315M5881P3674a35598k01235B1267
12007h7156A16824b561j72494k6574B06910m1878a16781D4587a0146A8333h1854
11995C53636o5004b72008B41898J50701d266B34726a65584o5827B76359h3911
11984A94803b86936f1432g18A28564J38136c20106E6589j9500a40896L6274M0604
11973f4018a1409B52113b22508l26770c6023l6468l2543A45623a74478P9161H0813
11961A08245J47671q3668G1212a18927D38J3636a15657A94162f2446r1794b3766
11949b37052B6641l065a6167j13129r4553C19733j36964b39056d7517m7803j03931
11938a99251I1419f4127k9933B64753G560b46389a9248j685A4242a19733F5757
$$ plain form
12019 -244341 280312 59510 68929 -319035 66847 70162 116043 189717 -135598 -336833 21267
12007 -87156 116824 -2561 -175055 -201629 206910 165032 -116781 44587 -10146 18333 -81854
11995 353636 288632 -272008 241898 392599 -4266 234726 -165584 -231411 276359 -83911
11984 194803 -286936 -61432 -718 128564 266700 -320106 56589 37089 -140896 -104622 -64018
11973 -64018 -11409 252113 -222508 -549278 -36023 -72491 -105034 145623 -174478 -95317 80813
11961 108245 255916 172248 71212 -118927 438 14074 -115657 194162 -62446 -154240 -23766
11949 -237052 26641 23576 -16167 -129296 -223849 319733 182769 -239056 -47517 -95320 -199251
11938 -199251 91419 -64127 -94060 264753 7560 -246389 -19248 -20933 14242 -119733 65757
11926a19139A07887b6231B32147j02935J20626c06444A044K64584a16435B00497
11915d680L24A35222m7951j7251a41289G0118a67195K9008c3685G3430a9730C21740
11902b58839G6346a8670r144C01772a14624G1501A9259a25316K3579K5470F7853
11890d48492a34763H4523C1746c39860a43102g370F5493J9365a02823B9337c33642
11878B3519J27197b36528L9344i4222L4692k47211A67843b09230a5028m36515
11868d51543a60817I2792d50301C70715f7900A97234a25978K1665C0496a04624
11857a07765H571e5742A13629a59241f1435A17023c94786J38800b8356m6603D322
11845B75475f9702a9423k16882A71514c12188B5397h0464j38902M9462Q1676A43119
$$ plain form
11926 -119139 107887 -26231 232147 129212 249838 -306444 1044 265628 -116435 200497
11915 -4680 -4356 135222 87271 70020 -141289 70118 -167195 -138187 -33685 73430 -19730 321740
11902 -258839 76346 -18670 -27814 301772 -114624 71501 19259 -125316 -101737 -76267 67853
11890 -448492 -134763 84523 31746 -339860 -143102 -7370 65493 84858 -102823 29337 -333642
11878 23519 150716 -236528 -197184 -94222 -59530 -306741 167843 -209230 -15028 -451543
11868 -451543 -160817 92792 -450301 370715 -67900 197234 -125978 -104313 30496 -104624
11857 -107765 8571 -55742 113629 -159241 -61435 117023 -394786 -255986 -28356 -74959 4322
11845 275475 -69702 -19423 -236305 171514 -312188 25397 -80464 -219366 -169904 -88228 143119
11833e0474E9821K6989b14539j7506j70365E7515M218a82132K1516K1312H775
11821b6858A13945d57540f6564j93881A57105a84075K2931M3245A82810h576G080
11809b02267E9270J79510K42894I4340M3552b85158O3109E430a1060j7393k23908
11798b52361D3344b4848A48254b3860j52710F8353c0369A32035D8609b43504b9751
11786F3426M1819J65287j21664c48761I4766M2093i5644K6943j32821i6779D4225
11774a92622a4460o5797A48149h4597D21209j26104f2023A36251o6238a55238
11763a3212l5871E4367a8113A96251Q4832A4551L69934a13400F8529a63137A47337
11751a74268B8777k164J2212a33120n0288A14715O6418p6524a02389a8868m7846
$$ plain form
11833 -50474 59821 86810 -214539 -232045 -402410 57515 61733 -182132 -160616 -139304 8775
11821 -26858 113945 -457540 -66564 -260445 157105 -184075 -161144 -117899 182810 -8576 7080
11809 -202267 59270 238780 481674 94340 137892 -285158 -222049 5430 -11060 -28453 -252361
11798 -252361 43344 -24848 148254 -23860 -176570 68353 -30369 132035 48609 -243504 -29751
11786 63426 105245 270532 148868 -348761 94766 136859 -95644 -68701 -201522 -96779 44225
11774 -192622 -14460 -80257 148149 -84597 421209 295105 -62023 136251 70013 -155238
11763 -13212 -49083 54367 -18113 196251 281083 14551 384485 -113400 68529 -163137 147337
11751 -174268 28777 26613 38825 -133120 -183408 114715 181133 104609 -102389 -18868 -66714
11740f6714m31529A44761a06910A09928l0697a92550k77289a43655B54349B6248
11729A49087b75050F0047d2008D14328c76478a20755M7603A92356q5053J5117
11719A22420c32762B4956f1527J7839J3580I0427R2049K07347A69334f6908C37033
11707A00062m4763N6559B5212a04816C4799c62565C40633r0236j1731g6580A13725
11695H1162C6302K37121j28161b16297i6645j33397E63759A90879J78953a62830
11684B43496g6639m574A45847J9325b47650a04677F3726J93586c94654P1548A70201
11672c6858j09434A3466J08167i4535C7392a10671C76950A17837a34387F6258
11661b52493B45619j02932E1920b62078G5590L3240N040m7539g0136j98454A09711
$$ plain form
11740 -66714 -498243 144761 -106910 109928 79231 -192550 -469839 -143655 254349 26248
11729 149087 -275050 60047 -42008 414328 -376478 -120755 -73152 192356 107303 122420
11719 122420 -332762 24956 -61527 -43688 -30108 90427 182476 389823 169334 -66908 337033
11707 100062 55299 111858 25212 -104816 34799 -362565 340633 250397 238666 -76580 113725
11695 81162 36302 273423 145262 -216297 -96645 -230042 563759 190879 369832 -162830
11684 243496 -76639 -81213 145847 165172 -247650 -104677 63726 257312 -394654 -323106 170201
11672 -36858 -146292 13466 121633 -94535 37392 -110671 376950 117837 -134387 66258
11661 -252493 245619 142687 51920 -262078 75590 108830 113870 66331 -70136 -268590 109711
11649G7427c7796A21387J5516g7096A2770P598b15268j3011B9309c10191A72222
11637b73630J29160K5606B33456b42996B48939a82683A30927a02932A75945k1892
11627A54053d838I5680b18489e2331m337I6852O8477b14860a3132B1811f0977
11615e33887a05287l8406a6496c168k49E73221e6812A39663C4799c6629F4638
11603B23384g545E4030f0704E2295J69069b01045q9340A45291a53815E6937a052
11591e398l9540I7010d8727C57688A47168a9713A19348B8298L11872c37335A33479
11579C0868R7274Q468J64032o6386N3204h3957G7190a46080A42135o1688R8175
11568A78622a22919A84814E2082B0046J73191B7626M96574a26440C0483L8618
$$ plain form
11649 77427 -37796 121387 136903 -77096 12770 20368 -215268 -228279 29309 -310191 172222
11637 -273630 -144470 -118864 233456 -242996 248939 -182683 130927 -102932 175945 154053
11627 154053 -4838 95680 -218489 -52331 -56668 96852 165329 -214860 -13132 21811 -60977
11615 -533887 -105287 -143693 -16496 -3168 -3417 573221 -56812 139663 34799 -36629 64638
11603 223384 -7545 54030 -60704 52295 221364 -201045 -290385 145291 -153815 56937 -1052
11591 -5398 -44938 97010 -48727 357688 147168 -19713 119348 28298 340170 -337335 133479
11579 30868 128142 136610 300642 234256 287460 -83957 77190 -146080 142135 80447 178622
11568 178622 -122919 184814 52082 20046 193237 27626 524200 -126440 30483 69101
11558F9101c1866C32097G3526J78833A03068m3418J51411I2706i6500B9559K98569
11547C28128a96848A55572k0388k9432a15125E5124M05638a28293Q343A29888
11536A16125a0169C6454L4268K40761n1616h1327C08860a26135I7463J02585J76763
11525C76811g4440B66345a73827p2929B30264c4832C03764b5647G4723a81495
11514B52121H1521J33294k6200q082b7358G4787a93287G7208h7274A49888O575
11503A56463G1696h0505m6734b1708C56919b47056C42183A33020F3642f2448H0070
11491A10992K48055D9647J39323n9037J50414j01640d0451I3055R6142G6849a1793
11479A8937D522L340P6920k0118J49974p081I3237Q2154a93729B92316H9596a98979
$$ plain form
11558 69101 -31866 332097 73526 252359 103068 59650 211061 92706 -96500 29559 328128
11547 328128 -196848 155572 135184 105752 -115125 55124 460762 -128293 -119950 129888
11536 116125 -10169 36454 70722 311483 259867 -81327 308860 -126135 97463 200048 376811
11525 376811 -74440 266345 -173827 -246756 230264 -34832 303764 -25647 74723 -181495
11514 252121 81521 214815 188615 180533 -27358 74787 -193287 77208 -87274 149888 156463
11503 156463 71696 -80505 -127239 -21708 356919 -247056 342183 133020 63642 -62448 80070
11491 110992 359047 49647 188970 129933 280347 178707 -40451 93055 189197 76849 -11793
11479 18937 4522 7862 84782 64664 214638 207557 93237 175391 -193729 292316 89596 -198979
11466C41145g8312A92996K54975j56286G7445N48048A27692J88573a43810A53908
11455C28843P0080c6706B67629F580J37399n5134g6624B51723a5852B02894C2951
11443A4442a40446k71633A36285K45924j07859j10892a36482B98694D9347b6844
11432f345j46089A98031a75065I1407J11681A7239a08117j2537C9318Q4810c2217
11420F6636L68232k02683i7814k87D04050j97704A4769J04411d5784b0901B1215
11408B65191c3180G5297j7448J32876q5870a20577I2020J01447h7956H1561O6439
11397A48000a26489p3023e9015N021j14443h647q7814C7946a21741a9991E2693
11385a07960A39171m7312a05479o5649a0569k26092I1911b2454C57763K0457b39197
$$ plain form
11466 341145 -78312 192996 447971 291685 77445 625493 127692 316265 -143810 153908
11455 328843 398923 -36706 267629 6580 143979 88845 -76624 251723 -15852 202894 32951
11443 14442 -140446 -412079 136285 382209 274350 163458 -136482 298694 49347 -26844
11432 -6345 -152434 198031 -175065 91407 203088 17239 -108117 -120654 39318 124128 -32217
11420 66636 434868 232185 -97814 -98101 404050 206346 14769 119180 -45784 -20901 21215
11408 265191 -33180 75297 57849 190725 104855 -120577 92020 193467 -87956 81561 148000
11397 148000 -126489 -199512 -59015 -53994 -168437 -8647 -96461 37946 -121741 -19991 52693
11385 -107960 139171 91859 -105479 -171128 -10569 -236661 91911 -22454 357763 378220 -239197
11373b14953c1569A94958q7604R0055h6567B27119h2840C65529B4817d01576f1331
11361b54096F1109b25898B73961H3816b1715I7486M6506k5045L8689a57969q7771
11350b45740i9286B961J21802K770K8966C680J16612K22984G7282M4753M3085
11339A65120B2681K40229A31227a02632d7918k50953O3834A30470o3112g2353
11328e3844r7419D3202K37380i8590K550j7773k3145B01391e1172o2389B23837
11316a167j67728G0495c72435C61656B2732b992j65978p0236A9399a5658A55964
11304d60738m596b12038K7149A31974C6760K35576j00010l3341m4985a44121c286
11292C6411a32044k30302e806k85317f3694j85880d0376B89727g8520a9302P087
$$ plain form
11373 -214953 -31569 194958 107354 197409 -86567 227119 -82840 365529 24817 -401576 -61331
11361 -254096 61109 -225898 273961 83816 -21715 97486 143992 118947 157636 -157969 -245740
11350 -245740 -99286 2961 124763 127533 156499 3680 120292 343276 77282 122035 165120
11339 165120 22681 262910 131227 -102632 -47918 -298871 -235037 130470 67358 -72353
11328 -53844 -151263 43202 280582 -98590 -96040 -113813 -136958 201391 -51172 -113561 223837
11316 -1167 -168895 70495 -372435 361656 22732 -2992 -168970 -239206 19399 -15658 155964
11304 -460738 -465334 -212038 -184889 131974 36760 272336 172326 138985 94000 -144121 -3286
11292 36411 -132044 -362346 -5806 -291123 -63694 -249574 -40376 289727 -78520 -19302 -12215
11281a2215A44327b81909A6815c53519A8178a59482b484k41789j43426B28601
11270c62132B20571a79645C4858J86669m9016b3961l5243B27050f2913b7754D9433
11258A81352a84631h9362J9889C31716D5610L7873a917A43467f7020K7315A54765
11246f5061q3485H4408a05544M5511l00525a23603o4913A81783d5617A32492C9712
11234b65103A53872a2888q8390A49052J13282C2432j943J74936c57098B500a33290
11222A30554h6918q41j30406L3887o1940B01401E8655b87967A53208c38173a45801
11210a44017C00079r7478j9826a61551A55206b6802j23465p9159j93245A55511
11199b57686J10130k41520N7081a12764j54365a15106c6709j16412A42943P8592
$$ plain form
11281 -12215 144327 -281909 16815 -353519 18178 -159482 -2484 -244273 -387699 228601
11270 -362132 220571 -179645 34858 221527 172511 -23961 -59204 227050 -62913 -27754 49433
11258 181352 -184631 -89362 -69473 331716 45610 83483 -1917 143467 -67020 -39705 154765
11246 -65061 -148546 84408 -105544 -60033 -360558 -123603 -188516 181783 -45617 132492 39712
11234 -265103 153872 -12888 -101278 149052 262334 32432 30489 205425 -357098 2500 -133290
11222 130554 -86918 -87759 -218165 -184278 -246218 201401 58655 -287967 153208 -338173 -145801
11210 -144017 300079 202601 182775 -161551 155206 -26802 -150267 -229426 -422671 155511
11199 -257686 -147556 -389076 -331995 -112764 -267129 -115106 -36709 -153121 142943 221535
11189B21535g8980I5955a39553O414j02738C6211h1364q6576a7725j91397D1694
11177a01501o2744C5175j0328J74088B847N4727F828h6071A18938k0010P2555
11166A71483A3321a47167n1439O8591j91397J60135C6880c37946J13894e4298
11155I6652J39478C1584a08978B20466a58854b7047E095J55623a85646A40461
11144b71279J17934o7643e3792B59468O7431A10378i343B09288K2231F1435K8220
11133H9655b7353j25563M7594Q477l67430c7197A7804J98110a78018p0557J354
11122b47221B61930b08019D097a70336c6583B018J21941j7780a27234B92558I5214
11110i5761c5963A965J36017b4628j9951C13562m1566a19889B68470a31827A42750
$$ plain form
11189 221535 -78980 95955 -139553 -133139 -235877 36211 -81364 -167940 -17725 -209122 41694
11177 -101501 -164245 35175 24847 198935 2847 57574 6828 -86071 118938 98928 171483
11166 171483 13321 -147167 -198606 -130015 -321412 -161277 36880 -337946 -224052 -54298
11155 96652 236130 31584 -108978 220466 -158854 -27047 5095 160718 -185646 140461
11144 -271279 -153345 -220988 -53792 259468 326899 110378 -9343 209288 231519 61435 89655
11133 89655 -27353 -152916 -105322 -96845 -464275 -37197 17804 215914 -178018 -248575 -247221
11122 -247221 261930 -208019 4097 -170336 -36583 2018 123959 106179 -127234 292558 95214
11110 -95761 -35963 1965 137982 -24628 -44579 313562 271996 -119889 268470 -131827 142750
11098H038J29044K9561d915E8277b77966H600P0648L5265J51587E487K89842o1362
11086B33967J78970G8343o345K89003A55866F9650M4792N237b78344a04384A79159
11074H9333J77482j26869L5477N5004K26119k14273b0945A92883a35121d70F14347
11062f0481E1444K2370C0548f0326D47163m2110l5183k580k5106A20435L08759
11051D29194f280B91305K9138J11230k08787j5781K33950j08432j13049P744K81901
11040E09219L183K90933C75760N59791m00749K52642R233j49319K92006K13039
11030A152403n02741K57725L7272P8572k69804k6020J14587M16113F10545R0380
11020G00925J38310m9386j06907Q1627j1259J53324r5697K17253k39617r1799
$$ plain form
11098 8038 137082 166643 -4915 58277 -277966 8600 79248 114513 266100 5487 295329 233967
11086 233967 412937 78343 71998 361001 155866 69650 114442 119679 -278344 -104384 179159
11074 89333 266815 139946 175423 230427 456546 242273 -20945 192883 -135121 -470 614347
11062 -60481 51444 73814 30548 -60326 447163 405053 369870 367290 342184 120435 429194
11051 429194 -6280 291305 320443 431673 222886 207105 441055 332623 219574 227318 509219
11040 509219 512402 803335 375760 935551 534802 787444 796677 647358 939364 1152403
11030 1152403 649662 907387 944659 1023231 753427 727407 841994 1258107 610545 700925
11020 700925 839235 789849 682942 764569 753310 906634 810937 1028190 788573 696774
11010F96774k4919J0106K78511k84567M2754j08369K8578L8550q691L34066l87252
10999F15541K17461k82835B59732M88767C43834J88877J12159J4198l5103J52796
10989G76761p6270p9925L43333j24841l8632L3265k10100j19473K05541J8373
10979G28032j84401J18419K01821l17318p0271L01408j96946j41219L48050j75196
10969F12379M96512j97888L9276k42721L6432L96900r7339l03525K81977L98018
10959A420021k70662J43882N73190J88280L50472J28779K7972M48815l92918j25758
10949B492073J33288J01667j63270m79320l46785m24K93117l15622K51415q6146
10939A879993k28827K03742m35452J39450N3711k85449n8992m3692m98959Q4131
$$ plain form
11010 696774 671855 681961 960472 675905 718659 610290 638868 677418 668727 1002793 615541
10999 615541 833002 550167 259732 748499 343834 532711 644870 659068 623965 776761
10989 776761 700491 620566 963899 839058 800426 833691 623591 504118 709659 728032
10979 728032 543631 662050 863871 546553 476282 777690 580744 439525 787575 612379
10969 612379 1108891 911003 950279 707558 743990 1140890 1043551 740026 1022003 1420021
10959 1420021 1149359 1293241 1866431 2054711 2405183 2533962 2561934 3010749 2617831 2492073
10949 2492073 2625361 2727028 2563758 2084438 1737653 1737229 2030346 1714724 1966139 1879993
10939 1879993 1651166 1854908 1419456 1558906 1612617 1327168 1268176 1224484 725525 809656
10929H09656l24128K48403l1622j50277k70459L81450A91280P0672j28497J98753
10919C32208C2763N3455K96186a571j73641D06067a00117k0671n0720H5550A2571
10907g5447L5522j61004E6224f9126B1598a24716A32207j0305A314J31653l2519
10896A00448a13666A4810a64417F7571L20545G3192h3822A41663a84207b9483
10885B28261r6197a28391j65176g716k9509j52310G7183e2662j39738A64022f7175
10873e8203A82179J867M0448n2835O8326a91383G3180J23818m607b2200G0837
10861a33860j471E5284k4407a69086E8281j6330c5833A77406b77139a30726B09425
10849a60917G4131C0632j2554d64577d7304q711D7926c43250a66733A19962n5792
$$ plain form
10929 809656 485528 733931 702309 552032 281573 663023 191280 261952 133455 332208
10919 332208 32763 86218 382404 -1571 -175212 406067 -100117 -120788 -171508 85550 12571
10907 -75447 -39925 -200929 56224 -69126 21598 -124716 132207 121902 1314 132967 100448
10896 100448 -113666 14810 -164417 67571 388116 73192 -83822 141663 -184207 -29483
10885 228261 132064 -128391 -293567 -7716 -37225 -189535 77183 -52662 -192400 164022 -67175
10873 -58203 182179 184046 224494 171659 239985 -191383 73180 196998 192391 -22200 70837
10861 -133860 -135331 55284 30877 -169086 58281 41951 -35833 177406 -277139 -130726 209425
10849 -160917 74131 30632 18078 -464577 -47304 -56015 47926 -343250 -166733 119962 64170
10838F4170K68701b82622B4613P167A0587a23665Q28M2050G7203R7117a90692
10826A34843a8038k14839A64349B565M7996h3320D4341a76251F29Q2319O6876
10815A49824J5217a99958R8146B14374a2823A67419k7059b96965B09704b43834
10804A76294O4887I8473D4026L26972g3214q4318p9309I9692a94953f6740A90681
10792d78867a49316o1043j0746B76013r250c70274J73302j51457J17333L8737
10782a92359F0917K69915a56251A07051L4798b0262j61927I2799a4288j84112
10772a98400f0081J6125j13444J9246e5419j33786q209B03195b61682F1870a56661
10760A35316j8916j2261g1073A13972l740i4808A85751c20757A66411b64279i0809
$$ plain form
10838 64170 332871 -282622 24613 31780 10587 -123665 -122837 -80787 77203 174320 -190692
10826 134843 -18038 -232877 164349 2565 50561 -83320 44341 -176251 629 82948 149824
10815 149824 165041 -199958 -101812 214374 -12823 167419 140360 -296965 209704 -243834
10804 176294 241181 98473 44026 370998 -73214 -157532 -236841 99692 -194953 -66740 190681
10792 -478867 -149316 -210359 -221105 276013 266763 -370274 -196972 -348429 -231096 -192359
10782 -192359 60917 330832 -156251 107051 141849 -20262 -182189 92799 -14288 -198400
10772 -198400 -60081 -43956 -157400 -138154 -55419 -189205 -197414 203195 -261682 61870 -156661
10760 135316 116400 104139 -71073 113972 110232 -94808 185751 -320757 166411 -264279 -90809
10748d34406a71429j63888g317l00129E8575i5675D7868K6790b81450A09502a30594
10736A10423a01418j02433g2671C9474K75193a36312j92258A6490D531K98435
10726C02966a39151B28157F7376c4257A5701a40665l8169k56927K15258b2615
10715E0987Q0799A3979K53133B895b31517c9615j85978b5870F2013K016a36073
10703h5103j6458k44725O5007g5869c2276A62032O8633b23048Q1714E3318a34077
10691A90887c4317q2894G2126f1922k55825f3253k3745a7546B25208h6312j4648
10680a00960a4298A59586b39190J02765H4858a78723I3778e3865a5978I1498a68758
10668a19260A40944b05119G7360K00165a10110j45242D7389a85973j83337e0092
$$ plain form
10748 -434406 -171429 -335317 -7317 -307446 58575 -95675 47868 74658 -281450 109502 -130594
10736 110423 -101418 -203851 -72671 39474 314667 -136312 -328570 16490 4531 302966
10726 302966 -139151 228157 67376 -34257 15701 -140665 -178834 -435761 -220503 -22615
10715 50987 131786 13979 267112 2895 -231517 -39615 -225593 -25870 62013 64029 -136073
10703 -85103 -101561 -346286 -281279 -75869 -32276 162032 230665 -223048 -141334 53318 -134077
10691 190887 -34317 -117211 72126 -61922 -317747 -63253 -86998 -17546 225208 -86312 -100960
10680 -100960 -14298 159586 -239190 -136425 84858 -178723 93778 -53865 -15978 91498 -168758
10668 -119260 140944 -205119 77360 277525 -110110 -255352 47389 -185973 -369310 -50092
10657b05386c121j48205p4377o0581A01554h6488B73398c5200j75507b4325L205
10646b1120d692J435B1679a67953B3647a36242a6415o86887A5725a31859c0202
10634e9894q5109A73754c28777a00207j69961j53873K10816G2114g8372D0236
10623a48215N2844E1624d85529B69974i7563j16480B09700f2720N118p1294J5810
10612a13086l3055j13150c3564F363a79821A40808a31615j41903a02589j35382
10602b37971G3917g411l36483D5629a92281G532a57170n5998N4404J3537L1780
10591a13447d9991C54743g2885n9399H2840k9811b1606A76574c37739b2710j56768
10580a79478O3919b5175k24793i86k4692C47455A4056a51903l09529h8351B21074
$$ plain form
10657 -205386 -3121 -151326 -225703 -286284 101554 -86488 273398 -35200 -210707 -24325 -21120
10646 -21120 -4692 -3257 21679 -167953 23647 -136242 -16415 -703302 15725 -131859 -30202
10634 -59894 -145003 173754 -328777 -100207 -270168 -424041 -213225 72114 -78372 40236
10623 -148215 -95371 51624 -485529 269974 -97563 -214043 209700 -62720 -57602 -128896 -113086
10612 -113086 -146141 -259291 -33564 6363 -179821 140808 -131615 -273518 -102589 -237971
10602 -237971 73917 -7411 -343894 45629 -192281 7532 -157170 -213168 -158764 -145227 -113447
10591 -113447 -49991 354743 -72885 -132284 82840 53029 -21606 176574 -337739 -22710 -179478
10580 -179478 -115559 -25175 -249968 -986 -25678 347455 14056 -151903 -461432 -88351 221074
10568a752j44709r5640b149A54776o5359e023j61805G1030h4389K5181b9518H7193
10555c58474a03964A54031a70222h279B9941b22611a03519I8616a85628j18105
10545c03733G4156R1897g4081j02549k39132d8879B87779c52198E6536a18879
10534b52309Q6110A23050a02704A9960a58144A46041m5141i4536k8166j35606
10524b58308M5840e0387G0509e7118Q383q2828d0693k31959h8894L8279A58645
10512d35783B20638n9512J85363I8966c90454Q4912A1001i9018o972k1767r066
10501a36823G3627N479b67420D5550R2213m7369c6029A35957e3668P866n1555
10490i7357p4299B4946g6876o3824h900A66895E6316b2925B2478a35634A17250
$$ plain form
10568 -1752 -146461 -242101 -2149 154776 89417 -5023 -166828 71030 -84389 -59208 -29518 87193
10555 -358474 -103964 154031 -170222 -8279 29941 -222611 -103519 98616 -185628 -303733
10545 -303733 74156 166053 -74081 -176630 -415762 -48879 287779 -352198 56536 -118879
10534 -252309 -166199 123050 -102704 19960 -158144 146041 100900 -94536 -122702 -258308
10524 -258308 -212468 -50387 70509 -57118 -48735 -131563 -40693 -272652 -88894 -50615 158645
10512 -435783 220638 161126 346489 98966 -390454 -305542 11001 -99018 -105990 -127757 -136823
10501 -136823 73627 79106 -267420 45550 137763 90394 -36029 135957 -53668 -45802 -97357
10490 -97357 -171656 24946 -76876 -140700 -8900 166895 56316 -22925 22478 -135634 117250
10478A42838a43766A79581E4459a38453e1938o2786K8921k38796D77989D626R3213
10467I7839A6918a83480g3570E97g6453I2684J56242K41928A03175J72144L1510
10456C06829a67049C98910A35423b263A09099a36641H8774a60924A3253b34448
10445c8994B8139L79513H7049A3971c19761h1B93592h1139q9524K5328A7190a64215
10432F7307b2463L150A21270b8991k30441M4853N9686A767a61779L905D6383i0465
10419g1149j31442B60866j04063d079q6501J8732N210B7586a20699b7830o0155
10408h7985Q886k06013R552k3350D1934O8559b929j86146k31126a49682G238L58991
10396C66229E6676j7893j432a46911d5092A83134b77412P3978h1925A63053a22398
$$ plain form
10478 142838 -143766 179581 54459 -138453 -51938 -114724 -85803 -324599 477989 4626 97839
10467 97839 16918 -183480 -73570 597 -76453 92684 248926 490854 103175 275319 306829
10456 306829 -167049 398910 135423 -2263 109099 -136641 88774 -160924 13253 -234448
10445 -38994 28139 407652 87049 13971 -319761 -81 293592 -81139 -170663 -145335 17190 -164215
10432 67307 -22463 -19313 121270 -28991 -259432 -214579 -154893 1767 -161779 -157874 46383 -90465
10419 -71149 -202591 260866 156803 -4079 -90580 -71848 -66638 27586 -120699 -27830 -87985
10408 -87985 -79099 -285112 -275560 -298910 41934 110493 -2929 -189075 -420201 -149682 7238 366229
10396 366229 56676 38783 37351 -146911 -45092 183134 -277412 -203434 -81925 163053 -122398
10384b15205I8083J01240a6109G7771k9639L9578O9148A587L14236a84062A8907
10372A32204a45681D0828a82787B44173j19986Q9034a72519k02662B97013J97707
10362D94720E9782a63170C99021j84358Q5721a60970B10886m2214J89085J6526
10352C74283j6812J47749G6637P6019J76480N11423k31740k45774p5887j13454
10342A73704K07724A62608J86997c25315a4161C91891J6989J42871j04685n0105
10332C96961J52741q8559J24420k30909o3659K43097j14087J25306k17718P8853
10322D06446L4994D1706K80018k6891N3140r0954j9969b08087B84439j36533m8830
10311I9076b511I1111J87500J37371e4390E0008K52868a30861A84189j2013Q3464
$$ plain form
10384 -215205 98083 199323 -16109 77771 48132 87710 156858 1587 315823 -184062 18907
10372 132204 -145681 40828 -182787 244173 124187 213221 -172519 -375181 297013 494720
10362 494720 59782 -163170 399021 214663 300384 -160970 210886 168672 357757 374283
10352 374283 357471 505220 76637 152656 329136 840559 608819 363045 287158 173704
10342 173704 381428 162608 349605 -325315 -14161 391891 408880 551751 447066 396961
10332 396961 549702 461143 585563 354654 290995 534092 420005 545311 327593 406446
10322 406446 441440 41706 321724 294833 347973 257019 237050 -208087 284439 147906 99076
10311 99076 -2511 91111 278611 415982 -54390 50008 302876 -130861 184189 172176 255640
10300B55640G1962K12844j10390M7486E5318g7764b8122A09321a27418A4266d482
10288c07078H1661K11652b49810E0841K13529j30381C6538g8836E049a28542O1809
10277f6733C1713a12104H6546c04374M972A44137J11947a22503m5928g459j00089
10266a07548C9080J1749a21103j0795B399L53994I8537g8632b7993a0852j10871
10255a21723c1965j12847j77915c6409j98667A78675a96926R7163F3588k3855
10245C9733Q8710d5165c494D7788K3208J52650a88128B9693K67399q6454m9817
10234A60821K14870j51570F9369R8385a72803n8784J01300j45875c6614H0869
10223b23090j0749A31940b91676A13607c94673a01735A14361d5034a8552B8323
$$ plain form
10300 255640 71962 284806 174416 221902 55318 -77764 -28122 109321 -127418 14266 -4482
10288 -307078 81661 293313 -249810 50841 264370 133989 36538 -78836 5049 -128542 -66733
10277 -66733 31713 -112104 86546 -304374 -299402 144137 256084 -122503 -168431 -7459 -107548
10266 -107548 39080 50829 -121103 -131898 2399 356393 98537 -78632 -27993 -10852 -121723
10255 -121723 -31965 -144812 -322727 -36409 -235076 178675 -196926 -99763 63588 39733
10245 39733 128443 -45165 -3494 47788 70996 223646 -188128 29693 297092 210638 160821
10234 160821 375691 224121 69369 167754 -172803 -231587 -130287 -276162 -36614 80869
10223 -223090 -233839 131940 -291676 113607 -394673 -101735 114361 -45034 -18552 28323
10212C00773g9356k84598A36512b47926n2845K8956a09606M6623r8365b6580A51784
10200a40182e5839j82633D7323a12990B66802A1408f0603r0926k12300e8492B21455
10188a99082B2940b8745m8720p6266r0923B01436q0756c4880B22785c21891Q3378
10177b38513k02781e3333k96935L9571i916j31269B27842C9353c6804k16735B16643
10165C857a36859b5234C0383a70991L3183R669K082l84815F0910b63634c7016
10153B80320J84357d66441I3551b72413e1413A22659J60923a3976q1541l98420
10143d93937C11105a48280B7539b49984b1034A42291c07342A35818a33858I0516
10132a78677A1727b44888M6515h615j6861E781M7841M4579a01710j40679p3053
$$ plain form
10212 300773 -79356 -363954 136512 -247926 -300771 -271815 -109606 -62983 -161348 -26580 151784
10200 -140182 -55839 -238472 47323 -112990 266802 11408 -60603 -151529 -363829 -58492 221455
10188 -199082 22940 -28745 -77465 -153731 -244654 201436 120680 -34880 222785 -321891 -238513
10177 -238513 -441294 -53333 -350268 -310697 -9916 -141185 227842 39353 -36804 -253539 216643
10165 3857 -136859 -25234 30383 -170991 -137808 -128139 -126057 -510872 60910 -263634 -37016
10153 280320 464677 -466441 93551 -272413 -51413 122659 283582 -13976 -95517 -493937
10143 -493937 311105 -148280 27539 -249984 -21034 142291 -307342 135818 -133858 90516
10132 -178677 11727 -244888 -198373 -8615 -25476 5781 53622 98201 -101710 -242389 -315442
10121c15442p6194O0479k7906L2468a2844j93543M3711c3809m7476L0771B00034
10109e108I6373e48j68188J2469J5058F3949a63786r8672P3553A66101h3798O485
10097g7313L7917A27613O906a81921j26914J00898B84893C6974b02211M7297k41851
10086c96765a50183F4303e4207B28499a64843G9112b9816q5788E0771a03000r6480
10075a99480H4488N6762j4687c56776h1294B18885H0690E725O3741O4988K24711
10064C59165A778a82723J1565G8818B1898M1522F919Q1381l3255c15672g6079
10052a36470j07536A06821e9760A64521M2543f4697A01483J67791d131A49285
10041b05619h0524A15783J30513a53351p2688a07030I5177c15451J04706P2137
$$ plain form
10121 -315442 -391636 -331157 -359063 -326595 -12844 -206387 -162676 -33809 -81285 -50514 200034
10109 -5108 96373 -548 -168736 -156267 -141209 63949 -163786 -262458 -188905 166101 -83798 -77313
10097 -77313 -39396 127613 134519 -181921 -308835 -207937 284893 36974 -202211 -154914 -396765
10086 -396765 -150183 64303 -54207 228499 -164843 79112 -29816 -115604 50771 -103000 -199480
10075 -199480 84488 141250 126563 -356776 -81294 218885 80690 5725 69466 134454 359165
10064 359165 1778 -182723 -171158 78818 21898 63420 6919 88300 55045 -315672 -76079
10052 -136470 -244006 106821 -59760 164521 207064 -64697 101483 269274 -4131 149285
10041 -205619 -80524 115783 246296 -153351 -226039 -107030 95177 -315451 -210745 -138608
10031a38608M9681G9499c88151J32641n4860A99141b01084d6230j99902A91626
10020B53008p4066h2930A91568c8069l5493l6856r5790Q9664I0171a42111O7366
10009g4745r9658A35512i4824E6690a63261n5662B5768N9858b64533A49914a64735
9997a06814J1183R489D37g2999D9930d31394a01826c368k34809A46650c76883
9985c18386f5292n3382A45310f5446j80137B85763b6757B38430a20904L4510C87648
9973c88909r482J64830g2174B09213h7290B21191D7734h6718e506n315B6657J730
9961B8387h232j28352G777Q051f8001A04195r484f320A97320E5282c8187D6447
9948g5336I4593b05396H702j175b64184B8407O95d07257A04318J84436c07170
$$ plain form
10031 -138608 -88927 79499 -388151 -255510 -310370 199141 -201084 -46230 -246132 191626
10020 253008 178942 -82930 191568 -38069 -73562 -110418 -206208 -116544 90171 -142111 -74745
10009 -74745 -174403 135512 -94824 56690 -163261 -218923 25768 85626 -264533 149914 -164735
9997 -106814 -95631 -86142 437 -72999 49930 -431394 -101826 -3368 -238177 146650 -376883
9985 -318386 -65292 -118674 145310 -65446 -245583 285763 -26757 238430 -120904 -86394 387648
9973 -388909 -398391 -233561 -72174 209213 -87290 221191 47734 -86718 -5506 -10821 26657 28387
9961 28387 -8232 -136584 7777 15828 -68001 104195 94711 -6320 197320 55282 -38187 46447
9948 -75336 94593 -205396 8702 7527 -264184 28407 29102 -407257 104318 288754 -307170
9936F1578B5180f0425A62886B396a72085g1594q559F261J53015a1518A91307D0008
9923A72752n4a63337q4503D5552J21679c67737e955k4658j53395B08713p4654
9912A34059g8395J9947o7224k97893a0291A9874b72537o4265A15200g5677P69
9901g4908r1185O5574r2722c2487A3664b19067j08179A17770h9215k7759j32307
9890b49281F1989c40026a16956k09956A0702C581J95169B9451h4444M1039j34705
9879a78110f4781a014j35877l38962a16590M9742j83635D7942j2439J69067k6086
9868A78484o8734a73393k15426h5335A3482J10500a33017D9158a75119a0870k09907
9857b20777j94348a13523r1324b1321B0202a08873q3902g7339G7773b08588G8432
$$ plain form
9936 61578 25180 -60425 162886 2396 -172085 -71594 -80153 6261 159276 -11518 191307 40008
9923 172752 172698 -163337 -247840 45552 167231 -367737 -5955 -30613 -184008 208713 134059
9912 134059 -78395 -58448 -125672 -423565 -10291 19874 -272537 -336802 115200 -75677 -74908
9901 -74908 -166093 -100519 -193241 -32487 13664 -219067 -327246 117770 -89215 -116974 -249281
9890 -249281 61989 -340026 -116956 -326912 10702 3581 198750 29451 -84444 -43405 -178110
9879 -178110 -64781 -1014 -136891 -475853 -116590 -66848 -250483 47942 35503 204570 178484
9868 178484 109750 -173393 -388819 -85335 13482 123982 -133017 49158 -175119 -10870 -220777
9857 -220777 -415125 -113523 -204847 -21321 20202 -108873 -192775 -77339 77773 -208588 78432
9845f9340B47768i5501C8200b32368A19729b5749E3912N0258a93200k05889b7812
9833e0638q0114D06844c61746G5072J31455E3862j0223K318N5110M4672b06115
9821e9849A64937g0984A07747i5618o5382l08672a18610D08341b24689A42621
9810d3663k41133a28462B5539b56512B98971d3195k48579c5165k78178Q2751j2844
9799b43436h8876k26000j25066d2357r1338d6538A01686a41071d2172f516j49976
9788a56492K7083M8249c6430k18919E7310Q5316a13373k77086i6283q8971A7901
9776A91937h6378f504j17949F3559H506J82281c94797j48997a34143B62112a14730
9764A59214g441A35151b0080k09668D1777J31643e0649J3701j88573c2245A80374
$$ plain form
9845 -69340 247768 -95501 38200 -232368 119729 -25749 53912 104170 -193200 -399089 -27812
9833 -50638 -130752 406844 -361746 75072 206527 53862 43639 45957 101067 145739 -206115
9821 -59849 164937 -70984 107747 -95618 -161000 -469672 -118610 408341 -224689 142621
9810 -43663 -284796 -128462 25539 -256512 298971 -43195 -291774 -35165 -313343 -230592 -243436
9799 -243436 -88876 -314876 -439942 -42357 -133695 -46538 101686 -141071 -42172 -6516 -156492
9788 -156492 -129409 -81160 -36430 -255349 57310 142626 -113373 -390459 -96283 -185254 17901
9776 191937 -86378 -6504 -124453 63559 8506 190787 -394797 -543794 -134143 262112 -114730
9764 159214 -7441 135151 -20080 -229748 41777 173420 -50649 -36948 -225521 -32245 180374
9752a39167B35461P5061a79090A1269h0951r3883g3455m7779a3634j89029c0869
9740A98230D0112c94399C04014F7325J4585a57143E96Q9105b01467d0718k20901
9729b61619M6568K8298A28060b34125h1664c1393j54375P1012I910a88049Q7520
9718a00529j73649b9155j79379a8444l28699C7028A3202a59664A99303b71870
9707G005O021L7617b3038m48584b710F8440b06713B6540i2866j86178C0203L36232
9695C66435A1344K26695a82838A68961H0305b18584B51573D0434d6339k28269
9685b74608b4664A76681J45238A03815f5849A20790a15220r1978R7033C4480J0191
9674D4671f4178j1803A48967a17145A01915g5331E3898i2331L0435C1708O4172
$$ plain form
9752 -139167 235461 310522 -179090 11269 -80951 -174834 -73455 -121234 -13634 -202663 -30869
9740 198230 40112 -394399 304014 67325 81910 -157143 596 89701 -201467 -40718 -261619
9729 -261619 -215051 -186753 128060 -234125 -81664 -31393 -185768 -114756 9910 -188049 -100529
9718 -100529 -274178 -29155 -208534 -18444 -347143 37028 13202 -159664 199303 -271870
9707 7005 13026 50643 -23038 -471622 -2710 68440 -206713 26540 -92866 -279044 30203 366435
9695 366435 11344 238039 -182838 168961 80305 -218584 251573 40434 -46339 -274608
9685 -274608 -24664 176681 321919 103815 -65849 120790 -115220 -207198 -110165 34480 44671
9674 44671 -64178 -75981 148967 -117145 101915 -75331 53898 -92331 -61896 31708 95880
9663I5880b93902A47224l8676B5795a07728j78407c5059j92855j54853G6268b9748
9651a04454F1904d753k66715o4312J54350A1030b70055j703B41179d14542G1179
9639b05850B01899b39728m1198M1251A4017P9667a31789m4036p896K7476g1268
9627a44690F3341N4047K1085B8621a86616g0696l7707c5347k46584J10016c278
9615G5145a55987j28895A08707d06424A57322b45670f5979k78196A6255b7638
9604a3460l22315g450k8681j63020M030R6572a7623E3385c06808j7076I8347c89862
9591a77090c6155j78405B1658c94514a78102k9300A81690a32604A37074a75379
9580c08589k9566a56834G9521a54884D5051M5961J01106b53573e9383C4377a87759
$$ plain form
9663 95880 -293902 147224 108548 25795 -107728 -286135 -35059 -227914 -382767 76268 -29748
9651 -104454 61904 -4753 -271468 -335780 -181430 11030 -270055 -271758 241179 -414542 71179
9639 -205850 201899 -239728 -280926 -239675 14017 93684 -131789 -175825 -183721 -156245 -71268
9627 -144690 63341 117388 138473 28621 -186616 -70696 -108403 -35347 -281931 -171915 -3278
9615 75145 -155987 -284882 108707 -406424 157322 -245670 -65979 -344175 16255 -27638
9604 -13460 -335775 -7450 -36131 -199151 -195121 -98549 -17623 53385 -306808 -323884 98347 -389862
9591 -177090 -36155 -214560 21658 -394514 -178102 -207402 181690 -132604 137074 -175379
9580 -308589 -338155 -156834 79521 -154884 45051 91012 192118 -253573 -59383 34377 -187759
9568G0691b35992e8601k12335a19169j40613N8101R1349J4871C9563b35058b6214
9556a12372j78565a26870l0499G0595a48220p9006l2059A50400J45798I3323i0561
9544a19741o4767F2456a83953A21306J67186f3757l7379A0320d12666h8877j22614
9533b11491B51080a88496f5096p4113J109H7430a96906A81425D0629M4901a52668
9521d6940G8050L11081A39226c99257J69242b3444A20227a67922P6935D9875J7680
9510F7555f6812b2835B4591a91900G708d62105A33655J58030J02541A36079c78196
9498E9211J35131b51362m9881B89788j35787f7114A57825B1656K58090d38417
9487g0655H7834j973M263g8955r000a5799B9026h7059L2171I4577A0543b47231
$$ plain form
9568 70691 -235992 -58601 -270936 -119169 -259782 -201681 -110332 -95461 39563 -235058 -26214
9556 -112372 -290937 -126870 -157369 70595 -148220 -227226 -259285 150400 296198 93323 -90561
9544 -119741 -184508 62456 -183953 121306 288492 -63757 -101136 10320 -412666 -88877 -211491
9533 -211491 251080 -188496 -65096 -139209 -138100 87430 -196906 181425 40629 85530 -152668
9521 -46940 78050 389131 139226 -399257 -230015 -23444 120227 -167922 -90987 49875 67555
9510 67555 -66812 -22835 24591 -191900 7708 -462105 133655 291685 394226 136079 -378196
9498 59211 194342 -251362 -301243 289788 154001 -67114 157825 21656 279746 -438417
9487 -70655 87834 85861 90124 -78955 -87955 -15799 29026 -87059 -54888 94577 10543 -247231
9474G600a6638j49692P0288k52464C9418f375r0283n6831k42586r4767B07157
9462a53436n0729B1724k413K50037b09905B0561a92497M9973A52658K5283Q1476
9451B59417a11827d4477k08443i1280j10563c129m212k26356C9331O4507c9752
9439b11804A80364n9103c57955b6960k10752Q1720I1716a49122A8122c8414j6184
9428e4598J0921j46187N6664H4381a32636C4783J8175L4560J5151B2378c7330
9416a84982d760A4343a47389A27540d33963P7184a70919e6296j6866A7395O0775
9405G8170a42369q2078K3237a450I661O1748J05006b13033C24068A084e24679
9393C1988L0083K63895A31280E903a23677o0401K1355j5935f1915B39611b70248
$$ plain form
9474 7600 -16638 -166330 -96042 -348506 39418 -6375 -96658 -153489 -396075 -490842 207157
9462 -153436 -204165 21724 19311 269348 -209905 20561 -192497 -142524 152658 177941 259417
9451 259417 -111827 -44477 -252920 -91280 -201843 -3129 -7341 -233697 39331 103838 -39752
9439 -211804 180364 121261 -357955 -26960 -237712 -155992 91716 -149122 18122 -38414 -54598
9428 -54598 -43677 -189864 -133200 84381 -132636 34783 52958 87518 102669 22378 -37330
9416 -184982 -4760 14343 -147389 127540 -433963 -356779 -170919 -56296 -73162 17395 78170
9405 78170 -142369 -224447 -201210 -1450 9661 71409 176415 -213033 324068 1084 -524679
9393 31988 62071 325966 131280 5903 -123677 -184078 -162723 -178658 -61915 239611 -270248
9381g3973j63681C07005c50232c9499k30445c0987A31280A5737f2292j89494h7164
9369a38089h282k1594C5480a56016I1210A7881b62219L3288k192a13247k35157
9358c48404C328j341K3957J87756F6283i6606F5123a21171q3993a7931B8825c4415
9345b08515A63813b23796m5185i6262j8575I5384J42902b28819d6255D8880L40134
9334C89014j41193b0040G8584e6130b3802j34779P3144H7791K29500H0739a55695
9322c5340q5436N4095c2480K797B17638C8941K57191G081e8228A95380g8889B3543
9309a71354j14631A95870b5519B08730C3299b40146j7511i1387E143J83783Q2529
9298B71455c93985J1836a7090B3812f4811C18318a73454j61060o4810a17006o5340
$$ plain form
9381 -73973 -237654 307005 -350232 -39499 -269944 -30987 131280 15737 -62292 -251786 -87164
9369 -138089 -8282 -29876 35480 -156016 91210 17881 -262219 -228931 -231123 -113247 -348404
9358 -348404 3328 1987 25944 213700 66283 -96606 65123 -121171 -205164 -17931 28825 -34415
9345 -208515 163813 -223796 -268981 -96262 -114837 95384 238286 -228819 -46255 48880 389014
9334 389014 247821 -20040 78584 -56130 -23802 -158581 -85437 87791 317291 80739 -155695
9322 -35340 -120776 -66681 -32480 -29683 217638 38941 296132 7081 -58228 195380 -78889 23543
9309 -171354 -285985 195870 -25519 208730 33299 -240146 -257657 -91387 5143 188926 271455
9298 271455 -393985 -382149 -17090 23812 -64811 318318 -173454 -334514 -399324 -117006 -182346
9287a82346p0801Q3756O1923j8839A70036b6751j65139e2016A18827a41941m0426
9276a82367A64446b01226A16476b27184e2023k18937N8475b8110I934L1949A1162
9264a78431f9131j41276J107C20432e691q8737j83246O9811k3470I6548h4979
9252b12377j61567c2382p299j71449f3979E3649c0468H5987c76613A11464C0081
9240a79021j8522i5078A80515h9572a7240E1914f0083j99462A51542i9483A16666
9228c62578a57677A32412a42377f5130A91413b43005c9502j24073N1894A22901
9217a17240q0061d5942r6950L4771A53926N80A9968a35410B09033c8291n0303
9206h8594j7145B35871e485A65322d66124g1572H631b00077a4402c653G7265Q5803
$$ plain form
9287 -182346 -253147 -169391 -107468 -126307 170036 -26751 -191890 -52016 118827 -141941 -182367
9276 -182367 164446 -201226 116476 -227184 -52023 -270960 -212485 -28110 9934 41883 11162
9264 -178431 -69131 -210407 -209300 320432 -5691 -94428 -277674 -207863 -231333 96548 -84979
9252 -212377 -373944 -32382 -39681 -211130 -63979 53649 -30468 85987 -376613 111464 30081
9240 -179021 -197543 -95078 180515 -89572 -17240 51914 -60083 -259545 151542 -99483 116666
9228 -362578 -157677 132412 -142377 -65130 191413 -243005 -39502 -163575 -111681 122901
9217 -117240 -197301 -45942 -142892 -108121 153926 154506 19968 -135410 209033 -38291 -88594
9206 -88594 -105739 235871 -5485 165322 -466124 -71572 8631 -200077 -14402 -3653 77265 163068
9194A63068b40178O2114A95801B1369a28799l30343a29208k22583e6496B19540
9183H5195c8126B8274A0879L6530R5234d9124G3049D104K44346d39463D41310
9171E0725J4572a82507k08977A23778o0670f7955D5446j9819a13637L4212A3016
9159b01511B35711I2824e715n0949k31964A86a847m44758a576k50437A15085g1528
9146A35568D0237J34902i7107A82477n6015d01069d7949j63948o7574D55510A31839
9134a96625N7152C02474b50322A1912d07867J14221k6067A83570a92867p1673
9124b64540a8293A77277p6894J48916c25661h1301l13159a94203N8555p9444d4547
9112a30621E0169A7304J56423b23731k4619L8996A94889c10274A05644m3581O3062
$$ plain form
9194 163068 -240178 -178064 195801 21369 -128799 -459142 -129208 -351791 -56496 219540
9183 85195 -38126 28274 10879 47409 142643 -49124 73049 4104 248450 -439463 441310
9171 50725 65297 -182507 -391484 123778 63108 -67955 45446 25627 -113637 -79425 13016
9159 -201511 235711 92824 -5715 -56664 -288628 186 -1847 -446605 -1576 -252013 115085 -71528
9146 135568 40237 175139 -97107 182477 126462 -401069 -47949 -211897 -279471 455510 131839
9134 -196625 -139473 302474 -250322 11912 -407867 -293646 -319713 183570 -192867 -264540
9124 -264540 -18293 177277 100383 249299 -325661 -81301 -394460 -194203 -135648 -215092 -44547
9112 -130621 50169 17304 173727 -223731 -248350 -209354 194889 -310274 105644 62063 125125
9101A25125f5956n2468A40473a75293A0648P0827h955m12264J69358b1951k33157
9090b55108B2515J89293I412a26589m6377M3984a232j44356c3852l45066A6728
9078d35758h6334A36455g815k6652A21697b61891a6874B85719b07509l31126b5189
9066c86481a11390F842Q8689g6348l9143A10544h9352c5684o3845K4630j94458
9055b69357d98j0739j8092F4813b45904h5223o3803f0211C9433M4363c08496k5897
9043c34393a58477A68053h3703b5549j53636N5329N6775k52578n7468a73352p5870
9032b49222R9259j32052N5668Q4666l26200a79430g6997j88760A86948e9008J8486
9021d0522A36890K4815c36242a52061N6387E8263f5354E98R1852b6026j3384k64557
$$ plain form
9101 125125 -65956 -118424 140473 -175293 10648 81475 -8955 -421219 -251861 -21951 -255108
9090 -255108 22515 211808 9412 -126589 -172966 -128982 -1232 -145588 -33852 -378918 16728
9078 -435758 -86334 136455 -7815 -34467 121697 -261891 -16874 285719 -207509 -538635 -25189
9066 -386481 -111390 6842 95531 -76348 -115491 110544 -89352 -35684 -99529 -74899 -269357
9055 -269357 -498 -11237 -29329 64813 -245904 -85223 -149026 -60211 39433 83796 -308496 -334393
9043 -334393 -158477 168053 -83703 -25549 -179185 -123856 -67081 -319659 -377127 -173352 -249222
9032 -249222 -149963 -282015 -226347 -141681 -467881 -179430 -76997 -265757 186948 -59008 -40522
9021 -40522 136890 161705 -336242 -152061 -95674 58263 -65354 598 92450 -26026 -39410 -303967
9009c03967j1789C75a68855h4196d0596p9222p5871i5275p4041R989C2700c3298
8996a80482j00560A14194c6739j69855n2181O1021A43493d3203A9919b4506L551
8985b0955r6640E2976J34426r124c98794I0254J30862F0771a29651C21356A01434
8973A441c06122J42035A55188e9599b5942H252e4973o8623j44046j03934J12858
8962b58718E5114a83272j43898B4954c53669E53d86519a75626A01023O1177e7846
8950c89254H8086d8111I527a61576A16124i5582j63364Q4148a7995E7874b13536
8938d9430B44170H2417J65735a58647P6302A2652b67915B603N2393a62145I7607
8926B9884g3894G8864A6188a6821l28014A87148H7411a73801n3341A04170J4141
$$ plain form
9009 -303967 -315756 375 -168855 -84196 -40596 -119818 -195689 -95275 -169316 -159327 32700 -33298
8996 -180482 -281042 114194 -36739 -206594 -258775 -197754 143493 -43203 19919 -24506 -20955
8985 -20955 -117595 52976 187402 178278 -398794 90254 221116 60771 -129651 321356 101434
8973 1441 -306122 -164087 155188 -59599 -25942 8252 -54973 -123596 -267642 -371576 -258718
8962 -258718 55114 -183272 -327170 24954 -353669 553 -486519 -175626 101023 162200 -57846
8950 -389254 88086 -48111 9527 -161576 116124 -95582 -258946 -174798 -17995 57874 -213536
8938 -49430 244170 82417 248152 -158647 -82345 12652 -267915 2603 54996 -162145 97607
8926 29884 -73894 78864 16188 -16821 -344835 187148 87411 -173801 -227142 104170 118311
8915A18311m2213K47885A8737J43779N2681L44488k74721Q6731K61347N85597
8905A218639R42111J817202K836189j894747k174960q36361I19643l15433k33954
8896C70256I7847e4981C21943A57267h9830I4358L39222I1667K7894J30535a74887
8884a31124m8978l5705A65793i8766k2961M418H4198A7183a03592F2665J00403
8873A63068i7547A38859a60394k45565i4562q20B10i470k56242M010I3340A0623
8860b2487B47801d6537k3672j99454D4835g9054C2436h4048n7933d8638a6957
$$ plain form
8915 118311 76098 323983 18737 162516 215197 559685 284964 371695 633042 1218639
8905 1218639 2160750 3977952 6814141 4919394 2744434 1908073 919643 604210 370256
8896 370256 97847 -54981 321943 157267 -89830 94358 433580 91667 119561 250096 -174887
8884 -131124 -180102 -215807 165793 -98766 -121727 -117309 84198 17183 -103592 62665 163068
8873 163068 -97547 138859 -160394 -405959 -94562 -95382 210 -9470 -265712 -261702 93340 10623
8860 -22487 247801 -46537 -70209 -269663 44835 -79054 32436 -84048 -141981 -48638 -16957
$$ [...]
##END NTUPLES=NMR SPECTRUM
##END=
