
##TITLE=AC1071_TOPL04_5835268_LkaQr7E7HN
##JCAMPDX= 6.0         $$ Bruker NMR JCAMP-DX V2.0
##DATA TYPE= NMR SPECTRUM
##DATA CLASS= NTUPLES
##ORIGIN= BRUKER
##OWNER= Administrator
$$ 1.72 TOPSPIN		Version 2.1
$$ 2012-03-26 21:55:00.265 -0500  Administrator@TOPSPIN
$$ Compression mode = diff/dup
##.OBSERVE FREQUENCY= 400.13188235
##.OBSERVE NUCLEUS= ^1H
##.ACQUISITION MODE= SIMULTANEOUS (DQD)
##.ACQUISITION SCHEME= undefined
##.AVERAGES= 64
##.DIGITISER RES= 22
##SPECTROMETER/DATA SYSTEM= spect
##.PULSE SEQUENCE= noesygpps1d.comp
##.SOLVENT NAME= COFFEE_meoh
##.SHIFT REFERENCE= INTERNAL, COFFEE_meoh, 1, 14.9685
##AUDIT TRAIL= $$ (NUMBER, WHEN, WHO, WHERE, PROCESS, VERSION, WHAT)
$$ ##TITLE= Audit trail, TOPSPIN		Version 2.1
$$ ##JCAMPDX= 5.01
$$ ##ORIGIN= Bruker BioSpin GmbH
$$ ##OWNER= Administrator
$$ $$ C:\Bruker\TOPSPIN/data/COFFEE/nmr/AC1071_TOPL04_5835268_LkaQr7E7HN/12/pdata/1/auditp.txt
$$ ##AUDIT TRAIL=  $$ (NUMBER, WHEN, WHO, WHERE, PROCESS, VERSION, WHAT)
(   1,<2012-03-26 21:54:55.562 -0500>,<Administrator>,<TOPSPIN>,<go>,<TOPSPIN 2.1>,
      <created by zg
	started at 2012-03-26 21:43:24.031 -0500,
	POWCHK enabled, PULCHK disabled,
       configuration hash MD5:
       1A 1E CE 29 27 FD 77 03 67 4E F0 E3 C4 B2 CB 90
       data hash MD5: 64K
       88 0F A9 A4 99 89 DC 93 65 BB BB 2D C8 CF 89 52>)
(   2,<2012-03-26 21:54:58.312 -0500>,<Administrator>,<TOPSPIN>,<proc1d>,<TOPSPIN 2.1>,
      <Start of raw data processing
       efp LB = 0.3 FT_mod = 6 PKNL = 1 PHC0 = 0 PHC1 = 0 SI = 128K 
       data hash MD5: 128K
       BD FA 0B 25 5D 59 62 20 B6 28 03 2F 60 87 0F 53>)
(   3,<2012-03-26 21:54:59.515 -0500>,<Administrator>,<TOPSPIN>,<proc1d>,<TOPSPIN 2.1>,
      <pk PHC0 = 31.51978 PHC1 = 0 
       data hash MD5: 128K
       2E 48 C1 B2 A7 36 B0 E7 AF A9 EE 4A 25 DA 30 F9>)
(   4,<2012-03-26 21:54:59.750 -0500>,<Administrator>,<TOPSPIN>,<proc1d>,<TOPSPIN 2.1>,
      <abs ABSG = 1 
       data hash MD5: 128K
       D3 81 A5 4F A1 25 F1 83 0E 84 84 71 CD 96 C6 38>)
(   5,<2012-03-26 21:54:59.828 -0500>,<Administrator>,<TOPSPIN>,<proc1d>,<TOPSPIN 2.1>,
      <abs ABSG = 2 
       data hash MD5: 128K
       E4 15 9A D6 E0 99 F5 99 91 78 C4 8D C9 1B 6F D8>)
(   6,<2012-03-26 21:54:59.984 -0500>,<Administrator>,<TOPSPIN>,<proc1d>,<TOPSPIN 2.1>,
      <abs ABSG = 3 
       data hash MD5: 128K
       F5 5F 85 92 55 F1 B6 EB 4B 7F 42 1B 5E F5 5A 9F>)
(   7,<2012-03-26 21:55:00.125 -0500>,<Administrator>,<TOPSPIN>,<proc1d>,<TOPSPIN 2.1>,
      <abs ABSG = 4 
       data hash MD5: 128K
       CE FC C5 CC 29 1F F2 8F 93 13 DF D6 F4 7E C9 C8>)
(   8,<2012-03-26 21:55:00.187 -0500>,<Administrator>,<TOPSPIN>,<proc1d>,<TOPSPIN 2.1>,
      <abs ABSG = 5 
       data hash MD5: 128K
       82 B1 49 C3 56 13 4F CB A4 65 73 FB F5 43 7E AB>)
$$ ##END=
$$ 
$$ $$ hash MD5
$$ $$ FD 60 00 FE AE 9B 88 BF 13 01 46 3A 0B BE 2F F8
##$RELAX= 
##$RELAX= 
##$RELAX= 
##$RELAX= 
##$RELAX= 
##$RELAX= 
##$RELAX= 
##$RELAX= 
$$ Bruker specific parameters
$$ [...]
##$TP07= 0
##$TPNAME0= <>
##$TPNAME1= <>
##$TPNAME2= <>
##$TPNAME3= <>
##$TPNAME4= <>
##$TPNAME5= <>
##$TPNAME6= <>
##$TPNAME7= <>
##$TPOAL= (0..7)
0.5 0.5 0.5 0.5 0.5 0.5 0.5 0.5
##$TPOFFS= (0..7)
0 0 0 0 0 0 0 0
##$TUNHIN= 0
##$TUNHOUT= 0
##$TUNXOUT= 0
##$USERA1= <user>
##$USERA2= <user>
##$USERA3= <user>
##$USERA4= <user>
##$USERA5= <user>
##$V9= 5
##$VALIST= <valist>
##$VCLIST= <CCCCCCCCCCCCCCC>
##$VD= 0
##$VDLIST= <DDDDDDDDDDDDDDD>
##$VPLIST= <PPPPPPPPPPPPPPP>
##$VTLIST= <TTTTTTTTTTTTTTT>
##$WBST= 1024
##$WBSW= 4
##$XGAIN= (0..3)
0 0 0 0
##$XL= 0
##$YL= 0
##$YMAX_a= 14774657
##$YMIN_a= -6488457
##$ZGOPTNS= <>
##$ZL1= 120
##$ZL2= 120
##$ZL3= 120
##$ZL4= 120
##$ABSF1= 14.9685
##$ABSF2= -5.58403
##$ABSG= 5
##$ABSL= 3
##$ALPHA= 0
##$AQORDER= 0
##$ASSFAC= 0
##$ASSFACI= 0
##$ASSFACX= 0
##$ASSWID= 0
##$AUNMP= <proc_prof1d_extract.lims>
##$AXLEFT= 0
##$AXNAME= <>
##$AXNUC= <1H>
##$AXRIGHT= 0
##$AXTYPE= 0
##$AXUNIT= <>
##$AZFE= 0.1
##$AZFW= 0.1
##$BCFW= 0
##$BC_mod= 0
##$BYTORDP= 0
##$COROFFS= 0
##$CY= 15
##$DATMOD= 1
##$DC= 0
##$DFILT= <>
##$DTYPP= 0
##$F1P= 0
##$F2P= 0
##$FCOR= 0.5
##$FTSIZE= 131072
##$FT_mod= 6
##$GAMMA= 0
##$GB= 0
##$INTBC= 1
##$INTSCL= 1
##$ISEN= 128
##$LB= 0.3
##$LEV0= 0
##$LPBIN= 0
##$MAXI= 10000
##$MC2= 0
##$MEAN= 0
##$ME_mod= 0
##$MI= 0
##$NCOEF= 0
##$NC_proc= -3
##$NLEV= 6
##$NOISF1= 0
##$NOISF2= 0
##$NSP= 0
##$NTH_PI= 0
##$NZP= 0
##$OFFSET= 14.9685
##$PC= 1
##$PHC0= 31.51978
##$PHC1= 0
##$PH_mod= 1
##$PKNL= yes
##$PPARMOD= 0
##$PPDIAG= 0
##$PPIPTYP= 0
##$PPMPNUM= 2147483647
##$PPRESOL= 1
##$PSCAL= 4
##$PSIGN= 0
##$PYNMP= <proc.py>
##$REVERSE= no
##$SF= 400.130004847409
##$SI= 131072
##$SIGF1= 0
##$SIGF2= 0
##$SINO= 400
##$SIOLD= 131072
##$SPECTYP= <>
##$SREGLST= <1H.CDCl3>
##$SSB= 0
##$STSI= 131072
##$STSR= 0
##$SW_p= 8223.68421052632
##$SYMM= 0
##$S_DEV= 0
##$TDeff= 65536
##$TDoff= 0
##$TI= <>
##$TILT= no
##$TM1= 0
##$TM2= 0
##$TOPLEV= 0
##$USERP1= <user>
##$USERP2= <user>
##$USERP3= <user>
##$USERP4= <user>
##$USERP5= <user>
##$WDW= 1
##$XDIM= 131072
##$YMAX_p= 478727685
##$YMIN_p= -370371311
##$CURPLOT= <Network HP LaserJet P1505>
##$CURPRIN= <$Network HP LaserJet P1505>
##$DFORMAT= <normdp>
##$LAYOUT= <+/1D_H.xwp>
##$LFORMAT= <normlp>
##$PFORMAT= <normpl>
##$SURQMSG= 1
$$ End of Bruker specific parameters
$$ ---------------------------------
##NTUPLES= NMR SPECTRUM
##VAR_NAME=  FREQUENCY,     SPECTRUM/REAL,   SPECTRUM/IMAG
##SYMBOL=    X,             R,               I
##VAR_TYPE=  INDEPENDENT,   DEPENDENT,       DEPENDENT
##VAR_FORM=  AFFN,          ASDF,            ASDF
##VAR_DIM=   131072,        131072,          131072
##UNITS=     HZ,            ARBITRARY UNITS, ARBITRARY UNITS
##FACTOR=    0.0627417313425165, 1,          1
##FIRST=     8223.62146879498, -1102,        -114284
##LAST=      0,             3992,            -114752
##MIN=       0,             -370371311,      0
##MAX=       8223.62146879498, 478727685,    0
$$ Real data points
##PAGE= N=1
##DATA TABLE= (X++(R..R)), XYDATA
$$ [...]
62925C578560M0039L7646L2836K5008J5195M851n365j5626k6238l7288m8643n9862
62913C541113p0225p9121q6378r1972r5632r7106r6748r5513r4292r3271r1862
62902B548993q9227q5154q0522p6401p2672o8103o2222n6316n1863m8594m5025
62891A812894m0580l6121l2467k9465k6753k4436k2585k0767j8621j6488j5045
62880A529566j4477j4330j4159j4149j4887j6293j7010j5674j3006j1575j2656
62869A371350j4379j4268j2764j2371j3647j4275j2594j0134r455j0813j2265
62858A234385j2204j0680q753p616p939r237j0135r843q973q487q393q148p718
62845A116259p400p093o471n673n083m752m490m243l820k762j091K64M92j08o76
$$ plain form
62925 3578560 3618599 3656245 3689081 3714089 3729284 3734135 3728770 3713144 3686906 3649618 3600975 3541113
62913 3541113 3470888 3391767 3305389 3213417 3117785 3020679 2923931 2828418 2734126 2640855 2548993
62902 2548993 2459766 2374612 2294090 2217689 2145017 2076914 2014692 1958376 1906513 1857919 1812894
62891 1812894 1772314 1736193 1703726 1674261 1647508 1623072 1600487 1579720 1561099 1544611 1529566
62880 1529566 1515089 1500759 1486600 1472451 1457564 1441271 1424261 1408587 1395581 1384006 1371350
62869 1371350 1356971 1342703 1329939 1317568 1303921 1289646 1277052 1266918 1257463 1246650 1234385
62858 1234385 1222181 1211501 1202748 1195132 1187193 1177956 1167821 1157978 1149005 1140518 1132125 1123977 1116259
62845 1116259 1108859 1101766 1095295 1089622 1084539 1079787 1075297 1071054 1067234 1064472 1063381 1063645 1064137 1064029 1063353
62830A063353q91r32r82j500l207n827p504o755m555l178l327l799l726l504l387
62815A010279k945k412k899m330m669k427J011K874K211M48p26q67m15m4m37j741
62799I92911l067l231k067n18M96N94m11k324l878l450j120Q85N97j381k738k175
62783I69123m51R18J073J63q35o73R40K659K960K122J724K144K081Q63l26l88
62767I84097N5J40M33J487J874r9l343m914l968k600k473k847k558j863j257k72
62751I61892J200J961J354O84J400K957M131N286P531J0371J2270J3135J4302
62738A038474J6127J7514J8084J8996K1063K3520K5414K7092K9510L2825L6369
62727A304988L9482M1969M4227M7123N1240N6163O1072O6011P1747P8305Q4657
$$ plain form
62830 1063353 1062462 1061530 1060548 1059048 1055841 1050014 1042510 1035755 1031200 1028022 1024695 1020896 1017170 1013666 1010279
62815 1010279 1007334 1004922 1002023 997693 993024 990597 991608 994482 996693 997141 996415 995548 995133 995089 994652 992911
62799 992911 989844 986613 984546 984028 984524 985118 984707 982383 978505 975055 973935 974820 975417 974036 971298 969123
62783 969123 968672 969590 970663 970826 969991 969318 970258 972917 975877 977999 979723 981867 983948 984811 984485 984097
62767 984097 984152 984292 984725 986212 988086 987987 984644 979730 975762 973162 970689 967842 965284 963421 962164 961892
62751 961892 963092 965053 966407 967091 968491 971448 975579 980865 988396 998767 1011037 1024172 1038474
62738 1038474 1054601 1072115 1090199 1109195 1130258 1153778 1179192 1206284 1235794 1268619 1304988
62727 1304988 1344470 1386439 1430666 1477789 1529029 1585192 1646264 1712275 1784022 1862327 1946984
62716A946984R0127R5268J00891J06865J12209J15766J16605J14623J10977J07079
62706C017394J02661R5705Q4888P1290N6986M2610K7197J0063q067k5711m1749
62695C433267n5773o7867p8182q6667r3276r8423j02788j06464j08609j08309
62685B526909j05639j01654r7552r3934r0598q6823q2137p6905p1947o7532o3194
62674A588994n8678n4470n0991m7721m3661l8537l3187k8786k5915k4224k2816
62663A160008k0956j8567j6012j3577j1287r160p232n392l425j187J635N625J0903
62650A071376J6294J9959K1179K1119K1739K4314K8895L4534L9868M4208M8222
62639A391707N3049N8680O3950O8305P2711P8305Q4855R0953R5234R7097R6893
$$ plain form
62716 1946984 2037111 2132379 2233270 2340135 2452344 2568110 2684715 2799338 2910315 3017394
62706 3017394 3120055 3215760 3300648 3371938 3428924 3471534 3498731 3508794 3500727 3475016 3433267
62695 3433267 3377494 3309627 3231445 3144778 3051502 2953079 2850291 2743827 2635218 2526909
62685 2526909 2421270 2319616 2222064 2128130 2037532 1950709 1868572 1791667 1719720 1652188 1588994
62674 1588994 1530316 1475846 1424855 1377134 1333473 1294936 1261749 1232963 1207048 1182824 1160008
62663 1160008 1139052 1120485 1104473 1090896 1079609 1070449 1063217 1057825 1054400 1053213 1054848 1060473 1071376
62650 1071376 1087670 1107629 1128808 1149927 1171666 1195980 1224875 1259409 1299277 1343485 1391707
62639 1391707 1444756 1503436 1567386 1635691 1708402 1786707 1871562 1962515 2057749 2154846 2251739
62628B251739R5769R4664R3082Q9465Q3064P4503O4230N1632L6472K0028L714
62617B958362j2446k8723m3918n6310o5875p4034q1331q6919r0384r2588r4293
62606B231541r5166r4578r2487q9219q5216q1234p7795p4275o9676o4559o0884
62595A346452n9210n7403n3233m7335m2302l9407l7549l5197l2162k9270k7229
62584H86155k6126k5340k3838k1215j8495j7182j7196j6592j3932j0342q373r046
62572F78478j0833j1651j1106j0314j0093r974q948o566l322l46J206R85K8O0
62558E97604J794M144N506N525N128N002M856M374M171N161P262R279J0251J0472
62544F80529J1030J2579J4856J7294J9716K2232K4793K7302L0002L3296L7115
$$ plain form
62628 2251739 2347508 2442172 2535254 2624719 2707783 2782286 2846516 2898148 2934620 2954648 2958362
62617 2958362 2945916 2917193 2873275 2816965 2751090 2677056 2595725 2508806 2418422 2325834 2231541
62606 2231541 2136375 2041797 1949310 1860091 1774875 1693641 1615846 1541571 1471895 1407336 1346452
62595 1346452 1287242 1229839 1176606 1129271 1086969 1047562 1010013 974816 942654 913384 886155
62584 886155 860029 834689 810851 789636 771141 753959 736763 720171 706239 695897 687524 678478
62572 678478 667645 655994 644888 634574 624481 614507 605559 598993 595671 595325 596531 597516 597544 597604
62558 597604 599398 603542 609048 614573 619701 624703 629559 633933 638104 643265 650527 659806 670057 680529
62544 680529 691559 704138 718994 736288 756004 778236 803029 830331 860333 893629 930744
62533I30744M0843M4063M6959M9840N2723N5632N8732O1678O3225O2184N8644
62522A525267N3728M8315M2478L5994K8743K0695J2077L567m325j1975k0005k7928
62510A706631l4339l8709m2031m5215m7713m8513m7802m6670m5525m3827m1384
62499A224903l8967l7255l5840l3769l0877k8166k6746k6689k7044k6894k6083
62488H86573k4702k2466j9273j6212j4942j5641j6459j5631j3468j1405r803p901
62476F98670n635m035l523l121j889j71J374L025N263P366Q058P559P786J0092
62462G30819J3572J6191J7197J7725J9127K1336K3296K4725K6837L0923L6467
62451I78215M1363M4216M5853M8133N1568N4752N6047N5222N3290N1220M8990
$$ plain form
62533 930744 971587 1015650 1062609 1112449 1165172 1220804 1279536 1341214 1404439 1466623 1525267
62522 1525267 1578995 1627310 1669788 1705782 1734525 1755220 1767297 1770864 1766539 1754564 1734559 1706631
62510 1706631 1672292 1633583 1591552 1546337 1498624 1450111 1402309 1355639 1310114 1266287 1224903
62499 1224903 1185936 1148681 1112841 1079072 1048195 1020029 993283 966594 939550 912656 886573
62488 886573 861871 839405 820132 803920 788978 773337 756878 741247 727779 716374 706571 698670
62476 698670 693035 689000 685477 682356 680467 680296 681670 684695 689958 697324 705382 712941 720727 730819
62462 730819 744391 760582 777779 795504 814631 835967 859263 883988 910825 941748 978215
62451 978215 1019578 1063794 1109647 1157780 1209348 1264100 1320147 1375369 1428659 1479879 1528869
62440A528869M5600L9927L1878K2779J4248O659q25q649j6006k1922k6528l0587
62428A585443l4340l7462l9841m1530m2229m1697m0600m0033l9995l9257l6983
62417A151476l3678l0242k6937k3871k1584k0358j9420j7762j5380j3001j0927
62406I18316q969p227n970m845l161j017P35J825K969M733O766Q499R767J0466
62392I32887J0392R998J0429J2168J4181J5113J4658J3175J0720P520M648K914
62380A058803J352j711o032r405j0617j1036j2437j4538j5873j6319j7227j9191
62368I25769k1060k1499k0507j8878j6923j4498j1948j0188r680r812r507q208
62356G53061o097l690j466K41J513K908M915P228Q996R865J0358J1018J1766J2417
$$ plain form
62440 1528869 1574469 1614396 1646274 1669053 1683301 1689960 1689135 1680486 1664480 1642558 1616030 1585443
62428 1585443 1551103 1513641 1473800 1432270 1390041 1348344 1307744 1267711 1227716 1188459 1151476
62417 1151476 1117798 1087556 1060619 1036748 1015164 994806 975386 957624 942244 929243 918316
62406 918316 909347 902120 896150 891305 888144 887127 887862 889687 892656 897389 904155 912654 922421 932887
62392 932887 943279 953277 963706 975874 990055 1005168 1019826 1033001 1043721 1051241 1055889 1058803
62380 1058803 1060155 1058444 1052412 1043007 1032390 1021354 1008917 994379 978506 962187 944960 925769
62368 925769 904709 883210 862703 843825 826902 812404 800456 790268 780588 770776 761269 753061
62356 753061 746964 743274 741808 742049 743562 746470 751385 758613 767609 777474 787832 798850 810616 823033
62342H23033J3203J4225J4815J4225J2692J1143J0045R214Q436P407N326J764
62330I45528k150m475m633l742k760j601m23k06j229k212j981q29P62L482P857
62315I31388J2586J5847J7671J9499K1988K4803K8178L2894L8801M4828N0421
62304A238904N5585N9781O2511O4881O8671P3626P7409P8578P7875P6157P2949
62293B006927O7739O0889N2473M1955L0033J9040J0289K602n424j3291k0156k6762
62281B226314l4079m1339m7261n2054n6278n8936n8831n6996n5452n4177n1688
62270A659223m8196m5743m5037m4545m3117m1421m0115l8501l5837l2492k9030
62259A215189k5412k1796j8917j7063j5559j3720j1456q867o346n012n644p100
$$ plain form
62342 823033 836236 850461 865276 879501 892193 903336 913381 922595 931031 938438 943764 945528
62330 945528 943378 938903 934270 930528 927768 926167 925744 925538 924309 922097 920116 919287 920049 923531 931388
62315 931388 943974 959821 977492 996991 1018979 1043782 1071960 1104854 1143655 1188483 1238904
62304 1238904 1294489 1354270 1416781 1481662 1550333 1623959 1701368 1779946 1857821 1933978 2006927
62293 2006927 2074666 2135555 2188028 2229983 2260016 2279056 2289345 2291947 2286523 2273232 2253076 2226314
62281 2226314 2192235 2150896 2103635 2051581 1995303 1936367 1877536 1820540 1765088 1710911 1659223
62270 1659223 1611027 1565284 1520247 1475702 1432585 1391164 1351049 1312548 1276711 1244219 1215189
62259 1215189 1189777 1167981 1149064 1132001 1116442 1102722 1091266 1082399 1076053 1071041 1065397 1058297
62247A058297p418o587o476p687q544p921o962o845o803n932n165n682o629o388
62233I63258n097m042l264j731N41K418L528M609N910O827P274Q113R817J1717
62219A009878J2937J3381J3590J4270J5946J8498K1020K2692K3657K4629K6023
62208A216521K8120L1422L5782L9695M1777M2935M5679N1055N7303O1993O4503
62197A716785O5961O7524O9284P0314O9347O5763O0163N3574M6093L6870K5714
62186B347392J3885K866p083j6580k5732l3900m0749m6788n2561n7671o1121o2452
62174A959506o2057o0378n7444n3560m9763m6780m3894l9877l4916l0503k7369
62163A452965k4757k2150k0254j9325j7868j4415r916o846o174o519o234n040
$$ plain form
62247 1058297 1050879 1044292 1037816 1030129 1021585 1013664 1006702 999857 993054 987122 981957 976275 969646 963258
62233 963258 958161 954119 950855 949124 949665 952083 955611 960220 966130 972957 980231 988344 998161 1009878
62219 1009878 1022815 1036196 1049786 1064056 1080002 1098500 1119520 1142212 1165869 1190498 1216521
62208 1216521 1244641 1276063 1311845 1351540 1393317 1436252 1481931 1532986 1590289 1652282 1716785
62197 1716785 1782746 1850270 1919554 1989868 2059215 2124978 2185141 2238715 2284808 2321678 2347392
62186 2347392 2361277 2364143 2357060 2340480 2314748 2280848 2240099 2193311 2140750 2083079 2021958 1959506
62174 1959506 1897449 1837071 1779627 1726067 1676304 1629524 1585630 1545753 1510837 1480334 1452965
62163 1452965 1428208 1406058 1385804 1366479 1348611 1334196 1324280 1317434 1311260 1304741 1298507 1293467
62151A293467l489j876k71J035J534R79q3k53J692N326Q785J0988J2795J5281
62137A345910J7834J9301K0270K2466K6083K9355L0950L1393L1863L2889L4539
62126A642853L6582L8033L7650L5434L2631K9971K7057K3901K1633K0889K0647
62115A967281J9775J8883J9502K2062K5669K9530L3524L7567M1273M4254M6236
62104B305556M6850M5860M3530M0472L7109L3359K8803K3158J6853J1031O470
62093B639051K592j921p478j3204j8178k2201k5159k6655k6770k6371k5999k5143
62081B422564k3211k0666j8522j7194j6377j5625j4477j2574j0213q368p515o838
62069B250984n166k387O06K900M159M796O079R385J4496J9262K1844K2842K4241
$$ plain form
62151 1293467 1289978 1288102 1287831 1288866 1290400 1291379 1291296 1291043 1292735 1298061 1306846 1317834 1330629 1345910
62137 1345910 1363744 1383045 1403315 1425781 1451864 1481219 1512169 1543562 1575425 1608314 1642853
62126 1642853 1679435 1717468 1755118 1790552 1823183 1853154 1880211 1904112 1925745 1946634 1967281
62115 1967281 1987056 2005939 2025441 2047503 2073172 2102702 2136226 2173793 2215066 2259320 2305556
62104 2305556 2352406 2398266 2441796 2482268 2519377 2552736 2581539 2604697 2621550 2632581 2639051
62093 2639051 2641643 2639722 2632244 2619040 2600862 2578661 2553502 2526847 2500077 2473706 2447707 2422564
62081 2422564 2399353 2378687 2360165 2342971 2326594 2310969 2296492 2283918 2273705 2265337 2257822 2250984
62069 2250984 2245818 2243431 2244037 2246937 2251096 2255892 2261971 2271356 2285852 2305114 2326958 2349800 2374041
62056B374041K6756K9394L1415L3322L5704L8284M0545M2379M3649M3944M3456
62045B782889M3528M5510M9255N3214N6051N7892O0069O3715O8538P2944P5582
62034C429187P6784P8167Q0733Q3589Q4784Q3305Q0230P8016P8550Q1591Q4960
62023D319896Q6460Q5755Q4237Q3214Q2590Q1459P9518P7378P5691P4505P3595
62012E204298P2980P2726P2596P2345P2342P3354P5526P7929P9375P9402P8245
62001F031118P6201P3446P0239O6797O3115N9227N5511N2319M9454M6530M3592
61990F687549M0797L7765L4045L0232K7592K6290K5007K2853K0823K0524K1918
61979F995395K3220K2847K0858J8450J6673J5627J4607J2905J0618Q526P062N633
$$ plain form
62056 2374041 2400797 2430191 2461606 2494928 2530632 2568916 2609461 2651840 2695489 2739433 2782889
62045 2782889 2826417 2871927 2921182 2974396 3030447 3088339 3148408 3212123 3280661 3353605 3429187
62034 3429187 3505971 3584138 3664871 3748460 3833244 3916549 3996779 4074795 4153345 4234936 4319896
62023 4319896 4406356 4492111 4576348 4659562 4742152 4823611 4903129 4980507 5056198 5130703 5204298
62012 5204298 5277278 5350004 5422600 5494945 5567287 5640641 5716167 5794096 5873471 5952873 6031118
62001 6031118 6107319 6180765 6251004 6317801 6380916 6440143 6495654 6547973 6597427 6643957 6687549
61990 6687549 6728346 6766111 6800156 6830388 6857980 6884270 6909277 6932130 6952953 6973477 6995395
61979 6995395 7018615 7041462 7062320 7080770 7097443 7113070 7127677 7140582 7151200 7159726 7166788 7172421
61967G172421L237m32m755q855j2166j4557j6201j7370j8197j8680j8925j9049
61955G026471j8761j7333j4341j0355o568l733j530R37M011P012R073J0459J2482
61942F997824J5941K0180K4012K6894K8510K8055K5178K1102J7402J3802Q679
61931G227579J714n519j1795j7362k2441k6418k9301l2213l5336l7122l6999l7221
61919F937566m0137m4828m8420m9968n0946n2526n4423n6209n7838n8832n8704
61908F364735n8208n8529n9247n8851n7248n5880n5171n3897n1566m9325m7698
61897E759115m5370m1439l7139l3982l1525k8450k4603k0538j6161j1466p642
61886E460800n496l349J495R135J6667K1545K3880K5181K6518K8583L2121L7010
$$ plain form
61967 7172421 7175658 7175226 7170471 7161616 7149450 7134893 7118692 7101322 7083125 7064445 7045520 7026471
61955 7026471 7007710 6990377 6976036 6965681 6959113 6955380 6953850 6954787 6958798 6965810 6974883 6985342 6997824
61942 6997824 7013765 7033945 7057957 7084851 7113361 7141416 7166594 7187696 7205098 7218900 7227579
61931 7227579 7229293 7223774 7211979 7194617 7172176 7145758 7116457 7084244 7048908 7011786 6974787 6937566
61919 6937566 6897429 6852601 6804181 6754213 6703267 6650741 6596318 6540109 6482271 6423439 6364735
61908 6364735 6306527 6247998 6188751 6129900 6072652 6016772 5961601 5907704 5856138 5806813 5759115
61897 5759115 5713745 5672306 5635167 5601185 5569660 5541210 5516607 5496069 5479908 5468442 5460800
61886 5460800 5455304 5451955 5453450 5462585 5479252 5500797 5524677 5549858 5576376 5604959 5637080 5674090
61874E674090M1609M4162M4736M4995M6270M8432N0635N2488N4285N6521N9536
61863F217759O3625O9208P6751Q6516R8444J12330J28023J45546J65132J87233
61853G350567K12246K40123K70375L02666L37290L74808M15320M58381N03759
61844A0465535N51829O02860O55936P08963P59647Q05921Q45010Q72290Q81573
61835A7149564Q66388Q20697P39219O19032M62405K78140P9463j19576l06233
61826B0589099m69754o02665p02477p71528q14466q35804q39404q29015q08346
61817A3915640p80699p48745p14309o78253o40918o02914n65029n27354m89227
61808H168192m50475m12158l75603l41298l09213k79506k52032k25684j99403
$$ plain form
61874 5674090 5715699 5759861 5804597 5849592 5895862 5944294 5994929 6047417 6101702 6158223 6217759
61863 6217759 6281384 6350592 6427343 6513859 6612303 6724633 6852656 6998202 7163334 7350567
61853 7350567 7562813 7802936 8073311 8375977 8713267 9088075 9503395 9961776 10465535
61844 10465535 11017364 11620224 12276160 12985123 13744770 14550691 15395701 16267991 17149564
61835 17149564 18015952 18836649 19575868 20194900 20657305 20935445 21014908 20895332 20589099
61826 20589099 20119345 19516680 18814203 18042675 17228209 16392405 15553001 14723986 13915640
61817 13915640 13134941 12386196 11671887 10993634 10352716 9749802 9184773 8657419 8168192
61808 8168192 7717717 7305559 6929956 6588658 6279445 5999939 5747907 5522223 5322820
61799E322820j73739j50353j29826j11052r3085p6560o2575n1012m0904l1926
61789D401788k4529j8790j4220j0753q920q832r844j1606j4598j8906k3147k5439
61777D212204k5163k3035j9833j5890j1624p575l776K4L393N249N228M205L077
61764D126484J607r63m733r102j3487j7605k1273k4348k6548k7179k5532k1874
61752C935447j7497j3292q745k819M742J3495K3131L3404M3647N3214O2330P1921
61740D198978Q2681R4714J07787J21407J34944J48142J61426J75374J90366K06911
61730E622730K25554K45979K67188K89409L14852L45375L80176M17262M56692
61721H565217N00853N51727O09388O73124P42650Q17971Q99210R86682J079984
$$ plain form
61799 5322820 5149081 4998728 4868902 4757850 4664765 4588205 4525630 4474618 4433714 4401788
61789 4401788 4377259 4358469 4344249 4333496 4324576 4315744 4305900 4294294 4279696 4260790 4237643 4212204
61777 4212204 4187041 4164006 4144173 4128283 4116659 4109084 4105308 4105332 4108725 4113974 4119202 4123407 4126484
61764 4126484 4128091 4127128 4122395 4113293 4099806 4082201 4060928 4036580 4010032 3982853 3957321 3935447
61752 3935447 3917950 3904658 3895913 3893094 3897836 3911331 3934462 3967866 4011513 4064727 4127057 4198978
61740 4198978 4281659 4376373 4484160 4605567 4740511 4888653 5050079 5225453 5415819 5622730
61730 5622730 5848284 6094263 6361451 6650860 6965712 7311087 7691263 8108525 8565217
61721 8565217 9066070 9617797 10227185 10900309 11642959 12460930 13360140 14346822 15426806
61712A5426806J177130J275536J373397J468401J555142J625416J670795J682829
61704B7255452J650688J561596J405918J181726Q95327N60530J98685j63684n01357
61695C4044881p96105j037363j220594j347299j424793j462816j469787j452648
61687B3833476j418320j372716j319025j258996j195379j131068j066502j000391
61679A4071079r33022q66624q02396p39577o78002o19422n65342n15298m68433
61670G882963m25243l86626l52223l20809k91547k64166k38833k16592j98866
61661E188058j85545j74295j62769j50826j39816j30368j22021j14408j07553
61652C900457j01115r4544q8132q3044p9803p7261p3539o8000o2030n7744n5912
$$ plain form
61712 15426806 16603936 17879472 19252869 20721270 22276412 23901828 25572623 27255452
61704 27255452 28906140 30467736 31873654 33055380 33950707 34511237 34709922 34546238 34044881
61695 34044881 33248776 32211413 30990819 29643520 28218727 26755911 25286124 23833476
61687 23833476 22415156 21042440 19723415 18464419 17269040 16137972 15071470 14071079
61679 14071079 13138057 12271433 11469037 10729460 10051458 9432036 8866694 8351396 7882963
61670 7882963 7457720 7071094 6718871 6398062 6106515 5842349 5603516 5386924 5188058
61661 5188058 5002513 4828218 4665449 4514623 4374807 4244439 4122418 4008010 3900457
61652 3900457 3799342 3704798 3616666 3533622 3453819 3376558 3303019 3235019 3172989 3115245 3059333
61641C059333n5342n4496n3168n2014n0911m8996m6496m5139m5911m7328m6902
61630B512630m3989m0243l7602l6561l6185l5097l2588k9364k7055k6416k6317
61619B141213k5180k2982k0903j9283j7241j4411j1761j0208r464q993r019r705
61607A962063j0092r167p556o877p416p704o651n013m120m082m090l881l897m213
61593A877304m209l479k429j678j257p00K21J038Q99n57k539l598l028j620o18
61578A853750j53O92K396M333N740O705P772R113J0533J1874J2970J3445J3131
61565A952301J2484J2042J1562J0215P722M745K002n39l290o162q581j0284j1667
61552A972550j3102j4339j4894j4953j5256j6084j6840j6933j6663j6810j7528
$$ plain form
61641 3059333 3003991 2949495 2896327 2844313 2793402 2744406 2697910 2652771 2606860 2559532 2512630
61630 2512630 2468641 2428398 2390796 2354235 2318050 2282953 2250365 2221001 2193946 2167530 2141213
61619 2141213 2116033 2093051 2072148 2052865 2035624 2021213 2009452 1999244 1989780 1980787 1971768 1962063
61607 1962063 1951971 1942804 1935248 1928371 1920955 1913251 1906600 1901587 1897467 1893385 1889295 1885414 1881517 1877304
61593 1877304 1873095 1869616 1867187 1865509 1864252 1863552 1863773 1864811 1865710 1865153 1862614 1859016 1855988 1854368 1853750
61578 1853750 1853597 1854289 1856685 1861018 1866758 1873463 1881235 1890348 1900881 1912755 1925725 1939170 1952301
61565 1952301 1964785 1976827 1988389 1998604 2006326 2011071 2013073 2012534 2009244 2003082 1994501 1984217 1972550
61552 1972550 1959448 1945109 1930215 1915262 1900006 1883922 1867082 1850149 1833486 1816676 1799148
61541A799148j8134j7858j6490j4565j3190j3322j4596j5133j3338r784o624n169
61529A640945m766l948j829J633N689Q867J0036R829J0136J1851J4108J6144J8653
61516A737348K2438K6813L0558L3606L6607L9411M1286M2357M3718M6060M8965
61505B149167N1398N2378N1623N0187M9757N0556N0665M8493M5058M2451M0877
61494B682610L9025L6905L5982L6300L5588L2054K6543K1087J6582J2747R091
61483B984514N078K99m670q487j0894j3287j6712k0155k1849k1404j9702j7452
61471B835279j4905j2397j0023p113l024J859O712J1534J6936K3074K9658L6644
61459B914234M4080N1560N8935O7288P8075R1112J04457J16657J28431J41759
$$ plain form
61541 1799148 1781014 1763156 1746666 1732101 1718911 1705589 1690993 1675860 1662522 1652738 1646114 1640945
61529 1640945 1636179 1632231 1630402 1632035 1637724 1646591 1656627 1666456 1676592 1688443 1702551 1718695 1737348
61516 1737348 1759786 1786599 1817157 1850763 1887370 1926781 1968067 2010424 2054142 2100202 2149167
61505 2149167 2200565 2252943 2304566 2354753 2404510 2455066 2505731 2554224 2599282 2641733 2682610
61494 2682610 2721635 2758540 2794522 2830822 2866410 2898464 2925007 2946094 2962676 2975423 2984514
61483 2984514 2989592 2989891 2985221 2976734 2965840 2952553 2935841 2915686 2893837 2872433 2852731 2835279
61471 2835279 2820374 2807977 2797954 2790841 2787817 2789676 2796388 2807922 2824858 2847932 2877590 2914234
61459 2914234 2958314 3009874 3068809 3136097 3214172 3305284 3409741 3526398 3654829 3796588
61449C796588J57837J76142J95141K13650K31752K50483K70586K91519L11701
61440E895399L29198L42026L48421L47487L39196L23132K97753K61793K16261
61431H700666J64240J09008N3130r04n0591r4290j31259j60689j81797j95372
61421H212142k03993k09703k12101k09674k02553j92810j82124j70272j56339
61412F472573j40572j24254j08058r1420p3769n5692l8315k1946o114R165K3111
61401E844709L5428M6748N7260O5881P1802P6023P9998Q3275Q4173Q2772Q1369
61390F609438Q1481Q2098Q1799Q1176Q1684Q3152Q3949Q3231Q1657Q0068P8535
61379G508268P6643P3694O8830O1967N4423M7592M1072L3306K4088J4975O945
$$ plain form
61449 3796588 3954425 4130567 4325708 4539358 4771110 5021593 5292179 5583698 5895399
61440 5895399 6224597 6566623 6915044 7262531 7601727 7924859 8222612 8484405 8700666
61431 8700666 8864906 8973914 9027044 9026140 8975549 8881259 8750000 8589311 8407514 8212142
61421 8212142 8008149 7798446 7586345 7376671 7174118 6981308 6799184 6628912 6472573
61412 6472573 6332001 6207747 6099689 6008269 5934500 5878808 5840493 5818547 5812433 5821598 5844709
61401 5844709 5880137 5926885 5984145 6050026 6121828 6197851 6277849 6361124 6445297 6528069 6609438
61390 6609438 6690919 6773017 6854816 6935992 7017676 7100828 7184777 7268008 7349665 7429733 7508268
61379 7508268 7584911 7658605 7727435 7789402 7843825 7891417 7932489 7965795 7989883 8004858 8011803
61368H011803q51r230j7304k3834k9234l4795m0455m4828m7250m8453m9078m8751
61356G617740m6991m4051m0244l5380k9504k3659j9144j6260j4296j2661j1438
61345G324112j0931j1187j2097j3590j5558j7564j8775j8286j5714j1455o143
61334G172812K14Q341J8940L2164M7931O6262Q6912J09112J32192J56317J82035
61323H013232K09168K36616K63246K88455L11865L32972L51123L65236L73213
61314A0745126L72260L60355L37278L04076K61993K12392J57334R9448M1176j5556
61304A2875882o9136j18443j63225k03654k39307k69201k93032l11697l26073
61295A0882114l35926l40739l41113l38382l33051l24744l13796l01627k88978
$$ plain form
61368 8011803 8010952 8001722 7984418 7960584 7931350 7896555 7856100 7811272 7764022 7715569 7666491 7617740
61356 7617740 7570749 7526698 7486454 7451074 7421570 7397911 7378767 7362507 7348211 7335550 7324112
61345 7324112 7313181 7301994 7289897 7276307 7260749 7243185 7224410 7206124 7190410 7178955 7172812
61334 7172812 7173026 7181367 7200307 7232471 7280402 7346664 7433576 7542688 7674880 7831197 8013232
61323 8013232 8222400 8459016 8722262 9010717 9322582 9655554 10006677 10371913 10745126
61314 10745126 11117386 11477741 11815019 12119095 12381088 12593480 12750814 12850262 12891438 12875882
61304 12875882 12806746 12688303 12525078 12321424 12082117 11812916 11519884 11208187 10882114
61295 10882114 10546188 10205449 9864336 9525954 9192903 8868159 8554363 8252736 7963758
61286G963758k74801k57931k39150k20506k02797j84916j65689j45463j25564
61277F146941j07044r0199p4631n9398m3625k7448j1983J825J3814K4072L2582
61266E804906L9791M6534N2780N7257N9182N9677O0253O0473N8491N3851M8424
61255F401619M4235M1523L9378L7231L4892L1798K7224K1134J4241P234K32p053
61243F693688j4897k3209l1491l9221m6260n2680n8263o2589o5684o8244p1083
61232F160067p4509p8104q0825q1473p9654p6278p2597o8797o4128n8271n1856
61221E373575m5617l9923l5171l1564k8302k4236j9880j7447j8001j9750k0318
61210E073366j9560j8638j7320j4256r716n844l741j948J403O328J1663J6927
$$ plain form
61286 7963758 7688957 7431026 7191876 6971370 6768573 6583657 6417968 6272505 6146941
61277 6146941 6039897 5949698 5875067 5815669 5772044 5744596 5732613 5734438 5748252 5772324 5804906
61266 5804906 5844697 5891231 5944011 6001268 6060450 6120127 6180380 6240853 6299344 6353195 6401619
61255 6401619 6445854 6487377 6526755 6563986 6598878 6630676 6657900 6679034 6693275 6700509 6700741 6693688
61243 6693688 6678791 6655582 6624091 6584870 6538610 6485930 6427667 6365078 6299394 6231150 6160067
61232 6160067 6085558 6007454 5926629 5845156 5765502 5689224 5616627 5547830 5483702 5425431 5373575
61221 5373575 5327958 5288035 5252864 5221300 5192998 5168762 5148882 5131435 5113434 5093684 5073366
61210 5073366 5053806 5035168 5017848 5003592 4993876 4988032 4984291 4982343 4983746 4990074 5001737 5018664
61198E018664K2488K8669L5710M4044N3770O4192P4640Q5445R7301J09895J21810
61187E756628J31741J39080J43371J43740J39041J28186J10350Q5367N4194J8809
61177F850507j8537n5898r1534j23531j49941j69644j83106j92000j97753k00487
61167E468076j99556j94906j87535j78801j69796j61183j52891j43961j33544
61158C945903j22306j12021j03418r5278q6206p6403o6953n8194m9855m2221l5814
61147C097234l0164k4089j7309j0777n197k08M740R451J3368J6195J7839J8237
61135C089320J7523J5920J3353R784N939K977J130n93l074o148r254j2261j5154
61122C109462j7729k0214k3416k7425l0735l1720l0841l0559l2874l7386m1874
$$ plain form
61198 5018664 5041152 5069821 5105531 5149575 5203345 5267537 5342177 5427622 5524923 5634818 5756628
61187 5756628 5888369 6027449 6170820 6314560 6453601 6581787 6692137 6777504 6831698 6850507
61177 6850507 6831970 6776072 6684538 6561007 6411066 6241422 6058316 5866316 5668563 5468076
61167 5468076 5268520 5073614 4886079 4707278 4537482 4376299 4223408 4079447 3945903
61158 3945903 3823597 3711576 3608158 3512880 3426674 3350271 3283318 3225124 3175269 3133048 3097234
61147 3097234 3067070 3042981 3025672 3014895 3009698 3009490 3014230 3023681 3037049 3053244 3071083 3089320
61135 3089320 3106843 3122763 3136116 3145900 3151839 3154816 3155946 3155353 3152279 3146131 3136877 3124616 3109462
61122 3109462 3091733 3071519 3048103 3020678 2989943 2958223 2927382 2896823 2863949 2826563 2784689
61111B784689m4501m5403m6237m8068m9942n0064m8392m7060m7878n0239n2130
61100B254775n2418n1354m9494m7159m4656m2250m0049l8361l7652l7664l7308
61089A776410l6225l5508l6009l6821l6685l6028l5801l5164l2332k7627k3547
61078A404663k1559k0624j9150j6591j2838q043l581j212m75J128M407P054P175
61065A320354O236O757Q973J1720J4869J8403K0528J9601J7244J6677J8165J8886
61053A498413J7506J6049J6488J7900J8341J7600J6623J5607J4076J1926R226
61042A669755N801K007q17j803j899k795m771o529o908o176n673o666r310j2440
61028A611776j4537j5125j4930j4710j4594j4755j5775j7661j9202j9179j7944
$$ plain form
61111 2784689 2740188 2694785 2648548 2600480 2550538 2500474 2452082 2405022 2357144 2306905 2254775
61100 2254775 2202357 2151003 2101509 2054350 2009694 1967444 1927395 1889034 1851382 1813718 1776410
61089 1776410 1740185 1704677 1668668 1631847 1595162 1559134 1523333 1488169 1455837 1428210 1404663
61078 1404663 1383104 1362480 1343330 1326739 1313901 1305858 1302277 1301065 1300590 1301718 1306125 1313179 1320354
61065 1320354 1326590 1333347 1342320 1354040 1368909 1387312 1407840 1427441 1444685 1461362 1479527 1498413
61053 1498413 1515919 1531968 1548456 1566356 1584697 1602297 1618920 1634527 1648603 1660529 1669755
61042 1669755 1675556 1677563 1676746 1674943 1673044 1670249 1665478 1658949 1652041 1645865 1640192 1633526 1624216 1611776
61028 1611776 1597239 1582114 1567184 1552474 1537880 1523125 1507350 1489689 1470487 1451308 1433364
61017A433364j6942j6780j6501j4916j2147r536q205p913p413n939m079l012l059
61004A306922l456l425k923k210j287j55Q40J281J236J288K075L713N514O454
60990A315867O211N665N895O833P571P859Q527J0165J2193J3708J4564J5136J5509
60977A445703J5671J6256J8358K2314K6944L0389L1809L2181L3175L5212L7044
60966A745056L7547L7370L8216M0828M4413M7839N0584N2570N4030N5685N8295
60955B262433O1892O5990P0545P5966Q2202Q8760R5661J03379J11693J19677J27187
60944C265385J35307J44882J55538J66665J78382J90979K04515K19684K38169
60935D899506K61207K88430L18771L51736L87213M25426M68509N21332N88970
$$ plain form
61017 1433364 1416422 1399642 1383141 1368225 1356078 1346542 1338337 1330424 1323011 1317072 1312993 1309981 1306922
61004 1306922 1303466 1300041 1297118 1294908 1293621 1293466 1294306 1295587 1296823 1298111 1300186 1303899 1309413 1315867
60990 1315867 1322078 1327743 1333638 1340471 1348042 1355901 1364428 1374593 1386786 1400494 1415058 1430194 1445703
60977 1445703 1461374 1477630 1495988 1518302 1545246 1575635 1607444 1639625 1672800 1708012 1745056
60966 1745056 1782603 1819973 1858189 1899017 1943430 1991269 2041853 2094423 2148453 2204138 2262433
60955 2262433 2324325 2390315 2460860 2536826 2619028 2707788 2803449 2906828 3018521 3138198 3265385
60944 3265385 3400692 3545574 3701112 3867777 4046159 4237138 4441653 4661337 4899506
60935 4899506 5160713 5449143 5767914 6119650 6506863 6932289 7400798 7922130 8511100
60926H511100O73040P71440Q81616J003420J138850J289965J457635J642964J850540
60917A9220570K088799K362248K657584K934592L130896L178411L023561K648516
60909D1245177K091941J456342Q82665M92516L31075L50696M42650M86139L82217
60900D8161418P0805m52367j119987j803981k366296k721342k863063k841398
60892C4063789k718439k542363k346090k152756j975816j818108j675717j543627
60884A7290873j418376j298421j184399j078393r81500q92343q08589p29374o55649
60875H243829n88667n28847m75798m28699l86622l48823l14839k84517k58204
60866D628813k36668k20158k07421j96234j85055j73706j62473j51304j40267
$$ plain form
60926 8511100 9184140 9955580 10837196 11840616 12979466 14269431 15727066 17370030 19220570
60917 19220570 21309369 23671617 26329201 29263793 32394689 35573100 38596661 41245177
60909 41245177 43337118 44793460 45676125 46168641 46499716 46850412 47293062 47779201 48161418
60900 48161418 48232223 47779856 46659869 44855888 42489592 39768250 36905187 34063789
60892 34063789 31345350 28802987 26456897 24304141 22328325 20510217 18834500 17290873
60884 17290873 15872497 14574076 13389677 12311284 11329784 10437441 9628852 8899478 8243829
60875 8243829 7655162 7126315 6650517 6221818 5835196 5486373 5171534 4887017 4628813
60866 4628813 4392145 4171987 3964566 3768332 3583277 3409571 3247098 3095794 2955527
60857B955527j30033j21207j13503j06177r9080r2592q6613q0422p3823o7694
60847A984383o2783n8453n3632m8822m5782m4833m3804m0736l6511l3340l1484
60836A484203k9349k6390k3702k1599j8881j5233j2147j0380q547n587k795j580
60824A308013r16Q75L148M062L720L686L921K842L15j828k562k722k917k572j810
60809A315255k211m505p031p784p079p094r372j3299j6579j6861j3723r309o325
60796A194083n323m746l409j628J05J998M123O087Q151J1362J5910K0413K3432
60783A270558K4707K4486K2974K1136K0647K1954K3310K2882K1007J9456J9121
60772A512238J9519K0011K0364K0260J9199J7063J4286J1362Q496N692L157J529
$$ plain form
60857 2955527 2825494 2704287 2590784 2484607 2385527 2292935 2206322 2125900 2052077 1984383
60847 1984383 1921600 1863147 1809515 1760693 1714911 1670078 1626274 1585538 1549027 1515687 1484203
60836 1484203 1454854 1428464 1404762 1383163 1364282 1349049 1336902 1326522 1317975 1312388 1309593 1308013
60824 1308013 1307097 1307972 1311120 1315182 1318902 1322588 1326509 1329351 1329666 1327838 1325276 1322554 1319637 1317065 1315255
60809 1315255 1313044 1308539 1301508 1293724 1286645 1279551 1270179 1256880 1240301 1223440 1209717 1200408 1194083
60796 1194083 1188760 1184014 1180605 1178977 1179082 1181080 1185203 1191290 1199441 1210803 1226713 1247126 1270558
60783 1270558 1295265 1319751 1342725 1363861 1384508 1406462 1429772 1452654 1473661 1493117 1512238
60772 1512238 1531757 1551768 1572132 1592392 1611591 1628654 1642940 1654302 1662798 1668490 1671647 1673176
60760A673176J389K290K891K537K052K154J840j72l121n020n643o748r304j2372
60746A645949j5075j7645j9921k0795k0107j9350j9571k0135k0388k0674k0702
60735A431586j8968j5228j1659r849q376n440k189j045j708j418J252M984P996
60722A369938R824J0882J1760J3011J4559J5545J5724J6270J7989J9631J9610
60711A534743J8599J8628K0170K1825K2439K1701J9272J5434J2345J2185J3995
60700A731336J4556J2674J0477R963J0579J1011J1242J1502J0927Q827O211M675
60688A853980M465M614M383L698K727J806J330J228R29J38j038k803n507q440
60674A861510j0013r858r686j1134j3498j4700j4026j2787j2445j3020j3555j3466
$$ plain form
60760 1673176 1674565 1676855 1679746 1682283 1684335 1686489 1688329 1688157 1685036 1680016 1674373 1667625 1658321 1645949
60746 1645949 1630874 1613229 1593308 1572513 1552406 1533056 1513485 1493350 1472962 1452288 1431586
60735 1431586 1412618 1397390 1385731 1375882 1367506 1362066 1359877 1358832 1357124 1355706 1356958 1361942 1369938
60722 1369938 1379762 1390644 1402404 1415415 1429974 1445519 1461243 1477513 1495502 1515133 1534743
60711 1534743 1553342 1571970 1592140 1613965 1636404 1658105 1677377 1692811 1705156 1717341 1731336
60700 1731336 1745892 1758566 1769043 1779006 1789585 1800596 1811838 1823340 1834267 1843094 1849305 1853980
60688 1853980 1858445 1863059 1867442 1871140 1873867 1875673 1877003 1878231 1879160 1879298 1878260 1875457 1869950 1861510
60674 1861510 1851497 1841639 1831953 1820819 1807321 1792621 1778595 1765808 1753363 1740343 1726788 1713322
60662A713322j2955j2276j1096q943o159l854k724k473k695l583n146o461o700
60649A628257o380o498o984p226p574q747r964r465p119m812l805l313k274r69
60635A543127n7O22J353J762J579J133K79j997n873r745j2094j3461j5288j7650
60621A473690j9442k0298k0862k1440k1541k0864j9770j8679j7564j6077j3932
60610A263221j1449r769r838j0824j0464p629l744q97M73J205J708J963K436L566
60596A209958M698M831M177L675L296K300J113J312L337N569O270N518M651M612
60582A265317N320O109O308N861N576O349Q077R830J1072J2059J3115J4247J5466
60569A384706J6734J7600J7835J8358K0392K3477K5591K5640K4716K4214K4053
$$ plain form
60662 1713322 1700367 1688091 1676995 1668052 1661893 1658039 1655315 1652842 1650147 1646564 1641418 1634957 1628257
60649 1628257 1621877 1615379 1608395 1601169 1593595 1584848 1574884 1565419 1558300 1553488 1549683 1546370 1544096 1543127
60635 1543127 1543070 1543692 1545045 1546807 1548386 1549519 1549798 1547801 1541928 1532183 1520089 1506628 1491340 1473690
60621 1473690 1454248 1433950 1413088 1391648 1370107 1349243 1329473 1310794 1293230 1277153 1263221
60610 1263221 1251772 1242003 1232165 1221341 1210877 1203248 1199504 1198607 1199080 1200285 1201993 1203956 1206392 1209958
60596 1209958 1214656 1219487 1223664 1227339 1230635 1232935 1234048 1235360 1238697 1244266 1250536 1256054 1260705 1265317
60582 1265317 1270637 1276746 1283054 1288915 1294491 1300840 1308917 1318747 1329819 1341878 1354993 1369240 1384706
60569 1384706 1401440 1419040 1436875 1455233 1475625 1499102 1524693 1550333 1575049 1599263 1623316
60558A623316K3640K3433K4128K4978K4403K1945J8444J4486J0087N847K940J440
60546A819087k54l557p991j1848j4022j4636j4538j4853j6529j9487k2336k3647
60534A655389k3394k2515k1260j8922j5434j2179j0504r907q641n979l098j504
60522A502052j374j778k027k094k104k054k115k524l031k901j701K99K602M865
60508A486115O505O751N696M818N542P427Q672Q348P157N889M330K283N46j11
60494A559968k40p71j259k84K448N628Q043R702J1018J2152J3657J6589K1156
60481A657807K5973K9599L2184L4799L7718M0312M2096M2728M1260L6748K9711
60470B050935K1833J3980N702k979j0465j5204j7511j8808j9523j8799j6106j2077
$$ plain form
60558 1623316 1646956 1670389 1694517 1719495 1743898 1765843 1784287 1798773 1808860 1814707 1817647 1819087
60546 1819087 1818833 1815276 1807285 1795437 1781415 1766779 1752241 1737388 1720859 1701372 1679036 1655389
60534 1655389 1631995 1609480 1588220 1569298 1553864 1541685 1531181 1521274 1512633 1506654 1503556 1502052
60522 1502052 1500678 1498900 1496873 1494779 1492675 1490621 1488506 1485982 1482951 1480050 1478349 1478648 1481250 1486115
60508 1486115 1492620 1499371 1505067 1509885 1515427 1522854 1531526 1539874 1547031 1552920 1557250 1559533 1560079 1559968
60494 1559968 1559728 1558957 1557698 1557414 1559862 1565490 1573533 1583235 1594253 1606405 1620062 1636651 1657807
60481 1657807 1683780 1713379 1745563 1780362 1818080 1858392 1900488 1943216 1984476 2021224 2050935
60470 2050935 2072768 2086748 2092450 2089471 2079006 2063802 2046291 2027483 2007960 1989161 1973055 1960978
60458A960978p609k969J834O316R781J2145J4143J6642J9864K3337K6571K9693
60446B110726L3384L8177M3987N0348N7081O4560P3444Q4167R6650J10367J24895
60435B887786J40520J58116J78151J99886K21833K43123K64039K85261L06948
60426D885663L28822L50564L71327L88675L98341L95254L74886L34242K72711
60417H100485J92722R9452l04r9045j88969k63216l18081l53944l73489l79372
60407F416239l74159l61539l45774l29482l12991k96025k78947k61956k44453
60398C610913k26157k08063j91374j76083j61474j47431j34352j22158j10368
60389B133453r8875q7928p7649o8344o0874n5680n1669m7117m1736l6906l3883
$$ plain form
60458 1960978 1953369 1950400 1952234 1958550 1968331 1980476 1994619 2011261 2031125 2054462 2081033 2110726
60446 2110726 2144110 2182287 2226274 2276622 2333703 2398263 2471707 2555874 2652524 2762891 2887786
60435 2887786 3028306 3186422 3364573 3564459 3786292 4029415 4293454 4578715 4885663
60426 4885663 5214485 5565049 5936376 6325051 6723392 7118646 7493532 7827774 8100485
60417 8100485 8293207 8392659 8392355 8293310 8104341 7841125 7523044 7169100 6795611 6416239
60407 6416239 6042080 5680541 5334767 5005285 4692294 4396269 4117322 3855366 3610913
60398 3610913 3384756 3176693 2985319 2809236 2647762 2500331 2365979 2243821 2133453
60389 2133453 2034578 1946650 1869001 1800657 1739783 1684103 1632434 1585317 1543581 1506675 1472792
60378A472792l2590l2119l1492k9889k7195k4494k2980k2150k0151j6392j2676
60367A200664j1088j1619j2750j3466j3653j2995j0885p557m360k494j947j871
60355A095979j559q33J95J357K416L129L502M004N228P165Q884R249Q012O055
60341A152783M588M334N273O784P943Q114P465O663O078N654N509O069P288Q163
60327A242708P599N669L652K774L032L383K941J736K77j306l225n133n956n041
60313A253110l110j509q45o99m51J65R82J436R54j19l91J045L378N131O078O942
60297A272097P678P537O899P258Q857R951R390Q569R499J1886J3644J3676J2706
60284A399647J1598J0442R395R040R316R112P530M999K577O39j042k329k573j497
$$ plain form
60378 1472792 1440202 1408083 1376591 1346702 1319507 1295013 1272033 1249883 1229732 1213340 1200664
60367 1200664 1189576 1177957 1165207 1151741 1138088 1125093 1114208 1106651 1102291 1099797 1097850 1095979
60355 1095979 1094420 1093587 1093782 1095139 1097555 1100684 1104186 1108190 1113418 1120583 1129467 1138716 1146728 1152783
60341 1152783 1157371 1161705 1166978 1173762 1181705 1189819 1197284 1203947 1210025 1215679 1221188 1227257 1234545 1242708
60327 1242708 1250307 1255976 1259628 1262402 1265434 1268817 1271758 1273494 1273771 1272465 1269240 1264107 1258151 1253110
60313 1253110 1250000 1248491 1247646 1246947 1246496 1246661 1247643 1249079 1250033 1249914 1249523 1250568 1253946 1259077 1265155 1272097
60297 1272097 1279775 1287312 1294211 1301469 1310326 1320277 1329667 1338236 1347735 1359621 1373265 1386941 1399647
60284 1399647 1411245 1421687 1431082 1440122 1449438 1458550 1466080 1471079 1473656 1474295 1473253 1470924 1468351 1466854
60270A466854L11J974L060L606L786L875M234M766M646L199J065l72q15j546l474
60255A495169n673o709o619o494o529n921m534l267k633k144j481j080j172j277
60241A439636j068p41j83J074K496K573J105K40J888M949O614N893M430M097N207
60226A478210P124R171J0505J0321Q876P649P805Q900R623R436Q977Q953R365
60213A594915R926J0906J2932J5933J8795K0498K1320K2342K3882K5215K5912
60202A802576K6740K8775L2239L6645M1558M6697N1672N6330O1140O6736P3100
60191B324208P9639Q6024R2660J00307J09393J19634J30226J40416J49854J58346
60181C490707J65539J71250J75934J80267J84186J86808J87198J84772J79078
$$ plain form
60270 1466854 1467165 1469139 1472199 1475805 1479591 1483466 1487700 1492466 1497112 1500311 1501376 1501004 1500189 1498643 1495169
60255 1495169 1489496 1482787 1476168 1469674 1463145 1457224 1452690 1449423 1446790 1444646 1443165 1442085 1440913 1439636
60241 1439636 1438568 1437827 1437644 1438718 1441214 1443787 1444892 1445132 1447020 1451969 1458583 1464476 1468906 1473003 1478210
60226 1478210 1485334 1494505 1505010 1515331 1524207 1531856 1539661 1548561 1558184 1567620 1576597 1585550 1594915
60213 1594915 1604841 1615747 1628679 1644612 1663407 1683905 1705225 1727567 1751449 1776664 1802576
60202 1802576 1829316 1858091 1890330 1926975 1968533 2015230 2066902 2123232 2184372 2251108 2324208
60191 2324208 2403847 2489871 2582531 2682838 2792231 2911865 3042091 3182507 3332361 3490707
60181 3490707 3656246 3827496 4003430 4183697 4367883 4554691 4741889 4926661 5105739
60172E105739J69949J57927J43873J28192J11075R3330P5976N9022M1766K4497
60162F111346Q696m707j6010k5304l1633l4331l3920l0955k5194j6826p270K373
60150E896265J2662K4526L7683N1564O6775Q3976J02064J19006J33975J47126
60140F675622J57760J64537J67426J67726J65777J59998J48767J32351J12561
60131H052525R1178O9011M6015K2076k137k5296m6493o5673q2585r6161j05582
60120G856878j11174j13373j11624j05302r5009q1874o6341m8819l0652j2981
60110G079729M741K3561M2876O1036P7397R2000J03741J10970J13736J13341J09706
60099G932834J01412Q8769P4584O1137M8193L4834K1560R638n6o629r002p160
$$ plain form
60172 5105739 5275688 5433615 5577488 5705680 5816755 5910085 5986061 6045083 6086849 6111346
60162 6111346 6120042 6115335 6099325 6074021 6042388 6008057 5974137 5943182 5917988 5901162 5893892 5896265
60150 5896265 5908927 5933453 5971136 6022700 6089475 6173451 6275515 6394521 6528496 6675622
60140 6675622 6833382 6997919 7165345 7333071 7498848 7658846 7807613 7939964 8052525
60131 8052525 8143703 8212714 8258729 8280805 8278668 8253372 8206879 8141206 8058621 7962460 7856878
60120 7856878 7745704 7632331 7520707 7415405 7320396 7238522 7172181 7123362 7092710 7079729
60110 7079729 7084470 7108031 7150907 7211943 7289340 7381340 7485081 7596051 7709787 7823128 7932834
60099 7932834 8034246 8123015 8197599 8258736 8306929 8341763 8363323 8372961 8372905 8366276 8357274 8350114
60087H350114k388M683J5109K9885M8347O9188R1939J16581J42803J70635K00795
60076I237691K33313K66769K99902L33179L67697M03249M38435M71941N02709
60067A2554885N29481N51143N67094N76498N77761N69529N51683N24725M88926
60058A7491725M44861L93875L37013K74171K05355J32156N6910j8973r4622j68106
60048A9054365k36531k97533l49656l91540m22085m41466m50832m50729m40809
60039A5573184m21421l94604l62859l27360k88013k45052k00194j55891j13569
60030A3064221p2966l3541L657L6183O2098Q0943R2743R7078R3701Q3297O6943
60019A3574357M5529K0354o385l2671n7986q2759j06958j30022j51878j73046
$$ plain form
60087 8350114 8347726 8352409 8367518 8397403 8445750 8514938 8606877 8723458 8866261 9036896 9237691
60076 9237691 9471004 9737773 10037675 10370854 10738551 11141800 11580235 12052176 12554885
60067 12554885 13084366 13635509 14202603 14779101 15356862 15926391 16478074 17002799 17491725
60058 17491725 17936586 18330461 18667474 18941645 19147000 19279156 19336066 19317093 19222471 19054365
60048 19054365 18817834 18520301 18170645 17779105 17357020 16915554 16464722 16013993 15573184
60039 15573184 15151763 14757159 14394300 14066940 13778927 13533875 13333681 13177790 13064221
60030 13064221 12991255 12957714 12961371 12997554 13059652 13140595 13233338 13330416 13424117 13507414 13574357
60019 13574357 13619886 13640240 13633855 13601184 13543198 13460439 13353481 13223459 13071581 12898535
60009A2898535j93728k13394k31176k46044k56733k62316k62839k58958k51002
60000A0722345k39115k24192k07743j90483j71482j49254j23547r5817o8037m1223
59990I211452j5201J0404L5293N8806Q0711J01173J19909J35787J47239J52704
59980A0038277J51061J42400J28357J10860R0427O6395L8853R334k0581n0206
59970A0705177p8927j05564j29255j49981j67489j80510j87975j90197j88109
59961I327170j82055j72189j59303j44262j27263j08468q8617o8022m5786k1241
59951H209964M526K9973N5283Q1716J09155J36015J61468J85854K08612K27495
59941I410061K40769K48724K52143K50075K40416K22392J97709J69310J39218
$$ plain form
60009 12898535 12704807 12491413 12260237 12014193 11757460 11495144 11232305 10973347 10722345
60000 10722345 10483230 10259038 10051295 9860812 9689330 9540076 9416529 9320712 9252675 9211452
59990 9211452 9196251 9206655 9241948 9300754 9381465 9482638 9602547 9738334 9885573 10038277
59980 10038277 10189338 10331738 10460095 10570955 10661382 10727777 10766630 10775964 10755383 10705177
59970 10705177 10626250 10520686 10391431 10241450 10073961 9893451 9705476 9515279 9327170
59961 9327170 9145115 8972926 8813623 8669361 8542098 8433630 8345013 8276991 8231205 8209964
59951 8209964 8214490 8244463 8299746 8381462 8490617 8626632 8788100 8973954 9182566 9410061
59941 9410061 9650830 9899554 10151697 10401772 10642188 10864580 11062289 11231599 11370817
59932A1370817J07426P2727L4833m356m1929p6223j07319j35382j59332j77512
59922A0883750j89046j94050j92952j86146j74303j58631j40457j20349r7852
59913I429964p2645m5884j9667N156K9658N4636P8691R9685J17364J32953J46510
59902I956421J56472J62036J64182J63584J59173J50008J37544J24586J12570
59893A1286576J01149R0191Q0788P4076P0250O9276P1846P8881R0481J06094J25673
59882A2245281J50048J80009K15457K55604K99440L45390L91098M34502M75203
59873A4992032N13778N49359N78645N97687O03777N94891N68510N22584M57614
59864A9978877L76479K82224J77291O5328m7643j54949k51840l35826m05278m58858
$$ plain form
59932 11370817 11478243 11550970 11585803 11581447 11539518 11463295 11355976 11220594 11061262 10883750
59922 10883750 10694704 10500654 10307702 10121556 9947253 9788622 9648165 9527816 9429964
59913 9429964 9357319 9311435 9291768 9296924 9326582 9381218 9459909 9559594 9676958 9809911 9956421
59902 9956421 10112893 10274929 10439111 10602695 10761868 10911876 11049420 11174006 11286576
59893 11286576 11387725 11477916 11558704 11632780 11703030 11772306 11844152 11923033 12013514 12119608 12245281
59882 12245281 12395329 12575338 12790795 13046399 13345839 13691229 14082327 14516829 14992032
59873 14992032 15505810 16055169 16633814 17231501 17835278 18430169 18998679 19521263 19978877
59864 19978877 20355356 20637580 20814871 20880199 20832556 20677607 20425767 20089941 19684663 19225805
59854A9225805m96355n19045n28705n26658n14116m93073m66014m34509l98584
59845A4848746l58036l14081k69020k24189j78993j32268q4137l6081J0184N3323
59835A3315448R2171J25711J53285J74289J87452J90810J82563J61963J29419
59826A4713111Q6096L3670k5411q7671j49302k07606k61535l10340l52163l84910
59816A3053939m08228m23390m31194m31414m24768m13782m00653l85353l67037
59807I368120l46321l24787l02916k80005k55918k31685k08506j87077j67705
59798G063200j50275j34358j20118j08540r9977r3294q7511q3353q1564q0424
59788F023786p6929p0266o2301n4744m7721m1352l6702l4410l3907l4769l7528
$$ plain form
59854 19225805 18729450 18210405 17681700 17155042 16640926 16147853 15681839 15247330 14848746
59845 14848746 14490710 14176629 13907609 13683420 13504427 13372159 13288022 13251941 13262125 13315448
59835 13315448 13407619 13533330 13686615 13860904 14048356 14239166 14421729 14583692 14713111
59826 14713111 14799207 14832877 14807466 14719795 14570493 14362887 14101352 13791012 13438849 13053939
59816 13053939 12645711 12222321 11791127 11359713 10934945 10521163 10120510 9735157 9368120
59807 9368120 9021799 8697012 8394096 8114091 7858173 7626488 7417982 7230905 7063200
59798 7063200 6912925 6778567 6658449 6549909 6449932 6356638 6269127 6185774 6104210 6023786
59788 6023786 5946857 5876591 5814290 5759546 5711825 5670473 5633771 5599361 5565454 5530685 5493157
59777E493157m2449m8642n4941o0690o5090o6986o5915o2580n7901n2425m6662
59766D868876m0763l3801k4916j5413p947k991J957Q906J6970K4623L2414M1646
59754D869561N1832O1350O9711P7329Q3732Q7897Q9897R0557Q9816Q6935Q2215
59743E740832P6915P1507O5350N8165N0731M4039L8719L5230L3710L3823L5659
59732F284680M0362M8757N9806P1858Q5136J01314J20672J41615J63547J88255
59722G306002K17294K49413K82084L14818L49315L86485M24541M60279M91146
59713A0481377N15189N29154N27305N02812M51055L72333K72177J59631M5068
59704A3856101o1615j52463k22516k70219k97228l07564l05863k95540k78570
$$ plain form
59777 5493157 5450708 5402066 5347125 5286435 5221345 5154359 5088444 5025864 4967963 4915538 4868876
59766 4868876 4828113 4794312 4769396 4753983 4746036 4743045 4745002 4753908 4770878 4795501 4827915 4869561
59754 4869561 4921393 4982743 5052454 5129783 5213515 5301412 5391309 5481866 5571682 5658617 5740832
59743 5740832 5817747 5889254 5954604 6012769 6063500 6107539 6146258 6181488 6215198 6249021 6284680
59732 6284680 6325042 6373799 6433605 6505463 6590599 6691913 6812585 6954200 7117747 7306002
59722 7306002 7523296 7772709 8054793 8369611 8718926 9105411 9529952 9990231 10481377
59713 10481377 10996566 11525720 12053025 12555837 13006892 13379225 13651402 13811033 13856101
59704 13856101 13794486 13642023 13419507 13149288 12852060 12544496 12238633 11943093 11664523
59695A1664523k56993k33563k10105j86024j59778j31483j02788p4202m4300j2044
59685A0253243K1522N4872Q8122J22278J57126J91405K24986K59502K96332L34947
59675A2004335L73928M13047M53690M97392N44593N94759O47140P01129P56121
59666A6986134Q11382Q66102R19408R70374J017846J060002J094109J117217J127639
59657B5970213J125611J112385J089430J059247J026409R96288R72390R55782
59649C4307755R47193R48006R58158R74265R91354J005884J015613J016809J003498
59640D3168535R70209R14547Q36942P39338O25253N00260L71013K43622J23463
59631D8493182J6092p2909j39565j82650k02875k01411j79523j39192q2959j2689
$$ plain form
59695 11664523 11407530 11173967 10963862 10777838 10618060 10486577 10383789 10309587 10265287 10253243
59685 10253243 10274765 10329637 10417759 10540037 10697163 10888568 11113554 11373056 11669388 12004335
59675 12004335 12378263 12791310 13245000 13742392 14286985 14881744 15528884 16230013 16986134
59666 16986134 17797516 18663618 19583026 20553400 21571246 22631248 23725357 24842574 25970213
59657 25970213 27095824 28208209 29297639 30356886 31383295 32379583 33351973 34307755
59649 34307755 35254948 36202954 37161112 38135377 39126731 40132615 41148228 42165037 43168535
59640 43168535 44138744 45053291 45890233 46629571 47254824 47755084 48126097 48369719 48493182
59631 48493182 48509274 48436365 48296800 48114150 47911275 47709864 47530341 47391149 47308190 47295501
59621D7295501P1058J67852K75939L92446N14698O40476P66979Q90420J006659
59612E2022028J111099J197401J257360J282790J266908J203476J086282R11797
59604F1339141O82875M09384J05742k11334n24024q15349j071702j283857j446543
59595E7184333j558924j625477j654206j652758j627060j583797j532202j482021
59587D4467888j440769j413890j405759j417967j446662j483109j517269j540484
59579C2801979j546290j531224j495907j444276j381156j310747j236830j162746
59571B1692803j090469j020548r53182q88598q26292p65265p05610o48922n96350
59562A4197567n47240n00467m56277m15602l78280l43307l10630k81293k55760
$$ plain form
59621 47295501 47366559 47534411 47810350 48202796 48717494 49357970 50124949 51015369 52022028
59612 52022028 53133127 54330528 55587888 56870678 58137586 59341062 60427344 61339141
59604 61339141 62022016 62431400 62537142 62325808 61801784 60986435 59914733 58630876 57184333
59595 57184333 55625409 53999932 52345726 50692968 49065908 47482111 45949909 44467888
59587 44467888 43027119 41613229 40207470 38789503 37342841 35859732 34342463 32801979
59579 32801979 31255689 29724465 28228558 26784282 25403126 24092379 22855549 21692803
59571 21692803 20602334 19581786 18628604 17740006 16913714 16148449 15442839 14793917 14197567
59562 14197567 13650327 13149860 12693583 12277981 11899701 11556394 11245764 10964471 10708711
59553A0708711k33392k13962j98407j87319j79716j74367j71613j72418j75863
59544I001654j79046j79969j79290j78509j77519j75185j71544j67679j63391
59535G429522j56832j47230j36485j26726j17355j06154r2838p9638o8264n8018
59525F339982m7430l6323k5334j4673m542M196J1082J7242K4055L0911L5742L7895
59513F372803L9265M2250M7509N4127O1103O8109P5379Q3462R2810J03320J14563
59502G154700J26571J39950J55080J71706J89408K07982K27255K47162K68227
59493H888041K91251L16124L41586L66539L90986M15072M37816M57405M72463
59484A2377283M82446M87256M87127M82653M74340M62137M45778M25232M00670
$$ plain form
59553 10708711 10475319 10261357 10062950 9875631 9695915 9521548 9349935 9177517 9001654
59544 9001654 8822608 8642639 8463349 8284840 8107321 7932136 7760592 7592913 7429522
59535 7429522 7272690 7125460 6988975 6862249 6744894 6638740 6545902 6466264 6398000 6339982
59525 6339982 6292552 6256229 6230895 6216222 6211680 6215876 6226958 6244200 6268255 6299166 6334908 6372803
59513 6372803 6412068 6454318 6501827 6555954 6617057 6685166 6760545 6844007 6936817 7040137 7154700
59502 7154700 7281271 7421221 7576301 7748007 7937415 8145397 8372652 8619814 8888041
59493 8888041 9179292 9495416 9837002 10203541 10594527 11009599 11447415 11904820 12377283
59484 12377283 12859729 13346985 13834112 14316765 14791105 15253242 15699020 16124252 16524922
59475A6524922L72336L41070L08448K76014K44659K15391J89992J69996J55221
59466A8798049J44395J37265J35208J39353J48647J60026J70174J76900J78925
59457B0188942J74474J60344J33078R1456L7448k5541r4764j68208k43725l19151
59447A9934353l92614m61475n21484n68667o02115o23697o35059o36267o27583
59438A4865392o10941n88771n62352n32132m98881m63823m28134l92743l58131
59429A0429484l23980k89627k55147k21335j88449j55823j22995r0394n8536k7502
59419H695696K508L1191N9235Q8327J19204J50678J81308K10998K40041K67689
59409A0046875K92877L15389L34859L49401L56854L56928L50336L36027L11196
$$ plain form
59475 16524922 16897258 17238328 17546776 17822790 18067449 18282840 18472832 18642828 18798049
59466 18798049 18942444 19079709 19214917 19354270 19502917 19662943 19833117 20010017 20188942
59457 20188942 20363416 20523760 20656838 20748294 20785742 20760201 20665437 20497229 20253504 19934353
59447 19934353 19541739 19080264 18558780 17990113 17387998 16764301 16129242 15492975 14865392
59438 14865392 14254451 13665680 13103328 12571196 12072315 11608492 11180358 10787615 10429484
59429 10429484 10105504 9815877 9560730 9339395 9150946 8995123 8872128 8781734 8723198 8695696
59419 8695696 8698204 8729395 8788630 8876957 8996161 9146839 9328147 9539145 9779186 10046875
59409 10046875 10339752 10655141 10990000 11339401 11696255 12053183 12403519 12739546 13050742
59400A3050742K74388K27169J72214J11228M5484k2879r1165j57134k18701k73238
59390A3118108l18234l52835l78288l96559m08714m14564m13896m07827l98483
59381I628708l87088l72958l55244l35260l15878k98391k81175k62059k41116
59372F779539k20246k00717j82292j64433j47234j30936j15364j00218q5453p1247
59362E361399n7958m6194l6145k6727j6197m192P507J7001K4499L1604L8975M5872
59350E339444N1744N6747O0581O2378O2467O2878O5347P0144P7648Q9179J04602
59339F103159J20821J35047J48506J64109J81184J95995K07884K21273K40169
59330G718147K63774K89733L18995L54253L95185M38614M82972N29673N79793
$$ plain form
59400 13050742 13325130 13552299 13724513 13835741 13881225 13858346 13767181 13610047 13391346 13118108
59390 13118108 12799874 12447039 12068751 11672192 11263478 10848914 10435018 10027191 9628708
59381 9628708 9241620 8868662 8513418 8178158 7862280 7563889 7282714 7020655 6779539
59372 6779539 6559293 6358576 6176284 6011851 5864617 5733681 5618317 5518099 5432646 5361399
59362 5361399 5303441 5257247 5221102 5194375 5178178 5173986 5181493 5198494 5222993 5254597 5293572 5339444
59350 5339444 5391188 5447935 5508516 5570894 5633361 5696239 5761586 5831730 5909378 5998557 6103159
59339 6103159 6223980 6359027 6507533 6671642 6852826 7048821 7256705 7477978 7718147
59330 7718147 7981921 8271654 8590649 8944902 9340087 9778701 10261673 10791346 11371139
59321A1371139O31984O84310P36084P86697Q33792Q73685R03027R19871R23780
59312A8664369R15278Q94771Q62177Q18110P64919P05626O42325N76783N11970
59303B5356328M50912L93617L36745K77030K13868J48076P9665Q003o6696j43105
59293B7054443k19478k93649l62721m23748m74973n16208n48337n72858n91790
59284B3050681o07561o22516o38033o53767o68126o79931o89142o95473o97101
59275A7099031o92046o80451o64074o43669o18568n89070n57352n25193m92297
59266A1636311m58130m23910l91293l59943l28287k96286k65820k38150k12416
59257H662076j87124j62161j38610j17110r6991p7044n6851l7198j9113k543J3690
$$ plain form
59321 11371139 12003123 12687433 13423517 14210214 15044006 15917691 16820718 17740589 18664369
59312 18664369 19579647 20474418 21336595 22154705 22919624 23625250 24267575 24844358 25356328
59303 25356328 25807240 26200857 26537602 26814632 27028500 27176576 27256241 27264244 27197548 27054443
59293 27054443 26834965 26541316 26178595 25754847 25279874 24763666 24215329 23642471 23050681
59284 23050681 22443120 21820604 21182571 20528804 19860678 19180747 18491605 17796132 17099031
59275 17099031 16406985 15726534 15062460 14418791 13800223 13211153 12653801 12128608 11636311
59266 11636311 11178181 10754271 10362978 10003035 9674748 9378462 9112642 8874492 8662076
59257 8662076 8474952 8312791 8174181 8057071 7960080 7883036 7826185 7788987 7769874 7767331 7781021
59246G781021L0512M7486O3404P7701R0835J03365J15000J24744J31919J36910
59236H702897J40556J42721J41973J37250J29499J20808J12068J02583R2112Q2157
59226I904624P4634P0127O8126O8236P0455P4821Q1568R1095J03105J16190J28942
59215A0851923J40969J52020J60594J64461J62393J54514J41049J21610R6034
59206A2145567O5366L1875j681l2991o0967q5536j06430j22465j32417j36304
59196A1564017j35258j30389j22334j11572r8630q4071o8801n3876l9522k4851
59186A0694713r471N184J7235K6622L4700M1795M6884M9974N3149N8474O6113
59175A1085372P5392Q6548J00376J17139J37147J61659J91635K25877K61787K98095
$$ plain form
59246 7781021 7811533 7859019 7922423 8000124 8090959 8194324 8309324 8434068 8565987 8702897
59236 8702897 8843453 8986174 9128147 9265397 9394896 9515704 9627772 9730355 9822467 9904624
59226 9904624 9979258 10049385 10117511 10185747 10256202 10331023 10412591 10503686 10606791 10722981 10851923
59215 10851923 10992892 11144912 11305506 11469967 11632360 11786874 11927923 12049533 12145567
59206 12145567 12210933 12242808 12241127 12208136 12147169 12061633 11955203 11832738 11700321 11564017
59196 11564017 11428759 11298370 11176036 11064464 10965834 10881763 10812962 10759086 10719564 10694713
59186 10694713 10685242 10690426 10707661 10734283 10768983 10810778 10857662 10907636 10960785 11019259 11085372
59175 11085372 11160764 11247312 11347688 11464827 11601974 11763633 11955268 12181145 12442932 12741027
59165A2741027L35439L73905M11093M43274M67606M82312M85350M74002M46062
59156A6660070M00844L39024K62023J72006P2126l3685j41269k46447l44880m32405
59146A6707407n05973n64166o06675o33573o45626o45031o35073o18752n98022
59137A1254516n74195n48199n20231m90040m58169m26357l95942l66534l37238
59128G137611l08751k82995k60661k40365k20713k01890j84554j68185j51872
59119E117625j36132j22466j10998r9864q7564p4998o4266n5922m8424m0291l1778
59108D244922k3918j6703r094p30P445J4605K1332K8816L7135M5234N2495N9429
59096D460968O6665P4028Q1114Q8151R5631J03501J11371J19370J28032J37334
$$ plain form
59165 12741027 13076466 13450371 13861464 14304738 14772344 15254656 15740006 16214008 16660070
59156 16660070 17060914 17399938 17661961 17833967 17906093 17872408 17731139 17484692 17139812 16707407
59146 16707407 16201434 15637268 15030593 14397020 13751394 13106363 12471290 11852538 11254516
59137 11254516 10680321 10132122 9611891 9121851 8663682 8237325 7841383 7474849 7137611
59128 7137611 6828860 6545865 6285204 6044839 5824126 5622236 5437682 5269497 5117625
59119 5117625 4981493 4859027 4748029 4648165 4560601 4485603 4421337 4365415 4316991 4276700 4244922
59108 4244922 4221004 4204301 4195207 4194477 4201922 4216527 4237859 4266675 4303810 4349044 4401539 4460968
59096 4460968 4527633 4601661 4682775 4770926 4866557 4970058 5081429 5200799 5328831 5466165
59086E466165J46268J53570J58538J61232J62243J62361J62062J61138J58869
59077F892446J54450J47125J36350J22449J07086R2405P9454O7874N7185M7731
59067G904555M0011L3878K9252K7295K9881L7549M8548O0505P2725Q6459J03025
59056H473683J22299J43143J64650J86396K07820K28160K47141K65167K82428
59047A0320887K98048L10126L16464L15285L05825K88311K62990K29344J87079
59038A2834359J38033Q5977L4117j6222o3912j06440j41406j68784j90369k07536
59028A2197817k20945k31833k41719k50810k58317k64561k71099k78392k84928
59019I895213k89392k92372k95046k97267k97943k96539k93448k89327k84567
$$ plain form
59086 5466165 5612433 5766003 5924541 6085773 6248016 6410377 6572439 6733577 6892446
59077 6892446 7046896 7194021 7330371 7452820 7559906 7652311 7731765 7799639 7856824 7904555
59067 7904555 7944566 7978444 8007696 8034991 8064872 8102421 8150969 8211474 8284199 8370658 8473683
59056 8473683 8595982 8739125 8903775 9090171 9297991 9526151 9773292 10038459 10320887
59047 10320887 10618935 10929061 11245525 11560810 11866635 12154946 12417936 12647280 12834359
59038 12834359 12972392 13058369 13092486 13076264 13012352 12905912 12764506 12595722 12405353 12197817
59028 12197817 11976872 11745039 11503320 11252510 10994193 10729632 10458533 10180141 9895213
59019 9895213 9605821 9313449 9018403 8721136 8423193 8126654 7833206 7543879 7259312
59010G259312k78858k71089k60536k48400k37124k27773k19131k09724j99504
59001E107173j88939j77846j66120j54528j43743j33489j23580j14875j08153
58992C795900j02802r7622r2174q6548q0705p4940p0147o6695o3879o1231n9110
58981B940047n7144n3740m8545m3772m1044l8383l2801k4950j8449j4919j2461
58970B553839r105n148j404K460O670J0251J2344J3314J3642J2979J1153Q955
58958B629950P046N085K852J344J707L567N318N886N644N726O866Q864J1055J3072
58944B713982J4861J5953J5621J4040J2385J0986Q534M270m9k003j640r81r57
58931B805002p23J72J055J793L140N089O561P346Q664J1245J4223J6573J8240
$$ plain form
59010 7259312 6980454 6709365 6448829 6200429 5963305 5735532 5516401 5306677 5107173
59001 5107173 4918234 4740388 4574268 4419740 4275997 4142508 4018928 3904053 3795900
58992 3795900 3693098 3595476 3503302 3416754 3336049 3261109 3190962 3124267 3060388 2999157 2940047
58981 2940047 2882903 2829163 2780618 2736846 2695802 2657419 2624618 2599668 2581219 2566300 2553839
58970 2553839 2544734 2539586 2538182 2540642 2547312 2557563 2569907 2583221 2596863 2609842 2620995 2629950
58958 2629950 2636996 2642081 2644933 2646277 2647984 2651551 2656869 2662755 2668399 2674125 2680991 2689855 2700910 2713982
58944 2713982 2728843 2744796 2760417 2774457 2786842 2797828 2806362 2810632 2810583 2808580 2806940 2805959 2805002
58931 2805002 2804279 2804451 2805506 2807299 2810439 2815528 2822089 2829435 2838099 2849344 2863567 2880140 2898380
58918B898380J9469K0346K1493K3706K6534K8682L0287L3087L7683M2394M5700
58907C227761M8163N0942N3930N6702N9797O3665O7290O9292O9707O9674P0105
58896C907028P1578P4626P9116Q4013Q8624R3485R9330J05912J12607J19475J27034
58885D962828J35623J45372J56136J67147J77676J88361K00746K15252K30853
58876F579994K47032K64513K83626L03600L24289L46878L72038L99115M28236
58867I549321M61318M99503N41071N83517O26563O71612P19515P70209Q23459
58858A5246088Q78287R32627R84879J034815J081530J121621J150783J166147
58850B3596777J165551J145709J102901J034848R40612Q19831O73851N06981L25294
$$ plain form
58918 2898380 2917849 2938195 2959688 2983394 3009928 3038610 3068897 3101984 3139667 3182061 3227761
58907 3227761 3275924 3326866 3380796 3437498 3497295 3560960 3628250 3697542 3767249 3836923 3907028
58896 3907028 3978606 4053232 4132348 4216361 4304985 4398470 4497800 4603712 4716319 4835794 4962828
58885 4962828 5098451 5243823 5399959 5567106 5744782 5933143 6133889 6349141 6579994
58876 6579994 6827026 7091539 7375165 7678765 8003054 8349932 8721970 9121085 9549321
58867 9549321 10010639 10510142 11051213 11634730 12261293 12932905 13652420 14422629 15246088
58858 15246088 16124375 17057002 18041881 19076696 20158226 21279847 22430630 23596777
58850 23596777 24762328 25908037 27010938 28045786 28986398 29806229 30480080 30987061 31312355
58841C1312355J35012n6790k41646m12087n63967o95182q03578q88170r50941
58832B6835006r94953j021491j031339j027736j015135r95359r67598r32073q91322
58823A7958000q48025q03834p60215p18008o76154o33205n90311n50570n15316
58814A1862362m83198m52853m24123l96522l69128l42473l18230k96406k75120
58805H504309k53674k33467k15236j97781j80346j63968j49329j35403j21416
58796F853689j08146r6041q3983p1225n8724m7191l5613k3155j0813N27J2068
58785F331393K5402L9991N4210O7768Q1321R4572J06724J18419J31550J47179
58775G198529J64666J82635J99975K16428K32970K51125K71260K92476L14740
$$ plain form
58841 31312355 31447367 31390577 31148931 30736844 30172877 29477695 28674117 27785947 26835006
58832 26835006 25840053 24818562 23787223 22759487 21744352 20748993 19781395 18849322 17958000
58823 17958000 17109975 16306141 15545926 14827918 14151764 13518559 12928248 12377678 11862362
58814 11862362 11379164 10926311 10502188 10105666 9736538 9394065 9075835 8779429 8504309
58805 8504309 8250635 8017168 7801932 7604151 7423805 7259837 7110508 6975105 6853689
58796 6853689 6745543 6649502 6565519 6494294 6435570 6388379 6352766 6329611 6318798 6319325 6331393
58785 6331393 6356795 6396786 6450996 6518764 6600085 6694657 6801381 6919800 7051350 7198529
58775 7198529 7363195 7545830 7745805 7962233 8195203 8446328 8717588 9010064 9324804
58766I324804L39699L68187L98418M28449M59472M94596N34909N78751O24626
58757A3551911O72690P23113P74984Q27564Q80907R34161R84422J028344J063963
58748B1442059J089699J102190J096528J068795J017331R41356Q39499P10957
58740B9308414N58033L86700K04463J8186j65920l41391n02004o43338p63298
58731B8059845q61161r36821r91080j025872j043766j047408j039388j022029
58723B0092320r97106r66148r30968q93248q53515q11439p67501p23694o81938
58714A2466763o42372o03995n66674n31587m99524m69570m40130m11038l83722
58705G918151l59047l35883l12616k89599k68698k50530k33640k16884k00975
$$ plain form
58766 9324804 9664503 10032690 10431108 10859557 11319029 11813625 12348534 12927285 13551911
58757 13551911 14224601 14947714 15722698 16550262 17431169 18365330 19349752 20378096 21442059
58748 21442059 22531758 23633948 24730476 25799271 26816602 27757958 28597457 29308414
58740 29308414 29866447 30253147 30457610 30475796 30309876 29968485 29466481 28823143 28059845
58731 28059845 27198684 26261863 25270783 24244911 23201145 22153737 21114349 20092320
58723 20092320 19095214 18129066 17198098 16304850 15451335 14639896 13872395 13148701 12466763
58714 12466763 11824391 11220396 10653722 10122135 9622611 9153041 8712911 8301873 7918151
58705 7918151 7559104 7223221 6910605 6621006 6352308 6101778 5868138 5651254 5450279
58696E450279j86711j73192j59454j46592j36217j27458j17818j06886r6935q9492
58686D109524q3371p6914p0355o4882o0794n7649n5200n3041n0392m7297m5256
58675C444373m5509m7249m8503m8330m7176m5485m3219m0776l9317l9674m1371
58664B957764m3105m4060m4541m5398m7113m9653n2812n6053n8071n7532n4762
58653B404664n1843n0239m9198m7434m5431m4453m4064m2660m0332l8941l8822
58642A911247l7577l3403k8072k4919k4889k6012k6282k5494k4308k2911k1228
58631A616152j9627j8630j7959j6479j3414r403n924l736k370j157j7Q54J242
58618A509532M76k014n266p059o613n677n797n925m496k479k061k957k716m54
$$ plain form
58696 5450279 5263568 5090376 4930922 4784330 4648113 4520655 4402837 4295951 4199016 4109524
58686 4109524 4026153 3949239 3878884 3814002 3753208 3695559 3640359 3587318 3536926 3489629 3444373
58675 3444373 3398864 3351615 3303112 3254782 3207606 3162121 3118902 3078126 3038809 2999135 2957764
58664 2957764 2914659 2870599 2826058 2780660 2733547 2683894 2631082 2575029 2516958 2459426 2404664
58653 2404664 2352821 2302582 2253384 2205950 2160519 2116066 2072002 2029342 1989010 1950069 1911247
58642 1911247 1873670 1840267 1812195 1787276 1762387 1736375 1710093 1684599 1660291 1637380 1616152
58631 1616152 1596525 1577895 1559936 1543457 1530043 1520640 1514716 1510980 1508610 1507453 1507436 1508290 1509532
58618 1509532 1510008 1507994 1502728 1495669 1489056 1483379 1477582 1471657 1467161 1464682 1462621 1459664 1456948 1456494
58604A456494K135L644M531N382N751N416N026M830M359L733L737M292M709N589
58590A519628Q398J2655J5761J6453J6436J7821K0921K5378L1061L6716M0032
58579A761260M0706M1490M4685M9502N4316N9436O5499P1211P5398P9871Q7444
58568B430818R7748J07681J15812J23876J33837J45568J58068J71263J85790K01869
58558C872330K19061K36651K54086K71269K88420L05383L21043L33282L39154
58549F440679L35630L21330K97352K65254K24520J73814J14785N2486q559o6492
58539H150799j19603j64447j98442k22491k39062k49195k53301k53310k51665
58530F199283k48938k44429k38231k30789k21469k09755j97206j85979j75701
$$ plain form
58604 1456494 1458629 1462273 1466804 1472186 1477937 1483353 1488379 1493209 1497568 1501301 1505038 1509330 1514039 1519628
58590 1519628 1528026 1540681 1556442 1572895 1589331 1607152 1628073 1653451 1684512 1721228 1761260
58579 1761260 1801966 1843456 1888141 1937643 1991959 2051395 2116894 2188105 2263503 2343374 2430818
58568 2430818 2528566 2636247 2752059 2875935 3009772 3155340 3313408 3484671 3670461 3872330
58558 3872330 4091391 4328042 4582128 4853397 5141817 5447200 5768243 6101525 6440679
58549 6440679 6776309 7097639 7394991 7660245 7884765 8058579 8173364 8225850 8217291 8150799
58539 8150799 8031196 7866749 7668307 7445816 7206754 6957559 6704258 6450948 6199283
58530 6199283 5950345 5705916 5467685 5236896 5015427 4805672 4608466 4422487 4246786
58521D246786j64025j50267j36533j24891j14982j04934r3791q2746p4363p0116
58511C130138o8353o5646o0812n6169n3790n2286m9149m4730m1454m0128l9641
58500B557980l9750m1411m4290m6530m7466m8357m9746n0135m8167m4571m1007
58489B056550l8149l5715l3379l0886k7978k4799k1904j9656j8001j6741j5517
58478A773825j3863j1986j0988j1344j1702j0480q283p245q189j0056j2173j5207
58466A642309j9257k2726k4196k4284k4457k4877k4716k4102k4244k5391k5919
58455A378140k4228k0904j8036j6677j5983j4959j3830j3078j2250j0841r428
58444A207926q611p503m981j893k04k9M90K190L780M136L854L934M582N795P334
$$ plain form
58521 4246786 4082761 3932494 3795961 3671070 3556088 3451154 3357363 3274617 3200254 3130138
58511 3130138 3061785 2996139 2935327 2879158 2825368 2773082 2723933 2679203 2637749 2597621 2557980
58500 2557980 2518230 2476819 2432529 2385999 2338533 2290176 2240430 2190295 2142128 2097557 2056550
58489 2056550 2018401 1982686 1949307 1918421 1890443 1865644 1843740 1824084 1806083 1789342 1773825
58478 1773825 1759962 1747976 1736988 1725644 1713942 1703462 1695179 1687934 1679745 1669689 1657516 1642309
58466 1642309 1623052 1600326 1576130 1551846 1527389 1502512 1477796 1453694 1429450 1404059 1378140
58455 1378140 1353912 1333008 1314972 1298295 1282312 1267353 1253523 1240445 1228195 1217354 1207926
58444 1207926 1199315 1191812 1186831 1184938 1184734 1184705 1185195 1187385 1191165 1195301 1199155 1203089 1207671 1213466 1220800
58429A220800P886O305M078M143O581Q134P051N493N653O362N726M579M789O064
58415A303644P044P837R091R989R564Q516P525N430J439k472m033m145n185p258
58401A346986q919j0299j2445j4559j4924j3921j3256j2914j1745j0414j0641
58390A212949j1896j1866j0020p998o577n037l390k516k085p94J309L091M706
58377A159876P109R532J0094Q954Q189Q460Q311O965N317L898K241O01N1N74J003
58362A241175J089J743L304N224P237R170J0275J0690J2400J6479K0516K1564
58350A360866K0477K0127K0493J9240J6450J4505J3491J0929O514K927J171r00
58338A506290m336p266q600r805j1374j1233q763p105q895j2229j3386j1669r258
$$ plain form
58429 1220800 1228686 1234991 1239069 1243212 1249793 1257927 1264978 1270471 1276124 1282486 1288212 1292791 1297580 1303644
58415 1303644 1310688 1318525 1327616 1337605 1347169 1355685 1363210 1368640 1370079 1367607 1363574 1359429 1354244 1346986
58401 1346986 1338067 1327768 1315323 1300764 1285840 1271919 1258663 1245749 1234004 1223590 1212949
58390 1212949 1201053 1189187 1179167 1171169 1164592 1159555 1156165 1153649 1151564 1150770 1152079 1155170 1159876
58377 1159876 1166985 1176517 1186611 1195565 1203754 1212214 1220525 1227490 1232807 1236705 1238946 1239547 1239598 1240172 1241175
58362 1241175 1242264 1244007 1247311 1252535 1259772 1268942 1279217 1289907 1302307 1318786 1339302 1360866
58350 1360866 1381343 1401470 1421963 1441203 1457653 1472158 1485649 1496578 1503092 1506019 1507190 1506290
58338 1506290 1501954 1494688 1486088 1476283 1464909 1453676 1444913 1437808 1428913 1416684 1403298 1391629 1382371
58325A382371p824p343p383p736q180q408p958o356m125k954l423l455r82K719
58311A308963M842N284O175P823Q480P967Q174R827J1889J4073J6672J8086J6312
58298A444567J2978J1959J3622J4545J3429J2830J3993J4578J3246J2200J3008
58287A590955J3676J2176R565P465N548L533K634L017K719R85j55O33J889K430
58273A657070L431N620P366P561P668R034J0730J1765J2812J4448J6253J8598
58261A782356K2359K6058K6850K5193K4665K6141K6686K5414K5391K7589K8272
58250B066974K5376K2554K3216K5094K4711K3233K3535K4884K4932K4211K4372
58239B333092K4392K2492J9882J9106K0498K3172K7215L2088L5343L5903L6298
$$ plain form
58325 1382371 1374547 1367204 1359821 1352085 1343905 1335497 1327539 1321183 1317058 1314104 1310681 1307226 1306244 1308963
58311 1308963 1313805 1319089 1325264 1333087 1341567 1349534 1357708 1367535 1379424 1393497 1410169 1428255 1444567
58298 1444567 1457545 1469504 1483126 1497671 1511100 1523930 1537923 1552501 1565747 1577947 1590955
58287 1590955 1604631 1616807 1626372 1633837 1639385 1642918 1645552 1648569 1651288 1652273 1652118 1652751 1654640 1657070
58273 1657070 1660501 1666121 1673487 1681048 1688716 1697750 1708480 1720245 1733057 1747505 1763758 1782356
58261 1782356 1804715 1830773 1857623 1882816 1907481 1933622 1960308 1985722 2011113 2038702 2066974
58250 2066974 2092350 2114904 2138120 2163214 2187925 2211158 2234693 2259577 2284509 2308720 2333092
58239 2333092 2357484 2379976 2399858 2418964 2439462 2462634 2489849 2521937 2557280 2593183 2629481
58228B629481L8860M2274M4542M6506M9476N2226N3518N4905N7918O1140O3000
58217C193846O4861O8325P2199P5048P7866Q1372Q3718Q3965Q4824Q8640R3547
58206D068211R6710R8430J00006J00725J00287J01217J05566J11863J18181J25115
58196E126311J33155J40661J47282J55690J67167J79300J90775K04028K20230
58187F664599K36370K50600K65535K82701K98939L12154L25443L41549L58552
58178I336442L75056L94015M17043M40948M64457M92244N27369N66260O06182
58169A3620016O50788P02747P58272Q15065Q77708R48077J018258J081019J140247
58160B1612197J203409J271529J344732J429207J529245J640113J758108J889507
$$ plain form
58228 2629481 2668341 2710615 2755157 2801663 2851139 2903365 2956883 3011788 3069706 3130846 3193846
58217 3193846 3258707 3327032 3399231 3474279 3552145 3633517 3717235 3801200 3886024 3974664 4068211
58206 4068211 4164921 4263351 4363357 4464082 4564369 4665586 4771152 4883015 5001196 5126311
58196 5126311 5259466 5400127 5547409 5703099 5870266 6049566 6240341 6444369 6664599
58187 6664599 6900969 7151569 7417104 7699805 7998744 8310898 8636341 8977890 9336442
58178 9336442 9711498 10105513 10522556 10963504 11427961 11920205 12447574 13013834 13620016
58169 13620016 14270804 14973551 15731823 16546888 17424596 18372673 19390931 20471950 21612197
58160 21612197 22815606 24087135 25431867 26861074 28390319 30030432 31788540 33678047
58152C3678047K040582K208553K393082K606641K861406L155740L485976L861388
58144E6291415M295654M797692N387252O105151O986255Q031543R227156J0583649
58136A11705767J2139741J3934587J5980391J8232179K0575223K2910237K5317657
58129B40795782K8073036L1329475L4665757L6947213L6689828L2683945K4540880
58122D65725916J3001769j08554j2428199k1976293k7885519l0439034l0518207
58115C55371879k9035566k6721859k4146811k1722561j9662244j7994866j6641596
58108A99446376j5483880j4406992j3337679j2255552j1158851j0028009q837585
58101A13937828p594578o345620n144716m021539k979051k017277j166157n04990
$$ plain form
58152 33678047 35718629 37927182 40320264 42926905 45788311 48944051 52430027 56291415
58144 56291415 60587069 65384761 70772013 76877164 83863419 91894962 101122118 111705767
58136 111705767 123845508 137780095 153760486 171992665 192567888 215478125 240795782
58129 240795782 268868818 300198293 334864050 371811263 408501091 441185036 465725916
58122 465725916 478727685 478619131 466190932 444214639 416329120 385890086 355371879
58115 355371879 326336313 299614454 275467643 253745082 234082838 216087972 199446376
58108 199446376 183962496 169555504 156217825 143962273 132803422 122775413 113937828
58101 113937828 106343250 99997630 94852914 90831375 87852324 85835047 84668890 84163900
58093H4163900j49035k04826p14045j605741k682332l674822m363102m677202
58085F6092795m688851m513133m231202l891862l540356l215687k933547k691932
58077C6386225k487120k312972k155323k002215j854777j718391j590184j464897
58069B0800346j345633j238067j139923j046100r58639q82002q13494p47857o86824
58060A1941807o35024n90368n47324n06102m70264m38493m06976l77081l52823
58051G617352l33273l14816k98407k87310k79912k71664k62128k53552k44725
58042E071565k33008k20371k10594k02120j90254j75316j62188j52640j44008
58033C381066j34846j26262j18205j09582j01612r6412r2929q8523q3558p9956
$$ plain form
58093 84163900 84014865 83810039 83095994 81490253 78807921 75133099 70769997 66092795
58085 66092795 61403944 56890811 52659609 48767747 45227391 42011704 39078157 36386225
58077 36386225 33899105 31586133 29430810 27428595 25573818 23855427 22265243 20800346
58069 20800346 19454713 18216646 17076723 16030623 15071984 14189982 13376488 12628631 11941807
58060 11941807 11306783 10716415 10169091 9662989 9192725 8754232 8347256 7970175 7617352
58051 7617352 7284079 6969263 6670856 6383546 6103634 5831970 5569842 5316290 5071565
58042 5071565 4838557 4618186 4407592 4205472 4015218 3839902 3677714 3525074 3381066
58033 3381066 3246220 3119958 3001753 2892171 2790559 2694147 2601218 2512695 2429137 2349181
58023B349181p6603p0970o4262o0037n8551n6994n4626n3030n1897m9197m5380
58012A707634m3017m2347m1031l8197l5173l2460k9528k7175k6661k6891k5720
58001A339434k3468k1858k0480j7824j5056j4831j6772j7856j7019j5901j5237
57990A143132j4060j2375j1252j0287q106n426m488n461o328o261o247o497o100
57977A040244n176m697m339l084j496q02k88J461L400L166R84p91j622k923m454
57962A019583m206k082l47Q2O47J854K161R39l17o48r99j996k804l028l559m791
57946A000489o047p350r551j2117j3020j1651r805q998q657p760o379m952l743
57933H90459l654n728r055j0916j0004p996p147p554p788p036n707m448l310j682
$$ plain form
58023 2349181 2272578 2201608 2137346 2077309 2018758 1961764 1907138 1854108 1802211 1753014 1707634
58012 1707634 1664617 1622270 1581239 1543042 1507869 1475409 1445881 1418706 1392045 1365154 1339434
58001 1339434 1315966 1294108 1273628 1255804 1240748 1225917 1209145 1191289 1174270 1158369 1143132
57990 1143132 1129072 1116697 1105445 1095158 1087052 1081626 1077138 1071677 1065349 1059088 1052841 1046344 1040244
57977 1040244 1035068 1030371 1026032 1022948 1021452 1020650 1020362 1021823 1025223 1028389 1029373 1028582 1026960 1024037 1019583
57962 1019583 1015377 1013295 1012948 1013030 1013677 1015531 1017692 1018631 1018314 1017666 1016667 1014671 1011867 1008839 1005280 1000489
57946 1000489 994442 987092 977541 965424 952404 940753 930948 921950 913293 905533 899154 894202 890459
57933 890459 886805 881077 872022 861106 851102 843106 835959 828405 820617 813581 807874 803426 800116 798434
57919G98434Q88L614M869M270L401L561L930L382K698L156L952L449K099J650
57905H43353J861P20k143m825o176o938p523p048n348l814l511m127n390p604
57891G81487j0109j1023r475o817m894m230m243m072k986j136J6o78k182k516
57877G17142j774k027m165o758q353r046r351r288r169r671j0539j0728j0217
57864F16056j0074j0300r384o778m160l313l967m609m307l029j106R82K875M709
57850E63595O600Q082R005J0426J3081J5425J5132J2512J0367J0189J0604J0055
57838F95073Q896Q010P195N972M526K893N46k272m193m513m184m313m833n350
57824G03453o083p166p986p986p316o341n373m987n451n866n135l768l029k431
$$ plain form
57919 798434 799322 802936 807805 812075 815476 819037 822967 826349 829047 832203 836155 839604 841703 843353
57905 843353 845214 845934 843791 838966 832790 825852 818329 811281 805933 802119 798608 794481 789091 781487
57891 781487 771378 760355 750880 744063 739169 734939 730696 726624 723638 722502 722518 721840 719658 717142
57877 717142 715368 713341 709176 702418 694065 685019 675668 666380 657211 647540 637001 626273 616056
57864 616056 605982 595682 586298 579520 575360 572047 568080 563471 559164 556135 555029 556011 558886 563595
57850 563595 570195 578277 587282 597708 610789 626214 641346 653858 664225 674414 685018 695073
57838 695073 703969 711979 719174 725146 729672 732565 733111 730839 726646 722133 717949 713636 708803 703453
57824 703453 697370 690204 682218 674232 666916 660575 655202 650215 644764 638898 633763 629995 626966 624535
57810F24535k42L268N562N578N244O076O649N258L085K522L722M880N054M631
57796F85822L746K100J99p94m33P10J845K244J276q54k863l710l717l740l882
57781F77949l863l987m705n724o411o724p058p489p865q289q925r625j0178j0497
57767E76609j0504j0403j1025j2916j4907j4972j3011j1300j1473j2420j2267
57756D41411j1060j0097r600q767p448o349n759n363m986m522l441j484M62J292
57742C64289J300J697K663L078K479K244M136Q030J1631J2542J0511P491N431
57729D37522M336K941Q51r44j607j458j145p68k54K06M48L27p95l480o819q737
57713D20624q252o415m542k703o96Q64J365J144O08m03j434r64J405L486L067
$$ plain form
57810 624535 624293 627561 633123 638701 643945 650021 656670 661928 665013 667535 671257 676137 681191 685822
57796 685822 689568 691668 691867 691073 690640 691350 693195 695439 696715 695861 692998 689288 685571 681831 677949
57781 677949 674086 670099 665394 659670 653259 646535 639477 631988 624123 615834 606909 597284 587106 576609
57767 576609 566105 555702 544677 531761 516854 501882 488871 477571 466098 453678 441411
57756 441411 430351 420254 410654 401887 394439 388090 382331 376968 371982 367460 364019 362535 362997 364289
57742 364289 365589 367286 369949 373027 375506 377750 381886 389916 401547 414089 424600 432091 437522
57729 437522 441858 444799 445650 444706 443099 441641 440496 439728 439474 439680 440128 440455 439660 436180 429361 420624
57713 420624 412372 405957 401415 398712 398016 398880 400245 401389 401997 401594 400160 399196 400601 404087 407154
57698D07154J155P62K785N107N769N128M418L897L293K903L145L591L400K562
57684D55069K073K741M194N325N705O172P651R688J0829J0439R386Q836R136J0098
57670E57342J1410J2369J2232J1389J1262J2402J3665J4030J4133J5011J6339
57659G01584J7209J7860J9102K0611K1440K1999K3825K7136L0115L1200L1111
57648I63192L1899L4637L8593M2281M4867M6670M8588N1230N4744N9305O5143
57637A481149P1946P8950Q5981R3633J01970J10046J17657J26631J39117J54912
57627B561992J71728J87880K03557K19513K35774K52030K68150K83662K97117
57618D681403L06518L10238L07251K96607K77061K47839K10333J68852J28516
$$ plain form
57698 407154 408309 409071 411856 416963 422732 427860 432278 436175 439468 442371 445516 449107 452507 455069
57684 455069 457142 459883 464077 469402 475107 481279 488930 498618 509447 519886 529272 538108 547244 557342
57670 557342 568752 581121 593353 604742 616004 628406 642071 656101 670234 685245 701584
57659 701584 718793 736653 755755 776366 797806 819805 843630 870766 900881 932081 963192
57648 963192 995091 1029728 1068321 1110602 1155469 1202139 1250727 1301957 1356701 1416006 1481149
57637 1481149 1553095 1632045 1718026 1811659 1913629 2023675 2141332 2267963 2407080 2561992
57627 2561992 2733720 2921600 3125157 3344670 3580444 3832474 4100624 4384286 4681403
57618 4681403 4987921 5298159 5605410 5902017 6179078 6426917 6637250 6806102 6934618
57609F934618R1714N6877K0728j9070o3420j11963j61958k07858k43783k66852
57599F029033k77686k78439k71568k59932k46214k31702k16532k01175j86653
57590C859132j73068j59167j43969j28093j12894r8838q5380p2165n9652m8324
57580B777582l7769k7035j5920n252M504J4299K5229L6788M7721N8361P0426Q4250
57568C033184R8184J11351J25037J40104J55008J68131J80435J93611K06716K16913
57558D628674K22677K23901K19417K06920J85437J55791J18789P5232K7845j9212
57548F045471o3300j03797j39490j67994j88658k03674k14860k21281k21699k17750
57538D302968k12647k07622k01556j93647j84779j76188j67903j58990j48721
$$ plain form
57609 6934618 7026332 7083209 7103937 7084867 7021447 6909484 6747526 6539668 6295885 6029033
57599 6029033 5751347 5472908 5201340 4941408 4695194 4463492 4246960 4045785 3859132
57590 3859132 3686064 3526897 3382928 3254835 3141941 3043103 2957723 2885558 2825906 2777582
57580 2777582 2739813 2712778 2696858 2691606 2696110 2710409 2735638 2772426 2820147 2878508 2948934 3033184
57568 3033184 3131368 3242719 3367756 3507860 3662868 3830999 4011434 4205045 4411761 4628674
57558 4628674 4851351 5075252 5294669 5501589 5687026 5842817 5961606 6036838 6064683 6045471
57548 6045471 5982171 5878374 5738884 5570890 5382232 5178558 4963698 4742417 4520718 4302968
57538 4302968 4090321 3882699 3681143 3487496 3302717 3126529 2958626 2799636 2650915
57529B650915j37480j26621j17333j09532j02236r4848q7520q0353p3189o6363
57519A655440o0606n5895n1276m6239m1424l7554l4550l2030k9921k8024k5752
57508A212169k2719j9158j5524j2363j0458r998r534p002k297K370N108O227P107
57495A123928Q567J0941J4340J7814J9650J9698K0348K3820K9367L4413L7763
57484A360649M0277M3061M6519N0934N6439O2343O7646P2546P8460Q6250R5152
57473B060276J03747J11616J19647J28978J39674J50550J60186J67912J73516
57464C316102J76438J75976J72006J64446J52075J33254J08161P9052M7840J4783
57454D540133j9695n3298q3156j07826j27084j40821j49452j54491j57296j57776
$$ plain form
57529 2650915 2513435 2386814 2269481 2159949 2057713 1962865 1875345 1794992 1721803 1655440
57519 1655440 1594834 1538939 1487663 1441424 1400000 1362446 1327896 1295866 1265945 1237921 1212169
57508 1212169 1189450 1170292 1154768 1142405 1131947 1121949 1112415 1105413 1103116 1105486 1110594 1116821 1123928
57495 1123928 1132495 1143436 1157776 1175590 1195240 1214938 1235286 1259106 1288473 1322886 1360649
57484 1360649 1400926 1443987 1490506 1541440 1597879 1660222 1727868 1800414 1878874 1965124 2060276
57473 2060276 2164023 2275639 2395286 2524264 2663938 2814488 2974674 3142586 3316102
57464 3316102 3492540 3668516 3840522 4004968 4157043 4290297 4398458 4477510 4525350 4540133
57454 4540133 4520438 4467140 4383984 4276158 4149074 4008253 3858801 3704310 3547014 3389238
57444C389238j55507j51341j46519j40908j33587j24890j16277j08378j00534
57435B211297r2221q3572p4553o4899n5065m6069l8128l0535k3081j6558j1476
57424A675140p026j835M756J2286J9724K6412L2802M0047M8585N7539O5932P3915
57412B048277Q2156R0766R9740J09751J21266J33266J44027J52888J60087J65208
57402C307432J67009J64613J57457J44318J23884R6547O4340K9059q226m5635
57392D200798q0115j09356j32987j51360j64302j71797j75011j75638j74593j71848
57382B693791j67124j60604j53226j46297j40168j33553j25130j15733j07689
57373A444267j01771r6125q8854q0514p3185o7834o3503n8653n2735m6601m1790
$$ plain form
57444 3389238 3233731 3082390 2935871 2794963 2661376 2536486 2420209 2311831 2211297
57435 2211297 2119076 2035504 1960951 1896052 1840987 1794918 1756790 1726255 1703174 1686616 1675140
57424 1675140 1668114 1666279 1671035 1683321 1703045 1729457 1762259 1802306 1850891 1908430 1974362 2048277
57412 2048277 2130433 2221199 2320939 2430690 2551956 2685222 2829249 2982137 3142224 3307432
57402 3307432 3474441 3639054 3796511 3940829 4064713 4161260 4225600 4254659 4246433 4200798
57392 4200798 4120683 4011327 3878340 3726980 3562678 3390881 3215870 3040232 2865639 2693791
57382 2693791 2526667 2366063 2212837 2066540 1926372 1792819 1667689 1551956 1444267
57373 1444267 1342496 1246371 1157517 1077003 1003818 935984 872481 813828 761093 714492 672702
57362F72702l9111l7783l6294l3993l1313k8635k5876k3214k1260k0213j9699
57351C55311j9492j9503j9031j7217j4567j2720j2354j2418j2006j1611j1761
57340A92631j1720j0678r245q493q254p566o345n460n382n739o038o085n809n291
57326I0526m851m599m232l589l004k653k174j537j642l157n176n974m988l378
57312C9572k633l205m436n354n479n128m935C363a663m601l905l052k117j617
57298a6955k231l650m562m288l612l378l185k335j337j387k680m165m788m232
57284f2785k763j130m06j155k697l768l781l032k051j268j067j444j792j529p97
57269i1465p7M79Q65Q31L85L17J272K577K904K163J767K748M370N115M524L456
$$ plain form
57362 672702 633591 595808 559514 525521 494208 465573 439697 416483 395223 375010 355311
57351 355311 335819 316316 297285 280068 265501 252781 240427 228009 216003 204392 192631
57340 192631 180911 170233 160988 152495 144241 136675 130330 124870 119488 113749 107711 101626 95817 90526
57326 90526 85675 81076 76844 73255 70251 67598 65424 63887 62245 59088 53912 47938 42950 39572
57312 39572 36939 33734 29298 23944 18465 13337 8402 3363 -1663 -6264 -10169 -13221 -15338 -16955
57298 -16955 -19186 -22836 -27398 -31686 -35298 -38676 -41861 -44196 -45533 -46920 -49600 -53765 -58553 -62785
57284 -62785 -65548 -66678 -67084 -68239 -70936 -74704 -78485 -81517 -83568 -84836 -85903 -87347 -89139 -90668 -91465
57269 -91465 -91542 -91063 -90198 -89367 -88982 -88665 -87393 -84816 -81912 -79749 -77982 -75234 -70864 -65749 -61225 -57769
57253e7769K813K668K754L198M241N501O252O604P660f169E975J2938J2665J3137
57239D4715J5199J7801J9529K0182K0654K2100K5257K9620L3207L4234L3322L3080
57227C48900L5071L8191M0385M0996M1000M1692M3570M5811M6764M5683M3792
57216H11855M2561M1324L8133L2732K6614K0128J1990K339o356j2745j8571k5573
57204I64431l2441l6928l9222m1040m2639m2949m1748l9708l7004l3688l0761
57193E46303k9070k7751k5312k1709j7929j4293j0607p388n229l653j850R8J972
57180C83582M473Q184J2298J5676J8169J9785J9957J8994J8718K0020K1401K1681
57168E82938K2313K4678K7062K7055K5537K5162K6085K6350K5549K4977K4808
$$ plain form
57253 -57769 -54956 -52288 -49534 -46336 -42095 -36594 -30342 -23738 -16078 -6169 5975 18913 31578 44715
57239 44715 59914 77715 97244 117426 138080 160180 185437 215057 248264 282498 315820 348900
57227 348900 383971 422162 462547 503543 544543 586235 629805 675616 722380 768063 811855
57216 811855 854416 895740 933873 966605 993219 1013347 1025337 1027676 1021320 1008575 990004 964431
57204 964431 931990 895062 855840 814800 772161 729212 687464 647756 610752 577064 546303
57193 546303 517233 489482 464170 442461 424532 410239 399632 392244 387015 383362 381512 381610 383582
57180 383582 388055 396239 408537 424213 442382 462167 482124 501118 519836 539856 561257 582938
57168 582938 605251 629929 656991 684046 709583 734745 760830 787180 812729 837706 862514
57157H62514K4297K4288K6246K9039K9937K8894K8831L1513L5917M0653M5187
57146A207316M8577M9897N0385N2533N6790O1327O4851O7252O7877O5980O2719
57135A855504O0063N8046N5830N4484N5343N6404N4377N0026M7194M6595M5054
57124B438920M1361L8175L7047L6071L4094L3101L4541L6950L9006M1496M4659
57113B855421M6976M8150M9802N1642N0595M5496L9257L4511L0556K6372K2885
57102C301663K0194J5996R191K006l591q439j3332j7050j9351k2509k7390l1091
57090C206297l0896k7701k3402j7901j0932m010J486N606P633N565r46j0233k2234
57077C078332l8690n8856p9274r8913j19800j41425j60159j76116j94808k19351
$$ plain form
57157 862514 886811 911099 937345 966384 996321 1025215 1054046 1085559 1121476 1162129 1207316
57146 1207316 1255893 1305790 1356175 1408708 1465498 1526825 1591676 1658928 1726805 1792785 1855504
57135 1855504 1915567 1973613 2029443 2083927 2139270 2195674 2250051 2300077 2347271 2393866 2438920
57124 2438920 2480281 2518456 2555503 2591574 2625668 2658769 2693310 2730260 2769266 2810762 2855421
57113 2855421 2902397 2950547 3000349 3051991 3102586 3148082 3187339 3221850 3252406 3278778 3301663
57102 3301663 3321857 3337853 3347044 3349050 3345459 3337020 3323688 3306638 3287287 3264778 3237388 3206297
57090 3206297 3175401 3147700 3124298 3106397 3095465 3091455 3092941 3098547 3106180 3111745 3110799 3100566 3078332
57077 3078332 3039642 2980786 2901512 2802599 2682799 2541374 2381215 2205099 2010291 1790940
57067A790940k46554k73529l02525l36060B59544a51642m53142m99323n48067
57058a652174o00543o61736p33554q13098r00080r98799j110310j230733j360351
57049a0061378j505782j669998j849501k044850k263817k510943k785640l094218
57041b7786127l450526l860959m325213m858439n497764o283182p247889q417735
57033g1727834r776306j1224341j2636612j3997922j5418582j6933232j8316489
57026a70031318j9207250j9452828j9276123j9079751j9121517j9355426j9460025
57019c04984238j8940878j7298485j4267795r981402m898513M25437N511728J0002625
57011c54431521J3675723J6472507J8470304J9783501K0493380K0661305K0357617
$$ plain form
57067 1790940 1544386 1270857 968332 632272 259544 -151642 -604784 -1104107 -1652174
57058 -1652174 -2252717 -2914453 -3648007 -4461105 -5361185 -6359984 -7470294 -8701027 -10061378
57049 -10061378 -11567160 -13237158 -15086659 -17131509 -19395326 -21906269 -24691909 -27786127
57041 -27786127 -31236653 -35097612 -39422825 -44281264 -49779028 -56062210 -63310099 -71727834
57033 -71727834 -81504140 -92728481 -105365093 -119363015 -134781597 -151714829 -170031318
57026 -170031318 -189238568 -208691396 -227967519 -247047270 -266168787 -285524213 -304984238
57019 -304984238 -323925116 -341223601 -355491396 -365472798 -370371311 -369945874 -364434146 -354431521
57011 -354431521 -340755798 -324283291 -305812987 -286029486 -265536106 -244874801 -224517184
57004b24517184J9648686J8584879J7233083J5710025J4163956J2730188J1508041
56997a14938326J0551790R852621R334369Q890958Q438604P936978P378953O777895
56989d5776158O158764N544558M947388M375669L843320L363888K940402K568655
56981a2033514K245979J969707J731905J523764J342479J187651i77514d0691
56972G92044P41752O59418N81595N10833M52154M04651L62743L23378K86447K50203
56962E365218K11959J72436J34998J01691P3407N1908L7655K7212J6550N547l629
56951F194952j0441j5129j6275j2662n756K606J2433K2320K6748K0830O425r835
56939F216216k3583l5903n2115p9971j25644j86916k51532l05395l41453l59299
$$ plain form
57004 -224517184 -204868498 -186283619 -169050536 -153340511 -139176555 -126446367 -114938326
56997 -114938326 -104386536 -94533915 -85199546 -76308588 -67869984 -59933006 -52554053 -45776158
56989 -45776158 -39617394 -34072836 -29125448 -24749779 -20906459 -17542571 -14602169 -12033514
56981 -12033514 -9787535 -7817828 -6085923 -4562159 -3219680 -2032029 -977514 -40691
56972 792044 1533796 2193214 2774809 3285642 3737796 4142447 4505190 4828568 5115015 5365218
56962 5365218 5577177 5749613 5884611 5986302 6059709 6111617 6149272 6176484 6193034 6198581 6194952
56951 6194952 6184511 6169382 6153107 6140445 6134689 6137295 6149728 6172048 6198796 6219626 6226051 6216216
56939 6216216 6192633 6156730 6104615 6024644 5899000 5712084 5460552 5155157 4813704 4454405
56929D454405l60104l46218l23139k97044k71026k46386k25356k08911j94166
56920A982055j78219j63044j52599j46557j41199j35169j29748j24125j15361
56911F96034j03472r2271q4023p6732o7778n7515m7956m0049l3237k6458j9013
56900D7530j1449n387j560J203L826N018L237n43m082o976j0349F269a0847j8154
56886b9001j7120j3754q418k961J025M083P340J0219J1710J2882h377A1179K2684
56873C3863K4542K6540K9191L1142L1051K8613K3899J7208R533J945n058j0689
56861B41780j3455j3148j2017j2227j3113j2842j1725j1556j2464j2747j1647
56850A04839j0171r339r254r719j0261j0004q858q093q363q252F050A732b062
$$ plain form
56929 4454405 4094301 3748083 3424944 3127900 2856874 2610488 2385132 2176221 1982055
56920 1982055 1803836 1640792 1488193 1341636 1200437 1065268 935520 811395 696034
56911 696034 592562 500291 416268 339536 271758 214243 166287 126238 93001 66543 47530
56900 47530 36081 30694 29134 30337 34163 39181 42418 41875 37793 30817 20468 6269 -10847 -29001
56886 -29001 -46121 -59875 -68293 -71254 -70229 -66146 -58806 -48587 -36877 -23995 -8377 11179 33863
56873 33863 58405 84945 114136 145278 176329 204942 228841 246049 255582 257527 252469 241780
56861 241780 228325 215177 203160 190933 177820 164978 153253 141697 129233 116486 104839
56850 104839 94668 85329 76075 66356 56095 46091 37233 29140 20777 12525 6050 1732 -2062
56836f539m377l100j680J2K993e981C461J1085J3178J6287J9479K2265K4793K6125
56822A36673K4771K1204J7734J5504J3623J1645J0724J1645J3435J4800J5595
56811C07353J6216J6705J7051J7470J8003J8523J9241K0568K2637K5564K9644
56800E28975L4425L8144L9124L7166L2668K5296J4913L176p176j4337j7946j8421
56788F96007j6844j4606j2029q250l277J362M965Q809J3547J7784K1268K6930
56776G35666L6877M8202N6101N9480N9954N6861M7551L2218J4506k642j8170l0258
56764A096346l6639l8164l8253l8077l5715l0787k6066k3162k0144j5162r248
56753G84929l711K329R641J6625K1627K5392K9071L1407K9999K4126J4755L116
$$ plain form
56836 -6539 -10916 -14016 -15696 -15684 -12691 -5981 3461 14546 27724 44011 63490 85755 110548 136673
56822 136673 161444 182648 200382 215886 229509 241154 251878 263523 276958 291758 307353
56811 307353 323569 340274 357325 374795 392798 411321 430562 451130 473767 499331 528975
56800 528975 563400 601544 640668 677834 710502 735798 750711 753887 746711 732374 714428 696007
56788 696007 679163 664557 652528 644278 641001 642363 647328 656137 669684 687468 708736 735666
56776 735666 772543 820745 876846 936326 996280 1053141 1100692 1132910 1147416 1144774 1126604 1096346
56764 1096346 1059707 1021543 983290 945213 909498 878711 852645 829483 809339 794177 784929
56753 784929 781218 783547 793188 809813 831440 856832 885903 917310 947309 971435 986190 989306
56741I89306r187j9876k7441l2084l4371l4160l1839k9149k7376k5810k3121j9396
56729F75496j5715j2629r855o859l132J295N413Q232J0300J2796J5047J4563J0019
56716G04971K659n513j3160j8855k1057j9956j7870j6961j7610j9147k0510k0002
56704E16989j6598j2093r795j0482j1721j1877j2087j3260j3846j2384j0045q657
56692C74144q035p102n980n248m575l858m018n093n227l444j663j892k990k676
56678C12343j420j577l391m617l948k504j676j411j047m73l7j71j210k888m206
56663B81767m338l381j856l00M09n39k455l343k405j097p99q88k74N88P17L81
56647B62187K53m7j016j882j804j476j904k506k272j811k372l476l631k938k894
$$ plain form
56741 989306 980119 960243 932802 900718 866347 832187 800348 771199 743823 718013 694892 675496
56729 675496 659781 647152 637297 630438 627306 628601 634014 642246 652546 665342 680389 694952 704971
56716 704971 707630 702117 688957 670102 649045 629089 611219 594258 576648 557501 536991 516989
56704 516989 500391 488298 478503 468021 456300 444423 432336 419076 405230 392846 382801 374144
56692 374144 366109 359007 353027 347779 343204 339346 335328 330235 325008 321564 319901 318009 315019 312343
56678 312343 310923 309346 305955 301338 297390 294886 293210 291799 290752 290279 290242 290071 288861 285973 281767
56663 281767 277429 274048 272192 271892 272301 271762 269307 265964 263559 262462 261663 260775 260501 261089 261806 262187
56647 262187 262440 262393 261377 259495 257691 256215 254311 251805 249533 247722 245350 241874 238243 235305 232411
56632B32411l794m205l185j416k3M44p7j017j130J65J656J832J165J364K680L604
56616B30474L311K727K823L287L403L102K650K152J771J791K142K416K471K474
56602B66994K442K199J733J156N73M15J394L487N389N748M742L678L359L477L424
56587C10210L095K968L605M816N345M110J831M71Q14J775K368K854L434L487L068
56572C54251L422M781N289L704J635J294K245K345Q85j129k868l943l530j358
56558C67023J031J800J187O84O88P14J052J979K232N95j596j987q07m39j686l089
56542C69381l731l985l537j590O45P41j094j875m42P78r3j495j391m45j3O46K553
56525C55053M102K893m38k784k703j682j386j504r15M81J710J852R45k2o9O81
$$ plain form
56632 232411 228617 224412 221227 219811 219788 220232 220155 219138 218008 218173 219829 221661 222826 224190 226870 230474
56616 230474 233785 236512 239335 242622 246025 249127 251777 253929 255700 257491 259633 262049 264520 266994
56602 266994 269436 271635 273368 274524 275097 275512 276906 280393 285782 291530 296272 299950 303309 306786 310210
56587 310210 313305 316273 319878 324694 330039 334149 335980 336451 337265 339040 341408 344262 347696 351183 354251
56572 354251 357673 362454 367743 371447 373082 374376 376621 378966 379851 378722 375854 371911 368381 367023
56558 367023 368054 369854 371041 371725 372413 373127 374179 376158 378390 378985 377389 375402 374595 374156 372470 369381
56542 369381 365650 361665 358128 356538 357183 357924 356830 354955 354513 355291 355198 353703 352312 351867 351854 352500 355053
56525 355053 359155 362048 361610 358826 356123 354441 353055 351551 350636 351117 352827 354679 355624 355602 355533 356214
56509C56214J215J114J142J976L213M113M633N020N065M530L838L602L832M068
56495D03575M110M017L799L523L387L425L397L248L225L317L072K158P26r13k427
56480D41639l277l017k053j401j547k106k695l379m081m321l904l200k566k032
56466D02060j669j570j463j139j189k342m018m606l496j786o73j97J9j77j018
56451C76736k255l462m236l909k077K82J263J80j598k378j796n18O74J081M51
56436C58438l96l83O2o12k463l411k131p4O48J20n8O27J269J141L30q81j943j782
56418C48501J87K907M566M528L645K868K453K311K355K551L026L968N035N347
56404C94248M535L321K590K452K648L165L767L700K688J711J921L185M265M133
$$ plain form
56509 356214 357429 358543 359685 361661 364874 368987 373620 378640 383705 388235 392073 395675 399507 403575
56495 403575 407685 411702 415501 419024 422411 425836 429233 432481 435706 439023 442095 444253 444979 444066 441639
56480 441639 438362 435345 433292 431891 430344 428238 425543 422164 418083 413762 409858 406658 404092 402060
56466 402060 400391 398821 397358 396219 395030 392688 388670 384064 380568 378782 378109 377912 377931 377754 376736
56451 376736 374481 371019 366783 362874 360797 361079 362342 362522 360924 358546 356750 356232 356906 357987 358438
56436 358438 358042 357659 357721 357109 354646 351235 349104 349030 349678 349798 349740 350367 351636 352777 353107 352226 350283 348501
56418 348501 348688 351595 356161 360689 364334 367202 369655 371966 374321 376872 379898 383866 388901 394248
56404 394248 398783 402104 404694 407146 409794 412959 416726 420426 423114 424825 426746 429931 434196 438329
56390D38329K565J35j918k464j691q78o33l88L2k39j251j306O58L026L480K059
56374D39516N66j85p07j072q26l52m15n89L1Q30L42j107j644r34q49k381l964
56357D26260l993l207l261m152m509l617k024o83k70q40j551j350l92O4m80j014
56341C94981p44l47o62j153q44J27J094K181L765N220N664N579O140P033O702
56326D34736M929L526L712M268L352J103q33j666j975k200k057j615j551j792
56312D41937j062J280L748M259K790J334J256J896K101J981K347L215L879M103
56298D75064M296M583M487L707K570J612J207J686L190N048N897N014L382K752
56284E24495L614M609M327L207K912L936M809M177K879K896M679O697P713Q176
$$ plain form
56390 438329 440894 441029 439111 436647 434956 434078 433445 433057 433089 432850 431599 430293 430951 433977 437457 439516
56374 439516 440082 439897 439190 438118 437292 436940 436525 435936 435967 436797 437139 436032 434388 433454 432605 430224 426260
56357 426260 422267 419060 415799 411647 407138 403521 401497 400814 400544 399704 398153 396803 396411 396475 395995 394981
56341 394981 394237 393890 393228 392075 391231 391358 392452 394633 398398 403618 409282 414861 421001 428034 434736
56326 434736 439665 443191 446903 451171 454523 455626 454793 453127 451152 448952 446895 445280 443729 441937
56312 441937 440875 442155 445903 450162 452952 454286 455542 457438 459539 461520 463867 467082 470961 475064
56298 475064 479360 483943 488430 492137 494707 496319 497526 499212 502402 507450 513347 518361 521743 524495
56284 524495 528109 532718 537045 540252 543164 547100 551909 556086 558965 561861 566540 573237 580950 589126
56270E89126Q845R266Q751Q045Q721J1000J3203J3681J2574J1463J1602J2706
56258G18983J3345J2557J1099J0785J2475J5059J6755J6916J6167J5273J4482
56247H73896J3598J2187R902P173N153M521M664M695M695N199N850N725M842M368
56233I66468N160O920Q957J0939J2686J4012J5131J6684J8979K1597K3911K5712
56221A147156K7267K9159L1972L5782L9967M3921M7725N1575N5022N7698O0609
56210A627853O5495P2690Q0656Q8074R5336J03570J13026J23313J34418J46501
56200B650932J59052J71224J82955J94926K07278K19049K29216K37762K45064
56191D497458K50461K52129K48802K40948K29561K14184J93456J67707J39602
$$ plain form
56270 589126 597971 607237 615988 624033 632754 643754 656957 670638 683212 694675 706277 718983
56258 718983 732328 744885 755984 766769 779244 794303 811058 827974 844141 859414 873896
56247 873896 887494 899681 909583 916756 921909 926430 931094 935789 940484 945683 951533 957258 962100 966468
56233 966468 971628 978548 987505 998444 1011130 1025142 1040273 1056957 1075936 1097533 1121444 1147156
56221 1147156 1174423 1203582 1235554 1271336 1311303 1355224 1402949 1454524 1509546 1567244 1627853
56210 1627853 1693348 1766038 1846694 1934768 2030104 2133674 2246700 2370013 2504431 2650932
56200 2650932 2809984 2981208 3164163 3359089 3566367 3785416 4014632 4252394 4497458
56191 4497458 4747919 5000048 5248850 5489798 5719359 5933543 6126999 6294706 6434308
56182F434308J11389Q2677N2256K1183p575l2307n3697p2775q9403j03191j14497
56171F228368j23785j31113j36924j42364j48067j53412j57655j61083j64313
56162D909652j67173j69046j69852j69995j69572j68343j66085j62725j58357
56153C408504j53384j48129j42184j34896j26763j19317j13150j07121j00341
56144B263219r3734q8425q3538p7267o9787o3263n8797n4977n0192m5070m1455
56133A536714l9685l8086l5197l1453k8248k6000k3909k1355j8678j6308j3867
56122A243928j0865p751n380l732k004J31K285M403O919R662J1655J2445J2658
56109A274354J2842J2774J2544J3150J5088J7213J8060J7620J6825J5930J4575
$$ plain form
56182 6434308 6545697 6628374 6680630 6701813 6694238 6661931 6608234 6535459 6446056 6342865 6228368
56171 6228368 6104583 5973470 5836546 5694182 5546115 5392703 5235048 5073965 4909652
56162 4909652 4742479 4573433 4403581 4233586 4064014 3895671 3729586 3566861 3408504
56153 3408504 3255120 3106991 2964807 2829911 2703148 2583831 2470681 2363560 2263219
56144 2263219 2169485 2081060 1997522 1920255 1850468 1787205 1728408 1673431 1623239 1578169 1536714
56133 1536714 1497029 1458943 1423746 1392293 1364045 1338045 1314136 1292781 1274103 1257795 1243928
56122 1243928 1233063 1225312 1219932 1216200 1214196 1214327 1216612 1221015 1227934 1237596 1249251 1261696 1274354
56109 1274354 1287196 1299970 1312514 1325664 1340752 1357965 1376025 1393645 1410470 1426400 1440975
56098A440975J3102J2502J3110J4226J5067J5432J5516J5853J7235K0092K3972
56087A617082K8096L2210L6426M0673M4987N0008N6461O4384P3298Q2825R2628
56076B219078J02321J11896J21481J29950J34728J34116J29131J21983J13640
56067C318324J04271R5130Q7858Q2030P5398O6756N6839M6147L3801J9410M578
56056C990542q502j9154k8395l7919m9383o3528p9211r3928j05736j14091j18883
56045C271812j20008j18173j14731j09994j02954r3472q3480p4981o7892o1043
56035B325084n4384m8868m4684m1031l7445l4246l1680k9545k7682k6141k4853
56024A924525k3594k2218k0423j7592j3463q819m978k586j267l83L86J130J939
$$ plain form
56098 1440975 1454077 1466579 1479689 1493915 1508982 1524414 1539930 1555783 1573018 1593110 1617082
56087 1617082 1645178 1677388 1713814 1754487 1799474 1849482 1905943 1970327 2043625 2126450 2219078
56076 2219078 2321399 2433295 2554776 2684726 2819454 2953570 3082701 3204684 3318324
56067 3318324 3422595 3517725 3605583 3687613 3763011 3829767 3886606 3932753 3966554 3985964 3990542
56056 3990542 3982040 3962886 3934491 3896572 3847189 3783661 3704450 3610522 3504786 3390695 3271812
56045 3271812 3151804 3033631 2918900 2808906 2705952 2612480 2529000 2454019 2386127 2325084
56035 2325084 2270700 2221832 2177148 2136117 2098672 2064426 2032746 2003201 1975519 1949378 1924525
56024 1924525 1900931 1878713 1858290 1840698 1827235 1818416 1813438 1810852 1809585 1809202 1809588 1810718 1812657
56011A812657K935M305O251Q795J1591J4045J5739J6835J8011J9754K1725K3209
55999A975852K4256K5624K7247K7801K6563K4894K4699K6119K8045L0145L2708
55988B273953L5061L6241L7108L9588M3535M6630M7912M9100N1443N3647N4425
55977B768643N5113N7722O1890O5663O8293P0469P2675P5050P8172Q2351Q6672
55966C542713R0128R3175R6858J01007J04705J07902J11223J14819J18641J23252
55956D604423J28964J34962J40691J47405J56599J67378J77284J85591J94168
55947F037465K04961K17978K31905K45580K58607K71415K84861K99381L14739
55938H366892L30726L47496L65108L83983M06041M33572M66192N00976N36669
$$ plain form
56011 1812657 1815592 1819897 1826148 1834943 1846534 1860579 1876318 1893153 1911164 1930918 1952643 1975852
55999 1975852 2000108 2025732 2052979 2080780 2107343 2132237 2156936 2183055 2211100 2241245 2273953
55988 2273953 2309014 2345255 2382363 2421951 2465486 2512116 2560028 2609128 2660571 2714218 2768643
55977 2768643 2823756 2881478 2943368 3009031 3077324 3147793 3220468 3295518 3373690 3456041 3542713
55966 3542713 3632841 3726016 3822874 3923881 4028586 4136488 4247711 4362530 4481171 4604423
55956 4604423 4733387 4868349 5009040 5156445 5313044 5480422 5657706 5843297 6037465
55947 6037465 6242426 6460404 6692309 6937889 7196496 7467911 7752772 8052153 8366892
55938 8366892 8697618 9045114 9410222 9794205 10200246 10633818 11100010 11600986 12137655
55929A2137655N75521O19380O66686P15871P69114Q28900Q92176R51902J004455
55920A9161660J052884J103445J161839J232006J315063J408916J511535J624674
55912B9572022J752358J896743K058750K242218K453869K698992K980340L301558
55904D8956850L669272M093418M590696N188491N919684O809431P867882R097514
55896I6193238J0506325J2112472J3935962J5985964J8256659K0733809K3393912
55889B11118341K6171894K8897374L1223801L2573022L2129802K8981326K2500468
55882D13596028J2874562J396663r859138j8903221k4659232k7191239k7301831
55875C19952592k5951859k3916528k1724569j9700442j7993551j6608996j5467028
$$ plain form
55929 12137655 12713176 13332556 13999242 14715113 15484227 16313127 17205303 18157205 19161660
55920 19161660 20214544 21317989 22479828 23711834 25026897 26435813 27947348 29572022
55912 29572022 31324380 33221123 35279873 37522091 39975960 42674952 45655292 48956850
55904 48956850 52626122 56719540 61310236 66498727 72418411 79227842 87095724 96193238
55896 96193238 106699563 118812035 132747997 148733961 166990620 187724429 211118341
55889 211118341 237290235 266187609 297411410 329984432 362114234 391095560 413596028
55882 413596028 426470590 427867253 418008115 399104894 374445662 347254423 319952592
55875 319952592 294000733 270084205 248359636 228659194 210665643 194056647 178589619
55868A78589619j4468728j3538741j2641078j1772796j0941622j0145093r369029
55861I5712532q600692p837861p087695o363209n680562n054051m491201l993153
55853D6604108l557665l179357k849856k561912k312356k098301j912495j746240
55845B6385926j595455j460127j339121j229600j130843j044425r70204r05221
55837A6710930q46790p93864p45166o98868o54689o14018n77455n44084n13349
55828A0722647m85749m61197m38326m15966l94146l73348l53708l35072l17274
55819G147861l00578k86101k74754k65123k53925k39778k25031k12433k01579
55810D888559j90705j80454j73188j69219j66394j63117j59345j54754j48398
$$ plain form
55868 178589619 164120891 150582150 137941072 126168276 115226654 105081561 95712532
55861 95712532 87111840 79273979 72186284 65823075 60142513 55088462 50597261 46604108
55853 46604108 43046443 39867086 37017230 34455318 32142962 30044661 28132166 26385926
55845 26385926 24790471 23330344 21991223 20761623 19630780 18586355 17616151 16710930
55837 16710930 15864140 15070276 14325110 13626242 12971553 12357535 11780080 11235996 10722647
55828 10722647 10236898 9775701 9337375 8921409 8527263 8153915 7800207 7465135 7147861
55819 7147861 6847283 6561182 6286428 6021305 5767380 5527602 5302571 5090138 4888559
55810 4888559 4697854 4517400 4344212 4174993 4008599 3845482 3686137 3531383 3382985
55801C382985j40588j32958j26172j19172j11157j02634r4259q6271p9500p5358
55791B314916p4003p3619p2125o8786o3946n8281n2659m7828m3789m0008l6285
55780A683587l2848k9691k6638k3919k1817j9996j8126j7078j8243k1521k4958
55769A428752k6682k6523k5610k5118k5509k6398k6898k6549k5940k6039k7003
55758A140483k7972k7894k6305k3661k1140j9584j8462j6549j3839j1757j0990
55747I22330j0354q685o626n433m948m047k309p6K293M031L738R54k730n464p248
55732H75426r002j0553j1308j1970j3601j5409j5582j4135j2955j3008j3305j2818
55720G21780j1727j0533r401q634q513q580q275q144r207j1284j3285j4829j6108
$$ plain form
55801 3382985 3242397 3109439 2983267 2864095 2752938 2650304 2556045 2469774 2390274 2314916
55791 2314916 2240913 2167294 2095169 2026383 1962437 1904156 1851497 1803669 1759880 1719872 1683587
55780 1683587 1650739 1621048 1594410 1570491 1548674 1528678 1510552 1493474 1475231 1453710 1428752
55769 1428752 1402070 1375547 1349937 1324819 1299310 1272912 1246014 1219465 1193525 1167486 1140483
55758 1140483 1112511 1084617 1058312 1034651 1013511 993927 975465 958916 945077 933320 922330
55747 922330 911976 903291 896665 891232 886284 882237 879928 879852 882145 886176 889914 890868 888138 882674 875426
55732 875426 866424 855871 844563 832593 818992 803583 788001 773866 760911 747903 734598 721780
55720 721780 710053 699520 690119 681485 672972 664392 656117 647973 638766 627482 614197 599368 583260
55707E83260j6552j5401j3414j2200j1825j0906r120p755p587p944q268q830r619
55694D43839j0088j0293j0779j1180j0678r844j0087j1103j0981r349q206q808
55682C22443r803r456p915o250m941m240m457m858l897j532K91L72j67r9q5j054
55666B64352k204k188j215m80n00j193k506l911m254l286k321k438l139l605l910
55651B27202m011l112j241J46M12R85K820M392M140L208L530M617M737M150M334
55636B56309M788L670J429Q28K868N283N954N557N748O586P079O929O390N285
55622C24703L304R61o18p81L6P05N06J15J007L364N190M451J664p36j300n77M90
55605C42484J678K851L580L816M010M200L896L117K554K445K227J613J144J253
$$ plain form
55707 583260 566708 551307 537893 525693 513868 502962 493842 486087 478500 470556 462288 453458 443839
55694 443839 433751 423458 412679 401499 390821 380977 370890 359787 348806 339457 331251 322443
55682 322443 312640 303184 295269 289019 284078 279838 275381 270523 266626 265094 265385 265757 265590 265491 265406 264352
55666 264352 262148 259960 258745 258265 257765 256572 254066 250155 245901 242615 240294 237856 234717 231112 227202
55651 227202 223191 220079 218838 218984 219396 220381 223201 227593 231733 234941 238471 243088 247825 251975 256309
55636 256309 261097 264767 266196 267024 269892 275175 281129 286686 292434 299020 306099 313028 319418 324703
55622 324703 328007 328968 328350 327569 327605 328310 328816 328931 329938 333302 338492 342943 344607 343871 342571 341994 342484
55605 342484 344162 347013 350593 354409 358419 362619 366515 369632 372186 374631 376858 378471 379615 380868
55591C80868J574J552R99j78k003l916n035n329n719o731p825q494r076r924j0620
55576C10143j0773j0896j1508j1936j1042r045p614p884r097r575q592o918n719
55563A89544n408n616n832n771n309m549l966l997m327m061k959j937j839k152
55549A31821j753o59o6o01j422j401m92N15J014Q60J45p01r38l57M7r18k933m212
55531A17949l674k350j901k369k461j834j745l033m656n076m207k987j864q55
55517G8937n06j244k025j335L97R70m99k291k548j561n80K64J442K421K147P89
55501G4778k96k75M98J394K145K595K503J823R18N23J354L151M174K770k41k014
55485I5800j136O97J400J342J996L104L291K702K726L380L216K028J569K945N053
$$ plain form
55591 380868 382442 383994 384993 384815 382812 378896 373861 368532 362813 356082 348257 339763 330687 320763 310143
55576 310143 299370 288474 276966 265030 253988 244943 237329 229445 220348 210773 202181 195263 189544
55563 189544 184136 178520 172688 166917 161608 157059 153093 149096 144769 140708 137749 135812 133973 131821
55549 131821 130068 129409 129343 128742 127320 125919 125427 125942 126956 127816 127961 127260 126322 125965 126012 125094 122161 117949
55531 117949 114275 111925 110024 107655 105194 103360 101615 98582 93926 88850 84643 81656 79792 78937
55517 78937 78431 77187 75162 73827 74224 75194 74695 72404 69856 68295 67715 67979 69421 71842 73989 74778
55501 74778 74482 74207 74705 76099 78244 80839 83342 85165 86083 86606 87960 91111 95285 98055 97814 95800
55485 95800 94664 95361 96761 98103 100099 103203 106494 109196 111922 115302 118518 120546 122115 125060 130113
55470A30113O279O326N597M191K409J157Q75Q32K56n54q54n01J95R15J054r9k222
55453A55969l746l622k664k415l297m721o398q419j0314j1058j0168q153n791
55440G5203l565j752n47P9L11L05K48L82N78K07j035k385k862k679k851l373k990
55423E3274j368k33j152k922k925q72O51j35j786k005r71n82j359k102k234k468
55407C0811k975k788j593m13R5N01J040P98m56j226m40O96N83j38L15J914K968
55390B9692K819K483K532K183Q66p03j555j546j091o23n42q79r46o4J269J870
55374C5765J416O43O3n28j175j497j462j534j772j597p40K61P23N09J4n9Q32K197
55356C2059K569J185q05j754j672j705k012j618k41J277K334K890K466O51j245
$$ plain form
55470 130113 136392 142718 148315 152506 154915 156072 156947 157779 158035 157481 156627 156126 156321 157236 158290 158191 155969
55453 155969 152223 148601 145937 143522 140225 135504 129106 120687 110373 99315 89147 80994 75203
55440 75203 71638 69886 69339 69418 69729 70034 70282 70664 71242 71449 70414 68029 65167 62488 59637 56264 53274
55423 53274 51906 51673 50521 47599 44674 43802 44453 44318 42532 40527 39556 38974 37615 35513 33279 30811
55407 30811 27836 25048 23455 23042 23137 23638 24678 25476 25020 23794 23354 24050 24633 24495 24810 26724 29692
55390 29692 32511 34994 37526 39709 40575 39872 38317 36771 35680 35057 34515 33636 32690 32626 33895 35765
55374 35765 37181 37824 37887 37359 36184 34687 33225 31691 29919 28322 27582 27843 28566 29075 29089 29030 29862 32059
55356 32059 34628 35813 35008 33254 31582 29877 27865 26247 26006 27283 29617 32507 34973 35624 34379
55341C4379r84J475L364K554J70j241q92oJ29p33k018k751k307j147l34q7K32
55324B9803O87M91m39j010o05O4L14L70K83m64j510j412O5J090N13j35Q12K217
55306C1134J782l51j940k009j601j441j000k14q0q75j375o02O94J087K03j136
55290B2276j950j714m87J145K318K359J231k62p11O80K825L484J820n36j688j804
55274B8986k213l000k975j747l32L53L62K9m32m83M81K073L025K595J181n22k053
55257B5328k783k049j76J415J621P09l63j017j103n20O79J961K571K074O63q92
55241B8118j675j310k75N89Q03L41n05j080o28P88J976J919J029M42M02K58j86
55224C1006l16K52J177J967K301J825N60m77j08J301K054J303M0n50o78j126j743
$$ plain form
55341 34379 33395 34870 38234 40788 40958 39717 38825 38819 38948 38215 36197 33446 31139 29992 29658 29571 29803
55324 29803 30490 30981 30542 29532 28927 28991 29305 29675 29958 29494 27984 26572 26637 27727 28240 28105 28917 31134
55306 31134 32916 32565 30625 28616 27015 25574 24574 24360 24280 23405 22030 21428 22122 23209 23412 22276
55290 22276 20326 18612 18125 19270 21588 23947 25178 24916 24205 24885 27710 31194 33014 32478 30790 28986
55274 28986 26773 23773 20798 19051 18719 19072 19434 19463 19031 18548 19029 21102 24127 26722 27903 27381 25328
55257 25328 22545 20496 20320 21735 23356 24065 23702 22685 21582 21062 21741 23702 26273 28347 29010 28118
55241 28118 26443 25133 24858 25447 26250 26591 26086 25006 24378 25166 27142 29061 30090 30532 30934 31192 31006
55224 31006 30690 30942 32119 34086 36387 38212 38772 38295 38187 39488 41542 42845 42885 42335 41657 40531 38788
55207C8788j738j022l09k6L0L4k42r06j490j317k70Q75J156N15K3O10J797K261
55189C8769J525L11p90k011l234l261j236J665L140K383P23m15j204k367l388
55174C0610k902p90J195J394J52q00m87M69R59O38Qj49P23K454L937L929K424
55157D3764P23qK70J067K036K606J898q9j776j634j05J062J051M83j00p79j213
55140D9256m81J316K480J623n24k025k022j260o78l97q7L90J008J801K706L352
55124E6458L217K041Nk386m429n313m505k416m03M18K77K26O14Q14N15K62M36
55107D5831O49O63R07J286O94j131k322j112J293J897k04k913m044l460j989k02
55091C5843J164J195J41n32k42m5o06r25k35L44l73j373q79P37J422N44l17K05
$$ plain form
55207 38788 37050 36028 35719 35693 35723 35757 35515 34609 33119 31802 31532 32407 33563 34078 34101 34711 36508 38769
55189 38769 40294 40605 39815 37804 34570 31309 30073 31738 34878 37261 37984 37569 36365 33998 30610
55174 30610 27708 26918 28113 29507 29659 28859 28372 28841 29800 30438 30446 30297 31020 33474 37411 41340 43764
55157 43764 44487 44479 44749 45816 47852 50458 52356 52267 50491 48857 48752 49814 50865 51348 51248 50469 49256
55140 49256 48775 50091 52571 54194 53670 51645 49623 48363 47685 47288 47201 47591 48599 50400 53106 56458
55124 56458 59675 61716 61721 59335 54906 49593 45088 42672 42269 42687 42964 43190 43804 44618 45133 45395 45831
55107 45831 46480 47143 48050 49336 50030 48899 46577 45465 46758 48655 48451 45538 41494 38034 36045 35843
55091 35843 37007 38202 38343 37811 37569 37524 36918 35993 35758 36102 35729 34356 33477 34214 35636 36180 35863 36068
55073C6068J596K580K658K127J429Q71L86m27j423j465K04K422L239K556K150
55058E4971K884L534L043K323K498K626J024j701k841j172J161J202j299l833
55044F4420m180k502l71J175K107K476K079J099L06J31J09k82o07K3J571K925
55028G0479L131K230Q96j98n27J05J211J814J310L2j087j187j5J688K539J830
55012H4251N12R2N77N07p34j895j750r04n88n96J74J551K042J026l37p80m55k46
54994H2447m19n58k44P53K436M136M486K580q61l839m692l269p56J332K094J581
54978H7207M89m21p22m53m9O6m8q1k37j078k215k076j3K176K233N88k48O29J476
54959H7223J025M65J113K011J630M83mj59j265k634k119L89K289J846N05N10J822
$$ plain form
55073 36068 37664 40244 42902 45029 46458 47329 47715 47288 45865 44400 44604 47026 50265 52821 54971
55058 54971 57855 61389 64432 66755 69253 71879 72903 71202 68361 67189 68350 69552 68253 64420
55044 64420 60240 57738 57367 58542 60649 63125 65204 66303 66609 66740 66849 66567 65960 65983 67554 70479
55028 70479 73610 75840 76736 76538 76011 76116 77327 79141 80451 80483 79396 78209 78194 79882 82421 84251
55012 84251 84763 84855 85432 85939 85205 83310 81560 80656 80068 79472 79646 81197 83239 84265 83928 83148 82693 82447
54994 82447 82028 81470 81226 81979 84415 88551 93037 95617 94756 90917 86225 82956 82200 83532 85626 87207
54978 87207 87696 87275 86553 86100 86051 86117 86069 85988 85751 84673 82458 80382 80369 82545 84778 85366 85118 85747 87223
54959 87223 88248 88713 89826 91837 93467 93950 93946 93787 92522 89888 87769 88158 90447 92293 92798 93308 95130
54942I5130K675K172R86L9l67l21n5R0j15o53j422k196k402j585k50M05ln07j76
54923I1445O45J031Q78Q71J317J688J373M54m34p84o22j66O52J925L044L069K240
54906A08626K173L617M955M225K118J255K691M910O403P355Q217Q456P773P060
54892A79834P107P536Q005R164J1282J3133J3605J3497J4235J5520J5684J3946
54880C22548J1127Q299N807L334K36l822p998j0688j1379j1232j1234j1006j0296
54867B73696j0240j1602j2971j2483j0524q888p942o585m616l162k821l066l415
54854A75381l578k653j2L017M278L712L421M599O284P619R312J1956J4552J5847
54840B53735J5938J5478J4367J2234R481O866M456J740j555n096q100r796j0261
$$ plain form
54942 95130 97805 99977 100963 101002 100635 100314 100259 100349 100234 99581 98159 95963 93561 91976 91726 92131 92128 91621 91445
54923 91445 92090 93121 93999 94870 96187 97875 99248 99702 99268 98484 97862 97696 98348 100273 103317 106386 108626
54906 108626 110799 114416 119371 123596 125714 126969 129660 134570 140973 148328 156545 165001 172774 179834
54892 179834 186941 194477 202482 211646 222928 236061 249666 263163 277398 292918 308602 322548
54880 322548 333675 341974 347781 351115 351351 347529 339531 328843 317464 306232 294998 283992 273696
54867 273696 263456 251854 238883 226400 215876 206988 199046 192461 187845 184683 181862 178796 175381
54854 175381 171803 169150 169138 172155 176433 180145 183566 188165 194449 202068 211380 223336 237888 253735
54840 253735 269673 285151 299518 311752 321233 328099 332555 334295 332740 327644 319544 309748 299487
54827B99487j0638j1889j3475j4128j3633j2809j2055j1198j0620j0887j1215
54816A66940j0005p286n009m393m520m159l464l050k781k426k353k632k498j558
54802A10806n00R3O11J239J150j66j710k145j551j063j462k649l828l799k016
54787I3010J83N61j154k733k461j226n17K6J444K983K845R70o34l94J110K071
54771I6084J334n19j608o46J326J966O48o92k94J194K167K337K298J998J153L32
54755A09078J62J64k75n61J71J458K249K533K925L346L587M323O037P576P502
54740A50275O325N692N959O325O897Q611J1314J3824J5723J7319J8049J6961J4750
54727B98024J3313J3078J2678J1308R367O613K143l171o571o836n953o167p231
$$ plain form
54827 299487 288849 276960 263485 249357 235724 222915 210860 199662 189042 178155 166940
54816 166940 156935 149649 144640 140247 135727 131568 128104 125054 122273 119847 117494 114862 112364 110806
54802 110806 110306 110399 111010 112249 113399 113233 111523 109378 107827 106764 105302 102653 98825 95026 93010
54787 93010 93193 93754 92600 89867 87406 86180 85663 85689 87133 90116 92961 93931 93297 92903 94013 96084
54771 96084 97418 96899 95291 94645 95971 97937 98585 97893 97599 98793 100960 103297 105595 107593 108746 109078
54755 109078 109240 109404 109129 108568 108739 110197 112446 114979 117904 121250 124837 129160 135197 142773 150275
54740 150275 156600 162292 168251 174576 181473 190084 201398 215222 230945 248264 266313 283274 298024
54727 298024 311337 324415 337093 348401 357768 364381 366524 363353 356782 349946 343993 337826 330595
54714C30595p850q130q884r755r741q770p346n425l032j373j749l485m239k599
54700B48217M27K597K687J605J580L993P856J0785J1680J1923J3596J7049K0713
54687C54708K2832K2984K2028K0837J9082J5620J0360N111J649n30l261o908j0156
54674D74356j2527j5162j8529k1123k1527k0292j8733j7099j5114j3166j1768
54663B89316j0709r854r818j0637j0817r140o617n184n049m845l880k656j528
54650A98582m81l7q22k137k532j924j692k387k814j998o91r6j36l4J71k71j395
54633A79306k135j588j24J029J215J049J403J878J114j026k517j480J197K789
54619A82110K140Q02N88J459K325K683K684K484K522L625N815P549P307N644M576
$$ plain form
54714 330595 322745 314615 305731 295976 286235 277465 270119 264694 261662 260289 258540 255055 250816 248217
54700 248217 248644 251241 253928 255533 257113 261106 268962 279747 291427 303350 316946 333995 354708
54687 354708 377540 400524 422552 443389 462471 478091 488451 493562 495211 494681 491420 484512 474356
54674 474356 461829 446667 428138 407015 385488 365196 346463 329364 314250 301084 289316
54663 289316 278607 268753 258935 248298 237481 228341 221724 216540 211491 206646 202766 200110 198582
54650 198582 198101 198064 197242 195105 192573 190649 188957 186570 183756 181758 181067 180971 180835 180801 180972 180701 179306
54633 179306 177171 175583 175459 176488 177703 178752 180155 182033 183147 182121 179604 178124 179321 182110
54619 182110 184250 185052 185640 187099 189424 192107 194791 197275 199797 203422 209237 216786 224093 229737 234313
54604B34313N076O127O346N629M873M832N630O800P502P110O000N232N281N510
54590C16261N321N198N899P002P169N860M164L706N185Q012J0854J2414J2341
54577D09386J1686J1958J3345J4332J3393J0587O953K929j623o183r518j1227
54565D66018j2386j4031j5626j5805j4407j2926j2679j3164j2794j1025r062q103
54553C14010p601o129l753k306k902m178m056k542j460j691k033j196K59O96m56
54538B74662k080k627j615q4K64j303l707n271n639n830o365o473n629m773n006
54523B18524n844n916n106m790n825p283p474n616k415N21J695O86j553l488m249
54508A61867l978l247k558k187j975j379k40O38L50p63j416j142q43j278j922
$$ plain form
54604 234313 239389 245516 251862 257491 262364 267196 272826 279626 287128 294238 300238 305470 310751 316261
54590 316261 321582 326780 332679 339681 346850 352710 356874 360580 365765 373777 384631 397045 409386
54577 409386 421072 433030 446375 460707 474100 484687 491640 494569 492946 486763 477245 466018
54565 466018 453632 439601 423975 408170 393763 380837 368158 354994 342200 331175 322113 314010
54553 314010 306409 300280 296527 294221 291319 287141 283085 280543 279083 277392 275359 274163 274422 275118 274662
54538 274662 272582 269955 268340 268256 268520 267217 263510 258239 252600 246770 240405 233932 228303 223530 218524
54523 218524 212680 206764 201658 196868 191043 183760 176286 170670 168255 168776 170471 171157 169604 166116 161867
54508 161867 157889 154642 152084 149897 147922 146543 146303 146941 147291 146528 145112 143970 143127 141849 139927
54493A39927j939j430r62n00J68M51l58j557j573k19Q69N68j37K34J484K440L045
54476A40511M241N964O884O374N434N134N395N950P176Q950R750Q362N917M659
54462B30701M979N101L706J447n29k103l575m628m910n033n951p615q953r115
54448A93522q252p091o133n315m306l132k417k606l152k991j872n80J87L26l29
54433A45859k117m315m899k611J162L656L612K138R89R46J752K645K772J827N59
54418A53975O0M98J051J179J325K085L289M151M092L183K151J909K661L396K851
54403A87856J102l80m53M51J152J207J035R41N86m93k174l587l672k301p58o84
54387A79828k215l703l689k637k055k362k583k006j167q86j149j459j611j593
$$ plain form
54493 139927 137988 136558 135596 135096 135264 135715 135357 133800 132227 132008 132877 133445 133308 133542 135026 137466 140511
54476 140511 144752 150716 157600 163974 169408 174542 179937 185887 193063 202013 211763 220125 226042 230701
54462 230701 235680 240781 244487 245934 245405 243302 239727 235099 230189 225156 219205 211590 202637 193522
54448 193522 185270 178179 172046 166731 162425 159293 156876 154270 151118 148127 146255 145675 145862 146188 145859
54433 145859 143742 139427 134528 131917 133079 136735 140347 142485 143474 144420 146172 148817 151589 153416 153975
54418 153975 154035 154533 155584 156763 158088 160173 163462 167613 171705 174888 177039 178948 181609 185005 187856
54403 187856 188958 188578 188125 188576 189728 190935 191970 192911 193497 193004 190830 187243 183571 181270 180512 179828
54387 179828 177613 173910 170221 167584 165529 163167 160584 158578 157411 156525 155376 153917 152306 150713
54373A50713j206m55L0l03r28p24N21J728J793O10j289l260m340l372k66L283
54357A42535N218N165M287L454K576J652J284J568J577P44LN93K241L580M149
54342A80626M800O086P300P629P393P461P923Q080P584O920O669O682O294N203
54328B76650L905L141K927K444J032q93k348l053l739m968o275o742o154n124
54314B50803m396m303m749n280n423n265n461o235o658n556l118q46J39J06j01
54299A93657j15P6N55J167J193P9j649k782k713j898j135o79j49R69K663M235
54283A93474M976N074N448O430P212O885N628M325L527L262L351L313K580J473
54269B56958J250K188K418N3l950o697o961o144n635n230m641m636n526o129n579
$$ plain form
54373 150713 149507 149052 149082 148779 147851 147127 147648 149376 151169 151779 150490 147230 142890 139518 139252 142535
54357 142535 147753 152918 157205 160659 163235 164887 166171 167739 169316 170060 170063 170656 172897 176477 180626
54342 180626 185426 191512 198812 206441 213834 221295 229218 237298 244882 251802 258471 265153 271447 276650
54328 276650 280555 283696 286623 289067 290099 289206 286858 283805 280066 275098 268823 262081 255927 250803
54314 250803 246407 242104 237355 232075 226652 221387 215926 209691 203033 197477 194359 193513 193652 193758 193657
54299 193657 193542 193618 194173 195340 196533 196612 194963 192181 189468 187570 186435 185756 185607 186576 189239 193474
54283 193474 198450 203524 208972 215402 222614 229499 235127 239452 242979 246241 249592 252905 255485 256958
54269 256958 258208 260396 262814 262867 258917 252220 245259 239115 233480 228250 223609 218973 213447 207318 201739
54254B01739m966n767p511q381p493n443l240j781j709k674l284k838k429l297
54240A40926m872n711n599n247m626l295j913j583j825j104O05J515N95j143k410
54225A04313l055l220k516r14O75J493J777J933J751J065L20n8j68J4J018K964
54209A07392M824N278M218K967K951M055M393K294j186k855j243J310J689J6j303
54194A34800j499j797k308j588K25P71r05k629k352r71k62j29K47L66m51j214
54178A20304o72N58J219J643K719L604K776Q13j41M35R17K38p89j189j201j415
54162A29819j738j779j413p28j0K36j28n44o11p94j476j977j554o89j54O17K716
54145A19793N625P399O868M417R75k404m219l649k090j940l521m682l814j826
$$ plain form
54254 201739 196773 191006 183495 175114 167621 162178 158938 157157 155448 152774 149490 146652 144223 140926
54240 140926 136054 130343 124744 119497 114871 111576 109663 108080 106255 105151 105756 107271 107866 106723 104313
54225 104313 101258 98038 95522 94608 95283 96776 98553 100486 102237 103302 103622 103564 103396 103410 104428 107392
54209 107392 112216 117494 121712 124679 127630 131685 136078 138372 137186 134331 133088 134398 136087 136103 134800
54194 134800 133301 131504 129196 127608 127833 128604 127699 125070 122718 121747 121485 121356 121603 121969 121518 120304
54178 120304 119632 120190 121409 123052 125771 129375 132151 132964 132823 133258 134175 134413 133624 132435 131234 129819
54162 129819 128081 126302 124889 124161 124151 124387 124259 123715 123104 122310 120834 118857 117303 116614 116460 117077 119793
54145 119793 125418 132817 139685 144102 145077 142673 138454 134805 132715 130775 127254 122572 118758 116932
54131A16932n43m65q12q26l36K50J95o71j289n88O14K87j918l853l623j980r81
54114A00393j206j404m35J457L228M106L962L005J443m70k088k583j890j075j142
54099A05301j675j423o4J329J610O78p43j849k175j822j249o19L86J772K918L485
54083A05860L883M050K748o08m274n862n181l830k553r64M43L69q63j253j22P93
54067I2636K11o55k02J013J289K44j028j554j087J10J160J002k41j088o31L05
54051I1484O76Q03J351J820J462Q74J173K001J938O46o22p86oJ069K114K838K765
54034A11600J750K78r57j524j338o41j3p8j044k472l456l219j859m88j16l50J82
54017I6255J924L604L789K516Q94m33j682k917l349k034P98L403L941K402N73
$$ plain form
54131 116932 116389 115924 115112 114286 113950 114200 114395 113724 112435 111847 112461 112748 110830 106977 103354 101374 100393
54114 100393 99187 97783 97348 98805 102033 106139 110101 113106 114549 114079 111991 109408 107518 106443 105301
54099 105301 103626 102203 102139 103468 105078 105756 105013 103164 100989 99167 97918 97299 97685 99457 102375 105860
54083 105860 109743 113793 116541 115933 111659 105797 100616 96786 94233 93269 93712 94081 93218 91965 91843 92636
54067 92636 92847 92192 91990 93003 94292 94536 93508 91954 90867 90977 92137 93139 92898 91810 91179 91484
54051 91484 92160 92963 94314 96134 97596 98470 99643 101644 103582 104228 103606 102820 102814 103883 105997 108835 111600
54034 111600 113350 113628 112671 111147 109809 109168 109155 109077 108033 105561 102105 98886 97027 96539 96423 96073 96255
54017 96255 98179 101783 105572 108088 108982 108549 106867 103950 100601 98567 99365 102768 106709 109111 109684
54002A09684j87l60p82p96N74K335K397P69k10O71J891J895J526K201L363L539
53986A28510K859K606K895K682J928J981L476N196N633M801M020M332N571O789
53972A83279P357P486P623P678P394P222P889R073R496Q674P603P313P640P812
53958B93539P344O008L990K506K890M522N044L470J587J264J872J777R50K80o49
53943C36394k957o102q087q010o927o169n931n570m453k656j376j940l799m630
53929B67787l421k061k524l917m326m192n205o726o251l508j248j431k976l918
53915B16083l676k431l85J487J753O16R9J214K506K358J212M56M52P68J254J734
53899B25500J719J354J653K936M085M146L576K988K014N57j50Q08K258K467J644
$$ plain form
54002 109684 109497 109137 108355 107559 108133 110468 112865 113634 113424 114095 115986 117881 119407 121608 124971 128510
53986 128510 131369 133975 136870 139552 141480 143461 146937 152133 157766 162567 166587 170919 176490 183279
53972 183279 190636 198122 205745 213423 220817 228039 235928 245001 254497 263171 270774 278087 285727 293539
53958 293539 300883 306891 310881 313387 316277 320799 325843 329313 330900 332164 334036 335813 336763 337043 336394
53943 336394 333437 327335 319248 311238 304311 298142 292211 286641 282188 279532 278156 276216 272417 267787
53929 267787 264366 262305 259781 255864 251538 247346 242141 235415 229164 225656 224408 222977 220001 216083
53915 216083 212407 209976 209591 211078 212831 213447 213546 214760 217266 219624 220836 221292 221744 222512 223766 225500
53899 225500 227219 228573 230226 233162 237247 241393 244969 247957 249971 250528 250378 251186 253444 255911 257555
53884B57555J423K261K997K838K324K239K718L632M903O233P178P507P065N546
53870C16419L129R94K55N13L75n52j156m45J140K398K725K458K246K567L554M924
53854C41544O089O588O485O317O637P455Q210Q382Q084P888Q038Q205P944P121
53840D44987N775M069K468J596J565J652Q41j251l858n428m857k809j452k248
53826D41050m380o031o809p677q846r297q740q486r494j0790j0760r134o864m870
53812C28872l824m252n815p187p625p922q899r750r219p638o345n607m761l955
53798B36073l991m486m030k526j617k228l213l232k597k324k546k819l127l532
53784A93805l582l066k655k891l082k375j267q80j125q98L2O94O33O43J259J667
$$ plain form
53884 257555 258978 261239 264236 267074 269398 271637 274355 277987 282890 289123 296301 303808 310873 316419
53870 316419 319548 320542 320797 321310 321685 321133 319977 319532 320672 323070 325795 328253 330499 333066 336620 341544
53854 341544 347633 354221 360706 367023 373660 381115 389325 397707 405791 413679 421717 429922 437866 444987
53840 444987 450762 454831 457299 458895 460460 462112 462953 461702 457844 452416 447559 444750 443298 441050
53826 441050 436670 430639 423830 416153 407307 398010 389270 380784 371290 360500 349740 340606 333742 328872
53812 328872 325048 320796 314981 307794 300169 292247 283348 273598 264379 256741 250396 244789 240028 236073
53798 236073 232082 227596 223566 221040 219423 217195 213982 210750 208153 205829 203283 200464 197337 193805
53784 193805 190223 187157 184502 181611 178529 176154 174887 174007 172882 171984 172016 172710 173343 173986 175245 176912
53768A76912R84j57k67R36K034J606q2j425j250K3J043J140Q88R89J195Q66K93
53751A85728N72K023L430L377J874K76j16R45K722M134M552M340M523N631P095
53736B31106P961P958P593P444P729Q309Q759Q717Q296P811O922M812J733m38
53722C24712k16J460K297J478K21k56p3J17K9m62j272j571m98J232J689J75j916
53705C27146l218l969m665m692l622k598k797l386k798j375j056k511m236m575
53691B81648l271j083R15J539L85j321j780o99O68J442J825J878J080m61j628
53676B81137j712j154n35R1M28j98j501j962r03J66n95k803m275l749k130j112
53660B59193j319k074k415k084j492r91m64J58N41O73J319K928M542M944M509
$$ plain form
53768 176912 177896 177739 177472 178408 180442 182048 181966 180541 179291 179314 180357 181497 182385 183374 184569 185435 185728
53751 185728 186300 188323 191753 195130 197004 197280 197164 198109 200831 204965 209517 213857 218380 224011 231106
53736 231106 239067 247025 254618 262062 269791 278100 286859 295576 303872 311683 318605 323417 325150 324712
53722 324712 324496 325956 328253 329731 329952 329696 329623 329740 329769 329307 328035 326464 325966 327198 328887 329062 327146
53705 327146 323928 319959 315294 310602 306980 304382 301585 298199 295401 294026 292970 290459 286223 281648
53691 281648 278377 277294 278209 279748 280133 278812 277032 276333 277001 278443 280268 282146 283226 282765 281137
53676 281137 279425 278271 277736 277827 278255 278057 276556 274594 273691 273857 273262 270459 266184 262435 260305 259193
53660 259193 257874 255800 253385 251301 249809 248818 248354 248512 249053 249726 251045 253973 258515 263459 267968
53645B67968M429M398L017Q16N56L460P035Q224P176O155N930N460M442L962M622
53630C37650N844P131Q503R452Q967P092N187M205L852L774M342N514O062N030
53616D22605L321K800L874M813L630K42l253m333k313R24K554J357j289k963k528
53601D29441q59M08M41l78j229j738k067k446k886l280l545l621l490l171k614
53586C98966j730q11n33j121j719j347l33J10k80n23j48j2o03q65K21J801K305
53569C93378J833J804K492K620J633Q62J689L538M616M087K812K206K792L791
53555D30153L971L091K427L380N698P787Q766R267R805R670Q324P139Q053J0651
53541E28182J2084J0487P408N867O784Q529R573R973R977Q904O628M976N848Q368
$$ plain form
53645 267968 272397 276795 279812 280628 281184 284644 291679 299903 307079 313234 319164 324624 329066 333028 337650
53630 337650 343494 350625 359128 368580 377547 384639 389826 394031 397883 401657 405999 411513 417575 422605
53616 422605 425926 428726 432600 437413 441043 441285 438032 433699 431386 432310 434864 436221 434932 431969 429441
53601 429441 428582 428990 429431 429053 427824 426086 424019 421573 418687 415407 411862 408241 404751 401580 398966
53586 398966 397236 396425 395892 394771 393052 391705 391372 391482 391202 390679 390531 390519 389916 389051 389272 391073 393378
53569 393378 395211 397015 399507 402127 403760 404622 406311 409849 414465 418552 421364 423570 426362 430153
53555 430153 434124 437215 439642 443022 448720 456507 465273 474540 484345 494015 502339 509478 517531 528182
53541 528182 540266 550753 558161 564028 570812 579341 588914 598887 608864 617768 624396 629372 635220 643588
53527F43588R663Q650P242P260P937P665O736O699P755Q523Q160P162O167N252
53513G48459M469L897L124J829R42J802L985N380M968M123M358N098M800L357
53499H00591K090J975K847L955M319L177J128K68J851M224M567K562O83O99J608
53484H36544J782J525K219L902N163M968L459J399j39J21K569N710P344O869N663
53469H89098N212N835P182Q909J0536J1738J2983J4963J7151J8176J7961J8131
53457A037875J9562K1031K1447K1956K4159K7283K9109K9204K9271L0399L1984
53446A323280L3600L5991L9401M2496M3968M4239M4634M5661M6945M8255M9814
53435A798284N1804N4064N6134N7426N7669N7202N6471N5416N3993N2958N3188
$$ plain form
53527 643588 653251 661901 669143 676403 684340 692005 698741 705440 713195 721718 729878 737040 743207 748459
53513 748459 752928 756825 759949 761778 762720 764522 768507 773887 778855 782978 787336 792434 797234 800591
53499 800591 802681 804656 807503 811458 815777 818954 820082 820350 822201 826425 830992 833554 834237 834936 836544
53484 836544 838326 839851 842070 845972 851135 856103 859562 860961 860822 860943 863512 869222 876566 883435 889098
53469 889098 894310 900145 907327 916236 926772 938510 951493 966456 983607 1001783 1019744 1037875
53457 1037875 1057437 1078468 1099915 1121871 1146030 1173313 1202422 1231626 1260897 1291296 1323280
53446 1323280 1356880 1392871 1432272 1474768 1518736 1562975 1607609 1653270 1700215 1748470 1798284
53435 1798284 1850088 1904152 1960286 2017712 2075381 2132583 2189054 2244470 2298463 2351421 2404609
53424B404609N4332N5155N5227N5196N5493N5864N6230N6663N6524N5032N2753
53413C013078N0950M9354M6566M2947M0806M0869M0901L9067L6396L4266L1718
53402C466918K7587K3367K1266K0554J8675J5104J1500Q394M542m40n308r418
53390C602741j3544j7941k1501k3517k4826k6664k9589l3637l8314m2251m4210
53379C286747m4656m5149m6350m7820m9452n1398n2818n2600n1267n0322m9625
53368B745290m7557m4019m1002l9547l8283l5784l2434k9061k5701k2702k1067
53357B368133k0417j8469j4001q661m514j398J767M901P713J1167J5764J9772
53345B361757K1572K2867K6884L3744M0087M3521M5224M7589N1107N4598N7229
$$ plain form
53424 2404609 2458941 2514096 2569323 2624519 2680012 2735876 2792106 2848769 2905293 2960325 3013078
53413 3013078 3064028 3113382 3159948 3202895 3243701 3284570 3325471 3364538 3400934 3435200 3466918
53402 3466918 3494505 3517872 3539138 3559692 3578367 3593471 3604971 3613365 3617907 3617467 3612159 3602741
53390 3602741 3589197 3571256 3549755 3526238 3501412 3474748 3445159 3411522 3373208 3330957 3286747
53379 3286747 3242091 3196942 3150592 3102772 3053320 3001922 2949104 2896504 2845237 2794915 2745290
53368 2745290 2697733 2653714 2612712 2573165 2534882 2499098 2466664 2437603 2411902 2389200 2368133
53357 2368133 2347716 2329247 2315246 2306585 2302071 2300673 2302440 2307341 2315054 2326221 2341985 2361757
53345 2361757 2383329 2406196 2433080 2466824 2506911 2550432 2595656 2643245 2694352 2748950 2806179
53334B806179N9399O2128O6046P0782P5381P9566Q4048Q8927R2711R4168R4632
53323C673967R6798J01213J05648J08276J09926J12316J15370J17513J18004J17766
53313D776797J17880J18133J17396J15008J11381J07263J02830R7828R2298Q6599
53303E843413Q0632P3866O6330N8842N1764M4287L5731K6843J8810J1469L684
53292F315671m686j2552j9505k6735l5374m4830n3674o1714p0164p9721q9232
53281E817484r6804j01860j05401j08336j10329j10814j10346j09995j09783j08854
53271D744962j07321j06529j06968j07144j05373j01918r8369r5631r3458r1385
53261C730866q8929q5247p9897p3886o9010o5814o3068n9402n4890n0758m7952
$$ plain form
53334 2806179 2865578 2927706 2993752 3064534 3139915 3219481 3303529 3392456 3485167 3579335 3673967
53323 3673967 3770765 3871978 3977626 4085902 4195828 4308144 4423514 4541027 4659031 4776797
53313 4776797 4894677 5012810 5130206 5245214 5356595 5463858 5566688 5664516 5756814 5843413
53303 5843413 5924045 5997911 6064241 6123083 6174847 6219134 6254865 6281708 6300518 6311987 6315671
53292 6315671 6310985 6298433 6278928 6252193 6216819 6171989 6118315 6056601 5986437 5906716 5817484
53281 5817484 5720680 5618820 5513419 5405083 5294754 5183940 5073594 4963599 4853816 4744962
53271 4744962 4637641 4531112 4424144 4317000 4211627 4109709 4011340 3915709 3822251 3730866
53261 3730866 3641937 3556690 3476793 3402907 3333897 3268083 3205015 3145613 3090723 3039965 2992013
53250B992013m6205m4212m0815l6248l1931k8778k6101k2676j8481j4585j1530
53239B670451q643n054p83L193N699O340O135O877R385J2744J5746J8523K1951
53226B762564K5906K9297L1756L4131L7019L9779M1496M2276M3136M4880M7367
53215C179607M9647N0714N0312M9028M7540M6058M4670M3605M2564M0496L6881
53204C681122L2814K9769K7451K4057J8788J3094R093P437O826N033M48o528j3489
53191C835915j8173k0735k3217k6945l1436l5819m0036m4101m7433m9693n1504
53180C446823n3580n5724n7312n8191n8612n8721n8630n8510n8283n7698n7001
53169B814561n6762n6704n5687n3343n0866m9348m8267m6686m5030m4258m3912
$$ plain form
53250 2992013 2945808 2901596 2860781 2824533 2792602 2763824 2737723 2715047 2696566 2681981 2670451
53239 2670451 2661808 2656754 2655971 2659164 2664863 2671203 2677338 2684215 2693600 2706344 2722090 2740613 2762564
53226 2762564 2788470 2817767 2849523 2883654 2920673 2960452 3001948 3044224 3087360 3132240 3179607
53215 3179607 3229254 3279968 3330280 3379308 3426848 3472906 3517576 3561181 3603745 3644241 3681122
53204 3681122 3713936 3743705 3771156 3795213 3814001 3827095 3836188 3843625 3850451 3855484 3855932 3849404 3835915
53191 3835915 3817742 3797007 3773790 3746845 3715409 3679590 3639554 3595453 3548020 3498327 3446823
53180 3446823 3393243 3337519 3280207 3222016 3163404 3104683 3046053 2987543 2929260 2871562 2814561
53169 2814561 2757799 2701095 2645408 2592065 2541199 2491851 2443584 2396898 2351868 2307610 2263698
53158B263698m2598m0314l8545l7774l6573l3965l1327l0613l1630l2439l2058
53147A875862l1339l1198l1436l1638l2013l2540l2251l0510k8462k7904k8879
53136A537692k9595k8972k8026k8229k9402l0151k9764k8792k8047k7859k8225
53125A220630k8985k9763l0126k9911k9258k8480k7921k7560k6749k5005k3127
53114I13745k2575k3277k3277k1400j9083j8210j8243j7296j5332j4178j4519
53103G06355j5036j4859j4858j5739j6675j6649j5776j4376j2181r478p695p668
53091E45365q305q153p309o677o352o005n986o705p536p655p297o945o061m088
53077D50291k137j919l334m677n059n006m709l600j960j122j462j663q56m3m52
$$ plain form
53158 2263698 2221100 2180786 2142241 2104467 2067894 2033929 2002602 1971989 1940359 1907920 1875862
53147 1875862 1844523 1813325 1781889 1750251 1718238 1685698 1653447 1622937 1594475 1566571 1537692
53136 1537692 1508097 1479125 1451099 1422870 1393468 1363317 1333553 1304761 1276714 1248855 1220630
53125 1220630 1191645 1161882 1131756 1101845 1072587 1044107 1016186 988626 961877 936872 913745
53114 913745 891170 867893 844616 823216 804133 785923 767680 750384 735052 720874 706355
53103 706355 691319 676460 661602 645863 629188 612539 596763 582387 570206 560728 553033 545365
53091 545365 537060 528907 521598 514921 508569 502564 496578 489873 482337 474682 467385 460440 454379 450291
53077 450291 448154 446235 442901 438224 433165 428159 423450 419850 417890 416768 415306 413643 412787 412744 412292
53062D12292j606k125j619o74L93J649K715K951K363J605J138R95J192J791K539
53047D25599L022L176L336L749M350M828M673L437J297q30k191k990l798m532
53033D43126m836n255o887r500j1031r891p131n257n168n508n053m400m640n517
53019C53052o049o263o935p891p949o709n185m233l536k660k074k270k779k886
53005B85633k614k248j636r28j108k539l707k944j013k50j287k374k180j514j595
52990B57696k119k004r83M63J878K745K414R08q49k139k982l195k133j13J162
52975B50749P13l32o17o40j475k494k340j468j556k634k983k015j061r01n70N64
52959B30940J414J008R1k97n11j320k384k956l083k854j564Q82K800K603J246
$$ plain form
53062 412292 410686 408561 406942 406268 406661 408310 411025 413976 416339 417944 419082 420077 421269 423060 425599
53047 425599 428621 431797 435133 438882 443232 448060 452733 456170 457467 456637 454446 451456 447658 443126
53033 443126 438290 433035 426148 416648 405617 395726 388595 383338 378170 372662 367609 363209 358569 353052
53019 353052 347003 340740 333805 325914 317965 311256 306071 301838 298302 295642 293568 291298 288519 285633
53005 285633 283019 280771 279135 278207 277099 274560 270853 267909 266896 266646 265359 262985 260805 259291 257696
52990 257696 255577 253573 252590 253053 254931 257676 260090 260998 260149 258010 255028 251833 249700 249587 250749
52975 250749 251462 251130 250513 249873 248398 245904 243564 242096 240540 237906 234923 232908 231847 230946 230376 230940
52959 230940 232354 233362 233453 233156 232645 231325 228941 225985 222902 220048 218484 219366 222166 224769 226015
52944B26015R02J727J923P85l58n01k78l01rR93J899K058K058K337J989K13j852
52927B39600k379j339l84l97n70P2J401K720L597L816L307K555K448L295M410
52912B62152M931M707M122L549L305L729M837O069O738O772O737P154P896Q247
52898C40945P614O302N477O033P471Q202P196M993K928J623O45o12k137l420l992
52883C89268l797l304l215l778m328m002l027k770m001n560n582l888k281k199
52869C37536k952k882j619k70K82K17l1m77j107j515j552j765k653l708l833k501
52853C11170k36J858K676J597r01l146l496j964l08j03r99j213K81K483L532K830
52837C14061J501O70J15q36j713j300L94J751J506K42o25n87p2N01Q76O75k0k79
$$ plain form
52944 226015 226917 228644 230567 231352 230994 230493 230215 229914 229905 230898 232797 234855 236913 239250 241239 241452 239600
52927 239600 237221 235882 235498 235101 234531 234603 236004 238724 242321 246137 249444 251999 254447 257742 262152
52912 262152 267083 271790 275912 279461 282766 286495 291332 297401 304139 310911 317648 324802 332698 340945
52898 340945 348559 354861 360338 366371 373842 382044 389240 394233 397161 398784 399429 398817 396680 393260 389268
52883 389268 385471 382167 378952 375174 370846 366844 363817 361047 357046 351486 345904 342016 339735 337536
52869 337536 334584 331702 330083 329813 330095 330312 330281 329804 328697 327182 325630 323865 321212 317504 313671 311170
52853 311170 310934 312792 315468 317065 316164 313018 309522 307558 307250 307147 306148 304935 305216 307699 311231 314061
52837 314061 315562 316232 316347 315511 313798 312498 312892 314643 316149 316391 315766 315179 315107 315608 316484 317159 317139 316860
52819C16860N68J700J754P96J42K17k4j250k564k796j945n63J275L420M801M385
52803C26776K642J057K29m23j067o38J758N195P347O593L539M90o12J11Q32J93
52787C54022j072j059J081M284O796P605O715M849L322L429N211P137P608O656
52773D16584N538M983M557L781K862K113J332K35j005k191l483m731n038l815
52759D21722k021j419k546m252n269n446n280n100n186n971p472q911r363q542
52745C44944o813m846l421k932k851k351j785k577n044p380p735o505n352m680
52731B80672l588k009j142j577k378k521k101j608j048l77K5j18o38j471k767
52716B57354m061m285l259k267k314k678k146j050q34j854k792k337o87Q04R45
$$ plain form
52819 316860 317428 319128 320882 321678 321820 322037 322013 320763 318199 315403 313458 312895 314170 317590 322391 326776
52803 326776 329418 330475 330704 330281 329214 328576 330334 335529 342876 349469 353008 353498 352886 352997 353829 354022
52787 354022 352950 351891 352972 357256 364052 371657 378372 383221 386543 389972 395183 402320 409928 416584
52773 416584 422122 427105 431662 435443 438305 440418 441750 441985 440980 438789 435306 430575 425537 421722
52759 421722 419701 418282 415736 411484 406215 400769 395489 390389 385203 379232 371760 362849 353486 344944
52745 344944 338131 333285 329864 326932 324081 321730 319945 317368 312324 304944 297209 290704 285352 280672
52731 280672 277084 275075 273933 272356 269978 267457 265356 263748 262700 262323 262348 262230 261592 260121 257354
52716 257354 253293 249008 245749 243482 241168 238490 236344 235294 234460 232606 229814 227477 226790 227594 228539
52701B28539m22k330l475l439l096l487m503n134m720l442j856o66q00k732n529
52686A82908p262o684m242j361O75J119o3j874k767k106r56q65k085l441l809
52671A47187l136j993q39J01O99J085J631K330K452J328o00k065k443k313k315
52656A41109k141j351n92r84k222k387k80K742M047K605Rj385p35R92K433L080
52640A44940L251L330L448L682M171M812N163M950M476M192M180M375M988O029
52626B05987O605N600L234J127M66Q18J146J214J294J192M49p17j650k234k898
52611B21633l664m074m155m559n472o132n875n085m530m247l721k941k527k866
52597A61785l639m315m618m429l705k724k005j674j253m45K67L41J46M73J148
$$ plain form
52701 228539 228117 225787 222312 218873 215777 212290 207787 202653 197933 194491 192635 191969 191169 188437 182908
52686 182908 175646 168962 164720 163359 164034 165153 165090 163216 160449 158343 157387 156522 154437 150996 147187
52671 147187 144051 142058 141219 141320 142019 143104 144735 147065 149517 150845 150245 148180 145737 143424 141109
52656 141109 138968 137617 137025 136041 133819 131432 131152 133894 137941 140546 140555 139170 138435 139427 141860 144940
52640 144940 148191 151521 154969 158651 162822 167634 172797 177747 182223 186415 190595 194970 199958 205987
52626 205987 212592 218192 221426 222553 223019 223837 224983 226197 227491 228683 229132 228415 226765 224531 221633
52611 221633 217969 213895 209740 205181 199709 193577 187702 182617 178087 173840 170119 167178 164651 161785
52597 161785 158146 153831 149213 144784 141079 138355 136350 134676 133423 132978 133245 133586 133732 134205 135353
52582A35353J024l67j941k343j459j88P27R52K99q41j144M15L009M476L638J355
52566A42965p69j912k040j456p83p87j566k253j952o94P56J672J746J158N13L43
52550A34941N03M12o8n16p11p70n95J09J082J699K012K577K989K013k25j572m78
52533A43402J854L130K820J913Q42o31j955k065j049k8O08J345K044J932J345
52518A55507J666L022L696K767J664J931K757K350R15N14K100M222M917L789J900
52503A93717N20M50J851M006N505N324L767K133J378J394J559J668J919K275K339
52488B29805K005J663J469R27k38j230r74L84J607K056K383L177L845L472K321
52473B52672J542J583J666J000j38r45j233j482j857j803q70N80J936L203M609
$$ plain form
52582 135353 136377 136010 134069 131726 130267 130079 130806 131758 132057 131216 130072 130487 133496 137972 141610 142965
52566 142965 142196 140284 138244 136788 136005 135218 133652 131399 129447 128753 129509 131181 132927 134085 134598 134941
52550 134941 135444 135856 135788 135272 134561 133791 133196 133305 134387 136086 138098 140675 143664 145677 145452 143880 143402
52533 143402 145256 148386 151206 153119 153961 153330 151375 149310 148261 148233 148841 150186 152230 154162 155507
52518 155507 157173 160195 163891 166658 168322 170253 173010 175360 176275 176789 178889 183111 188028 191817 193717
52503 193717 194237 194687 196538 200544 206049 211373 215140 217273 218651 220045 221604 223272 225191 227466 229805
52488 229805 231810 233473 234942 235869 235631 234401 233427 233811 235418 237474 239857 243034 246879 250351 252672
52473 252672 254214 255797 257463 258463 258325 257380 256147 254665 252808 251005 250135 250715 252651 255854 260463
52458B60463N452M442J607j024j518l42L98l28j457j700j245j106j587k055j941
52443B58059j296m80J63L00l49j745l366m388m063k216M04K399K766J831R64J155
52427B50138K054K619K537K374K438K270J660J369K008K705K057J91j225j155
52413B72040k74L54N90P90J022J275J569J456M12p82m12J711L408K905J182K37
52397B87483J87j35o92m80L09L91l75p50j98O38J555K978M204L653J504J61R60
52380C01393K199J749J81l62O96K074K861L367L809L645K564J275P01P72M26j018
52364C26332k674k686m65K235L104J919M54r1l03j219k903m706n912n772m009
52349C03304j688m60o01q81o71p61j561k068j541q55j004j470j163q4J062J899
$$ plain form
52458 260463 265915 270357 271964 270940 269422 269080 269478 269150 267693 265993 264748 263642 262055 260000 258059
52443 258059 256763 256283 256446 256746 256397 254652 251286 246898 242835 240619 241023 243422 246188 248019 248983 250138
52427 250138 252192 254811 257348 259722 262160 264430 266090 267459 269467 272172 274229 274420 273195 272040
52413 272040 271766 272120 272710 273500 274522 275797 277366 278822 279234 278452 278040 279751 283159 286064 287246 287483
52397 287483 287670 287535 286843 286363 286672 287063 286688 285938 285740 286378 287933 290911 295115 298768 300272 300433 301393
52380 301393 303592 305341 305522 305160 305856 307930 310791 314158 317967 321612 324176 325451 326152 326924 327350 326332
52364 326332 323658 320972 320507 322742 325846 327765 328219 328128 327825 326606 323703 318997 313085 307313 303304
52349 303304 301616 301156 300555 299674 299003 298242 296681 294613 293072 292217 291213 289743 288580 288496 289558 291457
52333B91457K051Q97j128k232j523n52j015k087j772l7J423J954K454L347M043
$$ plain form
52333 291457 293508 294405 293277 291045 289522 288970 287955 285868 284096 284059 285482 287436 289890 293237 297280
$$ [...]
##END NTUPLES=NMR SPECTRUM
##END=
