
##TITLE=AC1071_TOPL04_5835268_LkaQr7E7HN
##JCAMPDX= 6.0         $$ Bruker NMR JCAMP-DX V2.0
##DATA TYPE= NMR SPECTRUM
##DATA CLASS= NTUPLES
##ORIGIN= BRUKER
##OWNER= Administrator
$$ 1.72 TOPSPIN		Version 2.1
$$ 2012-03-28 11:07:35.140 -0500  Administrator@TOPSPIN
$$ Compression mode = diff/dup
##.OBSERVE FREQUENCY= 400.13188235
##.OBSERVE NUCLEUS= ^1H
##.ACQUISITION MODE= SIMULTANEOUS (DQD)
##.ACQUISITION SCHEME= undefined
##.AVERAGES= 8
##.DIGITISER RES= 22
##SPECTROMETER/DATA SYSTEM= spect
##.PULSE SEQUENCE= zg30
##.SOLVENT NAME= COFFEE_meoh
##.SHIFT REFERENCE= INTERNAL, COFFEE_meoh, 1, 14.98061
##AUDIT TRAIL= $$ (NUMBER, WHEN, WHO, WHERE, PROCESS, VERSION, WHAT)
$$ ##TITLE= Audit trail, TOPSPIN		Version 2.1
$$ ##JCAMPDX= 5.01
$$ ##ORIGIN= Bruker BioSpin GmbH
$$ ##OWNER= Administrator
$$ $$ C:\Bruker\TOPSPIN/data/COFFEE/nmr/AC1071_TOPL04_5835268_LkaQr7E7HN/20/pdata/1/auditp.txt
$$ ##AUDIT TRAIL=  $$ (NUMBER, WHEN, WHO, WHERE, PROCESS, VERSION, WHAT)
(   1,<2012-03-28 02:42:30.875 -0500>,<Administrator>,<TOPSPIN>,<go>,<TOPSPIN 2.1>,
      <created by zg
	started at 2012-03-28 02:41:24.390 -0500,
	POWCHK enabled, PULCHK disabled,
       configuration hash MD5:
       1A 1E CE 29 27 FD 77 03 67 4E F0 E3 C4 B2 CB 90
       data hash MD5: 64K
       F0 95 D8 4E A6 3D 0B 99 FC B7 54 30 BD 84 9E 5B>)
(   2,<2012-03-28 02:42:34.796 -0500>,<Administrator>,<TOPSPIN>,<proc1d>,<TOPSPIN 2.1>,
      <Start of raw data processing
       efp LB = 0 FT_mod = 6 PKNL = 1 PHC0 = 0 PHC1 = 0 SI = 32K 
       data hash MD5: 32K
       28 5F 1A 50 91 30 24 62 47 3C 20 50 DF C8 E7 19>)
(   3,<2012-03-28 02:42:35.125 -0500>,<Administrator>,<TOPSPIN>,<proc1d>,<TOPSPIN 2.1>,
      <pk PHC0 = 213.6676 PHC1 = 0 
       data hash MD5: 32K
       8F B6 02 D8 D9 CB 22 D0 B4 B4 43 29 52 07 3B 8E>)
(   4,<2012-03-28 02:42:35.312 -0500>,<Administrator>,<TOPSPIN>,<proc1d>,<TOPSPIN 2.1>,
      <abs ABSG = 1 
       data hash MD5: 32K
       6E F0 81 3B 37 76 EF F2 F7 11 ED E3 DA C9 F6 61>)
(   5,<2012-03-28 02:42:35.421 -0500>,<Administrator>,<TOPSPIN>,<proc1d>,<TOPSPIN 2.1>,
      <abs ABSG = 2 
       data hash MD5: 32K
       4D 41 DA 2D 73 3F C7 52 DA 6A E2 1A BF 99 18 55>)
(   6,<2012-03-28 02:42:35.453 -0500>,<Administrator>,<TOPSPIN>,<proc1d>,<TOPSPIN 2.1>,
      <abs ABSG = 3 
       data hash MD5: 32K
       81 E9 26 6D 47 AA 1A 0C 4B 3E 7C 00 D0 02 1B C6>)
(   7,<2012-03-28 02:42:35.484 -0500>,<Administrator>,<TOPSPIN>,<proc1d>,<TOPSPIN 2.1>,
      <abs ABSG = 4 
       data hash MD5: 32K
       E9 F5 39 47 0A EC C0 A2 F5 85 39 1D 32 23 DF EA>)
(   8,<2012-03-28 02:42:35.515 -0500>,<Administrator>,<TOPSPIN>,<proc1d>,<TOPSPIN 2.1>,
      <abs ABSG = 5 
       data hash MD5: 32K
       23 0E DB 84 B7 AD E8 91 93 27 B3 3A 6E DF 63 8F>)
(   9,<2012-03-28 02:42:40.187 -0500>,<Administrator>,<TOPSPIN>,<audit>,<TOPSPIN 2.1>,
      <user comment:
       ICON-NMR User ID: COFFEE
       data hash MD5: 32K
       23 0E DB 84 B7 AD E8 91 93 27 B3 3A 6E DF 63 8F>)
$$ [...]
150 150 150 150 150 150 150 150
##$TP07= 0
##$TPNAME0= <>
##$TPNAME1= <>
##$TPNAME2= <>
##$TPNAME3= <>
##$TPNAME4= <>
##$TPNAME5= <>
##$TPNAME6= <>
##$TPNAME7= <>
##$TPOAL= (0..7)
0.5 0.5 0.5 0.5 0.5 0.5 0.5 0.5
##$TPOFFS= (0..7)
0 0 0 0 0 0 0 0
##$TUNHIN= 0
##$TUNHOUT= 0
##$TUNXOUT= 0
##$USERA1= <user>
##$USERA2= <user>
##$USERA3= <user>
##$USERA4= <user>
##$USERA5= <user>
##$V9= 5
##$VALIST= <valist>
##$VCLIST= <CCCCCCCCCCCCCCC>
##$VD= 0
##$VDLIST= <DDDDDDDDDDDDDDD>
##$VPLIST= <PPPPPPPPPPPPPPP>
##$VTLIST= <TTTTTTTTTTTTTTT>
##$WBST= 2048
##$WBSW= 25
##$XGAIN= (0..3)
0 0 0 0
##$XL= 0
##$YL= 0
##$YMAX_a= 531073
##$YMIN_a= -644708
##$ZGOPTNS= <>
##$ZL1= 120
##$ZL2= 120
##$ZL3= 120
##$ZL4= 120
##$ABSF1= 14.98061
##$ABSF2= -5.57192
##$ABSG= 5
##$ABSL= 3
##$ALPHA= 0
##$AQORDER= 0
##$ASSFAC= 0
##$ASSFACI= 0
##$ASSFACX= 0
##$ASSWID= 0
##$AUNMP= <proc_prof1d_extract_pilot.lims>
##$AXLEFT= 0
##$AXNAME= <>
##$AXNUC= <1H>
##$AXRIGHT= 0
##$AXTYPE= 0
##$AXUNIT= <>
##$AZFE= 0.1
##$AZFW= 0.1
##$BCFW= 0
##$BC_mod= 0
##$BYTORDP= 0
##$COROFFS= 0
##$CY= 15
##$DATMOD= 1
##$DC= 0
##$DFILT= <>
##$DTYPP= 0
##$F1P= 0
##$F2P= 0
##$FCOR= 0.5
##$FTSIZE= 32768
##$FT_mod= 6
##$GAMMA= 0
##$GB= 0
##$INTBC= 1
##$INTSCL= 1
##$ISEN= 128
##$LB= 0
##$LEV0= 0
##$LPBIN= 0
##$MAXI= 10000
##$MC2= 0
##$MEAN= 0
##$ME_mod= 0
##$MI= 0
##$NCOEF= 0
##$NC_proc= -8
##$NLEV= 6
##$NOISF1= 0
##$NOISF2= 0
##$NSP= 0
##$NTH_PI= 0
##$NZP= 0
##$OFFSET= 14.98061
##$PC= 1
##$PHC0= 213.6676
##$PHC1= 0
##$PH_mod= 1
##$PKNL= yes
##$PPARMOD= 0
##$PPDIAG= 0
##$PPIPTYP= 0
##$PPMPNUM= 2147483647
##$PPRESOL= 1
##$PSCAL= 4
##$PSIGN= 0
##$PYNMP= <proc.py>
##$REVERSE= no
##$SF= 400.13
##$SI= 32768
##$SIGF1= 0
##$SIGF2= 0
##$SINO= 400
##$SIOLD= 32768
##$SPECTYP= <>
##$SREGLST= <1H.CDCl3>
##$SSB= 0
##$STSI= 32768
##$STSR= 0
##$SW_p= 8223.68421052632
##$SYMM= 0
##$S_DEV= 0
##$TDeff= 65536
##$TDoff= 0
##$TI= <>
##$TILT= no
##$TM1= 0
##$TM2= 0
##$TOPLEV= 0
##$USERP1= <user>
##$USERP2= <user>
##$USERP3= <user>
##$USERP4= <user>
##$USERP5= <user>
##$WDW= 1
##$XDIM= 32768
##$YMAX_p= 470146729
##$YMIN_p= -683259
##$CURPLOT= <Network HP LaserJet P1505>
##$CURPRIN= <$Network HP LaserJet P1505>
##$DFORMAT= <normdp>
##$LAYOUT= <+/1D_H.xwp>
##$LFORMAT= <normlp>
##$PFORMAT= <normpl>
##$SURQMSG= 1
$$ End of Bruker specific parameters
$$ ---------------------------------
##NTUPLES= NMR SPECTRUM
##VAR_NAME=  FREQUENCY,     SPECTRUM/REAL,   SPECTRUM/IMAG
##SYMBOL=    X,             R,               I
##VAR_TYPE=  INDEPENDENT,   DEPENDENT,       DEPENDENT
##VAR_FORM=  AFFN,          ASDF,            ASDF
##VAR_DIM=   32768,         32768,           32768
##UNITS=     HZ,            ARBITRARY UNITS, ARBITRARY UNITS
##FACTOR=    0.250966925370066, 1,           1
##FIRST=     8223.43324360095, -56283,       -177824
##LAST=      0,             67717,           -57355
##MIN=       0,             -683259,         0
##MAX=       8223.43324360095, 470146729,    0
$$ Real data points
##PAGE= N=1
##DATA TABLE= (X++(R..R)), XYDATA
$$ [...]
19468a481F7523a59245i257j58483A78428A3485l374K0641c374l8121k28420J19157
19456a50758J6759p869o005K9939a5754q7129C3642J72878a14073c3186j39944
19445a73130A80179c9527A28715A9822e06148K14726b4210A40314b81193g4457
19434C1137N2638c86478B8222a71890A31675i4578K5684C189a96443A6457a2969
19422a73450n0777b9127o8098A49293a05889H0633Q5053J10155b53469k704D388
19410G428d4276r2487j44636J03913e0442o224A85606m4670F7113i4708N314E2888
19397a64978K2171m139B59387A8473O3262l1313b9638q0911A06452h4387b1899
19385B9154a54783K4057a690B09570e93279d8435J689J9331j30373K1237O6869
$$ plain form
19468 -1481 67523 -159245 -9257 -167740 178428 13485 10111 30752 -3374 -41495 -269915 -150758
19456 -150758 -133999 -141868 -147873 -117934 -15754 -102883 33642 206520 -114073 -33186 -173130
19445 -173130 180179 -39527 128715 19822 -506148 -291422 -24210 140314 -281193 -74457
19434 31137 83775 -386478 28222 -171890 131675 -94578 -68894 3189 -196443 16457 -12969
19422 -173450 -224227 -29127 -97225 149293 -105889 80633 165686 275841 -253469 -256173 4388
19410 7428 -44276 -136763 -281399 -177486 -50442 -56666 185606 140936 67113 -94708 -89394 52888
19397 -164978 -142807 -146946 259387 18473 81735 50422 -29638 -110549 106452 -84387 -21899
19385 29154 -154783 -130726 -1690 209570 -593279 -48435 -46746 -27415 -157788 -136551 -69682
19374f9682k76679c4873k71071K4516f4866j52204j80175J67949K7667H5724a08169
19362B24029i0771j69848J16008N8612l63326J84196g9039G8923j5610M7361c10791
19350d3773B96398A5747b74843h6903k4958j07552A34355c01734j36917A13352
19339f689p9033B0671f7134l08305J62949f3912B5484P9452K35480F6824c5249
19327b06657a4897B7150a97470B8945b29809C59793A00740b72997g3310j78056
19317b51366k39570b01739N9852k6136o2892A1857d09838i2915p3413D5154K79350
19306C24504a72208k02338B090c6682j63552r7216a12211A18604a21737a1547
19295b1309o1906b642o6737C2533J13725b44326a2598m15005a97069G1985d6716
$$ plain form
19374 -69682 -346361 -34873 -305944 -281428 -64866 -217070 -397245 -229296 -201629 85724 -108169
19362 224029 -90771 -260619 -144611 -85999 -449325 -265129 -79039 78923 63313 110674 -310791
19350 -43773 296398 15747 -274843 -86903 -111861 -219413 134355 -301734 -438651 113352
19339 -6689 -85722 20671 -67134 -375439 -212490 -63912 25484 104936 340416 66824 -35249
19327 -206657 -14897 27150 -197470 28945 -229809 359793 100740 -272997 -73310 -251366
19317 -251366 -490936 -201739 -141887 -168023 -230915 11857 -409838 -92915 -166328 45154 324504
19306 324504 -172208 -374546 2090 -36682 -200234 -297450 -112211 118604 -121737 -11547
19295 -21309 -83215 -2642 -69379 32533 146258 -244326 -12598 -427603 -197069 71985 -46716
19283c9950E7070e8001o9170N0476j99535I5108l0633a15923l0900o5838i2523
19271a03710a7572l50818c546k05816A22025i9763C322e6665A84323N5076a83197
19259a36239k3120j29627O8333k85663b52817o0673J09200J3238I3434i1342k02498
19248b93840d9004k96533O4417E7644J1098a20141K1517j16094B55524C8970g733
19236D8828e13920D7249i5228A08714C353R5298b59212c1158l21668M9984I0589
19224h5104B63526E6487b04001i2153d1798q3604o1418b8234r433j5946f158G6975
19211c24524B53871a91640g7243b2076k60761I4440a69881M1743j4756b3705j06215
19200a29920M4123j21208A87330i7256m0937j21092b2003k03411d8336A48274
$$ plain form
19283 -39950 57070 -58001 -127171 -76695 -276230 95108 64475 -115923 -146823 -212661 -92523
19271 -103710 -17572 -368390 -3546 -209362 122025 -99763 3322 -56665 184323 239399 -183197
19259 -136239 -159359 -288986 -220653 -506316 -252817 -313490 -204290 -191052 93434 -91342 -293840
19248 -293840 -49004 -345537 -281120 57644 68742 -120141 -98624 -214718 255524 38970 -7733
19236 48828 -513920 47249 -95228 108714 3353 98651 -259212 -31158 -352826 -302842 90589
19224 -85104 263526 56487 -204001 -92153 -41798 -125402 -186820 -28234 -37667 -53613 -6158 76975
19211 -324524 253871 -191640 -77243 -22076 -282837 94440 -169881 -128138 -142894 -23705 -129920
19200 -129920 -85797 -207005 187330 -97256 -138193 -259285 -22003 -225414 -48336 148274
19189b8245B67315B1388d66397A94493j6503c31912P6422J21576q2428o3152J34745
19178a44749A24010A7044h6276C4823N0802b40895o4058A95465r7561C8717a27199
19166h0416b2693I0106a59418o455I9121D1976M6044a86964L4320A40143a44806
19154b60959a23777N7180l1932B33874b48787o6620J54294g6104A54583c7601
19143f8028l33902b3144A75324f464j32264k9343E3772b47377D52948A35687b42408
19131A35889b09070e4988A54116d5485l3827m6427I8502a50783f5854k08477h2048
19119d8010j03102A9033a35707b8946A76354b96471e1835A13536B9580J34925
19109A64505o5668a55027A36518c2774j44872h7502B50262a36566j99373J43207
$$ plain form
19189 -28245 267315 21388 -466397 194493 177990 -331912 -255490 -133914 -216342 -279494 -144749
19178 -144749 124010 17044 -86276 34823 85625 -240895 -304953 195465 97904 38717 -127199
19166 -80416 -22693 90106 -159418 -165873 99121 41976 88020 -186964 -152644 140143 -144806
19154 -260959 -123777 -66597 -98529 233874 -248787 -315407 -161113 -76104 154583 -37601
19143 -68028 -401930 -23144 175324 -6464 -138728 -168071 53772 -247377 452948 135687 -242408
19131 135889 -209070 -54988 154116 -45485 -79312 -125739 98502 -150783 -65854 -274331 -82048
19119 -48010 -151112 19033 -135707 -28946 176354 -296471 -51835 113536 29580 164505
19109 164505 98837 -155027 136518 -32774 -177646 -87502 250262 -136566 -335939 -192732
19099a92732A91237C3232c3440k8210K6520A64264b68655a07733L8955D0993L1771
19088G2764c33301a08726A35979N2346C7740J39653G7557b8812l35608C1472a72963
19076f5193o67j7902A60781a44984D7009d04005C1217a2175A63126M5266b52682
19064b27211L8920g4787A2762c68082B49356B7267b79097r8213A43673k2841b88953
19052d44622C9857K12063a68166L7967C1038K3132b89393a31435L5151p5019I6791
19040a89632k57155C82407A52457K95471a40812G8219A0000c2184A77634a97228
19029a26237c408E775N109J958J13030a40165A88970b40024i6151O502j03156
19018a92805J8393e5629j08675B29226o2030j198o1424b4380O659A03294g5395
$$ plain form
19099 -192732 191237 33232 -33440 -61650 -35130 164264 -268655 -107733 -68778 40993 72764
19088 72764 -333301 -108726 135979 188325 37740 177393 77557 -28812 -364420 31472 -172963
19076 -65193 -65860 -83762 160781 -144984 47009 -404005 31217 -12175 163126 208392 -252682
19064 -227211 -188291 -74787 12762 -368082 249356 27267 -279097 -377310 143673 120832 -288953
19052 -444622 39857 251920 -168166 -130199 31038 54170 -289393 -131435 -96284 -171303 96791
19040 -189632 -446787 382407 152457 447928 -140812 78219 10000 -32184 177634 -197228
19029 -126237 -3408 5775 10884 12842 125872 -140165 188970 -240024 -96151 -89649 -192805
19018 -192805 -174412 -55629 -164304 229226 167196 165998 104574 -24380 -17721 103294 -75395
19006A8733a13813n4306O652A55898f3132b2881j68058A41667b5765k22923A60446
18994A34186B4435J55720a21074A16620K39065b91910o128E8182b23874A08732
18983a66299H6031N7376b51020f5487n0757j7161A08455b32044r1735d5950m5486
18972i1436L8096R591m649C8502h2223A18670Q6288a43659B18874f7088D3359
18960a33560H4658O2041O2526l8861J53364j55029D1386b18496C03395A48627
18949F0743B891a30462d9940j04164o2068e0790j0074k9830K4617p1274d6257
18937b29888A67448P8594R700A10449g8136j28678M9534n7623h8967M3588A49857
18925b13859q685F5763c4174m8281A48262a69786j6487K1924H7511M45934i3744
$$ plain form
19006 18733 -113813 -168119 -161467 155898 -63132 -22881 -190939 141667 -25765 -248688 160446
18994 134186 24435 180155 -121074 116620 355685 -291910 -298038 58182 -223874 108732
18983 -166299 86031 143407 -251020 -65487 -116244 -133405 108455 -232044 -323779 -45950 -91436
18972 -91436 -53340 -43749 -48398 38502 -82223 118670 204958 -143659 218874 -67088 43359
18960 -133560 84658 146699 209225 170364 323728 168699 41386 -218496 303395 148627
18949 60743 2891 -130462 -49940 -154104 -216172 -50790 -60864 -90694 -66077 -137351 -46257
18937 -229888 167448 246042 255742 110449 -78136 -206814 -157280 -214903 -88967 -45379 149857
18925 -213859 -222544 65763 -34174 -82455 148262 -169786 -186273 -164349 87511 533445 -93744
18913F459b64376J09821q2107O333F1169b74769E016a031B9903K28888a28867
18901C49982b21118k68758A57167j2256J18554m6891q3753J24659J6365m9734
18891B24111K1527H6583K43568B9454c643j97670k5794A93923a14963j42370R2563
18880a64770j20080e0010j69310g7057n7380D3815M7272a58972j01408B9958b42223
18868H4066b63356F7524a97878a5980r0903k1100B8597J78978a50125q4281M4322
18857a90084C29178b57001A19052D0340a71575j57481A25805d21282J38359d599
18846A43481n7583K0386g0070B1464a03578e1555m8832j14776e2950j0980A05498
18834A08336a36854C1371O7543k4954a24504A16931n0175d8877E862a9384B488
$$ plain form
18913 6459 -264376 -154555 -236662 -230329 61169 -274769 5016 -1031 29903 258791 -128867
18901 349982 -221118 -489876 157167 144911 263465 216574 132821 257480 273845 224111
18891 224111 245638 86583 330151 29454 -3643 -201313 -227107 193923 -114963 -257333 -164770
18880 -164770 -284850 -50010 -219320 -77057 -134437 43815 91087 -158972 -260380 29958 -242223
18868 84066 -263356 67524 -197878 -15980 -106883 -127983 28597 207575 -150125 -234406 -190084
18857 -190084 329178 -257001 119052 40340 -171575 -329056 125805 -421282 -282923 -4599
18846 143481 85898 106284 -70070 21464 -103578 -51555 -100387 -215163 -52950 -63930 105498
18834 108336 -136854 31371 98914 73960 -124504 116931 66756 -48877 5862 -19384 2488
18822a5372m2548I9545a48118K7208c0055C14627B7655a75058J5744N107r2588
18811b46795a9893n7293j94093A53104a93979A5367K2730j1050K08019D6494d11724
18799a41880f9167A24511a24560A31631N1214q358b6658J0917B28012h1839B32449
18787c5052I3326b95989H728a74495c0222j04867C2293b1783l0297o0289j1242
18776a23611l15589B6808a5883j66866c4662m65764a78679b3454l53643J45260
18766b31837B00950E1980e5981b0005j5442C55758b01466n4083M7748R7857b4383
18754d9548M642q2367A82670C8477J60377h5163b1821l2610k14822F0581R381
18743F9962c04198a0754A68982Q0794a54506A5927b76784a2341C7469a6441n6347
$$ plain form
18822 -15372 -57920 99545 -148118 -120910 -30055 314627 27655 -175058 -159314 -154207 -246795
18811 -246795 -19893 -77186 -271279 153104 -193979 15367 38097 27047 235066 46494 -411724
18799 -141880 -69167 124511 -124560 131631 182845 174487 -26658 -15741 228012 -81839 232449
18787 -35052 93326 -295989 8728 -174495 -30222 -135089 32293 -21783 -52080 -112369 -123611
18776 -123611 -439200 26808 -15883 -182749 -34662 -500426 -178679 -23454 -377097 -231837
18766 -231837 200950 51980 -55981 -20005 -35447 355758 -201466 -255549 -207801 -109944 -24383
18754 -49548 -44906 -127273 182670 38477 198854 -85163 -21821 -54431 -269253 60581 69962
18743 69962 -304198 -10754 168982 249776 -154506 15927 -276784 -12341 37469 -16441 -72788
18732g2788B70810c60398J28454j00903a18559L4248A12559J37921b83584J17079
18722a66505e8600l5511m3658R720A21125a5175j9586g789p6526B2036c16908
18710b90393J08864j31912A85717c15685H9695h353A23567B7123a96132B18868
18699i159G0537b02947J8574n4486N0426O8540B9974a55681j08192d1531A31488
18687c31374A98502n3878R0609a6421A33615d1921A13867c2675A98937dn7044
18676e7048B5309a07766N07c8200B5165L1969a49348q2528A31779a5545l58821
18665c74366B6045J37137b5514C20004i4396G2163Q1966J3201a8719j32384k8747
18654a79850A17974C8178L86683i9180B53899c58650B04413b32243E9606J0017
$$ plain form
18732 -72788 270810 -360398 -231944 -332847 -118559 -84311 112559 250480 -283584 -166505
18722 -166505 -58600 -94111 -137769 -128049 121125 -15175 -34761 -7789 -84315 22036 -316908
18710 -290393 -181529 -313441 185717 -315685 89695 -8353 123567 27123 -196132 218868
18699 -9159 70537 -202947 -184373 -238859 -188433 -119893 29974 -155681 -263873 -41531 131488
18687 -331374 198502 144624 235233 -16421 133615 -41921 113867 -32675 198937 -4 -57048
18676 -57048 25309 -107766 -107259 -38200 25165 57134 -149348 -231876 131779 -15545 -374366
18665 -374366 26045 163182 -25514 320004 -94396 72163 154129 167330 -18719 -151103 -179850
18654 -179850 117974 38178 424861 -99180 253899 -358650 204413 -232243 59606 69623
18644F9623a74327c6658F531c6759H5843d3101D1813A493a07914k86333C0765
18632A04775a47896A23963b17450k760p754f9615b1473A5525g7773l14715a4799
18620A33274C7986R0969a02475N401A23644e4191k17412l6999f034m18574d1452
18608A00550a04151k08707J17157j45433e1929A37707a01852l18854J66102C3248
18597c71844a52110L6890c9577k54163a42642B68388G3168C2293J867I027Q1997
18586I1024l1924L3215a72764H3185j7573A3838e1745b4766G9247k4596b00157
18574b55918c1274j70500c7173A86333c77977a87392q739j02123G1105a76382
18563B7407M004e9679P412A67908B4197K0432a33327m3028J1869A08498D2041
$$ plain form
18644 69623 -174327 -36658 6531 -36759 85843 -43101 41813 1493 -107914 -394247 30765
18632 104775 -147896 123963 -217450 -220210 -227964 -69615 -21473 15525 -77773 -392488 -14799
18620 133274 37986 128955 -102475 -97074 123644 -54191 -271603 -308602 -6034 -424608 -41452
18608 100550 -104151 -312858 -195701 -341134 -51929 137707 -101852 -420706 -254604 33248
18597 -371844 -152110 -115220 -39577 -293740 -142642 268388 73168 32293 34160 9027 91024
18586 91024 59100 92315 -172764 83185 65612 13838 -51745 -24766 79247 54651 -200157
18574 -255918 -31274 -201774 -37173 186333 -377977 -187392 -196131 -298254 71105 -176382
18563 27407 31411 -59679 -52267 167908 24197 44629 -133327 -176355 -164486 108498 42041
18551A68552b38572m8578N1892I6722b05128A12260b97122i3118A23627a26539
18540A08079A3604e2954D9859h0832j30350G5990d8094K1764j73577A72823f7726
18528A15862c05689A80911a07819k9965B1908E750E44J93243c70231R6303N8154
18517b15774N9355N6041j3397l1587J9828l6870B9043f3199F1626M1694b75467
18505b88068B7427P241a07739j659H1596N1157c97560A03142b12957F1586c08300
18493b02417K5517a9105j70067P4667r3690k2769l56027A2755J99570e2336b1262
18481D364c9050o041j04289G543b39530B29916g6316A2635J20969b69202C80559
18469B28065F3722a1394k07114M8601B59160a95170j04731A55222o8415K07985
$$ plain form
18551 168552 -238572 -287150 -235258 96722 -205128 112260 -297122 -93118 123627 -126539
18540 108079 13604 -52954 49859 -80832 -211182 75990 -48094 -26330 -199907 172823 -67726
18528 115862 -305689 180911 -107819 -137784 21908 5750 544 193787 -370231 -273928 -215774
18517 -215774 -156419 -100378 -113775 -145362 -125534 -162404 29043 -63199 61626 103320 -275467
18505 -288068 27427 34668 -107739 -109398 81596 132753 -397560 103142 -212957 61586 -308300
18493 -202417 -176900 -19105 -189172 -114505 -208195 -230964 -586991 12755 212325 -52336 -21262
18481 4364 -39050 -45091 -149380 7543 -239530 229916 -76316 12635 133604 -269202 380559
18469 228065 63722 -11394 -218508 -169907 259160 -195170 -299901 155222 86807 294792
18459B94792f0501A32186c8649B25721a36010n3607j23117o776M778J48663M4956
18448a21113A52742E624a65186A50182F7202e04172A54217b61999B47674b14575
18437g2711n2644I2976i97r8621j28100J01372A75240k9723F7557a16544k32326
18426c48870D1649P8387a95084R3139B5789A1285a85968L4111A7853b41375h8985
18414A13649b79591R3687E1396N3203J19891J66050b34591D1534a755j53205A61602
18402a05718A14842m3418E806c05762A38450F8631L0274F72h4814p4760r2597
18391b52171h6098j54248a00540B07290M7533b79496A52677a20508C46217A06081
18380A93692c50235b9479j75769A41379b22020h6507A50434c86230A6636a46425
$$ plain form
18459 294792 -60501 132186 -38649 225721 -136010 -189617 -312734 -319510 -314732 -166069 -121113
18448 -121113 152742 5624 -165186 150182 67202 -504172 154217 -261999 247674 -214575
18437 -72711 -125355 92976 -997 -99618 -227718 -126346 175240 145517 67557 -116544 -348870
18426 -348870 41649 120036 -195084 -101945 25789 11285 -185968 -151857 17853 -241375 -88985
18414 113649 -279591 -185904 51396 104599 224490 390540 -234591 41534 -1755 -154960 161602
18402 -105718 114842 71424 5806 -305762 138450 68631 98905 672 -84814 -159574 -252171
18391 -252171 -86098 -240346 -100540 207290 254823 -279496 152677 -120508 346217 106081
18380 193692 -350235 -29479 -205248 141379 -222020 -86507 150434 -386230 16636 -146425
18369c21491C10561a59965I9623g5738B64341A6693J7706b9844k17855b5748o2827
18358h8575A81881c51450i4571B34224I6732O4992K29392a3166m5268B63239i2559
18346a29254m1265A48802c3962F8380J29249c46910C173a62041j60505J07358
18336b15188g1446C47573a02734C01197A00983b52488J8456C5113h0454o5020
18326a45474p8082D1255g4721B6556N1936M5614b11679n243B00570d6957C31071
18314F986a27670D6432j6828g9888j82689A44517h0820c7753q3256B47025b05425
18302F5450K22915b75437D4853b62536R3856E9266I810J7988K89381M7317a79372
18290b5817k1596q4500A2983g6134p2138b5465E4288J66268e0629B35254b86177
$$ plain form
18369 -321491 310561 -159965 99623 -75738 264341 16693 34399 -29844 -247699 -25748 -88575
18358 -88575 181881 -351450 -94571 234224 96732 161724 391116 -13166 -58434 263239 -92559
18346 -129254 -170519 148802 -33962 68380 197629 -346910 3173 -162041 -322546 -215188
18336 -215188 -71446 347573 -102734 301197 100983 -252488 -234032 35113 -80454 -145474
18326 -145474 -223556 41255 -74721 26556 78492 124106 -211679 -216922 200570 -46957 331071
18314 6986 -127670 46432 29604 -79888 -262577 144517 -80820 -37753 -121009 247025 -205425
18302 65450 288365 -275437 44853 -262536 -168680 59266 9810 27798 317179 364496 -179372
18290 -25817 -47413 -131913 12983 -76134 -148272 -25465 54288 220556 -50629 235254 -286177
18278d73920F4294J99935F6672B824h0021p5946B80567a32823C41274d6082K2211
18267b3871A93530C1335Q3952M2140c1507j09226G0734c4315m3178A57148N4346
18256B11494c87118B46151b13j74317P8967c3099j02166c8631F7459a06552A61282
18244a17981b2362F8037c34140C70685a30596E96a87860p9398A82464a47841g1903
18232a90106b3745B08726b95174E6940a14300J9207A81122q1468c58667i5899
18221g7403j00178f0429E2180a98585c0080E8671k076b60742J03625o5260c6735
18209a1398E34640b98975I732g9967k66122B57107A8049a09269j89889E6898e9695
18197h5196C0888i1511A1660K8989a03620A27986i0604B38916b96633H7443k2888
$$ plain form
18278 -473920 64294 264229 66672 2824 -80021 -155967 280567 -132823 341274 -46082 -23871
18267 -23871 193530 31335 115287 157427 -31507 -140733 70734 -34315 -77493 157148 211494
18256 211494 -387118 246151 -213 -174530 -95563 -33099 -135265 -38631 67459 -106552 161282
18244 -117981 -22362 68037 -334140 370685 -130596 596 -187860 -267258 182464 -147841 -71903
18232 -190106 -23745 208726 -295174 56940 -114300 -95093 181122 99654 -358667 -95899
18221 -77403 -177581 -60429 52180 -198585 -30080 58671 56595 -260742 -157117 -222377 -36735
18209 -11398 534640 -298975 9732 -79967 -346089 257107 18049 -109269 -299158 56898 -59695
18197 -85196 30888 -91511 11660 40649 -103620 127986 -90604 238916 -296633 87443 64555
18186F4555c27447J4362J00812c5971p4044K0622K8607B49028j13311M4547b39370
18174A76251G3263a61639c7144a7246o7027E8811b03159B99342f5859k2485o980
18163i5324Q125A2503K12008M2308j14707a72152k23075f7732o1845B89412d8220
18151A78259a65254D7488c7520H0632b2403A23472h5014A47324P5103a62151A34372
18139a06857k63204A484J44201a04957M1592I0177a64951k97251a53113C6450
18128e3923j18785K6276N0342L6335q6351E7209g0499H3563a90620f1536O645
18117e4891A48534P1972b28278A16471c44754i5161a8567p531q3740K7790k64270
18106c46318D02514e167A7069J97693b70156B12920p7404J17759E4632f8724b2128
$$ plain form
18186 64555 -327447 -313085 -212273 -35971 -110015 -89393 -60786 249028 135717 180264 -239370
18174 176251 73263 -161639 -37144 -17246 -84273 58811 -203159 299342 -65859 -88344 -95324
18163 -95324 -87199 12503 224511 266819 152112 -172152 -395227 -67732 -129577 289412 -48220
18151 178259 -165254 47488 -37520 80632 -22403 123472 -85014 147324 222427 -162151 134372
18139 -106857 -370061 1484 145685 -104957 -63365 90177 -164951 -462202 -153113 36450
18128 -53923 -172708 -146432 -96090 -59755 -146106 57209 -70499 83563 -190620 -61536 -54891
18117 -54891 148534 220506 -228278 116471 -344754 -95161 -18567 -26098 -109838 -82048 -346318
18106 -346318 402514 -5167 17069 214762 -270156 212920 135516 253275 54632 -68724 -22128
18094a4499o4104j29553b8214j74839C40609b54069a6796J316j66327A25999h3802
18082b51201N4154P5891I0975m2508b23698G0601c1191k2831j20630B4206d9272
18070A92596p0507l3321a81461A8577b07675i9450A1595N1121a01030I6053c62073
18058b0331D1883f951A27254a7992I8650b12306d0537l57544G1116c18032J05769
18047b12263d9722A12124Q7640H6030J6401a78734K1904D1426J20539i7475B43850
18035b03919e4379k641A80225H4526k0802Q0811i5489B84902j27379A64d8627
18023b58572F1391g424n3465A43949c07145J8801D51233b73869A53849O1795b95610
18011a00535H084J82357b1250o3531Q571F686K40477l4257f7650b7992A98829
$$ plain form
18094 -14499 -78603 -208156 -28214 -203053 340609 -254069 -16796 -15480 -181807 125999 -83802
18082 -251201 -197047 -121156 90975 48467 -223698 70601 -31191 -54022 -174652 24206 -49272
18070 192596 122089 88768 -181461 18577 -207675 -99450 11595 62716 -101030 96053 -362073
18058 -20331 41883 -6951 127254 -17992 98650 -212306 -40537 -398081 71116 -318032 -212263
18047 -212263 -49722 112124 199764 86030 102431 -178734 -156830 41426 161965 -97475 243850
18035 -203919 -54379 -57020 180225 84526 63724 144535 -95489 284902 157523 164 -48627
18023 -258572 61391 -7424 -60889 143949 -307145 -288344 451233 -273869 153849 215644 -295610
18011 -100535 8084 190441 -21250 -84781 -76210 6686 247163 212906 -67650 -27992 198829
17999A02445a60201q8749d6055A54566a70085g3407q6914F349a05345A7860K21686
17988B39546b08331G8218A794a08806A17207n3370j5845A6729L60285a6488l0893
17977d7381n4452B5873a27582J8681k48861f6235p7696J7188j67626G851a05296
17965f4541A55487i1108A93123H0542k5165J09370b48801L4908A77549I773a38081
17953C64244c85244a2574k85644a4055A09292d6970j9912A36363K49687a75774
17942c6620l4535j8833F4376J91024a06626A9705G46d8000D3293B0645J06371
17931A27016J31280q1270e3221C45385r4646c61523b4502E0320J69129M7185B5373
17919B47422d6795n6890K4412G8957d0206j23131h803A28183k8074J96096G0766
$$ plain form
17999 102445 -160201 -248950 -46055 154566 -170085 -73407 -160321 6349 -105345 17860 239546
17988 239546 -208331 78218 1794 -108806 117207 63837 47992 16729 377014 -16488 -47381
17977 -47381 -101833 25873 -127582 -108901 -357762 -66235 -143931 -126743 -294369 7851 -105296
17965 -64541 155487 -91108 193123 80542 55377 164747 -248801 -213893 177549 9773 -138081
17953 364244 -385244 -12574 -298218 -14055 109292 -46970 -66882 136363 386050 -175774
17942 -36620 -71155 -89988 64376 255400 -106626 19705 746 -48000 43293 20645 127016
17931 127016 258296 177026 -53221 345385 250739 -361523 -24502 50320 219449 266634 25373
17919 247422 -46795 -103685 -79273 78957 -40206 -163337 -8803 128183 100109 296205 70766
17907d3820C7196h1648n1289D01585C0884J10192k0512l0310h155B12609F6643
17895d8819k09279C0611a68824c3350n4359B24838p3524F5791k546i055C97286
17883h9582A90738i1669A35977D3597q967J06346K3243f9168A28875m698Q2172
17872B06349a6087m3524A97071b98452E3138K38537b59797e3761C06147J6724
17862C22871e9920A31755L871i6013A45750J62545A24450k3174C3091J4097b41485
17850A98138n6310a5332k28981I2393h4940L4612A41146J1641b95096d2187a4509
17838A28067b01635A07427b5606j4656A27274D5732L8158a07555F8638M0265K87292
17827C96195m6809o9660a15723C9036J26477o0753B9558h7966j81636A94852a64269
$$ plain form
17907 -43820 37196 -81648 -132937 401585 30884 141076 120564 90254 -8155 212609 66643
17895 -48819 -258098 30611 -168824 -33350 -87709 224838 151314 65791 63245 -9055 397286
17883 -89582 190738 -91669 135977 43597 34630 140976 164219 -69168 128875 124177 206349
17872 206349 -16087 -59611 197071 -298452 53138 291675 -259797 -53761 306147 322871
17862 322871 -59920 131755 135626 -96013 145750 308295 124450 101276 33091 47188 -241485
17850 198138 141828 -15332 -244313 92393 -84940 -50328 141146 152787 -295096 -42187 -14509
17838 128067 -201635 107427 -25606 -40262 127274 45732 83890 -107555 68638 108903 396195
17827 396195 349386 279726 -115723 39036 165513 104760 29558 -87966 -269602 194852 -164269
17815a72338C47147A627a35951o2834B54269a65364g838L128A46813d4661j5556
17804f0217j21569a0042c78B57595l1680G6332J29978E0451j1787d0047B10587
17792d6689D091Q9593J63243l4551g7427B07464a20039C37338C1303L1080g1235
17780a27508E6895P3751m7496a142E3685e6966k36649F1980d0239D0593N5436
17769I6029K02753F0527h0782r4698p6889A78800b49002b0147j7880A24177e1314
17757I4832K5146O304a89202P3262D35501h3799B37539m4041K10480I6116K2625
17746A18741L1555K3029D6386a81771A12624O3854D0120a74844B57528B5587J33843
17735A59430b3882H7674G57a63010L1687J1524A509K51834b14326B626N2483b18401
$$ plain form
17815 -172338 347147 1627 -135951 -198785 254269 -165364 -7838 -4710 146813 -44661 -60217
17804 -60217 -181786 -10042 -378 257595 225915 76332 206310 50451 38664 -40047 210587
17792 -46689 4091 93684 256927 222376 -77427 207464 -120039 337338 31303 62383 -71235
17780 -127508 56895 130646 83150 -1142 53685 -56966 -293615 61980 -40239 40593 96029
17769 96029 298782 60527 -80782 -175480 -252369 178800 -249002 -20147 -38027 124177 -51314
17757 94832 119978 126282 -189202 -115940 435501 -83799 237539 193498 403978 96116 118741
17746 118741 150296 173325 46386 -181771 112624 176478 40120 -174844 257528 25587 159430
17735 159430 -23882 87674 757 -163010 -131323 -119799 1509 253343 -214326 2626 55109 -218401
17722A61715a12298A38814k3252L2472g6893D6241a80036c7802A28317J84385
17712C12702i1324B3449b57774B68294n3751D0530A0654J51066c5334D2861J32857
17701A75718K45770k02490P1252R0645g1736B61319a75770l254B12937a29053
17690D73917A74003b8134I8351A4603a89255A6253M6283D720A838M47282G3391
17678E8825a37962A53516J07279G8801J01364a95699A6950N57265B39633a06430
17667A03050J9619K50026b37906M0990H2490N3428K62517A91193A3773L45497
17657C59270G0756M1593d275q4612A02306J36500J1991a05932B56810j15707a3361
17645a27806A13137N8761e6037C919K21259r5421J46453j36974J81341K66395
$$ plain form
17722 161715 -112298 138814 115562 148034 -76893 46241 -180036 -37802 128317 312702
17712 312702 -91324 23449 -257774 268294 214543 40530 10654 161720 -35334 42861 175718
17701 175718 421488 218998 290250 380895 -71736 261319 -175770 -179024 212937 -129053
17690 473917 174003 -28134 98351 14603 -189255 16253 62536 4720 1838 449120 73391
17678 58825 -137962 153516 260795 78801 180165 -195699 16950 574215 239633 -106430
17667 103050 122669 372695 -237906 -196916 82490 135918 398435 191193 13773 359270
17657 359270 70756 112349 -4275 -88887 102306 238806 250797 -105932 256810 141103 -13361
17645 -127806 113137 171898 -56037 3919 225178 129757 276210 139236 320577 586972
17635E86972A13674D3661M8706i2738B44423b9631A01957J64044j30870J0316
17625A45447O0574I8226P7857e5819A02426b39413A79808B4794a93986F1343J03763
17614A65106J68506J7263j43643Q8310e728j09644A76087a8928k78232J34897
17604a62263j2722J3273a654B69023n6709M8627b7478A20852M01208j75811j2396
17593C33853D3196R9544J41976K9161A02030J89403A11891J49252E0249J23390
17583A73639R5678A2839O8845K80757j09411G8203l8637c23486C44109b43841
17572C64832A07016a4672A43126k9995a06853A21400E9894K00970C2472M0899
17562G3371J91055D0458h1646p3255L0456B9115K8035J0505g716j04652C58850
$$ plain form
17635 586972 113674 43661 92367 -92738 244423 -29631 101957 266001 135131 145447
17625 145447 206021 98226 176083 -55819 102426 -239413 179808 24794 -193986 61343 165106
17614 165106 333612 350875 207232 295542 -5728 -115372 176087 -18928 -297160 -162263
17604 -162263 -174985 -161712 -1654 269023 212314 260941 -27478 120852 522060 346249 333853
17593 333853 43196 142740 284716 313877 102030 291433 111891 261143 50249 173639
17583 173639 269317 12839 81684 362441 253030 78203 39566 -323486 344109 -243841
17572 364832 107016 -14672 143126 113131 -106853 121400 59894 260864 32472 73371
17562 73371 264426 40458 -81646 -154901 -124445 29115 57150 67655 -7716 -112368 358850
17550A95402q969e1018C94938A58752J07211b06260B60640a30455A96448B577
17539A94164P2154D1803L10717j18817e8255B80797M1973A32627e8740A30357
17528H5569M21654B05765J48327N4822A54543O7942J4666l2652J48536n685j02675
17517B44675L57539A72295J79474K63677k36582k3435K95574m0391O88563k34004
17507A065171k89616j05066j62284j22103m3611J77778A43694L55735n6019k4547
17497D18863J20234J50682K68661M8906k55365K89319m43952J7279n2541E0985
17486D26637j72573M7873M86687c5781C84700r2976q6511P6969P2287l1217N3021
17475C76273K07059k00886A34384L72608k26280m9538K9231O38L2003j14978q0549
$$ plain form
17550 195402 186433 -51018 394938 158752 265963 -206260 260640 -130455 196448 2577
17539 194164 266318 41803 352520 233703 -58255 280797 322770 132627 -58740 130357
17528 85569 507223 205765 354092 408914 154543 222485 237151 204499 353035 347350 244675
17517 244675 602214 172295 351769 615446 378864 355429 651003 610612 1299175 1065171
17507 1065171 775555 670489 508205 386102 342491 520269 143694 499429 443410 418863
17497 418863 539097 689779 958440 1007346 751981 1041300 597348 614627 562086 50985
17486 426637 254064 301937 788624 -35781 384700 291724 205213 282182 354469 323252 376273
17475 376273 583332 382446 134384 506992 280712 231174 260405 261043 293046 178068 97519
17464I7519K84385J24479B36756E3620J45326L59814j48954A88611H7022L71727
17454D58749j35126k9480L51778k55536m6121c5352A58743L4863J37694J92961
17444E24261A91662J04470M9314A68444K58645j30980J77952A60600J99839m4709
17434C15730j1313L35751j13108J33399j81453C2057L68808k2962m0980M13631
17424G50554C16398P2338L3532K58254j10612j03155O8649k60362J02486G7497
17413D92955P8j22250q9515J24251A55919J21904J67660K889j0465J82947k53420
17402C67434m8649A40878O2441J56539F1327J83799J88820J06681A53117P3310
17392B26427O2574j12379R279Q290P4385J77988m4301j93903O9474j9468P7749
$$ plain form
17464 97519 381904 506383 236756 53620 198946 558760 409806 188611 87022 458749
17454 458749 323623 294143 645921 390385 344264 -35352 158743 193606 331300 524261
17444 524261 191662 296132 345446 168444 427089 296109 474061 160600 360439 315730
17434 315730 304417 640168 527060 660459 479006 32057 400865 377903 336923 750554
17424 750554 316398 388736 422268 680522 569910 466755 535404 275042 377528 77497
17413 492955 493033 370783 281268 405519 155919 277823 445483 448372 437907 620854 367434
17402 367434 318785 140878 203319 359858 61327 245126 433946 540627 153117 226427
17392 226427 289001 176622 185901 194191 268576 446564 402263 208360 277834 258366 336115
17381C36115F8525a55216B13855L9958a5244E2089K47828c0862C97609o6269q1132
17370B50208j09800o3784J7682e6547F9936L87710j71271A37257o1362K0300K84711
17359C80906r1091P3836m6239J2628J05963j03066a2211B81272k3498K04475j60310
17348C01939J91406j59055f1811B78308M605n9548r4329L659J4631J38900M2000
17337C28226j11388n8649J09389J05164j81200L04110j68165C4653M67287J0912
17327E12852j99576m0710A29039L9544K35988A60002p1680K03237j35611E5731
17316C85857N1395n9955A36982J61133j26728R9347O9999J00857j77499j14584
17306A49507J4349p7783K92487F6201K22158A25636M02029k21325j39521M59832
$$ plain form
17381 336115 68525 -155216 213855 253813 -15244 52089 299917 -30862 397609 331340 250208
17370 250208 140408 76624 94306 -56547 69936 457646 286375 137257 75895 96195 380906
17359 380906 289815 363651 317412 330040 436003 332937 -12211 281272 257774 462249 301939
17348 301939 493345 334290 -61811 278308 282913 223365 129036 132695 147326 286226 328226
17337 328226 216838 158189 267578 372742 191542 495652 327487 34653 501940 512852
17327 512852 313276 272566 129039 168583 404571 160002 88322 291559 155948 55731
17316 385857 437252 377297 136982 298115 171387 270734 340733 441590 264091 149507
17306 149507 163856 86073 378560 66201 288359 125636 527665 306340 166819 626651
17296F26651j55614j79615o8857J32352J0628m9926K17959j6985H7823K20080
17286C07903K20014B51482K26901G8465J88189K11809j52870q9705o6959K22616
17276C91545K51555q7282Q973B21305J4599L02615B02127N8057K57367a76926
17265C92136I0993N9084a51276B03165J25552B1573L15708A41989J09364K66226
17255E17579n3302p6008j44332J23184j31973L12197j3151j41951K58449k34877
17245D15815A60796Q6348m3577J62091A58926L88629j30073k00351M69525D3023
17234E76250B49970M56191k41809j80483J14592K22310k71066K41256k67912D9003
17223B08228K73779k18850j05716M09203j30757o7959N5566K22831C13778J61337
$$ plain form
17296 626651 471037 291422 222565 354917 365545 315619 533578 516593 87823 307903
17286 307903 527917 251482 478383 78465 266654 478463 325593 235888 168929 391545
17276 391545 643100 555818 564791 221305 235904 538519 202127 260184 517551 -176926
17265 392136 90993 150077 -151276 203165 328717 21573 337281 141989 251353 517579
17255 517579 464277 388269 243937 367121 235148 547345 534194 392243 650692 415815
17245 415815 160796 247144 203567 365658 158926 547555 417482 217131 686656 43023
17234 576250 249970 706161 464352 283869 398461 620771 349705 590961 323049 49003
17223 208228 482007 263157 157441 566644 435887 367928 423494 646325 313778 475115
17213D75115A71446C86J93540L76714B48609J79155j22495A17340P59183k48257
17203F28266B13019E9396M48917B7885N51070j4249r2376P3243a2422E13685k55178
17192B58507J82287J35088B31372J79229j34001A29019K66616A59399N00047J4306
17182F73752C23621J38014N2466j28026j55728K20199N9600m6771j80011q2561
17172B00803J82815M52923C16089L60319j98881N8874A38605N55025l06297n780
17162C81553O0925L53300l00175J42782r1730B72720L88234j19412A24426J68987
17152B93413O6056L6260J33648j43824P5966k20968N44580j47555j20529J93704
17142G10751o1505M2260J30356C52372p2896N23487o9150C18232J25039K68859
$$ plain form
17213 475115 171446 386 193926 570640 248609 427764 305269 117340 876523 628266
17203 628266 213019 59396 508313 27885 578955 564706 472330 545573 -12422 513685 258507
17192 258507 440794 575882 231372 410601 276600 129019 395635 159399 659446 673752
17182 673752 323621 461635 514101 386075 230347 450546 510146 463375 283364 200803
17172 200803 383618 836541 316089 676408 477527 536401 138605 693630 387333 381553
17162 381553 442478 795778 495603 638385 546655 272720 660954 541542 124426 293413
17152 293413 359469 395729 529377 385553 461519 240551 785131 637576 517047 710751
17142 710751 649246 691506 821862 352372 279476 802963 733813 318232 443271 712130
17132G12130l29770R3667K44678k82104K08153j52420K63226l42042F8144M99726
17122E67870k71423M85794q3908l18773J81763B51152K40745p2594J61553J32634
17112G13490B25932K77289J09221o4240J071P0927k27810m0902K80896j29011
17102E03373J76678B22492N95428j39436C37162K76546J55363l24499M16430k68004
17092E92998J48733j78699n6145K2512K37194K60350m34101n4365J44871A37432
17081F05443K8728k53420L8271L59048p0802j08940k48370J82589L20295j21220
17071G31622j59840L97770C51620J67235K55767j78416L67713D68953K18953o3281
17061F24625j2526p8667N89505m96966J95036L8439k59177J53002Q1973L479k21481
$$ plain form
17132 712130 382360 476027 720705 438601 646754 494334 757560 415518 68144 567870
17122 567870 296447 782241 698333 379560 561323 251152 491897 419303 580856 713490
17112 713490 225932 503221 612442 548202 549273 620200 392390 351488 632384 503373
17102 503373 680051 222492 817920 678484 337162 613708 769071 444572 861002 592998
17092 592998 741731 563032 506887 529399 766593 1026943 592842 538477 683348 137432
17081 605443 634171 380751 419022 778070 707268 598328 349958 532547 852842 731622
17071 731622 571782 969552 351620 518855 774622 596206 963919 468953 687906 624625
17061 624625 612099 533432 1122937 625971 821007 859446 600269 753271 835244 838723 617242
17050F17242J68168j79657J04236K69165j88987l28869O26269k12656P8619n1549
17040I01981k15929J00645j46083K10123Q2030m32739N07139l74567M62068J50934
17030A245602j80019k24228O7639q6368J20281j38868J53767J27257j32968K42690
17020A194785r5979p5577j59305k20071K53182K4708j04719R9748j55524J15140
17010H76388j01426L57286O9581r2237k75287K96346L2912j07552J52421k15132
17000I93300J10357k76958M02414j01068L7151L96199l48388r6086r628J20068
16990A227361l36859K77933j88916L47280k72773L65979k63532j74328K41372
16981A223517Q6514K36525j61679k12879L30849m02210L00876k12142L32322k70753
$$ plain form
17050 617242 785410 605753 709989 979154 790167 461298 1087567 874911 953530 901981
17040 901981 686052 786697 640614 850737 932767 500028 1007167 632600 1094668 1245602
17030 1245602 1065583 841355 908994 822626 942907 804039 957806 1085063 952095 1194785
17020 1194785 1098806 1023229 863924 643853 897035 921743 817024 916772 761248 876388
17010 876388 774962 1132248 1201829 1109592 834305 1130651 1163563 1056011 1208432 993300
17000 993300 1103657 826699 1229113 1128045 1165196 1561395 1213007 1116921 1107293 1227361
16990 1227361 890502 1168435 979519 1326799 1054026 1420005 1156473 982145 1223517
16981 1223517 1310031 1546556 1384877 1171998 1502847 1100637 1401513 1189371 1521693 1250940
16971A250940L0196m5078J3008L64212o15m28919K15304j48890K59305N0556q7823
16960A472196j12562J56728j59253K08782k17865J10971k12600N80403l21522
16951A505278p5546K09016j06906L00595m93037M76988j44943J22445L65474n11602
16941A647762K75130k51132K2533J1643k18872L36476J89481j8275k4153r5170
16931A875423j52353j3038L01116m5333j51921K75634O535p1676j59407K28503
16921B093483k20370L80627l92602L74991l30236P9196J10091K3180j75715K44491
16911B187136j83757J57999P1932J64346L891O0200k33523J1620J6932J9536m3042
16900B233270O6224N8533L69216q604j77440r7645l4008J96816m7214q091K576
$$ plain form
16971 1250940 1281136 1236058 1249066 1613278 1612663 1183744 1399048 1250158 1509463 1560019 1472196
16960 1472196 1359634 1516362 1357109 1565891 1348026 1458997 1246397 1826800 1505278
16951 1505278 1429732 1638748 1531842 1832437 1339400 1816388 1671445 1793890 2159364 1647762
16941 1647762 1922892 1671760 1694293 1705936 1487064 1823540 2013021 1994746 1970593 1875423
16931 1875423 1723070 1710032 2011148 1965815 1813894 2089528 2096063 2024387 1864980 2093483
16921 2093483 1873113 2253740 1861138 2236129 1905893 1985089 2095180 2118360 1942645 2187136
16911 2187136 2003379 2161378 2233310 2397656 2401547 2461747 2228224 2239844 2256776 2276312 2233270
16900 2233270 2299494 2358027 2727243 2718639 2541199 2443554 2409546 2606362 2559148 2551057 2553633
16889B553633J75239o090J92863K62650j83280M5257k90479M72275j38747r5260
16879B988061J55312l4725n15392O67856k38016L07293J03551J29783n41585N92181
16869C614319k54255Q1247N3608j13285L61573p2838K37519l54250N19817N2533
16859D125988j96320j39415J60633j9680J21457L07097k56469J43911L3163K6462
16849D306827J29454K41834J00093j93495k9519J09338k33113M58440l43340N88432
16839E134951k80057N4218L07744l1663J57202M6902K85665r1190K45719J4333
16829E843824k23140K83500J94320j16326M8457Q6650L22958j8034K76240k25878
16819F472571L20029j340J99988L65070r3773K977L04520o2676L15339j30215
$$ plain form
16889 2553633 2728872 2722782 2915645 3178295 2995015 3040272 2749793 3222068 3083321 2988061
16879 2988061 3143373 3108648 2593256 3261112 3023096 3330389 3433940 3563723 3022138 3614319
16869 3614319 3360064 3441311 3494919 3381634 3743207 3670369 3907888 3553638 4073455 4125988
16859 4125988 3929668 3790253 3950886 3931206 4052663 4359760 4103291 4247202 4280365 4306827
16849 4306827 4436281 4678115 4778208 4584713 4555194 4664532 4431419 4889859 4546519 5134951
16839 5134951 4854894 4909112 5216856 5185193 5342395 5389297 5674962 5583772 5829491 5843824
16829 5843824 5620684 5904184 6098504 5982178 6030635 6117285 6440243 6422209 6698449 6472571
16819 6472571 6792600 6791260 6991248 7356318 7262545 7265522 7570042 7507366 7822705 7692490
16809G692490M32904q0710M70363Q078L84776L82541P3766N71178l75870L64739
16799I924255n8742K27027Q3533M85790k5671J38850L76132K79614M76296j167
16789A1905917L25827o7656P19204N5762L18242Q6105J032976J24280N6212J0628
16779A4567497Q22091R4878P80671k36281P65022Q26125L2165L28590Q98404L91889
16769A9271051P54900L70176N77415O72315K70203P25065J106766L20159P86983
16760B4855033O21946Q76203Q22941Q00964P41393J123316J053869J017829Q84201
16751C2797695R01906J504239J087596J068983J537484J534055J172918J727704
16743D3332580J018292J927204J448190K048840J613695K272036K108973J790889
$$ plain form
16809 7692490 8125394 8044684 8515047 8523125 8907901 9290442 9364208 9935386 9559516 9924255
16799 9924255 9865513 10092540 10176073 10661863 10636192 10775042 11151174 11430788 11907084 11905917
16789 11905917 12231744 12164088 12883292 12939054 13257296 13343401 14376377 14500657 14556869 14567497
16779 14567497 15389588 15484466 16265137 16028856 16793878 17620003 17652168 17980758 18879162 19271051
16769 19271051 20025951 20396127 20973542 21645857 21916060 22641125 23747891 24068050 24855033
16760 24855033 25476979 26353182 27176123 27977087 28718480 29841796 30895665 31913494 32797695
16751 32797695 33699601 35203840 36291436 37360419 38897903 40431958 41604876 43332580
16743 43332580 44350872 46278076 47726266 49775106 51388801 53660837 55769810 57560699
16735E7560699K365443K137595K155951K788147K386683K660509L043151K322289
16727G7420467L315341K889921L009241K875948L334799K927786L199429L230609
16719A02203541L113899K960463K803721K988358K451861K640533K320522K085446
16711A23568344J926242J429281J086233Q96886N87517J94483l07185k43748r72725
16702A28165328j214769j122709k144511k212065k138735k568857k869297k652471
16694A11241914k759960l280077l189192l303234k826626l402525l106653l227677
16686H6145970l100571k934801l102430k846449k274842k912936k526888k808119
16678F3638934k191928k660918j863286k363076j923902j879323k115788j687027
$$ plain form
16735 57560699 59926142 62063737 64219688 67007835 69394518 72055027 75098178 77420467
16727 77420467 80735808 83625729 86634970 89510918 92845717 95773503 98972932 102203541
16719 102203541 105317440 108277903 111081624 114069982 116521843 119162376 121482898 123568344
16711 123568344 125494586 126923867 128010100 128906986 129494503 129688986 129381801 129138053 128165328
16702 128165328 126950559 125827850 123683339 121471274 119332539 116763682 113894385 111241914
16694 111241914 108481954 105201877 102012685 98709451 95882825 92480300 89373647 86145970
16686 86145970 83045399 80110598 77008168 74161719 71886877 68973941 66447053 63638934
16678 63638934 61447006 58786088 56922802 54559726 52635824 50756501 48640713 46953686
16670D6953686j772372j455223j426001j886260j119631j626840j469896j028927
16662C5168536j254458j208976q82391j415697r64949q21597q42964j101740q51960
16653B5823804p04017m07092j040202q74011o10949p38610m90756p04619j22433
16644B0131115j108399n2578p57425m50604n19135k61430n49517l94108l83330
16635A5654589o09755l56897l96409m00053m81869k23454R4726p83977Q2762n00777
16625A2078886L9772m85223m78153r1901l95041K50254m19170o24513m9457j14081
16615I711373k11410k93843l16387K50379n02285N7784m48942P8620k21256l55643
16605G748390J07393q0675N4972m75330K39908o83785M2010J41769l77229j45054
$$ plain form
16670 46953686 45181314 43726091 42300090 40413830 39294199 37667359 36197463 35168536
16662 35168536 33914078 32705102 31822711 30407014 29442065 28620468 27777504 26675764 25823804
16653 25823804 25119787 24712695 23672493 22798482 22187533 21448923 20958167 20253548 20131115
16644 20131115 19022716 18970138 18212713 17762109 17242974 16981544 16432027 16037919 15654589
16635 15654589 15044834 14687937 14291528 13891475 13409606 13186152 13280878 12496901 12579663 12078886
16625 12078886 12118658 11633435 11155282 11063381 10668340 10918594 10499424 9874911 9825454 9711373
16615 9711373 9499963 9206120 8889733 9140112 8637827 8695611 8246669 8325289 8104033 7748390
16605 7748390 7855783 7775108 7830080 7354750 7594658 6910873 6952883 7094652 6717423 6572369
16595F572369J32214J67490q21279L23309m42103j65488Q6053k57890J94052J4552
16585E803279k77774l35869l8243j5368K49008m4692l11652l01100N57783l91230
16575D894142j98946O7088j10242q3025l69802O5200K4089r3112R8704l65927
16565C928169K67054l01670J76780l49837J15925n3197j85816L9506J15712J04336
16555C856962n29610N9487K31820n34480N3830N75183q16506K46228m334r1027
16545C047553k0953Q6408j56146K5713P5103n03429K45934q8280K585K03774l71487
16534B546775J55098J69721k00472j29212J28332p9513j01500l1696m2613K93280
16524B708200j58588m14220M65885o3349j57827j86067J09369k68529J7723K801
$$ plain form
16595 6572369 6704583 6872073 6050794 6374103 5932000 5766512 5852565 5594675 5788727 5803279
16585 5803279 5525505 5189636 5151393 5136025 5385033 5340341 5028689 4727589 5285372 4894142
16575 4894142 4695196 4762284 4652042 4569017 4199215 4264415 4288504 4195392 4294096 3928169
16565 3928169 4195223 3893553 4070333 3720496 3836421 3783224 3597408 3636914 3752626 3856962
16555 3856962 3327352 3386839 3618659 3084179 3138009 3713192 2896686 3142914 3138580 3047553
16545 3047553 3026600 3113008 2956862 2982575 3057678 2554249 2800183 2711903 2714488 2918262 2546775
16534 2546775 2701873 2871594 2671122 2541910 2670242 2590729 2489229 2457533 2414920 2708200
16524 2708200 2549612 2135392 2601277 2537928 2380101 2194034 2303403 2034874 2052597 2055398
16514B055398j22064K8746J21681k07374j51767p492L66263M9815l89815K73617
16504B017008J59847k16680J00868l27192J8391L73688k03001j70720m4379k8069
16494A679761K8146n0574K66926j22774j58754o7216L37471l14454j62652K40676
16484A676556j14091L2738j8059q9870K04976j6556j12484j84497l6039Q4119
16474A426793l7225J71720o081k5862m05702M80596j28617m12075K73004L9234
16464A375785j6451j10257k43335N07141m6813j92128j3985j4016l51814K58197
16454A152324M3057K6482J4156l1571l52524L93124j43793j8500L6173M3147j16725
16443A045350L0562l08420M66218k94736M56330l65108k06040M07582l94550L24053
$$ plain form
16514 2055398 1933334 1962080 2083761 1876387 1724620 1717128 2083391 2133206 1743391 2017008
16504 2017008 2176855 1960175 2061043 1733851 1752242 2125930 1922929 1752209 1707830 1679761
16494 1679761 1707907 1657333 1924259 1801485 1642731 1575515 1912986 1598532 1435880 1676556
16484 1676556 1562465 1595203 1577144 1487274 1692250 1675694 1563210 1378713 1342674 1426793
16474 1426793 1389568 1561288 1555207 1529345 1123643 1604239 1475622 1063547 1336551 1375785
16464 1375785 1359334 1249077 1005742 1512883 1466070 1273942 1259957 1245941 894127 1152324
16454 1152324 1195381 1221863 1236019 1204448 851924 1245048 1101255 1082755 1118928 1162075 1045350
16443 1045350 1075912 767492 1233710 938974 1395304 1030196 824156 1231738 837188 1161241
16433A161241R1032j66920j08117J35085j57988J83374n6850k69152K6565K82152
16423A120422j63465L31487l21033k00348L39206k60966k09560M35655k21030
16414H50368K54925l3196l12920Q0106J8985j0596J38549j70809K21523l56432
16404F80503M2287K02597j49743r0638K18292j34760R5314J5904m5554M9080k09537
16393F73745l2668K72084k07653K84628L6800m85364M07759l90118M01777l49443
16383F11547J61279j58786K15418Q9940l6174k83647l2446R6739j70326n6130
16373D37414M24946l24253L80162m47470L17667k52988J14288M9921j67628r8807
16363D33252K35261r0838j70119J70393m7701J23472k05331q495J21592L5216
$$ plain form
16433 1161241 1252273 1085353 977236 1112321 954333 1137707 1080857 811705 838270 1120422
16423 1120422 956957 1288444 967411 767063 1106269 845303 635743 1071398 850368
16414 850368 1105293 1072097 759177 839283 858268 847672 986221 815412 1036935 680503
16404 680503 722790 925387 775644 685006 903298 768538 863852 879756 834202 883282 673745
16393 673745 641077 913161 705508 990136 1026936 541572 949331 559213 960990 611547
16383 611547 772826 614040 829458 919398 883224 599577 567131 663870 493544 437414
16373 437414 862360 538107 918269 470799 788466 535478 649766 699687 532059 433252
16363 433252 668513 577675 407556 577949 530248 653720 448389 439894 561486 596702
16353E96702r9593k12967O45321l14357j53738m2428K16088j63289k11849O7318
16343C27208O00706j44897C12152K01668L82102m26924J12040J25364k41738K06261
16333F70925j92873j27515K3994L24721B57008L29390B68047M09265q2050k50375
16323C44887n8991Q4722j64296J81223J1412j18661K20269j40059J47167k15220
16313B92453o0645K58397k9143n3236J53052j63425J45514k25393j55082j0420
16303A52072R5563N8208K71241p1272l9000J00563j80533j3724O5769j76964K34454
16292D96377m1136r8537k356J00032J57492l0818a30030B16400J23229O0218J69041
16281E68888j88987k1223f501E66482N6588k85170J5772L09167j69295k43716
$$ plain form
16353 596702 497109 284142 929463 615106 461368 418940 635028 471739 259890 327208
16343 327208 927914 783017 312152 513820 895922 468998 581038 706402 464664 670925
16333 670925 478052 350537 374531 699252 257008 586398 268047 677312 595262 344887
16323 344887 285896 370618 206322 387545 398957 280296 500565 360506 507673 292453
16313 292453 231808 490205 461062 407826 560878 397453 542967 317574 162492 152072
16303 152072 247635 305843 577084 505812 466812 567375 386842 373118 438887 261923 496377
16292 496377 455241 356704 354348 454380 611872 581054 -130030 216400 339629 399847 568888
16281 568888 379901 358678 -6501 566482 623070 337900 353672 662839 493544 249828
16271B49828o6767H8914J50651K55480M2043j95131P7644J09966B26504j01183
16261A25321K72967A93439P2814q7190J46014M8100j28227C5014K19178J92389
16251D46581n943j70084P5585c4340B53357J20899K25175k80796K02413R0520
16241F11568B72421G9227K38486J45680R1426P7446B80938J65849p7250I8818
16230C86084N6912h591A77160J67355j44526G9851J82705J44148A29388n8860
16220G0528M09205a46364f7993B57015b4872D55351l6628A63960p4219J78123
16210B67864p3998k9113R4265J3071C2652J30611L03938K2724k22120J65146g4368
16198E4692K78179A21230J96015B5607J20179J15674I6983J1091J10429c2310
$$ plain form
16271 249828 183061 88914 239565 495045 537088 341957 419601 529567 226504 125321
16261 125321 398288 193439 266253 179063 325077 373177 244950 35014 254192 446581
16251 446581 440638 270554 346139 -34340 253357 374256 599431 318635 521048 611568
16241 611568 272421 79227 317713 463393 554819 632265 280938 446787 369537 98818
16230 386084 442996 -8591 177160 344515 199989 79851 262556 406704 129388 70528
16220 70528 479733 -146364 -67993 257015 -24872 455351 418723 163960 89741 267864
16210 267864 193866 164753 259018 272089 32652 163263 467201 489925 267805 432951 -74368
16198 54692 332871 121230 317245 25607 145786 261460 96983 108074 218503 -32310
16187a5211A23187N0296c8909B8842J50387J45773m3102A13314c8311A15077K24860
16176C39937G3571K62410j58950D7107N2231L45103B13276j00386L0749j096J34365
16165B76908p8674l0711P22K4456l5748d7944A74460J1106E4466J57069J26283
16154C37818i3136B53309M3822a16506B65926j04086a951B8021h7601B64486A12624
16142A31566b05459f5286k41644C42430K67581I332J00788i5431k5757L6577D05859
16130A50779a7516k5745B6663J21837J93965A03068l4556a0105B12684n0088d0563
16118A52897f5879k0239F305J88129q9283M2319P9447A01552J29381H4446e3382
16106C3121R2947M2547D1784Q0657D5060h1375H9110K133a92217B12939F3047
$$ plain form
16187 -15211 123187 173483 -38909 28842 179229 325002 281900 113314 -38311 115077 339937
16176 339937 73571 335981 177031 47107 99338 444441 213276 112890 143639 142543 276908
16165 276908 198234 167523 168245 192701 156953 -47944 174460 185566 54466 211535 337818
16154 337818 -93136 253309 297131 -116506 265926 161840 -1951 28021 -87601 264486 112624
16142 131566 -205459 -65286 -306930 342430 610011 9332 110120 -95431 -121188 -84611 405859
16130 150779 -17516 -43261 26663 148500 342465 103068 68512 -10105 212684 162596 -40563
16118 152897 -65879 -86118 6305 194434 105151 147470 226917 101552 230933 84446 -53382
16106 33121 126068 168615 41784 122441 45060 -81375 89110 91243 -192217 212939 63047
16094B39719j08007F302P1681k2633P193L51568G8574L00835j49979J2444B8348
16082g1316A63097n3990b62077D69933A41592r340G180a10808a727j28596C39708
16070B1638L82993a71188B40760a47855A28666D7916K7489a93080A84527a24208
16059E2815h2950j61038C54186N1065a78168h1697A36772b15357B52622C3020
16048a31051B2253P3515O38278b1654C55652D461J2895c03930I8484l6138J9902
16037H2248b24898i4873a5733j07930C11093q3964b00159B61178A23663E1829
16026f3533C69796H6095L0941a17226K0761L8040p3448C3583P640P9923f1120
16014b02539H4017a7738A03261m5154P3194h260A78743J0248A4073R7261J82163
$$ plain form
16094 239719 131712 6302 77983 55350 62543 414111 78574 379409 229430 241874 28348
16082 -71316 163097 109107 -262077 469933 141592 132252 7180 -110808 -1727 -130323 339708
16070 21638 404631 -171188 240760 -147855 128666 47916 75405 -193080 184527 -124208
16059 52815 -82950 -243988 354186 405251 -178168 -81697 136772 -215357 252622 33020
16048 -131051 22253 95768 734046 -21654 355652 4461 17356 -303930 98484 62346 82248
16037 82248 -224898 -94873 -15733 -123663 311093 227129 -200159 261178 123663 51829
16026 -63533 369796 86095 117036 -117226 -96465 -58425 -131873 33583 41223 121146 -61120
16014 -202539 84017 -17738 103261 58107 131301 -8260 178743 188991 14073 111334 293497
16003B93497c1697p0991B16828H359P5538M2116L0404C9088J41881b83600A8544
15991d8548B8794a82807A48722c33640f3504B15445A726J46593F6570a7548q182
15980b5730H4120K6787O0241a76353A34808L3032J89109Q2301J0267L96933J66952
15969A013402L12920n01796j00022l26686j40973j21138K5627J14596F9347d8012
15958B58864j09143a74928B41016b994C45162B4934l262Q8J92807a73308a8790
15946b49010C6746a6751o5148k68132J01264M7539I30P5211c00757A89520J9296
15935B08816b49218A17796K36330B6143J5656O1167e4166F8552c6411j00674E3010
15923B05200c7974D6440a04010I5066c2353A45797h2793b3537j27962A99071b20444
$$ plain form
16003 293497 -31697 -102688 216828 8359 83897 126013 156417 39088 180969 -283600 18544
15991 -48548 28794 -182807 148722 -333640 -63504 215445 1726 148319 66570 -17548 -25730
15980 -25730 84120 110907 171148 -176353 134808 167840 356949 439250 449517 846450 1013402
15969 1013402 1326322 824526 724504 397818 256845 135707 161334 275930 69347 -48012
15958 258864 149721 -174928 241016 -2994 345162 24934 21672 21760 214567 -173308 -18790
15946 -249010 36746 -16751 -81899 -350031 -248767 -201228 930 76141 -300757 189520 208816
15935 208816 -249218 117796 354126 26143 41799 102966 -54166 68552 -36411 -137085 53010
15923 205200 -37974 46440 -104010 95066 -32353 145797 -82793 -23537 -151499 199071 -220444
15911A9619a8038A2351a44431p0558m891i1958k63958b2192p8523c8891A5214
15899i2027j38515N6257P3655b4828k46223a04269l867L8154N47j22243F9601
15887a9747F9048M8472J27569j00430a21251j08968F1324M0616f1670A15061c25846
15875c648p2548B5511a50272B08861E9526e3854q1018j21433B0439a2893N61p25
15863a3057A27939n5138d1560B48293a81971j19417J39333a8819A98720b3384
15852c33079I140K03795H2523k3504d54034k5620K25312A67167e0670A3479J2562
15841B6041Q6387J93337g3104A81402a82222h2083l9167m0637J8209f3121E03109
15829A3041o115L81107a16341B71672B4364a73335c0396A9486b39044F1107O942
$$ plain form
15911 19619 -18038 12351 -144431 -214989 -219880 -91958 -355916 -22192 -100715 -38891 15214
15899 -92027 -230542 -174285 -100630 -24828 -271051 -104269 -108136 -69982 -69435 -191678 69601
15887 -19747 69048 117520 245089 144659 -121251 -230219 61324 101940 -61670 115061 -325846
15875 -3648 -76196 25511 -150272 208861 59526 -53854 -134872 -256305 20439 -12893 -12332 -13057
15863 -13057 127939 72801 -41560 248293 -181971 -301388 -162055 -18819 198720 -23384
15852 -333079 9140 212935 82523 59019 -454034 -479654 -254342 167167 -50670 13479 26041
15841 26041 112428 305765 -73104 181402 -182222 -82083 -121250 -161887 -143678 -63121 503109
15829 13041 6926 388033 -116341 271672 24364 -173335 -30396 19486 -239044 61107 68049
15818F8049a25975j9803D5675M8469D0417b0451A35359d1055j26741e7125E2727
15806C241a09056k222B00484a81779j29775P9091i6093M5676A14319E077J5629
15795B0706m14O9875C9118g7004A28386B2976a3030A39480A2236a75114a0853
15783a59001A95242b6178C64125d5502a6340B02334J3523c91340d3297I315a89468
15771b94190B98890b15237C2092J33077M1128A7837K97546a21298l06463I8913
15760C8880b39692A50850h6820l76412K12231Q1488e0688J5516J3219A30925c3130
15748G6252b53647M2894A8985O0421P7264D0259K25067M991D3873M38342A79048
15736b32520J1668D95654C3545L1615Q6305L675l7201l3502L38932B334a01620
$$ plain form
15818 68049 -125975 -145778 45675 94144 40417 -20451 135359 -41055 -167796 -57125 52727
15806 3241 -109056 -111278 200484 -181779 -311554 -232463 -96093 -50417 114319 5077 20706
15795 20706 20292 90167 39118 -77004 128386 22976 -13030 139480 12236 -175114 -10853
15783 -159001 195242 -26178 364125 -45502 -16340 202334 215857 -391340 -43297 9315 -189468
15771 -294190 298890 -215237 32092 165169 206297 17837 315383 -121298 -427761 98913
15760 38880 -239692 150850 -86820 -463232 -251001 -169513 -50688 -35172 -21953 130925 -33130
15748 76252 -253647 -210753 18985 79406 156670 40259 265326 270317 43873 482215 179048
15736 -232520 -220852 495654 33545 65160 151465 155140 117939 84437 423369 2334 -101620
15724a29426k5188C1455K6746J8734a10976j28525A8422h4320j13890C250a09396
15712b49233f2218k04319g1200p3890j5495r0440B11455b51465B31588a37802
15701F7918J06802a98083A52862a9411k1788A1755a39716l10895K08437H9290
15690A6126a49076f7690D7705M3590P5228b89569A18225h9624m0841H6858M885
15679I1743f1789E5730L8643J88847f2378B49112J447D2265J54867A0288a97373
15667d5228l14071B7572b28090A05558e3034m3168A16659M1110d47246b0419A56916
15655A81424f8460g762B53134a44118B03119A4669c3757p9999e2554a4493A01091
15643A3573d45047f5303D12758b19877K5996k4632I3814D456J86145d03480E6533
$$ plain form
15724 -129426 -154614 31455 58201 76935 -110976 -239501 18422 -84320 -198210 3250 -109396
15712 -249233 -62218 -266537 -71200 -145090 -160585 -251025 211455 -251465 231588 -137802
15701 67918 174720 -198083 152862 -19411 -41199 11755 -139716 -450611 -242174 89290
15690 16126 -149076 -67690 47705 91295 166523 -289569 118225 -89624 -130465 86858 91743
15679 91743 -61789 55730 94373 283220 -62378 249112 250559 42265 197132 10288 -197373
15667 -45228 -359299 27572 -228090 105558 -53034 -96202 116659 157769 -447246 -20419 156916
15655 181424 -68460 -7762 253134 -144118 203119 14669 -33757 -113756 -52554 -14493 101091
15643 13573 -445047 -65303 412758 -219877 -193881 -218513 93814 4456 190601 -403480 56533
15631C54642a81885F7127e3264l2661J6932A27333A5958b38783A43170b98062
15620h9022D503c8939j73233H2082N4356C3954J19515n2933d2468o2235j69305
15609b74008B7446a50355A6701f6907r5465E5508h2066l46236E5033A2474i4656
15597I213e2613A542b19079A7984K20088a6759A76607b9911H1048d7040k07926
15586b54966A34385l7985c74776b8300B1614b32286i9642C22589b64417A91090
15575C0825a15162H2201d4528B11405f6682K0894k8050b786C68557I2164g6056
15563b46510B85719F4331a37183A08812J42888l8825C5334b78564B0135b11712
15552a4752k30724J22620E6402b6431B4398L0505e0279a9710o1485C32276G2828
$$ plain form
15631 354642 -181885 67127 -53264 -85925 -68993 127333 15958 -238783 143170 -298062
15620 -89022 4503 -38939 -212172 82082 136438 33954 153469 100536 -42468 -104703 -274008
15609 -274008 27446 -150355 16701 -66907 -162372 55508 -82066 -428302 55033 12474 -94656
15597 9213 -52613 1542 -219079 17984 238072 -16759 176607 -29911 81048 -47040 -254966
15586 -254966 134385 96400 -374776 -28300 21614 -232286 -99642 322589 -264417 191090
15575 30825 -115162 82201 -44528 211405 -66682 -45788 -73838 -2786 368557 92164 -76056
15563 -246510 285719 64331 -137183 108812 251700 212875 35334 -278564 20135 -211712
15552 -14752 -245476 -122856 56402 -26431 24398 54903 -50279 -19710 -81195 332276 72828
15540B99605b63693a991r2334A4106a06829A15133e6361l1877n4441B29442b34554
15528b95393J14521L4341d7948B28928o2399i0795A50735h804B0822J65866f5068
15516c18790A49415i1715D4002M1772L9773N6290d8076b3305A65923K9350l0366
15505A64907o0107N4927a3584D7397a73079A09691a92304D90240E3470f0038D21888
15493A0053B30i0471D3459K6868M21557f0126B15620K67370j92483A7081J67637
15482A84718B9060J86196a84568A73054i9567A11865e312B3190A879O5152J03640
15471A70671H1472J92346J0466g977j8947A27728a1335A8325b80075D40267A08805
15459C75655M4550j06416M16082j87821j57380j61873J15098A16420Q4592m5608
$$ plain form
15540 299605 -263693 -1991 -94325 14106 -106829 115133 -56361 -88238 -142679 229442 -234554
15528 -295393 -180872 -146531 -47948 228928 166529 -90795 150735 -8804 20822 186688 -65068
15516 -318790 149415 -91715 44002 85774 125547 181837 -48076 -23305 165923 195273 164907
15505 164907 104800 159727 -13584 47397 -173079 109691 -192304 490240 53470 -60038 421888
15493 10053 230 -90471 43459 70327 491884 -60126 215620 482990 290507 17081 184718
15482 184718 29060 215256 -184568 173054 -99567 111865 -5312 23190 1879 67031 170671
15471 170671 81472 273818 284284 -7977 -26924 127728 -11335 18325 -280075 440267 108805
15459 375655 420205 313789 729871 542050 384670 222797 337895 116420 201012 155404
15449A55404E4886P0645l6261J97681a05719A63477b9950A67634b34463j07146
15439c41609A16760E2017J27625P9256h7743G8809J9727a18966A95117J46899
15429C42016O3371j24378L05632J39599M66218l95655K29334l79621B69331K71054
15419E40385B12429J00618j30367a82871B45350E19J97134B3326a51841M7939
15409a03902A45284b28399E7655a93893A77313a11072B27756b3864j18240d0363
15398B02283a57594k15520G5463h3150D2310b13134C4531L310N69Q6041e6658
15386a84680B79659q8486N3693b11274A00847b6226k19035G9543a08478d0173
15375A30450c0175C9658C546J33578a92961b5386j04780B50311I1331P88K72461
$$ plain form
15449 155404 54886 125531 89270 286951 -105719 163477 -29950 167634 -234463 -341609
15439 -341609 116760 52017 179642 258898 -87743 78809 98536 -118966 195117 342016
15429 342016 405387 281009 586641 726240 1192458 796803 1026137 646516 269331 540385
15419 540385 212429 313047 182680 -182871 245350 519 197653 23326 -151841 -103902
15409 -103902 145284 -228399 57655 -193893 177313 -111072 227756 -23864 -142104 -40363
15398 202283 -157594 -373114 75463 -83150 42310 -213134 34531 37841 38410 124451 -56658
15386 -184680 279659 191173 244866 -211274 100847 -26226 -245261 79543 -108478 -40173
15375 130450 -30175 39658 3546 137124 -192961 -25386 -130166 250311 91331 92119 364580
15364C64580a38369c0181l5720A64120J02195A31048J47629J00418D1888L12601
15354C54489j68537Q3474j29075J61344r7835F7602K75209A01573M4173A6550
15343E4672J89600a1864F663L66464n4361q3822E346J42232a2011C46847j65279
15332A81568b4926B93545A1687K90674n7576K1707G5198M35543k43567j05124
15322A62050J16914r8409K0074G946J94358A1957a20374b3051H9798D4128J11208
15311A55336L37166j49126l2963H0668J16753b8172D4861M00021k08161p1718
15301A65003E1761q919j5218L07960j31964J07511B8086O4806M17269B20788p7000
15290A43788g2653b6637A56993F3285b448k13513C19367G7195J58694d3051A83087
$$ plain form
15364 364580 -138369 -30181 -65901 164120 266315 131048 278677 379095 41888 354489
15354 354489 185952 269426 140351 301695 203860 67602 342811 101573 145746 16550
15343 54672 244272 -11864 6663 373127 318766 234944 5346 147578 -12011 346847 181568
15332 181568 -24926 293545 11687 302361 244785 266492 75198 510741 267174 162050
15322 162050 278964 180555 200629 7946 202304 11957 -120374 -23051 89798 44128 155336
15311 155336 492502 343376 310413 80668 197421 -28172 44861 444882 236721 165003
15301 165003 51761 42842 27624 335584 203620 311131 28086 92892 510161 220788 143788
15290 143788 -72653 -26637 156993 63285 -2448 -215961 319367 77195 235889 -43051 183087
15278a17255D0411a80795C70347a69022A53759J00937C2837J45603H144Q4325
15268I2469K79875A6561a76185A60393K64815B6471a07658B4443J43322a53662
15257g0090A26363K9373C8536K81397b26305B59304A24843J28847a18596b0639
15246f7103G3832f3622A49857g766o618A15973J1486K26944E9298c7562A94916
15234A28733J77431A42271e6626D76733J28007n1912M44971L32425l28985N97710
15224A598949o08527j25077B57765L3703c1628A43364L941C2684J06056n7224
15214H1516B7836M8038J5584i5330I4307M7743O5756j03479K43365b97443H7196
15202c11339f9979A36625J41907j02037A4868J87676h3501d1314B55776N2351
$$ plain form
15278 -117255 40411 -180795 370347 -169022 153759 254696 32837 178440 8144 92469
15268 92469 372344 16561 -176185 160393 425208 26471 -107658 24443 167765 -153662
15257 -70090 126363 155736 38536 319933 -226305 259304 124843 253690 -118596 -20639
15246 -67103 73832 -63622 149857 -7766 -14384 115973 127459 354403 59298 -37562 194916
15234 128733 306164 142271 -56626 476733 604740 552828 997799 1330224 1001239 1598949
15224 1598949 990422 865345 257765 291468 -31628 143364 147305 32684 138740 81516
15214 81516 27836 75874 91458 -95330 94307 142050 207806 104327 347692 -297443 87196
15202 -311339 -69979 136625 278532 176495 14868 202544 -83501 -41314 255776 308127
15192C08127g7687g615A20961a6076A21456K60733j83751I2173g3093E6730L2217
15181H8947a61324m8429o7005C39601A6823Q5921J23239A00975P3222j6982e3534
15169A75748a00660I3503J01167J99651r9378A37267N4347A9882N69982A79577
15158G5952Q1895g2034E9263J58531l3173a91313d6813E995L78020i1764A71685
15146F6320J88059a88550m1796c0385B1674d2628B792N6370a97643j3841C91736
15134b9090C97958A47672J16416b2290A84741E1638J5371i4378A21949D7135J88328
15123B35463a89210c401E45827m635A85256l9091m9741O6403J01677C2827L55230
15112C88057j85443l3902L38736E6197J16227H0965M17120j13023q4164F7835
$$ plain form
15192 308127 -77687 -7615 120961 -16076 121456 382189 198438 92173 -73093 56730 88947
15181 88947 -161324 -209753 -276758 339601 16823 102744 225983 100975 174197 157215 -53534
15169 175748 -100660 93503 194670 394321 294943 137267 191614 19882 589864 179577
15158 75952 157847 -72034 59263 217794 184621 -191313 -46813 5995 384015 -91764 171685
15146 66320 254379 -188550 -230346 -30385 21674 -42628 2792 59162 -197643 -211484 391736
15134 -29090 397958 147672 264088 -22290 184741 51638 67009 -94378 121949 47135 235463
15123 235463 -189210 -3401 545827 541192 185256 146165 96424 162827 264504 32827 388057
15112 388057 202614 168712 507448 56197 172424 80965 498085 385062 300898 67835
15101A68520C675K19297b3868B36065N1388I7655m5641M47060a26736A93612N278
15090A98890l9389e4361A10910a00324A47174O863k494k2381N8159a3388A9729
15078E16486k38130a59040K0307B02442m0616L80776a976A05015a77722D01814
15067A66609J42574O4663D1250M771Q6635k4084O8845M857A2720a46247E2761
15055B45408D0660L86473j79243N8430d5386D40268j64215J41956o7876m2531
15045C07602d1906C25046l510c4509C85410j6326p6066H4770J19356K96830l8259
15034D62697j80117K56288j64365n334j29443J05800L92447B66191r6763J70516
15024C39944K3770j18748n8889l039K24592j18741J65435Q1923K69870K7931l60415
$$ plain form
15101 168520 3675 222972 -23868 236065 287453 97655 52014 499074 -126736 193612 198890
15090 198890 159501 -54361 110910 -100324 147174 154037 151543 129162 187321 -13388 19729
15078 516486 278356 -159040 -138733 202442 161826 542602 -1976 105015 -177722 401814
15067 166609 309183 373846 41250 46021 132656 108572 177417 182274 12720 -146247 52761
15055 245408 40660 427133 247890 306320 -45386 440268 276053 418009 350133 307602
15045 307602 -41906 325046 321536 -34509 385410 369084 293018 84770 204126 500956 462697
15034 462697 282580 538868 374503 369169 239726 345526 737973 266191 169428 339944
15024 339944 363714 244966 186077 183038 407630 288889 454324 536247 806117 834048 473633
15013D73633L86130k20082o174j68235N00284l47425B39323J16880N4474P2937
15003D83614o3747J44932A58534J07800j08860L25535J45091j81363q0246N52819
14993I19310k9152m41413Q6710A78506j8825B1412P68099n1054C12716J31329
14983D44045K89697k36801M9783k21099j53018R2177K75974J18813A92335L45520
14973E37855L0322j10754J73601j04763l6285L3070J36978K78546l70740L7847
14963F05677Q3908j16388P6227A53519Q30147B77793M56264L3210l26555R7549
14953E38261j52754K67606B69618R8182F1582M00651A55792J65353p0027p5270
14943A75848J29900O2631A42447K54642l5203a31221B51463K63916N5524k9311
$$ plain form
15013 473633 859763 639681 633507 465272 965556 618131 239323 356203 410677 483614
15003 483614 419867 564799 158534 266334 157474 483009 628100 446737 366491 919310
14993 919310 890158 448745 535455 178506 159681 21412 789511 738457 312716 444045
14983 444045 733742 496941 546724 325625 172607 264784 540758 659571 192335 537855
14973 537855 568177 457423 631024 526261 489976 523046 660024 938570 567830 605677
14963 605677 689585 573197 649424 153519 983666 277793 734057 767267 440712 538261
14953 538261 385507 653113 269618 367800 61582 462233 155792 321145 251118 175848
14943 175848 305748 368379 142447 397089 361886 -131221 251463 515379 570903 541592
14933E41592n2311B40837M04612B15748L28191N4568l8542k5768L39624l37776
14923E36045K30846k86537A46903L31759k36207O75643k57389L93701m18891P30104
14913A365623k85578L54181J36356j23572K74076j04534L8438m82226M54348k51478
14903A375634M66047J03844P4809O7966j51775m92187j95499k68844J05413k01315
14893H84093o9768r3490J18270j38758C28356J87376O8701R2317R6571B75688
14882B93050L10957k34349B3857L45392n8049m8216J89102r110K40209j18696
14872E64489j11913J69254J32408j22429K47968j28734J01889l15317R076N141
14862E51832L86171l50794K0676j86611K99881j74263O2101J61525j03160j18853
$$ plain form
14933 541592 489281 240837 645449 215748 543939 598507 559965 534197 873821 536045
14923 536045 766891 480354 146903 478662 242455 918098 660709 1054410 635519 1365623
14913 1365623 1080045 1434226 1570582 1447010 1721086 1616552 1654990 1172764 1627112 1375634
14903 1375634 1841681 1945525 2020334 2088300 1936525 1444338 1248839 979995 1085408 884093
14893 884093 814325 720835 839105 700347 328356 515732 584433 676750 773321 275688
14882 293050 604007 369658 23857 369249 311200 262984 452086 442976 683185 564489
14872 564489 452576 621830 754238 631809 879777 751043 852932 537615 546691 551832
14862 551832 938003 587209 607885 421274 721155 546892 608993 770518 667358 548505
14852E48505j7966L48065q0461J00864o805k50056q4236L22469l74323j84313
14842C21743L03725A74545L43843j31932j60405A07913N43838o4867B03458L23579
14832E27037k30581L15738l5515L22800j60517M01116j22399k8491L38115l57283
14822I70020L66787m89485J16419l31809k49597J3135J77656R8112O24531o24637
14812F71132j18355R3179k61511L33435l04159M13161j47238K26517l09355K52114
14802H48920l0041J6025j57262j6938m7291k24775j46143M27666K43706r6043
14792H17824B26188O24459L06453K5182p3954p8743j28377l7575j44251M2559
14782G61941q7020n357K10929j64360j7221m715j62248L08050l06559k46408L56109
$$ plain form
14852 548505 530539 878604 798143 899007 892202 642146 557910 880379 506056 321743
14842 321743 625468 174545 518388 386456 226051 107913 651751 586884 203458 527037
14832 527037 296456 612194 576679 899479 738962 1140078 1017679 989188 1327303 970020
14822 970020 1336807 847322 963741 631932 382335 395470 573126 671238 1295769 671132
14812 671132 552777 645956 384445 717880 413721 826882 679644 906161 596806 848920
14802 848920 818879 834904 677642 660704 613413 388638 242495 670161 913867 817824
14792 817824 226188 850647 1157100 1182282 1108328 1029585 901208 863633 719382 761941
14782 761941 674921 669564 880493 716133 698912 694197 531949 839999 533440 287032 643141
14771F43141J54977j39152p8847M084j70912L47482j43417J40336K27878j00553
14761H85017K37965l74306M43424k92549Q367j39370k0605q5878J18120k50611
14751E29574L22665O6729l89095K1575J03792j83971L66632C60570r1707L14867
14741E83730Q51K6678Q8781j31807J59854l6444q4110K83309l68556K93969J43097
14730I59352l85206j06732K16873J2734j63522K14106P9032k49976n771L39700
14720I10590J5191k59726O15742l7771k47766O7910M87338L9799k87115j2979
14710A291213O12892l06357m8515k62729K6836k73628L8250j91902L9012k03193
14700G21879K84655o1012o6862J31967Q1587k29347O3689M7727K4489K17103R8329
$$ plain form
14771 643141 798118 658966 580119 584203 413291 760773 617356 757692 985570 885017
14761 885017 1122982 748676 1192100 899551 907918 768548 747943 662065 780185 529574
14751 529574 852239 918968 529873 551448 655240 471269 837901 360570 268863 583730
14741 583730 584581 611259 700040 568233 728087 691643 607533 890842 522286 816255 959352
14730 959352 574146 467414 684287 697021 533499 747605 826637 576661 570890 910590
14720 910590 925781 666055 1281797 1244026 996260 1064170 1551508 1591307 1304192 1291213
14710 1291213 1904105 1597748 1549233 1286504 1313340 1039712 1077962 886060 925072 721879
14700 721879 1006534 945522 878660 1010627 1092214 862867 926556 974283 998772 1215875 1314204
14689A314204j79550L77059L35290k40201K14192k51559K65662o96299L53621
14680A492419l86356k53395j5479j26912K77513r0278L81334m47278N338M74444
14670A311350l26629P4782j52437J31825O6568K27968j55670k89559N5295j30982
14660H12511K25619l27288M31878l91571L77962j75844M5687J81083k12L07212
14650A487037K4331o52607L21932k46924L90556K654n77927L35422j5867J90968
14640A259575r8422k26758K1489L6019N39794j60427j71427K51754k47071K37979
14630A442505j20914n04987N33475j39507J66877l53833J52243j51958K99362
14621A323263M2178k81024J57690k87J10471R9981n1227j5457N9641l88677J55120
$$ plain form
14689 1314204 1134654 1511713 1847003 1606802 1820994 1569435 1835097 1138798 1492419
14680 1492419 1106063 852668 837189 710277 987790 897512 1278846 831568 836906 1311350
14670 1311350 984721 1059503 907066 1038891 1105459 1333427 1177757 888198 943493 812511
14660 812511 1038130 710842 1142720 751149 1129111 953267 998954 1180037 1179825 1487037
14650 1487037 1511368 858761 1180693 933769 1324325 1326979 749052 1084474 1068607 1259575
14640 1259575 1161153 934395 955884 991903 1531697 1371270 1199843 1451597 1204526 1442505
14630 1442505 1321591 816604 1350079 1210572 1377449 1023616 1175859 1023901 1323263
14621 1323263 1365441 1084417 1242107 1241820 1352291 1452272 1401045 1385588 1445229 1056552 1211672
14610A211672J68076Q3184l65059J84182L03709j06124j91488J31770K8213J63279
14600A611414j65289L3436q6540Q0677J0214L15454k57670Q058K4595k5111j7171
14589A532067P9440k27608K40444j18284M97962j36427m38634L10155j10809K21774
14579A850080k50996j26046J18836J38993m0859Q1293K88801k71874N3730j14477
14569A727481J25306k8989J28834j33861q0283L72849m18925K75584k97802L61941
14559B032135J18040l43936K26388J44197M7673q2996J37409P6595J52600o9397
14549B438708M8242J16867K52333j24509j70261J48639J45820J83536N19752M03947
14539C963074J1482M76468N97810P41980J528192K113397M226301O378473J0765592
$$ plain form
14610 1211672 1379748 1462932 1097873 1282055 1585764 1479640 1288152 1419922 1448135 1611414
14600 1611414 1446125 1479561 1393021 1473698 1483912 1799366 1541696 1549754 1574349 1549238 1532067
14589 1532067 1611507 1383899 1624343 1506059 2004021 1867594 1428960 1739115 1628306 1850080
14579 1850080 1599084 1473038 1591874 1730867 1690008 1771301 2060102 1788228 1841958 1727481
14569 1727481 1852787 1823798 1952632 1818771 1738488 2111337 1692412 1967996 1670194 2032135
14559 2032135 2150175 1806239 2032627 2176824 2224497 2141501 2278910 2355505 2508105 2438708
14549 2438708 2486950 2603817 2856150 2731641 2561380 2710019 2855839 3039375 3559127 3963074
14539 3963074 3974556 4451024 5048834 5790814 7319006 9432403 13658704 20037177 30802769
14530C0802769K371730j3516268q349276m553458k009541k43676k23282O55746
14522D934744J31127j213542q25965k2780j84213m60809K25414j6185j30249k62962
14512B174580K15915K4049k98401L3157L88960L43589p02477K31738J97232K06576
14502B814918p4324J15603j77805K51629q282m20472K00588J29671k7598q380
14492B795548L2880J86356o2999m5088M12252j19865j90478K28066J23222l02862
14482C057032j60951N54049l47817K39605j42462M926J65349K59087k9742K39202
14472C838278m06620M06691R5353k95945q0676k3012K95895L46984k14596K14060
14462D176412l79449L50861n5750J91046P2439j32415O791L6495K61569Q9144
$$ plain form
14530 30802769 33174499 19658231 11308955 6755497 4745956 4502280 4278998 4934744
14522 4934744 5065871 3852329 3026364 3003584 2819371 2358562 2583976 2567791 2437542 2174580
14512 2174580 2390495 2414544 2116143 2149300 2538260 2881849 2179372 2411110 2608342 2814918
14502 2814918 2740594 2856197 2678392 2930021 2921739 2501267 2701855 2831526 2803928 2795548
14492 2795548 2828428 3014784 2951785 2906697 3318949 3199084 3008606 3236672 3359894 3057032
14482 3057032 2896081 3450130 3102313 3341918 3199456 3204382 3369731 3628818 3599076 3838278
14472 3838278 3431658 3838349 3933702 3637757 3557081 3534069 3829964 4176948 3962352 4176412
14462 4176412 3796963 4147824 4092074 4283120 4355559 4223144 4229935 4266430 4527999 4617143
14452D617143Q7269j09965j3202q4901J42464J18267o7458L18147K3378m17399
14442D613743L48756r840R778L90057j52290N26890j81962j86965K3772K57930
14432E639869k60571J97688r8446K85445J42372j41550L91057L0515J03004k87223
14422F002160M28909J03388K12120k7882k62700J96838L33276N88367q2124l34441
14412G157911K0834j25153N67975k70996L80439K10183L7392J84875N8311O89894
14402H911665j21139j16891K11893N713J52K41501R8522k1758M61940j55816J36741
14391I652523N1807M90036L04137k9541j62363L96805L83250k06368J98898r2852
14381A0986332O29950l88964K87936M39666M7133O33961J47135J63656K92020
$$ plain form
14452 4617143 4704412 4594447 4581245 4496344 4638808 4757075 4689617 5007764 5031142 4613743
14442 4613743 4962499 4952659 4962437 5352494 5200204 5727094 5545132 5358167 5381939 5639869
14432 5639869 5379298 5576986 5478540 5763985 5906357 5764807 6155864 6186379 6289383 6002160
14422 6002160 6431069 6534457 6746577 6718695 6455995 6652833 6986109 7574476 7492352 7157911
14412 7157911 7178745 7053592 7621567 7350571 7731010 7941193 7978585 8163460 8221771 8911665
14402 8911665 8790526 8673635 8885528 8891241 8891393 9132894 9231416 9209658 9671598 9515782 9652523
14391 9652523 9704330 10194366 10498503 10468962 10306599 10703404 11086654 10880286 11079184 10986332
14381 10986332 11616282 11227318 11515254 11954920 12002053 12636014 12783149 12946805 13238825
14372A3238825J02039k11201M88581N23465q1146M87704K14753N27741L46299
14363A5637060Q5440J64629M76483K30616N0363M46661M45849N47071J60880K62128
14353A8507180K45917L75240P91040N66801N55024M44465R4036N7332R88720N79641
14343B3205396K86050J71767O11663P67450N59926O12656P45120N95156M75735
14334B8030919O30552O51800J243021K95174R79655R37564N96616J341218N89191
14325C5295710J086785Q84241J334843J086769J212627J376169J100708J185237
14317D4563089J417366J357764J662876J634879J414976J960477J718650J995981
14309E7726058J667976K246085K415973K184549K375547K875037K464544K758708
$$ plain form
14372 13238825 13340864 13129663 13618244 14141709 14060563 14548267 14763020 15290761 15637060
14363 15637060 15722500 15887129 16363612 16594228 16644591 17091252 17537101 18084172 18245052 18507180
14353 18507180 18753097 19128337 19919377 20486178 21041202 21485667 21579703 21637035 22625755 23205396
14343 23205396 23491446 23663213 24274876 25042326 25602252 26214908 26960028 27555184 28030919
14334 28030919 28661471 29313271 30556292 30851466 31831121 32768685 33365301 34706519 35295710
14325 35295710 36382495 37266736 38601579 39688348 40900975 42277144 43377852 44563089
14317 44563089 45980455 47338219 49001095 50635974 52050950 54011427 55730077 57726058
14309 57726058 59394034 61640119 64056092 66240641 68616188 71491225 73955769 76714477
14301G6714477K689315L137346K882854L593613L479136M018980L928159M423290
14293A04867170M620168M905373M970427N372606N839208O449427O312839O896121
14285A50233339P445292P410392Q513405Q521118R592257R735338J0268278J0914821
14277B22634240J1349761J1972268J3025066J3328837J4377874J4458888J4786477
14270C15933411J4736383J4837107J4969366J4318028J4150476J3123161J2422535
14263D14490467J1207394J0165979R420822Q433957P324262L863987K026851J285092
14255D68218811J927918j077862p189105n336383p889303j1847412j0725359j2749159
14247D13332146j3121233j3168836j3457951j4424347j4095883j3856086j3501669
$$ plain form
14301 76714477 79403792 82541138 85423992 89017605 92496741 96515721 100443880 104867170
14293 104867170 109487338 114392711 119363138 124735744 130574952 137024379 143337218 150233339
14285 150233339 157678631 165089023 173602428 182123546 191715803 201451141 211719419 222634240
14277 222634240 233984001 245956269 258981335 272310172 286688046 301146934 315933411
14270 315933411 330669794 345506901 360476267 374794295 388944771 402067932 414490467
14263 414490467 425697861 435863840 445284662 453718619 461042881 464906868 466933719 468218811
14255 468218811 470146729 469068867 461879762 456543379 448654076 436806664 426081305 413332146
14247 413332146 400210913 387042077 373584126 359159779 345063896 331207810 317706141
14240C17706141j3804536j3637623j3344973j2458496j2121547j1036577j1539162
14233B29763227j0419064j0700810j1137369j0478877r433557q990016q160076
14226A60443458p815922p184056p158126o042360n905339o322935n338806m763807
14218A09912107m753124m202523l684479m033100m141846l443715l695508l013762
14210G8944050l143128k390053l140276k528240k155920k035563k427861j830543
14202E9292466k283517j554419j630877j511898j487186j905660j541244j424028
14194D5953637j412160r44783j283045r45587j435316r27785j431194p52861o89522
14185C6131384j035285q61071j002798r75489q41610r59880o22692l34116o29473
$$ plain form
14240 317706141 303901605 290263982 276919009 264460513 252338966 241302389 229763227
14233 229763227 219344163 208643353 197505984 187027107 177593550 168603534 160443458
14226 160443458 152627536 145443480 138285354 132242994 126337655 120014720 114675914 109912107
14218 109912107 105158983 100956460 97271981 93238881 89097035 85653320 81957812 78944050
14210 78944050 75800922 73410869 70270593 67742353 65586433 63550870 61123009 59292466
14202 59292466 57008949 55454530 53823653 52311755 50824569 48918909 47377665 45953637
14194 45953637 44541477 43596694 42313649 41368062 39932746 39004961 37573767 36820906 36131384
14185 36131384 35096099 34235028 33232230 32256741 31415131 30455251 29832559 29498443 28868970
14176B8868970j166979o45531n84244m16263q28599p14947m44704l20634r12329
14167B2834740j34587o44403k73869p40774k49644m96346p9918q97940j50816
14158A9166443m80013M4068q94799l65059l70089J000o98350N0039l73172l06200
14148A5773868j93220j04922m14263l74098l77234l53387j20681Q568j06520l37658
14138A3400453n01719J667m52538O416J23285n92716k43358O3793l10419J36787
14128A1631651q6233m46656m64070J50719n49951r3868N4100j91404P6581k31395
14118I849474n56761K4685m40376J34205K28817n13660K62771j81473j07553n23751
14108H176378K00057m01919M14808j7657p14072K28937l30298j27031J11928k8386
$$ plain form
14176 28868970 27701991 27056460 26472216 26055953 25227354 24512407 24067703 23747069 22834740
14167 22834740 22700153 22055750 21781881 21041107 20791463 20295117 20215199 19317259 19166443
14158 19166443 18686430 18730498 17835699 17470640 17100551 17101551 16403201 16453240 16080068 15773868
14148 15773868 15580648 15475726 15061463 14687365 14310131 13956744 13836063 13844631 13738111 13400453
14138 13400453 12898734 12900401 12447863 12454279 12577564 11984848 11741490 11805283 11494864 11631651
14128 11631651 11545418 11098762 10634692 10785411 10235460 10141592 10195692 10004288 10080869 9849474
14118 9849474 9292713 9317398 8877022 9011227 9240044 8726384 8989155 8807682 8700129 8176378
14108 8176378 8376435 7974516 8389324 8371667 7657595 7886532 7556234 7429203 7541131 7512745
14098G512745j11136n41093L04982k13731K88863n41546j6063J02260m7916n70553
14088F166812K12265J30975J3993m96126J17369n22225L00425m8261L2284k95848
14078E611663O3491P5651k23660k06324K86577r5043j3466k41432k20848j4665
14068E021944q4049K8378k37430O34016k16007j20424l91770K75598m97502j76154
14058D236600L55451m7151j87164K66766j31438k94165J97308k9370q7243N9653
14048D339247N8573M15735n90801J39553j58975k81344J58179j52979J20751l16046
14038C731893L06954o55579K97393J25992l84523N51680l28511k65157J56866
14029C537008j94581J07696j57003J28431J78965k82220M0341J115l2150l5654
$$ plain form
14098 7512745 7401609 6860516 7165498 6951767 7240630 6699084 6683021 6785281 6737365 6166812
14088 6166812 6379077 6510052 6524045 6027919 6145288 5623063 5923488 5875227 5907511 5611663
14078 5611663 5675154 5750805 5527145 5320821 5607398 5512355 5498889 5257457 5036609 5021944
14068 5021944 4937895 4966273 4728843 5362859 5146852 5026428 4634658 4910256 4412754 4236600
14058 4236600 4592051 4544900 4357736 4624502 4493064 4198899 4396207 4366837 4279594 4339247
14048 4339247 4397820 4813555 4222754 4362307 4203332 3921988 4080167 3927188 4047939 3731893
14038 3731893 4038847 3383268 3680661 3806653 3422130 3973810 3645299 3380142 3537008
14029 3537008 3342427 3450123 3293120 3421551 3600516 3318296 3358637 3359752 3327602 3291948
14019C291948N0163j29466j74573M80683p08617O20091j58918l24433K46975m10780
14009B783073J72045j30930Q6552j81988J44051k83598J75160q1065K38048k74432
13999B646916O0339k41288L01063j7742k15888L0184J9943o08654M97448j27317
13989B345004N0154j67219L0066n6364p3369K15021j33655J42975K57146n02370
13979B107389P72141J54138L23560L26190J084529J153676L090501N815532J0820753
13970B5648409R618531j1426925q635571m615989k517521k204872o98133p09531
13962D458398m62693j70901k72282j92346k65285J30170n16622J4218R8814k01196
13952B620275L5934k04675k14617K6293M19131o28356L67535j87513O3972j68545
$$ plain form
14019 3291948 3342111 3212645 3038072 3518755 2810138 3430229 3271311 2946878 3193853 2783073
14009 2783073 2955118 2824188 2910740 2728752 2872803 2589205 2764365 2683300 2921348 2646916
13999 2646916 2707255 2465967 2767030 2749288 2533400 2563584 2583527 1974873 2472321 2345004
13989 2345004 2395158 2227939 2258005 2201641 2128272 2343293 2209638 2352613 2609759 2107389
13979 2107389 2879530 3033668 3357228 3683418 4767947 5921623 9012124 14827656 25648409
13970 25648409 35266940 23840015 15204444 10588455 8070934 5866062 5167929 4458398
13962 4458398 3995705 3824804 3552522 3360176 3094891 3225061 2708439 2722657 2821471 2620275
13952 2620275 2656209 2451534 2236917 2263210 2682341 2053985 2421520 2234007 2297979 2129434
13942B129434J28180j83359J59616j84256O6682l4756j74846M0324j08023K16451
13932B055447j25511J94782p4586k351O2772l91663J11024k84232M18162k51805
13922A712039k6694K0184j74157J79297k57364o7196M38198o8715l36523L72417
13912A791486j73379K27296j13640p7233L01400l65108K45769o2828k94853K93390
13902A772300j0445k57228k6897K00560N3802k82845J50529j81355Q4835j53101
13892A350155J03555J16646k50106n2081K07121L59826l83192j52566J8978K4904
13882A343240J33351L2794m7730j00416Q9482k90067N2636L00779l02982K40658
13872A451745k66918K13757J75611m63958J40664K09401m66549K56194J13856
$$ plain form
13942 2129434 2257614 2074255 2233871 2049615 2116297 2081541 1906695 1947019 1838996 2055447
13932 2055447 1929936 2124718 2050132 2047781 2110553 1718890 1829914 1545682 1963844 1712039
13922 1712039 1685345 1705529 1531372 1710669 1453305 1386109 1824307 1755592 1419069 1791486
13912 1791486 1618107 1845403 1731763 1654530 1955930 1590822 1836591 1773763 1478910 1772300
13902 1772300 1761855 1504627 1477730 1678290 1732092 1449247 1599776 1418421 1503256 1350155
13892 1350155 1453710 1570356 1320250 1268169 1475290 1835116 1451924 1299358 1318336 1343240
13882 1343240 1476591 1509385 1461655 1361239 1450721 1160654 1213290 1514069 1211087 1451745
13872 1451745 1184827 1398584 1574195 1110237 1250901 1460302 993753 1249947 1363803
13863A363803l57738P4895J6366j69278K84939k94619N45815k90279n158l31293
13853H37453L59860k18412m3625K89306l13563K83691N9313j26124N2850j81404
13843I99345L75440k04691j29324k19354K3583J04170r9928K35179k87906L56875
13833A153389j49808O6891j46916L11459j38192n46337L90989n4426k2935p0949
13823G93165j4558M5109J89451j11513K87855q1450j01219K3719k224n9485L2070
13812A000920O7211k6010j76418n3814K07674j85984J58883q3443J01294K2479
13802A032792n03854J82777N0140N2729Q0773k88608L42643m33320L98202k02151
13792G12123j14201L20663k03211J1499k25157o6180R6604M19007J16302j85693
$$ plain form
13863 1363803 1006065 1080960 1097326 928048 1212987 918368 1464183 1173904 1168746 837453
13853 837453 1197313 978901 935276 1224582 911019 1194710 1254023 1127899 1180749 999345
13843 999345 1374785 1170094 1040770 821416 844999 949169 849241 1084420 796514 1153389
13833 1153389 1003581 1070472 923556 1235015 1096823 550486 941475 887049 864114 793165
13823 793165 778607 823716 1013167 901654 1189509 1108059 1006840 1030559 1028335 968850 1000920
13812 1000920 1068131 1042121 865703 811889 1019563 833579 992462 909019 1010313 1032792
13802 1032792 528938 711715 761855 814584 895357 606749 949392 516072 914274 712123
13792 712123 597922 918585 715374 726873 501716 435536 532140 951147 1067449 881756
13782H81756q6603J63812k0311J60310l15428L33967n11354Q8070L87281l17356
13772G64144k21313J94128j88742K22047J10497k01035k71479K16703J33821l27831
13762D30940K44416K31822r818k79168K10148j55358M34851m23516J35244o4973
13752G54588j55590J47339J1087J8991j44379j50422j73778M74554j81009J02211
13742G03592R810J08802j68796l06316K40663l906m3335M04311j43965l16137
13732D84723R5019J81635j36328j29975M74847C65167L19724p350J84232j68836
13722F92937r9882L47746C89708J40319J44690J51853j85840L9327K66929j85543
13712G61443k43246K91735q2281j12249r0861j5142Q0377j07484L6396K60748
$$ plain form
13782 881756 795153 958965 938654 1098964 783536 1117503 606149 694219 1081500 764144
13772 764144 542831 736959 548217 770264 880761 679726 408247 624950 758771 430940
13762 430940 675356 907178 897360 618192 828340 672982 1107833 684317 819561 754588
13752 754588 598998 746337 757424 776415 632036 481614 307836 782390 601381 703592
13742 703592 713402 822204 653408 347092 587755 583849 540514 944825 800860 484723
13732 484723 579742 761377 625049 495074 969921 365167 684891 677541 861773 692937
13722 692937 593055 940801 389708 530027 674717 826570 640730 680057 946986 761443
13712 761443 518197 809932 727651 615402 524541 509399 589776 482292 518688 779436
13702G79436p6971k34819N23748l02769j99904M8734j06155L0624j68393J71494
13692D65025J00092K50424j14177k16476m6017r3827N1366J30538A94999M17506
13682F12505l755p1290J31415j74333J61212k49337M32689k18389L19203j76551
13672G63369k85058R845J39845L0270k33312n3292K99470j55984K45348j95572
13662E64929j72115J78811n9426J4519q5001J05688k30040J45461M0383j82636
13652C20573j34211j0717O24779C47620K56087j94413k1049K35159p281B69891
13641C01114L90561C06730d8436b3192G34941k80187A24295K9271M56267B78052
13630F95717B13717N33852A619M15264N1423p0328j51665N31516l39168A68037
$$ plain form
13702 779436 702465 467646 991394 688625 488721 537455 431300 461924 293531 465025
13692 465025 565117 815541 701364 484888 438871 345044 396410 526948 194999 612505
13682 612505 608750 537460 668875 494542 655754 406417 839106 620717 939920 763369
13672 763369 478311 488156 628001 658271 424959 371667 671137 515153 760501 564929
13662 564929 392814 571625 512199 526718 441717 547405 317365 462826 503209 320573
13652 320573 186362 175645 800424 347620 603707 409294 388245 623404 616123 269891
13641 301114 691675 306730 -48436 -23192 734941 454754 124295 153566 609833 278052
13630 695717 213717 747569 1619 416883 468306 397978 246313 777829 438661 168037
13619f035G83153A94274J00091n2311N7227K50638k21550p1858O9924L4749K38440
13608E99624k85889J03242J49237j06939j10097j07176R3655A62367Q9143j09735
13598A41775J86782K48003A59322K8636J26468N5336j05904J64968Q9493B27976
13587A61099p0697N75093j30711j77717Q3341k1679J73100j55817o4623K7366
13577C98755A74427R0131K13822J06883A81782K74983J54555B03702n8462a9707
13566B44042K61237A60142H719K26845Q7353j07111J43338K71420j14825k14230
13556C01509n9772J11630k6449F3711R5040k5729J62040a44341B99880k793r5866
13545B01221J82417J72001B2434M86048A40257J98068j24282M72062k31791k22546
$$ plain form
13619 -6035 783153 194274 294365 242054 299281 549919 328369 256511 326435 361184 599624
13608 599624 313735 416977 566214 459275 349178 242002 335657 162367 251510 141775
13598 141775 328557 576560 159322 187958 314426 369762 263858 428826 518319 227976
13587 161099 90402 665495 534784 357067 440408 418729 591829 436012 371389 398755
13577 398755 174427 264558 478380 585263 181782 456765 611320 203702 145240 -19707
13566 244042 505279 160142 8719 235564 322917 215806 359144 630564 515739 301509
13556 301509 241737 353367 326918 63711 158751 133022 295062 -144341 299880 297087 201221
13545 201221 383638 555639 22434 508482 140257 338325 214043 686105 454314 231768
13535B31768J85999D547J41622P4912n6513J70093b23488B87115A43246M9075
13525A92321J23690o5389n4601N9668C4059K44652J5098j05901P5493O942K76214
13514E46557P5511B09625b6817A67010J5310M40084k35768j10140r3752o7472
13504A15272K39427k1932b36136A48138M42683k47188j43919r8478K11338L424
13494C15998j01198L9101r3339K62582P1633A80068k146E9354K29562G1988L24551
13483C96539l3214a5695C0154J11443K82653a54307B72107J54286j68649O8299
13473C26043p1207H5368J14446M8245J08611K4487A74344M9445J18024J19207
13463D61020C4780r854M16155n5377j91806G7024N3380a3188C02347a7191C29892
$$ plain form
13535 231768 417767 4547 146169 221081 164568 334661 -223488 287115 143246 192321
13525 192321 316011 250622 196021 255689 34059 278711 293809 187908 263401 270343 546557
13514 546557 622068 209625 -26817 167010 182320 622404 386636 276496 182744 115272
13504 115272 354699 332767 -236136 148138 590821 343633 199714 101236 312574 315998
13494 315998 214800 253901 160562 423144 494777 180068 177922 59354 288916 71988 396539
13483 396539 363325 -15695 30154 141597 424250 -154307 272107 426393 257744 326043
13473 326043 254836 85368 199814 248059 356670 381157 174344 223789 341813 461020
13463 461020 34780 24926 441081 385704 193898 77024 130404 -13188 302347 -17191 329892
13451B51374I6077L38639A62824E6394K71312H7785J75710A08062N4134a35973
13440A03116J78887h5794A76996J98338m8890m0658A16226J24329B8315N35260
13430E63575B17618J1747D7469K20784D7746K65887r6384j6386m0173p6478L87005
13419D71217c28595C91130H1790J82319a52360C83035F7846M10761c23956B34968
13408A15963L31359q2405o1758B0642L21933q6994r7890K78139A13947f0270D4153
13396C30270j0953K28172j31725E9721J84522O0456O556F5203K61605j42018b35173
13384B5906K85741f4274B42440J57772O3023A87496A0166K27283G3354k9080J35429
13373A79703J03988d1235E4875K16525d4085B12796J40322A11968C3068K72514
$$ plain form
13451 251374 96077 434716 162824 56394 327706 87785 263495 108062 162196 -135973
13440 103116 282003 -85794 176996 375334 326444 285786 116226 240555 28315 563575
13430 563575 217618 229365 47469 268253 47746 313633 217249 200863 160690 84212 471217
13419 471217 -328595 391130 81790 264109 -152360 383035 67846 478607 -323956 234968
13408 115963 447322 364917 303159 20642 342575 255581 157691 435830 113947 -60270 44153
13396 330270 319317 547489 415764 59721 244243 304699 311255 65203 326808 184790 -235173
13384 25906 311647 -64274 242440 400212 463235 187496 10166 237449 73354 44274 179703
13373 179703 283691 -41235 54875 271400 -44085 212796 353118 111968 33068 305582
13363C05582A05361e9855C01010j42930J59378Q7870j42317G7099K80163j21982
13353B35280P1473R9156N4025j09570F5631a5879B69817a05212B46026o1751K41182
13342D25457j81306R9082j64154J39646A19876J33869K49161A40329a52478A55722
13331B42421L9027H2527f4247B00226g1609D32908A34777m2660K55385N5773r5423
13320C07852N1152J45721B52085A21610J31269m6099m2743J04013o314j27410
13310A34326J09395F6066K03024M8560l9068J14965A07065E01N80680A85387a94025
13298B09430A01817K30140Q4125B02961m1289K28464p7867j52199l3866a12609
13287B05640q9502K09639j62171l7591f5520a9569I5902a42284d2653D15708C5328
$$ plain form
13363 305582 105361 -59855 301010 158080 317458 405328 263011 77099 357262 235280
13353 235280 306753 405909 459934 350364 65631 -15879 269817 -105212 246026 184275 425457
13342 425457 244151 343233 179079 318725 119876 253745 502906 140329 -152478 155722
13331 242421 281448 82527 -64247 200226 -71609 432908 134777 92117 347502 403275 307852
13320 307852 359004 504725 252085 121610 252879 206780 164037 268050 261736 134326
13310 134326 243721 66066 269090 317650 278582 393547 107065 501 581181 185387 -194025
13298 209430 101817 331957 416082 202961 161672 390136 312269 160070 126204 -112609
13287 205640 116138 325777 163606 126015 -65520 -19569 95902 -142284 -42653 415708 35328
13275C80352b31454f9021A70950j9128A427a43170B05624k8072d7388E793J91747
13264A97540a986B47768J0899Q9179A63783m6245i3819C42969o9914A21947K78288
13253D00235a38845D507b11417B289J48451p0356J55691a95796B97290a74413
13242B86242h7872C979J88356g7889J8004P381B51575B4874k205M35782k05764
13231B52687b4595A42257B44J59071e321A61541l8832d4899G7365d110C20474
13219B21262h2823m3236B0942M2777m867L61621k4950j82738f3130j78255A07641
13207A22441d9851B8385N1097i3288B70139b11310b269A87532l6424K04634b2122
13195i9393A31054a5670b128B84990p9771a21001A94273J70990g8271C9178L29959
$$ plain form
13275 380352 -231454 -69021 170950 151822 1427 -143170 205624 177552 -47388 5793 197540
13264 197540 -1986 247768 258667 347846 163783 117538 -93819 342969 273055 121947 400235
13253 400235 -138845 4507 -211417 2289 150740 80384 236075 -195796 297290 -174413
13242 286242 -87872 3979 192335 -77889 -59885 -52504 251575 24874 22669 458451 252687
13231 252687 -24595 142257 244 159315 -5321 161541 122709 -44899 77365 -4110 320474
13219 221262 -82823 -126059 20942 63719 58852 420473 395523 212785 -63130 -241385 107641
13207 122441 -49851 28385 79482 -93288 270139 -211310 -2269 187532 151108 355742 -22122
13195 -99393 131054 -15670 -2128 284990 205219 -121001 194273 365263 -78271 39178 369137
13184C69137J787A65499J5562H3079B9301a86726B9514J35383K25273B3550h1689
13172A18819B0472f730E29901b5813A28082K36266e914A77282J32576d235r0622
13161i4857A80313p3852J18463j0945n2533n6824B8418f3442o2225j41982B29557
13149A80025l074n8930a6363D27099b47607f8029C15069d4863c793o5431G781
13137A87797b5450k25189H3689J2488g923G3987c399C7155a26570O2177A35348
13125h354D59948b60042A8730J62657C4744R5672c94991B04033n891E6627J90873
13114B47500a17512I868K4668K67591A16233K31550A52481n2447K83936A0430
13103b6243D3720i5205B78219q2280H5380J18517b91979A56861p5964a5832j16422
$$ plain form
13184 369137 370924 165499 181061 83079 29301 -186726 29514 164897 390170 23550 -81689
13172 118819 20472 -6730 529901 -25813 128082 364348 -5914 177282 309858 -4235 -94857
13161 -94857 180313 106461 224924 213979 161446 104622 28418 -63442 -125667 -267649 229557
13149 180025 176951 118021 -16363 427099 -247607 -68029 315069 -44863 -3793 -69224 7781
13137 187797 -25450 -250639 83689 96177 -7923 73987 -3399 37155 -126570 -64393 135348
13125 -8354 459948 -260042 18730 181387 34744 130416 -394991 204033 198142 56627 247500
13114 247500 -117512 9868 34536 302127 116233 347783 152481 100034 383970 10430
13103 -26243 43720 -95205 278219 195939 85380 203897 -291979 156861 80897 -15832 -132254
13092a32254C10896p8126h3631c3013A1627Q8043D4544J61277B7495O8166L9881
13081A35542a63822A48605d8955q7773A68502h6874B50918M9300a45798j08191
13071b53989g9263D8238Q0700f1924A87637a26849B62527b87776b5372A81349
13060I446J07384J05574J60454j82327a8315B2257Q6629c5259H420b17448H7075
13048f559G7133e0760p7071O91F592K13219a20632N0361A54529J2673b362q3216
13036h5578B78097l7677b40885a14910j74176A33524J92279j62659a36068L047
13026a33021c2023B11824g7463H4149K72455D5444h7032E6803L1333J39123C5262
13014G7383R7018J19216c8360B42254k5369n000f2675D60390A64305g2137j6583
$$ plain form
13092 -132254 310896 232770 -83631 -33013 11627 99670 44544 205821 27495 95661 135542
13081 135542 -163822 148605 -48955 -136728 168502 -86874 250918 300218 -145798 -253989
13071 -253989 -79263 48238 128938 -61924 187637 -126849 262527 -287776 -25372 181349
13060 9446 116830 222404 382858 200531 -18315 22257 108886 -35259 8420 -217448 87075
13048 -6559 77133 -50760 -127831 -127140 6592 219811 -120632 -70271 154529 167202 -2362 -85578
13036 -85578 278097 240420 -240885 -114910 -289086 133524 325803 163144 -136068 -133021
13026 -133021 -32023 211824 -77463 84149 356604 45444 -87032 56803 88136 227259 35262
13014 77383 174401 293617 -38360 242254 216885 211885 -62675 460390 164305 -72137 -88720
13003h8720b2881j2529I970K9181K05839N9760L10j51688Q546d0886C8663L4264
12991G2927e2985l3173q3370B94076a11390I9830K81126g634A10205j777k904
12980A05524K7286J0457a22443A81642l3651a27617A70917q0745k3870Q4342K26629
12969C77273b4524A8606a49700A49778P9532C075M3431L5248Q929c5885a3675
12957b35182R4932j92288A5320b12700A12798a36712B0007c43870C25139m1589
12947B83550C6863b72075j1188J36599H6720f6078j9849F8845k9418C349K08934
12936B12283d4062p6499G2590B608J68431c2335j0466C85294E8162b10950B14214
12924A72757p1969l0780J62235m7218g5177k00966a7775n2039J9268b4079E8209
$$ plain form
13003 -88720 -22881 -35410 9970 39151 244990 304750 305060 153372 161918 -40886 38663 72927
12991 72927 -52985 -86158 -169528 294076 -111390 99830 380956 -7634 110205 108428 105524
12980 105524 132810 143267 -122443 181642 147991 -127617 170917 90172 66302 150644 377273
12969 377273 -24524 18606 -149700 149778 229310 3075 46506 81754 90683 -35885 -13675
12957 -235182 -140250 -332538 15320 -212700 112798 -136712 20007 -343870 325139 283550
12947 283550 36863 -272075 -283263 -146664 86720 -66078 -85927 68845 39427 3349 212283
12936 212283 -44062 -120561 72590 2608 171039 -32335 -42801 385294 58162 -210950 214214
12924 172757 100788 70008 232243 185025 -75177 -276143 -17775 -69814 -50546 -24079 58209
12912A25754J04572G5301K13793B4577P2025c20220c7883B9748a7728B06244m1100
12901A65144r548J17379b24380l0980a26395A61304i5967o7552I4054c0578k3155
12890e3733p4878J0371l7514d6349m1127A36695b7397p8006B21670c2739k98479
12879c31218A82371b08806B45513a20386E1133K25500a02720C02744b92268B34078
12868A18691a6389C104i200E39595A9262K19152J25354E2097J26736a6756B3872
12856A45626Q8732a10521e0991B9630d2029D7610J0541J35735J9947J39902i8934
12844A00449c00959A79311Q5015K6674j19137h5667l28070A81969L80775g4235
12833B13482J8992k1179M6631a36939C76014D9655K85589h5750C61872A8990a10739
$$ plain form
12912 125754 230326 75301 289094 24577 96602 -320220 -37883 29748 -17728 206244 165144
12901 165144 155596 272975 -224380 -255360 -126395 161304 -95967 -163519 94054 -30578 -53733
12890 -53733 -128611 -118240 -155754 -46349 -87476 136695 -27397 -105403 221670 -32739 -331218
12879 -331218 182371 -208806 245513 -120386 51133 276633 -102720 302744 -292268 234078
12868 118691 -16389 3104 -9200 539595 19262 238414 363768 52097 178833 -16756 23872
12856 145626 234358 -110521 -50991 29630 -42029 47610 58151 193886 213833 353735 -98934
12844 100449 -300959 179311 264326 291000 171863 -85667 -413737 181969 562744 -74235
12833 213482 232474 211295 257926 -136939 376014 49655 335244 -85750 361872 18990 -110739
12821A88466a79906B18694a42427A55204a89518E2685O9065h4405a5441l36952
12811c52393B28968a12011j76912J42532A66062G5459k4979J6334f4887p0593
12801a35480p5602p3582H0725a15774A89498a51028b1412o8419n2085f0780f501
12789B9928P3812b44903j10892c320A6921f1704r3753G4012R1131e8650G0860
12777a72194H8808c81927a35403B3996b21482i031E8257k324j8338J25181a53382
12765a35812A7157M39747A78242J17366a73066d6352f540G9844J34452b75928
12754A47055a33682A7924a19470J4441C97366b71465I9762a36275F4492O259b23766
12742B02856b95554k21417b21392C11608a36144C7704H536K6695L2599b62550
$$ plain form
12821 188466 -179906 218694 -142427 155204 -189518 52685 121750 -84405 -15441 -352393
12811 -352393 228968 -112011 -288923 -146391 166062 75459 50480 66814 -64887 -135480
12801 -135480 -211082 -284664 80725 -115774 189498 -151028 -21412 -89831 -141916 -60780 -6501
12789 29928 103740 -244903 -355795 -3320 16921 -61704 -155457 74012 165143 -58650 70860
12777 -172194 88808 -381927 -135403 23996 -221482 -9031 58257 55933 37595 162776 -153382
12765 -135812 17157 456904 178242 295608 -173066 -46352 -6540 79844 214296 -275928
12754 147055 -133682 17924 -119470 -105029 397366 -271465 99762 -136275 64492 70751 -223766
12742 202856 -295554 -516971 -221392 311608 -136144 37704 8536 35231 67830 -262550
12731A46036F0814A3265b18014A58416c31669e8404j0253F708e373k3713l9814
12720f8900A49771N899K19397a25662f411D6002h1871A80066m50L474a94605e5154
12707a47487B3365f6785k1368C35651g2558j30667d7646A60691O0227c08438a8547
12695h8313B00027A766b6514C36878h1059B25018c6922D57975D9982b5246k47307
12684b72553A56389c20157B21615n3177c1614A18223a59850j9821C78261b93124
12673d20381A21209a8582k2890F0929A8411J34029b22110F7893L7980N1696p5331
12662H2238A2071K02371a34942C52554E4999R8772f9574O270a8203K877B85795
12650A47375M6385b1919B2825R9169C7577K28724g2070A05344B4688d3363p9911
$$ plain form
12731 146036 60814 13265 -218014 158416 -331669 -58404 -68657 6708 -5373 -29086 -68900
12720 -68900 149771 155670 375067 -125662 -6411 46002 -81871 180066 179616 183090 -194605 -55154
12707 -147487 23365 -66785 -88153 335651 -72558 -203225 -47646 160691 220918 -308438 -18547
12695 -88313 200027 1766 -26514 336878 -81059 225018 -36922 457975 49982 -25246 -272553
12684 -272553 156389 -320157 221615 168438 -31614 118223 -159850 -179671 378261 -293124
12673 -420381 121209 -18582 -41472 60929 18411 152440 -222110 67893 105873 157569 82238
12662 82238 12071 214442 -134942 352554 54999 153771 -69574 -63304 -18203 -15326 285795
12650 147375 193760 -21919 22825 121994 37577 266301 -72070 105344 24688 -43363 -123274
12639a23274D89951A43035J18800D9148J59668g1759m8223L097B57110j11228
12629A45882M84730A02631d4235E55g832A3384K1740J21119l3554a27481a0298
12617a08605B6832K67016Q3227l9718j31779r8199d5587A97302A5979Q1358k4020
12606G3317J50145J2927j03783L2987G6653j9718J6371J04437c10100A6926c46541
12594a42317B33755f7013l2008B70579b89758A07453J49717a53657B74023A9264
12583a12899D7231M3874L01954c80395F8716L15834j00574f4313j2793k50065
12573c27171J2973b6759I9937J65649m0807H7157K31873a44120c8130r3132A41202
12561C4853b22386B14253c34293A21191a61050A27063f6867C90308i1070Q373
$$ plain form
12639 -123274 489951 143035 261835 49148 208816 -71759 -119982 -116885 257110 145882
12629 145882 630612 102631 -44235 555 -7832 13384 35124 156243 122689 -127481 -10298
12617 -108605 26832 293848 377075 337357 205578 107379 -45587 197302 15979 97337 73317
12606 73317 223462 236389 132606 165593 76653 56935 73306 177743 -310100 16926 -346541
12594 -142317 233755 -67013 -99021 270579 -289758 107453 257170 -153657 274023 19264
12583 -112899 47231 91105 393059 -380395 68716 384550 283976 -64313 -77106 -327171
12573 -327171 -314198 -26759 99937 265586 224779 87157 319030 -144120 -38130 -131262 141202
12561 34853 -222386 214253 -334293 121191 -161050 127063 -66867 390308 -91070 -82697
12551h2697k9676C02070b03050C02478a9775C7318a72380A52577C224a95618B37288
12539F1239d5380D1453d1554j45032D8640b16739n9527e6682j73821A2697b98233
12527a18283A3616a71770A67331j4127c7782p8907A37242Q4121r8846c0763m6825
12516g7588k83281e0329I2366c4746A78065a25251R398L9274C72449b8781B5374
12504b9785E4563O505a77746N8227k11899B33322e5753A76747C2997a81532g9349
12492A63541G0925D156J46453j5447F833J01962Q3519H103M8789a21074D00883
12480G3173B5680a9721Q118B26612C8577M4409b7169E3893C022b54525O5807A78347
12467A17419d83540K22204H3605a14789j00005B75803j32969a6479E8956K66555
$$ plain form
12551 -82697 -112373 302070 -203050 302478 -19775 37318 -172380 152577 3224 -195618 237288
12539 61239 -45380 41453 -41554 -186586 48640 -216739 -276266 -56682 -230503 12697 -298233
12527 -118283 13616 -171770 167331 153204 -37782 -116689 137242 221363 122517 -30763 -77588
12516 -77588 -360869 -50329 92366 -34746 178065 -125251 -115853 -76579 372449 -28781 25374
12504 -29785 54563 61068 -177746 -119519 -331418 233322 -55753 176747 32997 -181532 -79349
12492 163541 70925 4156 150609 135162 6833 108795 192314 8103 56892 -121074 400883
12480 73173 25680 -19721 -11603 226612 38577 82986 -27169 53893 3022 -254525 -188718 178347
12467 117419 -483540 -261336 83605 -114789 -214794 275803 142834 -16479 58956 325511
12457C25511d8372j18319j35614E21533k60402A4717a61347g1197F3417l0999
12447C2418b50519J12780H1404a4972F1432Q679a8980r9792D9678i7787j48161
12436b45948O1436m9743G2855c479q7746L0564B47693C8525p920f395H461b48079
12423h3884I9417J99816e1645A77145i288G2J86853a59513m9450c9568H0182b7000
12410E0292J46215a88572R2969k89585A07966m1653Q0335m8235f6980A9960L70431
12399C90391a35859A05737d2262H4951k5450i1076A73934b15693F3375a56684
12388F089b5459k40491a08451l61435B05667a05452c9103C42344A07117A5060
12377d2815A90791p5810n3792J01527a67671A0347b7326j39292A94989E2067b44391
$$ plain form
12457 325511 -48372 -166691 -302305 521533 261131 14717 -161347 -71197 63417 32418
12447 32418 -250519 -137739 81404 -14972 61432 70111 -18980 -118772 49678 -97787 -245948
12436 -245948 -184512 -234255 72855 -3479 -91225 -60661 247693 38525 30605 -6395 8461 -248079
12423 -83884 99417 299233 -51645 177145 -9288 72 186925 -159513 -208963 -39568 80182 -27000
12410 50292 196507 -188572 -95603 -385188 107966 66313 146648 98413 -66980 19960 390391
12399 390391 -135859 105737 -42262 84951 59501 -91076 173934 -215693 63375 -156684
12388 6089 -25459 -265950 -108451 -469886 205667 -105452 -39103 342344 107117 15060
12377 -42815 190791 114981 61189 162716 -167671 10347 -27326 -166618 194989 52067 -244391
12365A54564b98023f0352b3470n4980A51391b98538a45085B09347j2977a59700
12354f4892B88b47600A58524a25686j87299J41626A4949f4899H8854b27163A66068
12342A18907C5919J1445c21516D76244g5367k4112L0976j91044C35447i3196D8356
12330A46709a19453A07082O4549e6535A83707F6877J45102N9090c49672a50711
12319F7190b1142k1242D66367A6158K13592K35113D2151J38923b024A96620J66917
12308C63537A20974b46720B17364B5822L16140A46633b44425B63027p6773p6797
12298A09457P0380d6214E37135A21206m3871P466b19139C47929a60664P9501m7930
12287a29093A06999a61767B99853f1221F4052b45887d4087B38371r6789q301c69521
$$ plain form
12365 154564 -298023 -60352 -23470 -78450 151391 -298538 -145085 209347 196370 -159700
12354 -64892 288 -247600 158524 -125686 -312985 -171359 14949 -64899 88854 -227163 166068
12342 118907 35919 47364 -321516 476244 -75367 -99479 -68503 -259547 335447 -93196 48356
12330 146709 -119453 107082 171631 -56535 183707 66877 211979 271069 -349672 -150711
12319 67190 -21142 -42384 466367 16158 229750 464863 42151 181074 -2024 196620 363537
12308 363537 120974 -246720 217364 25822 341962 146633 -244425 263027 186254 109457
12298 109457 179837 -46214 537135 121206 77335 84801 -219139 347929 -160664 -81163 -129093
12287 -129093 106999 -161767 299853 -61221 64052 -245887 -44087 238371 141582 133281 -369521
12275I9733O8082i0278L8080A22927F0414k6730K27280e1093A70580C7712J74172
12264B11884J37370F2339K35339a54505H2733K26890G4569E347a01531A85912
12253A78533a43900k0636G1660K30735j16137j4946j5252B9837J1290c469A13127
12241a29104d2412A84871q7634K38128j52242N6274A11442K44440K60418A51290
12230B49664G584K26180l0047M12688C6981J4775K83854A58145g4553J744A99783
12218a71684B32186q1891B7174J77911k1993E0454a13880B64674o1326H5648K92170
12207C77818A12978K09326H0338C2545J97629o8631n446J19428M2126J13744A88330
12195b7519C07349p2571M9429D413J94553e1821B20481Q6191D7655K47792q0546
$$ plain form
12275 99733 167815 -90278 -52198 122927 60414 33684 260964 -51093 170580 37712 211884
12264 211884 349254 62339 297678 -154505 82733 309623 74569 5347 -101531 185912
12253 178533 -143900 -164536 71660 302395 186258 171312 156060 29837 41127 -3469 113127
12241 -129104 -42412 184871 97237 335365 183123 239397 111442 355882 616300 151290
12230 249664 7584 233764 203717 616405 36981 51756 335610 158145 -74553 -72809 199783
12218 -171684 232186 150295 27174 205085 183092 50454 -113880 264674 203348 85648 377818
12207 377818 112978 322304 80338 32545 230174 161543 156097 275525 317651 431395 188330
12195 -27519 307349 234778 284207 4413 198966 -51821 220481 306672 47655 295447 214901
12184B14901p3471C9774J37325l4046J39457N8751A52582L36737F022J1532K07876
12173B25430C9041a52386B4041M18788c3328C62973b67495A98637r6697K29817
12163C31757A53149L5371L6887H3305K0758O5404J07276Q6816a33812D91367F0572
12151B97374a02502D50579I8253L82283k31161A23862K78002A43336K25089A3452
12140C95372D9076O5904J90474p2970l0052J95515f3814C27788G6760a21007B96457
12128B54508a39029H0931R43J11632j1200d8978A12413c579A35238d9764m0512
12117i0276o1992A27308A6062a31181B24346a47836B73590j19204J71830D2914
12106f4699a5065E45711j59350f701I1433k91K87093o9709F3330k4507J77492
$$ plain form
12184 214901 141430 39774 177099 143053 282510 341261 152582 489319 6022 17554 225430
12173 225430 39041 -152386 24041 442829 -33328 362973 -267495 198637 101940 331757
12163 331757 153149 188520 225407 83305 104063 169467 276743 363559 -133812 491367 60572
12151 297374 -102502 450579 98253 480536 249375 123862 401864 143336 368425 13452
12140 395372 49076 114980 305454 232484 202432 397947 -63814 327788 76760 -121007 296457
12128 254508 -139029 80931 81874 193506 182306 -48978 112413 -3579 135238 -49764 -90276
12117 -90276 -152268 127308 16062 -131181 224346 -147836 273590 154386 326216 42914
12106 -64699 -15065 545711 386361 -6701 91433 91142 378235 308526 63330 38823 216315
12095B16315G0723J02234R4803a6814B93965P0540E4576a44621p1852f0451A25223
12083b90327A7642b49604A43820K01530F896O2493J49386p3812J59865J9108F4795
12071b85927A8071L14183j06768I8465J49140J99068a2726L400B60440j26089
12061A34351J67139P3588p0965j26312e334A37687o4635B3831J60733K670P5692
12050B62926k791J56767g0373B56668m0254i7090A61278K6097C5059K53273F1497
12038A16338j308a24469B3217a23487d4151A12553D7747A6758f5371E8263J03287
12027A61550n0420c1188q2772F6522B6717b14775O1965G60i3716F5579b56249
12015E7965i0616l12169h7612H7177b07507D8208c7085A56301h0689J4529K5239
$$ plain form
12095 216315 70723 172957 267760 -16814 293965 364505 54576 -144621 -216473 -60451 125223
12083 -290327 17642 -249604 143820 345350 6896 69389 218775 144963 304828 323936 64795
12071 -285927 18071 332254 225486 98465 247605 446673 -12726 -9326 260440 134351
12061 134351 301490 375078 304113 177801 -5334 137687 73052 23831 184564 187234 262926
12050 262926 260135 416902 -70373 256668 216414 -97090 161278 187375 35059 288332 61497
12038 116338 115030 -124469 23217 -123487 -44151 112553 47747 16758 -65371 58263 161550
12027 161550 111130 -31188 -113960 66522 26717 -214775 -152810 760 -93716 65579 -256249
12015 57965 -90616 -402785 -87612 87177 -207507 48208 -37085 156301 -80689 -66160 -40921
12004d0921B62493b4625A98793a9038C24957b84554a18655E6558J31171d4050
11993B03349H4821e266B29483g4699C74856a10693M7453A27138h7876a9670G464
11981a68381j40521A06424c65575a50258d9192j44801e7427A33765n7515Q1385
11971A57635L473a89075G6910b90419G0495J61006b38591H6160a7933A42674j5144
11960A27530C0532f6658a7937I1810q179J18995b1923j106j75913c0548B01375
11948c1807A64457c66676a25509B66580G1870a3715D8616a82924A67771J22519
11938B90290a82313n2971A59660a71502j05541N5876B06708f8686D2220i1029
11927A60234a2982A86317a5361B77566E4184h2485E906e8063j34341L1588a6537
$$ plain form
12004 -40921 262493 -24625 198793 -19038 324957 -284554 -118655 56558 187729 -44050
11993 203349 84821 -5266 229483 -74699 374856 -110693 -63240 127138 -87876 -19670 7464
11981 -168381 -308902 106424 -365575 -150258 -49192 -193993 -57427 133765 76250 157635
11971 157635 161108 -189075 76910 -290419 70495 231501 -238591 86160 -17933 142674 127530
11960 127530 30532 -66658 -17937 91810 83631 202626 -21923 -23029 -198942 -30548 201375
11948 -31807 164457 -366676 -125509 266580 71870 -13715 48616 -182924 167771 290290
11938 290290 -182313 -235284 159660 -171502 -277043 -221167 206708 -68686 42220 -91029
11927 160234 -12982 186317 -15361 277566 54184 -82485 5906 -58063 -192404 -160816 -16537
11915c48205J27612E8853b13757h8589j979m03G1899d7942A32558l6248h7457
11903a53544B63436A24264a1504A71308D1309J02718a44520B2369i1438l30049
11893d21487A6442J41916b5078j19320j5870A61014k0817J10245b45745A09866
11882A34089d8768K2437E0574M446b40831L2248B07416F6903g5940j69703b1409
11870f0253G9287K33457F3617e6629F0780J07130g2503A96138a81745A56841f7952
11858b07755g298p0032j40564h5127L5016F3743L6678i7172C2493F26a97094d4610
11845C78917H2872c3330A78393c16633j26313G4666b92385O6557h2670A15583
11834f2250F084L51240a22773I5415a51864D0568J80634D8713b37324a16767j23471
$$ plain form
11915 -348205 -220593 58853 -213757 -88589 -90568 -90971 71899 -47942 132558 96310 -87457
11903 -153544 263436 124264 -11504 171308 41309 144027 -144520 22369 -91438 -421487
11893 -421487 16442 158358 -25078 -144398 -160268 161014 140197 250442 -245745 109866
11882 134089 -48768 -26331 50574 55020 -240831 -208583 207416 66903 -75940 -245643 -21409
11870 -60253 79287 312744 63617 -56629 60780 167910 -72503 196138 -181745 156841 -67952
11858 -207755 -7298 -77330 -217894 -85127 -50111 63743 100421 -97172 32493 626 -197094 -44610
11845 378917 82872 -33330 178393 -316633 -442946 74666 -292385 -225828 -82670 115583
11834 -62250 6084 357324 -122773 95415 -151864 40568 221202 48713 -237324 -116767 -240238
11823b40238b4431k0793k11446f8953j20618f5497i046j15086B13831p1799d50425
11811h235B24379h2944p8303A49166P087n5880A6125H005K04136e8616k15417
11800b74033B16373D5751i9255E1007a71574r0394A90808b34412a02317n8614
11790a60931E957f4875j3653a4195j88378N411j43449A65058F0348h3442D6023
11778a47972A70528a89783c1366A54746b10682a25A42797b12157j2922J10515
11768a14564k46524J36086B10830G9668N4721c55672a64203A27897a36250A09229
11757A8495a11699A21953k7629a61508B33631r7637J15770I5364m636d9711A13492
11745a83156Q9352j00441N6955j17375b8591B24527G3910c42933J69207n3158
$$ plain form
11823 -240238 -24431 -45224 -256670 -68953 -189571 -65497 -9046 -124132 213831 142032 -450425
11811 -8235 224379 -82944 -161247 149166 156253 100373 16125 8005 212141 -58616 -274033
11800 -274033 216373 45751 -99255 51007 -171574 -261968 190808 -234412 -102317 -160931
11790 -160931 5957 -64875 -78528 -14195 -202573 -197162 -340611 165058 60348 -83442 46023
11778 -147972 170528 -189783 -31366 154746 -210682 -125 142797 -212157 -225079 -114564
11768 -114564 -361088 -225002 210830 79668 134389 -355672 -164203 127897 -136250 109229
11757 18495 -111699 121953 94324 -161508 233631 135994 251764 95364 90728 -49711 113492
11745 -183156 -93804 -194245 -137290 -254665 -28591 224527 73910 -342933 -173726 -226884
11735b26884C8163a97503B24730i3689r772A28980a34039F2049J36981J33229
11725C32259h9550K6596B91722p5718D3297K17140A09841a57553l0217c4857B21351
11713A10422a17554j95344B39055b49430A55290J0384e9180g210C30105a81325
11702d8202E7422J85050c3307A98955B6480a57183H4362J66726G6263h7238j14541
11691b01779l267j31707g1507G4713m123P1393b10244p7632a9505C826K25759
11680B29585a6524B76423a55723a6948A44354J18013o1487b5660A15683l639m0703
11669G1341b15416M23B25022a53396A46462m0815k2417J49761b590k15006h5182
11657A53924a02319B80753i1302d1826A47334M6606A8568K47979r4923a4374A60854
$$ plain form
11735 -226884 38163 -197503 224730 -93689 -103461 128980 -134039 62049 199030 332259
11725 332259 -89550 -62954 291722 216004 43297 260437 109841 -157553 -187770 -34857 221351
11713 110422 -117554 -312898 239055 -249430 155290 165674 -59180 -7210 330105 -181325
11702 -48202 57422 242472 -33307 198955 26480 -157183 84362 251088 76263 -87238 -201779
11691 -201779 -205046 -336753 -71507 74713 70590 141983 -210244 -287876 -19505 3826 229585
11680 229585 -16524 276423 -155723 -16948 144354 262367 200880 -25660 115683 112044 71341
11669 71341 -215416 -214993 225022 -153396 146462 105647 83230 232991 -2590 -217596 -85182
11657 153924 -102319 280753 -91302 -41826 147334 193940 18568 266547 171624 -14374 160854
11645a5930j05613J7761B7910f9550K0969J6667A88550c32631H0218J5113L14385
11634D09716E4693A0859a44828B74238a63995I2755J34641d48700A17197a58005
11623A59507Q990b83370h5685E3625k5869L7429a12483d8868A19625B0189J53124
11612A73313b21197f58n0168j33912B07598n8577P111o9107J49454a2946l65542
11601c78488h119j15435A92109G2327R6785K2707B3004c24013G6834a55693A98659
11589i3637n4510q087K481K2917H7001a02756e291B26729a04978A25966k4390
11578A01576B9248K70792b0789j32553E7479j1098a39211B51976b26765B02483
11567F5877P6945J7829o1587A9176f8675p2924A83224J1241K19516i9858C74936
$$ plain form
11645 -15930 -121543 -103782 27910 -69550 -48581 -31914 188550 -332631 80218 95331 409716
11634 409716 54693 10859 -144828 274238 -163995 92755 227396 -448700 117197 -158005
11623 159507 168497 -283370 -85685 53625 27756 65185 -112483 -48868 119625 20189 173313
11612 173313 -221197 -658 -50826 -184738 207598 149021 156132 87025 236479 -12946 -378488
11601 -378488 -8119 -123554 192109 72327 169112 191819 23004 -324013 76834 -155693 198659
11589 -93637 -148147 -156234 -153753 -130836 87001 -102756 -5291 226729 -104978 125966 101576
11578 101576 29248 300040 -20789 -153342 57479 46381 -139211 251976 -226765 202483
11567 65877 142822 160651 99064 19176 -68675 -141599 183224 194465 413981 -99858 374936
11555D55598a42605B45330A02087L28846c9127B68168b09283C51158d1641A5375
11544a60626j28189H7625a52126B35947b43535d6266H4267K39134B407J13390
11534A15797K33703b45951e8899F2748N9261J08769G0413J02656R607G0240b22318
11522c0529A90751Q2873h1422A40770K8047o8637Ac2990A49508n6994c6574A89427
11509A50645E4795e5443k85131D07492n7456c64645B63625M026c0467A02621l5151
11498F7470K54706A16974b6545h716o9146D2634J42615q791O6343E3207J45357
11487A98564J30112I2041i8299j93260A62427E180N78974A81225j0813b13062
11476c9753A76291a00243A71712a03115r076F3966K27545F4528J82096Q7210C5575
$$ plain form
11555 455598 -142605 245330 102087 430933 -39127 268168 -209283 351158 -41641 15375
11544 -160626 -288815 87625 -152126 235947 -243535 -46266 84267 323401 2407 115797
11534 115797 349500 -245951 -58899 62748 122009 230778 70413 173069 182676 70240 -222318
11522 -30529 190751 273624 -81422 140770 168817 100180 1 -32990 149508 92514 -36574 189427
11509 150645 54795 -55443 -340574 407492 350036 -364645 263625 267651 -30467 102621 67470
11498 67470 322176 116974 -26545 -8716 -77862 42634 185249 176458 242801 53207 198564
11487 198564 328676 92041 -98299 -291559 162427 5180 584154 181225 170412 -213062
11476 -39753 176291 -100243 171712 -103115 -112191 63966 291511 64528 246624 333834 35575
11464A25327a68249A69468m5204l4784a66437A45835L00p358K11679j65641N0614
11453B35429E1272L70246j97342p6344K9000K3098j0367P6507a83817c0634B00360
11441a5542k40813E8441P6188a58657B68433A11310P9848o0289b0586l45457B1248
11429a4179j55319A68194b17528c0944k45807h2153B8971j870Q8388c7144B27372
11417c9329H756a30862B05969D8317d2818B47906P805J10976A61007J586a3991
11405C72401b23491B1855d6565l4686c5354G409O5133K24185a81397D9079b237
11393b422j28466b4558E6729a71891j5484Q1806A95903p2159f3504G1649g6341
11381C01536b96713F8536J17738c32934R2168H5842l8839P0608k1192J29912E3188
$$ plain form
11464 125327 -168249 169468 124264 89480 -166437 145835 146135 138777 350456 184815 235429
11453 235429 51272 421518 224176 147832 176832 199930 189563 266070 -183817 -30634 200360
11441 -15542 -256355 58441 134629 -158657 268433 111310 191158 130869 -20586 -366043 21248
11429 -14179 -169498 168194 -217528 -30944 -276751 -82153 28971 27101 115489 -37144 227372
11417 -39329 8756 -130862 205969 48317 -42818 247906 255711 366687 161007 162593 -13991
11405 372401 -223491 21855 -46565 -81251 -35354 7409 72542 296727 -181397 49079 -2237
11393 -2422 -130888 -24558 56729 -171891 -187375 -105569 195903 123744 -63504 71649 -76341
11381 301536 -296713 68536 186274 -332934 -240766 85842 47003 117611 96419 226331 53188
11369D0600b8619l08131B4627J71493J14297c01272H104g3760k9003A16842a88472
11357E5051K72734b86637a33859m0970j1148P730A43514g2824p4843A86038c9315
11345B1366h6585j92437c2454E0714L8861c6848G7305b214D0727a80723b9289
11333a85126A34279A3893c22680a1764j20073B7254a0365r4543k8286l888j84808
11322c21890f6838j0016D8924a43651g0486A3485a68396f6011J4969j7374A03835
11310c32087F2921A7963a86704J3072c5815A32903k7451a81131A9650b72729J01736
11299a70993M4671j3608f8616F9047h7468A82346F6145K39769G433P9048k0444
11288F6037c76045c825k11176H4001J5533h602r6465B17075a5906F6089M253a71
$$ plain form
11369 40600 -28619 -336750 24627 196120 310417 -301272 8104 -73760 -102763 116842 -188472
11357 55051 327785 -286637 -133859 -174829 -185977 -178247 143514 -72824 -147667 186038 -39315
11345 21366 -86585 -279022 -32454 50714 89575 -36848 77305 -2214 40727 -180723 -29289
11333 -185126 134279 13893 -322680 -11764 -131837 27254 -10365 -104908 -133194 -137082 -321890
11322 -321890 -66838 -76854 48924 -143651 -70486 13485 -168396 -66011 -51042 -68416 103835
11310 -332087 62921 17963 -186704 -173632 -35815 132903 105452 -181131 19650 -272729 -170993
11299 -170993 -126322 -139930 -68616 69047 -87468 182346 66145 305914 7433 86481 66037
11288 66037 -376045 -3825 -215001 84001 99534 -8602 -105067 217075 -15906 66089 70342 -171
11275a64A68519b38523N870g0791F2107a66270M6296j88377F9454a75149A7800
11263A30758e71602C6344q086a01095a5965k79012a08556j5700F7706a32672j91647
11252c24319E7022b6762E0654K48411C7738O764K972b75917R5269A35910k6285
11241A09625C3587b23206j0596A22139a01160A2531L84576b08684B0450a83493
11230g845j79480j6977A09055a42175E4062k3786b64000e9855A58255a3251I9876
11218b15251k63947J44800A82745a17711d4229j33208G9128f284k06236k2867
11208b35387c5231k06816L0449G3857c59411G5453a09l22783A15121b8845k0447
11197d9292N592k72903A69470R9196j12488d31052k52207C41423a51014q0037
$$ plain form
11275 -164 168519 -238523 -232653 -70791 62107 -166270 -119974 -308351 69454 -175149 17800
11263 130758 -571602 36344 28258 -101095 -15965 -294977 -108556 -124256 67706 -132672 -324319
11252 -324319 57022 -26762 50654 299065 37738 44502 47474 -275917 -180648 135910 109625
11241 109625 33587 -223206 -233802 122139 -101160 12531 397107 -208684 20450 -183493
11230 -7845 -187325 -204302 109055 -142175 54062 30276 -264000 -59855 158255 -13251 99876
11218 -215251 -479198 -334398 182745 -117711 -44229 -177437 79128 -6284 -212520 -235387
11208 -235387 -35231 -242047 -211598 73857 -359411 75453 -109 -322892 115121 -28845 -49292
11197 -49292 -43700 -316603 169470 268666 156178 -431052 -683259 341423 -151014 -231051
11187b31051a00615j94584R0421b7068D4921f2407A67649a35972N1737l62076
11177d46311B9832b97924P9839f9446A4437e957F3915b47368e532E0754a01284
11165c07669B91043b97950G8825c1409q3846M0871l6695c0126k20715k4500G6474
11153C02893e78955a42392B54221a18158j65635A39903i6584j47712A95118a12233
11142E8204c1973j4395j11055g1453B11215q2184e4073D0952J5485J41492b87153
11130A42914a53975f0885B569a3124o7755j86506b2061C4368K51878I2093f2937
11118i4607A61087a32094j14929E0107a81673j73121f4657B65407a2782D76459
11107C44799p290a33855A86041G0710e6581A09994K41913A07955j737K99863d42065
$$ plain form
11187 -231051 -100615 -295199 -204778 -27068 44921 -62407 167649 -135972 -84235 -446311
11177 -446311 29832 -297924 -218085 -69446 14437 -5957 63915 -247368 -5532 50754 -101284
11165 -307669 291043 -297950 78825 -31409 -115255 -74384 -111079 -30126 -250841 -275341 76474
11153 302893 -578955 -142392 254221 -118158 -283793 139903 -96584 -244296 195118 -112233
11142 58204 -31973 -46368 -157423 -71453 211215 129031 -54073 40952 56437 197929 -287153
11130 142914 -153975 -60885 2569 -13124 -80879 -267385 -22061 34368 286246 92093 -62937
11118 -94607 161087 -132094 -247023 50107 -181673 -354794 -64657 265407 -12782 476459
11107 344799 337509 -133855 186041 70710 -56581 109994 351907 107955 106218 406081 -442065
11095F6468Q8389a09693g481B82143a46952e0451A87724a17381H430e8427B45419
11083A9417J69913k2762J52944I3942K52795j49123I3245K24593h5053B52515
11072C73280A84336n3296R5569J50488A82012J02436A8912L11804K3891K48798
11062F03405k59929n8832L64061B12296L06064B32437F7296L8814Q6244K47093
11052D39447j48248m7214J01936R4641B12465Q6065L37741A10673N32446A17863
11041D10410l5126Q9186j03362K43292J71842A77698O08032j28781k15874N32856
11031I73931j423M7254k93005K98082k64522K22941j873k76798K48081j22317
11021H30351k36262J85008M80108E93185O11436l90586j9498j94419R4158M269
$$ plain form
11095 66468 154857 -109693 -7481 282143 -146952 -50451 187724 -117381 8430 -58427 245419
11083 19417 189330 166568 319512 93942 346737 197614 93245 317838 -85053 252515
11072 373280 184336 131040 226609 377097 182012 284448 18912 330716 354607 603405
11062 603405 343476 284644 648705 212296 518360 232437 67296 106110 192354 439447
11052 439447 291199 243985 345921 440562 212465 298530 636271 110673 643119 117863
11041 410410 375284 464470 361108 604400 776242 177698 785730 656949 441075 973931
11031 973931 972508 1019762 726757 1024839 760317 983258 981385 704587 952668 830351
11021 830351 594089 779097 1259205 593185 1204621 814035 794537 600118 694276 698545
11011F98545j8247l8753j6703J56863L6760j1432j85334N96269n11067J12084
11001H18985l06086L4644J98112C51184L61437J8587C19042N74422j1192l31378
10991E50894n1749K37519k10086O8984K3028M5782K8142m3127J22585J8547P5125
10980H65644Q5818k56719k15532M01082m12473M3191N51879D99168O51290m23336
10970G27122J99950m4314k439K23413O486l01287L72428o1433j86943O9266M97296
10959A499545J83714M77054k77054K02259K08130J73659J49039K86797J99280
10950C102423l31255K2478l14305j57489k60376k24641k05219L47789j50773J07706
10940A936338k52248K1644j48497K8593j655k96588j0016k10235O6436l44693
$$ plain form
11011 698545 680298 641545 624842 781705 818465 807033 621699 1217968 706901 818985
11001 818985 512899 547543 745655 351184 712621 731208 319042 893464 882272 550894
10991 550894 499145 736664 526578 595562 618590 664372 692514 649387 771972 790519 865644
10980 865644 951462 694743 479211 880293 467820 511011 1062890 499168 1150458 727122
10970 727122 927072 882758 880319 1103732 1110218 808931 1181359 1119926 932983 1002249 1499545
10959 1499545 1683259 2160313 1883259 2085518 2293648 2467307 2616346 2903143 3102423
10950 3102423 2771168 2793646 2479341 2321852 2061476 1836835 1631616 1979405 1828632 1936338
10940 1936338 1684090 1705734 1557237 1585830 1584175 1287587 1277571 1067336 1133772 789079
10930G89079K35584C82275J29944k40144K39643I1528M75075A71808L2852N7970
10920B62630I8784L91982A89078K6168D7305a1158C81129K24035k91811a61658
10909A16605l7968a7283B70379q3530h9577L0317m5117C6142c37072e1144j01590
10898a52734L8629A18147a08779A45339B591K50760E4345b5925l7369j67643j57640
10887c88577a30870k599k8199N0139B52811I1337L0601B4171K06795A5189b95726
10875B5675b48956d0195o4531M2500N192l32361A90374c74051J10536A05035a0689
10863b4340A04923a02881k23944B8218b40198a11675k5378m23122d3575A55059
10852A37061B2822M5656a36134D5767f4425j02783B6999d0563j32962g3266A18070
$$ plain form
10930 789079 1024663 382275 512219 272075 511718 91528 566603 171808 204660 262630
10920 262630 98784 490766 189078 215246 47305 -11158 381129 605164 313353 -161658
10909 116605 78637 -17283 270379 186849 -89577 -59260 -104377 36142 -337072 -51144 -152734
10898 -152734 -114105 118147 -108779 145339 2591 253351 54345 -25925 -63294 -230937 -388577
10887 -388577 -130870 -133469 -161668 -111529 252811 91337 121938 24171 230966 15189 -295726
10875 25675 -248956 -40195 -104726 -62226 -57034 -389395 190374 -374051 -263515 105035 -10689
10863 -24340 104923 -102881 -326825 28218 -240198 -111675 -137053 -560175 -43575 155059
10852 137061 22822 68478 -136134 45767 -64425 -167208 26999 -40563 -173525 -73266 118070
10840B3734d7919A94920G9939h1083J781B64657M0582b35536A0793a25117c6747
10828a32667n9865K931F3135B4365a09923G9753J00679a20897e0675B6729f5449
10816b8156j21865B58162g7866A7966a45296r8355A04783f4758q3801c7343A58942
10804A37897a24388C47199i7054D2232O9345h1322a4612k40092J248F884J7583
10793B4467K9773C532b67754A84444b45614j5108e9456B4388c7231F7362J90545
10782B57907A27274K6210J1016a22746E4164a44971k12306G0671a96254f375A42250
10770c7963A53854G0886a09847A6391d0960A16480B2518K7139B1875b18802P0755
10759a48047o3332r9690B05311B5512b02201f1418o4714M5786Q153a9765i834
$$ plain form
10840 23734 -47919 194920 79939 -81083 -79302 264657 305239 -235536 10793 -125117 -36747
10828 -132667 -192532 -189601 63135 24365 -109923 79753 180432 -120897 -50675 26729 -65449
10816 -28156 -150021 258162 -77866 17966 -145296 -243651 104783 -64758 -148559 -37343 158942
10804 137897 -124388 347199 -97054 42232 111577 -81322 -14612 -254704 -253456 6884 24467
10793 24467 54240 3532 -267754 184444 -245614 -260722 -59456 24388 -37231 67362 257907
10782 257907 127274 153484 164500 -122746 54164 -144971 -357277 70671 -196254 -6375 142250
10770 -37963 153854 70886 -109847 16391 -40960 116480 22518 49657 21875 -218802 -148047
10759 -148047 -211379 -311069 205311 25512 -202201 -61418 -126132 -80346 -72193 -19765 -9834
10747b95270D4796a79232f5857A74953b31644L5969m4699F3279c81463J89670
10737a91793O1323a0484j74171C7870c19288R9380P7453l3429m0873e6547j19053
10726a75600k993K1322O1554D6498d10956J42101f6154A46042c34895C9978a09034
10714a21290p250B14938C029K0731b18221R4627J2015k20030I8913K9694f5284
10702e2343q165B13151e6060K3415F1630a73987L6812j52603q21l2116A85149
10690a01361i1k39308b1580G5946d1398r632o1852B2266b97556f919j04334B52520
10677A17659d07748a39003c1114j13720I1047a26059D12697H3337b84652i8135
10666g7938A2546i586j5409A32043J79317a22139c2975E9865O9872a70502I7933
$$ plain form
10747 -295270 44796 -179232 -65857 174953 -231644 -195675 -240374 63279 -381463 -191793
10737 -191793 -130470 -10484 -184655 37870 -319288 -219908 -142455 -175884 -216757 -56547 -175600
10726 -175600 -178593 -157271 -95717 46498 -410956 -268855 -66154 146042 -334895 39978 -109034
10714 -121290 -128540 214938 3029 23760 -218221 -123594 -111579 -331609 98913 128607 -65284
10702 -52343 -60508 213151 -56060 -32645 61630 -173987 -137175 -289778 -290599 -322715 185149
10690 -101361 -91 -239399 -21580 75946 -41398 -51030 -112882 22266 -297556 -6919 -111253 252520
10677 117659 -407748 -139003 -31114 -144834 91047 -126059 412697 83337 -284652 -98135
10666 -77938 12546 -9586 -24995 132043 311360 -122139 -32975 59865 129737 -170502 97933
10654c9716p2588B25065G1219E586J27873E6183J33639a73283c8500F4140b72703
10642i9164L6298k9446H6483a73063h2382A81209K03565c0072p3209I0830b22895
10630f9289a5289k3603l7299K0064C9515J17025b30095B790g221C8988a90832
10618A045a7095A11148i8177r4981A14223d404j16806L2074A03346a93975b8910
10606a34190F251b23242N4896L6319N8951K4979k03848a08218j56195a8316j35050
10595a53366l9304E4542J52793a57397A11987b58315R1611f0658k6004B7362I379
10583e6629j03336A4065J86952i6922b948j97886h8912C3884a65926B51079A0110
10571a26818j55004B816b07018B94071a36194A18738p695a849m5422B43716e504
$$ plain form
10654 -39716 -112304 225065 71219 5586 133459 56183 189822 -173283 -38500 64140 -272703
10642 -99164 -62866 -92312 86483 -173063 -82382 181209 384774 -30072 -103281 90830 -222895
10630 -69289 -15289 -38892 -76191 -56127 39515 156540 -230095 2790 -7221 38988 -190832
10618 1045 -17095 111148 -98177 -193158 114223 -4404 -121210 -89136 103346 -193975 -28910
10606 -134190 6251 -223242 -168346 -132027 -73076 -48097 -251945 -108218 -264413 -18316 -153366
10595 -153366 -192670 54542 207335 -157397 111987 -258315 -166704 -60658 -86662 27362 9379
10583 -56629 -159965 14065 201017 -96922 -2948 -200834 -88912 33884 -165926 251079 10110
10571 -126818 -281822 2816 -207018 294071 -136194 118738 111043 -1849 -47271 243716 -5504
10559b97450J7302I1257g4667A00796h4973k6348B09043e7948B41245d1322j19417
10548a60739b8084A83591o0820g5947A94493a31467A14493E1149f4261A41437
10537b23980A4938a87811a1871o2407R618A64916a84713m4614j67752a78278f831
10525b24349a1864n4281q7099L3911d5984A89903O4271a09166G353h9297I4863
10513b77269o035i7990o1827O0750A57297c5563a7475p6658j14672A93366o3547
10502A29819C0127R487a36630A0828L03816I9863A7352d7344n0699C0693b87376
10490A36633c70190a50878m4507F9586a77852B9925K26578n5503G665K15605a97259
10478B58740A27091b30822j52979A50656j1211D1302c66059i1389F1369A8003
$$ plain form
10559 -297450 -280148 91257 -74667 100796 -84973 -111321 209043 -57948 241245 -41322 -160739
10548 -160739 -28084 183591 122771 -75947 194493 -131467 114493 51149 -64261 141437
10537 -223980 14938 -187811 -11871 -74278 -64660 164916 -184713 -229327 -397079 -178278 -6831
10525 -224349 -11864 -66145 -153244 -119333 -45984 189903 254174 -109166 7353 -89297 94863
10513 -277269 -283304 -97990 -159817 -99067 157297 -35563 -17475 -94133 -208805 193366 129819
10502 129819 30127 39614 -136630 10828 314644 99863 17352 -47344 -98043 30693 -287376
10490 136633 -370190 -150878 -195385 69586 -177852 29925 256503 201000 7665 223270 -197259
10478 258740 127091 -230822 -383801 150656 139445 41302 -366059 -91389 61369 18003
10467h6193m6602D0979K3701J43723I7716N8416F4635K32369Q5915A81209g988
10455F24137a0690C8448f4708A52083R6582a33966L1834E7896Q2033b62099B95550
10443A8045h2932F0053J55005a74862k21779G7438b8117j62072B5608b22111f1854
10431a66296e1342A07976C5656J49715e2965J2389E4146b18775p7374C4319d2146
10419b08544A31367E1919b03328A98629c21270a21442B93778a55547L84A7278
10408b89118N7952M9853g7008o4269A1550Q593a21048k9018d7715L689A20781
10396a3699l43853B7062c2237B78143A38389o8851c14188J29081e8302A01120
10385a66676A09000f8372j107a1499j41229A2509h8294r7904A0965d5062j7262
$$ plain form
10467 -86193 -132795 40979 64680 208403 97716 156132 64635 297004 382919 181209 -7988
10455 624137 -10690 38448 -64708 152083 248665 -133966 -102132 57896 139929 -262099 295550
10443 18045 -82932 60053 215058 -174862 -396641 77438 -28117 -190189 25608 -222111 -61854
10431 -166296 -51342 107976 35656 185371 -52965 -40576 54146 -218775 -296149 34319 -42146
10419 -208544 131367 51919 -203328 198629 -321270 -121442 293778 -155547 -155163 17278
10408 -289118 -231166 -181313 -77008 -141277 11550 20143 -121048 -150066 -47715 -44026 120781
10396 -13699 -357552 27062 -32237 278143 138389 69538 -314188 -185107 -58302 101120
10385 -166676 109000 -68372 -69479 -11499 -152728 12509 -88294 -186198 10965 -45062 -62324
10374f2324A64505K9686q7906N5354D639M86568d7862G7234J58656g7377j11154
10363a88531H2142K22900J04719A81624N2657p9131L7856P1015Q823J37601A21890
10351C82103o7057N7071J08303A40001L10561N3379p0520J23394k01700P9449
10341D34564r5776i526E84219B90574n3974M0679J19349j64373K02096K22242
10331F56593j54194J6795j83612n5218K06508B29549K41749M0904k05023r9280
10321B07899h4787B31027J44922k913J3768A84067b7919c895G4314J2740M10851
10310D97905A26339J26971H1071J3867a59746D5022K25791a29890I3290J93753
10300B87043F8769a7824M731p5938B74809E2002b11559D5926K1622a59786b982
$$ plain form
10374 -62324 164505 194191 106285 161639 4639 491207 -47862 77234 235890 -77377 -188531
10363 -188531 82142 305042 409761 181624 234281 155150 193006 264021 272844 410445 121890
10351 382103 315046 372117 480420 140001 450562 503941 433421 556815 355115 434564
10341 434564 338788 -9526 584219 290574 236600 277279 396628 232255 434351 656593
10331 656593 502399 519194 335582 280364 486872 229549 471298 512202 307179 207899
10321 207899 -84787 231027 375949 373036 386804 184067 -27919 -3895 74314 87054 497905
10310 497905 126339 253310 81071 94938 -159746 45022 270813 -129890 93290 287043
10300 287043 68769 -17824 -13093 -89031 274809 52002 -211559 45926 67548 -159786 -2982
10288I0209b19483B5947n886J12185h0302j8307A6920K8932a19885F9718c61075
10276F9815a03695B99100e4534C3278M2118a30152C87534a08598A98729a68327
10265c42295F1704N9466g3477r1294K8647j3044l7712Q0135B08342K73739A25775
10253C08000b76204f5807j13001D9145a06199L0486O478H3989d290B83538I755
10241a167l3067e645C47818a84196B04952J67384A68596q0991J60007F1020O788
10230F7808J12819L0714A01605K94061c4110n7167I0691k8071g2507k76105G3206
10218a86482c1795l01147a08351B1796h6508k8975A20141a5646m3957k5843A70924
10206A6078a5755l59408a84660Q9938A60503b48380Q7308k9851p4918f6551B15023
$$ plain form
10288 90209 -219483 25947 20061 132246 -80302 -98609 16920 45852 -119885 69718 -361075
10276 69815 -103695 299100 -54534 33278 75396 -130152 387534 -108598 198729 -168327
10265 -342295 61704 121170 -73477 -164771 -136124 -149168 -186880 -106745 208342 482081 125775
10253 308000 -276204 -65807 -178808 49145 -106199 -75713 -69235 83989 -4290 283538 9755
10241 -1167 -34234 -5645 347818 -184196 204952 372336 168596 87605 247612 61020 67808
10230 67808 180627 211341 101605 395666 -34110 -91277 90691 62620 -72507 -348612 73206
10218 -186482 -31795 -332942 -108351 21796 -86508 -115483 120141 -15646 -59603 -85446 170924
10206 16078 -15755 -375163 -184660 -94722 160503 -248380 -161072 -190923 -265841 -66551 215023
10194e856G5029b78849A90826G7162g8298p8492b5976k52023o5266A3673d0142
10182C7732Q1481l1543a93131A6974f0887A07781d2499m24338D8956j9509J30087
10171A59534b62878d8218q4479e8612m18193A19729a51495P0299A96319E2315
10160C46228A16022a66380B01657d39755A87266o1677c5908E9381J67373o5725
10150A61029e00497J85972a5022A62691a23422j23739B5573K12226d0643j64920
10140b05563A43388g8783j01102l9413c4153j36516M4654m5263l9139d2142A69297
10128a23850N0563o6545c7003j5561H6460j1232J5261j2567d04553J51954H3208
10116d938B86053b88036a05077A29886f2683C7295b3193I3845c05925g0349C9541
$$ plain form
10194 -5856 75029 -278849 190826 77162 -78298 -156790 -25976 -277999 -343265 13673 -40142
10182 37732 119213 87670 -193131 16974 -60887 107781 -42499 -466837 48956 29447 159534
10171 159534 -262878 -48218 -132697 -58612 -476805 119729 -151495 -81196 196319 52315
10160 346228 116022 -166380 201657 -439755 187266 125589 -35908 59381 226754 161029
10150 161029 -500497 -314525 -15022 162691 -123422 -247161 25573 237799 -40643 -205563
10140 -205563 143388 -78783 -179885 -219298 -34153 -170669 -126015 -171278 -210417 -42142 169297
10128 -123850 -73287 -139832 -37003 -52564 86460 75228 90489 77922 -404553 -252599 83208
10116 -4938 286053 -288036 -105077 129886 -62683 37295 -23193 93845 -305925 -70349 39541
10104b45088F3P0291a70994B33903K0404m5631r5489d80917a79664b6200k61725
10093b87925f2037j79846J2562Q6537c3244l9829E5103a21671a038A50371p1145
10082G9226M28791i8237B4985N979c02785E5106O4429D7851h3820k35468I9957
10070a14910j03565h3927J1593o1738q6127a2292j82896Q9208r9531A36013b80781
10058a53398k246O0988B32843b86762M9793A21453c96215E0007J86530b08475
10047b19504b5307k47175O7385h9589j89613E08093G7996a51997d7056n8584p0961
10036a76601j7037D353b77469a07897C6464k883M0843R39a34653I4849i6026m7706
10024a43732m889F303c5434j89930C0670c60708B64854h2913k56051c3741G7213
$$ plain form
10104 -245088 63 70354 -170994 233903 254307 208676 113187 -480917 -179664 -26200 -287925
10093 -287925 -62037 -241883 -229321 -142784 -33244 -73073 55103 -121671 -1038 150371 79226
10082 79226 508017 -98237 24985 30964 -302785 55106 119535 47851 -83820 -319288 99957
10070 -114910 -218475 -83927 -72334 -134072 -220199 -12292 -195188 -105980 -205511 136013 -280781
10058 -153398 -155644 -94656 232843 -286762 -236969 121453 -396215 50007 236537 -208475
10047 -219504 -25307 -272482 -205097 -89589 -279202 508093 77996 -151997 -47056 -105640 -176601
10036 -176601 -193638 4353 -277469 -107897 36464 33581 74424 75363 -134653 94849 -96026 -143732
10024 -143732 -148621 6303 -35434 -225364 30670 -360708 264854 -82913 -338964 -33741 77213
10012D1863b74040B23J4253a89117O2430N4725B00464A979J65619b73095g8728
10000e67170f2547A19126h1835C3872c5763J789j6763A97736P4474D3498b66812
9988a82763j55549I7579a72621m7655J07892B8181a35620A9917h9041A08842l4885
9977G3957M14665b03245A83760a32421r1520P9002A80862D9425h785A14541b95129
9965A09441e1937k03748Q2762Q270j5057M4957M8980k08488a0038k06825A58599
9953b6117j42651a075j97016b3473A08942k5022b11619H421a44939j81052f6937
9941E9723J10458B1173c37382a45994k2352A32772b984A5244h241m80831F3629
9929b22832C14319D4986J35990c79883B837J30719a38629H2015B849L388b36837
$$ plain form
10012 41863 -274040 223 14476 -189117 -126687 -71962 200464 1979 167598 -273095 -78728
10000 -567170 -62547 119126 -81835 33872 -35763 -33974 -50737 197736 272210 43498 -266812
9988 -182763 -338312 97579 -172621 -220276 -112384 28181 -135620 19917 -89041 108842 73957
9977 73957 488622 -203245 183760 -132421 -223941 -144939 180862 49425 -8785 114541 -295129
9965 109441 -51937 -255685 -172923 -164653 -179710 -134753 -85773 -294261 -10038 -216863 158599
9953 -26117 -168768 -1075 -198091 -23473 108942 83920 -211619 8421 -144939 -325991 -66937
9941 59723 170181 21173 -337382 -145994 -168346 132772 -2984 15244 -8241 -489072 63629
9929 -222832 314319 44986 180976 -379883 2837 133556 -138629 82015 2849 6237 -236837
9917e58657b46883l4353I0726M64648B32576b38621A05894M2335a78136J0797
9907a67339F1435d9176j73533i4505A22812a28417M5431A29590a04489j24536
9897b29025e5536n1839A07012L7811a31655m9941N1058b5512F9348a48056C19957
9885a05095G862a86141j5467B01517a78051K1533j46273B7425a48203H8370H938
9873b73802B19364a86895k17677O9297A67019B5659J67913D5377A3932c7330C7243
9861a8730H578c13462e4666A90549h1103j82014C75373c75839a15347j50455J13137
9850a52665j9239k86705J57988C8387O1580a18696q0872n1399f7061E0378b97707
9838d36806a00819I5354l8568a13955D6488b66664i523G5165j3469a90338A4740
$$ plain form
9917 -558657 -246883 -281236 90726 555374 232576 -238621 105894 148229 -178136 -167339
9907 -167339 61435 -49176 -222709 -94505 122812 -128417 -82986 129590 -104489 -229025
9897 -229025 -55536 -107375 107012 144823 -131655 -181596 -130538 -25512 69348 -148056 319957
9885 -105095 7862 -186141 -201608 201517 -178051 -156518 -302791 27425 -148203 88370 8938
9873 -273802 219364 -186895 -404572 -335275 167019 25659 193572 45377 13932 -37330 37243
9861 -18730 8578 -313462 -54666 190549 -81103 -263117 375373 -375839 -115347 -265802 -152665
9850 -152665 -171904 -458609 -300621 38387 99967 -118696 -199568 -250967 -67061 50378 -297707
9838 -436806 -100819 95354 56786 -113955 46488 -266664 -9523 75165 61696 -190338 14740
9826A95972B9613b79829k0432a08737j49210H7061d0885A32241a38129D2572R3107
9815A35679a21637N8543F8678b46988m8411J31658E495a53837A07005J2690C5818
9803C3873a247k13092B8752A2771b40183j35038a20516k02924O6182A15145c98706
9791c75672g664k21212D4924i285j46363C04249e8227K1844F7424g9408a0043
9779i8969l3829o3224B04565r678a28365p845B66865B6726a56907A3752a89177
9767B7476a65786D4417n418a70663D6579b39653d6473A64753a69062l0689p8020
9756b77771N5463f8852G0791b9992j61090g3911J5887p1911A074g877n7068o8666
9744a33611N8031o5201A60870G376J20741M2170a64194f2135H0162l9364d7064
$$ plain form
9826 195972 29613 -279829 -300261 -108737 -257947 87061 -40885 132241 -138129 42572 135679
9815 135679 -121637 -63094 68678 -246988 -295399 -163741 5495 -153837 107005 119695 35818
9803 33873 -1247 -214339 28752 12771 -240183 -375221 -120516 -323440 -257258 115145 -398706
9791 -375672 -7664 -228876 44924 -9285 -155648 304249 -58227 -36383 67424 -79408 -10043
9779 -98969 -132798 -196022 204565 194887 -128365 -136210 266865 26726 -156907 13752 -189177
9767 27476 -165786 44417 38999 -170663 46579 -239653 -46473 164753 -169062 -199751 -277771
9756 -277771 -222308 -68852 70791 -29992 -191082 -73911 -58024 -129935 1074 -7877 -64945 -133611
9744 -133611 -75580 -140781 160870 7376 128117 170287 -164194 -62135 80162 40798 -47064
9732F3210a28457F0772c17797A85536J61874i1360j19931R7182G108f3578m7433
9721a11011M9933l15848J36816A24488c340l4386k22587R1946A95278a35919P486
9710a28433m9880M7873E1866a83689j39917C5393a90683H1353c3361G4683j8068
9699E6615a09199p6447j852b4164H8242b41260O6396M0822B49372a28790j10240
9688b39030h0230j60571Q4920d7665A97528a67988e85E7525a34704K5524j36762
9677b45942O0044C1098a06134l6663j92930A22404L8695e2849F6603a98247r9625
9666b97872F4765B8765b15208B48389J04420E7434b73831R9109L41B780c58811
9654a20618k12211c9689j8243j45676A58138a37903j38832F0853J25933b8124
$$ plain form
9732 63210 -128457 60772 -317797 185536 347410 -91360 -211291 -114109 7108 -63578 -111011
9721 -111011 -61078 -376926 -240110 124488 -3340 -37726 -260313 -168367 195278 -135919 -128433
9710 -128433 -178313 -130440 51866 -183689 -323606 35393 -190683 81353 -33361 74683 56615
9699 56615 -109199 -185646 -187498 -24164 88242 -241260 -174864 -134042 249372 -128790 -239030
9688 -239030 -80230 -240801 -155881 -47665 197528 -167988 -585 57525 -134704 -109180 -245942
9677 -245942 -185898 31098 -106134 -142797 -335727 122404 161099 -52849 66603 -198247 -297872
9666 -297872 64765 28765 -215208 248389 352809 57434 -273831 -174722 -174381 2780 -358811
9654 -120618 -332829 -39689 -57932 -203608 158138 -137903 -276735 60853 186786 -28124
9643d1144o1001l12175d5008B30955g974q714l68117o844F7113c57899a59708
9631I3539d47761H4504f5829H991g9521j25845I7306I306a01373D80350c4792
9619c8398j59113A20671d74566b29763A15254g9948A27840b53745D1292b51340
9608f7485A01271m8813b5048A34625a92667A3478J1844a27534k4993E3725E412
9596D2487d21209A4411j37J65236J51475H8243b81744f5304C68004q4151a13820
9584c53724K1729a8535C0419J70488d2542l31828e5830j18492m8622N1427f7138
9572f8856j03581F1482j7797K17039a45974O528d1770B8438c09810F1137c56096
9560C3702J80674a58927F8833E930b68923J01861L2365b3827C7336Q7208F1703
$$ plain form
9643 -41144 -102145 -414320 -45008 230955 -7974 -16688 -384805 -391649 67113 -357899 -159708
9631 93539 -447761 84504 -65829 8991 -79521 -205366 97306 9306 -101373 480350 -34792
9619 -38398 -197511 120671 -474566 -229763 115254 -79948 127840 -253745 41292 -251340
9608 -67485 101271 52458 -25048 134625 -192667 13478 25322 -127534 -152527 53725 5412
9596 42487 -421209 14411 14274 179510 330985 88243 -281744 -65304 368004 283853 -113820
9584 -353724 -331995 -18535 30419 200907 -42542 -374370 -55830 -174322 -222944 -171517 -67138
9572 -68856 -172437 61482 43685 260724 -145974 -139446 -41770 28438 -309810 61137 -356096
9560 33702 214376 -158927 68833 5930 -268923 -167062 -134697 -23827 37336 124544 61703
9548g3989m0862q7571r7355e3526F2088f3185A07846J46482b4909j14270A82690
9536g796j52207b9351l30115F7097e6555A39659c34301j6062c1627k54848h8560
9524a35647j766N3632l4670J4459e1068B65116A07903a77133A64923d20143p4928
9513d95071f3395p3158E4749Q7964K7623F2869i6730j75713a26670B23107a14350
9501b13816a0372q8977k91154e2547K0578j7723k41271A60436b56323k8670A52246
9489f16o2314o4865j6113B9827N03038a71812i155o4407A47768A1653P0605l4302
9477D7956a17969p709a3521l2003f994j52600b6496A07048J23763a15944o4405
9466a80349A56716b50641B17977a59564r9851d5996J6158m05101c1274A02784
$$ plain form
9548 -73989 -114851 -202422 -299777 -53526 62088 -63185 107846 254328 -24909 -139179 182690
9536 -7796 -160003 -29351 -359466 67097 -56555 139659 -334301 -350363 -31627 -286475 -88560
9524 -135647 -137413 -83781 -118451 -103992 -51068 265116 107903 -177133 164923 -420143 -495071
9513 -495071 -63395 -136553 54749 142713 170336 62869 -96730 -272443 -126670 223107 -114350
9501 -213816 -10372 -99349 -390503 -52547 -31969 -49692 -290963 160436 -256323 -284993 152246
9489 -616 -62930 -127795 -143908 29827 532865 -171812 -9155 -73562 147768 11653 82258 47956
9477 47956 -117969 -125678 -13521 -45524 -6994 -159594 -26496 107048 230811 -115944 -180349
9466 -180349 156716 -250641 217977 -159564 -259415 -45996 -29838 -434939 -31274 102784
9455i2494k70247a05637E857J07676i2530j57052o1283J48464g2255r7272B8492
9443B14187M472G414a65449O6716j12798d8260A53934a48929M7151j88602Q6547
9432b03833K5388A99454e930m23917g9415k9265j66928G1998b52511a2499l94211
9421d06710Q1464J4622Q7308b4743c759j85667A51686c60941A03325b42175R3835
9410a48340L8139A42254c29831g6686C53118c7064J2815r486k72628C6074J3146
9399D9220b04442c7184p5798b1324k96706d6905H670a22777A927b55342B6027
9387a00484A33314a61635C31801c32510A62932a04393l093j2873d8114q0010K1106
9376a07018A37909b7854A80373R3660a52263B67835b49659A18686h9325j8628
$$ plain form
9455 -92494 -362741 -105637 5857 113533 -92530 -249582 -310865 -162401 -72255 -169527 28492
9443 214187 218659 7414 -165449 -98733 -211531 -48260 153934 -148929 -101778 -290380 -203833
9432 -203833 -178445 199454 -5930 -429847 -79415 -108680 -275608 71998 -252511 -12499 -406710
9421 -406710 -325246 -310624 -223316 -24743 -3759 -189426 151686 -360941 103325 -242175 -148340
9410 -148340 -110201 142254 -329831 -76686 353118 -37064 -24249 -33735 -306363 36074 49220
9399 49220 -204442 -37184 -112982 -21324 -318030 -46905 8670 -122777 1927 -255342 26027
9387 -100484 133314 -161635 331801 -332510 162932 -104393 -107486 -120359 -48114 -128124 -107018
9376 -107018 137909 -27854 180373 274033 -152263 267835 -249659 118686 -89325 -107953
9366a07953D093L7128J75255a19792A04139N7011b22466A05784b86283A28582
9355a36984m3445A64857g8266j32011E1979a79261E7117c15901A73201c17707
9344f0498A70695p9226a91538B2696N7571i2162l3861f0003J6232j32452C8556
9332e7817j17540p0473N6448c8663H512b479k24147J1134b2220C6890a51534P3406
9320g8128j7483B02786a49898B01898b76791E7846b26759L5958h8987j1693j11197
9309b11877A55482o0979K7610M9070h5225A81950d12324a8978G9799d8234m67414
9298e15648b47444O188k0057L1891n5118N0571A6284c49925h8779A39400A4166
9286a37829k79725J97011c8800A45643d8238n9339b5094B56618D5432K2478J29101
$$ plain form
9366 -107953 4093 41221 216476 -119792 104139 161150 -222466 105784 -286283 128582
9355 -136984 -180429 164857 -78266 -210277 51979 -179261 57117 -315901 173201 -317707
9344 -60498 170695 91469 -191538 22696 80267 -92162 -126023 -60003 -43771 -176223 38556
9332 -57817 -175357 -245830 -189382 -38663 8512 -2479 -226626 -215492 -22220 36890 -151534 -78128
9320 -78128 -95611 202786 -149898 201898 -276791 57846 -226759 -190801 -88987 -100680 -211877
9309 -211877 155482 94503 122113 171183 -85225 181950 -412324 -18978 79799 -48234 -515648
9298 -515648 -247444 -241256 -261313 -229422 -284540 -233969 16284 -349925 -88779 139400 14166
9286 -137829 -417554 -220543 -38800 145643 -48238 -107577 -25094 256618 45432 67910 197011
9275A97011J0663a48414K8023N3817C8677a38752A59173a55103G4984a76776j15536
9264b92312a00324k89286J87103A35762N7990a92149i2400A0630e9826k56358
9254c16184B4844J03187C9434J58626j1668h4028E7288c02633d852j55050N4871
9243a05031o8395j04812J17583F8916h9055j9170A07504c6875R883n6262G8914
9231a18165M2461l31054B02793a45547p2348d5737G872J05666e3169j75298e7509
9219c9408E948a8947F397c1964A38856c2028B67809a3562k06456m6188a29658
9207C6316a03091b2497j71839a4801k72576J9105J12319d1608j43163B3425b73124
9195i0593o9669i119B2362e1150j63802a01064A2014a47070B5747J66384a45668
$$ plain form
9275 197011 207674 -148414 -120391 -66574 38677 -138752 159173 -155103 74984 -176776 -292312
9264 -292312 -100324 -389610 -202507 135762 193752 -192149 -92400 10630 -59826 -316184
9254 -316184 24844 128031 39434 198060 186392 -84028 57288 -302633 -4852 -159902 -105031
9243 -105031 -173426 -278238 -160655 68916 -89055 -108225 107504 -36875 -26992 -83254 78914
9231 -118165 -75704 -406758 202793 -145547 -217895 -45737 7872 113538 -53169 -228467 -57509
9219 -39408 5948 -18947 6397 -31964 138856 -32028 267809 -13562 -220018 -266206 -129658
9207 36316 -103091 -22497 -194336 -14801 -287377 -268272 -155953 -41608 -184771 23425 -273124
9195 -90593 -160262 -9119 22362 -51150 -214952 -101064 12014 -147070 25747 192131 -145668
9183h4083I7795b29373i515G033a72402j6773B60698b62113J06973j6345B7676
9171C9858h4606A0068c42551H2446c18486a11119G8203R763a42021A60225c99857
9159H96g9259j46845i3392d3551r6239A3216a04490A53758a71361b0097k71315
9148b91412C724a66703A40693E5802e5225p8700d9697A09310h8178p3137g8123
9136a05152E8299c07979E6069c331k28819A09151i6144q9990A11902c06577J40439
9125a66138J071c237G4268d21A15617J3919a82249j31508c3958q3086j20565A78826
9112B63021f1600A71297E3553a90782d9816k66198B18b16699R7733B18817b80357
9100f0969j36970j022N2180k32671C2430a82025a6176p9303C2198L401J03259
$$ plain form
9183 -84083 97795 -229373 -9515 7033 -172402 -189175 260698 -262113 -155140 -171485 27676
9171 39858 -84606 10068 -342551 82446 -318486 -111119 78203 87966 -142021 160225 -399857
9159 896 -79259 -226104 -93392 -43551 -139790 13216 -104490 153758 -171361 -20097 -291412
9148 -291412 3724 -166703 140693 55802 -55225 -133925 -49697 109310 -88178 -161315 -78123
9136 -105152 58299 -307979 56069 -3331 -232150 109151 -96144 -186134 111902 -306577 -166138
9125 -166138 -165067 -3237 74268 -421 115617 129536 -182249 -313757 -33958 -117044 -237609 178826
9112 263021 -61600 171297 53553 -190782 -49816 -316014 218 -216699 -118966 218817 -280357
9100 -60969 -197939 -198961 -146781 -379452 32430 -182025 -16176 -95479 32198 35599 138858
9089A38858C3908b80847a26968N064e605G8493d97j41350A95142g617C611J57291
9077A60902h3002j56630A54213o1796a78643Q0153G710K80942A15627b89412a02008
9065A89522d0884Q361l65254A24814b87456k3060B13555D3351b23153J11173k68523
9054c80503B15926K1374q3222l0946a19582K3753j98818A38454a15765a0486G5982
9042c17175a50760F6645a59626F9009a934k83221b6478k61729P7143G6152a86377
9030c33906a51344j31180J06843f9734j36838D231a09347l5819P1075j51544E7979
9018a32430m6833A39081O2708a13715q6586K0343k12965R4941A39260a60495k70752
9007d31247a41191M5689b3029n5257j19655c5201l361M680j06558B05060b68991
$$ plain form
9089 138858 33908 -280847 -126968 -121904 -5605 78493 -497 -141847 195142 -7617 3611 160902
9077 160902 -83002 -239632 154213 92417 -178643 -98490 7710 288652 115627 -289412 -102008
9065 189522 -40884 -32523 -397777 124814 -287456 -310516 213555 43351 -223153 -111980 -380503
9054 -380503 215926 237300 154078 123132 -119582 -95829 -294647 138454 -115765 -10486 75982
9042 -317175 -150760 66645 -159626 69009 -1934 -285155 -26478 -288207 -211064 76152 -186377
9030 -333906 -151344 -282524 -175681 -69734 -206572 4231 -109347 -145166 -74091 -225635 57979
9018 -132430 -179263 139081 201789 -113715 -200301 -179958 -392923 -297982 139260 -160495 -431247
9007 -431247 -141191 -95502 -23029 -78286 -197941 -35201 -38562 -33882 -140440 205060 -268991
8995a34816A17758a43967N4633c2857A67832a03948i055A16197j2548O9854c708
8983B00710n2000b06032l0577R2720c9690q9336j85653A2597a81255P0902p9306
8972a89659G0598d48237A30596l5403g6425j09661f2315l98569C7734J2580c05649
8960h7637L8568r6935B59356b04559d6776p7294j75908H1500O6048F9339N2377
8949A21716e2529b0497q5761C18556B8520b35866h0757q542L1772B24677d8768
8937A81184a38000f6780j81032C0876b32355B24386A8214J93444b6259E6249c69614
8925e8538A34031D3850e8653n7271J3591p1558A88589G0502N0256Q4067J35986
8914C40811K01638a11329D3952K13438H9383M64227r7777J83886M71845R00217
$$ plain form
8995 -134816 117758 -143967 -89334 -32857 167832 -103948 -9055 116197 103649 173503 -3708
8983 200710 148710 -206032 -236609 -143889 -39690 -129026 -314679 12597 -181255 -110353 -189659
8972 -189659 70598 -448237 130596 95193 -76425 -186086 -62315 -460884 37734 50314 -305649
8960 -87637 -49069 -146004 259356 -204559 -46776 -124070 -299978 81500 147548 69339 121716
8949 121716 -52529 -20497 -106258 318556 28520 -235866 -80757 -89299 -57527 224677 -48768
8937 181184 -138000 -66780 -247812 30876 -232355 224386 18214 211658 -26259 56249 -369614
8925 -58538 134031 43850 -58653 -115924 -102333 -173891 188589 70502 120758 204825 340811
8914 340811 542449 -111329 43952 257390 89383 553610 455833 639719 1111564 2011781
8904B011781K050477M608756m070439j875101j196247G55086j99288j84823k3711
8895C47264A67608J52549A07395h8063j12270B84320b6129A98100p676j3307B9682
8883a0815I944a76831P3113K6136J2739k48707C348R8871b8631A4747R4817k6596
8871H2968c91318a72358A41802e7271B67137e0269B344a06044m910d008I2012
8859B35196j4426e0062l10877H4179K39674b76755f3366o6403e3004j43575A26044
8847b07311j43705f7847F4385e09929a32340M7157c6218B23315b21191A63424
$$ plain form
8904 2011781 4062258 8671014 4600575 2725474 1529227 755086 555798 370975 347264
8895 347264 167608 320157 107395 -88063 -200333 284320 -26129 198100 190424 177117 29682
8883 -10815 9944 -176831 -103718 -77582 -64843 -313550 3348 102219 -28631 14747 109564 82968
8871 82968 -391318 -172358 141802 -57271 267137 -50269 2344 -106044 -110954 -4008 92012
8859 235196 220770 -50062 -360939 84179 323853 -276755 -63366 -129769 -53004 -196579 126044
8847 -207311 -351016 -67847 64385 -509929 -132340 -85183 -36218 223315 -221191 163424
$$ [...]
##END NTUPLES=NMR SPECTRUM
##END=
