
##TITLE=AC1071_TOPL04_5835268_LkaQr7E7HN
##JCAMPDX= 6.0         $$ Bruker NMR JCAMP-DX V2.0
##DATA TYPE= NMR SPECTRUM
##DATA CLASS= NTUPLES
##ORIGIN= BRUKER
##OWNER= Administrator
$$ 1.72 TOPSPIN		Version 2.1
$$ 2012-03-28 11:07:40.968 -0500  Administrator@TOPSPIN
$$ Compression mode = diff/dup
##.OBSERVE FREQUENCY= 400.13188235
##.OBSERVE NUCLEUS= ^1H
##.ACQUISITION MODE= SIMULTANEOUS (DQD)
##.ACQUISITION SCHEME= undefined
##.AVERAGES= 64
##.DIGITISER RES= 22
##SPECTROMETER/DATA SYSTEM= spect
##.PULSE SEQUENCE= noesygpps1d.comp
##.SOLVENT NAME= COFFEE_meoh
##.SHIFT REFERENCE= INTERNAL, COFFEE_meoh, 1, 14.96848
##AUDIT TRAIL= $$ (NUMBER, WHEN, WHO, WHERE, PROCESS, VERSION, WHAT)
$$ ##TITLE= Audit trail, TOPSPIN		Version 2.1
$$ ##JCAMPDX= 5.01
$$ ##ORIGIN= Bruker BioSpin GmbH
$$ ##OWNER= Administrator
$$ $$ C:\Bruker\TOPSPIN/data/COFFEE/nmr/AC1071_TOPL04_5835268_LkaQr7E7HN/22/pdata/1/auditp.txt
$$ ##AUDIT TRAIL=  $$ (NUMBER, WHEN, WHO, WHERE, PROCESS, VERSION, WHAT)
(   1,<2012-03-28 02:56:08.984 -0500>,<Administrator>,<TOPSPIN>,<go>,<TOPSPIN 2.1>,
      <created by zg
	started at 2012-03-28 02:44:37.062 -0500,
	POWCHK enabled, PULCHK disabled,
       configuration hash MD5:
       1A 1E CE 29 27 FD 77 03 67 4E F0 E3 C4 B2 CB 90
       data hash MD5: 64K
       C0 43 21 1C 23 A8 BF FD 5A CB 78 6A 2C 38 4D D3>)
(   2,<2012-03-28 02:56:14.140 -0500>,<Administrator>,<TOPSPIN>,<proc1d>,<TOPSPIN 2.1>,
      <Start of raw data processing
       efp LB = 0.3 FT_mod = 6 PKNL = 1 PHC0 = 0 PHC1 = 0 SI = 128K 
       data hash MD5: 128K
       1E 5F 0F F3 C9 60 35 33 F1 F8 52 CF 20 B2 08 A5>)
(   3,<2012-03-28 02:56:15.468 -0500>,<Administrator>,<TOPSPIN>,<proc1d>,<TOPSPIN 2.1>,
      <pk PHC0 = 36.08459 PHC1 = 0 
       data hash MD5: 128K
       5F F7 05 E7 40 25 77 F2 A0 6D 7B 11 10 1E ED 8C>)
(   4,<2012-03-28 02:56:16.062 -0500>,<Administrator>,<TOPSPIN>,<proc1d>,<TOPSPIN 2.1>,
      <abs ABSG = 1 
       data hash MD5: 128K
       40 2E E0 A5 1B F0 59 7B 8B 8C DA 60 41 A6 BA 48>)
(   5,<2012-03-28 02:56:16.171 -0500>,<Administrator>,<TOPSPIN>,<proc1d>,<TOPSPIN 2.1>,
      <abs ABSG = 2 
       data hash MD5: 128K
       D3 EF 3D 04 81 2E DF 27 E2 4C 7F 05 DF 37 C5 02>)
(   6,<2012-03-28 02:56:16.265 -0500>,<Administrator>,<TOPSPIN>,<proc1d>,<TOPSPIN 2.1>,
      <abs ABSG = 3 
       data hash MD5: 128K
       91 C5 F3 3F B9 CC 07 EA 3E 99 6B D3 91 A5 EF 79>)
(   7,<2012-03-28 02:56:16.343 -0500>,<Administrator>,<TOPSPIN>,<proc1d>,<TOPSPIN 2.1>,
      <abs ABSG = 4 
       data hash MD5: 128K
       1F 0F 11 96 01 38 0B 35 7E 1B B2 90 E3 D0 62 18>)
(   8,<2012-03-28 02:56:16.406 -0500>,<Administrator>,<TOPSPIN>,<proc1d>,<TOPSPIN 2.1>,
      <abs ABSG = 5 
       data hash MD5: 128K
       BB 66 6B 8E E6 7A AB EE 45 77 76 55 27 7C A1 59>)
(   9,<2012-03-28 02:56:17.140 -0500>,<Administrator>,<TOPSPIN>,<audit>,<TOPSPIN 2.1>,
      <user comment:
       ICON-NMR User ID: COFFEE
       data hash MD5: 128K
$$ [...]
150 150 150 150 150 150 150 150
##$TP07= 0
##$TPNAME0= <>
##$TPNAME1= <>
##$TPNAME2= <>
##$TPNAME3= <>
##$TPNAME4= <>
##$TPNAME5= <>
##$TPNAME6= <>
##$TPNAME7= <>
##$TPOAL= (0..7)
0.5 0.5 0.5 0.5 0.5 0.5 0.5 0.5
##$TPOFFS= (0..7)
0 0 0 0 0 0 0 0
##$TUNHIN= 0
##$TUNHOUT= 0
##$TUNXOUT= 0
##$USERA1= <user>
##$USERA2= <user>
##$USERA3= <user>
##$USERA4= <user>
##$USERA5= <user>
##$V9= 5
##$VALIST= <valist>
##$VCLIST= <CCCCCCCCCCCCCCC>
##$VD= 0
##$VDLIST= <DDDDDDDDDDDDDDD>
##$VPLIST= <PPPPPPPPPPPPPPP>
##$VTLIST= <TTTTTTTTTTTTTTT>
##$WBST= 2048
##$WBSW= 25
##$XGAIN= (0..3)
0 0 0 0
##$XL= 0
##$YL= 0
##$YMAX_a= 17907418
##$YMIN_a= -8497377
##$ZGOPTNS= <>
##$ZL1= 120
##$ZL2= 120
##$ZL3= 120
##$ZL4= 120
##$ABSF1= 14.96848
##$ABSF2= -5.58405
##$ABSG= 5
##$ABSL= 3
##$ALPHA= 0
##$AQORDER= 0
##$ASSFAC= 0
##$ASSFACI= 0
##$ASSFACX= 0
##$ASSWID= 0
##$AUNMP= <proc_prof1d_extract.lims>
##$AXLEFT= 0
##$AXNAME= <>
##$AXNUC= <1H>
##$AXRIGHT= 0
##$AXTYPE= 0
##$AXUNIT= <>
##$AZFE= 0.1
##$AZFW= 0.1
##$BCFW= 0
##$BC_mod= 0
##$BYTORDP= 0
##$COROFFS= 0
##$CY= 15
##$DATMOD= 1
##$DC= 0
##$DFILT= <>
##$DTYPP= 0
##$F1P= 0
##$F2P= 0
##$FCOR= 0.5
##$FTSIZE= 131072
##$FT_mod= 6
##$GAMMA= 0
##$GB= 0
##$INTBC= 1
##$INTSCL= 1
##$ISEN= 128
##$LB= 0.3
##$LEV0= 0
##$LPBIN= 0
##$MAXI= 10000
##$MC2= 0
##$MEAN= 0
##$ME_mod= 0
##$MI= 0
##$NCOEF= 0
##$NC_proc= -2
##$NLEV= 6
##$NOISF1= 0
##$NOISF2= 0
##$NSP= 0
##$NTH_PI= 0
##$NZP= 0
##$OFFSET= 14.96848
##$PC= 1
##$PHC0= 36.08459
##$PHC1= 0
##$PH_mod= 1
##$PKNL= yes
##$PPARMOD= 0
##$PPDIAG= 0
##$PPIPTYP= 0
##$PPMPNUM= 2147483647
##$PPRESOL= 1
##$PSCAL= 4
##$PSIGN= 0
##$PYNMP= <proc.py>
##$REVERSE= no
##$SF= 400.130004852801
##$SI= 131072
##$SIGF1= 0
##$SIGF2= 0
##$SINO= 400
##$SIOLD= 131072
##$SPECTYP= <>
##$SREGLST= <1H.CDCl3>
##$SSB= 0
##$STSI= 131072
##$STSR= 0
##$SW_p= 8223.68421052632
##$SYMM= 0
##$S_DEV= 0
##$TDeff= 65536
##$TDoff= 0
##$TI= <>
##$TILT= no
##$TM1= 0
##$TM2= 0
##$TOPLEV= 0
##$USERP1= <user>
##$USERP2= <user>
##$USERP3= <user>
##$USERP4= <user>
##$USERP5= <user>
##$WDW= 1
##$XDIM= 131072
##$YMAX_p= 322179287
##$YMIN_p= -11291
##$CURPLOT= <Network HP LaserJet P1505>
##$CURPRIN= <$Network HP LaserJet P1505>
##$DFORMAT= <normdp>
##$LAYOUT= <+/1D_H.xwp>
##$LFORMAT= <normlp>
##$PFORMAT= <normpl>
##$SURQMSG= 1
$$ End of Bruker specific parameters
$$ ---------------------------------
##NTUPLES= NMR SPECTRUM
##VAR_NAME=  FREQUENCY,     SPECTRUM/REAL,   SPECTRUM/IMAG
##SYMBOL=    X,             R,               I
##VAR_TYPE=  INDEPENDENT,   DEPENDENT,       DEPENDENT
##VAR_FORM=  AFFN,          ASDF,            ASDF
##VAR_DIM=   131072,        131072,          131072
##UNITS=     HZ,            ARBITRARY UNITS, ARBITRARY UNITS
##FACTOR=    0.0627417313425165, 1,          1
##FIRST=     8223.62146879498, 3066,         -59307
##LAST=      0,             3907,            -59135
##MIN=       0,             -11291,          0
##MAX=       8223.62146879498, 322179287,    0
$$ Real data points
##PAGE= N=1
##DATA TABLE= (X++(R..R)), XYDATA
$$ [...]
$$ plain form
60912 16325709 18087018 19842044 21386962 22540087 23239402 23558332 23637282 23609310 23579092
60903 23579092 23629153 23795069 24013935 24116331 23903410 23257321 22193053 20821304 19275468
60894 19275468 17666429 16075642 14559676 13151237 11863134 10698025 9655144 8730074
60886 8730074 7914300 7198303 6573297 6029020 5552753 5132566 4760143 4429381 4133982
60877 4133982 3867801 3626291 3406289 3205169 3020967 2852336 2697675 2555096 2423538
60868 2423538 2302717 2191474 2087376 1988530 1894676 1805988 1722039 1642564 1567965 1498197 1432282
60857 1432282 1369736 1311380 1257790 1208021 1160934 1116909 1077028 1041208 1008253 977310 948315
60846 948315 921307 896258 873352 852659 833734 816082 799742 784868 771109 758031 745892
$$ packed form
60912A6325709J761309J755026J544918J153125O99315L18930P8950k7972l0218
60903B3579092N0061J65916K18866J02396k12921o46089j064268j371749j545836
60894A9275468j609039j590787j515966j408439j288103j165109j042881r25070
60886H730074q15774p15997o25006n44277m76267m20187l72423l30762k95399
60877D133982k66181k41510k20002k01120j84202j68631j54661j42579j31558
60868B423538j20821j11243j04098r8846r3854q8688q3949p9475p4599o9768o5915
60857A432282o2546n8356n3590m9769m7087m4025l9881l5820l2955l0943k8995
60846I48315k7008k5049k2906k0693j8925j7652j6340j4874j3759j3078j2139
$$ plain form
60835 745892 735307 726312 718311 710854 703977 697884 692660 688286 684724 682012 680336 679815 680202 681142 682654
60820 682654 684889 687348 688993 689335 688870 688185 687217 685617 683237 679890 675206 669184 662417 655449 648368
60805 648368 641391 635191 630091 625385 620080 614073 608121 602957 598903 596164 594961 595380 597251 600097
60791 600097 603233 606300 609821 614816 621660 629757 638503 648055 658874 671006 684104 697664 710871
60778 710871 722759 733029 742425 751926 761873 772130 782575 792977 802810 811613 819272 825636 830360
60765 830360 833510 835816 837816 839252 839871 840287 841263 842518 843094 842734 842041 841319 840101 838038 835456 832637
60749 832637 829011 823576 815950 806749 796958 787081 776898 765957 754288 742562 731568 721699 712983
60736 712983 705374 698784 692991 687730 682854 678348 674357 671324 669850 670180 671990 674885 678943 684470
$$ packed form
60835G45892j0585q995q001p457o877o093n224m374l562k712j676n21L87R40J512
60820F82654K235K459J645L42m65o85r68j600k380l347m684o022o767o968p081
60805F48368o977o200n100m706n305o007n952n164m054k739j203M19J871K846
60791F00097L136L067L521M995O844Q097Q746R552J0819J2132J3098J3560J3207
60778G10871J1888J0270R396R501R947J0257J0445J0402R833Q803P659O364M724
60765H30360L150K306K000J436O19M16R76J255N76l60o93p22j218k063k582k819
60749H32637l626n435p626r201r791r877j0183j0941j1669j1726j0994r869q716
60736G12983p609o590n793n261m876m506l991l033j474L30J810K895M058N527
$$ plain form
60722 684470 691328 698794 706224 713702 721927 731416 741868 752395 762442 772276 782413 792779 802779
60709 802779 812107 821031 829873 838658 847373 856136 864876 873177 880665 887328 893326 898743 903652 908195
60695 908195 912493 916735 921324 926538 931968 936747 940501 943651 946652 949393 951573 953098 953781 953185 951212
60680 951212 948444 945447 942141 938343 934536 931341 928416 924610 919308 913064 906732 900487 893991 887164
60666 887164 880403 874043 867916 861583 854966 848642 843419 839627 836912 834626 832364 830174 828362 827064
60652 827064 825865 823955 820848 816791 812321 807663 802850 798119 793628 789034 784020 779166 775518 773209
60638 773209 771293 769234 767743 767734 769132 771250 773717 776325 778390 779036 777987 775496 771669 766337 759532
60623 759532 751561 742649 732892 722533 711916 701101 689862 678130 666302 655102 645164 636661
$$ packed form
60722F84470O858P466P430P478Q225R489J0452J0527J0047R834J0137J0366J0000
60709H02779R328Q924Q842Q785Q715Q763Q740Q301P488O663N998N417M909M543
60695I08195M298M242M589N214N430M779L754L150L001K741K180J525O83n96j973
60680I51212k768k997l306l798l807l195k925l806n302o244o332o245o496o827
60666H87164o761o360o127o333o617o324n223l792k715k286k262k190j812j298
60652H27064j199j910l107m057m470m658m813m731m491m594n014m854l648k309
60638G73209j916k059j491rJ398K118K467K608K065O46j049k491l827n332o805
60623G59532p971q912r757j0359j0617j0815j1239j1732j1828j1200r938q503
$$ plain form
60611 636661 629299 622825 617479 613677 611272 609597 608367 608025 608907 610573 612400 614363 616677 618967 620482
60596 620482 621089 621571 622843 625166 628081 630852 633007 634700 636546 639006 642051 645435 648993 652491 655582
60581 655582 658240 660984 664288 667984 671524 674692 677763 681235 685627 691247 697822 704683 711687 719644
60567 719644 729270 740089 750982 761761 773437 786870 801673 816689 831077 844737 857960 870926
60555 870926 883397 894714 904159 911376 916465 919777 921689 922414 921828 919618 915759 910712 904951 898446
60541 898446 890848 881985 871930 860744 848580 836006 823857 812653 802333 792610 783415 775022
60529 775022 767872 762303 758299 755522 753605 752357 751698 751555 751904 752710 753764 754799 755807 756929 757973
60514 757973 758404 758015 757243 756613 756322 756652 758267 761512 765756 770031 774132 778519 783222 787502 790657 792632
$$ packed form
60611F36661p362o474n346l802k405j675j230l42Q82J666J827J963K314K290J515
60596F20482O07M82J272K323K915K771K155J693J846K460L045L384L558L498L091
60581F55582K658K744L304L696L540L168L071L472M392N620O575O861P004P957
60567G19644R626J0819J0893J0779J1676J3433J4803J5016J4388J3660J3223J2966
60555H70926J2471J1317R445P217N089L312J912P25n86k210l859n047n761o505
60541H98446p598q863j0055j1186j2164j2574j2149j1204j0320r723r195q393
60529G75022p150n569m004k777j917j248o59j43L49Q06J054J035J008J122J044
60514G57973M31l89p72o30k91L30J615L245M244M275M101M387M703M280L155J975
$$ plain form
60498 792632 793715 794120 794091 794066 794492 795573 797216 799002 800278 800643 800521 800982 802937 806706 812477 820788
60482 820788 832137 846227 862033 878826 896934 917162 939549 963036 986421 1009143 1030689
60471 1030689 1049643 1064091 1073008 1076696 1075758 1070341 1060710 1047998 1033877 1019799 1006928 996370
60459 996370 988894 984520 982849 983739 987406 994031 1003530 1015545 1029379 1044166 1059444 1075457 1092684
60446 1092684 1111351 1131699 1154402 1180281 1209817 1243348 1281607 1325601 1376110 1433640 1498745
60435 1498745 1571934 1653417 1743465 1842977 1953141 2074397 2206148 2347660 2498998 2660980
60425 2660980 2834488 3019872 3216465 3421688 3629779 3831033 4012679 4161402 4265934
60416 4265934 4318166 4313225 4250127 4133028 3971073 3776083 3559946 3333493 3106123 2884991
$$ packed form
60498G92632J083M05k9k5M26J081J643J786J276L65j22M61J955L769N771Q311
60482H20788J1349J4090J5806J6793J8108K0228K2387K3487K3385K2722K1546
60471A030689J8954J4448Q917L688r38n417r631j2712j4121j4078j2871j0558
60459I96370p476m374j671Q90L667O625R499J2015J3834J4787J5278J6013J7227
60446A092684J8667K0348K2703K5879K9536L3531L8259M3994N0509N7530O5105
60435A498745P3189Q1483R0048R9512J10164J21256J31751J41512J51338J61982
60425B660980J73508J85384J96593K05223K08091K01254J81646J48723J04532
60416D265934N2232m941o3098j17099j61955j94990k16137k26453k27370k21132
$$ plain form
60406 2884991 2674405 2476582 2292985 2124728 1972230 1835225 1712966 1603939 1505758 1416189
60396 1416189 1334343 1260364 1194153 1135008 1082256 1035405 993598 955700 921138 890001 862127
60385 862127 836708 813123 791558 772374 755207 739116 723456 708346 694316 681650 669994
60374 669994 658599 647085 635882 625735 616847 608770 601087 593882 587571 582503 578697 575749 573066
60361 573066 570425 568123 566383 564838 563022 561126 559799 559330 559585 560607 562668 565662 569079 572720 576861
60346 576861 581489 585929 589581 592617 595536 598339 600555 602033 603321 605247 608225 612084 616449 621158
60332 621158 626160 631067 635197 638252 640672 643048 645436 647566 649408 651017 651988 651647 649893 647408 645012
60317 645012 643085 641591 640220 638502 636191 633629 631422 629739 628260 626855 625920 625932 626964 628730 630900
$$ packed form
60406B884991k10586j97823j83597j68257j52498j37005j22259j09027r8181q9569
60396A416189q1846p3979o6211n9145n2752m6851m1807l7898l4562l1137k7874
60385H62127k5419k3585k1565j9184j7167j6091j5660j5110j4030j2666j1656
60374F69994j1395j1514j1203j0147q888q077p683p205o311n068l806k948k683
60361E73066k641k302j740j545j816j896j327m69K55J022K061K994L417L641M141
60346E76861M628M440L652L036K919K803K216J478J288J926K978L859M365M709
60332F21158N002M907M130L055K420K376K388K130J842J609R71l41j754k485k396
60317F45012j927j494j371j718k311k562k207j683j479j405r35J2J032J766K170
$$ plain form
60302 630900 633349 636265 639966 644372 648817 652709 656233 660061 664527 669515 674987 681004 687260 693197
60288 693197 698796 704695 711303 718214 724698 730424 735418 739615 742767 744724 745638 745942 746132 746399 746438 745802
60272 745802 744488 743126 742553 743169 744562 745787 746343 746869 748410 750909 753110 754319 755418 757353 759316
60257 759316 759509 757385 754017 750451 746862 743398 740607 738616 736902 735334 734558 734815 735194 734720 733569
60242 733569 732578 732119 732114 732690 734055 735989 738048 740117 742257 744237 745792 747212 749125 751732 754719 757928
60226 757928 761627 766005 770803 775649 780463 785335 790188 794893 799651 804922 810840 816969 822894 828867
60212 828867 835453 842645 849902 857139 865130 874589 885445 897378 910543 925172 940978 957731 976050
60199 976050 996826 1020002 1044867 1071527 1101172 1134634 1171455 1210665 1251953 1295809 1343035
$$ packed form
60302F30900K449K916L701M406M445L892L524L828M466M988N472O017O256N937
60288F93197N599N899O608O911O484N726M994M197L152J957R14L04J90K67L9o36
60272G45802j314j362n73O16J393J225N56N26J541K499K201J209J099J935J963
60257G59316J93k124l368l566l589l464k791j991j714j568p76K57L79m74j151
60242G33569r91m59nN76J365J934K059K069K140J980J555J420J913K607K987L209
60226G57928L699M378M798M846M814M872M853M705M758N271N918O129N925N973
60212H28867O586P192P257P237P991R459J0856J1933J3165J4629J5806J6753J8319
60199I76050K0776K3176K4865K6660K9645L3462L6821L9210M1288M3856M7226
$$ plain form
60188 1343035 1394410 1450454 1511245 1576677 1646933 1722384 1803042 1888391 1977609 2069622 2163214
60177 2163214 2257658 2352962 2448741 2542970 2632674 2715846 2791970 2860760 2921379 2973000 3015207
60166 3015207 3047559 3069671 3082092 3086296 3083472 3074047 3058722 3039163 3017247 2994388 2971982 2951750
60154 2951750 2935072 2922618 2915069 2913583 2919132 2932196 2953539 2984442 3025444 3075571 3133518 3198933
60142 3198933 3271829 3351347 3435970 3524345 3614959 3705391 3792819 3875145 3950836 4017929 4074086
60131 4074086 4117653 4148111 4165504 4169983 4161777 4141101 4108204 4064040 4010803 3951354 3888156 3823144
60119 3823144 3758335 3696009 3638359 3587383 3544935 3512386 3490231 3478469 3477304 3487193 3508293 3540166
60107 3540166 3581918 3632290 3689682 3752260 3817952 3884337 3948931 4009895 4066092 4116243 4158496
$$ packed form
60188A343035N1375N6044O0791O5432P0256P5451Q0658Q5349Q9218R2013R3592
60177B163214R4444R5304R5779R4229Q9704Q3172P6124O8790O0619N1621M2207
60166C015207L2352K2112J2421M204k824r425j5325j9559k1916k2859k2406k0232
60154B951750j6678j2454p549j486N549J3064K1343L0903M1002N0127N7947O5415
60142C198933P2896P9518Q4623Q8375R0614R0432Q7428Q2326P5691O7093N6157
60131D074086M3567L0458J7393M479q206k0676l2897m4164n3237n9449o3198o5012
60119C823144o4809o2326n7650n0976m2448l2549k2155j1762j165R889K1100L1873
60107C540166M1752N0372N7392O2578O5692O6385O4594O0964N6197N0151M2253
$$ plain form
60096 4158496 4191269 4214250 4228207 4234181 4233319 4227241 4218067 4208141 4199846 4195319 4196049 4203014 4217498
60083 4217498 4241445 4276847 4325240 4387908 4465890 4559369 4667805 4791309 4931326 5089378
60073 5089378 5265696 5459767 5671552 5901168 6147692 6409183 6683579 6968617 7260955
60064 7260955 7556281 7850257 8138651 8416633 8678803 8920119 9136345 9323734 9479055
60055 9479055 9600007 9684950 9732018 9739031 9704510 9628573 9513048 9361312 9178071 8968841
60045 8968841 8739518 8496519 8246757 7996685 7751413 7515264 7292857 7088760 6906081
60036 6906081 6746199 6610008 6498654 6412890 6352429 6316277 6303127 6311111 6337621 6379656 6434021
60025 6434021 6496965 6563990 6630360 6691721 6744400 6785572 6813343 6826416 6823660 6804282 6768375
$$ packed form
60096D158496L2773K2981J3957N974q62o078r174r926q295m527P30O965J4484
60083D217498K3947L5402M8393O2668P7982R3479J08436J23504J40017J58052
60073E089378J76318J94071K11785K29616K46524K61491K74396K85038K92338
60064G260955K95326K93976K88394K77982K62170K41316K16226J87389J55321
60055I479055J20952Q4943M7068P013l4521p5937j15525j51736j83241k09230
60045H968841k29323k42999k49762k50072k45272k36149k22407k04097j82679
60036F906081j59882j36191j11354q5764o0461l6152j3150P984K6510M2035N4365
60025F434021O2944O7025O6370O1361N2679M1172K7771J3073k756j9378l5907
$$ plain form
60014 6768375 6716862 6650826 6571252 6479422 6377027 6265643 6146355 6020045 5887869 5751502
60004 5751502 5613239 5475874 5342150 5214221 5093735 4982222 4881012 4790872 4712223 4645762
59994 4645762 4592556 4553523 4529103 4519296 4523583 4540893 4570191 4611124 4663670 4727057 4799425 4878482
59982 4878482 4961843 5046574 5129061 5205823 5274279 5332529 5378733 5410972 5427581 5427422 5409993 5375466
59970 5375466 5324621 5258772 5179790 5090042 4992053 4888270 4781393 4674706 4571633 4474773
59960 4474773 4385578 4304910 4233659 4172840 4123447 4086283 4061747 4049763 4050167 4063166 4089263 4128808
59948 4128808 4181752 4247738 4326187 4416433 4517964 4630341 4752494 4882126 5015968 5150404
59938 5150404 5281644 5405675 5518667 5617511 5699830 5763786 5808361 5833544 5839689 5826665 5794051
$$ packed form
60014F768375n1513o6036p9574r1830j02395j11384j19288j26310j32176j36367
60004E751502j38263j37365j33724j27929j20486j11513j01210r0140p8649o6461
59994D645762n3206l9033k4420r807M287J7310K9298M0933N2546O3387P2368P9057
59982D878482Q3361Q4731Q2487P6762O8456N8250M6204L2239J6609j59j7429l4527
59970E375466n0845o5849p8982q9748r7989j03783j06877j06687j03073r6860
59960D474773q9195q0668p1251o0819m9393l7164k4536j1984M04J2999K6097L9545
59948D128808N2944O5986P8449R0246J01531J12377J22153J29632J33842J34436
59938E150404J31240J24031J12992R8844Q2319O3956M4575K5183O145j3024l2614
$$ plain form
59927 5794051 5742109 5672251 5586844 5489040 5382706 5271896 5160309 5051384 4948561 4854823
59917 4854823 4772096 4701582 4644464 4601743 4573662 4560056 4561138 4577176 4607477 4650520 4705077
59906 4705077 4770361 4844959 4926575 5013132 5103325 5195671 5287794 5377150 5461910 5540741 5612383
59895 5612383 5676081 5732029 5780882 5823128 5859377 5890886 5919388 5946701 5974982 6007038 6045910
59884 6045910 6094252 6154448 6229025 6320425 6430529 6560815 6712874 6888263 7087787 7311276
59874 7311276 7558010 7826869 8115643 8420243 8734695 9051796 9363541 9660905 9933489
59865 9933489 10169937 10359335 10492848 10564764 10572746 10517541 10402480 10233083 10016980 9763716
59855 9763716 9483765 9187102 8882593 8578438 8282268 8000198 7736133 7492645 7272221
$$ packed form
59927E794051n1942o9858q5407r7804j06334j10810j11587j08925j02823r3738
59917D854823q2727p0514n7118m2721k8081j3606J082J6038L0301M3043N4557
59906D705077O5284P4598Q1616Q6557R0193R2346R2123Q9356Q4760P8831P1642
59895E612383O3698N5948M8853M2246L6249L1509K8502K7313K8281L2056L8872
59884F045910M8342O0196P4577R1400J10104J30286J52059J75389J99524K23489
59874G311276K46734K68859K88774L04600L14452L17101L11745K97364K72584
59865I933489K36448J89398J33513P1916P982n5205j15061j69397k16103k53264
59855I763716k79951k96663l04509l04155k96170k82070k64065k43488k20424
$$ plain form
59846 7272221 7077085 6908105 6764822 6646738 6554088 6487317 6446375 6430608 6438879 6469653 6521250
59835 6521250 6591909 6679176 6779358 6888032 7000845 7113099 7218713 7310585 7382290 7428839
59825 7428839 7445870 7429286 7376411 7287019 7162901 7007054 6823725 6618477 6397277 6165547
59815 6165547 5928286 5690528 5456864 5230544 5013453 4806872 4612026 4430161 4262512
59806 4262512 4110032 3972760 3849620 3739196 3640656 3553749 3478059 3412544 3355594 3305214
59796 3305214 3259342 3216403 3175643 3136704 3098955 3061537 3024090 2987161 2951798 2918918 2889149
59785 2889149 2863038 2840984 2822743 2807152 2792654 2778137 2763079 2746840 2728186 2705792 2678998
59774 2678998 2648024 2613875 2578388 2543854 2511875 2482651 2455771 2431562 2411146 2395421 2384716
$$ packed form
59846G272221j95136j68980j43283j18084r2650o6771m0942j5767Q271L0774N1597
59835F521250P0659Q7267J00182J08674J12813J12254J05614R1872P1705M6549
59825G428839J7031j6584n2875q9392j24118j55847j83329k05248k21200k31730
59815F165547k37261k37758k33664k26320k17091k06581j94846j81865j67649
59806D262512j52480j37272j23140j10424r8540q6907p5690o5515n6950n0380
59796C305214m5872m2939m0760l8939l7749l7418l7447l6929l5363l2880k9769
59785B889149k6111k2054j8241j5591j4498j4517j5058j6239j8654k2394k6794
59774B678998l0974l4149l5487l4534l1979k9224k6880k4209k0416j5725j0705
$$ plain form
59763 2384716 2379328 2379499 2384651 2393404 2404780 2418919 2436388 2457399 2482124 2511250 2545581 2585206
59751 2585206 2629381 2676994 2726761 2777159 2826620 2873976 2918675 2960590 2999680 3035696 3068178
59740 3068178 3096767 3121496 3142666 3160683 3176250 3190597 3205135 3221003 3239347 3261874 3290583
59729 3290583 3326857 3371283 3424460 3487575 3562131 3649553 3751127 3867899 4000481 4149391
59719 4149391 4315679 4500750 4705308 4928885 5170424 5428613 5700838 5981502 6261074
59710 6261074 6526173 6760652 6947935 7074419 7132644 7122711 7051531 6930503 6772690 6590758
59700 6590758 6396250 6199434 6008737 5830079 5667123 5522225 5396969 5292065 5207447 5142761
59690 5142761 5097518 5070949 5062225 5070809 5096218 5137532 5193765 5264801 5351408 5454319 5573787
$$ packed form
59763B384716n388J71N152Q753J1376J4139J7469K1011K4725K9126L4331L9625
59751B585206M4175M7613M9767N0398M9461M7356M4699M1915L9090L6016L2482
59740C068178K8589K4729K1170J8017J5567J4347J4538J5868J8344K2527K8709
59729C290583L6274M4426N3177O3115P4556Q7422J01574J16772J32582J48910
59719D149391J66288J85071K04558K23577K41539K58189K72225K80664K79572
59710F261074K65099K34479J87283J26484N8225r933p1180j21028j57813j81932
59700F590758j94508j96816j90697j78658j62956j44898j25256j04904q4618o4686
59690E142761m5243k6569q724Q584K5409M1314N6233P1036Q6607J02911J19468
$$ plain form
59679 5573787 5710085 5863773 6035289 6224846 6432928 6660462 6908419 7177805 7470097
59670 7470097 7787095 8130019 8499220 8894905 9317647 9768025 10246171 10751540 11282263
59661 11282263 11834363 12402126 12979361 13559800 14136377 14701358 15248108 15772695 16273975
59652 16273975 16753135 17213743 17661488 18102979 18544607 18992236 19450775 19922975 20408518
59643 20408518 20904203 21404283 21900271 22381137 22834530 23248081 23610054 23910203 24141228
59634 24141228 24299774 24386288 24404858 24363559 24274059 24149812 24004359 23851001 23702884 23572353
59624 23572353 23470207 23405728 23386855 23419965 23510000 23661330 23877982 24162649 24515912 24936761
59614 24936761 25423142 25971218 26574181 27221800 27900066 28590293 29268687 29907365 30475865
$$ packed form
59679E573787J36298J53688J71516J89557K08082K27534K47957K69386K92292
59670G470097L16998L42924L69201L95685M22742M50378M78146N05369N30723
59661A1282263N52100N67763N77235N80439N76577N64981N46750N24587N01280
59652A6273975M79160M60608M47745M41491M41628M47629M58539M72200M85543
59643B0408518M95685N00080M95988M80866M53393M13551L61973L00149K31025
59634B4141228J58546Q6514J8570m1299q9500j24247j45453j53358j48117j30531
59624B3572353j02146o4479j8873L3110R0035J51330K16652K84667L53263M20849
59614B4936761M86381N48076O02963O47619O78266O90227O78394O38678N68500
$$ plain form
59605 30475865 30942383 31275918 31450183 31447549 31260938 30894003 30360799 29684444 28893959 28020406
59595 28020406 27094151 26143293 25192429 24261782 23366908 22518255 21720241 20971085 20263906
59586 20263906 19587714 18927712 18266939 17590650 16890907 16167894 15427961 14680991 13938312
59577 13938312 13210801 12507524 11835613 11200565 10605781 10052012 9538105 9062529 8624041
59568 8624041 8221349 7852835 7516546 7210053 6930525 6675464 6443210 6232448 6041521
59559 6041521 5868565 5711913 5569871 5440527 5322302 5214245 5115254 5023381 4936529 4853347
59549 4853347 4772799 4693316 4613243 4531875 4449257 4365154 4278980 4190631 4100660 4009738 3918625
59538 3918625 3828656 3741595 3658887 3581370 3509538 3443622 3383590 3329489 3281658 3240281 3205097
$$ packed form
59605C0475865M66518L33535J74265k634j86611l66935n33204o76355p90485q73553
59595B8020406r26255r50858r50864r30647q94874q48653p98014p49156p07179
59586B0263906o76192o60002o60773o76289o99743p23013p39933p46970p42679
59577A3938312p27511p03277o71911o35048n94784n53769n13907m75576m38488
59568H624041m02692l68514l36289l06493k79528k55061k32254k10762j90927
59559F041521j72956j56652j42042j29344j18225j08057r8991r1873q6852q3182
59549D853347q0548p9483q0073q1368q2618q4103q6174q8349q9971r0922r1113
59538C918625q9969q7061q2708p7517p1832o5916o0032n4101m7831m1377l5184
$$ plain form
59527 3205097 3175902 3152923 3136126 3124763 3118209 3116778 3120887 3129816 3142181 3157327 3175350 3196012
59515 3196012 3218625 3242952 3269304 3297706 3327755 3359366 3392995 3429142 3468338 3511619 3560249
59504 3560249 3614927 3675855 3743513 3818646 3901565 3992344 4091792 4201444 4322328 4454421 4597532
59493 4597532 4752114 4918891 5098202 5289952 5493779 5708962 5934418 6168869 6410702
59484 6410702 6657650 6906913 7155658 7401158 7640595 7871211 8090774 8297717 8490856
59475 8490856 8669116 8831270 8975791 9101392 9208254 9298488 9375158 9441185 9499441 9553086
59465 9553086 9604996 9657305 9712291 9773207 9843029 9922259 10008527 10097966 10185899 10266328 10332027
59454 10332027 10375798 10391287 10372770 10315222 10215229 10071600 9885014 9657687 9393602 9098570
$$ packed form
59527C205097k9195k2979j6797j1363o554j431M109Q929J2365J5146J8023K0662
59515C196012K2613K4327K6352K8402L0049L1611L3629L6147L9196M3281M8630
59504C560249N4678O0928O7658P5133Q2919R0779R9448J09652J20884J32093J43111
59493D597532J54582J66777J79311J91750K03827K15183K25456K34451K41833
59484F410702K46948K49263K48745K45500K39437K30616K19563K06943J93139
59475H490856J78260J62154J44521J25601J06862R0234P6670O6027N8256N3645
59465I553086N1910N2309N4986O0916O9822P9230Q6268Q9439Q7933Q0429O5699
59454A0332027M3771J5489j8517n7548r9993j43629j86586k27327k64085k95032
$$ plain form
59444 9098570 8779608 8444151 8099551 7752762 7410190 7077692 6760237 6461131 6181860
59435 6181860 5923055 5685398 5469351 5274624 5100522 4946405 4811292 4693632 4592289
59426 4592289 4507371 4439288 4387422 4350562 4328210 4320416 4326603 4345721 4377499 4422526 4481168 4553406
59414 4553406 4639713 4740918 4856896 4986275 5127646 5280272 5443410 5615645 5795018 5978906
59404 5978906 6163443 6343590 6513979 6669270 6803901 6912330 6989780 7032393 7037109 7002401
59394 7002401 6929228 6820558 6679957 6511269 6319370 6110129 5889375 5662445 5434267 5208720
59384 5208720 4987849 4772809 4565638 4369091 4184727 4012328 3851419 3702183 3564608
59375 3564608 3437990 3321896 3216704 3122628 3038966 2964715 2899186 2841612 2791029 2746993 2709700
$$ packed form
59444I098570l18962l35457l44600l46789l42572l32498l17455k99106k79271
59435F181860k58805k37657k16047j94727j74102j54117j35113j17660j01343
59426D592289q4918o8083n1866l6860k2352p794O187J9118L1778M5027N8642P2238
59414D553406Q6307J01205J15978J29379J41371J52626J63138J72235J79373J83888
59404E978906J84537J80147J70389J55291J34631J08429P7450M2613M716l4708
59394G002401p3173j08670j40601j68688j91899k09241k20754k26930k28178k25547
59384E208720k20871k15040k07171j96547j84364j72399j60909j49236j37575
59375C564608j26618j16094j05192r4076q3662p4251o5529n7574n0583m4036l7293
$$ plain form
59364 2709700 2679015 2654091 2634359 2620190 2612083 2609761 2612443 2619447 2630189 2644171 2661330 2682066
59352 2682066 2706888 2736322 2770804 2809684 2850458 2890103 2927522 2963997 3001471 3041536 3086046
59341 3086046 3137092 3195771 3262124 3336795 3421387 3516325 3619540 3728383 3842315 3963063
59331 3963063 4093063 4234662 4390211 4561874 4751460 4960868 5192281 5447483 5727439
59322 5727439 6032889 6364739 6723511 7108935 7520251 7955905 8412307 8883460 9362193
59313 9362193 9841069 10311950 10766053 11195698 11595673 11962479 12293143 12585733 12840444
59304 12840444 13059210 13244306 13397600 13520381 13612972 13674639 13704208 13700421 13661480 13585084
59294 13585084 13469668 13315378 13123818 12897822 12642120 12363358 12068381 11762498 11449422
$$ packed form
59364B709700l0685k4924j9732j4169q107k322K682P004J0742J3982J7159K0736
59352B682066K4822K9434L4482L8880M0774L9645L7419L6475L7474M0065M4510
59341C086046N1046N8679O6353P4671Q4592R4938J03215J08843J13932J20748
59331C963063J30000J41599J55549J71663J89586K09408K31413K55202K79956
59322E727439L05450L31850L58772L85424M11316M35654M56402M71153M78733
59313I362193M78876M70881M54103M29645L99975L66806L30664K92590K54711
59304A2840444K18766J85096J53294J22781R2591O1667K9569l787l8941p6396
59294A3585084j15416j54290j91560k25996k55702k78762k94977l05883l13076
$$ plain form
59285 11449422 11131819 10811050 10486984 10158986 9826915 9490878 9150828 8807301 8462245
59276 8462245 8118574 7779259 7447175 7125102 6815190 6518924 6238055 5974773 5730285
59267 5730285 5503970 5294737 5102593 4928077 4770828 4629770 4504222 4393767 4297331 4213367
59257 4213367 4140826 4079226 4028025 3986725 3955318 3933776 3921256 3916589 3919491 3930521 3949863 3976845
59245 3976845 4010674 4051019 4097837 4151019 4210229 4274657 4342980 4413885 4486532 4560209 4633686
59234 4633686 4705211 4773030 4835673 4892107 4941986 4985638 5023607 5056468 5085239 5111563 5137182
59223 5137182 5163461 5191538 5222579 5257749 5298318 5345740 5401076 5464296 5534721 5611957 5695401
59212 5695401 5782780 5870376 5954857 6033594 6102762 6156903 6191658 6206075 6201308 6178187 6137384
$$ packed form
59285A1449422l17603l20769l24066l27998l32071l36037l40050l43527l45056
59276H462245l43671l39315l32084l22073l09912k96266k80869k63282k44488
59267E730285k26315k09233j92144j74516j57249j41058j25548j10455r6436q3964
59257D213367p2541o1600n1201m1300l1407k1542j2520m667K902J1030J9342K6982
59245C976845L3829M0345M6818N3182N9210O4428O8323P0905P2647P3677P3477
59234D633686P1525O7819O2643N6434M9879M3652L7969L2861K8771K6324K5619
59223E137182K6279K8077L1041L5170M0569M7422N5336O3220P0425P7236Q3444
59212E695401Q7379Q7596Q4481P8737O9168N4141L4755J4417m767k3121m0803
$$ plain form
59201 6137384 6081059 6012813 5936345 5855269 5773657 5695223 5621956 5554594 5494414 5443568 5403717
59190 5403717 5375179 5357352 5349228 5349558 5357300 5371885 5392570 5417799 5445847 5475812 5507359 5539869
59178 5539869 5572685 5606044 5641126 5679412 5722644 5773088 5833047 5904248 5988263 6087207 6203362
59167 6203362 6338363 6493329 6669334 6866808 7084473 7319300 7567102 7822450 8078324
59158 8078324 8326458 8557863 8762717 8930702 9052608 9121610 9132742 9082257 8968929 8795618
59148 8795618 8568406 8294494 7981955 7640872 7282666 6917479 6552857 6194841 5849002
59139 5849002 5519815 5209808 4919927 4650487 4401736 4173965 3967119 3779990 3610050
59130 3610050 3454733 3312751 3183688 3066664 2960236 2863382 2775633 2696249 2624089 2558283
$$ packed form
59201F137384n6325o8246p6468q1076q1612p8434p3267o7362o0180n0846l9851
59190E403717k8538j7827q124L30P742J4585K0685K5229K8048K9965L1547L2510
59178E539869L2816L3359L5082L8286M3232N0444N9959P1201Q4015R8944J16155
59167F203362J35001J54966J76005J97474K17665K34827K47802K55348K55874
59158H078324K48134K31405K04854J67985J21906O9002J1132n0485j13328j73311
59148H795618k27212k73912l12539l41083l58206l65187l64622l58016l45839
59139E849002l29187l10007k89881k69440k48751k27771k06846j87129j69940
59130C610050j55317j41982j29063j17024j06428r6854q7749p9384p2160o5806
$$ plain form
59120 2558283 2498321 2443477 2392959 2346711 2305324 2269052 2237499 2210326 2187597 2169331 2155281
59109 2155281 2145238 2139126 2136798 2138177 2143404 2152368 2164348 2178827 2196512 2218757 2245999 2277423
59097 2277423 2312131 2349958 2391115 2435798 2484286 2536883 2593546 2653947 2717936 2785602 2856946
59086 2856946 2931907 3010524 3092586 3177158 3262854 3348426 3432775 3514665 3592943 3666840 3735651
59075 3735651 3798370 3854046 3902100 3941958 3973017 3995706 4012055 4024354 4033600 4040059 4045015 4051048
59063 4051048 4060689 4075564 4096680 4124802 4160676 4205494 4260843 4327555 4405073 4492754 4591259
59052 4591259 4701621 4823348 4954697 5094687 5243534 5400851 5564314 5730174 5894191
59043 5894191 6051947 6199101 6331641 6445374 6535482 6597597 6629546 6631581 6605187 6552661 6477668
$$ packed form
59120B558283n9962n4844n0518m6248m1387l6272l1553k7173k2729j8266j4050
59109B155281j0043o112k328J379N227Q964J1980J4479J7685K2245K7242L1424
59097B277423L4708L7827M1157M4683M8488N2597N6663O0401O3989O7666P1344
59086B856946P4961P8617Q2062Q4572Q5696Q5572Q4349Q1890P8278P3897O8811
59075C735651O2719N5676M8054L9858L1059K2689J6349J2299R246O459M956O033
59063D051048R641J4875K1116K8122L5874M4818N5349O6712P7518Q7681R8505
59052D591259J10362J21727J31349J39990J48847J57317J63463J65860J64017
59043E894191J57756J47154J32540J13733R0108O2115L1949K035k6394n2526p4993
$$ plain form
59032 6477668 6384888 6278475 6161338 6035940 5904916 5770568 5634257 5496491 5357232 5216178
59022 5216178 5073344 4929377 4784904 4639794 4493643 4346668 4199479 4052306 3905339
59013 3905339 3759565 3616396 3476568 3340310 3208408 3082137 2962161 2848387 2740819
59004 2740819 2639557 2543975 2452945 2366197 2284637 2209177 2139884 2076266 2017566 1962668 1910593
58993 1910593 1861286 1815312 1772737 1732968 1695625 1660710 1627834 1596096 1564948 1534600 1505502
58982 1505502 1477995 1452478 1429275 1408301 1389374 1372764 1358927 1347856 1339156 1332486 1327423 1323338
58970 1323338 1320069 1318236 1318229 1319565 1322059 1326726 1334225 1343087 1350983 1357322 1363057 1368281 1371883 1373590 1374582
58955 1374582 1375730 1376718 1377318 1378152 1379688 1381707 1384277 1388119 1393561 1400023 1406908 1414105 1421408 1428417 1435199
$$ packed form
59032F477668r2780j06413j17137j25398j31024j34348j36311j37766j39259j41054
59022E216178j42834j43967j44473j45110j46151j46975j47189j47173j46967
59013C905339j45774j43169j39828j36258j31902j26271j19976j13774j07568
59004B740819j01262r5582r1030q6748q1560p5460o9293o3618n8700n4898n2075
58993A910593m9307m5974m2575l9769l7343l4915l2876l1738l1148l0348k9098
58982A505502k7507k5517k3203k0974j8927j6610j3837j1071q700o670n063m085
58970A323338l269j833pJ336K494M667P499Q862P896O339N735N224L602J707R92
58955A374582J148R88O00Q34J536K019K570L842N442O462O885P197P303P009O782
$$ plain form
58940 1435199 1442008 1448163 1452319 1454149 1454707 1454863 1454377 1452809 1450356 1447527 1444965 1443708 1444624 1447364 1450875
58925 1450875 1454962 1460233 1466496 1472682 1478638 1485645 1494629 1505157 1516727 1529841 1545063 1561958 1579642
58912 1579642 1597730 1616450 1636609 1659538 1685968 1714732 1743710 1772352 1802200 1834673 1869559
58901 1869559 1906029 1943799 1982682 2022139 2061975 2102662 2144601 2187980 2233560 2282432 2334636
58890 2334636 2389163 2445675 2505139 2568439 2635690 2707349 2784665 2868374 2958082 3053460 3154984
58879 3154984 3263181 3378376 3501625 3634471 3777250 3929061 4090001 4261986 4446595
58870 4446595 4643704 4853278 5077159 5317903 5576925 5854848 6152669 6471546 6812377
58861 6812377 7176562 7566249 7982822 8425869 8894442 9388441 9907773 10450786 11014021
$$ packed form
58940A435199O809O155M156J830N58J56m86j568k453k829k562j257R16K740L511
58925A450875M087N271O263O186N956P007Q984J0528J1570J3114J5222J6895J7684
58912A579642J8088J8720K0159K2929K6430K8764K8978K8642K9848L2473L4886
58901A869559L6470L7770L8883L9457L9836M0687M1939M3379M5580M8872N2204
58890B334636N4527N6512N9464O3300O7251P1659P7316Q3709Q9708R5378J01524
58879C154984J08197J15195J23249J32846J42779J51811J60940J71985J84609
58870D446595J97109K09574K23881K40744K59022K77923K97821L18877L40831
58861F812377L64185L89687M16573M43047M68573M93999N19332N43013N63235
$$ plain form
58852 11014021 11592420 12178735 12763393 13335595 13883784 14394539 14852267 15241252 15547881
58843 15547881 15761080 15872480 15877810 15777944 15578215 15287390 14917392 14482310 13996253 13472286
58833 13472286 12923133 12361114 11796445 11236748 10688825 10159447 9653576 9173296 8719615
58824 8719615 8294009 7897197 7527902 7184263 6865349 6570024 6295593 6039224 5799886
58815 5799886 5577459 5370739 5177715 4997139 4828471 4670798 4523063 4384932 4256422
58806 4256422 4137169 4026823 3925416 3832464 3746577 3666945 3594340 3529666 3472402 3421463 3376641
58795 3376641 3338062 3305162 3277454 3255513 3240024 3230662 3227055 3229947 3240151 3257177 3280118 3309067
58783 3309067 3344416 3385677 3432468 3485902 3547508 3617330 3694511 3779086 3871767 3972580 4081256
$$ packed form
58852A1014021N78399N86315N84658N72202N48189N10755M57728L88985L06629
58843A5547881K13199J11400N330r9866j99729k90825l69998m35082m86057n23967
58833A3472286n49153n62019n64669n59697n47923n29378n05871m80280m53681
58824H719615m25606l96812l69295l43639l18914k95325k74431k56369k39338
58815E799886k22427k06720j93024j80576j68668j57673j47735j38131j28510
58806D256422j19253j10346j01407r2952q5887p9632p2605o4674n7264n0939m4822
58795C376641l8579l2900k7708k1941j5489r362l607K892J0204J7026K2941K8949
58783C309067L5349M1261M6791N3434O1606O9822P7181Q4575R2681J00813J08676
$$ plain form
58772 4081256 4198592 4325863 4463198 4609888 4766119 4933130 5111932 5303159 5508051
58763 5508051 5728469 5966016 6221976 6497791 6794736 7113519 7455091 7821336 8213997
58754 8213997 8633432 9079239 9551203 10048282 10567130 11102750 11649981 12202842 12752529
58745 12752529 13287128 13793045 14255847 14660387 14991817 15237264 15386762 15433832 15376557 15217987
58735 15217987 14964875 14626342 14213964 13741625 13223728 12673671 12104219 11527775 10954679
58726 10954679 10391912 9844534 9317485 8814808 8338204 7887944 7464555 7068325 6698020
58717 6698020 6351755 6028560 5727769 5447555 5185545 4940270 4710627 4494679 4290590
58708 4290590 4098214 3918215 3750117 3592658 3445399 3308329 3180436 3060360 2948065
$$ packed form
58772D081256J17336J27271J37335J46690J56231J67011J78802J91227K04892
58763E508051K20418K37547K55960K75815K96945L18783L41572L66245L92661
58754H213997M19435M45807M71964M97079N18848N35620N47231N52861N49687
58745A2752529N34599N05917M62802M04540L31430K45447J49498M7070n7275j58570
58735A5217987k53112l38533m12378m72339n17897n50057n69452n76444n73096
58726A0954679n62767n47378n27049n02677m76604m50260m23389l96230l70305
58717F698020l46265l23195l00791k80214k62010k45275k29643k15948k04089
58708D290590j92376j79999j68098j57459j47259j37070j27893j20076j12295
$$ plain form
58699 2948065 2844146 2747892 2657757 2573464 2495920 2425170 2360062 2299866 2244705 2194415 2148376
58688 2148376 2106510 2069084 2035525 2004518 1975162 1947068 1919785 1893251 1868311 1845499 1823827
58677 1823827 1802018 1780276 1759361 1738586 1716430 1692728 1668655 1644955 1621772 1599679 1579069
58666 1579069 1558783 1537165 1514252 1491280 1468312 1444207 1418672 1392453 1365515 1337026 1307378
58655 1307378 1278401 1251239 1225477 1200603 1176771 1153818 1130993 1108094 1085795 1064664 1044790
58644 1044790 1026309 1009222 992899 976906 961983 948992 937329 925765 914420 904293 895180
58633 895180 885754 875582 865495 856134 847667 840710 835821 832166 828259 824005 820535 818309 816948 816558
58619 816558 817374 818290 817724 815919 814511 813840 812595 810252 807913 806433 805536 805110 805664 807065 808370 809286
$$ packed form
58699B948065j03919r6254r0135q4293p7544p0750o5108o0196n5161n0290m6039
58688B148376m1866l7426l3559l1007k9356k8094k7283k6534k4940k2812k1672
58677A823827k1809k1742k0915k0775k2156k3702k4073k3700k3183k2093k0610
58666A579069k0286k1618k2913k2972k2968k4105k5535k6219k6938k8489k9648
58655A307378k8977k7162k5762k4874k3832k2953k2825k2899k2299k1131j9874
58644A044790j8481j7087j6323j5993j4923j2991j1663j1564j1345j0127r113
58633H95180r426j0172j0087r361q467o957m889l655l907m254l470k226j361l90
58619H16558Q16R16n66j805j408o71j245k343k339j480q97m26N54J401J305R16
$$ plain form
58603 809286 810433 812061 813905 816296 819853 824017 827462 830001 832511 835095 837108 839011 842325 847526
58589 847526 853754 860768 869412 879915 891528 904144 918541 934762 951948 970134 990545 1013805
58577 1013805 1039385 1067046 1097214 1129780 1164159 1200735 1240626 1283936 1329951 1379112 1432924
58566 1432924 1491820 1555061 1622972 1697230 1778595 1866365 1960630 2063176 2175516 2297739 2429804
58555 2429804 2572232 2724761 2885762 3053364 3225740 3399864 3571354 3735690 3888165
58546 3888165 4022712 4132637 4212901 4260481 4273089 4249774 4192982 4107983 4000003 3873524
58536 3873524 3733938 3587303 3438040 3288851 3142832 3003257 2871089 2745163 2625231
58527 2625231 2512535 2407246 2308103 2215165 2130258 2053890 1984275 1920173 1862210 1810513 1763604
$$ packed form
58603H09286J147J628J844K391L557M164L445K539K510K584K013J903L314N201
58589H47526O228P014Q644J0503J1613J2616J4397J6221J7186J8186K0411K3260
58577A013805K5580K7661L0168L2566L4379L6576L9891M3310M6015M9161N3812
58566A432924N8896O3241O7911P4258Q1365Q7770R4265J02546J12340J22223J32065
58555B429804J42428J52529J61001J67602J72376J74124J71490J64336J52475
58546C888165J34547J09925Q0264M7580J2608k3315n6792q4999j07980j26479
58536C873524j39586j46635j49263j49189j46019j39575j32168j25926j19932
58527B625231j12696j05289r9143r2938q4907p6368o9615o4102n7963n1697m6909
$$ plain form
58516 1763604 1720692 1682613 1649309 1618700 1589242 1561494 1535921 1511318 1486754 1463138 1441583
58505 1441583 1421788 1402948 1384561 1365643 1345109 1323613 1302951 1282937 1261210 1236945 1212325
58494 1212325 1189222 1166773 1143562 1120012 1097289 1075837 1056272 1039815 1026541 1014906 1003989
58483 1003989 994483 986728 979854 973620 968920 965539 961699 956803 952366 949269 946393 942933 939513 935958
58469 935958 930522 922659 914054 905622 895960 884110 871304 858511 844848 829968 815522 802562
58457 802562 789927 776838 764669 754464 745151 735909 727851 721593 715669 709206 703719 700313 697562
58444 697562 694177 691406 690639 690906 690839 690915 691770 692580 693135 695202 699729 704939 709255 713651 718990 723634
58428 723634 726182 728163 731413 735095 737895 740890 745390 750016 752854 754695 757404 760861 764152 768019
$$ packed form
58516A763604m2912l8079l3304l0609k9458k7748k5573k4603k4564k3616k1555
58505A441583j9795j8840j8387j8918k0534k1496k0662k0014k1727k4265k4620
58494A212325k3103k2449k3211k3550k2723k1452j9565j6457j3274j1635j0917
58483A003989r506p755o874o234m700l381l840m896m437l097k876l460l420l555
58469I35958n436p863q605q432r662j1850j2806j2793j3663j4880j4446j2960
58457H02562j2635j3089j2169j0205r313r242q058o258n924o463n487l406k751
58444F97562l385k771p67K67o7P6Q55Q10N55K067M527N210M316M396N339M644
58428G23634K548J981L250L682K800K995M500M626K838J841K709L457L291L867
$$ plain form
58414 768019 773342 778878 783190 787200 792223 797117 800063 801578 803041 803714 801880 797582 791817 784473
58400 784473 775463 766366 758531 751021 742685 734521 727666 721011 713440 706548 702271 699565 696315 692908
58386 692908 690998 690237 689247 688595 689915 693165 697282 702360 708755 715473 721866 729367 738967 748609 755711
58371 755711 760665 765178 768905 770670 771405 772820 774407 774675 774071 774028 774486 775014 776882 781254 786806 791869
58355 791869 797381 805018 814035 822749 831398 840636 849021 855119 860445 867216 874709 880863 885715 890134
58341 890134 892966 892782 890810 888791 885588 879310 871164 863663 856627 848517 840189 833637 828349 822550
58327 822550 816846 813167 811325 810008 809823 811953 815265 818132 821593 827206 833416 837713 840887 845446
58313 845446 851402 857304 863735 871869 880166 886535 892339 900282 909810 918579 926916 936716 947389 957000
$$ packed form
58414G68019N323N536M312M010N023M894K946J515J463O73j834m298n765p344
58400G84473r010r097p835p510q336q164o855o655p571o892m277k706l250l407
58386F92908j910p61r90o52J320L250M117N078O395O718O393P501R600R642P102
58371G55711M954M513L727J765P35J415J587K68o04m3M58N28J868M372N552N063
58355G91869N512P637R017Q714Q649R238Q385O098N326O771P493O154M852M419
58341H90134K832j84j972k019l203o278q146p501p036q110q328o552n288n799
58327H22550n704l679j842j317j85K130L312K867L461N613O210M297L174M559
58313H45446N956N902O431Q134Q297O369N804P943R528Q769Q337R800J0673R611
$$ plain form
58299 957000 965983 975676 984759 991271 996525 1002839 1009312 1014195 1019423 1027883 1038014 1046160 1052549 1059778
58285 1059778 1066938 1070841 1071918 1073402 1075547 1075993 1075107 1075670 1077896 1079789 1081740 1085801 1091277 1096006 1101036
58270 1101036 1108996 1118933 1127953 1136828 1148551 1162418 1175116 1186725 1200046 1214980 1229289 1243890
58258 1243890 1261495 1280831 1298166 1313791 1331003 1349519 1366062 1380778 1396796 1414031 1429598
58247 1429598 1443787 1459335 1475545 1489503 1502399 1517980 1535486 1550970 1565064 1582270 1602896
58236 1602896 1622783 1640852 1659848 1679788 1697964 1715413 1736218 1760348 1784281 1808430 1836485
58225 1836485 1867617 1897139 1924967 1955760 1990637 2026492 2063390 2104520 2148788 2191756 2234069
58214 2234069 2280658 2331446 2381385 2429727 2480351 2532856 2582679 2630583 2682570 2739672 2797212
$$ packed form
58299I57000Q983R693R083O512N254O314O473M883N228Q460J0131Q146O389P229
58285A059778P160L903J077J484K145M46q86N63K226J893J951M061N476M729N030
58270A101036P960R937R020Q875J1723J3867J2698J1609J3321J4934J4309J4601
58258A243890J7605J9336J7335J5625J7212J8516J6543J4716J6018J7235J5567
58247A429598J4189J5548J6210J3958J2896J5581J7506J5484J4094J7206K0626
58236A602896J9887J8069J8996J9940J8176J7449K0805K4130K3933K4149K8055
58225A836485L1132K9522K7828L0793L4877L5855L6898M1130M4268M2968M2313
58214B234069M6589N0788M9939M8342N0624N2505M9823M7904N1987N7102N7540
$$ plain form
58203 2797212 2854815 2917427 2985676 3055196 3126529 3205655 3293615 3385661 3481599 3586528 3700490
58192 3700490 3818274 3940601 4074346 4220440 4372961 4531320 4701484 4883873 5072528
58183 5072528 5268017 5478471 5705957 5944764 6194948 6464120 6753857 7058374 7378841
58174 7378841 7724469 8097043 8489444 8902006 9344540 9819455 10319497 10845353 11408091
58165 11408091 12010537 12644447 13310447 14022259 14786797 15599657 16465092 17399853 18411690
58156 18411690 19495236 20654685 21907722 23260830 24705239 26245339 27907132 29712450
58148 29712450 31672664 33816056 36191471 38834893 41763416 45013077 48650917 52741931
58140 52741931 57343887 62546278 68470083 75214472 82852727 91497199 101312516 112447859
$$ packed form
58203B797212N7603O2612O8249O9520P1333P9126Q7960R2046R5938J04929J13962
58192C700490J17784J22327J33745J46094J52521J58359J70164J82389J88655
58183E072528J95489K10454K27486K38807K50184K69172K89737L04517L20467
58174G378841L45628L72574L92401M12562M42534M74915N00042N25856N62738
58165A1408091O02446O33910O66000P11812P64538Q12860Q65435R34761J011837
58156A8411690J083546J159449J253037J353108J444409J540100J661793J805318
58148B9712450J960214K143392K375415K643422K928523L249661L637840M091014
58140E2741931M601956N202391N923805O744389P638255Q644472R815317J1135343
$$ plain form
58132 112447859 125025079 139212286 155216808 173176827 193177599 215362209 239639474
58125 239639474 264808842 287944295 305110571 313208091 311425813 301160227 284832514
58118 284832514 264823436 243081032 221086227 199834998 179878967 161491675 144819414
58111 144819414 129912114 116722494 105154691 95103728 86437434 78984168 72574686
58104 72574686 67083652 62419352 58496872 55240499 52598104 50534422 49011394 47983997
58096 47983997 47420252 47319686 47676515 48366050 49048294 49241595 48568823 46959607 44617216
58087 44617216 41825148 38814081 35759763 32803809 30032607 27471247 25124296 23003658
58079 23003658 21110457 19421869 17913866 16576529 15395697 14341661 13389435 12532240
$$ packed form
58132A12447859J2577220J4187207J6004522J7960019K0000772K2184610K4277265
58125B39639474K5169368K3135453J7166276Q097520j782278j0265586j6327713
58118B84832514k0009078k1742404k1994805k1251229j9956031j8387292j6672261
58111A44819414j4907300j3189620j1567803j0050963q666294p453266o409482
58104G2574686n491034m664300l922480l256373k642395k063682j523028j027397
58096D7983997n63745j00566L56829O89535O82244J93301o72772j609216k342391
58087D4617216k792068l011067l054318k955954k771202k561360k346951k120638
58079B3003658j893201j688588j508003j337337j180832j054036r52226q57195
$$ plain form
58071 12532240 11764123 11067088 10426197 9840589 9308605 8817049 8355222 7925218 7528715
58062 7528715 7157102 6803816 6473324 6168803 5883147 5610700 5355895 5121841 4901808
58053 4901808 4690287 4491361 4307760 4132139 3957532 3786753 3623653 3464614 3306451
58044 3306451 3153642 3010001 2871605 2735182 2605226 2485757 2373042 2263281 2159703
58035 2159703 2065416 1976860 1890945 1811292 1740887 1675728 1612077 1553058 1501772 1454589 1407424
58024 1407424 1362175 1321085 1281239 1240501 1202484 1169732 1138201 1104259 1070956 1041541 1012973
58013 1012973 981958 951584 925802 902665 878977 856497 837764 820694 802947 786814 774415
58002 774415 762849 749402 736666 727174 717853 705376 692286 682214 673402 662608 651278 642292
$$ packed form
58071A2532240p68117o97035o40891n85608n31984m91556m61827m30004l96503
58062G528715l71613l53286l30492l04521k85656k72447k54805k34054k20033
58053D901808k11521j98926j83601j75621j74607j70779j63100j59039j58163
58044C306451j52809j43641j38396j36423j29956j19469j12715j09761j03578
58035B159703r4287q8556q5915p9653p0405o5159o3651n9019n1286m7183m7165
58024A407424m5249m1090l9846m0738l8017l2752l1531l3942l3303k9415k8568
58013A012973l1015l0374k5782k3137k3688k2480j8733j7070j7747j6133j2399
58002G74415j1566j3447j2736r492r321j2477j3090j0072q812j0794j1330q986
$$ plain form
57990 642292 634460 625710 617934 613344 609512 603293 596336 591708 588303 583535 578440 575303 573186 570332
57976 570332 567994 567573 567052 564605 562561 563479 565386 565178 563687 563209 563093 561962 561168 561848 561681 558761
57960 558761 555623 555263 556235 555894 555249 556217 557197 555940 553931 553363 552580 549092 544450 541475 539194 535144
57944 535144 530367 527388 525399 521968 517599 514211 511030 506424 501979 500356 500620 499789 497530 495445 493328
57929 493328 490008 486409 484066 482082 479045 476211 475351 475308 474188 473013 473651 475187 476077 477769 482271
57914 482271 488069 492453 495962 500525 505093 507427 508509 510762 513324 513485 511634 510438 510070 508417 505244
57899 505244 502116 498867 494050 488285 483481 479355 474230 468574 464234 460879 456709 452010 448607 446445
57885 446445 444072 441804 441078 441394 441114 440518 440750 440647 438096 433840 430481 428293 425378 421419 417816 414569
$$ packed form
57990F42292p832q750p776m590l832o219o957m628l405m768n095l137k117k854
57976E70332k338m21n21k447k044R18J907k08j491m78j16j131p94O80j67k920
57960E58761l138l60R72l41o45R68R80j257k009n68p83l488m642k975k281m050
57944E35144m777k979j989l431m369l388l181m606m445j623K64q31k259k085k117
57929D93328l320l599k343j984l037k834q60m3j120j175O38J536Q90J692M502
57914D82271N798M384L509M563M568K334J082K253K562J61j851j196l68j653l173
57899E05244l128l249m817n765m804m126n125n656m340l355m170m699l403k162
57885D46445k373k268p26L16k80n96K32j03k551m256l359k188k915l959l603l247
$$ plain form
57869 414569 410390 405553 401416 397493 392113 385610 379804 374812 369425 364135 360587 358430 355860 352922
57855 352922 351270 351068 351173 351972 354878 359363 363598 367763 373712 381585 389671 397329 405213 413001 419796
57840 419796 426273 433487 440104 443938 445660 447761 450398 451649 451436 451460 451418 449078 444357 439722 436108
57825 436108 431915 426663 422234 419582 417247 414062 410678 407686 404765 402298 401295 401195 400206 398283 397353
57810 397353 398242 399798 401348 403517 406332 409075 412262 417121 422831 426923 428841 430490 432882 434961
57796 434961 436193 437556 439220 439796 438653 436663 434100 430176 425193 420738 417209 413491 409510 406577
57782 406577 404706 402259 398893 396249 394917 393298 390377 387135 384280 381061 377337 374374 372339 369249
57768 369249 363742 356940 350506 344765 339678 335563 331702 326177 318422 310294 303599 298191 293367 289333
$$ packed form
57869D14569m179m837m137l923n380o503n806m992n387n290l548k157k570k938
57855C52922j652k02J05P99K906M485M235M165N949P873Q086P658P884P788O795
57840D19796O477P214O617L834J722K101K637J251k13K4m2k340m721m635l614
57825D36108m193n252m429k652k335l185l384k992k921k467j003j00r89j923r30
57810C97353Q89J556J550K169K815K743L187M859N710M092J918J649K392K079
57796D34961J232J363J664N76j143j990k563l924m983m455l529l718l981k933
57782D06577j871k447l366k644j332j619k921l242k855l219l724k963k035l090
57768C69249n507o802o434n741n087m115l861n525p755q128o695n408m824m034
$$ plain form
57754 289333 286190 283117 279674 276528 274018 271463 268644 266488 265513 265082 264853 265405 266780 268070 269228
57739 269228 271717 276509 282840 289607 296624 303853 310815 317338 323586 328958 332368 333972 335098 336217
57725 336217 336616 336301 336308 336708 336208 334270 331854 329530 326624 322800 318705 314579 310016 305528 302363 300237
57709 300237 297339 293196 289477 287177 285185 282616 280503 280030 280862 282330 284605 287713 290948 294140 297857
57694 297857 301667 304075 304986 306311 309218 312704 315866 319478 324050 328312 331119 333202 335658 338292
57680 338292 340774 343880 348127 352559 356234 359639 363453 367227 370528 374095 378677 383956 389637 396308
57666 396308 404231 412729 421709 432238 444503 456853 468112 479302 491750 505043 518310 532034
57654 532034 547063 563100 579713 597606 617412 638374 659704 682147 706811 733517 761700
$$ packed form
57754B89333l143l073l443l146k510k555k819k156r75m31k29N52J375J290J158
57739B69228K489M792O331O767P017P229O962O523O248N372L410J604J126J119
57725C36217L99l15PM00n00j938k416k324k906l824m095m126m563m488l165k126
57709C00237k898m143l719k300j992k569k113m73Q32J468K275L108L235L192L717
57694B97857L810K408R11J325K907L486L162L612M572M262K807K083K456K634
57680C38292K482L106M247M432L675L405L814L774L301L567M582N279N681O671
57666C96308P923Q498Q980J0529J2265J2350J1259J1190J2448J3293J3267J3724
57654E32034J5029J6037J6613J7893J9806K0962K1330K2443K4664K6706K8183
$$ plain form
57643 761700 791818 824392 858730 894136 931482 972139 1016219 1063305 1114081 1169817 1230946
57632 1230946 1297453 1369937 1449096 1534932 1627687 1728800 1839725 1960523 2090719 2230717
57622 2230717 2381166 2541663 2711081 2888277 3071180 3255770 3436977 3609954 3769775
57613 3769775 3911060 4029270 4122038 4188829 4230525 4249791 4249709 4229960 4185176 4108729 3997994
57602 3997994 3855740 3688396 3504695 3314461 3125980 2944156 2771803 2611604 2465484
57593 2465484 2333264 2213838 2107128 2013434 1931732 1860323 1798630 1746734 1703748 1668282 1640030
57582 1640030 1619184 1604636 1594492 1588236 1586861 1591002 1600445 1615393 1636681 1664481 1698023 1736905
57570 1736905 1781792 1833741 1893588 1961898 2038638 2122994 2214214 2312511 2418496 2531975 2651883
$$ packed form
57643G61700L0118L2574L4338L5406L7346M0657M4080M7086N0776N5736O1129
57632A230946O6507P2484P9159Q5836R2755J01113J10925J20798J30196J39998
57622B230717J50449J60497J69418J77196J82903J84590J81207J72977J59821
57613C769775J41285J18210R2768O6791M1696J9266q2j9749m4784p6447j10735
57602C997994j42254j67344j83701j90234j88481j81824j72353j60199j46120
57593B465484j32220j19426j06710r3694q1702p1409o1693n1896m2986l5466k8252
57582A640030k0846j4548j0144o256j375M141R443J4948K1288K7800L3542L8882
57570A736905M4887N1949N9847O8310P6740Q4356R1220R8297J05985J13479J19908
$$ plain form
57559 2651883 2776909 2905323 3034396 3160487 3279266 3385331 3472336 3534519 3568043 3570876
57549 3570876 3542517 3484659 3401233 3296816 3175534 3041907 2901368 2758614 2616180 2475593
57539 2475593 2338990 2208491 2084959 1968690 1860502 1760877 1668786 1582779 1502661 1428897
57529 1428897 1361122 1298613 1241531 1190281 1144143 1101789 1062572 1026089 991365 958027 927552
57518 927552 901559 879307 858561 838549 820289 804272 789766 776516 765316 756403 748700 741119
57506 741119 733627 726800 721275 717762 716634 717335 718950 721287 724665 728953 733773 739414 746535 755191
57492 755191 765106 776616 790334 806166 823632 842813 863894 886198 908987 932957 959709 989891
57480 989891 1023052 1059103 1098578 1141567 1187777 1237740 1292719 1353311 1419231 1490497 1567683
$$ packed form
57559B651883J25026J28414J29073J26091J18779J06065Q7005O2183L3524K833
57549C570876k8359n7858q3426j04417j21282j33627j40539j42754j42434j40587
57539B475593j36603j30499j23532j16269j08188r9625r2091q6007q0118p3764
57529A428897o7775o2509n7082n1250m6138m2354l9217l6483l4724l3338l0475
57518I27552k5993k2252k0746k0012j8260j6017j4506j3250j1200q913p703p581
57506G41119p492o827n525l513j128P01J615K337L378M288M820N641P121Q656
57492G55191R915J1510J3718J5832J7466J9181K1081K2304K2789K3970K6752L0182
57480I89891L3161L6051L9475M2989M6210M9963N4979O0592O5920P1266P7186
$$ plain form
57469 1567683 1650859 1739416 1833118 1932209 2036178 2143209 2251017 2357424 2459899 2555057
57459 2555057 2638667 2705784 2751522 2772830 2769571 2743451 2696478 2631163 2551283 2460910 2362890
57448 2362890 2259404 2153606 2049225 1948731 1853190 1763670 1681308 1606047 1536863 1473483
57438 1473483 1416652 1366555 1322322 1283292 1249527 1220771 1196113 1175078 1158018 1145042 1135521
57427 1135521 1128949 1125458 1125291 1128604 1135907 1147662 1163251 1181281 1201232 1224067 1251063 1282864
57415 1282864 1319750 1361923 1409224 1461303 1518334 1580981 1649601 1723994 1803867 1888898 1978533
57404 1978533 2072293 2169837 2269704 2368180 2460344 2542019 2609878 2660201 2689115 2694277 2675410
57393 2675410 2633347 2569739 2487686 2391384 2284818 2171508 2055120 1939024 1825185 1714585
$$ packed form
57469A567683Q3176Q8557R3702R9091J03969J07031J07808J06407J02475R5158
57459B555057Q3610O7117M5738K1308l259k6120m6973o5315p9880r0373r8020
57448B362890j03486j05798j04381j00494r5541q9520q2362p5261o9184o3380
57438A473483n6831n0097m4233l9030l3765k8756k4658k1035j7060j2976r521
57427A135521o572l491j67L313P303J1755J5589J8030J9951K2835K6996L1801
57415A282864L6886M2173M7301N2079N7031O2647O8620P4393P9873Q5031Q9635
57404A978533R3760R7544R9867R8476R2164Q1675O7859N0323K8914N162j8867
57393B675410m2063o3608q2053r6302j06566j13310j16388j16096j13839j10600
$$ plain form
57383 1714585 1608643 1509038 1416250 1329700 1249399 1176087 1109577 1048411 991533 939037 890936
57372 890936 846469 805123 767114 732313 699773 668933 640363 614714 591653 570264 549838
57361 549838 530053 511103 493844 478999 466045 453686 441397 429610 418443 407415 396578
57350 396578 386719 378110 370111 362333 355209 349024 343302 337516 331701 326175 321435 318248 316841 316003
57336 316003 314083 310986 308104 306266 304992 303829 303006 302405 301252 299360 297507 296099 294568 292511 290346
57321 290346 288391 286402 284434 283040 282138 280753 278435 275950 274094 272739 271455 270190 269010 268062 267905
57306 267905 268831 269782 269281 267622 266692 267297 268184 268225 267938 268053 268086 267370 266317 265648 265381 265444 266298 268101 270090
57287 270090 271577 272797 274260 276137 278679 282149 285863 288560 290291 292643 296448 300661 304326 308135
$$ packed form
57383A714585j05942r9605r2788q6550q0301p3312o6510o1166n6878n2496m8101
57372H90936m4467m1346l8009l4801l2540l0840k8570k5649k3061k1389k0426
57361E49838j9785j8950j7259j4845j2954j2359j2289j1787j1167j1028j0837
57350C96578r859q609p999p778p124o185n722n786n815n526m740l187j407q38
57336C16003j920l097k882j838j274j163q23o01j153j892j853j408j531k057k165
57321B90346j955j989j968j394r02j385k318k485j856j355j284j265j180r48j57
57306B67905R26R51n01j659r30O05Q87M1k87J15L3p16j053o69k67O3Q54J803J989
57287B70090J487J220J463J877K542L470L714K697J731K352L805M213L665L809
$$ plain form
57273 308135 312962 318158 322612 326502 330779 335723 341080 346814 352775 358420 363732 369556 376261 383036
57259 383036 389380 396160 404158 412708 420935 429378 439098 450019 461421 473379 486434 500434 514848
57246 514848 529731 545391 561611 578080 594922 611989 628433 643896 659314 675529 691960
57235 691960 707698 723052 738849 755054 771389 788550 807425 827705 848557 870238 893712
57224 893712 919108 945694 973056 1001162 1029723 1058577 1088313 1119342 1150706 1180785 1208789
57213 1208789 1234586 1257618 1277135 1293067 1305554 1314046 1317991 1318028 1315414 1310672 1303875 1295838 1287807
57200 1287807 1280242 1272979 1266297 1260789 1256533 1253447 1252089 1253008 1255689 1259306 1264183 1271345 1280884 1291972
57186 1291972 1304257 1318122 1333692 1350656 1368968 1388721 1409524 1430934 1453319 1477375 1503041
$$ packed form
57273C08135M827N196M454L890M277M944N357N734N961N645N312N824O705O775
57259C83036O344O780P998Q550Q227Q443R720J0921J1402J1958J3055J4000J4414
57246E14848J4883J5660J6220J6469J6842J7067J6444J5463J5418J6215J6431
57235F91960J5738J5354J5797J6205J6335J7161J8875K0280K0852K1681K3474
57224H93712K5396K6586K7362K8106K8561K8854K9736L1029L1364L0079K8004
57213A208789K5797K3032J9517J5932J2487Q492L945L7k614m742o797q037q031
57200A287807p565p263o682n508m256l086j358R19K681L617M877P162R539J1088
57186A291972J2285J3865J5570J6964J8312J9753K0803K1410K2385K4056K5666
$$ plain form
57175 1503041 1529762 1557484 1586452 1616417 1647078 1678914 1712571 1747789 1783973 1821368 1860590
57164 1860590 1901436 1943410 1987025 2033226 2081785 2131607 2182511 2235450 2291122 2349611 2411342
57153 2411342 2477165 2547447 2622028 2700860 2783640 2869089 2955725 3043026 3130689 3217252 3301078
57142 3301078 3382571 3463926 3546728 3631235 3717834 3807342 3899356 3991861 4083167 4173157 4262265
57131 4262265 4350339 4437051 4522556 4607240 4691416 4775424 4859415 4943232 5027230 5112933 5201786
57120 5201786 5293295 5385331 5476083 5564746 5650750 5733705 5814065 5892585 5969191 6043582 6116672
57109 6116672 6189960 6263508 6336020 6406871 6476501 6544884 6611455 6676971 6743765 6813529 6886199
57098 6886199 6961440 7039806 7121865 7207592 7297414 7392685 7494462 7602614 7716516 7835529
$$ packed form
57175A503041K6721K7722K8968K9965L0661L1836L3657L5218L6184L7395L9222
57164A860590M0846M1974M3615M6201M8559M9822N0904N2939N5672N8489O1731
57153B411342O5823P0282P4581P8832Q2780Q5449Q6636Q7301Q7663Q6563Q3826
57142C301078Q1493Q1355Q2802Q4507Q6599Q9508R2014R2505R1306Q9990Q9108
57131D262265Q8074Q6712Q5505Q4684Q4176Q4008Q3991Q3817Q3998Q5703Q8853
57120E201786R1509R2036R0752Q8663Q6004Q2955Q0360P8520P6606P4391P3090
57109F116672P3288P3548P2512P0851O9630O8383O6571O5516O6794O9764P2670
57098F886199P5241P8366Q2059Q5727Q9822R5271J01777J08152J13902J19013
$$ plain form
57088 7835529 7958489 8083955 8211570 8342298 8476976 8615414 8756847 8899959 9042294
57079 9042294 9181136 9315490 9446202 9574017 9699041 9822279 9946021 10071957 10200312
57070 10200312 10331475 10467141 10608885 10756404 10907445 11058362 11204580 11342066 11469087
57061 11469087 11585634 11691116 11784120 11864533 11933918 11993055 12040700 12075437 12097242 12106725 12104725
57050 12104725 12093645 12077713 12061066 12046842 12038410 12039832 12054948 12088504 12149260 12250191 12405216
57039 12405216 12628313 12936740 13352461 13899232 14601006 15484299 16578720 17913035 19513433
57030 19513433 21407141 23623881 26191096 29130609 32460185 36189235 40303298 44751465
57022 44751465 49446642 54262373 59012298 63439191 67255050 70222627 72214260 73204946
$$ packed form
57088G835529J22960J25466J27615J30728J34678J38438J41433J43112J42335
57079I042294J38842J34354J30712J27815J25024J23238J23742J25936J28355
57070A0200312J31163J35666J41744J47519J51041J50917J46218J37486J27021
57061A1469087J16547J05482R3004Q0413O9385N9137M7645L4737K1805R483k000
57050A2104725j1080j5932j6647j4224q432J422J5116L3556O0756J00931J55025
57039A2405216K23097L08427M15721N46771P01774Q83293J094421J334315J600398
57030A9513433J893708K216740K567215K939513L329576L729050M114063M448167
57022D4751465M695177M815731M749925M426893L815859K967577J991633R90686
$$ plain form
57014 73204946 73226943 72339916 70630117 68213220 65225420 61812479 58124005 54304888
57006 54304888 50480182 46744771 43166645 39796223 36669864 33807502 31212166 28874528
56998 28874528 26779325 24910468 23253582 21795479 20521739 19415431 18458293 17632362
56990 17632362 16920298 16305473 15772868 15309520 14903484 14543076 14218061 13921354 13648895
56981 13648895 13398083 13167059 12955126 12762761 12590418 12437197 12300396 12176046 12060117
56972 12060117 11949901 11844514 11743833 11646897 11551440 11454779 11354807 11250378 11141667 11030582
56962 11030582 10920226 10813025 10709167 10607117 10505635 10404998 10306334 10210250 10116421 10024239
56952 10024239 9933228 9842644 9751078 9657006 9559652 9458849 9354134 9244772 9130923 9013685
$$ packed form
57014G3204946K1997q87027j709799k416897k987800l412941l688474l819117
57006E4304888l824706l735411l578126l370422l126359k862362k595336k337638
56998B8874528k095203j868857j656886j458103j273740j106308r57138q25931
56990A7632362p12064o14825n32605m63348m06036l60408l25015k96707k72459
56981A3648895k50812k31024k11933j92365j72343j53221j36801j24350j15929
56972A2060117j10216j05387j00681r6936r5457r6661r9972j04429j08711j11085
56962A1030582j10356j07201j03858j02050j01482j00637r8664r6084r3829r2182
56952A0024239r1011r0584r1566r4072r7354j00803j04715j09362j13849j17238
$$ plain form
56942 9013685 8893259 8768428 8639753 8512133 8390159 8268418 8128103 7946281 7709508
56933 7709508 7418740 7083668 6715864 6327360 5931656 5542254 5169448 4818902 4492666
56924 4492666 4190876 3913138 3659168 3428152 3217433 3022659 2839896 2667317 2504704
56915 2504704 2352012 2208939 2075224 1950599 1834631 1726967 1627450 1535789 1451562 1374792
56905 1374792 1305974 1245164 1191579 1144417 1103431 1068261 1037863 1011251 988301 969104 952748
56894 952748 937206 920234 900112 876078 848638 819253 789299 759551 730745 703959 679848
56883 679848 658022 637918 620021 605629 595474 588952 584711 581801 580424 581662 586360 594435 605572
56870 605572 619940 636973 653487 664471 666555 659894 646354 627282 603923 578643 553972 530758
$$ packed form
56942I013685j20426j24831j28675j27620j21974j21741j40315j81822k36773
56933G709508k90768l35072l67804l88504l95704l89402l72806l50546l26236
56924D492666l01790k77738k53970k31016k10719j94774j82763j72579j62613
56915B504704j52692j43073j33715j24625j15968j07664r9517r1661q4227p6770
56905A374792o8818o0810n3585m7162m0986l5170l0398k6612k2950j9197j6356
56894I52748j5542j6972k0122k4034k7440k9385k9954k9748k8806k6786k4111
56883F79848k1826k0104j7897j4392j0155o522m241k910j377J238M698Q075J1137
56870F05572J4368J7033J6514J0984K084o661j3540j9072k3359k5280k4671k3214
$$ plain form
56858 530758 508438 486854 466750 448773 433030 419565 408421 399236 391463 384900 379534 375107
56846 375107 371367 368400 366119 363855 361184 358776 357729 358322 360094 362743 366254 370470 375295 381069
56832 381069 388087 396109 404963 415222 427531 441689 457171 474010 492132 510046 525134 535154
56820 535154 539013 536714 529620 520352 511266 503070 495636 489640 486266 485701 487274 491004 497732 507744
56806 507744 520524 536044 555128 578341 605648 637492 674984 718255 764988 810740 850157
56795 850157 878129 891272 889416 875574 854162 829179 803492 778846 756163 736289 720429 709583
56783 709583 703966 703673 709550 722533 742504 768873 802104 843496 893449 951023 1014939 1083207
56771 1083207 1151001 1210166 1252103 1271357 1266918 1241551 1200582 1150305 1096140 1041753 989444
$$ packed form
56858E30758k2320k1584k0104j7977j5743j3465j1144r185p773o563n366m427
56846C75107l740k967k281k264k671k408j047N93J772K649L511M216M825N774
56832C81069P018Q022Q854J0259J2309J4158J5482J6839J8122J7914J5088J0020
56820E35154L859k299p094r268r086q196p434n996l374n65J573L730O728J0012
56806E07744J2780J5520J9084K3213K7307L1844L7492M3271M6733M5752L9417
56795H50157K7972J3143j856j3842k1412k4983k5687k4646k2683j9874j5860j0846
56783G09583n617k93N877J2983J9971K6369L3231M1392M9953N7574O3916O8268
56771A083207O7794N9165M1937J9254m439k5367m0969n0277n4165n4387n2309
$$ plain form
56760 989444 940754 896689 858210 826695 803291 787762 778794 775663 778882 789072 806081 829503
56748 829503 859255 895083 935688 978172 1017579 1047191 1060720 1055359 1032743 997167 953359 905499
56736 905499 856805 809220 763946 722381 685883 654674 628026 605740 588540 576799 569988 567643
56724 567643 569815 576104 585473 597582 613170 632024 651223 666178 672988 669507 655328 631976
56712 631976 602712 571037 539142 507962 478146 450347 424898 401827 381023 362118 344561
56701 344561 328164 313251 300035 288302 277972 269422 262829 257564 252670 247719 243038 239301 236899
56688 236899 235272 232961 228942 223928 219694 217054 215295 213527 211585 209388 206571 203286 200441 198494
56674 198494 196751 194416 191665 189088 186730 184300 181801 179369 176956 174557 172256 169792 166712 163287
$$ packed form
56760I89444m8690m4065l8479l1515k3404j5529q968l131L219J0190J7009K3422
56748H29503K9752L5828M0605M2484L9407K9612J3529n361k2616l5576m3808m7860
56736I05499m8694m7585m5274m1565l6498l1209k6648k2286j7200j1741o811k345
56724E67643K172O289R369J2109J5588J8854J9199J4955O810l481j4179k3352
56712F31976k9264l1675l1895l1180k9816k7799k5449k3071k0804j8905j7557
56701C44561j6397j4913j3216j1733j0330q550o593n265m894m951m681l737k402
56688B36899j627k311m019n014m234k640j759j768j942k197k817l285k845j947
56674A98494j743k335k751k577k358k430k499k432k413k399k301k464l080l425
$$ plain form
56660 163287 160568 159111 158368 157689 157099 156638 155790 154291 152787 152011 151888 152029 152423 152975 153012 152027 150442
56643 150442 149082 148331 148272 148961 149986 150425 149972 149505 149872 150673 151015 150920 151162 152096 153450 154974 156556 157859
56625 157859 158534 158703 158899 159661 161343 163860 166369 167789 168016 168093 168873 170172 171531 172924 174127 174262
56609 174262 172809 170519 168550 167144 165763 164016 161848 159313 156780 154842 153467 151813 149425 146957
56595 146957 145112 143566 141664 139557 137892 136899 136565 137171 138935 141565 144759 148555 152638 156050 158375
56580 158375 160465 163116 165728 167195 167508 167478 167411 167080 166527 165846 164608 162486 160131 158434 157238 155666
56564 155666 153461 151098 148883 146835 145230 144397 144163 144125 144162 144115 143507 142320 141471 141647 142239 142358 142277 142737
56546 142737 143393 143214 142133 141045 140316 139473 138347 137477 137330 137966 139406 141538 143705 145167 145846 146027
$$ packed form
56660A63287k719j457p43o79n90m61q48j499j504p76j23J41L94N52L7r85j585
56643A50442j360p51n9O89J025M39m53m67L67Q01L42r5K42R34J354J524J582J303
56625A57859O75J69J96P62J682K517K509J420K27P7P80J299J359J393J203J35
56609A74262j453k290j969j406j381j747k168k535k533j938j375j654k388k468
56595A46957j845j546j902k107j665r93l34O06J764K630L194L796M083L412K325
56580A58375K090K651K612J467L13l0o7l31n53o81j238k122k355j697j196j572
56564A55666k205k363k215k048j605q33k34l8L7m7o08j187q49J76N92J19q1M60
56546A42737O56j79j081j088p29q43j126q70j47O36J440K132K167J462O79J81
$$ plain form
56530 146027 145653 144635 143491 142843 142671 142815 143677 145478 147356 148360 148882 149901 151213 151762 151545 151797
56514 151797 153227 155336 157609 160231 163329 166454 169073 170951 172047 172737 173979 176391 179309 181609
56500 181609 183349 185729 189567 194608 200111 205209 208988 211293 213320 216435 220536 224509 227937 231201
56486 231201 234117 235846 236197 235794 234864 233055 230550 228176 226232 224219 221954 219827 217767 215030 211378
56471 211378 207545 204235 201447 199040 197137 195660 194190 192553 190985 189619 188322 187020 185591 183634
56457 183634 180987 178293 176367 175238 174518 174295 174710 175084 174571 173433 172588 172103 171289 170083 169185 168858 168761
56440 168761 168830 169234 169539 169129 168439 168613 169847 171151 171678 171323 170153 168386 166869 166413 166745 167143 167811
56423 167811 169394 171520 173243 174721 176829 179266 180739 181121 181752 183366 185323 187147 189236 191643 193666
$$ packed form
56530A46027l74j018j144o48j72J44Q62J801J878J004N22J019J312N49k17K52
56514A51797J430K109K273K622L098L125K619J878J096O90J242K412K918K300
56500A81609J740K380L838N041N503N098L779K305K027L115M101L973L428L264
56486B31201K916J729L51m03r30j809k505k374j944k013k265k127k060k737l652
56471B11378l833l310k788k407j903j477j470j637j568j366j297j302j429j957
56457A83634k647k694j926j129p20k23M15L74n13j138q45m85q14j206q98l27r7
56440A68761O9M04L05m10o90J74J234J304N27l55j170j767j517m56L32L98O68
56423A67811J583K126J723J478K108K437J473L82O31J614J957J824K089K407K023
$$ plain form
56408 193666 195129 196755 198842 200845 202557 204434 206463 208037 209201 210731 212811 214947 217250 220218
56394 220218 223148 224559 224532 224885 226510 228288 229196 229750 230584 231247 231243 230870 230294 229160 227793 227341 228023 228657
56376 228657 228557 228401 228576 228251 226940 225445 224360 223143 221575 220642 220901 221333 220828 219579 218103 216203
56360 216203 213846 211764 210197 208316 205797 203604 202267 200871 198815 197106 196621 196458 195429 193996 193262
56345 193262 193120 192826 192523 192795 193425 193883 194396 195421 196627 197367 197614 197633 197383 196923 196611 196362 195611 194527
56327 194527 194110 194507 194613 194079 194302 196365 199366 201894 203956 206211 208503 210417 212332 214737 217359
56312 217359 219967 223069 226851 230494 233516 236668 240506 244207 246934 249203 251702 253901 255041 255523
56298 255523 256156 256994 257978 259621 261921 263714 264260 264485 265495 266933 267943 268694 269801 271291 273194 276055
$$ packed form
56408A93666J463J626K087K003J712J877K029J574J164J530K080K136K303K968
56394B20218K930J411k7L53J625J778R08N54Q34O63ml73n76j134j367m52O82O34
56376B28657j00j56J75l25j311j495j085j217j568r33K59M32n05j249j476j900
56360B16203k357k082j567j881k519k193j337j396k056j709m85j63j029j433p34
56345A93262j42k94l03K72O30M58N13J025J206P40K47J9k50m60l12k49p51j084
56327A94527m17L97J06n34K23K063L001K528K062K255K292J914J915K405K622
56312B17359K608L102L782L643L022L152L838L701K727K269K499K199J140M82
56298B55523O33Q38R84J643K300J793N46K25J010J438J010P51J107J490J903K861
$$ plain form
56282 276055 279795 283218 285719 288239 291523 294814 297443 300241 304062 308371 312621 317543 323643 329904
56268 329904 335545 341551 348807 356221 362474 368221 374717 381640 388231 395266 403831 413186 421831 429693
56254 429693 437427 444715 451185 457861 465644 473351 479246 483535 487434 490938 493636 496537 500744 505293
56240 505293 508614 511262 514847 519142 522691 525591 529175 533530 537780 542432 549066 557976 568247 579751
56226 579751 592884 606862 620568 634770 651285 670229 690215 710948 733462 758142 784631
56215 784631 813334 844839 878285 912601 949013 990040 1036245 1086251 1139680 1197686 1260783
56204 1260783 1328644 1402064 1482704 1570699 1664746 1764741 1872154 1987608 2110102 2238805
56194 2238805 2373562 2513422 2656603 2802025 2948956 3095029 3236463 3370270 3494473
$$ packed form
56282B76055L740L423K501K520L284L291K629K798L821M309M250M922O100O261
56268C29904N641O006P256P414O253N747O496O923O591P035Q565R355Q645P862
56254D29693P734P288O470O676P783P707N895M289L899L504K698K901M207M549
56240E05293L321K648L585M295L549K900L584M355M250M652O634Q910J0271J1504
56226E79751J3133J3978J3706J4202J6515J8944J9986K0733K2514K4680K6489
56215G84631K8703L1505L3446L4316L6412M1027M6205N0006N3429N8006O3097
56204A260783O7861P3420Q0640Q7995R4047R9995J07413J15454J22494J28703
56194B238805J34757J39860J43181J45422J46931J46073J41434J33807J24203
$$ plain form
56185 3494473 3606291 3702183 3779876 3838547 3877202 3894935 3892871 3873874 3840138 3792781 3733664
56174 3733664 3665626 3590784 3510345 3425979 3339546 3251504 3161342 3069445 2976855 2883577 2789036
56163 2789036 2693819 2598997 2504160 2408206 2311718 2216420 2122660 2029652 1937859 1848784 1762708
56152 1762708 1678945 1598085 1521646 1449794 1381784 1318323 1260961 1209339 1161553 1117042 1076576
56141 1076576 1039638 1004560 971275 941278 914761 890337 867571 847271 829313 812741 797867
56130 797867 785630 775071 764227 753342 744254 736815 729147 721378 715701 712383 709146 705130 702198
56117 702198 701578 702304 703821 707162 712585 718808 725448 733634 743486 753618 763746 775076 787540 799369
56103 799369 810064 821074 832916 844251 854367 863947 873028 880932 888498 897488 907517 916648 925308
$$ packed form
56185C494473J11818R5892P7693N8671L8655J7733k064j8997l3736m7357n9117
56174C733664o8038p4842q0439q4366q6433q8042r0162r1897r2590r3278r4541
56163B789036r5217r4822r4837r5954r6488r5298r3760r3008r1793q9075q6076
56152A762708q3763q0860p6439p1852o8010o3461n7362n1622m7786m4511m0466
56141A076576l6938l5078l3285k9997k6517k4424k2766k0300j7958j6572j4874
56130G97867j2237j0559j0844j0885r088p439p668p769n677l318l237m016k932
56117G02198o20P26J517L341N423O223O640Q186R852J0132J0128J1330J2464J1829
56103G99369J0695J1010J1842J1335J0116R580R081P904P566Q990J0029R131Q660
$$ plain form
56090 925308 936287 950458 965950 982238 1001594 1025682 1054058 1086936 1126031 1171683 1222348
56079 1222348 1277897 1340337 1410477 1487124 1570193 1661014 1758476 1858152 1956120 2050403 2138245
56068 2138245 2216136 2283923 2345205 2402347 2454347 2500273 2540602 2573936 2596531 2606932 2607550 2600413
56056 2600413 2585175 2562590 2535628 2505110 2467896 2421181 2365023 2299388 2223069 2137597 2048366
56045 2048366 1959800 1872870 1788858 1711338 1642390 1580761 1525735 1478889 1440141 1406235 1375295
56034 1375295 1348847 1327341 1307889 1288679 1271391 1256925 1243041 1228599 1215862 1206007 1196618 1186247
56022 1186247 1177266 1171531 1167369 1163367 1160938 1160593 1160109 1159031 1160517 1165969 1172386 1177787 1184486 1194069
56008 1194069 1203995 1212498 1222094 1234827 1248685 1262049 1276989 1294736 1312657 1329119 1346527 1366095
$$ packed form
56090I25308J0979J4171J5492J6288J9356K4088K8376L2878L9095M5652N0665
56079A222348N5549O2440P0140P6647Q3069R0821R7462R9676R7968R4283Q7842
56068B138245P7891O7787O1282N7142N2000M5926M0329L3334K2595J0401O18p137
56056B600413j5238k2585k6962l0518l7214m6715n6158o5635p6319q5472q9231
56045B048366q8566q6930q4012p7520o8948o1629n5026m6846l8748l3906l0940
56034A375295k6448k1506j9452j9210j7288j4466j3884j4442j2737r855r389j0371
56022A186247q981n735m162m002k429l45m84j078J486N452O417N401O699R583
56008A194069R926Q503R596J2733J3858J3364J4940J7747J7921J6462J7408J9568
$$ plain form
55996 1366095 1384768 1400949 1418026 1438335 1458921 1477425 1496807 1519860 1544345 1568069 1593527
55985 1593527 1622749 1652802 1681239 1710914 1744491 1779378 1813179 1848902 1889526 1932413 1974332
55974 1974332 2016942 2062146 2107265 2150227 2194385 2242797 2292991 2342648 2394897 2452569 2512943
55963 2512943 2573781 2638613 2710252 2785334 2861365 2942752 3033389 3129677 3227568 3329987 3440499
55952 3440499 3556455 3675629 3802778 3942041 4089726 4242173 4403564 4578050 4761808
55943 4761808 4951448 5152655 5371433 5604347 5846735 6102887 6378591 6671485 6978758
55934 6978758 7306408 7660578 8037855 8434538 8856897 9311551 9794811 10302778 10842185
55925 10842185 11419398 12029176 12667333 13343969 14070777 14846746 15670869 16556747 17518719
$$ packed form
55996A366095J8673J6181J7077K0309K0586J8504J9382K3053K4485K3724K5458
55985A593527K9222L0053K8437K9675L3577L4887L3801L5723M0624M2887M1919
55974A974332M2610M5204M5119M2962M4158M8412N0194M9657N2249N7672O0374
55963B512943O0838O4832P1639P5082P6031Q1387R0637R6288R7891J02419J10512
55952C440499J15956J19174J27149J39263J47685J52447J61391J74486J83758
55943D761808J89640K01207K18778K32914K42388K56152K75704K92894L07273
55934F978758L27650L54170L77277L96683M22359M54654M83260N07967N39407
55925A0842185N77213O09778O38157O76636P26808P75969Q24123Q85878R61972
$$ plain form
55916 17518719 18555941 19666866 20865977 22167748 23568150 25062568 26668855 28412799
55908 28412799 30307364 32370101 34644672 37179052 39998893 43130083 46630591 50572597
55900 50572597 55016216 60035118 65743594 72258543 79660645 88037960 97539269 108336724
55892 108336724 120578444 134443837 150193057 168066846 188183464 210608574 235298586
55885 235298586 261476909 286812449 307531851 319929424 322179287 314914345 300334374
55878 300334374 280950718 258929878 235984279 213355506 191800942 171717569 153327569
55871 153327569 136748667 121978225 108926183 97479906 87505336 78817494 71212474
55864 71212474 64529964 58655699 53481922 48904655 44848263 41256107 38062049 35198266
$$ packed form
55916A7518719J037222J110925J199111J301771J400402J494418J606287J743944
55908B8412799J894565K062737K274571K534380K819841L131190L500508L942006
55900E0572597M443619N018902N708476O514949P402102Q377315R501309J0797455
55892A08336724J2241720J3865393J5749220J7873789K0116618K2425110K4690012
55885B35298586K6178323K5335540K0719402J2397573K249863p264942j4579971
55878C00334374j9383656k2020840k2945599k2628773k1554564k0083373j8390000
55871A53327569j6578902j4770442j3052042j1446277r974570q687842p605020
55864G1212474o682510n874265n173777m577267m056392l592156l194058k863783
$$ plain form
55856 35198266 32622278 30309211 28224411 26327317 24594027 23012299 21560797 20214977
55848 20214977 18967118 17819805 16764766 15786424 14879991 14047336 13280107 12564369 11897068
55839 11897068 11281451 10711106 10174458 9670228 9202857 8766997 8351710 7955962 7585289
55830 7585289 7236962 6902912 6583995 6287256 6011644 5749657 5500493 5268773 5052666
55821 5052666 4845782 4648772 4466983 4298510 4136117 3979199 3832564 3694980 3560028
55812 3560028 3427043 3300662 3180553 3061731 2944102 2832015 2725329 2620112 2517129
55803 2517129 2420588 2329600 2239678 2151519 2069689 1993902 1920311 1850110 1787935 1732570 1677867
55792 1677867 1622299 1569363 1519217 1468259 1416659 1368289 1323349 1278687 1235144 1197096 1164858
$$ packed form
55856C5198266k575988k313067k084800j897094j733290j581728j451502j345820
55848B0214977j247859j147313j055039r78342r06433q32655p67229p15738o67301
55839A1897068o15617n70345n36648n04230m67371m35860m15287l95748l70673
55830G585289l48327l34050l18917k96739k75612k61987k49164k31720k16107
55821E052666k06884j97010j81789j68473j62393j56918j46635j37584j34952
55812C560028j32985j26381j20109j18822j17629j12087j06686j05217j02983
55803B517129r6541r0988q9922q8159q1830p5787p3591p0201o2175n5365n4703
55792A677867n5568n2936n0146n0958n1600m8370m4940m4662m3543l8048l2238
$$ plain form
55781 1164858 1134758 1106365 1082519 1062505 1042363 1021807 1003884 987998 970223 950413 932175
55770 932175 915816 898056 878763 861290 845894 829275 810913 793657 777735 760275 741022
55759 741022 722656 705392 687028 668314 652378 638863 624631 610163 599168 591753 584166 575544
55747 575544 568803 564511 560048 555438 553879 555621 557176 557548 559463 563415 566154 566314 566057 565931 563409
55732 563409 557844 551714 545611 537004 525387 513755 503535 492761 480614 469178 459280 449171
55720 449171 438743 430677 425902 422097 417967 414867 412833 409212 402721 395046 387224 378294 368666 360859
55706 360859 355600 350943 346386 344127 345114 347479 349822 352262 353382 350200 342480 333414 324924 315902
55692 315902 305951 296853 289089 280764 271350 262897 256332 250237 244360 240458 238386 235253 229994 225071
$$ packed form
55781A164858l0100k8393k3846k0014k0142k0556j7923j5886j7775j9810j8238
55770I32175j6359j7760j9293j7473j5396j6619j8362j7256j5922j7460j9253
55759G41022j8366j7264j8364j8714j5936j3515j4232j4468j0995p415p587q622
55747E75544o741m292m463m610j559J742J555L72J915L952K739J60k57j26k522
55732E63409n565o130o103q607j1617j1632j0220j0774j2147j1436r898j0109
55720D49171j0428q066m775l805m130l100k034l621o491p675p822q930r628p807
55706C60859n259m657m557k259R87K365K343K440J120l182p720r066q490r022
55692C15902r951r098p764q325r414q453o565o095n877l902k072l133n259m923
$$ plain form
55678 225071 222041 219179 215227 211927 210886 211139 211607 212944 215243 216879 217186 217430 217774 216309 212522
55663 212522 208603 205859 202845 198547 194347 191196 187866 183701 180261 178534 177191 175256 173872 173822 173820
55648 173820 172851 171812 171550 171662 172431 175346 180417 185461 189187 192407 195266 196180 194774 193001 191976
55633 191976 190557 188396 187492 189086 191789 194294 197262 200980 203895 205205 206318 208106 209271 209055 209006
55618 209006 210321 211881 212594 213261 214451 214918 213887 212618 212071 211282 209666 208631 209245 210432 211040 211556
55602 211556 212358 212572 212194 212964 215572 218258 219760 221310 224100 227106 229106 230593 232008 232298 230923
55587 230923 229083 227338 224275 219187 213752 209346 205042 199914 194911 190556 185270 178058 170576 164453
55573 164453 158746 152189 145720 140530 135663 129885 124097 119649 115998 112132 108531 105614 102079 97007
$$ packed form
55678B25071l030k862l952l300j041K53M68J337K299J636L07K44L44j465l787
55663B12522l919k744l014m298m200l151l330m165l440j727j343j935j384n0k
55648A73820r69j039k62J12P69K915N071N044L726L220K859R14j406j773j025
55633A91976j419k161r04J594K703K505K968L718K915J310J113J788J165k16m9
55618B09006J315J560P13O67J190M67j031j269n47p89j616j035O14J187O08N16
55602B11556Q02K14l78P70K608K686J502J550K790L006K000J487J415K90j375
55587B30923j840j745l063n088n435m406m304n128n003m355n286p212p482o123
55573A64453n707o557o469n190m867n778n788m448l651l866l601k917l535n072
$$ plain form
55559 97007 91872 88390 86010 83581 81679 81084 80707 79316 77750 77176 76752 75303 73743 73490 73837 73283
55543 73283 72173 71714 71501 70251 68063 65924 64013 62288 61612 62440 63562 63868 64099 65093 65790 64881 62982
55526 62982 61265 59450 57211 55951 56833 58396 58549 57747 57838 58870 59438 59255 59016 58520 57174 55689 55226
55509 55226 55558 55922 56746 58619 60570 61443 61971 63373 64931 65199 64706 65095 66256 66669 66066 65537 65434
55492 65434 65238 65123 65621 66129 65661 64683 64403 64649 64285 63298 62719 62884 63500 64923 67666 71077 74124 77008
55474 77008 80383 83630 85556 86281 86827 87405 87772 88550 90517 93126 95379 97509 100185 102838 104589 106093
55458 106093 108564 111518 113335 113578 112996 111772 109533 106578 103407 99549 94463 88964 84042 79009 72708
55443 72708 65813 60035 55575 51320 47012 43328 40241 37245 34769 33559 33115 32463 31822 31687 31025 28530
$$ packed form
55559I7007n135l482k380k429j902n95l77j391j566n74m24j449j560k53L47n54
55543G3283j110m59k13j250k188k139j911j725o76Q28J122L06K31R94O97r09j899
55526F2982j717j815k239j260Q82J563J53q02R1J032N68j83k39m96j346j485m63
55509E5226L32L64Q24J873J951Q73N28J402J558K68m93L89J161M13o03n29j03
55492F5434j96j15M98N08m68r78k80K46l64r87n79J65O16J423K743L411L047K884
55474G7008L375L247J926P25N46N78L67P78J967K609K253K130K676K653J751J504
55458A06093K471K954J817K43n82j224k239k955l171l858n086n499m922n033o301
55443G2708o895n778m460m255m308l684l087k996k476j210m44o52o41j35o62k495
$$ plain form
55427 28530 25047 22620 21623 20986 20618 21206 22031 21579 20179 19650 20245 20361 19369 18395 17977 17166 15422 13396
55409 13396 11454 9260 7193 6314 6567 6709 6344 6335 6992 7558 7781 8279 9084 9445 9296 9325 9463 8977 8223
55390 8223 8511 9973 11276 11737 11997 12336 12146 11491 11452 12299 12898 12554 11992 11927 11975 11561 10799 10072 9725 10326
55370 10326 12059 13887 14529 14254 14345 14973 15184 14919 15245 16423 17507 18111 18858 19729 19737 18760 18059 18405 19106
55351 19106 19388 19289 18783 17578 16282 16218 17457 18436 18093 17050 16153 15335 14588 14617 15652 16763 17104 16869
55333 16869 16435 15637 14501 13616 13207 12763 12061 11624 11786 12239 12821 13726 14679 14992 14723 14631 14674 13802 11637
55314 11637 9168 7296 5829 4445 3495 3255 3305 3201 2970 2590 1888 1253 1539 2945 4778 6505 8128
55297 8128 9456 10042 10026 10059 10265 10204 9841 9437 8661 7080 5506 5401 6820 8365 9247 9941 10632 10682 10006
$$ packed form
55427B8530l483k427r97o37l68N88Q25m52j400n29N95J16r92r74m18q11j744k026
55409A3396j942k194k067q79K53J42l65rO57N66K23M98Q05L61j49K9J38m86p54
55390H223K88J462J303M61K60L39j90o55l9Q47N99l44n62o5M8m14p62p27l47O01
55370A0326J733J828O42k75R1O28K11k65L26J178J084O04P47Q71Qr77p01L46P01
55351A9106K82r9n06j205j296o4J239R79l43j043q97q18p47K9J035J111L41k35
55333A6869m34p98j136q85m09m44p02m37J62M53N82R05R53L13k69r2M3q72k165
55314A1637k469j872j467j384r50k40N0j04k31l80p02o35K86J406J833J727J623
55297H128J328N86j6L3K06o1l63m04p76j581j574j05J419J545Q82O94O91N0o76
$$ plain form
55278 10006 9442 9267 8851 8200 8282 9257 9908 9518 8838 8504 7961 6819 5880 5829 6050 5686 4875 4061 3083
55259 3083 1797 768 470 460 68 -650 -1122 -879 241 1844 2838 2453 1442 1326 2364 3419 3821 4095
55241 4095 4693 5320 5742 5925 5267 3140 392 -1254 -1540 -1765 -2349 -2232 -1111 -167 284 1785 5169 8834
55223 8834 10921 11706 12419 13102 13081 12442 11625 10463 8852 7477 6780 6140 5070 4217 4171 4324 4024 3829
55205 3829 4439 5329 5699 5897 6701 7869 8577 8683 8559 8295 7993 8157 8940 9677 9991 10451 11310 11605 10607
55186 10607 9250 8875 9270 9170 8103 6622 5224 4121 3625 3791 4097 4274 4941 6614 8679 10152
55170 10152 10888 11234 11174 10652 10082 9673 8882 7390 6016 5796 6722 8155 9819 11528 12646 12796 12600
55153 12600 12907 13737 14667 15593 16443 16794 16507 16059 15598 14588 13068 12264 12968 14230 14751 14654 14749 14854 14200
$$ packed form
55278A0006n64j75m16o51Q2R75O51l90o80l34n43j142r39n1K21l64q11q14r78
55259C083j286G68k98j0F8f50m72K43B41J603R94l85j011j16J038J055M02K74
55241D095N98O27M22J83o58k127C92a254k86k25n84J17a111a67B84J501L384L665
55223H834K087P85P13O83k1o39q17j162j611j375o97o40j070q53m6J53l00j95
55205C829O10Q90L70J98Q04J168P08J06j24k64l02J64P83P37L14M60Q59K95r98
55186A0607j357l75L95j00j067j481j398j103m96J66L06J77O67J673K065J473
55170A0152P36L46o0n22n70m09p91j492j374k20R26J433J664J709J118J50j96
55153A2600L07Q30R30R26Q50L51k87m48m61j010j520q04P04J262N21r7R5J05o54
$$ plain form
55134 14200 12974 12157 12130 12480 12901 13425 14097 15112 16759 18578 19301 18400 16899 15883 15113 14028 13068
55117 13068 12817 12785 12380 12224 13037 14010 13858 12977 12881 13839 14706 14925 15096 15515 15630 15217 14827 14739 14493 13752
55097 13752 12849 12269 12178 12528 13071 13421 13594 14144 15179 15740 14950 13340 12194 11980 12279 12810 13534 14104
55079 14104 14240 14396 15135 16080 16445 16282 16239 16297 15817 14728 13746 13436 13820 14735 15846 16497 16364 16071 16490
55060 16490 17730 19437 21575 24026 25983 26789 27060 27884 29158 29794 29371 28513 27784 27293 27317 28258 29840
55043 29840 31172 31690 31420 30496 29134 27943 27503 27767 28459 29645 31250 32501 32796 32723 33248 34256 34899
55026 34899 35013 35087 35148 34848 34503 34901 36118 37479 38593 39433 39620 38744 37297 36261 35826 35533 35479 36216
55008 36216 37548 38697 39643 41054 42755 43566 42975 41844 41110 40810 40775 41212 42045 42480 41867 40520 39289
$$ packed form
55134A4200j226q17k7L50M21N24O72J015J647J819P23r01j501j016p70j085r60
55117A3068k51l2m05j56Q13R73j52q81r6R58Q67K19J71M19J15m13l90q8k46p41
55097A3752r03n80r1L50N43L50J73N50J035N61p90j610j146k14K99N31P24N70
55079A4104J36J56P39R45L65j63m3N8m80j089r82l10L84R15J111O51j33k93M19
55060A6490J240J707K138K451J957Q06K71Q24J274O36m23q58p29m91K4R41J582
55043B9840J332N18k70r24j362j191m40K64O92J186J605J251K95p3N25J008O43
55026C4899J14P4O1l00l45L98J217J361J114Q40J87q76j447j036m35k93n4P37
55008C6216J332J149R46J411J701Q11n91j131p34l00l5M37Q33M35o13j347j231
$$ plain form
54991 39289 38752 38953 39467 39582 38902 37839 37106 36836 36707 36710 37038 37409 37309 36915 37000 37882 39139 40360 41483
54972 41483 42405 42943 43166 43187 42776 41822 40977 41078 42069 43200 44037 44546 44491 43734 42962 43128 44190 45290 46043
54953 46043 46733 47332 47367 46802 46144 45621 45066 44593 44541 44799 45024 45372 46143 46909 46995 46685 46795 47200 46916 45663
54933 45663 44160 42820 41396 40079 39712 40565 41937 43182 44156 44566 44047 43164 43130 44228 45541 46549
54917 46549 47803 49584 51117 51699 51642 51481 51209 50859 50960 51771 52817 53690 54583 55587 56251 56414 56752 57987
54899 57987 60184 63181 66999 71344 75510 79298 83436 88575 94507 100778 107411 114561 122046 129711
54885 129711 137778 146439 155483 164505 172930 179794 184232 186407 187189 186727 184210 179204 172244 163810 153862
54870 153862 143012 133035 125320 119448 114082 108663 103525 98962 94999 91735 89221 87236 85648 84633
$$ packed form
54991C9289n37K01N14J15o80j063p33k70j29LL28L71j00l94Q5Q82J257J221J123
54972D1483R22N38K23K1m11r54q45J01R91J131Q37N09n5p57p72J66J062J100P53
54953D6043O90N99L5n65o58n23n55m73n2K58K25L48P71P66Q6l10J10M05k84j253
54933D5663j503j340j424j317l67Q53J372J245R74M10n19q83l4J098J313J008
54917D6549J254J781J533N82n7j61k72l50J01Q11J046Q73Q93J004O64J63L38J235
54899E7987K197K997L818M345M166L788M138N139N932O271O633P150P485P665
54885A29711Q067Q661R044R022Q425O864M438K175P82m62k517n006o960q434r948
54870A53862j0850r977p715n872n366n419n138m563l963l264k514j985j588j015
$$ plain form
54856 84633 84197 83944 83700 83896 84894 86469 88353 90766 93917 97539 101473 106242 112448 119919 127948 136047
54840 136047 143992 151472 158185 164049 168871 172021 172846 171281 167775 162768 156490 149117 140981 132689
54826 132689 124960 118070 111613 105217 99325 94643 90945 87148 82694 78121 74194 71165 69049 67831
54812 67831 67080 66088 64689 63333 62187 60888 59439 58489 58303 58161 57305 55909 54653 53913 53719 53917 53928
54795 53928 52950 50867 48477 46508 44951 43692 43068 43279 43800 43911 43362 42133 40146 37737 35880 35283
54779 35283 35581 35852 35669 35243 34980 35300 36556 38641 40841 42325 42677 41990 40825 40077 40323 41200 42007
54762 42007 42837 44397 46675 48761 50271 51938 54220 56249 56903 56284 55444 55159 55603 56776 58562 60631
54746 60631 62738 64931 67223 69521 72081 75512 80002 85062 90295 95775 101406 106704 111663 117104
$$ packed form
54856H4633m36k53k44J96R98J575J884K413L151L622L934M769O206P471Q029Q099
54840A36047P945P480O713N864M822L150Q25j565l506n007o278p373q136q292
54826A32689p729o890o457o396n892m682l698l797m454m573l927l029k116j218
54812F7831p51r92j399j356j146j299j449r50j86j42q56j396j256p40j94J98J1
54795E3928r78k083k390j969j557j259o24K11N21J11n49j229j987k409j857n97
54779C5283K98K71j83m26k63L20J256K085K200J484L52o87j165p48K46Q77Q07
54762D2007Q30J560K278K086J510J667K282K029O54o19q40k85M44J173J786K069
54746F0631K107K193K292K298K560L431M490N060N233N480N631N298M959N441
$$ plain form
54732 117104 123644 130953 138599 146859 155963 165189 173564 180998 187844 193704 197482 198542 197127 193729
54718 193729 188609 181975 174155 165621 157049 149317 143141 138737 135775 133496 130994 127896 124824 122762
54704 122762 121997 122146 122991 124485 126036 126848 127239 128625 131819 136291 141514 147918 155822 164402 172675
54689 172675 180884 190000 200342 211472 223017 234743 245980 255616 262594 266166 266051 262697 257034
54676 257034 249635 240497 229695 217727 205005 191829 179061 167948 158800 150673 142870 135877 130223
54663 130223 125342 120379 115433 111134 107554 104248 100896 97305 93342 89522 87044 86538 87305 88267 89041
54648 89041 89452 88936 87349 85687 85050 85344 85808 86304 87171 88299 89246 89924 90410 90448 89884 89181 88816 88588
54630 88588 88225 88126 88737 89713 90476 91186 92335 93825 95165 96198 96930 97204 97235 97884 99562 101420 102429
$$ packed form
54732A17104O540P309P646Q260R104R226Q375P434O846N860L778J060j415l398
54718A93729n120o634p820q534q572p732o176m404k962k279k502l098l072k062
54704A22762p65J49Q45J494J551Q12L91J386L194M472N223O404P904Q580Q273
54689A72675Q209R116J0342J1130J1545J1726J1237R636O978L572j15l354n663
54676B57034p399r138j0802j1968j2722j3176j2768j1113r148q127p803o993n654
54663A30223m881m963m946m299l580l306l352l591l963l820k478n06P67R62P74
54648H9041M11n16j587j662o37K94M64M96Q67J128R47O78M86L8n64p03l65k28
54630H8588l63r9O11R76P63P10J149J490J340J033P32K74L1O49J678J858J009
$$ plain form
54613 102429 102699 102910 103211 103658 105029 107963 111712 114969 117611 120565 124282 128464 132942 137638 141889
54598 141889 144974 147197 149432 151799 153894 156077 159259 163366 167149 169656 171040 171884 172632 173741 175587
54583 175587 178160 181486 186121 192434 199675 206715 213543 221077 229551 238019 245402 251115 254727 255936
54569 255936 254921 251973 246867 239441 230606 221814 213590 205436 197074 188886 181151 173770 166756 160247
54555 160247 154188 148755 144793 142849 142057 141068 139833 139282 139446 139353 138864 139154 140924 143297 145006 145703
54539 145703 145649 144917 143390 140974 137607 133599 129885 127136 124733 121546 117724 114626 112874 111600 109792
54524 109792 107304 104212 100339 95941 91927 88803 86081 83216 80408 78099 76352 75180 74844 75407 76390
54509 76390 77147 77195 76170 74032 71341 68773 66444 64317 63011 63211 64348 64892 64157 62853 61846 61347
$$ packed form
54613A02429K70K11L01M47J371K934L749L257K642K954L717M182M478M696M251
54598A41889L085K223K235K367K095K183L182M107L783K507J384Q44P48J109J846
54583A75587K573L326M635O313P241P040O828P534Q474Q468P383N713L612J209
54569B55936j015k948n106p426q835q792q224q154q362q188p735p381p014o509
54555A60247o059n433l962j944p92r89j235n51J64r3m89K90J770K373J709O97
54539A45703n4p32j527k416l367m008l714k749k403l187l822l098j752j274j808
54524A09792k488l092l873m398m014l124k722k865k808k309j747j172l36N63R83
54509G6390P57M8j025k138k691k568k329k127j306K00J137N44p35j304j007m99
$$ plain form
54493 61347 61397 62029 62764 63012 63221 64469 66739 68851 70421 72419 75193 77405 77947 77708 78291 79854 81382
54476 81382 82438 83504 85015 87086 89896 93493 97395 101049 104488 107944 111209 114016 116759 120069
54462 120069 123772 126806 128260 128096 126870 125011 122448 118856 114298 109435 104840 100357 95695 91415
54448 91415 88518 86981 85573 83370 80679 78193 76035 74087 72496 71344 70381 69606 69558 70504 71805 72561
54432 72561 72502 71931 71198 70577 70196 69759 68764 67326 66319 66451 67652 69588 72114 74916 77390 79329 81170
54415 81170 83112 84551 84914 84550 84266 84380 84729 85235 86008 87122 88607 90386 92018 92932 93130 93183 93286
54398 93286 92931 91809 90472 89658 89446 89449 89351 88839 87566 85656 83872 82851 82471 82194 81611 80419 78506
54381 78506 76414 75084 74713 74402 73358 71918 70911 70565 70572 70688 70661 70042 68735 67432 66982 67588 68940
$$ packed form
54493F1347N0O32P35K48K09J248K270K112J570J998K774K212N42k39N83J563J528
54476H1382J056J066J511K071K810L597L902L654L439L456L265K807K743L310
54462A20069L703L034J454j64j226j859k563l592m558m863m595m483m662m280
54448I1415k897j537j408k203k691k486k158j948j591j152r63p75m8R46J301P56
54432G2561n9n71p33o21l81m37r95j438j007J32J201J936K526K802K474J939J841
54415H1170J942J439L63l64k84J14L49N06P73J114J485J779J632R14J98N3J03
54398I3286l55j122j337q14k12Lr8n12j273j910j784j021l80k77n83j192j913
54381G8506k092j330l71l11j044j440j007l46PJ16k7o19j307j303m50O06J352
$$ plain form
54364 68940 70713 72445 73400 73184 72313 71702 71868 72913 74824 77233 79314 80540 81328 82414 83814 84952
54348 84952 85676 86616 88499 91482 95138 98900 102434 105658 108409 110399 111814 113708 117116 121761 126303
54333 126303 129931 132994 135945 138563 140527 141933 142753 142574 141439 140249 139661 139160 137858 135766 133630
54318 133630 131917 130554 129280 127722 125434 122434 119428 117036 115094 113050 110676 107988 104935 101638
54304 101638 98581 96135 94183 92521 91198 90151 89060 87955 87378 87531 87882 88092 88690 90201 92207
54289 92207 94024 95795 98125 100939 103479 105242 106362 107261 108401 110113 112275 114476 116747 119605 122976
54274 122976 125855 127634 129034 130888 132677 133254 132524 131310 129854 127636 124628 121631 119119 116585 113403
54259 113403 109718 106160 103032 100032 96592 92417 87839 83636 80463 78507 77600 77191 76236 73838 70378
$$ packed form
54364F8940J773J732R55k16q71o11J66J045J911K409K081J226P88J086J400J138
54348H4952P24R40J883K983L656L762L534L224K751J990J415J894L408M645M542
54333A26303L628L063K951K618J964J406Q20j79j135j190n88n01j302k092k136
54318A33630j713j363j274j558k288l000l006k392j942k044k374k688l053l297
54304A01638l057k446j952j662j323j047j091j105n77J53L51K10N98J511K006
54289I2207J817J771K330K814K540J763J120Q99J140J712K162K201K271K858L371
54274A22976K879J779J400J854J789N77p30j214j456k218l008k997k512k534l182
54259A13403l685l558l128l000l440m175m578m203l173j956r07m09r55k398l460
$$ plain form
54244 70378 67409 65951 65381 64441 62808 61173 60333 60734 62359 64346 65183 64023 61589 59260 57597 56276
54228 56276 54997 53763 52567 51485 50858 50895 51349 52026 53140 54686 55990 56513 56642 57039 57651 58056 58331
54211 58331 58843 59543 60129 60550 60748 60403 59601 59230 59951 61275 62402 63385 64583 65578 65714 65274 64995 64811
54193 64811 64155 63201 62619 62362 61818 61070 60860 61364 62023 62551 63079 63431 63275 62919 62950 63154 62874 62288 62158
54174 62158 62398 62201 61664 61868 63033 63964 63880 63597 64191 65461 66438 66619 66034 64774 63120 61668 60792 60311
54156 60311 59983 59900 60182 60751 61595 62688 63528 63384 62255 61049 60619 61090 62182 63501 64409 64363 63579 62753
54138 62753 62028 60989 59753 59117 59296 59472 59061 58541 58431 58252 57232 55503 53872 52814 52307 52340 52928
54121 52928 53827 54664 55251 55486 55181 54302 53137 51999 51013 50296 49971 49794 49193 48013 46905 46631 47257 48302
$$ packed form
54244G0378k969j458n70r40j633j635q40M01J625J987Q37j160k434k329j663j321
54228E6276j279j234j196j082o27L7M54O77J114J546J304N23J29L97O12M05K75
54211E8331N12P00N86M21J98l45q02l71P21J324J127R83J198R95J36m40k79j84
54193F4811o56r54n82k57n44p48k10N04O59N28N28L52j56l56L1K04k80n86j30
54174F2158K40j97n37K04J165R31q4k83N94J270R77J81n85j260j654j452q76m81
54156F0311l28q3K82N69Q44J093Q40j44j129j206m30M71J092J319R08m6p84q26
54138F2753p25j039j236o36J79J76m11n20j10j79j020j729j631j058n07L3N88
54121E2928Q99Q37N87K35l05q79j165j138r86p17l25j77o01j180j108k74O26J045
$$ plain form
54103 48302 49405 50524 51669 52712 53461 53839 54068 54595 55572 56428 56351 55169 53505 52028 50885 49902 48966
54086 48966 48170 47799 48119 48938 49526 49340 48657 48116 47900 47862 48105 48699 49042 48354 46851 45675 45597 46429 47695
54067 47695 49072 50086 50244 49748 49333 49174 48647 47433 46133 45408 45167 44974 44691 44387 44107 44002 44201 44344
54049 44344 43849 42855 42233 42385 42732 42746 42768 43300 44072 44414 44140 43575 43077 42962 43496 44494 45254 45358 45288 45881
54029 45881 47370 49229 50749 51497 51487 51147 50925 50773 50282 49379 48561 48295 48576 49182 50001 50983 52114 53489
54011 53489 55029 56185 56407 55929 55553 55584 55545 55013 54150 53388 53121 53716 55094 56311 56406 55790 55906 57329
53993 57329 59186 60718 62277 64201 65756 66077 65469 64957 65147 66208 68369 71582 75109 78220 81001
53978 81001 83877 86789 89481 92234 95500 99051 102219 104847 107398 110164 112930 115436 117863 120856
$$ packed form
54103D8302J103J119J145J043P49L78K29N27R77Q56p7j182j664j477j143r83r36
54086D8966p96l71L20Q19N88j86o83n41k16l8K43N94L43o88j503j176p8Q32J266
54067D7695J377J014J58m96m15j59n27j214j300p25k41j93k83l04k80j05J99J43
54049D4344m95r94o22J52L47J4K2N32P72L42k74n65m98j15N34R98P60J04p0N93
54029D5881J489J859J520P48j0l40k22j52m91r03q18k66K81O06Q19R82J131J375
54011E3489J540J156K22m78l76L1l9n32q63p62k67N95J378J217R5o16J16J423
53993E7329J857J532J559J924J555L21o08n12J90J061K161L213L527L111K781
53978H1001K876K912K692K753L266L551L168K628K551K766K766K506K427K993
$$ plain form
53964 120856 125191 131134 137943 144282 149327 153183 156261 158878 161581 164970 168698 171424 172434 172657
53950 172657 173403 174684 175625 175952 176040 175815 174619 172187 168910 165098 160778 156308 152476 149647 147303 144740
53934 144740 141899 139310 137323 135585 133267 129909 125980 122483 120001 118389 117280 116407 115393 113916
53920 113916 112352 111658 112169 112983 112906 111639 109750 108044 107296 107919 109283 109941 109168 107885 107473 108177 109333
53903 109333 110655 112400 114553 116730 118741 120577 121957 122633 123035 123920 125377 126819 127951 129135 130737
53888 130737 132639 134465 135868 136609 136741 136731 137123 138171 139977 142606 145687 148338 150088 151607 153828
53873 153828 156624 159045 160693 162098 163725 165389 166720 167580 167844 167405 166557 165933 165863 166176 166782 167999
53857 167999 170140 173104 176492 179889 182977 185684 188277 191125 194313 197667 201016 204240 207193 209938
$$ packed form
53964A20856M335N943O809O339N045L856L078K617K703L389L728K726J010K23
53950A72657P46J281R41L27Q8k25j196k432l277l812m320m470l832k829k344k563
53934A44740k841k589j987j738k318l358l929l497k482j612j109q73j014j477
53920A13916j564o94N11Q14p7j267j889j706p48O23J364O58p73j283m12P04J156
53903A09333J322J745K153K177K011J836J380O76M02Q85J457J442J132J184J602
53888A30737J902J826J403P41J32j0L92J048J806K629L081K651J750J519K221
53873A53828K796K421J648J405J627J664J331Q60K64m39q48o24p0L13O06J217
53857A67999K141K964L388L397L088K707K593K848L188L354L349L224K953K745
$$ plain form
53843 209938 212897 216451 220453 224438 228094 231166 233154 233699 233205 232560 232171 231680 230639 229052 227147
53828 227147 224952 222250 218755 214341 209302 204314 199904 195996 192161 188123 183792 179065 173990 168966
53814 168966 164365 160079 155783 151513 147590 144110 140919 137981 135310 132624 129539 126117 122825 119947
53800 119947 117380 114960 112615 110208 107636 105188 103441 102727 102858 103329 103532 102936 101416 99438 97653
53785 97653 96276 95025 93582 91893 90137 88641 87663 87104 86612 86122 85948 86136 86162 85653 84994 84720 84752 84778
53767 84778 84969 85582 86130 85806 84640 83456 82706 82134 81701 82028 83574 85965 88455 90624 92321 93364
53751 93364 93689 93650 93882 94890 96719 98856 100556 101525 102286 103677 106052 109215 112875 116813 120773 124604
53735 124604 128424 132264 135802 138881 142040 145888 150056 153450 155584 157045 158610 160531 162813 165471
$$ packed form
53843B09938K959L554M002L985L656L072J988N45m94o45l89m91j041j587j905
53828B27147k195k702l495m414n039m988m410l908l835m038m331m727n075n024
53814A68966m601m286m296m270l923l480l191k938k671k686l085l422l292k878
53800A19947k567k420k345k407k572k448j747p14J31M71K03n96j520j978j785
53785I7653j377j251j443j689j756j496r78n59m92m90j74J88K6n09o59k74L2K6
53767H4778J91O13N48l24j166j184p50n72m33L27J546K391K490K169J697J043
53751I3364L25l9K32J008J829K137J700R69P61J391K375L163L660L938L960L831
53735A24604L820L840L538L079L159L848M168L394K134J461J565J921K282K658
$$ plain form
53721 165471 168174 170179 171048 171150 171159 171326 171489 171517 171437 171258 170881 170166 169030 167536 165872 164114 162094 159695
53703 159695 157119 154644 152252 149781 147364 145372 144002 143168 142670 142200 141364 140050 138683 137751 137231 136811
53687 136811 136492 136561 137099 137894 138711 139271 139244 138725 138433 138914 139794 140394 140769 141401 142078 142015 141056 139888 138949
53668 138949 137985 136871 136027 135644 135273 134598 133988 133813 133741 133229 132295 131376 130704 130187 129671 129087 128561 128505 129259
53649 129259 130570 131806 132871 134324 136357 138199 139036 139201 139932 142104 145534 149428 153177 156711 160313
53634 160313 164141 167974 171506 174847 178502 182839 187731 192741 197445 201635 205358 208777 211872 214481
53620 214481 216766 219286 222249 225007 226833 227875 228763 229542 229736 229333 228838 228370 227564 226446 225488 224581
53604 224581 222919 220319 217836 216499 216131 215999 215963 216277 216725 216699 215935 214606 212885 210954 209234 208120
$$ packed form
53721A65471K703K005Q69J02RJ67J63K8q0j79l77p15j136j494j664j758k020k399
53703A59695k576k475k392k471k417j992j370q34m98m70q36j314j367r32n20m20
53687A36811l19O9N38P95Q17N60k7n19k92M81Q80O00L75O32O77o3r59j168r39
53668A38949r64j114q44l83l71o75o10j75p2n12r34r19o72n17n16n84n26n6P54
53649A29259J311J236J065J453K033J842Q37J65P31K172L430L894L749L534L602
53634A60313L828L833L532L341L655M337M892N010M704M190L723L419L095K609
53620B14481K285K520K963K758J826J042Q88P79J94m03m95m68q06j118r58r07
53604B24581j662k600k483j337l68j32l6L14M48k6p64j329j721j931j720j114
$$ plain form
53588 208120 207554 207183 206830 206486 206120 205821 205917 206553 207298 207536 207163 206572 206111 205866 205899 206324 207108 208036 208966
53569 208966 209959 211128 212391 213439 214028 214426 215430 217649 220738 223687 225903 227699 229564 231374 232637
53554 232637 233373 234319 236214 239041 242139 245032 247971 251470 255447 259291 262892 267099 272718 279417 286062
53539 286062 291900 296899 301297 305455 309910 314874 319807 324141 328230 332810 337753 342350 346745 351868
53525 351868 357715 362865 366258 368482 370655 372985 375232 377805 381386 385817 390277 394365 398286 402075
53511 402075 405256 407298 408110 408161 408314 409264 410839 412187 412863 413348 414260 415550 416874 418206 419547 420515
53495 420515 420926 421428 422878 425247 427745 429893 431833 433671 435072 435664 435428 434686 434010 434118 435438 437692
53479 437692 440106 442077 443526 444787 446401 448806 451914 455042 457555 459526 461668 464739 469216 475263
$$ packed form
53588B08120n66l71l53l44l66k99R6O36P45K38l73n91m61k45L3M25P84R28R30
53569B08966R93J169J263J048N89L98J004K219L089K949K216J796J865J810J263
53554B32637P36R46J895K827L098K893K939L499L977L844L601M207N619O699O645
53539B86062N838M999M398M158M455M964M933M334M089M580M943M597M395N123
53525C51868N847N150L393K224K173K330K247K573L581M431M460M088L921L789
53511D02075L181K042Q12N1J53R50J575J348O76M85R12J290J324J332J341R68
53495D20515M11N02J450K369K498K148J940J838J401N92k36p42o76J08J320K254
53479D37692K414J971J449J261J614K405L108L128K513J971K142L071M477O047
$$ plain form
53465 475263 482647 490734 498907 507071 515585 524714 534316 544131 554307 565453 577993 591466 604831
53452 604831 617694 630891 645442 661280 677698 694756 713372 733866 755367 776989 798865
53441 798865 821569 845180 869424 894246 919776 946099 973438 1002090 1031762 1061493 1090705
53430 1090705 1119863 1149661 1179986 1210204 1240020 1269493 1298571 1327248 1355917 1384997 1414432
53419 1414432 1443935 1473432 1502805 1531547 1559226 1586017 1612218 1637500 1661234 1683390 1704634
53408 1704634 1725612 1746487 1766952 1786239 1803441 1818296 1831454 1843539 1854234 1862784 1869096 1873772
53396 1873772 1877234 1879357 1879838 1878374 1874673 1868756 1861070 1851817 1840434 1826315 1809917 1792503 1774777
53383 1774777 1756272 1736037 1713500 1688814 1662867 1636913 1611660 1586725 1561263 1535012 1508351
$$ packed form
53465D75263P384Q087Q173Q164Q514R129R602R815J0176J1146J2540J3473J3365
53452F04831J2863J3197J4551J5838J6418J7058J8616K0494K1501K1622K1876
53441G98865K2704K3611K4244K4822K5530K6323K7339K8652K9672K9731K9212
53430A090705K9158K9798L0325L0218K9816K9473K9078K8677K8669K9080K9435
53419A414432K9503K9497K9373K8742K7679K6791K6201K5282K3734K2156K1244
53408A704634K0978K0875K0465J9287J7202J4855J3158J2085J0695Q550O312M676
53396A873772L462K123M81j464l701n917p686r253j1383j4119j6398j7414j7726
53383A774777j8505k0235k2537k4686k5947k5954k5253k4935k5462k6251k6661
$$ plain form
53372 1508351 1481629 1454993 1428818 1403723 1380100 1357961 1337130 1317346 1298360 1280352 1264007
53361 1264007 1249792 1237393 1226253 1216318 1207772 1200465 1194271 1189728 1187588 1187928 1190353 1194804 1201438
53348 1201438 1209976 1220043 1232023 1246657 1263775 1282405 1302193 1323770 1347483 1372689 1398714
53337 1398714 1425736 1454334 1484812 1517376 1552341 1589642 1628650 1668988 1711107 1755636 1802516
53326 1802516 1851161 1901170 1952494 2005136 2059125 2114613 2171702 2230261 2290057 2350863 2412343
53315 2412343 2474038 2535614 2596901 2657596 2717205 2775395 2832097 2887146 2940070 2990392 3037850
53304 3037850 3082150 3122772 3159261 3191570 3220013 3244969 3266590 3284574 3298185 3306741 3310132 3308691
53292 3308691 3302681 3292203 3277485 3258747 3235781 3208116 3175687 3138846 3097626 3051605 3000842
$$ packed form
53372A508351k6722k6636k6175k5095k3623k2139k0831j9784j8986j8008j6345
53361A264007j4215j2399j1140r935q546p307o194m543k140L40K425M451O634
53348A201438Q538J0067J1980J4634J7118J8630J9788K1577K3713K5206K6025
53337A398714K7022K8598L0478L2564L4965L7301L9008M0338M2119M4529M6880
53326A802516M8645N0009N1324N2642N3989N5488N7089N8559N9796O0806O1480
53315B412343O1695O1576O1287O0695N9609N8190N6702N5049N2924N0322M7458
53304C037850M4300M0622L6489L2309K8443K4956K1621J7984J3611Q556L391j441
53292C308691o010j0478j4718j8738k2966k7665l2429l6841m1220m6021n0763
$$ plain form
53281 3000842 2946529 2890267 2833012 2775027 2716516 2657769 2598829 2539518 2479914 2420517 2361913
53270 2361913 2304391 2247945 2192430 2137768 2084212 2032466 1983312 1936858 1892278 1848605 1805927
53259 1805927 1765469 1728247 1693904 1661339 1630250 1601378 1575163 1550956 1528041 1506747 1487835
53248 1487835 1471131 1455597 1440680 1426933 1415239 1405926 1398701 1393049 1388552 1385191 1383323 1383155 1384370
53235 1384370 1386565 1389806 1394264 1399578 1405305 1411963 1420824 1432424 1445900 1460073 1474696 1490314 1507413
53222 1507413 1526179 1546775 1569350 1593756 1619462 1645776 1672092 1698065 1723575 1748508 1772668
53211 1772668 1796098 1819275 1842572 1865520 1886994 1906165 1922999 1937831 1950923 1962560 1973130
53200 1973130 1982823 1991429 1998555 2003863 2007018 2007640 2005450 2000332 1992229 1981138 1967256 1950968 1932673
$$ packed form
53281C000842n4313n6262n7255n7985n8511n8747n8940n9311n9604n9397n8604
53270B361913n7522n6446n5515n4662n3556n1746m9154m6454m4580m3673m2678
53259A805927m0458l7222l4343l2565l1089k8872k6215k4207k2915k1294j8912
53248A487835j6704j5534j4917j3747j1694r313p225n652m497l361j868j68J215
53235A384370K195L241M458N314N727O658Q861J1600J3476J4173J4623J5618J7099
53222A507413J8766K0596K2575K4406K5706K6314K6316K5973K5510K4933K4160
53211A772668K3430K3177K3297K2948K1474J9171J6834J4832J3092J1637J0570
53200A973130R693Q606P126N308L155O22k190n118q103j1091j3882j6288j8295
$$ plain form
53187 1932673 1912704 1891252 1868154 1842925 1815367 1786071 1756067 1726078 1696333 1666833 1637307
53176 1637307 1607141 1576015 1544636 1514289 1485515 1457655 1429815 1401760 1373762 1346071 1318878
53165 1318878 1292440 1266857 1241875 1217107 1192393 1167975 1144396 1122157 1101222 1080991 1061045
53154 1061045 1041796 1024022 1007811 992394 977035 961675 946650 932075 917586 902440 886031
53143 886031 868606 851280 834938 819283 803454 787377 771840 757295 743253 728979 714209
53132 714209 699111 684115 669839 656583 643742 630285 615944 601367 587012 572535 557481
53121 557481 541952 526368 511124 496680 483387 470985 458819 446780 435404 424843 414484
53110 414484 403948 393722 384302 375396 366572 358115 350552 343754 337179 330689 324480 318469 312376 306266
$$ packed form
53187A932673j9969k1452k3098k5229k7558k9296l0004k9989k9745k9500k9526
53176A637307l0166l1126l1379l0347k8774k7860k7840k8055k7998k7691k7193
53165A318878k6438k5583k4982k4768k4714k4418k3579k2239k0935k0231j9946
53154A061045j9249j7774j6211j5417j5359j5360j5025j4575j4489j5146j6409
53143H86031j7425j7326j6342j5655j5829j6077j5537j4545j4042j4274j4770
53132G14209j5098j4996j4276j3256j2841j3457j4341j4577j4355j4477j5054
53121E57481j5529j5584j5244j4444j3293j2402j2166j2039j1376j0561j0359
53110D14484j0536j0226r420q906q824q457p563o798o575o490o209o011o093o110
$$ plain form
53096 306266 300444 294952 289637 284619 280162 276134 271993 267334 262205 256990 252229 248452 245850 244110
53082 244110 242669 241021 238733 235603 232071 229092 227200 225885 224282 222236 220277 218735 217350 215792
53068 215792 214127 212679 211670 211064 210597 209917 208857 207630 206716 206571 207438 209225 211419 213238 214112 214153
53052 214153 214157 215072 217268 220208 222967 225166 227202 229432 231478 232702 233057 232964 232573 231694 230340 228653
53036 228653 226387 223145 219217 215451 212161 208848 205141 201366 197894 194603 191315 188173 185256 182336
53022 182336 179335 176417 173398 169786 165820 162687 161049 159960 158001 155093 152481 151171 151039 151283 151174
53007 151174 150407 149146 147738 146188 144184 141797 139711 138489 138031 138077 138666 139646 140273 139944 138937 137882
52991 137882 136907 135896 135179 135153 135509 135562 135218 134879 134569 133869 132725 131641 131028 130882 131078 131444 131544 130942
$$ packed form
53096C06266n822n492n315n018m457m028m141m659n129n215m761l777k602j740
53082B44110j441j648k288l130l532k979j892j315j603k046j959j542j385j558
53068B15792j665j448j009o06m67o80j060j227r14j45Q67J787K194J819Q74M1
53052B14153MR15K196K940K759K199K036K230K046J224L55r3l91q79j354j687
53036B28653k266l242l928l766l290l313l707l775l472l291l288l142k917k920
53022A82336l001k918l019l612l966l133j638j089j959k908k612j310j32K44j09
53007A51174p67j261j408j550k004k387k086j222m58M6N89R80O27l29j007j055
52991A37882r75j011p17k6L56N3l44l39l10p00j144j084o13j46J96L66J00o02
$$ plain form
52973 130942 129786 128671 127884 127206 126418 125533 124472 123093 121629 120670 120461 120526 120177 119251 118262 117968 118772
52956 118772 120276 121437 121381 120104 118316 116752 115806 115640 116248 117398 118695 119744 120230 120071 119596 119307
52940 119307 119258 118973 118217 117510 117482 117986 118308 118071 117552 117227 117343 117820 118315 118516 118625 119274 120671 122137 122947
52921 122947 123344 124222 126001 128283 130428 131957 132605 132630 133018 134751 137755 141034 143909 146670 149894 153589
52905 153589 157233 160412 163211 166122 169607 173673 177931 182152 186531 191165 195587 199153 201683 203335
52891 203335 204127 204106 203817 203947 204428 204419 203319 201387 199185 196837 194097 190983 188091 186266 185885 186344 186325
52874 186325 184767 181602 177542 173413 169853 167288 165772 164915 164271 163759 163516 163522 163590 163578 163359 162784 161938 161219
52856 161219 160901 160798 160660 160569 160588 160353 159476 158185 157050 156193 155286 154228 153376 153057 153190 153404 153291 152702
$$ packed form
52973A30942j156j115p87o78p88q85j061j379j464r59k09O5l49r26r89k94Q04
52956A18772J504J161n6j277j788j564r46j66O08J150J297J049M86j59m75k89
52940A19307m9k85p56p07k8N04L22k37n19l25J16M77M95K01J09O49J397J466Q10
52921A22947L97Q78J779K282K145J529O48K5L88J733L004L279K875K761L224L695
52905A53589L644L179K799K911L485M066M258M221M379M634M422L566K530J652
52891B03335P92k1k89J30M81rj100j932k202k348k740l114k892j825l81M59j9
52874A86325j558l165m060m129l560k565j516q57o44n12k43OO8j2k19n75q46p19
52856A61219l18j03j38r1J9k35q77j291j135q57r07j058q52l19J33K14j13n89
$$ plain form
52838 152702 152041 152110 153382 155577 158146 160817 163302 164946 165255 164566 163641 162814 162011 161345 161021 160848 160541
52821 160541 160416 161094 162523 163941 164827 165327 165711 166058 166560 167477 168648 169572 170196 171042 172303 173292 173203 172191
52803 172191 171344 171615 172908 174226 174706 174492 174421 174867 175388 175680 176338 178096 180659 182895 184015 184131 183937
52786 183937 184391 186397 190056 194357 198219 201667 205357 209274 212760 215727 218851 222424 225849 228485
52772 228485 230276 231296 231357 230366 228541 226108 223277 220631 218925 218228 217684 216337 213827 210365 206583
52757 206583 203368 201155 199257 196538 192863 189231 186336 183786 180986 178047 175446 173382 171809 170594
52743 170594 169332 167558 165446 163707 162478 160949 158522 155718 153378 151525 149656 147746 146196 144932
52729 144932 143239 140620 137456 134644 132754 131605 130570 129272 127884 126715 125678 124440 122939 121454
$$ packed form
52838A52702o61O9J272K195K569K671K485J644L09o89r25q27q03o66l24j73l07
52821A60541j25O78J429J418Q86N00L84L47N02R17J171R24O24Q46J261R89q9j012
52803A72191q47K71J293J318M80k14p1M46N21K92O58J758K563K236J120J16j94
52786A83937M54K006L659M301L862L448L690L917L486K967L124L573L425K636
52772B28485J791J020O1r91j825k433k831k646j706o97n44j347k510l462l782
52757B06583l215k213j898k719l675l632k895k550k800k939k601k064j573j215
52743A70594j262j774k112j739j229j529k427k804k340j853j869j910j550j264
52729A44932j693k619l164k812j890j149j035j298j388j169j037j238j501j485
$$ plain form
52715 121454 120302 119698 119729 120065 119923 118785 117008 115317 113961 112871 112155 111665 110534 108188 105644 104598
52699 104598 105186 105833 105445 104450 103418 102048 100139 98318 96936 95278 92805 90282 88711 87890 87057 86244
52683 86244 85881 85573 84470 82609 80895 79781 78935 78137 77601 77316 76786 75709 74416 73477 73136 73143 72948 72179
52665 72179 71144 70567 70650 70838 70803 71108 72290 73797 74631 74788 75236 76504 77974 78664 78172 76837 75452
52648 75452 74909 75626 77193 78785 79973 80912 81940 83293 85099 87240 89317 91056 92688 94588 96654
52633 96654 98451 99923 101539 103670 106160 108644 111046 113590 116341 118886 120567 121100 120817 120163 119173
52618 119173 117755 116256 115097 113982 112227 110008 108422 107909 107374 105514 102468 99463 97222 95396 93315
52603 93315 90670 87561 84422 81825 80027 78803 77921 77371 76848 75536 73041 70197 68336 67938 68504 69462
$$ packed form
52715A21454j152o04L1L36j42j138j777j691j356j090p16m90j131k346k544j046
52699A04598N88O47l88r95j032j370j909j821j382j658k473k523j571q21q33q13
52683H6244l63l08j103j861j714j114q46p98n36k85n30j077j293r39l41Pj95p69
52665G2179j035n77Q3J88l5L05J182J507Q34J57M48J268J470O90m92j335j385
52648G5452n43P17J567J592J188R39J028J353J806K141K077J739J632J900K066
52633I6654J797J472J616K131K490K484K402K544K751K545J681N33k83o54r90
52618A19173j418j499j159j115j755k219j586n13n35j860l046l005k241j826k081
52603I3315k645l109l139k597j798j224q82n50n23j312k495k844j861l98N66R58
$$ plain form
52587 69462 70575 71596 72104 71776 70528 68588 66674 65713 65888 66255 65741 64286 62607 61319 60870 61770
52571 61770 63970 66332 67647 68099 68840 70163 71100 70969 70347 70106 70261 70317 70199 70261 70689 71325 71941 72352
52553 72352 72423 72132 71607 70959 70227 69586 69421 70082 71529 73209 74308 74347 73719 73410 73963 74932 75534 75584 75409
52534 75409 75148 74701 74272 74418 75381 76762 78046 79223 80706 82665 84563 85502 85150 84231 83778 83987 84255
52517 84255 84301 84538 85171 85741 86072 86853 88534 90304 91078 91098 91565 92912 94472 95771 97148 98908 100729
52500 100729 102201 103341 104337 105315 106472 107948 109467 110599 111422 112364 113432 114230 114802 115713 117054 118085
52484 118085 118212 117824 117784 118536 120001 121938 124035 125921 127367 128288 128516 127958 127071 126706 127219 128110 128766
52467 128766 129188 129747 130543 131337 131897 132126 131986 131461 130574 129451 128422 127931 128049 128250 127992 127399 126960 126767
$$ packed form
52587F9462J113J021N08l28j248j940j914r61J75L67n14j455j679j288m49R00
52571F1770K200K362J315M52P41J323R37j31o22k41J55N6j18O2M28O36O16M11
52553G2352P1k91n25o48p32o41j65O61J447J680J099L9o28l09N53R69O02N0j75
52534G5409k61m47m29J46R63J381J284J177J483J959J898R39l52r19m53K09K68
52517H4255M6K37O33N70L31P81J681J770P74K0M67J347J560J299J377J760J821
52500A00729J472J140R96R78J157J476J519J132Q23R42J068P98N72R11J341J031
52484A18085J27l88m0P52J465J937K097J886J446R21K28n58q87l65N13Q91O56
52467A28766M22N59P96P94N60K29j40n25q87j123j029m91J18K01k58n93m39j93
$$ plain form
52449 126767 126583 126490 126799 127306 127413 127103 127026 127395 127546 127015 126311 126093 126172 125992 125657 125751 126411 127258 128070 128903
52429 128903 129535 129449 128526 127350 126667 126801 127710 129250 131151 132927 134092 134594 134880 135535 136819 138596 140565
52412 140565 142449 144002 145088 145829 146461 146877 146599 145476 144201 143763 144482 145881 147359 148596 149411 149724
52396 149724 149783 150046 150702 151515 152164 152466 152339 151906 151584 151677 151896 151746 151384 151590 152765 154456 156060 157483
52378 157483 158788 159664 159727 159136 158552 158528 159093 159830 160229 160096 159695 159426 159460 159943 161352 164027 167231 169257
52360 169257 168911 166633 163902 161846 160683 160082 159526 158430 156450 153856 151429 149873 149305 149236 148977 148182
52344 148182 147111 146326 146140 146429 146890 147271 147390 147207 146949 146855 146758 146191 145083 144095 144088 145303 147186 148929
52326 148929 150162 151239 152818 155077 157398 158968 159583 159654 159596 159532 159489 159515 159639 160059 161245 163398 165922
$$ packed form
52449A26767j84r3L09N07J07l10p7L69J51n31p04k18P9j80l35R4O60Q47Q12Q33
52429A28903O32q6r23j176o83J34R09J540J901J776J165N02K86O55J284J777J969
52412A40565J884J553J086P41O32M16k78j123j275m38P19J399J478J237Q15L13
52396A49724N9K63O56Q13O49L02j27m33l22R3K19j50l62K06J175J691J604J423
52378A57483J305Q76O3n91n84k4N65P37L99j33m01k69L4M83J409K675L204K026
52360A69257l46k278k731k056j163o01n56j096j980k594k427j556n68o9k59p95
52344A48182j071p85j86K89M61L81J19j83k58r4r7n67j108r88pJ215J883J743
52326A48929J233J077J579K259K321J570O15P1n8o4m3K6J24M20J186K153K524
$$ plain form
52309 165922 167924 169286 170736 172814 175318 177838 180255 182513 184526 186571 189275 192803 196484 199579
52295 199579 202040 204211 206241 208182 210277 212717 215400 218280 221607 225364 228791 231060 232278 233346
52281 233346 234915 236941 239174 241594 244223 246875 249237 251082 252432 253690 255561 258524 262305 266048
52267 266048 269086 271438 273569 275827 278197 280543 282964 285861 289666 294537 300251 306204 311480 315297
52253 315297 317866 320661 325276 331841 338964 345436 351583 358693 367422 377214 387090 396614 406032 415782
52239 415782 426033 436661 447583 459001 471249 484482 498610 513450 528751 544166 559461
52228 559461 574713 590089 605452 620499 635290 650266 665704 681411 697002 712168 726646
52217 726646 740275 753231 765921 778543 790906 802631 813224 822106 829093 834927 840756 846917
$$ packed form
52309A65922K002J362J450K078K504K520K417K258K013K045K704L528L681L095
52295A99579K461K171K030J941K095K440K683K880L327L757L427K269J218J068
52281B33346J569K026K233K420K629K652K362J845J350J258J871K963L781L743
52267B66048L038K352K131K258K370K346K421K897L805M871N714N953N276L817
52253C15297K569K795M615O565P123O472O147P110Q729R792R876R524R418R750
52239D15782J0251J0628J0922J1418J2248J3233J4128J4840J5301J5415J5295
52228E59461J5252J5376J5363J5047J4791J4976J5438J5707J5591J5166J4478
52217G26646J3629J2956J2690J2622J2363J1725J0593Q882O987N834N829O161
$$ plain form
52205 846917 852673 857313 860995 864192 866868 868691 869702 870251 870416 869960 868857 867484 866270 865357 864620
52190 864620 863916 863296 863032 863396 864505 866495 869655 874127 879557 885422 891597 898240 905248 912370 919838
52175 919838 928192 937309 946259 954435 962238 970289 978464 986218 993406 1000237 1006655 1012325 1017094 1021135
52161 1021135 1024675 1027831 1030550 1032561 1033582 1033763 1033621 1033347 1032492 1030523 1027335 1023019 1017553 1011082 1004128
52146 1004128 997165 990193 982992 975466 967510 958920 949838 940961 932912 925733 919287 913734 909121 904872
52132 904872 900343 895722 891853 889183 887349 885773 884219 882729 881321 879915 878412 876873 875528 874490
52118 874490 873494 872261 871013 870140 869293 867481 864366 860859 858005 855893 854091 852550 851314 849800 847200
52103 847200 843523 839603 836136 833211 830636 828232 825943 824053 823088 823074 823156 822502 821294 820182 819019 816969
$$ packed form
52205H46917N756M640L682L197K676J823J011N49J65m56j103j373j214r13p37
52190H64620p04o20k64L64J109J990L160M472N430N865O175O643P008P122P468
52175I19838Q354R117Q950Q176P803Q051Q175P754P188O831O418N670M769M041
52161A021135L540L156K719K011J021J81j42k74q55j969l188m316n466o471o954
52146A004128o963o972p201p526p956q590r082q877q049p179o446n553m613m249
52132I04872m529m621l869k670j834j576j554j490j408j406j503j539j345j038
52118H74490r96j233j248q73q47j812l115l507k854k112j802j541j236j514k600
52103H47200l677l920l467k925k575k404k289j890r65j4Q2o54j208j112j163k050
$$ plain form
52087 816969 813821 810376 807338 804478 801198 797461 793768 790484 787431 784060 779989 775475 771271 767905
52073 767905 765210 762694 760085 757287 754147 750702 747401 744646 742314 740116 738112 736326 734139 730811
52059 730811 726612 722788 720312 719150 718836 719190 720273 721970 723890 725590 726971 728617 731531 736187 742070
52044 742070 748481 755548 763886 773462 783466 793353 803411 814170 825754 838017 850933 864650
52032 864650 879374 895256 912201 929855 947954 966410 984783 1002040 1017537 1032010 1046841
52021 1046841 1062256 1076986 1089773 1100520 1109715 1117526 1123955 1129403 1134464 1139279 1143438 1146425 1147970
52008 1147970 1148058 1146815 1144385 1140876 1136506 1131677 1126732 1121677 1116309 1110564 1104607 1098743 1093419 1089060
51994 1089060 1085569 1082228 1078460 1074584 1071500 1069800 1069538 1070477 1072015 1073172 1073414 1073441 1074516 1077027 1080305
$$ packed form
52087H16969l148l445l038k860l280l737l693l284l053l371m071m514m204l366
52073G67905k695k516k609k798l140l445l301k755k332k198k004j786k187l328
52059G30811m199l824k476j162l14L54J083J697J920J700J381J646K914M656N883
52044G42070O411P067Q338R576J0004R887J0058J0759J1584J2263J2916J3717
52032H64650J4724J5882J6945J7654J8099J8456J8373J7257J5497J4473J4831
52021A046841J5415J4730J2787J0747R195P811O429N448N061M815M159K987J545
52008A147970Q8j243k430l509m370m829m945n055n368n745n957n864n324m359
51994A089060l491l341l768l876l084j700k62R39J538J157K42K7J075K511L278
$$ plain form
51979 1080305 1083805 1087683 1092123 1096795 1101264 1105366 1109015 1112152 1115038 1118018 1120809 1122658 1123447 1124056
51965 1124056 1125232 1126584 1127045 1125944 1123334 1119666 1115486 1111065 1106047 1099810 1092396 1084626 1076962 1068752
51951 1068752 1059019 1047616 1035139 1022066 1008536 994761 980998 967036 952234 936308 919885
51940 919885 904011 889031 874092 857930 840206 821896 804199 787406 771106 755113 739496
51929 739496 723841 707323 689748 671867 654352 637007 619359 601493 583887 566791 550212
51918 550212 534187 518626 503165 487605 472361 458127 445143 433056 421386 409927 398881
51907 398881 388789 380109 372666 365762 359019 352759 347194 341556 334620 326129 317307 309841 304525 300903
51893 300903 297967 295052 292124 289358 286724 284079 281442 278786 275704 271774 267394 263716 261476 260235
$$ packed form
51979A080305L500L878M440M672M469M102L649L137K886K980K791J849P89O09
51965A124056J176J352M61j101k610l668m180m421n018o237p414p770p664q210
51951A068752r733j1403j2477j3073j3530j3775j3763j3962j4802j5926j6423
51940I19885j5874j4980j4939j6162j7724j8310j7697j6793j6300j5993j5617
51929G39496j5655j6518j7575j7881j7515j7345j7648j7866j7606j7096j6579
51918E50212j6025j5561j5461j5560j5244j4234j2984j2087j1670j1459j1046
51907C98881j0092q680p443o904o743o260n565n638o936q491q822p466n316l622
51893C00903k936k915k928k766k634k645k637k656l082l930m380l678k240j241
$$ plain form
51879 260235 259098 257793 256644 255760 254856 253729 252383 250551 247644 243536 239172 235950 234375 233533 232056
51864 232056 229452 226304 223327 220672 218267 216358 215271 214850 214586 214204 213704 212962 211784 210336 208982
51849 208982 207616 205646 202892 199977 197609 195843 194385 193254 192697 192620 192482 191800 190582 189353 188833 189388
51833 189388 190600 191448 191099 189551 187513 185739 184449 183242 181601 179571 177883 177225 177549 178343 179359
51818 179359 180607 181746 182107 181500 180539 179955 179942 180294 180771 181111 181082 180811 180763 181115 181454 181415 181361 182007 183436
51799 183436 184838 185358 185087 185080 186329 188726 191215 193019 194441 196247 198620 201161 203632 206083 208322
51784 208322 209900 210705 211076 211212 210955 210248 209301 208209 206956 205856 205475 205866 206401 206530 206189 205359 203857
51767 203857 201929 200458 200132 200801 201936 203294 204829 206411 208060 210045 212383 214555 216099 217137 218041
$$ packed form
51879B60235j137j305j149q84r04j127j346j832k907m108m364l222j575q42j477
51864B32056k604l148k977k655k405j909j087m21k64l82n00p42j178j448j354
51849B08982j366j970k754k915k368j766j458j131n57p7j38o82j218j229n20N55
51833A89388J212Q48l49j548k038j774j290j207j641k030j688o58L24P94J016
51818A79359J248J139L61o07r61n84j3L52M77L40k9k71m8L52L39l9n4O46J429
51799A83436J402N20k71pJ249K397K489J804J422J806K373K541K471K451K239
51784B08322J578Q05L71J36k57p07r47j092j253j100l81L91N35J29l41q30j502
51767B03857j928j471l26O69J135J358J535J582J649J985K338K172J544J038R04
$$ plain form
51752 218041 218935 219832 220851 221937 222738 223126 223466 224016 224428 224243 223517 222537 221288 219704 218139 217088 216568
51735 216568 216227 215897 215745 215983 216699 217804 218937 219651 219885 220010 220264 220556 220976 221996 223795 225813 227386
51718 227386 228477 229435 230386 231229 231903 232346 232516 232750 233667 235375 237233 238758 240248 242123 244193 246094
51702 246094 247906 249691 250986 251446 251607 252261 253394 254519 255721 257519 259815 261858 263301 264607 266316
51687 266316 268510 271071 273953 277071 280263 283421 286462 289256 291761 293969 295535 295964 295533 295445 296458
51672 296458 297865 298483 298188 297605 296752 295079 292725 290688 289637 289311 289154 288777 287801 286105 284320 283276
51656 283276 282762 281613 279222 276262 273619 271291 268718 265684 262554 259922 258138 256865 255165 252525
51642 252525 249723 248026 247509 246870 245012 242149 239211 236882 235484 235096 235446 236168 237337 239178 241164
$$ packed form
51752B18041Q94Q97J019J086Q01L88L40N50M12j85p26r80j249j584j565j051n20
51735B16568l41l30j52K38P16J105J133P14K34J25K54K92M20J020J799K018J573
51718B27386J091R58R51Q43O74M43J70K34R17J708J858J525J490J875K070J901
51702B46094J812J785J295M60J61O54J133J125J202J798K296K043J443J306J709
51687B66316K194K561K882L118L192L158L041K794K505K208J566M29m31q8J013
51672B96458J407O18k95n83q53j673k354k037j051l26j57l77r76j696j785j044
51656B83276n14j149k391k960k643k328k573l034l130k632j784j273j700k640
51642B52525k802j697n17o39j858k863k938k329j398l88L50P22J169J841J986
$$ plain form
51627 241164 242309 242662 243636 246189 249480 252062 253837 255951 259114 262860 266313 268960 270665 271579 272164
51612 272164 272905 273910 275081 276588 278761 281526 284370 286928 289274 291497 293301 294195 293946 292691 290655
51597 290655 287923 284456 280228 275299 269817 264044 258364 253142 248451 244022 239485 234612 229383 224053
51583 224053 219226 215591 213337 211974 210888 209828 208639 206885 204238 201075 198237 196224 194954 194135
51569 194135 193441 192424 190783 188770 186886 185218 183520 181945 181050 180943 181000 180708 180351 180561 181566 183140
51553 183140 184977 186723 187899 188196 187804 187292 187180 187690 188730 189999 191213 192306 193352 194392 195536
51538 195536 197118 199384 202045 204530 206760 209285 212511 216155 219675 223005 226605 230965 236220 242135
51524 242135 248334 254578 260875 267266 273608 279689 285435 290755 295306 298757 301200 302950 303991 303982 302870
$$ packed form
51627B41164J145L53R74K553L291K582J775K114L163L746L453K647J705R14N85
51612B72164P41J005J171J507K173K765K844K558K346K223J804Q94k49j255k036
51597B90655k732l467m228m929n482n773n680n222m691m429m537m873n229n330
51583B24053m827l635k254j363j086j060j189j754k647l163k838k013j270q19
51569A94135o94j017j641k013j884j668j698j575q95j07N7k92l57K10J005J574
51553A83140J837J746J176K97l92n12j12N10J040J269J214J093J046J040J144
51538A95536J582K266K661K485K230K525L226L644L520L330L600M360N255N915
51524B42135O199O244O297O391O342O081N746N320M551L451K443J750J041rj112
$$ plain form
51509 302870 301151 299387 297784 296291 294830 293313 291647 289808 287822 285804 284217 283879 285220 287617
51495 287617 289953 291854 293948 296903 300740 305181 310093 315270 320224 324596 328622 332941 337932 343295
51481 343295 348152 351618 353453 354091 353982 353180 351865 350737 350309 350139 349539 348823 348939 349923 350773 351141 352109
51464 352109 354692 358351 361662 363935 365448 366456 366697 365826 363867 361243 358601 356423 354557 352325 349266
51449 349266 345564 341604 337439 332931 328118 323200 318382 313922 310061 306693 303354 299721 295928 292373
51435 292373 289506 287744 287106 286882 286160 284824 283574 282926 282798 283132 284122 285494 286382 286393 286103 286044 285943 285630
51417 285630 286021 288292 292420 297253 301743 305513 308676 311813 315791 320785 325728 329579 332914 337399
51403 337399 343725 350947 357854 364135 369995 375471 380530 385273 389589 393058 395535 397460 399257 400657
$$ packed form
51509C02870j719j764j603j493j461j517j666j839j986k018j587l38J341K397
51495B87617K336J901K094K955L837M441M912N177M954M372M026M319M991N363
51481C43295M857L466J835O38j09q02j315j128m28j70o00p16J16R84Q50L68R68
51464C52109K583L659L311K273J513J008K41q71j959k624k642k178j866k232l059
51449C49266l702l960m165m508m813m918m818m460l861l368l339l633l793l555
51435B92373k867j762o38k24p22j336j250o48j28L34R90J372Q88J1k90n9j01l13
51417B85630L91K271M128M833M490L770L163L137L978M994M943L851L335M485
51403C37399O326P222O907O281N860N476N059M743M316L469K477J925J797J400
$$ plain form
51389 400657 401022 400185 398703 397266 396005 394450 392209 389648 387693 386898 386980 387447 388328 389814 391422 392105
51373 392105 391209 388847 385331 380803 375559 370157 364810 359038 352337 344966 337669 330689 323593 316137
51359 316137 308892 302653 297435 292507 287516 283173 280491 279566 279517 279569 279718 280252 281095 281982 283013 284677
51343 284677 287393 291255 296085 301507 307001 312092 316496 320021 322458 323661 323703 322793 321077 318563 315122
51328 315122 310510 304469 296925 288126 278652 269230 260359 251944 243540 235089 227139 220073 213537 207134
51314 207134 201323 196853 193470 190029 185906 181439 176926 172232 167695 164361 162604 161306 159191 156416
51300 156416 154127 152954 152639 152701 152695 152178 151152 150270 149917 149447 148094 146273 145119 144975 145243 145566 146196 147148
51282 147148 147976 148586 149433 150686 151955 153137 154753 157008 159159 160365 160710 160903 161399 162337 164049 166927
$$ packed form
51389D00657L65q37j482j437j261j555k241k561j955p95Q2M67Q81J486J608O83
51373C92105q96k362l516m528n244n402n347n772o701p371p297o980p096p456
51359C16137p245o239n218m928m991m343k682r25m9N2J49N34Q43Q87J031J664
51343B84677K716L862M830N422N494N091M404L525K437J203M2r10j716k514l441
51328C15122m612o041p544q799r474r422q871q415q404q451p950p066o536o403
51314B07134n811m470l383l441m123m467m513m694m537l334j757j298k115k775
51300A56416k289j173l15O2on17j026q82l53m70j353j821j154j44K68L23O30R52
51282A47148Q28O10Q47J253J269J182J616K255K151J206L45J93M96R38J712K878
$$ plain form
51266 166927 170821 175057 179164 183166 187060 190431 192993 195348 198655 203356 208618 213383 217640 222059
51252 222059 226580 230196 232326 233549 234458 234495 232695 229168 225058 221216 217601 213837 209612 204573 198601
51237 198601 192381 187029 182860 178974 174329 168947 163839 159987 157555 155821 153734 150683 146935 143369
51223 143369 140813 139641 139749 140678 141825 142747 143193 142885 141620 139730 138015 136916 136081 135026 133808 132666
51207 132666 131547 130542 130306 131304 132956 134256 134926 135246 135143 134411 133607 133600 134227 134470 134082 133923 134357 134445
51189 134445 133302 131412 129874 129046 128575 128202 127785 126904 125175 122828 120508 118678 117538 117234 117670 118277
51173 118277 118437 118077 117603 117369 117437 117708 118081 118528 119102 119720 119980 119541 118689 118169 118323 118844 119460 120370 121698
51154 121698 123001 123723 123797 123498 123018 122463 121933 121286 120212 118906 118282 118997 120546 121772 122163 122188 122500 123292
$$ packed form
51266A66927L894M236M107M002L894L371K562K355L307M701N262M765M257M419
51252B22059M521L616K130J223R09L7j800l527m110l842l615l764m225n039n972
51237A98601o220n352m169l886m645n382n108l852k432j734k087l051l748l566
51223A43369k556j172J08R29J147R22M46l08j265j890j715j099q35j055j218j142
51207A32666j119j005k36R98J652J300O70L20j03p32q04pO27K43l88j59M34Q8
51189A34445j143j890j538q28m71l73m17q81j729k347k320j830j140l04M36O07
51173A18277J60l60m74k34O8K71L73M47N74O18K60m39q52n20J54N21O16R10J328
51154A21698J303P22P4k99m80n55n30o47j074j306o24P15J549J226L91K5L12P92
$$ plain form
51136 123292 124385 125543 126610 127551 128405 129070 129319 129196 129187 129653 130223 130129 129184 128141 128028 129202 131091 132762
51118 132762 133820 134710 136014 137472 138126 137509 136331 135668 135837 136462 137267 138176 138774 138341 136673 134415 132391
51101 132391 130875 129742 128923 128354 127608 126047 123508 120692 118671 117998 118323 118800 118802 118253 117503 116974 116912 117306
51083 117306 118011 118868 119613 119760 118915 117393 116266 116425 117699 119164 120210 121000 121968 123294 124889 126550
51067 126550 128072 129438 130850 132268 133076 132671 131343 129996 128978 127786 126099 124377 123086 121941 120468
51052 120468 118793 117350 116127 114872 113772 113273 113315 113392 113315 113313 113327 112896 111996 111420 111878 113057 114025 114403 114632
51033 114632 115147 115714 115904 115874 116289 117461 118961 120276 121541 123305 125691 128211 130413 132313 134017 135279
51017 135279 135766 135629 135535 136067 137242 138613 139713 140395 140826 141179 141410 141438 141449 141817 142660 143658 144432 144973 145580
$$ packed form
51136A23292J093J158J067R41Q54O65K49j23rM66N70r4r45j043j13J174J889J671
51118A32762J058Q90J304J458O54o17j178o63J69O25Q05R09N98m33j668k258k024
51101A32391j516j133q19n69p46j561k539k816k021o73L25M77Kn49p50n29o2L94
51083A17306P05Q57P45J47q45j522j127J59J274J465J046P90R68J326J595J661
51067A26550J522J366J412J418Q08m05j328j347j018j192j687j722j291j145j473
51052A20468j675j443j223j255j100m99M2P7p7kJ4m31r00n76M58J179R68L78K29
51033A14632N15N67J90l0M15J172J500J315J265J764K386K520K202J900J704J262
51017A35279M87j37r4N32J175J371J100O82M31L53K31K8J1L68Q43R98P74N41O07
$$ plain form
50998 145580 146475 147592 148703 149650 150462 151257 152055 152742 153271 153797 154527 155499 156585 157701 158903 160361 162250
50981 162250 164452 166270 166829 166061 165040 164932 165813 166912 167753 168420 168864 168694 167798 166532 165064 163171
50965 163171 160945 159190 158672 159376 160786 162526 164364 165967 167139 168096 169143 170273 171347 172475 173857
50950 173857 175479 177227 179169 181416 183868 186320 188632 190595 191996 193154 195136 198912 204326 210184
50936 210184 215367 219646 223590 227998 233314 239347 245544 251745 258518 266526 275709 285338 294766 303878
50922 303878 312945 322421 332885 344852 358504 373644 389919 406944 424397 442240 460910 481114
50910 481114 503453 528277 555842 586364 619852 655963 694164 734088 775787 819516 865243
50899 865243 912480 960679 1009541 1058692 1107313 1154482 1199729 1242786 1282880 1318927 1350462
$$ packed form
50998A45580Q95J117J111R47Q12P95P98O87N29N26P30R72J086J116J202J458J889
50981A62250K202J818N59p68j021j08Q81J099Q41O67M44j70q96j266j468j893
50965A63171k226j755n18P04J410J740J838J603J172R57J047J130J074J128J382
50950A73857J622J748J942K247K452K452K312J963J401J158J982L776N414N858
50936B10184N183M279L944M408N316O033O197O201O773Q008R183R629R428R112
50922C03878R067R476J0464J1967J3652J5140J6275J7025J7453J7843J8670K0204
50910D81114K2339K4824K7565L0522L3488L6111L8201L9924M1699M3729M5727
50899H65243M7237M8199M8862M9151M8621M7169M5247M3057M0094L6047L1535
$$ plain form
50888 1350462 1377785 1401092 1420129 1434913 1446071 1454017 1458443 1459203 1457170 1453572 1448872 1442989 1436330
50875 1436330 1429858 1424135 1418824 1413049 1405832 1396292 1384024 1369264 1352275 1332575 1309214 1281881
50863 1281881 1251352 1218745 1184601 1148725 1110693 1070494 1028842 986831 945223 904195 863870
50852 863870 824756 787416 752086 718980 688612 661317 636717 614209 593765 575730 559990
50841 559990 545982 533476 522720 513731 505990 499018 492815 487636 483618 480749 478847 477550 476629 476289
50827 476289 476777 477812 478884 480120 482289 485845 490437 495504 500800 506219 511695 517546 524428 532543
50813 532543 541369 550498 560331 571463 583825 596977 611022 626561 643834 662523 682444 703891
50801 703891 727108 751996 778674 807956 840791 877431 917530 961016 1008460 1060499 1117305
$$ packed form
50888A350462K7323K3307J9037J4784J1158P946M426P60k033l598m700n883o659
50875A436330o472n723n311n775p217r540j2268j4760j6989j9700k3361k7333
50863A281881l0529l2607l4144l5876l8032m0199m1652m2011m1608m1028m0325
50852H63870l9114l7340l5330l3106l0368k7295k4600k2508k0444j8035j5740
50841E59990j4008j2506j0756q989p741o972o203n179m018k869j902j297r21l40
50827D76289M88J035J072J236K169L556M592N067N296N419N476N851O882Q115
50813E32543Q826R129R833J1132J2362J3152J4045J5539J7273J8689J9921K1447
50801G03891K3217K4888K6678K9282L2835L6640M0099M3486M7444N2039N6806
$$ plain form
50790 1117305 1178790 1245089 1316604 1393687 1476385 1564340 1656882 1753427 1853836 1958012 2064921
50779 2064921 2172471 2278717 2382749 2483799 2579948 2668602 2748141 2818176 2878162 2926863
50769 2926863 2963548 2988823 3003774 3009128 3005979 2996591 2983575 2968587 2952552 2936735 2922677 2911131
50757 2911131 2901725 2893533 2885343 2875513 2862271 2844260 2820365 2789170 2749216 2699867 2641507 2574951
50745 2574951 2501100 2421002 2335714 2246119 2153355 2059317 1966183 1875515 1788287 1705608 1628696
50734 1628696 1558131 1493775 1435591 1383990 1339276 1301273 1269628 1244058 1224254 1209982 1201291
50723 1201291 1198115 1199658 1204612 1211936 1220823 1230062 1238219 1244608 1249391 1252508 1253230 1251065 1246476 1240284
50709 1240284 1232758 1223632 1212677 1199981 1185926 1170962 1155127 1137853 1118732 1098365 1077838 1057493
$$ packed form
50790A117305O1485O6299P1515P7083Q2698Q7955R2542R6545J00409J04176J06909
50779B064921J07550J06246J04032J01050R6149Q8654P9539P0035N9986M8701
50769B926863L6685K5275J4951N354l149r388j3016j4988j6035j5817j4058j1546
50757B911131r406q192q190r830j3242j8011k3895l1195l9954m9349n8360o6556
50745B574951p3851q0098q5288q9595r2764r4038r3134r0668q7228q2679p6912
50734A628696p0565o4356n8184n1601m4714l8003l1645k5570j9804j4272q691
50723A201291l176J543M954P324Q887R239Q157O389M783L117P22k165m589o192
50709A240284p526r126j0955j2696j4055j4964j5835j7274j9121k0367k0527k0345
$$ plain form
50697 1057493 1037065 1017053 998890 983485 970557 959831 951855 946945 944298 943104 943919 947991 955670
50684 955670 966378 979782 995985 1014733 1035315 1057347 1081063 1106879 1135257 1166945 1202673
50673 1202673 1242459 1285647 1331726 1380817 1433460 1490159 1550965 1615066 1680919 1747086 1812758
50662 1812758 1877126 1938734 1996063 2048498 2095972 2137773 2172442 2198813 2216457 2225108 2224521 2215175
50650 2215175 2198582 2176563 2150661 2122394 2093465 2065358 2039065 2015432 1995275 1978828 1965499
50639 1965499 1954475 1945159 1936677 1927428 1915653 1900235 1880497 1855602 1824839 1788459 1747605 1703287
50627 1703287 1655936 1606144 1555369 1505496 1457940 1413463 1372664 1336200 1304509 1277646 1255595
50616 1255595 1238652 1227371 1222225 1223374 1230666 1243770 1262359 1286347 1315950 1351378 1392334 1437817
$$ packed form
50697A057493k0428k0012j8163j5405j2928j0726p976m910k647j194Q15M072P679
50684I55670J0708J3404J6203J8748K0582K2032K3716K5816K8378L1688L5728
50673A202673L9786M3188M6079M9091N2643N6699O0806O4101O5853O6167O5672
50662A812758O4368O1608N7329N2435M7474M1801L4669K6371J7644Q651n87r346
50650B215175j6593k2019k5902k8267k8929k8107k6293k3633k0157j6447j3329
50639A965499j1024r316q482r249j1775j5418j9738k4895l0763l6380m0854m4318
50627A703287m7351m9792n0775m9873m7556m4477m0799l6464l1691k6863k2051
50616A255595j6943j1281n146J149P292J3104J8589K3988K9603L5428M0956M5483
$$ plain form
50604 1437817 1486387 1536654 1587576 1638423 1688425 1736362 1780545 1819475 1852693 1880876 1904945
50593 1904945 1925161 1941219 1953078 1961359 1966888 1970143 1971355 1970896 1969228 1966522 1962754 1958380 1954590
50580 1954590 1952505 1952174 1952719 1953517 1954991 1958120 1963480 1970933 1980034 1990386 2001661 2013498 2025499 2037235
50566 2037235 2048287 2058267 2066689 2072826 2076040 2076448 2074985 2072482 2068940 2064189 2059006 2054992 2053216 2053535
50552 2053535 2055385 2058705 2063768 2070530 2078615 2087626 2097016 2105722 2112439 2116332 2117174 2114760 2108504 2097712
50538 2097712 2081993 2061115 2034672 2002195 1963701 1919959 1872085 1820888 1766709 1709879 1651230
50527 1651230 1592065 1533585 1476421 1420797 1367149 1316445 1269683 1227080 1187981 1151684 1118104
50516 1118104 1087504 1059970 1035577 1014739 997696 983748 971750 961550 954195 950417 949712 951398
$$ packed form
50604A437817M8570N0267N0922N0847N0002M7937M4183L8930L3218K8183K4069
50593A904945K0216J6058J1859Q281N529L255J212m59j668k706l768m374l790
50580A954590k085l31N45P98J474L129N360P453R101J0352J1275J1837J2001J1736
50566B037235J1052R980Q422O137L214M08j463k503l542m751n183m014j776L19
50552B053535J850L320N063O762Q085R011R390Q706O717L893Q42k414o256j0792
50538B097712j5719k0878k6443l2477l8494m3742m7874n1197n4179n6830n8649
50527A651230n9165n8480n7164n5624n3648n0704m6762m2603l9099l6297l3580
50516A118104l0600k7534k4393k0838j7043j3948j1998j0200p355l778p05J686
$$ plain form
50504 951398 955796 963550 974364 987451 1002848 1021239 1042567 1065939 1091046 1118704 1149563 1183138
50492 1183138 1218675 1256374 1297161 1341613 1389557 1440470 1493793 1548967 1605361 1662114 1718064
50481 1718064 1772138 1823865 1873133 1919452 1962031 2000780 2036761 2071415 2105779 2140588 2176448
50470 2176448 2213435 2250999 2288698 2326677 2365085 2403625 2442262 2481969 2524001 2568569 2614908
50459 2614908 2662507 2711585 2762204 2813473 2863930 2912362 2958029 3000252 3037970 3069625 3093428
50448 3093428 3107860 3112112 3106213 3090834 3066858 3034880 2995100 2947881 2894452 2836866 2777323 2717758
50436 2717758 2659988 2605780 2556599 2513603 2477913 2450372 2430847 2418252 2411558 2410386 2414310 2422040
50424 2422040 2431660 2441190 2448409 2450492 2444667 2429228 2403592 2367487 2320703 2263672 2197845 2125261
$$ packed form
50504I51398M398P754J0814J3087J5397J8391K1328K3372K5107K7658L0859L3575
50492A183138L5537L7699M0787M4452M7944N0913N3323N5174N6394N6753N5950
50481A718064N4074N1727M9268M6319M2579L8749L5981L4654L4364L4809L5860
50470B176448L6987L7564L7699L7979L8408L8540L8637L9707M2032M4568M6339
50459B614908M7599M9078N0619N1269N0457M8432M5667M2223L7718L1655K3803
50448C093428J4432M252n899j5379k3976l1978l9780m7219n3429n7586n9543n9565
50436B717758n7770n4208m9181m2996l5690k7541j9525j2595o694j172L924P730
50424B422040R620R530P219K083n825j5439k5636l6105m6784n7031o5827p2584
$$ plain form
50412 2125261 2047913 1967573 1885904 1804457 1724473 1646702 1571547 1499599 1431924 1369564 1312766
50401 1312766 1261068 1214138 1172072 1134794 1101692 1072142 1045962 1023155 1003699 987830 975929
50390 975929 967701 962013 958087 956342 957473 961151 966388 972892 981277 992079 1005249 1020565 1037851
50377 1037851 1056768 1076918 1098180 1120484 1143369 1166332 1189597 1213948 1239698 1266248 1292643
50366 1292643 1318187 1342645 1366424 1390556 1415892 1442125 1468000 1492520 1515582 1537497 1558508
50355 1558508 1578908 1599098 1619223 1639101 1658716 1678525 1699179 1721149 1744632 1769554 1795593
50344 1795593 1822380 1849552 1876409 1901815 1924895 1945603 1964074 1979685 1991422 1999005 2002695 2001932
50332 2001932 1995136 1981307 1961051 1935538 1905106 1869468 1828760 1783637 1734703 1682609 1628681
$$ packed form
50412B125261p7348q0340q1669q1447p9984p7771p5155p1948o7675o2360n6798
50401A312766n1698m6930m2066l7278l3102k9550k6180k2807j9456j5869j1901
50390I75929q228n688l926j745J131L678N237O504Q385J0802J3170J5316J7286
50377A037851J8917K0150K1262K2304K2885K2963K3265K4351K5750K6550K6395
50366A292643K5544K4458K3779K4132K5336K6233K5875K4520K3062K1915K1011
50355A558508K0400K0190K0125J9878J9615J9809K0654K1970K3483K4922K6039
50344A795593K6787K7172K6857K5406K3080K0708J8471J5611J1737P583L690p63
50332B001932o796j3829k0256k5513l0432l5638m0708m5123m8934n2094n3928
$$ plain form
50321 1628681 1574824 1522685 1473210 1426987 1384619 1346659 1313481 1285420 1262905 1246284 1235461
50310 1235461 1229732 1227975 1229079 1232194 1236555 1241146 1244640 1245702 1243318 1236921 1226271 1211212 1191564
50297 1191564 1167504 1140058 1110842 1081062 1051022 1020810 991076 962672 935828 910241 885777
50286 885777 862567 840565 819639 800033 782190 766134 751566 738485 727033 716768 706947 697700
50274 697700 690126 684914 681613 679673 679393 681173 684476 688425 693140 699670 708614 719373 730859 742458
50260 742458 754248 766599 779681 793186 806483 819225 831796 845124 859980 876458 893914
50249 893914 911385 928251 944630 960999 977493 993770 1009462 1024365 1038159 1050419 1061074
50238 1061074 1070463 1078715 1085468 1090406 1093612 1095062 1094258 1090847 1085369 1078918 1072166 1065021 1056997 1047531
$$ packed form
50321A628681n3857n2139m9475m6223m2368l7960l3178k8061k2515j6621j0823
50310A235461n729j757J104L115M361M591L494J062k384o397j0650j5059j9648
50297A191564k4060k7446k9216k9780l0040l0212k9734k8404k6844k5587k4464
50286H85777k3210k2002k0926j9606j7843j6056j4568j3081j1452j0265r821r247
50274F97700p574n212l301j940k80J780L303L949M715O530Q944J0759J1486J1599
50260G42458J1790J2351J3082J3505J3297J2742J2571J3328J4856J6478J7456
50249H93914J7471J6866J6379J6369J6494J6277J5692J4903J3794J2260J0655
50238A061074R389Q252O753M938L206J450q04l411n478o451o752p145q024r466
$$ plain form
50224 1047531 1036159 1022816 1007939 992001 975031 956910 938024 919192 900954 883199 865529
50213 865529 847763 830089 812894 796388 780373 764520 748971 734406 721315 709506 698614
50202 698614 688782 680475 673812 668488 664216 660772 657773 654964 652714 651723 652069 653010 653920 655003 656761
50187 656761 659044 661019 662038 662245 662254 662426 662522 661991 660468 658044 655143 652213 649451 646661 643431 639619
50171 639619 635661 632155 629119 625966 622269 618239 614262 610353 606419 602744 599642 596832 593769 590688
50157 590688 588698 588546 589694 591013 592094 593457 595628 598521 601752 605046 608070 610268 611340 611739 612257
50142 612257 613029 613363 612693 611282 609679 607872 605453 602394 599054 595476 591290 586425 581314 576114 570215
50127 570215 562992 554830 546962 540438 535493 531717 528426 524950 520881 516173 510926 505187 499151 493391
$$ packed form
50224A047531j1372j3343j4877j5938j6970j8121j8886j8832j8238j7755j7670
50213H65529j7766j7674j7195j6506j6015j5853j5549j4565j3091j1809j0892
50202F98614r832q307o663n324m272l444k999k809k250r91L46R41R10J083J758
50187F56761K283J975J019K07RJ72R6n31j523k424k901k930k762k790l230l812
50171F39619l958l506l036l153l697m030l977l909l934l675l102k810l063l081
50157E90688j990j52J148J319J081J363K171K893L231L294L024K198J072L99N18
50142F12257P72L34o70j411j603j807k419l059l340l578m186m865n111n200n899
50127E70215p223q162p868o524m945l776l291l476m069m708n247n739o036n760
$$ plain form
50113 493391 488603 485048 482318 479600 476201 472106 468164 465419 463986 462798 460778 458071 455762 454556
50099 454556 454150 453781 452838 450886 447628 443153 438030 432929 428251 424164 420728 417813 415101 412396 409851
50084 409851 407736 406052 404538 403053 401766 400906 400358 399685 398617 397465 396835 396972 397553 398212 398995 400095
50068 400095 401427 402830 404614 407443 411646 416943 422885 429212 435646 441727 447159 452124 456972 461759
50054 461759 466415 471256 476848 483270 489781 495470 500090 504104 508049 512018 515731 518900 521465 523599
50040 523599 525588 527672 529992 532658 535738 539076 542306 545263 548317 551954 556012 559718 562666 565400
50026 565400 568736 572837 577372 582285 587815 593827 599809 605675 612003 619160 626683 633949 641073 648715
50012 648715 657222 666489 676497 687417 699130 711143 723187 735557 748645 762392 776410 790454
$$ packed form
50113D93391m788l555k730k718l399m095l942k745j433j188k020k707k309j206
50099D54556m06l69r43j952l258m475n123n101m678m087l436k915k712k705k545
50084D09851k115j684j514j485j287q60n48o73j068j152o30J37N81O59P83J100
50068D00095J332J403J784K829M203N297N942O327O434O081N432M965M848M787
50054D61759M656M841N592O422O511N689M620M014L945L969L713L169K565K134
50040E23599J989K084K320K666L080L338L230K957L054L637M058L706K948K734
50026E65400L336M101M535M913N530O012N982N866O328P157P523P266P124P642
50012F48715Q507R267J0008J0920J1713J2013J2044J2370J3088J3747J4018J4044
$$ plain form
50000 790454 804520 818555 832333 845646 858508 871201 884166 897723 911672 925238 937652
49989 937652 948853 959392 969611 979269 988204 997013 1006540 1016729 1026474 1034829 1042024 1049132 1057072
49976 1057072 1066231 1076719 1088581 1101776 1116281 1132282 1150180 1170549 1194137 1221621 1253141
49965 1253141 1288238 1326358 1367032 1409258 1451230 1491209 1528426 1562528 1592422 1616542 1634309
49954 1634309 1646748 1655606 1662456 1668617 1674998 1681535 1687323 1691575 1693916 1693453 1688256 1676375 1657021
49941 1657021 1630369 1596661 1556156 1509715 1458892 1405463 1351117 1297224 1244452 1192783 1142316
49930 1142316 1093926 1048792 1007466 969695 934894 902417 871627 842212 814439 788780 765404
49919 765404 744209 725100 707900 692275 678096 665616 654874 645244 636062 627460 620070 614106
$$ packed form
50000G90454J4066J4035J3778J3313J2862J2693J2965J3557J3949J3566J2414
49989I37652J1201J0539J0219R658Q935Q809R527J0189R745Q355P195P108P940
49976A057072R159J0488J1862J3195J4505J6001J7898K0369K3588K7484L1520
49965A253141L5097L8120M0674M2226M1972L9979L7217L4102K9894K4120J7767
49954A634309J2439Q858O850O161O381O537N788M252K341m63n197j1881j9354
49941A657021k6652l3708m0505m6441n0823n3429n4346n3893n2772n1669n0467
49930A142316m8390m5134m1326l7771l4801l2477l0790k9415k7773k5659k3376
49919G65404k1195j9109j7200j5625j4179j2480j0742r630r182q602p390n964
$$ plain form
49907 614106 609218 604953 600747 595817 589892 583915 579136 575468 571687 567361 563557 561170 559518 557315
49893 557315 554328 551250 548444 545768 543402 541952 541614 541975 542774 544260 546582 549345 552109 554955 558252
49878 558252 562166 566781 572447 579517 587833 596889 606518 616972 628312 640236 652805 666828 682997
49865 682997 700916 719649 739125 760374 784278 810697 839086 869413 902102 937549 976176
49854 976176 1018660 1065555 1116853 1172411 1232629 1298144 1368783 1443246 1519844 1597086 1673428
49843 1673428 1746852 1815151 1876724 1931204 1979444 2022785 2062068 2097384 2128895 2157654 2185110
49832 2185110 2211735 2236415 2257056 2271414 2277369 2273107 2257601 2230899 2193802 2147425 2093142 2032590
49820 2032590 1967371 1898758 1827763 1755333 1682316 1609387 1537206 1466536 1398094 1332337 1269475
$$ packed form
49907F14106m888m265m206m930n925n977m779l668l781m326l804k387j652k203
49893E57315k987l078k806k676k366j450l38L61P99J486K322K763K764K846L297
49878E58252L914M615N666P070Q316R056R629J0454J1340J1924J2569J4023J6169
49865F82997J7919J8733J9476K1249K3904K6419K8389L0327L2689L5447L8627
49854I76176M2484M6895N1298N5558O0218O5515P0639P4463P6598P7242P6342
49843A673428P3424O8299O1573N4480M8240M3341L9283L5316L1511K8759K7456
49832B185110K6625K4680K0641J4358N955m262j5506k6702l7097m6377n4283o0552
49820B032590o5219o8613p0995p2430p3017p2929p2181p0670o8442o5757o2862
$$ plain form
49809 1269475 1209658 1153054 1099818 1050099 1003978 961322 921777 885054 851199 820467 792892
49798 792892 768019 745125 723716 703790 685564 668986 653634 639141 625544 613024 601392
49787 601392 590027 578364 566338 554355 542910 532255 522329 512943 504012 495515 487286 479106 471156
49774 471156 464172 458828 455043 452123 449559 447387 445792 444679 443741 442682 441263 439371 437217 435314
49760 435314 434081 433604 433866 434962 436822 438986 441107 443663 447679 453516 460279 466777 472880 479516 487417
49745 487417 496354 505752 515542 526065 537431 549476 562327 576651 593246 612484 634135 657618
49733 657618 682594 709543 739548 773277 810412 850454 893726 940922 991749 1044733 1098408
49722 1098408 1151896 1204002 1252524 1295136 1330671 1359173 1381134 1397217 1408432 1416014 1421178 1425181
$$ packed form
49809A269475n9817n6604n3236m9719m6121m2656l9545l6723l3855l0732k7575
49798G92892k4873k2894k1409j9926j8226j6578j5352j4493j3597j2520j1632
49787F01392j1365j1663j2026j1983j1445j0655r926r386q931q497q229q180p950
49774D71156o984n344l785k920k564k172j595j113r38j059j419j892k154j903
49760D35314j233m77K62J096J860K164K121K556M016N837O763O498O103O636P901
49745D87417Q937R398R790J0523J1366J2045J2851J4324J6595J9238K1651K3483
49733F57618K4976K6949L0005L3729L7135M0042M3272M7196N0827N2984N3675
49722A098408N3488N2106M8522M2612L5535K8502K1961J6083J1215P582N164M003
$$ plain form
49710 1425181 1429262 1434028 1438952 1442680 1443483 1439171 1427266 1406165 1376091 1338352 1293853 1243059 1187346
49697 1187346 1129479 1072256 1017039 963937 912976 864657 819587 778117 740487 706999 677758
49686 677758 652301 629831 609903 592582 577728 564508 552089 540549 530494 521912 514149 507014
49674 507014 501000 496165 491696 487075 482867 479721 477322 475052 473043 471692 470686 469410 467935 466663
49660 466663 465345 463456 461339 459851 458903 457356 454582 451223 448196 445768 443868 442571 441854 441340 440645
49645 440645 439703 438695 437981 438016 438885 439979 440569 440611 440461 440064 439117 437915 437256 437589 438932 441418 445004
49628 445004 448682 451052 451898 452352 453364 454899 456694 458727 460610 461582 461601 461574 462086 462776 463416 464576 466555
49611 466555 468630 470134 471484 473223 474772 475122 474380 473678 473785 474493 475206 475563 475660 476111 477584 479870 481844
$$ packed form
49710A425181M081M766M924L728Q03m312j1905k1101l0074l7739m4499n0794n5713
49697A187346n7867n7223n5217n3102n0961m8319m5070m1470l7630l3488k9241
49686F77758k5457k2470j9928j7321j4854j3220j2419j1540j0055q582p763p135
49674E07014o014m835m469m621m208l146k399k270k009j351j006j276j475j272
49660D66663j318j889k117j488r48j547k774l359l027k428j900j297p17n14o95
49645D40645r42j008p14L5Q69J094N90M2j50l97r47j202o59L33J343K486L586
49628D45004L678K370Q46M54J012J535J795K033J883R72J9k7N12O90O40J160J979
49611D66555K075J504J350J739J549L50p42p02J07P08P13L57R7M51J473K286J974
$$ plain form
49594 481844 482767 483146 483784 484491 484428 483341 481779 480364 479399 478947 478701 478072 476927 475942 475718 475985 476178 476352
49576 476352 476840 477450 477769 477983 478549 479291 479663 479763 480262 481308 482280 482685 482683 482682 483036 484166 486371 489362 492526
49557 492526 495677 499097 502821 506500 510053 513859 518132 522527 526598 530275 533779 537422 541593 546602
$$ packed form
49594D81844R23L79O38P07o3j087j562j415r65m52k46o29j145r85k24K67J93J74
49576D76352M88O10L19K14N66P42L72J00M99J046R72M05kjL54J130K205K991L164
49557D92526L151L420L724L679L553L806M273M395M071L677L504L643M171N009
$$ [...]
##END NTUPLES=NMR SPECTRUM
##END=
