
##TITLE=AC1072_TOPL05_5819035_JyEpBJPI1D
##JCAMPDX= 6.0         $$ Bruker NMR JCAMP-DX V2.0
##DATA TYPE= NMR SPECTRUM
##DATA CLASS= NTUPLES
##ORIGIN= BRUKER
##OWNER= Administrator
$$ 1.72 TOPSPIN		Version 2.1
$$ 2012-03-24 22:14:06.328 -0500  Administrator@TOPSPIN
$$ Compression mode = diff/dup
##.OBSERVE FREQUENCY= 400.13188235
##.OBSERVE NUCLEUS= ^1H
##.ACQUISITION MODE= SIMULTANEOUS (DQD)
##.ACQUISITION SCHEME= undefined
##.AVERAGES= 8
##.DIGITISER RES= 22
##SPECTROMETER/DATA SYSTEM= spect
##.PULSE SEQUENCE= zg30
##.SOLVENT NAME= COFFEE_meoh
##.SHIFT REFERENCE= INTERNAL, COFFEE_meoh, 1, 14.98061
##AUDIT TRAIL= $$ (NUMBER, WHEN, WHO, WHERE, PROCESS, VERSION, WHAT)
$$ ##TITLE= Audit trail, TOPSPIN		Version 2.1
$$ ##JCAMPDX= 5.01
$$ ##ORIGIN= Bruker BioSpin GmbH
$$ ##OWNER= Administrator
$$ $$ C:\Bruker\TOPSPIN/data/COFFEE/nmr/AC1072_TOPL05_5819035_JyEpBJPI1D/10/pdata/1/auditp.txt
$$ ##AUDIT TRAIL=  $$ (NUMBER, WHEN, WHO, WHERE, PROCESS, VERSION, WHAT)
(   1,<2012-03-24 22:13:58.484 -0500>,<Administrator>,<TOPSPIN>,<go>,<TOPSPIN 2.1>,
      <created by zg
	started at 2012-03-24 22:12:51.937 -0500,
	POWCHK enabled, PULCHK disabled,
       configuration hash MD5:
       1A 1E CE 29 27 FD 77 03 67 4E F0 E3 C4 B2 CB 90
       data hash MD5: 64K
       5B F1 D9 12 39 D7 BC A1 CB 7F 14 30 5B 94 98 E3>)
(   2,<2012-03-24 22:14:01.921 -0500>,<Administrator>,<TOPSPIN>,<proc1d>,<TOPSPIN 2.1>,
      <Start of raw data processing
       efp LB = 0 FT_mod = 6 PKNL = 1 PHC0 = 0 PHC1 = 0 SI = 32K 
       data hash MD5: 32K
       9D 09 F4 22 F6 F7 AE 07 F1 AE 52 78 A9 F9 7F 47>)
(   3,<2012-03-24 22:14:02.234 -0500>,<Administrator>,<TOPSPIN>,<proc1d>,<TOPSPIN 2.1>,
      <pk PHC0 = 215.9308 PHC1 = 0 
       data hash MD5: 32K
       89 DD 28 E0 63 8D 89 15 24 62 E8 34 4D F6 A7 4B>)
(   4,<2012-03-24 22:14:02.437 -0500>,<Administrator>,<TOPSPIN>,<proc1d>,<TOPSPIN 2.1>,
      <abs ABSG = 1 
       data hash MD5: 32K
       65 48 50 57 E4 24 9E 5E 82 0C 26 ED 18 A7 9A 75>)
(   5,<2012-03-24 22:14:02.484 -0500>,<Administrator>,<TOPSPIN>,<proc1d>,<TOPSPIN 2.1>,
      <abs ABSG = 2 
       data hash MD5: 32K
       7B 84 20 B4 CA 6D A1 D2 0B B8 01 B6 8E E5 39 01>)
(   6,<2012-03-24 22:14:02.531 -0500>,<Administrator>,<TOPSPIN>,<proc1d>,<TOPSPIN 2.1>,
      <abs ABSG = 3 
       data hash MD5: 32K
       4E 30 11 57 54 76 3C 3D 94 20 38 A7 9A 6C 89 D3>)
(   7,<2012-03-24 22:14:02.562 -0500>,<Administrator>,<TOPSPIN>,<proc1d>,<TOPSPIN 2.1>,
      <abs ABSG = 4 
       data hash MD5: 32K
       11 49 EC 47 D2 CF 6D CC 38 2B D9 96 77 FB DD 2B>)
(   8,<2012-03-24 22:14:02.593 -0500>,<Administrator>,<TOPSPIN>,<proc1d>,<TOPSPIN 2.1>,
      <abs ABSG = 5 
       data hash MD5: 32K
       8F 92 E6 E1 0C 6C C2 80 03 22 19 9B 38 6D C8 1A>)
$$ ##END=
$$ 
$$ $$ hash MD5
$$ $$ 6C 59 BB E6 15 DB 66 F1 C2 78 50 B5 15 6C 1E B4
##$RELAX= 
##$RELAX= 
##$RELAX= 
##$RELAX= 
##$RELAX= 
##$RELAX= 
##$RELAX= 
$$ Bruker specific parameters
$$ --------------------------
$$ [...]
##$TP= (0..7)
150 150 150 150 150 150 150 150
##$TP07= 0
##$TPNAME0= <>
##$TPNAME1= <>
##$TPNAME2= <>
##$TPNAME3= <>
##$TPNAME4= <>
##$TPNAME5= <>
##$TPNAME6= <>
##$TPNAME7= <>
##$TPOAL= (0..7)
0.5 0.5 0.5 0.5 0.5 0.5 0.5 0.5
##$TPOFFS= (0..7)
0 0 0 0 0 0 0 0
##$TUNHIN= 0
##$TUNHOUT= 0
##$TUNXOUT= 0
##$USERA1= <user>
##$USERA2= <user>
##$USERA3= <user>
##$USERA4= <user>
##$USERA5= <user>
##$V9= 5
##$VALIST= <valist>
##$VCLIST= <CCCCCCCCCCCCCCC>
##$VD= 0
##$VDLIST= <DDDDDDDDDDDDDDD>
##$VPLIST= <PPPPPPPPPPPPPPP>
##$VTLIST= <TTTTTTTTTTTTTTT>
##$WBST= 2048
##$WBSW= 25
##$XGAIN= (0..3)
0 0 0 0
##$XL= 0
##$YL= 0
##$YMAX_a= 527372
##$YMIN_a= -634851
##$ZGOPTNS= <>
##$ZL1= 120
##$ZL2= 120
##$ZL3= 120
##$ZL4= 120
##$ABSF1= 14.98061
##$ABSF2= -5.57192
##$ABSG= 5
##$ABSL= 3
##$ALPHA= 0
##$AQORDER= 0
##$ASSFAC= 0
##$ASSFACI= 0
##$ASSFACX= 0
##$ASSWID= 0
##$AUNMP= <proc_prof1d_extract_pilot.lims>
##$AXLEFT= 0
##$AXNAME= <>
##$AXNUC= <1H>
##$AXRIGHT= 0
##$AXTYPE= 0
##$AXUNIT= <>
##$AZFE= 0.1
##$AZFW= 0.1
##$BCFW= 0
##$BC_mod= 0
##$BYTORDP= 0
##$COROFFS= 0
##$CY= 15
##$DATMOD= 1
##$DC= 0
##$DFILT= <>
##$DTYPP= 0
##$F1P= 0
##$F2P= 0
##$FCOR= 0.5
##$FTSIZE= 32768
##$FT_mod= 6
##$GAMMA= 0
##$GB= 0
##$INTBC= 1
##$INTSCL= 1
##$ISEN= 128
##$LB= 0
##$LEV0= 0
##$LPBIN= 0
##$MAXI= 10000
##$MC2= 0
##$MEAN= 0
##$ME_mod= 0
##$MI= 0
##$NCOEF= 0
##$NC_proc= -8
##$NLEV= 6
##$NOISF1= 0
##$NOISF2= 0
##$NSP= 0
##$NTH_PI= 0
##$NZP= 0
##$OFFSET= 14.98061
##$PC= 1
##$PHC0= 215.9308
##$PHC1= 0
##$PH_mod= 1
##$PKNL= yes
##$PPARMOD= 0
##$PPDIAG= 0
##$PPIPTYP= 0
##$PPMPNUM= 2147483647
##$PPRESOL= 1
##$PSCAL= 4
##$PSIGN= 0
##$PYNMP= <proc.py>
##$REVERSE= no
##$SF= 400.13
##$SI= 32768
##$SIGF1= 0
##$SIGF2= 0
##$SINO= 400
##$SIOLD= 32768
##$SPECTYP= <>
##$SREGLST= <1H.CDCl3>
##$SSB= 0
##$STSI= 32768
##$STSR= 0
##$SW_p= 8223.68421052632
##$SYMM= 0
##$S_DEV= 0
##$TDeff= 65536
##$TDoff= 0
##$TI= <>
##$TILT= no
##$TM1= 0
##$TM2= 0
##$TOPLEV= 0
##$USERP1= <user>
##$USERP2= <user>
##$USERP3= <user>
##$USERP4= <user>
##$USERP5= <user>
##$WDW= 1
##$XDIM= 32768
##$YMAX_p= 465390622
##$YMIN_p= -699422
##$CURPLOT= <Network HP LaserJet P1505>
##$CURPRIN= <$Network HP LaserJet P1505>
##$DFORMAT= <normdp>
##$LAYOUT= <+/1D_H.xwp>
##$LFORMAT= <normlp>
##$PFORMAT= <normpl>
##$SURQMSG= 1
$$ End of Bruker specific parameters
$$ ---------------------------------
##NTUPLES= NMR SPECTRUM
##VAR_NAME=  FREQUENCY,     SPECTRUM/REAL,   SPECTRUM/IMAG
##SYMBOL=    X,             R,               I
##VAR_TYPE=  INDEPENDENT,   DEPENDENT,       DEPENDENT
##VAR_FORM=  AFFN,          ASDF,            ASDF
##VAR_DIM=   32768,         32768,           32768
##UNITS=     HZ,            ARBITRARY UNITS, ARBITRARY UNITS
##FACTOR=    0.250966925370066, 1,           1
##FIRST=     8223.43324360095, 77297,        57082
##LAST=      0,             36598,           -118743
##MIN=       0,             -699422,         0
##MAX=       8223.43324360095, 465390622,    0
$$ Real data points
##PAGE= N=1
##DATA TABLE= (X++(R..R)), XYDATA
$$ [...]
19440g2523A2362a74099j33127b6382k1260j06258K3470E7826f6384j07912G9090
19428a33851A2123c03898J12144A43277k0773b39411N4461P6723H135L45645e0078
19416b13187R8842K8519B2000a95096o7906A7208b01388K4082p2355j2571j9121
19405b81353A35001a23937j11791a05110B31238c09440R6394Q1741m5134L1997
19395a44442o1388A14885a64634j66670H8144a31650A60796C8467a20251M9968
19385g0283q1623j25732a5009l54803J77056O5451c815k77011i6977j93729d3807
19373e57574d4687m3618M0526A43595d3152j19487A89399b47519j4096f510r608
19362a6118G1989a63662A23404L8693a62591n2708a03345K9219j56165F4422a26984
$$ plain form
19440 -72523 12362 -174099 -307226 -26382 -47642 -153900 -130430 57826 -66384 -174296 79090
19428 -133851 12123 -303898 -191754 143277 122504 -239411 -184950 -108227 8135 353780 -50078
19416 -213187 -114345 -85826 22000 -195096 -263002 17208 -201388 -177306 -249661 -262232 -281353
19405 -281353 135001 -123937 -235728 -105110 231238 -309440 -213046 -131305 -176439 -144442
19395 -144442 -205830 114885 -164634 -331304 88144 -131650 160796 38467 -120251 -70283
19385 -70283 -151906 -277638 -15009 -369812 -192756 -127305 -3815 -280826 -96977 -290706 -43807
19373 -557574 -44687 -88305 -47779 143595 -43152 -162639 189399 -247519 -261615 -6510 -16118
19362 -16118 71989 -163662 123404 162097 -162591 -215299 -103345 -74126 -230291 64422 -126984
19350A3373O1099b03694B53833c04177N2845c3300j24465q9285a09423q0122P0134
19339a19411M2234K0473j72949f5865G9788L2169a22816a5016j61855j29941c7481
19327A23060i0749k80426B5219d17117a52806C9787J3868o927J77787b59590a9872
19315a56806P5635A70991c12124p6002A07360c6430j50203M8789D65538H6022
19304D8942E516a3608m3901G6922j1441c01302a05132k18019J32669j23867E0750
19292a90659h7760A84562a51635c4289j47324L1234q3623A45645c97010a97754
19281d9024l38064N0619h1297A38211f157A38776l9669b33304a04655C13732b61374
19269A36621b94286P622R8014k27204a15425o0782m8744H730M3405B3949c13699
$$ plain form
19350 13373 74472 -203694 253833 -304177 -251332 -33300 -157765 -247050 -109423 -189545 -119411
19339 -119411 -77177 -56704 -229653 -65865 79788 111957 -122816 -15016 -176871 -306812 -37481
19327 123060 -90749 -371175 25219 -417117 -152806 39787 53655 46728 224515 -259590 -19872
19315 -156806 -81171 170991 -312124 -388126 107360 -36430 -186633 -137844 465538 86022
19304 48942 5516 -13608 -57509 76922 65481 -301302 -105132 -323151 -190482 -314349 50750
19292 -190659 -87760 184562 -151635 -34289 -181613 -150379 -234002 145645 -397010 -197754
19281 -49024 -387088 -336469 -81297 138211 -6157 138776 99107 -233304 -104655 313732 -261374
19269 136621 -294286 -286664 -188650 -415854 -115425 -176207 -224951 8730 52135 23949 -313699
19257h8552B6567h8554E7806a89705H333b8442k71543p2454a36252N8311B76611
19245C1389a92747k9307b3155j8218j39275J3493A53524a75838H7361a29443k5034
19234a54477G1997a62658D2501i3015k21579n3455a26258j90253d0593E3707J85162
19223B38869d16902a17131r8980r1059B41250j01097b71146g8185B6737O4471
19213I1208J6929A1777a13422o352c8543o5021d986o0384j49715e914l18564J56287
19201a68191A07108f1453k15003b3603j16636D4936d353B62734J48406b96304
19190f2356j5898p2826q1142q1426a01726J3691A8718a67806B7254D247J52568
19179A56815a6052l24747F3181b5926k43366f695p604J948k90302A45902b77868
$$ plain form
19257 -88552 26567 -88554 57806 -189705 8333 -28442 -299985 -372439 -136252 -77941 276611
19245 31389 -192747 -222054 -23155 -41373 -180648 -167155 153524 -175838 87361 -129443 -154477
19234 -154477 71997 -162658 42501 -93015 -314594 -368049 -126258 -316511 -40593 53707 238869
19223 238869 -416902 -117131 -216111 -307170 241250 140153 -271146 -78185 26737 91208
19213 91208 108137 11777 -113422 -119774 -38543 -103564 -4986 -65370 -215085 -5914 -324478 -168191
19201 -168191 107108 -61453 -276456 -23603 -140239 44936 -4353 262734 411140 -296304
19190 -62356 -78254 -151080 -232222 -313648 -101726 -88035 18718 -167806 27254 4247 156815
19179 156815 -16052 -340799 63181 -25926 -269292 -6695 -14299 -12351 -302653 145902 -277868
19167B1767i9906D14a26064B19201r9602J20827a02045j15379e1845j52544F7992
19155h7234k75025J29405j14424a46357q2184e9315l51649J88913J9394K4296
19145a78361P6852C3383M575f4097A32166r117K6327b61488I0051h0616k54574
19134c35190J06950C2693b18395A2731h5659j55091c3024k45803e4111k70658
19124c24769c0607k68160J34597M4339p7492E2560a37175q6016R196A26341b02405
19112d6769j23550q9104A1021K2800K17142c05796A07766a73420d5060n6944H263
19100b17767q0736d3839q6012B72654C6004J29476F0205b15707a1242r0347a4571
19088e057n3099b4561A91795d5637B62177A10630a89846m0683G1693P42b00564
$$ plain form
19167 21767 -99906 414 -126064 219201 119599 240426 -102045 -217424 -51845 -204389 67992
19155 -87234 -362259 -232854 -347278 -146357 -228541 -59315 -410964 -222051 -202657 -178361
19145 -178361 -101509 33383 37958 -64097 132166 123049 149376 -261488 90051 -80616 -335190
19134 -335190 -228240 32693 -218395 12731 -85659 -240750 -33024 -278827 -54111 -324769
19124 -324769 -30607 -298767 -164170 -119831 -197323 52560 -137175 -223191 -213995 126341 -202405
19112 -46769 -170319 -259423 11021 33821 250963 -305796 107766 -173420 -45060 -102004 8263
19100 -217767 -298503 -43839 -129851 272654 36004 165480 60205 -215707 -11242 -101589 -14571
19088 -5057 -58156 -24561 191795 -45637 262177 110630 -189846 -230529 71693 72435 -200564
19076g1371l027B12840o7494b5546C1116c9179j6877a6277m9880G3541a24845
19064e772I1781g8698E8797b15956D7269R6891a97635A57667b47302e1649A38769
19052A90191G9659b11146O0094B7769b32946L0550q135k11760a00841A32335a26904
19040A28761e1382j42517l2049c1241l4381J4352k34175f4988q7476j31951M7082
19029b37333F8104d0309l25495B3763D189i1790F5334O9438J1003b93706J32120
19018a61586c123B09171I665b61162B34487b74315A8031K36705P7372d181l0523
19007c4704A22127N8881e3320B99801I7210h8679B57381c66580B2667a63415b8506
18995a30019j87030e9653B44387b29571E9097g772B31063A15459a27650p0556
$$ plain form
19076 -71371 -74398 212840 145346 -25546 31116 -39179 -56056 -16277 -66157 73541 -124845
19064 -5772 91781 -78698 58797 -215956 47269 144160 -197635 157667 -247302 -51649 138769
19052 190191 79659 -211146 -151052 27769 -232946 -202396 -210531 -422291 -100841 132335 -126904
19040 128761 -51382 -193899 -225948 -31241 -65622 -51270 -285445 -64988 -152464 -284415 -237333
19029 -237333 68104 -40309 -365804 23763 4189 -91790 65334 134772 145775 -293706 -161586
19018 -161586 -3123 209171 9665 -261162 234487 -274315 18031 254736 332108 -4181 -34704
19007 -34704 122127 181008 -53320 299801 97210 -88679 257381 -366580 22667 -163415 -28506
18995 -130019 -317049 -59653 244387 -229571 59097 -7772 231063 115459 -127650 -198206
18985a98206d9859j16934n6577a02436M9760j40371p1398c8088j55529A11981
18974A75624a32822D68213a66471c8782k55318g1751q4896f7094j86675E2281
18963B39430b72131A45879J05087o8320i4108d6018B26064M27856l01169A17913
18952a13852L1856o5328A63968C3339a0816A02268L7162a6738j77438A39261b12171
18940b92295A71510b55308A06337a77432O0962N97A65172m8896b339B1361a57634
18928a88942F8992P5553e3005G2956a70416q014m9194F2852a8611C35692i280
18916a32432c399C92976a2618D8962N7093a54038R731I3574L34178b09149i8788
18904C7443a9065A97481J51977H1826l4934f7684B23280D1432h2477D10749q006
$$ plain form
18985 -198206 -49859 -166793 -223370 -102436 -52676 -193047 -264445 -38088 -193617 111981
18974 175624 -132822 468213 -166471 -38782 -294100 -71751 -156647 -67094 -253769 52281
18963 239430 -272131 145879 250966 182646 -94108 -46018 226064 653920 352751 117913
18952 -113852 -81996 -147324 163968 33339 -10816 102268 139430 -16738 -194176 139261 -212171
18940 -292295 171510 -255308 106337 -177432 -116470 -115873 165172 116276 -2339 21361 -157634
18928 -188942 68992 144545 -53005 72956 -170416 -178430 -227624 62852 -18611 335692 -9280
18916 -132432 -3399 392976 -12618 48962 106055 -154038 -144307 93574 427752 -209149 -98788
18904 37443 -19065 197481 349458 81826 46892 -67684 223280 41432 -82477 410749 402743
18893D02743j24227J32051j54553L8898j45119c0143k05932g069r3844K910j57089
18882b55092F299e85975c5730j41196g2276j17895c9154o9430l8277e3195B1967
18870E1050a75639k4668k6563D2601O4512B1321a36758n718k24071i8254l7552
18859a35806n2345B44694K6457b92914j29640i3637j52120e5006j40436R0398
18849a05044A57354A2879N3519L1949a83179j37727P5762C083R5725b33601F9195
18837b4936j27871c1631F4126L5074c3265k27573J05230m9124Q0282A90379f1113
18825A75008c37402C4662b19824B3760c3656j9759A3766a05072j84217Q1072c2361
18813b41340L1335h1385B15724a5325B9203c05216K7524B33491J50323A12919
$$ plain form
18893 402743 278516 410567 256014 294912 149793 -30143 -236075 -7069 -100913 -98003 -255092
18882 -255092 6299 -585975 -35730 -176926 -72276 -190171 -39154 -108584 -146861 -53195 21967
18870 51050 -175639 -200307 -226870 42601 107113 21321 -136758 -142476 -366547 -98254 -135806
18859 -135806 -188151 244694 271151 -292914 -422554 -93637 -245757 -55006 -195442 -105044
18849 -105044 157354 12879 66398 98347 -183179 -320906 -245144 3083 98808 -233601 69195
18837 -24936 -152807 -31631 64126 99200 -33265 -260838 -155608 -204732 -124450 190379 -61113
18825 175008 -337402 34662 -219824 23760 -33656 -53415 13766 -105072 -289289 -208217 -32361
18813 -241340 -210005 -81385 215724 -15325 29203 -305216 -277692 233491 383814 112919
18802A6841O1312a06700B14937b23615A07543J85199d7237k2070j36956e6626
18791C21926C2241K33129f077I9164b26542d1425J4182A97068a28994l96281O0728
18780d64547a94838C0114L2241J22114a04830E8781c455n2878A00191a82513N3703
18769a28810c0295j41549O9170l7109i270B11984b44895J13597r566N0451A07036
18757b27309o2396Q0935r9131a03733j00746e4578m9706J2209c1692E053J14462
18746A19515A4253c40990j01714A86445b79221A58708a15278l3999A9357K03529
18736B22886a63464P6617A59349i9490G0974c48075a43244j19250a28521K4638
18726a03883l5087I441a20370d7274J6606o6257k22267A62050c52028a00895I4893
$$ plain form
18802 16841 78153 -106700 214937 -223615 107543 292742 -47237 -69307 -206263 -56626
18791 321926 32241 265370 -6077 99164 -226542 -41425 -27243 197068 -128994 -525275 -464547
18780 -464547 -194838 30114 62355 184469 -104830 58781 -3455 -56333 100191 -182513 -128810
18769 -128810 -30295 -171844 -102674 -139783 -9270 211984 -244895 -131298 -140864 -90413 107036
18757 -227309 -289705 -208770 -307901 -103733 -204479 -54578 -104284 -92075 -31692 5053 119515
18746 119515 14253 -340990 -442704 186445 -279221 158708 -115278 -149277 19357 222886
18736 222886 -163464 -86847 159349 -99490 70974 -348075 -143244 -262494 -128521 -103883
18726 -103883 -138970 9441 -120370 -47274 -30668 -96925 -319192 162050 -352028 -100895 94893
18714d81689a18348M1996A02767a12879G7349b00693f0534C07519f04404I7087
18703A98504J3600a66499d712A37423F2161J80206b9062j46531I9314b3531C05299
18691A78842m0343i1060N718A91744C4754c1443G4168K27636H3296A8681K03061
18680B21742c3417A03955e2250B10629c18995M2518Q0623K1332A04022M5867D6790
18668a53504E5659b0101o66789a24122j55161A67364C1867g1058A7763J65659
18658A83422M1647H3542b65543P7620m0597e2101l0763n179F3309g2220j28486
18647b00706M5978l3822O8161j8061j04008D3990a22150j2570k60677J74839A08112
18635a3841j39738I4046a60209Q383L9565j32410K2656i0071o0714M9475k44281
$$ plain form
18714 -481689 -118348 -76352 102767 -112879 77349 -200693 -60534 307519 -604404 97087
18703 198504 212104 -166499 -4712 137423 62161 242367 -29062 -175593 99314 -23531 305299
18691 178842 138499 -91060 -85342 191744 34754 -31443 74168 301804 83296 18681 221742
18680 221742 -33417 103955 -52250 210629 -318995 -276477 -195854 -174522 104022 149889 46790
18668 -153504 55659 -20101 -686890 -124122 -279283 167364 31867 -71058 17763 183422
18658 183422 225069 83542 -265543 -187923 -228520 -52101 -82864 -88043 63309 -72220 -200706
18647 -200706 -154728 -188550 -120389 -138450 -242458 43990 -122150 -134720 -395397 -220558 108112
18635 -13841 -153579 94046 -160209 -151826 -112261 -244671 -222015 -90071 -150785 -101310 -345591
18624c45591a7535l98844J74709j33918a59588c4128m06916I2621e1808l67181
18614d18989A99973C0368a45289e7971A20612A3894b28704m6768C05794j34704
18604A71090i5533m19894a55251A81590b11161B5247f6277H284a5360j23979q3622
18593b22961A37821E0553J43044g1833L0111k7909J0264p5395A9098A747a13291
18581I1139f6676H6708B1466b66057a13358D0012b71520B41034F3412a22977m1715
18570a64692c3297A88395c53508a68930I3290M1511K3651N6972a11574J8880j48506
18559b41200C75196g6762k21724c177A23117C7137a47030D0924a62657H658q21
18548G837b4730j45454A1758f9033k97206I1935C5184a39172H3992a15953A57774
$$ plain form
18624 -345591 -17535 -416379 -241670 -375588 -159588 -34128 -441044 92621 -51808 -418989
18614 -418989 199973 30368 -145289 -57971 120612 13894 -228704 -275472 305794 171090
18604 171090 -95533 -515427 -155251 181590 -211161 25247 -66277 8284 -15360 -139339 -222961
18593 -222961 137821 50553 193597 -71833 -41722 -69631 -59367 -134762 19098 1747 -113291
18581 91139 -66676 86708 21466 -266057 -113358 40012 -271520 241034 63412 -122977 -164692
18570 -164692 -33297 188395 -353508 -168930 93290 134801 158452 215424 -111574 -92694 -241200
18559 -241200 375196 -76762 -298486 -3177 123117 37137 -147030 40924 -162657 8658 7837
18548 7837 -24730 -170184 11758 -69033 -366239 91935 35184 -139172 83992 -115953 157774
18536c71434B34242D776f9371b1367l91901B73598d8164n6815m0469j03760a6872
18524A54666l3002b09195O3634A7115h2808l44727a36441M9320b5416k21523Q771
18513b38168B16332j4797a1150m5621R668B06845c26927B16618A2734a05138j51429
18502b56567b809A96608a83814j4164G0971d33639B30030a8398k03131G1944i9910
18490a53067g1229A22622c74449I6250a89389g5206L1173C34417A39004c2703
18479A58967h5817o8734o821B3095a09002a9274k96114A8812J46821E8240k5031
18468C3209b13479B67556c8285k45780a00434b4789m4717q9516a7009j24335N3037
18457h8307j98713H9767b19935O5707B48733A0287b1298k61900H5828J00032b72412
$$ plain form
18536 -371434 234242 4776 -69371 -21367 -413268 273598 -48164 -104979 -145448 -249208 -16872
18524 154666 121664 -209195 -145561 17115 -82808 -427535 -136441 -87121 -25416 -246939 -238168
18513 -238168 216332 201535 -11150 -56771 -47103 206845 -326927 216618 12734 -105138 -256567
18502 -256567 -2809 196608 -183814 -197978 70971 -433639 230030 -18398 -221529 71944 -99910
18490 -153067 -71229 122622 -374449 96250 -189389 -75206 -44033 334417 139004 -32703
18479 158967 -85817 -154551 -161372 23095 -109002 -19274 -315388 18812 165633 58240 33209
18468 33209 -213479 267556 -38285 -284065 -100434 -24789 -69506 -159022 -17009 -141344 -88307
18457 -88307 -287020 89767 -219935 -154228 248733 10287 -21298 -283198 85828 185860 -272412
18445E5355J3019C856b05464A86914F6899b22931R4705A57950J28016b76355i4871
18433d33441H5830g4705I6066c7683A2724K10966e79285A40963a09282j83411
18423b92693d1487l8317j01148A66703d918j12683j39553J09518k23554A10066
18412c42778B17856n3146D6506r293a68789J0981A09269g5356j95206I0038q483
18401H1555d587A82689b1986A48201a53650G6892d69206B03673h1562q9714f7973
18389a04504H3829B1364M45966a61607D6719f0989B0806N1715J98056K33488b31133
18377I8303b75035e7908H6415a66438m6075a4252j36088K5988k06678a60155B7499
18365a49992k4336A30007c15420A13622a03407a9988j78418D23903b22629j64410
$$ plain form
18445 55355 68374 3856 -205464 186914 66899 -222931 -128226 157950 285966 -276355 -94871
18433 -433441 85830 -74705 96066 -37683 12724 223690 -579285 140963 -109282 -292693
18423 -292693 -41487 -79804 -180952 166703 -4918 -117601 -257154 -147636 -371190 110066
18412 -342778 217856 164710 46506 37213 -168789 -157808 109269 -75356 -270562 90038 81555
18401 81555 -4587 182689 -21986 148201 -153650 76892 -469206 203673 -81562 -171276 -67973
18389 -104504 83829 21364 467330 -161607 46719 -60989 20806 72521 270577 504065 -231133
18377 98303 -275035 -57908 86415 -166438 -212513 -14252 -150340 -124352 -331030 -160155 27499
18365 -149992 -174328 130007 -315420 113622 -103407 -19988 -198406 423903 -222629 -387039
18355c87039k7678A29633C7201J15692h6972A60905f3248C70169a42005l890k22770
18344c68665a8642I9821m9722c09051i8857k08404h804m428F723a24174d6100
18332a73498P5222A70259c15814G88P2260K31017b3862B84081j41432C7533J77000
18321B14533b01810r1421a37566N1572B28443a34436C1948J29718a8458j0998
18311b9456R347H7866L34294E0921L43879g38A39484J13120A14499a80337C34124
18299a97486o6272G9143a76036p7276I5122a61694I8885g275q8656B03352K7297
18288B30649i9433C34834F7005c7793j07868n1727P7179A80932a18093m3756C51606
18276b71064A48022N7858c0683C1691O5313a63778A65158i2218A36924H623C077
$$ plain form
18355 -387039 -414717 129633 37201 152893 -86972 160905 -63248 370169 -142005 -145895 -368665
18344 -368665 -18642 99821 50099 -309051 -98857 -307261 -8804 -13232 6723 -124174 -46100
18332 -173498 -98276 170259 -315814 788 73048 304065 -23862 284081 142649 37533 214533
18321 214533 -201810 -293231 -137566 -85994 228443 -134436 31948 161666 -18458 -29456
18311 -29456 -20109 87866 422160 50921 394800 -738 139484 252604 114499 -180337 334124
18299 -197486 -263758 79143 -176036 -253312 95122 -161694 98885 -7275 -95931 203352 230649
18288 230649 -99433 334834 67005 -37793 -145661 -197388 -120209 180932 -118093 -161849 351606
18276 -271064 148022 205880 -30683 31691 97004 -163778 165158 -92218 136924 8623 3077
18264f6656J5426B14181d4672F5414A5806Q3708a12273j09012A2136N5113M9601
18253A16850J10622a95760H7730a03267k32430r3764g7126n5824A99754a05138
18242b69275c7220j5816B45054c41955J53570k2429c3328k18112A9461K54754
18232B74215A05609j7324a03341B2555J02721a60765j17772c6111A00916K34208
18222C35124d2082B14990k3868b60010R600F2712B8596a36094m9038h7343A80461
18210a5627p9768H5568M9974d23603c8012j27973I7218k6842f2547I7471J68869
18199B66340G1749M83J41478A6536L5954K5510a253j74631A06289K05080H883
18187b50755O1758B0229J08778a77727A47009h3161P366L1550l10859R9694h0829
$$ plain form
18264 -66656 -51230 214181 -44672 65414 15806 99514 -112273 -221285 12136 67249 116850
18253 116850 227472 -195760 87730 -103267 -335697 -429461 -77126 -132950 199754 -105138
18242 -269275 -37220 -53036 245054 -341955 -188385 -210814 -33328 -251440 19461 274215
18232 274215 105609 88285 -103341 22555 125276 -160765 -278537 -36111 100916 335124
18222 335124 -42082 214990 191122 -260010 -250410 62712 28596 -136094 -185132 -87343 180461
18210 -15627 -95395 85568 135542 -423603 -38012 -165985 97218 70376 -62547 97471 266340
18199 266340 71749 72232 213710 16536 52490 78000 -1253 -175884 106289 311369 8883
18187 -250755 -188997 20229 129007 -177727 147009 -83161 -75795 -44245 -355104 -255410 -80829
18175a41188B78045h6080q4452k43056a26394C6018O6089N1474a25634B3107Q5434
18164A08541J9270a16245d3956D2295J48863n5783A7594f7292B46959a85734H1120
18152h9494j12786B52353A20099a12437e4851j13395e8365p5710k43884c6571
18141D4356d1754E9778k5816a99884A93246N4697c26625I7147d25802F8031a87076
18129G6521e3469n0287D67809a34353b9141j75574F8226L387K1621J53358b45564
18117A39983N1288n180i607j66680M7225B77348a61129A41172a44885b0286A03554
18105H891b2567A67404a33145A44249a4629A8931a61874C27524A094b9070j3981
18094d3051k46869J20034a7763q6676J149q03B52151j02830a69679f7182j05410
$$ plain form
18175 -141188 278045 -86080 -170532 -413588 -126394 36018 102107 153581 -125634 23107 108541
18164 108541 127811 -116245 -43956 42295 191158 135375 17594 -67292 246959 -185734 81120
18152 -89494 -202280 252353 120099 -112437 -54851 -168246 -58365 -134075 -377959 -36571
18141 44356 -41754 59778 33962 -199884 193246 247943 -326625 97147 -425802 68031 -187076
18129 76521 -53469 -103756 467809 -134353 -29141 -204715 68226 71613 93234 246592 -245564
18117 139983 191271 186091 -9607 -176287 -129062 277348 -161129 141172 -144885 -20286 103554
18105 8891 -22567 167404 -133145 144249 -14629 18931 -161874 327524 1094 -29070 -43051
18094 -43051 -289920 -169886 -17763 -104439 -103290 -104093 252151 149321 -169679 -67182 -172592
18083a72592Q1344K8434B3526c3959l9562J5108I7101d03980B42368a48912r5158
18072b44070P0490B1724b20527A03052Q358q076d2880k01067h5058L479C8180
18060E8857J84239L5655M038I5550L01736d0794A06760h8691D544K54935h6554
18048a93516O4456e7984E865M226a54831m4426I3696a01032d2449F0646K1487
18037H2133a9347j76978A67830d1159j81878Q463A87941F8573R7330J47432j37323
18026A76012H3244C8733b81245G1798l384k8263b25897h4603C19219a5266l50154
18015c65420A00898h9485A64380d0051j11170C26667a13487A48080h87p4232p2258
18004a47377b2946j72444J3984A34246a47528B70099F4313h7012l25763J98248
$$ plain form
18083 -172592 -91248 -62814 23526 -33959 -73521 -58413 97101 -403980 242368 -148912 -244070
18072 -244070 -173580 21724 -220527 103052 111410 103334 -42880 -243947 -85058 -81579 38180
18060 58857 243096 278751 282789 95550 397286 -40794 106760 -88691 4544 259479 -86554
18048 -193516 -129060 -57984 5865 10091 -154831 -199257 93696 -101032 -42449 60646 82133
18037 82133 -19347 -196325 167830 -41159 -223037 -214574 187941 68573 165903 313335 176012
18026 176012 83244 38733 -281245 71798 68414 40151 -225897 -84603 319219 -15266 -365420
18015 -365420 100898 -89485 164380 -40051 -151221 326667 -113487 148080 -887 -75119 -147377
18004 -147377 -22946 -195390 -181406 134246 -147528 270099 64313 -87012 -412775 -214527
17994b14527B19160c13048A4297J20912n8478b9691A86977h4346A1558a28371
17983i8170A21612a55852B09401c2521C3611b3758J109H6453a46886f6565l0564
17972i7129E7295P6731O9519A927a85777G4503d0616p2668B41795b24902k8605
17961b53507C67206A61070F6965K8421A7826J95245A4850b2571k98295a8934A00147
17949g7785B99871a84305H2483J05760a63365k08418P0828A95206A4586L7865
17939E2451a64530E8247c02022G2703R0673c37856J68588f762H9828K24034E7008
17927B32612M4303G8710K9581b06164M4134B16610D8267J2594i3091A63613a48091
17915a79098O1886m18116B46970j9439a68815B00615l1304H0453b0046B0645J2992
$$ plain form
17994 -214527 219160 -313048 14297 135209 76731 -29691 186977 -84346 11558 -128371
17983 -98170 121612 -155852 209401 -32521 33611 -23758 -22649 86453 -146886 -66565 -97129
17972 -97129 57295 134026 203545 1927 -185777 74503 -40616 -113284 241795 -224902 -253507
17961 -253507 367206 161070 66965 95386 17826 213071 14850 -22571 -320866 -18934 100147
17949 -77785 299871 -184305 82483 188243 -163365 -371783 -300955 195206 14586 52451
17939 52451 -164530 58247 -302022 72703 163376 -337856 -169268 -6762 89828 313862 57008
17927 232612 276915 78710 108291 -206164 -162030 216610 48267 60861 -93091 163613 -148091
17915 -179098 -117212 -535328 246970 227531 -168815 200615 169311 80453 -20046 20645 33637
17904C3637M7549K28769F3181N59166C05909d49381C18127a65609B94639a92170
17893C5913a16728C9746M0748J19468a24440F7311J32572J02975d728C15801D0718
17881G0214J18714a4758I3473M38445b8447I0346h5157a1207m7236M909B45813
17869A92970R26q2628b33020f2641j06078I1586a8427A08350K68553A38162J45339
17858B83501E2402a26302H7529K47a10336H6510J13929e1905H8664J77877c4456
17846A98771b7605p741B06762r1411d2618A23862a70922B48666H3756K26575D1295
17834h8067E0768J03846a79l0733n6306J0925A60575F5369b3536C37162b86280
17822h6422A10265a27204A29839a10507G1819O4064K9991B9923Q5098l222f3102
$$ plain form
17904 33637 81186 309955 63181 622347 305909 -449381 318127 -165609 294639 -192170
17893 35913 -116728 39746 80494 199962 -124440 67311 199883 302858 -4728 315801 40718
17881 70214 188928 -14758 93473 531918 -28447 90346 -85157 -11207 -58443 -53534 245813
17869 192970 193896 111268 -233020 -62641 -168719 91586 -18427 108350 376903 138162 283501
17858 283501 52402 -126302 87529 87776 -110336 86510 200439 -51905 88664 266541 -34456
17846 198771 -27605 -35346 206762 115351 -42618 123862 -170922 248666 83756 310331 41295
17834 -88067 50768 154614 -179 -30912 -87218 -76293 160575 65369 -23536 337162 -286280
17822 -86422 110265 -127204 129839 -110507 71819 135883 165874 29923 115021 111799 -63102
17810a15229C8097O7075K32286a70709k326h5759F9042M2623J28707f5434K8157
17799c7277j84410A12956J65569a35756b3073j23337A14400a25797A41281n0339
17789I0942A0923b3144j33109F5400B0684q935Q9630K79105F6288e3094D1890
17777b42144J12913A24834a24274G9272L05549a23960C25422C8123J60007a29009
17766B76698a03287b6124B54602h1134A25508N1987a53841C73545d30463f9496
17755A93779P531P7946a1033D32360j97059c82015f883A62902P383H4297c3841
17743d50844B25377c79429e0043A06135f0581C39156c05949a49363B33343a27400
17732A80472a94043P4381I6315a70144k6097H1665g2105b7684B46787C5694i8265
$$ plain form
17810 -115229 38097 105172 337458 -170709 -173035 -85759 69042 111665 240372 -65434 -37277
17799 -37277 -221687 112956 278525 -135756 -23073 -146410 114400 -125797 141281 90942
17789 90942 10923 -23144 -156253 65400 20684 11749 101379 380484 66288 -53094 41890
17777 -242144 -129231 124834 -124274 79272 384821 -123960 325422 38123 198130 -129009
17766 276698 -103287 -26124 254602 -81134 125508 177495 -153841 373545 -430463 -69496
17755 193779 201310 279256 -11033 432360 235301 -382015 -6883 162902 170285 84297 -33841
17743 -450844 225377 -379429 -50043 106135 -60581 339156 -305949 -149363 233343 -127400
17732 180472 -194043 -119662 96315 -170144 -196241 81665 -72105 -27684 246787 35694 -98265
17720F1296J34157K5020a46497B77447E7152c0945j45125B58743D730a23234A20007
17708B89066j32223l8846a23649L8101B24538J25455F5679K07587E4265L2176
17698H6441L56062A08563E0637L6587J3553A7714J86630G6165g0994A95943A6039
17686C80185f8020A04891j7053N3786Q8404g8432B88450j11261b70957a29206
17675A19328a15016B63367i6244N171E1262n505a07487B90985J26943E3394L0863
17664H4257J77785j25950b16629A03601J12540L317M2482a24143b5158G7879L80348
17653D58227q8620i6035C59591a1601k0328A03371a13448a3793B86905H218K09758
17642B17976D2971O2906J3509J47694H4804J35065c6166A36316B3124K26849n1999
$$ plain form
17720 61296 195453 220473 -146497 277447 57152 -30945 -176070 258743 4730 -123234 120007
17708 289066 156843 117997 -123649 -85548 224538 349993 65679 273266 54265 86441
17698 86441 442503 108563 50637 87224 100777 17714 204344 76165 -70994 195943 16039
17686 380185 -68020 104891 87838 141624 230028 -78432 288450 177189 -270957 -129206
17675 119328 -115016 263367 -96244 -91073 51262 45757 -107487 290985 417928 53394 84257
17664 84257 262042 136092 -216629 103601 216141 219458 261940 -124143 -25158 77879 458227
17653 458227 369607 -96035 359591 -11601 -31929 103371 -113448 -13793 286905 8218 217976
17642 217976 42971 105877 119386 267080 84804 219869 -36166 136316 23124 249973 197974
17631A97974e203I8136f55q741C7062M5808b61086B21128l9344N437a92377A45460
17618B10506j1957K17514A3676O149o327J35913R6120n1577p5422j0907K26341
17607C33966j55061q0018K07925a76556A39763P9400a38787a549D92663k5291
17597D67372j76222a36077A78490J25240e2035A73130A4917b4156D8728R6616
17587A45344P4464Q13p7680j7251B755J07711a18510D51634A59242L2544K45888
17576D37674L88j07544a02326L1998C6169A1348d3958F5069A3300O3018K13814
17565B90132h6083B37646E7336M3266J26439J01129I0459a85239A213K89895I6771
17553a15261o3566B70997F7737K06738p9915O9804j19427i503A22750L05321f8105
$$ plain form
17631 197974 -5203 98136 -655 -9396 37062 82870 -261086 221128 181784 187221 -192377 145460
17618 210506 198549 416063 13676 19825 13498 149411 245531 193954 118532 107625 333966
17607 333966 178905 98887 306812 -176556 139763 219163 -138787 -1549 492663 467372
17597 467372 291150 -136077 178490 303730 -52035 173130 14917 -24156 48728 145344
17587 145344 219808 220621 142941 125690 2755 110466 -118510 451634 159242 191786 437674
17576 437674 438062 330518 -102326 -70328 36169 11348 -43958 65069 13300 76318 290132
17565 290132 -86083 237646 57336 100602 227041 328170 90459 -185239 1213 291108 96771
17553 -115261 -178827 270997 67737 274475 194560 264364 144937 -9503 122750 428071 -68105
17541c3025A0517O0843J94295j26865L61692A76077L8420P3687A25109O7798n3863
17530A39044J46217F9580J41831A05251j1604B2447L82032g5711A89737J29511
17520C19248j1443j02173K82567k0154k13118R9756L01501j37991j76690K54741
17510E96244L13845J35436D75216L01666j46432k49221J86853o0939p1988j13720
17500C21435j5575L65529j27454K15118p5759K53574l31383L52756k45387O628
17490G19482O9015B39965J80631r3870r8663k4311J84052A72802Q9774M8930J06415
17479D17921L7459j56571M5797j43055M47725k68582o9312k7997J61310j5326
17469D29369A59888J48702j8447r2883M36099k74491J49110j23522R3201F2406
$$ plain form
17541 -33025 10517 71360 265655 138790 500482 176077 214497 288184 125109 192907 139044
17530 139044 285261 69580 211411 105251 93647 22447 404479 -75711 189737 319248
17520 319248 307805 205632 488199 468045 254927 354683 656184 518193 341503 596244
17510 596244 910089 1045525 475216 776882 630450 381229 568082 507143 435155 321435
17500 321435 305860 671389 543935 759053 683294 936868 605485 958241 712854 719482
17490 719482 788497 239965 420596 326726 228063 203752 387804 172802 262576 311506 417921
17479 417921 455380 298809 344606 201551 649276 380694 311382 283385 444695 429369
17469 429369 159888 308590 290143 197260 633359 358868 507978 384456 477657 62406
17458D68377r3931D1887J41972R4216K60493k10007j14062N2998N7325j27020
17448A97802L53724A7819N89105B67283K28974M5035M8372B49946K0698q4550
17438A86094J47819N5403o6279J25512j40348K05180Q8867k13933r0460J63850
17428D61705Q5126k49104K50135j65586K6654R132j22206L92828k28424j58198
17418C02062J26257k01892r7637m1761N13177j57618M454j80838Q0573J02184
17408D48961k21727P7333J3918H3003Q8499M41013G5083O12864l03024K4745H1885
17396D73272o3496J31641k02637q9341M14480B81111K75085k33067K08259A60285
17385A08880J20215r1434J7650K76579j69731H3960M32712k26499M4263b12384
$$ plain form
17458 468377 374446 41887 183859 278075 538568 328561 214499 267497 324822 197802
17448 197802 551526 17819 606924 267283 496257 541292 589664 249946 270644 186094
17438 186094 333913 389316 323037 448549 308201 513381 602248 388315 297855 461705
17428 461705 546831 297727 547862 382276 408930 418062 295856 688684 460260 302062
17418 302062 428319 226427 128790 87029 600206 442588 447042 266204 346777 448961
17408 448961 227234 304567 318485 83003 171502 612515 75083 687947 384923 409668 81885
17396 473272 409776 541417 338780 249439 663919 281111 556196 323129 531388 160285
17385 108880 229095 137661 155311 431890 262159 83960 516672 290173 334436 -212384
17374E17829k10024j21705n5179K80459j21444k8120m1014K67419Q0859j24485
17364D44595A53938M19425A391M48314k06666J8216H5059M06387L0267B43424
17353C71758m8462G6509J93571j1117k453K28268j75391j41628b8448B07400K34694
17342D42094I2299H643K20906L79868j85895J4123A71954k3186L05271L0429I8634
17330C20910p8098J01672K1190D2255J38927K0403o2193O9469p3068J15422J38446
17319C89661K9137j13464K46350B22981K26572A04150M65212j92447a1460C83296
17308B51009n6572M73348g569E06418Q951A22492J37450J36874A88748L44727
17298E33475k18089B0142N89904A06464a1190B93847J52619A90055J79725j62686
$$ plain form
17374 517829 307805 186100 130921 411380 289936 261816 220802 488221 569080 444595
17364 444595 153938 573363 1391 449705 243039 261255 85059 491446 521713 243424
17353 371758 323296 76509 270080 258963 256510 484778 309387 167759 -28448 207400 442094
17342 442094 92299 8643 229549 609417 423522 437645 171954 148768 454039 484468 98634
17330 320910 242812 344484 365674 42255 181182 201585 139392 208861 135793 251215 389661
17319 389661 418798 305334 551684 222981 449553 104150 569362 376915 -11460 383296
17308 251009 194437 667785 -7569 506418 515369 122492 259942 396816 188748 533475
17298 533475 315386 20142 610046 106464 -11190 293847 446466 190055 369780 207094
17288B07094R0773M2749A47256m8920K33810K21571j05513n8890J64146A86513
17277B66840M47468C43730J45982j44784n3205P7256p4889O8853A27791L55927
17267D83718M0430B31920L36139j17955j97776L00605k63856j12144L93319O6459
17257F36711l2010A18677L06983A33083L18027p2230j33470K07491j55475J14945
17247D12371j63431K3750o2756E7155M51456A58947M04485b1035A77816J57470
17237C35286r2186j17728M20795J3619g47C50610p2307K71776k0073j31144K5541
17226D24403o3646l4076J18904j75870j02244k6750j3420L71656J94815C36166
17215C13262J73080j83113Q5549n4173m6659P9879J21470B37735L6211N9440j44432
$$ plain form
17288 207094 297867 340616 147256 98336 332146 553717 448204 389314 553460 186513
17277 266840 714308 343730 489712 344928 291723 368979 294090 362943 127791 483718
17267 483718 524148 231920 568059 450104 252328 552933 289077 176933 570252 636711
17257 636711 604701 118677 425660 133083 451110 378880 245410 452901 297426 412371
17247 412371 248940 272690 209934 57155 508611 158947 563432 -21035 177816 335286
17237 335286 243100 125372 546167 559786 -747 350610 278303 550079 530006 398862 424403
17226 424403 360757 326681 445585 269715 167471 140721 127301 498957 693772 336166
17215 313262 486342 303229 388778 334605 287946 367825 489295 237735 273946 333386 188954
17204A88954N31834j90161q7083j19421J25386J41176A20058K58890P5393J38145
17194E92486B86717J37157l5841N6470J71337B63378J19044L22898j41575j83033
17184C80712J43916J82756j94713K80402C10346K87596o6501B44488M97270j51545
17174E90213k80210J36388r7113j00384M06355j67780J70745J1391C34521K69914
17164F04435M670A49063L99821j07391p7320J52567L45087l53060j6998l9389
17154D52380p258j33998J56194L0794A06992M82132j99380M79206l37804K9655
17144E60801K51410j85941n6449J09966j73925l0012L98866B47411M03943J08836
17134G60190n0001C26521O29975D61486L38971k00278B67936J67783R4191k14401
$$ plain form
17204 188954 720788 530627 443544 324123 449509 590685 120058 378948 454341 592486
17194 592486 286717 423874 388033 444503 615840 263378 382422 705320 563745 380712
17184 380712 524628 707384 512671 793073 310346 597942 531441 244488 741758 590213
17174 590213 310003 446391 349278 248894 655249 487469 658214 669605 334521 604435
17164 604435 609105 149063 548884 441493 364173 516740 861827 508767 491769 452380
17154 452380 445122 311124 467318 498112 106992 589124 389744 868950 531146 560801
17144 560801 812211 626270 569821 679787 505862 475850 874716 247411 651354 760190
17134 760190 710189 326521 956496 461486 800457 600179 267936 435719 529910 315509
17124C15509M12337k03527N4266k03387K78041B57405n9766L37824K79971C60020
17113E29983J53966k53158L67552m1488K00974m29335P1231k14106N11020j97464
17103F99175Q0048C24567N3308M28793k38266q7364K64762l32728L02320q7996
17093F27396J11230j07403q5245K92858o3512J89358D57881L06297J12231j86533
17083F89876M9635k52440K62186n9957M965j23165K99256l92457L00429K13013
17073I91341j60406J02877L5507j27623k88350M47966k36315K78800l64306N00686
17063A180177m87864J39996Q7948l11l66134M23595k80018o406K69922J49725
17053A110630j73667Q6721m60297L69250j15601L36878l09095j79070J24001K16295
$$ plain form
17124 315509 727846 524319 578585 375198 653239 257405 197639 535463 815434 360020
17113 529983 683949 430791 798343 756855 957829 528494 599725 385619 896639 699175
17103 699175 779223 324567 377875 806668 568402 481038 745800 413072 715392 627396
17093 627396 738626 631223 545978 838836 775324 964682 457881 764178 876409 689876
17083 689876 739511 487071 749257 689300 694265 571100 870356 477899 778328 991341
17073 991341 830935 933812 969319 841696 553346 1001312 764997 1043797 679491 1180177
17063 1180177 692313 832309 920257 919946 553812 977407 697389 690983 960905 1110630
17053 1110630 936963 1023684 563387 932637 817036 1153914 844819 665749 789750 1006045
17043A006045k79861L01705K25519l59865J43166m53789M28429k47025K70953
17034A035277o0498k18457L09138k59014N46498m03971K89699j78479L37640k41694
17024A156139m54311N47201j24532j19794q194J24649o5799K23599m77151K40836
17014A042643M16286n13955Q8252P2365J25310k60212J09606N31644n40987K94745
17004A365697r1752J57360r4092k78679n3561L34768r0559J37118N2078p6248
16994A362130K2573k74799L12853j45299J10359l25193K94754j55971o7404O2593
16984A196596J79570K48713l89576j5684M8592L70230j84674j62627J66376l8719
16974A418797J51512k00747O91K33360J2631r9772R2440K67090m43995K65727
$$ plain form
17043 1006045 726184 1027889 1253408 893543 1036709 582920 1011349 764324 1035277
17034 1035277 974779 756322 1065460 806446 1352944 948973 1238672 1060193 1397833 1156139
17024 1156139 701828 1249029 1124497 1004703 996509 1121158 1055359 1278958 801807 1042643
17014 1042643 1458929 944974 1033226 1105591 1230901 970689 1080295 1611939 1070952 1365697
17004 1365697 1273945 1431305 1337213 1058534 1004973 1339741 1249182 1386300 1438378 1362130
16994 1362130 1384703 1109904 1422757 1277458 1387817 1062624 1357378 1201407 1134003 1196596
16984 1196596 1376166 1624879 1235303 1219619 1268211 1638441 1453767 1291140 1457516 1418797
16974 1418797 1570309 1369562 1370253 1603613 1616244 1516472 1608912 1876002 1432007 1697734
16964A697734l39570M14124L3914j04441k04437K247O1941M60570n3386p24165
16954A244531N50110o8625j81011q9479p3967M03726k91612M21413l86946L64451
16944A892591k01475o6321K62409j80711K82817K23074m00842J08679K81782o74957
16934A527046O52538k93054Q5461j99209K43881J73131K9861k36347j37839L20232
16924B165701M2314O2700j41621j78774J57511L61124l23612J65078L7749J83305
16914B531475k57674K99369k29328M4274K02949k31077L99139q4860k6463j43900
16904B503904O09706n94033J36844J90679k66820N3840k0483J70376K21875n42714
16894B463174L61318J02670n94162Q37873k39251J70237j69461L03470l75785
$$ plain form
16964 1697734 1358164 1772288 1806202 1701761 1497324 1499571 1561512 2022082 1968696 1244531
16954 1244531 1794641 1726016 1545005 1455526 1381559 1785285 1493673 1915086 1528140 1892591
16944 1892591 1691116 1624795 1887204 1706493 1989310 2212384 1811542 1920221 2202003 1527046
16934 1527046 2179584 1886530 1971991 1772782 2016663 2189794 2219655 1983308 1845469 2165701
16924 2165701 2208015 2270715 2129094 1950320 2107831 2468955 2145343 2310421 2348170 2531475
16914 2531475 2273801 2573170 2343842 2388116 2591065 2359988 2759127 2674267 2647804 2503904
16904 2503904 3113610 2519577 2656421 2847100 2580280 2634120 2613637 2784013 3005888 2463174
16894 2463174 2824492 2927162 2333000 3170873 2931622 3101859 2932398 3235868 2860083
16885B860083K69515j29914M78784j72570j22466L33075R3755l21359J35002L7382
16875C461287M2508Q4129j70249L43881j12837J16798J1736k65397O13045k20308
16865C904593J92437j80635K59055j94135L43375j6121k84065L27636J59838l05754
16855D206224N71535k38294Q4899J1650R2359L84545j15313j33669J77443M2828
16845E084207r62l96J88167K81853j23268J42843k11633N74090l99598L27269
16835E862572k55513N46684j05176Q3602K14769j05256L92885J11516n6624o5189
16825F624270L51426r8182L17760j54609J9543K97677L6134M11531n5790J34296
16815G884056L26963K93550l41700K65477N27283q5393j11435N13649L6645K1607
$$ plain form
16885 2860083 3129598 2999684 3478468 3305898 3183432 3516507 3610262 3288903 3423905 3461287
16875 3461287 3503795 3587924 3417675 3761556 3648719 3765517 3777253 3511856 4124901 3904593
16865 3904593 4097030 3916395 4175450 3981315 4324690 4308569 4024504 4352140 4511978 4206224
16855 4206224 4777759 4539465 4624364 4636014 4728373 5112918 4997605 4863936 5041379 5084207
16845 5084207 5083245 5082849 5271016 5552869 5429601 5572444 5360811 5934901 5535303 5862572
16835 5862572 5607059 6153743 6048567 6132169 6346938 6241682 6634567 6746083 6689459 6624270
16825 6624270 6975696 6877514 7195274 7040665 7060208 7357885 7394019 7805550 7749760 7884056
16815 7884056 8211019 8504569 8162869 8428346 8955629 8870236 8758801 9272450 9309095 9330702
16805I330702K20578O90507j00420K16378K74153L5564L7862M25167K71447n3416
16795A1348522K94587K70429L25046L78895j1080N54051J65562L54324M39541
16786A4119877L85873Q9871M16028P96272l58973N23363q227P82028L03329M75705
16776A7525146M11804O18809J34515O39152N34366O99597O55921K7879O85097
16767B1932286P68676M39135P74204J102064R6341J007111O77659O67054P29636
16758B8194166Q47645J081831P45677P47060J540879Q74301N26053J391085J504253
16749C7452950J265889Q38536J389664J448066J207271J628551J620203J592953
16741D8444083J483179K007872J551863J962499J772318J855825K320677K110269
$$ plain form
16805 9330702 9551280 10241787 10141367 10357745 10631898 10667462 10705324 11130491 11401938 11348522
16795 11348522 11643109 11913538 12238584 12617479 12606399 13160450 13326012 13680336 14119877
16786 14119877 14505750 14595621 15011649 15807921 15448948 15972311 15964084 16746112 17049441 17525146
16776 17525146 17936950 18555759 18690274 19329426 19863792 20563389 21219310 21247189 21932286
16767 21932286 22700962 23140097 23914301 25016365 25112706 26119817 26797476 27464530 28194166
16758 28194166 29041811 30123642 30869319 31616379 33157258 34031559 34557612 35948697 37452950
16749 37452950 38718839 39557375 40947039 42395105 43602376 45230927 46851130 48444083
16741 48444083 49927262 51935134 53486997 55449496 57221814 59077639 61398316 63508585
16733F3508585J970270K448418K419827K519736K265916K869093K256241K342310
16725H2600396K699793K568599K691620K536138K565736K414703K837923K106674
16717A03021582K297983K263081K175268J371716J842454J579459J361151R71315
16709A16884009R64707N38066J91329j26640l15846l69385j064805p25043j322050
16700A14654342j725414j399455j935128j870681k336473k227670k020942k931967
16692I8206612k791635k165668k441384k885724k768811k416774k842066k528399
16684G7366151k681529k025302k491810k639544k113631k220706k290291j939600
16676E8963738j805941k595720j694509j837236j371613j964236j462039j557740
$$ plain form
16733 63508585 65478855 67927273 70347100 72866836 75132752 78001845 80258086 82600396
16725 82600396 85300189 87868788 90560408 93096546 95662282 98076985 100914908 103021582
16717 103021582 105319565 107582646 109757914 111129630 112972084 114551543 115912694 116884009
16709 116884009 117848716 118386782 118578111 118451471 118135625 117766240 116701435 115976392 114654342
16700 114654342 112928928 111529473 109594345 107723664 105387191 103159521 101138579 98206612
16692 98206612 95414977 93249309 90807925 87922201 85153390 82736616 79894550 77366151
16684 77366151 74684622 72659320 70167510 67527966 65414335 63193629 60903338 58963738
16676 58963738 57157797 54562077 52867568 51030332 49658719 47694483 46232444 44674704
16668D4674704j524111j773891j194900j348512q67632j492760j280700r44330
16660C4247868j024353j117677j207531q47861r07442o69152r27865n45118r12381
16651B6088488q80674n97710o61416n45599j043071k5339j382965k51601k94535
16642B0405578n95427q58588o04413Q0998o05929q34216n07850L6007o52843l30062
16632A5533255l33859k21794l38957p42599J89142n12722o93758K36049m64370
16623A2650387l81748p2557k10161m46850j6971m49847j61022k10342l01441M0251
16613A0439699q58144K73787j29912l02245j39799p1157l88121j9193J24160m35881
16603H493194Q4921m26865n1093k63463m256k38905k66717J17741l52856k02991
$$ plain form
16668 44674704 43150593 41376702 40181802 38833290 37965658 36472898 35192198 34247868
16660 34247868 33223515 32105838 30898307 30050446 29143004 28473852 27545987 27000869 26088488
16651 26088488 25207814 24610104 23948688 23403089 22360018 22334679 20951714 20700113 20405578
16642 20405578 19810151 18951563 18347150 18428148 17822219 16988003 16480153 16516160 15863317 15533255
16632 15533255 15199396 14977602 14638645 13896046 14085188 13572466 12878708 13114757 12650387
16623 12650387 12268639 12196082 11985921 11539071 11522100 11072253 10911231 10700889 10399448 10439699
16613 10439699 9581555 9855342 9725430 9423185 9283386 9212229 8824108 8804915 8929075 8493194
16603 8493194 8578115 8151250 8100157 7836694 7832438 7593533 7326816 7444557 7091701 6888710
16593F888710k03389K8437j22158J84196l25997n41041K49751J80129m38130q721
16583E891787N5208l77298N40142n21000L50950m66435k80382k35441M69240p20970
16573D705801K67367R9839l55724N09726m21689m97723L24247j92321k09743k4323
16563D205457J6747J63213O6916k37642j79500p0796K01513j67393j22283P542
16553C883774K37830n39920L30260k74768k33643j04374l1033M53126j83706m10117
16543C127429J13628j1070k68724L78011k27347M6300N44664l96042j86457j10622
16533C009770k94020K12447J0854m19601M22109m22876J26243j0910J42798j17589
16523B659225m5379L97771m0051m27829k12278R7324J46579l23536P5867J74285
$$ plain form
16593 6888710 6685321 6713758 6591600 6775796 6449799 5908758 6158509 6338638 5900508 5891787
16583 5891787 5946995 5569697 6109839 5588839 5939789 5473354 5192972 4957531 5426771 4705801
16573 4705801 4973168 5073007 4717283 5227009 4805320 4307597 4631844 4439523 4229780 4205457
16563 4205457 4222204 4385417 4452333 4214691 4035191 3964395 4165908 3998515 3876232 3883774
16553 3883774 4121604 3581684 3911944 3637176 3403533 3299159 3268126 3721252 3537546 3127429
16543 3127429 3241057 3229987 2961263 3339274 3111927 3158227 3702891 3306849 3120392 3009770
16533 3009770 2715750 2928197 2939051 2519450 2941559 2518683 2644926 2634016 2776814 2659225
16523 2659225 2613846 3011617 2971566 2543737 2331459 2428783 2575362 2251826 2327693 2501978
16513B501978j11723M1818M0643l45000n5263R0368K36407l85489J0709Q1034
16503B105482r2847Q8910L74778r8870k88719q2872P9464P408j0539k17730K03146
16492B067611q4497n43069N53171r5386j82625k82859L84617l7170J92753k20979
16482A751567Q4138j27573j04338q5978J29124n7870k34706L31509k31458K3217
16472A477632K94775j30257k18693l5061j22899L7691P51029p01897O224J04563
16462A463107k59473J76162k01182J44031j5064J22208q1973N5656J28033j72459
16452A359046J11667j73737p155R4413q1020j8295r3907J07036K46440j52295
16442A392193j03415j68599j49771K35644k02383J11540Q150L6155j69760r9967
$$ plain form
16513 2501978 2390255 2432073 2472716 2127716 2072453 2162821 2399228 2013739 2024448 2105482
16503 2105482 2012635 2101545 2476323 2377453 2088734 2005862 2085326 2092734 2082195 1864465 2067611
16492 2067611 1983114 1440045 1993216 1897830 1715205 1432346 1816963 1779793 1972546 1751567
16482 1751567 1835705 1708132 1603794 1517816 1646940 1589070 1354364 1685873 1454415 1477632
16472 1477632 1772407 1642150 1423457 1388396 1265497 1303188 2054217 1352320 1358544 1463107
16462 1463107 1203634 1379796 1178614 1322645 1307581 1429789 1347816 1403472 1531505 1359046
16452 1359046 1470713 1296976 1289821 1384234 1303214 1284919 1191012 1298048 1544488 1392193
16442 1392193 1288778 1120179 970408 1206052 1003669 1115209 1123359 1159514 989754 889787
16432H89787L01310J2094r7903l1800j54934M17326k78478O7841q9188j4091r5802
16421I26162P4993m14296M57013j78279K3270L21012l20075J96555j39724N5257
16411A001888k44529M2952K00097O9785J31243n69030N48475D22850J70245K64025
16401H57120J17991j40640J34453k64275j49063J02837M44092O9784n81301K19444
16391H10442k61027j46136L96830R5534k97572L51667M6174q8765j34718k23239
16381E49190M75392l45771N4202n4045J56495k1646j42043j43803K33626k35222
16371E26375L19298l05995R1239l444M08585q0076l04072J20926p7078K30776
16361I26534j79134j09186j72534P27631D88673M78983m47417J14602J3433J92155
$$ plain form
16432 889787 1191097 1203191 1105288 1073488 918554 1335880 1057402 1125243 1036055 1021964 926162
16421 926162 1001155 586859 1043872 865593 888863 1209875 889800 1086355 946631 1001888
16411 1001888 757359 800311 1000408 1070193 1201436 632406 1180881 422850 593095 857120
16401 857120 975111 834471 968924 704649 555586 658423 1102515 1172299 590998 810442
16391 810442 549415 403279 800109 895643 598071 949738 995912 907147 772429 549190
16381 549190 1024582 678811 733013 678968 835463 813817 671774 527971 761597 526375
16371 526375 845673 539678 630917 627473 1036058 955982 651910 772836 695758 926534
16361 926534 747400 638214 465680 1193311 488673 967656 520239 634841 648274 840429
16351H40429o2767C49047K85958M3258J7655O9699C45905K63555j43944j08962
16341C56554J48179J40665k02576R2528J42537j01841J47104j32951P4334P0951
16331G35484K4556l68935M49474J01999l33640J59285l51920L02174F4877N52551
16321F17428K41663C75051N5494j90390M32093j39546q291j12812j6971K30716
16311F25344R4895j50987R823q3819j48197L24381k18510k12508K35386L7817
16301E13625B36519M66434C10128m7206K08655J26086j01281J17494j07185B15304
16290B31093Q2211M01092B75356J78763A60558R9645K81836B12943P8746J81450
16280D73139k8470j16854J0817A55243K46430a12143D48959J33664b464A78419
$$ plain form
16351 840429 777662 349047 635005 678263 695918 765617 345905 609460 465516 356554
16341 356554 504733 645398 442822 535350 677887 576046 723150 590199 664533 735484
16331 735484 760040 391105 840579 942578 608938 768223 416303 718477 64877 617428
16321 617428 859091 375051 430545 240155 672248 532702 524411 411599 394628 625344
16311 625344 720239 569252 579075 495256 347059 671440 452930 240422 475808 513625
16301 513625 236519 702953 310128 262922 471577 597663 496382 613876 506691 215304
16290 231093 313304 714396 275356 454119 160558 260203 542039 212943 291689 473139
16280 473139 444669 327815 338632 155243 401673 -112143 448959 582623 -2464 178419
16269C74621j51617J50077A33701J56120b6471B69137j25161L65458o2430O0529
16259E07533l5446O7476k55163J92510B32588K99245I5750J0999J89851m1778
16249B54822K01439k5798C4035M23051o8646L2516j42210K57655A63741J46529
16239C10270k5415A6692K17037O1409E2017K04345I9399K56601P332q5227K69275
16228E47380E2516K92703N2544J47585a66040B34312P5969A5318L15902q4484
16218B46736Q7884K74823g9057A21581Q5013o2284L36470j66965J69320A61010
16207a61947B04406r3785J93425p9760p9912K08244n5254k0281b2502C94461M7725
16196D42186j33524f2406C84934R3148q0372j65623I9733J67847l5964f5336F2925
$$ plain form
16269 374621 223004 373081 133701 289821 -26471 269137 143976 509434 447004 507533
16259 507533 472087 539563 284400 476910 232588 531833 95750 106749 296600 254822
16249 254822 456261 430463 34035 457086 388440 420956 278746 536401 163741 310270
16239 310270 284855 16692 233729 295138 52017 256362 99399 356000 363332 278105 547380
16228 547380 52516 345219 397763 545348 -166040 234312 310281 15318 331220 246736
16218 246736 334620 609443 -79057 121581 206594 144310 480780 313815 483135 161010
16207 -161947 204406 110621 304046 224286 144374 352618 297364 277083 -22502 394461 442186
16196 442186 308662 -62406 384934 478082 397710 232087 99733 267580 231616 -65336 62925
16184B93548C8244K24215K1040n6669a541B61755K40714f8603H0929J16674K3793
16173B21396R9796A33773Q724J13919j1940E9808K62200O9700J10206b1634r857
16162c1491A02902B9317j457c0281A6983K47823A5060M70991B04319b68139I2358
16150C27645K3557j15772L8861d0810A97017G2435e2608A48891K81J19441m9775
16139B18838E3144K62425e2745C6691D120a0880p6162I92K25323m0002L90024
16128E76337B29613m2573a4527C2552J37736j1264g060k64877i6402A85673B2330
16116a04595A89527J01360p5354n4271L18357a7910I7747k2358c08383A35591
16105A48261a27122D07972B1584P5245a32641A29696E3706j6159R4762K84537
$$ plain form
16184 293548 38244 262459 283499 226830 -1541 261755 502469 -68603 80929 197603 221396
16173 221396 321192 133773 142497 256416 244476 59808 322008 391708 501914 -21634 -31491
16162 -31491 102902 29317 27860 -30281 16983 264806 15060 486051 204319 -268139 92358
16150 327645 351202 235430 274291 -40810 197017 72435 -52608 148891 149172 268613 218838
16139 218838 53144 315569 -52745 36691 4120 -10880 -87042 992 226315 186313 576337
16128 576337 229613 187040 -14527 32552 170288 159024 -7060 -271937 -96402 185673 22330
16116 -104595 189527 290887 215533 161262 479619 -17910 97747 75389 -308383 135591
16105 148261 -127122 407972 21584 96829 -132641 129696 53706 37547 132309 416846
16095D16846c3439A77771J08084l3984m6351J21576E6991e5672A6057b13506d1190
16083C67984n5705h1425A73484H2706D378J50573a26973C02190r9088K524A4447
16071C23165H6880a01552A95206R644c2925C212i7640A9442K49214L7944h6960
16059c12568A21961J4522g0123A90531E1322e72j47619A01065K04034F8186i4741
16047D5665h5814A28391D1884a17846B08438A025N9747k9137J53627a73378B37653
16035b22205a1E4765K18656M6548G3530j6904N0930O7855l3125J81589r2386r7751
16023A33738l6251k4081b18560C16811e1202j12928A3562J14488K84624a44154
16012B4615P9829a01778n248A70935J1123H9169K1722b18728f5829D136L56053
$$ plain form
16095 416846 -33439 177771 285855 251871 205520 327096 56991 -55672 16057 -213506 -41190
16083 367984 312279 -81425 173484 82706 4378 154951 -126973 302190 203102 205626 14447
16071 323165 86880 -101552 195206 204850 -32925 3212 -97640 19442 268656 306600 -86960
16059 -312568 121961 136483 -70123 190531 51322 -572 -148191 101065 305099 68186 -94741
16047 45665 -85814 128391 41884 -117846 208438 1025 60772 31635 185262 -173378 237653
16035 -222205 -11 54765 273421 319969 73530 56626 107556 175411 142286 323875 231489 133738
16023 133738 97487 73406 -218560 316811 -51202 -164130 13562 128050 412674 -144154
16012 24615 104444 -101778 -107026 170935 182058 89169 110891 -218728 -65829 4136 360189
16001C60189E8410J1552M7656J92299k4287a06446B96881A23952a13580A4977
15990A5458L25485a39180K2049A71831a129A005a56960K0996B16877K74397A3119
15978a52726E16753A99398D7137b5032C30699J13231j5708J32497K59402L93545
15968A213666m5513l52244C38260L1597Q3629G3473K51982A39292a4957k29318
15958b44275E3718k5455J03809E8879O2501K76057A27195a21196j09165B2920
15947B1935K37038a33304A30401a14135A36255K05085A28941b56366B59190a67749
15936A15483a59213J8285j02951C0507f4206o6596A39719K5260G5231R8748m8055
15925A25924L5204a50178K0376A43986P0877B7322R5806e6756B051d9222C3630
$$ plain form
16001 360189 58410 69962 117618 309917 285630 -106446 296881 123952 -113580 14977
15990 15458 340943 -139180 -117131 171831 -1129 1005 -156960 -135964 216877 491274 13119
15978 -152726 516753 199398 47137 -25032 330699 443930 428222 560719 820121 1213666
15968 1213666 1168153 815909 338260 369857 453486 73473 325455 139292 -14957 -244275
15958 -244275 53718 28263 132072 58879 121380 397437 127195 -121196 -230361 22920
15947 21935 258973 -133304 130401 -114135 136255 341340 128941 -256366 259190 -167749
15936 115483 -159213 -140928 -243879 30507 -64206 -130802 139719 164979 75231 173979 125924
15925 125924 161128 -150178 -129802 143986 214863 27322 123128 -56756 2051 -49222 33630
15913F7283a06951A23777b48323H408L0731g0530j00561j9646B79734p8519D7371
15901E0057N7975i672r2350l8916E484a43763A52283M8524K1816H9165d5473l04149
15889c49622e5562C29239b1535D9412O3674b59241C21063a19563j7830f1328o7143
15878a28471D4263c12277B02684d3703n6377A76374g7225A2569a40000I5786a80510
15866a47715F5887e7098H7536a10180B19266j1641a59913j29960b3136B8343m828
15855B3515b04416P6405L3999B33158a83452A0637O8256l2693A2340f7697q1992
15844a49689q5734E5685J5564d13933B5570b21000c0311A09390a84555A48893
15833a72315d3067C34729e4223A4632a24236B66631a88050B43103I6338B8040
$$ plain form
15913 67283 -106951 123777 -248323 8408 39139 -70530 -171091 -190737 279734 201215 47371
15901 50057 108032 -9672 -102022 -140938 5484 -143763 152283 200807 222623 89165 -45473 -349622
15889 -349622 -55562 329239 -21535 49412 113086 -259241 321063 -119563 -137393 -61328 -128471
15878 -128471 44263 -312277 202684 -43703 -100080 176374 -77225 12569 -140000 95786 -180510
15866 -147715 65887 -57098 87536 -110180 219266 207625 -159913 -289873 -23136 28343 23515
15855 23515 -204416 -128011 -94012 233158 -183452 10637 78893 46200 12340 -67697 -149689
15844 -149689 -235423 55685 71249 -413933 25570 -221000 -30311 109390 -184555 148893
15833 -172315 -43067 334729 -54223 14632 -124236 266631 -188050 243103 96338 28040
15822E2144i3575b0074F4053P0699a44733b3863H6411i6491d3765A34198b17488
15810A24821b78966B6749M657b46095o065N8394c7683c724A75922b24213G1793
15798a28337j1112j33398i3160j61181J00372A83583Q4381b66544B78402a48983
15787a19475A70256n1386b8084B17281p9120b78387P7422B5105J91698R4095a80663
15775A81846b04210g4210g728r520A49500e8801D4269b07780N5492E3026f8946
15763B0282J9914M0353b75383P6845G3147L63831A99183H9937L8764C1503J59062
15752A90565E2525d4526A8106a23362d0624B50221c72479J40040a05693A26844
15741i5041A4405K30912q5223a09811b6299A33279K10211a43097C72031a48380
$$ plain form
15822 52144 -93575 -20074 64053 134752 -144733 -23863 86411 -96491 -43765 134198 -217488
15810 124821 -278966 26749 31406 -246095 -252160 -193766 -37683 -3724 175922 -224213 71793
15798 -128337 -139449 -272847 -93160 -254341 -153969 183583 267964 -266544 278402 -148983
15787 -119475 170256 118870 -28084 217281 138161 -278387 -200965 25105 216803 310898 -180663
15775 181846 -204210 -74210 -7728 -17248 149500 -58801 44269 -207780 -152288 53026 -68946
15763 20282 40196 80549 -275383 -198538 73147 436978 199183 89937 128701 31503 190565
15752 190565 52525 -44526 18106 -123362 -40624 250221 -372479 -232439 -105693 126844
15741 -95041 14405 245317 160094 -109811 -26299 133279 343490 -143097 372031 -148380
15730a06905A41320J85081A2618L39792g7714L262j17032B2912L97817d285C65410
15718b36635A44054B2211J19899O5634M4570a27354a7272F2310M1049h1635q4509
15707a66144G7298P123a76261l07383e5831E3193J74248A9972f2834j5706B34247
15695a31008j06778n6624F7794a02709B1166h9414k33740A12721C2367b02301
15684a21961n7659N9627m5875G8137c79045B40337L2897H7955c25895C86479a87724
15672C9889a07147B41979a14821n1140e0214k41910B66114a434j1183I2370b9417
15660A51018M6057F796e267A50304B9282K2063d2237A85551b1644C3051k546K6492
15648E6997N5267a38184K8047C479K34781a89466K6239j00150a24900A85717M8717
$$ plain form
15730 -106905 141320 326401 12618 352410 -77714 -74452 -191484 22912 420729 -4285 365410
15718 -236635 144054 22211 142110 207744 252314 -127354 -17272 62310 103359 -81635 -166144
15707 -166144 77298 84421 -176261 -483644 -55831 53193 227441 19972 -62834 -78540 234247
15695 -131008 -237786 -294410 67794 -102709 21166 -89414 -323154 112721 32367 -202301
15684 -121961 -179620 -119993 -165868 78137 -379045 240337 273234 87955 -325895 386479 -187724
15672 39889 -107147 241979 -114821 -165961 -50214 -292124 266114 -1434 -12617 92370 -29417
15660 151018 197075 6796 -5267 150304 29282 51345 -42237 185551 -21644 33051 30505 56997
15648 56997 112264 -138184 -110137 3479 238260 -189466 -163227 -263377 -124900 185717 234434
15637B34434A5372J02341K1833P6639d30413J81070a5598j32698K1701C26609
15626A55724A7593P4914a69787r9301A56643k8931B6885a90100G5186e3987k11471
15615b65458A10488e4265j33369N5195I7934M3789a7253A26709c42387A45199
15604F5109J2354b21194R4833M2533a4138r9266c5474j53339k4260k2107H8930
15592B90104c2655A25288A3316a11142q204j64491c3261A17490d6586j77860N2509
15581a71937L7707G8729K58057e2716j73202m4852C6890M6766d1360A64223j5768
15570A48455j7374b22452j73183G3679c2622k6542E7226a12545e386p463r8420
15559a11269q4131j93815B61975c17918d2121C7871c74057i276m1265j14410m2036
$$ plain form
15637 234434 15372 117713 139546 216185 -430413 -249343 -15598 -148296 -126595 326609
15626 155724 17593 92507 -169787 -269088 156643 127712 26885 -190100 75186 -53987 -265458
15615 -265458 110488 -54265 -187634 -132439 97934 141723 -17253 126709 -342387 145199
15604 65109 77463 -221194 -126361 -83828 -14138 -113404 -35474 -188813 -213073 -235180 88930
15592 290104 -32655 125288 13316 -111142 -119346 -283837 -33261 117490 -46586 -224446 -171937
15581 -171937 -134230 78729 336786 -52716 -225918 -270770 36890 83656 -41360 164223 148455
15570 148455 131081 -222452 -395635 73679 -32622 -59164 57226 -112545 -5386 -12849 -111269
15559 -111269 -195400 -389215 261975 -317918 -42121 37871 -374057 -9276 -50541 -164951 -206987
15548b06987b6432G8776b84769B37873L406i4855l5895c2176H9745O5628b15127
15536B34883l6117N4459c3466m43325a95593m7995G8562E319M9094R9999M13977
15525E68389a6614F7436J00431a38729a8861I7826a4163n2106A7298c1310o8664
15514i9974C75600O705A25638b1751A41216Q1561o7649f0953A48021L1356d4400
15502C93938p6117r5824n8741b28419A55778a4032F0856K59679A02615J48807
15492B51422J11633J939D5583J4999J05331G5862c9411A90313J54343k6509r6947
15481B21200O2956o075J65397A66422G8970m608J15348J09032k2690a00935C13522
15469G9761k4784J08655J91964A4775J60701L42497G1114L35650j13436I3301
$$ plain form
15548 -206987 -26432 78776 -284769 237873 241279 -94855 -130750 -32176 89745 155373 -215127
15536 234883 198766 253225 -33466 -476791 -195593 -243588 78562 5319 54413 154412 568389
15525 568389 -16614 67436 167867 -138729 -18861 97826 -14163 -66269 17298 -31310 -99974
15514 -99974 375600 382305 125638 -21751 141216 222777 155128 -60953 148021 179377 -44400
15502 393938 317821 221997 163256 -228419 155778 -14032 60856 320535 102615 251422
15492 251422 363055 364994 45583 60582 165913 75862 -39411 190313 344656 318147 221200
15481 221200 284156 278081 443478 166422 78970 74362 189710 298742 276052 -100935 313522
15469 79761 54977 163632 355596 14775 175476 517973 71114 406764 293328 93301
15458E55935J52000j07635B64247j26533P9123a55688C1978b61004B93655A34204
15447A02116K33634D5495J90842b18346m2317g2923B52573M4198f3558n378j6870
15436h5806B56089A08929a44647B8379A1385a98995D0496K77769L3314L15170
15426F66749L73680k6296D64601J72871m8734j70310F5219J79757E1284N7177
15416A08461C9701a74458m8304j8152A55160C2433O6707a31780a1317H5255d1239
15404c17579c61n6161k67368A97089B0871K11380d71840A23407k6396a73851B18645
15392B2536b16088G0375L44548h5651D9620k495R565h576B01466a72380H316a59275
15379a16432B38232b7583N603A90752H9763Q27b01462B48155j20127K20962A18878
$$ plain form
15458 555935 707935 600300 264247 137714 216837 -155688 31978 -261004 293655 134204
15447 102116 335750 45495 236337 -218346 -260663 -72923 252573 296771 -63558 -68936 -85806
15436 -85806 256089 108929 -144647 28379 11385 -198995 40496 318265 351579 666749
15426 666749 1040429 1014133 464601 637472 588738 418428 65219 244976 51284 108461
15416 108461 39701 -174458 -222762 -240914 155160 32433 99140 -131780 -11317 85255 -41239
15404 -317579 -361 -56522 -323890 197089 20871 232251 -471840 123407 97011 -173851 218645
15392 22536 -216088 70375 414923 -85651 49620 47125 56690 -8576 201466 -172380 8316 -159275
15379 -116432 238232 -27583 -21980 190752 89763 90590 -201462 248155 128028 348990 118878
15367B5686R90i1266A20353b897D1372K04058j2825i6010H0725e5512B06792o3896
15355A42896F9744J56811I9066B7529J14316j1829N8581q8507l4081P5644J08335
15344B49988o4476C5101L87704k03086J95300A71448O6876f7748A98004n8610
15334A39394a8205C04445p8403K87827A66776l9138K11211q6105C963L99757j43854
15323B59866j13399K42813A88789H2654J71068A0340a95345G6901J04629C7890
15312A47079a1259B31486J2794R455n0a0422F460L92383A40200N0733O765J62962
15300C60660A02582K06273l8637p7612J8115l5850D0382J06045i816B93343a39059
15288B06985d7255A80723i0143A49928K71600b83062a4315n3646B2129L21882
$$ plain form
15367 25686 26676 -91266 120353 -2897 41372 245430 232605 -96010 80725 -55512 206792 142896
15355 142896 69744 226555 99066 27529 141845 130016 188597 100090 66009 141653 249988
15344 249988 185512 35101 422805 219719 415019 171448 238324 -67748 198004 139394
15334 139394 -18205 304445 226042 513869 166776 127638 338849 252744 3963 403720 259866
15323 259866 146467 389280 188789 82654 253722 10340 -195345 76901 181530 37890
15312 147079 -11259 231486 244280 253735 253685 -10422 6460 398843 140200 190933 197698 360660
15300 360660 102582 308855 270218 192606 210721 174871 40382 146427 -9816 293343 -139059
15288 206985 -47255 180723 -90143 149928 421528 -283062 -14315 -67961 22129 344011
15278C44011A67149O6938m5320J50765l1120P737j27606q1492R4718a10740j25157
15267b35897Q7686A31691B2071I820b4310j39334o9291H6412b39224b5891A87297
15255A05914a24646B50827K71861a68460L8336B67354k9613i7195A68983a18121
15244A13895L0270K30610a219B0123J81196i6505G9864C6688J70390a82127a871
15232C64181l4818k9622q2373J1684L49159O05213N48975q9209j20244k80608
15222A242338l97652B94084E4936d5930C65672j21742c1280H2464l3623L758c2042
15210A01400Q7357C1199K93472i179l0619l6454q0986D4413J0425K08188e9202
15198A56112J23005D8160J32900i3856A86791k6598o25J18387J12135O4682b42431
$$ plain form
15278 344011 167149 234087 188767 339532 308412 316149 188543 107051 201769 -110740 -235897
15267 -235897 -148211 131691 22071 9820 -24310 -163644 -232935 86412 -239224 -25891 187297
15255 105914 -124646 250827 522688 -168460 -130124 267354 237741 -97195 168983 -118121
15244 113895 144165 374775 -1219 20123 201319 -96505 79864 36688 207078 -182127 -1871
15232 364181 329363 299741 217368 229052 578211 1183424 1732399 1643190 1522946 1242338
15222 1242338 844686 294084 54936 -45930 365672 243930 -31280 82464 48841 52599 -32042
15210 101400 188757 31199 324671 -9179 -39798 -76252 -157238 44413 54838 263026 -59202
15198 156112 279117 48160 181060 -93856 186791 160193 159568 277955 390090 454772 -242431
15186E5021e4752j08124A63308R207K6001a26885B9501D645K99202I9850a03502
15174D88243J84838h5277B3237N3941a89261K1697G4366K25924j19395G8651Q8910
15163A67561j4203M1423l2123f0815l2530B8148a72655j13130k5025G2962J83547
15152B56509J0240j07426K25759H2826K935a70502G6823e3565j63080a9623I6653
15140B76161b29261f5362C05410i3152B33327i0685p3262b4639B24194A84K38924
15129B39108Q6055i6328c3889D10786I4162k2005b24615A29831J48138G2470L04689
15118C77159A01571M0979j8271B951J81252l6413j9581K97024c41851D9052N0629
15107I9681o320R1862K38007M8657B32963j1625J67140a83524B75070J0983r8052
$$ plain form
15186 55021 -54752 -162876 163308 172515 198516 -126885 29501 4645 303847 99850 -103502
15174 488243 673081 -85277 23237 77178 -189261 -167564 74366 300290 180895 78651 167561
15163 167561 153358 194781 162658 -60815 -93345 28148 -172655 -285785 -310810 72962 256509
15152 256509 266749 159323 385082 82826 85761 -170502 76823 -53565 -216645 -19623 96653
15140 276161 -229261 -65362 305410 -93152 233327 -90685 -163947 -24639 224194 184 239108
15129 239108 325163 -96328 -33889 410786 94162 72157 -224615 129831 277969 72470 377159
15118 377159 101571 142550 124279 2951 184203 147790 128209 425233 -341851 49052 99681
15107 99681 93361 185223 423230 471887 232963 221338 388478 -183524 275070 286053 188001
15096A88001b2824p4077j48679B01945J04748a6224E9509a70627B22555A00239
15085D01978f7728A43477c6704C40462H6759J66597a39064A13577J13087P0174
15075B96838k7611H3947P5897a44742B20964F1167J37133B7362F296d5387C79110
15063H6858O8020D9611J33309j2771N6380M2976a01083A81755A6951K18503e2844
15051B57284M1447l8487n6345M2743a6548C89852L2438I5323K71504A70878L03335
15040D74213A24646L990q389L22672j83624J31621n9483R5559K10880B67286A3713
15028B81316J54831B11754K95098q2462p6189q0569q8189m582K17510p5687r8645
15017B18039K89555m7132J99354P3352M052O4527k18499B66242J80686K71018
$$ plain form
15096 188001 -22824 -96901 -245580 201945 306693 -16224 59509 -170627 222555 100239
15085 401978 -67728 143477 -36704 340462 86759 253356 -139064 113577 226664 296838
15075 296838 269227 83947 159844 -144742 220964 61167 198300 27362 6296 -45387 379110
15063 86858 154878 49611 182920 170149 226529 269505 -101083 181755 16951 235454 -52844
15051 257284 298731 260244 203899 246642 -16548 389852 422290 95323 366827 170878 474213
15040 474213 124646 128636 120247 442919 259295 390916 331433 426992 637872 267286 13713
15028 281316 436147 211754 506852 424390 348201 267632 179443 174861 392371 316684 218039
15017 218039 507594 460462 659816 733168 737220 801747 583248 266242 446928 717946
15007G17946B12032N86641l54121n2940K58659A95177P5337J17533o3080J37224
14997D62191j92169K10903K5988E1333M01881n8860J94298j90537L77030b8660
14986D70635B4881O38341j72157K03175j68153j75946O1440R6752j49614J44276
14976E02995K69976C04029J33795J08895m4353j03761A02216N78510j91617N62534
14966A051643k16590C94515J36137J2837n6398N4650J18556P6239B80398K10357
14956D90755Q8279N9415p0061F2508M89004l7749j94698K05386j41361p098K57051
14945F33043G1197O2112M03772k3832A70883A9642L09665J32287j10122L0878
14935C82350K13714j94886j29422K07286j81478L98991k59066J25030q3101N4575
$$ plain form
15007 717946 212032 798673 444552 391612 650271 195177 270514 388047 324967 462191
14997 462191 270022 480925 506913 51333 453214 394354 588652 398115 775145 -28660
14986 470635 24881 663222 491065 694240 526087 350141 411581 508333 358719 502995
14976 502995 772971 304029 437824 546719 502366 398605 102216 680726 489109 1051643
14966 1051643 835053 394515 530652 543489 487091 541741 660297 736536 280398 490755
14956 490755 579034 638449 568388 62508 551512 513763 319065 524451 383090 375992 633043
14945 633043 71197 133309 537081 513249 170883 19642 329307 461594 351472 382350
14935 382350 596064 401178 271756 479042 297564 696555 437489 562519 479418 533993
14925E33993r9652j58016j0195K43834K14823K3828j49662J29979N6452j59440
14915F25944K66836k64481M20571L32645k3081R8562K33739P0988k26463r8132
14905A437128K21104k3301K06950N20127o38022K10313J1876p25038l53636K28477
14895A095978j7103l08496k45386n0176M557p2803O8562P9656E3783M04493k4404
14884D33872p6013j6328k1309J98259k04625L58155j4867B69494k6539K29642
14874D72597J78652A01186M16968L23442L116l1161R0221j665k09910K33736m28003
14863D97930K07459l06199J86238K64119k95520K55993B66779M34179K19120l14649
14853F05429P0580j7282K85346J50835n08063O7427j66263J24897j33668L81531
$$ plain form
14925 533993 434341 276325 266130 509964 724787 748615 598953 728932 785384 625944
14915 625944 892780 628299 1048870 1381515 1358434 1456996 1690735 1761723 1535260 1437128
14905 1437128 1658232 1634931 1841881 2362008 1723986 1934299 1946175 1221137 867501 1095978
14895 1095978 1078875 770379 524993 474817 479374 406571 475133 554789 53783 458276 433872
14884 433872 357859 341531 320222 518481 313856 672011 657144 269494 242955 472597
14874 472597 651249 101186 518154 841596 844712 813551 903772 902107 692197 925933 497930
14863 497930 705389 399190 585428 849547 554027 810020 266779 700958 920078 605429
14853 605429 676009 658727 944073 1094908 586845 654272 488009 612906 479238 860769
14843H60769C57866o4858P7175j32158L6215J30778Q0583j72942L84027j68025
14833E28661J12187B74205P28834D43978K83959J24553L78654m54776J73381L11257
14823A261006k53805J11324m74407r8081A89070M36218k69819q5984J72545n0195
14813C91835K31510o7697j47531J51891K75773l50954L26351C97087M72736k47321
14803F22502J67886L52722k20094j99329o4687R1098k08756k01691L05326B98759
14792F87675Q5317M4292K23949l1915L10368m78872j80231L07263C88611J82305
14782E70916O6851K54255A55177J08720M27973J50805j77346M4090M9163k23816
14772E34766L97814k84725q5363O05721l21859k48450L91108k10125j70749N28231
$$ plain form
14843 860769 357866 293008 370183 238025 274240 405018 485601 312659 696686 528661
14833 528661 640848 274205 1003039 443978 727937 852490 1231144 776368 949749 1261006
14823 1261006 1007201 1118525 644118 546037 189070 625288 355469 269485 442030 391835
14813 391835 623345 555648 408117 560008 835781 484827 811178 397087 869823 622502
14803 622502 790388 1143110 923016 723687 659000 750098 541342 339651 644977 298759
14792 687675 772992 817284 1041233 1009318 1319686 840814 660583 967846 388611 570916
14782 570916 637767 892022 155177 263897 691870 842675 665329 709419 758582 534766
14772 534766 932580 647855 562492 1168213 846354 597904 989012 778887 608138 1136369
14762A136369l67349K71914k51374K63453k61973K2064k52765K46926j38330o5887
14752F03048O171k5226N01830m88060Q8005M111C4137N21134J17271J79527l81233
14741D70836J34132L41580j34282p5812L705j10621n3515J75505j58105l694N1776
14730F41505J97886R8140L3801l68094N1521M56225n00090K19107n465r2101m4431
14719F88004L64019q1202j95628K97637K33236p010K6170K20602K81633l37426
14709A490035j50906K42597n27671j61867J61954k46018m3614L30780K6906j20145
14699A002051j84852K01251k23387J72759P1151m34966M61136M518L1114j64541
14689I36234L06989J72181L39131Q166j82088M36649m45707k15940l6275l20727
$$ plain form
14762 1136369 769020 1040934 789560 1053013 791040 813104 560339 807265 668935 603048
14752 603048 609219 583993 1085823 597763 685768 689879 34137 555271 672542 852069 470836
14741 470836 604968 946548 812266 736454 740159 629538 576023 751528 593423 589729 641505
14730 641505 839391 937531 971332 603238 654759 1110984 610894 830001 824536 732435 688004
14719 688004 1052023 970821 775193 1072830 1306066 1299056 1325226 1545828 1827461 1490035
14709 1490035 1339129 1581726 1054055 892188 1054142 808124 764510 1095290 1122196 1002051
14699 1002051 817199 1018450 795063 967822 1038973 604007 1065143 1069661 1100775 936234
14689 936234 1243223 1415404 1754535 1762701 1580613 2017262 1571555 1355615 1319340 998613
14679I98613K59711k73405k08410k12196L69396k75636N95540k54132k44386M83982
14669A239077m50791j89168L89393k77498J92281L11335m86779M1336L03059m18653
14659F53592J78231J51881k48556K2404J85956J16580j39153l3178j4670M5640
14649I18727J37919M2819k23175J72012k4124L44508m06803J5575K30713l7723
14639A170448J5561N34620m74134M6551K91323j27396k17182K97872j52705J09031
14629A493989m39370K87582n6088J62301m79811K16064K7800O3808J16486k38833
14619A153928K04608k69746Q1328N3938j42066K99820l47897K12983l56004O57813
14609A548705j75013O7568N9426j17942J52678j31766K88294m14391J5893J55699
$$ plain form
14679 998613 1258324 984919 776509 564313 933709 658073 1253613 999481 755095 1239077
14669 1239077 788286 599118 988511 711013 903294 1214629 727850 769186 1072245 653592
14659 653592 831823 983704 735148 757552 943508 1060088 920935 887757 873087 918727
14649 918727 1056646 1099465 876290 1048302 1024178 1368686 961883 977458 1208171 1170448
14639 1170448 1186009 1720629 1246495 1293046 1584369 1456973 1239791 1537663 1384958 1493989
14629 1493989 1054619 1342201 1286113 1448414 968603 1184667 1212467 1276275 1392761 1153928
14619 1153928 1358536 1088790 1170118 1224056 1081990 1381810 1033913 1246896 890892 1548705
14609 1548705 1373692 1441260 1500686 1382744 1535422 1403656 1691950 1277559 1293452 1449151
14599A449151k66754L87221l5120K21197k79059K61022Q6673l88799k64336M87613
14589A658809j1146O1061j33776j91138j3292K73006j72061P2313J89828k80695
14579A452909J55151K33711l03308N74280l53819L2340J07847l44306J35649L6706
14569A727160N9734O3121O5672q6600P4211q1225j14099M00398J23006l47235
14559A884143L07826p0843j15874o6162L33781j31564J80336l526r2257j35508
14549B090352K55581K16472p8747J66844L45862j48647J07574K72839K06899L69629
14539C804658O9706N77061P91510R23544J197445K544549M111930O162489J0703811
14530C0886703K718787j4669844q681158l794031j578839p36447k96633N65789
$$ plain form
14599 1449151 1182397 1569618 1534498 1755695 1476636 1737658 1824331 1435532 1171196 1658809
14589 1658809 1647663 1708724 1574948 1383810 1370518 1643524 1471463 1543776 1733604 1452909
14579 1452909 1608060 1841771 1538463 2112743 1758924 1791264 1899111 1554805 1690454 1727160
14569 1727160 1786894 1850015 1915687 1829087 1903298 1822073 1707974 2108372 2231378 1884143
14559 1884143 2191969 2121126 2005252 1939090 2272871 2141307 2321643 2318117 2225860 2090352
14549 2090352 2345933 2562405 2483658 2650502 2996364 2847717 2955291 3228130 3435029 3804658
14539 3804658 3874364 4451425 5242935 6166479 7363924 9908473 14020403 20182892 30886703
14530 30886703 33605490 18935646 10254488 6460457 4881618 4145171 3848538 4414327
14522D414327N24041p6238j446645m55087j33303l51275J25869k14854l19093
14513B067742K52333j10635L33676k19810K03848J35216J08457n16868K86681
14504B540640k4317r7307N2473Q2625j96953K06906K2883P2126J99064o5530K62566
14493C055176r9037j0458j2677J55581N4603j18506p6339K4565L39777o1663j30190
14482C120832J07657J26292k7010q1637J87507r8935j74676O13547m42045M37976
14472C769508R6660n61932M49600r5579M1095J81286J49931n9137J97630k49426
14462C919636K34043r0808p1494Q2450r7000J07577P9849K52891j15042p4276
14452D227826K61036K0539l40204L20613j22193O38994l97876K44429N6913J20829
$$ plain form
14522 4414327 4938368 4862130 3415485 2960398 2827095 2475820 2601689 2386835 2067742
14513 2067742 2320075 2209440 2543116 2323306 2527154 2662370 2770827 2253959 2540640
14504 2540640 2516323 2419016 2471489 2554114 2357161 2564067 2586950 2659076 2858140 2792610 3055176
14493 3055176 2956139 2945681 2933004 3088585 3143188 3024682 2948343 2972908 3312685 3251022 3120832
14482 3120832 3228489 3354781 3327771 3246134 3433641 3334706 3160030 3773577 3331532 3769508
14472 3769508 3866168 3304236 3753836 3658257 3699352 3880638 4030569 3971432 4169062 3919636
14462 3919636 4153679 4062871 3991377 4073827 3976827 4084404 4164253 4417144 4302102 4227826
14452 4227826 4488862 4509401 4169197 4489810 4367617 5006611 4608735 4853164 4910077 5030906
14442E030906j81128L07270k32149L81848k56157K71914m9777J15683J17051J02916
14432E608377k06608K53451P9008R5728M10577p30224O72309J35276j63426j73943
14422E980525L56901J52361O6869M83582k96881p5144J48434K5811J28487L44498
14412G315443k18732L82979j98136O71151q7672J38985n6085M63827R9201J66845
14402H677806m7475P8188q3415J15647J56236J70771L5615K48190j05439J51028
14392I397152K50822L28422j11913N90971M4103L9446p7801K84994J37309P4564
14382A0958069K8957J92592N70627P2150J78341K47603J53921J87602K95306K81427
14372A3166595j22898N79204K15986N85441K75257Q8652O8472L21500L38465J82206
$$ plain form
14442 5030906 4849778 5157048 4924899 5306747 5050590 5322504 5272727 5388410 5505461 5608377
14432 5608377 5401769 5655220 5734228 5829956 6240533 5510309 6182618 6317894 6154468 5980525
14422 5980525 6337426 6489787 6556656 7040238 6743357 6668213 6816647 6842458 6970945 7315443
14412 7315443 7096711 7479690 7281554 7952705 7865033 8004018 7947933 8411760 8510961 8677806
14402 8677806 8630331 8708519 8625104 8740751 8896987 9067758 9103373 9351563 9246124 9397152
14392 9397152 9647974 9976396 9864483 10455454 10499557 10539003 10461202 10746196 10883505 10958069
14382 10958069 10987026 11179618 11750245 11822395 12000736 12248339 12402260 12589862 12885168 13166595
14372 13166595 13043697 13622901 13838887 14424328 14699585 14788237 14856709 15178209 15516674 15698880
14362A5698880Q8940K34026O21269J84864L47527L09844n4640P92034N3208Q19383
14352A9095335J68542O97072L46766J92250M94422K33964P29333J73547K59437
14343B2390668N50376N84212O80288P25739N09164O55640K37644Q59569N53927
14334B7747227M66249N62441J152880N52567O96840J198045N43090J014752Q46782
14325C4780873J178417P55782J365320J089959R29673J383004J161272J504874
14317D4149174J239293J098024J726045J240358J387367K103567J950079J826551
14309E6720458J887454K096736J941030K342808K353345K402998K577817K860906
14301G5183552K631169L102796K991276L304255L718045L590441M002597M403827
$$ plain form
14362 15698880 15787820 16021846 16643115 16827979 17175506 17485350 17430710 18222744 18275952 19095335
14352 19095335 19263877 19960949 20307715 20499965 20994387 21228351 21957684 22131231 22390668
14343 22390668 22941044 23525256 24205544 24931283 25440447 26096087 26333731 27193300 27747227
14334 27747227 28213476 28775917 29928797 30481364 31178204 32376249 32919339 33934091 34780873
14325 34780873 35959290 36715072 38080392 39170351 40100024 41483028 42644300 44149174
14317 44149174 45388467 46486491 48212536 49452894 50840261 52943828 54893907 56720458
14309 56720458 58607912 60704648 62645678 64988486 67341831 69744829 72322646 75183552
14301 75183552 77814721 80917517 83908793 87213048 90931093 94521534 98524131 102927958
14293A02927958M022891M883585M909111N800312N343409N981247O242212O753274
14285A46863999P338815P324599Q251601Q478696R050702R374205J0072989J0815187
14277B17570793J1577911J1662204J2134462J3027512J3610865J4236500J4460237
14270C08280484J5368948J4648192J4636697J4904370J3363839J2583491J2287308
14263D06073329J1488466J0632522R397462Q850253P688614M957019J348754K150971
14255D62587390K803232j331802m714426m369509q546465j0804490j1782227j1875734
14247D11965969j1776914j1944911j3083801j3863236j3865748j3789752j3643321
14240C19998286j3482253j3107824j2876748j2459917j2551581j1997638j2165480
$$ plain form
14293 102927958 106950849 111834434 116743545 122543857 127887266 133868513 140110725 146863999
14285 146863999 154202814 161527413 169779014 178257710 187308412 196682617 206755606 217570793
14277 217570793 229148704 240810908 252945370 265972882 279583747 293820247 308280484
14270 308280484 323649432 338297624 352934321 367838691 381202530 393786021 406073329
14263 406073329 417561795 428194317 437591779 446442032 454130646 459087665 460436419 462587390
14255 462587390 465390622 464058820 459344394 454974885 446428420 435623930 423841703 411965969
14247 411965969 400189055 388244144 375160343 361297107 347431359 333641607 319998286
14240 319998286 306516033 293408209 280531461 268071544 255519963 243522325 231356845
14233B31356845j0534604j0679902j0921779r966590r555753q720775q491015
14226A62486427p953535p534056o707783o401082o104811n636904n341778n020502
14218A11785976n315418l931301l858794m462354l690070l406432l376506l240576
14210H0504525l345380k787820k637699k468937k111473k605954j912380k383740
14202F0251142k133159j624908j979845j707955j400189j737416j555122j434893
14194D6677655j399149j049429j017473j126108j301808j164794j160047j116059
14186C7342788q87394p84729p95977j550233q15889p17425m52644j145268m01302
14177B9791927o85378r08631n93236q74245o26090l10229r57637m70956n17029
$$ plain form
14233 231356845 220822241 210142339 199220560 189253970 179698217 170977442 162486427
14226 162486427 154532892 146998836 140291053 133889971 127785160 122148256 116806478 111785976
14218 111785976 106470558 102539257 98680463 94218109 90528039 87121607 83745101 80504525
14210 80504525 77159145 74371325 71733626 69264689 67153216 64547262 62634882 60251142
14202 60251142 58117983 56493075 54513230 52805275 51405086 49667670 48112548 46677655
14194 46677655 45278506 44229077 43211604 42085496 40783688 39618894 38458847 37342788
14186 37342788 36455394 35670665 34874688 33324455 32508566 31791141 31338497 30193229 29791927
14177 29791927 29106549 28197918 27604682 26730437 26104347 25794118 24836481 24365525 23848496
14168B3848496p56278j67646n54969n29884p74851l75954l634o63461k75718o82926
14158A9063175j83854m51109k35336l12304k57929n60914l08199l96604k35810
14149A6121116k91929l1118n64743m01756J49818m57769j71363o20469j0450m52648
14139A3268689q804o5563l26977M4218n39407p2269k21869k13972q8045q7243
14129A1688758n09921n609k64040j81147k38856j0621k38984J32407J1509o19958
14119I763538K31408n08573Q1548l60083J40093l35938j42141N821K18210o48781
14109H445102J41288p672j38456p0078l97645l16731L66066l15160k07038k2888
14099G476788J09848j43274n2868l30453o1947j32913q5928j56959j22056O4771
$$ plain form
14168 23848496 23092218 22924572 22369603 21839719 21064868 20688914 20685280 20021819 19746101 19063175
14158 19063175 18879321 18428212 18192876 17880572 17622643 17061729 16753530 16356926 16121116
14149 16121116 15829187 15798069 15233326 14831570 14981388 14523619 14352256 13731787 13721337 13268689
14139 13268689 13259885 13194322 12867345 12911563 12372156 12299887 12078018 11864046 11776001 11688758
14129 11688758 11178837 11173228 10909188 10728041 10489185 10478564 10239580 10371987 10383496 9763538
14119 9763538 9994946 9486373 9567921 9207838 9347931 9011993 8869852 8875673 9093883 8445102
14109 8445102 8586390 8578718 8440262 8370184 7972539 7655808 8021874 7706714 7499676 7476788
14099 7476788 7586636 7443362 7390494 7060041 6998094 6865181 6779253 6622294 6500238 6565009
14089F565009M3971p5864P1848l86173K99831l25815q5856L84298n97305o6335
14079E827609m5954j4540r47J90357l10001j5904m63400K63912j00887J06818
14069E437063l71288m0990R0973j50521j79029J35400k50982P56159o57094j14411
14059D655280J9666L7197K0173j41658k94381K72948j65344j07564R3784J04485
14049D494586l28378J88373j99159K47090q278k89398K82642p9436m97825p534
14039C802683J18757K82286l31073l67251J45726L5859o5789L4667k9574l06821
14029C319470Q0838K52954l80001K24306K45196q0563o32371J96413q619k8498
14019C189125R7538Q401K20046r7632m14174J41050p9211J26658l92921J48413
$$ plain form
14089 6565009 6608980 6533116 6604964 6218791 6518622 6192807 6106951 6491249 5893944 5827609
14079 5827609 5781655 5767115 5766168 5956525 5646524 5630620 5167220 5431132 5330245 5437063
14069 5437063 5065775 5024785 5115758 4965237 4786208 4921608 4670626 5426785 4769691 4655280
14059 4655280 4674946 4712143 4732316 4590658 4296277 4569225 4403881 4296317 4390101 4494586
14049 4494586 4166208 4354581 4155422 4402512 4394234 4104836 4387478 4308042 3810217 3802683
14039 3802683 3921440 4203726 3872653 3505402 3651128 3686987 3621198 3655865 3626291 3319470
14029 3319470 3400308 3653262 3273261 3497567 3742763 3662200 3029829 3226242 3217623 3189125
14019 3189125 3286663 3295064 3515110 3417478 3003304 3144354 3065143 3191801 2798880 2947293
14009B947293j86121J9390j67222j82741L61627J63575j72679J94491k58022j51461
13999B568130k04097J33582j99117j29387J16990J43453K16759j99380j10402
13990B336531K14788j90358L12726k30021k63867J74173k31266L07444J61578
13981B591728j4965k4624R559J469O51488M601J586624J252495L571112N273900
13971A4903387J0126236J1139068j2123228r140672n288003k103460j553179r17366
13963E042783p28467l67236l21632m27036o6953L37022p01802M39228l96323J15948
13953B925532l67912p0028J74261j59737k44210J60712l33043J01483o681j63460
13943B016917K52683l93423L39156r6853j13498N52807o93780J68565J8176j01529
$$ plain form
14009 2947293 2761172 2780562 2613340 2430599 2792226 2955801 2783122 2977613 2719591 2568130
13999 2568130 2364033 2497615 2298498 2169111 2286101 2429554 2646313 2446933 2336531
13990 2336531 2551319 2360961 2673687 2443666 2179799 2353972 2122706 2430150 2591728
13981 2591728 2576763 2552139 2561698 2563167 3214655 3219256 4805880 6058375 9629487 14903387
13971 14903387 25029623 36168691 24045463 14904791 9616788 7513328 5960149 5042783
13963 5042783 4314316 3947080 3625448 3198412 3131459 3468481 2766679 3205907 2809584 2925532
13953 2925532 2557620 2487592 2661853 2502116 2257906 2418618 2085575 2187058 2180377 2016917
13943 2016917 2269600 1876177 2215333 2118480 2004982 2557789 1864009 2032574 2050750 1949221
13933A949221L05773k44749j2470k10578R3361J70169n51854L28212o0853Q8741
13923A854973p504O7704J47015l2609m43257J62709R3325N867J24122k86418j77082
13912A508845J89447O1462j16272j17052o614J29279l49599N81386j97824q5443
13902A597615j9146k2635n8282J11236j73388j83491N3724J97352j86242R7340
13892A414083J06730J42447j58943j3685j1722j44927L56847O8023l13842k8046
13882A416965k56841N34262l77244k76304L56501k92652J34428l39111M68995
13873A368999o2925K41800k18016J22836j07317k6699j10427k2776k76206L62254
13863A271523j65323P1972J03339l66566K07837j74408K03664R2391K24094m53304
$$ plain form
13933 1949221 2254994 2010245 1997775 1787197 1880558 2050727 1498873 1827085 1766232 1854973
13923 1854973 1847469 1915173 2062188 2029579 1586322 1749031 1842356 1848223 1972345 1685927 1508845
13912 1508845 1698292 1759754 1643482 1526430 1519816 1649095 1299496 1880882 1683058 1597615
13902 1597615 1578469 1555834 1497552 1608788 1435400 1251909 1305633 1502985 1316743 1414083
13892 1414083 1520813 1663260 1504317 1490632 1478910 1333983 1690830 1758853 1445011 1416965
13882 1416965 1160124 1694386 1317142 1040838 1397339 1104687 1239115 900004 1368999
13873 1368999 1306074 1547874 1329858 1452694 1345377 1318678 1208251 1185475 909269 1271523
13863 1271523 1106200 1178172 1281511 914945 1122782 948374 1152038 1244429 1468523 1015219
13853A015219Q7702k92756K30339K01976j22344k20294J65764R7401N3889j75460
13843A041436m4334Q4931N4622k18895J45920j90130J21662K18433m85362N28171
13833A256454k23908r2597K33045j89919M4159l6907J14535m82303M35364j67716
13823H90207Q6098J90171l50047K38438p6222J16307J73726n22270l3260J23711
13813H36859O3444J83252M4593j96102k67881j65434M62942j15784K59253j42068
13803I63074j5027j91186K24309J17930l94989K41205j25400L50348m83985J15098
13793H01377R2513J90364k74606N453l10355M47338K8621J04041l18769n571O9781
13782H30187J86086l18340L61745j16386J92964E51461K47021J00283p5014n7508
$$ plain form
13853 1015219 1102921 810165 1040504 1242480 1120136 899842 1065606 1163007 1216896 1041436
13843 1041436 997102 1082033 1136655 917760 1063680 873550 995212 1213645 728283 1256454
13833 1256454 1032546 939949 1172994 983075 1027234 990327 1104862 622559 1057923 890207
13823 890207 976305 1166476 816429 1054867 978645 1094952 1268678 746408 713148 836859
13813 836859 900303 1083555 1128148 932046 664165 498731 961673 845889 1105142 963074
13803 963074 948047 756861 981170 1099100 704111 945316 819916 1170264 686279 801377
13793 801377 893890 1084254 809648 815101 504746 952084 980705 1084746 765977 760406 830187
13782 830187 1016273 697933 1059678 943292 1136256 551461 798482 898765 823751 766243
13772G66243N57599l10783l60960M25283k19843q2654j73319N8268J10565k20002
13762E50397J4509K47496j5726j74174o6992L41159k31787R8406M4001j00027
13752G07262Q9176r8585J86423m01891M23681C03538M31400J54k7521L01844j79861
13741H29554n4801k50009M3742J4292j09575K32906j99751K87429k42481k3281
13731E28025J55319L928k78482M6855K48580j01000j42102L70341j67143j05064
13721E59257Q475K63707j01078K01167k18030k7199q3759O928j51998J16536J09400
13710F83406k98293J53017p8613M61k8471N4676k6912K58315r310k46667M63818
13699I25427k73401j65647L93053k58564J10661m758B02436K24775N5620j72162
$$ plain form
13772 766243 1323842 1013059 652099 1077382 857539 774885 601566 659834 770399 550397
13762 550397 564906 812402 796676 622502 555510 896669 664882 763288 807289 707262
13752 707262 796438 697853 884276 482385 906066 303538 734938 735092 707571 1009415 829554
13741 829554 774753 524744 568486 582778 473203 706109 506358 793787 551306 528025
13731 528025 683344 687272 408790 455645 704225 603225 461123 831464 664321 559257
13721 559257 567732 831439 730361 931528 713498 686299 602540 609468 457470 574006 683406
13710 683406 385113 538130 459517 459978 431507 486183 459271 717586 708276 461609 925427
13699 925427 652026 486379 879432 620868 731529 726771 202436 427211 482831 310669
13689C10669L39790K85196J40711C45879N1134q9743J25820J9894j9093A84508
13678C39553K92785k53466K13488j91321L34141k30456j47678J87562K02733N2971
13668H00312C69747J69453D0447Q05978C58175K5285m9394L2578j48281J29646
13658C48009L22814Q061C37181o2307K66540K19235j10936k06917j97342K98446
13648E43900J12447k43817N7750P2974j69223J0155L27378l49227J93451k67398
13638B88390J94929l4269J00453A28393M8994M62444B81512L77752j87123Q6905
13628E59046j91649K13995o3619J32658j26997j50156N9177j52272R4703p389
13618C67497j9964n8848J62020o5986L56172B65669J4820K71406j43143j5164
$$ plain form
13689 310669 650459 935655 1076366 345879 397013 307270 433090 452984 433891 184508
13678 339553 632338 378872 592360 401039 735180 504724 357046 544608 747341 800312
13668 800312 369747 539200 40447 846425 358175 383460 334066 366644 218363 348009
13658 348009 670823 678884 337181 274874 541414 760649 649713 442796 245454 543900
13648 543900 656347 412530 470280 543254 374031 384186 711564 362337 555788 288390
13638 288390 483319 449050 549503 128393 177387 639831 281512 659264 472141 559046
13628 559046 367397 581392 517773 650431 523434 373278 432455 280183 374886 367497
13618 367497 347533 288685 450705 384719 740891 265669 280489 551895 408752 393588
13608C93588j8703N5500j34602n9607J27904K16773k88534m3068F7472P58682
13598H26154C42661O1958j42588P9481q4753K23222N7200j57208j68595K40858
13588D52236P844j83995n5023J23621m1168j3640M0836J38031j46538j1159o2957
13577B48088J21989M7575o4751K02299B32815K5535N7377J9031A54718K44632
13567C99350j64048J10602o9451L01238A63469K17559A67325L98915k59619G1432
13556G31883C34642Q0472j76810J44533j32205A12625J23874A0162O23685l08140
13546C25707J30877q4845A72577M09629k72845r9846b0020A1245J21775K32901
13536C65921R7117k08406C1879M65758o2313I4893L81350m7351A67409a26343
$$ plain form
13608 393588 374885 430385 295783 236176 364080 580853 292319 249251 67472 826154
13598 826154 342661 404619 262031 341512 256759 479981 537181 379973 211378 452236
13588 452236 460080 276085 221062 344683 303515 289875 330711 468742 322204 311045 248088
13577 248088 370077 417652 352901 555200 232815 258350 315727 334758 154718 399350
13567 399350 235302 345904 276453 577691 163469 381028 167325 566240 306621 71432
13556 731883 334642 415114 238304 382837 250632 112625 236499 10162 633847 325707
13546 325707 456584 371739 172577 582206 309361 209515 -20020 11245 133020 365921
13536 365921 463038 254632 31879 497637 435324 94893 476243 428892 167409 -126343
13525C51682J8409j1393m0513j275K25617A57581l496K68058j84495K67673A92499
13513E79822K0692k44848J25968j5121j66385E7184J27898p3248J28602l1759
13503B08677A02687f0991a0426B61202j0576j15041J01112L89624A83511O4044
13493B47555K1408p4027J34062K8078j70965J01760K7567k1922o1754I813K54904
13482B64717j3651K88303H0565N9676O0297l3044P0184k2371L42187A7464L30674
13471C48138j33345M25825G3744f5721C43369L6473a5587A56309D3123I030M47058
13460D56088B26572f4149C71315Q3642H9686K03166n8550J73638C9118G29L00099
13449C00828j9118r8475K02694O6706A64731J34745A12394J22604D424J92659
$$ plain form
13525 351682 370091 358698 318185 316910 542527 157581 154085 422143 237648 505321 192499
13513 579822 600514 355666 481634 466513 300128 57184 185082 111834 240436 208677
13503 208677 102687 -60991 -10426 261202 250626 135585 236697 626321 183511 247555
13493 247555 268963 194936 328998 357076 186111 287871 315438 293516 231762 9813 264717
13482 264717 251066 539369 80565 140241 200538 167494 237678 215307 557494 17464 348138
13471 348138 214793 640618 73744 -65721 343369 379842 -15587 156309 43123 9030 456088
13460 456088 226572 -64149 371315 454957 89686 292852 234302 407940 39118 729 300828
13449 300828 281710 183235 385929 452635 164731 299476 112394 234998 4424 197083
13439A97083o2352N3585l2787M12818n0920G3168Q2619J24937J48293K9194B05865
13427B10888L03375a14631a0758B10820K9131P7674A29644J09405d5638A61436
13416A35753J04639j17013K3920M8200l3883l9822J76099g7396O515D94022B03573
13404A76625L28444A75020J60988b8113B29529Q9981j33341q8780R2625J22827
13394C12841D7601J00716C2349P46096e3030B83873A17783k4994L37001A66775
13383B81939a14025D0005K36963C4467O1662R4778q7423J31144J01957J75950
13373E12535A90950J9848L58134A24795J43221A30550J82181q7297n1956p9971
13363I3507L03485A04675O6461M9810r245g0582C02726J05120A77829J23202O8976
$$ plain form
13439 197083 134731 188316 155529 568347 517427 73168 155787 280724 429017 458211 205865
13427 210888 514263 -114631 -10758 210820 239951 317625 129644 239049 -45638 161436
13416 135753 240392 123379 147299 195499 161616 121794 297893 -77396 -70881 494022 203573
13404 176625 505069 175020 336008 -28113 229529 319510 186169 97389 190014 312841
13394 312841 47601 148317 32349 778445 -53030 283873 117783 92789 429790 166775
13383 281939 -114025 40005 276968 34467 96129 190907 103484 234628 336585 512535
13373 512535 190950 210798 568932 124795 268016 130550 312731 225434 173478 93507
13363 93507 396992 104675 171136 220946 211701 -70582 302726 407846 177829 301031 370007
13352C70007A3439M90275F4432K14743A15808J49128h2639C81069h6622E20374
13341B799K01424a24439C15196b27401B83271b41269A16113J77956A39988K9621
13331A69609m5608R7686n3296P1271a49800E50525k09986n081J48855J49437B66904
13319F65002j63456A07209J62269J78716J05968N4009B25419a77704C3917M2144
13309G6061O8087L23133A56871A6424N29K48428I013L31437K2853m610b2005A5199
13296C0746K33234p793C3630K21306J11870A32769b11727G81g5705B81159A08711
13284B51394J1847o3938J00118a77916d4993A15181J59025j19656N8419O1385
13274B74354a1761o4054B50162J17391a06402B80470A31914a44277B46211J33155
$$ plain form
13352 370007 13439 503714 64432 279175 115808 264936 -82639 381069 -86622 520374
13341 2799 204223 -124439 315196 -227401 283271 -241269 116113 294069 139988 169609
13331 169609 124001 221687 168391 239662 -149800 550525 340539 335458 484313 633750 266904
13319 665002 501546 107209 269478 448194 554162 608171 225419 -177704 33917 76061
13309 76061 144148 467281 156871 16424 16953 265381 9013 340450 363303 358693 -22005 15199
13296 30746 263980 256187 33630 254936 366806 132769 -211727 781 -75705 281159 108711
13284 251394 263241 199303 299421 -177916 -44993 115181 274206 154550 212969 274354
13274 274354 -11761 -75815 250162 367553 -106402 280470 131914 -144277 246211 379366
13264C79366A15034j9339R3123D2186J77787r3455c0184B3342a46609L8694E98220
13252B39439b5055B60272a8425A87730J38343a6519k8746C76993A42768l1960
13242A10808j2915J07153b70087l9657B12579b52154g619a114B5508g997H2275
13230E80778B19956a35497c3696B04443F5775a48208B08034n7964J65439n3008
13220B62501K4287m4186d1524p6966B02136j0980a22533L8867k46584B38766b64690
13208D22851G5527J02725i0710c8536A3520a083B73321B5110J62513d4297D24287
13196B25651i4356B58026a86113E1225J89474c27064B16518c268C0067J97246
13186B27313q8234P4165K305l6347b5815l7460K4492A6444J82223n3868N0750
$$ plain form
13264 379366 115034 95695 188818 42186 219973 126518 -30184 23342 -146609 -107915 598220
13252 239439 -25055 260272 -18425 187730 326073 -16519 -45265 376993 142768 110808
13242 110808 97893 205046 -270087 -309744 212579 -252154 -7619 -1114 25508 -7997 82275
13230 580778 219956 -135497 -33696 204443 65775 -148208 208034 150070 315509 262501
13220 262501 286788 242602 -41524 -118490 202136 191156 -122533 -83666 -330250 238766 -264690
13208 422851 75527 178252 -90710 -38536 13520 -1083 273321 25110 187623 -44297 424287
13196 225651 -94356 258026 -186113 51225 240699 -327064 216518 -3268 30067 227313
13186 227313 139079 213244 215549 179202 -25815 -63275 -38783 16444 198667 144799 195549
13175A95549c3691H2081O8860o2430J48998e2417K1046q3449M7118k40119C41850
13163f0431n1586B27343r3277P6151M8035G9787j5092K00928j12819H519J72802
13152A81321R7946j03612i608B05478D3960j7731K90580e0215K4267B90303D2438
13140C10084J36E1619L1085a2719k6704H9945B0215L23930C6955e5823p3626A0787
13127C51777A37305a38158A97979M6329G6462a2524B05182P3018b10433e0954
13116A76448L1377A02886b92371h6075A60201l2375k0251a74793G5356P9240e8138
13104F7003P7868a99418A9438J09783a10143L4895g312I2349m1638L2056g3653
13092b6881L259A97655e2293c883k31332E3601J59115l8636D1733Q3332a16613
$$ plain form
13175 195549 -33691 82081 150941 88511 237509 -52417 -31371 -114820 -67702 -307821 341850
13163 -60431 -112017 227343 134066 210217 258252 79787 64695 265623 152804 8519 181321
13152 181321 279267 175655 -9608 205478 43960 26229 316809 -50215 -25948 290303 42438
13140 310084 310220 51619 82704 -12719 -39423 89945 20215 344145 36955 -55823 -129449 10787
13127 351777 137305 -138158 197979 244308 76462 -12524 205182 278200 -210433 -50954
13116 176448 207825 102886 -292371 -86075 160201 127826 107575 -174793 75356 154596 -58138
13104 67003 144871 -199418 19438 129221 -110143 -75248 -7312 92349 50711 82767 -73653
13092 -26881 -23622 197655 -52293 -3883 -235215 53601 212716 174080 41733 125065 -116613
13080c15089h7885B57486g3982F9928P794j6136f1857A07757a65945D0107J39127
13069A79234b1027F5728a65927A92929a5470j17894A92554C8208E351K185O2333
13058F9869b44567E51313A17402M5500K60284A02069K02096F1998b57611B79457
13047E136K30913a33252c1105j63215D3181P9814e564K13H8573L8574J99286j62343
13035A64090Q1298d9538J9545B46042a82788A01228a51372D6315g8903E65156
13024C05482A21562n9225M45357k4517A71011a9018A61984K42537b45693a5629
13013E8944M171m105K31322F5845A6707K2287Q1820Q8361a13540k8632d9699I4255
13000D46500n1085a81697E4866J74214D1655c76829A18790b39085C64662j26391
$$ plain form
13080 -315089 -87885 257486 -73982 69928 77722 61586 -61857 107757 -165945 40107 179234
13069 179234 -21027 65728 -165927 192929 -15470 -133364 192554 38208 5351 7536 69869
13058 69869 -244567 551313 117402 162902 423186 102069 304165 61998 -257611 279457
13047 5136 236049 -133252 -31105 -194320 43181 122995 -5564 -5351 88573 127147 326433 164090
13035 164090 245388 -49538 -29993 246042 -182788 101228 -151372 46315 -78903 565156
13024 305482 121562 62337 507694 483177 171011 -19018 161984 404521 -245693 -15629
13013 58944 63115 59010 290332 65845 16707 38994 120814 209175 -113540 -142172 -49699 94255
13000 446500 395415 -181697 54866 229080 41655 -376829 118790 -239085 364662 238271
12990B38271J32293j70477r1104a91608h2387A53614K8926B0423J97443a10381
12979b01372O2142B0428R061L47346a6695B22430e1018E5633L1559J09866E0174
12967C9412J05371b88420J42044B5043K7270K20401A24913h1091A19727b77312
12956a28376p4167d6509r9038B79029a02863R510j68544B1995e7920B13451c04782
12944F4643b37541D8986K7131h2622c8579c237j5648B45140F9922J2076B614b64088
12931f735A31199K4022R818e1457A73311F1152f6357j24865A12344a43315a4713
12919b38221j06563a17745H0227i6455B0848J73022C1566K6460c50306C25016
12908H7255j2678a14410l6912A67829E1316d2170B82474n1020P3887a29996p1585
$$ plain form
12990 238271 370564 200087 108983 -191608 -82387 153614 182540 20423 217866 -110381
12979 -201372 -139230 20428 29489 376835 -16695 222430 -51018 55633 87192 197058 50174
12967 39412 144783 -288420 -146376 25043 52313 272714 124913 -81091 119727 -277312
12956 -128376 -202543 -46509 -145547 279029 -102863 -93353 -261897 21995 -57920 213451 -304782
12944 64643 -237541 48986 76117 -82622 -38579 -3237 -18885 245140 69922 81998 2614 -264088
12931 -6735 131199 155221 165039 -51457 173311 61152 -66357 -191222 112344 -143315 -14713
12919 -238221 -344784 -117745 80227 -96455 20848 193870 31566 58026 -350306 325016
12908 87255 74577 -114410 -151322 167829 51316 -42170 282474 231454 305341 -129996 -201581
12897b01581A46518E9786j497f7444j16982B89319d7085H3097N0504J93756a17514
12885h4088a2075j1494A69852p0801B9458a04541j37745g5175I1820b40812a3628
12873a2830l3469B03738M5648f2296A62370c146G861b59360B08757a43746J8489
12862a25257m4356B7900a50341C32092B7435a70057h187E7525c90687a92353Q9879
12851a02474j22044C11607A21319a62713C3330A383M08806A83223G8288Q298d68584
12839H2251Q3466L2268b93039J06976B61315H4984c0869I780J35618g2954A45072
12827a51914j6453B26344H3206J00641G142Q9211d8427g032A28640l0972b83456
12815D17845a14780B882i5648k19103c6933H0825b0411l6279K1157n7438j77775
$$ plain form
12897 -201581 146518 59786 58289 -67444 -184426 289319 -47085 83097 133601 327357 -117514
12885 -84088 -12075 -23569 169852 99051 29458 -104541 -242286 -75175 91820 -240812 -13628
12873 -12830 -46299 203738 249386 -62296 162370 -3146 7861 -259360 208757 -143746 -125257
12862 -125257 -169613 27900 -150341 332092 27435 -170057 -8187 57525 -390687 -192353 -102474
12851 -102474 -224518 311607 121319 -162713 33330 1383 410189 183223 78288 86586 -468584
12839 82251 165717 197985 -293039 -186063 261315 84984 -30869 9780 145398 -72954 145072
12827 -151914 -168367 226344 83206 183847 7142 96353 -48427 -7032 128640 97668 -283456
12815 417845 -114780 2882 -95648 -314751 -36933 80825 -20411 -56690 -35533 -92971 -270746
12804b70746B66098a33667I6661j7709L72498A44571J04011j08859F5538d8755
12793C6009E547J2717c1133A19592g3801B7041f8641L3074N279k66515A84683
12781I3119c08040i611p9223j43814A2980c46840f964A22938h8980I5762R1509
12770A87271l5938c7876B36532d7295A64908p5773J9052b87034a589k82755A72133
12758A16354a77421B48160c32012a09960A82599a238k65317D40869b3800A18527
12747B42326I4180g5719I110L3814a04771A8907K20332B0632c2918m2353J1616
12736f3655C9241J34441h8238l1622i680D14342a08779c9228C3224f680j47047
12725a53727d485k66179a21131l6409A85032r1791b02575i3963A21017k1904b62546
$$ plain form
12804 -270746 266098 -133667 96661 78952 451450 144571 248582 139723 65538 -48755
12793 36009 5547 18264 -31133 119592 -73801 27041 -68641 -35567 -30288 -296803 184683
12781 93119 -308040 -9611 -88834 -232648 12980 -346840 -6964 122938 -88980 95762 187271
12770 187271 151333 -37876 236532 -47295 164908 89135 108187 -287034 -1589 -284344 172133
12758 116354 -177421 248160 -332012 -109960 182599 -1238 -266555 440869 -23800 118527
12747 242326 94180 -75719 9110 42924 -104771 18907 239239 20632 -32918 -75271 -63655
12736 -63655 39241 173682 -88238 -119860 -9680 414342 -108779 -39228 33224 -6680 -153727
12725 -153727 -4485 -270664 -121131 -157540 185032 93241 -202575 -93963 121017 99113 -262546
12713B87834b22724M2522a7780F0676J48329a78880j16487A31442a46297A12896
12702a47968A2607a73453G9019c8471C16949e24542B6813J39364B91e3404A71831
12690C82882K28174F0632J87566a28525C6303a15957B84930d16072D1895o36i855
12678A01852a57899e5711I7817a42841C8679j4647f7378K9985k36717E8442b5984
12666A86369r056l4425b19935F0246L34107b9652J2517B70074O8553j61516K31213
12655D08324d4966A50848j5845b50664j77327A64061J10392a62662A80215P7239
12645B57454D2417n052a05538A49885G2377K39186c04740A38088N7444D5679a50016
12633f9482j4444c7391q4040F7484b0411k34572c3209A95745L2949f6080D5744
$$ plain form
12713 287834 -222724 -180202 -17780 60676 209005 -178880 -295367 131442 -146297 112896
12702 -147968 12607 -173453 79019 -38471 316949 -524542 26813 166177 291 -53404 171831
12690 382882 611056 60632 248198 -128525 36303 -115957 284930 -416072 41895 41259 -9855
12678 101852 -157899 -55711 97817 -142841 38679 24032 -67378 -37393 -274110 58442 -25984
12666 186369 177313 142888 -219935 60246 394353 -29652 -17135 270074 338627 177111 408324
12655 408324 -44966 150848 135003 -250664 -427991 164061 274453 -162662 180215 257454
12645 257454 42417 37365 -105538 149885 72377 311563 -304740 138088 195532 45679 -150016
12633 -69482 -83926 -37391 -121431 67484 -20411 -254983 -33209 195745 228694 -66080 45744
12621B61100q4204l1449e6496E65075g3539A94770K644a0327C59853o8172p4802
12610B16879k1392K59334a16419B50406c9047B56882I0802m0459c9144A82793
12599d8488k93918b3241I8791a4139B00174n4201L2549a55359I4918b13933i9208
12587D77596F4591a86241N0678B06383B3611B196e7791r685B39856f0927D9680
12575H866J82333C9137A164i2026p4080N4762A28561c44235A46875C5553d4726
12563A16958b18081f8313I002f2009D65P1701a32416j20219A56882h5047A91490
12551c11041a54821f6071m9080A42109K06426c43711g0995B10730a00226l8462
12541a38688c6353J8008D5568b3239G6803a67752A77323l0219D1561A5655P3197
$$ plain form
12621 261100 176896 145447 -56496 565075 -73539 194770 197414 -10327 359853 291681 216879
12610 216879 195487 454821 -116419 250406 -39047 256882 90802 50343 -39144 182793
12599 -48488 -342406 -23241 98791 -14139 200174 145973 178522 -155359 94918 -213933 -99208
12587 477596 64591 -186241 -135563 206383 23611 2196 -57791 -67476 239856 -60927 49680
12575 8866 191199 39137 1164 -92026 -166106 -111344 128561 -344235 146875 35553 -44726
12563 116958 -218081 -68313 9002 -62009 465 72166 -132416 -252635 156882 -85047 191490
12551 -311041 -154821 -66071 -115151 142109 348535 -343711 -70995 210730 -100226 -138688
12541 -138688 -36353 -18345 45568 -23239 76803 -167752 177323 147104 41561 15655 88852
12530H8852f1934k19995J06904A24962a30230A5159K47914c7688B01450c36878
12519c04537P9996Q0938d5769B13716J43629f5323j19928I0414k3869a5270l53902
12508c69172B32866o9821b2749A47389b3569A79105a40645A0149a25930A31196
12497c1630F511P2523b71392B24126J0014q3529a13487B51581b59400J04845g1545
12485i5762j46785a3775r6218A42342d16598a27600I6571d20981e4761B48385
12474A78256q7566d06956E6353c4218j72935A70499K10315m0567G6858J25648
12464B02506p5164K09070g7328B97187b1234e142A41025l8716b0470o261l00595
12453c27326B24599f7824J4063D36754a6536r9059A37976e525m9741e462c45m05631
$$ plain form
12530 88852 -61934 -281929 -175025 124962 -130230 15159 263073 -37688 201450 -336878
12519 -304537 -224541 -143603 -45769 213716 357345 -65323 -185251 90414 66545 -15270 -369172
12508 -369172 232866 163045 -22749 147389 -23569 179105 -140645 10149 -125930 131196
12497 -31630 6511 79034 -271392 224126 234140 150611 -113487 251581 -259400 -154555 -71545
12485 -95762 -242547 -13775 -109993 142342 -416598 -127600 96571 -420981 -54761 248385
12474 178256 90690 -406956 56353 -34218 -207153 170499 380814 340247 76858 202506
12464 202506 127342 336412 -77328 297187 -21234 -5142 141025 102309 -20470 -26731 -327326
12453 -327326 224599 -67824 -53761 436754 -16536 -115595 137976 -5525 -55266 -5462 -345 -405976
12441d05976C40386A68714J57937k3189o8683F9038J01927K67414B7674J9275
12431D6949J34115j9989a53620b7718A21104a09654A64638A9104i2670D8117e1538
12419B98201b3273k87417I1478a03759p1387a9681A72292c96706a49030j091B6331
12407a88713J79g9008K2309B36088c23654a28453A14477a6199o5489k4189A8687
12395a32156D28553H847L5591a41164f5052j34190R4780B0011a28099k8470A67842
12383i6624E9845J63004I3553c70152D5385b8058A07560a72680B70296L0641j12659
12372A88278L0261I7958J08530E7745K840B9361K07075G8778J49407J088r7951
12361A31322a03226H5044J67785o5063c00875i6942B50249b76127b6910B46476
$$ plain form
12441 -405976 340386 168714 326651 303462 234779 69038 170965 438379 27674 46949
12431 46949 181064 161075 -153620 -27718 121104 -109654 164638 19104 -92670 48117 -51538
12419 298201 -23273 -310690 91478 -103759 -175146 -19681 172292 -396706 -149030 -150121 26331
12407 -188713 -188534 -79008 -56699 236088 -323654 -128453 114477 -16199 -81688 -105877 18687
12395 -132156 428553 8847 44438 -141164 -65052 -199242 -104462 20011 -128099 -156569 167842
12383 -96624 59845 222849 93553 -370152 45385 -28058 107560 -172680 270296 300937 188278
12372 188278 218539 97958 206488 57745 60585 29361 236436 78778 228185 229273 131322
12361 131322 -103226 85044 252829 187766 -300875 -96942 250249 -276127 -26910 246476
12350D60521a52117A59696K0878g5012o2908A55555i9699k944G4796b04482C3355
12338C2913g9360k54978A7303f5727o5747E2538J35800G4710K78927j11558A16842
12326G3219b54j62k97876A75501P0451L9521p4351b7752I7792J34870O5101J4032
12314C11795L16264B44876j15969e8857A13480n007K83617m3906e0174K756C59916
12302A14210J81831o902G5319J55561J07733j19587A4470L85434a60602B2530
12291g3242A80987a22335l1071A94109K9426i5214i684o8080A61250f4757K9474
12280c5283j1716C15952a59490J4118A95856J5950c0911c063C30603G7470a29952
12268b3715G801M55121b5608B70575q7723E9864P3021N353K6200D6080B91a8068
$$ plain form
12350 460521 -152117 159696 180574 -75012 -137920 155555 -99699 -102643 74796 -204482 33355
12338 32913 -79360 -334338 17303 -65727 -131474 52538 188338 74710 353637 242079 116842
12326 73219 -254 -416 -298292 175501 245952 285473 211122 -27752 97792 232662 297763 311795
12314 311795 628059 244876 128907 -58857 113480 108473 392090 348184 -50174 -47418 359916
12302 114210 296041 289139 75319 230880 338613 219026 14470 399904 -160602 22530
12291 -73242 180987 -122335 -153406 194109 223535 -95214 -9684 -77764 161250 -64757 -35283
12280 -35283 -46999 315952 -159490 -145372 195856 211806 -30911 -3063 330603 77470 -129952
12268 -23715 7801 462922 -25608 270575 182852 59864 132885 138238 164438 46080 291 -18068
12255B40409I2012K34745A0181K3618K65166j20842L28351A07994K94031G995
12244H8339d344j59383l10451C95174j48766b8407E88622B51419D625L04180p5331
12233B33474F2856R088l4706J01294K5800J73631h3640C71719j14534r5568b82224
12221e974j91849C5501J83546f2387A30913J43302d7371B69939e870D82576J7492
12210E00068B23601h0099A53486B8308K5007J22824O1454G2144B092N2127L84744
12199D38963N905c738q1653A53843B4327L30679c47689g5943C83213a9969B94061
12187A36984A9324M4778b46176J12186A61268a4980C65053H6850d9332r68D53347
12175A20019J71467a25052A08067b0669B44646O3057k2075O5202j9013I4879D481
$$ plain form
12255 240409 92012 326757 10181 33799 298965 178123 506474 107994 402025 7995
12244 88339 -4344 -163727 -474178 395174 246408 -28407 588622 251419 4625 308805 233474
12233 233474 62856 71944 37238 138532 164332 337963 -83640 371719 257185 161617 -282224
12221 -5974 -197823 35501 219047 -62387 130913 274215 -47371 269939 -5870 482576 500068
12210 500068 223601 -80099 153486 28308 53315 176139 237593 72144 2092 54219 438963
12199 438963 444868 -3738 -85391 153843 24327 355006 -347689 -75943 383213 -19969 294061
12187 136984 19324 64102 -246176 -133990 161268 -14980 365053 86850 -49332 -50300 453347
12175 120019 291486 -125052 108067 -20669 244646 307703 285628 350830 331817 94879 4481
12163D36661E400P4399J38577l3334i2604A98817L43400B23802J98003A09432
12152B28776O076C7901J03663J49990l6575G6981J47594J48202A50586P4130b6195
12140E59790j14389B20908r3344a14168B19590o2383j6884Q6061g507m147n1992
12129f3646K5434p9012K3568A54185O5941c3867I1932K44063R085f5060d808A97689
12116A38963B3264L7389l0284J07501R3222N42741A85412j3633L44915C9637K97305
12105C36942A30562K14508j33484F6598J11080p5195q558C0829J24297F8525M1525
12094A10050K9855J13874j01028P9457l4206K44900A88506o7252K03871G1376
12083f2163l8043j759H9243Q2220r087M31638A5692K48013h158j57882O2406A18883
$$ plain form
12163 436661 5400 79799 218376 185042 -92604 198817 542217 223802 421805 109432
12152 228776 234852 37901 141564 291554 254979 76981 224575 372777 150586 224716 -26195
12140 559790 445401 220908 127564 -114168 219590 157207 140323 226384 -7507 -11654 -63646
12129 -63646 -38212 -117224 -93656 154185 220126 -33867 91932 335995 345080 -65060 -4808 197689
12116 138963 23264 60653 30369 137870 231092 773833 185412 171779 516694 39637 336942
12105 336942 130562 345070 211586 66598 177678 102483 93925 30829 155126 68525 110050
12094 110050 139905 253779 152751 232208 198002 442902 188506 121254 325125 71376
12083 -62163 -100206 -101965 89243 171463 162376 594014 15692 263705 -8158 -166040 -103634 118883
12070A61852F7953B1091M93461r4572C4834a00394F1604k6304h2976c9466A31564
12058B86009L534m2589A17868J52426p900A19961M3618j1339d042H6410J23122
12047B09532D0206L763a0010j72322A23686a19919E2477O095a42177a8836l8752
12036e7588B59644f3087q995A8643K3625J06507l1640a77093A51047K0852e4323
12024a64615A96069d2618l8004C04692b15133e7464A92508A7511b31637B88881
12013g4804I3045Q6399O5269N8692F348N15034C6578K62124c6172C06167A15148
12001e62971A16132D298b9561B71740j01053F3400b7834B25351c0073p5152A85515
11989G5009J40396i33B73662g9164A69642J13473I8355B1594i0769L5184m4683
$$ plain form
12070 161852 67953 21091 514552 419980 34834 -100394 61604 35300 -82976 -39466 131564
12058 286009 289543 246954 117868 270294 262394 119961 163579 152240 -4042 86410 209532
12047 209532 40206 43969 -10010 -182332 123686 -119919 52477 58572 -142177 -18836 -57588
12036 -57588 259644 -63087 -72082 18643 42268 148775 117135 -177093 151047 171899 -54323
12024 -164615 196069 -42618 -80622 304692 -215133 -57464 192508 17511 -231637 288881
12013 -74804 93045 179444 244713 303405 6348 521382 36578 298702 -36172 306167 115148
12001 -562971 116132 4298 -29561 271740 170687 63400 -27834 225351 -30073 -105225 185515
11989 75009 215405 -933 273662 -79164 169642 283115 98355 21594 -90769 -55585 -100268
11978a00268J2961B59166A00134B0821J09237L1580b14718H5172b25001a2879
11967A55916d49183A8009c9027H6412d20507a27707k70340A78206b06561k07735
11957d14296f71D51487i4353j26653A37427m1886C203f9037A0768b17866A20282
11945b68476B25986b08313j25770b6492n1105k2624B57714D7739f4308A34048
11934d8490A19788a49197e6087b816q8240j67669E2141P0273E9849d18341f4469
11922G7491J73708J63895a11424p0703o2731C43819c06831H7964a19200A4538
11911d66607K02697B66326B9291J9006N3363l2485J03785p0764a31895K2674o9986
11900a79207K5346k0081D3162a01704A51856D2802l040J80644d37871E4123M6327
$$ plain form
11978 -100268 -87307 259166 100134 20821 130058 161638 -214718 85172 -225001 -12879
11967 155916 -449183 18009 -39027 86412 -420507 -127707 -398047 178206 -206561 -414296
11957 -414296 -671 451487 -94353 -221006 137427 95541 3203 -69037 10768 -217866 120282
11945 -268476 225986 -208313 -334083 -26492 -77597 -100221 257714 47739 -64308 134048
11934 -48490 119788 -149197 -56087 -2816 -91056 -258725 52141 122414 59849 -418341 -64469
11922 77491 251199 415094 -111424 -182127 -244858 343819 -306831 87964 -119200 14538
11911 -466607 -263910 266326 29291 48297 101660 69175 172960 102196 -131895 -109221 -179207
11900 -179207 -153861 -173942 43162 -101704 151856 42802 39762 220406 -437871 54123 100450
11889A00450J13871g1951A78419i7014A93882e9434A23250n9835b09144g2809
11878a32566G201a92372A54645A5463d8927j97428r4612D2106d7139j55439A30659
11866b53487B47426H5380e1773A68547J14285A29698J23339l4622f548B91306
11855a36182q6268i0765k41481M6536i9705j09917H4451g1475l1407A21852a94214
11843f3790H057K42717C2206b40544P1122H0456b26368G5821A3393h066k58850
11832b66916M2592E8432a64928l9619k64860A39289h4531E7782q818K08689B3623
11820e8144B42030a16038c4309G2069b8395j57514J5356A15469h4204E0437K76441
11809C26878a60863q9643n4181a35711N500c2634k2915B53108A1990e938B36974
$$ plain form
11889 100450 214321 -71951 178419 -97014 193882 -59434 123250 63415 -209144 -72809
11878 -132566 7201 -192372 154645 15463 -48927 -246355 -340967 42106 -47139 -202578 130659
11866 -253487 247426 85380 -51773 168547 282832 129698 253037 218415 -6548 291306
11855 -136182 -222450 -90765 -332246 -285710 -99705 -209622 84451 -71475 -102882 121852 -194214
11843 -63790 8057 250774 32206 -240544 -169422 80456 -226368 75821 13393 -8066 -266916
11832 -266916 -224324 58432 -164928 -204547 -469407 139289 -84531 57782 48964 257653 23623
11820 -58144 242030 -116038 -34309 72069 -28395 -185909 -170553 115469 -84204 50437 326878
11809 326878 -160863 -250506 -304687 -135711 -130211 -32634 -55549 253108 11990 -5938 236974
11797B67109b80199f2452q945G6553c03268F0495c0605h400C24157f69558c772
11785G148J4166a42920A12656j7250Q1618b63150D1888a92174G1099J5092J05258
11774A91449b9309A57101a0415j64697j95884a15948H5596l9004a00040a173k6502
11763b7675o649k26727R0238g4495L6c2830D8612g5820F5698a47577j98126e146
11750A70362a91853i391B45478e3384G0039g4638k68915h4882L6793j83367E4064
11738A66123Q8148c6245j12590A4374c86498A53379h0287l19318g4330B19925
11727E0999b72661c9656l438r9510B00317b5837k351B6249c91248a18399l2305
11716a50704k17643a83139O6426N8L1720q008j23848b89k01963I7175m4405a51799
$$ plain form
11797 267109 -280199 -62452 -71397 76553 -303268 60495 -30605 -8400 324157 -669558 -3772
11785 7148 21314 -142920 112656 95406 177024 -263150 41888 -192174 71099 86191 191449
11774 191449 -29309 157101 -10415 -175112 -370996 -115948 85596 46592 -100040 -1173 -27675
11763 -27675 -34324 -261051 -170813 -74495 -74459 -32830 48612 -75820 65698 -147577 -345703 -5146
11750 170362 -191853 -9391 245478 -53384 70039 -74638 -343553 -84882 -48089 -231456 54064
11738 166123 254271 -36245 -148835 14374 -386498 153379 -80287 -399605 -74330 219925
11727 50999 -272661 -39656 -43094 -142604 200317 -25837 -28188 26249 -391248 -118399 -150704
11716 -150704 -368347 -183139 -116713 -116655 -84935 -92943 -216791 -289 -202252 97175 52770 -151799
11703B36191p4644k8786k9979N0470o3272K09885G9796K5207l3832J74062A01659
11691a77057A56730D9188a90709O2341l2730f3279C18232n6124f9684n3459A76076
11679a37157F0384a07868r037A07492q43j0336b2702A22133b07388A06627e2478
11667F3216B4847a43048E1773h2171m8003B05420a84627e2979B13907b8937j8175
11656d7112A85061e847j63899h1263A09705K1225m1749B3160a44124B97683a02748
11644A5283a51974A34415c26933h8998A4856f1609i464j73717Q5841l982A66044
11632C2404a01249A04160K86D9864a04348j96184C46789F295J04467c3762B3701
11620a62262B23081b14131j978C4b59930j6286a17085j30582A85658p764b22230
$$ plain form
11703 236191 161547 132761 102782 153252 89980 299865 79796 105003 71171 245233 101659
11691 -177057 156730 49188 -190709 -128368 -161098 -63279 318232 262108 -69684 -123143 176076
11679 -137157 60384 -107868 -116905 107492 106649 96313 -22702 122133 -207388 106627 -52478
11667 63216 24847 -143048 51773 -82171 -130174 205420 -184627 -52979 213907 -28937 -47112
11656 -47112 185061 -5847 -169746 -81263 109705 130930 89181 23160 -144124 297683 -102748
11644 15283 -151974 134415 -326933 -88998 14856 -61609 -9464 -183181 -97340 -101322 166044
11632 32404 -101249 104160 104446 49864 -104348 -300532 346789 6295 110762 -33762 23701
11620 -162262 223081 -214131 -216109 34 -259930 -276216 -117085 -247667 185658 177894 -222230
11608A35407J87013A13049A8729c7161l00581A92034i2057D674J35824c4690k34673
11597b69363C34777H3830d2023B24796a02493p360A1714J11046a28538A84850
11586a49404B785c8867J7605n7692o3949B28550H0527I220a83122m5711j19487
11575c48320a08239e0262r1207B95688D3341a24853A02320F88h825k7786B17029
11563E308J30196e487l1622j37123A17276b39561J4818i8052c6770A17145L49567
11552D66712h4325L4154I5116j9398k3533b35A61023J77294a98762A64608a55041
11540a96733B817f5179f38C96574D0003E78J81737l4238c08122C31213A32314
11528i7399d4706B56734h6160A28414k269f6269L1365C54792b7892a1928j1446
$$ plain form
11608 135407 322420 113049 18729 -37161 -337742 192034 -92057 4674 140498 -34690 -269363
11597 -269363 334777 83830 -42023 224796 -102493 -109853 11714 122760 -128538 184850
11586 -149404 2785 -38867 -21262 -78954 -142903 228550 80527 9220 -183122 -228833 -348320
11575 -348320 -108239 -50262 -141469 295688 43341 -124853 102320 688 -8825 -36611 217029
11563 5308 135504 -5487 -37109 -174232 117276 -239561 -224743 -98052 -36770 117145 466712
11552 466712 -84325 -50171 95116 75718 52185 -235 161023 338317 -198762 164608 -155041
11540 -196733 2817 -65179 -638 396574 40003 578 182315 148077 -308122 331213 132314
11528 -97399 -44706 256734 -86160 128414 126145 -66269 -34904 354792 -27892 -11928 -23374
11517b3374Q448B41407a1494k0590B47862j02187J22461a21008r6420c3812C69104
11505f7349j49071F8592J62086A06840K28415a9980A31070k1946a54811B67806
11494B28593k1996b25929g9671B08196o4639K125q494a36933A43318J85528b3690
11482A10450P3547A3039O4251G367J48505n1689a7552j03834n1698A61673K0743
11471A82416J80940D987L21419O702B777a94210A90538L07417k18410J6074A15121
11459g1052b5666l7450B42813f0852B54432h636B52949d5602C43280e3046e891
11447C10450o8161a0431B79891P0297B6036J24233j0643n517M5863K81166f9859
11435B71562E3694d7684A09246J3786J8759K23920j73570J33115j3734D5249f6080
$$ plain form
11517 -23374 -14926 241407 -11494 -32084 247862 145675 268136 -121008 -217428 -33812 369104
11505 -67349 -216420 68592 230678 106840 335255 -19980 131070 109124 -154811 267806
11494 228593 206597 -225929 -79671 208196 143557 145682 137188 -136933 143318 328846 -23690
11482 110450 183997 13039 77290 7367 155872 104183 -17552 -121386 -173084 161673 182416
11471 182416 363356 4987 326406 333108 2777 -194210 190538 497955 279545 295619 115121
11459 -71052 -25666 -63116 242813 -60852 254432 -8636 252949 -45602 343280 -53046 -5891
11447 310450 242289 -10431 279891 350188 26036 150269 139626 134109 179972 461138 -69859
11435 271562 53694 -47684 109246 123032 141791 365711 192141 325256 311522 45249 -66080
11423B4259K74095d4117C13976h2176m723A11340a52953P3810E26K31123b07002
11411E1316b3874F87f8259a2773j29062j7640A65445c0345B44494D6521a7403
11399a32036A05743L0220D7187a44710a925C57549a88845B09868a26862E4127
11388f4436H5759J15919r1675m7986a27053N9982K9205n9353B14387b4938C8619
11376d28359C8946A8166a50872G6765j3916f3718B9705J79509C3533M22788i2751
11364A26705C249a0101I6808c27170A7263c33270g668A63093d2027k2862A88935
11352A39291m6169b47627E5669J2770g0580k59677C53563D8671a00493M7129B02293
11340A55017a96356j41879g3242p995j02328H8260K58051b68112A2353a74467
$$ plain form
11423 24259 298354 -44117 313976 -82176 -86899 111340 -152953 -79143 526 231649 -207002
11411 51316 -23874 687 -68259 -12773 -141835 -159475 165445 -30345 244494 46521 -17403
11399 -132036 105743 135963 47187 -144710 -1925 357549 -188845 209868 -126862 54127
11388 -64436 85759 201678 110003 62017 -127053 -67071 -37866 -97219 214387 -24938 38619
11376 -428359 38946 18166 -150872 76765 62849 -63718 29705 209214 33533 456321 -92751
11364 126705 3249 -10101 96808 -327170 17263 -333270 -7668 163093 -42027 -64889 188935
11352 139291 93122 -247627 55669 68439 -70580 -330257 353563 48671 -100493 -53364 202293
11340 155017 -196356 -338235 -73242 -81237 -183565 88260 346311 -268112 12353 -174467
11329c3774B95560c3903j1774o3200K4707A20536a26887A28581D8156a34629d5528
11317b33223A80704g8961L2448j13284C8673b32790J02418q312M1755b4785p6408
11306a01193C1874f156A16650m8907B6876M0944A9749J67886L8342a16523B13297
11294A8972a24901j88596i5024j08957h0055F023b21226K6440A46676O8406a60336
11282B8199g1920k72528a29301e2116B49823A10019C0934a16125l6145H0416b48297
11270d14343A48723J68406c99995J90747B05891q5033h1375l17923a52827C14939
11259g472k33613A01270l4807b73424A79887a64661k34223c9181A67232a58399
11248a56184D6106j3324K04810b229l39281A8661A259d44939A44271J93543G1831
$$ plain form
11329 -33774 295560 -33903 -45677 -108877 -84170 120536 -126887 128581 48156 -134629 -45528
11317 -233223 180704 -78961 -46513 -159797 38673 -232790 -130372 -138684 -96929 -24785 -101193
11306 -101193 31874 -6156 116650 67743 26876 67820 19749 187635 225977 -116523 213297
11294 18972 -124901 -313497 -95024 -203981 -80055 6023 -221226 -194786 146676 215082 -160336
11282 28199 -71920 -344448 -129301 -52116 249823 110019 30934 -116125 -152270 80416 -248297
11270 -414343 148723 317129 -399995 -209248 205891 120858 -81375 -399298 -152827 314939
11259 -7472 -241085 101270 66463 -273424 179887 -164661 -398884 -39181 167232 -158399
11248 -156184 46106 32782 237592 -2229 -341510 18661 1259 -444939 144271 337814 71831
11236F4017b44472A72019B7423e5126D2285a98298n8115R9288N6341A1746L1984
11225D3730J4116h0016j06176A97642b70731H6267e9483A04819b26976D7126M0899
11214H8025c8641j99625r6448A97912a27695j5187q5727a1667k17888K2471P5926
11203a31158b8626A86008J12358a96273j90691F6800K017a08654k21090j55392
11193d85136b5502o342l2368k3613A15123B0232a29543M3048p4067A14839m786
11182A10053E2489a95767o032A85637q9200K19210G485d15692e7983j42225i5924
11170b62152a03183n96239L48282J11319C7619J3856a60607O8440j1739I4417
11159a87963A36700h1231l54778K07437F1784d59407B3276d8369E67J19700c2270
$$ plain form
11236 64017 -244472 172019 27423 -55126 42285 -198298 -256413 -157125 -100784 11746 43730
11225 43730 57846 -80016 -186192 197642 -270731 86267 -59483 104819 -226976 47126 88025
11214 88025 -38641 -238266 -334714 197912 -127695 -142882 -228609 -11667 -229555 -207084 -131158
11203 -131158 -28626 186008 298366 -196273 -386964 66800 68817 -108654 -329744 -485136
11193 -485136 -25502 -31844 -64212 -87825 115123 20232 -129543 -86495 -160562 114839 110053
11182 110053 52489 -195767 -201799 185637 96437 315647 7485 -415692 -57983 -200208 -95924
11170 -262152 -103183 -699422 -351140 -239821 37619 51475 -160607 -92167 -103906 94417
11159 -187963 136700 -81231 -436009 -228572 61784 -459407 23276 -48369 567 120267 -32270
11147F0640K1834b5233j26730B17768a79166h112n2808A11304J97284c7715o798
11136d4513A3805f1904D9885b65284B93442a08742B75854k2341j15683n6094b51766
11124b02282f9047k44328a2500B09202f2643A5381i2105j22746B66593b60377
11113a4394A8565K37032b29464B2783J31103a04826B21578h5381A14031L5456
11103A49487b65020d784B09888d5817B32533L3388b09636I0032g4743q2352B54141
11091b85364B99802o9002H5570B0836K21604a44534H6922K66226J85576f0846
11080B02538q9757n1415K60608p3338r3513g8990p4174B71708Q4864a4660D6954
11068B35475k3978K79077B39967I9310J47640R3291m5665j3891j7016e4197E77786
$$ plain form
11147 60640 82474 -25233 -151963 217768 -179166 -8112 -60920 111304 308588 -37715 -44513
11136 -44513 13805 -61904 49885 -265284 293442 -108742 275854 253513 137830 81736 -251766
11124 -202282 -69047 -313375 -12500 209202 -62643 15381 -92105 -214851 266593 -260377
11113 -14394 18565 255597 -229464 22783 153886 -104826 221578 -85381 114031 149487
11103 149487 -265020 -4784 209888 -45817 232533 265921 -209636 90032 -74743 -157095 254141
11091 -285364 299802 230800 85570 20836 242440 -144534 86922 353148 538724 -60846
11080 202538 112781 61366 321974 248636 155123 -78990 -153164 271708 356572 -14660 46954
11068 235475 211497 490574 239967 99310 246950 340241 294576 280685 263669 -54197 577786
11056C82922O9454j61013K19859n0927j66234r2024R599K41081j70526L01910
11046E84101J19477n9523j52464J43822R0161B68227O44757k72607M635J70100
11036H15112k6022q8440K95260L7868K594k8751J07160O5262K34401F60409J45477
11025H05886N36395m56909O6031J6309L02855p9212j49783j56010K59098O8118
11015A212778m7084k95407k8121J57890J61424k17020j20889J55180m2371q7306
11005H49074K00209N1125n18496N61301j98049m51272J84544J80327j32688Q9988
10995H16063q584j73253K35469j48653r769K00899K72557k89548K45662D08362
10984F36187L35481k50741j78291J48131o7076o8604K46573O8674m4049l9237
$$ plain form
11056 382922 452376 291363 511222 460295 294061 202037 211636 452717 282191 584101
11046 584101 703578 644055 491591 635413 725574 268227 912984 640377 645012 815112
11036 815112 789090 700650 995910 1033778 1036372 1007621 1114781 1180043 1414444 660409 805886
11025 805886 1342281 885372 951403 967712 1270567 1191355 1041572 885562 1144660 1212778
11015 1212778 1165694 870287 842166 1000056 1161480 944460 823571 978751 936380 849074
11005 849074 1049283 1100408 581912 1143213 945164 493892 678436 858763 726075 816063
10995 816063 807479 634226 869695 721042 711273 912172 1184729 895181 1140843 408362
10984 636187 971668 720927 542636 690767 623691 555087 801660 870334 826285 787048
10974G87048n4981L50797l18908J21092k66689N16678J34123j77538k23701K14864
10964A082785K89172k61580K74114o0746L88281j35570P7316L61333Q410L8141
10954B061656J66651O96712J70427K28023l9596K25962q2379n2242m25427o4020
10944B885767p00073j06874k27537M4406j32503j65321L05543l26615J08499r6604
10934A588688k45071j82291l66508L92416m36922l17021K76264K7225l22449A98824
10923C20521A17332J06819m3528J06374q6470K56707E2265a54255C28001b1285
10912a25967j76077A61338a81695q2242A12104A4040R7631c05409G389i8877j11194
10901b10071c3114G768J3171d4471B03811F3456a9034j24424B4758O3232b40162
$$ plain form
10974 787048 732067 1082864 763956 885048 618359 1135037 1269160 1091622 867921 1082785
10964 1082785 1371957 1110377 1384491 1323745 1712026 1576456 1653772 2015105 2023515 2061656
10954 2061656 2228307 2925019 3095446 3323469 3283873 3509835 3427456 3375214 2949787 2885767
10944 2885767 2185694 2078820 1851283 1895689 1763186 1597865 1903408 1576793 1685292 1588688
10934 1588688 1343617 1161326 794818 1187234 750312 433291 709555 736780 414331 198824
10923 320521 117332 224151 180623 286997 200527 457234 52265 -154255 328001 -21285
10912 -125967 -302044 161338 -181695 -263937 112104 14040 111671 -305409 7389 -98877 -210071
10901 -210071 -33114 7768 20939 -44471 203811 63456 -19034 -143458 24758 87990 -240162
10889D62h9862C31571I7340L380a51442q4796i7360n7434A79601i3117A37168
10877A03063J13832d58246J19801A32522a41332A53286b63621J31258r0293O1580
10867a61076A80119b87835B51646c7764A97169a27989j09291J01016H4193b25233
10856a01719L9546A74862K4882b42597d5456k39549g6913L7035B90662n7630a47229
10844b46100N3625B01056i3844d1181j23121P2981B69180a05428A95847B9220
10833b34784j62698A25502j5626K24026a65242j3666C74104p0919a16389A40177
10822b7460A17552k3489k7956l0257N2254E040k153M3211P195L46967I745b01657
10809a94541p4747A60969F3166a52950P2901A39773b38910A0592a69671l1216
$$ plain form
10889 462 -89862 331571 97340 100720 -151442 -236238 -97360 -154794 179601 -93117 137168
10877 103063 216895 -458246 -338445 132522 -141332 153286 -263621 -132363 -222656 -161076
10867 -161076 180119 -287835 251646 -37764 197169 -127989 -237280 -136264 84193 -225233
10856 -101719 -62173 174862 199744 -242597 -45456 -285005 -76913 -39878 290662 233032 -147229
10844 -246100 -192475 201056 -93844 -41181 -164302 -91321 269180 -105428 195847 29220
10833 -234784 -397482 125502 109876 333902 -165242 -178908 374104 303185 -116389 140177
10822 -27460 117552 94063 66107 35850 88104 5040 2887 46098 53293 400260 9745 -201657
10809 -194541 -269288 160969 63166 -152950 -80049 139773 -238910 10592 -169671 -200887
10799b00887D660e3745l68010A781e6997E2198a10687n9010L3540l64212A62595
10787A36210B2454K8392d4822I5657A3212d1070b299j13498L8040K0648F5749
10775f0282j44063L4385g1830j21881q5183a04474o7562P3759B96365d5477J9850
10764b5627A99533q5779K0758C4442J23253E3115a02019A3647c34249D9330J55134
10753B04464p3746b47068Q5947K0605c7615k30478H8946O1001h9967j30084B23693
10741a32696B21481f5943A51432b01107e8347j14538e0752n7972j23866a4233
10730a40328f1165B17226b51086I7554L6864a90767m5671A00522i6063m6763c4620
10718d2609q6622M8863B14906b36449I7973L49539b34234A1642J9363b17594b1153
$$ plain form
10799 -200887 4660 -53745 -421755 1781 -56997 52198 -110687 -169697 -136157 -500369 162595
10787 136210 22454 50846 -44822 95657 13212 -41070 -2299 -115797 -77757 -57109 65749
10775 -60282 -204345 -169960 -71830 -193711 -278894 -104474 -172036 -98277 296365 -45477 -25627
10764 -25627 199533 113754 134512 34442 157695 53115 -102019 13647 -334249 49330 204464
10753 204464 130718 -247068 -161121 -140516 -37615 -268093 88946 149947 -89967 -220051 223693
10741 -132696 221481 -65943 151432 -201107 -58347 -172885 -50752 -108724 -232590 -14233
10730 -140328 -61165 217226 -251086 97554 134418 -190767 -236438 100522 -96063 -142826 -34620
10718 -42609 -129231 -80368 214906 -236449 97973 447512 -234234 11642 31005 -217594 -21153
10706F8815a16487j06515j9939P548g5168B0910c19110I7841b13735F1767O2913
10695A24680A3436a30974B1509P5377a21j3557E7499N644c105k30285Q5184b8922
10682B67797b0096G1964b15871D9493J22045F42d6077I4871b55784J12590O4325
10671g8869q8101D3972e0182j46669E8537J55633a53983L3082j35231A95598b23156
10659g5084j98745f8882A43259e5098o8075f1337l97914a45167P1858l1873o6683
10648a71865o4356a17613b1984j44178l8782B6014a91355B96841j08344O469a90489
10636i490C21275E0540b66140a13937G6630a52928C7523J27633F4340i8616M2047
10625e6569F6733a34693b2525j21780q5972B4183b48019b2004k95313J0490M2719
$$ plain form
10706 68815 -116487 -223002 -242941 -235393 -75168 20910 -319110 97841 -213735 61767 124680
10695 124680 13436 -130974 21509 96886 -121 -13678 57499 63143 -3105 -233390 -148206 -28922
10682 267797 -20096 71964 -215871 49493 171538 642 -46077 94871 -255784 -143194 -78869
10671 -78869 -166970 43972 -50182 -196851 58537 214170 -153983 -120901 -256132 195598 -223156
10659 -75084 -273829 -68882 143259 -55098 -123173 -61337 -459251 -145167 -73309 -105182 -171865
10648 -171865 -236221 -117613 -21984 -166162 -204944 26014 -191355 296841 188497 194966 -190489
10636 -9490 321275 50540 -266140 -113937 76630 -152928 37523 165156 64340 -98616 -56569
10625 -56569 66733 -134693 -22525 -144305 -230277 24183 -248019 -22004 -317317 -306827 -264108
10614b64108B5176d11100G6349c40313e5104G4255c43780A47045D4525c63277
10603b03839D2829d05286a3648j0094q3900B23602b25339B69961A12572a08254
10592b47738C4492J5668J45694E1978J09333e537n9545N782k03525N6033j03077
10581c09869N2112i4435A7153a93479r2226I5210n478a83787D7994a43818k16356
10570c60174n1817e4845C1826a13961k36058B7737e2508B9600a17598j57826B30013
10558I5967a75119b4383r9070K9588C5376a51602A15356l3297M0341a81523A67499
10546c29276c9263B05987q5283c84609a54035N6802r7965k6824g8413I4054c79105
10534E7301J78249I1587b45196Q8396f8174m0045l6333B320a87179j24822a5421
$$ plain form
10614 -264108 25176 -411100 76349 -340313 -55104 74255 -343780 147045 44525 -363277
10603 -203839 42829 -405286 -13648 -23742 -107642 223602 -225339 269961 112572 -108254
10592 -247738 34492 50160 195854 51978 161311 -5537 -65082 -59300 -262825 -206792 -309869
10581 -309869 -257757 -94435 17153 -193479 -285705 95210 89732 -183787 47994 -143818 -360174
10570 -360174 -411991 -54845 31826 -113961 -350019 27737 -52508 29600 -117598 -275424 230013
10558 95967 -175119 -24383 -123453 -93865 35376 -151602 115356 82059 122400 -181523 167499
10546 -329276 -39263 205987 120704 -384609 -154035 -97233 -195198 -222022 -78413 94054 -379105
10534 57301 235550 91587 -245196 -156800 -68174 -108219 -144552 2320 -187179 -312001 -15421
10522B5573a27822o762K762k31623A11203e14421f2335k22055J24408J3380j47399
10511b94001B9702c8164k21738f8184j5546k49267B9728c6336H7424J3528a28540
10499d2535A05867b63923J04962A05636B5757M16h859C8792L5976d9958k71002
10488c20960A61655G0208J05227J62752A29280N0214a85909d3899a2840m8118
10478f0958j55968j2197A90822b0049j47466e1791b743H2715b70920Q0902c7801
10466b91151B07130k9391a14837o084b4525D05299A69093P5035L1802A09453K33234
10455C42687r1355K4246f0003B30863E6460L2930e2420q7167a9552j07554k3969
10444a51075f1745H2946h8955a750k00570C4876b01304A6303a35191B07883h2580
$$ plain form
10522 25573 -127822 -134584 -131822 -363445 111203 -514421 -62335 -284390 -159982 -146602 -294001
10511 -294001 29702 -38164 -259902 -68184 -83730 -332997 29728 -36336 87424 100952 -128540
10499 -42535 105867 -263923 -158961 105636 25757 26173 -8859 38792 74768 -49958 -320960
10488 -320960 161655 70208 175435 338187 129280 179494 -185909 -43899 -12840 -60958
10478 -60958 -216926 -229123 190822 -20049 -167515 -51791 -2743 82715 -270920 -190018 -37801
10466 -291151 207130 177739 -114837 -120921 -24525 405299 169093 244128 275930 109453 342687
10455 342687 251332 275578 -60003 230863 56460 89390 -52420 -139587 -19552 -127106 -151075
10444 -151075 -61745 82946 -88955 -1750 -202320 34876 -201304 16303 -135191 207883 -82580
10432A41699e47608A40800i3892q6920A23720m7088a32616O2871K7456A00446
10421A37443e9756p4094O1789B11115e695j9435k57800J8944J06451k6096j91604
10410c75235A04267J09416j03767i2361m6877A06861D03f3884A4911K15385a252
10398C84110A75782e4274j91959C8487a87992p2392C930J52746a73393A451a64229
10386A57012d05088J83744E0221a59718A39957b28335A1358J21979B4494K46216
10376B70710f9302A46481K91409f3231B31375h2686E1777a5497A72565m0852L1138
10365A62851a28219j5140A94464J46542F0640M77939k51055J47508F9377K05791
10355B75168k0108G5178L13533P8325k0365j24544L11522A87629M98599O179p1044
$$ plain form
10432 141699 -547608 140800 -93892 -180812 123720 76632 -132616 -69745 -42289 100446
10421 137443 -59756 -133850 -72061 211115 -5695 -25130 -282930 -263986 -157535 -183631 -375235
10410 -375235 104267 213683 109916 -92361 -139238 106861 403 -63884 14911 230296 -1252
10398 384110 175782 -54274 -246233 38487 -187992 -260384 3930 156676 -173393 1451 -164229
10386 157012 -405088 -221344 50221 -159718 139957 -228335 11358 133337 24494 270710
10376 270710 -69302 146481 437890 -63231 231375 -82686 51777 -15497 172565 131713 162851
10365 162851 -128219 -143359 194464 341006 60640 538579 287524 435032 69377 275168
10355 275168 255060 75178 388711 467036 446671 322127 633649 187629 686228 692407 621363
10344F21363j52012N6875k53226L26402j57661A84925J33543A02193K92633j82257
10334B12569J57294O8444J21604m2638O3992B87176l0150O6434k9294J1435d5119
10322D4073K75870o2886F2234K47065K1251O8995j20300m7964C9005J70063a63963
10310E2557b96049A37405O0057D1602J62413f7801B03404C3610g3554I2334l3122
10299E9212c26718A57958h6535B71655A12657f4488m6077F5660h8249L4788D3275
10287F5672a36800N1561A96715a31360P687f1098A12532a71055A35010D0894J1896
10276E2790b30333A14030K03383A03493l4435J78184i6660m5375J0294l9287I0357
10264D2553J47309c2041j16886H3462k5914e9374D1610j7166a78066m84059d319
$$ plain form
10344 621363 469351 526226 273000 599402 441741 184925 318468 102193 394826 212569
10334 212569 369863 438307 559911 517273 581265 287176 257026 323460 294166 305601 -45119
10322 44073 319943 257057 62234 309299 330550 399545 279245 231281 39005 209068 -163963
10310 52557 -296049 137405 197462 41602 204015 -67801 203404 33610 -73554 92334 59212
10299 59212 -326718 157958 -86535 271655 112657 -64488 -110565 65660 -88249 -53461 43275
10287 65672 -136800 -85239 196715 -131360 -123673 -61098 112532 -171055 135010 40894 52790
10276 52790 -230333 114030 317413 103493 69058 247242 -96660 -142035 -131741 -171028 90357
10264 42553 189862 -32041 -148927 83462 57548 -59374 41610 24444 -178066 -662125 -4319
10252a74476o0995B2280a25158o798B39725D2377a34316n542B16721A5101a03912
10240H825J83014f3004C65567Q7712A60766m008J90604g9693A15856a26640B18202
10228b01606R5138j19314A31789i5328b8484C265K68705a05940k40395H224a71093
10216I6774a49747a290j1298j74192C22739j23929e7768D4240i7787B223b26910
10204a97345r846G5393a91097k597p3128E8364a68205j70767H3927m413C2054
10192b91309m0885A62410a91250C20641d9462m1091C6275h2983r6353A0260K39441
10181B49701a3468n4687G0618m13c36650E477J30168K7236b22345k0126A01782
10169D5682R4800b41957R7607j74680a07677A59968l0791a03195L2198k12117
$$ plain form
10252 -174476 -235471 22280 -125158 -131956 239725 42377 -134316 -139858 216721 15101 -103912
10240 8825 191839 -63004 365567 453279 160766 156758 347362 -79693 115856 -126640 218202
10228 -201606 -106468 -225782 131789 -95328 -28484 3265 271970 -105940 -346335 8224 -171093
10216 96774 -149747 -1290 -12588 -186780 322739 198810 -57768 44240 -97787 2223 -226910
10204 -197345 -207191 75393 -191097 -193694 -266822 58364 -168205 -338972 83927 79514 32054
10192 -291309 -332194 162410 -191250 320641 -49462 -90553 36275 -82983 -179336 10260 249701
10181 249701 -13468 -68155 70618 70205 -336650 5477 135645 162881 -222345 -242471 101782
10169 45682 140482 -241957 -144350 -319030 -107677 159968 129177 -103195 -70997 -283114
10159b83114M6505A5420c71538f4317D2182J86211H0075c3931o4592j50607A68348
10147c9000m2064r0328D1321a62184r1486j10752a17441p0617E4991C334O6939
10136G0273k5616c1780p8998A19401a75583P8755E9687K8487a5218l3930k11732
10125b60880O1256B9799a83759j67729J69914D6093a3302j83227b6656A13566
10114F9031d284l0567G2380a35563p6199h855j04852j9202m9769A35158J5333
10103A50491N7062d2358A10156b9045k09630J04426I0749e6269B6662c03250J23784
10092a79466c6473m1845R85k11079a25772B01449F8949b75178e0382A68727f19395
10080A20158k2169f113m14431e0031j59309d0280A17806o398a9428B21454q8222
$$ plain form
10159 -283114 -236609 15420 -371538 -64317 42182 228393 80075 -33931 -98523 -249130 168348
10147 -39000 -81064 -171392 41321 -162184 -253670 -364422 -117441 -188058 54991 3334 70273
10136 70273 44657 -31780 -110778 119401 -175583 -96828 59687 88174 -15218 -49148 -260880
10125 -260880 -199624 29799 -183759 -351488 -181574 46093 -13302 -196529 -26656 113566
10114 69031 -4284 -34851 72380 -135563 -211762 -8855 -113707 -132909 -182678 135158 150491
10103 150491 207553 -42358 110156 -29045 -238675 -134249 90749 -56269 26662 -303250 -179466
10092 -179466 -36473 -78318 -77333 -288412 -125772 201449 68949 -275178 -50382 168727 -619395
10080 120158 97989 -6113 -420544 -50031 -209340 -40280 117806 111408 -19428 221454 133232
10069A33232b30960A50104a54615f5417K4984j4684m11833A12764i6181o6480
10059a62661B52910a2818j94901d2016B0014e9736B95233C3718K73687A07121
10048B1629c8452j48627D08856a60637m0232O4011p4356f1438r9233C75730G3300
10036d4300k77047J00908Q4623f92j46478f1490A13115b0479j02212e8452k07847
10025b66299A12754H592c32653E1844j5469e7229l08960J58472I7649a47533A65393
10013G9826f1569L0434G949L8431b35925O6835j14589A2818b16183h7889C31501
10001a86458B87769q9389K0326d08292A0380a16730j14147P9014b0195A40098
9990I9139N1146K4925p7177b84834a12539F8374k4974b03553H338a63888A66172
$$ plain form
10069 133232 -230960 150104 -154615 -65417 -40433 -55117 -466950 112764 -96181 -162661
10059 -162661 252910 -12818 -207719 -42016 20014 -59736 295233 33718 307405 107121
10048 21629 -38452 -187079 408856 -160637 -200869 -136858 -211214 -61438 -160671 375730 73300
10036 -44300 -321347 -220439 -135816 -692 -147170 -61490 113115 -20479 -122691 -58452 -266299
10025 -266299 112754 8592 -332653 51844 36375 -57229 -366189 -207717 97649 -147533 165393
10013 79826 -61569 -31135 7949 46380 -235925 -169090 -283679 12818 -216183 -87889 331501
10001 -186458 287769 198380 218706 -408292 10380 -116730 -230877 -151863 -20195 140098
9990 99139 150285 175210 98033 -284834 -112539 68374 43400 -203553 8338 -163888 166172
9978g8495o4278j27574K3753g4765A74871i3686C83514a94327e0129k54179A08163
9966g1895r8768k3805j43354G8129L17168a24857b0826j85178J8774j25807O070
9955c06967J41492f5863q1750d7413q5562J1827A34235c6167A75529j5278c43947
9943C6198J57977E4156J0582d6609B32306i0350A93053a08078m556B8765a61520
9931F0634i3177K8450B49588b8618j49794r0779j37746d7443A76238a21322j1674
9920a32996k44926R7438A24933i3487o1171e09k09225f0994A03469k8076K7012
9909A02405b30051p73a15204b3570B01204b28645n3157h5688R671c5934j65565
9898b01499J9442J3058B25907a32646p3654Q3644C86962c02308L9446J30943j25267
$$ plain form
9978 -78495 -142773 -270347 -246594 -74765 174871 -93686 383514 -194327 -50129 -304308 108163
9966 -71895 -170663 -194468 -337822 78129 395297 -124857 -20826 -206004 -187230 -313037 -306967
9955 -306967 -165475 -65863 -147613 -47413 -132975 -121148 134235 -36167 175529 160251 -343947
9943 36198 194175 54156 64738 -46609 232306 -90350 193053 -108078 -112634 28765 -161520
9931 60634 -93177 -64727 249588 -28618 -178412 -269191 -406937 -47443 176238 -121322 -132996
9920 -132996 -377922 -280484 124933 -93487 -154658 -509 -209734 -60994 103469 75393 102405
9909 102405 -230051 -230824 -115204 -23570 201204 -228645 -281802 -85688 -76017 -35934 -201499
9898 -201499 -182057 -168999 225907 -132646 -206300 -122656 386962 -302308 -262862 -131919 -257186
9887b57186a25127M249H4109J71132c63115h888o9820k10138A33256b49842b2714
9875c5457r7106A94468b70069L1541E802a74800E63689b10970o7399J07405A42793
9863a84680A7283P7194a06850D08627j93187a05467C5457c05391C7776L25765
9853C63541c44460P431A2799h8790A2718a46334J4153c7586F3938Q7374J85184
9842C36496a29710B7842c75475A49795k2813J29568c6689j76286Q3530N0030m4173
9831a23588E9521L04424a63728o1393B89333c01386j71051A52064a97985P618
9821a90367j15190a45238A83167c7185p2291K0903j14995A7446g0592B7509M2037
9810F9546R8398b79373H2131N2064o6301j6045e5187A01074a8618H5496a86782
$$ plain form
9887 -257186 -125127 -120878 84109 255241 -363115 -8888 -78708 -288846 133256 -249842 -22714
9875 -35457 -132563 194468 -270069 -238528 5802 -174800 563689 -210970 -278369 -170964 142793
9863 -184680 17283 94477 -106850 408627 215440 -105467 35457 -305391 37776 363541
9853 363541 -344460 -337029 12799 -88790 12718 -146334 -132181 -37586 63938 151312 336496
9842 336496 -129710 27842 -375475 149795 126982 256550 -36689 -212975 -129445 -79415 -123588
9831 -123588 59521 363945 -163728 -225121 289333 -301386 -472437 152064 -197985 -190367
9821 -190367 -305557 -145238 183167 -37185 -109476 -88573 -203568 17446 -70592 27509 69546
9810 69546 167944 -279373 82131 134195 67894 51849 -55187 101074 -18618 85496 -186782
9798G7566a77175b8340k75776J16103k8504Q7318j01764C2293R5643D0367h9356
9786d7083B6966a40425I9691i5444D8410a80704A7161a64961Q1376G8470e1649
9774a33445o9106O0501f0065p2543B4840a41862j44322A10786C8157A4911a94947
9762f1639j56312B06583b73403i8039d3535j86488A48595m332a93812M4531l9284
9751a88565R2663A47474g4436j30479C48690H1893a10432r8520l058k26425a37719
9739A26309d7054A85551j6646J25909j19054h2858K4472j5942j79959A17211b70285
9727A11151c59817J58918k4644a4118l56253J62487Q4465I551a76871a960k70173
9716b72133G6103g6281j81966H4810J8990a50279e0677m7628j4321k04575J48270
$$ plain form
9798 77566 -177175 -28340 -304116 -188013 -216517 -129199 -230963 32293 127936 40367 -89356
9786 -47083 26966 -140425 99691 -95444 48410 -180704 17161 -164961 -83585 78470 -51649
9774 -133445 -202551 -142050 -60065 -132608 24840 -141862 -286184 110786 38157 14911 -194947
9762 -61639 -217951 206583 -273403 -98039 -43535 -230023 148595 144263 -193812 -149281 -188565
9751 -188565 -95902 147474 -74436 -204915 348690 81893 -110432 -208952 -212010 -438435 -137719
9739 126309 -47054 185551 168905 294814 175760 -82858 -58386 -74328 -254287 117211 -270285
9727 111151 -359817 -200899 -225543 -14118 -370371 -207884 -123419 9551 -176871 -1960 -272133
9716 -272133 76103 -76281 -258247 84810 103800 -150279 -50677 -98305 -112626 -317201 -168931
9705a68931A75718b50683C51371a91528l24759A09792m3195P740J6088r144c5332
9693b13472a5274G4731c4360l1680A36774F029f4337j89999H7465e9811j06843
9682a66654Q2098C390a03501j20142o4776B73895q9687d53384I539A657Q9013
9671I0670h527k85953A92556b4917D28980e7848n3436M0688A50253C9437b68847
9659b9985k21008f121k54256a01209F2469J7930n017a52098l3271A77829j2658
9648A65171d1849k30490A46524d00509B27455b26780j64219C2758P2681d0897
9637B15793a67598e439j91385b2860j93623e4756k57265a38518f741D9291a64126
9625B3820a72193h0533j1038m1390l27649a01324I6020J5161O3916a45820B9427
$$ plain form
9705 -168931 175718 -250683 351371 -191528 -516287 109792 66597 74337 90425 81281 -35332
9693 -213472 -15274 74731 -34360 -66040 136774 6029 -64337 -254336 87465 -59811 -166654
9682 -166654 -84556 3390 -103501 -223643 -288419 273895 184208 -453384 9539 1657 90670
9671 90670 -8527 -294480 192556 -24917 428980 -57848 -111284 -70596 150253 39437 -268847
9659 -29985 -250993 -6121 -260377 -101209 62469 80399 75382 -152098 -185369 177829 165171
9648 165171 -41849 -272339 146524 -400509 227455 -226780 -390999 32758 105439 -40897
9637 215793 -167598 -5439 -196824 -22860 -216483 -54756 -312021 -138518 -6741 49291 -164126
9625 23820 -172193 -80533 -91571 -132961 -460610 -101324 96020 111181 175097 -145820 29427
9613H341a38858M3526d6776j8443j16240N7611M0969j36354D7569a7057A5801
9601b11603k17900B84070a90670B58770A1650Q8831a26520H1238L9172m9818e8580
9589G3531A3307b74441R0843P6851j82877a906n3378B85368a74395f602p653k16862
9577b31117m9107B6394e1479j12630E9223d92655O224g8998A24749c62986f7525
9565A6770Q0692b37185B2394b4751l18717J36797q2590c6417C83265b3176G5093
9553e6069k5862m7883F3568c2809B2518L2026h3628G8139a3666C4377i6764gG3647
9539A76926B0819a31955D01970c35821N1933f0547A32461e2301k43631H3463C9987
9527E6622c64190B06321b70644C4925d6766o4078K2646B4899a77450A6734a4514
$$ plain form
9613 8341 -138858 -95332 -46776 -65219 -181459 -123848 -82879 -219233 47569 -17057 15801
9601 -211603 -429503 284070 -190670 258770 11650 100481 -126520 81238 120410 70592 -58580
9589 73531 13307 -274441 -183598 -106747 -289624 -1906 -55284 285368 -174395 -6602 -14255 -231117
9577 -231117 -280224 26394 -51479 -164109 59223 -492655 -486431 -78998 124749 -362986 -67525
9565 16770 97462 -237185 22394 -24751 -343468 -206671 -289261 -36417 383265 -23176 75093
9553 -56069 -81931 -129814 63568 -32809 22518 54544 -83628 78139 -13666 34377 -96764 -7 73647
9539 176926 20819 -131955 401970 -335821 -283888 -60547 132461 -52301 -295932 83463 39987
9527 56622 -364190 206321 -270644 34925 -46766 -110844 -88198 24899 -177450 16734 -14514
9515C71313c30995a41211m3866p9939a06377D216b8914k13961j9895j75816a08276
9503I8808d7674G7761J13104H9464g6004q3976k39477B12646a15060j02373g9006
9491c17850c7460A9713J3402a9512D7661B1270a50691o552j1119n6491c7157I2716
9478d47689b04315B159J0728e8086l49256D6466j0211h3018B2855b52612G90b02826
9465A4225K32630c7808k00265N0089G320b59405b7487o0828B10123b61097C2026
9453C36025d2088r1605O2322j94046M7921a7478k94123g8610o2773q5405F1718
9441B58233A8092a60901E9944b26483f4008A9443b53163B81396d13368C452c1764
9429I8889m7670i0280j16585l2467b9205A95506i7233p7878b2807A51996a15267
$$ plain form
9515 371313 -330995 -141211 -185077 -265016 -106377 4216 -28914 -242875 -262770 -438586 -108276
9503 98808 -47674 77761 190865 89464 -76004 -159980 -399457 212646 -115060 -217433 -79006
9491 -317850 -37460 19713 33115 -19512 47661 21270 -150691 -157243 -168362 -224853 -37157 92716
9478 -447689 -204315 2159 12887 -58086 -407342 46466 36255 -83018 22855 -252612 790 -202826
9465 14225 246855 -37808 -238073 -187984 7320 -259405 -27487 -88315 210123 -261097 32026
9453 336025 -42088 -133693 -71371 -265417 -217496 -17478 -311601 -78610 -141383 -226788 61718
9441 258233 18092 -160901 59944 -226483 -64008 19443 -253163 281396 -413368 3452 -31764
9429 98889 51219 -90280 -206865 -239332 -29205 195506 -97233 -175111 -22807 151996 -115267
9417d43017a84070g1714r4369A33605a34355r657r8678N4333J707E4511a26428
9405F5392R5682D1951b7398A03793C686a97622C30557j56011c6755k56175J948
9394b90982l9153g5459j71530A78319H237a23316I3270c9040C53677A72898e5413
9382d153E59771E8716m761a12758B4010c61611n9321F4029L14764j81410d60614
9370e5535R077G4747a47684l16730a61358g9398b1931j8618j34353k90479A61840
9358A6263O461J59798e338k64745h0013j00463b8041k91190L5437D3011c69812
9346B74539b93916j02739I4418b65108a5535p1732A11508a46814A98169P4366
9336B72535C2890Q1256n0533a15836e3983B02135a19510M0643p7815A11504J01050
$$ plain form
9417 -443017 -184070 -71714 -166083 133605 -134355 -144012 -242690 -188357 -186650 54511 -126428
9405 65392 161074 41951 -27398 103793 3686 -197622 330557 174546 -36755 -292930 -290982
9394 -290982 -330135 -75459 -246989 178319 8237 -123316 93270 -39040 353677 172898 -55413
9382 -4153 559771 58716 53955 -112758 24010 -361611 -420932 64029 378793 197383 -460614
9370 -55535 -46458 74747 -147684 -464414 -161358 -79398 -21931 -40549 -174902 -465381 161840
9358 16263 22724 182522 -5338 -270083 -80013 -180476 -28041 -319231 -283794 43011 -369812
9346 274539 -293916 -396655 94418 -265108 -15535 -87267 111508 -146814 198169 272535
9336 272535 32890 114146 63613 -115836 -53983 202135 -119510 -78867 -156682 111504 212554
9325B12554E3711a91801A58599J42601d8301B64742G8088O1427l6078K5937b28792
9313c50466J61524q2557e9368k00928B31258c49169A18326a44669J4449B6377
9302b63112J02271B38645b53799i614A86587b44606f0235C024L49950a46282k87591
9291d33873A37717b23526g6270A27684E2991J27053a17136B47313b64425q833
9281b73258K6712b7871A27218a5812k95063h047n3825e216j80551e1896m34184
9270d86080A20802b31446N7165K8183j30017f0418l07136a51588b5522A60427
9259a46522C02067a90618d4406k6064r1965A68487a38699J6057A81630b71683
9248A307a08419j61938D0677P4671N67g6361l55458f9641a7524G7427p840A2231
$$ plain form
9325 212554 53711 -191801 158599 301200 -48301 264742 78088 139515 103437 129374 -228792
9313 -350466 -188942 -271499 -59368 -260296 231258 -349169 118326 -144669 -130220 26377
9302 -263112 -160841 238645 -253799 -9614 186587 -244606 -60235 3024 352974 -146282 -433873
9291 -433873 137717 -223526 -76270 127684 52991 180044 -117136 247313 -264425 -273258
9281 -273258 -246546 -27871 127218 -15812 -310875 -8047 -61872 -5216 -185767 -51896 -486080
9270 -486080 120802 -231446 -174281 -146098 -276115 -60418 -367554 -151588 -25522 160427
9259 -146522 302067 -190618 -44406 -70470 -162435 168487 -138699 -122642 181630 -271683
9248 1307 -108419 -270357 40677 115348 115915 -76361 -431819 -69641 -17524 77427 69587 12231
9235g779r8A0978b93653f9496A72633H5718b23262g6049B0367L3261H363P169
9223A5532c88600j2781B48469c97761J81497Q5483b1260o7386d3046m1416j76230
9212b60692A7671a31644e1303H6765c67920O1914O864A59481a71366B3958b6089
9200g851l57528a15010j39404E9013c17310J07941j2761A87340b49394L3143h1460
9188c60523a15721H0148j7428a88180n1587A63401c21821f2697k23600J23460
9178a62837a3653k61254B44655B3967a72552k0666B27453b55351m990M0943A15006
9166e5750o3423b4956A02509L4061c33380i6634K4203J3205B2777c1753K973j01254
9154a30034E4424J30836a46993B86788C8800P4765g1244a6644c314j473p3369
$$ plain form
9235 -7779 -7877 10978 -293653 -69496 172633 85718 -223262 -76049 20367 53628 8363 15532
9223 15532 -388600 -401381 248469 -397761 -216264 -130781 -21260 -88646 -43046 -84462 -260692
9212 -260692 17671 -131644 -51303 86765 -367920 -306006 -299142 159481 -171366 23958 -26089
9200 -7851 -365379 -115010 -254414 59013 -317310 -209369 -222130 187340 -249394 -216251 -81460
9188 -360523 -115721 80148 62720 -188180 -239767 163401 -321821 -62697 -286297 -162837
9178 -162837 -13653 -274907 244655 23967 -172552 -193218 227453 -255351 -260341 -219398 115006
9166 -55750 -119173 -24956 102509 136570 -333380 -96634 -72431 -59226 22777 -31753 -28780 -130034
9154 -130034 54424 185260 -146993 286788 38800 113565 -71244 -16644 -3314 -4787 -78156
9143g8156q2727C3696F944b37415B40673d2265C07289j8878b64096i7878r4272
9132a92150A33379b02327A97952a68305j04744m950E5766h3223A3162e6170D2745
9120B51026A7359i7172E657O4838a47499A44403e9649A82888E3635a45257m8285
9109a93542f8479B63513a91540b8252r992k12472Q2154b7621k5303r4365K8842
9098a18447k8759A84585K3048c25421h3672B1576J28120a46776L8190B93226c26887
9086A07525O770a20933j05370D9239b02025B91617B2875a50010a7787j02563A73947
9074a16503a0219k61582A6777a42113B23314g8500k69190B4436b3596k27276P8925
9063a71947K4043j6587F3127i7010C34206b24640f1481b608j60826B3382B574
$$ plain form
9143 -78156 -160883 33696 6944 -237415 240673 -42265 307289 288411 -264096 -97878 -192150
9132 -192150 133379 -202327 197952 -168305 -273049 -277999 55766 -83223 13162 -56170 42745
9120 251026 17359 -97172 5657 70495 -147499 144403 -59649 182888 53635 -145257 -193542
9109 -193542 -68479 263513 -191540 -28252 -38244 -250716 -168562 -27621 -52924 -147289 -118447
9098 -118447 -147206 184585 207633 -325421 -83672 21576 149696 -146776 -108586 293226 -326887
9086 107525 114295 -120933 -226303 49239 -202025 291617 22875 -150010 -17787 -120350 173947
9074 -116503 -10219 -271801 16777 -142113 223314 -78500 -347690 24436 -23596 -250872 -171947
9063 -171947 -147904 -164491 63127 -97010 334206 -224640 -61481 -2608 -163434 23382 2574
9051A17525k570l692e6138j7951L22k9328F4971a33112A62543b4406D4735Q3279
9039A28014A6031g7456j3076d1864A66677b75350f2984j45584J3974B05225d8985
9027A21253h5350A00784M5535b18802l9698J11133b866A3391b4445k75583j65311
9016d65339D1131A6375c43994R5443D1590Q7642b61845P3355B72761c7340A2816
9004c31971A23272b17632K3276b6997B16119c23124h7804o5025O5965c4993M266
8993c0727l8775A3456c20800J41473A96529a03992j7628A39803a939j34907r7105
8982b33951c9172A36408a37255o189A86858k9159R4754A4462J0314g0096H9081
8970h3453B88600a68015k9268B34168H2782K5557c8336a1460A42031h9978A33303
$$ plain form
9051 117525 114955 111263 -56138 -74089 -73767 -103095 64971 -133112 162543 -24406 44735 128014
9039 128014 16031 -77456 -90532 -41864 166677 -275350 -62984 -208568 -194594 205225 -48985
9027 121253 -85350 100784 146319 -218802 -258500 -147367 -2866 13391 -24445 -300028 -465339
9016 -465339 41131 16375 -343994 -248551 41590 129232 -261845 -188490 272761 -37340 12816
9004 -331971 123272 -217632 -194356 -26997 216119 -323124 -87804 -152829 -86864 -34993 -30727
8993 -30727 -69502 13456 -320800 -179327 196529 -103992 -121620 139803 -1939 -136846 -233951
8982 -233951 -39172 136408 -137255 -143444 186858 157699 252453 14462 24776 -70096 89081
8970 -83453 288600 -168015 -197283 234168 82782 108339 -38336 -11460 142031 -89978 133303
8958f9602k03927p8200B59338a25831j06817N1267N3851B56346e1535k20986A18900
8946A67968C9320c6303G2121B5515a12497E4310c00879j2356A12368b46016j35094
8935c81110J55083I0855f6669k18036c0003A45042d11495a01103q5948b7931p5459
8924a03390A11416b23347d7702j30582A02535i4860n6702A68806a96897E0646
8913A9325J81053b86640A31972P9023K09160r2713M28466J49286P42152J343289
8903B990635J915845M367836D485410B125162r08080m93971k99421B02453o0220
8894A42233r36L51423B40392L7648B181L82456o7910j56291J45692o4426c0353
8882h1872A50713c63948C16088e4479m819K0698B8142P4180R0812b07605B23418
$$ plain form
8958 -69602 -273529 -351729 259338 -125831 -232648 -181381 -127530 256346 -51535 -272521 118900
8946 167968 39320 -36303 72121 25515 -112497 54310 -300879 -313235 112368 -246016 -381110
8935 -381110 -226027 90855 -66669 -284705 -30003 145042 -411495 -101103 -187051 -27931 -103390
8924 -103390 111416 -223347 -47702 -178284 102535 -94860 -151562 168806 -196897 50646
8913 19325 200378 -286640 131972 210995 420155 327442 755908 905194 1647346 2990635
8903 2990635 4906480 9274316 4485410 2125162 1217082 723111 423690 202453 142233
8894 142233 141297 492720 240392 278040 2181 384637 316727 160436 306128 241702 -30353
8882 -81872 150713 -363948 316088 -54479 -59298 -38600 28142 102322 193134 -207605 223418
8870c6650b509j91334b9171G6729a52733A31765a6260k42536A26148m2914J107
8859H4341a21421r0463K5607j06991A05744O0864P321j0099J48841b18106B60490
8847e3649l6475d3764A36795a67889P8182E0841g417j36968G1289h5931D2692
$$ plain form
8870 -36650 -2509 -193843 -29171 76729 -152733 131765 -16260 -258796 126148 83234 84341
8859 84341 -121421 -211884 -186277 -293268 105744 166608 173929 163830 312671 -218106 260490
8847 -53649 -90124 -43764 136795 -167889 -89707 50841 -7417 -144385 71289 -85931 42692
$$ [...]
##END NTUPLES=NMR SPECTRUM
##END=
