
##TITLE=AC1072_TOPL05_5819035_JyEpBJPI1D
##JCAMPDX= 6.0         $$ Bruker NMR JCAMP-DX V2.0
##DATA TYPE= NMR SPECTRUM
##DATA CLASS= NTUPLES
##ORIGIN= BRUKER
##OWNER= Administrator
$$ 1.72 TOPSPIN		Version 2.1
$$ 2012-03-24 22:27:40.546 -0500  Administrator@TOPSPIN
$$ Compression mode = diff/dup
##.OBSERVE FREQUENCY= 400.13188235
##.OBSERVE NUCLEUS= ^1H
##.ACQUISITION MODE= SIMULTANEOUS (DQD)
##.ACQUISITION SCHEME= undefined
##.AVERAGES= 64
##.DIGITISER RES= 22
##SPECTROMETER/DATA SYSTEM= spect
##.PULSE SEQUENCE= noesygpps1d.comp
##.SOLVENT NAME= COFFEE_meoh
##.SHIFT REFERENCE= INTERNAL, COFFEE_meoh, 1, 14.9689
##AUDIT TRAIL= $$ (NUMBER, WHEN, WHO, WHERE, PROCESS, VERSION, WHAT)
$$ ##TITLE= Audit trail, TOPSPIN		Version 2.1
$$ ##JCAMPDX= 5.01
$$ ##ORIGIN= Bruker BioSpin GmbH
$$ ##OWNER= Administrator
$$ $$ C:\Bruker\TOPSPIN/data/COFFEE/nmr/AC1072_TOPL05_5819035_JyEpBJPI1D/12/pdata/1/auditp.txt
$$ ##AUDIT TRAIL=  $$ (NUMBER, WHEN, WHO, WHERE, PROCESS, VERSION, WHAT)
(   1,<2012-03-24 22:27:35.171 -0500>,<Administrator>,<TOPSPIN>,<go>,<TOPSPIN 2.1>,
      <created by zg
	started at 2012-03-24 22:16:03.515 -0500,
	POWCHK enabled, PULCHK disabled,
       configuration hash MD5:
       1A 1E CE 29 27 FD 77 03 67 4E F0 E3 C4 B2 CB 90
       data hash MD5: 64K
       DA 99 37 AB BD EB E7 BB FB 40 FC 1E 65 D3 34 DB>)
(   2,<2012-03-24 22:27:38.062 -0500>,<Administrator>,<TOPSPIN>,<proc1d>,<TOPSPIN 2.1>,
      <Start of raw data processing
       efp LB = 0.3 FT_mod = 6 PKNL = 1 PHC0 = 0 PHC1 = 0 SI = 128K 
       data hash MD5: 128K
       4B 36 A4 C3 7F F3 50 C1 26 0D 4B 85 5F 66 6D 7B>)
(   3,<2012-03-24 22:27:39.671 -0500>,<Administrator>,<TOPSPIN>,<proc1d>,<TOPSPIN 2.1>,
      <pk PHC0 = 37.50732 PHC1 = 0 
       data hash MD5: 128K
       21 FB FB 7D 93 D7 EB E7 F2 BC C0 77 F6 E8 93 42>)
(   4,<2012-03-24 22:27:40.250 -0500>,<Administrator>,<TOPSPIN>,<proc1d>,<TOPSPIN 2.1>,
      <abs ABSG = 1 
       data hash MD5: 128K
       8B 56 F2 61 21 F3 D8 04 DD 20 94 B7 C8 C8 65 99>)
(   5,<2012-03-24 22:27:40.312 -0500>,<Administrator>,<TOPSPIN>,<proc1d>,<TOPSPIN 2.1>,
      <abs ABSG = 2 
       data hash MD5: 128K
       09 F2 90 CF 4B 5A 0B 44 29 13 0A D9 7D DF FA 29>)
(   6,<2012-03-24 22:27:40.375 -0500>,<Administrator>,<TOPSPIN>,<proc1d>,<TOPSPIN 2.1>,
      <abs ABSG = 3 
       data hash MD5: 128K
       E9 3B AD 5E 40 F0 67 AA 91 32 86 E9 87 3B A8 46>)
(   7,<2012-03-24 22:27:40.421 -0500>,<Administrator>,<TOPSPIN>,<proc1d>,<TOPSPIN 2.1>,
      <abs ABSG = 4 
       data hash MD5: 128K
       73 F5 6E 1A BD 22 61 C2 55 9A 81 5E 1B 74 20 57>)
(   8,<2012-03-24 22:27:40.468 -0500>,<Administrator>,<TOPSPIN>,<proc1d>,<TOPSPIN 2.1>,
      <abs ABSG = 5 
       data hash MD5: 128K
       F6 5D E9 A4 6F 57 12 4E E9 AC 9F 33 4A 2F 6B D0>)
$$ ##END=
$$ 
$$ $$ hash MD5
$$ $$ 98 81 80 7A 67 94 74 79 46 3D 05 66 D8 4A 1A 6A
##$RELAX= 
##$RELAX= 
##$RELAX= 
##$RELAX= 
##$RELAX= 
##$RELAX= 
##$RELAX= 
##$RELAX= 
$$ Bruker specific parameters
$$ [...]
##$TP07= 0
##$TPNAME0= <>
##$TPNAME1= <>
##$TPNAME2= <>
##$TPNAME3= <>
##$TPNAME4= <>
##$TPNAME5= <>
##$TPNAME6= <>
##$TPNAME7= <>
##$TPOAL= (0..7)
0.5 0.5 0.5 0.5 0.5 0.5 0.5 0.5
##$TPOFFS= (0..7)
0 0 0 0 0 0 0 0
##$TUNHIN= 0
##$TUNHOUT= 0
##$TUNXOUT= 0
##$USERA1= <user>
##$USERA2= <user>
##$USERA3= <user>
##$USERA4= <user>
##$USERA5= <user>
##$V9= 5
##$VALIST= <valist>
##$VCLIST= <CCCCCCCCCCCCCCC>
##$VD= 0
##$VDLIST= <DDDDDDDDDDDDDDD>
##$VPLIST= <PPPPPPPPPPPPPPP>
##$VTLIST= <TTTTTTTTTTTTTTT>
##$WBST= 2048
##$WBSW= 25
##$XGAIN= (0..3)
0 0 0 0
##$XL= 0
##$YL= 0
##$YMAX_a= 16960138
##$YMIN_a= -7369358
##$ZGOPTNS= <>
##$ZL1= 120
##$ZL2= 120
##$ZL3= 120
##$ZL4= 120
##$ABSF1= 14.9689
##$ABSF2= -5.583631
##$ABSG= 5
##$ABSL= 3
##$ALPHA= 0
##$AQORDER= 0
##$ASSFAC= 0
##$ASSFACI= 0
##$ASSFACX= 0
##$ASSWID= 0
##$AUNMP= <proc_prof1d_extract.lims>
##$AXLEFT= 0
##$AXNAME= <>
##$AXNUC= <1H>
##$AXRIGHT= 0
##$AXTYPE= 0
##$AXUNIT= <>
##$AZFE= 0.1
##$AZFW= 0.1
##$BCFW= 0
##$BC_mod= 0
##$BYTORDP= 0
##$COROFFS= 0
##$CY= 15
##$DATMOD= 1
##$DC= 0
##$DFILT= <>
##$DTYPP= 0
##$F1P= 0
##$F2P= 0
##$FCOR= 0.5
##$FTSIZE= 131072
##$FT_mod= 6
##$GAMMA= 0
##$GB= 0
##$INTBC= 1
##$INTSCL= 1
##$ISEN= 128
##$LB= 0.3
##$LEV0= 0
##$LPBIN= 0
##$MAXI= 10000
##$MC2= 0
##$MEAN= 0
##$ME_mod= 0
##$MI= 0
##$NCOEF= 0
##$NC_proc= -3
##$NLEV= 6
##$NOISF1= 0
##$NOISF2= 0
##$NSP= 0
##$NTH_PI= 0
##$NZP= 0
##$OFFSET= 14.9689
##$PC= 1
##$PHC0= 37.50732
##$PHC1= 0
##$PH_mod= 1
##$PKNL= yes
##$PPARMOD= 0
##$PPDIAG= 0
##$PPIPTYP= 0
##$PPMPNUM= 2147483647
##$PPRESOL= 1
##$PSCAL= 4
##$PSIGN= 0
##$PYNMP= <proc.py>
##$REVERSE= no
##$SF= 400.130004687614
##$SI= 131072
##$SIGF1= 0
##$SIGF2= 0
##$SINO= 400
##$SIOLD= 131072
##$SPECTYP= <>
##$SREGLST= <1H.CDCl3>
##$SSB= 0
##$STSI= 131072
##$STSR= 0
##$SW_p= 8223.68421052632
##$SYMM= 0
##$S_DEV= 0
##$TDeff= 65536
##$TDoff= 0
##$TI= <>
##$TILT= no
##$TM1= 0
##$TM2= 0
##$TOPLEV= 0
##$USERP1= <user>
##$USERP2= <user>
##$USERP3= <user>
##$USERP4= <user>
##$USERP5= <user>
##$WDW= 1
##$XDIM= 131072
##$YMAX_p= 540572964
##$YMIN_p= -154704083
##$CURPLOT= <Network HP LaserJet P1505>
##$CURPRIN= <$Network HP LaserJet P1505>
##$DFORMAT= <normdp>
##$LAYOUT= <+/1D_H.xwp>
##$LFORMAT= <normlp>
##$PFORMAT= <normpl>
##$SURQMSG= 1
$$ End of Bruker specific parameters
$$ ---------------------------------
##NTUPLES= NMR SPECTRUM
##VAR_NAME=  FREQUENCY,     SPECTRUM/REAL,   SPECTRUM/IMAG
##SYMBOL=    X,             R,               I
##VAR_TYPE=  INDEPENDENT,   DEPENDENT,       DEPENDENT
##VAR_FORM=  AFFN,          ASDF,            ASDF
##VAR_DIM=   131072,        131072,          131072
##UNITS=     HZ,            ARBITRARY UNITS, ARBITRARY UNITS
##FACTOR=    0.0627417313425165, 1,          1
##FIRST=     8223.62146879498, -1925,        -132582
##LAST=      0,             -1648,           -133965
##MIN=       0,             -154704083,      0
##MAX=       8223.62146879498, 540572964,    0
$$ Real data points
##PAGE= N=1
##DATA TABLE= (X++(R..R)), XYDATA
$$ [...]
62841A094208l669m817m815l703k958l042k895j879q40p18j262j814k483l731
62827A055582n281o371o703o513n910m907l858l174k710k008j117n77o38j005
62813A004810j285j197n18O03J418J313O93M89Q33R63M81j03k39p0j7k40o53j091
62795A006190j299j265j467k238k924k537j134K05P77O72j13j734l488m145l792
62780I81708l922m963n268l708j828j743k920l058j673o56j223k305k679k890
62766I42872l933n285n664n069m693m926m762l446j756j039j472j960j516j29
62752H97222J636L214M079L907L157L011M252O487Q868J1017J2773J3678J3712
62739I87013J4002J5626J7949J9482K0326K2141K5411K8415K9734L0301L1830
$$ plain form
62841 1094208 1090539 1085722 1080907 1077204 1074246 1071204 1068309 1066430 1065590 1064872 1063610 1061796 1059313 1055582
62827 1055582 1050301 1043930 1037227 1030714 1024804 1019897 1016039 1012865 1010155 1008147 1007030 1006453 1005815 1004810
62813 1004810 1003525 1002328 1001810 1002413 1003831 1005144 1005837 1006326 1007159 1008122 1008603 1008500 1008261 1008191 1008174 1007934 1007281 1006190
62795 1006190 1004891 1003626 1002159 999921 996997 994460 993326 993531 994308 994980 994867 993133 989645 985500 981708
62780 981708 977786 972823 967555 963847 962019 960276 957356 954298 952625 951969 950746 948441 945762 942872
62766 942872 938939 933654 927990 922921 918228 913302 908540 905094 903338 902299 900827 898867 897351 897222
62752 897222 898858 902072 906151 910058 913215 916226 920478 926965 935833 946850 959623 973301 987013
62739 987013 1001015 1016641 1034590 1054072 1074398 1096539 1121950 1150365 1180099 1210400 1242230
62728A242230L4533L7687M1382M6072N0975N4665N7091N9709O3647O8892P5054
62717A831937Q1685Q7869R2824R7097J01989J07561J12330J15131J16203J16058
62707B860684J14484J11141J05938R8134Q6287P0235N2201L4658J7669l21j9477
62696C531633l7993n4612p0033q4966r8053j07131j12065j14937j17391j18967
62686B615485j18411j15695j11893j07610j02455r6021q8743q1626p5537p0760
62676A646734o6883o3079n8767n4010m9150m4323l9750l6026l3420l1102k7917
62665A142307k3961k0516j8275j6575j4605j2382j0027p105l486m0K442M449O897
62652A029123R575J1587J3029J5042J8106K1346K3919K6271K9460L3693L8077
$$ plain form
62728 1242230 1276763 1314450 1355832 1401904 1452879 1507544 1564635 1624344 1687991 1756883 1831937
62717 1831937 1913622 2001491 2094315 2191412 2293401 2400962 2513292 2628423 2744626 2860684
62707 2860684 2975168 3086309 3192247 3290381 3376668 3446903 3499104 3533762 3551431 3551110 3531633
62696 3531633 3493640 3439028 3368995 3284029 3185976 3078845 2966780 2851843 2734452 2615485
62686 2615485 2497074 2381379 2269486 2161876 2059421 1963400 1874657 1793031 1717494 1646734
62676 1646734 1579851 1516772 1458005 1403995 1354845 1310522 1270772 1234746 1201326 1170224 1142307
62665 1142307 1118346 1097830 1079555 1062980 1048375 1035993 1025966 1018861 1015375 1015335 1017777 1022226 1029123
62652 1029123 1038698 1050285 1063314 1078356 1096462 1117808 1141727 1167998 1197458 1231151 1269228
62641A269228M1698M4646M7920N2439N8172O4311P0260P6130Q2179Q8076R2989
62630A988048R6237R7674R7720R7138R6280R4269Q9306Q0366O8318N5064M1759
62619B902179K8218J3598k752k0681l8848n5150o8285p8709q7625r5242j00694
62608B396009j03431j03843j02500r9553r5172r0057q5061q0522p6097p1133o5345
62597A423295n9340n4335n0972m8532m5770m2369l9003l6067l3132k9963k7315
62586I56497k6018k5601k4569k2171j9443j8061j8339j8883j8190j6271j4345
62575G34606j3359j3194j3152j2658j1460r600p414n326l600k445k093k387k585
62562F35333k104j216m53L03J327K096K014J893L201N690P332P217O909Q113J0324
$$ plain form
62641 1269228 1310926 1355572 1403492 1455931 1514103 1578414 1648674 1724804 1806983 1895059 1988048
62630 1988048 2084285 2181959 2279679 2376817 2473097 2567366 2656672 2737038 2805356 2860420 2902179
62619 2902179 2930397 2943995 2941243 2920562 2881714 2826564 2758279 2679570 2591945 2496703 2396009
62608 2396009 2292578 2188735 2086235 1986682 1891510 1801453 1716392 1635870 1559773 1488640 1423295
62597 1423295 1363955 1309620 1258648 1210116 1164346 1121977 1082974 1046907 1013775 983812 956497
62586 956497 930479 904878 880309 858138 838695 820634 802295 783412 765222 748951 734606
62575 734606 721247 708053 694901 682243 670783 661183 653769 648443 644843 642398 640305 637918 635333
62562 635333 633229 632013 631560 631863 633190 635286 637300 639193 642394 648084 655416 662633 669542 677655 687979
62547F87979J2000J2821J3538J4513J5722J7457J9720K1644K2797K4363K7557
62536H90111L1450L3985L5021L6595M0077M4573M8541N1728N4855N8246O1399
62525A386581O3501O3996O2874O0446N6812N1773M5358L7761K8611J7337M810
62514A879860o639j5792k3953l2443m0020m4619m6702m8615n1067n2649n2775
62503A464586n2644n2738n1646m8338m3867l9849l6763l4591l3595l3356l2350
62492A004849k9793k6854k5039k4257k3521k2569k1547j9920j7117j3882j1694
62481G68656j0921j0547r666q394p321o668o093m850k293J212M027M568L161K089
62467G16960L405O839J0189J1819J2235J2896J4044J4733J4975J6378J9901K4068
$$ plain form
62547 687979 699979 712800 726338 740851 756573 774030 793750 815394 838191 862554 890111
62536 890111 921561 955546 990567 1027162 1067239 1111812 1160353 1212081 1266936 1325182 1386581
62525 1386581 1450082 1514078 1576952 1637398 1694210 1745983 1791341 1829102 1857713 1875050 1879860
62514 1879860 1873221 1857429 1833476 1801033 1761013 1716394 1669692 1621077 1570010 1517361 1464586
62503 1464586 1411942 1359204 1307558 1259220 1215353 1175504 1138741 1104150 1070555 1037199 1004849
62492 1004849 975056 948202 923163 898906 875385 852816 831269 811349 794232 780350 768656
62481 768656 757735 747188 737522 729128 721807 715139 709046 704196 701903 703115 707142 711710 714871 716960
62467 716960 720365 727204 737393 749212 761447 774343 788387 803120 818095 834473 854374 878442
62455H78442K6754K8071L0072L3815L8168M1619M4024M6249M8971N2122N4860
62444A323167N6077N5426N3738N1825M9339M5402L9767L2382K2796J1415M84q068
62432A733750j5134k2868l1095l7593m1696m4876m7612m8535m7412m6086m5279
62421A305564m3233l9109l5092l3043l1377k7773k3133k0165j9202j8110j5670
62410I99657j2638r920p778o550o251n760m148k355j827j950p79J985M735O471
62396I52892P604Q268P939P101P329R098J0987J1672J1282J0347Q819O875N351
62383A065564M500L226L57l928q509j2535j5732j8129j9888k1034k1234k0351
62371I32307j9133j8569j8570j8142j6860j5227j3498j1289q686o510n020l335
$$ plain form
62455 878442 905196 933267 963339 997154 1035322 1076941 1120965 1167214 1216185 1268307 1323167
62444 1323167 1379244 1434670 1488408 1540233 1589572 1634974 1674741 1707123 1729919 1741334 1741818 1733750
62432 1733750 1718616 1695748 1664653 1627060 1585364 1540488 1492876 1444341 1396929 1350843 1305564
62421 1305564 1262331 1223222 1188130 1155087 1123710 1095937 1072804 1052639 1033437 1015327 999657
62410 999657 987019 977099 969321 962771 956520 950760 946612 944257 942430 940480 939701 941686 946421 952892
62396 952892 960496 968764 976703 983804 991133 1000231 1011218 1022890 1034172 1044519 1053338 1060213 1065564
62383 1065564 1070064 1073290 1073647 1069719 1061210 1048675 1032943 1014814 994926 973892 952658 932307
62371 932307 913174 894605 876035 857893 841033 825806 812308 801019 792333 785823 780803 777468
62359G77468q69J621L180M096N296O861Q078Q634Q939R402J0071J1004J2351J3969
62345H80101J5244J5411J4026J1399Q683P142O852O403M420J295j123j690j247
62332I66916j439k737m188m941n200n413n208l863j526P23K079K771L565N008
62318I46547P286J0333J3899J7762K1837K5822K9123L1763L5053M0251M6577N1661
62306A277914N4362N5988N8350O1733O5353O8524P0475P0194O7631O4252O1159
62295A975935N7468N1749M4265L6272K7772J7769O595l862j2587k0401k8037l4563
62283B118375l8690m0792m2732m5917m9943n3023n3643n2077n0041m8563m6750
62272A596204m3380l9160l6137l5023l4367l2646l0024k7586k5821k4464k3054
$$ plain form
62359 777468 776599 778220 781400 785496 790792 797653 805731 814365 823304 832706 842777 853781 866132 880101
62345 880101 895345 910756 924782 936181 944864 952006 958858 965261 969681 970976 969853 968163 966916
62332 966916 965477 962740 958552 953611 948411 942998 937790 933927 932401 933124 935203 937974 941539 946547
62318 946547 953833 964166 978065 995827 1017664 1043486 1072609 1104372 1139425 1179676 1226253 1277914
62306 1277914 1332276 1388264 1446614 1508347 1573700 1642224 1712699 1782893 1850524 1914776 1975935
62295 1975935 2033403 2085152 2129417 2165689 2193461 2211230 2217825 2213963 2201376 2180975 2152938 2118375
62283 2118375 2079685 2038893 1996161 1950244 1900301 1847278 1793635 1741558 1691517 1642954 1596204
62272 1596204 1552824 1513664 1477527 1442504 1408137 1375491 1345467 1317881 1292060 1267596 1244542
62261A244542k1136j8408j5154j2183j0067q754p952p448p016o580o463o871p276
62248A109234p037o615p170q880j0581j1322j1223j0595r248p343n867n410n203
62235A002740m168k277j59K047M501O742Q025Q498R158J0474J1692J1818J0958
62222A080049J0406J1359J3517J5191J5053J3762J3317J4862J7761K0912K3956
62211A250145K6680K8328K8650K9005L1111L4787L8167M0354M2603M6368N1167
62200A647365N5456N8933O2815O7784P2597P5175P4502P1032O5533N8123M8409
62189B357724L6368K2811R104l603j4895k4896l3709m1204m7248n1863n5118n7183
62177B096288n8445n9120n8660n6126n1522m6200m1505l7580l4033l1027k8667
$$ plain form
62261 1244542 1223406 1204998 1189844 1177661 1167594 1158840 1150888 1143440 1136424 1129844 1123381 1116510 1109234
62248 1109234 1102197 1095582 1088412 1079532 1068951 1057629 1046406 1035811 1026563 1019220 1013353 1007943 1002740
62235 1002740 998572 996295 996136 998183 1002684 1009426 1017451 1025949 1035107 1045581 1057273 1069091 1080049
62222 1080049 1090455 1101814 1115331 1130522 1145575 1159337 1172654 1187516 1205277 1226189 1250145
62211 1250145 1276825 1305153 1333803 1362808 1393919 1428706 1466873 1507227 1549830 1596198 1647365
62200 1647365 1702821 1761754 1824569 1892353 1964950 2040125 2114627 2185659 2251192 2309315 2357724
62189 2357724 2394092 2416903 2426007 2422404 2407509 2382613 2348904 2307700 2260452 2208589 2153471 2096288
62177 2096288 2037843 1978723 1920063 1863937 1812415 1766215 1724710 1687130 1653097 1622070 1593403
62166A593403k5934k1682j6665j3129j2134j2407j2218j1133r489p421n325m231
62154A441635m609n443n319l918j731R24L716N917P185Q336J0388J3160J5604
62141A485845J7122J7874J8396J9609K2567K7170L1649L4319L5364L6067L7098
62130A783080L8653M1383M5426M8990M9678M7244M3555L9831L5649L0798K6358
62119B230645K3189K0704J7950J4902J2050R653Q100Q261J0699J4928J9833K4404
62107B415318K8039L0754L3184L5674L7267L6510L3268K8775K3724J7640J0669
62096B730822M678J391J12j582n194j0084j4582j7539j8758j8724j8323j8412
62084B613805j9093j9287j7464j3376q785n780m431l095j122K51M39J202M263
$$ plain form
62166 1593403 1567469 1545787 1529122 1515993 1503859 1491452 1479234 1468101 1458612 1451191 1445866 1441635
62154 1441635 1437026 1431583 1426264 1422346 1420615 1421539 1425255 1431172 1438357 1446693 1457081 1470241 1485845
62141 1485845 1502967 1520841 1539237 1558846 1581413 1608583 1640232 1674551 1709915 1745982 1783080
62130 1783080 1821733 1863116 1908542 1957532 2007210 2054454 2098009 2137840 2173489 2204287 2230645
62119 2230645 2253834 2274538 2292488 2307390 2319440 2329093 2337193 2345454 2356153 2371081 2390914 2415318
62107 2415318 2443357 2474111 2507295 2542969 2580236 2616746 2650014 2678789 2702513 2720153 2730822
62096 2730822 2735500 2736891 2737003 2735421 2730227 2720143 2705561 2688022 2669264 2650540 2632217 2613805
62084 2613805 2594712 2575425 2557961 2544585 2535800 2530020 2525589 2522494 2521372 2521623 2522062 2523264 2527527
62071B527527Q426J1163J2394J4427J8299K2388K5000K6396K7664K9330L1787
62060B754801L5522M0028M3762M5874M7039M8135M9382N1115N3813N6733N8081
62049C284285N7500N6922N7968N9885O1275O2426O4459O7167O9333P0718P2366
62038C984304P5143P8774Q2052Q3615Q3249Q2870Q5111R0236R5598R8883J00485
62027D940320J01581J01542R9168R5433R2893R2699R3953R5640R7342R8152R6767
62016F005490R3147Q8784Q4984Q1915P9552P8317P8404P9346Q0687Q2298Q3707
62005F916631Q3874Q2133P8973P5585P2798P0508O7926O4367N9977N5498N1301
61994G679571M7177M3205M0032L7658L4656K9552K2632J5650R998N815K483p36
$$ plain form
62071 2527527 2535953 2547116 2559510 2573937 2592236 2614624 2639624 2666020 2693684 2723014 2754801
62060 2754801 2790323 2830351 2874113 2919987 2967026 3015161 3064543 3115658 3169471 3226204 3284285
62049 3284285 3341785 3398707 3456675 3516560 3577835 3640261 3704720 3771887 3841220 3911938 3984304
62038 3984304 4059447 4138221 4220273 4303888 4387137 4470007 4555118 4645354 4740952 4839835 4940320
62027 4940320 5041901 5143443 5242611 5338044 5430937 5523636 5617589 5713229 5810571 5908723 6005490
62016 6005490 6098637 6187421 6272405 6354320 6433872 6512189 6590593 6669939 6750626 6832924 6916631
62005 6916631 7000505 7082638 7161611 7237196 7309994 7380502 7448428 7512795 7572772 7628270 7679571
61994 7679571 7726748 7769953 7809985 7847643 7882299 7911851 7934483 7950133 7960131 7965946 7968429 7967693
61982G967693m213p458r486j0252j1151j3290j5901j7440j7654j7460j7295j6980
61970G809113j6927j8043k0240k2337k3560k4125k4171k3325k1685k0052j8736
61959G575912j7043j4506j1820r753p787m612K41N779J0595J4192J7314K1002
61947G579514K5463K9984L3974L7613M1085M3683M4209M2144L7929L2230K5322
61936G973150J6986O698n660j8902l1034m1230n0664o0451o9542p5918p9404q1723
61924G482306q3865q5077q4830q4145q4152q4464q3960q2422q0502p8624p6777
61913F573488p5114p3905p2834p1026o7974o4280o1106n8870n6624n3195m8931
61902E869629m5481m3416m0956l6163k9761k4343k1002j8340j5011j1397p949
$$ plain form
61982 7967693 7963480 7956022 7946536 7936284 7925133 7911843 7895942 7878502 7860848 7843388 7826093 7809113
61970 7809113 7792186 7774143 7753903 7731566 7708006 7683881 7659710 7636385 7614700 7594648 7575912
61959 7575912 7558869 7544363 7532543 7522790 7515003 7510391 7510632 7516411 7527006 7541198 7558512 7579514
61947 7579514 7604977 7634961 7668935 7706548 7747633 7791316 7835525 7877669 7915598 7947828 7973150
61936 7973150 7990136 7996834 7991174 7972272 7941238 7900008 7849344 7788893 7719351 7643433 7564029 7482306
61924 7482306 7398441 7313364 7228534 7144389 7060237 6975773 6891813 6809391 6728889 6650265 6573488
61913 6573488 6498374 6424469 6351635 6280609 6212635 6148355 6087249 6028379 5971755 5918560 5869629
61902 5869629 5824148 5780732 5739776 5703613 5673852 5649509 5628507 5610167 5595156 5583759 5575810
61891E575810l474L436J2083K0263K6772L2131L7104M1794M6224N0622N4717N7743
61879E955225N9625O1459O4275O7753P0739P2601P3517P3718P3199P2366P2365
61868F716842P4345P8450Q3740Q9132R4468J00778J09474J21239J35938J53760
61858G758166J75824K02812K33268K64669K96482L30921L69792M11876M54750
61849A0498560M98150N43648N91603O40687O90448P41957P94948Q46163Q91297
61840A6737461R26647R47175R44483R08590Q31208P06837N33465L16033O9553
61831B2921452j83801m22485o31130q00737r27146j010662j055481j067696j053590
61822A5768724j019351r70804r12533q47847p79977p12543o48473n89057n34327
$$ plain form
61891 5575810 5572336 5575772 5587855 5608118 5634890 5667021 5704125 5745919 5792143 5842765 5897482 5955225
61879 5955225 6014850 6076309 6140584 6208337 6279076 6351677 6425194 6498912 6572111 6644477 6716842
61868 6716842 6791187 6869637 6953377 7042509 7136977 7237755 7347229 7468468 7604406 7758166
61858 7758166 7933990 8136802 8370070 8634739 8931221 9262142 9631934 10043810 10498560
61849 10498560 10996710 11540358 12131961 12772648 13463096 14205053 15000001 15846164 16737461
61840 16737461 17664108 18611283 19555766 20464356 21295564 22002401 22535866 22851899 22921452
61831 22921452 22737651 22315166 21684036 20883299 19956153 18945491 17890010 16822314 15768724
61822 15768724 14749373 13778569 12866036 12018189 11238212 10525669 9877196 9288139 8753812
61813H753812m83843m37007l93542l53918l18681k87206k57790k29215k01588
61804E791022j75698j52338j32152j14973r9020q1994o3548m5733l0480j7550
61794D877536n781M761J2982J8625K2815K6682L0112L1824L0325K5065J7108Q468
61782E100522M89o918j4147k0544k4738k6004k4662k1257j6044r336j863N482
61770D940980J1877J6428J8101J6284J1439M796k760j1187k0450k9575l7206m2969
61758D875758m7475n0884n2329n1074m7281m1158l2437k1561j0346o6J0424K3142
61746D554713L7976N2848O6722Q0661R5615J10869J25439J39652J54425J70005
61736E588925J86265K03483K22053K42098K64020K88572L15783L44612L74596
$$ plain form
61813 8753812 8269969 7832962 7439420 7085502 6766821 6479615 6221825 5992610 5791022
61804 5791022 5615324 5462986 5330834 5215861 5116841 5034847 4971299 4925566 4895086 4877536
61794 4877536 4871755 4876516 4889498 4908123 4930938 4957620 4987732 5019556 5049881 5074946 5092054 5100522
61782 5100522 5101011 5094093 5079946 5059402 5034664 5008660 4983998 4962741 4946697 4937361 4935498 4940980
61770 4940980 4952857 4969285 4987386 5003670 5015109 5019905 5017145 5005958 4985508 4955933 4918727 4875758
61758 4875758 4828283 4777399 4725070 4673996 4626715 4585557 4553120 4531559 4521213 4521147 4531571 4554713
61746 4554713 4592689 4645537 4712259 4792920 4888535 4999404 5124843 5264495 5418920 5588925
61736 5588925 5775190 5978673 6200726 6442824 6706844 6995416 7311199 7655811 8030407
61727H030407M07184M44488M87146N34232N85072O40280P01262P69272Q44849
61718A3444192R27503J015988J109095J206057J306016J407487J508330J605300
61710B3529968J692788J762157J802231J799532J737835J599906J373428J057937
61702C6355782O67635K28801k25296o59963j044971j359733j595228j752154j837651
61693B8777222j862632j839546j780256j694873j592126j479909j364766j251083
61685A5912031j141355j037370r40699q52091p71246o97786o32124n74565n23708
61676H741087m76763m32107l90700l54270l22618k93824k66734k41977k20434
61667E741660k01977j86171j72982j62146j52742j44355j37763j33468j30231
$$ plain form
61727 8030407 8437591 8882079 9369225 9903457 10488529 11128809 11830071 12599343 13444192
61718 13444192 14371695 15387683 16496778 17702835 19008851 20416338 21924668 23529968
61710 23529968 25222756 26984913 28787144 30586676 32324511 33924417 35297845 36355782
61702 36355782 37023417 37252218 37026922 36366959 35321988 33962255 32367027 30614873 28777222
61693 28777222 26914590 25075044 23294788 21599915 20007789 18527880 17163114 15912031
61685 15912031 14770676 13733306 12792607 11940516 11169270 10471484 9839360 9264795 8741087
61676 8741087 8264324 7832217 7441517 7087247 6764629 6470805 6204071 5962094 5741660
61667 5741660 5539683 5353512 5180530 5018384 4865642 4721287 4583524 4450056 4319825
61658D319825j26199j21031j15684j10424j04516r7955r2008q7396q3186p8272
61648C303154p3030o8546o4982o1781n9028n7283n6099n4035n0512m6820m4686
61637B666352m4502m5347m6162m6208m4971m2362l8922l5393l2355l0403k9931
61626B229796l0073k8797k5235k1310j9624k0078k0166j8429j5809j3465j1354
61615B005456r639r302j0118r899p401m434l225l213k565j676k376m382n412m932
61601A926882m984o614p984p194n064l685l676m124m177l509k056k52J088J757
61587A876408K317K929L050K779L174M504N479N154M419M442M836M835N371Q170
61573A937867J3048J7675K0254K1258K2225K3621K4383K3106J9407J4189Q650
$$ plain form
61658 4319825 4193626 4072595 3956911 3846487 3741971 3644016 3552008 3464612 3381426 3303154
61648 3303154 3230124 3161578 3096596 3034815 2975787 2918504 2862405 2808370 2757858 2711038 2666352
61637 2666352 2621850 2576503 2530341 2484133 2439162 2396800 2357878 2322485 2290130 2259727 2229796
61626 2229796 2199723 2170926 2145691 2124381 2104757 2084679 2064513 2046084 2030275 2016810 2005456
61615 2005456 1995817 1986515 1976397 1966498 1959097 1954663 1951438 1948225 1945660 1943984 1941608 1937226 1931814 1926882
61601 1926882 1921898 1915284 1907300 1900106 1895042 1891357 1887681 1883557 1879380 1875871 1873815 1873563 1874651 1876408
61587 1876408 1878725 1881654 1884704 1887483 1890657 1895161 1900640 1905794 1910213 1914655 1919491 1924326 1929697 1937867
61573 1937867 1950915 1968590 1988844 2010102 2032327 2055948 2080331 2103437 2122844 2137033 2145683
61562B145683L239k135p149j1167j4258j7178k0122k2397k3635k4255k4396k3621
61550A958609k2345k2083k3247k3996k2708k0570k0026k1267k2038k0710j7932
61539A721687j5108j2860j1344j0787j0963j0853r510p021m365k520j665j029
61527A623662M33K874N450P543R596J2280J5388J8337K1262K4707K8411L1348
61515A801291L3002L3970L5302L7723M1276M5261M8621N0883N2480N3875N4942
61504B288626N5577N6122N6464N5588N3093N0332M8692M7411M4653M0501L6948
61493B834007L4915L3220L1071K9692L0150L0883K9027K3706J6700R974L764k624
61481C104485r090j4565j8319k0774k2776k4383k4869k3809k1581j8730j5395
$$ plain form
61562 2145683 2148922 2146787 2139638 2128471 2114213 2097035 2076913 2054516 2030881 2006626 1982230 1958609
61550 1958609 1936264 1914181 1890934 1866938 1844230 1823660 1803634 1782367 1760329 1739619 1721687
61539 1721687 1706579 1693719 1682375 1671588 1660625 1649772 1640262 1633241 1628876 1626356 1624691 1623662
61527 1623662 1624095 1626969 1632419 1639962 1649558 1661838 1677226 1695563 1716825 1741532 1769943 1801291
61515 1801291 1834293 1868263 1903565 1941288 1982564 2027825 2076446 2127329 2179809 2233684 2288626
61504 2288626 2344203 2400325 2456789 2512377 2565470 2615802 2664494 2711905 2756558 2797059 2834007
61493 2834007 2868922 2902142 2933213 2962905 2993055 3023938 3052965 3076671 3093371 3103345 3107109 3104485
61481 3104485 3095395 3080830 3062511 3041737 3018961 2994578 2969709 2945900 2924319 2905589 2890194
61470B890194j1667p804l671J316P068J2360J6412K0356K6073L3896M2661N1584
61458C078778O0885P0591Q0273R0266J01732J14918J28515J41487J54702J69895
61448D192042J87691K07322K27845K48828K70091K91276L11598L29975L45695
61439F612363L58864L69295L74671L70827L54575L25697K85608K35221J75392
61430I462513J08990M0926k4278q4057j36894j81019k14874k38302k52539k59115
61420H221351k59170k53569k43033k28196k10042j90231j70352j50701j30415
61411F385642j09205q8302o9027n1052l3073j4973J844J6414K9350M1574N2937
61400F162129O2823P1314P8710Q4444Q7575Q8225Q7703Q7114Q6421Q4978Q2539
$$ plain form
61470 2890194 2878527 2870723 2867052 2868368 2875436 2887796 2904208 2924564 2950637 2984533 3027194 3078778
61458 3078778 3139663 3210254 3290527 3380793 3482525 3597443 3725958 3867445 4022147 4192042
61448 4192042 4379733 4587055 4814900 5063728 5333819 5625095 5936693 6266668 6612363
61439 6612363 6971227 7340522 7715193 8086020 8440595 8766292 9051900 9287121 9462513
61430 9462513 9571503 9612429 9588151 9504094 9367200 9186181 8971307 8733005 8480466 8221351
61420 8221351 7962181 7708612 7465579 7237383 7027341 6837110 6666758 6516057 6385642
61411 6385642 6276437 6188135 6119108 6068056 6034983 6020010 6021854 6038268 6067618 6109192 6162129
61400 6162129 6224952 6296266 6374976 6459420 6546995 6635220 6722923 6810037 6896458 6981436 7063975
61389G063975P9711P7639P7115P7935P9418Q1472Q4251Q6609Q6355Q3000P8892
61378G956372P6187P3691O8675O1097N3642M7542M0790L1256J9311O329p489k2120
61366H405283l6035m7444n6367o3861o9790p3028p3400p1826o8689o3681n7299
61355G723863n0896m4964l8659l1490k4182j7350j0633l905J743N251O942P661
61343G523381P282N392K799R91K08o14j776j917N41O145J4855K6608M0735N5943
61329G680573P1883R0027J11985J37431J64618J92368K20503K48793K76738L04190
61319I499109L30889L55379L75493L89987L98470L99668L91047L70544L37533
61310A2848119K91960K34318J67332R6170K5693m1727j04943j62128k11707k54135
$$ plain form
61389 7063975 7143686 7221325 7298440 7376375 7455793 7537265 7621516 7708125 7794480 7877480 7956372
61378 7956372 8032559 8106250 8174925 8236022 8289664 8337206 8377996 8409252 8428563 8434892 8427403 8405283
61366 8405283 8369248 8321804 8265437 8201576 8131786 8058758 7985358 7913532 7844843 7781162 7723863
61355 7723863 7672967 7628003 7589344 7557854 7533672 7516322 7505689 7501784 7503527 7508778 7515720 7523381
61343 7523381 7530663 7536055 7538854 7539845 7540053 7539439 7537663 7535746 7536287 7542432 7557287 7583895 7624630 7680573
61329 7680573 7752456 7842483 7954468 8091899 8256517 8448885 8669388 8918181 9194919 9499109
61319 9499109 9829998 10185377 10560870 10950857 11349327 11748995 12140042 12510586 12848119
61310 12848119 13140079 13374397 13541729 13637899 13663592 13621865 13516922 13354794 13143087 12888952
61300A2888952k90951l22385l47431l65760l77962l84031l83402l76740l66321
61291I673969l54172l40930l26672l11665k95863k78729k60027k39981k18515
61282G047415j95537j72391j51636j34388j18753j01915q3188o4141m6269k9707
61272E949490j4143R4J2347K2564L1419L9484M6445N1514N4675N7126N9836O1995
61260F372846O1748N8537N3767M8923M4106L9156L5085L3032L2183L0181K5916
61249F835480K0826J6808J3566Q877J205q677j8672k7208l3891l9132m3889m9485
61237F675808n6705o4688p1487p6063p9307q2497q5257q5884q3605p9625p5581
61226E835109p1680o6899o0689n3673m6612l9345l1427k3499j7119j2832r275
$$ plain form
61300 12888952 12598001 12275616 11928185 11562425 11184463 10800432 10417030 10040290 9673969
61291 9673969 9319797 8978867 8652195 8340530 8044667 7765938 7505911 7265930 7047415
61282 7047415 6851878 6679487 6527851 6393463 6274710 6172795 6089607 6025466 5979197 5949490
61272 5949490 5935347 5935441 5947788 5970352 6001771 6041255 6087700 6139214 6193889 6251015 6310851 6372846
61260 6372846 6434594 6493131 6546898 6595821 6639927 6679083 6714168 6747200 6779383 6809564 6835480
61249 6835480 6856306 6873114 6886680 6895557 6896762 6888085 6869413 6842205 6808314 6769182 6725293 6675808
61237 6675808 6619103 6554415 6482928 6406865 6327558 6245061 6159804 6073920 5990315 5910690 5835109
61226 5835109 5763429 5696530 5635841 5582168 5535556 5496211 5464784 5441285 5424166 5411334 5402059
61215E402059n023q08J351J111M32Q10J313L64j592k636k117j383j784l025l745
61200E385327k934n29K985P469J3763K3091L5499M9480O3731P8495R4282J10033
61188E860692J23894J35374J45135J52690J55909J53067J43906J28126J04346
61179G103139P1588L1050j4301o1166j06439j47348j81963k09318k28656k39249
61169F017337k41531k37602k29918k19872k08095j95179j81423j66627j51148
61160D185942j36559j24255j13811j03769r3671q4151p5285o6183n6502m7127
61150C284629l8813l1226k3947j7558j2726q713l877K403R151J5120J9868K3214
61138C217525K4544K3356K0150J6159J2331Q918N822K805m93m239q102j1598j4683
$$ plain form
61215 5402059 5397036 5396228 5397579 5398690 5399122 5399932 5401245 5401609 5400017 5397381 5395264 5393881 5392097 5389072 5385327
61200 5385327 5382393 5381864 5384849 5392318 5406081 5429172 5464671 5514151 5577882 5656377 5750659 5860692
61188 5860692 5984586 6119960 6265095 6417785 6573694 6726761 6870667 6998793 7103139
61179 7103139 7174727 7205777 7191476 7130310 7023871 6876523 6694560 6485242 6256586 6017337
61169 6017337 5775806 5538204 5308286 5088414 4880319 4685140 4503717 4337090 4185942
61160 4185942 4049383 3925128 3811317 3707548 3613877 3529726 3454441 3388258 3331756 3284629
61150 3284629 3245816 3214590 3190643 3173085 3160359 3151646 3147769 3150172 3159323 3174443 3194311 3217525
61138 3217525 3242069 3265425 3285575 3301734 3314065 3322983 3328805 3331610 3331117 3326878 3318776 3307178 3292495
61125C292495j7703k0997k4886k9618l4754l9108m2217m5237m9209n2818n3639
61114B882309n1712n0006n0627n2434n3332n3156n2813n2093n0332m8328m7591
61103B319885m8073m8267m7261m5163m2056l8276l5397l4940l5977l5903l3961
61092A874611l2244l2693l4631l6079l6118l5121l3677l2277l1332l0708k9606
61081A510125k7344k3943j9872j5820j2560j0266p987m760j168J332K570L808
61069A394115N595P068P934R486J2652J6187J8104J8085J7443J7200J7390J7900
61057A559159J8969K0589K1966K1990K0335J8046J6657J6347J5557J3033R599
61046A752247O810M454R69l737p776r949j1250j3013j5013j6353j6993j7481j8051
$$ plain form
61125 3292495 3274792 3253795 3228909 3199291 3164537 3125429 3083212 3037975 2988766 2935948 2882309
61114 2882309 2830597 2780591 2729964 2677530 2624198 2571042 2518229 2466136 2415804 2367476 2319885
61103 2319885 2271812 2223545 2176284 2131121 2089065 2050789 2015392 1980452 1944475 1908572 1874611
61092 1874611 1842367 1809674 1775043 1738964 1702846 1667725 1634048 1601771 1570439 1539731 1510125
61081 1510125 1482781 1458838 1438966 1423146 1410586 1400320 1392333 1387573 1386405 1387737 1390307 1394115
61069 1394115 1399710 1406778 1414712 1424198 1436850 1453037 1471141 1489226 1506669 1523869 1541259 1559159
61057 1559159 1578128 1598717 1620683 1642673 1663008 1681054 1697711 1714058 1729615 1742648 1752247
61046 1752247 1759057 1763511 1764480 1760743 1752967 1743018 1731768 1718755 1703742 1687389 1670396 1652915 1634864
61033A634864j8913k0415k2168k3005k2632k2283k2823k3290k2500k1128k0698
61022A395009k1141k0935j9343j7177j5260j3393j1141q729o718n281m097k765
61010A249029j193L31J486K367L328M402N317O099P133Q379R089Q556O903M927
60996A316153L544L260L777M210M327N184P715J0879J2473J1857J0708J0820J2303
60983A417210J4353J6486J8459K0011K1369K3166K5253K6534K6533K6314K7152
60972A662840K9013L0813L1617L1233L0418L0674L2844L5687L6945L6254L5747
60961B024085L7262M0219M2977M5064M7220N0185N4331N9676O5487P0603P4787
60950B611896P9175Q4951R2262J00557J09187J17603J26088J36248J49487J64947
$$ plain form
61033 1634864 1615951 1595536 1573368 1550363 1527731 1505448 1482625 1459335 1436835 1415707 1395009
61022 1395009 1373868 1352933 1333590 1316413 1301153 1287760 1276619 1267890 1261172 1255891 1251794 1249029
61010 1249029 1247836 1248167 1249653 1252020 1255348 1259750 1265067 1271166 1278299 1286678 1295767 1304323 1311226 1316153
60996 1316153 1319697 1322957 1326734 1330944 1335271 1340455 1348170 1359049 1371522 1383379 1394087 1404907 1417210
60983 1417210 1431563 1448049 1466508 1486519 1507888 1531054 1556307 1582841 1609374 1635688 1662840
60972 1662840 1691853 1722666 1754283 1785516 1815934 1846608 1879452 1915139 1952084 1988338 2024085
60961 2024085 2061347 2101566 2144543 2189607 2236827 2287012 2341343 2401019 2466506 2537109 2611896
60950 2611896 2691071 2776022 2868284 2968841 3078028 3195631 3321719 3457967 3607454 3772401
60940C772401J80342J94659K08399K21531K33719K46694K63602K85298L09993
60931E916638L37215L69019M05993M45345M84995N27022N75326O32741P02234
60922A0396528P87612Q90286J007881J138160J281309J437239J606418J796878
60914B0342311K024014K297955K617252K977585L365304L712988L866933L648215
60906D4852557K995581K055192J106576L85451k4765j55396o7267J55859L54271
60897E1658059L07613j35752r32210j859362k665688l209917l482798l540614
60889C6139331l444264l244170k984349k699251k409796k128474j865403j627210
60881A5736414j415207j229058j070164r38925q31308p40904o63018n95197n35874
$$ plain form
60940 3772401 3952743 4147402 4355801 4577332 4811051 5057745 5321347 5606645 5916638
60931 5916638 6253853 6622872 7028865 7474210 7959205 8486227 9061553 9694294 10396528
60922 10396528 11184140 12074426 13082307 14220467 15501776 16939015 18545433 20342311
60914 20342311 22366325 24664280 27281532 30259117 33624421 37337409 41204342 44852557
60906 44852557 47848138 49903330 51009906 51395357 51370592 51215196 51147929 51303788 51658059
60897 51658059 51965672 51829920 50897710 49038348 46372660 43162743 39679945 36139331
60889 36139331 32695067 29450897 26466548 23767297 21357501 19229027 17363624 15736414
60881 15736414 14321207 13092149 12021985 11083060 10251752 9510848 8847830 8252633 7716759
60872G716759m84574m41842m07004l76978l48702l21595k96483k73424k51890
60863D514267k32027k14489j99652j87587j77777j68556j58136j46707j36105
60854B893231j26996j18135j08831j00143r2767q5708p8230p1283o5695o0692
60844A984751n5590n1268m8387m5588m1293l6153l2012k9391k7450k5624k3726
60833A568269k1266j8084j4985j2499r857o522l810l362m636n622n670n977p363
60820A448616r058r998j0252j0944j3162j6861k0395k1697k0422j8418j7441j7278
60808A262690j6874j6263j5990j5456j3475j0382p920o788n580k694J654N820
60796A158742Q526R752J0235J0682J1459J2723J4583J7037J9819K2529K4910K6790
$$ plain form
60872 7716759 7232185 6790343 6383339 6006361 5657659 5336064 5039581 4766157 4514267
60863 4514267 4282240 4067751 3868099 3680512 3502735 3334179 3176043 3029336 2893231
60854 2893231 2766235 2648100 2539269 2439126 2346359 2260651 2182421 2111138 2045443 1984751
60844 1984751 1929161 1877893 1829506 1783918 1742625 1706472 1674460 1645069 1617619 1591995 1568269
60833 1568269 1547003 1528919 1513934 1501435 1491578 1485056 1481246 1477884 1473248 1467626 1461956 1455979 1448616
60820 1448616 1439558 1429560 1419308 1408364 1395202 1378341 1357946 1336249 1315827 1297409 1279968 1262690
60808 1262690 1245816 1229553 1213563 1198107 1184632 1174250 1166330 1159542 1153962 1151268 1152922 1158742
60796 1158742 1167268 1177020 1187255 1197937 1209396 1222119 1236702 1253739 1273558 1296087 1320997 1347787
60784A347787K7941K8317K8339K8539K9040K9626L0038K9714K7800K4296K0787
60773A652224J8779J7579J5171J1225P657N878M984L410J050j149k707l832m902
60760A725367o431q751j1222j2674j3198j4350j6848j9242j9922j9413j9410k0336
60748A543570k1191k1287k0761j9633j7677j5257j3270j1987j0693q760o519m774
60736A371761l684k456k36K819N661P712R574J1979J4474J5979J6183J5500J4235
60723A479501J2913J2784J4307J5415J3414Q896N534N425O763P240P449R240J2325
60710A611206J4751J5776J6232J6683J6909J6997J7360J7688J7022J4981J2220
60699A787825R756Q321P944P745O661M743K931J407n17k437k548l78J786J751
$$ plain form
60784 1347787 1375728 1404045 1432384 1460923 1489963 1519589 1549627 1579341 1607141 1631437 1652224
60773 1652224 1671003 1688582 1703753 1714978 1722635 1728513 1733497 1736907 1737957 1736808 1734101 1730269 1725367
60760 1725367 1718936 1710185 1698963 1686289 1673091 1658741 1641893 1622651 1602729 1583316 1563906 1543570
60748 1543570 1522379 1501092 1480331 1460698 1443021 1427764 1414494 1402507 1391814 1383054 1376535 1371761
60736 1371761 1368077 1365621 1365385 1368204 1373865 1381577 1391151 1403130 1417604 1433583 1449766 1465266 1479501
60723 1479501 1492414 1505198 1519505 1534920 1548334 1557230 1562764 1568189 1574952 1582192 1589641 1598881 1611206
60710 1611206 1625957 1641733 1657965 1674648 1691557 1708554 1725914 1743602 1760624 1775605 1787825
60699 1787825 1797581 1805902 1813846 1821591 1828252 1832995 1835926 1837333 1836816 1834379 1831831 1831453 1833239 1834990
60685A834990L70k48j98j326m000o571p963q745r544j0130j0370j0663j1015j1001
60671A743586j0851j1349j2417j3013j2794j2794j3791j4987j4932j3291j1164
60660A602203r897r923j0595j0957j0658r974r170q376q047q585r298q786o934
60647A481003n322m750l663m73L606N801N334L875K740J520k64j998l186m465
60633A479758o472q596r746r981j0615j2859j6549k0117k1901k1711k1017k1141
60621A299053k1579k0734j8169j5213j3214j1933j0215p767n642m861m921m180
60609A160625j769J380L812N332O766Q379R578J0109J0280R935Q571O740N936
60596A245674O479P031O822O865P947R103R369R631J1049J2902J3669J3364J2993
$$ plain form
60685 1834990 1835360 1835112 1834914 1833588 1829588 1823017 1815054 1806309 1796765 1786635 1776265 1765602 1754587 1743586
60671 1743586 1732735 1721386 1708969 1695956 1683162 1670368 1656577 1641590 1626658 1613367 1602203
60660 1602203 1592306 1582383 1571788 1560831 1550173 1540199 1531029 1522653 1514606 1506021 1496723 1487937 1481003
60647 1481003 1475681 1470931 1467268 1466795 1470401 1476202 1481536 1485411 1488151 1489671 1489407 1487409 1484223 1479758
60633 1479758 1473286 1464690 1454944 1444963 1434348 1421489 1404940 1384823 1362922 1341211 1320194 1299053
60621 1299053 1277474 1256740 1238571 1223358 1210144 1198211 1187996 1180229 1174587 1169726 1164805 1160625
60609 1160625 1158856 1160236 1164048 1169380 1176146 1184525 1194103 1204212 1214492 1224427 1232998 1239738 1245674
60596 1245674 1252153 1259184 1266006 1272871 1280818 1289921 1299290 1308921 1319970 1332872 1346541 1359905 1372898
60583A372898J2549J1445J0305J0396J1641J2966J4178J5667J6766J6510J5889
60572A521210J7048K0003K2214K1959K0190J8450J6784J4716J2591J0751Q561
60561A704477N496K351K11j244l434p054j1270j4602j6210j6467j6382j6510j6456
60548A592906j5645j4150j2315j0085p351m537k098J43K267L424K962J865J648
60535A539034J943Q87j918m408m657l151j654q69j56J100K731M125M759M598M162
60520A546526L937L676K742J270M35J219L135M370L213l90m559p182q007q475
60506A541910r356r750r139q931j0431j2361j2409j0801j0104j1350j2422j1094
60494A413762p912n027l328j827P09M374Q083J0564J1668J2707J5073J8713K2590
$$ plain form
60583 1372898 1385447 1396892 1407197 1417593 1429234 1442200 1456378 1472045 1488811 1505321 1521210
60572 1521210 1538258 1558261 1580475 1602434 1622624 1641074 1657858 1672574 1685165 1695916 1704477
60561 1704477 1709973 1712324 1712535 1711291 1707857 1700803 1689533 1674931 1658721 1642254 1625872 1609362 1592906
60548 1592906 1577261 1563111 1550796 1540711 1533360 1528823 1526725 1526868 1529135 1532559 1535521 1537386 1539034
60535 1539034 1540977 1541864 1539946 1535538 1530881 1527730 1526076 1525207 1525051 1526151 1528882 1533007 1537766 1542364 1546526
60520 1546526 1550463 1554139 1556881 1558151 1558586 1559805 1562940 1567310 1570523 1570133 1565574 1558392 1550385 1541910
60506 1541910 1532554 1522804 1513665 1504734 1494303 1481942 1469533 1458732 1448628 1437278 1424856 1413762
60494 1413762 1405850 1400823 1397495 1395668 1396377 1400751 1408834 1419398 1431066 1443773 1458846 1477559 1500149
60481A500149K6249K9891L3317L6179L9278M4066N0423N6175N9340N9657N7527
60470A992251N2697M4918L4914K3874J2575J587q211j5945k1143k3536k3073k0439
60458B050469j6892j3107q693l084L525J0292J6247K0728K3994K7343L1759L6435
60446B179016L9643M1187M2906M6428N1519N7189O3412P0974Q0315R1243J03482
60435B867314J17130J32710J50867J71492J93307K15030K36809K59547K82936
60426D627142L05513L26937L48906L73065L98961M24410M46264M59318M55375
60417H165891M25543L64707K74166J60686L3766r6488k20243l28345m13477m71956
60407G894250n04444n14438n06065m83569m52007m16619l80805l45493l10897
$$ plain form
60481 1500149 1526398 1556289 1589606 1625785 1665063 1709129 1759552 1815727 1875067 1934724 1992251
60470 1992251 2044948 2089866 2124780 2148654 2161229 2162816 2154605 2138660 2117517 2093981 2070908 2050469
60458 2050469 2033577 2020470 2011777 2008693 2012218 2022510 2038757 2059485 2083479 2110822 2142581 2179016
60446 2179016 2218659 2259846 2302752 2349180 2400699 2457888 2521300 2592274 2672589 2763832 2867314
60435 2867314 2984444 3117154 3268021 3439513 3632820 3847850 4084659 4344206 4627142
60426 4627142 4932655 5259592 5608498 5981563 6380524 6804934 7251198 7710516 8165891
60417 8165891 8591434 8956141 9230307 9390993 9424759 9328271 9108028 8779683 8366206 7894250
60407 7894250 7389806 6875368 6369303 5885734 5433727 5017108 4636303 4290810 3979913
60398C979913k78157k48748k23000k00015j78880j59527j42453j27903j15375
60389B305855j03966r3216q3403p4908o7669o1566n6758n3136m9941m6573m3337
60378A571382m0684l8239l5407l2448l0001k7905k5446k2543j9782j7630j6275
60367A265022j5723j5209j3304r769o497n371n901o376o395o456n960l949j331
60354A162781J03O27K136M651N948N070L678L229L208L126L868N728P158O910
60340A218221N811N163M919M594M520M972N487O003P173Q549Q223N564K721K026
60326A293946L246M652N330N038L285K81k357l384l484l855m324m160l470k548
60312A288196j053P12J212l4r92K40K541L545L118K858L038K532J375J063K182
$$ plain form
60398 3979913 3701756 3453008 3230008 3029993 2851113 2691586 2549133 2421230 2305855
60389 2305855 2201889 2108673 2025270 1950362 1882693 1821127 1764369 1711233 1661292 1614719 1571382
60378 1571382 1530698 1492459 1457052 1424604 1394603 1366698 1341252 1318709 1298927 1281297 1265022
60367 1265022 1249299 1234090 1220786 1211017 1204520 1199149 1193248 1186872 1180477 1174021 1168061 1164112 1162781
60354 1162781 1162884 1163511 1165647 1170298 1176246 1181316 1184994 1188223 1191431 1194557 1198425 1204153 1211311 1218221
60340 1218221 1224032 1229195 1234114 1238708 1243228 1248200 1253687 1259690 1266863 1275412 1283635 1289199 1291920 1293946
60326 1293946 1297192 1301844 1307174 1312212 1315497 1315778 1313421 1310037 1306553 1302698 1298374 1294214 1290744 1288196
60312 1288196 1287143 1287855 1289067 1289033 1288041 1288281 1290822 1294367 1297485 1300343 1303381 1305913 1307288 1308351 1310533
60297A310533L755N059O397P904R141J0054J1163J2605J3950J4831J4879J3565
60285A433836J1287R995J1186J3634J4700J3652J2094J1276J0644R286P213M806
60273A563609K368O75Q02K787N361P387Q913J0493J2164J3414J3708J2864J1200
60260A665745R212O864L563p37m974q138j0381j2241j3472j3667j3424j3591j3798
60247A580961j2942j1006r154q077p388o624n777m698l014q17J298L021M449N509
60233A525741N971O076O405P193Q320R731J1135J1638J0574Q615P195O878O996
60220A632468O814O338O073O551Q002R887J1172J1657J2602J5185J8813K1938
60208A767500K4142K6309K8896L1372L3438L5737L8890M2634M6249M9488N2877
$$ plain form
60297 1310533 1314288 1319347 1325744 1333648 1342789 1352843 1364006 1376611 1390561 1405392 1420271 1433836
60285 1433836 1445123 1455118 1466304 1479938 1494638 1508290 1520384 1531660 1542304 1551590 1558803 1563609
60273 1563609 1565977 1566652 1567454 1570241 1575602 1582989 1591902 1602395 1614559 1627973 1641681 1654545 1665745
60260 1665745 1674957 1681821 1685384 1684647 1679673 1671535 1661154 1648913 1635441 1621774 1608350 1594759 1580961
60247 1580961 1568019 1557013 1547859 1539782 1532394 1525770 1519993 1515295 1512281 1511464 1512762 1515783 1520232 1525741
60233 1525741 1531712 1537788 1544193 1551386 1559706 1569437 1580572 1592210 1602784 1611399 1618594 1625472 1632468
60220 1632468 1639282 1645620 1651693 1658244 1666246 1676133 1687305 1698962 1711564 1726749 1745562 1767500
60208 1767500 1791642 1817951 1846847 1878219 1911657 1947394 1986284 2028918 2075167 2124655 2177532
60197B177532N7361O3442P0357P6524Q1279Q5815R1767R9383J07760J16402J25513
60186C153135J35100J44684J53859J62386J69860J76110J81674J87049J91609
60177D655466J94016J93533J90211J84011J74671J62414J47996J31862J13916
60168F148096R4186P3346N2470L2537J4055k908j8156l0884m0238m6261m9485
60157F226758m9683m6161l9377l0764k0552p423Q864K6294M3157O0131P8318R6877
60145F346439J14395J31159J47938J63553J75949J84790J90741J92896J89336
60136G837196J79963J66389J49343J28401J04316P9096N3566K7059k20k6621n1253
60125H647235p4409r5298j11592j22240j28672j32151j31599j25252j13107r6650
$$ plain form
60197 2177532 2234893 2298335 2368692 2445216 2526495 2612310 2704077 2803460 2911220 3027622 3153135
60186 3153135 3288235 3432919 3586778 3749164 3919024 4095134 4276808 4463857 4655466
60177 4655466 4849482 5043015 5233226 5417237 5591908 5754322 5902318 6034180 6148096
60168 6148096 6242282 6315628 6368098 6400635 6414690 6411782 6393626 6362742 6322504 6276243 6226758
60157 6226758 6177075 6130914 6091537 6060773 6040221 6032798 6041662 6067956 6111113 6171244 6249562 6346439
60145 6346439 6460834 6591993 6739931 6903484 7079433 7264223 7454964 7647860 7837196
60136 7837196 8017159 8183548 8332891 8461292 8565608 8644704 8698270 8725329 8725109 8698488 8647235
60125 8647235 8572826 8477528 8365936 8243696 8115024 7982873 7851274 7726022 7612915 7516265
60115G516265p7458n7013l6595j6332M687K6600M8145O8431Q7931J06768J23205
60104G794634J34945J41060J41726J37052J27326J13727R7804Q0606O2901M5509
60094H877290K8844J2893j740j3418k0653k2980k0166j1677K263K0030M0041O2176
60082H952903Q6855J13456J40950J69733K01561K37377K75974L15075L53282L90812
60072A1237978M28522M66369N02925N36410N65889N91009O10773O23283O26708
60063A6189866O19780O01510N71445N30543M80849M23715L59055K86871K08677
60054B0272311J26634M1880m5158j32875k17882k96635l66993m27601m76236n09960
60044A7967485n27543n30965n23386n05914m77709m39383l94566l47055k97726
$$ plain form
60115 7516265 7438807 7381794 7345199 7328867 7333554 7360154 7408299 7476730 7564661 7671429 7794634
60104 7794634 7929579 8070639 8212365 8349417 8476743 8590470 8688274 8768880 8831781 8877290
60094 8877290 8906134 8919027 8917287 8903869 8883216 8860236 8840070 8828393 8830656 8850686 8890727 8952903
60082 8952903 9039758 9153214 9294164 9463897 9665458 9902835 10178809 10493884 10847166 11237978
60072 11237978 11666500 12132869 12635794 13172204 13738093 14329102 14939875 15563158 16189866
60063 16189866 16809646 17411156 17982601 18513144 18993993 19417708 19776763 20063634 20272311
60054 20272311 20398945 20440825 20395667 20262792 20044910 19748275 19381282 18953681 18477445 17967485
60044 17967485 17439942 16908977 16385591 15879677 15401968 14962585 14568019 14220964 13923238
60035A3923238k45717j91708j38272q7461l9868L990M2941P6139J03301J23424
60025A3570007J34439J34844J25145J07404Q3874N6112K4742r957m6726q2855
60015A4097029j15817j45066j71458j95343k16378k34766k51144k65046k74784
60006A2227227k79260k78953k75014k68172k58657k46232k30322k10811j88645
59997I991161j64857j39493j12498q5087n8788l3392p388J9653M6560P2290R6637
59986I624798J19191J39035J55420J67402J73157J71438J63445J51298J34691
59977A0999875J11505Q1846M9060J5941j7678n2494q7126j19358j48238j73435
59967A0659898j93858k08252k16238k17952k13751k04968j93405j79293j61189
$$ plain form
60035 13923238 13677521 13485813 13347541 13260080 13220212 13224202 13267143 13343282 13446583 13570007
60025 13570007 13704446 13839290 13964435 14071839 14155713 14211825 14236567 14226610 14179884 14097029
60015 14097029 13981212 13836146 13664688 13469345 13252967 13018201 12767057 12502011 12227227
60006 12227227 11947967 11669014 11394000 11125828 10867171 10620939 10390617 10179806 9991161
59997 9991161 9826304 9686811 9574313 9489226 9430438 9397046 9389658 9409311 9455871 9528161 9624798
59986 9624798 9743989 9883024 10038444 10205846 10379003 10550441 10713886 10865184 10999875
59977 10999875 11111380 11193226 11242286 11258227 11240549 11188055 11100929 10981571 10833333 10659898
59967 10659898 10466040 10257788 10041550 9823598 9609847 9404879 9211474 9032181 8870992
59958H870992j38728j13939q8883o3589l7377j0515J6672M4683P3442J01461J27938
59947H782157J54209J81502K08502K32709K53066K69498K80892K85379K81988
59938A0929902K70613K51107K23963J91146J54795J15630P3788L0371j3069n5713
59928A2172533r6665j33870j65482j91500k12458k27142k33382k30638k20297
59919A0461099k03917j82697j58139j31463j02611p1305l8801p132K2929N1654
59909I639617P8633J03030J25114J45527J63198J76064J84015J89096J92246J91798
59899A1188338J86007J75472J62126J47225J31396J15605J00923Q7908P7029O9137
59889A2441166O4951O4678O8768P8463R4798J17400J44986J76901K13594K55528
$$ plain form
59958 8870992 8732264 8618325 8529442 8465853 8428476 8417961 8434633 8479316 8552758 8654219 8782157
59947 8782157 8936366 9117868 9326370 9559079 9812145 10081643 10362535 10647914 10929902
59938 10929902 11200515 11451622 11675585 11866731 12021526 12137156 12210944 12241315 12228246 12172533
59928 12172533 12075868 11941998 11776516 11585016 11372558 11145416 10912034 10681396 10461099
59919 10461099 10257182 10074485 9916346 9784883 9682272 9610967 9572166 9565034 9587963 9639617
59909 9639617 9718250 9821280 9946394 10091921 10255119 10431183 10615198 10804294 10996540 11188338
59899 11188338 11374345 11549817 11711943 11859168 11990564 12106169 12207092 12295000 12372029 12441166
59889 12441166 12506117 12570795 12639563 12718026 12812824 12930224 13075210 13252111 13465705 13721233
59879A3721233L02076L51565M02195M52618N01731N47982N89182O22898O46728
59870A8138208O58056O53803O30769N86289N18867M28858L19012J94184O0420
59861B2188466p5667k07068l27112m30697n14715n77454o18277o38146o39596
59852A8159734o25741n99564n64021n21764m74234m21890l65751l07984k50549
59843A4028236j94196j39267q6403l5805J3084O0151J03586J41452J73522K00440
59833A4264800K21509K34363K36502K26249K02513J64768J13554N0668k0949r7356
59823A5596621j74391k48805l18088l79119m28341m64187m88122n02045n05658
59814A2087865m97972m80632m57814m32790m06006l76577l44433l10814k77770
$$ plain form
59879 13721233 14023309 14374874 14777069 15229687 15731418 16279400 16868582 17491480 18138208
59870 18138208 18796264 19450067 20080836 20667125 21185992 21614850 21933862 22128046 22188466
59861 22188466 22112799 21905731 21578619 21147922 20633207 20055753 19437476 18799330 18159734
59852 18159734 17533993 16934429 16370408 15848644 15374410 14952520 14586769 14278785 14028236
59843 14028236 13834040 13694773 13608370 13572565 13585649 13645800 13749386 13890838 14064360 14264800
59833 14264800 14486309 14720672 14957174 15183423 15385936 15550704 15664258 15714926 15693977 15596621
59823 15596621 15422230 15173425 14855337 14476218 14047877 13583690 13095568 12593523 12087865
59814 12087865 11589893 11109261 10651447 10218657 9812651 9436074 9091641 8780827 8503057
59805H503057k47454k21021j97925j76879j57594j41078j28418j19935j15290
59796F997463j13465j12608j10729j06941j01599r5287q8104p9828p0305n9678
59786F058919m8734l9004l2127k8977k9511l3063l8640m5277n2395n9639o6321
59775E585231p1566p4899p6005p4045o8406o0244n1821m3747l4287k2200q764
59764D999247M149J6491K8925M0670N0557N9473O9404Q0118Q8899R4082R7156
59753E629171J00622J04995J08751J10435J09791J06992J01466R2006P8352O2552
59743F605133M8024L7030K9493K4429K1574K1193K3330K8112L6128M7621O1941
59732F984008P8437R7314J18981J43272J69918J98873K29616K61256K94088L29646
$$ plain form
59805 8503057 8255603 8034582 7836657 7659778 7502184 7361106 7232688 7112753 6997463
59796 6997463 6883998 6771390 6660661 6553720 6452121 6356834 6268730 6188902 6118597 6058919
59786 6058919 6010185 5971181 5939054 5910077 5880566 5847503 5808863 5763586 5711191 5651552 5585231
59775 5585231 5513665 5438766 5362761 5288716 5220310 5160066 5108245 5064498 5030211 5008011 4999247
59764 4999247 5003396 5019887 5048812 5089482 5140039 5199512 5268916 5349034 5437933 5532015 5629171
59753 5629171 5729793 5834788 5943539 6053974 6163765 6270757 6372223 6464229 6542581 6605133
59743 6605133 6653157 6690187 6719680 6744109 6765683 6786876 6810206 6838318 6874446 6922067 6984008
59732 6984008 7062445 7159759 7278740 7422012 7591930 7790803 8020419 8281675 8575763 8905409
59722H905409L68155M07326M45064M81859N18386N51498N74248N78958N58545
59713A3389448N06502M19503L01490J63896K1386j12162k25420l11248l68357
59704A3785038m00112m10841m03878l82630l51317l13821k72787k30243j87913
59695A0831496j46649j06676o8640l3226L63L4120O8934J03663J36884J68545
59685A0988814J99516K30601K62487K95797L30678L66962M04811M44505M85637
59676A4009808N27607N71063O17594O67648P19713P72231Q25467Q80625R37332
59667B0529088R92518J041924J082732J114660J138110J151407J150858J134056
59659B9335353J102341J059708J010750R60717R15987Q82296Q62565Q57547Q67427
$$ plain form
59722 8905409 9273564 9680890 10125954 10607813 11126199 11677697 12251945 12830903 13389448
59713 13389448 13895950 14315453 14616943 14780839 14802225 14690063 14464643 14153395 13785038
59704 13785038 13384926 12974085 12570207 12187577 11836260 11522439 11249652 11019409 10831496
59695 10831496 10684847 10578171 10509531 10476305 10476668 10510788 10579722 10683385 10820269 10988814
59685 10988814 11188330 11418931 11681418 11977215 12307893 12674855 13079666 13524171 14009808
59676 14009808 14537415 15108478 15726072 16393720 17113433 17885664 18711131 19591756 20529088
59667 20529088 21521606 22563530 23646262 24760922 25899032 27050439 28201297 29335353
59659 29335353 30437694 31497402 32508152 33468869 34384856 35267152 36129717 36987264 37854691
59650C7854691Q91129R24824R63257J002117J037304J062601J070720J056751
59642D5863394J018481R53597Q59754P38498N96892M44088K87997J36136k779
59633E0896058j20379k11128k72415l03281l04250k77441k25575j51230n7506
59624D8972853N1593J72304L02029M38603N79541P22584Q65835J006266J138588
59615E4250196J256314J353326J423380J458134J446492J376567J239353J031915
59607F4835677P58165M27593N4580l40707p32977j096723j412158j666941j854290
59598E8972219j972519k026432k026188j982877j906211j806839j698684j597090
59590D3955379j515083j461798j442243j455626j493312j539976j578907j598342
$$ plain form
59650 37854691 38745820 39670644 40633901 41636018 42673322 43735923 44806643 45863394
59642 45863394 46881875 47835472 48695226 49433724 50030616 50474704 50762701 50898837 50896058
59633 50896058 50775679 50564551 50292136 49988855 49684605 49407164 49181589 49030359 48972853
59624 48972853 49024446 49196750 49498779 49937382 50516923 51239507 52105342 53111608 54250196
59615 54250196 55506510 56859836 58283216 59741350 61187842 62564409 63803762 64835677
59607 64835677 65593842 66021435 66076015 65735308 65002331 63905608 62493450 60826509 58972219
59598 58972219 56999700 54973268 52947080 50964203 49057992 47251153 45552469 43955379
59590 43955379 42440296 40978498 39536255 38080629 36587317 35047341 33468434 31870092
59582C1870092j594657j570310j528737j471449j399998j318799j233765j148483
59574B0603894j063835r81189r03297q31340p63477o97856o35437n78445n27416
59565A3621602m81163m38498l98681l61132l26040k94460k66726k41652k18457
59556A0594793j98468j83467j73060j65236j59217j56193j57215j61591j67644
59547I072702j74145j80602j86632j91459j93934j93179j89200j82659j74003
59538G406889j63184j50453j36959j24167j12651j01480q8860p3862n7832m3490
59528F353951l2036k1780j0522J538J2529K1879L0661L9130M5880M9935N2021
59517F543186N3248N3984N4685N6417N9759O4279O9767P6820Q5753R6059J07632
$$ plain form
59582 31870092 30275435 28705125 27176388 25704939 24304941 22986142 21752377 20603894
59574 20603894 19540059 18558870 17655573 16824233 16060756 15362900 14727463 14149018 13621602
59565 13621602 13140439 12701941 12303260 11942128 11616088 11321628 11054902 10813250 10594793
59556 10594793 10396325 10212858 10039798 9874562 9715345 9559152 9401937 9240346 9072702
59547 9072702 8898557 8717955 8531323 8339864 8145930 7952751 7763551 7580892 7406889
59538 7406889 7243705 7093252 6956293 6832126 6719475 6617995 6529135 6455273 6397441 6353951
59528 6353951 6321915 6300135 6289613 6291151 6303680 6325559 6356220 6395350 6441230 6491165 6543186
59517 6543186 6596434 6650418 6705103 6761520 6821279 6885558 6955325 7032145 7117898 7213957 7321589
59506G321589J21253J37098J53965J70804J88054K06719K27065K48910K72106
59497I047563K96056L19803L43419L68273L95039M22326M48029M71085M91136
59488A2602729N07419N19081N25862N27619N23840N14321M99689M80547M56827
59479A7157934M28711L97615L65564L33962L03134K72475K41058K09203J79732
59470A9889388J56412J40784J31679J27991J30165J37993J48574J57654J61845
59461B1182485J58476J44518J17341P5983K0878m6984j25617k11487l00403l88518
59451B0626672m72162n47685o12281o64122p01365p22340p27554p20163p03327
59442A4755673o78120o44899o05429n62241n16997m70747m24967l80967l38923
$$ plain form
59506 7321589 7442842 7579940 7733905 7904709 8092763 8299482 8526547 8775457 9047563
59497 9047563 9343619 9663422 10006841 10375114 10770153 11192479 11640508 12111593 12602729
59488 12602729 13110148 13629229 14155091 14682710 15206550 15720871 16220560 16701107 17157934
59479 17157934 17586645 17984260 18349824 18683786 18986920 19259395 19500453 19709656 19889388
59470 19889388 20045800 20186584 20318263 20446254 20576419 20714412 20862986 21020640 21182485
59461 21182485 21340961 21485479 21602820 21678803 21699681 21652697 21527080 21315593 21015190 20626672
59451 20626672 20154510 19606825 18994544 18330422 17629057 16906717 16179163 15459000 14755673
59442 14755673 14077553 13432654 12827225 12264984 11747987 11277240 10852273 10471306 10132383
59433A0132383k98667k60714k25426j91899j58930j26475r5229o5426l7018j0123
59423H662476J5791M2180O9701R7126J23219J48780J75383K02991K30474K57684
59413A0025805K85157L12124L36665L57662L74812L86652L90400L84250L68335
59404A3221862L42713L05735K55516J92517J19872M1343m0301j22695k02398k74972
59394A3839192l37065l87853m27814m56686m73866m80467m79226m72000m58847
59385I865368m40079m17694l93778l68846l42810l16419k90521k64950k39494
59376F790777k15190j93450j74410j57109j40709j24576j07940r0771p4520o0839
59366E451263m9700l9493k8764j7329o113L646J1582J8890K7189L6420M4817N1312
$$ plain form
59433 10132383 9833716 9573002 9347576 9155677 8996747 8870272 8775043 8709617 8672599 8662476
59423 8662476 8678267 8720447 8790148 8887274 9010493 9159273 9334656 9537647 9768121 10025805
59413 10025805 10310962 10623086 10959751 11317413 11692225 12078877 12469277 12853527 13221862
59404 13221862 13564575 13870310 14125826 14318343 14438215 14479558 14439257 14316562 14114164 13839192
59394 13839192 13502127 13114274 12686460 12229774 11755908 11275441 10796215 10324215 9865368
59385 9865368 9425289 9007595 8613817 8244971 7902161 7585742 7295221 7030271 6790777
59376 6790777 6575587 6382137 6207727 6050618 5909909 5785333 5677393 5586622 5512102 5451263
59366 5451263 5401563 5362070 5333306 5315977 5309864 5313510 5325092 5343982 5371171 5407591 5452408 5503720
59354E503720N6962O3621P2274Q2749R3479J01238J03304J01047R9723J03487
59344F381604J12169J23805J37980J55013J74084J94614K17776K43978K70088
59335H011111K92229L10893L30737L55588L86034M21696M63010N09947N60906
59326A1642151O13963O68164P23051P77780Q30963Q80582R23964R58231R80486
59317A8999335R87274R75140R43096Q94094Q32933P63272O87656O09311N31869
59308B6223980M57385L85925L16960K50114J84719J19741N4093j3470q4038j57397
59298B7738012k31948l06311l79609m49150n09414n55301n85584o02137o07439
59289B3511119o04822n99520n96433n96916n99830o05114o13989o25898o37735
$$ plain form
59354 5503720 5560682 5624303 5696577 5779326 5872805 5974043 6077347 6178394 6278117 6381604
59344 6381604 6493773 6617578 6755558 6910571 7084655 7279269 7497045 7741023 8011111
59335 8011111 8303340 8614233 8944970 9300558 9686592 10108288 10571298 11081245 11642151
59326 11642151 12256114 12924278 13647329 14425109 15256072 16136654 17060618 18018849 18999335
59317 18999335 19986609 20961749 21904845 22798939 23631872 24395144 25082800 25692111 26223980
59308 26223980 26681365 27067290 27384250 27634364 27819083 27938824 27992917 27979447 27895409 27738012
59298 27738012 27506064 27199753 26820144 26370994 25861580 25306279 24720695 24118558 23511119
59289 23511119 22906297 22306777 21710344 21113428 20513598 19908484 19294495 18668597 18030862
59280A8030862o46361o50182o48294o40105o25983o06668n82031n52015n18412
59271A2560811m83618m47760m09261l68566l29085k93679k61999k32087k02987
59262I531769j74769j47297j20330r4270p0018m8106k8132q958J0264K9081M6211
59251H925445O1360P5507Q8816R9539J06107J09120J09868J08141J03055R4947
59241I881905Q4509P1083N4011L5020J7098J435j2453k4150l2157l6020l6335
59230A0003946l2829k4713j2818R03J6135L4276N5617P8647J02293J26590J50724
59219A0498771J72776J91939K08899K23245K32572K35087K31323K22398K08204
59210A2425214J88341J63459J34704J02729O7880L0583q352m6697q0228j04879
$$ plain form
59280 18030862 17384501 16734319 16086025 15445920 14819937 14213269 13631238 13079223 12560811
59271 12560811 12077193 11629433 11220172 10851606 10522521 10228842 9966843 9734756 9531769
59262 9531769 9357000 9209703 9089373 8995103 8925085 8876979 8848847 8839889 8850153 8879234 8925445
59251 8925445 8986805 9062312 9151128 9250667 9356774 9465894 9575762 9683903 9786958 9881905
59241 9881905 9966414 10037497 10091508 10126528 10143626 10145061 10132608 10108458 10076301 10040281 10003946
59230 10003946 9971117 9946404 9933586 9934489 9950624 9984900 10040517 10119164 10221457 10348047 10498771
59219 10498771 10671547 10863486 11072385 11295630 11528202 11763289 11994612 12217010 12425214
59210 12425214 12613555 12777014 12911718 13014447 13082327 13112910 13104558 13057861 12977633 12872754
59200A2872754j19820j27156j28791j25337j18053j09524j01500r3681q5499p7798
59190A1785595p2037o8831o7730o7584o6948o5049o2245n8617n2684m2824k9193
59179A1131853j2386Q994L6934P0529J06611J44032J84540K28997K75466L22037
59169A2497607L68866M15899M60596M99389N29786N49763N56504N47006N18898
59160A6944314M70121L99455L08366K01090Q2205m4540j74520l01237m18152n20532
59150A6946570o05085o69617p13876p39276p46905p37292p12760o78215o38478
59141A0705066n96061n52230n08466m65782m24127l83731l45984l12071k81874
59132F834740k55043k31641k10895j90812j70431j51261j35324j22563j11198
$$ plain form
59200 12872754 12752934 12625778 12496987 12371650 12253597 12144073 12042573 11948892 11863393 11785595
59190 11785595 11713558 11644727 11576997 11509413 11442465 11377416 11315171 11256554 11203870 11161046 11131853
59179 11131853 11119467 11128461 11165395 11235924 11342535 11486567 11671107 11900104 12175570 12497607
59169 12497607 12866473 13282372 13742968 14242357 14772143 15321906 15878410 16425416 16944314
59160 16944314 17414435 17813890 18122256 18323346 18405551 18361011 18186491 17885254 17467102 16946570
59150 16946570 16341485 15671868 14957992 14218716 13471811 12734519 12021759 11343544 10705066
59141 10705066 10109005 9556775 9048309 8582527 8158400 7774669 7428685 7116614 6834740
59132 6834740 6579697 6348056 6137161 5946349 5775918 5624657 5489333 5366770 5255572
59123E255572r9817q8264p7260o7764o0003n2661m4010l4000k4074j4783n191
59112D687745M914J4099K1550K8683L7270M7076N6461O4568P1912P9515Q7992
59101E201785R7035J05576J13118J20758J29794J39529J47923J54159J58956J62472
59091F531105J63920J63371J61741J58648J52375J42468J30244J16138R8925P8434
59081G897369N6859L6238J6684j891j8271l1250m0614m5833m5870m1430l5197
59070G746794k8456j9451o399R983K8376M9038P2208R6298J19849J43675J69016
59059H380931J94961K19856K44023K68910K94255L18085L39136L57727L74599
59050A0992483L89881M02537M10076M09617L99908L81096L52115L10311K54931
$$ plain form
59123 5255572 5155755 5067491 4990231 4922467 4862464 4809803 4765793 4731793 4707719 4692936 4687745
59112 4687745 4692659 4706758 4728308 4756991 4794261 4841337 4897798 4962366 5034278 5113793 5201785
59101 5201785 5298820 5404396 5517514 5638272 5768066 5907595 6055518 6209677 6368633 6531105
59091 6531105 6695025 6858396 7020137 7178785 7331160 7473628 7603872 7720010 7818935 7897369
59081 7897369 7954228 7990466 8007150 8005259 7986988 7955738 7915124 7869291 7823421 7781991 7746794
59070 7746794 7718338 7698887 7692488 7702471 7730847 7779885 7852093 7948391 8068240 8211915 8380931
59059 8380931 8575892 8795748 9039771 9308681 9602936 9921021 10260157 10617884 10992483
59050 10992483 11382364 11784901 12194977 12604594 13004502 13385598 13737713 14048024 14302955
59041A4302955J89251J17971M4081l0334j02161j68169k26620k76426l16362l47001
59031A3187185l71921l94529m14400m28675m36345m39179m39012m36000m29511
59022I397613m19263m05711l90149l74061l57675l39910l20406l00552k81775
59013F208111k64106k47308k31953k18132k04531j90179j75966j63162j51600
59004D361174j40475j29772j19716j10084j01120r3678q7376q0451p2737o6754
58994C359011o4048o2521n9602n6181n4726n4850n3811n0615m6809m3347l9267
58983B773234l3819k7901k2863j9238j6827j5080j3393j1682j0319r013o690l085
58971B583324O85M019P875J2884J7914K1687K4322K5750K4466J9770J3940R935
$$ plain form
59041 14302955 14492206 14610177 14654258 14623924 14521763 14353594 14126974 13850548 13534186 13187185
59031 13187185 12815264 12420735 12006335 11577660 11141315 10702136 10263124 9827124 9397613
59022 9397613 8978350 8572639 8182490 7808429 7450754 7110844 6790438 6489886 6208111
59013 6208111 5944005 5696697 5464744 5246612 5042081 4851902 4675936 4512774 4361174
59004 4361174 4220699 4090927 3971211 3861127 3760007 3666329 3578953 3498502 3425765 3359011
58994 3359011 3294963 3232442 3172840 3116659 3061933 3007083 2953272 2902657 2855848 2812501 2773234
58983 2773234 2739415 2711514 2688651 2669413 2652586 2637506 2624113 2612431 2602112 2593099 2586409 2583324
58971 2583324 2584009 2588028 2595903 2608787 2626701 2648388 2672710 2698460 2722926 2742696 2756636 2766571
58959B766571P938O046L532J422N97J231L405O624R377J0760J1803J3710J5764
58946B858780J6573J6326J5921J4888J2114Q002L967M18l067o153q077r011r567
58933B911114r497q323o619n215l737j291K183O300J0993J5633J8698J9703K0296
58920B970238K2135K4941K7938L1511L5804L9426M1445M3146M5962M9363N2606
58909C384515N6573O1719O6268O9112P2282P7620Q3054Q5659Q6653Q9406R3795
58898D226656R6754R7744R9487J03369J07980J12514J17926J24234J30086J35726
58888E352476J43342J53738J65294J76932J89453K03495K18642K35001K53162
58879G091535K72257K90622L08777L29086L52213L76627M02044M30244M61699
$$ plain form
58959 2766571 2774509 2780555 2784087 2785509 2786106 2787337 2790742 2797366 2806743 2817503 2829306 2843016 2858780
58946 2858780 2875353 2891679 2907600 2922488 2934602 2942604 2946571 2946989 2943922 2937769 2929692 2920681 2911114
58933 2911114 2901617 2893294 2886675 2881460 2877723 2876432 2878615 2884915 2895908 2911541 2930239 2949942 2970238
58920 2970238 2992373 3017314 3045252 3076763 3112567 3151993 3193438 3236584 3282546 3331909 3384515
58909 3384515 3441088 3502807 3569075 3638187 3710469 3788089 3871143 3956802 4043455 4132861 4226656
58898 4226656 4323410 4421154 4520641 4624010 4731990 4844504 4962430 5086664 5216750 5352476
58888 5352476 5495818 5649556 5814850 5991782 6181235 6384730 6603372 6838373 7091535
58879 7091535 7363792 7654414 7963191 8292277 8644490 9021117 9423161 9853405 10315104
58870A0315104M94445N27700N63765O04824O50097O97846P47993Q01052Q56143
58861A6258969R11861R67783J023452J076868J125432J167593J202141J226154
58853B4960253J234451J221057J181041J111576J011623Q80732P18989N29078
58845C2848800L17849R4740j30973l50554n54905p35777q88208j010516j102305
58836B8488151j164139j198729j210266j202230j177255j138867j091374j037799
58828A9267492r79517r18154q56201p95508p36812o81123o30157n84821n44241
58819A2540958n06837m71679m38791m08720l81760l57148l33505l10413k88656
58810I043449k68576k49480k31305k14972k00161j84853j68571j53672j41370
$$ plain form
58870 10315104 10809549 11337249 11901014 12505838 13155935 13853781 14601774 15402826 16258969
58861 16258969 17170830 18138613 19162065 20238933 21364365 22531958 23734099 24960253
58853 24960253 26194704 27415761 28596802 29708378 30720001 31600733 32319722 32848800
58845 32848800 33166649 33261389 33130416 32779862 32224957 31489180 30600972 29590456 28488151
58836 28488151 27324012 26125283 24915017 23712787 22535532 21396665 20305291 19267492
58828 19267492 18287975 17369821 16513620 15718112 14981300 14300177 13670020 13085199 12540958
58819 12540958 12034121 11562442 11123651 10714931 10333171 9976023 9642518 9332105 9043449
58810 9043449 8774873 8525393 8294088 8079116 7878955 7694102 7525531 7371859 7230489
58801G230489j28979j13882r7984q4859p4189o2826n0074l7878k6482j3940P6
58790F539472J3829K7096M1556N7155P1486Q3669R5774J09493J24165J39003J54637
58779G457335J71447J88621K05882K24302K44611K66174K88039L09677L31050
58770I687138L53420L79384M10012M42844M75087N07846N44408N85306O28355
58761A4013800O73019P21088P73123Q27621Q83685R40966R96784J046924J089673
58752B1966683J125528J152407J164674J157435J128113J073052R86739Q66308
58744C0620939P13985N34129L31283J12582j11429l30565n37409p25023q85674
58735B9722818j014183j110518j177432j217329j232505j226255j202389j165137
$$ plain form
58801 7230489 7101510 6987628 6889644 6804785 6730596 6667770 6617696 6579818 6553336 6539396 6539472
58790 6539472 6553301 6580397 6621953 6679108 6750594 6834263 6930037 7039530 7163695 7302698 7457335
58779 7457335 7628782 7817403 8023285 8247587 8492198 8758372 9046411 9356088 9687138
58770 9687138 10040558 10419942 10829954 11272798 11747885 12255731 12800139 13385445 14013800
58761 14013800 14686819 15407907 16181030 17008651 17892336 18833302 19830086 20877010 21966683
58752 21966683 23092211 24244618 25409292 26566727 27694840 28767892 29754631 30620939
58744 30620939 31334924 31869053 32200336 32312918 32201489 31870924 31333515 30608492 29722818
58735 29722818 28708635 27598117 26420685 25203356 23970851 22744596 21542207 20377070
58727B0377070j119676j070338j017838r60869r00825q42057p86895p33824o81541
58718A2263207o31649n85970n44279n06144m72146m41842m13297l86117l62317
58709G919446l42723l25020l06866k88494k70877k53722k36689k20404k05023
58700E469628j89843j75006j61369j48355j34672j21396j11087j03406r5213q5693
58690D143588p7362p1058o4284n6101m9308m5526m2316l7757l3985l3342l4458
58679C598091l5285l6806m0669m5852n0563n4872n8837o0771o0139n9449o0487
58668C034361o1358o0059n8151n7907n8407n7800n6973n7634n8875n8975n8602
58657B389620n8963n8687n5868n1648m8445m6135m3056l9415l6644l4563l2165
$$ plain form
58727 20377070 19257394 18187056 17169218 16208349 15307524 14465467 13678572 12944748 12263207
58718 12263207 11631558 11045588 10501309 9995165 9523019 9081177 8667880 8281763 7919446
58709 7919446 7576723 7251703 6944837 6656343 6385466 6131744 5895055 5674651 5469628
58700 5469628 5279785 5104779 4943410 4795055 4660383 4538987 4427900 4324494 4229281 4143588
58690 4143588 4066226 3995168 3930884 3874783 3825475 3779949 3737633 3699876 3665891 3632549 3598091
58679 3598091 3562806 3526000 3485331 3439479 3388916 3334044 3275207 3214436 3154297 3094848 3034361
58668 3034361 2973003 2912944 2854793 2796886 2738479 2680679 2623706 2566072 2507197 2448222 2389620
58657 2389620 2330657 2271970 2216102 2164454 2116009 2069874 2026818 1987403 1950759 1916196 1884031
58646A884031l0026k9197k8729k6993k4390k2348k0792j8968j7476j7076j6780
58635A631256j5520j4374j4704j5493j5049j3983j3866j4166j3309j1770j1368
58624A477654j2252j3063j3351j3498j2976j0962q064n379k545J253N027O863
58612A398707O639O179O993R183J1885J3738J3728J2589J2211J2945J2998J1458
58600A529253R981J0120J0867J0334Q263N545K975J734L235P144J1352J4878J8661
58587A644342K2697K5369K6904L0257L6629M3258M7805N1795N7188O2698O6652
58576B115594P0581P6627Q3704Q9774R5897J04534J15407J26344J36946J48475
58566C163883J61241J74681J88812K03335K16932K29713K44622K63957K86080
$$ plain form
58646 1884031 1854005 1824808 1796079 1769086 1744696 1722348 1701556 1682588 1665112 1648036 1631256
58635 1631256 1615736 1601362 1586658 1571165 1556116 1542133 1528267 1514101 1500792 1489022 1477654
58624 1477654 1465402 1452339 1438988 1425490 1412514 1401552 1393488 1388109 1385564 1386817 1391844 1398707
58612 1398707 1405346 1411525 1418518 1427701 1439586 1453324 1467052 1479641 1491852 1504797 1517795 1529253
58600 1529253 1539234 1549354 1560221 1570555 1578818 1584363 1587338 1589072 1592307 1599451 1610803 1625681 1644342
58587 1644342 1667039 1692408 1719312 1749569 1786198 1829456 1877261 1929056 1986244 2048942 2115594
58576 2115594 2186175 2262802 2346506 2436280 2532177 2636711 2752118 2878462 3015408 3163883
58566 3163883 3325124 3499805 3688617 3891952 4108884 4338597 4583219 4847176 5133256
58557E133256L07706L27426L44627L57166L62773L60796L49931L26416K87427
58548H157524K34504J71184R9407K1238n8170j32580j98250k53035k94261l20675
58538G426886l34741l40012l37694l28198l13777k96777k77410k56064k35579
58529D706634k18179k02447j86187j69911j54693j39373j23264j08729r7412q6751
58519C219688p4153o1800n3101m6979m0389l3961l0361k8912k6889k4450k3536
58508B775157k3243k1082j7558j5115j3924j3096j4426k0070k7998l4647m0738
58497B533260m9212n8569o3934o4228o2889o1531n8286n2764m7680m4669m2768
58486A926730m1520m1671m2324m1387l9183l8028l8003l6772l3650l0405k7954
$$ plain form
58557 5133256 5440962 5768388 6113015 6470181 6832954 7193750 7543681 7870097 8157524
58548 8157524 8392028 8563212 8662619 8683857 8625687 8493107 8294857 8041822 7747561 7426886
58538 7426886 7092145 6752133 6414439 6086241 5772464 5475687 5198277 4942213 4706634
58529 4706634 4488455 4286008 4099821 3929910 3775217 3635844 3512580 3403851 3306439 3219688
58519 3219688 3145535 3083735 3030634 2983655 2943266 2909305 2878944 2850032 2823143 2798693 2775157
58508 2775157 2751914 2730832 2713274 2698159 2684235 2671139 2656713 2636643 2608645 2573998 2533260
58497 2533260 2484048 2425479 2361545 2297317 2234428 2172897 2114611 2061847 2014167 1969498 1926730
58486 1926730 1885210 1843539 1801215 1759828 1720645 1682617 1644614 1607842 1574192 1543787 1515833
58475A515833k5708k3963k3522k3206k1198j8543j7814j8784j9017j8207j8290
58464A287581j9590k0542k0854k1400k1403j9317j6022j3665j1998r369o542n661
58452A101218o118n373l220j401K78L482P604J0492J2260J4510J6548J6495J5427
58439A182202J6246J8920K1071K2540K5100K8234K9572K9181K9165K9346K7530
58428A459107K3604J9295J4396P512n1n458q990j3324j8706k3054k6281l0102
58416A397948l3940l5299l3858l1397k8350k4363k1128k0593k1354k0852j9650
58405A107164j9402j8575j5077j1106j0131j0829r481o534n036m359j792J299
58393I96141J470P7J398M968O653O445Q107J1666J3533J3779J6017K0092K2124
$$ plain form
58475 1515833 1490125 1466162 1442640 1419434 1398236 1379693 1361879 1343095 1324078 1305871 1287581
58464 1287581 1267991 1247449 1226595 1205195 1183792 1164475 1148453 1134788 1122790 1113421 1106879 1101218
58452 1101218 1095100 1089727 1086507 1085106 1085384 1088866 1096470 1106962 1119222 1133732 1150280 1166775 1182202
58439 1182202 1198448 1217368 1238439 1260979 1286079 1314313 1343885 1373066 1402231 1431577 1459107
58428 1459107 1482711 1502006 1516402 1523914 1523863 1518405 1509415 1496091 1477385 1454331 1428050 1397948
58416 1397948 1364008 1328709 1294851 1263454 1235104 1210741 1189613 1169020 1147666 1126814 1107164
58405 1107164 1087762 1069187 1054110 1043004 1032873 1022044 1012563 1006029 1000993 996634 994842 996141
58393 996141 997611 997688 999086 1004054 1010707 1017152 1025259 1036925 1050458 1064237 1080254 1100346 1122470
58380A122470K1941K3371K6896K9092K9430L0309L0273K5036J5875R153O511L133
58368A373490l089q466j0960j3080j5686j6231j4892j5210j7057j6159j2040r058
58356A221562q103n039R37N309O695R301J4572J8131J7813J7132J7990J7341J3814
58343A347455J0471Q306M319j506m877n412q230j4398j7828j5225j1302j0405
58331A281368j0427q886p630p517n454o46K944L848N799R905J1443Q140M457L800
58317A291144L673K147J857L834M651L412M237Q143J0289Q877Q823J2500J5129
58304A378716J3745J2459J4136J5171J3463J3372J7291K0424J9428J8465K1024
58293A557694K3539K2739K1588K2180K0457J3996P543M904K794j579m569l592
$$ plain form
58380 1122470 1144411 1167782 1194678 1223770 1253200 1283509 1313782 1338818 1354693 1363846 1370357 1373490
58368 1373490 1370401 1361935 1350975 1337895 1322209 1305978 1291086 1275876 1258819 1242660 1230620 1221562
58356 1221562 1213459 1208420 1209357 1214666 1221361 1230662 1245234 1263365 1281178 1298310 1316300 1333641 1347455
58343 1347455 1357926 1366232 1370551 1369045 1364168 1358756 1350526 1336128 1318300 1303075 1291773 1281368
58331 1281368 1270941 1262055 1254425 1246908 1241454 1240808 1243752 1247600 1253399 1263304 1274747 1282887 1287344 1291144
58317 1291144 1294817 1296964 1298821 1302655 1307306 1310718 1314955 1323098 1333387 1342264 1351087 1363587 1378716
58304 1378716 1392461 1404920 1419056 1434227 1447690 1461062 1478353 1498777 1518205 1536670 1557694
58293 1557694 1581233 1603972 1625560 1647740 1668197 1682193 1689736 1694640 1697434 1695855 1691286 1687694
58281A687694k747m802n460j745J787J543J552N104P970O894O660J1366J6510
58268A732326J7363J7483K1209K5225K5515K5457K9011L2741L2506L1364L3186
58257B023386L5070L3701L2544L5148L7849L6289L2592K9376K3939J5212Q887
58246B343993Q542R354P455P150J1781J6220J6228J6374K0797K5028K5151K5836
58234B533909L0835L5001L4490L5186M1790M8462M9847N1409N8598O5920O7316
58223C052763O7453P1871P5956P5022P5153Q2390R0946R4016R6151J02822J08108
58212C992651J05403J00183R9229R7662Q9899Q2802Q3951Q7415Q5461Q3760R0222
58201D998638R9391J03311J07212J18812J32522J40377J47908J62824J78741J86997
$$ plain form
58281 1687694 1684947 1680145 1674685 1672940 1674727 1676270 1677822 1682926 1690896 1697790 1704450 1715816 1732326
58268 1732326 1749689 1767172 1788381 1813606 1839121 1864578 1893589 1926330 1958836 1990200 2023386
58257 2023386 2058456 2092157 2124701 2159849 2197698 2233987 2266579 2295955 2319894 2335106 2343993
58246 2343993 2352535 2361889 2369344 2376494 2388275 2404495 2420723 2437097 2457894 2482922 2508073 2533909
58234 2533909 2564744 2599745 2634235 2669421 2711211 2759673 2809520 2860929 2919527 2985447 3052763
58223 3052763 3120216 3192087 3268043 3343065 3418218 3500608 3591554 3685570 3781721 3884543 3992651
58212 3992651 4098054 4198237 4297466 4395128 4485027 4567829 4651780 4739195 4824656 4908416 4998638
58201 4998638 5098029 5201340 5308552 5427364 5559886 5700263 5848171 6010995 6189736 6376733
58191F376733J93699K07892K24168K34691K46602K68689K92767L07891L21228
58182H674360L44600L72341L93681M15035M47869M86207N18653N50989N93928
58173A2797663O40766O80685P21153P72458Q23843Q61158Q94329R39906R90892
58164B0122853J033237J077486J142826J224102J307064J401526J524695J665756
58156C0499545J802760J940524K095633K260188K419876K591213K799288L036147
58148D9445174L285437L568665L918740M328501M778364N293775N919175O660323
58140H7198154P516047Q539659R795347J1276611J2937054J4759884J6711282
58133A68734038J8690716K0668637K2845110K5545212K9015265L3431199L8798300
$$ plain form
58191 6376733 6570432 6778324 7002492 7237183 7483785 7752474 8045241 8353132 8674360
58182 8674360 9018960 9391301 9784982 10200017 10647886 11134093 11652746 12203735 12797663
58173 12797663 13438429 14119114 14840267 15612725 16436568 17297726 18192055 19131961 20122853
58164 20122853 21156090 22233576 23376402 24600504 25907568 27309094 28833789 30499545
58156 30499545 32302305 34242829 36338462 38598650 41018526 43609739 46409027 49445174
58148 49445174 52730611 56299276 60218016 64546517 69324881 74618656 80537831 87198154
58140 87198154 94714201 103253860 113049207 124325818 137262872 152022756 168734038
58133 168734038 187424754 208093391 230938501 256483713 285498978 318930177 357728477
58126C57728477M4209574M7073794M3866486L2634721J5059912m234261k0614126
58119E15724577l1809379l7966641m0273391l9915377l7862009l4890776l1521035
58112B61485969k8038477k4644698k1510513j8707823j6213677j4008136j2099103
58105A26263542j0455620q999929p681634o501001n452164m502167l639215k887779
58097G6144033k252227j682727j115883n13578J60791R57162J851255K612332
58089G6161158K815722K097918M81237j556110l380916m605818n218548n396736
58081F1397907n293718n001921m606978m184080l762677l347258k959480k624762
58073B9617033k336926k074029j836196j636040j465987j308014j165081j052247
$$ plain form
58126 357728477 401938051 449011845 492878331 525513052 540572964 536338703 515724577
58119 515724577 483915198 445948557 405675166 365759789 327897780 293007004 261485969
58112 261485969 233447492 208802794 187292281 168584458 152370781 138362645 126263542
58105 126263542 115807922 106807993 99126359 92625358 87173194 82671027 79031812 76144033
58097 76144033 73891806 72209079 71093196 70579618 70740409 71697571 73548826 76161158
58089 76161158 78976880 81074798 81556035 79999925 76619009 72013191 66794643 61397907
58081 61397907 56104189 51102268 46495290 42311210 38548533 35201275 32241795 29617033
58073 29617033 27280107 25206078 23369882 21733842 20267855 18959841 17794760 16742513
58065A6742513r65128q85754q12167p55388p13494o73954o35917o06455n80152
58056A0114104n45108n04239m69407m39576m05274l69195l42010l22687l02535
58047F414073k83712k74145k69096k57305k41157k31656k27422k17610k02115
58038D209855j90211j82016j69540j53809j43434j38108j30180j20607j16967
58029B864983j17691j14234j06953j03261j02234r6703q8445q5401q5661q0117
58019A884283o9652o3821o3388n9985n2725m9530n1637n1665m7912m6292m7269
58008A280407m4814l9210l7240l8598l5614k7756k3226k4463k4868k1729k0022
57997I42867k1265k0612j7321j6800j9917k1026j8608j7406j8322j6627j1990
$$ plain form
58065 16742513 15777385 14891631 14079464 13324076 12610582 11936628 11300711 10694256 10114104
58056 10114104 9568996 9064757 8595350 8155774 7750500 7381305 7039295 6716608 6414073
58047 6414073 6130361 5856216 5587120 5329815 5088658 4857002 4629580 4411970 4209855
58038 4209855 4019644 3837628 3668088 3514279 3370845 3232737 3102557 2981950 2864983
58029 2864983 2747292 2633058 2526105 2422844 2320610 2223907 2135462 2050061 1964400 1884283
58019 1884283 1814631 1750810 1687422 1627437 1574712 1525182 1473545 1421880 1373968 1327676 1280407
58008 1280407 1235593 1196383 1159143 1120545 1084931 1057175 1033949 1009486 984618 962889 942867
57997 942867 921602 900990 883669 866869 846952 825926 807318 789912 771590 754963 742973
57986G42973r904j1348j1130q188p413r519r166n174k701l243k134J819L767K135
57972F70774J358K960K836j78j673J06J592J497K917N953O501M120L193M549M119
57957G10624J392P75K880K984Q9r22J707L805L499L762M617J538n540j0074q998
57942G12138o998p616q093o477o049q675j0936j0749j1275j4489j7219j7134j6497
57929E69931j6533j4304q731l826k381j970l85N62j33K82L125N342M993M558N841
57914E46371O628N394M341M786M459K185M07L87k53k620m197m076n359r264j1815
57899E37374r789n657l388l332m130n692p430p306n305m330n566o631o072n539
57885D57207n682m390j277M38r61k860k929k509l148l705l355l816o236r122j1127
$$ plain form
57986 742973 733069 721721 710591 702403 694990 685471 676305 671131 668430 665187 663053 664872 668639 670774
57972 670774 672132 675092 677928 677750 676077 676183 677775 679272 682189 688142 694643 698763 701956 706505 710624
57957 710624 712016 712791 715671 718655 718744 717822 719529 723334 726833 730595 735212 736750 731210 721136 712138
57942 712138 705140 697524 689431 682954 676905 668230 657294 646545 635270 620781 603562 586428 569931
57929 569931 553398 539094 530363 526537 524156 522186 521801 522363 522230 522512 525637 530979 535972 540530 546371
57914 546371 552999 558393 562734 567520 571979 574164 574571 574958 574705 572085 567888 563812 558453 549189 537374
57899 537374 527585 521928 518540 515208 511078 505386 497956 490650 485345 481015 475449 468818 462746 457207
57885 457207 451525 447135 445858 446296 445335 442475 439546 437037 433889 430184 426829 423013 416777 407655 396528
57870C96528j2700j3692j3051j1904j2839j5080j4863j1683r323r294q574n655
57858B57870l538m121m675k725N1J594K926N140O972P839R411J1866J2621J0927
57844C12158R574R975R918Q322P563Q642Q748O382M309M404M141J477j104q96
57830C93613M66L03r28j963l720o673q535p783o468o729p555p612p904q959q719
57815C10834o092l370k510k231j138k24K17K237O090Q298O894M851N165O255N613
57800C40889M390M645N315M606L495L346K847N69j926k825l125m120m600l551
57786C49955k695l383l822k494j315k318m032m385m238m942n298m212l528m910
57772B98383o748p231p547q894r610q744r070j2609j6381j6805j5383j5480j6308
$$ plain form
57870 396528 383828 370136 357085 345181 332342 317262 302399 290716 281393 272099 263525 257870
57858 257870 254332 250211 245536 242811 242862 244456 247382 252522 259494 267333 276744 288610 301231 312158
57844 312158 321732 331707 341625 349947 357510 366152 374900 381282 385591 389995 394136 395613 394509 393613
57830 393613 394079 394382 393454 391491 387771 381098 372563 364780 358312 351583 344028 336416 328512 319553 310834
57815 310834 304742 301372 298862 296631 295493 295269 295486 297723 303813 312111 319005 323856 329021 335276 340889
57800 340889 345279 349924 355239 359845 363340 366686 369533 370102 368176 365351 362226 358106 353506 349955
57786 349955 347260 343877 340055 337561 336246 333928 329896 325511 321273 316331 311033 306821 303293 298383
57772 298383 291635 284404 276857 267963 258353 249609 240539 227930 211549 194744 179361 163881 147573
57759A47573j4905j1942j0527j0774j0264q766q170q573q319p274o588o011m662
57746C0798l366l288l396k192n40O1M32K024L931M769N725Q447J1634J3028J3209
57731H1276J3989J4586J2975R661O692M222J411o39l99Q56P94j52j34K00j262
57716A44076m175o362p526q788r462p944n232m065m835n528n237m660l622j343
57702F5297J231K440K901M546P021P999O937N671N327N335N403N935O402N433
57688A37878K611j331n553q789r297o933m033k234l4M168Q568J0436J0448J1202
57674A47107J2798J3391J3178J4144J6326J7751J7888J8087J8825J9527K0859
57663C29881K4066K8094L0355L0386L0194L1045L2519L4641L8051M1939M4415
$$ plain form
57759 147573 132668 120726 110199 99425 89161 80395 72225 63652 55333 48059 41471 35460 30798
57746 30798 27432 24144 20748 18556 18016 18077 18509 20533 24464 29233 34958 43405 55039 68067 81276
57731 81276 95265 109851 122826 132487 139179 143401 144812 144173 143774 144630 145424 145272 145138 145338 144076
57716 144076 139901 133539 126013 117225 107763 99819 94587 90522 85687 80159 74922 70262 66640 65297
57702 65297 66528 68968 71869 76415 83436 91435 98372 104043 109370 114705 120108 126043 132445 137878
57688 137878 140489 139158 133605 124816 115519 108586 104553 102319 102285 106453 115021 125457 135905 147107
57674 147107 159905 173296 186474 200618 216944 234695 252583 270670 289495 309022 329881
57663 329881 353947 382041 412396 442782 472976 504021 536540 571181 609232 651171 695586
57652F95586M5280M6308M8530N1263N3836N6500N9657O3850P0067P8363Q6854
57641A356094R3829J00156J07754J16782J26352J36799J48900J61888J74782J88741
57631B712077K05433K23912K41651K57945K73602K88077K99641L07652L11808
57622E121798L09596K97354K73617K39095J94195J39681P9538K0221l3247p8542
57612F563306j14107j38612j52090j55313j48712j34585j19807j13255j19880
57603E366945j38670j65197j93647k17457k31721k35782k31776k21133k04650
57594C526912j84867j65240j46857j28448j09383r0564p2719n6058m1198k8462
57584B503116j6880n563N051J5136K6630M0154N2965O2994P2741Q5547J00156
$$ plain form
57652 695586 740866 787174 835704 886967 940803 997303 1056960 1120810 1190877 1269240 1356094
57641 1356094 1449923 1550079 1657833 1774615 1900967 2037766 2186666 2348554 2523336 2712077
57631 2712077 2917510 3141422 3383073 3641018 3914620 4202697 4502338 4809990 5121798
57622 5121798 5431394 5728748 6002365 6241460 6435655 6575336 6654874 6675095 6641848 6563306
57612 6563306 6449199 6310587 6158497 6003184 5854472 5719887 5600080 5486825 5366945
57603 5366945 5228275 5063078 4869431 4651974 4420253 4184471 3952695 3731562 3526912
57594 3526912 3342045 3176805 3029948 2901500 2792117 2701553 2628834 2572776 2531578 2503116
57584 2503116 2486236 2480673 2485724 2500860 2527490 2567644 2620609 2683603 2756344 2841891 2942047
57573B942047J13333J25994J41717J60117J76928J90481K03177K16289K27892
57564D497975K36321K41099K39918K29068K07884J78793J42392R6728M2437j5593
57554F097022p2761j27012j75668k14484k41786k59967k71243k75246k72140k64444
57544C922271k53944k40188k23843k08230j95442j83794j71056j57580j44572
57535B143622j31941j19716j09196j00922r3643q6539q0255p4684o8246o0632
57525A217848n3811m9118m5659m2497l9891l7493l4095l0166k7782k7125k5950
57514H04261k3379k0921j8729j4674q827m932n015n860l589J028M608O068O871
57501G16910Q329J1038J5286K0027K3197K4676K6889L0911L4551L6183L7815M1959
$$ plain form
57573 2942047 3055380 3181374 3323091 3483208 3660136 3850617 4053794 4270083 4497975
57564 4497975 4734296 4975395 5215313 5444381 5652265 5831058 5973450 6070178 6112615 6097022
57554 6097022 6024261 5897249 5721581 5507097 5265311 5005344 4734101 4458855 4186715 3922271
57544 3922271 3668327 3428139 3204296 2996066 2800624 2616830 2445774 2288194 2143622
57535 2143622 2011681 1891965 1782769 1681847 1588204 1501665 1421410 1346726 1278480 1217848
57525 1217848 1164037 1114919 1069260 1026763 986872 949379 915284 885118 857336 830211 804261
57514 804261 780882 759961 741232 726558 717731 712799 707784 701924 698335 699363 703971 710039 716910
57501 716910 725239 736277 751563 771590 794787 819463 846352 877263 911814 947997 985812 1027771
57489A027771M7731N2704N6762O1557O7646P4495Q1980Q9919R7427J04540J12980
57478A875512J23582J34698J44782J54880J66589J79342J91521K02521K11741
57469C385168K17288K17699K13373K04221J87672J61223J25674Q3845L7643j1414
57459D822392o0343j05886j46732j82522k11631k32020k43413k46798k42601k31301
57449B919145k15227j97918j81800j67377j53886j39939j24635j09008r5182q3497
57439A450676p2104o0085m8815l9166k9938k0604j3033q236l743L035J0829J6807
57427A185623K1303K7074L4770M2322M8593N4934O2801P2014Q1693R1384J00976
57416A823487J10490J19958J29065J37458J45753J54984J64441J71563J74787
$$ plain form
57489 1027771 1075502 1128206 1184968 1246525 1314171 1388666 1470646 1560565 1657992 1762532 1875512
57478 1875512 1999094 2133792 2278574 2433454 2600043 2779385 2970906 3173427 3385168
57469 3385168 3602456 3820155 4033528 4237749 4425421 4586644 4712318 4796163 4833806 4822392
57459 4822392 4762049 4656163 4509431 4326909 4115278 3883258 3639845 3393047 3150446 2919145
57449 2919145 2703918 2506000 2324200 2156823 2002937 1862998 1738363 1629355 1534173 1450676
57439 1450676 1378572 1318487 1269672 1230506 1200568 1179964 1166931 1158695 1154952 1157987 1168816 1185623
57427 1185623 1206926 1234000 1268770 1311092 1359685 1414619 1477420 1549434 1631127 1722511 1823487
57416 1823487 1933977 2053935 2183000 2320458 2466211 2621195 2785636 2957199 3131986
57407C131986J74512J70067J57956J35315J03595O6647K6584j6241o0361j02797
57397C787263j41025j73483j98705k15843k25545k28878k26109k17912k06651
57388A953112j94721j82384j69014j55518j43664j33586j23807j13371j02640
57379F34407r2545q4219p8610p5073p1237o5596n9361E3318B554d4540m3602m1378
57367a29520m0288l8848l6162l2646k9329k7362k7352k8181k7459k4317k0675
57356d62139j8725j8342j8263j8192j8224j7548j5509j2989j1110r697q498q516
57344f37752j0246j1922j1598r982r133r260q921p677o436n614m896m496n031
57331g42964o311p544q367q689q260p461p350p892p451n493m162n408p950r158
$$ plain form
57407 3131986 3306498 3476565 3634521 3769836 3873431 3940078 3966662 3950421 3890060 3787263
57397 3787263 3646238 3472755 3274050 3058207 2832662 2603784 2377675 2159763 1953112
57388 1953112 1758391 1576007 1406993 1251475 1107811 974225 850418 737047 634407
57379 634407 541862 457643 379033 303960 232723 167127 107766 53318 2554 -44540 -88142 -129520
57367 -129520 -169808 -208656 -244818 -277464 -306793 -334155 -361507 -389688 -417147 -441464 -462139
57356 -462139 -480864 -499206 -517469 -535661 -553885 -571433 -586942 -599931 -611041 -620738 -629236 -637752
57344 -637752 -647998 -659920 -671518 -681500 -690633 -699893 -708814 -716491 -722927 -728541 -733437 -737933 -742964
57331 -742964 -749275 -756819 -765186 -773875 -782135 -789596 -796946 -804838 -812289 -817782 -821944 -827352 -835302 -844460
57317h44460q787q584r038q897p512n743m740n090o649q081p624n590m690o324
57303i41809q078o932l571j112p58j131j210j331j626j672j601j881k222k132
57289i77066j959k100k059j702k230m279o265o430n294m252l161j498m39j221
57275a019955k629k687j822j674j804o34J001M38k638n465n834m234k158m77M43
57260a050129Q16J714L664N361N417M706N107O600P628P729P747P941P973Q209
57246i69517R092R936J0267J1397J4314J7074J7029J4925J4015J5603J8185K0643
57234g97037K3364K6298K8708L0976L4086L7205L8291L7281L6315L6487L6622
57223d31404L5526L3382L0688K7747K5350K4175K3427K1669J8631J4695R291J835
$$ plain form
57317 -844460 -853247 -861831 -870869 -879766 -887278 -893021 -897761 -902851 -909500 -917581 -925205 -930795 -935485 -941809
57303 -941809 -949887 -956819 -960390 -961502 -962260 -963391 -964601 -965932 -967558 -969230 -970831 -972712 -974934 -977066
57289 -977066 -979025 -981125 -983184 -984886 -987116 -991395 -997660 -1004090 -1009384 -1013636 -1016797 -1018295 -1018734 -1019955
57275 -1019955 -1022584 -1025271 -1027093 -1028767 -1030571 -1031205 -1030204 -1029766 -1032404 -1037869 -1043703 -1047937 -1050095 -1050572 -1050129
57260 -1050129 -1049313 -1047599 -1043935 -1038574 -1033157 -1028451 -1023344 -1016744 -1009116 -1001387 -993640 -985699 -977726 -969517
57246 -969517 -960425 -950489 -940222 -928825 -914511 -897437 -880408 -865483 -851468 -835865 -817680 -797037
57234 -797037 -773673 -747375 -718667 -687691 -653605 -616400 -578109 -540828 -504513 -468026 -431404
57223 -431404 -395878 -362496 -331808 -304061 -278711 -254536 -231109 -209440 -190809 -176114 -166823 -164988
57211a64988o441j3756k0230k6861l2800l6142l6894l6622l5688l3524l1134l0385
57199e05465l0861l0131k7265k3742k0872j8791j7779j8097j8417j6823j3434
57188g41677r891o529k346K525O749J0045J3288J6598J9541K2632K6283K8897
57176f13885K8578K6129K3694K1235J7267J2418Q942O963M508J344k50J203N043
57163d56811J0394J6939K3836L0400L7527M6090N4514O0430O3905d6503B0492
57151H5248O0522N6255N1602M5447L9433L5910L3546K9324K3947K0679J9632J8131
57139E19676J6266J6790J9579K1482K2050K4182K8509L2261L4480L7236M0554
57128H13065M1251L8211L4048L0289K5597K0122J6669J5870J4774J1943R437Q120
$$ plain form
57211 -164988 -171429 -185185 -205415 -232276 -265076 -301218 -338112 -374734 -410422 -443946 -475080 -505465
57199 -505465 -536326 -566457 -593722 -617464 -638336 -657127 -674906 -693003 -711420 -728243 -741677
57188 -741677 -751568 -758097 -760443 -757918 -751169 -741124 -727836 -711238 -691697 -669065 -642782 -613885
57176 -613885 -585307 -559178 -535484 -514249 -496982 -484564 -475622 -468659 -464151 -462807 -463057 -461854 -456811
57163 -456811 -446417 -429478 -405642 -375242 -337715 -291625 -237111 -176681 -112776 -46503 20492
57151 85248 145770 202025 253627 299074 338507 374417 407963 437287 461234 481913 501545 519676
57139 519676 535942 552732 572311 593793 615843 640025 668534 700795 735275 772511 813065
57128 813065 854316 892527 926575 956864 982461 1002583 1019252 1035122 1049896 1061839 1071276 1079396
57116A079396N584O36m451p939j0643j2459j1332p385l765j689R92M730O607N487
57102A043769M149M270L914J961K59q42m145j0348j5793j8205k0211k4404k9250
57089I35124l2649l5521l9075m2423m5396m9990n6800o3671o9801p7150q6236
57078C36412r4851j02651B6491i8513j37770j49450j61703j73942j82216j85370
57068a088964j87415j92087k00045k12669k32651k59250k88835l21452l60482
57059c343850m04818m48533m89751n32486n78511o25781o76355p36809q08693
57050h645587q87651r73890j073516j187341j308791j434825j567234j701231
57042a8780066j826298j942119k060633k189644k328875k483206k660942k856328
$$ plain form
57116 1079396 1084980 1085616 1081165 1073226 1062583 1050124 1038792 1031407 1027642 1025953 1026945 1031675 1038282 1043769
57102 1043769 1047918 1052188 1056102 1058063 1058322 1057480 1053335 1042987 1027194 1008989 988778 964374 935124
57089 935124 902475 866954 827879 785456 740060 690070 633270 569599 499798 422648 336412
57078 336412 241561 138910 26491 -98513 -236283 -385733 -547436 -721378 -903594 -1088964
57068 -1088964 -1276379 -1468466 -1668511 -1881180 -2113831 -2373081 -2661916 -2983368 -3343850
57059 -3343850 -3748668 -4197201 -4686952 -5219438 -5797949 -6423730 -7100085 -7836894 -8645587
57050 -8645587 -9533238 -10507128 -11580644 -12767985 -14076776 -15511601 -17078835 -18780066
57042 -18780066 -20606364 -22548483 -24609116 -26798760 -29127635 -31610841 -34271783 -37128111
57034c7128111l056098l268577l523826l843855m243134m751743n373610o001061
57026g1190015o461994o747402p148770q030645r396753j0718191j1226310j0374954
57018a41295034q078692m658499o71858L256891O602251R062730J0571629J1206789
57010a14003793J1100280J0409732R326489Q076840O897405N980679N412180N152491
57002e1647697N090247N115965N150986N136382N030701M823333M530828M174539
56994a2594716L771879L346162b549341a1760B173700J874556J606785J376531
56986G031572J172975R91747Q36462P08092O01310N11913M39043L79038L25585
56977A2997737K77431K38283K07886J80714J54562J32744J16321J01265Q5080
$$ plain form
57034 -37128111 -40184209 -43452786 -46976612 -50820467 -55063601 -59815344 -65188954 -71190015
57026 -71190015 -77652009 -84399411 -91548181 -99578826 -108975579 -119693770 -130920080 -141295034
57018 -141295034 -149373726 -154032225 -154704083 -151447192 -144844941 -135782211 -125210582 -114003793
57010 -114003793 -102903513 -92493781 -83167292 -75090452 -68193047 -62212368 -56800188 -51647697
57002 -51647697 -46557450 -41441485 -36290499 -31154117 -26123416 -21300083 -16769255 -12594716
56994 -12594716 -8822837 -5476675 -2549341 -11760 2173700 4048256 5655041 7031572
56986 7031572 8204547 9196294 10032756 10740848 11342158 11854071 12293114 12672152 12997737
56977 12997737 13275168 13513451 13721337 13902051 14056613 14189357 14305678 14406943 14492023
56968A4492023O9518N5036L8985K1157N196p392j9128l1030m0728m7633n4618
56957A4481386o2911p0551p7633q7984j03490j21229j38106j54049j68776j79829
56947A3316828j86187j90445j95442k01606k08713k16771k23908k26977k25665
56938A1441114k22246k15620j99936j73235j45861j36756j59965k13703k80771
56929I693021l39343l75961l90528l90295l80946l64346l41934l16433k90482
56920F502753k66220k45923k30685k18872k08001j97514j87704j77255j64610
56911D605969j50817j38194j26952j15786j04838r5221q6512p7607o9218o2613
56901C578211n6750m9626m1527l4124k7629k2088j9955k3440l0191l5607l8783
$$ plain form
56968 14492023 14561541 14616577 14655562 14676719 14681915 14674523 14655395 14624365 14583637 14536004 14481386
56957 14481386 14418475 14347924 14270291 14182307 14078817 13957588 13819482 13665433 13496657 13316828
56947 13316828 13130641 12940196 12744754 12543148 12334435 12117664 11893756 11666779 11441114
56938 11441114 11218868 11003248 10803312 10630077 10484216 10347460 10187495 9973792 9693021
56929 9693021 9353678 8977717 8587189 8196894 7815948 7451602 7109668 6793235 6502753
56920 6502753 6236533 5990610 5759925 5541053 5333052 5135538 4947834 4770579 4605969
56911 4605969 4455152 4316958 4190006 4074220 3969382 3874161 3787649 3710042 3640824 3578211
56901 3578211 3521461 3471835 3430308 3396184 3368555 3346467 3326512 3303072 3272881 3237274 3198491
56890C198491m2163m5945m7326m5386m2568m0713l9321l8119l7689l6967l3604
56879B748690k7548k1271j6119j1421p243m549k273K236R122J5339J8270J7089
56867B720322J0724j476j6459k8715l6103m1320m6666n0728n1427m9168m5384
56856B363600m0736l6143l3171l1951l0758k8630k6504k5148k4164k3388k3082
56845B039925k2317j9665j5816j3050j1838j0571q793p764p465o112l296o42J267
56832A913863L654O608Q547R410J1166J4170J6280J6718J7423J9070J9082J5599
56820B071590J0470O247K890m59k956l776m237n744p248o936n137l498k319o14
56806B048273J985M876P554J0047J2947J7398K3987L1074L5443L4906K9250J8922
$$ plain form
56890 3198491 3156328 3110383 3063057 3017671 2975103 2934390 2895069 2856950 2819261 2782294 2748690
56879 2748690 2721142 2699871 2683752 2672331 2665088 2660539 2658266 2660502 2669624 2684963 2703233 2720322
56867 2720322 2731046 2729570 2713111 2684396 2648293 2606973 2560307 2509579 2458152 2408984 2363600
56856 2363600 2322864 2286721 2253550 2221599 2190841 2162211 2135707 2110559 2086395 2063007 2039925
56845 2039925 2017608 1997943 1982127 1969077 1957239 1946668 1937875 1930111 1922646 1916534 1913238 1912596 1913863
56832 1913863 1917517 1924125 1932672 1942082 1953248 1967418 1983698 2000416 2017839 2036909 2055991 2071590
56820 2071590 2082060 2088307 2091197 2090738 2087782 2084006 2079769 2074025 2066777 2059841 2054704 2051206 2048887 2048273
56806 2048273 2050258 2055134 2062688 2072735 2085682 2103080 2127067 2158141 2193584 2228490 2257740 2276662
56794B276662M892j0048k2193l0014l4620l6779l5715l1388k5632j9842j3661
56783B021662o870o46M298Q951J4378K0491K7180L4810M2775M9400N4020N7002
56771B327451N6893N0088L4889J4100p686k7426m3200n2938n5985n4494n1304
56760B190388m7249m1862l5528k9297k3381j7292j0996m919Q28O518J2620J9671
56748B019501K7522L4465L8118L7225L1704K1355O387j0749k6074l7277m4804
56737B097373m9655n1805n1151m8181m3282l6903l0555k5807k2147j7666j2070
56726A708151o896k708J515N963R491J2098J5191J8450J8915J4400N881m397j4917
56713A781137k4088k9901l1851l1487l0097k7632k4565k2499k1921k1519k0652
$$ plain form
56794 2276662 2281554 2271506 2249313 2219299 2184679 2147900 2112185 2080797 2055165 2035323 2021662
56783 2021662 2014792 2014146 2018444 2027395 2041773 2062264 2089444 2124254 2167029 2216429 2270449 2327451
56771 2327451 2384344 2434432 2469321 2483421 2475735 2448309 2405109 2352171 2296186 2241692 2190388
56760 2190388 2143139 2101277 2065749 2036452 2013071 1995779 1984783 1979864 1980692 1987210 1999830 2019501
56748 2019501 2047023 2081488 2119606 2156831 2188535 2209890 2216277 2205528 2179454 2142177 2097373
56737 2097373 2047718 1995913 1944762 1896581 1853299 1816396 1785841 1760034 1737887 1720221 1708151
56726 1708151 1701255 1698547 1700062 1706025 1715516 1727614 1742805 1761255 1780170 1794570 1800451 1796054 1781137
56713 1781137 1757049 1727148 1695297 1663810 1633713 1606081 1581516 1559017 1537096 1515577 1494925
56702A494925k0273k0351j8925j5094j0790q186p416p953r805j1836j1418p812
56690A345066m018l225n065p045q059q534q468p296n121k896j807k771n351p126
56676A268284o030l423k618m062m827l425j944k175k902k852l281n224o807n955
56662A212759l753k621k915l538m290n269n508m363l013k677k779k542k785m216
56648A162490n496n109l638k403j283J07O49o47k522l015k139j227p25l46k71
56633A134425n03j77Q92J266K8j379j163K00R05K97j079k685l958m271m023m348
56617A114427m954m231k365j888l594m715l185j028j018k261k099n46L16O7J12
56602A083038J038K300L804N570O667O499O197P058Q902J1612J6381K3206K9178
$$ plain form
56702 1494925 1474652 1454301 1435376 1420282 1409492 1401306 1393890 1385937 1376132 1364296 1352878 1345066
56690 1345066 1341048 1337823 1332758 1325713 1317654 1309120 1300652 1293356 1288235 1285339 1283532 1280761 1275410 1268284
56676 1268284 1262254 1258831 1256213 1252151 1247324 1243899 1241955 1239780 1236878 1234026 1230745 1225521 1218714 1212759
56662 1212759 1209006 1206385 1203470 1199932 1195642 1190373 1184865 1180502 1177489 1174812 1172033 1169491 1166706 1162490
56648 1162490 1156994 1151885 1148247 1145844 1144561 1144668 1145317 1144670 1142148 1139133 1136994 1135767 1135042 1134696 1134425
56633 1134425 1133922 1133745 1134637 1135903 1135931 1134552 1133389 1133589 1134494 1134791 1133712 1131027 1127069 1122798 1118775 1114427
56617 1114427 1109473 1105242 1102877 1100989 1097395 1092680 1089495 1088467 1087449 1085188 1083089 1082543 1082859 1082926 1083038
56602 1083038 1084076 1086376 1090180 1095750 1102417 1108916 1115113 1122171 1131073 1142685 1159066 1182272 1211450
56589A211450L2038L3799L7761M3209M6377M5820M3540M0937L6676K8894J7515
56578A618016M215q163j6616k0244k1342k2788k4949k6515k7158k7422k7050k5631
56566A374353k4304k4675k6408k7488k6561k3706j9666j5702j3341j2829j2658
56555A147015j1711j0697j0329r787q341o914o344n833m822m581n954p243o504
56542A047955m432k900k134j366p72p86r07r23j558k412j620P21J506o37k641
56527A027094j807k42j019k799k496p60l69j065n45P92P25l09l9J187J143J91
56511A019682O72K410L054K456K429K606J049j201q70K000L806L302L318N565
56497A050278P918Q220P114N715L776J513K61J07m50j553j418M68K195K312J266
$$ plain form
56589 1211450 1243488 1277287 1315048 1358257 1404634 1450454 1493994 1534931 1571607 1600501 1618016
56578 1618016 1622231 1614068 1597452 1577208 1555866 1533078 1508129 1481614 1454456 1427034 1399984 1374353
56566 1374353 1350049 1325374 1298966 1271478 1244917 1221211 1201545 1185843 1172502 1159673 1147015
56555 1147015 1135304 1124607 1114278 1104491 1096150 1089236 1082892 1077059 1072237 1067656 1061702 1054459 1047955
56542 1047955 1043523 1040623 1038489 1037123 1036351 1035565 1034658 1033735 1032177 1029765 1028145 1028866 1030372 1029735 1027094
56527 1027094 1025287 1025045 1024026 1021227 1018731 1017971 1017602 1016537 1015992 1016784 1017509 1017200 1017161 1018348 1019491 1019682
56511 1019682 1020354 1022764 1025818 1028274 1030703 1033309 1034358 1033157 1032287 1034287 1038093 1041395 1044713 1050278
56497 1050278 1058196 1066416 1073530 1079245 1083021 1084534 1084795 1084902 1084452 1082899 1081481 1081949 1084144 1086456 1087722
56482A087722m18k849n014n125l437k239k534l137l330l766m454m515m245m742
56468A037917n269m061j896j694l957n717m904k828j494j219j832l528n558o449
56454I87511o208o148o264n387m027m041n126m840k782j507k351l458l169k476
56440I29727k744l576m160m462m130k529n43k5q50j097n35r58k400k247O58L955
56424I04084N150M523L402K211J372J724K760K744J577J223K442L672L997M505
56410I45386N694O281N774N522N953N558L851K759L450M358L850K516J314j33
56396A002133j909k691j913r40p19l92M95O50n96j726j383l39K78P53J414J493
56380I94608Q20Q09K204L466K883R04q06j392r27Q0N79l78k233l487l772l894
$$ plain form
56482 1087722 1087304 1084455 1079441 1074316 1070879 1068640 1066106 1062969 1059639 1055873 1051419 1046904 1042659 1037917
56468 1037917 1032648 1028587 1026691 1024997 1021040 1015323 1010419 1007591 1006097 1004878 1003046 999518 993960 987511
56454 987511 981303 975155 968891 963504 959477 955436 950310 945470 942688 941181 938830 935372 932203 929727
56440 929727 926983 923407 919247 914785 910655 908126 907583 907558 906708 905611 905076 904118 901718 899471 900129 904084
56424 904084 909234 913757 917159 919370 920742 922466 925226 927970 929547 930770 933212 936884 940881 945386
56410 945386 951080 957361 963135 968657 974610 980168 984019 986778 990228 994586 998436 1000952 1002266 1002133
56396 1002133 1000224 997533 995620 994680 993961 993569 994064 994714 994118 992392 991009 990670 990948 991701 993115 994608
56380 994608 995428 996237 998441 1001907 1004790 1005694 1004888 1003496 1002569 1002649 1003228 1002850 1000617 997130 993358 989464
56364I89464l945l253k158j740j910j893k211l640m696l275m86N46l99o34M01
56349I60171K31j790k975j946p90r43q60M37J079j44j344q02L60Q40J500K945
56333I55969L594K453J116R58Q77q8o07L05R77k47k354l817n327q060j1109j2614
56317I22026j2023r684n925j741J333L031M296M942L907K146K273M418N679M633
56303I29311L202K878K594J664J289J666J129k39J57K912N099N046M706N293M829
56288I71536K526J324L010M737L859K518L752O264O924N791M945M765M708N668
56274A032327Q225J0651J1474J1925J3253J4046J2992J1702J1971J2708J2425
56263A163699J2184J3199J4058J3299J2200J2098J1666R685P809P472O978M865
$$ plain form
56364 989464 985519 982266 980108 978368 976458 974565 972354 968714 964018 960743 960257 960803 960404 959770 960171
56349 960171 960402 958612 955637 953691 952901 951958 951098 951535 952614 952470 951126 950324 950684 951524 953024 955969
56333 955969 959563 962016 963132 964090 964967 964879 964272 964577 965554 965307 962953 959136 953809 945749 934640 922026
56317 922026 910003 900319 894394 892653 893986 897017 901313 906255 910162 912308 914581 918999 924678 929311
56303 929311 932513 935391 937985 939649 940938 942604 943733 943494 943651 946563 951662 956708 961414 966707 971536
56288 971536 974062 975386 978396 983133 986992 989510 993262 999526 1006450 1012241 1017186 1021951 1026659 1032327
56274 1032327 1040552 1051203 1062677 1074602 1087855 1101901 1114893 1126595 1138566 1151274 1163699
56263 1163699 1175883 1189082 1203140 1216439 1228639 1240737 1252403 1262088 1269897 1277369 1284347 1289212
56251A289212L251M198N625M696K695K495L535L411K507K836L934L882L071L273
56237A338621M213M504M804O691R570J1620J2732J3823J4731J5258J6598J9281
56225A472446K1702K3128K5621L0289L4402L5520L5762L8341M2316M4742M5960
56214A850229M8655N3301N8296O3289O8935P4791Q0539Q7626R6672J05313J11792
56203B699438J18484J28413J40444J51530J61670J72728J84354J94987K05194
56194D157242K16171K26383K33364K37298K39419K38440K32203K21109K06480
56185F208109J87287J62222J33379J04267P5605M6495J7978q053l1781n3918p2989
56174F768601q7491r8835j08902j16856j21623j25156j29541j33436j35126j36630
$$ plain form
56251 1289212 1292463 1296661 1302286 1306982 1309677 1312172 1315707 1319118 1321625 1324461 1328395 1332277 1335348 1338621
56237 1338621 1342834 1347338 1352142 1358833 1368403 1380023 1392755 1406578 1421309 1436567 1453165 1472446
56225 1472446 1494148 1517276 1542897 1573186 1607588 1643108 1678870 1717211 1759527 1804269 1850229
56214 1850229 1898884 1952185 2010481 2073770 2142705 2217496 2298035 2385661 2482333 2587646 2699438
56203 2699438 2817922 2946335 3086779 3238309 3399979 3572707 3757061 3952048 4157242
56194 4157242 4373413 4599796 4833160 5070458 5309877 5548317 5780520 6001629 6208109
56185 6208109 6395396 6557618 6690997 6795264 6870869 6917364 6935342 6927289 6895508 6841590 6768601
56174 6768601 6681110 6582275 6473373 6356517 6234894 6109738 5980197 5846761 5711635 5575005
56164E575005j40722j46240j50527j54160j58990j63820j66423j67562j68676
56155D157885j67885j62851j55506j49304j43884j37008j29466j23286j17210
56146B871485j08960j00039r3347q7859q0652p2311o5488n9949n3911m8380m5067
56135B055522m2051l6664l0765k7849k6830k4179k0342j8374j7827j5782j2612
56124A782247j0929r958o653j425K524M702P004R121R396R022J0341J2233J2123
56111A829748J0994J1389J2404J1720J0545J1027J1085P814L775L583O181P049
56099A937314O121O790Q760Q886P867R167J2332J4161J5399J9414K5293K9123
56087B100627L1300L5770M2943N0024N7211O6631P6304Q2422Q6718R4248J04936
$$ plain form
56164 5575005 5434283 5288043 5137516 4983356 4824366 4660546 4494123 4326561 4157885
56155 4157885 3990000 3827149 3671643 3522339 3378455 3241447 3111981 2988695 2871485
56146 2871485 2762525 2662486 2569139 2481280 2400628 2328317 2262829 2202880 2148969 2100589 2055522
56135 2055522 2013471 1976807 1946042 1918193 1891363 1867184 1846842 1828468 1810641 1794859 1782247
56124 1782247 1771318 1761360 1754707 1753282 1755806 1760508 1767512 1776633 1786029 1795051 1805392 1817625 1829748
56111 1829748 1840742 1852131 1864535 1876255 1886800 1897827 1908912 1916726 1920501 1924084 1930265 1937314
56099 1937314 1943435 1950225 1958985 1967871 1975738 1984905 1997237 2011398 2026797 2046211 2071504 2100627
56087 2100627 2131927 2167697 2210640 2260664 2317875 2384506 2460810 2543232 2629950 2724198 2829134
56076B829134J14699J23857J36391J51486J63741J71403J76467J77079J68473
56067D212730J51922J34852J21360J09934J00301R4232Q8917P7804N9410L8360
56057E189822J7160n637k8669m6987n9242o8939p8114q6518r6667j11956j29413
56046D494840j41819j47384j50164j51325j47821j39634j30360j20561j08275
56037C257497r5848q8068q3796p7548o8878o1991n6960n0252m2978l9223l6985
56026B554970l0671k1860j7319j6912j4262q982o911q070o144o05K370K056M309
56013B431969R320J0524P373O992J0960J2798J1019J2160J7793K1006J9278J8867
56001B590059K2625K5277K4526K5187K8516K9012K5652K4899K8915L2224L3279
$$ plain form
56076 2829134 2943833 3067690 3204081 3355567 3519308 3690711 3867178 4044257 4212730
56067 4212730 4364652 4499504 4620864 4730798 4831099 4925331 5014248 5092052 5151462 5189822
56057 5189822 5206982 5201345 5172676 5125689 5066447 4997508 4919394 4832876 4736209 4624253 4494840
56046 4494840 4353021 4205637 4055473 3904148 3756327 3616693 3486333 3365772 3257497
56037 3257497 3161649 3073581 2989785 2912237 2843359 2781368 2724408 2674156 2631178 2591955 2554970
56026 2554970 2524299 2502439 2485120 2468208 2453946 2444964 2438053 2429983 2423839 2423234 2425604 2427660 2431969
56013 2431969 2441289 2451813 2459186 2466178 2477138 2489936 2500955 2513115 2530908 2551914 2571192 2590059
56001 2590059 2612684 2637961 2662487 2687674 2716190 2745202 2770854 2795753 2824668 2856892 2890171
55990B890171L7465M5259M9676M9001M9767N3740N4637N1388N1450N6909O0515
55979C449978N9624O0790O6267O9639O9173P1730P8881Q3179Q2724Q4979R1684
55968D268648R4978R3287R5538J04288J10525J10794J13285J21134J26286J26353
55958E365116J30518J41799J50514J52570J57065J68360J78327J83988J94690
55949F822947K13435K29452K37943K48962K68119K87037L01438L19407L43286
55940I272026L63515L79011M02568M37194M69291M94513N26751N71415O14513
55931A3530797O49288O87907P34695P74603Q01699Q31994Q74113R15341R51201
55922B0751638R99367J068748J145220J223986J323331J448963J578782J701491
$$ plain form
55990 2890171 2927636 2972895 3022571 3071572 3121339 3175079 3229716 3281104 3332554 3389463 3449978
55979 3449978 3509602 3570392 3636659 3706298 3775471 3847201 3926082 4009261 4091985 4176964 4268648
55968 4268648 4363626 4456913 4552451 4656739 4767264 4878058 4991343 5112477 5238763 5365116
55958 5365116 5495634 5637433 5787947 5940517 6097582 6265942 6444269 6628257 6822947
55949 6822947 7036382 7265834 7503777 7752739 8020858 8307895 8609333 8928740 9272026
55940 9272026 9635541 10014552 10417120 10854314 11323605 11818118 12344869 12916284 13530797
55931 13530797 14180085 14867992 15602687 16377290 17178989 18010983 18885096 19800437 20751638
55922 20751638 21751005 22819753 23964973 25188959 26512290 27961253 29540035 31241526
55914C1241526J834707J986439K138333K288203K466716K688124K929386L183752
55906E0757186L486369L858067M277081M740157N296529N985640O801414P755478
55898I2957921Q903989J0262940J1770664J3386359J5145925J7076263J9172666
55891A88676727K1532481K4366580K7769625L1627070L5809827M0046195M3129433
55884D12957938M2514503L5615654K2120536M879640j1817717k4870538l3430934
55877D47969082l8075194l9662532l8970514l6758773l3685460l0184308k6549212
55870B04083089k3052662j9893000j7121927j4720788j2691925j1020529r624233
55863I5958025q415575p370684o489008n736645n078238m519294m069587l700705
$$ plain form
55914 31241526 33076233 35062672 37201005 39489208 41955924 44644048 47573434 50757186
55906 50757186 54243555 58101622 62378703 67118860 72415389 78401029 85202443 92957921
55898 92957921 101861910 112124850 123895514 137281873 152427798 169504061 188676727
55891 188676727 210209208 234575788 262345413 293972483 329782310 369828505 412957938
55884 412957938 455472441 491088095 513208631 518088271 506270554 481400016 447969082
55877 447969082 409893888 370231356 331260842 294502069 260816609 230632301 204083089
55870 204083089 181030427 161137427 144015500 129294712 116602787 105582258 95958025
55863 95958025 87542450 80171766 73682758 67946113 62867875 58348581 54278994 50578289
55855E0578289l378091l099617k867464k656550k445237k246450k076940j924516
55847B9883424j774008j636673j524974j424566j318881j217522j134663j061897
55839A8790240r86724r16392q60261q09032p53322p03167o68044o36487n95904
55830A1860907n54488n23800m97221m64909m33509m12107l94284l71959l51973
55821G856657l41630l32500l15351k97073k86523k77427k61197k43323k31510
55812E270123k20552k04176j89083j82234j76551j64158j51813j48333j48235
55803C684988j42416j34226j30496j27133j17840j07252j01698r6375q4785p1562
55793B571205o3272n6042m5061l6734l8152m3599m4420m3780m8514n4651n4236
$$ plain form
55855 50578289 47200198 44100581 41233117 38576567 36131330 33884880 31807940 29883424
55847 29883424 28109416 26472743 24947769 23523203 22204322 20986800 19852137 18790240
55839 18790240 17803516 16887124 16026863 15217831 14464509 13761342 13093298 12456811 11860907
55830 11860907 11306419 10782619 10285398 9820489 9386980 8974873 8580589 8208630 7856657
55821 7856657 7515027 7182527 6867176 6570103 6283580 6006153 5744956 5501633 5270123
55812 5270123 5049571 4845395 4656312 4474078 4297527 4133369 3981556 3833223 3684988
55803 3684988 3542572 3408346 3277850 3150717 3032877 2925625 2823927 2727552 2642767 2571205
55793 2571205 2507933 2451891 2406830 2370096 2331944 2288345 2243925 2200145 2151631 2096980 2042744
55782B042744m9290m6465m4726m0297l6899l9102m2197m0083l6719l8518m2081
55771A586367m0846l7419l7914m0126l8558l5328l4987l4336k8594k2156k1860
55760A214243k4587k2794j7829j6563j8670j8156j4421j1665j0155p376m914n497
55748A041616o224l071J210J678JP33K647J800n58j014j223m353q191r344j0254
55733A005453j4381j8614j8359j6107j6884j9216j8572j6037j5379j5194j2055
55722H24655q114p539q630p223m730n061o834o424n665q677j3791j6226j6193
55709G09548j7104j8413j7386j5279j4894j4791j2518j0253j0596j0546o889l566
55697E57313n845j0820j1984r974j0146j2287j1714q618p420q081o339j900J230
$$ plain form
55782 2042744 1993454 1946989 1902263 1861966 1825067 1785965 1743768 1703685 1666966 1628448 1586367
55771 1586367 1545521 1508102 1470188 1430062 1391504 1356176 1321189 1286853 1258259 1236103 1214243
55760 1214243 1189656 1166862 1149033 1132470 1113800 1095644 1081223 1069558 1059403 1052027 1047113 1041616
55748 1041616 1035392 1032321 1033531 1035209 1035210 1035943 1038590 1040390 1039832 1038818 1037595 1033242 1025051 1015707 1005453
55733 1005453 991072 972458 954099 937992 921108 901892 883320 867283 851904 836710 824655
55722 824655 816541 809002 800372 793149 788419 783358 776524 770100 764435 755758 741967 725741 709548
55709 709548 692444 674031 656645 641366 626472 611681 599163 588910 578314 567768 560879 557313
55697 557313 551468 540648 528664 518690 508544 496257 484543 475925 468505 460424 454085 452185 453415
55684D53415J960K603K997R03k633m467m868n915o258l503K41J419J333L036M623
55669D44886K639m71Q5K548J251l581o530o339o587p968p709o143o291p154m851
55654C87785k66J683M73M66K784L888K779K725M884O613O956P838R048P961N013
55639D50630L772M943N704N356O017P314O139K434j60k17J2n45n33k18j596l953
55623D85099m216k255r76r09L36K901M063L325L245M520M845L422K255K390K903
55608E10948L679N268O147M334J315J66M42m56j708j80L368M632K377l74j825
55593E38133k974l673k463n83j149l909n663n957p306r820j0960j0865j2333j4976
55579D45502j4996j1757r175r489j0657j1011j1414j1740j0235p496o331o612
$$ plain form
55684 453415 455375 457978 460975 461878 459245 454778 449910 443995 437737 434234 434475 435894 437227 440263 444886
55669 444886 447525 447054 447139 449687 450938 447357 440827 434488 427901 419933 412224 406081 399790 392636 387785
55654 387785 387519 389202 389675 390141 392925 396813 399592 402317 407201 413814 420770 428608 437656 445617 450630
55639 450630 454402 459345 465049 470405 476422 483736 489875 492309 492149 491932 491944 491399 490866 490648 489052 485099
55623 485099 480883 478628 477652 476743 477079 479980 484043 487368 490613 495133 499978 503400 505655 508045 510948
55608 510948 514627 519895 526042 530376 531691 531857 532299 531843 530135 529955 533323 537955 540332 539958 538133
55593 538133 535159 531486 529023 528440 527291 523382 517719 511762 504456 494636 483676 472811 460478 445502
55579 445502 430506 418749 409574 400085 389428 378417 367003 355263 345028 337532 331201 324589
55567C24589n232k134j063k955m046k381r27j960l214k370j010j399k877l894
55553B89127m457m581l413j587j354k918l715k561j350j436j648r72r6O47J732
55538B61418K214N32j932j877O83K172J177K55R82J501N34l37n5j1q10p81N31
55521B66196R42n22j632o91Q90J421J435J801K073K169K952M055L873K705K912
55506B90579M977O460N965N049N075N149M349L223K126O41p45j072j200k663m358
55491C23555l851j930j817l671m180k216l39J50J001K652K811J031K19J693K978
55476C18086K534K394L830M518K660K87j66O90J515K699M148L837J105j513k027
55461C44597j814k603l534l384l010l449m148m898o899j0072j2087j1961j1976
$$ plain form
55567 324589 319357 317223 316160 313205 309159 306778 305851 303891 300677 298307 297297 295898 293021 289127
55553 289127 284670 280089 276676 275089 273735 270817 267102 264541 263191 261755 260107 259135 259039 259686 261418
55538 261418 263632 264164 262232 260355 261038 263210 264387 264642 265624 267125 267659 267322 267267 267256 266446 265665 266196
55521 266196 267138 266616 264984 264293 265183 266604 268039 269840 271913 274082 277034 281089 284962 287667 290579
55506 290579 295556 302016 307981 313030 318105 323254 327603 330826 332952 333593 332848 331776 330576 327913 323555
55491 323555 319704 317774 315957 312286 308106 305890 305551 305701 306702 309354 312165 313196 313415 315108 318086
55476 318086 320620 323014 326844 331362 334022 334309 334143 334833 336348 339047 343195 347032 348137 346624 344597
55461 344597 342783 340180 336646 333262 330252 326803 322655 317757 310858 300786 288699 276738 264762
55448B64762j4275j7980k1182k3108k2971j9671j4268r794p208m442p08J737J599
55435A12491R05J446K165J978J858K365K296J535J870L264L067P52m66J068K600
55420A39194J863P74J370J981Q31k72P15K197J996J274J873K524J242r14j825
55405A54823j747j625n22K128M023L072P21p05j582k925l424j902k70m63q24R30
55389A49708L319L482J896R42O22m48j413n98P61J23j961k619j114O82J575J717
55373A56674R59n81j249O2J576J183kL75J780J918Q37L71M37n27j880j192J706
55356A62447M205M753M359M170L961L297K097J21k275l268j539J363K662J915
55342A88268R77R45J242J319J168M31j119k485k501j561q93p85r80j786l184l881
$$ plain form
55448 264762 250487 232507 211325 188217 165246 145575 131307 121513 114305 109863 109155 110892 112491
55435 112491 113396 114842 117007 118985 120843 123208 125504 127039 128909 132173 135240 135992 135526 136594 139194
55420 139194 141057 141831 143201 145182 146013 145741 146456 148653 150649 151923 153796 156320 157562 156648 154823
55405 154823 153076 151451 150929 153057 157080 160152 160873 160168 158586 155661 152237 150335 150065 149602 148778 149708
55389 149708 153027 156509 158405 159347 159969 159521 158108 157510 158271 158394 156433 153814 152700 153382 154957 156674
55373 156674 157633 157052 155803 155865 157441 158624 158622 158997 160777 162695 163532 163903 164340 163813 161933 160741 162447
55356 162447 166652 171405 175764 179934 183895 187192 189289 189410 187135 183867 182328 183691 186353 188268
55342 188268 189245 190190 191432 192751 193919 194350 193231 190746 188245 186684 185791 185006 184026 182240 179056 175175
55326A75175l057j991k134k662j963m30L19L4n00j374k879l822k795n82P91Q77
55310A53007P97J089J360J408J004n48l002m254k691N52L219M655N209M544K653
55295A69002J126J080J129l21k166k409j508j188j299p66m25j681l165k284M09
55280A55534J733P45j91N25J667J859J484J125L82q21j569j386q04k08M19N62
55264A61056l81j611j635n82j01o70p77O61K550L037J717r3p34K99J787J910K45
55247A66678j735k511j973p57P02J678J187n01j646j295m92j78L38J566K242J261
55231A64564l49j197j719k823l775l398k053n68J299L441M185K727J058J087J381
55216A63860l78l094l587j335J103J914J503N42p85j774j614p67j34M75J339J431
$$ plain form
55326 175175 172118 170127 167993 165331 163368 162938 163257 163291 162791 161417 158538 154716 151921 151339 152130 153007
55310 153007 153804 154893 156253 157661 158665 158117 155115 150861 148170 148722 151941 156596 161805 166349 169002
55295 169002 170128 171208 172337 172016 169850 167441 165933 164745 163446 162680 162255 160574 157409 155125 155534
55280 155534 157267 158012 157821 158346 160013 161872 163356 164481 164863 164042 162473 161087 160283 160075 160494 161056
55264 161056 160675 159064 157429 156847 156746 156076 155299 155960 158510 161547 163264 163171 162437 162736 164523 166433 166678
55247 166678 164943 162432 160459 159702 160404 162082 163269 162768 161122 159827 159335 159157 159495 161061 163303 164564
55231 164564 164215 163018 161299 158476 154701 151303 149250 148682 149981 153422 157607 160334 161392 162479 163860
55216 163860 163482 160388 156801 155466 156569 158483 159986 160528 159743 157969 156355 155588 155454 155929 157268 158699
55200A58699J27r48p2J728K451K370K785K899J231q96p95J116J817M72p30n60
55184A71694k63n87m81N26J159N44n68j188j000J07J636J966K70j590j349K26
55168A71102P19J20M06J523J236q25k260j632k24N58Q68R20L44l00J64J224J039
55151A74982m98j434r17j82L7N71J651K085J374M47k09r94j406k90J635J952L5
55134A78839j885j899n38Q10J519J222j03j061r5J834K157O64j94M90N89j254
55118A81095l170l105j832j143r51j84R99J621J489J071O45L32J52l83j589k344
55102A72703j078J699L545L226J953J054K85q63j867k079j618p64K58O29l83j933
55086A74767k279j154J08P29R75O50o82j933j321O93J621N39p77q76l61j0O75
$$ plain form
55200 158699 158826 157878 157806 159534 161985 164355 167140 170039 171270 170374 169579 170695 172512 172984 172254 171694
55184 171694 171431 170844 170363 170889 172048 172592 172024 170836 169836 169943 171579 173545 173815 172225 170876 171102
55168 171102 171821 171941 172347 173870 175106 174281 172021 170389 170165 170723 171591 172511 172855 172555 172719 173943 174982
55151 174982 174484 173050 172133 171951 171988 172559 174210 176295 177669 178116 177907 176913 175507 175217 176852 178804 178839
55134 178839 176954 175055 174517 175327 176846 178068 177965 176904 176809 178643 180800 181464 181270 181760 182349 181095
55118 181095 177925 174820 172988 171845 170894 170710 171709 173330 174819 175890 176535 176867 177019 176636 175047 172703
55102 172703 171625 173324 176869 180095 182048 183102 183387 182524 180657 178578 176960 176196 176454 177083 176700 174767
55086 174767 172488 171334 171442 172171 173146 173796 173114 171181 169860 170553 172174 172713 171936 171060 170699 170689 171364
55069A71364K058L477M542N460N768M605K711J911K292K134R31l2m45j534l198
55054B02044l436j662J12M93M29P23N13m01n17O99J621J369J310K165K373J064
55038B08899k3L72O67o00j906j379n6J92mR65K331K160Q80P21K142L331L102K142
55020B23936J325M91p20j898k026m27K164L633K647O19jP71P39n79j015N23K193
55003B32375K399K127K453K323Q93k50L61J224J20k291l634l314k484j634m58
54988B30210O74J222J674K514K884K008P64R7q24k801m174k696Q12L151K675N58
54972B38748j526k887l154k153p21j45o21j212j196l87J280L401M703M185K364
54957B40679N74n19r55q71p26j218k027j722M4J413P21j031j655q35j01l98j231
$$ plain form
55069 171364 173422 176899 181441 186901 192669 197274 199985 201896 204188 206322 207253 207221 206776 205242 202044
55054 202044 198608 196946 197058 197551 197980 198703 199216 198815 198298 198997 200618 201987 203297 205462 207835 208899
55038 208899 208876 209248 209915 209315 207409 206030 205974 206166 206162 207127 209458 211618 212498 213219 215361 218692 221794 223936
55020 223936 225261 225752 225032 223134 221108 220681 222845 226478 229125 229744 229743 230514 231253 230674 229659 230182 232375
55003 232375 234774 236901 239354 241677 242570 242320 242681 243905 244025 241734 238100 234786 232302 230668 230210
54988 230210 230884 232106 233780 236294 239178 241186 241950 242047 241223 238422 234248 231552 232364 235515 238190 238748
54972 238748 237222 234335 231181 229028 228307 228162 227541 226329 225133 224746 226026 229427 234130 238315 240679
54957 240679 241253 240734 239779 238908 238182 236964 234937 233215 233259 234672 235393 234362 232707 231872 231771 231373 230142
54940B30142j873k019j584q71o24j033j207m30P43J379J411J248J000Q02R70J222
54924B29276R15M96J275L060L859K919K032K448K677J192o14m90J128K131K086
54909B54390K159K624K919L525N262P089P135N812N638P658J0002J0555R387Q035
54895C42190P646Q416J0056J2256J4891J7597J9164J8184J4850J1153Q603O730
54883D91736M407J425k159o673j1544j4714j4913j3607j3221j4303j5652j6160
54871C74622j5212j2543r154p211p467p989o923n124m239l672j763J090K967L364
54857C00746L341L308K921K739L834N909P741R196J0996J2840J3688J3657J3777
54844D04693J4040J3407J1662R605P489M679Q35l710q359j2016j3356j2575j1862
$$ plain form
54940 230142 228269 226250 224666 223795 223171 222138 220931 220501 221244 222623 224034 225282 226282 227084 228054 229276
54924 229276 230191 230687 231962 235022 238881 241800 243832 246280 248957 250149 249535 249045 250173 252304 254390
54909 254390 256549 259173 262092 265617 270879 277968 285103 290915 296553 304211 314213 324768 334155 342190
54895 342190 349836 358252 368308 380564 395455 413052 432216 450400 465250 476403 485006 491736
54883 491736 496143 497568 495409 488736 477192 462478 447565 433958 420737 406434 390782 374622
54871 374622 359410 346867 337713 330502 323035 315046 308123 302999 298760 295088 293325 294415 297382 300746
54857 300746 304087 307395 310316 313055 316889 322798 330539 339735 350731 363571 377259 390916 404693
54844 404693 418733 432140 443802 453407 460896 465575 466410 462700 454341 442325 428969 416394 404532
54831D04532j2660j3702j3335j2428j2730j3594j2919j0495p981o157m790m404
54819B79337n509o475n192k635j872l446m634l654j842j014j298k229l660m709
54805B31168m007j891m33n60j039r03q37j355j622j105o82r92j150r8J806L284
54789B19584L340J716p62k222j525R1N65O6M61J884K129M2k640l707k860r65J255
54772B16452K938L156K233J562J475R22k11l42J301L182L665L057K366J503J28
54757B43387j036j114l88M34J376K609L693M383N392P234R064R614Q727P274O144
54742C06793N959O979Q670J0031J0912J2261J4553J6860J8049J8026J7178J5443
54730D61714J2829J0045P741N525K544j231m876p485q933r835j0893j2085j2519
$$ plain form
54831 404532 391872 378170 364835 352407 339677 326083 313164 302669 294688 288531 283741 279337
54819 279337 273828 267353 262161 259526 257654 254208 249574 245920 244078 243064 241766 239537 235877 231168
54805 231168 227161 225270 224837 224277 223238 222335 221498 220143 218521 217416 216734 215742 214592 214494 216300 219584
54789 219584 222924 224640 223878 221656 220131 220222 220787 220853 221314 223198 225327 225369 222729 219022 216162 215197 216452
54772 216452 219390 222546 224779 226341 227816 228738 228527 228185 229486 232668 236333 239390 241756 243259 243387
54757 243387 242351 241237 240849 241283 242659 245268 248961 253344 258736 265970 275034 284648 293375 300649 306793
54742 306793 312752 319731 328401 338432 349344 361605 376158 393018 411067 429093 446271 461714
54730 461714 474543 484588 492329 497854 500398 499167 494291 486806 477873 468038 457145 445060 432541
54717D32541j1512r592p904o817n743m218k402p26K94J74p76j209j86J547K752
54702C86223L683N491Q186J0679J2631J4645J6692J8026J8737J9855K1571K2877
54690E59296K3087K2397K0875J8275J4893J1075O098p23q008j3504j7272k1216
54678F15273k5178k6428k4074k1246k1047k2545k2739k0724j7863j5125j2431
54667C85873r919p996o575n583n636o911q098p829o585n810n618m812k967j239
54653C00295q51j594k032r35J333K814J946l75j664r95r2o50j919k026o62Q83
54637B93476J620J489N74r79k352k470j155Q21K645L841M023L147J986J559J991
54622C10216K438K276J914K150K991L493K946J916J650K357K772J954P90R42K789
$$ plain form
54717 432541 421029 411437 403533 396716 390973 386755 384353 383627 383921 384095 383319 382110 381924 383471 386223
54702 386223 389906 395397 403583 414262 426893 441538 458230 476256 494993 514848 536419 559296
54690 559296 582383 604780 625655 643930 658823 669898 675996 675273 667265 653761 636489 615273
54678 615273 590095 563667 539593 518347 497300 474755 452016 431292 413429 398304 385873
54667 385873 375954 367958 361383 355800 350164 343253 335155 327326 320741 314931 309313 304501 301534 300295
54653 300295 299444 297850 295818 294883 296216 299030 300976 300601 298937 297942 297850 297200 295281 293255 292593 293476
54637 293476 295096 296585 297159 296180 293828 291358 290203 291024 293669 297510 301533 304680 306666 308225 310216
54622 310216 312654 314930 316844 318994 321985 325478 328424 330340 331990 334347 337119 339073 339863 340805 343594
54607C43594N335P703R475R903Q391N998M994O279Q285R004Q195P029O446O550
54593D47181P012P468P787Q268R200J0362J1443J2688J4341J5684J5820J5257
54581E82511J5464J6621J7179J5990J3621J1021Q062M152o14n637j0572j5242
54569F52556j9275k2242k3806k3737k2287k0519j9497j9102j8337j6670j4386
54558D32698j1881r488p761o877o093m827l745l502l093j290P96Q45j064k281
54544C72437j383J16N32K33J78J45m52j505l013n374q011r231q459p125o376n469
54528C17243l610j865j842l472n342o301n976m645l372l143l299k258k94K01j740
54513B70285l832l629j798o37p76j125j080r08o57j90J73J84K34N70P37O79J159
$$ plain form
54607 343594 348929 356632 366107 376010 384401 390399 395393 401672 409957 418961 427156 434185 440631 447181
54593 447181 454193 461661 469448 477716 486916 497278 508721 521409 535750 551434 567254 582511
54581 582511 597975 614596 631775 647765 661386 672407 680469 684621 684007 678370 667798 652556
54569 652556 633281 611039 587233 563496 541209 520690 501193 482091 463754 447084 432698
54558 432698 420817 411329 403568 396691 390598 385771 382026 378524 375431 374141 374937 375782 374718 372437
54544 372437 371054 371170 371702 371935 372113 372258 371806 370301 367288 361914 353903 344672 336213 329088 322712 317243
54528 317243 313633 311768 309926 306454 301112 294811 288835 284190 280818 277675 274376 272118 271824 272025 270285
54513 270285 266453 262824 261026 260389 259613 258488 257408 256500 255843 255653 255826 256010 256244 256814 257551 258230 259389
54496B59389K239K591J522K71J3K7n79p50R51L699N375N441M981M551L942L624
54480B97287M410N814O433N968N379N221N372O208Q308J0824J1795J0548Q512
54467C92079P062N826L806J199r37k449m417p444j0348j1300j0166q801q643q976
54453C36491q413p108o187n669m815m005m283n104m780l381k777l321l039j119
54439B72490M19L5p54k8J410J729J063N25k19j843k975j623J542L763L803K881
54423B82218K144J342K89j12J056L439N569N913M137J690N12Q09J035M19qM40
54407C10892P55K31l2P94J362J61j898k967l079l351l544k646j192o87j158j318
54391B92323q58o06p08l91M85J143J019J26j298k513k429j097j26n82j745k900
$$ plain form
54496 259389 261628 264219 265741 266012 266025 266052 265473 264723 265674 269373 274748 280189 285170 289721 293663 297287
54480 297287 301697 307511 313944 319912 325291 330512 335884 342092 350400 361224 373019 383567 392079
54467 392079 399141 404967 408773 409972 409035 406586 402169 394725 384377 373077 362911 354110 345467 336491
54453 336491 328078 320970 314783 309114 304299 300294 296011 290907 286127 282746 279969 276648 273609 272490
54439 272490 272909 272944 272190 272162 273572 275301 276364 276889 276670 274827 271852 270229 271771 275534 279337 282218
54423 282218 284362 285704 285993 285881 286937 290376 295945 301858 305995 307685 308197 309006 310041 310460 310452 310892
54407 310892 311647 311878 311846 312640 314002 314163 312265 309298 306219 302868 299324 296678 295486 294799 293641 292323
54391 292323 291465 290859 290151 289760 290245 291388 292407 292533 291235 288722 286293 285196 285070 284488 282743 279843
54375B79843m513o195n689k211J219J469k80p69L08Q33O35J507L339L932K726
54360B76154J461R66M09r7O19K035K165J051R37K375L293K736K450L559M578M128
54344C08819L081K601K402K260K997M563N277M430L580L827L880K545J158J616
54330C53036L364M278L565K212J246Q46O05k42k256m875o765p365p081n883l312
54315C31373k68J004m77l193n215o005n678m174k134j018j323j905j834j526j393
54300B96234r29l0M01J23K55J168J412O4j357r13Q83J788O84j501l024k501L43
54283B93100M137O683P039O149N105L999K926K582L061L334K789K010J275j10
54269C44079k040k859j767m40q02k444l795m592n480o242o325o312p066p812o931
$$ plain form
54375 279843 275330 269135 263446 261235 262454 263923 263643 262874 263182 264015 264650 266157 269496 273428 276154
54360 276154 277615 278581 278990 278893 279512 281547 283712 284763 285700 288075 291368 294104 296554 300113 304691 308819
54344 308819 311900 314501 316903 319163 322160 326723 332000 336430 340010 343837 347717 350262 351420 353036
54330 353036 356400 360678 364243 366455 367701 368547 369152 368910 366654 361779 355014 347649 340568 334685 331373
54315 331373 331105 332109 331632 328439 323224 317219 311541 307367 305233 304215 302892 300987 299153 297627 296234
54300 296234 295305 295275 295676 295799 296054 297222 298634 298698 297341 296428 297311 299099 299783 298282 295258 292757 293100
54283 293100 297237 303920 310959 317108 322213 326212 329138 331720 334781 338115 340904 342914 344189 344079
54269 344079 342039 339180 337413 336973 336171 333727 329932 325340 319860 313618 307293 300981 293915 286103 279172
54254B79172m445k235j846l236n483p444p917o397l826j764q36n64m75m99n57
54239B31648n16m40m19l69l44o85j375j781j436n94L33J204J609Q64q49k141j924
54222B22785n78R12K136K895K657J319j49p68p73r62j393j420o82O61K176L230
54206B32046L299K630K007J606Q61k70r60q31m05J58J379K834K798P29j345j360
54190B45176PO37Q7l69j76j02o23j268j678j965j917r98O00J825J898J010j42
54173B42002r89j269j123r66r87r36o44l70l86o90j193j689j492k7J954K854K292
54156B36341J573J561J350m3j869k660k100q46O12J772J734L42r26n48R89J906
54140B39188J451L61m79p60m45K6l65j968l455l173j456l88j287l226m189l082
$$ plain form
54254 279172 274727 272492 270646 267410 261927 254483 246566 240169 236343 234579 233743 233179 232704 232205 231648
54239 231648 231132 230692 230273 229904 229560 228875 227500 225719 224283 223689 224022 225226 226835 227699 226850 224709 222785
54222 222785 222207 223119 225255 228150 230807 232126 231977 231209 230436 229474 228081 226661 225979 226640 228816 232046
54206 232046 235345 237975 239982 241588 242449 242179 241219 240388 239983 240141 241520 244354 247152 247881 246536 245176
54190 245176 245183 245820 245907 245538 245362 245260 244637 243369 241691 239726 237809 236811 237411 239236 241134 242144 242002
54173 242002 241013 239744 238621 237655 236668 235732 235088 234718 234332 233642 232449 230760 229268 229241 231195 234049 236341
54156 236341 237914 239475 240825 240782 238913 236253 234153 233307 233919 235691 237425 237767 236841 236293 237282 239188
54140 239188 240639 241000 240521 239761 239316 239342 238977 237009 233554 230381 228925 228537 227250 224024 219835 216753
54124B16753o70J106R72l04q76k55K83L8N5R39J116q58l404l501q88J465J198
54107B13169q67k450k527j622n74J32L74M47Q47J721K611K780J796K4j318j082
54091B13461N68K199K631J845L07j597l057k956j321L09P91P26J061J459J170
54076B17596M66j69j261l233m802m230j796N13J460J300N40m31p52K44J699K001
54060B09145R67o4k88k37m55p16p74q10r12r56r85q66L0J712K676J606l84r10
54042B07779L96J617J611J341J623J577L60j184j809j706j854k430k884k926k416
54027A99095r39J426L353L416J891N39N35J227J204P4j235j749j514j162q31j48
54011B05182P20Q30l35j976k763k091k05K160L785L478J537N2O79K540L455K765
$$ plain form
54124 216753 216083 217189 218161 217857 216981 216726 217009 217047 217102 218041 219157 218299 214895 211394 210506 211971 213169
54107 213169 212302 209852 207325 205703 205129 205261 205635 206082 206929 208650 211261 214041 215837 215861 214543 213461
54091 213461 214029 216228 218859 220704 221011 219414 216357 213401 212080 212389 213180 213906 214967 216426 217596
54076 217596 218062 217893 216632 213399 208597 204367 202571 203084 204544 205844 206384 205953 205201 205445 207144 209145
54060 209145 210112 210048 209760 209523 209068 208352 207578 206768 205856 204900 203915 203049 203079 204791 207467 209073 208689 207779
54042 207779 208175 209792 211403 212744 214367 215944 216304 215120 213311 211605 209751 207321 204437 201511 199095
54027 199095 198156 199582 202935 206351 208242 208781 209316 210543 211747 211821 210586 208837 207323 206161 205330 205182
54011 205182 205902 206732 206397 204421 201658 199567 199362 201522 205307 208785 210322 210374 211053 213593 217048 219813
53995B19813J773J641K114K456K449K180J607P14k48o50M23L294O500P538N788
53980B57392L729L921N669O334N198M025M023M465M601N010O259P773Q829R496
53966C36724R989J0078R710R238Q694P723O627O343P074P901Q017P352N743K806
53952D44019r23l811m715l893k171k42R73P07n26j380j743k851m876o049n275
53937D07244m095m568o314p262o612n543n234n489n352m230k366q36p20j822k619
53922C44182k142j298j509k536k800j669l23q9p57r80P7J909L226L152J833J07
53906C40383j214j695j245j22J033J519J042j59j436j910j058M71J171M00p50
53891C36430j011n87k53M06K274M612N588M957M392M775N031M377L830M400N372
$$ plain form
53995 219813 221586 223227 225341 227797 230246 232426 234033 234747 234499 233849 234272 237566 244066 251604 257392
53980 257392 261121 265042 270711 277045 282243 286268 290291 294756 299357 304367 310626 318399 327228 336724
53966 336724 346713 356791 366501 375739 384433 392156 398783 405126 412200 420101 428118 435470 441213 444019
53952 444019 443096 439285 434570 430677 428506 428264 429237 429944 429418 428038 426295 423444 418568 412519 407244
53937 407244 403149 398581 392267 385005 378393 372850 367616 362127 356775 352545 350179 349343 348623 346801 344182
53922 344182 342040 340742 339233 336697 333897 332228 331905 331816 331059 330079 330156 332065 335291 338443 340276 340383
53906 340383 339169 337474 336229 336107 337140 338659 339701 339542 338106 336196 335138 335609 336780 337180 336430
53891 336430 335419 334832 334579 334985 337259 341871 347459 352416 356808 361583 366614 370991 374821 379221 384593
53876C84593N807O397Q046R633Q994N919K573R15R20J255Q34m57j787k071j097
53861D30474K49J182J883K626K858K137J400K072M213O647Q684J0372J1218J0262
53847D96277P917O359P068Q874R396P979O211N734O497P249O949N279K419r10
53833E83298l446m189l549l124m034n744o961p223p075o996p002p229q055r314
53819D99357j0032r438p880o511o219o992p986q215p484o739p064q319r238q857
53805C88383p334n476m147m099n349o551n979l715j872k026l289l854l504l395
53791C27793l866l910k927j743j411j934k545k694k256j358m90m53j528k848l222
53776B94608k535j844j917k286k105j444j069j223j380j187q92o13KR64J507J110
$$ plain form
53876 384593 390400 396797 404843 414476 423470 429389 431962 432877 433797 435052 435886 435429 433642 431571 430474
53861 430474 430723 431905 433788 436414 439272 441409 442809 444881 449094 455741 464425 474797 486015 496277
53847 496277 504194 510553 517621 526495 535891 543870 550081 555815 562312 569561 576510 581789 584208 583298
53833 583298 579852 575663 572114 568990 564956 559212 552251 545028 537953 530957 523955 516726 508671 499357
53819 499357 489325 479887 472007 465496 459277 452285 444299 436084 428600 421861 414797 406478 397240 388383
53805 388383 381049 375573 371426 367327 361978 355427 349448 345733 343861 341835 338546 334692 331188 327793
53791 327793 323927 320017 317090 315347 313936 312002 309457 306763 304507 303149 302659 302206 300678 297830 294608
53776 294608 292073 290229 288312 286026 283921 282477 281408 280185 278805 277618 276726 276113 276115 277079 278586 279696
53760B79696L92L66J146K072K643K706K150J254R18J624K460K225J242R69J876
53745C03739K920L303L473M003M588M800M988N758P029Q130Q432P669O239N296
53731C80367N880P588Q797Q524P368O328N556M787M219M144M209L826L085K662
53717D57340K833K967K053l04l245n057m616k494m39K85l66j746l189m186m707
53702D35129n374o789q510r336q528o320l474j081l47j472k900k909j817j295
53688C74977j664j562n44l8r88k262k438j743j052l50M27K86j482l643m363l597
53672C49964k623j692O4K537M117L703J990K80j051k308l410l812l273k224j250
53657C41012l79Q19K435L827M387M311M048L488K591K327L534N038M696K627J514
$$ plain form
53760 279696 280088 280454 281600 283672 286315 289021 291171 292425 293343 294967 297427 299652 300894 301863 303739
53745 303739 306659 309962 313435 317438 322026 326826 331814 337572 344601 352731 361163 368832 375071 380367
53731 380367 386247 393835 402632 411156 418524 424852 430408 435195 439414 443558 447767 451593 454678 457340
53717 457340 460173 463140 465193 464889 461644 456587 451971 449477 449038 449323 448957 447211 444022 439836 435129
53702 435129 429755 422966 414456 405120 396592 390272 386798 385717 385370 383898 380998 378089 376272 374977
53688 374977 373313 371751 371207 371169 370181 367919 365481 363738 362686 362336 362763 363049 361567 357924 353561 349964
53672 349964 347341 345649 345713 348250 352367 356070 358060 358340 357289 354981 351571 347759 344486 342262 341012
53657 341012 340633 341452 343887 347714 352101 356412 360460 363948 366539 368866 372400 377438 382134 384761 386275
53642C86275K954N350O569O814P313P788P287O403O354O628N839M552M792O754
53628D71672Q249Q011P319P538P970P396O218N607N470M805L527K603K518K747
53614E51650K902L318M174M763M285L023K085J948J870J047j98r53j057j073j072
53599E76712m26Q65J747J497P62N17P00O90M50K93n2j078k418l032k531j641j360
53582E71695k080l332l946k860l40J909K526J969J533J431Q93j78q55o40k21l87
53566E67117r57j094k32J567L659N092N233M249K880J780J371K012L741N976P961
53551F10355R473J0602J1107J0535Q950P088N822N839P455J0132J2374J2876J1771
53538G34379J0385R778J0081J0903J1699J1847J1211J0668J1305J2993J4382J4517
$$ plain form
53642 386275 389229 394579 401148 407962 415275 423063 430350 436753 443107 449735 455574 460126 464918 471672
53628 471672 479921 487932 495251 502789 510759 518155 524373 529980 535450 540255 543782 546385 548903 551650
53614 551650 554552 557870 562044 566807 571092 574115 576200 578148 580018 581065 580867 579914 578857 577784 576712
53599 576712 576286 577151 578898 580395 581157 581674 582374 583064 583514 583807 583755 582677 580259 577227 574696 573055 571695
53582 571695 569615 566283 562337 559477 559137 561046 563572 565541 567074 568505 569398 569220 568365 567725 567504 567117
53566 567117 566160 565066 564834 566401 570060 575152 580385 584634 587514 589294 590665 592677 596418 602394 610355
53551 610355 619828 630430 641537 652072 661022 668110 673932 679771 687226 697358 709732 722608 734379
53538 734379 744764 754542 764623 775526 787225 799072 810283 820951 832256 845249 859631 874148
53526H74148J3844J3325J3102J2527J1200R607Q711Q968R738R848Q863P712P640
53513A009233Q697R569Q978P015M972M015M131M362L914K784J383R8m45M76K474
53498A071656L597K378o3j302r20p81j767k278r31J019J383j54k278l965m739
53483A060855m082k182m52K05P59K161L225K405P55O95K248L147K669K703M426
53468A079537O438P262P592Q710J0437J2070J3879J6124J7765J7842J7242J7541
53456A232439J8732J9744K0708K2866K6133K8550K8940K8744L0165L3245L6038
53445A526304L7355L8054L9370M1165M2685M4168M6410M9061N0873N1904N3896
53434B021245N7648O1213O2043O0240N8407N8664O0946O3893O6123O6628O5171
$$ plain form
53526 874148 887992 901317 914419 926946 938146 947753 956464 965432 975170 985018 993881 1001593 1009233
53513 1009233 1017930 1027499 1036477 1043492 1048464 1052479 1056610 1060972 1064886 1067670 1069053 1069151 1068706 1069182 1071656
53498 1071656 1075253 1077631 1077568 1076266 1075346 1074565 1072798 1070520 1069589 1070608 1071991 1071837 1069559 1065594 1060855
53483 1060855 1056773 1054591 1054139 1054344 1055103 1057264 1060489 1062894 1063649 1064344 1066592 1069739 1072408 1075111 1079537
53468 1079537 1085975 1093237 1100829 1109539 1119976 1132046 1145925 1162049 1179814 1197656 1214898 1232439
53456 1232439 1251171 1270915 1291623 1314489 1340622 1369172 1398112 1426856 1457021 1490266 1526304
53445 1526304 1563659 1601713 1641083 1682248 1724933 1769101 1815511 1864572 1915445 1967349 2021245
53434 2021245 2078893 2140106 2202149 2262389 2320796 2379460 2440406 2504299 2570422 2637050 2702221
53423B702221O2790O1270O1791O4177O7097O8681O7643O4739O2548O2822O4387
53412C410166O4707O3053O0836N9225N7956N6409N4318N1248M7010M2835M0487
53401D008250L9614L7566L2790K7105K3448K2374K2117K1245J9713J7510J3896
53390D285628Q622K943j462m395p381j1873j7713k3664k9104l4398l9687m4175
53378D083341m7116m8800n0039n1258n2626n4500n6976n9478o1343o2399o2568
53367C476238o1741o0582o0339o0908o0139n6406n0972m6417m3560m1411l9312
53356B894451l7183l4350l0060k4959k0191j5443r763l911M31L610P698J3228
53344B743558J8633K3309K8506L4493L9482M2501M4948M8018N0937N3255N6593
$$ plain form
53423 2702221 2765011 2826281 2888072 2952249 3019346 3088027 3155670 3220409 3282957 3345779 3410166
53412 3410166 3474873 3537926 3598762 3657987 3715943 3772352 3826670 3877918 3924928 3967763 4008250
53401 4008250 4047864 4085430 4118220 4145325 4168773 4191147 4213264 4234509 4254222 4271732 4285628
53390 4285628 4294250 4297193 4295731 4291336 4283955 4272082 4254369 4230705 4201601 4167203 4127516 4083341
53378 4083341 4036225 3987425 3937386 3886128 3833502 3779002 3722026 3662548 3601205 3538806 3476238
53367 3476238 3414497 3353915 3293576 3232668 3172529 3116123 3065151 3018734 2975174 2933763 2894451
53356 2894451 2857268 2822918 2792858 2767899 2747708 2732265 2722502 2718591 2719022 2722632 2730330 2743558
53344 2743558 2762191 2785500 2814006 2848499 2887981 2930482 2975430 3023448 3074385 3127640 3184233
53333C184233O2138O8303P3063P7025Q1948Q7433R1528R3933R6390J00078J04488
53322D120560J08823J12906J16752J20496J24801J30177J35938J40670J43728
53313E254851J45599J47081J48715J50498J51412J49817J45288J39673J35366
53304F568300J32744J30038J25367J18247J09552J00851R3524Q7812Q2764P7332
53294G626531P1149O3956N5144M4470L2643K0743R483p85j0272k0238l2216m6250
53282G814358o0954p5726r1331j07597j22174j32948j40311j45669j49099j50253
53272F638296j50327j50949j51662j50592j47488j44251j42378j41475j40502
53263E318672j39057j37066j34418j31258j27794j23638j18103j11277j04179
$$ plain form
53333 3184233 3246371 3314674 3387737 3464762 3546710 3634143 3725671 3819604 3915994 4016072 4120560
53322 4120560 4229383 4342289 4459041 4579537 4704338 4834515 4970453 5111123 5254851
53313 5254851 5400450 5547531 5696246 5846744 5998156 6147973 6293261 6432934 6568300
53304 6568300 6701044 6831082 6956449 7074696 7184248 7285099 7378623 7466435 7549199 7626531
53294 7626531 7697680 7761636 7816780 7861250 7893893 7914636 7924119 7923334 7913062 7892824 7860608 7814358
53282 7814358 7753404 7677678 7586347 7478750 7356576 7223628 7083317 6937648 6788549 6638296
53272 6638296 6487969 6337020 6185358 6034766 5887278 5743027 5600649 5459174 5318672
53263 5318672 5179615 5042549 4908131 4776873 4649079 4525441 4407338 4296061 4191882
53254D191882r7767r2334q7564q2673p6807p0049o3775n9367n6683n4266n0651
53243C399946m5196l8386l1858k7250k4353k1285j7124j3207j0792q877n893k382
53231C153343n6J081K747N735R170J2344J5576J9093K2465K5475K8500L1944L6053
53218C363470M1026M6496N1382N5235N8915O2774O5154O4442O1849O0216O0500
53207C991459O1315O1530O1175O0061N7775N5019N2867N0700M7145M2947M0335
53196D582328L9203L6784L1833K6247K1476J6176R166J958l910r829j7781k6733
53184D706918l4206m0367m7553n6090o3336o7405o9683p2728p7118q1252q3506
53173D013674q3816q3384q3266q3342q2806q1461p9787p7849p5302p2861p2291
$$ plain form
53254 4191882 4094115 4001781 3914217 3831544 3754737 3684688 3620913 3561546 3504863 3450597 3399946
53243 3399946 3354750 3316364 3284506 3257256 3232903 3211618 3194494 3181287 3170495 3161618 3155725 3153343
53231 3153343 3153287 3154368 3157115 3162850 3172020 3184364 3199940 3219033 3241498 3266973 3295473 3327417 3363470
53218 3363470 3404496 3450992 3502374 3557609 3616524 3679298 3744452 3808894 3870743 3930959 3991459
53207 3991459 4052774 4114304 4175479 4235540 4293315 4348334 4401201 4451901 4499046 4541993 4582328
53196 4582328 4621531 4658315 4690148 4716395 4737871 4754047 4763213 4765171 4761261 4751432 4733651 4706918
53184 4706918 4672712 4632345 4584792 4528702 4465366 4397961 4328278 4255550 4178432 4097180 4013674
53173 4013674 3929858 3846474 3763208 3679866 3597060 3515599 3435812 3357963 3282661 3209800 3137509
53162C137509p3933p5501p4713p2267p0711p0988p1709p1522p0449o8821o6398
53151B350497o3059n9293n5635n2343m9750m8066m6709m4768m2381m0767m0547
53140A807179m0834m0494l9585l8893l8569l7987l6882l5935l5787l5781l4329
53129A392103l0980k7743k7354l0029l2794l2755l0186k7613k6560k6570k6899
53118A072620k7496k8035k7522k5671k3519k1999k0813j9497j8632j8832j9273
53107H21331j8604j6974j5773j5353j4432j2204r841r096j0156j1681j2471j2360
53095F62386j1749j1059j0556j0197r609q621p612p005o636o049n139m105l076
53082E60973k277k200k906l483l076k219k125k895l444l204k638k014j039QK31
$$ plain form
53162 3137509 3063576 2988075 2913362 2841095 2770384 2699396 2627687 2556165 2485716 2416895 2350497
53151 2350497 2287438 2228145 2172510 2120167 2070417 2022351 1975642 1930874 1888493 1847726 1807179
53140 1807179 1766345 1725851 1686266 1647373 1608804 1570817 1533935 1498000 1462213 1426432 1392103
53129 1392103 1361123 1333380 1306026 1275997 1243203 1210448 1180262 1152649 1126089 1099519 1072620
53118 1072620 1045124 1017089 989567 963896 940377 918378 897565 878068 859436 840604 821331
53107 821331 802727 785753 769980 754627 740195 727991 718150 709054 698898 687217 674746 662386
53095 662386 650637 639578 629022 618825 609216 600595 592983 585978 579342 573293 568154 564049 560973
53082 560973 558696 556496 553590 550107 547031 544812 542687 539792 536348 533144 530506 528492 527453 527461 527692
53067E27692k16O4J443K304J532M82R80K472K999K232J584J684J652Q01n26j935
53051E45244l333m224m138l777m362n730o480o095n373m740l884l319m348o703
53037D78738q115p254n504m686m641m435m419n335o437o344n195m354m386m728
53023D02905m964n024m524l285k255k475l286l074j716p77j114j789j795j506
53009C65321j709k266k564k525k400k098j339j98Q92J395Q52n61j651j192L00
52994C50257P95o14k172j585Q82K652J986j99j760j497L61K756M140L084k96l686
52978C55104m482k542l17O3j001j698j380r97j397k219k636k255j092M36J267
52963C34854L24j949l456k764r28j29q60j673j510r50q08p25P2J306J935J496
$$ plain form
53067 527692 527476 527540 528983 531287 532819 533301 534281 536753 539752 541984 543568 545252 546904 547705 547179 545244
53051 545244 541911 537687 533549 529772 525410 519680 513200 507105 501732 496992 493108 489789 485441 478738
53037 478738 470623 463369 457865 453179 448538 444103 439684 434349 427912 421568 416373 412019 407633 402905
53023 402905 397941 392917 388393 385108 382853 380378 377092 374018 372302 371525 370411 368622 366827 365321
53009 365321 363612 361346 358782 356257 353857 351759 350420 350222 351114 352509 353361 352800 351149 349957 350257
52994 350257 351052 350438 348266 346681 347563 350215 352201 352002 350242 348745 349106 351862 356002 359086 358790 355104
52978 355104 350622 348080 347763 347826 346825 345127 343747 342750 341353 339134 336498 334243 333151 333587 334854
52963 334854 335178 333229 329773 327009 326081 325952 325092 323419 321909 320959 320151 319426 319498 320804 322739 324235
52947C24235N07l52q17q36m27J03J86n33j764k656k334o62J323K142J373K23J98
52930C19909J453K880L550L423K803J878J049R45J751K900L716M018L922L714
52916C57911M080N646P820Q861P874O122N437N836N805M672L381K799K478J605
52902D30327K77q32j542k305l486m886n755n315l541j437j69K9k92p70j310j498
52886C97495r50k70m64j266j245L8J302J493J179J137R26O4n78k7Q92N74q68j749
52868C97683j349p86j129j906j918p56Q05J537Q28m92q15K22R24k89k476l181
52852C86902j615N91J702J621J132Q13J064J926K398J139j456l034j978O29K512
52837C94346K882K584K223J490K73o46m47O88J839K353K286J864R66m49j672j668
$$ plain form
52947 324235 324742 324390 323573 322737 322310 322413 322599 322066 320302 317646 315312 314650 315973 318115 319488 319711 319909
52930 319909 321362 324242 327792 331215 334018 335896 336945 337890 339641 342541 346257 350275 354197 357911
52916 357911 361991 367637 375457 384318 392192 398314 403751 409587 415392 420064 423445 426244 428722 430327
52902 430327 430604 429772 428230 425925 422439 417553 411798 406483 402942 401505 401336 401365 401073 400303 398993 397495
52886 397495 396545 396275 395811 394545 393300 393338 394640 396133 397312 398449 399375 399439 398861 398834 399726 400300 399432 397683
52868 397683 396334 395548 394419 392513 390595 389839 390644 392181 393009 392517 391702 391924 392848 392559 390083 386902
52852 386902 385287 385878 387580 389201 390333 391146 392210 394136 396534 397673 396217 393183 391205 391834 394346
52837 394346 397228 399812 402035 403525 403798 403152 402705 403393 405232 407585 409871 411735 412701 412252 410580 408912
52821D08912l30J305K369K927L041K112J41j203k58K244L908L692K798K462K360
52806D36480J770R78P11R95J292J297J142J181J769K813L619L764L889M653N264
52791D71617M376K515J890L307M814M252J942j96j061p96K38J646K570K300J201
52776E00615K50j59n15j451l132n002n931n242l807l431m637n890n550l899k497
52761D49722k263k876l678m267m524m592m650m427l476k182j831l011m644n110
52747C98191l981k215j103j374k671l582k864j025R4l18j168j393j566k673m290
52732C68062n196n064m479l808l054k346j745r93k70m91j986l602m124l892l845
52717C23167l618k142K49J778J420j02j631k832l764m166l629k199n82J38o07
$$ plain form
52821 408912 408582 409887 412256 415183 418224 420336 420477 419274 419016 421260 425168 428860 431658 434120 436480
52806 436480 438250 439228 439939 440934 442226 443523 444665 445846 447615 450428 454047 457811 461700 466353 471617
52791 471617 475993 478508 480398 483705 488519 492771 494713 494517 493456 492660 492898 494544 497114 499414 500615
52776 500615 500865 500706 500191 498740 495608 490606 484675 479433 475626 472195 467558 461668 456118 452219 449722
52761 449722 447459 444583 440905 436638 432114 427522 422872 418445 414969 412787 410956 407945 403301 398191
52747 398191 394210 391995 390892 389518 386847 383265 380401 379376 379470 379152 377984 376591 375025 372352 368062
52732 368062 362866 357802 353323 349515 346461 344115 342370 341377 341107 340616 338630 335028 330904 327012 323167
52717 323167 319549 317407 317656 319434 320854 320752 319121 316289 312525 308359 304730 302531 301949 302087 301480
52702C01480k053k626j814q72j127k206k834k771k887l599m305m365l854l163
52688B63004k486j803j183j096k149m043n027l639r44N00J37L2J238J838J75k065
52672B42489k249p13J58k95q16r56j270j238J68J947J896K45l57J106K641K631
52656B45387J936J500N54j306k433j346J023K863L727L775K549L36p41Q65L558
52641B62247M449L072J362M44l54j400j684m72J285J924P77j369l036l172k013
52626B62060r34j142k584m313n446n458m162k018j41N85J68r30k278l231l026
52611B27150j703j96J010K378L765L568P70l075n394n613n071m345k587K44K419
52596B13320K404O80j210k361k638j977n92O38P77k15j549k361k220j300l79j68
$$ plain form
52702 301480 299427 296801 294987 294115 292988 290782 287948 285177 282290 278691 274386 270021 266167 263004
52688 263004 260518 258715 257532 256436 254287 250244 245217 241578 240634 241134 241271 241303 242541 244379 244554 242489
52672 242489 240240 239527 239685 239390 238574 237618 236348 235110 235278 237225 239121 239366 239009 240115 242756 245387
52656 245387 247323 248823 249377 248071 245638 244292 245315 248178 251905 255680 258229 258565 257824 258689 262247
52641 262247 266696 269768 271130 271574 271220 269820 268136 267664 268949 270873 271650 270281 267245 264073 262060
52626 262060 261126 259984 257400 253087 247641 242183 238021 236003 235862 236447 236615 235685 233407 230176 227150
52611 227150 225447 225251 226261 228639 232404 235972 236742 233667 228273 222660 217589 213244 210657 210901 213320
52596 213320 215724 216404 215194 212833 210195 208218 207626 208264 209041 208826 207277 204916 202696 201396 201017 200849
52580B00849m99n59j56N0j32K72J921L689L737J884j90j013o51J27R91J933K771
52563B15024L227L117K167K92j779k892k789k260j565R8K758M613M127K286J111
52548B27535P30j02j109n79J416K467J403J27M83J410J026j59l29N20Q92N12M66
52531B36709R25R52N56R93K690M523N440N390M527L005J724J738K690L158K701
52516B77721K042J315Oj163m89J843L265K243L86j10O21J220J494K031K570K562
52500B97557K414K666K743K037J406J853K526J856K95q3J464L479M459M210K991
52485C31873R21j266k377k272k085k392k240o46J850L814M469M045L097K083J284
52470C40158P42M58O32J307J782J155m16j636j575n94M60J180J326M69j310k884
$$ plain form
52580 200849 200350 199791 199635 199685 199553 199825 201746 205435 209172 211056 210866 209853 209202 209329 210320 212253 215024
52563 215024 218251 221368 223535 223827 222048 219156 216367 214107 212542 212640 215398 220011 224138 226424 227535
52548 227535 228265 228163 227054 226475 227891 230358 231761 231888 232371 233781 234807 234648 234319 234839 235731 236243 236709
52531 236709 237634 238586 239142 240135 242825 247348 252788 258178 262705 265710 267434 269172 271862 275020 277721
52516 277721 279763 281078 281084 279921 279432 281275 284540 286783 287169 287059 287680 288900 290394 292425 294995 297557
52500 297557 299971 302637 305380 307417 308823 310676 313202 315058 315353 315270 316734 320213 324672 328882 331873
52485 331873 332794 331528 329151 326879 324794 322402 320162 319516 321366 325180 329649 333694 336791 338874 340158
52470 340158 340900 341358 341990 343297 345079 346234 345818 344182 342607 342013 342473 343653 344979 345448 344138 341254
52454C41254l169k444j818j541p60R29K637L239K670J706Q89K62k55p34j295j682
52438C39888j065R28L122L710K507J245J212J582R21n78j479j129j03R51J591
52423C53303J054r12k678j946J086L382K766O40j60Q67J809J359L51J88J027J916
52407C64052K129J896J955K617L288L100J899K80j133j933j633j02J659K290J854
$$ plain form
52454 341254 338085 335641 333823 332282 331522 332451 335088 338327 340997 342703 343592 343854 343599 342865 341570 339888
52438 339888 338823 339751 342873 346583 349090 350335 351547 353129 354050 353472 351993 350864 350761 351712 353303
52423 353303 354357 353445 350767 348821 349907 353289 356055 356695 356535 357402 359211 360570 360921 361109 362136 364052
52407 364052 366181 368077 370032 372649 375937 379037 380936 381216 380083 378150 376517 376415 378074 380364 382218
$$ [...]
##END NTUPLES=NMR SPECTRUM
##END=
