
##TITLE=AC1072_TOPL05_5819035_JyEpBJPI1D
##JCAMPDX= 6.0         $$ Bruker NMR JCAMP-DX V2.0
##DATA TYPE= NMR SPECTRUM
##DATA CLASS= NTUPLES
##ORIGIN= BRUKER
##OWNER= Administrator
$$ 1.72 TOPSPIN		Version 2.1
$$ 2012-03-28 11:08:39.140 -0500  Administrator@TOPSPIN
$$ Compression mode = diff/dup
##.OBSERVE FREQUENCY= 400.13188235
##.OBSERVE NUCLEUS= ^1H
##.ACQUISITION MODE= SIMULTANEOUS (DQD)
##.ACQUISITION SCHEME= undefined
##.AVERAGES= 8
##.DIGITISER RES= 22
##SPECTROMETER/DATA SYSTEM= spect
##.PULSE SEQUENCE= zg30
##.SOLVENT NAME= COFFEE_meoh
##.SHIFT REFERENCE= INTERNAL, COFFEE_meoh, 1, 14.98061
##AUDIT TRAIL= $$ (NUMBER, WHEN, WHO, WHERE, PROCESS, VERSION, WHAT)
$$ ##TITLE= Audit trail, TOPSPIN		Version 2.1
$$ ##JCAMPDX= 5.01
$$ ##ORIGIN= Bruker BioSpin GmbH
$$ ##OWNER= Administrator
$$ $$ C:\Bruker\TOPSPIN/data/COFFEE/nmr/AC1072_TOPL05_5819035_JyEpBJPI1D/20/pdata/1/auditp.txt
$$ ##AUDIT TRAIL=  $$ (NUMBER, WHEN, WHO, WHERE, PROCESS, VERSION, WHAT)
(   1,<2012-03-28 05:58:49.781 -0500>,<Administrator>,<TOPSPIN>,<go>,<TOPSPIN 2.1>,
      <created by zg
	started at 2012-03-28 05:57:43.156 -0500,
	POWCHK enabled, PULCHK disabled,
       configuration hash MD5:
       1A 1E CE 29 27 FD 77 03 67 4E F0 E3 C4 B2 CB 90
       data hash MD5: 64K
       67 D4 DE 74 8B C7 90 F7 DB D3 C9 8D BB 6C 53 00>)
(   2,<2012-03-28 05:58:53.734 -0500>,<Administrator>,<TOPSPIN>,<proc1d>,<TOPSPIN 2.1>,
      <Start of raw data processing
       efp LB = 0 FT_mod = 6 PKNL = 1 PHC0 = 0 PHC1 = 0 SI = 32K 
       data hash MD5: 32K
       6C 90 C4 1E 75 15 35 9A C3 8E 47 D1 E9 B7 36 CD>)
(   3,<2012-03-28 05:58:54.046 -0500>,<Administrator>,<TOPSPIN>,<proc1d>,<TOPSPIN 2.1>,
      <pk PHC0 = 214.5026 PHC1 = 0 
       data hash MD5: 32K
       4C 0D 48 EC 71 73 64 4B 0C 7D 78 66 11 14 98 34>)
(   4,<2012-03-28 05:58:54.109 -0500>,<Administrator>,<TOPSPIN>,<proc1d>,<TOPSPIN 2.1>,
      <abs ABSG = 1 
       data hash MD5: 32K
       75 90 12 37 A9 37 25 3E DA 45 09 ED 06 DB EC C1>)
(   5,<2012-03-28 05:58:54.140 -0500>,<Administrator>,<TOPSPIN>,<proc1d>,<TOPSPIN 2.1>,
      <abs ABSG = 2 
       data hash MD5: 32K
       BF 6E 84 BC 18 F4 94 89 10 D4 0E 77 02 47 87 D7>)
(   6,<2012-03-28 05:58:54.171 -0500>,<Administrator>,<TOPSPIN>,<proc1d>,<TOPSPIN 2.1>,
      <abs ABSG = 3 
       data hash MD5: 32K
       37 10 C8 23 36 51 A5 FB B0 21 55 74 25 8B 8D 3B>)
(   7,<2012-03-28 05:58:54.203 -0500>,<Administrator>,<TOPSPIN>,<proc1d>,<TOPSPIN 2.1>,
      <abs ABSG = 4 
       data hash MD5: 32K
       0F 0D A0 4A 47 69 73 1C 1F 5A 85 F8 01 0D 30 A5>)
(   8,<2012-03-28 05:58:54.250 -0500>,<Administrator>,<TOPSPIN>,<proc1d>,<TOPSPIN 2.1>,
      <abs ABSG = 5 
       data hash MD5: 32K
       68 6E A1 00 84 7E 2C 64 AB 5E FE 0B 06 21 CC 4D>)
(   9,<2012-03-28 05:58:58.500 -0500>,<Administrator>,<TOPSPIN>,<audit>,<TOPSPIN 2.1>,
      <user comment:
       ICON-NMR User ID: COFFEE
       data hash MD5: 32K
       68 6E A1 00 84 7E 2C 64 AB 5E FE 0B 06 21 CC 4D>)
$$ [...]
150 150 150 150 150 150 150 150
##$TP07= 0
##$TPNAME0= <>
##$TPNAME1= <>
##$TPNAME2= <>
##$TPNAME3= <>
##$TPNAME4= <>
##$TPNAME5= <>
##$TPNAME6= <>
##$TPNAME7= <>
##$TPOAL= (0..7)
0.5 0.5 0.5 0.5 0.5 0.5 0.5 0.5
##$TPOFFS= (0..7)
0 0 0 0 0 0 0 0
##$TUNHIN= 0
##$TUNHOUT= 0
##$TUNXOUT= 0
##$USERA1= <user>
##$USERA2= <user>
##$USERA3= <user>
##$USERA4= <user>
##$USERA5= <user>
##$V9= 5
##$VALIST= <valist>
##$VCLIST= <CCCCCCCCCCCCCCC>
##$VD= 0
##$VDLIST= <DDDDDDDDDDDDDDD>
##$VPLIST= <PPPPPPPPPPPPPPP>
##$VTLIST= <TTTTTTTTTTTTTTT>
##$WBST= 2048
##$WBSW= 25
##$XGAIN= (0..3)
0 0 0 0
##$XL= 0
##$YL= 0
##$YMAX_a= 529119
##$YMIN_a= -642672
##$ZGOPTNS= <>
##$ZL1= 120
##$ZL2= 120
##$ZL3= 120
##$ZL4= 120
##$ABSF1= 14.98061
##$ABSF2= -5.57192
##$ABSG= 5
##$ABSL= 3
##$ALPHA= 0
##$AQORDER= 0
##$ASSFAC= 0
##$ASSFACI= 0
##$ASSFACX= 0
##$ASSWID= 0
##$AUNMP= <proc_prof1d_extract_pilot.lims>
##$AXLEFT= 0
##$AXNAME= <>
##$AXNUC= <1H>
##$AXRIGHT= 0
##$AXTYPE= 0
##$AXUNIT= <>
##$AZFE= 0.1
##$AZFW= 0.1
##$BCFW= 0
##$BC_mod= 0
##$BYTORDP= 0
##$COROFFS= 0
##$CY= 15
##$DATMOD= 1
##$DC= 0
##$DFILT= <>
##$DTYPP= 0
##$F1P= 0
##$F2P= 0
##$FCOR= 0.5
##$FTSIZE= 32768
##$FT_mod= 6
##$GAMMA= 0
##$GB= 0
##$INTBC= 1
##$INTSCL= 1
##$ISEN= 128
##$LB= 0
##$LEV0= 0
##$LPBIN= 0
##$MAXI= 10000
##$MC2= 0
##$MEAN= 0
##$ME_mod= 0
##$MI= 0
##$NCOEF= 0
##$NC_proc= -8
##$NLEV= 6
##$NOISF1= 0
##$NOISF2= 0
##$NSP= 0
##$NTH_PI= 0
##$NZP= 0
##$OFFSET= 14.98061
##$PC= 1
##$PHC0= 214.5026
##$PHC1= 0
##$PH_mod= 1
##$PKNL= yes
##$PPARMOD= 0
##$PPDIAG= 0
##$PPIPTYP= 0
##$PPMPNUM= 2147483647
##$PPRESOL= 1
##$PSCAL= 4
##$PSIGN= 0
##$PYNMP= <proc.py>
##$REVERSE= no
##$SF= 400.13
##$SI= 32768
##$SIGF1= 0
##$SIGF2= 0
##$SINO= 400
##$SIOLD= 32768
##$SPECTYP= <>
##$SREGLST= <1H.CDCl3>
##$SSB= 0
##$STSI= 32768
##$STSR= 0
##$SW_p= 8223.68421052632
##$SYMM= 0
##$S_DEV= 0
##$TDeff= 65536
##$TDoff= 0
##$TI= <>
##$TILT= no
##$TM1= 0
##$TM2= 0
##$TOPLEV= 0
##$USERP1= <user>
##$USERP2= <user>
##$USERP3= <user>
##$USERP4= <user>
##$USERP5= <user>
##$WDW= 1
##$XDIM= 32768
##$YMAX_p= 463994813
##$YMIN_p= -728985
##$CURPLOT= <Network HP LaserJet P1505>
##$CURPRIN= <$Network HP LaserJet P1505>
##$DFORMAT= <normdp>
##$LAYOUT= <+/1D_H.xwp>
##$LFORMAT= <normlp>
##$PFORMAT= <normpl>
##$SURQMSG= 1
$$ End of Bruker specific parameters
$$ ---------------------------------
##NTUPLES= NMR SPECTRUM
##VAR_NAME=  FREQUENCY,     SPECTRUM/REAL,   SPECTRUM/IMAG
##SYMBOL=    X,             R,               I
##VAR_TYPE=  INDEPENDENT,   DEPENDENT,       DEPENDENT
##VAR_FORM=  AFFN,          ASDF,            ASDF
##VAR_DIM=   32768,         32768,           32768
##UNITS=     HZ,            ARBITRARY UNITS, ARBITRARY UNITS
##FACTOR=    0.250966925370066, 1,           1
##FIRST=     8223.43324360095, 62243,        -88978
##LAST=      0,             -22778,          -158719
##MIN=       0,             -728985,         0
##MAX=       8223.43324360095, 463994813,    0
$$ Real data points
##PAGE= N=1
##DATA TABLE= (X++(R..R)), XYDATA
$$ [...]
19449D517N4934J77584b30991A6454P3130b86814a2003k0770n62561a95819O8758
19438a27061H0695b37688B37347a15123l26473b05383N2288k1268A24571c9917
19427e9360K9002A78646c10315J44277g2034n2131B43479d8913D31707E1581a7235
19415A09831a36674j21321j8686J771a08738A81271c8892j35754j02885e1956
19404b66710d4640J3524p6m7889A30992b15466k81650h1291j1376k82797J74253
19393b01211B49137r2084B7691b88867Q5006o128P0458j2132k682k132o8438K8205
19381a96710K1404C00049e4560B8455a05129o062M7048A26555k7705i481l40834
19370c50315D7475e9873l02321J04742g4567k8872j41931k68796a50027J3441
$$ y = [4517, 59451, 237035, -230991, 16454, 89584, -286814, -12003, -32773, -595334, -195819, -127061, 80695, -237688, 237347, -115123, -441596, -205383, -153095, -174363, 124571, -39917, -59360, -30358, 178646, -310315, -166038, -72034, -124165, 243479, -48913, 431707, 51581, -17235, 109831, -136674, -257995, -276681, -274910, -108738, 181271, -38892, -174646, -277531, -51956, -266710, -44640, -31116, -31192, -79081, 130992, -215466, -497116, -81291, -92667, -375464, -201211, 249137, 157053, 27691, -288867, -203861, -209989, -139531, -151663, -154345, -156477, -224915, -196710, -175306, 300049, -54560, 28455, -105129, -111191, -64143, 126555, 98850, -9481, -350315, 47475, -59873, -362194, -257452, -74567, -103439, -245370, -514166, -150027, -136586]
19360a36586j07298A97978b20414a3830m0224E9761A5440c2112n0021D114b61294
19348a03618d2602l7423C6049J07877k4463f2920l01708a38378O4479c6794j34751
19337a71545k30851a01549o9473d0286H97J0281b17069P0405p72p5327m5074A64900
19324F7182b44532d7108j22851r4288a05180L0265A82305c8120k3577l9327j5188
19313a16212a4611j24046G84L3642c1578k51223Q3395k108d8028A65239a39989
19301B14015b95219j06091O8943f8826k61764B3785a40509A43776c07450d4584
19290C410c5170A1190g7208B31234h7452K7257j56607J07674p8573B63546d5795
19278I9323J38018c6960A71553b13064G0008e4945a5151p3657D9013b06776K0697
$$ y = [-136586, -243884, 197978, -220414, -13830, -54054, 59761, 15440, -32112, -82133, 4114, -261294, -103618, -42602, -80025, 36049, 143926, 119463, -62920, -364628, -138378, -73899, -36794, -171545, -402396, -101549, -171022, -40286, 897, 11178, -217069, -146664, -147436, -222763, -267837, 164900, 67182, -244532, -47108, -169959, -264247, -105180, -74915, 182305, -38120, -61697, -101024, -116212, -14611, -138657, 784, 34426, -31578, -282801, -199406, -201514, -48028, 165239, -139989, 214015, -295219, -401310, -332367, -68826, -330590, 23785, -140509, 143776, -307450, -44584, 3410, -35170, 11190, -77208, 231234, -87452, -60195, -216802, -109128, -187701, 263546, -45795, 99323, 237341, -36960, 171553, -213064, 70008, -54945, -15151, -88808, 49013, -206776, -186079]
19267a86079O7991B39954k1299B2470N7358k5273e3960j62706j71729C1970L5294
19256F7264R7913c13389h6241c8421l42697H3268c55844i4247A59432c733p9074
19245h2807q7520M9914j01055k6146J12619P855c2593M858A01589a24592l31906
19234d56498a37468F0729Q3468D0949b43001n8885j07236a70640c7573j70682
19224b08255D0941Q7064c09746A6835b61977C4008g6923o0768E7974a52197A05676
19212H3562J26984h9767R782p8493K1305j98787c4006j98972f9347e171A28211
19200a79795A73528A1303L93690A11179J40941a15531b2202C3523R9912c5961
19189a09293m13495J16398f4558D0971P4617a64240B40433c24258M8690c6419
$$ y = [-186079, -118088, 239954, 218655, 22470, 79828, 54555, -53960, -216666, -388395, 31970, 67264, 165177, -313389, -86241, -38421, -381118, 83268, -355844, -94247, 159432, -3733, -82807, -170327, -120413, -221468, -247614, -134995, -127140, -32593, -27735, 101589, -124592, -456498, -137468, 60729, 144197, 40949, -243001, -301886, -409122, -170640, -37573, -208255, 40941, 128005, -309746, 16835, -261977, 34008, -76923, -137691, 57974, -152197, 105676, 83562, 210546, -89767, -79985, -158478, -137173, -335960, -34006, -232978, -69347, -5171, 128211, -179795, 173528, 11303, 404993, 111179, 252120, -115531, -22202, 33523, 133435, -35961, -109293, -522788, -406390, -64558, 40971, 115588, -164240, 240433, -324258, -275568, -36419]
19178c0511k59054a22929A43307c20402c9490A89530c75093A983O4385a17221
19167A27413d3339C5866N929N404a62334C3445J00215e6830A0529g5094l74542
19156d49636N674h7397B512b65036d3688C2399a07007C083e5972k321A37966c34183
19143b42550Q9397c8582m060G6326f03015c1536k51300a39382A70078k3286b26461
19131a15783N1728A67382c51446Q4230m8191i513j0530E9559i9419j30996B58048
19119B14079b29177A2682i0093I4228n157m1808a63289n4185B37249B5847J58353
19108A84200H8706b20224c8554H1228Q2838a2786j02089j08426p2744G8438J70777
19097B49215b50899E7821a53808j69265d9978k10686E4504g566j05328M1588p2161
$$ y = [-30511, -289565, -122929, 143307, -320402, -39490, 189530, -375093, 1983, 66368, -117221, 127413, -43339, 35866, 41795, 47199, -162334, 33445, 133660, -56830, 10529, -75094, -449636, -443962, -87397, 2512, -265036, -43688, 32399, -107007, 3083, -55972, -58293, 137966, -334183, -242550, -153153, -38582, -42642, 76326, -603015, -31536, -282836, -139382, 170078, 146792, -226461, -115783, -64055, 167382, -351446, -267216, -315407, -9513, -20043, 59559, -99419, -230415, 258048, 214079, -229177, 12682, -90093, 94228, 89071, 47263, -163289, -217474, 237249, 25847, 184200, 88706, -220224, -38554, 81228, 164066, -12786, -114875, -223301, -296045, 78438, 249215, -250899, 57821, -153808, -323073, -49978, -260664, 54504, -7566, -112894, -71306, -143467]
19086a43467N4714J1348L0636A1539e2125O039k33171h6500A11386a40157k27496
19075c67653J09900b3194h871j33509N1975k7538j26164h2488j0100G2208c53725
19063a57804A83206F3908a95022i2914A4394J50379b3909k79512A80633E2523
19052a97146F3932a34386B14176a1664I0617k8652B0952N2242a20567D08357h5864
19040D31587a5446B44106a32327k42982I9995c0157j46272g6604a274A99350b7575
19028a40072C9009J36973a44139a9398A14924B663a52200j63385I1102B841L00523
19017C03364a0868C4229c7411A02089a16882L4027k55889C2583K8472b98607P1997
19006b26610A20486a02884r3235M5202B41129c5863j72207m2799f1052A25663
$$ y = [-143467, -88753, -77405, -46769, 11539, -52125, -46086, -279257, -86500, 111386, -140157, -367653, -257753, -23194, -8871, -142380, -90405, -117943, -244107, -82488, -92588, 72208, -353725, -157804, 183206, 63908, -195022, -92914, 14394, 164773, -23909, -303421, 180633, 52523, -197146, 63932, -134386, 214176, -11664, 90617, 61965, 20952, 73194, -120567, 408357, -85864, 431587, -15446, 244106, -132327, -375309, 99995, -30157, -176429, -76604, -1274, 199350, -27575, -140072, 39009, 175982, -144139, -19398, 114924, 2663, -152200, -315585, 91102, 2841, 303364, -10868, 34229, -37411, 102089, -116882, -82855, -338744, 32583, 61055, -298607, -226610, 120486, -102884, -196119, -150917, 241129, -35863, -208070, -250869, -61052, 125663]
18995A41893J06706c05727A5136O6301Q2160a46893b8475m069k65236q3196a77580
18983h7442J4368k17439A80860b9897a1335q6220j54558H1824h585l6648A48515
18971a74018A28480l9939j3729f6040I8276c96570B16465J86433A03957Q1731
18961A85688L8825o9670a15912G2790K93576K79738B01306J73785f5861A26951
18950a04621k12804j38845B75156l3869a2874A68586b77626A0796a39380D03389
18939a01573J3718K4457k40177O8419C4409N6604e0289C8540c40612a17451l4879
18928a52330A22131h7924D4188f78566A2118R7221J66381F7630M3393l6917N4056
18917A28162O4017h417k3946J0334A65813E1837J83460I5166J29354d2338A01264
$$ y = [141893, 248599, -305727, 15136, 81437, 163597, -146893, -28475, -32544, -297780, -380976, -177580, -87442, -73074, -290513, 180860, -29897, -11335, -97555, -252113, 81824, -8585, -45233, 148515, -174018, 128480, 88541, 74812, -66040, 98276, -396570, 216465, 402898, 103957, 185688, 224513, 154843, -115912, 72790, 366366, 646104, 201306, 375091, -65861, 126951, -104621, -317425, -456270, 275156, 241287, -12874, 168586, -277626, 10796, -139380, 403389, -101573, -87855, -63398, -303575, -235156, 34409, 91013, -50289, 38540, -340612, -117451, -152330, 122131, -87924, 44188, -678566, 12118, 109339, 275720, 67630, 111023, 74106, 128162, 192179, -8417, -32363, -22029, 165813, 51837, 235297, 95166, 224520, -42338, 101264]
18905b3303j99575K3276B4996c04940a23985d4268l44714F2535P0831f1351G32544
18893D32012L1606A21776J65984b11204A17904k1233A8000L09855q8534A13257
18882F3578a8831H6191J32695i043c700k40672e9824o769m3199J1763A20293J29946
18870B50239a74945j7484B88575b72661H1174a27316j13912I0535a6769q1186
18860i7955A80224b51369a03339O127C8474h0345j16320f1778j65645N3551B2280
18848f9702H3021j7671a81069A16693b20242e0373D74688d4764j37443D6774N0167
18837I6941b17826N8761K7175A34091b0781A42898b48947A59681a87770H3476
18826e5557C1187P0282h8195C4169J31240b51163f7517l22294B92819c84847A23000
$$ y = [-23303, -222878, -199602, 24996, -304940, -123985, -44268, -388982, 62535, 133366, -61351, 732544, 432012, 463618, 121776, 287760, -211204, 117904, 96671, 18000, 327855, 239321, 113257, 63578, -18831, 86191, 218886, -9043, -3700, -244372, -59824, -66593, -109792, -98029, 120293, 250239, -174945, -192429, 288575, -272661, 81174, -127316, -241228, 90535, -16769, -97955, 180224, -251369, -103339, -97212, 38474, -80345, -196665, -61778, -227423, -173872, 22280, -69702, 83021, 65350, -181069, 116693, -220242, -50373, 474688, -44764, -182207, 46774, 96941, -217826, -159065, -131890, 134091, -20781, 142898, -248947, 159681, -187770, 83476, -55557, 31187, 101469, -88195, 34169, 165409, -251163, -67517, -389811, 292819, -384847, 123000]
18814A57126J94a02963N0323o1424C59033c0137j9004E7369P5782m5556g1530
18802a04085B57441c14734A29558c40004A89768C7055h2009I4615b32912B72747
18791a12047r3290C61320A38029a84794o9884G249c32618H3754J7913e57903a57518
18779a08864A43224g0428G6842a39383o1370m3675c5031l17140B54060g3488F0046
18767A66189C2992f0144E5096O0926C8391K9165d32654H9434c97928H1462b34568
18755A24851b10181l7468O1075f6170I4173d7162o8800A53159a38741A41391o9864
18744G1527d5691H6776M6a89634K5962j26419E0276a54481A28653b79205N4030
18733b25175b5681m78547g2249l2238G5739B9005d3667A09923c0509n9933G0105
$$ y = [157126, 157320, -102963, -52640, -114064, 359033, -30137, -49141, 57369, 133151, 87595, -71530, -104085, 257441, -314734, 129558, -340004, 189768, 37055, -82009, 94615, -232912, 272747, -112047, -205337, 361320, 138029, -184794, -254678, 7249, -332618, 83754, 101667, -557903, -157518, -108864, 143224, -70428, 76842, -139383, -200753, -244428, -35031, -352171, 254060, -73488, 60046, 166189, 32992, -60144, 55096, 116022, 38391, 67556, -432654, 89434, -397928, 81462, -234568, 124851, -210181, -247649, -186574, -66170, 94173, -47162, -115962, 153159, -138741, 141391, 71527, -45691, 86776, 86822, -189634, -163672, -290091, 50276, -154481, 128653, -279205, -225175, -25681, -504228, -72249, -104487, 75739, 29005, -43667, 109923, -30509, -90442, 70105]
18721B82175C8764J9905k3127c90170C0836J76321b24596j13315c1725j60428
18711a92153A50393F4288c54810D407a54116L2908A7997b01051j29474g7410q691
18700h6101B37564d25548A49143c42988A1930M5553c00487Q9609d6280r3286j32962
18689b72528H5346e1528k04681e2580A04658j6095P4324a27280H9844h818j96423
18678b05241A88446a97620B53319b80533B7661d7748A98172c42349A34216E8200
18667b7662R068r232B04422c5970j41208G495a07691k38870J48179j61157B3976
18655G839J0362c23463a1619M764j86415Q1041L9254b9688j3040j02156j6840
18644a61724n3857d8134k48448a03921K7826n5891A91548c04447J31138A38721
$$ y = [282175, 38764, 58669, 35542, -390170, 30836, 207157, -224596, -337911, -31725, -192153, 150393, 64288, -354810, 4407, -154116, -121208, 17997, -201051, -330525, -77410, -86101, 237564, -425548, 149143, -342988, 11930, 57483, -300487, -210878, -46280, -139566, -272528, 85346, -51528, -256209, -52580, 104658, 88563, 162887, -127280, 89844, -8818, -205241, 188446, -197620, 253319, -280533, 27661, -47748, 198172, -342349, 134216, 58200, -27662, -18594, -27826, 204422, -35970, -177178, 7495, -107691, -346561, -198382, -359539, 23976, 7839, 18201, -323463, -11619, -6855, -193270, -112229, -72975, -29688, -42728, -144884, -161724, -215581, -48134, -296582, -103921, -76095, -131986, 191548, -304447, -173309, 138721]
18633A7759c65C9791h1584J5160B87749a20708j12554L5393A3540b27932G5716
18621a00525A5525f467A58260b43465B10131d2876A50108g9833C1497d8462I4209
18609e09782a85870B8114a3876F9382b36304a14564a4376q3111o3310c6480l38523
18598c75003B05231N9444c89017a3584k56685J17893K5134c4525j80460A26072
18587A5102h7377l50172A34043a47265f0648j57659i1806L3492j03314C8911e1388
18575b80797C0229j1292b96191C05326d0887E1094A6922K62119c02671A07910
18564b7316B71939a01987A78906o8668D373M03413g8636b4100A53595B1012c3042
18552B0083i9556B1225K6689K61988b55495G989b27133F9405b31971B7001M5635
$$ y = [17759, -365, 39791, -81584, -66424, 287749, -120708, -233262, -197869, 13540, -227932, 75716, -100525, 15525, -6467, 158260, -243465, 210131, -42876, 150108, -79833, 31497, -48462, 94209, -509782, -185870, 28114, -13876, 69382, -236304, -114564, -14376, -97487, -160797, -36480, -375003, 205231, 264675, -389017, -13584, -270269, -152376, -127242, -34525, -214985, 126072, 15102, -87377, -437549, 134043, -147265, -60648, -218307, -91806, -58314, -161628, 38911, -51388, -280797, 30229, 18937, -296191, 305326, -40887, 51094, 16922, 279041, -302671, 107910, -27316, 271939, -101987, 178906, 110238, 4373, 407786, -78636, -24100, 153595, 21012, -33042, 20083, -99556, 21225, 47914, 309902, -255495, 7989, -227133, 69405, -231971, 27001, 72636]
18541G2636Q7339g6955a0330B28875a89915E9336a21152A60742C6746a37350N3135
18530h4215O87A12428b92520i6690n2154A25563a68775j46855F1005j5899M2626
18519H7732C4699h6026a8670B0547a389j30814k14601f6212E8418K1936B2563
18507g2536C16410j36845a18576F369a79729D1683B720M7300h0489Q700o6492
18496a38281A4286J83031g1248A29593c39587r8818A14312a39994A31240D4905
18485d2743k05781g2919B08699F8600b38633i0958l04189B01732c5445j52055
18475a87500A34177D6469Q2487a52259k15211a16053A56230b35757B2866J44172
18465A67038g1997C47386b08291e2112I595b13293j46719a62807e8457j42479
$$ y = [72636, 159975, -76955, -10330, 228875, -189915, 59336, -121152, 160742, 36746, -137350, -84215, -83528, 112428, -292520, -96690, -148844, 125563, -168775, -315630, 61005, 45106, 87732, 34699, -86026, -18670, 20547, -1389, -132203, -346804, -66212, 58418, 80354, 22563, -72536, 316410, 179565, -118576, 6369, -179729, 41683, 2720, 50020, -80489, -71789, -138281, 14286, 197317, -71248, 129593, -339587, -438405, 114312, -139994, 131240, 44905, -42743, -248524, -72919, 208699, 68600, -238633, -90958, -395147, 201732, -35445, -187500, 134177, 46469, 128956, -152259, -367470, -116053, 156230, -235757, 22866, 167038, -71997, 347386, -208291, -52112, 9595, -213293, -360012, -162807, -58457, -200936]
18455b00936M2736B45429D1545i1266j29934C06434b3677A36571a85894A39468
18444a79026B81068a12557j98921e8295D2233L2292g6493A22918N7846c15346
18433b44060J11370K6030d0943G2496f6371A86405E4296K0232b29729A77803h6976
18421D5419d2474l03570d5247A42075a41689G2554k2272b8885j12229B56550j24592
18410A31958j9278G853N5085c77588f7537c185r0325k06581R0415P749R3505G7006
18397h6162A60276i0797j47448c8516J3354r3459A02872l4885b36576E9715G066
18385A87928b4520C1877h7961A87888l2882D9790b02783b7179j10320j40358d5484
18373f5607B90054b02028H8378b47490F3192c87832a45772d2738o4165l75434
$$ y = [-200936, -158200, 245429, 41545, -91266, -221200, 306434, -23677, 136571, -185894, 139468, -179026, 281068, -112557, -311478, -58295, 42233, 74525, -76493, 122918, 180764, -315346, -244060, -132690, -106660, -40943, 72496, -66371, 186405, 54296, 74528, -229729, 177803, -86976, 45419, -42474, -346044, -45247, 142075, -141689, 72554, 50282, -28885, -141114, 256550, 131958, 112680, 7853, 62938, -377588, -67537, -3185, -93510, -300091, -209676, -201927, -108422, 77006, -86162, 160276, -90797, -238245, -38516, -25162, -118621, 102872, 67987, -236576, 59715, 7066, 187928, -24520, 31877, -87961, 187888, 155006, 49790, -202783, -27179, -137499, -277857, -45484, -65607, 290054, -202028, 88378, -247490, 63192, -387832, -145772, -42738, -106903, -482337]
18363d82337g2265A03190e4398m55454K28874e0152C0607b13670g1548j08912
18353a80460j67353A54971a84593A7597a84505p7069c6439A44625g5529O907n8971
18342a27593d9722A93179C593M757K426L6015i0540j5692A44146g2027B86559
18330B6931J40893f1770I0262i3924j27027Q3195A77276H0448r251C4710J23696
18319A58406c57169e1949G9059M9939a5907H7503N0417j5441d9096B37431e8266
18307a41292j21778h3404A08647b13316I6292a00678c3579p3688B59405j24657
18297A34748C1715b03222G8362b58630B64113G6863b84832C8789n085i0361D0804
18285h1496i085j82966A13918i2613d4289A33941B0936N5823O1799b48245b8147
$$ y = [-482337, -72265, 103190, -54398, -509852, -280978, -50152, 30607, -213670, -71548, -180460, -347813, 154971, -184593, 17597, -184505, -261574, -36439, 144625, -75529, -68622, -127593, -49722, 193179, 3593, 8350, 10776, 46791, -90540, -106232, 144146, -72027, 286559, 26931, 167824, -61770, 90262, -93924, -220951, -137756, 177276, 80448, 71197, 34710, 158406, -357169, -51949, 79059, 128998, -15907, 87503, 137920, 122479, -49096, 237431, -58266, -141292, -263070, -83404, 108647, -213316, 96292, -100678, -33579, -107267, 259405, 134748, 31715, -203222, 78362, -258630, 264113, 76863, -284832, 38789, 33704, -90361, 40804, -81496, -9085, -192051, 113918, -92613, -44289, 133941, 20936, 76759, 138558, -248245, -28147]
18273I6726H804N7850O8455O7040A4289a89270k4094o2708B0583i569A91517a17574
18260d879j79810J6554d9049I2793O7275a44799F6437f5332k11326C04119p9157
18249B24962b86665a5970A7051J44479F4348L4235o8M6412m0801b75991B5183
18237h1700m1325B18039G0479K51165c71219B63869q7338a12216c1870A14056
18226D73142A3606a4322I5795b670j503r5912j5185A11835b09628F7421J16709
18215A84130a4586A063a26992B7349R3233J46088c24386e9166A19342m0386O4244
18204A43200d2472j70503B57557i51j10435j44113f5475l4552p1914L9636I0947
18192c2942D3661K0480b41833h1807h831r1066L325D5435b26643d8213l2141H7217
$$ y = [96726, 8804, 66654, 135109, 202149, 14289, -189270, -213364, -276072, 20583, -9569, 191517, -117574, -4879, -184689, -168135, -49049, 92793, 160068, -144799, 66437, -65332, -276658, 304119, 224962, -286665, -15970, 17051, 161530, 64348, 98583, 98515, 144927, 104126, -275991, 25183, -81700, -123025, 218039, 70479, 321644, -371219, 263869, 176531, -112216, -31870, 114056, 473142, 13606, -14322, 95795, -2670, -4173, -100085, -115270, 111835, -209628, 67421, 184130, -14586, 1063, -126992, 27349, 120582, 266670, -324386, -59166, 119342, 78956, 143200, -42472, -212975, 257557, -951, -111386, -255499, -65475, -100027, -171941, -132305, 90947, -32942, 43661, 64141, -241833, -81807, -8831, -99897, -96572, 45435, -226643, -48213, -80354, 87217]
18179B48377h5914k56924f8194b668B31857a82575A06044b03202c0156j93323
18169b23479I5588J93112b43928A20476a91936R5471H3209b89550A37096c23827
18158a91177e3122B77349I7929a00223F7494B6167b37764R1273a1827j19065B05129
18146A23915a79961a2822A36172B6810b69087c2508G0537d7251O749A47826a60569
18134a81464P6796c1554C68425f365I7630F550b52461J25907C59885a36433A68139
18122i1294B07219f2663j30763E4178b58602G8737N0509m7172K32795j3638g5635
18110e2476J8602k41740J04975I8643e0367q5226l06192a18248k64340A70476
18099a2767H2335b3241C3057b11220d4671n4818H2291K0602K32738a37916L6710
$$ y = [248377, -85914, -342838, -68194, -2668, 231857, -182575, 106044, -203202, -30156, -223479, 95588, 288700, -243928, 120476, -191936, -96465, 83209, -289550, 137096, -323827, -191177, -53122, 277349, 97929, -100223, 67494, 26167, -237764, -146491, -11827, -130892, 205129, 123915, -179961, -12822, 136172, 26810, -269087, -32508, 70537, -47251, -40502, 147826, -160569, -181464, -104668, -31554, 368425, -6365, 97630, 6550, -252461, -126554, 359885, -136433, 168139, -91294, 207219, -62663, -193426, 54178, -258602, 78737, 129246, 82074, 314869, 301231, -75635, -52476, -33874, -275614, -170639, 98643, -50367, -135593, -441785, -118248, -382588, 170476, -12767, 82335, -23241, 33057, -211220, -44671, -99489, 82291, 102893, 335631, -137916, -101206]
18088a01206j17942j69597a70102A338f2778j90154A26174E2189e5972A01552
18077c72735a03037a9928A69523a07436I9848M3614j5719a02760c7717j51287
18067a89004b7183A52854g2898F8291a76935C1493j4987b79882B47536A04106
18056C4291a59940C28514F4851f977B24309a70077F5269g6654A64832j9509C6730
18044f0526A95673a71670D22365B8285J36871b7032m073H8709a58086j66271F6127
18032A20838n768n4496i1489B07935f9741L0943C2608f3272D9618M1621m3872
18021D7367o570N2019J07544K600a8281r619l51124A48514K9667a9390A08908
18009A79918k2469c59308p3061a12927A22184C4138i8083I5782e7532m852B65714
$$ y = [-101206, -219148, -388745, -170102, 1338, -62778, -252932, 126174, 52189, -55972, 101552, -372735, -103037, -19928, 169523, -107436, 99848, 143462, 127743, -102760, -37717, -189004, -27183, 152854, -72898, 68291, -176935, 31493, 16506, -279882, 247536, 104106, 34291, -159940, 328514, 64851, -6977, 224309, -170077, 65269, -76654, 164832, 145323, 36730, -60526, 195673, -171670, 422365, 28285, 165156, -27032, -31105, 88709, -158086, -324357, 66127, 120838, 115070, 60574, -91489, 207935, -69741, -38798, 32608, -63272, 49618, 91239, 47367, 40797, 92816, 200360, 202960, -18281, -27900, -379024, 148514, 178181, -19390, 108908, 179918, 157449, -359308, -432369, -112927, 122184, 34138, -98083, 95782, -57532, -62384, 265714]
17997f5938A54824a22914A0382b1777H9197Q4002b43194O587B96700c02421B39689
17985A54783b96819g4759A3239a84229G4851J46219c7430A76281b23979R5736
17975a28243B72408a06702m2779k5871K3800a0784k31343P3953I974a11153j17569
17964b28722C0624a3263j62708a0266D07968d9022A50029c04321c5052q7964A54125
17952D13488a11452j20221j53088A42285a86696j41796A21659m0668K23468a17828
17941c13117i3660C97397a53584I7546a8253A50227m8542k9538e9990A29606L6597
17930A66203a14725A39820N2256r1233L3000K15444j44396g6002c7384B0419a82507
17918B0495a17728B26610c31905D6082A00M93J37412M329g2456I2503R357b09794
$$ y = [-65938, 154824, -122914, 10382, -21777, 89197, 173199, -243194, -236607, 296700, -302421, 239689, 154783, -296819, -74759, 13239, -184229, 74851, 221070, -37430, 176281, -223979, -128243, 272408, -106702, -149481, -175352, -151552, -10784, -242127, -168174, 9974, -111153, -228722, 30624, -13263, -175971, -10266, 407968, -49022, 150029, -304321, -35052, -123016, 154125, 413488, -111452, -231673, -384761, 142285, -186696, -328492, 121659, 80991, 304459, -117828, -313117, -93660, 397397, -153584, 97546, -18253, 150227, 101685, 72147, -59990, 129606, 166203, -114725, 139820, 192076, 100843, 133843, 349287, 204891, -76002, -37384, 20419, -182507, 20495, -117728, 226610, -331905, 46082, 100, 593, 138005, 142334, -72456, 92503, 101860, -209794]
17905C0731K49912g4907D35506b13676E0587a36242B09239a48911B96536B6959
17894B4456b07302E9506b83578a26677j77265F7977a55495K2893B37387a96863
17883E2534L19070g1750j51866g6904A58720a17512G5115R5609n6895J2901P4081
17872B00811r6387h3593A40405K72382j39814E2068J30847m5859n8809b75195
17861C61305a91996C6213K71677d4158l3263N815D6498J2900g1774q8298C19168
17849g2476j4423A10851b74699A07537L4501D0674b1714j83710b41E8280a00939
17837E0920a22409E8128i143C31845q394b17728A04558J12456a24406A68893f6803
17825b97174E9809a76559A64939j972H0481l7393K00343j21177b66637D0532L0554
$$ y = [30731, 280643, -74907, 435506, -213676, 50587, -136242, 209239, -148911, 296536, 26959, 24456, -207302, 59506, -283578, -126677, -303942, 67977, -155495, -132602, 237387, -196863, 52534, 371604, -71750, -223616, -76904, 158720, -117512, 75115, 170724, 113829, 126730, 200811, 104424, -83593, 140405, 412787, 272973, 52068, 182915, 137056, 78247, -275195, 361305, -191996, 36213, 307890, -44158, -77421, -71606, 46498, 59398, -71774, -160072, 319168, -72476, -86899, 110851, -274699, 107537, 142038, 40674, -21714, -205424, -241, 58280, -100939, 50920, -122409, 58128, -9143, 331845, 323451, -217728, 104558, 217014, -124406, 168893, -66803, -297174, 59809, -176559, 164939, 162967, 80481, 43088, 243431, 122254, -266637, 40532, 71086]
17814G1086J9286J8084j465a35479M9214l0991A64392b39275g3745A78716A2203
17802B22084B0316K29544a95535E1453J19343h5037C64148F71c1952A06580c6225
17790H5943B7990i5354B03683a33816B45503J05442j12090i7289A14976Q4267
17780A99243c0852E7944K6795K07452A28716h0247b8078C940K89760a3699A6404
17768C32062a43959G9165i2442B47617G9724o365N5329e195k3864n5587n9604
17757a44250B12106j02713e6824D0894a1231B50849H6398L8798b09336K6983B47727
17745I5477b55845e517E44205a64626P8197j1720C85134r1322G1611A4953K08259
17734B23212a0306C62910G3095B4143a53696C15365j49802k8900B5043a1086C19265
$$ y = [71086, 90372, 108456, 106991, -135479, -86265, -117256, 164392, -239275, -73745, 178716, 12203, 222084, 20316, 249860, -195535, 51453, 170796, -85037, 364148, 671, -31952, 106580, -36225, 85943, 27990, -95354, 203683, -133816, 245503, 350945, 238855, -97289, 114976, 199243, -30852, 57944, 84739, 292191, 128716, -80247, -28078, 3940, 293700, -13699, 16404, 332062, -143959, 79165, -92442, 247617, 79724, 73359, 128688, -5195, -29059, -84646, -144250, 212106, 109393, -56824, 40894, -11231, 250849, 86398, 125196, -209336, -182353, 247727, 95477, -255845, -5517, 544205, -164626, -86429, -98149, 385134, 293812, 71611, 14953, 223212, -10306, 362910, 73095, 24143, -153696, 315365, 165563, 136663, 25043, -11086, 319265]
17722C3226N9805a51833g5894C7907d2846A99962p1914g2327I2142e254A87189
17710h1120A74055a06290I4100R6534n1349b85605D2623N9929J84863A21485L5198
17699A56683a45540A15188a1764B38431C6443J32971H4049a45855A76744L0148
17689B06892J8196l2827N3217A1842J6230J50803K91859C6304b24180A11811i5837
17677B46411D194i3137f951I0629p424L11078a8594D6914N4744R4864e3996p0175
17665a24171B19329R5371A5877B077J00292J05472b01770C15041E3069J24201
17655A77270q1087N4563n4187m4184r54K08622j21957j6121l3805L08259E5995
17643B59153J00964C4368J33981M2725J13090E0883K07694k8712A6564Q8869B8658
$$ y = [33226, 93031, -151833, -75894, 37907, -42846, 199962, 128048, -72327, 92142, -5254, 187189, -81120, 174055, -106290, 94100, 190634, 139285, -285605, 42623, 102552, 287415, 121485, 156683, -145540, 115188, -11764, 238431, 36443, 169414, 84049, -145855, 176744, 206892, 225088, 192261, 245478, 11842, 28072, 178875, 470734, 36304, -224180, 111811, -95837, 246411, 4194, -93137, -6951, 90629, 83205, 394283, -18594, 46914, 101658, 196522, -53996, -124171, 219329, 314700, 15877, 2077, 102369, 207841, -201770, 315041, 53069, 177270, 96183, 150746, 96559, 52375, 51421, 260043, 138086, 121965, 88160, 396419, 55995, 259153, 360117, 34368, 168349, 211074, 324164, 50883, 258577, 229865, 16564, 105433, 28658]
17631g3474A84264g303r9960n940L9699B45887j3934K3606h6252C1427K41301
17620B72728a3971A88681n009F5527e7930m5502A10687L6148a2094j57335B26814
17608I7703j5674j8739a07929c9838j11763A67422f7297B04482I0773J92477P1920
17597C55170j17599a73039C58209p9156f9748a1578M644j72692E5649K73724b0083
17585a21775D4522L9227R3626K57661a3604H7930M3317a58292B72373r0587J43125
17574C24911p5455j07496g44C05720j13267b88337A38121J47420B3590L38781
17564C62371r7045H3863d6180E9073R723J48799B1102L79721j71254P0845c6189
17552B63619p4834a4624A60510k9314J06949l7799I1474J59897A06586J15937
$$ y = [-73474, 184264, -7303, -107263, -113203, -73504, 245887, 231953, 255559, -86252, 31427, 272728, -13971, 188681, 183672, 65527, -57930, -103432, 110687, 146835, -12094, -169429, 226814, 97703, 82029, 63290, -107929, -39838, -151601, 167422, -67297, 204482, 90773, 283250, 355170, 237571, -173039, 358209, 279053, -69748, -11578, -6934, -179626, 55649, 329373, -20083, -121775, 44522, 83749, 177375, 435036, -13604, 87930, 131247, -158292, 272373, 181786, 324911, 249456, 141960, -744, 305720, 192453, -288337, 138121, 285541, 23590, 362371, 265326, 83863, -46180, 59073, 68796, 217595, 21102, 400823, 229569, 300414, -36189, 263619, 188785, -14624, 160510, 131196, 238145, 200346, 91474, 251371, 106586, 222523]
17542B22523P1374q6985P9044h7372B22541f7958B30783p4646J86840A15606J89971
17531C05577o6866H4126J12457g7425C50406q4953E7471h75B36952K54892a06239
17519B62879J55366j48017c2587B51619L44037p4238j18528p2953L59862L45507
17509A035306l7253j60173k3433l19726j52514M80291C10405J96429M8938J35695
17499F91467A92552N06902j47740m9728K42281J80461k46516n0024R5505K43174
17489I66867k29233q9370A09062M48419j00683B19201C4998K62841q5131K50520
17479D63228A60926J40156l4242C299J16689L1742K42038J53434A62118L54892
17469E17010j3700j65204C633J81367K97212Q0412j87178A79515L4050N1596J72625
$$ y = [222523, 293897, 206912, 285956, -87372, 222541, -67958, 230783, 156137, 342977, 115606, 305577, 238711, 84126, 196583, -77425, 350406, 265453, 57471, -875, 236952, 491844, -106239, 262879, 418245, 270228, -32587, 251619, 595656, 521418, 402890, 329937, 689799, 1035306, 998053, 837880, 814447, 494721, 342207, 822498, 310405, 506834, 555772, 691467, 192552, 699454, 551714, 501986, 744267, 924728, 678212, 628188, 723693, 966867, 737634, 648264, 109062, 557481, 456798, 219201, 34998, 297839, 212708, 463228, 160926, 301082, 266840, 3299, 119988, 151730, 393768, 547202, 162118, 517010, 503310, 338106, 3633, 185000, 482212, 562624, 375446, 179515, 213565, 265161, 437786]
17458D37786N5937k3941O1358A05514L640K89852j13573O5159O0137j46765P2589
17447C36553l3182L88762k57856G5241J62182m5082J77804N7185I3818J47171
17437B40989Q9114j01318Q7344K85787q0631j37484K95288k44375A82242M38164
17427F20406l08790K26442j56942L8836J20629J02302q1003j39351J3532j41233
17417B94828r7779L31367j55831j29835M18014k14956j21419n8976L07209J23907
17407F96529C30739j65368L23228J58189l6695r2324K87762k47130K40497C18538
17396E37286N7286k2256k79456J18995P0713p0446L1156j66712K41306A59875
17385B49721O1849K07316B35920K40709p1576m8854j74739M15395A05797M775
$$ y = [437786, 493723, 469782, 531140, 105514, 109154, 399006, 285433, 350592, 410729, 263964, 336553, 303371, 692133, 434277, 75241, 237423, 192341, 370145, 427330, 93818, 240989, 330103, 228785, 316129, 601916, 521285, 383801, 679089, 434714, 182242, 620406, 311616, 538058, 381116, 419952, 540581, 642883, 561880, 422529, 436061, 294828, 197049, 528416, 372585, 242750, 660764, 445808, 324389, 265413, 572622, 696529, 330739, 165371, 488599, 646788, 610093, 517769, 805531, 558401, 798898, 318538, 537286, 594572, 572316, 292860, 411855, 482568, 412122, 443278, 276566, 517872, 159875, 249721, 311570, 518886, 235920, 476629, 405053, 356199, 181460, 596855, 105797, 110572]
17375A10572J32342L29910j25213j81346h2618I7148L27064k6783j80166M68311
17365F85574n2645A45978R2561d713B32134A00404L03252E8715K04278J01648
17355C64641G7930J25428p224J3506M10738j92115E7419J60417O9831J55506A11402
17343F61663l01824A18081L12376j32366b8839b862A60090k8109b9480D68152
17332C51300g68D11276j15211L43350B50639K72346A58932l665J61301o6366M8305
17321B98507M11793l42249A33656l1460l4139K05715b2386D94216o6877j71088
17311B56251P0923n3884J99963H9415J08086J35324K1250G4899L80234A28938
17300D82116B27855D3831J85564N0465k0410j28617P2537m9104L60068n251K4832
$$ y = [110572, 242914, 572824, 447611, 266265, -82618, 97148, 424212, 397429, 217263, 685574, 632929, 145978, 238539, -4713, 232134, 100404, 403656, 58715, 262993, 364641, 77930, 203358, 196134, 209640, 620378, 428263, 57419, 217836, 287667, 443173, 111402, 661663, 359839, 118081, 430457, 298091, -28839, -2862, 160090, 131981, -29480, 468152, 351300, -768, 411276, 296065, 639415, 250639, 522985, 158932, 155267, 316568, 250202, 298507, 710300, 368051, 133656, 102196, 68057, 273772, -22386, 494216, 427339, 256251, 327174, 273290, 473253, 89415, 197501, 332825, 354075, 74899, 455133, 128938, 482116, 227855, 43831, 229395, 279860, 259450, 130833, 203370, 154266, 514334, 509083, 533915]
17289E33915N5998Kd1496B56685D4461K34685K31954k41789J96002j99613N1749
17278C17449K61990k76525A09998a2486C10262K95486A40557J60295L03645B33
17267E36464j13989p6368k6322N4891J14266k41222K40679j47841L7064A80924
17256E94972A74168J08699K37420M9796m5496j1740A49837J20097J78787A54088
17245E30433m1541q1020b10587A73467L34342M3784B2770e6213C19785l821R9114
17234D15078O470k03813Q1075K07644j27842o5048L67743k43715j52572J71485
17224D56505K73123B76593m8334N9751L20922L9382k79391K66406j94251K4037
17214D65115k23714K80951G7870J99146D4260L77905J48518j90252O4351R0562
$$ y = [533915, 589913, 589915, -41496, 256685, 44461, 279146, 511100, 269311, 465313, 265700, 317449, 579439, 302914, 109998, -12486, 310262, 605748, 140557, 300852, 604497, 233, 536464, 422475, 346107, 319785, 374676, 488942, 247720, 488399, 340558, 377622, 180924, 594972, 174168, 282867, 520287, 570083, 524587, 512847, 149837, 269934, 448721, 154088, 530433, 488892, 407872, -210587, 173467, 507809, 551593, 22770, -56213, 319785, 315964, 415078, 421548, 217735, 298810, 506454, 378612, 313564, 681307, 437592, 285020, 456505, 729628, 276593, 228259, 288010, 608932, 648314, 368923, 635329, 441078, 465115, 241401, 522352, 77870, 277016, 44260, 422165, 570683, 380431, 444782, 535344]
17204E35344B04628K99761k35349K32222j48449p2013J12973k8617J74611L0965
17194E70732j75233M634r405j1099A43004N40453n4327l08351p1214J60125j60040
17183B49650J33576K08649j45362p8683A2792N28695n8471K78003H5128N90778
17173F75906j11260j72844O4995j30757P5873K8534k3321j59794K05102k4103
17163D28331L9733J91056j46740j1725K94913l27904J04669K01632q8338k34036
17153D51591M78793m15349A99214K83174J53052n0768N072j6214J51924j25605
17143E99849K41765B44243M65808j74023o3212P3710L9799B82908L30486n7462
17133E55932J08388j58711J91416l26478J67251Q4374n7920J78790B54889L75404
$$ y = [535344, 204628, 504389, 269040, 501262, 352813, 280800, 393773, 365156, 539767, 570732, 395499, 400133, 390728, 379629, 143004, 683457, 629130, 320779, 249565, 409690, 249650, 383226, 591875, 446513, 367830, 12792, 541487, 483016, 761019, 85128, 675906, 564646, 391802, 456797, 326040, 401913, 430447, 407126, 247332, 452434, 428331, 468064, 659120, 512380, 500655, 795568, 467664, 572333, 773965, 685627, 451591, 930384, 515035, 199214, 482388, 635440, 584672, 589744, 573530, 725454, 599849, 841614, 244243, 710051, 536028, 472816, 546526, 586325, 282908, 613394, 555932, 664320, 505609, 697025, 370547, 537798, 622172, 564252, 743042, 254889, 630293]
17123F30293q8593j7406M5208J02950K2173j71802k53971K35278k1450N5704N389
17112E43773J401K09685K8023j34087K28796D06108P0567N1127O3130K9258K6870
17101F47060K40842M8272l04115N7848J8164j68776M09553n0618j80541j43458
17091E74231j04677L41871k44408O32664n12588k7481J13676J69514k24585J67170
17081H85387k75443J04083j51676L2089L74229l48627j45355L29016J7411k53534
17071E67580K27689k0897J48478k11380l0718O0818p163l5028Q0393M57104n61215
17060F75661j24142L9336r4670N8163M08685k03855M1742N18160E62694O50976
17050A213670j15587l1683O6062j88349m3909J50408q3526l25270L60845k90885
$$ y = [630293, 541700, 524294, 569502, 672452, 694625, 522823, 268852, 504130, 482680, 538384, 543773, 545174, 754859, 782882, 648795, 877591, 406108, 476675, 527802, 590932, 620190, 647060, 887902, 936174, 632059, 689907, 708071, 539295, 948848, 898230, 717689, 574231, 469554, 811425, 567017, 1199681, 687093, 659612, 773288, 942802, 718217, 885387, 609944, 714027, 562351, 594440, 968669, 620042, 474687, 803703, 821114, 567580, 795269, 774372, 922850, 711470, 680752, 741570, 734407, 699379, 779772, 1236876, 675661, 551519, 590855, 496185, 554348, 963033, 759178, 800920, 1319080, 562694, 1213670, 1098083, 1066400, 1132462, 944113, 900204, 1050612, 967086, 641816, 1002661, 711776]
17040G11776K39957Q0338k35642L7350J39760K41102r4140l21128j2028P4730
17030H62075J54872r5853J08126M5033O5464K86924k96422l81351K46352l5050
17020I60170K77484l36556M55535k72343K57574j19081m07028O03671l0991k21692
17010A166743k17037J2914J91110J42631l1034K0835k08617j2269L34370l44720
17000A054926J61994K43288Q6712j57071N3184J16229k43689J45614l3970J40090
16990A567307k30198o1351j42321M40079j32793J2827J6529j71404J58966q2405
16980A375236K06345l31943N53777l96364J34705j09849K10547l87158L36119
16971A591415m19868K94643J52057q5449o1015K31370j25455q5885M53156n60273
$$ y = [711776, 951733, 1032071, 796429, 833779, 973539, 1214641, 1120501, 799373, 787345, 862075, 1016947, 921094, 1029220, 1074253, 1139717, 1426641, 1130219, 748868, 995220, 960170, 1237654, 901098, 1356633, 1084290, 1341864, 1222783, 815755, 1419426, 1388435, 1166743, 949706, 962620, 1153730, 1296361, 1265327, 1286162, 1077545, 1065276, 1399646, 1054926, 1216920, 1460208, 1546920, 1389849, 1443033, 1559262, 1315573, 1461187, 1427217, 1567307, 1337109, 1275758, 1133437, 1573516, 1440723, 1453550, 1470079, 1298675, 1457641, 1375236, 1581581, 1249638, 1803415, 1407051, 1541756, 1431907, 1642454, 1255296, 1591415, 1171547, 1466190, 1618247, 1532798, 1471783, 1703153, 1577698, 1491813, 1944969, 1384696]
16961A384696K17025N6022m95278O28664j99632K54735r1117j76729K8565Q0320
16951A687271J55391q6696Q4664l03113L86108J30184k0712q8193j09785j7777
16941A817342K24282j10302j21933R4581l48046M64099k527j55297P07855m15339
16931B154715l97780M29125m9767j3016q7356J72242J10638q4394J26005Q8081
16921B448493l40850K66985R5391J94293o6596L3442k45725K43369m83024O44247
16911B790025l02597M797J5130o3564L76070K0774n9635J21111m22411J60204
16901B639904K19765l96678Q1654L73645k33028L0441n2802K81116j05974K8150
16891B866193J94627q6479L58041j25026p3427J99774j65684J46210L73584k69506
$$ y = [1384696, 1601721, 1657743, 1162465, 1791129, 1591497, 1846232, 1755115, 1578386, 1606951, 1687271, 1842662, 1755966, 1840630, 1537517, 1923625, 2053809, 2033097, 1944904, 1835119, 1817342, 2041624, 1931322, 1809389, 1903970, 1555924, 2020023, 2017496, 1862199, 2570054, 2154715, 1756935, 2186060, 2136293, 2123277, 2035921, 2208163, 2318801, 2234407, 2360412, 2448493, 2107643, 2374628, 2470019, 2664312, 2597716, 2631158, 2385433, 2628802, 2145778, 2790025, 2487428, 2492225, 2507355, 2443791, 2819861, 2840635, 2781000, 2902111, 2479700, 2639904, 2859669, 2462991, 2544645, 2918290, 2685262, 2715703, 2662901, 2944017, 2838043, 2866193, 3060820, 2974341, 3332382, 3207356, 3133929, 3333703, 3168019, 3314229, 3687813, 3418307]
16881C418307k50226L82183j98745J44558K72961k71517M03158k99727J22213
16872C723165J21349j6008l12873L25965P0623r8091L51903N1666j90440J40049
16862D167308J04774K69073n4918j14549q6491O1871K89237m71113L83830K46389
16852D795411J02822K540j51868K76340J18244l66017M41933J81163M9847j83705
16842E266710l3517M44603j02275Q4956K92112k7173k8489L65667k13034J78907
16832F228467J37255l81332M87859k03442L82600M6951M50191j71189L93690k41946
16822G129104L18847q3275K10750M42627P7521R068K36546j08386Q5949L44906
16812H663657k8559K57465l34291P40712P207J24837M02031J5094L78308L19425
$$ y = [3418307, 3168081, 3550264, 3351519, 3496077, 3769038, 3497521, 3900679, 3600952, 3723165, 3844514, 3828506, 3515633, 3841598, 3912221, 3814130, 4166033, 4217699, 4027259, 4167308, 4272082, 4541155, 4486237, 4371688, 4285197, 4347068, 4636305, 4165192, 4549022, 4795411, 4898233, 4900773, 4748905, 5025245, 5143489, 4777472, 5219405, 5400568, 5450415, 5266710, 5233193, 5677796, 5575521, 5660477, 5952589, 5925416, 5896927, 6262594, 6049560, 6228467, 6365722, 5984390, 6472249, 6268807, 6651407, 6698358, 7148549, 6977360, 7371050, 7129104, 7447951, 7364676, 7575426, 8018053, 8095574, 8104642, 8341188, 8232802, 8318751, 8663657, 8635098, 8892563, 8558272, 9298984, 9306191, 9431028, 9833059, 9848153, 10226461, 10545886]
16802A0545886m10089K65223K64929K96012J14231N07513L3728N86720J70450
16793A2374603J58064K14552N2915L03818O30483L01544M24667j58459N16947
16784A4819134N28877K55785M36234l3190Q40028J38774M08994O74426K81944
16775A8351006N85041M58611M35363N5256J073785L10757P29253J29051Q58653
16766B2986776M04218J128361P82482N12252J034456M62056J045459P43347O14586
16757B9713993N56819J390861J097762Q29381J072454R30757J567650J029712
16749C8189389J121660J333917J185304J464235J522944J567235J659790J577438
16741D9621912J432373J728152J888566K010756J589741K463289J973738J845106
$$ y = [10545886, 10135797, 10401020, 10665949, 10961961, 11076192, 11583705, 11617433, 12204153, 12374603, 12532667, 12747219, 12800134, 13103952, 13734435, 14035979, 14460646, 14302187, 14819134, 15348011, 15603796, 16040030, 16006840, 16846868, 16985642, 17394636, 18069062, 18351006, 18936047, 19394658, 19830021, 19885277, 20959062, 21269819, 21999072, 22128123, 22986776, 23390994, 24519355, 25301837, 25814089, 26848545, 27310601, 28356060, 29099407, 29713993, 30270812, 31661673, 32759435, 33588816, 34661270, 35592027, 37159677, 38189389, 39311049, 40644966, 41830270, 43294505, 44817449, 46384684, 48044474, 49621912, 51054285, 52782437, 54671003, 56681759, 58271500, 60734789, 62708527, 64553633]
16733F4553633K337065K403381K218885K455973K222331K770218K512133K317748
16725H3791367K576402K543701K846843K362428K314458K661892K120845K912255
16717A04130191K143989J778113K042367J608710J914763J152400J236347R95849
16709A17002729L19145L98181J99455N0469n74290m63894r93639p11711j475839
16700A13750606j377782j936223j986115k003841k057482k368469k686648k154062
16692I7179984k630897k687714k235620k833167k462926k689533k428125k801434
16684G6410568k455339k292160k375566k084718k213088k032847k776813j769548
16676E8410489j788872k153749j811441k023890j327716j669738j953607j497213
$$ y = [64553633, 66890698, 69294079, 71512964, 73968937, 76191268, 78961486, 81473619, 83791367, 86367769, 88911470, 91758313, 94120741, 96435199, 99097091, 101217936, 104130191, 106274180, 108052293, 110094660, 111703370, 113618133, 114770533, 116006880, 117002729, 117321874, 117720055, 117919510, 117969979, 117395689, 116931795, 115938156, 115226445, 113750606, 112372824, 110436601, 108450486, 106446645, 104389163, 102020694, 99334046, 97179984, 94549087, 91861373, 89625753, 86792586, 84329660, 81640127, 79212002, 76410568, 73955229, 71663069, 69287503, 67202785, 64989697, 62956850, 60180037, 58410489, 56621617, 54467868, 52656427, 50632537, 49304821, 47635083, 45681476, 44184263]
16668D4184263j404870j015330j467374j569378j122881j297655j036699j114695
16660C4155381j266986o56028j065863r19869j351668p01547o86775o73684q99894
16651B5933067p40314n48172r05798l26052q45213o06078r79411n95051k76658
16642B0110320m76337l83162p69385J23182r55903l67870m21915n68336j51590
16633A6139004r06473j7712j18490m68360l92950j09817l71913l43118n40051
16624A2870120j77001J8629k06611m71998l46284l61752k66281J86664o38047
16615A0607439q4331k08267k58411l38925j07241k83558r7359j40302l93681r0879
16605H604485r4968J80526l43441J75327o49245L07447n77668k31548K64198k50568
$$ y = [44184263, 42779393, 41764063, 40296689, 38727311, 37604430, 36306775, 35270076, 34155381, 32888395, 32232367, 31166504, 30246635, 28894967, 28193420, 27506645, 26832961, 25933067, 25192753, 24644581, 23738783, 23412731, 22567518, 21961440, 20982029, 20386978, 20110320, 19633983, 19250821, 18481436, 18604618, 17648715, 17280845, 16858930, 16290594, 16139004, 15232531, 15214819, 15096329, 14627969, 14235019, 14125202, 13753289, 13410171, 12870120, 12693119, 12711748, 12505137, 12033139, 11686855, 11325103, 11058822, 11245486, 10607439, 10523108, 10314841, 10056430, 9717505, 9610264, 9326706, 9229347, 9089045, 8695364, 8604485, 8509517, 8690043, 8346602, 8521929, 7872684, 8180131, 7602463, 7370915, 7635113, 7384545]
16595G384545l37823k3388J33095m29690n1560K00491k02143j51612n242m69650
16585F047023j77662J95494j96232n2096k82652M10997n50214K14312j33979j11335
16575E363656k62430k22366J52807K38056n15468J01301k60728n7585n138R5442
16565D627547l23394J95106k92550O5977L61428o12026M66153n51063K75083r1116
16555D121145j82511j70603K98191k31628k78592L15620l87831J34867R7531l04155
16545C412034J75948l6471k10105L98456n76508J02360J25816k03311N3221o284
16535C235156n2603k93392M4836r9669K8889P179J81369j18179J44613o92402
16525B385797K68448M1312p5891K0351n5457m3927k38374K65032L828k13463N1192
$$ y = [7384545, 7046722, 7023334, 7156429, 6726739, 6675179, 6875670, 6673527, 6521915, 6516673, 6047023, 5869361, 6064855, 5868623, 5816527, 5533875, 5944872, 5394658, 5608970, 5474991, 5363656, 5101226, 4878860, 5031667, 5269723, 4754255, 4855556, 4594828, 4537243, 4532105, 4627547, 4304153, 4499259, 4206709, 4272686, 4634114, 4022088, 4488241, 3937178, 4212261, 4121145, 3938634, 3768031, 4066222, 3834594, 3556002, 3871622, 3483791, 3618658, 3716189, 3412034, 3587982, 3551511, 3341406, 3739862, 3163354, 3265714, 3391530, 3188219, 3241440, 3235156, 3182553, 2889161, 2933997, 2834328, 2863217, 2870396, 3051765, 2933586, 3078199, 2385797, 2654245, 2695557, 2619666, 2640017, 2584560, 2540633, 2302259, 2567291, 2571119, 2357656, 2408848]
16514B408848J08144l67803J27554K37881n68078K92767K4713k96630L86157j26195
16504B227358Q7906n03923J03059M09522j98106j32020J0886j52659K09116M6423
16494B107562k45764l8985Q1403L36385n58205L19208l45343M08669R5187L8273
16484B198390n84384L85529k47312l9807J16899m69822M20123Q0693n17211M87104
16474A830202j25000O1599k54753o0409J13512r4852l693L0914J04963m4228m542
16463A553713k69629J88391J00010j41454O6693J29681j53740p2180l90703L93627
16453A404409j0157j03216k28614J87211r4412J70939k8476J21453m13484J5885
16443A021538J68958P549K56353m61798L35374j98836j6964k11049J45980k9068
$$ y = [2408848, 2516992, 2149189, 2276743, 2514624, 1946546, 2239313, 2264026, 1967396, 2353553, 2227358, 2315264, 1811341, 1914400, 2323922, 2125816, 1993796, 2004682, 1852023, 2061139, 2107562, 1861798, 1822813, 1904216, 2240601, 1682396, 2001604, 1656261, 2064930, 2160117, 2198390, 1614006, 1999535, 1752223, 1712416, 1829315, 1359493, 1779616, 1860309, 1343098, 1830202, 1705202, 1766801, 1512048, 1451639, 1565151, 1470299, 1466606, 1497520, 1602483, 1558255, 1553713, 1284084, 1472475, 1572485, 1431031, 1497724, 1627405, 1473665, 1401485, 1010782, 1404409, 1394252, 1291036, 1062422, 1249633, 1155221, 1326160, 1297684, 1419137, 1005653, 1021538, 1190496, 1198045, 1454398, 992600, 1327974, 1129138, 1112174, 901125, 1047105, 1018037]
16433A018037K32375j88196q6415J40294j21663P7516k5128N14616o27803L34789
16423A268422m65917J487K26925j59483J90410Q1200k03869L16922l6095m5515
16413A174487q4968k73179K34863j19769L8603J7832j5549K63873J8177D73585
16402I50671N3893j20339Q66J25391L2229j75886Q0806j56687j63698K24478J57528
16391A009252l73639P7589J27479J48375L4080m22167Q1184j2222k47862O59342
16381A081411k13769J53750N9483B78716N33317k86865M13430j31196n4156k66748
16371D86498J18262J15262L12316m61857J47647m13R1227j27625L18111m07305
16361E92123O8149K9468o2340J01729P68098o75254k17619k43292O7453J20705
$$ y = [1018037, 1250412, 1062216, 975801, 1116095, 994432, 1071948, 1046820, 1561436, 933633, 1268422, 802505, 803992, 1030917, 871434, 1061844, 1143044, 939175, 1256097, 1220002, 1174487, 1089519, 816340, 1051203, 931434, 970037, 987869, 972320, 1236193, 1254370, 473585, 950671, 1004564, 884225, 885091, 1010482, 1042711, 866825, 947631, 790944, 627246, 851724, 1009252, 635613, 713202, 840681, 989056, 1023136, 600969, 682153, 669931, 422069, 1081411, 867642, 1021392, 1080875, 278716, 812033, 525168, 938598, 807402, 753246, 486498, 604760, 720022, 1032338, 570481, 718128, 717715, 808942, 681317, 999428, 592123, 660272, 689740, 627400, 729129, 1497227, 821973, 604354, 361062, 428515, 549220]
16351E49220N7422Q5847j39551J1635q9991K07252k81167J14012L46111k47176
16341F13614J6763J19860k46495j8352L2785n5792J71737k10532P2062k0473O3107
16330E38284J63643k71912o721Q9016L2173j74841L43490k78631M1876j72894
16320C03483K44938B66824K81760J26851k13936L36463l12431j02417j1350A65087
16309E23776j07229R6389J41877j58643k29707R2777K42915Q7478k60679j03917
16299C25037p8704j12352L54614A88115L06617J30566k6827j32319B17803N74492
16289G92295j79168k39210Q9571j04994f8147A95589K89912J29041j8935j52021
16279D43586q7489J1317L21046l16798L9112k05012J37320N65651l55351A62966
$$ y = [549220, 606642, 692489, 552938, 564573, 474582, 681834, 400667, 514679, 860790, 613614, 630377, 750237, 503742, 485390, 518175, 462383, 634120, 423588, 495650, 475177, 538284, 701927, 430015, 423294, 512310, 544483, 369642, 713132, 434501, 476377, 303483, 548421, 266824, 548584, 675435, 461499, 797962, 485531, 383114, 371764, 165087, 523776, 416547, 512936, 654813, 496170, 266463, 359240, 602155, 689633, 428954, 325037, 246333, 133981, 488595, 188115, 494732, 625298, 598471, 466152, 217803, 792295, 613127, 373917, 463488, 358494, -68147, 195589, 485501, 614542, 595607, 443586, 356097, 367414, 688460, 371662, 410774, 205762, 343082, 908733, 553382, 162966]
16268B68307L49115I2710J54876A11288N14898l1924p2251A41341J37805q0306
16258A98840M5702J30887b2588B12314L22112J85930A15181L88358Q6993B28991
16247I4655L08422q5887I3266l2689J5426O33928B06043J66137J76928B12279
16236C80825A06805M6841Q1060L28399k48705a4652A42781P4398m5535h708D35888
16224D01437A9858M81390A34797J236N7707K42540j12144K07606k04653j939q671
16213C16479I8380Q3280H408L68949l1065A46969J26378j03647L74638L0281I101
16201H4978J1791b85940D28534A78540Q9013b32187a1619E46228B18950K55073
16191D74023B6415f2085B80165m5672a47350g3096C01768m1588r760G8000K58668
$$ y = [268307, 617422, 92710, 247586, 111288, 626186, 594262, 522011, 141341, 279146, 198840, 244542, 375429, -22588, 212314, 534426, 720356, 115181, 503539, 590532, 228991, 94655, 403077, 317190, 93266, 60577, 76003, 709931, 206043, 372180, 549108, 212279, 380825, 106805, 153646, 234706, 563105, 314400, -14652, 142781, 217179, 171644, -8708, 435888, 401437, 19858, 501248, 134797, 136033, 193740, 436280, 324136, 531742, 327089, 325150, 316479, 98380, 181660, 8408, 377357, 346292, 146969, 273347, 169700, 544338, 574619, 9101, 84978, 96769, -285940, 428534, 178540, 267553, -232187, -11619, 546228, 218950, 474023, 26415, -62085, 280165, 234493, -147350, -73096, 301768, 260180, 250420, 78000, 336668]
16180C36668j18384I1829J21238J07033j54527K96354j3949j45159J23117d9615
16169A912P0548J2122J46879J00779J01333A70677g8729L0975E84519k32010r2256
16158B60253j04896N5991M0234K5949A00406a33100A98949J25168p6703K7766
16148B75180E7881J66985O8529j32706C8467b29592B39616I8566b15309I7257
16137B24921G0962I853K16292a98772a839A59159g8242A45625k4757A191L01536
16126C02727j1876H6163C7776L63364F5099R8058E7436J88750l9614R4840j26958
16115A74454J25585n6285H4532O0156c37273B05084I1513K2616a77538A47725
16104C30247A62377c40994C74814O1462j84693J69078K6113j90132F4987K7410
$$ y = [336668, 218284, 91829, 213067, 320100, 165573, 461927, 447978, 302819, 425936, -49615, 1912, 72460, 84582, 231461, 332240, 433573, 170677, -78729, -47754, 584519, 352509, 260253, 155357, 211348, 251582, 277531, 100406, -133100, 198949, 324117, 247414, 275180, 57881, 224866, 293395, 160689, 38467, -229592, 239616, 98566, -215309, 97257, 224921, 70962, 9853, 226145, -198772, -1839, 159159, -78242, 145625, 120868, 1191, 302727, 290851, 86163, 37776, 401140, 65099, 163157, 57436, 246186, 206572, 301412, 174454, 300039, 243754, 84532, 144688, -337273, 205084, 91513, 114129, -177538, 147725, 330247, 162377, -340994, 374814, 436276, 251583, 420661, 446774, 256642, 64987, 92397]
16094I2397J50361R1921a44384I4554C1799J23077B7650J89919d4260l2059B56163
16082c32860B30705d9135B8336J11707o0375L13208A14558j8883D4572m050P172
16071D7694J18191D1713J2637M7739K7008j8905J42447b3471A15684K18897F0428
16059B01309b652B0860M3596K17396b46046d0456G3865a52373A21189e3534A27159
16047f4969A4664K53312a8383D6526a55666L7355F5893K91262H8913J67030e395
16035e5698j28079a9792A7880K4737a27269B0284a13068A57067J80478a41757
16024B6996R9612E6942e6389A58904r953A3862J77983o8436O0734f2252H7949
16012c0476H3699Q8025p4599J98331A7374e6736F08889B54062a14045A87846a53097
$$ y = [92397, 242758, 334679, -144384, 94554, 31799, 154876, 27650, 217569, -44260, -76319, 256163, -332860, 230705, -49135, 28336, 140043, 79668, 392876, 114558, 95675, 44572, 40522, 47694, 165885, 41713, 54350, 102089, 129097, 110192, 252639, -23471, 115684, 334581, 60428, 201309, -2652, 20860, 64456, 281852, -246046, -40456, 73865, -152373, 121189, -53534, 127159, -64969, 14664, 267976, -18383, 46526, -155666, -118311, 65893, 357155, 88913, 255943, -5395, -55698, -183777, -19792, 17880, 42617, -127269, 20284, -113068, 157067, 337545, -141757, 26996, 126608, 56942, -56389, 158904, 148951, 13862, 191845, 123409, 184143, -62252, 87949, -30476, 83699, 171724, 97125, 295456, 17374, -56736, 608889, 254062, -114045, 187846, -153097]
16000H6884E603c2317o1113c5982j6239j57952H4838K62658H4474e4399n2364
15989a06763I1018a93073d7611G4919a86704h052A81184j548L1675C6638P276
15978D3914A4172J08988o1421i3238E97049q2197k13955L24686J67051K57415
15968A050049J41776l64232m11478K3830J01878B17272J17035q9091D1114J9964
15958F1078B6052J79345H731b98451a38214d3264k52539J04149N0193B42748A8279
15946a48298B11845A9689J95856l9162a68034M9641A19740b24285A5295J34482
15936A49777b28753A96193b62560c5976A63833Q0029b35627B63711J57971a68340
15925B75506b0273j92141c4907j48061j12539a7417D0186d887k14498A00518g6247
$$ y = [86884, 5603, -32317, -93430, -35982, -52221, -210173, 84838, 347496, 84474, -54399, -106763, 91018, -193073, -47611, 74919, -186704, -8052, 181184, 179636, 211311, 36638, 43914, 14172, 123160, 61739, -93238, 597049, 514852, 300897, 625583, 792634, 1050049, 1191825, 827593, 416115, 439945, 541823, 217272, 334307, 245216, 41114, 61078, 26052, 205397, 8731, -298451, -138214, -43264, -295803, -191654, -141461, 242748, 18279, -148298, 211845, 19689, 215545, 176383, -168034, -118393, 119740, -224285, 15295, 149777, -228753, 196193, -262560, -35976, 163833, 243862, -235627, 263711, 421682, -168340, 275506, -20273, -212414, -34907, -182968, -295507, -17417, 40186, -4887, -219385, 100518, -76247]
15913E2187a33813H462K6974J09974J14353G2689J71763a60377C11817A7270R0429
15902A07699e5307C33892b6566j83752d182j45118d0880E2855J51263E0245d3078
15890A64019A2631M8256K69460h3557D9493a35348B8605Q5384N1733F9833C0178
15878I1755Q8993a90580j9287k913J02608K3948B92387E8034A2660b8190A49713
15866A62232b74108A21990m0354a97242c3384m9033M061j95646I8089l7511e4633
15854d5373B69777c0362A6954a8036A27924n6414K9142e9494F7292a88843O4004
15843a24839k13045C7591J55165a6541k09574A2241a38778a464j23044D2171b29370
15831c98564J1344f7493A05662a72303A57802a07562F6912R0107b06464f7537
$$ y = [52187, -133813, 8462, 35436, 145410, 259763, 72689, 244452, -160377, 311817, 17270, 107699, -55307, 333892, -26566, -210318, -4182, -149300, -40880, 52855, 204118, 50245, -43078, 164019, 12631, 60887, 330347, -83557, 49493, -135348, 28605, 113989, 165722, 69833, 30178, 91755, 180748, -190580, -209867, -212780, -110172, -86224, 292387, 58034, 12660, -28190, 149713, 162232, -274108, 121990, 81636, -197242, -33384, -82417, -78356, -274002, 98089, 60578, -54633, -45373, 269777, -30362, 16954, -18036, 127924, 71510, 100652, -59494, 67292, -188843, -124839, -337884, 37591, 192756, -16541, -226115, 12241, -138778, -1464, -124508, 42171, -229370, -398564, -387220, -67493, 105662, -172303, 157802, -107562, 66912, 157019, -206464, -67537]
15820G195i3293c8010C90035C3169a45241c9525A4360g323j71386H5816a3253
15808a70374J4281F9893h2088b0074B25143G0508O2983f5264A85723C0232J73092
15797B03324H0471b30265f8119a9259A33657a67435l157A26237b24701c2231j6618
15786d8849A25962a25330L7795C08263L1261a21434M1233m8473D5553R6025g8472
15774c5189B41442I516Q4996J55480B347a94749d1144G1719a14213J4436E9858
15762A99006B6381N4468a40392A38008C4148a6923e387l28943m856D3703c58764
15750a25746J2672B82877q2749a53695B26354Q2789a81896A49193E7335j4018
15740D3317a33341A24544B3130Q4622A3227O6087b02821i5413j99443A92208b42834
$$ y = [7195, -93293, -38010, 390035, 33169, -145241, -39525, 14360, -7323, -178709, 85816, -13253, -170374, -156093, 69893, -82088, -20074, 225143, 70508, 133491, -65264, 185723, 30232, 203324, 80471, -230265, -68119, -19259, 133657, -167435, -170592, 126237, -224701, -32231, -48849, 125962, -125330, -87535, 308263, 339524, -121434, -80201, -128674, 45553, 141578, -78472, -35189, 241442, 9516, 94512, 249992, 2347, -194749, -41144, 71719, -114213, -99777, 59858, 199006, 26381, 80849, -140392, 138008, 34148, -16923, -5387, -334330, -339186, 43703, -358764, -125746, -113074, 282877, 200128, -153695, 226354, 309143, -181896, 149193, 57335, 43317, -133341, 124544, 23130, 107752, 13227, 79314, -202821, -95413, -294856, 192208, -242834]
15728B20240N4565a10000A74226m1189a38533D2065a02907b5613D0759Q0689a48118
15716h4058j31397A04271D5458J64284a49049f1431j36351k43002Q6989J72095
15706a81700I1544F274c70767a42977A68372k5618L460l2657D9667h485C08666
15694c2907B80623J0935a04499c5282a3794p4960A2495a3995k33514d6959a1655
15682C2691J2007a17277A83320j8583G6751P1862J37048C7513a70964E5413r891
15671D5522a8280k72716J14155B9936b20676R4710A90313b7520B07547H2078R5751
15660A77829a93978P3342e0405B85553a69993G8154J27329E8814A1700J77168
15650A88868a76824c7069n0636o8937A32576O1477G1547b1132j38342d3671k10039
$$ y = [220240, 274805, -110000, 174226, 133037, -138533, 42065, -102907, -25613, 40759, 121448, -148118, -84058, -215455, 104271, 45458, 209742, -149049, -61431, -197782, -440784, -353795, -181700, 91544, 6274, -370767, -142977, 168372, 142754, 146214, 113557, 49667, -8485, 308666, -32907, 280623, 291558, -104499, -35282, -13794, -88754, 12495, -13995, -247509, -46959, -11655, 32691, 44698, -117277, 183320, 164737, 76751, 148613, 285661, 37513, -170964, 55413, 45522, -18280, -290996, -176841, 29936, -220676, -125966, 190313, -27520, 207547, 82078, 177829, -193978, -120636, -50405, 285553, -169993, 78154, 205483, 58814, 11700, 188868, -176824, -37069, -87705, -156642, 132576, 194053, 71547, -21132, -159474, -43671, -253710]
15639b53710O9524P9328k23407f2501J4715B09353c9936A97039i6469H7183M5432
15628A32615b14937D52938a04041B19840j03029o98n2171Q4399f7719K7520d751
15616G865e9840H2771e3663q83B33219F8695e13507I2449a47329F3349c9692q590
15604d8282l00225D07532a90098q3682B6315a57443M7387B2285J57147a53372
15593A181c12516J46078q1308a21702k2420I4319m6979Q876a27914b2915I4321
15581C33887B3469J33438C5401e7012B744P8441J4181D0928Q3300n9418Q4647
15570A49457N3515l0887G6779a9437q4736c859C99078j55943r3237a7295l6613
15559e3908E4348b7361A06985b42521e1257l1079K967F2150g061C0431b21001
$$ y = [-253710, -184186, -104858, -328265, -62501, -47786, 209353, -39936, 197039, -96469, 87183, 132615, -214937, 452938, -104041, 219840, 116811, 116113, 63942, 148341, -67719, -40199, -4751, 7865, -59840, 82771, -53663, -54546, 233219, 68695, -513507, 92449, -147329, 63349, -39692, -48282, -348507, 407532, -190098, -273780, 26315, -157443, -110056, 22285, 179432, -153372, 1181, -312516, -166438, -247746, -121702, -144122, 94319, 47340, 56216, -127914, -22915, 94321, 333887, 23469, 156907, 35401, -57012, 2744, 81185, 95366, 40928, 124228, 64810, 149457, 202972, 172085, 76779, -19437, -104173, -3859, 399078, 243135, 149898, -17295, -53908, 54348, -27361, 106985, -242521, -51257, -82336, -79369, 62150, -7061, 30431, -221001]
15547E1737J67742b67368I9587M498K8286d9249R254j97879C42J0139f9173j18218
15535a87391A7367J52115h4990A97456K2283b20793B6023a31837A45017P2787
15525B17804d88450A35148R017A04b6597A82919l1739a5459k10262H7256J49165
15514B36421a46995f3935K0567k6846l2848A14879K04456b6998E5726Q360P1418
15503A35504b2012p2801I0170B6334K78598G0941L4473J83600k2055j1543P0123
15492C25539j35268J51473j51547c0578C31181a10173E3317L49236A70854J56510
15482C27364A00269K0211a7536C78643c78759C60908I9978K13344q1387g3228
15471a18790e3811B6601P0420L5814l2343K77913A73400K74071F8139d444A9306
$$ y = [51737, 219479, -267368, 99587, 104085, 132371, -49249, -39995, -237874, 342, 10481, -69173, -187391, 17367, 169482, -84990, 197456, 219739, -220793, 26023, -131837, 145017, 217804, -488450, 135148, 144165, 104, -26597, 182919, 151180, -15459, -225721, 87256, 236421, -146995, -63935, -43368, -70214, -103062, 114879, 319335, -26998, 55726, 64086, 135504, -22012, -94813, 90170, 26334, 304932, 70941, 105414, 289014, 266959, 255416, 325539, 190271, 341744, 190197, -30578, 331181, -110173, 53317, 402553, 170854, 327364, 100269, 120480, -17536, 378643, -378759, 360908, 99978, 313322, 231935, -73228, -118790, -53811, 26601, 97021, 132835, 100492, 378405, 173400, 447471, 68139, -4444, 19306]
15459F47479k29753A28436K59558m3535J97713a4458E8988L36192i8978E20240
15448C29970D3920J90833C2513Q1773a04026B52371J19172K554A73158h3449N356
15437g8093A43606K96597h1891A99199K693d4230A01814J35306J16648j31659
15427B22109J63360N82150J0171J65650l40515A29491K31117P8219j02195h810
15416A57981o1868d673m1637D9162K2497k1950b6083l99846a27802F193b6927
15404G3135J60795c75397R9615R7969M3245d4622k10126O4626f8576L2789J4237
15393b1550n6947j60322a0140A06390a17521k41905a15994B48672A3852b78625
15382i4095A63522j3200a96764D04359c1145B41743j2071a82369A20439N9945
$$ y = [647479, 417726, 128436, 387994, 344459, 542172, -14458, 58988, 395180, -98978, 520240, 329970, 43920, 234753, 32513, 114286, -104026, 252371, 371543, 374097, 173158, -83449, -78093, 143606, 440203, -81891, 199199, 201892, -44230, 101814, 237120, 353768, 222109, 385469, 967619, 977790, 1143440, 802925, 129491, 360608, 438827, 336632, -8810, 157981, 96113, -4673, -46310, 49162, 71659, 49709, -26083, -425929, -127802, 6193, -26927, 73135, 233930, -375397, -275782, -177813, -134568, -44622, -254748, -190122, -68576, -35787, -21550, -78497, -238819, -10140, 106390, -117521, -359426, -115994, 248672, 13852, -278625, -94095, 163522, 150322, -196764, 404359, -31145, 241743, 229672, -182369, 120439, 180384]
15372A80384f826G5916P9356F1582J27397E6291N4297a56102A84852a47175D1549
15360A85568H5587h4034A96104d4829I0686P2985o6901a20482B51695o7333m0150
15349A44212Q5650p0878J82619A45872L5943H250D064K10876J9281B6736J83277
15338B10013K06619a74926B12435j7879J3856o7552J35487E0196L62390A15039
15327B44665L55836i7319D76904j04412e4719A99638J77362D0507f0868E1800
15316a77666N7047A57373N8906G7407J58737K62795A43548D6374b8729E2663a92606
15304B07984a31561A95570L5951a7249C05391j14547q0863K05251l7343E4605
15293A8923J45615N4980D1635L2505K61763B382L0509J49632l2937a0563j66063
$$ y = [180384, -6826, 75916, 155272, 61582, 188979, 56291, 110588, -156102, 184852, -147175, 41549, 185568, 85587, -84034, 196104, -44829, 90686, 163671, 96770, -120482, 251695, 184362, 144212, 229862, 158984, 341603, 145872, 181815, 8250, 4064, 214940, 234221, 26736, 210013, 416632, -174926, 212435, 194556, 208412, 140860, 276347, 50196, 412586, 115039, 244665, 600501, -97319, 476904, 372492, -54719, 199638, 377000, 40507, -60868, 51800, -177666, -120619, 157373, 216279, 77407, 236144, 498939, 143548, 46374, -28729, 52663, -192606, 207984, -131561, 195570, 231521, -17249, 305391, 190844, 109981, 315232, 277889, 54605, 18923, 164538, 219518, 41635, 74140, 335903, 2382, 32891, 182523, 149586, -10563, -176626]
15282a76626f4744B07296O4171b6738A37753e7478I0352R181L50415i7950I8763
15270a77320C6125J42185b07285P8713j12486h4381B46159H3840M56Q8920d93639
15258a08758q3349F9108K39805n9361o0357F7283K48500D0295J8153N5380K09591
15247C23419A35539F6872J03701a02937D9747H459c5573A26593e5461K1902k27485
15236b61044B57058j25383m3039L7819M46858B48862L1402J22562J98207K87591
15226H88624N62293j83696L71478l45225n85315k22969J42418A47185K34904A52451
15215D55265a39262M6234j22752I9662f7675q5232j07721n3796B81950n7052q8385
15204A36513b047C39124a3443q7493A71454L445A4209g6435D2655a2771C11282
$$ y = [-176626, -64744, 207296, 271467, -26738, 137753, -57478, 90352, 99533, 449948, -97950, 98763, -177320, 36125, 178310, -207285, -128572, -241058, -84381, 246159, 83840, 84296, 173216, -493639, -108758, -192107, 69108, 308913, 249552, 189195, 67283, 315783, 40295, 58448, 113828, 323419, 135539, 66872, 170573, -102937, 49747, 8459, -35573, 126593, -55461, -33559, -261044, 257058, 131675, 88636, 126455, 573313, 248862, 280264, 402826, 601033, 888624, 1450917, 1267221, 1638699, 1293474, 708159, 485190, 627608, 147185, 382089, 152451, 455265, -139262, -93028, -215780, 99662, -67675, -152907, -260628, -314424, 281950, 224898, 136513, -2047, 339124, -13443, -100936, 171454, 174899, 14209, -76435, 42655, -12771, 311282]
15192A33861a03537A92572B3419a18032C89524a75863Q7747E9241J44314a54987
15181e1480o9289A33392m0175J28483j00653B9979N5240J65853J80387j92233
15171B39226I1660A6808L96652A67736i876I2761P796l6426J4910b7855j02346
15160a30201h398l4525j38957B23302r5960c5813B72941j25175m7996L44549H4137
15148I2959a63796A99421K2680A2459J24349E4260B4338a2278k04659a4610A17642
15136a79197A29465J06134a19772A50482K701J90204j22254H1667n136e2696B20812
15124A30661a36762D2167c25807F4601L51087B07631L95383B76567R1858I9136
15113A05217J97170a45373b9290D0557L1296J9891l954P1452Q5535p0281K74051
$$ y = [133861, -103537, 192572, 23419, -118032, 389524, -175863, -88116, 59241, 203555, -154987, -51480, -120769, 133392, 93217, 221700, 121047, 29979, 85219, 251072, 431459, 239226, 91660, 16808, 413460, 167736, -9876, 92761, 100557, 64131, 79041, -27855, -130201, -8398, -42923, -181880, 223302, 127342, -35813, 272941, 147766, 99770, 444319, 84137, 92959, -163796, 199421, 222101, 12459, 136808, 54260, 24338, -12278, -216937, -14610, 117642, -179197, 129465, 235599, -119772, 150482, 153183, 343387, 221133, 81667, 76531, -52696, 220812, 130661, -136762, 42167, -325807, 64601, 415688, 207631, 603014, 276567, 368425, 99136, 105217, 302387, -145373, -29290, 40557, 71853, 91744, 87790, 159242, 244777, 174496, 448547]
15102D48547A87423L5676H9301J09869g6630C93659j24368J1735F5389N35574
15092F00963a52720B79641f1381A62521J36422B4058J87672c3379A91599J5375
15082B06974b86584C59946D0227K54525F8993a91143C77311I2227j839A2929L35575
15071C48504g2315H8751b7082B57793j6468J98328I3928a86553D6121K95430q0630
15060B60921j04874J08854p5846I3709b57457F1489J27845q121H7638O7322J81422
15049C36382J52332j69238N9282j55291K45676K0279k24237j12122J46631d0769
15038B82801L3790J80074G8921M24451j50492K9998j30359J35251k1020A62450
15027B13420j04694M74673B26099B6570M63782A80952J04290F7488L56211o5394
$$ y = [448547, 187423, 223099, 89301, 199170, -76630, 393659, 269291, 281026, 65389, 600963, -152720, 279641, -61381, 162521, 298943, 24058, 211730, -33379, 191599, 206974, -286584, 359946, 40227, 294752, 68993, -191143, 377311, 92227, 90388, 12929, 348504, -72315, 88751, -27082, 257793, 241325, 439653, 93928, -186553, 46121, 341551, 260921, 156047, 264901, 189055, 93709, -257457, 61489, 189334, 181213, 87638, 154960, 336382, 488714, 319476, 378758, 223467, 469143, 489422, 265185, 153063, 299694, -40769, 282801, 316591, 496665, 78921, 503372, 352880, 382878, 252519, 387770, 366750, 162450, 213420, 108726, 583399, 226099, 26570, 490352, 180952, 285242, 67488, 423699, 358305]
15017C58305K16871M0276K03489r4968J66293j55856k97946K63736k01787j07606
15007C90807L50582l07789j57351L99687k96665l3638j42773L18421L35943C44444
14996F10126A81306o0891J63790K08422k4405k26621J12778r4226K8499m8157
14986B40495M43029B85247j20859R01569B72243j12407J32256K10957j48425K68109
14976F22733J39290A51254J86384m5770J98026O0197K4158j49114L41784L8568
14966H05487P6467j6566j10935C38789P2999A42926O61056k41069J71572C12391
14955G77085m6498l21010l6248p4858K34209j63842A75926L60943j06091j62129
14945B68649J7363L13842P8764k02652P6616J9859j63083q3247J44136j53013
$$ y = [358305, 575176, 615452, 818941, 723973, 890266, 734410, 436464, 700200, 498413, 390807, 741389, 433600, 276249, 675936, 379271, 345633, 202860, 521281, 857224, 344444, 610126, 181306, 120415, 284205, 492627, 468222, 241601, 354379, 260153, 288652, 240495, 683524, 285247, 164388, 1065957, 272243, 159836, 292092, 503049, 354624, 622733, 762023, 151254, 337638, 291868, 489894, 550091, 574249, 425135, 766919, 805487, 881954, 865388, 754453, 338789, 411788, 142926, 803982, 562913, 734485, 312391, 777085, 730587, 409577, 373329, 298471, 532680, 368838, 175926, 536869, 430778, 268649, 286012, 599854, 678618, 475966, 552582, 572441, 409358, 326111, 470247, 317234]
14935C17234L89560j80996Q5218k06632A07395P60051k46104n8819k00699K85284
14925F47108k75582j9881L06870J47966j77305k09430J72444p7355N58999j45290
14915I28544k31524M08604k5471K28518J10202r2036M77036n54685K97807Q1316
14905A628311K33235o3542J72356J8571k12395L94754o5637n13185k62117l47782
14895I82569l11227r567l3723k60457j45301L36355j4077j47466K53093k89235
14885C60964O1759j83235N27582k56163M4117k2580k59622J11697A38105K09294
14875C47399M49879k00477k2424O6675J40453j8327p1390L8896L28724q3251l65996
14864F10161M90804l72598K11073m12416j4828R9479L62820m54855A24789M93897
$$ y = [317234, 706794, 525798, 611016, 404384, 107395, 867446, 621342, 562523, 361824, 647108, 371526, 351645, 658515, 806481, 629176, 419746, 592190, 514835, 1073834, 928544, 697020, 1105624, 1080153, 1308671, 1418873, 1326837, 1803873, 1249188, 1546995, 1628311, 1861546, 1798004, 1970360, 1988931, 1776536, 2171290, 2105653, 1592468, 1330351, 982569, 671342, 661775, 628052, 367595, 222294, 558649, 544572, 397106, 650199, 360964, 422723, 239488, 767070, 510907, 555024, 532444, 272822, 384519, 138105, 347399, 797278, 596801, 574377, 641052, 781505, 763178, 691788, 730684, 1059408, 976157, 610161, 1100965, 728367, 939440, 527024, 512196, 611675, 974495, 519640, 124789, 618686]
14854F18686r9458p081K74327K01416l65158J46365j65046B20813K48804J21745
14844E91362K47098o3706l07520r8381M9495J48846j91916L42631l0262b7858
14833G79961j98825J32755p006j69097K72199J53992R3l692J87502n5095O8200
14822A160987k92470O03333o91116J70306k62994j620j05169j26003J66498J01171
14812G22923Q8242m01720M60689k72665K07127j52096L1196j8603J73073l98016
14802D40150J80348L10250j55050q0129J63974P0983k37958R5555j27552J89956
14792H50527K95044l05335k4868Q5306j90621J47356K30333l99004R7191j83739
14782F02190L2970j85060J43616k9743k35400L68819J75463j54905q4354K43622
$$ y = [618686, 519228, 512147, 786474, 987890, 622732, 769097, 604051, 220813, 469617, 591362, 838460, 774754, 467234, 368853, 418348, 567194, 375278, 717909, 687647, -27858, 779961, 581136, 713891, 706885, 537788, 809987, 963979, 964072, 960380, 1147882, 1092787, 1160987, 868517, 1471850, 780734, 951040, 688046, 686426, 581257, 455254, 621752, 722923, 811165, 409445, 870134, 597469, 804596, 652500, 683696, 665093, 838166, 440150, 620498, 930748, 775698, 695569, 859543, 930526, 692568, 788123, 660571, 850527, 1145571, 840236, 815368, 900674, 710053, 857409, 1087742, 688738, 785929, 602190, 635160, 450100, 593716, 563973, 328573, 697392, 872855, 717950, 633596, 877218]
14772H77218k67966L03623j55433L95804k28756k14975J6256O8952j30589L75066
14762A039200J15258k43512k20780k3909J19211J74746L3601J72563E37652M22681
14752I60333k81794j31596J76866J24554l32666K96702l53094J67776K05276l16852
14742E15505J80430k64891J57304J05449J78423B75063M95084k201j23784J8258
14732F62420j15538J85319k83939O03324l51676M8457j68531L82057j66356J3054
14722H08591K8097J12909M0238k6799J96056j49287L38337m18937J98896O9401
14712A197502K44658K4477J66582r9157p1731l52444N8177p0619r3455q1868L4287
14701I56409j40239Q8016R2379J48583j82636L61292q7224p8111r9258K0620j26129
$$ y = [877218, 609252, 912875, 757442, 1153246, 924490, 709515, 725771, 794723, 664134, 1039200, 1154458, 910946, 690166, 666257, 785468, 960214, 993815, 1166378, 537652, 960333, 678539, 546943, 723809, 848363, 515697, 812399, 459305, 627081, 832357, 515505, 695935, 431044, 588348, 693797, 872220, 275063, 770147, 767946, 644162, 662420, 546882, 732201, 448262, 1051586, 699910, 748367, 579836, 961893, 795537, 808591, 836688, 949597, 989835, 963036, 1159092, 1009805, 1348142, 929205, 1128101, 1197502, 1442160, 1466637, 1633219, 1534062, 1462331, 1109887, 1168064, 1097445, 1003990, 922122, 956409, 816170, 904186, 996565, 1145148, 962512, 1323804, 1236580, 1158469, 1059211, 1079831, 953702]
14690I53702L07631K2639L1057M22617J39264m9562Q5593k73151j81160n38488
14680I20142L01532j90928M5319O7044k41715N12j32152K98101m10171K87360
14670I45044m9769K24401N445k16662J96366j39310l37225K17123j99867K73174
14660I18720K04066k54761j91059K76349K23236k73859J26644M1732N7962k13529
14650I15501j1214r0952J59870M5618K28839p3199l25019M80405l56955K00855
14640A173749K42663m0167Q7663j36550M22494n03172L81301j83229j00981j66146
14630A177625K65453q0871l71274N0883L2219K03192l93609N63364k48282l53791
14620H44909K17183K17729M37057l95068P6742J3693J1105k03224J16797P5767
$$ y = [953702, 1261333, 1283972, 1315029, 1737646, 1876910, 1827348, 1912941, 1639790, 1458630, 920142, 1221674, 1030746, 1076065, 1143109, 901394, 901906, 769754, 1067855, 657684, 945044, 895275, 1119676, 1125121, 908459, 1104825, 965515, 628290, 845413, 645546, 918720, 1122786, 868025, 676966, 953315, 1176551, 902692, 1029336, 1071068, 1129030, 915501, 904287, 813335, 973205, 1018823, 1247662, 1174463, 849444, 1329849, 972894, 1173749, 1416412, 1376245, 1463908, 1327358, 1749852, 1246680, 1627981, 1444752, 1343771, 1177625, 1443078, 1362207, 990933, 1041816, 1074035, 1277227, 883618, 1446982, 1198700, 844909, 1062092, 1279821, 1716878, 1321810, 1398552, 1412245, 1423350, 1220126, 1336923, 1412690]
14610A412690m4684j12366J63145p6990P1640Q7343l9130J63258o0838K07231
14600A771299l16655J93018L0778p9451o5490p4630j17955M9680K20917k34565
14590A376946K23711K35240o12340K62488J98017P0506j05975L18158m16563k1845
14580A528343K36827n861k05748K11939K15967k46632K20193j57320k6833J19751
14570A890626J6120O400N8215J08816l52359K40861P6289j95048O7531K37546
14560B154997l35200L73966K95177k27041k74708K15406N8368J74345k36241J766
14550B200835K40589K99643l77326K36243l2159J46796p5387O12245P9837K41489
14540C572805j27071P51147j36809Q50859P07471J355775K303340K778720P000561
$$ y = [1412690, 1368006, 1255640, 1418785, 1341795, 1413435, 1500778, 1461648, 1624906, 1564068, 1771299, 1454644, 1647662, 1678440, 1598989, 1533499, 1458869, 1340914, 1390594, 1611511, 1376946, 1600657, 1835897, 1223557, 1486045, 1684062, 1754568, 1648593, 1966751, 1550188, 1528343, 1765170, 1759309, 1553561, 1765500, 1981467, 1734835, 1955028, 1797708, 1770875, 1890626, 1906746, 1913146, 1971361, 2080177, 1727818, 1968679, 2044968, 1849920, 1917451, 2154997, 1819797, 2193763, 2488940, 2261899, 1987191, 2202597, 2260965, 2435310, 2199069, 2200835, 2441424, 2741067, 2363741, 2599984, 2567825, 2714621, 2639234, 3251479, 3331316, 3572805, 3445734, 4196881, 4060072, 4910931, 5618402, 6974177, 9277517, 12056237, 19056798]
14531A9056798R073167R98958r270083o091235k918885k530310k824258q29572
14523D664580k30437K35453l57422j068116J805m09100m2443n05806K69720j43217
14513B415017M3049J8367J8892j23962j27905L98890j18520P4058j46108k09808
14503B241970J87605K2709J46964l2524J4237K42283r5885j91975N9235M18727
14493C013346M057j26152R454K62333k77692M10347J9755k73196J22734J11026
14483C276012l03511M27861j48534l7829K26962k16937M18538J58331m05380J10182
14473C505695L3180K63059j57991j2834n5674L63620K18770l05679L5836n844
14463C882138M583M52612j10303j96180j04459K87428K60675k05490P8733K60617
$$ y = [19056798, 28129965, 29128923, 19858840, 13767605, 10848720, 8318410, 5494152, 4664580, 4434143, 4669596, 4312174, 3244058, 3245863, 2836763, 2794320, 2288514, 2558234, 2415017, 2458066, 2476433, 2495325, 2371363, 2243458, 2642348, 2523828, 2597886, 2451778, 2241970, 2429575, 2452284, 2599248, 2566724, 2580961, 2823244, 2727359, 2535384, 2594619, 3013346, 3017403, 2891251, 2900705, 3163038, 2885346, 3295693, 3315448, 3042252, 3164986, 3276012, 2972501, 3400362, 3251828, 3213999, 3440961, 3224024, 3642562, 3800893, 3395513, 3505695, 3538875, 3801934, 3643943, 3631109, 3575435, 3939055, 4157825, 3852146, 3887982, 3882138, 3886721, 4339333, 4229030, 4032850, 3928391, 4215819, 4476494, 4271004, 4349737, 4610354]
14453D610354l95796M62696q0325Q6378m5210N14345l63324J5067K57691k04362
14443D857514J62613P5746Q1722k9940K05407N0816k31288l301L14232R8907R8167
14432E680595J9345J80103j11405l6805J80602k1893K91614K14557j55780L4118
14422F275051L44595M8136j3127K63039J03780k35245J15065N31743j42258J4368
14412G305147M4161J19736Q2117N1953L44181l2240K22828M58980l9672j52317
14402H404874M12340j94147L92740j15522j99768O82742k49074l1632K74184M13389
14392I790126K70583k86911M66296L37584l347n7755J92889J34910j88129P54055
14382A1410301O4533J41602n7811M51183q8485M28746J35151k9828L18447L50697
$$ y = [4610354, 4214558, 4677254, 4596929, 4683307, 4638097, 5152442, 4789118, 4804185, 5061876, 4857514, 5020127, 5095873, 5177595, 5147655, 5353062, 5403878, 5172590, 5169289, 5483521, 5582428, 5680595, 5699940, 5880043, 5768638, 5731833, 5912435, 5890542, 6182156, 6396713, 6240933, 6275051, 6619646, 6667782, 6654655, 6917694, 7021474, 6786229, 6901294, 7433037, 7290779, 7305147, 7349308, 7469044, 7551161, 7603114, 7947295, 7915055, 8137883, 8596863, 8557191, 8404874, 8817214, 8623067, 9015807, 8900285, 8700517, 9383259, 9134185, 9102553, 9376737, 9790126, 10060709, 9773798, 10240094, 10577678, 10574331, 10516576, 10709465, 10844375, 10656246, 11410301, 11474834, 11616436, 11558625, 12009808, 11921323, 12350069, 12485220, 12455392, 12773839, 13124536]
14372A3124536J89738K15605L56317K48809M00436J85143J5995M38557j84345
14363A4990791N80964N18629M57557q1389M39475K74847Q6941M84041L31513O08516
14353A8691885K42658P75484J31341K69965O44993O7466M16521K79173Q57498
14344B2376984J35008Q54283Q7514O93582Q04446L42069O70855P03392N81604
14335B7249737O54501O15037P52830N61728J058381Q22719N32585Q89333J109813
14326C4246664Q39443R17709J326541M70192J543047P33121J377777J101545J183707
14317D3739746J227026J616815J185086J709759J565584J680964J603208K065705
14309E6393893J911596K169210J791114K059034K127812K583587L155883K294220
$$ y = [13124536, 13314274, 13529879, 13886196, 14135005, 14535441, 14720584, 14736579, 15175136, 14990791, 15571755, 16090384, 16547941, 16466552, 16906027, 17180874, 17267815, 17751856, 18083369, 18691885, 18934543, 19710027, 19841368, 20111333, 20756326, 20823792, 21240313, 21519486, 22376984, 22511992, 23366275, 23453789, 24147371, 24951817, 25293886, 25964741, 26668133, 27249737, 27904238, 28519275, 29272105, 29833833, 30892214, 31714933, 32247518, 33136851, 34246664, 35086107, 36003816, 37330357, 37800549, 39343596, 40076717, 41454494, 42556039, 43739746, 44966772, 46583587, 47768673, 49478432, 51044016, 52724980, 54328188, 56393893, 58305489, 60474699, 62265813, 64324847, 66452659, 69036246, 72192129, 74486349]
14301G4486349L059485K809236L209442L376341L617725L683287L696634M112981
14293A02051480M461260M640519M962050N752488N450159N616562O583573O333338
14285A45851429O816273P512646Q520298Q080274Q697247R532469J0070712J0163722
14277B15245070J1111902J1756159J2166612J3001671J3261398J4303365J4395340
14270C05241517J4880395J5174058J5145931J4459676J4358491J3614881J2556619
14263D05431568J1286808J0811706J0205898R460419P150561M056204L716096
14256D62119260J875553l653800n624346p007289o741158m523421j046492m922585
14248D30475722q619050j2181763j3734621j3862258j3642775j4259142j4921952
$$ y = [74486349, 77545834, 80355070, 83564512, 86940853, 90558578, 94241865, 97938499, 102051480, 106512740, 111153259, 116115309, 121867797, 127317956, 132934518, 139518091, 145851429, 152667702, 160180348, 168700646, 176780920, 185478167, 195010636, 205081348, 215245070, 226356972, 238113131, 250279743, 263281414, 276542812, 290846177, 305241517, 320121912, 335295970, 350441901, 364901577, 379260068, 392874949, 405431568, 416718376, 427530082, 437735980, 447196399, 454346960, 458403164, 462119260, 463994813, 460341013, 454716667, 447709378, 440968220, 436444799, 435398307, 430475722, 421856672, 409674909, 395940288, 382078030, 368435255, 354176113, 339254161]
14241C39254161j3539560j3705338j3658555j3274385j2947250j2117102j2379286
14234B47632685j1283452j0934521j0811055j0458384j0250241r710127r329584
14227A74855321q740934q495422p315802p067461o199533o665075n450901n515611
14219A19404582n478874m965997m524099l912756m263189m009583l489824l445322
14211H5314938l207332l204848k890343k956606k461672k513050k301402k051325
14203F3728360k478116j882149k259207j571663j861185j539658j627379j566518
14195D8942485j803407j229158j078355j319097p79272j612917j172694j004582
14187C8943003q43147j339883j017372p60514q19437j074134r93878o50935o85637
$$ y = [339254161, 325714601, 312009263, 298350708, 285076323, 272129073, 260011971, 247632685, 236349233, 225414712, 214603657, 204145273, 193895032, 184184905, 174855321, 166114387, 157618965, 150303163, 143235702, 137036169, 130371094, 124920193, 119404582, 113925708, 108959711, 104435612, 100522856, 96259667, 92250084, 88760260, 85314938, 82107606, 78902758, 76012415, 73055809, 70594137, 68081087, 65779685, 63728360, 61250244, 59368095, 57108888, 55537225, 53676040, 52136382, 50509003, 48942485, 47139078, 45909920, 44831565, 43512468, 42733196, 41120279, 39947585, 38943003, 38099856, 36759973, 35742601, 34982087, 34162650, 33088516, 32094638, 31443703, 30758066]
14178C0758066j012348m65463p95456r07997k85997r11434o79487o19750n28450
14169B4551684k61932l97630q93105n76068l80851n72393m32701m18456n03798
14160B0114750n13411K4425n69785n59984q8127m64925O7751o74406k41496m71392
14150A6623400o27064p0066l96799r1173l39787l25088k52794l91630r8016j57897
14140A3873086j71489K9626o31237l70307j91838o2834j54490m12856J02604l03153
14130A1707112p0214k49501k09685m60898K47594l01975j04816j56795k11806
14121A0189016j18040l57982p4188q7161j76116o4335K37547p34505J09129L7614
14111H960979m87234L99794J0429n46148j40730K4697k28181m8976j30006J11281
$$ y = [30758066, 29745718, 29280255, 28484799, 27576802, 27290805, 26379371, 25699884, 25080134, 24551684, 24289752, 23892122, 22999017, 22422949, 22042098, 21469705, 21037004, 20618548, 20114750, 19601339, 19625764, 19055979, 18495995, 18407868, 17942943, 18010694, 17336288, 17094792, 16623400, 15996336, 15926270, 15529471, 15438298, 15098511, 14773423, 14520629, 14128999, 14030983, 13873086, 13701597, 13731223, 13099986, 12729679, 12537841, 12475007, 12320517, 11907661, 12010265, 11707112, 11636898, 11387397, 11177712, 10716814, 10964408, 10662433, 10557617, 10400822, 10189016, 10070976, 9712994, 9638806, 9551645, 9375529, 9311194, 9548741, 8814236, 8923365, 8960979, 8473745, 8873539, 8883968, 8337820, 8197090, 8221787, 7993606, 7944630, 7814624, 7925905]
14101G925905l7208n02224J35188K921l02940J11943k70312O7695k21173r2798
14091F816997R3770k09315O08k19629n5204J9543k24574P0473K7999m05547J39471
14080F054592k29828Q9928l76521N50999o94665j58937N13715k1473l56896J00142
14070E471056l76271r3918O205J09978J33038k61600J49316n9933l7653j08431
14060D931787l19057j05181J13942j1787j1267l21600p8622K86603j79401L2729
14050D338146M3302k21825l41597O66112o1177l41832K37704j46163P4502M222
14040D251394m28262n5651N23571j00750m15474J85053m06317N0034N77905q66508
14030C314995J65047q6663j78410L4914L9265l43849J93289K34802K2091m68315
$$ y = [7925905, 7888697, 7386473, 7521661, 7524582, 7221642, 7333585, 7063273, 7130968, 6909795, 6816997, 6910767, 6701452, 6702060, 6482431, 6427227, 6446770, 6222196, 6292669, 6320668, 5915121, 6054592, 5824764, 5914692, 5538171, 6089170, 5394505, 5235568, 5749283, 5727810, 5370914, 5471056, 5094785, 5000867, 5007072, 5117050, 5250088, 4988488, 5137804, 5077871, 5040218, 4931787, 4612730, 4507549, 4621491, 4609704, 4598437, 4276837, 4198215, 4484818, 4305417, 4338146, 4381448, 4159623, 3818026, 4484138, 4422961, 4081129, 4318833, 4172670, 4247172, 4251394, 3823132, 3767481, 4291052, 4190302, 3774828, 3959881, 3553564, 3603598, 4181503, 3314995, 3480042, 3393379, 3214969, 3249883, 3289148, 2945299, 3138588, 3373390, 3395481, 2927166]
14020B927166L9888k0499K83089n2416J53486r065L5457k60920l76120L71269
14010C091335J8161l82934L24303N6062l16383k45104J99332m8902M79207m17293
14000B757784J0556l36334N92425n47973M17479m33341j7869O4702j30602j47303
13990B229524o3852J17994L1530l8719j87096L55893j76744p1829K49660o0092
13980B386269K05988J13952M50051q9882K49531J070349J311621J933146N801408
13971A3432433J0899606M594774n873365n983142l540223k975341k505702j806973
13963F242067j243556q65166j54348n99390r5129o1645n19741K91825l05678J77940
13953B867179m4398k43257J38034k59669l6471l0834M2001j40516K5436k51024
$$ y = [2927166, 2967054, 2946555, 3229644, 3177228, 3330714, 3321649, 3357106, 3096186, 2720066, 3091335, 3109496, 2726562, 3050865, 3106927, 2790544, 2545440, 2744772, 2695870, 3175077, 2757784, 2768340, 2432006, 3024431, 2476458, 2893937, 2460596, 2442727, 2507429, 2376827, 2229524, 2165672, 2283666, 2315196, 2276477, 2089381, 2445274, 2268530, 2196701, 2446361, 2386269, 2592257, 2706209, 3156260, 3066378, 3315909, 4386258, 5697879, 7631025, 13432433, 24332039, 28926813, 23053448, 17070306, 13530083, 10554742, 8049040, 6242067, 4998511, 4133345, 3978997, 3379607, 3284478, 3222833, 2703092, 2994917, 2689239, 2867179, 2822781, 2579524, 2717558, 2457889, 2421418, 2390584, 2432585, 2292069, 2317505, 2066481]
13943B066481k4968J01917j12059o7339L5539K21508k72304J58738j91668j34095
13933A781750n2118M15324l96914J52997K15960o4565j28395J51860K07097l94514
13923A888482k43391J62904j33705k4759j15277M04360k08757R0546l58412K43190
13913A705181j94568J49043n0218k52686K49407j84042K38833k14580J02034M7237
13903A595641l2297K80624p30964O62429j16823j42710K6782k0326J55109m36306
13893A241159M54784l35797l436j09228K89203j89798o7974m1438M25835k10043
13883A453267N8290j40932K29091l01332l01624K27675o8329K03986N5937k01074
13873A214955L2680J53441J09497k62136m74519L11004M8986K78183q2369M949
$$ y = [2066481, 2041513, 2143430, 2031371, 1964032, 1999571, 2221079, 1948775, 2107513, 1915845, 1781750, 1729632, 2144956, 1748042, 1901039, 2116999, 2052434, 1924039, 2075899, 2282996, 1888482, 1645091, 1807995, 1674290, 1649531, 1534254, 1938614, 1729857, 1820403, 1461991, 1705181, 1510613, 1659656, 1609438, 1356752, 1606159, 1422117, 1660950, 1446370, 1548404, 1595641, 1563344, 1843968, 1113004, 1775433, 1658610, 1515900, 1542682, 1522356, 1677465, 1241159, 1695943, 1360146, 1356710, 1247482, 1536685, 1346887, 1278913, 1237475, 1663310, 1453267, 1511557, 1370625, 1599716, 1298384, 996760, 1224435, 1156106, 1360092, 1416029, 1214955, 1247635, 1401076, 1510573, 1248437, 773918, 1084922, 1133908, 1412091, 1329722, 1334671]
13863A334671r5503J65685k53859Q3177j24743K32936m21599O38233m88716K26031
13853A296313j9460k66841q621k70419K26377L45938l17083J30604J6795N4279
13843A187882k86545n9715L74594j40655j43245R2807l5331J39380R1638k20342
13833A000468j09582L13114L2075j66954n9162K25721l81385K35605N9711l91163
13823G58448M54996l6101L8617k87745O4806m1344J71896J91075n89511M88167
13813A213304m41050K26935P5452l5269k95847M0875K93602l77910p9542L65237
13803I85787j3760J31515k29747K73029n61601M09652j71661K75982q5531l40170
13793F73495L77484j93088K7184k33053J7039Q0283J9915K24643k66662J82037
$$ y = [1334671, 1239168, 1404853, 1150994, 1234171, 1109428, 1342364, 920765, 1558998, 1070282, 1296313, 1276853, 1010012, 1001391, 730972, 957349, 1303287, 986204, 1116808, 1133603, 1187882, 901337, 841622, 1216216, 1075561, 932316, 1025123, 989792, 1129172, 1220810, 1000468, 890886, 1204000, 1236075, 1069121, 1009959, 1235680, 854295, 1089900, 1149611, 758448, 1213444, 1177343, 1215960, 928215, 993021, 951677, 1123573, 1314648, 725137, 1213304, 772254, 999189, 1074641, 1039372, 743525, 784400, 1078002, 700092, 620550, 985787, 972027, 1103542, 873795, 1146824, 585223, 994875, 823214, 1099196, 1013665, 673495, 1050979, 857891, 885075, 652022, 669061, 749344, 769259, 993902, 727240, 909277]
13783I09277l39497N80006k38394o5305J61178Q0735E17565J60295J68483k28833
13773F17510L42525j39673j56351K15118m4847j2514k34027p906J23752k7559
13763F76028j09021Q8474K30129j95780j1275K92688l41670J81149k02305L65366
13753I73783k07516r2193J5353k84725K04930m0428J38754k50331L77224l40463
13743D94388N96087E39977j05202J92470J7297K04792k72959K17124K9060j01825
13733G20734j86909k54286M89296j51400j6953p7142J47417L764O9565J54431
13723H98517D28577L34398j84697L0271k11386N697J3618K39211N8643K42613
13713I56945k49601j58952K09294j07945n5451q0240J05972j33456K13752C24099
$$ y = [909277, 569780, 1149786, 911392, 846087, 1007265, 1088000, 517565, 677860, 846343, 617510, 960035, 820362, 664011, 879129, 834282, 821768, 587741, 579835, 703587, 676028, 567007, 655481, 885610, 689830, 678555, 971243, 629573, 810722, 608417, 973783, 766267, 674074, 689427, 404702, 609632, 569204, 707958, 457627, 834851, 494388, 1090475, 539977, 434775, 627245, 644542, 849334, 576375, 793499, 822559, 720734, 533825, 279539, 768835, 617435, 600482, 523340, 670757, 674521, 744086, 898517, 428577, 762975, 578278, 608549, 397163, 402860, 416478, 655689, 714332, 956945, 707344, 548392, 757686, 649741, 594290, 514050, 620022, 486566, 700318, 324099]
13702F63278M2944k64452J15782n2126J73340r9070n6486O1053Q959j027j19042
13691D73153M4544K0226r1537p3228Q9730k28652L47894R9432k01956M5840m2591
13680D82855K36056o315C00461J28211J10380J25307k52697m4989l7909A00437
13669E52218J02950l17246J9825M21719C14264E8757L73136J47971J05597k02556
13659D82905B27093J68003k79O9348k25090K28297j54260o1868M67007p8894L6967
13648F76324k63898M31293l10477K4871J06903I8835J75930j9428J48634L36860
13638G40831j14882j87185K0244A03034N54462C18626K25098A75463J86831j20959
13628B41335R6285P6245K7663j08516K01735O8437B66880n3559J07801M81744
$$ y = [663278, 706222, 441770, 557552, 505426, 678766, 579696, 523210, 584263, 593222, 592195, 473153, 517697, 537923, 446386, 373158, 462888, 234236, 582130, 681562, 479606, 525446, 482855, 718911, 712596, 300461, 428672, 539052, 664359, 411662, 366673, 328764, 100437, 552218, 655168, 337922, 357747, 779466, 314264, 58757, 431893, 579864, 685461, 482905, 227093, 395096, 394817, 464165, 239075, 467372, 313112, 251244, 718251, 639357, 676324, 412426, 843719, 533242, 558113, 665016, 98835, 274765, 255337, 403971, 740831, 625949, 438764, 459008, 103034, 657496, 318626, 543724, 175463, 362294, 241335, 337620, 413865, 441528, 333012, 534747, 603184, 266880, 213321, 321122, 802866]
13618H02866A76162J67221K2973L12930k56655Q886A67282K57626r2402L26608
13608F59114C14150J56962j74206L01121k95688L61422k98329j23232K88004p6976
13598D53228p7609K04587B21559l6831O1870K06611j19387K31186p1670k1323
13588D72015K16160A95215N8742L19360k38343J35115f4307D06815I0347K80694
13578C71041J63880i1238C07841R044j2281j20554K1679L52098B43878K03060
13568D46938k0209o7765j8795C5723c7382C82076j60097J71436c2320G2414K26317
13557B98731J85436m731L37355k13029A04138J87081A23705L26506j67937K34417
13547E16691k10847A45895M90713j67301B10725O9586q4821j059R1306Q7510j58318
$$ y = [802866, 176162, 343383, 366356, 679286, 422631, 431517, 167282, 424908, 332506, 659114, 314150, 471112, 296906, 598027, 302339, 663761, 365432, 242200, 530204, 453228, 375619, 580206, 221559, 184728, 246598, 453209, 333822, 565008, 493338, 472015, 688175, 195215, 253957, 573317, 334974, 470089, -64307, 406815, 90347, 371041, 534921, -91238, 307841, 316885, 304604, 184050, 205729, 557827, 243878, 446938, 426729, 358964, 340169, 35723, -37382, 382076, 221979, 393415, -32320, 72414, 298731, 484167, 479436, 816791, 603762, 104138, 291219, 123705, 450211, 282274, 516691, 305844, 145895, 636608, 469307, 210725, 280311, 195490, 194431, 285737, 373247, 214929]
13536B14929K44811F6150P8762K01972K03937k29276a478B52707J90851A03616
13525C89090l1779M169p4704Q1173K60238A32187e377I2758L04714J11291B52820
13513C53903L10509A99031D0887J42851J17192B1563J43855p3447K12728J0508
13503C15207j24354O38910C81436C0757f5260B97685J11536A70240L66156E6715
13492D01614j04242K6169j02409l2281H9906K33655K30911j83124J54577k28800
13482B97125a36324E20406A61882j9228B0155K61396q1575p7130K27879N3920
13472D04645A65505K55494j71077M27384B43802j361K7725j33144J56408A24448
13461B98062k6789F2378M3923D9857P3245K70450A72164O6307c0846D06840J9916
$$ y = [214929, 459740, 66150, 144912, 346884, 550821, 321545, -1478, 252707, 443558, 103616, 389090, 357311, 361480, 286776, 367949, 628187, 132187, -5377, 92758, 397472, 508763, 252820, 353903, 664412, 199031, 40887, 183738, 300930, 21563, 165418, 91971, 304699, 315207, 190853, 829763, 381436, 30757, -65260, 297685, 409221, 170240, 536396, 56715, 401614, 297372, 323541, 221132, 188851, 89906, 323561, 554472, 371348, 525925, 297125, -136324, 520406, 161882, 142654, 20155, 281551, 199976, 122846, 350725, 404645, 165505, 420999, 249922, 677306, 243802, 242441, 270166, 137022, 293430, 124448, 298062, 271273, 62378, 106301, 49857, 123102, 393552, 172164, 238471, -30846, 406840, 426756]
13450D26756A13053K26006O370J23423C5495L23508a67010B81359R8938j82886
13440A97411j572a70724D31593C6187J70246H371J72708M7817j03195K9667a03220
13428C73596A73681n8118k0610P3152J76196J13452d1479J1043C09254q0159g044
13416A51733K7965e6432j50166d9313E9544K87893r3791I2426J77221l0867M5923
13405B84703C3665K47081Q721I9194l5234O4031c3935B66149C9931K67460B6205
13393B93781K52459a6002C02454p8551n6955L2456J74182Q8428A08288b14931
13382B72607H0593B4204L1369J32004d0417B68763K54294k26810O809p4790A6856
13370A76615k9711j7753m5087L75312D1701M55418G3683M69793A31574E2035L71793
$$ y = [426756, 113053, 339059, 345429, 468852, 35495, 359003, -167010, 281359, 380297, 197411, 195839, -170724, 431593, 36187, 206433, 8371, 181079, 228896, 125701, 155368, -103220, 373596, 173681, 115563, 94953, 168105, 344301, 457753, -41479, -30436, 309254, 229095, -7044, 151733, 179698, -56432, -206598, -49313, 59544, 347437, 253646, 92426, 269647, 238780, 284703, 33665, 280746, 289467, 99194, 63960, 127991, -33935, 266149, 39931, 307391, 26205, 293781, 546240, -16002, 302454, 223903, 166948, 199404, 373586, 462014, 108288, -214931, 272607, 80593, 24204, 55573, 187577, -40417, 268763, 523057, 296247, 303056, 228266, 16856, 176615, 146904, 129151, 84064, 459376, 41701, 497119, 73683, 543476, 131574, 52035, 423828]
13359D23828b2200k0794G4362L93557b4081C08265o9428B6749J07407K36435a79
13347H8203b0884B04821R6039l3184K9097B1767J03510m0497K5375c2983m5212
13336g8195A30768C4657L0439k7152K80198a95893B45365R461n2719j5733J91093
13325C77467j01251P4648L7010J06049j36138j5824J66936B51153m9528L17612
13315E19237K85525a31185C9406M79200j31100b6525B84920B9534M57352k40251
13305B46635L66677A65267B2588K00255R9893j5944J9544j45485N5669q7900M114
13294A52734M78062B61172R4484J9679o8720a5768B71733H1194J36019J92807
13284D10020K6481j66224q0296K53529g7145a6167H6357L29331O971I5707N5212
$$ y = [423828, -22200, -42994, 74362, 467919, -24081, 308265, 238837, 26749, 134156, 370591, -179, 88203, -20884, 204821, 300860, 267676, 296773, 21767, 125277, 84780, 110155, -32983, -78195, 130768, 34657, 65096, 37944, 318142, -195893, 245365, 254826, 202107, 186374, 377467, 276216, 350864, 387874, 493923, 357785, 341961, 508897, 251153, 201625, 519237, 804762, -131185, 39406, 518606, 387506, -26525, 284920, 29534, 486886, 246635, 613312, 165267, 22588, 222843, 322736, 306792, 326336, 180851, 236520, 148620, 152734, 630796, 261172, 355656, 375335, 306615, -15768, 271733, 81194, 217213, 410020, 436501, 270277, 189981, 443510, -77145, -16167, 86357, 415688, 422659, 95707, 150919]
13273A50919j0397a02601A88442A1589K15214A2075h5032B40318C8616L5076N2134
13262A25826J30586a2064C47431n4445A2728B740b07349F1574b0181D22087A64213
13250B66303n6285i866l9979j9296b9069H6547B7793b57007C56321O011A80894
13238a86808c6593B80047J21152q5540a98560e3181A93798d9785C91838D3082
13227G0616Q0992L1113B456L90635r8488F1426O3379b08838D12394A59086G2091
13215B44106a39100H3091A5133e7260J3975D0877M8357O1120M6041H9442J24035
13204B13477J67183A08973d0317j53152L6159B69909E3459d5802A94785b38486
13193A38987k929e7407A24951m5741L95864K23669B38442Q227p478P9254n461
$$ y = [150919, 140522, -102601, 188442, 11589, 226803, 12075, -85032, 240318, 38616, 73692, 125826, 256412, -12064, 347431, 292986, 12728, 2740, -207349, 61574, -20181, 422087, 164213, 266303, 210018, -9866, -49845, -69141, -29069, 86547, 27793, -257007, 356321, 362332, 180894, -186808, -36593, 280047, 401199, 315659, -198560, -53181, 193798, -49785, 391838, 43082, 70616, 151608, 182721, 2456, 393091, 294603, 61426, 124805, -208838, 412394, 159086, 72091, 244106, -139100, 83091, 15133, -57260, -43285, 40877, 89234, 150354, 196395, 89442, 213477, 380660, 108973, -40317, -193469, -157310, 269909, 53459, -45802, 194785, -238486, 138987, 136058, -57407, 124951, 79210, 475074, 698743, 238442, 246669, 239191, 318445, 312984]
13182C12984E5414h4212B01756K3851o9371K1319N3610I3543a74809D5178h1665
13170A69410c2692A82836D0775J24294L9265a16844A82750J31471A37629a05056
13159A30419a10694B04245q7243a96722f9550I1591a9893k8173A49890B5186N3162
13148G8348J94866a07808C34242p8182J11016f4615B68229J49638e7651E12158
13137B53691E1073e5608F1744J55347a71428H1859M4450D2402e6078D69043b38377
13125F0031J53704H793i3942B14297q6248f4832A4422J35454D1727J8816g3366
13113A03859a34746C65193b30604J3672c8703A77593F2979A5274L36315o5530
13103B86059H3952K23497k7553j19855o2299k6044d5630p1516o4749o970B8708
$$ y = [312984, 55414, -84212, 201756, 225607, 156236, 177555, 231165, 93543, -174809, 45178, -81665, 169410, -32692, 182836, 40775, 165069, 204334, -116844, 182750, 314221, 137629, -105056, 130419, -110694, 204245, 117002, -196722, -69550, 91591, -19893, -48066, 149890, 25186, 78348, 273214, -107808, 334242, 256060, 367076, -64615, 268229, 417867, -57651, 512158, 253691, 51073, -55608, 61744, 217091, -171428, 81859, 126309, 42402, -56078, 469043, -238377, 60031, 213735, 8793, -93942, 214297, 128049, -64832, 14422, 149876, 41727, 60543, -73366, 103859, -134746, 365193, -230604, -216932, -38703, 177593, 62979, 15274, 351589, 286059, 83952, 307449, 279896, 160041, 97742, 71698, -45630, -117146, -181895, -188865, 28708]
13091A88222Q8552h0498B05554a6592D618A640K0272b0545C11664J37254a15998
13079i7840B66067J38142A58825E3466K6754J82234J3918b25954C20620a04450
13068B19563q7004b9148H8569j9184h1503B04088a6772B23173A09259b05198A0866
13056A02808c81974e7655A09904a18928p0617b0090B81904A2673J38932b09684
13045A76809D1764K60485o6008n7172g7414D86308B28563g3995D17890p1345c8128
13033B7233L65882a85233A75318C9529b02511a00438B41263r8699J49188b85685
13022A5927R4073Q3321h6815B25254a09242G2010Q2044J15514C6039j619M7570
13011H1990K53213F9902J25610b18616B81255j17991D6388O432b04450E9845K88782
$$ y = [188222, 276774, -80498, 205554, -16592, 4618, 1640, 21912, -20545, 311664, 448918, -115998, -97840, 266067, 404209, 158825, 53466, 80220, 262454, 276372, -225954, 320620, -104450, 219563, 132559, -29148, 88569, 69385, -81503, 204088, -16772, 223173, 109259, -205198, 10866, 102808, -381974, -57655, 109904, -118928, -189545, -20090, 281904, 12673, 151605, -209684, 176809, 41764, 302249, 236241, 179069, -77414, 486308, 228563, -73995, 417890, 346545, -38128, 27233, 393115, -185233, 175318, 39529, -202511, -100438, 241263, 142564, 291752, -285685, 15927, 110000, 193321, -86815, 225254, -109242, 72010, 154054, 269568, 36039, 34420, 81990, 335203, 69902, 195512, -218616, 281255, 163264, 46388, 52820, -204450, 59845, 348627]
13000C48627A3876K32407g3923A72088m106N4704d1660F8297f5209A32912O1644
12989A94556b10141G6885N9828B5332J92410a41030I3492M6853b17950E5894b98958
12977F0757k8726L3695f6191H9344L19532b37062N3169A77674N1969M2739c15411
12965h4970j0443a3216B21220A08046a8440B3499b88482C3595h0544A69386b852
12953A31473K55310a98023d6934C8063P3963g4817B68598D4616K9790a66437P2090
12942i4347A93222D0889g7110A39282R7765d5050m5855m768A80084e1526C95910
12930a5950j55128e8333A20654l2361i8774E2953a75852g4301j8153B04651q7856
12919A16795b5797m4534j30023B71705j22808N9043b00862B1737c53047h4489
$$ y = [348627, 13876, 246283, -73923, 172088, 167982, 222686, -41660, 68297, -65209, 132912, 194556, -210141, 76885, 136713, 25332, 217742, -141030, 93492, 140345, -217950, 55894, -298958, 60757, 32031, 65726, -66191, 89344, 408876, -237062, -183893, 177674, 229643, 272382, -315411, -84970, -95413, -13216, 221220, 108046, -18440, 23499, -288482, 33595, -80544, 169386, -2852, 131473, 386783, -198023, -46934, 38063, 112026, -74817, 268598, 44616, 74406, -166437, -94347, 193222, 40889, -77110, 139282, 237047, -45050, -90905, -95673, 180084, -51526, 395910, -15950, -171078, -58333, 120654, 88293, -98774, 52953, -175852, -74301, -92454, 204651, 116795, -25797, -70331, -200354, 271705, 148897, 207940, -200862, 21737, -353047, -84489]
12908c23335J36337P1153M0570q765j6472A15758Q7528a35167b1861A69625M9220
12897B18845b07571B75874p3605b0055A01468b20913A99015a84296b7352G9230
12886a21814F6133l1310a44897L9424b7596A73059F6197P0381k9945a04516j22397
12875b26913H9282a6719D69104b50257a05541K4636k41152a50587r2192C806a78832
12863B31691c8643D853b81980A10701h8704j02657B11698H1988M99604H2744C5720
12851a75665Q284F0071N2975a3809k27788G0991a87336N5967A27916J10615G55
12839I4963a75287g3694k85216a62222d2084p4909C8691a50402k11812A31474
12828b40839D2615L8834h0590o0044O183C5558a0273B28670j00326i3391o2330
$$ y = [-323335, -186998, -115845, -75275, -84040, -100512, 115758, 203286, -135167, -21861, 169625, 218845, -207571, 275874, 202269, -20055, 101468, -220913, 199015, -184296, -27352, 79230, -121814, 66133, 34823, -144897, -105473, -27596, 173059, 66197, 136578, 106633, -104516, -226913, 89282, -16719, 469104, -250257, -105541, -80905, -322057, -150587, -242779, 3806, -178832, 231691, -38643, 4853, -281980, 110701, -88704, -191361, 211698, 81988, 581592, 82744, 35720, -175665, -167381, 60071, 113046, -13809, -241597, 70991, -187336, -131369, 127916, 238531, 755, 94963, -175287, -73694, -358910, -162222, -42084, -116993, 38691, -150402, -362214, 131474, -240839, 42615, 81449, -80590, -140634, -134451, 35558, -10273, 228670, 128344, -93391, -155721]
12817a55721e6230A02069J1612J85440A21769J07253D5361J04532a47544r9480
12807b47024P4799C0229b95278A1896J09514a01548o5183A18870l5180A6056b21958
12795b44253D7423K0231A0819M7341b76088B67368l3381a11215c8128B28265B4286
12783a22608A77637n7135j7582l5814a13123F3603a4427D9618g1986A40387D7648
12771A19199a51451A05424g6889r4160e5956q5518f681F0849J44130g3798b2669
12759a28696B09206b08032A0333f9351j3482r5403K8377g940A6494b02382d4329
12747c13336a8037C01152b4355j22208B80454a66460J5694j34725C3355M24623
12737D57978D3875j8378a56647B19612b66641Q1739l9565q5444d6859a9039A25379
$$ y = [-155721, -56230, 102069, 113681, 299121, 121769, 229022, 45361, 149893, -147544, -247024, -172225, 30229, -295278, 11896, 121410, -101548, -166731, 118870, 83690, 16056, -221958, -244253, 47423, 67654, 10819, 58160, -276088, 267368, 233987, -111215, -38128, 228265, 24286, -122608, 177637, 120502, 102920, 67106, -113123, 63603, -14427, 49618, -71986, 140387, 47648, 119199, -151451, 105424, -76889, -171049, -55956, -141474, -6681, 60849, 204979, -73798, -22669, -128696, 209206, -208032, 10333, -69351, -82833, -178236, -149859, -7940, 16494, -202382, -44329, -313336, -18037, 301152, -24355, -146563, 280454, -166460, -150766, -285491, 33355, 457978, 43875, 25497, -156647, 219612, -266641, -184902, -224467, -309911, -46859, -19039, 125379]
12725a90336C35729A17286c80100A30816n2952g5633c0990G0199K04691A34007
12714H1693B1741J31070g473F7221c8237p5403r3412l4732A69953o6489K39795
12703C43259e2282j92425i8925L7008C1512N6288B3290J99916K0062p0342G1227
12691C35962B8956L9255b4093j1469b63D27396j04757B8217F439b26925e856A62102
12678D19214A19731j6642P1714J62261a2396k21020F7331R5400a8923A3875J12739
12667A26614C3537e958o5026A94130q8266B2549a01602C78828a58661A32633O0113
12656A92746M8222H618a03932A96925A5361a51021B15639a43890H2984A8271L47882
12645C66153a4006B02573p9049c41412B76859b68171G205e4048E2818F98i6733
$$ y = [-190336, 335729, 117286, -380100, 130816, 77864, -75633, -30990, 70199, 274890, 134007, 81693, 21741, 152811, -7473, 67221, -38237, -113640, -207052, -241784, 169953, 103464, 343259, -52282, -244707, -98925, -61917, 31512, 87800, 23290, 223206, 243268, 172926, 71227, 335962, 28956, 68211, -24093, -35562, -263, 427396, 322639, 28217, 6439, -226925, -5856, 162102, 419214, 119731, 103089, 174803, 337064, -12396, -233416, 67331, 162731, -18923, 13875, 126614, 33537, -5958, -70984, 194130, 105864, 22549, -101602, 378828, -158661, 132633, 192746, 240968, 8618, -103932, 196925, 15361, -151021, 215639, -143890, 82984, 18271, 366153, -14006, 202573, 123524, -341412, 276859, -268171, 7205, -54048, 52818, 698, -96733]
12633f3131C357a36540B23981a54437A19773J390D4170c9715D27522a90834I599
12621B9014C961b46441B01460F6867J52729O8356D8796d3257B2874J44756J54441
12610C22071H8844K2520J39947h4994b6226B29659r8671J27315D3139K8451B7199
12598A25277E1198K961J12712g6131B01369r813f1759F7881a73835A88501h914
12586A54908a19000p7047C73986E0131J47903c24825E0462f1493G4821c6828k35229
12575b72057B87050E0795K13944A23117R6173l4385a55767A40794i4315D34333
12564e864j1652n2615A46877J46178e3209m1145A3769a40311A61008K2816p6906
12553A06918J61229D0695c77533J38225f2265D2861R0845J15544j00546c63396
$$ y = [-63131, 3357, -136540, 223981, -154437, 119773, 121163, 44170, -39715, 427522, -190834, 9599, 29014, 3961, -246441, 201460, 66867, 219596, 287952, 48796, -43257, 22874, 167630, 322071, 88844, 111364, 251311, -84994, -26226, 229659, 130988, 258303, 43139, 71590, 27199, 125277, 51198, 54159, 166871, -76131, 201369, 191556, -61759, 67881, -173835, 188501, -8914, 154908, -119000, -196047, 373986, 50131, 198034, -324825, 50462, -61493, 74821, -36828, -272057, 287050, 50795, 264739, 123117, 219290, 184905, -155767, 140794, -94315, 434333, -5864, -17516, -70131, 146877, 293055, -53209, -94354, 13769, -140311, 161008, 183824, 106918, 268147, 40695, -377533, -239308, -62265, 42861, 133706, 249250, 148704, -363396]
12542a19606H0194a92084j20446a05329c5927D0022a07973A27421n8444b75641
12531a04773H5420L1008d0446k9364b7475E1777a74213b9706F5325O9568k5857
12520A09036c22803i6847B2684f0667I7059A606b6972E4699M1024d08123i4534
12508c9612D0346J15925i0011G6237C3713c04400a15192b5200A09367c0192a1827
12496e7220b5237B68528M1515A23642J00276a12186I0394a39475I1309B0822K19182
12485B40004i9191c6783G5263g5548L1604D29K62870I2408d9501k92160I1786
12473a0017B07867F0754J15150J5446a28018F8711K18965a9527k7547C3691K96544
12462C30235B1155c1983B19522a3552D21040f9127A35273F0563a90952Q0627C02104
$$ y = [-119606, 80194, -192084, -312530, -105329, -35927, 40022, -107973, 127421, 68977, -275641, -104773, 85420, 116428, -40446, -69810, -27475, 51777, -174213, -29706, 65325, 134893, 109036, -322803, -96847, 22684, -60667, 97059, 1606, -26972, 54699, 95723, -408123, -94534, -39612, 40346, 156271, -90011, 76237, 33713, -304400, -115192, -25200, 109367, -30192, -11827, -57220, -25237, 268528, 310043, 123642, 223918, -112186, 90394, -139475, 91309, 20822, 240004, -99191, -36783, 75263, -75548, -43944, 429, 263299, 92408, -49501, -341661, 91786, -10017, 207867, 60754, 175904, 191350, -128018, 68711, 287676, -19527, -47074, 33691, 330235, 21155, -31983, 219522, -13552, 421040, -69127, 135273, 60563, -190952, -110325, 302104]
12450A33174d46998g335r0175J1859C04934B789b68869B41569G0075A6005J86994
12439B02999B607L2969K2860a64487c8224k02452A27331c22057a5864B64850C5325
12427I1468a20898D3681a25899M2012A38657b90283a14997D052Q1b59651a08535
12415b65134a09853m8601N9184H4715a71022O2645G4541a61052I1727m5648c05469
12403C3444a69232j70220d7196G1086H147J28215d703G8972C9247a21959o2076
12392a84035r1067A3058a39941E1056K2069a09484k14491a06566l7996H7238K10778
12381B98016b45312c9516r0291A52677C7290K43971a88669N0701e9420A61320
12370B80002i1210r6277I7535c9776p340B61373e6936A5206L42378f7606B91630
$$ y = [133174, -446998, -7335, -97510, -85651, 304934, 2789, -268869, 241569, 70075, 16005, 202999, 2607, 35576, 58436, -164487, -38224, -240676, 127331, -322057, -15864, 264850, 35325, 91468, -120898, 43681, -125899, -83887, 138657, -290283, -114997, 4052, 4133, -259651, -108535, -265134, -109853, -158454, -99270, 84715, -171022, -108377, 74541, -161052, 91727, 46079, -305469, 33444, -169232, -339452, -47196, 71086, 8147, 136362, -4703, 78972, 39247, -121959, -184035, -275102, 13058, -139941, 51056, 73125, -109484, -323975, -106566, -144562, 87238, 298016, -245312, -39516, -129807, 152677, 37290, 281261, -188669, -137968, -59420, 161320, 280002, -91210, -187487, 97535, -39776, -47116, 261373, -56936, 15206, 357584, -67606, 291630]
12358F274L30830j65249q572c20763B99064R0082a82828f9017b580j5931I932
12346A01731M54653a28328l0220E37729a06966A23790A5474b08717j3120J01123
12336a20714q992D9658d8302E3306b216A16301A1009J43497n404R092b8961A17909
12323e4005k26936A60034F7492J154c907D7224b12361D08566A09541K84710A84768
12311D67973j78800A19512J32741N7005g7901B48945J06238r1906Q4277p4438
12301B73116J57615G6928J76521i9687A28782n3238j4664O4883a8718k0800k5572
12290f5090G0144l0785M20844D246d65457B35309b2914A94373m3018a11979B46716
12278A91646b52918a19516G921K15660g153k13802B93119F1905j825g3159A80306
$$ y = [6274, 337104, 171855, 163283, -320763, 299064, 389146, -182828, -69017, -2580, -18511, 9932, 101731, 556384, -128328, -158548, 537729, -106966, 123790, 15474, -208717, -221837, -120714, -129706, 49658, -48302, 53306, -2216, 116301, 11009, 154506, 149102, 158194, -28961, 117909, -54005, -280941, 160034, 67492, 68646, -3907, 47224, -212361, 408566, 109541, 394251, 184768, 467973, 289173, 119512, 252253, 309258, -77901, 248945, 355183, 263277, 347554, 273116, 430731, 76928, 253449, -99687, 128782, 75544, 60880, 125763, -18718, -39518, -65090, 70144, 39359, 460203, 4246, -465457, 235309, -22914, 194373, 151355, -111979, 246716, 191646, -252918, -119516, 7921, 223581, -7153, -220955, 293119, 61905, 60080, -73159, 180306]
12266A50569a2171B53925K22530I6563O6591c9010C50673A69814A9623K57502
12256B77125K35544c15296B78951H8836J86764A37442a70004A33994n6172K24401
12246C02223A28071K673a41915C85186p1322k2839L6754j6274j28201C3135L57764
12235C90899b5368B75485r8423l371K71787H5003P5242c30530C14964H6041K4859
12224A10900b07632B83307c5055F4878J23761E4535a44391B02955h3774b4097
12213B44097j07704D7453M49446g4188k5784E55698I4693J44033A16866K74195
12203C91061J51194J60439j08620k52286J4053J01017B02925L5037r9119L6925
12193A75768K66039A35696b1336j49109C04552J81840j86748h6900L9306A05393
$$ y = [150569, -12171, 253925, 476455, 96563, 163154, -39010, 350673, 169814, 19623, 277125, 512669, -315296, 278951, 88836, 275600, 137442, -170004, 133994, 77822, 302223, 128071, 130744, -141915, 385186, 313864, 291025, 327779, 311505, 183304, 33135, 390899, -25368, 275485, 177062, 173691, 445478, 85003, 160245, -330530, 314964, 86041, 110900, -207632, 283307, -35055, 64878, 188639, 54535, -144391, 202955, -83774, -24097, 244097, 136393, 47453, 496899, -74188, -99972, 555698, 94693, 238726, 116866, 391061, 542255, 702694, 594074, 341788, 355841, 456858, 202925, 237962, 138843, 175768, 441807, 135696, -21336, -170445, 304552, 486392, 299644, -86900, -47594, 105393]
12182d1955A04281R6961i8898A74225A6323L99196A48381K0388J60628J92819
12172E22216H7864J28482i2198A74056d0584C62351C3260L49421p1846r3541A6837
12160B78859A00173O3738l4762K6442K13896j29816L9512J50426o0831c9816B05247
12148C34057J95592B30626J57938m9796P274D2682a58441B61019a2941l6590I4214
12136C20622G7105a44343H1382J56995C0417b79879F563a33849A0155e7720p9616
12125a37336B71896o0643a2855A79018a1395A9046a38334n2121C9554J91011j05813
12114A24752J42335A25599d0690k1883E2768J78931e4152B46918D5332K25729
12104B71061f1663B60022J34436A55686Q5272A18306K18135A30936O0419f8919
$$ y = [-41955, 104281, 201242, -98898, 174225, 16323, 415519, 148381, 168769, 329397, 522216, 87864, 216346, -92198, 174056, -40584, 362351, 33260, 382681, 310835, 217294, 16837, 278859, 100173, 163911, 129149, 155591, 369487, 239671, 279183, 429609, 368778, -39816, 205247, 334057, 529649, 230626, 388564, 338768, 346042, 42682, -158441, 261019, -12941, -49531, 94214, 320622, 77105, -144343, 81382, 238377, 30417, -279879, 6563, -133849, 10155, -57720, -137336, 271896, 211253, -12855, 179018, -11395, 19046, -138334, -190455, 39554, 230565, 124752, 267087, 125599, -40690, -62573, 52768, 231699, -54152, 246918, 45332, 271061, -61663, 260022, 394458, 155686, 240958, 118306, 336441, 130936, 191355, -68919]
12093g4354C59406G1690L509a3877j88890A82667F0435J03239p2902l4091f8108
12081A28789C3585e1828b4506A0742L942J24718n5364K25951B2564J78441I1164
12069B31103h5385c0471A44032J21439r1396f0614B43174Q1N9317J483C6316p598
12057B8718R21L11831j38225o4385K663O2566i06A61310a78810C27113A01530
12045C8314B233K83331C3450R6562K67318A28126a70894B20363A3682d7181a5318
12033d31039d619E7595a8011k79641J00174Q7872E1616a85571a0281j00957l27730
12022d38968B72094a88431C16474j38357O1390F1302P1319D125K12722C0224b96963
12010a14087F8846b76544C21122A18146a50916b6575P810B07306J25101q3376
$$ y = [-74354, 359406, 71690, 75199, -13877, -202767, 182667, 60435, 163674, 90772, 56681, -68108, 128789, 33585, -51828, -24506, 10742, 14684, 139402, 84038, 309989, 22564, 201005, 91164, 231103, -85385, -30471, 144032, 265471, 174075, -60614, 243174, 243255, 302572, 304055, 36316, 28718, 29639, 341470, 203245, 138860, 141523, 204089, -906, 161310, -178810, 327113, 101530, 38314, 2233, 285564, 33450, 130012, 397330, 128126, -170894, 220363, 13682, -47181, -15318, -431039, -4619, 57595, -18011, -297652, -197478, -109606, 51616, -185571, -10281, -111238, -438968, 272094, -188431, 316474, 178117, 239507, 61302, 132621, 4125, 216847, 30224, -296963, -114087, 68846, -276544, 321122, 118146, -150916, -26575, -18765, 207306, 332407, 249031]
12000B49031k9140M5303A08928A5218b4192l0751A62729a34528n533A04380h4571
11988A24989j8475L46945b31595j5759C05514H1903N4823A4821P7500a68637A4345
11976a15548B84234g2521j84120H3362K2154b48953p8670A74984l7076b20095
11965B02158f1467j54531B18389f657j33084C79021B2404e5280B15284F9260L0475
11954I9735a76660a2067A18706a99001m8700A66823E8476P7547a15205F8908J27637
11943A96545i3750A33393L8379c0644B11311c07955f5517p3566j2142n1181K6182
11932a76224f9367F6818a09050E7216f6100B62021a10339M4403B18195b95262
11921f3404A83139l543b61597A64653d1468r6421K1078A93661a54340c8554C1210
$$ y = [249031, 219891, 265194, 108928, 15218, -24192, -54943, 162729, -134528, -140061, 104380, -84571, 124989, 106514, 453459, -231595, -247354, 305514, 81903, 136726, 14821, 92321, -168637, 14345, -115548, 284234, -72521, -256641, 83362, 105516, -248953, -327623, 174984, 137908, -220095, 202158, -61467, -215998, 218389, -6657, -139741, 379021, 22404, -55280, 215284, 69260, 99735, -176660, -12067, 118706, -199001, -247701, 166823, 58476, 136023, -115205, 68908, 196545, -93750, 133393, 171772, -30644, 211311, -307955, -65517, -139083, -151225, -202406, -176224, -69367, 66818, -109050, 57216, -66100, 262021, -110339, -65936, 218195, -295262, -63404, 183139, 179596, -261597, 164653, -41468, -137889, -116811, 193661, -154340, -38554, 31210]
11909b9094k25761E3807k1340K8440g1175G9124g6862A43419i618I6059n548c76004
11896B45942j02434b02454A93251b655m9089p0116M6090j52938l4639H9906e1703
11884b9724l15932C86346A75973o6788C2997a48545j3752I4039c16813B05387
11873A44920b06533E9378m896a67497C7690a75463K4647H5249i9853B19929h7557
11861b90626P9065E562J26507O9344c48629A37303b12053C02681B7409K42768
11851B70177K5434a13963A9341a36003D0237a1744A11123B1116a21137A64176
11840b53997b2386B04076a51424C25520b73733C06149j51283F7190P3955a41603
11829g2575j83571A99877a58813A9923J43524l291b69163B108M0578b26163M318
$$ y = [-29094, -254855, 53807, 32467, 60907, -71175, 79124, -76862, 143419, -9618, 96059, 90511, -376004, 245942, 143508, -202454, 193251, -2655, -51744, -121860, -75770, -228708, -263347, 89906, -51703, -29724, -345656, 386346, 175973, 109185, 32997, -148545, -162297, 94039, -316813, 205387, 144920, -206533, 59378, 54482, -167497, 37690, -175463, -150816, 85249, -99853, 219929, -87557, -290626, -211561, 5562, 132069, 201413, -348629, 137303, -212053, 302681, 27409, 270177, 295611, -113963, 19341, -136003, 40237, -11744, 111123, 21116, -121137, 164176, -253997, -22386, 204076, -151424, 325520, -273733, 306149, 154866, 67190, 141145, -141603, -72575, -256146, 199877, -158813, 19923, 163447, 160156, -269163, 2108, 42686, -226163, -221845]
11818b21845B18827c86326a19919P958A1598a39491A53517b180j25240K7491a6771
11806a26156A50220i3316B2022N0682a09994A29825l9783a95397e1424A70393
11795d4186j13105K0112q0273H1018b39246N7637k90604B54886b13326L3873j00914
11784b80367J06175A30773b6513l7124k08756B43392a20984B9630b19205P2356
11774a46849F391a38170H872a1197k8770n0639B59711J4442H8019l7286b0188
11762b26457o707g2141p2543O1273k74864A6247P2112a9527G254I62M8989d5867
11749b10k41888n267C24982a6169B2984L2903J95158b14380D0400R3325G650J36099
11737A43749c0622k83825a5997j55229b2810A44177a97503b6006F6480j6920a0412
$$ y = [-221845, 218827, -386326, -119919, -111961, 11598, -139491, 153517, -2180, -127420, -99929, -16771, -126156, 150220, -93316, 22022, 72704, -109994, 129825, 90042, -195397, -51424, 170393, -44186, -157291, -137179, -217452, 81018, -239246, -181609, -472213, 254886, -213326, -179453, -280367, -174192, 130773, -26513, -63637, -272393, 243392, -120984, 29630, -219205, -146849, 6391, -138170, 8872, -11197, -39967, -90606, 259711, 274153, 88019, 50733, -20188, -226457, -233164, -72141, -144684, -83411, -358275, 16247, 88359, -19527, 7254, 962, 49951, -45867, -210, -242098, -247365, 324982, -16169, 22984, 55887, 251045, -214380, 40400, 133725, 7650, 143749, -30622, -314447, -15997, -171226, -22810, 144177, -197503, -26006, 66480, 49560, -10412]
11725h3118F3002a29689a5354B88042a64059N4382D91978a07229j59917O225i0086
11713a66756c6601G0608e3858o0340K6407j337L5494A09682j5493a93572q5918
11702b79490A53712c98706J53187O2358m6798A48027a18493C21436E5457k333
11692E3124J20250a74761L0570m0278C59668b53065A23057a7608C60754A75160
11681A76602F4964e2426A74236b48894e0715o215E3612J80437a80793a2540C03491
11669c2886A2371c7085A09161k1148g6061P749B32542a43019A12290h0029J7855
11658f2174D25039m9765E2690a62667e9329B7201L24145c5816A11572d317A56104
11646E1655O4042K243a17424r334c787B76454A20452K5644N0622a47573A58777
$$ y = [-83118, 63002, -129689, -15354, 288042, -164059, -109677, 491978, -107229, -267146, -260921, -90086, -166756, -36601, 70608, -53858, -114198, -87791, -89128, -53634, 109682, 94189, -193572, -279490, 153712, -398706, -245519, -183161, -229959, 148027, -118493, 321436, 55457, 53124, 173374, -174761, -144191, -184469, 359668, -253065, 123057, -17608, 360754, 175160, 176602, 64964, -52426, 174236, -248894, -50715, -56930, 53612, 234049, -180793, -12540, 303491, -32886, 12371, -37085, 109161, 88013, -76061, -68312, 232542, -143019, 112290, -80029, -62174, 425039, 375274, 52690, -162667, -59329, 27201, 351346, -35816, 111572, -4317, 156104, 51655, 115697, 117940, -117424, -126758, -3787, 276454, 120452, 146096, 196718, -147573, 158777]
11634f9212B16586H7941b18960j57340i1006A0786K53878I8686d2504q3555A72465
11622a89869D1363L8675g8662j7572C6086a06977B26615b8229j32787I0575l0838
11611E9737b35028P5895a9725k98986J43783f0113A57789b47254A71289a7258
11600A17807a95333B80123a13463C648K82453b11064G4762b7206j46212j8417
11590a91835M0359B62550a31390B65587j25473J47010B5918d6861I1116a54793
11579B01709k186E5862K04170A25341k6420C2219J52609d17937a54019a5181A28854
11567C91548a02967A609L8029J50860k46g6228k08255M3227B01743L25027e0610
11555g4004C16154k0418b13072C26988b87725B5723J00672C4190J53853J54211
$$ y = [-69212, 216586, 87941, -218960, -376300, -91006, 10786, 264664, 98686, -42504, -126059, 172465, -189869, 41363, 80038, -78662, -96234, 36086, -106977, 226615, -28229, -161016, 90575, 59737, -235028, -159133, -19725, -318711, -174928, -60113, 157789, -247254, 171289, -17258, 117807, -195333, 280123, -113463, 3648, 286101, -211064, 74762, -27206, -173418, -191835, -151476, 262550, -131390, 265587, 140114, 287124, 25918, -46861, 91116, -154793, 201709, 199523, 55862, 260032, 125341, 98921, 32219, 184828, -417937, -154019, -15181, 128854, 391548, -102967, 1609, 39638, 190498, 190252, -76228, -284483, -241256, 201743, 526770, -50610, -74004, 316154, 295736, -213072, 326988, -287725, 25723, 126395, 34190, 188043, 342254]
11545C42254I0446a06280B07014c899A44353D84K34525j15506E2864b34992N7110
11534a77882B00889I663i506F4205a7657A72515g1844I015a83347B9547J19915
11523A49462L6652E2900b2987C62797A00126R9194P8309A30771a71787B93172
11512C3730J51532A3550a08755A16843a97333R6731b6215m1595A09253j260B3295
11500B11913K2803a43421D39636A42232b86489B7321a17490B34675a22746B7625
11489A44861m7595b0657C26795A05849n0092Q9178b46133I3764P0761b4835E0945
11477b60729A69878q0472J54972A17744E766K1305L55136j46390l8928J80969
11467C77858I2680O8566L24446j98035k4362j31311a37302j02524A28702K14654
$$ y = [342254, 90446, -106280, 207014, -3899, 144353, 484, 235009, 119503, 52864, -234992, -177882, 200889, 9663, -9506, 64205, -17657, 172515, -71844, 9015, -183347, 29547, 149462, 186114, 52900, -22987, 362797, 100126, 199320, 277629, 130771, -171787, 293172, 33730, 185262, 13550, -108755, 116843, -197333, -100602, -26215, -67810, 109253, 107993, 23295, 211913, 234716, -143421, 439636, 142232, -286489, 27321, -117490, 234675, -122746, 27625, 144861, 97266, -20657, 326795, 105849, 55757, 144935, -246133, 93764, 164525, -24835, 50945, -260729, 169878, 89406, 244378, 117744, 5766, 27071, 382207, 235817, 196889, 377858, 92680, 161246, 485692, 287657, 263295, 131984, -137302, -239826, 128702, 343356]
11457C43356P147A33952a35603C04418A9375K23288p1003E3104J58077I0031M36232
11446E26263k61155o6069J57382O5690a60674B71757j2903j18435K00858F0666
11435B72862k1711a6493B56985A8891b7677j14622B80311I5714C7400R0271J46464
11424B74135O8794B2438J08466g6073b2586C0101J30003A8019K35234r1631g4501
11412B19785C391N79558I9216J36302a25005j1739I5201g5852G4883K58945o8022
11401B65806a92943l01257e5178n7950M5775k35292B3446K38a25213m4993f8416
11389i8221A19616J70234A15005g3431j62586a9911C2530a63683H7191b9918E4680
11377A58428L3432J71254A08833a5694j60163Q2655D2369g923B16760a90682I1574
$$ y = [343356, 350503, 133952, -135603, 304418, 19375, 242663, 171660, 53104, 211181, 90031, 526263, 265108, 199039, 356421, 422111, -160674, 271757, 258854, 140419, 341277, 60666, 272862, 251151, -16493, 256985, 18891, -27677, -142299, 280311, 95714, 37400, 127671, 274135, 342929, 22438, 130904, -76073, -22586, 30101, 160104, 18019, 253253, 161622, -74501, 219785, 3391, 582949, 99216, 235518, -125005, -136744, 95201, -75852, 74883, 333828, 265806, -192943, -494200, -55178, -113128, -67353, -302645, 23446, 23684, -125213, -170206, -68416, -98221, 119616, 289850, 115005, -73431, -236017, -19911, 32530, -163683, 87191, -29918, 54680, 158428, 191860, 363114, 108833, -15694, -175857, -93202, 42369, -7923, 216760, -190682, 91574]
11365i421r0059J6740m07768A39079D0177b5930B29997a50368B9930i3744D25139
11353A60586a55688B2558E194K45428C9700P0362a7704A58102b15476b469G6010
11341e613k72325A80715H4829K05398A4397N2862b86628B40660F8544a26445B068
11329c18737B52862i4949A58789b9044k67111c9755A53055E6194D01a53288H2042
11317a60493d6867j75824a00871F3396E468b72729F4413b11558i8720j83544D16063
11305e931B94581b37425A79920M1776a14021j76599D3523c02887a4225A07280
11294A47858b21973p4336b8182j41183B2389J75853b07660e5007p2287d5558q4831
11283a30389e2049j77448E3294N9991E4782i7999n2207b5107n2527k5407j1225
$$ y = [-9421, -99480, -82740, -490508, 139079, 40177, -25930, 229997, -150368, 29930, -93744, 425139, 160586, -155688, 22558, 5194, 250622, 39700, 110062, -17704, 158102, -215476, -2469, 76010, -5613, -277938, 180715, 84829, 290227, 14397, 67259, -286628, 240660, 68544, -126445, 2068, -318737, 252862, -94949, 158789, -29044, -296155, -39755, 153055, 56194, 401, -153288, 82042, -160493, -46867, -222691, -100871, 63396, 5468, -272729, 64413, -211558, -98720, -282264, 416063, -5931, 294581, -237425, 179920, 221696, -114021, -290620, 43523, -302887, -14225, 107280, 147858, -221973, -296309, -28182, -169365, 22389, 198242, -207660, -55007, -127294, -45558, -130389, -52049, -229497, 53294, 113285, 54782, -97999, -150206, -25107, -77634, -103041, -114266]
11272a14266B29411a08685j95926i749k98530J20749A07739O0862h9225l58690
11262d47915a54169A12452L0091L077A1654a53412D6980a13389K2764B0101Q9836
11251A09937a09144k91856a22014R713k0627j06171A5483J87747a87196b396j73041
11240a75437E2802a33632k36115f7468l876a9933C4903a70494N6021N0918j09947
11229a73502J2890b4355C5214O4509K4288c65840c1086a2222j61947e9207j4411
11218g3618E185b74177J04360p2703g1668J7977I0967K46326A48895b1979r6084
11207a18063F961K26209a22060l1542A41389a4180j1596j12348f7995k0486c3634
11195D3632c37253e7654l01062A00546q791b23405A31384c3830A30422b4756k37730
$$ y = [-114266, 229411, -108685, -304611, -9749, -308279, -187530, 107739, 168601, -89225, -447915, -154169, 112452, 142543, 145620, 11654, -153412, 46980, -113389, -90625, 20101, 109937, -109144, -401000, -122014, -112301, -132928, -239099, 15483, 203230, -187196, -2396, -175437, 52802, -133632, -369747, -67468, -71344, -19933, 34903, -170494, -114473, -63555, -173502, -160612, -24355, 35214, 99723, 124011, -365840, -31086, -12222, -174169, -59207, -73618, 5185, -274177, -169817, -242520, -71668, -53691, 90967, 337293, 148895, -21979, -118063, 6961, 233170, -122060, -153602, 141389, -14180, -25776, -138124, -67995, -88481, -33634, 43632, -337253, -57654, -358716, 100546, 91755, -223405, 131384, -33830, 130422, -24756, -262486]
11184b62486K3841c2459k1382p1112C5770b60839m2718h1635m97154B39501A08153
11172h4137r8401r6541a37133r7159m71O5060k52j02990N0239N0633n5219d9067
11159f000m5516i926E3544K24431G2770J17201b38922N890C1444O0955b70812
11147b38871A66931b11355r504k9463I06a19836n1138D6729a4492j32640g794
11135b39884A43693a31092B86529b1517a0356o8820r1046c4169A3241J0330e5122
11123A71511P6263b56403A57308a02546A95605J6934G7796c14965a0766A26062
11112a6096C99483L6495A03760a7667B64547a32374j67018A50110d4215b0700
11101A63207J1753P0685K33467a52323A91803K8018D6805a19068r2225E4599K79520
$$ y = [-262486, -238645, -32459, -53841, -124953, 35770, -260839, -303557, -81635, -578789, 239501, 108153, -84137, -182538, -279079, -137133, -234292, -234763, -169703, -169955, -272945, -222706, -172073, -227292, -49067, -6000, -51516, -9926, 53544, 277975, 72770, 189971, -238922, -233032, 31444, 92399, -270812, -238871, 166931, -211355, -220859, -250322, 906, -119836, -170974, 46729, -14492, -147132, -7794, -239884, 143693, -131092, 286529, -21517, -10356, -79176, -170222, -34169, 13241, 23571, -55122, 171511, 247774, -256403, 157308, -102546, 195605, 212539, 77796, -314965, -10766, 126062, -16096, 399483, 435978, 103760, -17667, 264547, -132374, -299392, 150110, -44215, -20700, 163207, 174960, 245645, 479112, -152323, 191803, 219821, 46805, -119068, -211293, 54599, 334119]
11090C34119q5743E7229A8228M05376k03336L3383f3971A94641M24921E2667P3290
11079A25957J0155K90335a8638D8429J36408d3821B16287b19987A3438L39389
11069C52827h1512E4604L64083A76662L6560L09399A26694K49403r3861O4620
11059C46856J37977J4221j20171K25251B87407k0811J41246K14582P1953M4474
11049G38851C50556j22546K74544k8679O1570j23281J97809q1816J17641C08524
11038F54097j07272N3143J54469L14538j23268j91849n8441J97100p9852L47372
11028A160037L04157l17833j38533r7876L04800l2618q0604l44662K94480N2789
11018A104137M1353j31326L35988E87510M06074r3567j33770K21695j31326R5120
$$ y = [334119, 248376, 57229, 18228, 423604, 220268, 253651, -63971, 194641, 619562, 52667, 125957, 136112, 426447, -18638, 48429, 184837, -43821, 216287, -219987, 13438, 352827, -81512, 54604, 418687, 176662, 213222, 522621, 126694, 376097, 282236, 346856, 484833, 499054, 378883, 604134, 287407, 266596, 407842, 622424, 694377, 738851, 350556, 228010, 502554, 473875, 535445, 412164, 609973, 528157, 645798, 308524, 654097, 546825, 599968, 754437, 1068975, 945707, 753858, 695417, 892517, 812665, 1160037, 1464194, 1146361, 1007828, 909952, 1214752, 1182134, 1101530, 756868, 1051348, 1104137, 1145490, 1014164, 1350152, 587510, 993584, 900017, 766247, 987942, 856616, 951736]
11008I51736j88379J02911j43517L08775J95979l29746J10249j57754k20505l1909
10998E97840L72352l9173q227j04167M8956J06448l46399K2715J49334K46155
10988A045834j98140j05917Q6999j72733m7271K32508O1109q3431L8787m502Q6397
10977I39640D31197N02757Q5062m45232L32948k61985l8452K25341j29688K56045
10967I57993O3872O3290J29550r4350j40653L41612q5270J81865O799K40225J19432
10956A784365K56177L3826K32354J72283P20149N5873j81009Q6598k29176M04528
10946C335968o073n85557j47769k83487m40462L4671K92193j71413k90483L19615
10936B057203j43474m00132J55515j48566k66697m45535K66026l75858j24801
$$ y = [951736, 763357, 866268, 722751, 1031526, 1227505, 897759, 1008008, 850254, 629749, 597840, 970192, 931019, 922792, 818625, 867581, 974029, 627630, 650345, 799679, 1045834, 847694, 741777, 828776, 656043, 608772, 841280, 902389, 818958, 857745, 853243, 939640, 431197, 933954, 1019016, 573784, 906732, 644747, 606295, 831636, 701948, 957993, 1021865, 1085155, 1214705, 1120355, 979702, 1321314, 1236044, 1417909, 1424708, 1664933, 1784365, 2040542, 2074368, 2306722, 2479005, 3199154, 3255027, 3074018, 3160616, 2931440, 3335968, 3329895, 2744338, 2596569, 2313082, 1872620, 1907291, 2199484, 2028071, 1737588, 2057203, 1913729, 1513597, 1669112, 1520546, 1253849, 808314, 1074340, 698482, 573681]
10927E73681j69189O5808L44736I5064O9031N4546O384J73885A90962N1554A2408
10915C96482A10877N34474A89233M4244K3666o192A08750P1454k2898E3599J41017
10904A94616o544a50132D5754b08576B14530g3184l15134E7591b65551B3013Q2262
10893A05275a8267l3662H7431b06244D4515j6267N3300g6338J917B83055A26825
10881B13612C4652J12176N3213a84220a7588k56659c1382j46143c0624n7883G1456
10869a34943n0920j5785B8095M0719R9354a78993I364K2726J53406B2414b07077
10857c00320r835A3477K74610E5801c27415g7894B01179g0542B18477E6029a03412
10845c77204e952k21919l12833i7075E3204M0589m3651J86298c6386A57874G5595
$$ y = [573681, 404492, 470300, 815036, 95064, 164095, 218641, 225025, 398910, 190962, 242516, 12408, 396482, 110877, 645351, 189233, 233477, 257143, 250951, 108750, 180204, 157306, 53599, 194616, 188072, -150132, 45754, -208576, 214530, -73184, -388318, 57591, -265551, 23013, 105275, -18267, -51929, 87431, -206244, 44515, 28248, 81548, -76338, -74421, 283055, 126825, 213612, 34652, 146828, 200041, -184220, -17588, -274247, -31382, -177525, -30624, -88507, 71456, -134943, -185863, -201648, 28095, 68814, 168168, -178993, 9364, 32090, 185496, 22414, -207077, -300320, -310155, 13477, 288087, 55801, -327415, -77894, 201179, -70542, 218477, 56029, -103412, -377204, -5952, -227871, -540704, -97075, 53204, 93793, 50142, 236440, -36386, 157874, 75595]
10833f34D0995J03279m8155C8092C376c88454h5204l3422A19419a79065e7824
10821A52111b28181b4370A12891a05565A83642d3701D6274Q8029b75818B82385
10810a69025e4528A19485a90236N3851A74354a03704B5242a55619k04087b840
10799B26314C3289a16799I5436a67039c6323I2913c01240B48397C3776c08694
10788c22030B5190g9084A45453b86017F474d0760B3623b61946L7783a08642L5637
10777g3005B7869J08636O1314a4669q1464o0964n1331i0544L3592k67850B13587
10765i5701j65162A55720J74015F282c46585a43043k30317a57190d0676C75346
10754d448j05806N4972o9919K9560A67315a93342D6005m44a66666j06056g4664
$$ y = [-634, 40995, 144274, 96119, 38092, 3376, -388454, -85204, -118626, 119419, -179065, -57824, 152111, -228181, -24370, 112891, -105565, 183642, -43701, 46274, 134303, -275818, 282385, -169025, -54528, 119485, -190236, -136385, 174354, -103704, 25242, -155619, -359706, -2840, 226314, 33289, -116799, 95436, -167039, -36323, 92913, -301240, 248397, 33776, -308694, -322030, 25190, -79084, 145453, -286017, 6474, -40760, 23623, -261946, -224163, -108642, -73005, 27869, 136505, 197819, -14669, -96133, -157097, -208428, -90544, -56952, -324802, 213587, -95701, -260863, 155720, 329735, 6282, -346585, -143043, -373360, -157190, -40676, 375346, -4448, -110254, -55282, -125201, -95641, 167315, -193342, 46005, 45561, -166666, -272722, -74664]
10742B25378a28148r7635f1958j91974M7288i7715j08290d1670o0510I6674K77204
10731C73878A39848B6453K22414b41453a4248A18609a28062B29573b09627h0033
10720a73496A75062a7287A16262A4170b67052Q7726r1915a01584c366C42773b06499
10708A14076D2063b44049Q3017A08224c3911E7646e5998H2398M6803c02983F5012
10696a41754B32446a54783d851j32271A42499a84721A83452c07999B34373L16296
10686E50669a63753b7959j80031B14306G9551B9771d44663a134o0887k95053C7307
10674a20879e4569j96627A37966o6363K0260M1055M3678b2003A15363L4844b24724
10662A78827a12244n8598o656N1529j61512i5119r87k60346F2164Q4081b66876
$$ y = [225378, -128148, -225783, -61958, -253932, -206644, -97715, -206005, -41670, -102180, 96674, 373878, 139848, 26453, 248867, -241453, -14248, 118609, -128062, 229573, -209627, -80033, -173496, 175062, -17287, 116262, 14170, -267052, -179326, -271241, -101584, -3366, 342773, -206499, 114076, 42063, -244049, -161032, 108224, -33911, 57646, -55998, 82398, 129201, -302983, 65012, -141754, 232446, -154783, -4851, -137122, 142499, -184721, 183452, -307999, 234373, 550669, -163753, -27959, -207990, 214306, 79551, 29771, -444663, -1134, -62021, -357074, 37307, -120879, -54569, -251196, 137966, 71603, 91863, 132918, 176596, -22003, 115363, 150207, -224724, 178827, -112244, -170842, -177498, -125969, -287481, -95119, -96106, -356452, 62164, 146245, -266876]
10650a85700G9384N7774j9957c6943j77576P4206j03363C45464a1949C26606d9532
10638a42933N6854j22442D4691b6481l331k06329R7306j66790A7442a89247A9885
10626i1515k20715J35417H392h8633L1356k78594R2575a15224b6410C30720b22168
10614g1012A08677h8259J7889J0959B38867P2483a61446A6413a59653H3102i080
10602a48112a9854k54562d7765j99661B71177a93889e6765B20875a33058N3184
10592g9874j93096a4574o7625C6448a26758A02222a3427l05383B22008c5338j77187
10581b12525e2375C04898a56691M6651n9439j25485D888a60982B37391p6429a48548
10569B86729b46454j46579J62277c2988r831a7745A7901K09599a9101j60563L074
$$ y = [-185700, 79384, 137158, 117201, -36943, -214519, -140313, -243676, 345464, -11949, 326606, -49532, -142933, -86079, -208521, 44691, -26481, -29812, -236141, -138835, -305625, 17442, -189247, 19885, -91515, -312230, -176813, 8392, -88633, -57277, -335871, -243296, -115224, -26410, 330720, -222168, -71012, 108677, -88259, -70370, -59411, 238867, 311350, -161446, 16413, -159653, 83102, -9080, -148112, -19854, -274416, -47765, -247426, 271177, -193889, -56765, 220875, -133058, -79874, -272970, -14574, -82199, 36448, -126758, 102222, -13427, -318810, 222008, -35338, -212525, -52375, 304898, -156691, -110040, -169479, -294964, 4888, -160982, 237391, 160962, -148548, 286729, -246454, -393033, -230756, -32988, -42819, -17745, 17901, 227500, -19101, -179664, -176590]
10558a76590g0322k03494g1893l19435H320a86027q0080a6419A25488b0125k6277
10547d6402E1300e63824A04481b46660P1622o9013B53117j09234c0529B2767R5230
10536A17997a80312D2546j9658b70244F2684b30291h0047A96367o5063P5363a34245
10524B7735R3361C8664q732J15172a17320A01035D7955f0494J1535k41562l7920
10513c28441C6651B500K19689H3701b15768e7309A63948f3350A04002b13666b094
10501A43483d03744a66070j86439J60783d6716k50951J42567c0542k51975E4498
10490A52409A7545b94854B42858b77668o7778j86471H5949b45227a2778A04185
10479d1095j31039d0722C2662c04385a8468H7476J05330a87679k02935B95958
$$ y = [-176590, -70322, -273816, -71893, -391328, 8320, -186027, -266107, -16419, 125488, -20125, -46402, 51300, -563824, 104481, -246660, -175038, -244051, 253117, 143883, -30529, 22767, 117997, -180312, 42546, 22888, -270244, 62684, -230291, -80047, 196367, 131304, 206667, -134245, 27735, 121096, 38664, 29932, 145104, -117320, 101035, 47955, -60494, -48959, -290521, -328441, 36651, 2500, 222189, 83701, -215768, -57309, 163948, -63350, 104002, -213666, -2094, 143483, -403744, -166070, -352509, -191726, -46716, -297667, -155100, -30542, -282517, 54498, 152409, 17545, -294854, 242858, -277668, -345446, -531917, 85949, -245227, -12778, 104185, -41095, -172134, -40722, 32662, -304385, -18468, 87476, 192806, -187679, -390614, 295958]
10468e3779A9222L6339G80b45096R0426B28423c65408B31368G5813N0274P4880
10457B00967J57501A19133R8637K5480B327J65228a87546N6039b2561j92030k40619
10446d55210e9093I9218b4453j27976B56523K6759h1123q0946c696R90j47459
10435a50165E5393e27857B12626b83484d3286A10957a47436d154q201C07235d1097
10423a04126l9845A64976B5298b39641H4589a67263o0244A54105q746f5012b8026
10411F1808k6667i4571B5309a192k02617m6367a8976k47259C21634a90623Q4105
10400a06518i92l31623H9379a05165D4128e1739A51928G4924h3031B86523a3976
10388A37924a49666A8597m627O3243c9330A5737f3234j1868I7479o558c4057H4283
$$ y = [-53779, 19222, 55561, 780, -245096, -154670, 228423, -365408, 231368, 75813, 126087, 200967, 358468, 119133, 217770, 243250, 2327, 167555, -187546, -131507, -22561, -214591, -455210, -59093, 99218, -24453, -152429, 256523, 283282, -81123, -162069, -3696, -2706, -150165, 55393, -527857, 212626, -283484, -43286, 110957, -147436, -4154, -12355, 307235, -41097, -104126, -143971, 164976, 25298, -239641, 84589, -167263, -227507, 154105, 145359, -65012, -28026, 61808, 35141, -94571, 25309, -1192, -203809, -250176, -18976, -266235, 321634, -190623, -106518, -992, -332615, 89379, -105165, 44128, -51739, 151928, 74924, -83031, 286523, -13976, 137924, -149666, 18597, 13970, 77213, -39330, 15737, -63234, -75102, 97479, 90921, -34057, 84283]
10375e8969C3035a07951A77387e2295C20816m6747A21772K02114J9581p8877d97661
10363B13056J94303A6935a03702l8794E35347k00940J00165n6711k8088j17206
10353B32567L76448j53190A81595J93046K7858O6004M53983C62445K50720o9652
10343E43513P8023l1238j90914j44916O2548M1937M9311A56879J45616O5773J33998
10332E02266B05455N91722C56247K43493A08661M86546o7537k24436D8357P707
10322E6064K23304c8538A95815K38057a34355A50494O35830l60639j02670A47761
10311H9109P0046J89467c6296D50298a39895A35871F5978a71177B92614j20218
10301A72396a10486C71195D2019L07734j09152A14612q250K53814j08070J7292
$$ y = [-58969, 33035, -107951, 177387, -52295, 320816, 274069, 121772, 323886, 343467, 264590, -497661, 213056, 407359, 16935, -103702, -142496, 535347, 334407, 434572, 377861, 349773, 232567, 609015, 455825, 181595, 374641, 402499, 468503, 922486, 362445, 613165, 543513, 621536, 590298, 399384, 254468, 317016, 358953, 408264, 156879, 302495, 368268, 502266, 205455, 797177, 356247, 599740, 108661, 595207, 527670, 303234, 48357, 56064, 279368, -38538, 195815, 433872, -134355, 150494, 786324, 425685, 323015, 147761, 89109, 159155, 348622, -36296, 450298, -139895, 135871, 65978, -171177, 292614, 172396, -110486, 371195, 42019, 349753, 240601, 114612, 106362, 360176, 252106, 269398]
10291B69398K5880i035j76893d4436A35266a59200P631p6339L9879q0171A3505
10279B98729c34287A54158f484B1497J01967A9367K19332A05803l0649g8767c5482
10267A31586A6805K77372q6501a14578d4955o703l2594C69250E692J36096b38877
10255b0619j07909c3536A4757a63047D44869a85487A38105C1353K7687b37692
10244C4139A3394J10264O4767f5395A31797J15259J22036j75288D7206L78899
10234D26105C4333J65382K78904b6169G2667J22880b1327A66703J21064a69781
10223a19306C6649J74717J12045g5974A7197a58285A38194n8470a75917P2551
10213a03366q5137n7684E6114e1045I2130b9033k04971A36964b3449r3647A09681
$$ y = [269398, 295278, -9035, -185928, -44436, 135266, -159200, -151569, -227908, -188029, -268200, 13505, 298729, -334287, 154158, -6484, 21497, 123464, 19367, 238699, 105803, 75154, -78767, -35482, 131586, 16805, 294177, 207676, -114578, -44955, -51658, -84252, 369250, 5692, 141788, -238877, -20619, -128528, -33536, 14757, -163047, 444869, -185487, 138105, 31353, 59040, -237692, 34139, 13394, 123658, 188425, -65395, 131797, 247056, 369092, 193804, 47206, 426105, 34333, 199715, 478619, -26169, 72667, 195547, -21327, 166703, 287767, -169781, -119306, 36649, 211366, 323411, -75974, 17197, -158285, 138194, 79724, -175917, -103366, -188503, -246187, 56114, -51045, 92130, -29033, -234004, 136964, -23449, -117096, 109681]
10201a13993c562r8513o004M793O387j28390h8707l4708A04990b36097j83962
10190d20059J89005J2670b0724j04422C7514a01931A51890c00845D8337c20666
10179f3970a7011j01463M8299m3155A47930i0916j59560h0420j69659R7351C3381
10167A9658R7838k2912Q9252b05085C752b79080A12396K6899b2978A10592b90706
10155b4254a1635C35537d8868k02193M7205d9904r2968c6268B2594a37474A77074
10143d4021l8915j23728j42703B23658d2150j33572P1012A87540K5949c03587
10132B34068e7501r2692A61997a58924P1313k20062I3035c15412a14733A89389
10121h7765o6091f22l37019a64429P2325k75301A9849g3587A0863b98366A05906
$$ y = [-113993, -3562, -102075, -108079, -103286, -96899, -225289, -88707, -123415, 104990, -236097, -420059, -231054, -218384, -20724, -125146, 37514, -101931, 151890, -300845, 48337, -320666, -63970, -17011, -118474, -70175, -113330, 147930, -90916, -250476, -80420, -250079, -152728, 33381, 19658, 117496, 94584, 183836, -205085, 3752, -279080, 112396, 139295, -22978, 110592, -290706, -24254, -11635, 335537, -48868, -251061, -203856, -49904, -142872, -36268, 22594, -137474, 177074, -44021, -82936, -206664, -349367, 223658, -42150, -175722, -104710, 187540, 213489, -303587, 234068, -57501, -150193, 161997, -158924, -87611, -307673, 93035, -315412, -114733, 189389, -87765, -153856, -622, -337641, -164429, -92104, -367405, 19849, -73587, 10863, -298366, 105906]
10109C1957b35400i7205A47007a64918m4372B00121B6979N5946a15165A39024
10098c07673Q347A34003a97856a7195l17201R436R6237g9051j00104M3698J0413
10087a25044a2636D30720d2162n409l35368d2575I4220a7166g501j56422K7248
10076a36675B1717b17725K1941J3698e018i9E74496a94648q2038A4271Q2693a14711
10063c14693P8303L2187A81221c22828d2551k6374l23117a04335a5748B81753
10052A26790a818D6458g4567k6347l22307A60315J53520a91454h8710b8262j35330
10041a63592L2749G6618a91743a2754o7811j59386A39600a71934A29500m0972
10031H8528C5831J8622c74248B8731b13709K3767l16993F059b91583B22414a51381
$$ y = [31957, -235400, -97205, 147007, -164918, -209290, 200121, 26979, 82925, -115165, 139024, -307673, -299326, 134003, -197856, -17195, -334396, -324960, -228723, -79051, -179155, -135457, -125044, -12636, 430720, -42162, -47571, -382939, -42575, 94220, -17166, -7501, -163923, -136675, 21717, -217725, -195784, -182086, -5018, -99, 574496, -194648, -276686, 14271, 96964, -114711, -314693, -236390, -204203, 181221, -322828, -42551, -68925, -392042, -104335, -15748, 281753, 126790, -1818, 46458, -74567, -100914, -423221, 160315, 313835, -191454, -88710, -28262, -163592, -130843, 76618, -191743, -12754, -80565, -239951, 139600, -171934, 129500, 88528, 35831, 54453, -374248, 28731, -213709, -189942, -506935, 6059, -291583, 222414, -151381]
10019b54367M4873a2114C8357J52290r432E3998f7058C6533a15096a932j99582
10008b01514F6338a06190L4662r4454J2131H9222d24381B0841a49563B9652b28823
9996H855b11683h5169m9440a0548m9254q1588j25552J26646D4445e9452j76433
9985b35885B19692L3109A8200c33483b6696A69469a42367O2459A45936a85420
9974a85949p5699O15J12805H1247l8813a19221A7526b58847d3381H9805K8315
9963A18120i5500k40483c4030J5409A14087f0828J4305E5614b03291J01214K6214
9952g5863B04021g3343L1437q4342d6739J5311A04930J3007d4786k61506d3459
9940H9601a99259J5279j09568i3708k9836k22801M3062g3400K5993j41624j79782
$$ y = [-254367, -209494, -12114, 38357, 190647, 181215, 53998, -67058, 36533, -115096, -1932, -201514, 66338, -106190, -71528, -165982, -153851, 89222, -424381, 20841, -149563, 29652, -228823, 8855, -211683, -85169, -134609, -10548, -59802, -141390, -266942, -140296, 44445, -59452, -235885, 219692, 252801, 18200, -333483, -26696, 169469, -142367, -79908, 145936, -185420, -185949, -261648, -261033, -148228, 81247, 42434, -119221, 17526, -258847, -43381, 89805, 118120, -95500, -335983, -34030, -18621, 114087, -60828, -46523, 55614, -203291, -102077, -75863, 204021, -73343, -41906, -126248, -46739, -31428, 104930, 117937, -44786, -306292, -43459, 89601, -199259, -183980, -293548, -93708, -123544, -346345, -303283, -73400, -47407, -189031, -368813]
9929c68813A19464E4685d354B3102p05a26010A31257f3323D460P9319j1104J8863
9917I1538J38235h0158l7168j05072K1658Q3886n7984c6795n3863k9700j36716
9906b57074j11839j9787B09512q7264B0338a14690K753k49126J19801O8378C17334
9894A70872b21670l060J04785k33590a9453j01274E7684a21996B63587b6389E57
9882B7835R4158l0604h9758c0937A83373a5351D0108Q7945R3222b6652k11930
9871b38582d806D5705R077a92734Q4686G0346c30915A1249a20347J9319j84493
9860b85521J08340H0145a45509I0026c05122B6141R2303R6352b2580k45624H809
9848G6307c46455j7816C46813a73881C2730a42452J7890o2543L8193J3184O5852
$$ y = [-368813, 119464, 54685, -4354, 23102, 22397, -126010, 131257, -63323, 4460, 83779, 72675, 91538, 229773, -80158, -117326, -222398, -200740, -116854, -174838, -36795, -90658, -120358, -257074, -368913, -388700, 209512, 122248, 20338, -114690, -111937, -361063, -241262, -172884, 317334, 170872, -221670, -224730, -119945, -353535, -19453, -120727, 57684, -121996, 263587, -26389, 557, 27835, 121993, 91389, -89758, -30937, 183373, -15351, 40108, 128053, 221275, -26652, -238582, -4806, 45705, 54782, -192734, -108048, 70346, -330915, 11249, -120347, -101028, -285521, -177181, 80145, -145509, 90026, -305122, 26141, 118444, 214796, -22580, -268204, 8809, 76307, -346455, -364271, 346813, -173881, 32730, -142452, -124562, -187105, -148912, -135728, -69876]
9837f9876j1862m0668L0377O773H0019f1087D5084b44222a00612J2328B44760
9825a4155A5972b85777h1330B15894k6542H8849b47731a20000k1461j71925A77322
9813a06850H4318a20683G9685a9800k18396o5582O7136C14587I3885a1820j01910
9802a13730E5911a01761j64651J21962l2829k4415C2741c11547C52806a82686
9791c6835l2058A11535c73736h2973m4013l3116P0908m9307K2082j62329n9559
9780c38307J50189A54281f0748k5331k2522B61347n5564G441Q317a57082c0867
9768a94556i6559o1242k1072j74655E1422a8838j67599E0065e7494B53857e32961
9756C51951a6498D97963B17399c15742A02979b24522a05768M8544j26732l19495
$$ y = [-69876, -81738, -122406, -92029, -85256, 80019, -61087, 45084, -244222, -100612, -88284, 244760, -14155, 15972, -285777, -81330, 215894, 189352, 88849, -247731, -120000, -141461, -313386, 177322, -106850, 84318, -120683, 79685, -19800, -238196, -303778, -236642, 314587, 93885, -11820, -113730, 55911, -101761, -266412, -144450, -177279, -201694, 32741, -311547, 352806, -182686, -36835, -68893, 111535, -373736, -82973, -126986, -160102, -89194, -138501, -116419, -278748, -338307, -188118, 154281, -60748, -86079, -108601, 261347, 205783, 7441, 15758, -157082, -30867, -194556, -96559, -157801, -178873, -353528, 51422, -18838, -186437, 50065, -57494, 253857, -532961, 351951, -16498, 497963, 217399, -315742, 102979, -224522, -105768, -57224, -183956, -503451]
9746e03451a92225K5926A25133b36714B1353Q3125k7797H131P7237d0797j12955
9735a53752O4778B22590a77864l2142A31044a01898l8877E1613c0200j38008j87104
9724c55312a15789f979k9476R684j22668p8260j04679f4023j37238h326j83773
9713a92099J0375p2084A02202b87798J40288o9782g091k51393j50303J04546P3289
9702b30952q500J8091d9745A1618J08712a960k24527m8638h1042j69404p774g5568
9689i8037D8456R8025a93202K2965k13773i6428B4588K1362a99797M2321A8771
9677c5559J3792j84686N8559r2191C837b65853B2707a30194d7828K1215k325F1864
9664c43776g7738a6117j19735f5699a8832A06999a2257l12466B07270d963j32015
$$ y = [-503451, -192225, -166299, 125133, -236714, 21353, 104478, 76681, 8131, 85368, -40797, -153752, -88974, 222590, -177864, -210006, 131044, -101898, -140775, 51613, -30200, -168208, -355312, -115789, -6979, -36455, -26771, -149439, -227699, -332378, -64023, -201261, -8326, -192099, -181724, -253808, 102202, -287798, -147510, -217292, -7091, -258484, -408787, -304241, -230952, -239452, -221361, -49745, 11618, 120330, -1960, -226487, -275125, -81042, -250446, -258220, -75568, -98037, 48456, 146481, -193202, -170237, -384010, -96428, 24588, 45950, -199797, -157476, 18771, -35559, -21767, -206453, -147894, -240085, 3837, -265853, 22707, -130194, -47828, -26613, -28938, 61864, -343776, -77738, -16117, -135852, -65699, -18832, 106999, -12257, -324723, 207270, -4963, -136978]
9653a36978L5798j35156G7626d61205h916H2446o279f636j35328A33372a22553
9641b43643B25407d371l82043A07982a22605A05881b78221A05429e8750l37354
9631c96104d2933p6915m51845A17787e4230J8294A51476a59451A2614a80497N0379
9620a30118A72782f7235N486l4938I8568a05708J5603K7130I6061h6272j11172
9609a97444d2665k0460j90894d527B7332c60946d5073b2399C5316e2916a1349
9597E0342b18063k57847a56264C42499c14160J12995k7970A7886K13253a07583
9586D5499c20545H2467N6489k7851M6070n5772c3405C6787a48j61474O5339n1271
9574a47554b3215j65781P8834j09439R8218A39143J46162b48434j05219F8573
$$ y = [-136978, -101180, -236336, 77626, -461205, -8916, 82446, 76167, -6636, -141964, 133372, -122553, -243643, 225407, -4371, -386414, 107982, -122605, 105881, -278221, 105429, -58750, -396104, -42933, -119848, -571693, 117787, -54230, -35936, 151476, -159451, 12614, -180497, -130118, 172782, -67235, -61749, -96687, 98568, -105708, -90105, -62975, 96061, -86272, -197444, -42665, -63125, -254019, -4527, 27332, -360946, -45073, -22399, 35316, -52916, -11349, 50342, -218063, -475910, -156264, 342499, -314160, -201165, -229135, 17886, 231139, -107583, 45499, -320545, 82467, 138956, 111105, 157175, 101403, -33405, 36787, -148, -161622, -96283, -147554, -23215, -188996, -110162, -219601, -121383, 139143, 285305, -248434, -353653, 68573]
9563a22672j31176R0207g035b630p2760G753P169a32409b0167D9599R4135a28542
9550c05573I6025c49482h3841k735F9851m322a40496e6005q7203j6478j98693
9539c58379J01036g8634C2338a52532D8173d5421m1334D00804D4005J9363d5549
9527a86507b9422D8476b57799d6868j26967k31114g3059j10437I48a10805K0979
9516h9826j00588A99807c8110B53729B2093b60766A2680i0742E5915r364a77173
9504A76785b69757A08306J82095h1001a9980E7568a22473e4998l06623a02955
9493A80783d90212b8288k3120l3271c3767j97759j18748D73419A27790O0061J617
9482A89468Q7890b5457G2780b7864A13184h7875b9069g566l73851C9188f2063
$$ y = [-122672, -253848, -163641, -7035, -2630, -75390, 7753, 14922, -132409, -20167, 49599, 143734, -128542, -305573, 96025, -349482, -83841, -86576, 69851, 65529, -140496, -56005, -143208, -159686, -358379, -257343, -78634, 32338, -152532, 48173, -45421, -86755, 400804, 44005, 63368, -45549, -186507, -29422, 48476, -257799, -46868, -173835, -404949, -73059, -183496, 948, -110805, -89826, -190414, 199807, -38110, 253729, 22093, -260766, 12680, -90742, 55915, 46551, -177173, 176785, -269757, 108306, 290401, -81001, -19980, 57568, -122473, -54998, -361621, -102955, 180783, -490212, -28288, -51408, -84679, -33767, -231526, -350274, 473419, 127790, 187851, 189468, 277358, -25457, 72780, -27864, 113184, -87875, -29069, -7566, -381417, 39188, -62063]
9470I0619a46952B18644H298J51771c01859a05076A31816L0948p704p7124c63544
9458g4118k04903J5608C7419f2405b4932j59545N4534J7713b4729G9027a87683
9446h0756L4724l614C58310b6927k42000A30147f3548A10748b71490F1790a46568
9434b118k5392q4077J1861p1859j1431B7185Q8127j864C7603a94778e9040j42092
9422b01132i4856j60252a04148q3481j57006G4684M8900e0736j48189O8340A8396
9410a26034j80441C2451c35428D7769b17849A20868i682k80265A4125e6145A09232
9398H7391f7020A32528b20687O2865r1565j7072E6228b4365j21924j8858j29474
9387b94621L8706C980a57924B42833c58916d1378j13952N5708B58891b11308A30641
$$ y = [90619, -146952, 218644, 8298, 160069, -301859, -105076, 131816, 162764, 155060, 77936, -363544, -74118, -279021, -263413, 37419, -62405, -24932, -184477, -129943, -112230, -24729, 79027, -187683, -80756, -46032, -49646, 358310, -26927, -268927, 130147, -63548, 110748, -271490, 61790, -146568, -2118, -27510, -111587, -99726, -171585, -183016, 27185, 115312, 113448, 37603, -194778, -59040, -201132, -94856, -255108, -104148, -187629, -344635, 74684, 123584, -50736, -198925, -130585, 18396, -126034, -306475, 32451, -335428, 47769, -217849, 120868, -9682, -289947, 14125, -56145, 109232, 87391, -67020, 132528, -220687, -157822, -249387, -266459, 56228, -24365, -146289, -165147, -294621, -255915, 3980, -157924, 242833, -358916, -41378, -155330, -99622, 258891, -211308, 130641]
9375b39867e5231k83799F7551d66518J27931g1805o4924d5162j52076F1798b1104
9363i7127m2128O3029j02896f6517k63785B77587A35541a17867b1580k622j25640
9352a49842E1198b69460d9676D1614i1051m832K2545p9710J8482j07704a19426
9340A80822o9381b92308R7593c1661e911q2538C9693c17153L3361C23554C3786
9328d4004r1539p8929C0638b56295Q6032j8914F3999J4815A0793a457m0708j20906
9316a63071C48475B7255b54246A22714c31022J49231k0185I0074A79J94568d3237
9304a97682Q8662J5827j71858m0293I9700O3939b18061H3416a18983j41706A619
9292c22j68780j87399Q0894J31226A3854J35920J43380i9925o4375p6120j2059
$$ y = [-239867, -55231, -339030, 67551, -466518, -338587, -71805, -136729, -45162, -197238, 61798, -21104, -97127, -139255, -76226, -179122, -66517, -330302, 277587, 135541, -117867, -21580, -24202, -149842, 51198, -269460, -49676, 41614, -91051, -95883, -73338, -153048, -134566, -242270, -119426, 180822, 111441, -292308, -194715, -31661, -5911, -88449, 39693, -317153, -283792, 323554, 33786, -44004, -135543, -214472, 30638, -256295, -170263, -189177, 63999, 78814, 10793, -1457, -42165, -163071, 348475, 27255, -254246, 122714, -331022, -181791, -201976, 90074, 179, 194747, -43237, -197682, -109020, -93193, -265051, -305344, 99700, 163639, -218061, 83416, -118983, -260689, 1619, -322, -169102, -356501, -275607, -144381, 13854, 149774, 293154, -99925, -164300, -240420, -252479]
9281b52479e7985E1638a81548k2144e4793j8536E8120i4807j49802L5297L8188
9270a71124g9653j80840A15306a21820M8816j99117a10333A78668q8902a22449
9259B10818h4736n126o0019N5737J1852A50085M2016a42103E7989c88620c5018
9247a09355N3101j46590H7007A2665M9383c23153H8952b50637C52047B1751K35716
9236B57467F6186b02454I3523D0518a67882O6732k37573a5375a211l1167B16274
9224G0859L18152c27099b8667A67079b35468A49633P2775j02252b97859a10212
9213c92695C53028n8864C0695a03298B3671b09138f6531A77150M931H9937N0023
9202A39960a8881A12050b51368k03038d6719j70093o000B5999e9419A5455M5591
$$ y = [-252479, -57985, 51638, -181548, -203692, -54793, -73329, 58120, -94807, -244609, -209312, -171124, -79653, -260493, 115306, -121820, -73004, -272121, -110333, 178668, 89766, -122449, 210818, -84736, -89862, -149881, -94144, -82292, 150085, 192101, -142103, 57989, -388620, -35018, -109355, -56254, -202844, 87007, 12665, 62048, -323153, 88952, -250637, 352047, 21751, 257467, 66186, -202454, 93523, 40518, -167882, -101150, -338723, -15375, -1211, -32378, 216274, 70859, 389011, -327099, -28667, 167079, -235468, 149633, 222408, 120156, -297859, -110212, -392695, 353028, 294164, 30695, -103298, 23671, -209138, -66531, 177150, 182081, 89937, 139960, -18881, 112050, -251368, -454406, -46719, -216812, -222812, 25999, -59419, 15455, 61046]
9191F1046i8009m89662A52050f4231H7737a21051p585j6837A31236a99880C7680
9179a24297K9948A0168K7531a45932G6033f3285B94572A19944e406q444r8692
9168a12542m8661E9570b5192A4881a55186o3919O3495J239P2250B90897o3675
9157B27222p5759D4418d13l1311E6100B6290b40118B2016J81444a70326b6544
9145a80542B50701a5290A51491B7232c71931A07676C6536J41163F0610c1649r9805
9134a31454E3450d4794B30613d3666C7635L9502i3081j37315e9356m898E6628
9122a24244m6136e4672C4462c62962b0511l62981D353i8568C7029h3804j16605
9111b00409a5428E0703J53822p6847b34758g766j05244A58547D8444a10225A8344
$$ y = [61046, -98009, -587671, 152050, -64231, 87737, -121051, -128636, -145473, 131236, -199880, 37680, -124297, -94349, 10168, 37699, -145932, 76033, -63285, 294572, 119944, -5406, -13850, -112542, -161203, 59570, -25192, 14881, -155186, -219105, -155610, -154371, -82121, 290897, 227222, 151463, 44418, -413, -31724, 56100, 26290, -240118, 22016, 203460, -170326, -26544, -180542, 250701, -15290, 151491, 27232, -371931, 107676, 36536, 177699, 60610, -31649, -131454, 53450, -44794, 230613, -43666, 37635, 77137, -93081, -230396, -59356, -64254, 56628, -124244, -170380, -54672, 34462, -362962, -20511, -383492, 4353, -98568, 37029, -83804, -200409, -15428, 50703, 204525, 127678, -234758, -7766, -113010, 158547, 48444, -110225, 18344]
9099i3674j31959d4610E9606J21355B7657a01512L5399j2408c7329j61303k4261
9088b22893O5624j73846B040N0404A5230d5298j95105F1194A8174b82700c6293
9076A31248N7183d9889B45256E9976a373j91480I7579Q6373h4087K4624p6342
9065a35805j68081E5383e4111E6601b037j57218B93437c16101a27286K1K949n3483
9053a77799A51073b26804A17244a57241A32872a06468B24810c73759a08374B2673
9042g0031A57647c91794J81525L6523N6763j15994R3524E8936a55122P3666j4462
9031i5918a3867B77280a30508j61890J10443B87995b94083d9260k22936i5267
9020I3018j538g9027q2768f0653k24723F3324e2596k91581i153k4888k69042d0087
$$ y = [-93674, -225633, -44610, 59606, 180961, 27657, -101512, -66113, -78521, -37329, -198632, -222893, -157269, -331115, 2040, 52444, 15230, -45298, -240403, 61194, 18174, -282700, -36293, 131248, 188431, -49889, 245256, 59976, -1373, -192853, 97579, 183952, -84087, -59463, -135805, -303886, 55383, -54111, 56601, -2037, -159255, 293437, -316101, -127286, -127265, -124316, -177799, 151073, -226804, 117244, -157241, 132872, -106468, 224810, -373759, -108374, 22673, -70031, 157647, -391794, -210269, -173746, -116983, -232977, -139453, 58936, -155122, -81456, -95918, -13867, 277280, -130508, -292398, -181955, 287995, -294083, -49260, -272196, -95267, 93018, 91480, -79027, -161795, -60653, -285376, 63324, -52596, -344177, -9153, -34041, -303083, -40087]
9007b69135k1733a7562D3511i6247A18221c43293a55291p9848j08288B45828d4334
8995c8935m68405a15592c5253H8267h4271C9894b2399j83352L1283c1583n1766
8984h3349c4189A06509h7234H1887d6691A04795R8395j01242k895o225l7715c21097
8971c126k8381j33544A31620h41j8042q9057C4940J8144i9851C2478p584L172
8959B8066b77577e3485o6117b9735A02270A2290J62794a33120B2365J3520e6072
8947C5186a85833F9579b8679j63926C30974G795J8907b98259A13527c02270K8139
8936b74131J9525A43283a12609d7332q0198A6588J67920b45212L3167p6957i0005
8924E1400h3377p1006o1590R3285B0381a55517I6813m880J67951N9664j22751
$$ y = [-269135, -290868, -17562, 43511, -96247, 118221, -343293, -155291, -235139, -343427, 245828, -44334, -38935, -507340, -115592, -35253, 88267, -84271, 39894, -22399, -205751, -174468, -31583, -83349, -34189, 106509, -87234, 81887, -46691, 104795, 203190, 101948, 99053, 92828, 55113, -321097, -3126, -31507, -165051, 131620, -841, -18883, -107940, 34940, 53084, -99851, 32478, 24894, 28066, -277577, -53485, -119602, -29735, 102270, 12290, 175084, -133120, 22365, 35885, -56072, 35186, -185833, 69579, -28679, -192605, 330974, 7795, 26702, -298259, 113527, -302270, -274131, -254606, 143283, -112609, -47332, -127530, 16588, 184508, -245212, -212045, -289002, -90005, 51400, -83377, -154383, -215973, -122688, 20381, -155517, 96813, 91933, 259884, 319548, 196797]
8913A96797f8100A1053L0343M30185P1118k36282K25655K80726M11278J189719
8903B413795K880951J362467k336868j685966j62301r58728o23983l95390b9356
8893A59330O9922o0986K6362J05068m966K69077B81338i3978b6776C44161j59707
8882A84454m2424i6441E4716J99743a07003j05470e1204p9257c6148m37754b5349
8870D1084b53901i0321A69857B5435P4523i2052r0418a0630j43312A3696O3943
8859G7639N1281f3476J9628j33271k33537C9242m121A5912C158J45798o7232i0156
$$ y = [196797, -68100, 11053, 41396, 471581, 542699, 306417, 532072, 812798, 1224076, 2413795, 5294746, 6657213, 4320345, 2634379, 2472078, 1513350, 889367, 493977, -29356, 159330, 229252, 168266, 194628, 299696, 294730, 563807, 281338, -93978, -26776, 344161, 184454, 142030, -96441, 54716, 254459, -107003, -212473, -51204, -130461, -36148, -473902, -25349, 41084, -253901, -90321, 169857, 25435, 99958, -92052, -182470, -10630, -153942, 13696, 77639, 128920, -63476, -43848, -177119, -410656, 39242, 35121, 15912, 3158, 148956, 81724, -90156]
$$ [...]
##END NTUPLES=NMR SPECTRUM
##END=
