
##TITLE=AC1072_TOPL05_5819035_JyEpBJPI1D
##JCAMPDX= 6.0         $$ Bruker NMR JCAMP-DX V2.0
##DATA TYPE= NMR SPECTRUM
##DATA CLASS= NTUPLES
##ORIGIN= BRUKER
##OWNER= Administrator
$$ 1.72 TOPSPIN		Version 2.1
$$ 2012-03-28 11:08:45.218 -0500  Administrator@TOPSPIN
$$ Compression mode = diff/dup
##.OBSERVE FREQUENCY= 400.13188235
##.OBSERVE NUCLEUS= ^1H
##.ACQUISITION MODE= SIMULTANEOUS (DQD)
##.ACQUISITION SCHEME= undefined
##.AVERAGES= 64
##.DIGITISER RES= 22
##SPECTROMETER/DATA SYSTEM= spect
##.PULSE SEQUENCE= noesygpps1d.comp
##.SOLVENT NAME= COFFEE_meoh
##.SHIFT REFERENCE= INTERNAL, COFFEE_meoh, 1, 14.969
##AUDIT TRAIL= $$ (NUMBER, WHEN, WHO, WHERE, PROCESS, VERSION, WHAT)
$$ ##TITLE= Audit trail, TOPSPIN		Version 2.1
$$ ##JCAMPDX= 5.01
$$ ##ORIGIN= Bruker BioSpin GmbH
$$ ##OWNER= Administrator
$$ $$ C:\Bruker\TOPSPIN/data/COFFEE/nmr/AC1072_TOPL05_5819035_JyEpBJPI1D/22/pdata/1/auditp.txt
$$ ##AUDIT TRAIL=  $$ (NUMBER, WHEN, WHO, WHERE, PROCESS, VERSION, WHAT)
(   1,<2012-03-28 06:12:27.312 -0500>,<Administrator>,<TOPSPIN>,<go>,<TOPSPIN 2.1>,
      <created by zg
	started at 2012-03-28 06:00:55.343 -0500,
	POWCHK enabled, PULCHK disabled,
       configuration hash MD5:
       1A 1E CE 29 27 FD 77 03 67 4E F0 E3 C4 B2 CB 90
       data hash MD5: 64K
       DE F1 18 E8 AF 95 18 1B ED CD AB 92 55 80 5A 53>)
(   2,<2012-03-28 06:12:33.640 -0500>,<Administrator>,<TOPSPIN>,<proc1d>,<TOPSPIN 2.1>,
      <Start of raw data processing
       efp LB = 0.3 FT_mod = 6 PKNL = 1 PHC0 = 0 PHC1 = 0 SI = 128K 
       data hash MD5: 128K
       06 6D 1E 0D 49 FA B4 37 C8 E9 D8 2C 67 8C 8D 19>)
(   3,<2012-03-28 06:12:34.953 -0500>,<Administrator>,<TOPSPIN>,<proc1d>,<TOPSPIN 2.1>,
      <pk PHC0 = 36.63391 PHC1 = 0 
       data hash MD5: 128K
       44 6B 9A 47 22 35 2B 72 2B E9 05 9F B9 A7 80 BC>)
(   4,<2012-03-28 06:12:35.453 -0500>,<Administrator>,<TOPSPIN>,<proc1d>,<TOPSPIN 2.1>,
      <abs ABSG = 1 
       data hash MD5: 128K
       68 C1 03 1D 92 77 2E 9A 29 A8 EC 6F 3D D3 73 5A>)
(   5,<2012-03-28 06:12:35.562 -0500>,<Administrator>,<TOPSPIN>,<proc1d>,<TOPSPIN 2.1>,
      <abs ABSG = 2 
       data hash MD5: 128K
       39 07 33 26 F7 65 73 76 13 54 AA F9 16 D2 34 3B>)
(   6,<2012-03-28 06:12:35.687 -0500>,<Administrator>,<TOPSPIN>,<proc1d>,<TOPSPIN 2.1>,
      <abs ABSG = 3 
       data hash MD5: 128K
       63 B9 3A 8B D7 90 73 74 1F F1 F0 4B 99 A0 96 84>)
(   7,<2012-03-28 06:12:35.781 -0500>,<Administrator>,<TOPSPIN>,<proc1d>,<TOPSPIN 2.1>,
      <abs ABSG = 4 
       data hash MD5: 128K
       93 90 37 4B 5F 87 9C F9 41 89 D5 FE BD 34 38 6F>)
(   8,<2012-03-28 06:12:35.890 -0500>,<Administrator>,<TOPSPIN>,<proc1d>,<TOPSPIN 2.1>,
      <abs ABSG = 5 
       data hash MD5: 128K
       89 E3 B7 0F 1F 4B BF 06 9C 44 8B 18 30 31 7D EA>)
(   9,<2012-03-28 06:12:36.921 -0500>,<Administrator>,<TOPSPIN>,<audit>,<TOPSPIN 2.1>,
      <user comment:
       ICON-NMR User ID: COFFEE
       data hash MD5: 128K
$$ [...]
##$TP07= 0
##$TPNAME0= <>
##$TPNAME1= <>
##$TPNAME2= <>
##$TPNAME3= <>
##$TPNAME4= <>
##$TPNAME5= <>
##$TPNAME6= <>
##$TPNAME7= <>
##$TPOAL= (0..7)
0.5 0.5 0.5 0.5 0.5 0.5 0.5 0.5
##$TPOFFS= (0..7)
0 0 0 0 0 0 0 0
##$TUNHIN= 0
##$TUNHOUT= 0
##$TUNXOUT= 0
##$USERA1= <user>
##$USERA2= <user>
##$USERA3= <user>
##$USERA4= <user>
##$USERA5= <user>
##$V9= 5
##$VALIST= <valist>
##$VCLIST= <CCCCCCCCCCCCCCC>
##$VD= 0
##$VDLIST= <DDDDDDDDDDDDDDD>
##$VPLIST= <PPPPPPPPPPPPPPP>
##$VTLIST= <TTTTTTTTTTTTTTT>
##$WBST= 2048
##$WBSW= 25
##$XGAIN= (0..3)
0 0 0 0
##$XL= 0
##$YL= 0
##$YMAX_a= 15917132
##$YMIN_a= -6902763
##$ZGOPTNS= <>
##$ZL1= 120
##$ZL2= 120
##$ZL3= 120
##$ZL4= 120
##$ABSF1= 14.969
##$ABSF2= -5.58353
##$ABSG= 5
##$ABSL= 3
##$ALPHA= 0
##$AQORDER= 0
##$ASSFAC= 0
##$ASSFACI= 0
##$ASSFACX= 0
##$ASSWID= 0
##$AUNMP= <proc_prof1d_extract.lims>
##$AXLEFT= 0
##$AXNAME= <>
##$AXNUC= <1H>
##$AXRIGHT= 0
##$AXTYPE= 0
##$AXUNIT= <>
##$AZFE= 0.1
##$AZFW= 0.1
##$BCFW= 0
##$BC_mod= 0
##$BYTORDP= 0
##$COROFFS= 0
##$CY= 15
##$DATMOD= 1
##$DC= 0
##$DFILT= <>
##$DTYPP= 0
##$F1P= 0
##$F2P= 0
##$FCOR= 0.5
##$FTSIZE= 131072
##$FT_mod= 6
##$GAMMA= 0
##$GB= 0
##$INTBC= 1
##$INTSCL= 1
##$ISEN= 128
##$LB= 0.3
##$LEV0= 0
##$LPBIN= 0
##$MAXI= 10000
##$MC2= 0
##$MEAN= 0
##$ME_mod= 0
##$MI= 0
##$NCOEF= 0
##$NC_proc= -3
##$NLEV= 6
##$NOISF1= 0
##$NOISF2= 0
##$NSP= 0
##$NTH_PI= 0
##$NZP= 0
##$OFFSET= 14.969
##$PC= 1
##$PHC0= 36.63391
##$PHC1= 0
##$PH_mod= 1
##$PKNL= yes
##$PPARMOD= 0
##$PPDIAG= 0
##$PPIPTYP= 0
##$PPMPNUM= 2147483647
##$PPRESOL= 1
##$PSCAL= 4
##$PSIGN= 0
##$PYNMP= <proc.py>
##$REVERSE= no
##$SF= 400.130004644969
##$SI= 131072
##$SIGF1= 0
##$SIGF2= 0
##$SINO= 400
##$SIOLD= 131072
##$SPECTYP= <>
##$SREGLST= <1H.CDCl3>
##$SSB= 0
##$STSI= 131072
##$STSR= 0
##$SW_p= 8223.68421052632
##$SYMM= 0
##$S_DEV= 0
##$TDeff= 65536
##$TDoff= 0
##$TI= <>
##$TILT= no
##$TM1= 0
##$TM2= 0
##$TOPLEV= 0
##$USERP1= <user>
##$USERP2= <user>
##$USERP3= <user>
##$USERP4= <user>
##$USERP5= <user>
##$WDW= 1
##$XDIM= 131072
##$YMAX_p= 436669064
##$YMIN_p= -299853178
##$CURPLOT= <Network HP LaserJet P1505>
##$CURPRIN= <$Network HP LaserJet P1505>
##$DFORMAT= <normdp>
##$LAYOUT= <+/1D_H.xwp>
##$LFORMAT= <normlp>
##$PFORMAT= <normpl>
##$SURQMSG= 1
$$ End of Bruker specific parameters
$$ ---------------------------------
##NTUPLES= NMR SPECTRUM
##VAR_NAME=  FREQUENCY,     SPECTRUM/REAL,   SPECTRUM/IMAG
##SYMBOL=    X,             R,               I
##VAR_TYPE=  INDEPENDENT,   DEPENDENT,       DEPENDENT
##VAR_FORM=  AFFN,          ASDF,            ASDF
##VAR_DIM=   131072,        131072,          131072
##UNITS=     HZ,            ARBITRARY UNITS, ARBITRARY UNITS
##FACTOR=    0.0627417313425165, 1,          1
##FIRST=     8223.62146879498, -3422,        -121266
##LAST=      0,             1045,            -122461
##MIN=       0,             -299853178,      0
##MAX=       8223.62146879498, 436669064,    0
$$ Real data points
##PAGE= N=1
##DATA TABLE= (X++(R..R)), XYDATA
$$ [...]
60688A843970J267O32J45J12O61J217O56j565m635p177q464q525p685o701o635
$$ 1843970 1845237 1845869 1846014 1846126 1846787 1848004 1848660 1847095 1842460 1835283 1826819 1818294 1810609 1803908 1797273
60673A797273p703q783r060r305j0397j1479j1383j1031j2266j4576j5416j3954
$$ 1797273 1789570 1780787 1771727 1762422 1752025 1740546 1729163 1718132 1705866 1691290 1675874 1661920
60661A661920j2246j2160j3266j4405j5224j5322j3869j1148q729p178n445l428
$$ 1661920 1649674 1637514 1624248 1609843 1594619 1579297 1565428 1554280 1545551 1538373 1532928 1529500
60649A529500k971m799o591n993l786k089j049L29J397O49j283k035q74M45L45
$$ 1529500 1526529 1521730 1515139 1509146 1505360 1503271 1502222 1502551 1503948 1504597 1503314 1501279 1500405 1500850 1501195
60634A501195r18k543m523p122j0100j2788j4314j3977j2305j1345j2788j5982
$$ 1501195 1500277 1497734 1493211 1486089 1475989 1463201 1448887 1434910 1422605 1411260 1398472 1382490
60622A382490j8682j9456j8422j6242j3690j1871j1441j1653j1285j0181q847
$$ 1382490 1363808 1344352 1325930 1309688 1295998 1284127 1272686 1261033 1249748 1239567 1230720
60611A230720p067m357j417N21J613K997M634N353N163N468O503O567M806K991
$$ 1230720 1223653 1219296 1217879 1218400 1220013 1223010 1227644 1232997 1238160 1243628 1250131 1256698 1261504 1264495
60597A264495L126M605N301M655M108M839O444P865Q551Q566Q388Q806J0295J2196
$$ 1264495 1267621 1272226 1277527 1282182 1286290 1291129 1297573 1305438 1313989 1322555 1330943 1339749 1350044 1362240
60583A362240J3058J2228J0846J0751J2421J4586J5944J6671J7547J8288J7938
$$ 1362240 1375298 1387526 1398372 1409123 1421544 1436130 1452074 1468745 1486292 1504580 1522518
60572A522518J6817J6556J7573J8028J6438J4171J3677J4845J5002J2476Q486
$$ 1522518 1539335 1555891 1573464 1591492 1607930 1622101 1635778 1650623 1665625 1678101 1686587
60561A686587N124K984J359l91k526n180q140j0734j2428j3199j3207j2655j2097
$$ 1686587 1691711 1694695 1696054 1695663 1693137 1687957 1679817 1669083 1656655 1643456 1630249 1617594 1605497
60548A605497j2068j2133j1045q342n102k719j538j141j214j461j272m14K39m87
$$ 1605497 1593429 1581296 1570251 1561909 1556807 1554088 1552550 1551409 1550195 1548734 1547462 1547048 1547287 1546800
60534A546800k464m131m091k499p47n8m58q57o1K121M589N863N406M165L649M342
$$ 1546800 1544336 1540205 1536114 1533615 1532868 1532810 1532352 1531495 1531434 1533555 1538144 1544007 1549413 1553578 1557227 1561569
60518A561569N106M399K053n35k046k484k547k408j947j737k854n558q845j1433
$$ 1561569 1566675 1571074 1573127 1572592 1570546 1568062 1565515 1563107 1561160 1559423 1556569 1551011 1542166 1530733
60504A530733j2654j2439j1228j0043r880j0515j0576r278p638p197p901p990
$$ 1530733 1518079 1505640 1494412 1484369 1474489 1463974 1453398 1444120 1436482 1429285 1421384 1413394
60492A413394o015k305J636M571O095O427O352P091R471J2992J6313J8920K1814
$$ 1413394 1407379 1405074 1406710 1411281 1417376 1423803 1430155 1437246 1446717 1459709 1476022 1494942 1516756
60479A516756K6091L1381L6287M0130M3382M6442M8703M9117M7136M2991L7516
$$ 1516756 1542847 1574228 1610515 1650645 1694027 1740469 1789172 1838289 1885425 1928416 1965932
60468A965932L1706K5929J9502J1772L624k901o703q502r379r423q209n681j970
$$ 1965932 1997638 2023567 2043069 2054841 2058465 2055564 2048861 2040359 2030980 2021557 2013348 2007667 2005697
60455B005697K765P612J1062J2785J4411J7485K1296K3878K4698K5119K6559K9320
$$ 2005697 2008462 2016074 2027136 2039921 2054332 2071817 2093113 2116991 2141689 2166808 2193367 2222687
60443B222687L3175L8020M3834N0680N8812O8250P8556Q9477J01385J14526J28483
$$ 2222687 2255862 2293882 2337716 2388396 2447208 2515458 2594014 2683491 2784876 2899402 3027885
60432C027885J43078J58960J76410J94469K12468K31666K53852K79065L06148
$$ 3027885 3170963 3329923 3506333 3700802 3913270 4144936 4398788 4677853 4984001
60423D984001L34610L63588L89221M05510M08167L95638L66363L17949K50490
$$ 4984001 5318611 5682199 6071420 6476930 6885097 7280735 7647098 7965047 8215537
60414H215537J68742P9629j0903r7557j74570k37326k84372l16291l33602l37536
$$ 8215537 8384279 8463908 8453005 8355448 8180878 7943552 7659180 7342889 7009287 6671751
60404F671751l32014l22458l12258l01581k89603k76709k64347k53787k45079
$$ 6671751 6339737 6017279 5705021 5403440 5113837 4837128 4572781 4318994 4073915
60395D073915k36546k25636k11243j95149j80190j67250j54981j42226j29381
$$ 4073915 3837369 3611733 3400490 3205341 3025151 2857901 2702920 2560694 2431313
60386B431313j17282j06099r5752q6417p8113p0646o4268n9542n6143n2757m8699
$$ 2431313 2314031 2207932 2112180 2025763 1947650 1877004 1812736 1753194 1697051 1644294 1595595
60375A595595m4607m0888l6608l1076k5719k2794k2483k2581k1178j8438j5517
$$ 1595595 1550988 1510100 1473492 1442416 1416697 1393903 1371420 1348839 1327661 1309223 1293706
60364A293706j3030j1084r784q965q094p116o658o770o310m524k445j507j263
$$ 1293706 1280676 1269592 1259808 1250843 1242749 1235633 1228975 1222205 1215895 1211371 1208926 1207419 1206156
60351A206156m4K354M158M170L310K988L098K627J497P91J394L099M954O077O259
$$ 1206156 1206112 1208466 1212624 1216794 1220104 1223092 1226190 1228817 1230314 1231105 1232499 1235598 1240552 1246629 1252888
60336A252888O010N866N740N324M789M487M180L590L392M316N385M751K610J322
$$ 1252888 1258898 1264764 1270504 1275828 1280617 1285104 1289284 1292874 1296266 1300582 1305967 1310718 1313328 1314650
60322A314650J905K455J232n79j028n46q08j651j628q33p34j475j711j039m05
$$ 1314650 1316555 1319010 1320242 1319663 1318635 1318089 1317281 1315630 1314002 1313169 1312435 1310960 1309249 1308210 1307805
60307A307805r5N59J263Q35m43o78P65K318K963L832N885P837Q001O857O230O802
$$ 1307805 1307710 1308269 1309532 1310367 1309924 1309246 1310011 1312329 1315292 1319124 1325009 1332846 1340847 1347704 1353934 1360736
60291A360736P812Q570R085R660J0706J2422J4033J4159J2667J1201J1022J1256
$$ 1360736 1368548 1377118 1386203 1395863 1406569 1418991 1433024 1447183 1459850 1471051 1482073 1493329
60279A493329J0424Q797P809P730P504O774O533P389Q385Q269P252O697P249Q074
$$ 1493329 1503753 1512550 1520359 1528089 1535593 1542367 1548900 1556289 1564674 1572943 1580195 1586892 1594141 1602215
60265A602215Q168P866Q267R317R477P836N545M173L288J042l059p323r943j0659
$$ 1602215 1610383 1618249 1626516 1635833 1645310 1653146 1658691 1662864 1666152 1667194 1664135 1656812 1646869 1636210
60251A636210j0231r466r077r363r601q745o964n437m446l055j088L1p60k601
$$ 1636210 1625979 1616513 1607436 1598073 1588472 1579727 1572763 1567326 1562880 1559825 1558737 1558768 1558008 1555407
60237A555407l888m057l326j783L57K414M059N621O956O976N216L049K319L421
$$ 1555407 1551519 1547462 1544136 1542353 1542710 1545124 1549183 1554804 1561760 1568736 1573952 1577001 1579320 1582741
60223A582741N461P512Q944R305Q769Q164P912P731P788R061J1706J4295J5604
$$ 1582741 1588202 1595714 1604658 1613963 1622732 1630896 1638808 1646539 1654327 1663388 1675094 1689389 1704993
60210A704993J6050J6537J7172J8238K0890K5275K9290L1125L1975L4177L7714
$$ 1704993 1721043 1737580 1754752 1772990 1793880 1819155 1848445 1879570 1911545 1945722 1983436
60199A983436M0904M3928M8826N5796O2303O6724P0739P6779Q4659R2077R7546
$$ 1983436 2024340 2068268 2117094 2172890 2235193 2301917 2372656 2449435 2534094 2626171 2723717
60188B723717J01675J06213J12708J21660J32180J42630J51874J59778J66430
$$ 2723717 2825392 2931605 3044313 3165973 3298153 3440783 3592657 3752435 3918865
60179C918865J71460J74351J75021J73856J71414J68020J63346J56517J47023
$$ 3918865 4090325 4264676 4439697 4613553 4784967 4952987 5116333 5272850 5419873
60170E419873J35297J22038J07363R1294P4605N8365M2869K8002J4458L637l848
$$ 5419873 5555170 5677208 5784571 5875865 5950470 6008835 6051704 6079706 6094164 6097801 6093953
60159F093953q810j2531j5704j8113j8682j5991r617q50Q642J8642L0025M2913
$$ 6093953 6085143 6072612 6056908 6038795 6020113 6004122 5994505 5993655 6002297 6020939 6050964 6093877
60147F093877N6435P0348Q5383J01469J16805J29513J39405J47338J53392J56572
$$ 6093877 6150312 6220660 6306043 6407512 6524317 6653830 6793235 6940573 7093965 7250537
60137G250537J56056J51936J44752J34735J21798J06114Q8438O9681N0168K9674
$$ 7250537 7406593 7558529 7703281 7838016 7959814 8065928 8154366 8224047 8274215 8303889
60127H303889Q342j2713l2003m8634o2423p3501q2118q8467r2207r2423q8480
$$ 8303889 8312231 8299518 8267515 8218881 8156458 8082957 8000839 7912372 7820165 7727742 7639262
60116G639262q0659o9851n7041m3321k9570j5554q6J7171L4841N1351O6416Q0011
$$ 7639262 7558603 7488752 7431711 7388390 7358820 7343266 7343180 7360351 7395192 7446543 7512959 7592970
60104G592970R0877R7490R9934R9353R6098Q9868Q1319P1754O1336M9366L6431
$$ 7592970 7683847 7781337 7881271 7980624 8076722 8166590 8247909 8319663 8380999 8430365 8466796
60093H466796K4705J5772R577N855N050P393J2482K0363L1669M6110O2105P8614
$$ 8466796 8491501 8507273 8516850 8522705 8527755 8535148 8547630 8567993 8599662 8645772 8707877 8786491
60081H786491R6266J16108J38421J63415J91591K22512K54392K86059L18336L52330
$$ 8786491 8882757 8998865 9137286 9300701 9492292 9714804 9969196 10255255 10573591 10925921
60071A0925921L87355M21669M54362M84999N11941N32698N45881N51743N50746
$$ 10925921 11313276 11734945 12189307 12674306 13186247 13718945 14264826 14816569 15367315
60062A5367315N42662N27009N03366M71131M29963L80878L26120K67472K05129
$$ 15367315 15909977 16436986 16940352 17411483 17841446 18222324 18548444 18815916 19021045
60053A9021045J38574O8330l429p3837j40534k01967k56764l03276l40095l66892
$$ 19021045 19159619 19227949 19224520 19150683 19010149 18808182 18551418 18248142 17908047 17541155
60043A7541155l84322l92998l93024l84678l69122l47980l22460k93198k60879
$$ 17541155 17156833 16763835 16370811 15986133 15617011 15269031 14946571 14653373 14392494
60034A4392494k26603j91565j56392j20964q5223n0352j8790P375K7737M2760
$$ 14392494 14165891 13974326 13817934 13696970 13611747 13561395 13542605 13549980 13577717 13620477
60024A3620477N1971N4097M9106L8992K5859R955r527l2198n5936p8634r9759
$$ 13620477 13672448 13726545 13775651 13814643 13840502 13850457 13840930 13808732 13752796 13674162 13574403
60013A3574403j19950j39524j57897j74500j89683k04124k17328k27470k33225
$$ 13574403 13454453 13314929 13157032 12982532 12792849 12588725 12371397 12143927 11910702
60004A1910702k35159k34588k31560k25057k15079k03185j90561j76464j59325
$$ 11910702 11675543 11440955 11209395 10984338 10769259 10566074 10375513 10199049 10039724
59995A0039724j38905j16721r4574p2942n0757k6851j732K2424M4010O3649Q2565
$$ 10039724 9900819 9784098 9689524 9616582 9565825 9538974 9537242 9559666 9603676 9667325 9749890
59984I749890R9887J13096J21153J25247J25904J21301J09853R3036P3849N3321
$$ 9749890 9849777 9962873 10084026 10209273 10335177 10456478 10566331 10659367 10733216 10786537
59974A0786537L0399M825k1731m7584p2354r5862j16945j34209j47302j56747
$$ 10786537 10816936 10821761 10800030 10752446 10680092 10584230 10467285 10333076 10185774 10029027
59964A0029027j62993j66010j65539j61306j53278j42008j28544j13755r7891
$$ 10029027 9866034 9700024 9534485 9373179 9219901 9077893 8949349 8835594 8737703
59955H737703q0817o2486m3047k2632j122K1862M6559P2436R8208J22859J46501
$$ 8737703 8656886 8594400 8551353 8528721 8527599 8549461 8596020 8668456 8766664 8889523 9036024
59944I036024J69591J91233K08921K20447K25674K25961K22080K13329J98694
$$ 9036024 9205615 9396848 9605769 9826216 10051890 10277851 10499931 10713260 10911954
59935A0911954J78246J53097J24448R3247O0542K7561m618l5178o3322q8524j11018
$$ 10911954 11090200 11243297 11367745 11460992 11521534 11549095 11544477 11509299 11445977 11357453 11246435
59924A1246435j31192j48072j59205j62910j60251j53870j45067j33055j17117
$$ 11246435 11115243 10967171 10807966 10645056 10484805 10330935 10185868 10052813 9935696
59915I935696r8370p8713n8867l8249j6465N811K7436M7776O6947Q5250J02433
$$ 9935696 9837326 9758613 9699746 9661497 9645032 9650843 9678279 9726055 9793002 9878252 9980685
59904I980685J17429J29014J36801J41468J43845J43959J41229J35550J27904
$$ 9980685 10098114 10227128 10363929 10505397 10649242 10793201 10934430 11069980 11197884
59895A1197884J19813J12252J05231R8437R2141Q7287Q4731Q4793Q7675R4052
$$ 11197884 11317697 11429949 11535180 11633617 11725758 11813045 11897776 11982569 12070244 12164296
59885A2164296J04793J20202J39866J63310J90525K21701K56593K94420L34529
$$ 12164296 12269089 12389291 12529157 12692467 12882992 13104693 13361286 13655706 13990235
59876A3990235L76826M20900M64504N03588N34583N56135N67752N67304N51434
$$ 13990235 14367061 14787961 15252465 15756053 16290636 16846771 17414523 17981827 18533261
59867A8533261N18430M69172M04982L26545K36086J38863M0826n4264j44052k25337
$$ 18533261 19051691 19520863 19925845 20252390 20488476 20627339 20668165 20613901 20469849 20244512
59857B0244512k94674l50672l93743m24105m41965m49251m48783m41580m27069
$$ 20244512 19949838 19599166 19205423 18781318 18339353 17890102 17441319 16999739 16572670
59848A6572670m06235l82202l56832l28781k96077k58979k19124j77416j34271
$$ 16572670 16166435 15784233 15427401 15098620 14802543 14543564 14324440 14147024 14012753
59839A4012753r0859m8651q284L0028O5493R6822J22704J41443J51015J50293
$$ 14012753 13921894 13873243 13864959 13894987 13960480 14057302 14180006 14321449 14472464 14622757
59829A4622757J39469J18726Q7541M6333k232n4764j09196j64096k16725k63421
$$ 14622757 14762226 14880952 14968493 15014826 15012594 14957830 14848634 14684538 14467813 14204392
59819A4204392l01881l32059l54886l71144l81507l86608l86745l82030l72883
$$ 14204392 13902511 13570452 13215566 12844422 12462915 12076307 11689562 11307532 10934649
59810A0934649l60155l44868l28110l10781k93179k75251k57558k41259k26726
$$ 10934649 10574494 10229626 9901516 9590735 9297556 9022305 8764747 8523488 8296762
59801H296762k12938j99020j85664j74224j64899j56733j48944j41288j33339
$$ 8296762 8083824 7884804 7699140 7524916 7360017 7203284 7054340 6913052 6779713
59792F779713j24413j14296j03490r2730q2540p3090o4207n5956m9423m6160m6370
$$ 6779713 6655300 6541004 6437514 6344784 6262244 6189154 6124947 6068991 6019568 5973408 5927038
59781E927038m8436n0884n3990n8572o3923o8113o9893o9303o6761o2764n8254
$$ 5927038 5878602 5827718 5773728 5715156 5651233 5583120 5513227 5443924 5377163 5314399 5256145
59770E256145n4065m9800m4081l6159k6689j6935p746P62R066J7816K7195L6784
$$ 5256145 5202080 5152280 5108199 5072040 5045351 5028416 5020670 5021432 5030498 5048314 5075509 5112293
59758E112293M6157N5097O3050O9211P3768P8227Q3604Q8966R2571R3703R2367
$$ 5112293 5158450 5213547 5276597 5345808 5419576 5497803 5581407 5670373 5762944 5856647 5949014
59747E949014Q8057Q0472P1002O1830N3622M5630L8073L2773L0948L1850L4307
$$ 5949014 6037071 6117543 6188545 6250375 6303997 6349627 6387700 6420473 6451421 6483271 6517578
59736F517578L8463M5161N4483O5790P8717R3257J09183J26139J44389J65050
$$ 6517578 6556041 6601202 6655685 6721475 6800192 6893449 7002632 7128771 7273160 7438210
59726G438210J89290K17288K48139K80969L16059L54206L94614M33791M66773
$$ 7438210 7627500 7844788 8092927 8373896 8689955 9044161 9438775 9872566 10339339
59717A0339339M88853M95895M84261M51870L99268L29039K44860J52092N8439
$$ 10339339 10828192 11324087 11808348 12260218 12659486 12988525 13233385 13385477 13443916
59708A3443916k7954j01481j59648k01377k26513k36999k36730k29447k17536
$$ 13443916 13415962 13314481 13154833 12953456 12726943 12489944 12253214 12023767 11806231
59699A1806231k02846j87145j71131j54234j36064j17106r7494p6340n2984k7897
$$ 11806231 11603385 11416240 11245109 11090875 10954811 10837705 10740211 10663871 10610887 10582990
59689A0582990j515K6644N6730Q7462J17703J48454J81758K17871K54855K91135
$$ 10582990 10581475 10608119 10664849 10752311 10870014 11018468 11200226 11418097 11672952 11964087
59679A1964087L27198L64440M03364M43677M85555N29857N77004O26196O76056
$$ 11964087 12291285 12655725 13059089 13502766 13988321 14518178 15095182 15721378 16397434
59670A6397434P26006P76476Q27640Q78057R24864R65170R96882J018479J028845
$$ 16397434 17123440 17899916 18727556 19605613 20530477 21495647 22492529 23511008 24539853
59661B4539853J027820J016673R97680R73522R47115R21603R00091Q85415Q80019
$$ 24539853 25567673 26584346 27582026 28555548 29502663 30424266 31324357 32209772 33089791
59652C3089791Q85444R01497R26103R56180R88190J017793J039749J049195J042937
$$ 33089791 33975235 34876732 35802835 36759015 37747205 38764998 39804747 40853942 41896879
59643D1896879J019071R75767R11561Q27273P26958O16352N00665L84145K71367
$$ 41896879 42915950 43891717 44803278 45630551 46357509 46973861 47474526 47858671 48130038
59634D8130038J67838P9016Q948m0141o7748p5081o4723l9334l60N1844J16761
$$ 48130038 48297876 48376892 48385840 48345699 48277951 48202870 48138147 48098813 48098453 48150297 48267058
59623D8267058J93007K78761L72552M73594N81595O95726Q13038R27731J032451
$$ 48267058 48460065 48738826 49111378 49584972 50166567 50862293 51675331 52603062 53635513
59614E3635513J119928J182701J211984J198813J137076J024715Q62231O52397
$$ 53635513 54755441 55938142 57150126 58348939 59486015 60510730 61372961 62025358
59606F2025358M02816J27174j58009m37501o97904r26744j114455j257637j358454
$$ 62025358 62428174 62555348 62397339 61959838 61261934 60335190 59220735 57963098 56604644
59597E6604644j420867j449385j451374j437600j418820j402842j395274j400699
$$ 56604644 55183777 53734392 52283018 50845418 49426598 48023756 46628482 45227783
59589D5227783j421058j453777j493131j533099j568142j592595j601624j593091
$$ 45227783 43806725 42352948 40859817 39326718 37758576 36165981 34564357 32971266
59581C2971266j567392j525640j469408j402220j329644j256760j185987j117634
$$ 32971266 31403874 29878234 28408826 27006606 25676962 24420202 23234215 22116581
59573B2116581j051717r88472r27735q68953q12000p57367p05446o55968o08355
$$ 22116581 21064864 20076392 19148657 18279704 17467704 16710337 16004891 15348923 14740568
59564A4740568n62237n17439m73842m31700l91939l55638l23198k94341k68831
$$ 14740568 14178331 13660892 13187050 12755350 12363411 12007773 11684575 11390234 11121403
59555A1121403k46780k28250k13290k02442j96306j94038j93044j91059j88160
$$ 11121403 10874623 10646373 10433083 10230641 10034335 9840297 9647253 9456194 9268034
59546I268034j85887j84756j83811j82392j80865j79145j75801j69604j61184
$$ 9268034 9082147 8897391 8713580 8531188 8350323 8171178 7995377 7825773 7664589
59537G664589j52147j43108j33603j23634j13876j04227r3449q0935o7968n6336
$$ 7664589 7512442 7369334 7235731 7112097 6998221 6893994 6800545 6719610 6651642 6595306
59527F595306m6192l6295k5966j5690n878L666J2666J9971K5058K9005L3036L6813
$$ 6595306 6549114 6512819 6486853 6471163 6465285 6468951 6481617 6501588 6526646 6555651 6588687 6625500
59515F625500L9378M1315M4662N0659N8653O7198P5352Q3119R1710J03122J18149
$$ 6625500 6664878 6706193 6750855 6801514 6860167 6927365 7002717 7085836 7177546 7280668 7398817
59504G398817J34748J49861J63029J76888J93803K13627K35050K57310K79798
$$ 7398817 7533565 7683426 7846455 8023343 8217146 8430773 8665823 8923133 9202931
59495I202931L01793L23747L47231L72290L96352M17126M35150M51790M66146
$$ 9202931 9504724 9828471 10175702 10547992 10944344 11361470 11796620 12248410 12714556
59486A2714556M75942M80429M80267M75392M65408M51590M36149M19375L99582
$$ 12714556 13190498 13670927 14151194 14626586 15091994 15543584 15979733 16399108 16798690
59477A6798690L76080L50364L24068K97653K71540K46995K25325K07438J94408
$$ 16798690 17174770 17525134 17849202 18146855 18418395 18665390 18890715 19098153 19292561
59468A9292561J87028J84296J83629J83001J81819J79487J74231J63552J44850
$$ 19292561 19479589 19663885 19847514 20030515 20212334 20391821 20566052 20729604 20874454
59459B0874454J15683P4980K4254l3602r6815j64680k35167l04530l69577m28528
$$ 20874454 20990137 21065117 21089371 21055769 20958954 20794274 20559107 20254577 19885000 19456472
59449A9456472m79282n19204n47848n67999n82354n90384n89876n80527n64565
$$ 19456472 18977190 18457986 17910138 17342139 16759785 16169401 15579525 14998998 14434433
59440A4434433n44634n22366m98377m72435m43998m13549l82960l53649l24887
$$ 14434433 13889799 13367433 12869056 12396621 11952623 11539074 11156114 10802465 10477578
59431A0477578k94851k63095k31178k00932j72624j44685j15110q3473n1568k1481
$$ 10477578 10182727 9919632 9688454 9487522 9314898 9170213 9055103 8971630 8920062 8898581
59421H898581O891L5396O4736R3474J20416J46605J73957K02843K31889K59294
$$ 8898581 8905472 8940868 9005604 9099078 9219494 9366099 9540056 9742899 9974788 10234082
59411A0234082K83515L03404L18663L29608L35782L35350L26329L07772K79366
$$ 10234082 10517597 10821001 11139664 11469272 11805054 12140404 12466733 12774505 13053871
59402A3053871K40982J93388J38512P8430J5005m8967j09708j64740k14035k57790
$$ 13053871 13294853 13488241 13626753 13705183 13720188 13671221 13561513 13396773 13182738 12924948
59392A2924948k94341l21903l41435l55849l66658l73058l74099l70282l62941
$$ 12924948 12630607 12308704 11967269 11611420 11244762 10871704 10497605 10127323 9764382
59383I764382l53473l43212l32833l21539l07821k91351k73439k55622k38506
$$ 9764382 9410909 9067697 8734864 8413325 8105504 7814153 7540714 7285092 7046586
59374G046586k21912k05341j88211j70399j52631j35776j19837j04235q8953p4642
$$ 7046586 6824674 6619333 6431122 6260723 6108092 5972316 5852479 5748244 5659291 5584649
59364E584649o1675m9820l8790k8420j8322q108J902J0986J9143K7311L6289M5908
$$ 5584649 5522974 5473154 5434364 5405944 5387622 5379514 5381416 5392402 5411545 5438856 5475145 5521053
59352E521053N5465O4395P2144P7937Q1336Q3135Q5377R0184R8518J10172J24745
$$ 5521053 5576518 5640913 5713057 5790994 5872330 5955465 6040842 6131026 6229544 6339716 6464461
59341F464461J42082J61486J81217J99708K17103K34714K53020K71419K90213
$$ 6464461 6606543 6768029 6949246 7148954 7366057 7600771 7853791 8125210 8415423
59332H415423L11570L37719L69008M04507M43801M87176N34445N84477O35770
$$ 8415423 8726993 9064712 9433720 9838227 10282028 10769204 11303649 11888126 12523896
59323A2523896O86779P35709P80315Q17973Q46003Q62444Q66786Q59566Q41167
$$ 12523896 13210675 13946384 14726699 15544672 16390675 17253119 18119905 18979471 19820638
59314A9820638Q11738P72368P25525O74026O20328N66692N14621M63543M11351
$$ 19820638 20632376 21404744 22130269 22804295 23424623 23991315 24505936 24969479 25380830
59305B5380830L56988L01276K44394J84144J18277M7556k4982r7020j67468k34634
$$ 25380830 25737818 26039094 26283488 26467632 26585909 26633465 26608483 26511463 26343995 26109361
59295B6109361k95709l48329l91513m25318m50717m69681m84261m95815n05968
$$ 26109361 25813652 25465323 25073810 24648492 24197775 23728094 23243833 22748018 22242050
59286B2242050n17545n32880n51346n70111n87184o02108o13874o20280o20160
$$ 22242050 21724505 21191625 20640279 20070168 19482984 18880876 18267002 17646722 17026562
59277A7026562o14526o04589n90042n70355n46587n20678m93604m65385m36236
$$ 17026562 16412036 15807447 15217405 14647050 14100463 13579785 13086181 12620796 12184560
59268A2184560m06552l76163l44925l14001k85325k59399k34531k08840j82369
$$ 12184560 11778008 11401845 11056920 10742919 10457594 10198195 9963664 9754824 9572455
59259I572455j56467j31650j07081q2309n8394l6642j6912J821J9620L5452M8884
$$ 9572455 9415988 9284338 9177257 9094948 9036554 8999912 8983000 8984821 9004441 9039893 9088777
59248I088777O0609P0723P7615P9635P7251P2548O6864N9900N1163M1248L1304
$$ 9088777 9149386 9220109 9297724 9377359 9454610 9527158 9594022 9653922 9705085 9746333 9777637
59237I777637K1809J2453L142n258j1327j4096j3496r974m075L602J2670K3594
$$ 9777637 9799446 9811899 9815041 9809783 9798456 9784360 9770864 9760890 9756815 9760417 9773087 9796681
59225I796681L7390N3970P1438Q8010J04073J21123J38890J55173J68513J79363
$$ 9796681 9834071 9888041 9959479 10047489 10151562 10272685 10411575 10566748 10735261 10914624
59215A0914624J88149J93817J95036J91509J83135J69239J49736J26215J00784
$$ 10914624 11102773 11296590 11491626 11683135 11866270 12035509 12185245 12311460 12412244
59206A2412244P4634M8380K2903r97k2788m1284n4698o2679o7282p0725p3122
$$ 12412244 12486878 12535258 12558161 12557164 12534376 12493092 12438394 12375715 12308433 12237708 12164586
59195A2164586p3585p2494p1306p0859p1272p2851p5594p8288p9483p9073p7743
$$ 12164586 12091001 12018507 11947201 11876342 11805070 11732219 11656625 11578337 11498854 11419781 11342038
59184A1342038p5249p0434o2582n1704l7866k1235k268J9171M4283P3850J06949
$$ 11342038 11266789 11196355 11133773 11082069 11044203 11022968 11020700 11039871 11084154 11158004 11264953
59173A1264953J42248J79806K20173K62381L04332L44630L82516M16364M43725
$$ 11264953 11407201 11587007 11807180 12069561 12373893 12718523 13101039 13517403 13961128
59164A3961128M62391M70135M63919M41160M01640L46899K78320J97449J07704
$$ 13961128 14423519 14893654 15357573 15798733 16200373 16547272 16825592 17023041 17130745
59155A7130745J3684q1231j74745k63216l41594m06485m57885m97350n25826n43774
$$ 17130745 17144429 17063198 16888453 16625237 16283643 15877158 15419273 14921923 14396097 13852323
59145A3852323n52124n52235n45546n33582n17851m99617m80093m60218m39635
$$ 13852323 13300199 12747964 12202418 11668836 11150985 10651368 10171275 9711057 9271422
59136I271422m16792l91307l65335l41236l18786k96380k74048k53017k32927
$$ 9271422 8854630 8463323 8097988 7756752 7437966 7141586 6867538 6614521 6381594
59127F381594k12241j91333j72563j56769j42119j27201j12961j00493q8891p6676
$$ 6381594 6169353 5978020 5805457 5648688 5506569 5379368 5266407 5165914 5077023 5000347
59117E000347o3960n1993m1534l2492k4155j5232m766O500J6717K5226L2987M0498
$$ 5000347 4936387 4884394 4842860 4810368 4786213 4770981 4766215 4772715 4789432 4814658 4847645 4888143
59105D888143M6950N2139N7700O5423P5272Q5790R5588J03989J11234J18425J26401
$$ 4888143 4935093 4987232 5044932 5110355 5185627 5271417 5367005 5470994 5582228 5700653 5827054
59094E827054J34467J41068J45622J48438J49116J46698J41480J34893J27404
$$ 5827054 5961521 6102589 6248211 6396649 6545765 6692463 6833943 6968836 7096240
59085G096240J18167J06851R3915P9124O2146M4894L0589J9766R834l74q451j2258
$$ 7096240 7214407 7321258 7415173 7494297 7556443 7601337 7631926 7651692 7661526 7661152 7652701 7640443
59073G640443j3200j3523j2705q987k551N418J5386K8483M3863N9591P5471R2786
$$ 7640443 7627243 7613720 7601015 7592028 7589477 7594895 7610281 7638764 7682627 7742218 7817689 7910475
59061G910475J11726J31393J51934J74383J98349K21842K43663K64455K85259
$$ 7910475 8022201 8153594 8305528 8479911 8678260 8900102 9143765 9408220 9693479
59052I693479L06282L26917L45657L60001L67728L68269L61808L47476L23665
$$ 9693479 9999761 10326678 10672335 11032336 11400064 11768333 12130141 12477617 12801282
59043A2801282K89986K47672J98504J44698Q9486L5914j5234o4859j12754j56813
$$ 12801282 13091268 13338940 13537444 13682142 13771628 13807542 13792308 13727449 13614695 13457882
59033A3457882j95434k29200k59412k86137l08684l27211l42775l56032l66663
$$ 13457882 13262448 13033248 12773836 12487699 12179015 11851804 11509029 11152997 10786334
59024A0786334l73999l77731l78048l75446l70486l63542l54667l43709l30712
$$ 10786334 10412335 10034604 9656556 9281110 8910624 8547082 8192415 7848706 7517994
59015G517994l16215l01141k86293k71999k58247k44927k31786k18516k05130
$$ 7517994 7201779 6900638 6614345 6342346 6084099 5839172 5607386 5388870 5183740
59006E183740j91930j78834j65391j52041j40503j31739j24085j15016j04742
$$ 5183740 4991810 4812976 4647585 4495544 4355041 4223302 4099217 3984201 3879459
58997C879459r6316r1662q8979q4947p8530p1635o6573o3720o1441n7906n3080
$$ 3879459 3783143 3691481 3602502 3517555 3439025 3367390 3300817 3237097 3175656 3117750 3064670
58986C064670m8682m5846m3434l9665l4824l0815k8278k5979k3185k0706j9016
$$ 3064670 3015988 2970142 2926708 2887043 2852219 2821404 2793126 2767147 2743962 2723256 2704240
58975B704240j7112j4060j0224o242k252J204L195M169O051R499J2638J3653J3063
$$ 2704240 2687128 2673068 2662844 2656602 2654350 2655554 2658749 2662918 2668969 2678468 2691106 2704759 2717822
58962B717822J2261J1320R774Q123O977N812M188L163L868N548O613O911P468
$$ 2717822 2730083 2741403 2751177 2759300 2766277 2772089 2776277 2779440 2783308 2788856 2795469 2802380 2809848
58949B809848Q680J0144J1734J3450J4663J4636J3391J1277Q395N081J960j153
$$ 2809848 2818528 2828672 2840406 2853856 2868519 2883155 2896546 2907823 2916218 2921299 2923259 2922106
58937B922106m953q500r247o582l397k255j891J52L194M665M522N202P581J0058
$$ 2922106 2917153 2908653 2899406 2892824 2889427 2887172 2885281 2885433 2888627 2893292 2897814 2903016 2910597 2920655
58923B920655J1745J3682J6390J8716J9952K1109K3251K6222K9617L3492L7444
$$ 2920655 2932400 2946082 2962472 2981188 3001140 3022249 3045500 3071722 3101339 3134831 3172275
58912C172275M0452M2315M4119M6802N0158N3611N7023O0469O4129O8388P3218
$$ 3172275 3212727 3255042 3299161 3345963 3396121 3449732 3506755 3567224 3631353 3699741 3772959
58901C772959P7560Q0408Q2281Q4596Q7764R1151R4546R8329J02386J06330J10787
$$ 3772959 3850519 3930927 4013208 4097804 4185568 4276719 4371265 4469594 4571980 4678310 4789097
58890D789097J16974J24940J33587J42425J51955J62339J73241J85072J98749
$$ 4789097 4906071 5031011 5164598 5307023 5458978 5621317 5794558 5979630 6178379
58881F178379K13863K28599K42113K55810K71653K90160L10547L32047L54751
$$ 6178379 6392242 6620841 6862954 7118764 7390417 7680577 7991124 8323171 8677922
58872H677922L79537M07132M37016M67876M99859N35194N75363O18860O63472
$$ 8677922 9057459 9464591 9901607 10369483 10869342 11404536 11979899 12598759 13262231
58863A3262231P09516P58341Q08686Q57721R05473R54588J004755J050567J086196
$$ 13262231 13971747 14730088 15538774 16396495 17301968 18256556 19261311 20311878 21398074
58854B1398074J109358J118814J110839J080837J026918R49426Q48296P23594
$$ 21398074 22507432 23626246 24737085 25817922 26844840 27794266 28642562 29366156
58846B9366156N78340M18575K50651Q0024q7652k46213l90467n17197o24837p13164
$$ 29366156 29944496 30363071 30613722 30693746 30606094 30359881 29969414 29452217 28827380 28114216
58836B8114216p83321q37050q75611r00005r12082r14515r09484q97991q80687
$$ 28114216 27330895 26493845 25618234 24718229 23806147 22891632 21982148 21084157 20203470
58827B0203470q58686q33224q04916p73916p40786p06717o72757o39097o05473
$$ 20203470 19344784 18511560 17706644 16932728 16191942 15485225 14812468 14173371 13567898
58818A3567898n71999n38994n06181m73097m40535m10429l83517l58216l32841
$$ 13567898 12995899 12456905 11950724 11477627 11037092 10626663 10243146 9884930 9552089
58809I552089l07970k85171k64295k43928k24019k05946j89808j73932j57695
$$ 9552089 9244119 8958948 8694653 8450725 8226706 8020760 7830952 7657020 7499325
58800G499325j42742j30260j18695j05752r1445p7513o4624n1814l8483k5331
$$ 7499325 7356583 7226323 7107628 7001876 6910431 6832918 6768294 6716480 6677997 6652666
58790F652666j2962o66J2760K7382M1918N5177O7434Q0091R4026J08759J23542
$$ 6652666 6639704 6639038 6651798 6679180 6721098 6776275 6843709 6923800 7017826 7126585 7250127
58779G250127J38629J54774J71830J88883K05768K23464K42811K63636K85488
$$ 7250127 7388756 7543530 7715360 7904243 8110011 8333475 8576286 8839922 9125410
58770I125410L08511L33152L59534L87408M16506M46926M79492N15454N55240
$$ 9125410 9433921 9767073 10126607 10514015 10930521 11377447 11856939 12372393 12927633
58761A2927633N97778O41840O87716P36388P87247Q37959Q86835R33741R77909
$$ 12927633 13525411 14167251 14854967 15591355 16378602 17216561 18103396 19037137 20015046
58752B0015046J015985J043258J056119J052311J029314R83745R12795Q16039
$$ 20015046 21031031 22074289 23130408 24182719 25212033 26195778 27108573 27924612
58744B7924612O95850N56318M01874K37061O7572r9428k56934m00350n27666o37800
$$ 27924612 28620462 29176780 29578654 29815715 29883287 29783859 29526925 29126575 28598909 27961109
58734B7961109p29613q02513q57199q95502r19983r33500r38288r35306r25100
$$ 27961109 27231496 26428983 25571784 24676282 23756299 22822799 21884511 20949205 20024105
58725B0024105r09205q89772q67783q42575q13533p81285p46934p11059o74147
$$ 20024105 19114900 18225128 17357345 16514770 15701237 14919952 14173018 13461959 12787812
58716A2787812o37328o01823n67845n34733n02096m70538m41147m14469l90089
$$ 12787812 12150484 11548661 10980816 10446083 9943987 9473449 9032302 8617833 8227744
58707H227744l67230l45427l24311l03067k81037k59083k39167k22057k06383
$$ 8227744 7860514 7515087 7190776 6887709 6606672 6347589 6108422 5886365 5679982
58698E679982j90740j75652j62352j50601j39267j28327j18588j09731j00397
$$ 5679982 5489242 5313590 5151238 5000637 4861370 4733043 4614455 4504724 4404327
58689D404327r0268q0614p2586o6255o1357n7623n4217n0304m6468m4334m4428
$$ 4404327 4314059 4233445 4160859 4094604 4033247 3975624 3921407 3871103 3824635 3780301 3735873
58678C735873m5562m6637m7842m9653n1726n3297n3899n3404n2183n1246n1416
$$ 3735873 3690311 3643674 3595832 3546179 3494453 3441156 3387257 3333853 3281670 3230424 3179008
58667C179008n2294n2995n3710n5282n7368n8539n8431n8287n8891n9369n8609
$$ 3179008 3126714 3073719 3020009 2964727 2907359 2848820 2790389 2732102 2673211 2613842 2555233
58656B555233n6685n4248n1578m8853m6367m4073m1735l9792l8972l8770l7611
$$ 2555233 2498548 2444300 2392722 2343869 2297502 2253429 2211694 2171902 2132930 2094160 2056549
58645B056549l5052l2493l0918k9310k6360k2817k0868k1432k3080k3639k2300
$$ 2056549 2021497 1989004 1958086 1928776 1902416 1879599 1858731 1837299 1814219 1790580 1768280
58634A768280k0055j8317j7360j6412j5226j4576j4826j5014j4468j4217j5298
$$ 1768280 1748225 1729908 1712548 1696136 1680910 1666334 1651508 1636494 1622026 1607809 1592511
58623A592511j6451j5479j2555j0198r762r936r003o903m467k161j98J330K916
$$ 1592511 1576060 1560581 1548026 1537828 1528066 1518130 1509127 1502224 1497757 1495596 1495398 1496728 1499644
58610A499644N101P304Q399Q495Q730R274R123Q138P557Q172R448J0630J1183
$$ 1499644 1504745 1512049 1520448 1528943 1537673 1546947 1556070 1564208 1571765 1579937 1589385 1600015 1611198
58597A611198J0173P179M044L512N706Q096R491J1551J5395J9322K1423K2483
$$ 1611198 1621371 1628550 1632594 1636106 1641812 1649908 1659399 1670950 1686345 1705667 1727090 1749573
58585A749573K4419K7489L0791L4192L8126M2370M6474N0582N4848N9037O3568
$$ 1749573 1773992 1801481 1832272 1866464 1904590 1946960 1993434 2044016 2098864 2157901 2221469
58574B221469O9628P7324Q5014R1614R8366J07141J18104J30116J42304J54173
$$ 2221469 2291097 2368421 2453435 2545049 2643415 2750556 2868660 2998776 3141080 3295253
58564C295253J65482J77149J91185K08472K27515K46271K64182K81467K97664
$$ 3295253 3460735 3637884 3829069 4037541 4265056 4511327 4775509 5056976 5354640
58555E354640L11776L22637L28085L25058L11670K88203K55343K13050J62378
$$ 5354640 5666416 5989053 6317138 6642196 6953866 7242069 7497412 7710462 7872840
58546G872840J06898N0690m024n6027j03177j43002j74514j98197k14905k25848
$$ 7872840 7979738 8030428 8026404 7970377 7867200 7724198 7549684 7351487 7136582 6910734
58536F910734k32793k37018k38504k36848k32349k25775k17972k10014k02496
$$ 6910734 6677941 6440923 6202419 5965571 5733222 5507447 5289475 5079461 4876965
58527D876965j94392j84123j72095j60477j50067j39583j28552j18281j08936
$$ 4876965 4682573 4498450 4326355 4165878 4015811 3876228 3747676 3629395 3520459
58518C520459r8425q6078p4812o7404o2663n7739n2254m7480m2922l6910k9893
$$ 3520459 3422034 3335956 3261144 3193740 3131077 3073338 3021084 2973604 2930682 2893772 2863879
58507B863879k4396k1735k0812k0114j9459j9779k2262k7250l3307l8294m1770
$$ 2863879 2839483 2817748 2796936 2776822 2757363 2737584 2715322 2688072 2654765 2616471 2574701
58496B574701m4964m7859m8580m6847m5434m6260m7400m6406m4463m4296m5519
$$ 2574701 2529737 2481878 2433298 2386451 2341017 2294757 2247357 2200951 2156488 2112192 2066673
58485B066673m5243m2441l8949l6689l6258l7544l9423l9602l7025l3671l1879
$$ 2066673 2021430 1978989 1940040 1903351 1867093 1829549 1790126 1750524 1713499 1679828 1647949
58474A647949l0937k8757k5683k3772k3098k1878j9941j8997j9450j9691j8962
$$ 1647949 1617012 1588255 1562572 1538800 1515702 1493824 1473883 1454886 1435436 1415745 1396783
58463A396783j8363j8544j8617j7872j6707j5423j3754j1887j0463r443q283p176
$$ 1396783 1378420 1359876 1341259 1323387 1306680 1291257 1277503 1265616 1255153 1245710 1237427 1230251
58451A230251o721o558n716l995j800Q82L954O463P833R086J1230J3402J4374
$$ 1230251 1223530 1216972 1211256 1207261 1205461 1206343 1210297 1216760 1224593 1233679 1244909 1258311 1272685
58438A272685J4876J6346J8393J9753K0866K2935K5095K5300K3648K2158K1311
$$ 1272685 1287561 1303907 1322300 1342053 1362919 1385854 1410949 1436249 1459897 1482055 1503366
58427A503366J9386J5403J0295M983l86n116q129r931j2327j5796j8977k1056
$$ 1503366 1522752 1538155 1548450 1553433 1553047 1547931 1539802 1529871 1517544 1501748 1482771 1461715
58415A461715k2647k3997k4244k3076k1601k0979k1332k2111k2401k1075j8057
$$ 1461715 1439068 1415071 1390827 1367751 1346150 1325171 1303839 1281728 1259327 1238252 1220195
58404A220195j5163j4219j4620j4252j2465j0474r177q279p409o431m832k434
$$ 1220195 1205032 1190813 1176193 1161941 1149476 1139002 1129825 1121546 1114137 1107706 1102874 1100440
58392A100440l35K84kL13J598L349N642Q581J1151J2624J4261J7491K1218K3191
$$ 1100440 1100105 1100389 1100387 1100700 1102298 1105647 1111289 1119870 1131021 1143645 1157906 1175397 1196615 1219806
58378A219806K3375K3482K3767K2860K0433J7439J3973R435M759J801M33j431
$$ 1219806 1243181 1266663 1290430 1313290 1333723 1351162 1365135 1374570 1379329 1381130 1381563 1380132
58366A380132m648p838r722j0414j0311r601q949q897q742p597o085n112l814
$$ 1380132 1375484 1367646 1357924 1347510 1337199 1327598 1318649 1309752 1301010 1293413 1287328 1282216 1278402
58353A278402q53K978N740P377R307J1629J3140J3602J3522J2293R102N055J823
$$ 1278402 1277549 1280527 1286267 1293644 1302951 1314580 1327720 1341322 1354844 1367137 1376239 1381294 1383117
58340A383117j061m840q428r740r361r523j0104r239p363o789p387o620m227k973
$$ 1383117 1382056 1377216 1368788 1359048 1349687 1340164 1330060 1320821 1313458 1306669 1299282 1292662 1288435 1285462
58326A285462m010n085m270k293k98J611K830K273Q90J210L575N482N463M887
$$ 1285462 1281452 1276367 1272097 1269804 1269506 1271117 1273947 1276220 1277110 1278320 1281895 1287377 1292840 1297727
58312A297727N231O106O871P694Q421Q558Q751J0095J1975J2866J3079J4153J5910
$$ 1297727 1302958 1309064 1315935 1323629 1332050 1340608 1349359 1359454 1371429 1384295 1397374 1411527 1427437
58299A427437J6960J7650J9464K1880K2972K2809K2887K2672K0364J6739J4373
$$ 1427437 1444397 1462047 1481511 1503391 1526363 1549172 1572059 1594731 1615095 1631834 1646207
58288A646207J3199J0780O893L819K019k60k913l716k483j342n05J893N435P220
$$ 1646207 1659406 1670186 1677079 1680898 1682917 1682657 1679744 1676028 1673545 1672203 1671698 1673591 1679026 1686246
58274A686246O640O121O699P118P590R889J3264J4883J4761J5558J7403J7968
$$ 1686246 1692886 1699007 1705706 1712824 1720414 1730303 1743567 1758450 1773211 1788769 1806172 1824140
58262A824140J7904K0480K5242K7977K7870K8673L1531L2965L1532L0166K9926
$$ 1824140 1842044 1862524 1887766 1915743 1943613 1972286 2003817 2036782 2068314 2098480 2128406
58251B128406K7970K3924K1662K2020K0448J5199J1328J2586J5528J5928J5367
$$ 2128406 2156376 2180300 2201962 2223982 2244430 2259629 2270957 2283543 2299071 2314999 2330366
58240B330366J6815J8869J9226J9435K1576K4060K4921K5555K7589K9742L1099
$$ 2330366 2347181 2366050 2385276 2404711 2426287 2450347 2475268 2500823 2528412 2558154 2589253
58229B589253L3524L7676M0815M1610M2888M6709N1257N5289O0733O7854P3165
$$ 2589253 2622777 2660453 2701268 2742878 2785766 2832475 2883732 2939021 2999754 3067608 3140773
58218C140773P5350P7922Q2700Q6215Q6158Q5570Q6832Q7242Q4723Q2095Q1404
$$ 3140773 3216123 3294045 3376745 3462960 3549118 3634688 3721520 3808762 3893485 3975580 4056984
58207D056984P9929P6239P4276P6688Q0080Q1664Q4588R1504R8923J03507J08072
$$ 4056984 4136913 4213152 4287428 4364116 4444196 4525860 4610448 4701952 4800875 4904382 5012454
58196E012454J15683J23606J28931J34636J44265J55938J66970J78821J92182
$$ 5012454 5128137 5251743 5380674 5515310 5659575 5815513 5982483 6161304 6353486
58187F353486K03459K11696K22666K40236K60235K78670K98773L23476L48312
$$ 6353486 6556945 6768641 6991307 7231543 7491778 7770448 8069221 8392697 8741009
58178H741009L69109L89774M15184M43092M70239M99374N33154N68479O04124
$$ 8741009 9110118 9499892 9915076 10358168 10828407 11327781 11860935 12429414 13033538
58169A3033538O45826O96275P48744P98650Q52092R14176R78672J039089J100202
$$ 13033538 13679364 14375639 15124383 15923033 16775125 17689301 18667973 19707062 20807264
58160B0807264J168268J239829J311227J389019J479432J577928J681184J798799
$$ 20807264 21975532 23215361 24526588 25915607 27395039 28972967 30654151 32452950
58152C2452950J941078K106748K295060K516883K780349L079585L411648L788815
$$ 32452950 34394028 36500776 38795836 41312719 44093068 47172653 50584301 54373116
58144E4373116M220096M700512N234322N841968O520599P229676P955005Q768182
$$ 54373116 58593212 63293724 68528046 74370014 80890613 88120289 96075294 104843476
58136A04843476R788198J1107499J2793024J4925448J7573556K0733388K4311691
$$ 104843476 114631674 125739173 138532197 153457645 171031201 191764589 216076280
58129B16076280K8083461L1544626L3851911L4111467L1847004K7140187K0324017
$$ 216076280 244159741 275704367 309556278 343667745 375514749 402654936 422978953
58122D22978953J1739497J950614p938533j6474471k2511132k5685414k6333230
$$ 422978953 434718450 436669064 428730531 412256060 389744928 364059514 337726284
58115C37726284k5121577k2798461k0089033j7578646j5596599j4219601j3373616
$$ 337726284 312604707 289806246 269717213 252138567 236541968 222322367 208948751
58108B08948751j2914560j2663908j2454362j2178119j1784293j1241055j0526101
$$ 208948751 196034191 183370283 170915921 158737802 146953509 135712454 125186353
58101A25186353r648280q650006p581381o482943n386784m312739l261557k233258
$$ 125186353 115538073 106888067 99306686 92823743 87436959 83124220 79862663 77629405
58093G7629405j266435m53082R7823L18264K07413j92174q31318j652749k553213
$$ 77629405 76362970 75909888 76007711 76325975 76533388 76341214 75509896 73857147 71303934
58084G1303934l372161l949706m207047m167746l912086l530298l110930k733886
$$ 71303934 67931773 63982067 59775020 55607274 51695188 48164890 45053960 42320074
58076D2320074k446063k248834k119216k035694j979825j930203j871030j800430
$$ 42320074 39874011 37625177 35505961 33470267 31490442 29560239 27689209 25888779
58068B5888779j720694j627475j517365j398268j282301j174024j073337r83011
$$ 25888779 24168085 22540610 21023245 19624977 18342676 17168652 16095315 15112304
58060A5112304r04504q32210p60805o93673o36580n88021n43153n02174m67198
$$ 15112304 14207800 13375590 12614785 11921112 11284532 10696511 10153358 9651184 9183986
58051I183986m35671m04474l76282l54525l36208l16802k98166k84391k73538
$$ 9183986 8748315 8343841 7967559 7613034 7276826 6960024 6661858 6377467 6103929
58042F103929k60774k46439k34032k23105k11019j99068j90225j83063j74014
$$ 6103929 5843155 5596716 5362684 5139579 4928560 4729492 4539267 4356204 4182190
58033D182190j63559j54566j46800j38572j31314j26978j23288j17071j09906
$$ 4182190 4018631 3864065 3717265 3578693 3447379 3320401 3197113 3080042 2970136
58024B970136j05088j01462r5821q9159q4746q2002p8013p3394p0903o9584o5919
$$ 2970136 2865048 2763586 2667765 2578606 2493860 2411858 2333845 2260451 2189548 2119964 2054045
58013B054045n9935n5021n2318n0006m7439m5549m3782m0781l7421l5432l4036
$$ 2054045 1994110 1939089 1886771 1836765 1789326 1743777 1699995 1659214 1621793 1586361 1552325
58002A552325l1502k8694k7370k6440k3809k0462j8922j9014j9078j9702k2122
$$ 1552325 1520823 1492129 1464759 1438319 1414510 1394048 1375126 1356112 1337034 1317332 1295210
57991A295210k4387k3490k0172j7542j6120j4360j2846j3397j4889j4475j2425
$$ 1295210 1270823 1247333 1227161 1209619 1193499 1179139 1166293 1152896 1138007 1123532 1111107
57980A111107j1519j1973j1231q709o686o238n931m830l620k526j126m0k5K43
$$ 1111107 1099588 1087615 1076384 1067675 1060989 1054751 1048820 1043990 1040370 1037844 1036718 1036678 1036653 1036896
57966A036896K519N544O439N148M384N295O337O431O274O258N751M771M135L922
$$ 1036896 1039415 1044959 1051398 1056546 1060930 1066225 1072562 1078993 1085267 1091525 1097276 1102047 1106182 1110104
57952A110104L626L461L692L426K064Q73R09O42j708m769n799m898m345m702m788
$$ 1110104 1113730 1117191 1120883 1124309 1126373 1127246 1128155 1128797 1127089 1122320 1116521 1111623 1107278 1102576 1097788
57937A097788m824o256q801j0808j2423j5263j9000k1175k0724j9103j7672j6249
$$ 1097788 1092964 1086708 1077907 1067099 1054676 1039413 1020413 999238 978514 959411 941739 925490
57925I25490j4377j1901q432m177r16k22j235k070k459k830k098Q04M134N098
$$ 925490 911113 899212 890780 886603 885687 885465 884230 882160 879701 876871 874773 875577 879711 884809
57911H84809L826K766K749K592K101K221K440J096j621l672m283m466m672m463
$$ 884809 888635 891401 894150 896742 898843 901064 903504 904600 902979 899307 895024 890558 885886 881423
57897H81423m400n559p238p690p030o915p453p058n242l229j978j861l561o674
$$ 881423 877023 871464 864226 856536 849506 842591 835138 828080 822838 819609 817631 815770 812209 805535
57883H05535q261n974k076j026l377n599n795n758o950q179q392q529r431j0475
$$ 805535 797274 791300 789224 788198 784821 779222 773427 767669 760719 752540 744148 735619 726188 715713
57869G15713j1171j1737j1637j0012p947p603q740q872p244n731n415n261m764
$$ 715713 704542 692805 681168 671156 663209 655606 646866 637994 630750 625019 619604 614343 609579
57856F09579m664m442k359J018K712J931J495L278N370N577M870N313O978Q803
$$ 609579 604915 600473 598114 599132 601844 603775 605270 608548 613918 619495 624365 629678 636656 645459
57842F45459J0382J1244J0429Q359P071P198O826M791K852K868M001M462M130
$$ 645459 655841 667085 677514 685873 692944 700142 706968 711759 714611 717479 721480 725942 730072
57829G30072L592K359k4k642m526o008p351p645o461n046m628m865n120n499n581
$$ 730072 733664 736023 735999 733357 728831 722823 715472 707827 701366 696320 691692 686827 681707 676208 670627
57814F70627m138j483oq52k011j406J71J029J480K598L823M144M170M716M595
$$ 670627 666489 665006 665000 664148 662137 660731 660902 661931 663411 666009 669832 673976 678146 682862 687457
57799F87457K347q14k193j218K10N10l27j773l100l056j052J430K204J044l77
$$ 687457 689804 688990 686797 685579 685789 686299 685972 684199 681099 678043 676991 678421 680625 681669 681292
57784F81292r61j146j530j932k058k084k291k689l058l140k982l221m402o010
$$ 681292 680331 679185 677655 675723 673665 671581 669290 666601 663543 660403 657421 654200 649798 643788
57770F43788o977p216p599q349q856r255j0435j2029j2343j1138j0511j1764j3297
$$ 643788 636811 629595 621996 613647 604791 595536 585101 573072 560729 549591 539080 527316 514019
57757E14019j3064j1371r646q181o980p170r182j0696q978m684j157l59j418k750
$$ 514019 500955 489584 479938 471757 464777 457607 448425 437729 428751 424067 422910 422551 421133 418383
57743D18383l481k954q98J656L164L529L993N208O708Q126R569J0706J0806R898
$$ 418383 414902 411948 411050 412706 415870 419399 423392 428600 435308 443434 453003 463709 474515 484413
57729D84413Q794P943P128O214N190L655J341q42j398q0J586J781p2l102n723
$$ 484413 493207 501150 508278 514492 519682 523337 524678 523836 522438 522358 523944 525725 525653 522551 516828
57714E16828o813o635o359o421n965m394k545j539j241q89m84l72o2J258L321
$$ 516828 510015 503380 497021 490600 484635 480241 477696 476157 474916 474027 473543 473171 473109 474367 477688
57699D77688M964N492M990L776K427J905K526L286L224K974L676M741M234J652
$$ 477688 482652 488144 493134 496910 499337 501242 503768 507054 510278 513252 516928 521669 525903 527555
57685E27555j010j469L85K713L946M272M963O459P556O963N224M094M198M770
$$ 527555 526545 525076 525461 528174 532120 536392 541355 547814 555370 562333 567557 571651 575849 580619
57671E80619N672P758J0669J2379J2359J3143J6940K2093K5035K4776K3263K2291
$$ 580619 586291 594049 604718 617097 629456 642599 659539 681632 706667 731443 754706 776997
57659G76997K2332K3810K7089L1096L4052L5658L6977L8405L9736M1902M6297
$$ 776997 799329 823139 850228 881324 915376 951034 988011 1026416 1066152 1108054 1154351
57648A154351N2097N6616N8911O1083O5150P0606P6033Q1454Q7743R4996J02725
$$ 1154351 1206448 1263064 1321975 1383058 1448208 1518814 1594847 1676301 1764044 1859040 1961765
57637A961765J10880J19638J28949J39005J50478J63510J77250J91101K05617
$$ 1961765 2072645 2192283 2321232 2460237 2610715 2774225 2951475 3142576 3348193
57628C348193K21301K37097K50968K61523K68217K70065K65017K50961K27269
$$ 3348193 3569494 3806591 4057559 4319082 4587299 4857364 5122381 5373342 5600611
57619E600611J95422J58283J18793P9368M2236R549j7387l8489n3875o3013o5920
$$ 5600611 5796033 5954316 6073109 6152477 6194713 6204262 6186875 6148386 6094511 6031498 5965578
57608E965578o5099o5195p0213q1321r7130j15451j34616j53477j70364j82425
$$ 5965578 5900479 5835284 5765071 5683750 5586620 5471169 5336553 5183076 5012712 4830287
57598D830287j87109j84722j78450j70978j62063j50535j37388j24953j13639
$$ 4830287 4643178 4458456 4280006 4109028 3946965 3796430 3659042 3534089 3420450
57589C420450j01809q8900p6530o5964n6297m5994l4837k3372j1670M54J2724
$$ 3420450 3318641 3229741 3153211 3087247 3030950 2984956 2950119 2926747 2915077 2915531 2928255
57578B928255K4849L7101M9829O2752P5234Q7043R8739J11426J25937J41777J57299
$$ 2928255 2953104 2990205 3040034 3102786 3178020 3265063 3363802 3475228 3601165 3742942 3900241
57567C900241J71387J84282J95823K03764K05439K00446J89889J73332J48832
$$ 3900241 4071628 4255910 4451733 4655497 4860936 5061382 5251271 5424603 5573435
57558E573435J16376P9151M0631K114l5992p2289j04882j32592j54694j70681
$$ 5573435 5689811 5768962 5809593 5811707 5775715 5703426 5598544 5465952 5311258 5140577
57548E140577j81081j87394j90395j89835j86504j82881j80514j78180j74001
$$ 5140577 4959496 4772102 4581707 4391872 4205368 4022487 3841973 3663793 3489792
57539C489792j68169j62036j55770j48691j41081j33855j26913j19508j11836
$$ 3489792 3321623 3159587 3003817 2855126 2714045 2580190 2453277 2333769 2221933
57530B221933j04647r7623q9825q1725p4990p0022o5209n9236n2872m7761m4345
$$ 2221933 2117286 2019663 1929838 1848113 1773123 1703101 1637892 1578656 1525784 1478023 1433678
57519A433678m1745l9024l5821l2046k7745k3408k0021j8354j8044j7544j5438
$$ 1433678 1391933 1352909 1317088 1285042 1257297 1233889 1213868 1195514 1177470 1159926 1144488
57508A144488j1887q425o099m302j724J888N465P899R296J0812J3415J6744J9429
$$ 1144488 1132601 1124176 1118077 1113775 1112051 1113939 1119404 1127303 1136599 1147411 1160826 1177570 1196999
57495A196999K0700K1346K2660K4988K8009L1860L6729M1666M5419M8549N3028
$$ 1196999 1217699 1239045 1261705 1286693 1314702 1346562 1383291 1424957 1470376 1518925 1571953
57484A571953N9317O5593P0636P5615Q1930Q9029R6016J03919J14197J25939J36720
$$ 1571953 1631270 1696863 1767499 1843114 1925044 2014073 2110089 2214008 2328205 2454144 2590864
57473B590864J45753J54183J62408J69091J72968J73627J70153J60813J45007
$$ 2590864 2736617 2890800 3053208 3222299 3395267 3568894 3739047 3899860 4044867
57464D044867J24187J00014P2714M2274J0371j9944m6279o7922q5195r8445j07720
$$ 4044867 4169054 4269068 4341782 4384056 4394427 4374483 4328204 4260282 4175087 4076642 3968922
57453C968922j13089j15155j15184j14491j13666j12570j10963j08809j06082
$$ 3968922 3855833 3740678 3625494 3511003 3397337 3284767 3173804 3064995 2958913
57444B958913j02745r9046r5390r1848q8029q3499p8178p2317o6240o0014n3364
$$ 2958913 2856168 2757122 2661732 2569884 2481855 2398356 2320178 2247861 2181621 2121607 2068243
57433B068243m6043l8397l1188k4709j8411j1599m101L812J1692J8914K5212L1469
$$ 2068243 2022200 1983803 1952615 1927906 1909495 1897896 1893795 1897607 1909299 1928213 1953425 1984894
57421A984894L9226M8870N9027O8365P7133Q6234R5655J04840J14007J23721J33512
$$ 1984894 2024120 2072990 2132017 2200382 2277515 2363749 2459404 2564244 2678251 2801972 2935484
57410B935484J41975J47984J50814J49338J42300J29469J11586Q9194O2427L1999
$$ 2935484 3077459 3225443 3376257 3525595 3667895 3797364 3908950 3998144 4060571 4092570
57400D092570l93l2686o2900q9271j10831j27872j40993j49854j53637j52715
$$ 4092570 4092177 4059491 3996591 3907320 3796489 3668617 3527624 3377770 3224133 3071418
57390C071418j49016j44807j41621j39891j38730j36359j31856j26236j20993
$$ 3071418 2922402 2777595 2635974 2496083 2357353 2220994 2089138 1962902 1841909
57381A841909j16021j10146j03293r6560r0343q4066p7797p2534o8448o4446n9975
$$ 1841909 1725888 1615742 1512449 1415889 1325546 1241480 1163683 1091149 1022701 958255 898280
57370H98280n5849n2668m9752m6392m2978m0154l7785l5530l3442l1374k8787
$$ 898280 842431 789763 740011 693619 650641 610487 572702 537172 503730 472356 443569
57359D43569k5702k3032k1359k0343j9719j9591j9274j7335j3831j0991j0491
$$ 443569 417867 394835 373476 353133 333414 313823 294549 277214 263383 252392 241901
57348B41901j1238j1301j0714j0554j0292q471n772m937p079r868j0404q584o529
$$ 241901 230663 219362 208648 198094 187802 179331 173559 168622 161543 151675 141271 132687 126158
57335A26158n631n352m680l671l156l433l833l701l453m039n361o007n087l651
$$ 126158 120527 115175 110495 106824 103668 100235 96402 92701 89248 85209 79848 73841 68754 65103
57321F5103l414m377m923m198l374l899n357o020n104l591k728k636k805l154
$$ 65103 61689 57312 52389 48191 44817 40918 35561 29541 24437 20846 18118 15482 12677 9523
57307I523l780A607a923k405k094k929l642l223k373k318k989l400l153k411r23
$$ 9523 5743 1607 -1923 -4328 -6422 -9351 -12993 -16216 -18589 -20907 -23896 -27296 -30449 -32860 -33783
57292c3783J372L141K672K08k064k594j835q79j72J58N5J05J044K366K680J896
$$ -33783 -32411 -29270 -26598 -26390 -28454 -31048 -32883 -33762 -33934 -33776 -33721 -33616 -32572 -30206 -27526 -25630
57276b5630J413J631J121o95j906p51J554K538J977J705K598L662M086b359B705
$$ -25630 -24217 -22586 -21465 -22160 -24066 -24817 -23263 -20725 -18748 -17043 -14445 -10783 -6697 -2359 2705
57260H811O964P312O980O277O119P061Q386R061R182R491R815R386Q613R113J1579
$$ 8811 15775 23087 30067 36344 42463 49524 57910 66971 76153 85644 95459 104845 113458 122571 134150
57245A34150J4699J6688J6983J6064J4586J3347J3418J5408J8571K1259K2390
$$ 134150 148849 165537 182520 198584 213170 226517 239935 255343 273914 295173 317563
57234C17563K2419K2744K4217K6224K7509K7743K7959K9258L1642L4369L6982
$$ 317563 339982 362726 386943 413167 440676 468419 496378 525636 557278 591647 628629
57223F28629L9397M1245M1788M0689L8498L6175L4063L1402K7217K1707J6250
$$ 628629 668026 709271 751059 791748 830246 866421 900484 931886 959103 980810 997060
57212I97060J1696P401K745j299l462m378n740p463p780o388n294n889p209q077
$$ 997060 1008756 1016157 1018902 1017603 1014141 1009763 1004023 996560 988780 982392 977098 971209 964000 955923
57198I55923q951j0264j0913j0153r427j0391j2288j3118j2441j1211r645p021
$$ 955923 946972 936708 925795 915642 906215 895824 883536 870418 857977 846766 837121 830100
57186H30100l027K214Q717J5902K2165K6623L0315L4187L7147L7912L7509L7716
$$ 830100 827073 829287 838004 853906 876071 902694 933009 967196 1004343 1042255 1079764 1117480
57174A117480L7974L6263L2249K7220K1622J5227R215N388L507K062J645M669
$$ 1117480 1155454 1191717 1223966 1251186 1272808 1288035 1297250 1302638 1306145 1308207 1309852 1314521
57162A314521J1399J9013K5325L1091L7738M5011N1798N7475O1679O4286O6273
$$ 1314521 1325920 1344933 1370258 1401349 1439087 1484098 1535896 1593371 1655050 1719336 1785609
57151A785609O8866P1481P2260P0979O9364O8037O5463O0773N5513N1224M7207
$$ 1785609 1854475 1925956 1998216 2069195 2138559 2206596 2272059 2332832 2388345 2439569 2486776
57140B486776M2256L7243L4279L3957L4625L4124L1820K9166K8347K9765L1347
$$ 2486776 2529032 2566275 2600554 2634511 2669136 2703260 2735080 2764246 2792593 2822358 2853705
57129B853705L1234L0355L0811L2440L3094L1921L0100K8372K6326K4325K3738
$$ 2853705 2884939 2915294 2946105 2978545 3011639 3043560 3073660 3102032 3128358 3152683 3176421
57118C176421K4596K5224K4630K3314K1425J8550J5709J4871J5623J4806J0548
$$ 3176421 3201017 3226241 3250871 3274185 3295610 3314160 3329869 3344740 3360363 3375169 3385717
57107C385717M499r22n268r009j2018j4410j7083k0216k2798k4395k5752k7234
$$ 3385717 3390216 3389294 3384026 3375017 3362999 3348589 3331506 3311290 3288492 3264097 3238345 3211111
57095C211111k8622l0894l5800m3013m9903n4797n8319o1183o3295o5575o9938
$$ 3211111 3182489 3151595 3115795 3072782 3022879 2968082 2909763 2848580 2785285 2719710 2649772
57084B649772p6700q4484r3032j03195j13950j22870j30055j37976j46885j54526
$$ 2649772 2573072 2488588 2395556 2292361 2178411 2055541 1925486 1787510 1640625 1486099
57074A486099j61282j71124j85901k03095k20981k41600C5633b58229l22443l53607
$$ 1486099 1324817 1153693 967792 764697 543716 302116 35633 -258229 -580672 -934279
57064i34279l87599m21796m55477m91971n33709n79709o30474o90307p61857q43498
$$ -934279 -1321878 -1743674 -2199151 -2691122 -3224831 -3804540 -4435014 -5125321 -5887178 -6730676
57054f730676r35136j041118j164073j301647j453347j625259j824638k056408
$$ -6730676 -7665812 -8706930 -9871003 -11172650 -12625997 -14251256 -16075894 -18132302
57046a8132302k329024k656849l052220l522304m078062m737441n513516o406629
$$ -18132302 -20461326 -23118175 -26170395 -29692699 -33770761 -38508202 -44021718 -50428347
57038e0428347p409072q499149r618446j0672873j1583504j2343246j3018811
$$ -50428347 -57837419 -66336568 -75955014 -86627887 -98211391 -110554637 -123573448
57031a23573448j3699035j4433527j5190081j5850339j6263301j6316345j5923875
$$ -123573448 -137272483 -151706010 -166896091 -182746430 -199009731 -215326076 -231249951
57024b31249951j4933397j3130375j0470948p344732m510085k662623k025883
$$ -231249951 -246183348 -259313723 -269784671 -277129403 -281639488 -284302111 -286327994
57017b86327994k313715k977288l424654l118747j690780R00619M330430Q074267
$$ -286327994 -288641709 -291618997 -295043651 -298162398 -299853178 -298952559 -294622129 -286547862
57009b86547862J1632434J4634383J6835863J8122307J8538355J8273188J7578377
$$ -286547862 -274915428 -260281045 -243445182 -225322875 -206784520 -188511332 -170932955
57002a70932955J6673636J5692436J4676024J3607863J2471168J1291075J0130568
$$ -170932955 -154259319 -138566883 -123890859 -110282996 -97811828 -86520753 -76390185
56995g6390185R055233Q106475P297112O615587O032288N512918N032985M580383
$$ -76390185 -67334952 -59228477 -51931365 -45315778 -39283490 -33770572 -28737587 -24157204
56987b4157204M148554L733645L337096K964373K619665K304448K019732a264375
$$ -24157204 -20008650 -16275005 -12937909 -9973536 -7353871 -5049423 -3029691 -1264375
56978B73116J331662J147235R87152Q52946P42966O54232N82811N22802M68060
$$ 273116 1604778 2752013 3739165 4592111 5335077 5989309 6572120 7094922 7562982
56969G562982M15387L64705L17073K73997K37091K05949J77438J49160J22477
$$ 7562982 7978369 8343074 8660147 8934144 9171235 9377184 9554622 9703782 9826259
56960I826259J00016Q1394O3649M5044K6254Q503p491k1172l2563m2750n2869
$$ 9826259 9926275 10007669 10071318 10116362 10142616 10151119 10143628 10122456 10089893 10047143 9994274
56949I994274o3074p3176q3180r2322r8845j01819j02121j01036r9128r6931r5039
$$ 9994274 9931200 9858024 9774844 9682522 9583677 9481858 9379737 9278701 9179573 9082642 8987603
56938H987603r3493r3248r8076j11425j30819j49869j68053j93806k34061k83938
$$ 8987603 8894110 8800862 8702786 8591361 8460542 8310673 8142620 7948814 7714753 7430815
56928G430815l30816l65896l87481l95764l90859l75959l57127l38310l19596
$$ 7430815 7099999 6734103 6346622 5950858 5559999 5184040 4826913 4488603 4169007
56919D169007l00819k83505k68320k53594k37713k20928k03966j86834j69719
$$ 4169007 3868188 3584683 3316363 3062769 2825056 2604128 2400162 2213328 2043609
56910B043609j53337j37668j21873j05909r0921p7762o6397n6817m9039m2178
$$ 2043609 1890272 1752604 1630731 1524822 1433901 1356139 1289742 1232925 1183886 1141708
56900A141708l5001k7508k0781j5375j1212q705q411r800j1951j5093j9688k4330
$$ 1141708 1106707 1079199 1058418 1043043 1031831 1023126 1014715 1004915 992964 977871 958183 933853
56888I33853k6654k6380k5465k5116k4639k3401k1735j9499j5922j1539q217o301
$$ 933853 907199 880819 855354 830238 805599 782198 760463 740964 725042 713503 705286 698985
56876F98985l713R82O346J0202J2498J4550J6548J7431J6524J3944R755L928k999
$$ 698985 695272 696254 702600 712802 725300 739850 756398 773829 790353 804297 814052 817980 814981
56863H14981r897j5658j9542k1343k1504k0759j9501j7929j6597j5885j4954j2435
$$ 814981 805084 789426 769884 748541 727037 706278 686777 668848 652251 636366 621412 608977
56851F08977q593n622n152o376p343p192o343n227l773j779Q44L900O571P841
$$ 608977 600384 594762 589610 583234 575891 568699 562356 557129 553356 551577 552421 556321 562892 570733
56837E70733P746P671Q745J0506J1777J2379J3117J4356J5484J5843J5411J4193
$$ 570733 578479 586150 594895 605401 617178 629557 642674 657030 672514 688357 703768 717961
56825G17961J1581P000J160m063p512j0130j3666j8070k1126k1033j8383j5018
$$ 717961 729542 736542 737702 733639 726127 715997 702331 684261 663135 642102 623719 608701
56813F08701j1877r006o728n362m155j889J518N296R484J4941K1653K8318L3711
$$ 608701 596824 587818 581090 575728 571573 569684 571202 576498 585982 600923 622576 650894 684605
56800F84605L7194L8012L5704L1456K7317K3512J8140J0240J540n709j0971j4380
$$ 684605 721799 759811 795515 826971 854288 877800 895940 906180 907720 902011 891040 876660
56788H76660j5126j2597q101l763k16L202O678R856J3112J7473K3330L0311L8131
$$ 876660 861534 848937 840836 837073 836857 840059 846737 856593 869705 887178 910508 940819 978950
56775I78950M6335N3379N7243N6962N2693M4338L1415J4560l585j9369k9939l4617
$$ 978950 1025285 1078664 1135907 1192869 1245562 1289900 1321315 1335875 1332290 1312921 1282982 1248365
56763A248365l5147l4252l3156l0907k6607k1411j7196j4031j0585o575l018M3
$$ 1248365 1213218 1178966 1145810 1114903 1088296 1066885 1049689 1035658 1025073 1018498 1015480 1015523
56751A015523M226J0659J8375K5308K9763L0605K7337K0621J1735J203j0903k3030
$$ 1015523 1019749 1030408 1048783 1074091 1103854 1134459 1161796 1182417 1194152 1195355 1184452 1161422
56739A161422l2146l6556l7418l6633l4578l1077k7130k3911k0959j7126j2827
$$ 1161422 1129276 1092720 1055302 1018669 984091 953014 925884 901973 881014 863888 851061
56728H51061r522p184m219j28L433M995N334O304Q424J0438J0652P985K218n790
$$ 851061 841539 834355 830136 830008 833441 838436 843770 850074 858498 868936 879588 887573 889791 884001
56714H84001j4056k0196k2754k2172k0481j9707k0059j9889j7889j5062j3717
$$ 884001 869945 849749 826995 804823 784342 764635 744576 724687 706798 691736 678019
56703F78019j4625j6150j6490j5709j4985j4650j4051j2931j1858j1289j0986
$$ 678019 663394 647244 630754 615045 600060 585410 571359 558428 546570 535281 524295
56692E24295j0556r939r135q031o771n840n402m896l840k759k703l731m604m308
$$ 524295 513739 503800 494665 486634 479863 474023 468621 463725 459885 457126 454423 450692 446088 441780
56678D41780l380l095l615l832l085k155k045k543k778k618k499k167q93P93J027
$$ 441780 438400 435305 431690 427858 424773 422618 420573 418030 415252 412634 410135 407968 407075 407868 408895
56663D08895r90l508m273l364k625k641j893O06L374M154K690O25q16j842k855
$$ 408895 407905 404397 400124 396760 394135 391494 389601 390207 393581 397735 400425 401050 400234 398392 395537
56648C95537l522l369k470j183J09P34J15j120j435m09L83m86k196l012k929l247
$$ 395537 392015 388646 386176 384993 385102 385836 385951 384831 383396 382987 383370 382884 380688 377676 374747 371500
56632C71500l939l501j705m30q87j867j942j753k489l387k696m84J485K364K846
$$ 371500 367561 364060 362355 361925 361038 359171 357229 355476 352987 349600 346904 346420 347905 350269 353115
56617C53115L262K900J622N64N47R03N60o37k122l294l644l008k064j804k240
$$ 353115 356377 359277 360899 361463 362010 362913 363473 362836 360714 357420 353776 350768 348704 346900 344660
56602C44660k390j718p27K8N99J105J586K571M516O453O589M836L309L557M717
$$ 344660 342270 340552 339825 339853 340452 341557 343143 345714 350230 356683 363272 368108 371417 374974 379691
56587C79691N296N352N641N879N411M648M326M140L586L397M539O314P190P078
$$ 379691 384987 390339 395980 401859 407270 411918 416244 420384 423970 427367 431906 438220 445410 452488
56573D52488P052P033N649K580o02k448l116l487l930m479n247o263p547r358
$$ 452488 459540 466573 472222 474802 474200 471752 468636 465149 461219 456740 451493 445230 437683 428325
56559D28325j1557j2933j2200r753p266n669m678m096m036l763k147K43J225m5
$$ 428325 416768 403835 391635 381882 374616 368947 364269 360173 356137 352374 350227 350470 351695 351650
56545C51650j759j997j093k83M70J778K968K677Q76j009j817j419j66J327K109
$$ 351650 349891 347894 346801 346518 346988 348766 351734 354411 355287 354278 352461 351042 350876 352203 354312
56530C54312J676O91J53J50K00L76J003J552J064k97j164o77O12J739K398K808
$$ 354312 355988 356679 356832 356982 357182 357558 358561 360113 361177 360880 359716 359039 359651 361390 363788 366596
56514C66596L242M006N317O781P419O566M611K696J809K080K817L275L578M491
$$ 366596 369838 373844 379161 385942 393361 399927 404538 407234 409043 411123 413940 417215 420793 425284
56500D25284O051O994O200M395L452M116N254N585N283N446O497P606P588O078
$$ 425284 431335 438329 444529 448924 452376 456492 461746 467331 472614 478060 484557 492163 499751 505829
56486E05829L862K027Q36j81j036r51J70P84n88l200m907m978m494m066l065j701
$$ 505829 509691 511718 512554 512373 511337 510386 510556 511340 510752 507552 502645 497667 493173 489107 486042 484341
56470D84341j829m264o949p459o241n390n229m383k929k749m233n038l387q25
$$ 484341 482512 478248 471299 463840 457599 452209 446980 442597 439668 436919 432686 427648 424261 423436
56456D23436j45j794l936n151n473n195m361l451l208l547l494k493r81L27J003
$$ 423436 423291 421497 417561 412410 406937 401742 397381 393930 390722 387175 383681 381188 380207 380534 381537
56441C81537P47l83j470j339K6J368J706J361J137J249J538K063K893L638L775
$$ 381537 382284 381901 380431 379092 379118 380486 382192 383553 384690 385939 387477 389540 392433 396071 399846
56426C99846L270K580K180K312K942L790M533N027N173M793M074L823M497N069
$$ 399846 403116 405696 407876 410188 413130 416920 421453 426480 431653 436446 440520 444343 448840 453909
56412D53909L893J042j148n17K561N782P223O529M516K448J466J813K621K813
$$ 453909 457802 458844 457696 457179 459740 465522 472745 479274 483790 486238 487704 489517 492138 494951
56398D94951K195J427J137J380J737J746J383J114J192J116L66m59j63J249K380
$$ 494951 497146 498573 499710 501090 502827 504573 505956 507070 508262 509378 509744 509285 509122 510371 512751
56383E12751K350J880J928K221J935R58j86r97r71Q1J106K84k488m641l777o42
$$ 512751 515101 516981 518909 521130 523065 524023 523837 522840 521869 521950 523056 523340 520852 516211 512434 511792
56367E11792J890K158P10j328l234m433m689m655n042n439m937l561k078p47N15
$$ 511792 513682 515840 516550 515222 511988 507555 502866 498211 493169 487730 482793 479232 477154 476407 476922
56352D76922J199P99N6J35Q00Q59K24mN06Q51N45K21M24J003J856K954L569K938
$$ 476922 478121 478920 478976 479111 479911 480770 480994 480990 481496 482347 482892 483113 483537 484540 486396 489350 492919 495857
56334D95857J761J585K436K681J607M51L22O57N31M6m10j101k242l329l913m085
$$ 495857 497618 499203 501639 504320 505927 506378 506700 507357 507888 507934 507524 506423 504181 500852 496939 492854
56318D92854l723k291M8K147L227L488L081J812L51J54J373K281J765R23J067
$$ 492854 489131 486840 486888 489035 492262 495750 498831 500643 500994 501148 502521 504802 506567 507490 508557
56303E08557J525R61j91k58J246L199M541N107N022M405L674L454M062N402O927
$$ 508557 510082 511043 510852 510594 511840 515039 519580 524687 529709 534114 537788 541242 545304 550706 557633
56288E57633P552O317L704J563J194K115L182L969M426M199L369L098M425O779
$$ 557633 565185 571502 575206 576769 577963 580078 583260 587229 591655 595854 599223 602321 606746 613525
56274F13525Q510Q685P770O949P283R070J1519J3418J4311J4545J4167J3004J1916
$$ 613525 622035 630720 638490 645439 652722 661792 673311 686729 701040 715585 729752 742756 754672
56261G54672J2427J4375J5423J4025J1547J0201J0024R485Q145O990O584O467
$$ 754672 767099 781474 796897 810922 822469 832670 842694 852179 860324 867314 873898 880365
56249H80365O219N768M823L171J511R66J738L011M003M412M199L842M349O099
$$ 880365 886584 892352 897175 900346 901857 902823 904561 907572 911575 915987 920186 924028 928377 934476
56235I34476P946Q507Q115Q497J0521J3266J5424J6704J7614J8531J9463K0584
$$ 934476 942422 950929 959044 967541 978062 991328 1006752 1023456 1041070 1059601 1079064 1099648
56223A099648K2611K6242L0952L4739L6041L5821L6710L9851M3801M6998M9915
$$ 1099648 1122259 1148501 1179453 1214192 1250233 1286054 1322764 1362615 1406416 1453414 1503329
56212A503329N3838N8769O3856O9046P4884Q1152Q7174R3269J00623J09628J19306
$$ 1503329 1557167 1615936 1679792 1748838 1823722 1904874 1992048 2085317 2185940 2295568 2414874
56201B414874J28633J37853J48236J60690J74581J87961J99392K09311K18738
$$ 2414874 2543507 2681360 2829596 2990286 3164867 3352828 3552220 3761531 3980269
56192C980269K26811K31082K30562K26914K21756K14346K03105J88088J70379
$$ 3980269 4207080 4438162 4668724 4895638 5117394 5331740 5534845 5722933 5893312
56183E893312J50079J26748J01337P6027N2220K9974R276r329k5429l9182n1028
$$ 5893312 6043391 6170139 6271476 6347503 6399723 6429697 6438973 6429644 6404215 6365033 6314005
56172F314005o1547p1293q0318q8325r5779j04065j13769j23586j31877j38622
$$ 6314005 6252458 6181165 6100847 6012522 5916743 5812678 5698909 5575323 5443446 5304824
56162E304824j44825j50742j55846j59995j63376j65603j65996j64704j62628
$$ 5304824 5159999 5009257 4853411 4693416 4530040 4364437 4198441 4033737 3871109
56153C871109j60283j57252j52677j46023j37872j30092j24350j20118j15182
$$ 3871109 3710826 3553574 3400897 3254874 3117002 2986910 2862560 2742442 2627260
56144B627260j08504j01322r4795q8218q0771p3638o8720o5997o3635o0124n5331
$$ 2627260 2518756 2417434 2322639 2234421 2153650 2080012 2011292 1945295 1881660 1821536 1766205
56133A766205m9917m4681l9995l5313l0083k5372k2973k2371k0577j6198j1622
$$ 1766205 1716288 1671607 1631612 1596299 1566216 1540844 1517871 1495500 1474923 1458725 1447103
56122A447103r534r104p677m665j449J243L548N030N340N606O940Q352Q194P066
$$ 1447103 1437569 1428465 1420788 1416123 1414674 1415917 1419465 1424495 1429835 1435441 1442381 1450733 1458927 1465993
56108A465993P027Q488R924J0217R405P633N370M082M778O351P231P807R252J0890
$$ 1465993 1473020 1481508 1491432 1501649 1511054 1518687 1524057 1528139 1532917 1539268 1546499 1554306 1563558 1574448
56094A574448J1222J0814J1594J3764J6016J8395K2241K7250L1376L4031L7095
$$ 1574448 1585670 1596484 1608078 1621842 1637858 1656253 1678494 1705744 1737120 1771151 1808246
56083A808246M2325M9655N8185O6953P4839Q1767Q9904J01488J15514J28650J39185
$$ 1808246 1850571 1900226 1958411 2025364 2100203 2181970 2271874 2373362 2488876 2617526 2756711
56072B756711J47698J54095J56877J55722J52122J46880J39478J30519J22235
$$ 2756711 2904409 3058504 3215381 3371103 3523225 3670105 3809583 3940102 4062337
56063D062337J15426J08150R8580Q7256P5342O2454M7643L1409J5533J412j0959
$$ 4062337 4177763 4285913 4384493 4471749 4547091 4609545 4657188 4688597 4704130 4705542 4694583
56052D694583k3077l6911n2901o9050q3046r4883j06100j16939j25794j31121
$$ 4694583 4671506 4634595 4581694 4512644 4429598 4334715 4228615 4111676 3985882 3854761
56042C854761j32335j29355j23170j16401j11273j07132j01831r5193q9033q4179
$$ 3854761 3722426 3593071 3469901 3353500 3242227 3135095 3033264 2938071 2849038 2764859
56032B764859p9743p5260p1159o7048o1922n6293n1865m8708m4855l9148l2568
$$ 2764859 2685116 2609856 2538697 2471649 2409727 2353434 2301569 2252861 2208006 2168858 2136290
56021B136290k6337k0640j5677j2146j0123q723p276n702l800j360J223L627O421
$$ 2136290 2109953 2089313 2073636 2061490 2051367 2042644 2035368 2029666 2025866 2024506 2025729 2029356 2035777
56008B035777R988J3314J5094J5346J4786J3873J3586J5483J9332K2596K4087
$$ 2035777 2045765 2059079 2074173 2089519 2104305 2118178 2131764 2147247 2166579 2189175 2213262
55997B213262K5858K9271L1912L1453K9972L0625L2448L2651L2039L3430L6168
$$ 2213262 2239120 2268391 2300303 2331756 2361728 2392353 2424801 2457452 2489491 2522921 2559089
55986B559089L7289L7135L8843M2693M5859M7579M9929N3445N6385N8424O0848
$$ 2559089 2596378 2633513 2672356 2715049 2760908 2808487 2858416 2911861 2968246 3026670 3087518
55975C087518O3338O4621O5872O9115P2987P4784P5942Q0255Q7085R1961R3786
$$ 3087518 3150856 3215477 3281349 3350464 3423451 3498235 3574177 3654432 3741517 3833478 3927264
55964C927264R5973J00168J04439J08083J12770J18193J21983J24460J28362J33524
$$ 3927264 4023237 4123405 4227844 4335927 4448697 4566890 4688873 4813333 4941695 5075219
55954E075219J37241J40140J46098J56000J67130J78738J92202K05777K15962
$$ 5075219 5212460 5352600 5498698 5654698 5821828 6000566 6192768 6398545 6614507
55945F614507K24422K36805K54133K72205K89977L11034L35771L59786L81560
$$ 6614507 6838929 7075734 7329867 7602072 7892049 8203083 8538854 8898640 9280200
55936I280200M04477M29843M55213M80873N10517N44322N78917O15295O58488
$$ 9280200 9684677 10114520 10569733 11050606 11561123 12105445 12684362 13299657 13958145
55927A3958145P08327P58973Q08844Q62241R20106R78407J036949J100292J168802
$$ 13958145 14666472 15425445 16234289 17096530 18016636 18995043 20031992 21132284 22301086
55918B2301086J238703J311847J394907J488284J587269J694938J821881J972945
$$ 22301086 23539789 24851636 26246543 27734827 29322096 31017034 32838915 34811860
55910C4811860K147055K349482K589273K865202L171144L515014L914132M373246
$$ 34811860 36958915 39308397 41897670 44762872 47934016 51449030 55363162 59736408
55902E9736408M887629N463213O104583O785636P473247Q194557R049976J0147924
$$ 59736408 64624037 70087250 76191833 82977469 90450716 98645273 107695249 117843173
55894A17843173J1558607J3341054J5574734J8342067K1690308K5553327K9570221
$$ 117843173 129401780 142742834 158317568 176659635 198349943 223903270 253473491
55887B53473491L2931616L4559477L3632514K9970262K3877002J5749818O069201
$$ 253473491 286405107 320964584 354597098 384567360 408444362 424194180 430263381
55880D30263381m226745j3655608k0761085k4842043k6134246k5406793k3490825
$$ 430263381 426036636 412381028 391619943 366777900 340643654 315236861 291746036
55873B91746036k1074365j8665985j6571852j4907949j3678734j2844193j2326279
$$ 291746036 270671671 252005686 235433834 220525885 206847151 194002958 181676679
55866A81676679j2012175j1792774j1588724j1336625j0981196j0497516r900894
$$ 181676679 169664504 157871730 146283006 134946381 123965185 113467669 103566775
55859A03566775r222246q488358p728953o978839o260486n579634m945166m376870
$$ 103566775 94344529 85856171 78127218 71148379 64887893 59308259 54363093 49986223
55851D9986223l886066l463965l096875k779302k506317k268006k059371j883255
$$ 49986223 46100157 42636192 39539317 36760015 34253698 31985692 29926321 28043066
55843B8043066j736395j604375j476830j356492j247420j145929j049660r64418
$$ 28043066 26306671 24702296 23225466 21868974 20621554 19475625 18425965 17461547
55835A7461547q94218q33611p76564p24538o79753o38668n98453n62335n32752
$$ 17461547 16567329 15733718 14957154 14232616 13552863 12914195 12315742 11753407 11220655
55826A1220655n05953m78550m52772m30392m08137l83862l61011l42444l25905
$$ 11220655 10714702 10236152 9783380 9352988 8944851 8560989 8199978 7857534 7531629
55817G531629l09611k96111k86441k76546k63766k51086k41015k30919k18423
$$ 7531629 7222018 6925907 6639466 6362920 6099154 5848068 5607053 5376134 5157711
55808E157711k05916j95833j86684j77352j70007j65203j59415j50948j43009
$$ 5157711 4951795 4755962 4569278 4391926 4221919 4056716 3897301 3746353 3603344
55799C603344j37567j31631j23100j14725j08413j01196r1102q1652p6040p1799
$$ 3603344 3465777 3334146 3211046 3096321 2987908 2886712 2795610 2713958 2637918 2566119
55789B566119o5984o1026o0366o2123o2057n9726n7273n5075n2652n1142n1122
$$ 2566119 2500135 2439109 2378743 2316620 2254563 2194837 2137564 2082489 2029837 1978695 1927573
55778A927573n0587m8309m6406m6507m6602m4876m3339m4058m4947m3048l9340
$$ 1927573 1876986 1828677 1782271 1735764 1689162 1644286 1600947 1556889 1511942 1468894 1429554
55767A429554l6634l4985l2720k9921k7768k6285k5341k5790k7205k6920k3819
$$ 1429554 1392920 1357935 1325215 1295294 1267526 1241241 1215900 1190110 1162905 1135985 1112166
55756A112166k0566j9531j9156j7047j4029j2115j0862q768o374n044m439l623
$$ 1112166 1091600 1072069 1052913 1035866 1021837 1009722 998860 990092 983718 978674 974235 970612
55744I70612l102l390l485k759k619m310o977r474j1943j4042j4238j2740j2203
$$ 970612 967510 964120 960635 957876 955257 950947 943970 934496 922553 908511 894273 881533 869330
55731H69330j3600j4240j2210r763r672j1051j1674j1721j2168j1792r250o219
$$ 869330 855730 841490 829280 819517 809845 798794 787120 775399 763231 751439 742189 735970
55719G35970n306o149o436n509m454l858l792m727o447p315o325m405k264Q50
$$ 735970 730664 724515 718079 712570 708116 704258 700466 695739 689292 681977 675652 671247 668983 669833
55705F69833M725O965O339M920M659M182J385l125p795j3009j9315k4771k6983
$$ 669833 674558 681523 687862 692782 697441 701623 703008 699883 692088 679079 659764 634993 608010
55692F08010k6340k4677k2511j9947j8279j7930j6687j3020r338q874j0729j1279
$$ 608010 581670 556993 534482 514535 496256 478326 461639 448619 439281 430407 419678 408399
55680D08399r260o530m665l812m008m998n232l526j024M74J059J588J395l99k645
$$ 408399 399139 392609 387944 384132 380124 375126 369894 366368 365344 365818 366877 368465 369860 369461 366816
55665C66816l748m382o063q028q146o169l676j645l24m28k041l266k402o04P4
$$ 366816 363068 358686 352623 344595 336449 330280 326604 324959 324635 324207 322166 318900 316498 315894 315968
55650C15968J32J514L988N509N732O349Q064R606R831Q857P313O026N865O407
$$ 315968 316100 317614 321602 327111 332843 339192 347256 356862 366693 375550 382863 388889 394754 401161
55636D01161N616K613m29j107k26k09j350k065j939j842j877j650j921l447m902
$$ 401161 406777 409390 408961 407854 407628 407419 406069 404004 402065 400223 398346 396696 394775 391328 386426
55621C86426m387k324n71N37J826K902K905K755L749M649L296N80m80O09J417
$$ 386426 382039 379715 379144 379681 381507 384409 387314 390069 393818 398467 401763 402343 401863 402472 403889
55606D03889Q16J91K06k28j044m42J717K975K049Q42J138J801R58r80k316k634
$$ 403889 404705 404896 405102 404874 403830 403388 405105 408080 410129 410971 412109 413910 414868 413888 411572 408938
55590D08938k707k932l324m249n988q088r871j1068j1607j1393j0686j0032r616
$$ 408938 406231 403299 399975 395726 389738 381650 371779 360711 349104 337711 327025 316993 307377
55577C07377r195q612p797o633n537n620p192q776q879q150q274r292r732r032
$$ 307377 298182 289570 281773 275140 269603 263983 256791 248015 239136 230986 222712 213420 203688 194656
55563A94656q012p108o000n000m995n713n692m307k461j124m65m99j156j697j340
$$ 194656 186644 179536 173536 168536 163541 157828 152136 147829 145368 144244 143779 143280 142124 140427 139087
55548A39087n12j85j92K97Q75L02j268k293k265k303k936l072j822J7R18J79j685
$$ 139087 138575 138390 138198 138495 139370 139672 138404 136111 133846 131543 128607 125535 123713 123730 124648 124827 123142
55531A23142l198k703j53K178K133N57J00J403K430J760L93k20j02Q9K92O76J188
$$ 123142 119944 117241 117088 119266 121399 121956 122056 123459 125889 127649 128042 127822 127720 127809 128101 128777 129965
55514A29965K065L622N263N896N579N441N778N781N321N359O136O602O274O049
$$ 129965 132030 135652 140915 146811 152390 157831 163609 169390 174711 180070 186206 192808 199082 205131
55500B05131O466O618N582L645J396j142l656n142n164m563m149l641k562j239
$$ 205131 211597 218215 223797 227442 228838 227696 224040 218898 213734 209171 205022 201381 198819 197580
55486A97580k77P2l18j284j615J37L408N477M544J901J43J64Q95J260J261J451
$$ 197580 197303 197375 197057 195773 194158 194295 197703 203180 207724 209625 209768 209932 210827 212087 213348 214799
55470B14799K146L054L412K823J879J369R23m95k714m280m562m525m812m567l211
$$ 214799 216945 219999 223411 226234 228113 229482 230405 229910 227196 222916 218354 213829 209017 204450 201239
55455B01239k107k943n269p081p580p907r074j0475j0918j0348r773r786r883
$$ 201239 199132 196189 190920 183839 176259 168352 159278 148803 137885 127537 117764 107978 98095
55442I8095r465q815q484q026o414l946k548l412n199n667m411k837j971j656
$$ 98095 88630 79815 71331 63305 56891 52945 50397 46985 41786 36119 31708 28871 26900 25244
55428B5244j632j905k019j329k39Q1n18q46j64P77R53M27k7P6O47J132P98m13
$$ 25244 23612 21707 19688 18359 18120 18201 17683 16837 16673 17450 18403 18830 18803 18879 19526 20658 21456 21043
55410B1043j252l06K059L765L291J168r70j985j701o54K23K35l90q13n01N37K057
$$ 21043 19791 19485 21544 25309 28600 29768 28798 26813 25112 24458 24681 24916 24526 23713 23212 23749 25806
55393B5806L409L401J487j017j914n11J832L440L733K936J493J1j051j785k410
$$ 25806 29215 32616 34103 33086 31172 30661 32493 35933 39666 42602 44095 44106 43055 41270 38860
55378C8860k587j925q06J66J141K461L542L546K908K789L226L299K912K846L004
$$ 38860 36273 34348 33542 33708 34849 37310 40852 44398 47306 50095 53321 56620 59532 62378 65382
55363F5382K338Q43n0L70J068R79M61L43O65J038J332J485J427J443J790J912
$$ 65382 67720 68563 68513 68883 69951 70930 71391 71734 72399 73437 74769 76254 77681 79124 80914 82826
55347H2826J141J77M86J956K660J488m06j338j092n41l59p92j724k486k364j703
$$ 82826 83967 84144 84630 86586 89246 90734 90328 88990 87898 87357 86998 86206 84482 81996 79632 77929
55331G7929j568k064k090j089P5M02j03r03j562j587p39K47K43q18k068l147m208
$$ 77929 76361 74297 72207 71118 71193 71595 71492 70589 69027 67440 66701 66948 67191 66373 64305 61158 56950
55314E6950m597l314r32Q14J548K514L862L851J668r92k277k421k460k445k192
$$ 56950 52353 49039 48107 48921 50469 52983 56845 60696 62364 61372 59095 56674 54214 51769 49577
55299D9577k260k779k693j542o58j160k033j779p47k21j32M63J373J451M60o77
$$ 49577 47317 44538 41845 40303 39645 38485 36452 34673 33926 33705 33573 34036 35409 36860 37320 36643
55283C6643j332j571j361m88P89J795K026J233n75k627l513k506n05Q58O68q17
$$ 36643 35311 33740 32379 31891 32680 34475 36501 37734 37159 34532 31019 28513 28008 28866 29534 28717
55267B8717k345k220K03L157L810J550j217k017q49Q06K018K536K282J625J185
$$ 28717 26372 24152 24355 27512 31322 32872 31655 29638 28789 29595 31613 34149 36431 38056 39241
55252C9241O58q18k616k783j101P0n97j134M88K819L132J591N07L58n32k609m039
$$ 39241 39899 39081 36465 33682 32581 32651 32054 30920 31408 34227 37359 38950 39457 39815 39283 36674 32635
55235C2635l334j018J596L577M096K740N30o93k32R27J513R28q49l071m182l205
$$ 32635 29301 28283 29879 33456 37552 40292 40822 40129 39897 40824 42337 43265 42416 39345 35163 31958
55219C1958j147J24Q4m29r12j459j630p13P98J391M67j015j909j905j199k00N09
$$ 31958 30811 30935 31019 30590 29678 28219 26589 25876 26674 28065 28532 27517 25608 23703 22504 22304 22813
55202B2813P85J330K490L098J829o25k073j481K61J968L111L213J993L21m28k75
$$ 22813 23598 24928 27418 30516 32345 31720 29647 28166 28427 30395 33506 36719 38712 39033 38605 38330
55186C8330m75j341j813j602j833k840k992j050J611K615J647M79M27J081J560
$$ 38330 37855 36514 34701 33099 31266 28426 25434 24384 25995 28610 30257 30736 31163 32244 33804
55171C3804J827K333K999L165K470J480J142J587J936J552J045J403K380K596
$$ 33804 35631 37964 40963 44128 46598 48078 49220 50807 52743 54295 55340 56743 59123 61719
55157F1719J291p59k190k301j316L5Q67P72K79K21N20J94j124k413k460j300K
$$ 61719 63010 62251 60061 57760 56444 56479 57346 58118 58397 58618 59138 59332 58208 55795 53335 52035 52037
55140E2037O04L68m64j325j282J20J794J866k6j870j708k83j9j489k488j149J422
$$ 52037 52641 53009 52545 51220 49938 50058 51852 53718 53692 51822 50114 49831 49812 48323 45835 44686 46108
55123D6108K726J917P4j634k594k258p61M05P0o78j06J049M47j779k532j18L379
$$ 46108 48834 50751 50825 49191 46597 44339 43578 43983 44053 43375 43269 44318 44765 42986 40454 40336 43715
55106D3715N241N320M705L453J604N23J089J788Q03j156k100j797j435j187l64
$$ 43715 48956 54276 58981 62434 64038 64561 65650 67438 68241 67085 64985 63188 61753 60566 60202
55091F0202N73M01p36j464j228m90O49K080K409K38l281n237m474k460n84J338
$$ 60202 60775 61176 60440 58976 57748 57258 57907 59987 62396 62634 59353 54116 49642 47182 46598 47936
55075D7936L396M479L884K628K120K478K804K431J338N3o25k69P53J900L097M054
$$ 47936 51332 55811 59695 62323 64443 66921 69725 72156 73494 73547 72922 72653 73406 75306 78403 82457
55059H2457L761J844j77m62P15J488R99r1j251k404k831j666L24J275Q28M45R67
$$ 82457 86218 88062 87885 87423 88138 89626 90625 90534 89283 86879 84048 82382 82706 83981 84809 85254 86221
55042H6221J575J594J442J253L77j026j561p26Q2l82j382j401p9J809L346L752
$$ 86221 87796 89390 90832 92085 92462 91436 89875 89149 89231 88849 87467 86066 85987 87796 91142 94894
55026I4894K814J563J519K607L029J756k9o85l4J148K262K707J794r7j258o00
$$ 94894 97708 99271 100790 103397 106426 108182 108153 107468 107434 108582 110844 113551 115345 115248 113990 113390
55010A13390R15J597R91j00p47l47J099K541K657J602R62J344J380m8j993k913
$$ 113390 114305 115902 116893 116793 116046 115699 116798 119339 121996 123598 124560 125904 127284 127236 125243 122330
54994A22330k790k493k144j436p39m38lJ007J723J183R3j34M36N91J17j3N20R26
$$ 122330 119540 117047 114903 113467 112728 112290 112287 113294 115017 116200 116293 116159 116595 117186 117303 117290 117810 118736
54976A18736P46L72j36j261k661k898j338O41J198K30p37n39M79J212J075L86
$$ 118736 119482 119854 119718 118457 115796 112898 111560 112201 113399 113629 112892 112353 112832 114044 115119 115505
54960A15505j86j91M47J439K121J709P4j814k645k029p04M24R68Q82K01p64j526
$$ 115505 115319 115128 115575 117014 119135 120844 120918 119104 116459 114430 113726 114150 115118 116000 116201 115437 113911
54943A13911j914k151k350k397k299k056j306J62J553J712Q04L76J348K879L682
$$ 113911 111997 109846 107496 105099 102800 100744 99438 99600 101153 102865 103669 104045 105393 108272 111954
54928A11954L416K248K28k021l020k001j54Q35R15J157J645J379K96o1J506M114
$$ 111954 115370 117618 117846 115825 112805 110804 110650 111485 112400 113557 115202 116581 116877 116816 118322 122436
54912A22436N640M864K381j38j168p3K764O194Q755R338P881N609M279M916P156
$$ 122436 128076 132940 135321 135183 134015 133942 136706 142900 151655 160993 168874 174483 178762 183678 190834
54897A90834R651J1075J1083J0674J1252J2863J3769J2585J0436R790J1155J2352
$$ 190834 200485 211560 222643 233317 244569 257432 271201 283786 294222 304012 315167 327519
54885C27519J1371Q636N697K976q2l574o977r876j1823j2086j0643r035q982j0267
$$ 327519 338890 347526 353223 356199 356117 352543 345566 335690 323867 311781 301138 292103 283121 272854
54871B72854j1110j0487r100p886o797n530m595m815o018o853o082l834j396K34
$$ 272854 261744 251257 242157 234271 227474 221944 217349 212534 206516 199663 193581 189747 188351 188585
54857A88585J302K518L719M065L628L730N195P108Q196Q780J0282J2996J5490
$$ 188585 189887 192405 196124 200189 203817 207547 212742 219850 228046 236826 247108 260104 275594
54844B75594J6293J5241J2892R455M946l7m329p012q075q334q805r864j0861j0661
$$ 275594 291887 307128 320020 329475 334421 334384 330055 323043 314968 306634 297829 287965 277104 266443
54830B66443q905o683n720o626q206q862q498q487r522j0362r397o947m995m691
$$ 266443 257538 250855 245135 238509 230303 221441 212943 204456 194934 184572 175175 168228 163233 158542
54816A58542n155m974l915k696j774j111p52r68j824k934l601l216j882o24n18
$$ 158542 153387 148413 144498 141802 140028 138917 138165 137197 135373 132439 128838 125622 123740 123116 122598
54801A22598j416k088j811j223j301k130l078l658l592k505m02J711K505J787
$$ 122598 121182 119094 117283 116060 114759 112629 109551 105893 102301 99796 99394 101105 103610 105397
54787A05397P62N69R70Q63j08j009q28J82Q63O61Q1l77q88j561j896j648j460
$$ 105397 106159 106728 107698 108561 108453 107444 106616 106798 107661 108322 108403 108026 107138 105577 103681 102033 100573
54770A00573j760j677k16J924L033K652J933J772K015K534L570M670M693L524
$$ 100573 98813 97136 96920 98844 101877 104529 106462 108234 110249 112783 116353 121023 125716 129240
54756A29240K499K401K265J132o2M50K869N501O591N921M776M786O459Q656R940
$$ 129240 131739 134140 136405 137537 137475 137925 140794 146295 152886 158807 163583 168369 174828 183484 193424
54741A93424J0335J0939J2005J2626J2662J3343J5214J6800J6454J4471J2219
$$ 193424 203759 214698 226703 239329 251991 265334 280548 297348 313802 328273 340492
54730C40492J0124P779N234K901N84j994m106m713m118l816m686o230p521q026
$$ 340492 350616 358395 363629 366530 367114 365120 361014 356301 352183 348367 343681 337451 329930 321904
54716C21904p548o226m706l700l386l552m137m900m987l667j450L23J107J742
$$ 321904 314356 308130 303424 299724 296338 292786 288649 283749 278762 275095 273645 273968 275075 276817
54702B76817L164N147O599O951O933P971J0808J4737J8314K0614K1586K1454K0429
$$ 276817 279981 285128 291727 298678 305611 313582 324390 339127 357441 378055 399641 421095 441524
54689D41524J8911J7283J5365J2696R269N362Q11m483r388j2214j2955j3549j5329
$$ 441524 460435 477718 493083 505779 515048 520410 521221 516738 507350 495136 482181 468632 453303
54676D53303j7376j8105j7314j5878j4404j3244j2923j3496j4098j3941j3221
$$ 453303 435927 417822 400508 384630 370226 356982 344059 330563 316465 302524 289303
54665B89303j2412j1388r971q492p142n660m290l991m852n479m932m088m012m203
$$ 289303 276891 265503 255532 247040 239898 234238 229948 225957 221105 215626 210694 206606 202594 198391
54651A98391l774l119k865k390j137l27j275k742k236L53K592K922K141J406Q09
$$ 198391 194617 191498 188633 186243 185106 184779 183504 180762 178526 178879 181471 184393 186534 187940 188749
54636A88749M36R44K273L254L210K784K589K170J037l38j229j619j853j925j680
$$ 188749 189185 190129 192402 195656 198866 201650 204239 206409 207446 207108 205879 204260 202407 200482 198802
54621A98802j249q28l09N59J801L018L582L169K334K078K601L116L267L785N047
$$ 198802 197553 196725 196416 196975 198776 201794 205376 208545 210879 212957 215558 218674 221941 225726 230773
54606B30773N994N607M603M457N248N935O197O629P377P941Q174Q353Q429Q400
$$ 230773 236767 242374 246977 251434 256682 262617 268814 275443 282820 290761 298935 307288 315717 324117
54592C24117Q922J0292J1309J0638Q988Q339R336J1079J3166J5998J8944K0251
$$ 324117 333039 343331 354640 365278 374266 382605 391941 403020 416186 432184 451128 471379
54580D71379J9201J6824J4147J1358Q908P432O038K555l454r562j3275j4676j5245
$$ 471379 490580 507404 521551 532909 541817 549249 555287 557842 554388 544826 531551 516875 501630
54567E01630j5508j5071j4081j3328j3360j4198j5457j6274j5820j4330j2907
$$ 501630 486122 471051 456970 443642 430282 416084 400627 384353 368533 354203 341296
54556C41296j1992j0942r368p808o585n300m081m021n393o466n379k535l7Q20
$$ 341296 329304 318362 308994 301186 294601 289301 285220 281199 275806 269340 263961 261426 261389 262209
54542B62209M36l10j048j646j793j308o73q47k353m420n452m736l286k549k717
$$ 262209 262645 262335 261287 259641 257848 256540 255867 255020 252667 248247 242795 238059 234773 232224 229507
54527B29507l056l306l736m168m203m179m674n091m224k269r41j281k590l789
$$ 229507 226451 223145 219409 215241 211038 206859 202185 197094 192870 190601 189660 188379 185789 182000
54513A82000m522m637l906k701j868j588j376j276j714k247j972j286j414k041
$$ 182000 177478 172841 168935 166234 164366 162778 161402 160126 158412 156165 154193 152907 151493 149452
54499A49452j563n6M47m81m88J753M002L875K604K787M033L791J731L48J225L231
$$ 149452 147889 147833 148280 147799 147311 149064 153066 156941 159545 162332 166365 170156 171887 172235 173460 176691
54483A76691M758N522N645M937L884L880N496P431Q087P432O754O989P859Q277
$$ 176691 181449 186971 192616 197553 201437 205317 210813 218244 226331 233763 240517 247506 255365 263642
54469B63642P324N152L058K329K796K850J183j692l947m522m365n242p385q941
$$ 263642 270966 276118 279176 281505 284301 287151 288334 286642 282695 278173 273808 268566 261181 252240
54455B52240q148n586l498l370m865o755p943p786o551n402n038m604l156j652
$$ 252240 244092 238506 235008 231638 226773 220018 212075 204289 197738 192336 187298 182694 179538 177886
54441A77886j798l176l639k624j795j900j508P8J103K45r61n57P40J048N42Q10
$$ 177886 176088 172912 169273 166649 164854 162954 161446 161524 162627 162872 161911 161354 162094 163142 163684 164494
54425A64494J897K403J909J186M54n45j046O0K141L302L006K484K482K332J486
$$ 164494 166391 168794 170703 171889 172343 171798 170752 170812 172953 176255 179261 181745 184227 186559 188045
54410A88045M01m35r58p45P60K873L863L117K012K115L242L873K924P91r44r91
$$ 188045 188446 188011 187053 186308 187068 189941 193804 196921 198933 201048 204290 208163 211087 211878 210934 209943
54394B09943R7K32j653l938m253k547r18p19j301j660j789j969k088k112k364
$$ 209943 210040 210272 208619 204681 200428 197881 196963 196244 194943 193283 191494 189525 187437 185325 182961
54379A82961k859l082k735k041j306p58o74q73m59R04J795O42j678k534j043Q10
$$ 182961 180102 177020 174285 172244 170938 170180 169506 168633 168174 169078 170873 171515 169837 167303 166260 167070
54363A67070J134N69Q17K099L266L485K682J059p71j670j069K23J050J454K258
$$ 167070 168204 168773 169590 171689 174955 178440 181122 182181 181410 179740 178671 178894 179944 181398 183656
54348A83656L489M202L831K953K449K512K757K891K960L127L494M072M681M862
$$ 183656 187145 191347 195178 198131 200580 203092 205849 208740 211700 214827 218321 222393 227074 231936
54334B31936M233L134K582L109L828L439K196J817K930L755K292q28l012l006
$$ 231936 236169 239303 241885 244994 248822 252261 254457 256274 259204 262959 265251 264423 261411 258405
54320B58405k170k344l499m118l236j543n68j032k112k605k696l723n899p421
$$ 258405 256235 253891 250392 246274 243038 241495 240927 239895 237783 235178 232482 228759 222860 215439
54306B15439o769m929l860l540k290J11J674R52j030k301k039o12J262K541K144
$$ 215439 208670 203741 199881 196341 194051 194162 195836 196788 195758 193457 191418 190806 192068 194609 196753
54291A96753J27k020k951k630j578P6K107L712M400M653M921M698L581K445K402
$$ 196753 196880 194860 191909 189279 187701 187777 189884 193596 197996 202649 207570 212268 215849 218294 220696
54276B20696L132L365K729J912J234M02l48j49R57J537N04j430k813l378m017
$$ 220696 223828 227193 229922 231834 233068 233470 233122 232973 233930 235467 235971 234541 231728 228350 224333
54261B24333n195o227o231n134l494j941j077j396k785m348n240n479n538n373
$$ 224333 219138 212911 206680 201546 198052 196111 195034 193638 190853 186505 181265 175786 170248 164875
54247A64875m593l484k985l278l309k257r17p42j848k831k510j211j34J6m19n78
$$ 164875 160282 156798 153813 150535 147226 144969 144052 143310 141462 138631 136121 134910 134776 134792 134373 133795
54231A33795l0P12O71m85k004k941l127l025k976k949k677j701K57K511L575K735
$$ 133795 133765 134477 135148 134663 132659 129718 126591 123566 120590 117641 114964 113263 113520 116031 119606 122341
54215A22341J069J50J29K6m62o02k6O60R56J161J632K131K364K492K728K958L092
$$ 122341 123410 123560 123689 123715 123253 122651 122625 123285 124241 125402 127034 129165 131529 134021 136749 139707 142799
54198A42799L255L254K429N59j493k519k202j272n75k92K6P72J701K087J614Q02
$$ 142799 146054 149308 151737 152296 150803 148284 146082 144810 144235 143943 143969 144741 146442 148529 150143 150945
54182A50945L80L76K69j70o93j101j338j186m64L40L74l98q67r6J396K098J179
$$ 150945 151325 151701 151970 151800 151107 150006 148668 147482 147018 147358 147732 147334 146467 146371 147767 149865 151044
54165A51044o96k248k917l002k618j241J192L304L426J657k90j376k123k820k519
$$ 151044 150348 148100 145183 142181 139563 138322 139514 142818 146244 147901 147611 146235 144112 141292 138773
54150A38773p79R16J055L64N75J580J756O62m72r59j483k410k969k578j633n59
$$ 138773 137994 138910 139965 140329 140904 142484 144240 144902 144430 143471 141988 139578 136609 134031 132398 131839
54134A31839N98J334Q83j84k06J084J777N43j255j444l0R85J62k093m362n285
$$ 131839 132437 133771 134654 134470 134264 135348 137125 137668 136413 134969 134939 135924 136086 133993 129631 124346
54118A24346m156j454J283K624K330J096l15j503k496l593m574m204j565K045
$$ 124346 120190 118736 120019 122643 124973 126069 125754 124251 121755 118162 113588 109384 107819 109864
54104A09864L923L155J665J388J818J477M64J10Q52J963K727K711J432q57k569
$$ 109864 113787 116942 118607 119995 121813 123290 123754 123864 124716 126679 129406 132117 133549 132692 130123
54089A30123k399j101l76l98j5R03J227O94M44R47J016k13j778k351k146k177
$$ 130123 127724 126623 126247 125849 125834 126737 127964 128658 129102 130049 131065 130852 129074 126723 124577 122400
54073A22400k395j813j13J839K976K777J292p98k346k644k126j532p58N57J616
$$ 122400 120005 118192 118079 119918 122894 125671 126963 126165 123819 121175 119049 117517 116759 117316 118932
54058A18932J017r02j736j07K136K234M01m55J080K847K067j112m083m837l360
$$ 118932 119949 119047 117311 117204 119340 121574 121975 121520 122600 125447 127514 126402 122319 117482 114122
54043A14122p23J783K890K107M42n20l04K88N18L57k8m54m51K62J029J005N47
$$ 114122 113399 115182 118072 120179 120621 120101 119797 120085 120603 120960 120932 120478 120027 120289 121318 122323 122870
54026A22870P65J659J965J113L4l53k22P9O77J182M75j496k862k076j28Q43M73
$$ 122870 123635 125294 127259 128372 128406 128053 127831 127910 128587 129769 130244 128748 125886 123810 123682 124525 124998
54009A24998K53J041K008K152J691J498J924K495K456J516K71k89JJ93m43j236
$$ 124998 125251 126292 128300 130452 132143 133641 135565 138060 140516 142032 142303 142014 142015 142208 141765 140529
53993A40529r93L89J932K961L567L797L330K232J281J186J818K482K711K709L131
$$ 140529 139536 139925 141857 144818 148385 152182 155512 157744 159025 160211 162029 164511 167222 169931 173062
53978A73062M498O454P667O888M380K088K056M569P884R919J0094R432Q993Q804
$$ 173062 177560 184014 191681 198569 202949 205037 207093 211662 219546 229465 239559 248991 257984 266788
53964B66788Q425P886P410O808N978N578O144O750N859L480J351O83J025J625
$$ 266788 275213 283099 290509 297317 303295 308873 315017 321767 327626 331106 332457 333140 334165 335790
53950C35790K465L212K578l4l121m527l807k320j448j590k313k812k635k402l146
$$ 335790 338255 341467 344045 344011 340890 336363 332556 330236 328788 327198 324885 322073 319438 317036 313890
53935C13890m492m695l198j840k315l718m221m045m698n953n991m437l044k823
$$ 313890 309398 304703 301505 299665 297350 293632 289411 285366 280668 274715 268724 264287 261243 258420
53921B58420k580j206K82K69j021j938j639q55o96j429k396k704k020q72l7L26
$$ 258420 255840 254634 254916 255185 254164 252226 250587 249732 249036 247607 245211 242507 240487 239615 239578 239904
53905B39904O72J340K261L172L625K997J282l41o31R2L94j95n85J13J313J977
$$ 239904 240576 241916 244177 247349 250974 253971 255253 254912 254281 254373 254767 254572 253987 254100 255413 257390
53889B57390J927J564J034M82M01J051K012K956M286O257P935Q051O647N010M024
$$ 257390 259317 260881 261915 262397 262798 263849 265861 268817 273103 279360 287295 295346 301993 307003 311027
53874C11027L524L215L287L697L782L192K584K636K825K122P49K02J263K868L516
$$ 311027 314551 317766 321053 324750 328532 331724 334308 336944 339769 341891 342640 342842 344105 346973 350489
53859C50489L070K416K017J788K096L593N893P500P529O682O060N838N667N720
$$ 350489 353559 355975 357992 359780 361876 365469 371362 378862 386391 393073 399133 404971 410638 416358
53845D16358O402P421P976P767P253P013P264P757P815O705M505K257Q40Kj018
$$ 416358 422760 430181 438157 445924 453177 460190 467454 475211 483026 489731 494236 496493 497333 497335 496317
53830D96317k270l211l701m139m667n013n109n311n957p150q907j0921j2256j1963
$$ 496317 494047 490836 487135 482996 478329 473316 468207 462896 456939 449789 440882 429961 417705 405742
53816D05742j0241q499p898q234q497q264q124q701r631r837q838p342o291n669
$$ 405742 395501 387002 379104 370870 362373 354109 345985 337284 327653 317816 308978 301636 295345 289676
53802B89676m918m182m264n153n645m912l676l227l811m631m993m835m444m135
$$ 289676 284758 280576 276312 271159 265514 260602 256926 253699 249888 245257 240264 235429 230985 226850
53788B26850m042l902l405k867k986l667l873k970j489k47L93Q8j406l080l031
$$ 226850 222808 218906 215501 212634 209648 205981 202108 199138 197649 197402 197795 197883 196477 193397 190366
53773A90366j000P44M74l96N06K777L878K919J485Q01L25l64m69L18P20l46k052
$$ 190366 189366 190110 190584 190188 190694 193471 197349 200268 201753 202554 202879 202515 202046 202364 203084 202738 200686
53756B00686k748k038p83L58J539L080M770N790N287L361J388Q64J882L291M138
$$ 200686 197938 195900 195117 195475 197014 200094 204864 210654 215941 219302 220690 221554 223436 226727 230865
53741B30865M393M364M291M489N145N886O196O169O200O143N623N054N302O371
$$ 230865 235258 239622 243913 248402 253547 259433 265629 271798 277998 284141 289764 294818 300120 306491
53727C06491P330P554P246O702N935N052M170L097J848J160J433J633N19j240
$$ 306491 313821 321375 328621 335323 341258 346310 350480 353577 355425 356585 358018 359651 360170 358930
53713C58930j703m29R11Q30n25k342m046m882m223k849k480l499m514m656m694
$$ 358930 357227 356798 357709 358539 358014 355672 351626 346744 342521 339672 337192 333693 329179 324523 319829
53698C19829n241n536m961m218l886l171j364O07J362Q72q7j251k569l442l531
$$ 319829 314588 309052 304091 299873 295987 292816 291452 292059 293421 294293 294206 292955 290386 286944 283413
53683B83413l510l856l764k409n48M49M23O4n64j758k971l297k806k224j579m50
$$ 283413 279903 276047 272283 269874 269326 269775 270198 270262 269698 267940 264969 261672 258866 256642 255063 254613
53667B54613Q16J411J344J208R24M7q67o24P53J836J683P82q3o70o82M15K344
$$ 254613 255429 256840 258184 259392 260316 260363 259496 258872 259625 261461 263144 263926 263843 263173 262491 262906 265250
53650B65250L731L637K705K118K113K278K779M171O039O864N739L696K686L473
$$ 265250 268981 272618 275323 277441 279554 281832 284611 288782 294821 301685 307424 311120 313806 317279
53636C17279N122O466P354Q072Q384P920P089O663O685O609O389O545P125P680
$$ 317279 322401 328867 336221 344293 352677 360597 367686 374349 381034 387643 394032 400577 407702 415382
53622D15382Q141Q608Q251O007K773J154K135L517K984J317R23K179L340L576
$$ 415382 423523 432131 440382 446389 449162 450316 452451 455968 458952 460269 461192 463371 466711 470287
53608D70287L971N233O209N542L594J914J416J729J914J350J46j075j797k048
$$ 470287 474258 479491 485700 491242 494836 496750 498166 499895 501809 503159 503305 502230 500433 498385
53594D98385k006j514l65J049J936J881J181L65j80l23k55m23j093k026k749k933
$$ 498385 496379 494865 494500 495549 497485 499366 500547 500912 500732 500409 500154 499731 498638 496612 493863 490930
53578D90930k504j617p20l11m49q00j133j262o34J150L196L776K427P21L28J153
$$ 490930 488426 486809 486089 485778 485329 484529 483396 482134 481500 482650 485846 489622 492049 492770 493098 494251
53562D94251K013K303K026J145rl46P92K459L307L578M790P390R868J0290Q155
$$ 494251 496264 498567 500593 501738 501729 501383 502175 504634 507941 511519 516309 523699 533567 543857 552012
53547E52012M833K649L169N655P638P676P012P701R772J1482J1919J1874J2152
$$ 552012 556845 559494 562663 568318 575956 583632 590644 598345 608117 619599 631518 643392 655544
53534F55544J2467J2263J1649J1086J0868J1124J1714J2128J2043J1935J2479
$$ 655544 668011 680274 691923 703009 713877 725001 736715 748843 760886 772821 785300
53523G85300J3506J4190J4111J3394J2232J1003J0455J0791J0893R692P980P578
$$ 785300 798806 812996 827107 840501 852733 863736 874191 884982 895875 905567 913547 921125
53511I21125Q743R764R351Q069P067O550O006N122L926K734K140K332K354J051
$$ 921125 929868 939632 948983 957052 964119 970669 976675 981797 985723 988457 990597 992929 995283 996334
53497I96334j138k365j696l05R9p61j782j791m85J281J946O68j566k883k652j784
$$ 996334 995196 992831 991135 990830 990929 990168 988386 986595 986110 987391 989337 990005 988439 985556 982904 981120
53481I81120j018j70Q22J335J128Q11Q07Q35R35J732L111L878L589L555M962P020
$$ 981120 980102 979932 980754 982089 983217 984028 984835 985670 986605 988337 991448 995326 998915 1002470 1007432 1014452
53465A014452Q253Q657R211R924J0011R655J0088J1784J3968J6086J8526K1430
$$ 1014452 1022705 1031362 1040573 1050497 1060508 1070163 1080251 1092035 1106003 1122089 1140615 1162045
53453A162045K3899K5119K5523K6034K6693K6927K7079K8604L2302L6879M0022
$$ 1162045 1185944 1211063 1236586 1262620 1289313 1316240 1343319 1371923 1404225 1441104 1481126
53442A481126M0806M0480M0815M2377M4632M7009M9104N0444N1026N1882N4023
$$ 1481126 1521932 1562412 1603227 1645604 1690236 1737245 1786349 1836793 1887819 1939701 1993724
53431A993724N6867N8691N8946N9043O0432O2706O4277O4303O3339O2497O2596
$$ 1993724 2050591 2109282 2168228 2227271 2287703 2350409 2414686 2478989 2542328 2604825 2667421
53420B667421O3838O5705O7140O7265O6037O4285O3183O3406O4367O4441O2593
$$ 2667421 2731259 2796964 2864104 2931369 2997406 3061691 3124874 3188280 3252647 3317088 3379681
53409C379681N9685N7571N6907N6602N5358N2796M9019M4317L9773L7027L6584
$$ 3379681 3439366 3496937 3553844 3610446 3665804 3718600 3767619 3811936 3851709 3888736 3925320
53398C925320L7093L6925L5713L3727L0715K6475K1822J7767J4081R762M779K39
$$ 3925320 3962413 3999338 4035051 4068778 4099493 4125968 4147790 4165557 4179638 4189400 4194179 4194418
53386D194418l163n956q977j2417j6084j9980k4253k8912l3699l8148m1815m4720
$$ 4194418 4191255 4185299 4176322 4163905 4147821 4127841 4103588 4074676 4040977 4002829 3961014 3916294
53374C916294m7372n0056n2297n3451n3791n4437n6120n8306n9696n9466n7912
$$ 3916294 3868922 3818866 3766569 3713118 3659327 3604890 3548770 3490464 3430768 3371302 3313390
53363C313390n6012n4342n2635n0494m8231m6445m4957m2918m0087l7136l4298
$$ 3313390 3257378 3203036 3150401 3099907 3051676 3005231 2960274 2917356 2877269 2840133 2805835
53352B805835l0724k5752k0117j5009j0552o138j671K565P017J2373J8057K2473
$$ 2805835 2775111 2749359 2729242 2714233 2703681 2697543 2695872 2698437 2705454 2717827 2735884 2758357
53340B758357K5221K7965L2384L8058M3266M7388N1519N6666O2117O6071O7800
$$ 2758357 2783578 2811543 2843927 2881985 2925251 2972639 3024158 3080824 3142941 3209012 3276812
53329C276812O8808P1569P7033Q3650Q9074R2639R5681R9561J04132J08493J12583
$$ 3276812 3345620 3417189 3494222 3577872 3666946 3759585 3855266 3954827 4058959 4167452 4280035
53318D280035J17186J22545J27780J31959J35142J37879J40134J41401J41785
$$ 4280035 4397221 4519766 4647546 4779505 4914647 5052526 5192660 5334061 5475846
53309E475846J42127J42778J42866J41314J38306J35143J32711J30515J27317
$$ 5475846 5617973 5760751 5903617 6044931 6183237 6318380 6451091 6581606 6708923
53300F708923J22391J16148J09676J03702R7942R1674Q4893P8274P1739O3896
$$ 6708923 6831314 6947462 7057138 7160840 7258782 7350456 7435349 7513623 7585362 7649258
53290G649258N3739M2357L1807K2486J2740J176j1818k5174l8521n1914o5042
$$ 7649258 7702997 7745354 7777161 7799647 7812387 7813563 7801745 7776571 7738050 7686136 7621094
53279G621094p7525q9425j00659j10387j17714j22750j26424j29376j31557j32814
$$ 7621094 7543569 7454144 7353485 7243098 7125384 7002634 6876210 6746834 6615277 6482463
53269F482463j33486j34435j36530j39816j43129j44870j44289j41817j38308
$$ 6482463 6348977 6214542 6078012 5938196 5795067 5650197 5505908 5364091 5225783
53260E225783j34582j31423j29020j26292j21836j15800j09802j04693r9705r4317
$$ 5225783 5091201 4959778 4830758 4704466 4582630 4466830 4357028 4252335 4152630 4058313
53250D058313q9443q5615q1440p5501o8853o3749o0337n6538n1168m5492m1235
$$ 4058313 3968870 3883255 3801815 3726314 3657461 3593712 3533375 3476837 3425669 3380177 3338942
53239C338942l8496l6108l2941k8381k2612j6950j2959j0613q221m680r37J549
$$ 3338942 3300446 3264338 3231397 3203016 3180404 3163454 3150495 3139882 3131661 3126981 3126044 3127593
53227C127593L080N264Q715J2390J5389J8467K2982K8771L3960L7094L8917M1351
$$ 3127593 3130673 3135937 3144652 3157042 3172431 3190898 3213880 3242651 3276611 3313705 3352622 3393973
53215C393973M5036M8690N1009N2222N3330N4570N5518N6168N6990N8079N9128
$$ 3393973 3439009 3487699 3538708 3590930 3644260 3698830 3754348 3810516 3867506 3925585 3984713
53204C984713O0026O0642O0105N7411N2976M8710M6123M4874M3520M1105L7639
$$ 3984713 4044739 4105381 4165486 4222897 4275873 4324583 4370706 4415580 4459100 4500205 4537844
53193D537844L3560K9217K4730K0017J4918R270K791m753j2950k0621k6892l2218
$$ 4537844 4571404 4600621 4625351 4645368 4660286 4669556 4672347 4667594 4654644 4634023 4607131 4574913
53181D574913l7726m3724m9577n4928o0037o4879o8783p1278p2592p3169p3431
$$ 4574913 4537187 4493463 4443886 4388958 4328921 4264042 4195259 4123981 4051389 3978220 3904789
53170C904789p4096p5757p7741p8461p7405p5962p5625p6237p6723p6782p6905
$$ 3904789 3830693 3754936 3677195 3598734 3521329 3445367 3369742 3293505 3216782 3140000 3063095
53159C063095p7256p7446p7162p6320p4918p3260p1811p0202o7215o2675n8526
$$ 3063095 2985839 2908393 2831231 2754911 2679993 2606733 2534922 2464720 2397505 2334830 2276304
53148B276304n6572n5777n3508m9420m6185m5858m7231m7760m6791m5581m5052
$$ 2276304 2219732 2163955 2110447 2061027 2014842 1968984 1921753 1873993 1827202 1781621 1736569
53137A736569m4854m4224m2573l9550l5599l2381l1556l2936l4660l5187l4455
$$ 1736569 1691715 1647491 1604918 1565368 1529769 1497388 1465832 1432896 1398236 1363049 1328594
53126A328594l3114l1554l0074k9108k8760k8555k8161k7904k8180k8643k8456
$$ 1328594 1295480 1263926 1233852 1204744 1175984 1147429 1119268 1091364 1063184 1034541 1006085
53115A006085k7187k5253k3585k2857k2768k2132k0222j7971j7019j7505j7839
$$ 1006085 978898 953645 930060 907203 884435 862303 842081 824110 807091 789586 771747
53104G71747j7137j6611j7520j8790j8219j5584j2929j1749j1463j0957j0305
$$ 771747 754610 737999 720479 701689 683470 667886 654957 643208 631745 620788 610483
53093F10483j0218j0805j1631j2272j2217j0870q333n734m257m215n219o722p999
$$ 610483 600265 589460 577829 565557 553340 542470 534137 528403 524146 519931 514712 507990 499991
53080D99991q219p126n214k999q04O21K73j656l436l716l038k618k423j594j47
$$ 499991 491772 484646 479432 476433 475629 476250 476523 474867 471431 467715 464677 462059 459636 458042 457895
53065D57895R41J185J044J086J481K192K812K626J497L39j72p12k053l300k914
$$ 457895 458836 460021 461065 462151 463632 465824 468636 471262 472759 473098 472926 472214 470161 466861 463947
53050D63947j194q2n36j752l012m502n856n824m286l012l292m168m243l969m633
$$ 463947 462753 462671 462135 460383 457371 452869 447013 441189 436903 433891 430599 426431 422188 418219 413586
53035D13586o042o960p089p041o675n358l800l778n505o917o444n223n303o507
$$ 413586 407544 400584 393495 386454 379779 374421 370621 366843 361338 354421 347977 342754 337451 330944
53021C30944o661m776k490j696j937j316M79J586O80j168k147k199k451k876k378
$$ 330944 324283 319507 317017 315321 313384 312068 312547 314133 314813 313645 311498 309299 306848 303972 301594
53006C01594j142r55k557m208m033k422r70j13O53J100N15o79j238j015j123k021
$$ 301594 300452 299497 296940 292732 288699 286277 285307 285194 285847 286947 287462 286783 285545 284530 283407 281386
52990B81386k764k488j355J98J959L239K979J314j04j88Q0q06k643l945m068l661
$$ 281386 278622 276134 274779 274977 276936 280175 283154 284468 284364 284176 284256 283450 280807 276862 272794 269133
52974B69133l256k644j742j118j185j531j351l38R98J613P53j100k178j072J433
$$ 269133 265877 263233 261491 260373 259188 257657 256306 255968 256966 258579 259332 258232 256054 254982 256415
52959B56415K855J579j430l719l787k171n72k63j147k018j746m16P30O33n26j648
$$ 256415 259270 260849 259419 255700 251913 249742 249170 248907 247760 245742 243996 243580 244310 244943 244417 242769
52943B42769j878j189r0Q82J359J210O13Nk14M3N86J206J838K384K561K162J529
$$ 242769 240891 239702 239612 240494 241853 243063 243676 243681 243467 243510 244096 245302 247140 249524 252085 254247 255776
52926B55776J422K133L020L283L002K909L321L860M256M749N534O358O890P003
$$ 255776 257198 259331 262351 265634 268636 271545 274866 278726 282982 287731 293265 299623 306513 313516
52912C13516O445M904K788J235Q06P04j9r71r41L86K030K960K958K370J714J437
$$ 313516 319961 324865 327653 328888 329694 330398 330379 329408 328467 328853 330883 333843 336801 339171 340885 342322
52896C42322J456J034k49j640k095j822j905k480k504j533n04l58q65j389j816
$$ 342322 343778 344812 344563 342923 340828 339006 337101 334621 332117 330584 330080 329722 328857 327468 325652
52881C25652k143k071j631j311r45M44K812M249L270J008l23n14j165k784l930
$$ 325652 323509 321438 319807 318496 317551 317995 320807 325056 328326 329334 329011 328497 327332 324548 320618
52866C20618l536k326j343n12M95J089O33k02p7J232K456K291O81j346k733l140
$$ 320618 317082 314756 313413 312901 313396 314485 315118 314916 314839 316071 318527 320818 321499 320153 317420 314280
52850C14280k883k302j408k60O84J035J159J795K936L672L353K307J239M74J30
$$ 314280 311397 309095 307687 307427 308111 309146 310305 312100 315036 318708 322061 324368 325607 326081 326211
52835C26211M47J347K033J775R86R04J981L151L009J491p4o02l87l57o19m34M84
$$ 326211 326658 328005 330038 331813 332799 333703 335684 338835 341844 343335 343261 342659 342272 341915 341296 340862 341346
52818C41346J418J701J556J424J131M25j36K07J236K078K542L158L909L902K678
$$ 341346 342764 344465 346021 347445 348576 349001 348865 349072 350308 352386 354928 358086 361995 365897 368575
52803C68575R90k6J28J251K630L219K523J600K114L998N203M486L228L300M234
$$ 368575 369565 369539 369667 370918 373548 376767 379290 380890 383004 387002 392205 396691 399919 403219 407453
52788D07453M150K907K343L261M054L145J362O15J089J153k03k012k731k124j281
$$ 407453 411603 414510 416853 420114 424168 427313 428675 429290 430379 431532 431329 429317 426586 424462 423181
52773D23181j253k102l106l529l191k581k428l009l857m266m050l618l312k994
$$ 423181 421928 419826 416720 413191 410000 407419 404991 401982 398125 393859 389809 386191 382879 379885
52759C79885k443j926j944k529l145l405l612m248n094n230m188k796k483l619
$$ 379885 377442 375516 373572 371043 367898 364493 360881 356633 351539 346309 342121 339325 336842 333223
52745C33223m956n009l711k208j321q83o71j037k132l215l529l476m112n522o411
$$ 333223 328267 323258 319547 317339 316018 315135 314464 313427 311295 308080 304551 301075 296963 291441 285030
52730B85030n484k791L47K338K339O87j493l237m199m260l311j898j349k328l717
$$ 285030 279546 276755 277102 279440 281779 282466 280973 277736 273537 269277 265966 264068 262719 260391 256674
52715B56674l934l064k492k583k229r55M6k34j098j349j096j112j248q64l69r15
$$ 256674 252740 249676 247184 244601 242372 241417 241463 241229 240131 238782 237686 236574 235326 234462 234093 233178
52699B33178k506l707l509k579k219k833l824m416m124k903j354n56j078k232
$$ 233178 230672 226965 223456 220877 218658 215825 212001 207585 203461 200558 199204 198648 197570 195338
52685A95338k756k274j683j883k571k734k158j701j984k435k147j085J12J088
$$ 195338 192582 190308 188625 186742 184171 181437 179279 177578 175594 173159 171012 169927 170039 171127
52671A71127J687J345l48k439l203k235r84o69o61K40J853K964L119K909K652
$$ 171127 172814 174159 173811 171372 168169 165934 164950 164281 163620 163860 165713 168677 171796 174705 177357
52656A77357J857K48j495k281j588K14K158L289L323K818K499K524K621K689K916
$$ 177357 179214 179462 177967 175686 174098 174312 176470 179759 183082 185900 188399 190923 193544 196233 199149
52641A99149L344L678L423K164j3k132k838j737QQ90N44m48j680l037l939l563
$$ 199149 202493 206171 209594 211758 211745 209613 206775 205038 205046 205936 206480 206032 204352 201315 197376 193813
52625A93813k082q41q66j722k260k114j973k621m084n671o558o316n102l494k126
$$ 193813 191731 190890 190024 188302 186042 183928 181955 179334 175250 169579 163021 156705 151603 148109 145983
52610A45983j371j084o30M79J852K351J364l45j382j202m86j29k77m88m52m13
$$ 145983 144612 143528 142898 143377 145229 147580 148944 148599 147217 146015 145529 145400 145123 144635 144183 143770
52594A43770p86j487j836j384o98p71j648k313k191j877j941j855r99P5N42Q98
$$ 143770 142984 141497 139661 138277 137579 136808 135160 132847 130656 128779 126838 124983 123984 124059 124601 125499
52578A25499K301M475N705N103L610K459J812J285P22j04j358k203j307R46K078
$$ 125499 127800 132275 137980 143083 146693 149152 150964 152249 152971 152867 151509 149306 147999 148945 151023
52563A51023O43j469j495L56J463P51o3M79J454J381N30O2M9j65l66K96J609K229
$$ 151023 151666 150197 148702 149058 150521 151272 151209 151688 153142 154523 155053 155115 155164 154999 154633 154929 156538 158767
52545A58767J485K93p6N57J366J643J397J109J006O92l29j649k107j297k88J7
$$ 158767 160252 160545 160469 161026 162392 164035 165432 166541 167547 168239 167910 166261 164154 162857 162569 162586
52529A62586N01K489N001N262K521l28j26K581M547M050K455J720J994K234K038
$$ 162586 163087 165576 170577 175839 178360 178032 177906 180487 185034 189084 191539 193259 195253 197487 199525
52514A99525J879K028K053J483O01L29J164K375K759K302K336L586M893M766L566
$$ 199525 201404 203432 205485 206968 207569 207898 209062 211437 214196 216498 218834 222420 227313 232079 235645
52499B35645K852K962K762J824J232J675K197J771J090J575L245M590M368K790
$$ 235645 238497 241459 244221 246045 247277 248952 251149 252920 254010 255585 258830 263420 267788 270578
52485B70578J016N5M8K64m2o76q08k93rn25j191j096k31Q22J700K143J778Q43
$$ 270578 271594 271649 271697 271961 271919 271243 270435 270142 270133 269608 268417 267321 267090 267912 269612 271755 273533 274376
52467B74376M94J377K305J495j030l260l395j470J193L266M004L421K240J239
$$ 274376 274870 276247 278552 280047 279017 275757 272362 270892 272085 275351 279355 282776 285016 286255
52453B86255M73n65j963l055l180k419j492j028j001p49K10J344J573O82k45k58
$$ 286255 286728 286163 284200 281145 277965 275546 274054 273026 272025 271276 271486 272830 274403 275085 274840 274582
52437B74582K01P9p44j368r64O58L065N061N084K833J14r64m44j75j110k245k366
$$ 274582 274783 274862 274118 272750 271786 272444 275509 280570 285654 288487 288601 287637 287193 287018 285908 283663 281297
52420B81297j559n59M13J479K433K880K723K210J749J685J927J851J089K77L86
$$ 281297 279738 279179 279592 281071 283504 286384 289107 291317 293066 294751 296678 298529 299618 299895 300281
52405C00281J310J885J336M4j131j542q47P08K044K264J951K409L498L502J681
$$ 300281 301591 303476 304812 304856 303725 302183 301336 302044 304088 306352 308303 310712 314210 317712 319393
52390C19393m09r64k44J81l44j257k137l189m447n374n317l979j766P2J84j368
$$ 319393 318984 318020 317776 317957 317613 316356 314219 311030 306583 301209 295892 291913 290147 290219 290403 289035
52374B89035k944l307l092l475m017l224r35J197J822J236L14q01k235l439l675
$$ 289035 286091 282784 279692 276217 272200 268976 268041 269238 271060 272296 272610 271809 269574 266135 262460
52359B62460l075k498k420k466j993q28O29J709K039J887J880K240K457J963R62
$$ 262460 259385 256887 254467 252001 250008 249180 249809 251518 253557 255444 257324 259564 262021 263984 264946
52344B64946K12R3K54K49Q9l3j82m87o27m3J289K585K948K214J063M33P89J681
$$ 264946 265158 265251 265505 265754 265843 265810 265628 265141 264514 264471 265760 268345 271293 273507 274570 275003 275792 277473
52326B77473K098J595J125K153M703O825O608M373K301K015L172M431M975M754
$$ 277473 279571 281166 282291 284444 289147 295972 302580 306953 309254 311269 314441 318872 323847 328601
52312C28601L937K827K118K411L261L346K073P13J064L114M901N057M530M929
$$ 328601 332538 335365 337483 339894 343155 346501 348574 349287 350351 353465 358366 363423 367953 372882
52298C72882O101O668O424O479O977O645N183M280N065O107N506L826L067L550
$$ 372882 378983 385651 392075 398554 405531 412176 417359 421639 426704 432811 438317 442143 445210 448760
52284D48760L743K905K074K172K739K870K280J267O07J402L820O172O565N496
$$ 448760 452503 455408 457482 459654 462393 465263 467543 468810 469417 470819 474639 480811 487376 492872
52270D92872N165O175O721N541L781K996L026L073L501N061P213Q626Q802Q094
$$ 492872 498037 504212 510933 516474 520255 523251 526277 529350 532851 537912 545125 553751 562553 570647
52256E70647O695M867L648M108N959P810Q701Q720Q397Q276Q900J0427J2276J3637
$$ 570647 577342 582209 585857 589965 595924 603734 612435 621155 629552 637828 646728 657155 669431 683068
52242F83068J4287J4667J5361J6758J8768K0536K1006K0180J9302J9405K0268
$$ 683068 697355 712022 727383 744141 762909 783445 804451 824631 843933 863338 883606
52231H83606K1196K2097K3118K3943K4291K4631K5672K7358K8912K9506K8682
$$ 883606 904802 926899 950017 973960 998251 1022882 1048554 1075912 1104824 1134330 1163012
52220A163012K6707K4898K4673K5788K6428K5658K4600K4388K4367K3572K2723
$$ 1163012 1189719 1214617 1239290 1265078 1291506 1317164 1341764 1366152 1390519 1414091 1436814
52209A436814K2991K3657K2953K0612J7810J5003J1946R577R496J1263J2294J1127
$$ 1436814 1459805 1483462 1506415 1527027 1544837 1559840 1571786 1581363 1590859 1602122 1614416 1625543
52197A625543Q986P504O758O372O621P221O643M163J353P1m4n05j299j067N24
$$ 1625543 1634529 1642033 1648791 1655163 1661784 1669005 1675648 1679811 1681164 1681235 1681191 1680686 1679387 1678320 1678844
52182A678844K237L086L336L647M518O531R866J3276J4707J3606J1779J1455J3017
$$ 1678844 1681081 1684167 1687503 1691150 1695668 1702199 1712065 1725341 1740048 1753654 1765433 1776888 1789905
52169A789905J5060J6086J5751J4897J4745J5801J7165J7322J5863J4100J3704
$$ 1789905 1804965 1821051 1836802 1851699 1866444 1882245 1899410 1916732 1932595 1946695 1960399
52158A960399J5031J7036J8401J8313J6551J3556J0415Q126O595M702J649j999
$$ 1960399 1975430 1992466 2010867 2029180 2045731 2059287 2069702 2077828 2084423 2089125 2090774 2088775
52146B088775m841o131o452o854p637q289q537q972j0212j1811j2602j2203j1580
$$ 2088775 2083934 2077803 2071351 2064497 2056860 2048571 2040034 2031062 2020850 2009039 1996437 1984234 1972654
52133A972654j1780j2602j2952j2151j0469q614p290o976p470p795p210o192n717
$$ 1972654 1960874 1948272 1935320 1923169 1912700 1904086 1896796 1889820 1882350 1874555 1867345 1861153 1855436
52120A855436n747n451m895n267o910q383q216o743n309m468l982l865m174m233
$$ 1855436 1849689 1844238 1839343 1834076 1827166 1818783 1810567 1803824 1798515 1794047 1790065 1786200 1782026 1777793
52106A777793l318j992j691k951m929o541p327p302o947p091p974q626q087o913
$$ 1777793 1774475 1772483 1770792 1767841 1762912 1756371 1749044 1741742 1734795 1727704 1719730 1711104 1703017 1696104
52092A696104o301o214n748n085n254n999n870m832m729o259p515o830n474n819
$$ 1696104 1689803 1683589 1677841 1672756 1667502 1661503 1655633 1650801 1646072 1639813 1632298 1625468 1619994 1614175
52078A614175p894r616r776r045q368p839p365p190p402p641p581p431p750q793
$$ 1614175 1606281 1596665 1586889 1577844 1569476 1561637 1554272 1547082 1539680 1532039 1524458 1517027 1509277 1500484
52064A500484r795r229o522l372k161l029l802l242k673l586n321o414o742o699
$$ 1500484 1490689 1481460 1474938 1471566 1469405 1466376 1462574 1459332 1456659 1453073 1447752 1441338 1434596 1427897
52050A427897n485k371J140K554J710R45J879L736N079N669O144P038Q728J1424
$$ 1427897 1422412 1420041 1421181 1423735 1425445 1426390 1428269 1432005 1437084 1442753 1448897 1455935 1464663 1476087
52036A476087J4724J7739J9948K1432K2329K2597K2414K2273K2729K4231K6843
$$ 1476087 1490811 1508550 1528498 1549930 1572259 1594856 1617270 1639543 1662272 1686503 1713346
52025A713346K9781L1839L2775L3558L4642L4957L3533L1193K9379K8203K6915
$$ 1713346 1743127 1774966 1807741 1841299 1875941 1910898 1944431 1975624 2005003 2033206 2060121
52014B060121K5523K4478K3433K1925K0608K0133J9383J6936J3745J2030J1564
$$ 2060121 2085644 2110122 2133555 2155480 2176088 2196221 2215604 2232540 2246285 2258315 2269879
52003B269879R595N137Q71l75O17P10j748n506q243q874q306q243r093r441q156
$$ 2269879 2279474 2284611 2285482 2285107 2285724 2286434 2284686 2279180 2270937 2262063 2253757 2245514 2236421 2226980 2218824
51988B218824o244n362n248m501l383l661n528o971o640n353m114k705r95L54
$$ 2218824 2212580 2207218 2201970 2197469 2194086 2190425 2184897 2177926 2171286 2165933 2161819 2159114 2158119 2158473
51974B158473J394L194N661O962O269N173N218N917O585P952J0119J0827Q305
$$ 2158473 2159867 2163061 2168722 2175684 2181953 2187126 2192344 2198261 2204846 2212798 2222917 2233744 2242049
51961B242049M441K612L146L402K014N66P33J736J388j370n512q967j0577j1252
$$ 2242049 2246490 2249102 2252248 2255650 2257664 2258230 2258963 2260699 2262087 2260717 2255205 2246238 2235661 2224409
51947B224409j2708j5035j6647j7107j8269k1413k4864k6270k6010k6280k7750
$$ 2224409 2211701 2196666 2180019 2162912 2144643 2123230 2098366 2072096 2046086 2019806 1992056
51936A992056k9322l0669l2605l5003l6513l6579l5988l5280l4399l4060l5440
$$ 1992056 1962734 1932065 1899460 1864457 1827944 1791365 1755377 1720097 1685698 1651638 1616198
51925A616198l8003l9508l8904l7680l7529l8089l8091l7370l6574l5691l4243
$$ 1616198 1578195 1538687 1499783 1462103 1424574 1386485 1348394 1311024 1274450 1238759 1204516
51914A204516l2516l1549l1790l2362l1843k9746k7142k5602k5335k4803k2661
$$ 1204516 1172000 1140451 1108661 1076299 1044456 1014710 987568 961966 936631 911828 889167
51903H89167j9547j7168j6157j5914j6042j6532j6663j5400j3172j1790j2027
$$ 889167 869620 852452 836295 820381 804339 787807 771144 755744 742572 730782 718755
51892G18755j2612j2236j1185j0227r137p555o265o298p237p710p232o478n876
$$ 718755 706143 693907 682722 672495 663358 655803 649538 643240 636003 628293 621061 614583 608707
51879F08707n054l833k907l144m602o437p606p657p069o737o923o923o075m769
$$ 608707 603653 599820 596913 593769 589167 582730 575124 567467 560398 553661 546738 539815 533740 528971
51865E28971m013m183m681m865m756m692m680m361l523k419j596j500k139l098
$$ 528971 524958 520775 516094 511229 506473 501781 497101 492740 489217 486798 485202 483702 481563 478465
51851D78465l888m236m133l674l060k614k611k882k826k019q21o3l5q4M22J067
$$ 478465 474577 470341 466208 462534 459474 456860 454249 451367 448541 446522 445701 445638 445603 445519 445941 447008
51835D47008Q14n65k002k266j158N78K019K437J395q49l144m166l574k295j554
$$ 447008 447822 447257 445255 442989 441831 442409 444428 446865 448260 447411 444267 440101 436527 434232 432678
51820D32678j664j822j114K21Q81P9j277j531k83J219J735J270N37N4J54J070
$$ 432678 431014 429192 428078 428299 429180 429259 427982 426451 426168 427387 429122 430392 430929 430983 431137 432207
51804D32207K384L029K522J648J390J683J917K000K161K242K164K529L654M390
$$ 432207 434591 437620 440142 441790 443180 444863 446780 448780 450941 453183 455347 457876 461530 465920
51790D65920L329J139K85J948M443N372M434L122K368J634K98j160j810j558j092
$$ 465920 469249 470388 470673 472621 477064 482436 486870 489992 492360 493994 494292 493132 491322 489764 488672
51775D88672p64k07P10J285R35K86M16J219J554J044N90P23P64L67O24K393M398
$$ 488672 487908 487701 488411 489696 490631 490917 491333 492552 494106 495150 495740 496463 497227 497594 498218 500611 505009
51758E05009M551K786J088P78J217J383J394J709J900J126m76j659j390q9O66
$$ 505009 509560 512346 513434 514212 515429 516812 518206 519915 521815 522941 522465 520806 519416 519327 519993
51743E19993k32k049k869j783O1R77P99O40J009J065r0k039l287k719q13O50M05
$$ 519993 519761 517712 514843 513060 513121 514098 514897 515537 516546 517611 517521 515482 512195 509476 508663 509313 509718
51726E09718p36r15J80Q98K61l98L67J540J011j163k776k516j203M4J043J570
$$ 509718 508982 508067 508247 509145 509406 509008 509375 510915 511926 510763 507987 505471 504268 504312 505355 506925
51710E06925Q21j237l136l304j568J031L174L866L123K202K237K628J918L19k42
$$ 506925 507746 506509 503373 500069 498501 499532 502706 506572 509695 511897 514134 516762 518680 518999 518757
51695E18757R99K385K275J172L43m17k029l960m515l126j150k18o17j505k142
$$ 518757 519756 522141 524416 525588 525931 525514 523485 519525 515010 511884 510734 510516 509899 508394 506252
51680E06252k635l523m757n328m365k518j474j995l014k936j279J067K582K086
$$ 506252 503617 500094 495337 490009 485644 483126 481652 479657 476643 473707 472428 473495 476077 478163
51666D78163k19k458k752j381m63j241k762l544l394k917k404k063k446l690m928
$$ 478163 477944 475486 472734 471353 470890 469649 466887 463343 459949 457032 454628 452565 450119 446429 441501
51651D41501n349n239n166m769l273q93J024J201n64l157m743m239k522j459j522
$$ 441501 436152 430913 425747 420978 417705 416812 417836 419037 418473 415316 410573 406334 403812 402353 400831
51636D00831j365p0J461K089K084K170K074J387Q89J583K939L576L305L151L675
$$ 400831 399466 399396 400857 402946 405030 407200 409274 410661 411550 413133 416072 419648 422953 426104 429779
51621D29779M441N042N503N820O035O563P492P925P074N632M925M909M250K329
$$ 429779 434220 439262 444765 450585 456620 463183 470675 478600 485674 491306 496231 501140 505390 507719
51607E07719n2k005l373m128m018l083j730k11J166J437k27l139n604o874p553
$$ 507719 507667 505662 502289 498161 494143 491060 489330 489119 490285 491722 491495 488356 482752 475878 468325
51592D68325p911p269n553m162m372n638o432o218n770n803o042n704m491k916
$$ 468325 460414 453145 447592 443430 439058 433420 426988 420770 415000 409197 403155 397451 392960 390044
51578C90044j724j022k71P08J162L46j308k604k893k310j074M79J451J012l51
$$ 390044 388320 387298 387027 387735 388897 389243 387935 385331 382438 380128 379054 379533 380984 381996 381645
51563C81645j270j229r28q90q91r63j654k716k811j292O63J720K184L101M176
$$ 381645 380375 379146 378218 377328 376437 375474 373820 371104 368293 367001 367664 369384 371568 374669 378845
51548C78845M011K249L40j07J013K478L147K973K834L479M620N248M861M097L975
$$ 378845 382856 385105 385445 385338 386351 388829 391976 394949 397783 401262 405882 411130 415991 420088 424063
51533D24063M831O143P049O966O081N347N569O447P098P518Q512R961J0358Q819
$$ 424063 428894 435037 442086 449052 455133 460480 466049 472496 479594 487112 495624 505585 515943 524762
51519E24762O555N312N205N248N255N642N767M337J666j84j49M07q8j016o93R62
$$ 524762 531317 536629 541834 547082 552337 557979 563746 568083 569749 569565 569416 569823 569735 568719 568026 568988
51503E68988K260K051R74M36J261L378N951P703P886P201P018P562P658O623N436
$$ 568988 571248 573299 574273 574709 575970 579348 585299 593002 600888 608089 615107 622669 630327 636950 642386
51488F42386N369O146O426N702M810M557M704M466L404J719J57l83L36J359J396
$$ 642386 647755 653901 660327 666029 670839 675396 680100 684566 687970 689689 689846 689463 689799 691158 692554
51473F92554K56j099j934k345k429j841p86n66k156m733o490o730o161n353m055
$$ 692554 692810 691711 689777 687432 685003 683162 682376 681810 679654 674921 668431 661701 655540 650187 646132
51458F46132k373j604k976n792p714p097m751l065l503n234o365o202n800o337
$$ 646132 643759 642155 639179 633387 625673 618576 613825 610760 607257 602023 595658 589456 583656 577319
51444E77319p570q243p645o282n132m686m676m424l539k465k189l106m280m333
$$ 577319 569749 561506 553861 547579 542447 537761 533085 528661 525122 522657 520468 517362 513082 508749
51430E08749l066j687j293j522j163J28J360J572J186J380K340K929K449J844
$$ 508749 505683 503996 502703 501181 500018 500146 501506 503078 504264 505644 507984 510913 513362 515206
51416E15206K418L862M633M115L276L002L012K923L367N051P290Q476P912O603
$$ 515206 517624 521486 526119 530234 533510 536512 539524 542447 545814 550865 558155 566631 574543 581146
51402E81146O151P115Q429Q468P010N761O264P507O934L963R08j98r8m63j077
$$ 581146 587297 594412 602841 611309 618319 624080 630344 637851 644785 648748 649656 649458 649360 648897 647820
51387F47820o73M82P84k73j677k732l666m413m482m260m951o870q990j0392j0977
$$ 647820 647147 647629 648413 648140 646463 643731 640065 635652 631170 626910 621959 615089 606099 595707 584730
51372E84730j0598q955o714n397n637o542p211p587p551o535m811l771m033m364
$$ 584730 574132 565177 558463 553066 547429 540887 533676 526089 518538 512003 507192 503421 499388 495024
51358D95024l459j776o30k75M8P76J757K806L649L826L314K773K470J670j51k148
$$ 495024 491565 489789 489159 488884 488932 489708 491465 494271 497920 501746 505060 507833 510303 511973 511822 509674
51342E09674l136l297l814n238p095q818j0051j0287r230p585o567o596p063p489
$$ 509674 506538 503241 499427 494189 487094 478276 468225 457938 448708 441123 434556 427960 420897 413408
51328D13408q171r472j0956j1549j0503q207o004m963m815m446l503k838l171
$$ 413408 405237 395765 384809 373260 362757 354550 348546 343583 338768 334322 330819 327981 324810
51315C24810m103m865n267n317m686l356k213k167l010l849m227m073l146j420
$$ 324810 320707 315842 310575 305258 300572 297216 295003 292836 289826 285977 281750 277677 274531 273111
51301B73111L09J126J054P32M17Q5j1J90Lj017j921j476j44M51l3j66J051K843
$$ 273111 273420 274546 275600 276332 276749 276834 276823 277013 277016 275999 274078 272602 272458 272909 272876 272710 273761 276604
51283B76604L976M175L725K713J460Q32J397K780M353N912P202P455O174M047
$$ 276604 280580 284755 288480 291193 292653 293485 294882 297662 302015 307927 315129 322584 328758 332805
51269C32805K555K772M644O936P842O385L675K077K624L791L353Q94k029l655
$$ 332805 335360 338132 342776 349712 357554 363939 367614 369691 372315 376106 379459 380353 378324 374669
51255C74669l356j838o95j370l739o023o662n927n019m271l349k782l671n698
$$ 374669 371313 369475 368780 367410 363671 357648 350986 345059 340040 335769 332420 329638 325967 320269
51241C20269o936o354n322n518o353n933m047k583k715l317k934k022j945k540
$$ 320269 313333 306979 301657 296139 289786 283853 279806 277223 274508 271191 268257 266235 264290 261750
51227B61750k279p37O29N46n13j436k132l086m019m125l285k083q18N83J750K035
$$ 261750 259471 258734 259363 259909 259396 257960 255828 252742 248723 244598 241313 239230 238412 238995 240745 242780
51211B42780J513R66O96K56l81m30M61J398J368N77j12n48j196j995k218j594
$$ 242780 244293 245259 245955 246211 245830 245400 245861 247259 248627 249204 249092 248544 247348 245353 243135 241541
51195B41541p76m48n47o74q22j249j810j970j457n91J33N17M80j90j492k665k646
$$ 241541 240765 240317 239770 239096 238274 237025 235215 233245 231788 231197 231330 231847 232327 232137 230645 227980 225334
51178B25334j277L61J143J061R07J103J399J393Q28l35j580j856o41J106J915
$$ 225334 224057 224418 225561 226622 227529 228632 230031 231424 232252 231917 230337 228481 227840 228946 230861
51163B30861J606J290J522J561P63l16p81n94j72M35J203J573J175P05J131K233
$$ 230861 232467 233757 235279 236840 237603 237287 236506 235912 235740 236175 237378 238951 240126 240831 241962 244195
51147B44195K784K242J394J283K047L012L394K836J712R01Q09P61j28j447j733
$$ 244195 246979 249221 250615 251898 253945 256957 260351 263187 264899 265800 266609 267370 267242 265795 264062
51132B64062k91J881L320L542K856J567J17m66N89K453L155J775l99j438j023
$$ 264062 263771 265652 268972 272514 275370 276937 277054 276588 277177 279630 282785 284560 284161 282723 281700
51117B81700n39j098k316l103l075k563j789o75N55J281J213Q04O42O71K35j124
$$ 281700 281161 280063 277747 274644 271569 269006 267217 266542 267097 268378 269591 270395 271037 271708 271943 270819
51101B70819l087m655m921l832k135m92J054K417K806J549o02k017k114j769j591
$$ 270819 267732 263077 258156 254324 252189 251697 252751 255168 257974 259523 258921 256904 254790 253021 251430
51086B51430r92M52J905K508K687L035K792R61j526k514j414J26N93J77l24p08
$$ 251430 250438 250890 252795 255303 257990 261025 263817 264778 263252 260738 259324 259450 260043 260220 259896 259188
51070B59188r86r60q36j157j547q00J060K117J032r11j660j301j580l011m193
$$ 259188 258202 257242 256406 255249 253702 252902 253962 256079 257111 256200 254540 253239 251659 248648 244455
51055B44455l977k857j909j494j372j222p28J87J031J257J101J251J690J733J184
$$ 244455 240478 237621 235712 234218 232846 231624 230896 231083 232114 233371 234472 235723 237413 239146 240330
51040B40330O43M73M52N58J130J886J824P46qQ78L002M785N267M646L465K072
$$ 240330 240973 241446 241898 242456 243586 245472 247296 248042 248034 248912 251914 256699 261966 266612 270077 272149
51024B72149P45j95m41K47J783L392M022L417K327J448P72L16N76J612K408K115
$$ 272149 272894 272699 272258 272505 274288 277680 281702 285119 287446 288894 289666 289982 290558 292170 294578 296693
51008B96693J340J269J986K663K949L009K503R27j005j733r08R1J93P6Q95K516
$$ 296693 298033 299302 301288 303951 306900 309909 312412 313339 312334 310601 309693 309784 309977 310053 310948 313464
50992C13464L827M095L230J393q17k261k308j718j673k113j987r94n2J08r9m9
$$ 313464 317291 321386 324616 326009 325192 322931 320623 318905 317232 315119 313132 312138 312086 312194 312095 312046
50976C12046R3j15m36k87K99Q32J324K235L377L694K624J038K45N63J446K574
$$ 312046 312139 312024 311588 311301 311600 312432 313756 315991 319368 323062 325686 326724 326969 327532 328978 331552
50960C31552L884M792M537L359K369J954J461P88R90K459L704L301K133K165L503
$$ 331552 335436 340228 344765 348124 350493 352447 353908 354696 355686 358145 361849 365150 367283 369448 372951
50945C72951M502M569M926O102O629N327L501L488N716Q455J0039J0243R733R316
$$ 372951 377453 382022 386948 393050 399679 405006 408507 411995 417711 426166 436205 446448 456181 465497
50931D65497R766J1500J3945J5823J6435J6415J6849J7857J8401J7842J7287J8648
$$ 465497 475263 486763 500708 516531 532966 549381 566230 584087 602488 620330 637617 656265
50919F56265K2241K6178K8704L0312L2512L5353L7711L9634M2524M6742N0928
$$ 656265 678506 704684 733388 763700 796212 831565 869276 908910 951434 998176 1049104
50908A049104N4241N7497O1346O5054O8216P1902P6705Q1258Q4342Q6903Q9938
$$ 1049104 1103345 1160842 1222188 1287242 1355458 1427360 1504065 1585323 1669665 1756568 1846506
50897A846506R1850R0473Q6824Q3898Q2187P9256P3961O8033O2742N6932M9700
$$ 1846506 1938356 2028829 2115653 2199551 2281738 2360994 2434955 2502988 2565730 2622662 2672362
50886B672362M2519L6852L1622K5201J8388J3214R757O300K265j045k673l417
$$ 2672362 2714881 2751733 2783355 2808556 2826944 2840158 2849915 2856215 2858480 2857435 2854762 2851345
50874B851345m772p453j1079j4524j6804j8303k0852k5729l2106l8330m4233n0873
$$ 2851345 2846573 2839120 2828041 2813517 2796713 2778410 2757558 2731829 2699723 2661393 2617160 2566287
50862B566287n8311o5012o9592p1965p2744p2507p1878p1238p0167o8044o5413
$$ 2566287 2507976 2442964 2373372 2301407 2228663 2156156 2084278 2013040 1942873 1874829 1809416
50851A809416o3679o3118o2301o0006n6677n3356n0072m6261m2095l8402l5510
$$ 1809416 1745737 1682619 1620318 1560312 1503635 1450279 1400207 1353946 1311851 1273449 1237939
50840A237939l2983l0406k7744k4954k1785j8056j3954j0140p645p177q096q489
$$ 1237939 1204956 1174550 1146806 1121852 1100067 1082011 1068057 1057917 1050272 1043095 1034999 1026510
50828A026510o889l856j264r5M48J578L435N304O720P784Q658R368J0223J1854
$$ 1026510 1019621 1015765 1014501 1014406 1014854 1016432 1019867 1025171 1031891 1039675 1048333 1057701 1067924 1079778
50814A079778J4457J7346J9543K0787K1623K2648K4024K5745K7951L0776L4154
$$ 1079778 1094235 1111581 1131124 1151911 1173534 1196182 1220206 1245951 1273902 1304678 1338832
50803A338832L7914M1746M5091M7636N0201N4447O1102O8934P6253Q2976R0333
$$ 1338832 1376746 1418492 1463583 1511219 1561420 1615867 1676969 1745903 1822156 1905132 1995465
50792A995465R8812J07674J16481J25801J35926J46042J55366J64214J73037J81227
$$ 1995465 2094277 2201951 2318432 2444233 2580159 2726201 2881567 3045781 3218818 3400045
50782C400045J87830J92895J96946J99393J98635J93812J85609J75202J63062
$$ 3400045 3587875 3780770 3977716 4177109 4375744 4569556 4755165 4930367 5093429
50773E093429J48880J32163J12989R2795P4162N8939M6550L5032K3680J3654O067
$$ 5093429 5242309 5374472 5487461 5580256 5654418 5713357 5759907 5794939 5818619 5832273 5838340
50762E838340P60k621l800l100k317l231n939r899j5824k5057l7326n0646o3677
$$ 5838340 5839100 5836479 5832679 5829579 5827262 5824031 5818092 5808193 5792369 5767312 5729986 5679340 5615663
50749E615663p6858r0786j04622j16857j26927j35365j42788j49196j53895j55800
$$ 5615663 5538805 5448019 5343397 5226540 5099613 4964248 4821460 4672264 4518369 4362569
50739D362569j54167j49553j43640j37717j31461j23548j13249j01138q8459p6180
$$ 4362569 4208402 4058849 3915209 3777492 3646031 3522483 3409234 3308096 3219637 3143457
50729C143457o4572n3442m2667l2415k2665j2804k328P972J6324K1752K4938K6903
$$ 3143457 3078885 3025443 2982776 2950361 2927696 2914892 2912564 2920536 2936860 2958612 2983550 3010453
50717C010453K7479K5858K2213J7915J4139J0900P323K512l778j0740j6860k1205
$$ 3010453 3037932 3063790 3086003 3103918 3118057 3128957 3136280 3138792 3135014 3124274 3107414 3086209
50705C086209k4366k7749l1955l6340l9992m2545m4163m5375m6942m9208n1401
$$ 3086209 3061843 3034094 3002139 2965799 2925807 2883262 2839099 2793724 2746782 2697574 2646173
50694B646173n2259n1485m9889m8014m5362m1397l6432l0997k4998j8285j1454
$$ 2646173 2593914 2542429 2492540 2444526 2399164 2357767 2321335 2290338 2265340 2247055 2235601
50683B235601n183Q36P357J4123K0012K4883L0275L7684M6797N5963O4190P1967
$$ 2235601 2230418 2231254 2238611 2252734 2272746 2297629 2327904 2365588 2412385 2468348 2532538 2604505
50671B604505Q0233Q9065R7603J04938J10705J15005J18046J20055J21238J21353
$$ 2604505 2684738 2773803 2871406 2976344 3087049 3202054 3320100 3440155 3561393 3682746
50661C682746J19396J14163J05587R5056Q3989P2255N8695M3169K7413J3409J610
$$ 3682746 3802142 3916305 4021892 4116948 4200937 4273192 4331887 4375056 4402469 4415878 4417488
50650D417488q597j7176k3196k6386k7852k8707k8609k6608k3134k0154j9141
$$ 4417488 4408891 4391715 4368519 4342133 4314281 4285574 4256965 4230357 4207223 4187069 4167928
50639D167928j9731k0926k2853k6477l1879l7919m3829n0174n7582o5154p1056
$$ 4167928 4148197 4127271 4104418 4077941 4046062 4008143 3964314 3914140 3856558 3791404 3720348
50628C720348p4656p7093p9383q0640p8996p4099o7730o1595n5247m7061l6923
$$ 3720348 3645692 3568599 3489216 3408576 3329580 3255481 3187751 3126156 3070909 3023848 2986925
50617B986925k6763j7920q998K615J7332L2648M6075N7814O9910Q3486R7638J10676
$$ 2986925 2960162 2942242 2933244 2935859 2953191 2985839 3031914 3089728 3159638 3243124 3340762 3451438
50605C451438J21514J29852J35850J40016J42679J43215J40270J33166J22738
$$ 3451438 3572952 3702804 3838654 3978670 4121349 4264564 4404834 4538000 4660738
50596D660738J10268R6191Q0568O4558N0210L8415K7872J6661M264q513k0922
$$ 4660738 4771006 4867197 4947765 5012323 5062533 5100948 5128820 5145481 5149745 5141232 5120310
50585E120310l2641m3057n1316n7216o1278o3754o4381o3381o1707n9691n6379
$$ 5120310 5087669 5044612 4993296 4936080 4874802 4811048 4746667 4683286 4621579 4561888 4505509
50574D505509n1036m4623l8714l3506k8200k2988j9107j6753j4575j1859r751
$$ 4505509 4454473 4409850 4371136 4337630 4309430 4286442 4267335 4250582 4236007 4224148 4214397
50563D214397r302r538q978q170q973j1539j3669j3419j0910p134k485K599O792
$$ 4214397 4205095 4195557 4186579 4178409 4169436 4157897 4144228 4130809 4119899 4112765 4110280 4112879 4119671
50550D119671R066J0246J2022J4472J5680J4005R971N476J746j609n757j1303
$$ 4119671 4128737 4138983 4151005 4165477 4181157 4195162 4205133 4210609 4212355 4210746 4204989 4193686
50538D193686j7849k4768l2264m1049n0924o0416o8493p5897q3660r0790r4976
$$ 4193686 4175837 4151069 4118805 4077756 4026832 3966416 3897923 3822026 3738366 3647576 3552600
50527C552600r5756r5357r5744r6248r5149r2426q9554q7256q4919q1834p7671
$$ 3552600 3456844 3361487 3265743 3169495 3074346 2981920 2892366 2805110 2720191 2638357 2560686
50516B560686p2067o5065n7858n1719m6234l9927l2714k6162k1028j6211j0725
$$ 2560686 2488619 2423554 2365696 2313977 2267743 2227816 2195102 2168940 2147912 2131701 2120976
50505B120976n136n2N366J2019J9049K4880K9538L4535M0869M8267N6175O4303
$$ 2120976 2115840 2115788 2121154 2133173 2152222 2177102 2206640 2241175 2282044 2330311 2386486 2450789
50493B450789P2333Q0143Q8210R6871J05411J12797J19116J25149J30639J34208
$$ 2450789 2523122 2603265 2691475 2788346 2893757 3006554 3125670 3250819 3381458 3515666
50483C515666J35100J33838J30860J25690J18016J08609R8550Q8252P7964O8772
$$ 3515666 3650766 3784604 3915464 4041154 4159170 4267779 4366329 4454581 4532545 4601317
50473D601317O2189N8657N6901N4953N1830M8116M4917M2457M0268L8550L8441
$$ 4601317 4663506 4722163 4779064 4834017 4885847 4933963 4978880 5021337 5061605 5100155 5138596
50462E138596M0437M3519M6639N0120N4428N8460O0572O0891O0838O0470N8073
$$ 5138596 5179033 5222552 5269191 5319311 5373739 5432199 5492771 5553662 5614500 5674970 5733043
50451E733043N2571M4728L5549K5164J3771K018j0220k3860l8457n1651o1778
$$ 5733043 5785614 5830342 5865891 5891055 5904826 5906844 5896624 5872764 5834307 5782656 5720878
50440E720878o9740p7042q3351q7341q8729q7841q4282p7863p0075o2684n5247
$$ 5720878 5651138 5574096 5490745 5403404 5314675 5226834 5142552 5064689 4994614 4931930 4876683
50429D876683m5959l4914k4631j7077j1859p855n232n153q410j5034k4506l5812
$$ 4876683 4830724 4795810 4771179 4754102 4742243 4734388 4729156 4724003 4715593 4700559 4676053 4640241
50417D640241m7863o0267p3171q6238r8318j08334j15970j21412j24944j26947
$$ 4640241 4592378 4532111 4458940 4372702 4274384 4166050 4050080 3928668 3803724 3676777
50407C676777j27637j26679j23637j19006j14235j10401j07206j03437r8207r1617
$$ 3676777 3549140 3422461 3298824 3179818 3065583 2955182 2847976 2744539 2646332 2554715
50397B554715q4603p8095p2061o5576n8114n0467m3855l8471l3638k9036k4834
$$ 2554715 2470112 2392017 2319956 2254380 2196266 2145799 2101944 2063473 2029835 2000799 1975965
50386A975965k0627j5392q778j770M411R443J3730J7571K1041K4265K7488L0847
$$ 1975965 1955338 1939946 1931168 1929398 1933809 1943252 1956982 1974553 1995594 2019859 2047347 2078194
50374B078194L4217L7272L9841M2306M5202M8270N0428N1169N1431N2366N3772
$$ 2078194 2112411 2149683 2189524 2231830 2277032 2325302 2375730 2426899 2478330 2530696 2584468
50363B584468N4614N4652N4500N4404N4092N3689N3673N3851N3460N2326N0969
$$ 2584468 2639082 2693734 2748234 2802638 2856730 2910419 2964092 3017943 3071403 3123729 3174698
50352C174698M9633M8324M7670M8284M9203M8613M6592M5378M6138M7011M5631
$$ 3174698 3224331 3272655 3320325 3368609 3417812 3466425 3513017 3558395 3604533 3651544 3697175
50341C697175M2283L8994L6312L2733K7180K0562J4427Q860K327o413j6568k5988
$$ 3697175 3739458 3778452 3814764 3847497 3874677 3895239 3909666 3918526 3920853 3914440 3897872 3871884
50329C871884l3940m2345n3070o4509p2929p7365q0833q5657q9794q9826q5858
$$ 3871884 3837944 3795599 3742529 3678020 3605091 3527726 3446893 3361236 3271442 3181616 3095758
50318C095758q1024p7078p3056o8063o2774n7713n2077m5096l7154k8936k0721
$$ 3095758 3014734 2937656 2864600 2796537 2733763 2676050 2623973 2578877 2541723 2512787 2492066
50307B492066j3292q284o683p733r888j2206j4382j6404j8926k3154k9431l6338
$$ 2492066 2478774 2470490 2463807 2456074 2446186 2433980 2419598 2403194 2384268 2361114 2331683 2295345
50295B295345m1786m4827m5995m6424m6968m7746m8073m7172m5298m3545m2322
$$ 2295345 2253559 2208732 2162737 2116313 2069345 2021599 1973526 1926354 1881056 1837511 1795189
50284A795189m0763l8251l5670l4215l3582l2489l0659k8936k7457k5098k1289
$$ 1795189 1754426 1716175 1680505 1646290 1612708 1580219 1549560 1520624 1493167 1468069 1446780
50273A446780j7154j3963j1215p524k955P57K441K897L723N597Q278J1509J5012
$$ 1446780 1429626 1415663 1404448 1396924 1393969 1394726 1397167 1400064 1403787 1409384 1417662 1429171 1444183
50260A444183J7960J9494J9836K0122K1055K2432K4100K6462K9508L2127L3243
$$ 1444183 1462143 1481637 1501473 1521595 1542650 1565082 1589182 1615644 1645152 1677279 1710522
50249A710522L3313L3902L5810L8186L9533L9034L6875L3789L0698K8358K6836
$$ 1710522 1743835 1777737 1813547 1851733 1891266 1930300 1967175 2000964 2031662 2060020 2086856
50238B086856K5261K2469J8241J3711J0255P929N464J989j929n395q702j2629
$$ 2086856 2112117 2134586 2152827 2166538 2176793 2184722 2190186 2192175 2190246 2184851 2176149 2163520
50226B163520j6677j9338k0261k0815k2075k3586k4824k6509k9307l2223l3745
$$ 2163520 2146843 2127505 2107244 2086429 2064354 2040768 2015944 1989435 1960128 1927905 1894160
50215A894160l3953l4074l4426l4269l3511l2965l2748l1923l0224k8847k8827
$$ 1894160 1860207 1826133 1791707 1757438 1723927 1690962 1658214 1626291 1596067 1567220 1538393
50204A538393k9480k9175k7182k4266k1781k0410j9483j7633j4496j1478j0080
$$ 1538393 1508913 1479738 1452556 1428290 1406509 1386099 1366616 1348983 1334487 1323009 1312929
50193A312929r814q888o753m585l172j879k51Q69P46J67L89J514K834M050N152
$$ 1312929 1303115 1294227 1287474 1282889 1279717 1277838 1277587 1278456 1279202 1279369 1279758 1281272 1284106 1288156 1293308
50178A293308N640M904L043P27j362k510k183r72m76j503l102m139m753n332n320
$$ 1293308 1298948 1303852 1306895 1307622 1306260 1303750 1301567 1300595 1300119 1298616 1295514 1291375 1286622 1281290 1275970
50163A275970m473m149n450o896o181l877k959m467o159o055n050m662m250k244
$$ 1275970 1271497 1267348 1261898 1255002 1248821 1244944 1241985 1237518 1231359 1225304 1220254 1215592 1211342 1209098
50149A209098J043L671M492L999L146K522K395K665K864K829K941L195K880J822
$$ 1209098 1210141 1213812 1218304 1222303 1225449 1227971 1230366 1233031 1235895 1238724 1241665 1244860 1247740 1249562
50135A249562J133J668K494K114N16j180k576l982m977m732l717l513m649o122
$$ 1249562 1250695 1252363 1254857 1256971 1257487 1256307 1253731 1249749 1244772 1240040 1236323 1232810 1228161 1222039
50121A222039p279q657j0428j1693j2059j2491j3538j4079j3092j1556j0972j0938
$$ 1222039 1214760 1206103 1195675 1183982 1171923 1159432 1145894 1131815 1118723 1107167 1096195 1085257
50109A085257r888p867o544o463o063m112j652n61j139k067k300k053k127k887
$$ 1085257 1075369 1067502 1060958 1054495 1048432 1044320 1042668 1042107 1040968 1038901 1036601 1034548 1032421 1029534
50095A029534m017m877n116m957m934n290n857o435o887o897o089m509k680j058
$$ 1029534 1025517 1020640 1015524 1010567 1005633 1000343 994486 988051 981164 974267 968178 963669 960989 959931
50081I59931J88Q58P23n4r75j817k605k889j966j76R71P26M18J815M712P233Q223
$$ 959931 960119 960977 961700 961646 960671 958854 956249 953360 951394 951218 952189 952915 953333 955148 959860 967093 975316
50064I75316Q205Q014P773P487P501P808P719O839N811N561O309P664R068R701
$$ 975316 983521 991535 999308 1006795 1014296 1022104 1029823 1036662 1042473 1048034 1054343 1062007 1071075 1080776
50050A080776Q679O152L744L019L799M696M970N053N370N663N613N376N245N358
$$ 1080776 1089455 1095607 1099351 1102370 1106169 1110865 1115835 1120888 1126258 1131921 1137534 1142910 1148155 1153513
50036A153513N929P153Q684R792J0318J0931J2117J3502J4548J5361J6349J7607
$$ 1153513 1159442 1166595 1175279 1185071 1195389 1206320 1218437 1231939 1246487 1261848 1278197 1295804
50024A295804J9223K1673K5110K8531L0573L1198L1807L3460L5663L7308L8244
$$ 1295804 1315027 1336700 1361810 1390341 1420914 1452112 1483919 1517379 1553042 1590350 1628594
50013A628594L9351M1354M4137M7197N0157N2681N4361N5277N6585N9899O5816
$$ 1628594 1667945 1709299 1753436 1800633 1850790 1903471 1957832 2013109 2069694 2129593 2195409
50002B195409P3239Q0615Q7471R4310J01292J08050J15012J23697J34835J46786
$$ 2195409 2268648 2349263 2436734 2531044 2632336 2740386 2855398 2979095 3113930 3260716
49992C260716J56787J63541J67532J69154J67766J62870J54928J44263J30252
$$ 3260716 3417503 3581044 3748576 3917730 4085496 4248366 4403294 4547557 4677809
49983D677809J12859R4544P9298O9397O3544N8506N2096M4290L5799K6175J3686
$$ 4677809 4790668 4885212 4964510 5033907 5097451 5155957 5208053 5252343 5288142 5314317 5328003
49972E328003k960k3211m5255o7613q9624j10535j29023j43914j54710j61172
$$ 5328003 5325043 5301832 5256577 5188964 5099340 4988805 4859782 4715868 4561158 4399986
49962D399986j63153j61400j57706j53382j48125j41218j33351j26043j19537
$$ 4399986 4236833 4075433 3917727 3764345 3616220 3475002 3341651 3215608 3096071
49953C096071j12638j04694r6576q9286q2807p6785p1347o6373o1036n5047m9617
$$ 3096071 2983433 2878739 2782163 2692877 2610070 2533285 2461938 2395565 2334529 2279482 2229865
49942B229865m5872m2807l8253l1911k6005k2510k0897j9454j7753j6703j6546
$$ 2229865 2183993 2141186 2102933 2071022 2045017 2022507 2001610 1982156 1964403 1947700 1931154
49931A931154j6256j5188j4245j4693j6247j7133j6034j3481j1167j0267j0604
$$ 1931154 1914898 1899710 1885465 1870772 1854525 1837392 1821358 1807877 1796710 1786443 1775839
49920A775839j1194j1284j0828j0074q958p057m210r37K033M517O784Q892J0660
$$ 1775839 1764645 1753361 1742533 1732459 1723501 1716444 1712234 1711297 1713330 1717847 1724631 1733523 1744183
49907A744183J2394J4966J8666K2456K5091K6716K8617L1323L3783L4897L5367
$$ 1744183 1756577 1771543 1790209 1812665 1837756 1864472 1893089 1924412 1958195 1993092 2028459
$$ [...]
##END NTUPLES=NMR SPECTRUM
##END=
