
##TITLE=AC1074_TORI01_5819511_qEZrfrgrqa
##JCAMPDX= 6.0         $$ Bruker NMR JCAMP-DX V2.0
##DATA TYPE= NMR SPECTRUM
##DATA CLASS= NTUPLES
##ORIGIN= BRUKER
##OWNER= Administrator
$$ 1.72 TOPSPIN		Version 2.1
$$ 2012-03-24 18:17:38.953 -0500  Administrator@TOPSPIN
$$ Compression mode = diff/dup
##.OBSERVE FREQUENCY= 400.13188235
##.OBSERVE NUCLEUS= ^1H
##.ACQUISITION MODE= SIMULTANEOUS (DQD)
##.ACQUISITION SCHEME= undefined
##.AVERAGES= 8
##.DIGITISER RES= 22
##SPECTROMETER/DATA SYSTEM= spect
##.PULSE SEQUENCE= zg30
##.SOLVENT NAME= COFFEE_meoh
##.SHIFT REFERENCE= INTERNAL, COFFEE_meoh, 1, 14.98061
##AUDIT TRAIL= $$ (NUMBER, WHEN, WHO, WHERE, PROCESS, VERSION, WHAT)
$$ ##TITLE= Audit trail, TOPSPIN		Version 2.1
$$ ##JCAMPDX= 5.01
$$ ##ORIGIN= Bruker BioSpin GmbH
$$ ##OWNER= Administrator
$$ $$ C:\Bruker\TOPSPIN/data/COFFEE/nmr/AC1074_TORI01_5819511_qEZrfrgrqa/10/pdata/1/auditp.txt
$$ ##AUDIT TRAIL=  $$ (NUMBER, WHEN, WHO, WHERE, PROCESS, VERSION, WHAT)
(   1,<2012-03-24 18:17:30.125 -0500>,<Administrator>,<TOPSPIN>,<go>,<TOPSPIN 2.1>,
      <created by zg
	started at 2012-03-24 18:16:23.265 -0500,
	POWCHK enabled, PULCHK disabled,
       configuration hash MD5:
       1A 1E CE 29 27 FD 77 03 67 4E F0 E3 C4 B2 CB 90
       data hash MD5: 64K
       C8 0B A9 B0 0E 0D 2E 8F 9D 29 2E 12 E1 E0 C6 BA>)
(   2,<2012-03-24 18:17:34.484 -0500>,<Administrator>,<TOPSPIN>,<proc1d>,<TOPSPIN 2.1>,
      <Start of raw data processing
       efp LB = 0 FT_mod = 6 PKNL = 1 PHC0 = 0 PHC1 = 0 SI = 32K 
       data hash MD5: 32K
       E9 BF 68 B3 43 41 B4 F5 07 9D 2C 4A 11 DA 22 BB>)
(   3,<2012-03-24 18:17:34.843 -0500>,<Administrator>,<TOPSPIN>,<proc1d>,<TOPSPIN 2.1>,
      <pk PHC0 = 214.6564 PHC1 = 0 
       data hash MD5: 32K
       31 81 3B 2F DC F4 2E B5 A0 E5 9C F5 B2 4A 0A 6D>)
(   4,<2012-03-24 18:17:34.890 -0500>,<Administrator>,<TOPSPIN>,<proc1d>,<TOPSPIN 2.1>,
      <abs ABSG = 1 
       data hash MD5: 32K
       83 30 90 8F 20 0A 88 8A 6A EC 41 8C 0B 72 07 8D>)
(   5,<2012-03-24 18:17:34.937 -0500>,<Administrator>,<TOPSPIN>,<proc1d>,<TOPSPIN 2.1>,
      <abs ABSG = 2 
       data hash MD5: 32K
       85 8C 84 5E D6 87 1D 32 D8 02 03 56 B4 C0 CB 51>)
(   6,<2012-03-24 18:17:34.968 -0500>,<Administrator>,<TOPSPIN>,<proc1d>,<TOPSPIN 2.1>,
      <abs ABSG = 3 
       data hash MD5: 32K
       9B 70 14 DC 93 72 ED 63 55 0C 20 CB E3 92 74 89>)
(   7,<2012-03-24 18:17:35.015 -0500>,<Administrator>,<TOPSPIN>,<proc1d>,<TOPSPIN 2.1>,
      <abs ABSG = 4 
       data hash MD5: 32K
       CD CA 5A 84 52 EE D6 67 BF E8 B7 B2 8F 74 1E 80>)
(   8,<2012-03-24 18:17:35.046 -0500>,<Administrator>,<TOPSPIN>,<proc1d>,<TOPSPIN 2.1>,
      <abs ABSG = 5 
       data hash MD5: 32K
       E3 1D FD 59 B2 F9 6C 35 42 DF E6 9B B8 78 45 19>)
$$ ##END=
$$ 
$$ $$ hash MD5
$$ $$ DF EC 19 12 72 83 C3 AD 7F 82 21 3D 2F DB A4 51
##$RELAX= 
##$RELAX= 
##$RELAX= 
##$RELAX= 
##$RELAX= 
##$RELAX= 
##$RELAX= 
$$ Bruker specific parameters
$$ --------------------------
$$ [...]
##$TP= (0..7)
150 150 150 150 150 150 150 150
##$TP07= 0
##$TPNAME0= <>
##$TPNAME1= <>
##$TPNAME2= <>
##$TPNAME3= <>
##$TPNAME4= <>
##$TPNAME5= <>
##$TPNAME6= <>
##$TPNAME7= <>
##$TPOAL= (0..7)
0.5 0.5 0.5 0.5 0.5 0.5 0.5 0.5
##$TPOFFS= (0..7)
0 0 0 0 0 0 0 0
##$TUNHIN= 0
##$TUNHOUT= 0
##$TUNXOUT= 0
##$USERA1= <user>
##$USERA2= <user>
##$USERA3= <user>
##$USERA4= <user>
##$USERA5= <user>
##$V9= 5
##$VALIST= <valist>
##$VCLIST= <CCCCCCCCCCCCCCC>
##$VD= 0
##$VDLIST= <DDDDDDDDDDDDDDD>
##$VPLIST= <PPPPPPPPPPPPPPP>
##$VTLIST= <TTTTTTTTTTTTTTT>
##$WBST= 2048
##$WBSW= 25
##$XGAIN= (0..3)
0 0 0 0
##$XL= 0
##$YL= 0
##$YMAX_a= 543638
##$YMIN_a= -658735
##$ZGOPTNS= <>
##$ZL1= 120
##$ZL2= 120
##$ZL3= 120
##$ZL4= 120
##$ABSF1= 14.98061
##$ABSF2= -5.57192
##$ABSG= 5
##$ABSL= 3
##$ALPHA= 0
##$AQORDER= 0
##$ASSFAC= 0
##$ASSFACI= 0
##$ASSFACX= 0
##$ASSWID= 0
##$AUNMP= <proc_prof1d_extract_pilot.lims>
##$AXLEFT= 0
##$AXNAME= <>
##$AXNUC= <1H>
##$AXRIGHT= 0
##$AXTYPE= 0
##$AXUNIT= <>
##$AZFE= 0.1
##$AZFW= 0.1
##$BCFW= 0
##$BC_mod= 0
##$BYTORDP= 0
##$COROFFS= 0
##$CY= 15
##$DATMOD= 1
##$DC= 0
##$DFILT= <>
##$DTYPP= 0
##$F1P= 0
##$F2P= 0
##$FCOR= 0.5
##$FTSIZE= 32768
##$FT_mod= 6
##$GAMMA= 0
##$GB= 0
##$INTBC= 1
##$INTSCL= 1
##$ISEN= 128
##$LB= 0
##$LEV0= 0
##$LPBIN= 0
##$MAXI= 10000
##$MC2= 0
##$MEAN= 0
##$ME_mod= 0
##$MI= 0
##$NCOEF= 0
##$NC_proc= -8
##$NLEV= 6
##$NOISF1= 0
##$NOISF2= 0
##$NSP= 0
##$NTH_PI= 0
##$NZP= 0
##$OFFSET= 14.98061
##$PC= 1
##$PHC0= 214.6564
##$PHC1= 0
##$PH_mod= 1
##$PKNL= yes
##$PPARMOD= 0
##$PPDIAG= 0
##$PPIPTYP= 0
##$PPMPNUM= 2147483647
##$PPRESOL= 1
##$PSCAL= 4
##$PSIGN= 0
##$PYNMP= <proc.py>
##$REVERSE= no
##$SF= 400.13
##$SI= 32768
##$SIGF1= 0
##$SIGF2= 0
##$SINO= 400
##$SIOLD= 32768
##$SPECTYP= <>
##$SREGLST= <1H.CDCl3>
##$SSB= 0
##$STSI= 32768
##$STSR= 0
##$SW_p= 8223.68421052632
##$SYMM= 0
##$S_DEV= 0
##$TDeff= 65536
##$TDoff= 0
##$TI= <>
##$TILT= no
##$TM1= 0
##$TM2= 0
##$TOPLEV= 0
##$USERP1= <user>
##$USERP2= <user>
##$USERP3= <user>
##$USERP4= <user>
##$USERP5= <user>
##$WDW= 1
##$XDIM= 32768
##$YMAX_p= 473208644
##$YMIN_p= -673238
##$CURPLOT= <Network HP LaserJet P1505>
##$CURPRIN= <$Network HP LaserJet P1505>
##$DFORMAT= <normdp>
##$LAYOUT= <+/1D_H.xwp>
##$LFORMAT= <normlp>
##$PFORMAT= <normpl>
##$SURQMSG= 1
$$ End of Bruker specific parameters
$$ ---------------------------------
##NTUPLES= NMR SPECTRUM
##VAR_NAME=  FREQUENCY,     SPECTRUM/REAL,   SPECTRUM/IMAG
##SYMBOL=    X,             R,               I
##VAR_TYPE=  INDEPENDENT,   DEPENDENT,       DEPENDENT
##VAR_FORM=  AFFN,          ASDF,            ASDF
##VAR_DIM=   32768,         32768,           32768
##UNITS=     HZ,            ARBITRARY UNITS, ARBITRARY UNITS
##FACTOR=    0.250966925370066, 1,           1
##FIRST=     8223.43324360095, 23412,        -83147
##LAST=      0,             -6710,           46132
##MIN=       0,             -673238,         0
##MAX=       8223.43324360095, 473208644,    0
$$ Real data points
##PAGE= N=1
##DATA TABLE= (X++(R..R)), XYDATA
$$ [...]
19442c76234a77403l03455h3173m7264d58l66558H3366d2383k8069A37765a31278
$$ -376234 -177403 -480858 -83173 -130437 -458 -367016 83366 -42383 -70452 137765 -131278
19430f8803A2562a02539j8571j66410A62916f8412I0038c3532C8106A3075d350
$$ -68803 12562 -102539 -121110 -287520 162916 -68412 90038 -33532 38106 13075 -4350
19418i7443C2744Q083J3473a35543j21003R5030K763D7778c7345b78j98580b0709
$$ -97443 32744 40827 54300 -135543 -256546 -161516 -158753 47778 -37345 -278 -198858 -20709
19405c57321a5236B0578a49201c5120F9199J30669a34709A03796i7844o9643l581
$$ -357321 -15236 20578 -149201 -35120 69199 199868 -134709 103796 -97844 -167487 -171068
19394a71068I116b83822a01041I203i9026B7691A0565d29745G2992e5499j65246
$$ -171068 9116 -283822 -101041 9203 -99026 27691 10565 -429745 72992 -55499 -220745
19383b20745J3298E4623b64356g7870K5021o719j49311Q7358K2976a3307l3029
$$ -220745 -207447 54623 -264356 -77870 -52849 -59568 -208879 -121521 -98545 -13307 -46336
19372d6336k28977A12643d45222g8002q3753F0914a26306j91570R2686K4608a548
$$ -46336 -275313 112643 -445222 -78002 -161755 60914 -126306 -317876 -225190 -200582 -1548
19360b43156P972c2815G903J93687r2988L1928F0650A2576d75052F4113m396b5606
$$ -243156 -235184 -32815 7903 201590 108602 140530 60650 12576 -475052 64113 59717 -25606
19347A3839b91729F5218M1116f0890K6734j88434L9844L0889e0335C18291l4273
$$ 13839 -291729 65218 106334 -60890 -34156 -222590 -182746 -151857 -50335 318291 284018
19336B84018c62288J06228J03253N5845l11409J92987r1006J50648E0098c8798
$$ 284018 -362288 -256060 -152807 -96962 -408371 -215384 -306390 -155742 50098 -38798
19325a63741B65358c02263A24208a95510f3923n06454C6678a01556M9708p6582
$$ -163741 265358 -302263 124208 -195510 -63923 -570377 36678 -101556 -51848 -128430
19315a28430k3107g4195m8516B958b74167a01443j99111I4431d40489a80959B47558
$$ -128430 -151537 -74195 -122711 2958 -274167 -101443 -300554 94431 -440489 -180959 247558
19303a35589a5295o9734j5873D2170R4704d02801f7082l3112n4420k36928f5149
$$ -135589 -15295 -85029 -100902 42170 136874 -402801 -67082 -100194 -154614 -391542 -65149
19291a38493o9434d3278k21126j17310i3737j6525H1845b48008a22621j57371
$$ -138493 -207927 -43278 -264404 -381714 -93737 -110262 81845 -248008 -122621 -279992
19281b79992o6740h8428A64725A1977f4146B32631L6847F261a63122N7023K2426
$$ -279992 -346732 -88428 164725 11977 -64146 232631 269478 6261 -163122 -106099 -83673
19270h3673j18718J4114j36410J42543B3684J91469k5922b46666m8470c2423E345
$$ -83673 -202391 -188277 -324687 -182144 23684 215153 189231 -246666 -295136 -32423 5345
19258e5803H7184b33018f3336I9501d4465k91667e3266o9161A06105l4931e5132
$$ -55803 87184 -233018 -63336 99501 -44465 -336132 -53266 -122427 106105 71174 -55132
19246h5106I4545b59173E4409O811h768k37870a12299d879C5246M233h9178A1666
$$ -85106 94545 -259173 54409 61220 -8768 -246638 -112299 -4879 35246 39479 -89178 11666
19233B18818b43068a0831q7293B495J4635c9904J6481j22783B5829H943N0554
$$ 218818 -243068 -10831 -98124 2495 17130 -39904 -23423 -146206 25829 8943 59497
19222E9497J18959P6162m8315L2477f461j31787C0475d6808H9002k6293k960b84026
$$ 59497 178456 254618 206303 238780 -6461 -138248 30475 -46808 89002 62709 59749 -284026
19209F5613c50965J41689B5278c0714k12379Q5856A9982b62672P9014A11833C798
$$ 65613 -350965 -209276 25278 -30714 -243093 -157237 19982 -262672 -183658 111833 3798
19197b48473B01359c72043f5891p2190d4780A31240a58712a0684A19148n6053
$$ -248473 201359 -372043 -65891 -138081 -44780 131240 -158712 -10684 119148 63095
19187F3095J67609f4905B83906D2103Q8689a85558n5160a19830H6865J51562a65769
$$ 63095 230704 -64905 283906 42103 130792 -185558 -240718 -119830 86865 238427 -165769
19175A00295c70186J52753n483f8144L1188A57962b01276D63240a32522m8901
$$ 100295 -370186 -217433 -222916 -68144 -36956 157962 -201276 463240 -132522 -181423
19165a81423P9903A43357P3131b56595d1956A09605c40922g3368A17256b62809
$$ -181423 -101520 143357 216488 -256595 -41956 109605 -340922 -73368 117256 -262809
19154C4641b70255F5449i843p376A2234c62611a44856o6721b6375G4424J89281
$$ 34641 -270255 65449 -9843 -17219 12234 -362611 -144856 -211577 -26375 74424 263705
19143B63705B5939K40194j22541o2509a30998C00069C590a08193M7880l9027k22383
$$ 263705 25939 266133 143592 81083 -130998 300069 3590 -108193 -60313 -99340 -321723
19132c21723A23046b29562B0978b21049A43201c71203A70715b28124J01493a4442
$$ -321723 123046 -229562 20978 -221049 143201 -371203 170715 -228124 -126631 -14442
19121F5382B0992h4369j72028A11083g2464l41655a09946F7524O3396D8039L0221
$$ 65382 20992 -84369 -256397 111083 -72464 -414119 -109946 67524 130920 48039 78260
19110G8260i4203M1824A39208a2094l32435D11603G1028P8953F6952d2479k32462
$$ 78260 -94203 -52379 139208 -12094 -344529 411603 71028 149981 66952 -42479 -274941
19099b74941h7839L1988k1266r1460A10244e8149j85655B43832d14363J04997
$$ -274941 -87839 -55851 -77117 -168577 110244 -58149 -243804 243832 -414363 -309366
19089c09366G9326c54385i4422B29857c6398j10023J6650q5847A62259f5244h233
$$ -309366 79326 -354385 -94422 229857 -36398 -146421 -129771 -215618 162259 -65244 -8233
19077A2385a90657d2516A86711n2898B2723J90163c7055j98006J4548b1390p1386
$$ 12385 -190657 -42516 186711 133813 22723 212886 -37055 -235061 -220513 -21390 -92776
19066i2776c553H2558a35466a1496A2660O1751b10232j5865R9066C01L1832a45434
$$ -92776 -3553 82558 -135466 -11496 12660 74411 -210232 -226097 -127031 301 32133 -145434
19053A02383m8573j3645E075b61324b232a012j4991G5057h9847n7837E3816K78620
$$ 102383 53810 40165 5075 -261324 -2232 -1012 -16003 75057 -89847 -147684 53816 332436
19041C32436D0985a90308h9396r9923A66086i0731A55490e2063A28226e856p7153
$$ 332436 40985 -190308 -89396 -189319 166086 -90731 155490 -52063 128226 -5856 -83009
19030h3009K1180k35761M9156A2166A786b66435C78639j79410b28861O6549E0208
$$ -83009 -61829 -297590 -248434 12166 1786 -266435 378639 199229 -228861 -162312 50208
19018B6400b14026B72663a2613k12799d3910q4908J2675J2273A46530k309b42036
$$ 26400 -214026 272663 -12613 -225412 -43910 -128818 -116143 -103870 146530 144221 -242036
19006B25978c37108C878N1511c74056A21338C860b9266j99822E3542A3743J29316
$$ 225978 -337108 3878 55389 -374056 121338 3860 -29266 -229088 53542 13743 143059
18995A43059a61478B2543J96395h0186b8918a629k06381A17616c4134j33651M6960
$$ 143059 -161478 22543 218938 -80186 -28918 -1629 -208010 117616 -34134 -167785 -120825
18984a20825q584h711r3705l43635A10421J1298J69056r8685n4972a62253H3895
$$ -120825 -129409 -8711 -102416 -446051 110421 121719 290775 192090 137118 -162253 83895
18972b2590n6271o3348N1448k280j78482a4380D8808J46988O4845b21941a3836
$$ -22590 -78861 -142209 -90761 -93041 -271523 -14380 48808 195796 260641 -221941 -13836
18960g174H3389A3894M4228J67131f3055D26182O4233A12658J69524p4062a84711
$$ -7174 83389 13894 58122 225253 -63055 426182 490415 112658 282182 208120 -184711
18948c74175A31426n9006D894a62643G7317k4548a78606h7334c9715k63943Q18
$$ -374175 131426 72420 4894 -162643 77317 52769 -178606 -87334 -39715 -303658 -302840
18937c02840D724a69465F6495B7519L1985J43921d1109C98802b03893l62764a50877
$$ -302840 4724 -169465 66495 27519 59504 203425 -41109 398802 -203893 -566657 -150877
18925a92441F6293a37055k25645B00673G8884a57167k07552E3521j5393a02388
$$ -192441 66293 -137055 -362700 200673 78884 -157167 -364719 53521 38128 -102388
18914a39337C08786D8769a66661P3239B15914q1503O2680K55104A07747h3909
$$ -139337 308786 48769 -166661 -93422 215914 134411 197091 452195 107747 -83909
18903E6541i8187C4349O9295l3854a41819A33207o1623J6051J35381p1099J39973
$$ 56541 -98187 34349 103644 69790 -141819 133207 71584 87635 223016 151917 291890
18892B91890J88439H2514J11197I2049M2173J19954b5789j8623j04615R535A75373
$$ 291890 480329 82514 193711 92049 134222 254176 -25789 -44412 -149027 -139492 175373
18880a92854g2081A01320b11288a1904j38727A08086Q5086H2865a23306o0699
$$ -192854 -72081 101320 -211288 -11904 -150631 108086 193172 82865 -123306 -184005
18870a84005h7828j22617A24650c4750j12298n3898c1861n4448F7170d5934B08478
$$ -184005 -87828 -210445 124650 -34750 -147048 -200946 -31861 -86309 67170 -45934 208478
18858b57509A98159E4771J81009D2008a72936j07439a5550A42983C4576g1407
$$ -257509 198159 54771 235780 42008 -172936 -280375 -15550 142983 34576 -71407
18847A55724R8358I7115g3722j48322R9829D0609b4754q2092a1114m9147n9741
$$ 155724 254082 97115 -73722 -222044 -122215 40609 -24754 -106846 -11114 -60261 -120002
18836a20002A02325O32677d11668A60741a89842B08810c71605G2753A1195a06423
$$ -120002 102325 735002 -411668 160741 -189842 208810 -371605 72753 11195 -106423
18825b19389a94F8436e8587k45334Q8958A29552a69544J6684K7473N0598j98071
$$ -219389 -194 68436 -58587 -303921 -214963 129552 -169544 -152860 -125387 -74789 -272860
18814b72860F9343b80262B5942a69006f9943j83431J08455d2133k09798h1628
$$ -272860 69343 -280262 25942 -169006 -69943 -253374 -144919 -42133 -251931 -81628
18803B29859B2420Q802a81422a8686k80873N743a0215B55362E9090L2659P6103
$$ 229859 22420 31222 -181422 -18686 -299559 -293816 -10215 255362 59090 91749 167852
18792A67852J29572E6255b37713I5459e67610b72372g4153L1378B29753A00957
$$ 167852 297424 56255 -237713 95459 -567610 -272372 -74153 -42775 229753 100957
18781a62531r9613J12688A23431C7866O0350b53976e7451r9593H3529b92202A61880
$$ -162531 -262144 -149456 123431 37866 98216 -253976 -57451 -157044 83529 -292202 161880
18769b69111F9445b01512G0904h9751A12048a26321A41645i123A02038L2646K37878
$$ -269111 69445 -201512 70904 -89751 112048 -126321 141645 -9123 102038 134684 372562
18758C72562h3904m5404e2208A92079a74518F9349B2015c56302e335l8243k06875
$$ 372562 -83904 -129308 -52208 192079 -174518 69349 22015 -356302 -5335 -43578 -250453
18747b50453R4234B20024a29062B42754c89590C0162a10773e2648C9350h8495
$$ -250453 -156219 220024 -129062 242754 -389590 30162 -110773 -52648 39350 -88495
18736a06839j77439A02867a96092M4360j43453h8730J8972r4331A68794a917j14655
$$ -106839 -284278 102867 -196092 -151732 -295185 -88730 -69758 -164089 168794 -1917 -116572
18725a16572n0875j01942B33457b01065F5237e3945J3513B15997c8800A10674
$$ -116572 -167447 -269389 233457 -201065 65237 -53945 -40432 215997 -38800 110674
18714A88066A6043J77576c17342a44300A90842n0265a31493j32796h4595m3455
$$ 188066 16043 193619 -317342 -144300 190842 140577 -131493 -264289 -84595 -128050
18704a28050j55981C3585a94647I4813O2414f6141o4692c3954H0419h0833a45
$$ -128050 -284031 33585 -194647 94813 157227 -66141 -130833 -33954 80419 -80833 -145
18692b43246A20129b22359a00244A01915h7101J5746j83905m952a8058K011l11506
$$ -243246 120129 -222359 -100244 101915 -87101 -71355 -255260 -260212 -18058 -16047 -327553
18681c27553c7084k64431O6157M7710J046o3366B5503h9678A71647c3020A45755
$$ -327553 -37084 -301515 -235358 -187648 -186602 -249968 25503 -89678 171647 -33020 145755
18669d81288a33020G4767a76051j30029J47116I4241j0856a01748j82434B85029
$$ -481288 -133020 74767 -176051 -306080 -158964 94241 83385 -101748 -284182 285029
18658E1647h1166A2594K42019a31913j38203j27188A1897g677B40060i8883B51302
$$ 51647 -81166 12594 254613 -131913 -270116 -397304 11897 -7677 240060 -98883 251302
18646A576b12817J6797O5977O7j16526g3349k29816P9680N5784e2380A47256E9314
$$ 1576 -212817 -196020 -130043 -129976 -246502 -73349 -303165 -223485 -167701 -52380 147256 59314
18633c3452A09254a39228B01591r1583a50069g4710D5875g6151l6916A38941b2168
$$ -33452 109254 -139228 201591 110008 -150069 -74710 45875 -76151 -113067 138941 -22168
18621b37958a09629p0381A70431K19037F1880b11787d5097A79152J0287a25913
$$ -237958 -109629 -180010 170431 389468 61880 -211787 -45097 179152 189439 -125913
18610a19993m8583C8206J45438c55955A65415a38964A2809c36757A1024b45968
$$ -119993 -168576 38206 183644 -355955 165415 -138964 12809 -336757 11024 -245968
18599b87272l05465C03325b9774j38081H381b04206Q4057j78712i7651q079A69221
$$ -287272 -592737 303325 -29774 -167855 8381 -204206 -120149 -298861 -97651 -105730 169221
18587D5184b9334m6502F6575L0628G810a43166A29588c0498B07430L4832a1822
$$ 45184 -29334 -75836 66575 97203 7810 -143166 129588 -30498 207430 242262 -11822
18575I7414f2291E5072J060c48803a54691C0644K0001b23818a341H8201J9446
$$ 97414 -62291 55072 56132 -348803 -154691 30644 50645 -223818 -1341 88201 107647
18564A07647C0026i0478b8433H9934e813B574f9610A04523J65866b77242a21099
$$ 107647 30026 -90478 -28433 89934 -5813 2574 -69610 104523 270389 -277242 -121099
18552C61300E1628K82216g5399K6224j90792P6443p0189A0740J3941d420q8142
$$ 361300 51628 333844 -75399 -49175 -239967 -163524 -233713 10740 24681 -4420 -92562
18541i2562j48037P3825A33003C0239h4093l6366j18121j48871C0704a91737A7454
$$ -92562 -240599 -166774 133003 30239 -84093 -120459 -238580 -387451 30704 -191737 17454
18529c48556A02920a05874m9970a398E3882Q5620m2915a8746j49261A97307a04595
$$ -348556 102920 -105874 -155844 -1398 53882 139502 96587 -18746 -168007 197307 -104595
18517a41263j06738E5072i4603N94o567d4871j17699O8580J556p5854K4987B18565
$$ -141263 -248001 55072 -94603 -94009 -100576 -44871 -162570 -93990 -92434 -168288 -143301 218565
18504A36053Q3278d64198i4772A32481L3053p7354a41044C4767f3223j48570l0284
$$ 136053 219331 -464198 -94772 132481 165534 88180 -141044 34767 -63223 -211793 -242077
18493b42077A46151B6681B416K44204j13200a10892l12238i0406B38611c47277
$$ -242077 146151 26681 2416 246620 133420 -110892 -423130 -90406 238611 -347277
18482A44203N9831a14192n2938A95857a37886q4344B07585d5944k21987A09485
$$ 144203 204034 -114192 -167130 195857 -137886 -222230 207585 -45944 -267931 109485
18471a75327Q7540k47020B81300h3615F2047Q8542C076K3776a53160F7112k998
$$ -175327 -87787 -334807 281300 -83615 62047 150589 3076 26852 -153160 67112 64114
18460F4114a39500M3982n8198a0816E9585E482i3059B61271H204O8627J59778
$$ 64114 -139500 -95518 -153716 -10816 59585 5482 -93059 261271 8204 76831 236609
18449B36609c07471e8791j29636b6211M348H296c3491k66361G5958j6325f2925
$$ 236609 -307471 -58791 -188427 -26211 -21863 8296 -33491 -299852 75958 59633 -62925
18437A70674C542J31526a15564C79972f2053k62648A29551a99363C6091Q9219
$$ 170674 3542 135068 -115564 379972 -62053 -324701 129551 -199363 36091 125310
18427A25310a71395d4391j49290p3895B63532h6851j5954r4399R4312E4043a68080
$$ 125310 -171395 -44391 -193681 -267576 263532 -86851 -102805 -197204 -102892 54043 -168080
18415a34812q1647a7631F6853J12496g0585j3251A2509k171K35943A8353c1848
$$ -134812 -216459 -17631 66853 179349 -70585 -83836 12509 10338 246281 18353 -31848
18403E4680K19411J38488A2592a93930B00927g651r3053a9406q6393k8124E0158
$$ 54680 274091 412579 12592 -193930 200927 -7651 -100704 -19406 -105799 -133923 50158
18391I4746m172J43541b39229e3397A5361m260L10233b75017A9963e6985F1351
$$ 94746 90574 234115 -239229 -53397 15361 11101 321334 -275017 19963 -56985 61351
18379f9662A69977h8338I1954a08952l6825f0687D9007L0601K32641E0062a90472
$$ -69662 169977 -88338 91954 -108952 -145777 -60687 49007 79608 312249 50062 -190472
18367b33472m651E5341O0723a99305g3558a9554j8967k3676A09833d09301G3749
$$ -233472 -238123 55341 116064 -199305 -73558 -19554 -38521 -62197 109833 -409301 73749
18355a78700A941b21217f8884n9516J0831j97981e322j28052j08818A0043a51329
$$ -178700 1941 -221217 -68884 -128400 -117569 -315550 -5322 -133374 -242192 10043 -151329
18343A37197J07934a75496L5118j0368c691k37234K9419A61875b01267B87679
$$ 137197 245131 -175496 -140378 -150746 -3691 -240925 -211506 161875 -201267 287679
18332C10088h0029h58r6062l10789d3489j50049E6811J93521j8712g8155H6787
$$ 310088 -80029 -858 -96920 -407709 -43489 -193538 56811 250332 231620 -78155 86787
18320b45963a3594C0057K55436A9246c24465A19900R0350j01084a43222A076J19548
$$ -245963 -13594 30057 285493 19246 -324465 119900 210250 109166 -143222 1076 120624
18309A20624b55608B38376p0385c24542d4175D82023h2229A16109k5509Q5446
$$ 120624 -255608 238376 167991 -324542 -44175 482023 -82229 116109 90600 176046
18299A76046p5712h018G7034a40475E3140J54920J56581a29423D5578b97588A46850
$$ 176046 100334 -8018 77034 -140475 53140 208060 364641 -129423 45578 -297588 146850
18287D0004O5887J61811k6448J9294a67544I4410L5003a51425f2239F6537j5292
$$ 40004 105891 267702 241254 260548 -167544 94410 129413 -151425 -62239 66537 51245
18276E1245c39664h4216B01618b40067A89464e1201r6780j197K4324j62411B99228
$$ 51245 -339664 -84216 201618 -240067 189464 -51201 -147981 -149178 -124854 -287265 299228
18264B66716e5727A5518R6093h2896l5347L486j4771q3194J03877C8503K14098
$$ 266716 -55727 15518 111611 -82896 -118243 -114757 -129528 -212722 -108845 38503 252601
18253B52601a57132e9789k04890n6320a48307k1181B81716p856a71723H0369R1750
$$ 252601 -157132 -59789 -264679 -320999 -148307 -169488 281716 273860 -171723 80369 172119
18242A72119i8007k07021F0337c6766m1503K1969j02606q7816j20882J70393A85259
$$ 172119 -98007 -305028 60337 -36766 -78269 -56300 -158906 -246722 -367604 -197211 185259
18230B7144P1682a23648j36884J14851e0038G8907i4515c0510q2235M9372E8355
$$ 27144 98826 -123648 -260532 -145681 -50038 78907 -94515 -30510 -112745 -63373 58355
18218F1350K92300A70991i3060B34987j05361k4944N8781b9479j52245L1621G1451
$$ 61350 353650 170991 -93060 234987 129626 104682 163463 -29479 -181724 -150103 71451
18206c51441B03214b38689K8812n5807A94708a4475J548r3794p8906j14926i7052
$$ -351441 203214 -238689 -209877 -265684 194708 -14475 -12927 -106721 -185627 -300553 -97052
18194I697g5581j6494R453I1188b20673F6622K36380D6683i7498o5165b9537g066
$$ 9697 -75581 -92075 -82622 91188 -220673 66622 303002 46683 -97498 -162663 -29537 -7066
18181b27426G3543f0949K9510o9705j17968B54715m5688E207a62036N791c4217
$$ -227426 73543 -60949 -31439 -101144 -219112 254715 209027 5207 -162036 -156245 -34217
18169A68363G5204d6763B68659J57968c1224h973A65270J0888b3460q683k5761
$$ 168363 75204 -46763 268659 426627 -31224 -8973 165270 176158 -23460 -32143 -57904
18158e7904j00981E4931K29477b17697F2331q298a22453A15998j3091J9229I566
$$ -57904 -158885 54931 284408 -217697 62331 54033 -122453 115998 102907 122136 9566
18146I8360C8331c8582l81861b01263j4061K0933O7959B28532d47062a34256A3991
$$ 98360 38331 -38582 -420443 -201263 -215324 -194391 -126432 228532 -447062 -134256 13991
18134B46291h8294k36652B08504C699a73639k15067J67821f2244o6751l8018a1246
$$ 246291 -88294 -324946 208504 3699 -173639 -388706 -220885 -62244 -128995 -167013 -11246
18122b9794A03493G361N8382N6718k9321Q0932b5808p298k58544F0824b09187
$$ -29794 103493 7361 65743 122461 93140 174072 -25808 -33106 -291650 60824 -209187
18110f5338A49836b51555A05632M9369a85963h7928a4160I504J53046E3365J36008
$$ -65338 149836 -251555 105632 155001 -185963 -87928 -14160 9504 162550 53365 189373
18099A89373n3301n0762K5681J66434e4169G3360d8990A02029l7549g4128I3226
$$ 189373 136072 85310 110991 277425 -54169 73360 -48990 102029 64480 -74128 93226
18087A38536M46080A46548b01094a7133H0666J60792c51763J36887R8828L6658
$$ 138536 584616 146548 -201094 -17133 80666 241458 -351763 -214876 -116048 -79390
18077g9390A03511b4818A5097a53949E7137b32575A03180g4266j02387A28107
$$ -79390 103511 -24818 15097 -153949 57137 -232575 103180 -74266 -176653 128107
18066b54161G1135j1462a74173A82936H3624J80497J52321a11989K5851B16044
$$ -254161 71135 59673 -174173 182936 83624 264121 416442 -111989 -86138 216044
18055A30180i4336C86726A46518L3975b3564A29015J90545g62k22308M6958c8952
$$ 130180 -94336 386726 146518 180493 -23564 129015 319560 -762 -223070 -176112 -38952
18043d6760A14481A3446M5011B8465i3619d1957A73017a64940O6085B3569M5391
$$ -46760 114481 13446 58457 28465 -93619 -41957 173017 -164940 -98855 23569 68960
18032F8960K06005n3977F5060f6601l3091A1591N9477J95569c17641B57361b12840
$$ 68960 274965 220988 65060 -66601 -99692 11591 71068 266637 -317641 257361 -212840
18020b41665B08220b16654E2505J3071L6187b95474a07910a8515n0825A59388
$$ -241665 208220 -216654 52505 65576 101763 -295474 -107910 -18515 -69340 159388
18009H3419a10241F4392f1532E8874b27736A47834K47731B9568K8246L9196J46822
$$ 83419 -110241 64392 -61532 58874 -227736 147834 395565 29568 57814 97010 243832
17998B43832K3283b05347i0451j03098B71578F5724k1048R1302J21869g8338j709
$$ 243832 267115 -205347 -90451 -193549 271578 65724 44676 135978 257847 -78338 -80047
17987h0047A59744j7072D4673K42266g9787k02755F6156c66214b9979C5353g1927
$$ -80047 159744 142672 44673 286939 -79787 -282542 66156 -366214 -29979 35353 -71927
17975H9272d9840m74339a62550r5929I4365R8G30J37048d7730A76532N4533a4657
$$ 89272 -49840 -524179 -162550 -258479 94365 94463 730 137778 -47730 176532 231065 -14657
17962f7992E5619J5081N8746a1562j08422J3182B0840H211L0228b0759C79045
$$ -67992 55619 70700 129446 -11562 -119984 -106802 20840 8211 38439 -20759 379045
17950A01776g941A51999f2750A44139b08403D6718B2155a71599I9054a29376j3108
$$ 101776 -7941 151999 -62750 144139 -208403 46718 22155 -171599 99054 -129376 -142484
17939a42484j13455Q4255Q2503j28628C7568a11617c0520A76051b40335B50576
$$ -142484 -255939 -171684 -89181 -217809 37568 -111617 -30520 176051 -240335 250576
17928A19508l0780c3635C03024C500a43762a6992m0362q0184j3776A2826Q4486
$$ 119508 88728 -33635 303024 3500 -143762 -16992 -57354 -137538 -151314 12826 97312
17917I7312M8715h1992A8014b00435A46682B2468j1003R1992b01345h4423A5115
$$ 97312 146027 -81992 18014 -200435 146682 22468 11465 103457 -201345 -84423 15115
17905D7493j8473M6578e4593B94480e3170E71557a28354k725A4227d8566p2475
$$ 47493 29020 75598 -54593 294480 -53170 571557 -128354 -131079 14227 -48566 -121041
17894a21041A92019c67249A02602a71051b0987m1855j49273N7885N4818A66626
$$ -121041 192019 -367249 102602 -171051 -20987 -62842 -212115 -154230 -99412 166626
17883A03180L9121J19718c6235B61011a1445F6938j1350b22371A15891K6747F3426
$$ 103180 142301 262019 -36235 261011 -11445 66938 55588 -222371 115891 142638 63426
17871a83376L884A13143a0259q8225j38445A49664a35449B22166c5057j61519
$$ -183376 -179492 113143 -10259 -98484 -236929 149664 -135449 222166 -35057 -196576
17861a96576A5971L3240a26393C2294N9389K753Q5851b87230a4647B59720j4698
$$ -196576 15971 49211 -126393 32294 91683 94436 180287 -287230 -14647 259720 245022
17850B45022a68376A16414K45181A27159Q0323J30436c09163O4692J18585j56158
$$ 245022 -168376 116414 361595 127159 207482 337918 -309163 -244471 -125886 -282044
17840b82044o0886H1189K01600B5472f0799a037A06663c22591H0565A3231L64633
$$ -282044 -342930 81189 282789 25472 -60799 -1037 106663 -322591 80565 13231 377864
17829C77864j35088e0603C04841j22974N2303K69649A02270a58568g5480A88732
$$ 377864 242776 -50603 304841 181867 234170 503819 102270 -158568 -75480 188732
17818c73066F690a75857P7339q3590A32660b38125G1786o686b42378B0445b77751
$$ -373066 6690 -175857 -98518 -182108 132660 -238125 71786 65100 -242378 20445 -277751
17806b45034e22D68866k29345r1196h0458j12429B76540b41718B46685b64678
$$ -245034 -522 468866 239521 148325 -80458 -192887 276540 -241718 246685 -264678
17795B48591e20720B50683g6952B36513A2706g9683A0413h1428C90533A50514
$$ 248591 -520720 250683 -76952 236513 12706 -79683 10413 -81428 390533 150514
17784B42080c17610C01392F2780K33080n6733N3382J7152A30399Q0479J82212
$$ 242080 -317610 301392 62780 295860 239127 292509 309661 130399 210878 393090
17774C93090j46018G9195L04009g0321B59848d25551J84713a058k3577f980j44669
$$ 393090 247072 79195 383204 -70321 259848 -425551 -240838 -1058 -24635 -6980 -151649
17763a51649e6522o4925j570d9793A27271J05712B3100b90299h411B90049b2211
$$ -151649 -56522 -121447 -123017 -49793 127271 232983 23100 -290299 -8411 290049 -22211
17751A16062K1261m6687a67614E3683J91856a48633A47917G2987a45563A33148
$$ 116062 137323 90636 -167614 53683 245539 -148633 147917 72987 -145563 133148
17740A47849l2047M690J0893L5208K8980J18363e4674C90263I9058K03982I2356
$$ 147849 115802 120492 131385 166593 195573 313936 -54674 390263 99058 303040 92356
17728C75749a17042D70843A41808M8133M11979I6157A8508b6348B72599O239B6233
$$ 375749 -117042 470843 141808 189941 601920 96157 18508 -26348 272599 278838 26233
17716B51258K466A11500a38135H6620J654e5381h220B1741P6800m5080a6017A65852
$$ 251258 253724 111500 -138135 86620 88274 -55381 -8220 21741 98541 53461 -16017 165852
17703A53669L1598c0055B25314j00240l9519J67793C1040J13561i0850A59497
$$ 153669 185267 -30055 225314 125074 85555 253348 31040 144601 -90850 159497
17692h499j32433A02316J09672c0476A1547M7985J48319F491J24455J78951j24162
$$ -8499 -140932 102316 211988 -30476 11547 59532 207851 6491 130946 309897 185735
17681A85735a68898B65089K15829j41731A00922L17141A62078q129D6162c6664
$$ 185735 -168898 265089 480918 339187 100922 418063 162078 153949 46162 -36664
17670C27270r1582A5215a04833C86106b3640A92079h4107d52j25401B28709n4205
$$ 327270 235688 15215 -104833 386106 -23640 192079 -84107 -452 -125853 228709 174504
17659A74504B3680J85616H1041a22931j6168N1652A79166M4950b15849B28221
$$ 174504 23680 209296 81041 -122931 -139099 -87447 179166 224116 -215849 228221
17648C75847b0663B08457i0885B04686J04452j21351b33507A27785b82226a27197
$$ 375847 -20663 208457 -90885 204686 309138 187787 -233507 127785 -282226 -127197
17637A41329J35336G8892K9150d9032A4406P2584g3917c5290C09758n1142b80395
$$ 141329 276665 78892 108042 -49032 14406 86990 -73917 -35290 309758 258616 -280395
17625D14726j27834j23152O5143M4170C3364P0828j0274K61530h7691n8901A18905
$$ 414726 286892 163740 228883 273053 33364 104192 93918 355448 -87691 -146592 118905
17613B72612a8968B08139g1710C07773a03312B61308e4866H9441K25253o0494
$$ 272612 -18968 208139 -71710 307773 -103312 261308 -54866 89441 314694 254200
17603B54200a2751B5576A1656c0299B74355H475J10345C4074J23501E0461M556
$$ 254200 -12751 25576 11656 -30299 274355 8475 118820 34074 157575 50461 55017
17592E5017M3500D3318e8388A77953H193b41359C5102r38a01215A69304a48072
$$ 55017 98517 43318 -58388 177953 8193 -241359 35102 34164 -101215 169304 -148072
17580i7438B22245H038K98306A30664J06574B5041L50211D1928a08665A24047
$$ -97438 222245 8038 306344 130664 237238 25041 375252 41928 -108665 124047
17569d40705A85140a05982A31513e567A510J09569a38905I6265G236e219k25203
$$ -440705 185140 -105982 131513 -5567 1510 111079 -138905 96265 7236 -5219 -230422
17558b30422B38319N6178K7945a91488A08828P6156i3993H8683Q4796J50683H3071
$$ -230422 238319 294497 322442 -191488 108828 184984 -93993 88683 173479 324162 83071
17546D62074a4639B73414A14520M7405n8234B526K24482J63768A92153l9925K47611
$$ 462074 -14639 273414 114520 161925 103691 2526 227008 390776 192153 152228 399839
17535C99839j45631J15099k4348K08447f7035B57685B9705J74109O7810J40642
$$ 399839 254208 369307 344959 553406 -67035 257685 29705 203814 271624 412266
17525D12266A69576e7568C50115p2556P4149J96023A04650k1907M0853m9537N85849
$$ 412266 169576 -57568 350115 277559 351708 547731 104650 82743 123596 74059 659908
17514F59908m7422j14332P3526J59977K41808K0358o8665P703j24062n8481k135
$$ 659908 612486 498154 571680 731657 973465 993823 925158 932861 808799 750318 748183
17503G48183C14309K70521j39096K07621k63166K18711P1310K59671L80255m46736
$$ 748183 314309 584830 445734 653355 390189 608900 680210 939881 1320136 873400
17493H73400n8263j72596J32367K1712C60672j67631K51842F2830N96521l23963
$$ 873400 815137 642541 774908 796620 360672 193041 444883 62830 659351 335388
17483C35388H7670L20214j47249J49898J59119j29389J01025Q4266k32224p4243
$$ 335388 87670 407884 260635 410533 569652 440263 541288 625554 393330 319087
17473C19087m4973J23551j20231K50216R4282j41123J61571k15528J62251B00576
$$ 319087 274114 397665 277434 527650 621932 480809 642380 426852 589103 200576
17462A95781J97653r7553L77028A84563B3797K96281o9241q0703m1872L29977
$$ 195781 393434 295881 672909 184563 23797 320078 250837 170134 128262 458239
17452D58239q8752P142m6562G92N28045A59316D0390K21622O9190J69310j11325
$$ 458239 369487 376629 330067 792 528837 159316 40390 262012 331202 500512 389187
17441C89187C6467N20469B30105P833K46151j62146M6013j7656l1565n881J31505
$$ 389187 36467 556936 230105 237938 484089 321943 367956 350300 318735 312854 444359
17430D44359n670J95434k88211M97814C21984J7844L91889B65011j9766M40982
$$ 444359 438689 634123 345912 843726 321984 339828 731717 265011 245245 686227
17420F86227r6927j21292K04562j98129J1J76778k71159A80635J79850K12576
$$ 686227 589300 468008 672570 474441 474452 651230 380071 180635 360485 573061
17410E73061k85699K20678q4984J39614K01465l43975r7527M21634m8683m7976
$$ 573061 287362 508040 423056 562670 764135 420160 322633 744267 695584 647608
17400F47608J62908j00635k02557B24017K93287j6671r4634J62135k06541j48116
$$ 647608 810516 709881 507324 224017 517304 500633 405999 568134 361593 213477
17390B13477J61885G4073J28429J35955j21420R806L59875a53975C88360J5510
$$ 213477 375362 74073 202502 338457 217037 226843 586718 -153975 388360 403870
17380D03870j79646o2969J78298l5245J09929F9378J4518M08248p5514G7914J29784
$$ 403870 224224 161255 339553 304308 414237 69378 83896 492144 416630 77914 207698
17369B07698J27513N8648p3297J10688L6270J6954p1585P1808o2262J16426k41370
$$ 207698 335211 393859 320562 431250 467520 484474 412889 484697 422435 538861 297491
17358B97491A19859K99073N7660k6634j55259k0897p4712K18707b4082D32157
$$ 297491 119859 418932 476592 449958 294699 273802 199090 417797 -24082 432157
17347A59616o4898K90037P6970A91085j6240M726K35595j19979B3165J42216R371
$$ 159616 94718 384755 461725 191085 174845 179571 415166 295187 23165 165381 174752
17336A74752B177O0091M11509A91526E6067K31584G8987L54884A74471L72474
$$ 174752 2177 62268 473777 191526 56067 287651 78987 433871 174471 546945
17326E46945k29261l4521K56427A93320L7604J66772J75862A13510L44265j38398
$$ 546945 317684 283163 539590 193320 230924 397696 573558 113510 457775 319377
17316C19377q1889D5996L26461A64199B4100L60829A38576J20813b51728D14380
$$ 319377 237488 45996 372457 164199 24100 384929 138576 259389 -251728 414380
17305D48809j97433R4353L0576A61756K16470j49594J83559j51900J37550j55135
$$ 448809 251376 345729 376305 161756 378226 228632 412191 260291 397841 242706
17295B42706J27512r5430A07130K17777o4079L2467j27831K81884d8906C8984
$$ 242706 370218 274788 107130 324907 260828 293295 165464 447348 -48906 38984
17284B12568K78193A70799M59078j16661J3740k25279j3485j37380J59853A35641
$$ 212568 490761 170799 629877 513216 526956 301677 288192 150812 310665 135641
17273D90148j60129j22812l6007K57598q9502K82374k8604k95529K30245B49153
$$ 490148 330019 207207 171200 428798 339296 621670 593066 297537 527782 249153
17262A83941K53417B12196J5281M82698j56516J18068k20060K4693j35584K2277
$$ 183941 437358 212196 227477 710175 553659 671727 451667 476360 340776 363053
17252C63053C4594K97923K9311K82460B41390M32653B65965K73709j6905k22571
$$ 363053 34594 332517 361828 644288 241390 674043 265965 539674 522769 300198
17242C00198K82414A86467J67831N9325j15702K6018k6536K5959j21855M27301
$$ 300198 582612 186467 354298 413623 297921 323939 297403 323362 201507 628808
17232F28808B09437J20921J07009j34417L60131B66349K88093k46214N469O6174
$$ 628808 209437 330358 437367 302950 663081 266349 554442 308228 313697 379871
17222C79871J29271k00233n4439J5602K24064A77636L28631k1238k21737J6915
$$ 379871 509142 308909 254470 270072 494136 177636 506267 485029 263292 280207
17212B80207j08254o6157j3972L93245A64286K00266N5440J57781j21879j17522
$$ 280207 171953 105796 91824 485069 164286 364552 419992 577773 455894 338372
17202C38372J17647J5813j55662K57334j11349B01902L25603K06388l11177O294
$$ 338372 456019 471832 316170 573504 462155 201902 527505 733893 422716 429010
17192D29010o9635N1161M2223R1206k63616K96650C9475M80339j50523Q0906L47111
$$ 429010 359375 410536 452759 543965 280349 576999 39475 519814 369291 450197 797308
17181G97308l86310m1500J11084q0998K69037R8012k63827B33237l7809M89451
$$ 797308 410998 369498 480582 399584 668621 766633 502806 233237 195428 684879
17171F84879k83224N4141j4752P647j12171K21968k20701K47786A32789O10791
$$ 684879 401655 455796 441044 448691 336520 558488 337787 585573 132789 743580
17161G43580l04198K40878M5330k54486J13901j07341p2746j31649K7426J048081
$$ 743580 439382 680260 725590 471104 585005 477664 404918 273269 300695 1348776
17151A348776B74467N82531l07561J5542N6497k07538Q641M10849l98865B03840
$$ 1348776 274467 856998 549437 564979 621476 413938 422579 833428 434563 203840
17140F78994m666j56656r1220K9604L56033n2729l04269L11488k77364J74463
$$ 678994 674328 517672 426452 456056 812089 759360 455091 766579 489215 663678
17130F63678B03374M61315o4657k55397L99247j31921p1431l3760J35J59854k10293
$$ 663678 203374 664689 600032 344635 743882 611961 540530 506770 506905 666759 456466
17119D56466J28256Q4520k30305K11102r270L09647l47618K65115l97905J90193
$$ 456466 584722 669242 438937 650039 640769 950416 602798 867913 470008 660201
17109F60201j09537J78156O0691l91070J16544j3786O4130M33047m49249K43270
$$ 660201 550664 728820 789511 398441 514985 501199 565329 998376 549127 792397
17099G92397k8838o4310j28266R9566n9086P1610k21221N07748j21301q6817j38675
$$ 792397 763559 699249 570983 670549 611463 683073 461852 969600 848299 761482 622807
17088F22807K74634J01030l70987J26354j24080m8194L18101k8882o4545j37364
$$ 622807 897441 998471 627484 753838 629758 581564 899665 870783 806238 668874
17078F68874l5582Q4197L0502N7789Q8079J74973r9455j82875Q3212l32048Q8535
$$ 668874 633292 717489 747991 805780 893859 1068832 969377 786502 869714 537666 626201
17067F26201K47515m0935o8506j56708J69497j25218J35753O9123q620n2332K0336
$$ 626201 873716 832781 764275 607567 777064 651846 787599 856722 848102 795770 816106
17056H16106M71526j06588l63513m0784J53491m40913M60291j59819J26090k36574
$$ 816106 1287632 1181044 817531 776747 930238 489325 949616 789797 915887 679313
17046F79313L20517j34528J60917j13197k21968J38900j98528r0170M61443k7106
$$ 679313 999830 865302 1026219 913022 691054 829954 631426 541256 1002699 975593
17036I75593K28296o9049k15004J19846k60143M36387j51451q2871k34050N10459
$$ 975593 1203889 1134840 919836 1039682 779539 1215926 1064475 981604 747554 1258013
17026A258013p6926j60349K59878n9653k67247N1434M99720n01874N8442n211
$$ 1258013 1181087 1020738 1280616 1220963 953716 1005150 1504870 1002996 1061438 1056227
17016A056227J79288l03313J74127o3649K18717q0465J50808Q608K4391l65088
$$ 1056227 1235515 932202 1106329 1042680 1261397 1180932 1331740 1340348 1364739 999651
17006I99651P7551J63569n33714N85728l99621Q1305K9517M78507Q5177k63470
$$ 999651 1077202 1240771 707057 1292785 893164 974469 1003986 1482493 1567670 1304200
16996A304200k20125K58544J38927k18458j71308J29360R3460j10855q8960M17230
$$ 1304200 1084075 1342619 1481546 1263088 1091780 1221140 1314600 1203745 1114785 1532015
16986A532015j08062j30678J45974j10034J87535O3700m80162K02500k07958M06996
$$ 1532015 1423953 1293275 1439249 1329215 1516750 1580450 1100288 1302788 1094830 1501826
16976A501826l12164K30938N23088n07372l78380O08678j13957k17409K69404
$$ 1501826 1189662 1420600 1943688 1436316 1057936 1666614 1552657 1335248 1604652
16967A604652j83082M26371J15818j59455m44615J87842o9163K04252K48181l56504
$$ 1604652 1421570 1847941 1963759 1804304 1359689 1547531 1478368 1682620 1930801 1574297
16957A574297j8926J43809N0714k61641J67646n3757J8003m9661J79184o1246
$$ 1574297 1555371 1699180 1749894 1488253 1655899 1602142 1620145 1570484 1749668 1688422
16947A688422J54613k15773j42125P8188K03069L5581P1169J55433j80841K06982
$$ 1688422 1843035 1627262 1485137 1563325 1766394 1801975 1873144 2028577 1847736 2054718
16937B054718j92028O7505j94285L9509M72251n0693k14603J59624j52485K00491
$$ 2054718 1862690 1930195 1735910 1775419 2247670 2196977 1982374 2141998 1989513 2190004
16927B190004k25914J36449N01893k44453k66374J188J07497p3930L1565M25408
$$ 2190004 1964090 2100539 2602432 2357979 2091605 2092793 2200290 2126360 2157925 2583333
16917B583333m43252K30178o8529K71410k71651M05352n41368J20984L26086Q7037
$$ 2583333 2140081 2370259 2301730 2573140 2301489 2706841 2165473 2286457 2612543 2699580
16907B699580R9875j88518j83395J28530K17405o5465q8965l1149J58025m8258
$$ 2699580 2799455 2610937 2427542 2556072 2773477 2708012 2619047 2587898 2745923 2697665
16897B697665M5258N1107k24307J68558K49818K25135k24901K3194o2838L14175
$$ 2697665 2742923 2794030 2569723 2738281 2988099 3213234 2988333 3011527 2948689 3262864
16887C262864K32440n55479K80343L33586j93142l85411L02684k48749N82656
$$ 3262864 3495304 2939825 3220168 3553754 3360612 2975201 3277885 3029136 3611792
16878C611792r5515J97436k71478j11910J44221K07578k42479K15799L1326j53688
$$ 3611792 3516277 3713713 3442235 3330325 3474546 3682124 3439645 3655444 3686770 3533082
16868C533082N46106l56363m5120M25813k49187J68583r3750Q8053M02688l08961
$$ 3533082 4079188 3722825 3677705 4103518 3854331 4022914 3929164 4017217 4419905 4110944
16858D110944k4302J68331M12298k03031L58548l06198M33257l58642M05214N9914
$$ 4110944 4086642 4254973 4667271 4464240 4822788 4516590 4949847 4591205 4996419 5056333
16848E056333J35141j35769Q5387O7875N44589n40301J29456o5103L40517J95466
$$ 5056333 5191474 5055705 5141092 5208967 5753556 5213255 5342711 5277608 5618125 5813591
16838E813591j61281K14855O7833m3170K5596j8538L11401M587J49453p9177M23190
$$ 5813591 5652310 5867165 5934998 5891828 5917424 5898886 6210287 6214874 6364327 6285150 6708340
16827F708340o732k7553K95171J45094K78167l09571K73377M36661j22311k00285
$$ 6708340 6701608 6674055 6969226 7114320 7392487 7082916 7356293 7792954 7670643 7470358
16817G470358L06677N52610k26123M6833L00141L36959l8548M09111l17769M85208
$$ 7470358 7777035 8329645 8103522 8150355 8450496 8787455 8748907 9158018 8840249 9325457
16807I325457P4390L73840J64631K10807j60773L23511O76826j31245K85473L85569
$$ 9325457 9399847 9773687 9938318 10149125 9988352 10311863 10988689 10857444 11142917 11528486
16797A1528486j97401J36586O08996P0214L88397j40616Q32055p6886L54501K20542
$$ 11528486 11331085 11467671 12076667 12146881 12535278 12394662 13226717 13149831 13504332 13724874
16787A3724874N36972J41195O17837J87349K62052O33262m3344P76230L37248
$$ 13724874 14261846 14403041 15020878 15208227 15470279 16103541 16060197 16836427 17173675
16778A7173675K21535O07467L48348M13608O92449P82531M9804P10278J91636
$$ 17173675 17395210 18002677 18351025 18764633 19457082 20239613 20289417 20999695 21191331
16769B1191331O98731Q99381N42848L32653J244660N95764M02053J168062N08498
$$ 21191331 21890062 22789443 23332291 23664944 24909604 25505368 25907421 27075483 27583981
16760B7583981J048659Q85576N88857J054144R64540J153091Q51685J032749J292314
$$ 27583981 28632640 29518216 30107073 31161217 32125757 33278848 34130533 35163282 36455596
16751C6455596J036023J783535R77854J472857J615469J141662J619385J334840
$$ 36455596 37491619 39275154 40253008 41725865 43341334 44482996 46102381 47437221
16743D7437221J892580J731456J984159K025627K092466J504307K814444J717908
$$ 47437221 49329801 51061257 53045416 55071043 57163509 58667816 61482260 63200168
16735F3200168K551768K437102K535524K526265K839989K682930K519957L094788
$$ 63200168 65751936 68189038 70724562 73250827 76090816 78773746 81293703 84388491
16727H4388491K893442K766112L255711L120660K880564K961170L229358K626160
$$ 84388491 87281933 90048045 93303756 96424416 99304980 102266150 105495508 108121668
16719A08121668K828404K893076K761722K575500K075868J820601K343284J197845
$$ 108121668 110950072 113843148 116604870 119180370 121256238 123076839 125420123 126617968
16711A26617968J055782J253161N50963L92016j80210l24703p22730j026071j454892
$$ 126617968 127673750 128926911 129477874 129869890 129689680 129364977 128642247 127616176 126161284
16702A26161284j443404k095036k356480j725578k946495k609928k608448l159769
$$ 126161284 124717880 122622844 120266364 118540786 115594291 112984363 110375915 107216146
16694A07216146l307224l233044k762889k801018l423405k757379l266139k845107
$$ 107216146 103908922 100675878 97912989 95111971 91688566 88931187 85665048 82819941
16686H2819941l164863k705441l172392k411415k799399k369355k193622k737499
$$ 82819941 79655078 76949637 73777245 71365830 68566431 66197076 64003454 61265955
16678F1265955k343759j902278k167824k218276k008832j834412j746666j271804
$$ 61265955 58922196 57019918 54852094 52633818 50624986 48790574 47043908 45772104
16670D5772104j776051j691528j520866j579834j341223j412363j130997j050312
$$ 45772104 43996053 42304525 40783659 39203825 37862602 36450239 35319242 34268930
16662C4268930j116936j277168p33439j274886q35848j151967o76557n71296j289873
$$ 34268930 33151994 31874826 31141387 29866501 29030653 27878686 27202129 26630833 25340960
16653B5340960n98284p27178o91153o62616q05568p01876k57073r45378q04371
$$ 25340960 24742676 24015498 23324345 22661729 21856161 21154285 20897212 19951834 19147463
16644A9147463n6506o91376m68149k13222o79966l27545k51859q07788l39094
$$ 19147463 19090957 18399581 17931432 17718210 17038244 16710699 16458840 15651052 15311958
16635A5311958k85841k98567q14087K48486n65375l24124l30860j12383o39782
$$ 15311958 15026117 14727550 13913463 14161949 13596574 13272450 12941590 12829207 12189425
16626A2189425K25080n07026n15738k82886K8741j74286l20518j29934q79984
$$ 12189425 12414505 11907479 11391741 11108855 11137596 10963310 10642792 10512858 9632874
16617I632874M47379m03247r4483j47457j75930k61541l00969m3129o70828L7169
$$ 9632874 10080253 9677006 9582523 9435066 9259136 8997595 8696626 8653497 7982669 8019838
16607H019838J37662l55721k29890K30464m05561j48084m2272j42000q4411m92035
$$ 8019838 8157500 7801779 7571889 7802353 7396792 7248708 7206436 7064436 6980025 6487990
16597F487990L63427l40902K05759j70981k77673O4441l65331o4074r3985J43886
$$ 6487990 6851417 6510515 6716274 6545293 6267620 6332061 5966730 5902656 5808671 5952557
16587E952557r9040n5333j29551m39123m8038N680L9136j74269l95446M13381
$$ 5952557 5853517 5798184 5668633 5229510 5181472 5187152 5226288 5052019 4656573 5069954
16577E069954j80722n10961K87240l02744N21959m63539Q2082l72778M9052L01015
$$ 5069954 4889232 4378271 4665511 4362767 4884726 4421187 4503269 4130491 4179543 4480558
16567D480558n06360m2979j45223j07676J85835M24325n60271J38661r2648L4557
$$ 4480558 3974198 3931219 3785996 3678320 3864155 4288480 3728209 3866870 3774222 3808779
16557C808779m32358J46983J38508j57714j16421j16694L04293k36613N0168l00241
$$ 3808779 3376421 3523404 3661912 3504198 3387777 3271083 3575376 3338763 3388931 3088690
16547C088690k79897N1176l2192K19143L24486p22273L28557p3773k3435j10708
$$ 3088690 2808793 2859969 2827777 3046920 3371406 2649133 2977690 2903917 2880482 2769774
16537B769774k40995K42796k95058J85227J85103k87647K7601l03169K45721j14608
$$ 2769774 2528779 2771575 2476517 2661744 2846847 2559200 2586801 2283632 2529353 2414745
16527B414745M616J60692j18529q2539l02442J45199J0695m8111k58039K91382
$$ 2414745 2419361 2580053 2461524 2378985 2076543 2221742 2232437 2184326 1926287 2217669
16517B217669j03974m7618L52955l10654J8830o8486J02859k29696P1210q2065
$$ 2217669 2113695 2066077 2419032 2108378 2127208 2058722 2161581 1931885 2003095 1921030
16507A921030J2015Q22j1979N3093J10285j87882l78657N99639P3191j98456j88847
$$ 1921030 1933045 1933867 1921888 1974981 2085266 1897384 1518727 2118366 2191557 1993101 1804254
16496A804254m05511M31328p2612k0675k45916J02930M4350J64668m48998K54097
$$ 1804254 1398743 1830071 1757459 1736784 1490868 1593798 1638148 1802816 1353818 1607915
16486A607915j06366J34335k16279k09537K12728m2079r7699q6290Q8532K65304
$$ 1607915 1501549 1635884 1419605 1210068 1422796 1380717 1283018 1196728 1285260 1550564
16476A550564m88721L79184l41571J84136J95057q4532n9451l9872P6877r469
$$ 1550564 1061843 1441027 1099456 1283592 1478649 1394117 1334666 1294794 1371671 1362202
16466A362202M81q5185m7992J55032k02355L2614l80393K46295J41503l17819
$$ 1362202 1362683 1277498 1229506 1384538 1182183 1214797 834404 1080699 1222202 904383
16456I04383J91627N23044n20558L15874l8103k9124l06256j4282L76999k63681
$$ 904383 1096010 1619054 1098496 1414370 1376267 1347143 1040887 1026605 1403604 1139923
16446A139923n3527m2853J10792l65300l3553M56408l62753L5162L05385k17194
$$ 1139923 1086396 1043543 1154335 789035 755482 1211890 849137 884299 1189684 972490
16436I72490J84550P6315j94153L5904k19803k49927M53944l67849M7014L89381
$$ 972490 1157040 1233355 1039202 1075106 855303 605376 1059320 691471 738485 1127866
16426A127866R4599J79907m20370k27591L50818m98237J61294K89668P6501j69115
$$ 1127866 1222465 1402372 982002 754411 1105229 606992 768286 1057954 1134455 965340
16416I65340q8287L13731m73987K0684l5181q4878Q2298l3942K45814k76846M77952
$$ 965340 877053 1190784 716797 737481 702300 617422 699720 665778 911592 634746 1112698
16405A112698k49680j99483K72541r1875C83250L36772j80643J4431j4172N7063
$$ 1112698 863018 663535 936076 844201 383250 720022 539379 553810 539638 596701
16395E96701J62743p4302J92055k16833K0698j45566J83195j4416L04443m02844
$$ 596701 759444 685142 877197 660364 681062 535496 718691 704275 1008718 605874
16385F05874j1110L58638C65516K19937K33409j52523p0278J6730L90479m09718
$$ 605874 594764 953402 365516 585453 818862 666339 596061 612791 1003270 593552
16375E93552J82291m8046k8868j76307r2595J80221j0815R7664j82145L1832j2235
$$ 593552 775843 727797 698929 522622 430027 610248 599433 697097 514952 546784 534549
16364E34549M7739B15533L13114K14891O3249N6890j51119l12744J36744p3980
$$ 534549 582288 215533 528647 743538 806787 863677 712558 399814 536558 462578
16354D62578J28743J41473k58043M12322k34986J01030k30234L6141B77358M35035
$$ 462578 591321 732794 474751 887073 652087 753117 522883 559024 277358 712393
16344G12393j40646J83337k03124j01049M2128l8265O4987Q1549k20365J11521
$$ 712393 571747 755084 551960 450911 493039 454774 519761 601310 380945 492466
16334D92466A96825J00897m4029n0118L66584j06307j70867L93513k73111j65771
$$ 492466 196825 297722 253693 203575 570159 463852 292985 686498 413387 247616
16324B47616N19420B43293K89408j37265J14574I5867K77311M36556k81650A08809
$$ 247616 767036 243293 532701 395436 510010 95867 373178 809734 528084 108809
16313E90642O1840j62192j18872k256m1961K0291O1858q6644J47827A89141L36359
$$ 590642 652482 490290 371418 369162 327201 347492 409350 322706 470533 189141 525500
16302E25500j82920J97020j81802m3162O9590Q806j59987O0501L3921G8169L7777
$$ 525500 342580 539600 357798 314636 384226 393032 233045 293546 327467 78169 115946
16291A15946L71197A4703Q9938P1190R1658K4334L51942C10989J86996a35850
$$ 115946 487143 14703 104641 175831 267489 291823 643765 310989 497985 -135850
16280C12091A34634K17495A18540J69751M3464A9805J11342M13746B19557K58598
$$ 312091 134634 352129 118540 288291 331755 19805 131147 544893 219557 478155
16270D78155r7110R8142j82765F1095J91531E7538J28810R800K88896O7668B75675
$$ 478155 381045 479187 296422 61095 252626 57538 186348 196148 485044 552712 275675
16258C06786o0211L3968K03307k38595J97229g6064B88969F8939K02925J32423
$$ 306786 246575 280543 483850 245255 442484 -76064 288969 68939 271864 404287
16248D04287A46730O03683C1409J19572K50418j85346J02238E8991f6255E27947
$$ 404287 146730 750413 31409 150981 401399 216053 318291 58991 -66255 527947
16237A45168K13417A45669O3675p2348L45708J22920B15544q4126J81856j29373
$$ 145168 358585 145669 209344 136996 482704 605624 215544 131418 313274 183901
16227A83901C8289J32506l8177K16426g005D75278k11203o934a6302F7334J51612
$$ 183901 38289 170795 132618 349044 -7005 475278 264075 257141 -16302 67334 218946
16216B18946E7608M3920O8395k5194Q8415a20852A21493B6001b52131G9296J93265
$$ 218946 57608 101528 169923 144729 233144 -120852 121493 26001 -252131 79296 272561
16205B72561E0397k1825o024K94225j45655K32697A51431A4214K5693K36265j11514
$$ 272561 50397 28572 22548 316773 171118 403815 151431 14214 39907 276172 164658
16194A64658a86559C46648a935B23276E8226L1492K13053l3960K24450a2005A23422
$$ 164658 -186559 346648 -1935 223276 58226 89718 302771 268811 493261 -12005 123422
16182D36373o8284A53337m0484e8796C64481q1540B7075M7706J23364E5483Q4574
$$ 436373 368089 153337 112853 -58796 364481 282941 27075 74781 198145 55483 140057
16171A40057C3108m195Q3311D0963K35551L74572B08468Q7848f4999A81661J18744
$$ 140057 33108 28913 112224 40963 276514 651086 208468 296316 -64999 181661 300405
16160C00405a49430d197C15594j24299C2815b4522O807A44555K12452n2181n1019
$$ 300405 -149430 -4197 315594 191295 32815 -24522 -17715 144555 357007 304826 253807
16149B53807J9994r5567f389B64638r8085m4771K3111e0580A09095O7144a55625
$$ 253807 273801 178234 -6389 264638 166553 121782 144893 -50580 109095 176239 -155625
16137B06486I1353K7062J175K27596a304k0910B30432E5646J20643G5209B0777
$$ 206486 91353 118415 119590 347186 -1304 -22214 230432 55646 176289 75209 20777
16125B91737K21451A0249J57286B7060K7845A9086K83218c08797F25350D4786
$$ 291737 513188 10249 167535 27060 54905 19086 302304 -308797 625350 44786
16114B33598A9917R7405b31159h3441J8541C87319a67000D26004B3323a01508
$$ 233598 19917 117322 -231159 -83441 -64900 387319 -167000 426004 23323 -101508
16103B29603J8507c53237C47200A1080M0086P1944l147h0942I4093a61462B79907
$$ 229603 248110 -353237 347200 11080 51166 123110 119963 -80942 94093 -161462 279907
16091B6791f6972b3812C69061a79912B27856a52336J8692d3921C43934H7528j2140
$$ 26791 -66972 -23812 369061 -179912 227856 -152336 -133644 -43921 343934 87528 75388
16080G5388d63688d8611l8405K5591H0435a09004m1074A26828a05205C63254H2318
$$ 75388 -463688 -48611 -87016 -61425 80435 -109004 -150078 126828 -105205 363254 82318
16068a15490B43570A3344D601h0090b635l8684q4122A26721j3715e572G5242R4706
$$ -115490 243570 13344 4601 -80090 -2635 -41319 -125441 126721 113006 -5572 75242 169948
16056A69948b48664B71006E2989a26381A15123J70243b61857B71991A10490b3336
$$ 169948 -248664 271006 52989 -126381 115123 285366 -261857 271991 110490 -23336
16045B5258K08675a58143o3157G8568J53307G8003Q6991B1488b8946j9025o1113
$$ 25258 233933 -158143 -221300 78568 231875 78003 164994 21488 -28946 -47971 -109084
16034a09084A20860a39384A81973q7198a40052A69407b95800A9572Q6484K59493
$$ -109084 120860 -139384 181973 94775 -140052 169407 -295800 19572 106056 365549
16024C65549B2072c3300r0442E6513k1772J32931F5620b6461B44124d0466k81532
$$ 365549 22072 -33300 -123742 56513 34741 167672 65620 -26461 244124 -40466 -321998
16013c21998B63236q2773a62043H3609a21807A46230b1119l5628O540C4021o953
$$ -321998 263236 180463 -162043 83609 -121807 146230 -21119 -56747 -50207 34021 27068
16002B7068c19251c2359j96596A08979N3021J35392A22457E9044a92095c1598
$$ 27068 -319251 -32359 -228955 108979 162000 297392 122457 59044 -192095 -31598
15991a08680B79601a89771j55361I7713a8366D47744A43762D7301b3132j17040
$$ -108680 279601 -189771 -345132 97713 -18366 447744 143762 47301 -23132 -140172
15981a40172K5991A98859a1361q1245A60627G9606K82531A34515J88866N28510
$$ -140172 -114181 198859 -11361 -92606 160627 79606 362137 134515 323381 851891
15971H51891k50799J63242K92812K83695o54871N8152C67995j58260p7254L22704
$$ 851891 601092 764334 1057146 1340841 685970 744122 367995 209735 132481 455185
15961D55185G611K74562b60472O7697N4880A8866h6062A13969D902a25671E8436
$$ 455185 7611 282173 -260472 -192775 -137895 18866 -86062 113969 4902 -125671 58436
15949a11132F4827M4900R7566a70695A18648a00240A2283c9865j00369c9404m4049
$$ -111132 64827 109727 207293 -170695 118648 -100240 12283 -39865 -140234 -39404 -83453
15938h3453k518j55367F8500a82178k4225H6200j3443K3663R5536d07207D3266
$$ -83453 -85971 -241338 68500 -182178 -206403 86200 72757 96420 191956 -407207 43266
15926a25336k33931d7318k18832G2018K466a33795q6827i2467q1649C69252B6590
$$ -125336 -359267 -47318 -266150 72018 74484 -133795 -220622 -92467 -174116 369252 26590
15914A0792a73988D8021J46852o7795h3710A05754D0777a78499E137b54268B6265
$$ 10792 -173988 48021 194873 127078 -83710 105754 40777 -178499 5137 -254268 26265
15902a83602A857g6240A64229C8797N1740d7131m5334C96727a08864l0569M8702
$$ -183602 1857 -76240 164229 38797 90537 -47131 -92465 396727 -108864 -139433 -90731
15891i0731L7619E2159b6140A0122K136L00308A9551J50274L7723m5736a81106
$$ -90731 -53112 52159 -26140 10122 12258 312566 19551 169825 207548 161812 -181106
15879a55096b1092j38023A09976J081J48957a99644a2376E546b35204m0543a21906
$$ -155096 -21092 -159115 109976 111057 260014 -199644 -12376 5546 -235204 -275747 -121906
15867b39630D5601R0423b0999k625k09667a532A96506i0577c1436E4784a59190
$$ -239630 45601 136024 -20999 -23624 -233291 -1532 196506 -90577 -31436 54784 -159190
15855f6241j58269B19169c05665f6668j36268A36268a63478B31954a62808j76642
$$ -66241 -224510 219169 -305665 -66668 -202936 136268 -163478 231954 -162808 -339450
15845c39450i2282B42144d7930A3331c61465B4815a02690H9713O6704c13218B11107
$$ -339450 -92282 242144 -47930 13331 -361465 24815 -102690 89713 156417 -313218 211107
15833B20766F3837b06122f4063q6416E5757a36937C42360b38681N2196j33394
$$ 220766 63837 -206122 -64063 -150479 55757 -136937 342360 -238681 -186485 -319879
15823c19879a17909K9424j17647i1954D16113A60344a42651l43271A29446R4811
$$ -319879 -117909 -88485 -206132 -91954 416113 160344 -142651 -485922 129446 224257
15813B24257f0942J7059a1952A1284Q918d7980A27427D8747N7676a73604Q6343
$$ 224257 -60942 -43883 -11952 11284 20202 -47980 127427 48747 106423 -173604 -87261
15802h7261I7261J26290q155r0663J21929C8503a87930A91416P0355a3870k68265
$$ -87261 97261 223551 215396 124733 246662 38503 -187930 191416 261771 -13870 -282135
15791b82135f2763H2186c07216A57699B3059a85377N8583A55548k9871A495N044
$$ -282135 -62763 82186 -307216 157699 23059 -185377 -126794 155548 125677 1495 6539
15780F539g6298k0868d5383j65437B32663i4768k01206A8555a26578A09313c55131
$$ 6539 -76298 -97166 -45383 -210820 232663 -94768 -295974 18555 -126578 109313 -355131
15768b6355f931n9784l33617a55573N1512j88I571h8547k5041k82342J18089A13006
$$ -26355 -6931 -66715 -400332 -155573 -104061 -104249 9571 -88547 -113588 -395930 -277841 113006
15755c49305a44803I3641g5286k1818j3936A05941h5723B52187a26368G546a5692
$$ -349305 -144803 93641 -75286 -97104 -111040 105941 -85723 252187 -126368 7546 -15692
15743A40652b2167l18337E813M4578P8415M94330B71611a1188G4923e3166G0574
$$ 140652 -22167 -340504 5813 50391 128806 623136 271611 -11188 74923 -53166 70574
15731a22437A2601e784I8077J98771j47934J5867a54518E948a57991B7580c1956
$$ -122437 12601 -5784 98077 296848 148914 164781 -154518 5948 -157991 27580 -31956
15719d1370C4784b6652k10223A64516h8390B27441C7494d6089B2547R9127a94580
$$ -41370 34784 -26652 -236875 164516 -88390 227441 37494 -46089 22547 121674 -194580
15707a85743k1545O2901A73a8773P158j15543A8087a2665B99863F8123a52237
$$ -185743 -207288 -144387 173 -18773 -11615 -127158 18087 -12665 299863 68123 -152237
15695b11873N8053K2691j0843a6077A4609J0067J27877F8109O0316b48681D79
$$ -211873 -153820 -131129 -141972 -16077 14609 24676 152553 68109 128425 -248681 479
15683G6354C5922N0715h8233q5320A68155i0546c7369D3292K40731j01781o0910
$$ 76354 35922 86637 -88233 -173553 168155 -90546 -37369 43292 284023 182242 121332
15672A21332d2119C0443J72704e0486M983q2162B4134R3929h8333l910a4335C03827
$$ 121332 -42119 30443 203147 -50486 -45503 -127665 24134 118063 -88333 -92243 -14335 303827
15659C27338F5727J39698d2293p1093I4739m738d6753k286C9974K79552h2480
$$ 327338 65727 205425 -42293 -113386 94739 90001 -46753 -49039 39974 319526 -82480
15647D882a70498H154L797J98236a05581A51709P1782b15625k02606a93721E2171
$$ 4882 -170498 8154 11951 210187 -105581 151709 223491 -215625 -418231 -193721 52171
15635a14535A41733b00680j2592F8082a5617A38890A6414N4168a11843k64446
$$ -114535 141733 -200680 -213272 68082 -15617 138890 16414 70582 -111843 -376289
15625c76289A35694A4685a78254e4766D96954b54568C2096J3208a74740J9183
$$ -376289 135694 14685 -178254 -54766 496954 -254568 32096 45304 -174740 -155557
15615a55557B7326N5911g5927j60222B59011d6149F8639B1412a57196k4407A51483
$$ -155557 27326 83237 -75927 -236149 259011 -46149 68639 21412 -157196 -181603 151483
15603I9229B3783a23661A47316b9023j09149M1162j27871e9752k03979N0636A38787
$$ 99229 23783 -123661 147316 -29023 -138172 -97010 -224881 -59752 -263731 -213095 138787
15591a37518h963j03529C2889P7166C2069c18852B1416R6458a80391N5070K3294
$$ -137518 -8963 -112492 32889 110055 32069 -318852 21416 117874 -180391 -125321 -102027
15580a02027J4990m9559r2219R6305A59849A998b42246B00718H1572b87564c2338
$$ -102027 -87037 -136596 -228815 -132510 159849 1998 -242246 200718 81572 -287564 -32338
15568c22472J07667J5663m6893P2702d2997F5374b26755a00029d6217J0426A9569
$$ -322472 -214805 -199142 -246035 -173333 -42997 65374 -226755 -100029 -46217 -35791 19569
15556f6394b6681F3413M8496J07810Q6510a86875C696J77218o3063L150D1119
$$ -66394 -26681 63413 111909 219719 306229 -186875 3696 180914 117851 121001 41119
15544B22082G8524c7594B8351f7317r5062B4718K99230a8361l4900a1427l03933
$$ 222082 78524 -37594 28351 -67317 -162379 24718 323948 -18361 -53261 -11427 -315360
15533c15360j90282A8161j032J5951L940J07109l0811m4235a44704C9012J01270
$$ -315360 -505642 18161 17129 33080 37020 144129 113318 69083 -144704 39012 140282
15522A40282D2013L4825B4809c52408F5589O1858a42457k43893h4998B93272a15138
$$ 140282 42013 76838 24809 -352408 65589 127447 -142457 -386350 -84998 293272 -115138
15510A39191a27029A08577L05080c8827B33958d3030F5750d01974B86930b14917
$$ 139191 -127029 108577 413657 -38827 233958 -43030 65750 -401974 286930 -214917
15499C30142K4877j04777C5621b0827C11579J31570B18253J88783Q9752B48034
$$ 330142 355019 250242 35621 -20827 311579 443149 218253 407036 496788 248034
15488B06996j9462O0803a81641A65511J19794B1926O2350a09415C47360l0253
$$ 206996 187534 248337 -181641 165511 285305 21926 84276 -109415 347360 317107
15478C17107j46981a24897l7762O4535C16873A48243b42187A42520P7801I4307
$$ 317107 170126 -124897 -162659 -98124 316873 148243 -242187 142520 220321 94307
15467c0356A19284R4159F91J46707O9473D8635J74513K22753K01677k48485l0841
$$ -30356 119284 213443 691 147398 216871 48635 223148 445901 647578 399093 368252
15456C68252j4619Q4184q4160J16397a07852A82719j1744K79775E9941D696b13807
$$ 368252 353633 437817 353657 470054 -107852 182719 170975 450750 59941 4696 -213807
15444b43291c1595A0310f5465A77468J56746j3545b62826A94199r3894J00052
$$ -243291 -31595 10310 -65465 177468 334214 320669 -262826 194199 100305 200357
15434B00357Q0065A36512E4709a8648B68421J75282j75774N5361O26012J97709
$$ 200357 280422 136512 54709 -18648 268421 443703 267929 323290 949302 1147011
15424A147011K1884m25344r3718K96627F2482L29040j50923F1516M35902j97996
$$ 1147011 1168895 743551 649833 946460 62482 391522 240599 61516 497418 299422
15414B99422I4329d7158C9233K1536J8271J50455H6431K57497O4826a20411B58797
$$ 299422 94329 -47158 39233 60769 79040 229495 86431 343928 408754 -120411 258797
15402c44601f7091A4021g2633p6048D949P5964d8934A0781N4392J4875e9175C512
$$ -344601 -67091 14021 -72633 -148681 4949 80913 -48934 10781 65173 80048 -59175 3512
15389a9947A05879b0088D0697K03038a40066A08815f0735k2231C73295h8165A99355
$$ -19947 105879 -20088 40697 243735 -140066 108815 -60735 -82966 373295 -88165 199355
15377A14145L4165a99374A50035C0058L75122j22991g6599D84269e4543D01463
$$ 114145 148310 -199374 150035 30058 405180 282189 -76599 484269 -54543 401463
15366h1481b1805B36896F4361a18349C27895A46008a84418I741K18204f9513C33665
$$ -81481 -21805 236896 64361 -118349 327895 146008 -184418 9741 227945 -69513 333665
15354D04599j43371G7474J49608J63796c8723j10221A70831H1567L2978K05842
$$ 404599 261228 77474 227082 390878 -38723 -148944 170831 81567 114545 320387
15344C20387H7833c3696r7896K2312G7122K98876m8968A03180f8266C62330j44824
$$ 320387 87833 -33696 -131592 -109280 77122 375998 327030 103180 -68266 362330 217506
15333B17506K65338B7502L5404K6840O8712F9885K08500K15446p0149m4423j0567
$$ 217506 482844 27502 62906 89746 158458 69885 278385 493831 423682 379259 368692
15322C68692j25939O2807K33622B61812a21262K0842D4924j4632J09670O2364
$$ 368692 242753 305560 539182 261812 -121262 -100420 44924 30292 139962 202326
15312B02326F5576m470J03709F4011J39340G1378f1119B33856g3474J7440B45448
$$ 202326 65576 61106 164815 64011 203351 71378 -61119 233856 -73474 -56034 245448
15300C07171D0200d689B18686H6268d0049A11058N89371D2391L91345A12093K48108
$$ 307171 40200 -4689 218686 86268 -40049 111058 700429 42391 433736 112093 360201
15289C60201B5283J29897L3286d6845A33314D6994o808K407K69952M0688o7218
$$ 360201 25283 155180 188466 -46845 133314 46994 40186 42593 312545 353233 286015
15278B86015c3683E43585e3364C49705a57669q5661R5745A44695j2254f5690K8824
$$ 286015 -33683 543585 -53364 349705 -157669 -243330 -147585 144695 132441 -65690 -36866
15267c6866k01249b5058o8723A5978M80537B6006J7484J60402I6574l2534Q2849
$$ -36866 -238115 -25058 -93781 15978 496515 26006 43490 203892 96574 64040 146889
15256A46889L50080a08353D8155J20894c9205B8024C517K56073a21544q344m2610
$$ 146889 496969 -108353 48155 169049 -39205 28024 3517 259590 -121544 -129888 -172498
15245a72498B62799o7265R0798C7999Q5384K3438J4672m5574Q464K16235A20729
$$ -172498 262799 195534 286332 37999 123383 146821 161493 115919 124383 340618 120729
15233A46246m614D9743d7286B09056p773K64618J08964O51408L62757q7213O7767
$$ 146246 141632 49743 -47286 209056 201283 465901 574865 1226273 1589030 1501817 1569584
15222A569584l98401m43299q5306j41261G7357K79596e3290A96064J76078j70905
$$ 1569584 1171183 727884 642578 501317 77357 356953 -53290 196064 372142 201237
15212B01237m9695M948p7117b16722A89161J46751A26015K30843j78297a44255
$$ 201237 151542 156490 79373 -216722 189161 335912 126015 356858 178561 -144255
15201a60159A57710a69193H0402C5767O2218N2554b5805A15507a59854E15077
$$ -160159 157710 -169193 80402 35767 97985 150539 -25805 115507 -159854 515077
15190A72588H1647O0597d7625B6706L3280O9615b31902F443h9058C25932j14168
$$ 172588 81647 142244 -47625 26706 59986 129601 -231902 6443 -89058 325932 211764
15179B11764m8161K14695B5694L15918A13804n840J28134o6292M3370f489A23745
$$ 211764 163603 378298 25694 341612 113804 107964 236098 169806 213176 -6489 123745
15167B56748f5470B60628I3357J4407a0449l1458B85008d67E1880h6511B38752
$$ 256748 -65470 260628 93357 107764 -10449 -41907 285008 -467 51880 -86511 238752
15155a24193c8798A18308h6879j8123I8549D6456b9917E2948K87715c2048A60385
$$ -124193 -38798 118308 -86879 -105002 98549 46456 -29917 52948 340663 -32048 160385
15143A22835b009A27589g3011j0460B18965A02470L57266b98613J12737C59673
$$ 122835 -2009 127589 -73011 -83471 218965 102470 459736 -298613 -185876 359673
15132B84592I5030O33J24060M3795N0053m3816K67289E980b39705A4660J86927
$$ 284592 95030 95663 219723 263518 313571 269755 537044 5980 -239705 14660 201587
15121B01587J57266a29297C55221b3944B56314l5607j7455K32854I6148J07118
$$ 201587 358853 -129297 355221 -23944 256314 220707 203252 436106 96148 203266
15111B03266a3199r2162C7449d5639C11084p3509p6857M03954K16089k68997j56708
$$ 203266 -13199 -105361 37449 -45639 311084 237575 160718 564672 780761 511764 355056
15100C55056A23990J86870A35313J91741A21195a11250j74993J17610M3359A84690
$$ 355056 123990 310860 135313 327054 121195 -111250 -286243 -168633 -125274 184690
15089B58698k2715A1900J57248J49230E2326f6203J9381A9326Q3537O3648J72999
$$ 258698 235983 11900 169148 318378 52326 -66203 -46822 19326 102863 166511 339510
15078C39510q3599J53370A12296M35962G995a56703A4365N54212A28046j7292
$$ 339510 255911 409281 112296 548258 7995 -156703 14365 568577 128046 110754
15068A10754J10855a13275G0310a24315j6359B08483K4930p7304p4437J52541
$$ 110754 221609 -113275 70310 -124315 -140674 208483 233413 156109 81672 234213
15058B34213a40057E7152K309O8559K25323A34455J69506a7003C20973K66155
$$ 234213 -140057 57152 59461 128020 353343 134455 303961 -17003 320973 587128
15048E87128a3900A47960K46309A59860l2547J50781i9083F80983A75776L24912
$$ 587128 -13900 147960 394269 159860 127313 278094 -99083 680983 175776 500688
15038E00688A97783L13598r5612n3466j28119k8881O1854H1954K65695j46293
$$ 500688 197783 511381 415769 362303 234184 205303 267157 81954 347649 201356
15028B01356J81934a57042E97573J71597k76174m8563J85381A0229K08175K84077
$$ 201356 383290 -157042 597573 769170 492996 444433 629814 10229 218404 502481
15018E02481O4506N6288j79507J73132J5769L15441k61253K12871l57309J26742
$$ 502481 566987 623275 443768 616900 632669 948110 686857 899728 542419 669161
15008F69161l04275M42787f975H40222k97515j10563Q9894j28002L7727J7140
$$ 669161 364886 807673 -6975 840222 542707 432144 522038 394036 431763 448903
14998D48903P2343p373A17776M76312j42649Q2151M07658F4554N21865A26311
$$ 448903 521246 513873 117776 594088 451439 533590 941248 64554 586419 126311
14987B67576N69549m03489m5370j28j74548J93183M2629r0286C4742Q77782l80949
$$ 267576 837125 433636 388266 388138 213590 406773 449402 359116 34742 912524 531575
14976E31575J7517k20602A56788L56471B26380L59104M9776Q1341k27011k0627
$$ 531575 549092 328490 156788 513259 226380 585484 635260 716601 489590 468963
14966D68963L00396k93952L78702k68818j53564J35981L10417K06767E16405r9214
$$ 468963 769359 475407 854109 585291 431727 567708 878125 1084892 516405 417191
14956D17191K57829J52967l20291j6935K38527J18637m17091Q7924B41192M0145
$$ 417191 675020 827987 507696 490761 729288 847925 430834 518758 241192 281337
14946B81337D4809L62444L7350j61066K05561r3792n771m4309K02448p8342l817
$$ 281337 44809 407253 444603 283537 489098 395306 389535 345226 547674 469332 465515
14935D65515J82769k56747K0706o698m090K73192B56200L13311j33647L72987
$$ 465515 648284 391537 412243 405545 401455 674647 256200 569511 435864 808851
14925H08851k33775R0823k02281L51351l55637J26738B80501J14252O4825L86973
$$ 808851 575076 665899 463618 814969 459332 586070 280501 394753 459578 846551
14915H46551L72945k00788K05658K96051Q9777k28575K83133O2689Q0831l91320
$$ 846551 1219496 1018708 1224366 1520417 1610194 1381619 1664752 1727441 1808272 1416952
14905A416952N9519L68626l07258J42767L50517L6602l86244j94751K02981j39337
$$ 1416952 1476471 1845097 1537839 1680606 2031123 2067725 1681481 1486730 1689711 1550374
14895A550374m72672k81276k31884l98K35900k68973o2142K21080j65173P1328
$$ 1550374 1077702 796426 564542 564144 800044 531071 468929 690009 524836 596164
14885E96164j45819K14817B22910n818P9842q6383P22129B58722J71460K38672
$$ 596164 450345 665162 222910 217092 296934 210551 932680 258722 430182 668854
14875F68854j34495j07461q8737J90354L8112J08480p1448K02426K72362j27191
$$ 668854 534359 426898 338161 528515 566627 675107 603659 806085 1078447 951256
14865I51256r3710j88476M61205l19433l30155j47115K52569J17516N6570C75924
$$ 951256 857546 669070 1130275 810842 480687 333572 586141 703657 760227 375924
14854C99926L85282k54185O1561J15819j78669L30736J24414k92790j63250j7301
$$ 399926 785208 531023 592584 708403 529734 860470 984884 692094 528844 511543
14844E11543L6128B63579K79307Q5095L85415n00491J74964j80395B658M88648
$$ 511543 547671 263579 542886 627981 1013396 512905 687869 507474 2658 491306
14834D91306j37034K19737k3220L30131j91904K26534J4374l2656K13509J43462
$$ 491306 354272 574009 550789 880920 689016 915550 929924 897268 1110777 1254239
14824A254239k11542K13826m38486K60682L0252p6378k81693o0249L17022D67273
$$ 1254239 1042697 1256523 818037 1078719 1108971 1032593 750900 690651 1007673 467273
14813A070114m63966j12900L90874j31257J28496k00237l32243M37745l34753
$$ 1070114 606148 493248 884122 752865 881361 681124 348881 786626 451873
14804D51873L77717k7826M6607J31710k24794r837j54823K59697K54369m78435
$$ 451873 829590 801764 848371 980081 755287 745450 590627 850324 1104693 626258
14794F26258j17802L50579k5812j12746J94196J62357l27916J41971m32328j1177
$$ 626258 508456 859035 833223 720477 914673 1077030 749114 891085 458757 447580
14784D47580K99942j32752R7443B16720N57604J34320j23381o5042n2664K14605
$$ 447580 747522 614770 712213 216720 774324 908644 785263 720221 667557 882162
14774H82162l27107J22211K48599q4639k05103L98052D83245J45533J19384N53114
$$ 882162 555055 677266 925865 841226 636123 1034175 483245 628778 748162 1301276
14764A301276F44025K69181k65934K60445L5250j69092J48668L4065k71855P8345
$$ 1301276 644025 913206 647272 907717 942967 773875 922543 956608 684753 763098
14754G63098n9003C22153K90414J16439k10920J6930L4870K27301k1723k83230
$$ 763098 704095 322153 612567 729006 518086 535016 569886 797187 775464 492234
14744D92234L91109r5045j13108L2935l678k1340k5441P0196J79511k35345M46486
$$ 492234 883343 788298 675190 708125 704447 683107 657666 727862 907373 672028 1118514
14733A118514k18456k47003j2637M33376k89598k4241j39266k20728K90233K48488
$$ 1118514 900058 653055 640418 1073794 784196 759955 620689 399961 690194 938682
14723I38682R0684Q1893l62289J63292J46285M8632k20234N0550J33550L58730
$$ 938682 1029366 1111259 748970 912262 1058547 1107179 886945 937495 1071045 1429775
14713A429775k81666P66868k37303k2221J1503k49893L0943k21613N087k6374
$$ 1429775 1148109 1914977 1677674 1655453 1666956 1417063 1448006 1226393 1231480 1205106
14703A205106l92237J89057J30336k30238J98576j77974Q1368J77836j93902j07501
$$ 1205106 812869 1001926 1132262 902024 1100600 922626 1003994 1181830 987928 880427
14693H80427L6282l6308K20120j9079M09118k40778L17062L16335O2036k50961
$$ 880427 916709 880401 1100521 1081442 1490560 1249782 1566844 1883179 1945215 1694254
14683A694254l51423J67515l51770J42225l6339k95268J46101P4163l18861J44968
$$ 1694254 1342831 1510346 1158576 1300801 1264462 969194 1115295 1189458 870597 1015565
14673A015565j06114N7481r8400K26544O3656j2409l56639N45971m66490l83242
$$ 1015565 909451 966932 868532 1095076 1158732 1146323 789684 1335655 869165 485923
14663D85923K76980M67756j22857p8197J09746m44275M48127K05104l21603P4687
$$ 485923 762903 1230659 1107802 1029605 1139351 695076 1143203 1348307 1026704 1101391
14653A101391k46429k6540N6857J67519K02722m9489p5220K57832j03347m94457
$$ 1101391 854962 828422 885279 1052798 1255520 1206031 1130811 1388643 1285296 790839
14643G90839N01516L5361K00647k82037R8846p3522J4860K79508j59244K14539
$$ 790839 1292355 1327716 1528363 1246326 1345172 1271650 1286510 1566018 1406774 1621313
14633A621313m36687K64076r9048J11597j08300M6776K8476k97664K59763j68225
$$ 1621313 1184626 1448702 1349654 1461251 1352951 1399727 1428203 1130539 1390302 1222077
14623A222077J43712k01314L23953k83844J9807M04774j77245J00401m46422J63038
$$ 1222077 1365789 1164475 1488428 1204584 1224391 1629165 1451920 1552321 1105899 1268937
14613A268937J3450J93541J84825l33891K44718o85312P50507l04801J50681K03727
$$ 1268937 1282387 1475928 1660753 1326862 1571580 886268 1636775 1331974 1482655 1686382
14603A686382l78414K74657L6636J5148R5141p37625J26935M65999M4497o7446
$$ 1686382 1307968 1582625 1619261 1634409 1729550 991925 1118860 1584859 1629356 1561910
14593A561910o5589M32680k95172j24915P3658J46375o6584l01187K09985L36185
$$ 1561910 1496321 1929001 1633829 1508914 1582572 1728947 1662363 1361176 1571161 1907346
14583A907346k19175o5847K36178o9521p4497j71336J54200l6655O08969K1738
$$ 1907346 1688171 1622324 1858502 1788981 1714484 1543148 1697348 1660693 2269662 2291400
14573B291400m20277k25466K13725J5823J04104l8146l41017O35241j71174J47310
$$ 2291400 1871123 1645657 1859382 1875205 1979309 1941163 1600146 2235387 2064213 2211523
14563B211523j33709J55481n6477N6776k61116M58329j41184L66559m02748K6119
$$ 2211523 2077814 2233295 2176818 2233594 1972478 2430807 2289623 2656182 2253434 2279553
14553B279553K64182p9790m8561K4670P336M04440j03471M878K37535m2404J91816
$$ 2279553 2543735 2463945 2415384 2440054 2447390 2851830 2748359 2753237 2990772 2948368 3140184
14542C140184K98278J87260N73613k83593P00983M36452R53478J374443J792091
$$ 3140184 3438462 3625722 4199335 3915742 4616725 5053177 6006655 7381098 9173189
14533I173189L910938O896894J1495828M589006j5869267q148307m813885j931769
$$ 9173189 13084127 19981021 31476849 36065855 20196588 12048281 7234396 5302627
14525E302627j136457j39327k665L44950O53515o83018q13452m04571j98294l81052
$$ 5302627 4166170 4026843 4024178 4369128 5022643 4339625 3526173 3121602 2923308 2542256
14515B542256l2485K73531n76649R7628M07750l45866M9799L61269o23028M30039
$$ 2542256 2509771 2783302 2206653 2304281 2712031 2366165 2415964 2777233 2154205 2584244
14505B584244K62342n58986L68725M7117J22363l9089P6994o8223j69103K04667
$$ 2584244 2846586 2287600 2656325 2703442 2825805 2786716 2863710 2795487 2626384 2831051
14495B831051p2581K86412J28194n36532P09072o6358K14817m61448L85296k08933
$$ 2831051 2758470 3044882 3173076 2636544 3345616 3279258 3494075 3032627 3417923 3208990
14485C208990K84094l04432L33094k42267J55515k48524L673O13850m42691Q0024
$$ 3208990 3493084 3188652 3521746 3279479 3434994 3186470 3190143 3803993 3361302 3441326
14475C441326L83283n9042J5274J43977r1619M0467J14300k6742k9m8827j06114
$$ 3441326 3824609 3765567 3780841 3924818 3833199 3873666 3987966 3961224 3961195 3912368 3806254
14464C806254L58737K09231p7496j44426o931L33231k65704M0805J80937J23083
$$ 3806254 4164991 4374222 4296726 4152300 4145369 4478600 4212896 4253701 4434638 4557721
14454D557721J15689K66844m36912M64250q8768J70461n7039R4890J89168J19811
$$ 4557721 4673410 4940254 4503342 4967592 4878824 5049285 4992246 5087136 5276304 5396115
14444E396115j62406P9742K7739k37678J1092O17233r1105J92862l19654Q8375
$$ 5396115 5233709 5313451 5341190 5103512 5114604 5731837 5640732 5833594 5513940 5602315
14434E602315J5698K30288J00889J54225J70458q2508K65951k07269M45267J42596
$$ 5602315 5618013 5848301 5949190 6103415 6273873 6191365 6457316 6250047 6695314 6837910
14424F837910k53708q2714K52231L90959l29071j6163O23763l35493M82681J37648
$$ 6837910 6584202 6501488 6753719 7144678 6815607 6799444 7423207 7087714 7570395 7708043
14414G708043k71762N98692k96486L5489L56361K4971N2136L50104L4487J56063
$$ 7708043 7436281 8034973 7738487 7773976 8130337 8155308 8207444 8557548 8592035 8748098
14404H748098N4210M01666J32342J4807K48420n7099J75798l50916L94866j53006
$$ 8748098 8802308 9203974 9336316 9351123 9599543 9542444 9718242 9367326 9762192 9609186
14394I609186O77438Q6375j22493L66241M05550L4861L62306q0879k52695L40239
$$ 9609186 10286624 10372999 10250506 10616747 11022297 11057158 11419464 11338585 11085890 11426129
14384A1426129J90235k7198K05298J69018L72716K09248L61594j24228L31543
$$ 11426129 11616364 11589166 11794464 11963482 12336198 12545446 12907040 12782812 13114355
14375A3114355L25270J78975K35625J01265L44641N13577j48879L48532N30586
$$ 13114355 13439625 13618600 13854225 13955490 14300131 14813708 14664829 15013361 15543947
14366A5543947L39892L64978r044M53689K68968J88923J30981P53128J61538N39526
$$ 15543947 15883839 16248817 16239773 16693462 16962430 17151353 17282334 18035462 18197000 18736526
14356A8736526J4265O27348L39769O32306J50163K4921J299129j23060O54686
$$ 18736526 18750791 19378139 19717908 20350214 20500377 20525298 21824427 21701367 22356053
14347B2356053K98611O78122N07299K40017M46678N78203N16392Q66559L83261
$$ 22356053 22654664 23332786 23840085 24080102 24526780 25104983 25621375 26487934 26871195
14338B6871195Q13313J047256M04278P39695P01076N41741R18378O02130R79747
$$ 26871195 27684508 28731764 29136042 29875737 30576813 31118554 32036932 32639062 33618809
14329C3618809J061369R25508N76067J427384R11285R67319R89938J586176P88497
$$ 33618809 34680178 35605686 36181753 37609137 38520422 39487741 40477679 42063855 42852352
14320D2852352J426606J149858J437859J585578J289863J869439J587904J724017
$$ 42852352 44278958 45428816 46866675 48452253 49742116 51611555 53199459 54923476
14312E4923476J998245J456140K074655K203831K306450K018316K842287K256146
$$ 54923476 56921721 58377861 60452516 62656347 64962797 66981113 69823400 72079546
14304G2079546K820414K367487K695476L209799K750461L603251L166854L422950
$$ 72079546 74899960 77267447 79962923 83172722 85923183 89526434 92693288 96116238
14296I6116238M124708L785063M492483M926767M608562N599914M958547N727237
$$ 96116238 100240946 104026009 108518492 113445259 118053821 123653735 128612282 134339519
14288A34339519N722664O922055O746808P072582P468776Q145772Q425936R180808
$$ 134339519 140062183 146984238 153731046 160803628 168272404 176418176 184844112 194024920
14280A94024920R471231R761488J0859125J1379861J1698338J2203364J2736350
$$ 194024920 203496151 213257639 224116764 235496625 247194963 259398327 272134677
14273B72134677J3557103J4341694J4828774J5296201J5451525J5265519J5367362
$$ 272134677 285691780 300033474 314862248 330158449 345609974 360875493 376242855
14266C76242855J4295543J3269601J1971453J1142064J0204817Q763217Q562499
$$ 376242855 390538398 403807999 415779452 426921516 437126333 445889550 454452049
14259D54452049P448846N754833L087650R66086J499180l71173q695080n856191
$$ 454452049 461900895 467655728 470743378 471709464 473208644 472837471 464142391 458286200
14251D58286200p546456j0571145j0769177j1335751j2243539j2902046j3358413
$$ 458286200 450739744 440168599 429399422 418063671 405820132 392918086 379559673
14244C79559673j2106371j4043431j4122827j2974380j3793846j2823040j3319192
$$ 379559673 367453302 353409871 339287044 326312664 312518818 299695778 286376586
14237B86376586j2625667j2574836j2514664j1644737j1024346j0686075r070568
$$ 286376586 273750919 261176083 248661419 237016682 225992336 215306261 206235693
14230B06235693j0014075r931219r857384r122619q303583p600111p097357o389125
$$ 206235693 196221618 186290399 176433015 167310396 159006813 151406702 144309345 137920220
14222A37920220o251105n970586n556824n297665m838601m384058m007500m149169
$$ 137920220 131669115 125698529 120141705 114844040 110005439 105621381 101613881 97464712
14214I7464712l931782l798989l334238l387846k975911l148772k903632k469828
$$ 97464712 93532930 89733941 86399703 83011857 80035946 76887174 73983542 71513714
14206G1513714k582503k321901j984030k282022k230736j851195j789174j651116
$$ 71513714 68931211 66609310 64625280 62343258 60112522 58261327 56472153 54821037
14198E4821037j516461j906223j283062j800409j448303j407967p05420j162111
$$ 54821037 53304576 51398353 50115291 48314882 46866579 45458612 44753192 43591081
14190D3591081j361744j209011j536222q81789j019634n17337j063708j015812
$$ 43591081 42229337 41020326 39484104 38602315 37582681 37065344 36001636 34985824
14182C4985824j210728p93846o98675p97137o16239j003990p62076m92560l91284
$$ 34985824 33775096 32981250 32282575 31485438 30869199 29865209 29103133 28610573 28219289
14173B8219289n21085j284715m98085o42157m53421n71197m47479q19153m24481
$$ 28219289 27698204 26413489 25915404 25273247 24819826 24248629 23801150 22981997 22557516
14164B2557516l28944l64357j07098p88287m38336l44937l76195l71973k29037
$$ 22557516 22228572 21864215 21757117 20968830 20530494 20185557 19809362 19437389 19208352
14155A9208352l80271m01125k50071p16880k27596k00304n11192j5462m60073
$$ 19208352 18828081 18426956 18176885 17460005 17232409 17032105 16520913 16505451 16045378
14146A6045378q0231l05200m14303n73890j76353m14586j32803J08132l01107
$$ 16045378 15965147 15659947 15245644 14671754 14495401 14080815 13948012 14056144 13755037
14137A3755037Q4173n54043k24755j25368o47895j1557j39357k42125L9301m36232
$$ 13755037 13839210 13285167 13060412 12935044 12287149 12275592 12136235 11894110 11933411 11497179
14127A1497179k07668k67801K29223o06648j67816j7933m5225j76768J4701m48807
$$ 11497179 11289511 11021710 11250933 10644285 10476469 10458536 10413311 10236543 10251244 9802437
14117I802437j16348J35729O8795n03191J56155l29847l32838k3486K71116n20413
$$ 9802437 9686089 9821818 9890613 9387422 9543577 9213730 8880892 8857406 9128522 8608109
14107H608109j70371k46218K49866n5774j80042N4743l91222p6857L6783j13733
$$ 8608109 8437738 8191520 8441386 8385612 8205570 8260313 7869091 7792234 7829017 7715284
14097G715284k89627l51696L60310k51086J35529k05186j71017m301j74264L445
$$ 7715284 7425657 7073961 7434271 7183185 7318714 7113528 6942511 6938210 6763946 6767391
14087F767391O9421k68621K46126m53138p1683K99248l88233m5689k97146K76338
$$ 6767391 6836812 6568191 6814317 6361179 6289496 6588744 6200511 6154822 5857676 6134014
14077F134014n01485K03781k57953k5088J68356k84271P0956k69999L38722k44782
$$ 6134014 5632529 5836310 5578357 5553269 5721625 5437354 5508310 5238311 5577033 5332251
14067E332251O0961o5759r2805n9444J11513r8169j48577j20864R7472m60885
$$ 5332251 5393212 5327453 5234648 5175204 5286717 5188548 5039971 4919107 5016579 4555694
14057D555694N19344l04074M8107k20531m0094N3668K960k11777K94767l40520
$$ 4555694 5075038 4770964 4819071 4598540 4558446 4612114 4615074 4403297 4698064 4357544
14047D357544O7911j29588K08233j71126K16864q9509M8018j57849k93423j67709
$$ 4357544 4425455 4295867 4504100 4332974 4549838 4460329 4508347 4350498 4057075 3889366
14037C889366j13381l8742L05007m06778L22691l19535J90910p3765L0646j21531
$$ 3889366 3775985 3737243 4042250 3635472 3958163 3638628 3829538 3755773 3786419 3664888
14027C664888j43548K41192j67694n9935j97447o6735K3687J806K84608m81151
$$ 3664888 3521340 3762532 3594838 3534903 3337456 3270721 3294408 3296214 3580822 3099671
14017C099671J26337J13607K38222k74894j48848j45478L71103l03440L5581l7637
$$ 3099671 3226008 3339615 3577837 3302943 3154095 3008617 3379720 3076280 3111861 3074224
14007C074224k97399L26567j23511l41652O3405J44930r9721k34247K56915k5485
$$ 3074224 2776825 3103392 2979881 2638229 2701634 2846564 2746843 2512596 2769511 2744026
13997B744026j63165l0870M80615l48438k9914M2094m7498j93731k80458M15584
$$ 2744026 2580861 2549991 3030606 2682168 2652254 2694348 2646850 2453119 2172661 2588245
13987B588245N9196l69311J61211k54351J42719J47356o8208O26763j90326M2223
$$ 2588245 2647441 2278130 2439341 2184990 2327709 2475065 2406857 3033620 2843294 2885517
13977B885517N2812P60371M79145J676182K455786N674311J1474952J2882421
$$ 2885517 2938329 3698700 4177845 5854027 8309813 13984124 25459076 38341497
13969C8341497j3141106q766262n303131l036947j587783j189039k90385o82021
$$ 38341497 25200391 16434129 11130998 8094051 6506268 5317229 5026844 4344823
13961D344823l40780m33300K2373k43194k92289j81936J39425m34558L92411l71008
$$ 4344823 4004043 3570743 3593116 3349922 3057633 2875697 3015122 2580564 2972975 2601967
13951B601967K40947m58230L76580L1622j37003k93092J41570l07557k70386M36617
$$ 2601967 2842914 2384684 2761264 2792886 2655883 2362791 2504361 2196804 1926418 2363035
13941B363035k29643j45787q072J53868k8183n2058L33858m59825j71957J06603
$$ 2363035 2133392 1987605 1979533 2133401 2105218 2053160 2387018 1927193 1755236 1861839
13931A861839J41009k11619O09959o52729M78898m90049K98646K13218k31435
$$ 1861839 2002848 1791229 2401188 1748459 2227357 1737308 2035954 2249172 2017737
13922B017737j9526j08798o1680k41214J42262p8116n5709L15947M1926j47934
$$ 2017737 1998211 1889413 1827733 1586519 1728781 1650665 1594956 1910903 1952829 1804895
13912A804895R758j0600o314J3824j42571K82147j79173L7449j48943J19889k18508
$$ 1804895 1814653 1804053 1797739 1811563 1668992 1951139 1771966 1809415 1660472 1780361 1561853
13901A561853j45152p0937L26469l5878M5849K0095l72920L16260l60503K387
$$ 1561853 1416701 1345764 1672233 1636355 1682204 1702299 1329379 1645639 1285136 1287523
13891A287523J76604L03467k74173n4891n2799k39807K89489J50858j76904K2217
$$ 1287523 1464127 1767594 1493421 1438530 1385731 1145924 1435413 1586271 1409367 1431584
13881A431584o5281j19489J60465j18622j03457K9645J71954q8150O135j89768
$$ 1431584 1366303 1246814 1407279 1288657 1185200 1214845 1386799 1298649 1304784 1115016
13871A115016Q8409J19650Q230m608Q5508j42137K92517k0792N3388k88090j89154
$$ 1115016 1203425 1323075 1331305 1326697 1412205 1270068 1562585 1541793 1595181 1307091 1117937
13860A117937K72773j16476j43461L41463l71225L76059l08020j11570K85378
$$ 1117937 1390710 1274234 1130773 1472236 1101011 1477070 1169050 1057480 1342858
13851A342858p3849J7618L8690r2081K15349l15288o9825r2594K19540l024Q6289
$$ 1342858 1269009 1286627 1325317 1233236 1448585 1133297 1063472 970878 1190418 1187394 1273683
13840A273683j83744j07782J48343n6809P6685J37968j75238k2118K098j35763
$$ 1273683 1089939 982157 1130500 1073691 1150376 1288344 1113106 1090988 1093086 957323
13830I57323J91789J28561J77479j60481k21722l54454J18186M10771j35246m9900
$$ 957323 1149112 1277673 1455152 1294671 1072949 718495 836681 1247452 1112206 1062306
13820A062306J58456l8624N5535j54699j76522K5704P1428R0479l0654r5462k24820
$$ 1062306 1220762 1182138 1237673 1082974 906452 932156 1003584 1094063 1063409 967947 743127
13809G43127k11374J52003M39108n9631k58983K14364k58337L17388j66756J62737
$$ 743127 531753 683756 1122864 1063233 804250 1018614 760277 1077665 910909 1073646
13799A073646k66855L11437m36879l1519K1466o7578j79481N63576K48810m47566
$$ 1073646 806791 1118228 681349 649830 671296 603718 424237 987813 1236623 789057
13789G89057N2980j52484k3473M45885j21004l12768l2720j92263Q0420M40467
$$ 789057 842037 689553 666080 1111965 990961 678193 645473 453210 533630 974097
13779I74097l07238L40342D52478N13399k53819J63567l5584L6608J74788j92660
$$ 974097 666859 1007201 452478 965877 712058 875625 840041 876649 1051437 858777
13769H58777O4922m3817j48171L56253o1713k97528J10815q4239j02517J26744
$$ 858777 923699 879882 731711 1087964 1026251 728723 839538 755299 652782 779526
13759G79526j20506K07123j09715j55863K34847k06208J24189r6769k11210M81508
$$ 779526 659020 866143 756428 600565 835412 629204 753393 656624 445414 926922
13749I26922m19185j8750K16470K58315m64630N11611C37593L17975J3918q6282
$$ 926922 507737 488987 705457 963772 499142 1010753 337593 655568 669486 583204
13739E83204Q9969N9203Q035J30162j51095L0512j35537k76723K41005J04543
$$ 583204 673173 732376 740411 870573 719478 749990 614453 337730 578735 683278
13729F83278n4288j12441K24978C50420L01084q5198n3409M13192m36928P5137
$$ 683278 628990 516549 741527 350420 651504 566306 512897 926089 489161 564298
13719E64298L45619D45041L81886k41379R2401j52107K45638N42j14486k11848
$$ 564298 909917 445041 826927 585548 677949 525842 771480 772022 657536 445688
13709D45688r8528N13937k69607P9788l3283j74043o6690L02257J73394l72419
$$ 445688 347160 861097 591490 671278 637995 463952 397262 699519 872913 500494
13699E00494J33054j02626m6263p2341L04901L27018q559m15439j1973K1992M4271
$$ 500494 633548 530922 484659 412318 717219 1044237 1035678 620239 608266 630258 674529
13688F74529J336B88454K02508L7319K7649k01304L44125j44048O2926J03519
$$ 674529 675865 288454 490962 528281 555930 354626 698751 554703 617629 721148
13678G21148k80907M0684P162M8688m6515Q0289B49729N76878k67594J29692k00286
$$ 721148 440241 480925 488087 536775 490260 570549 249729 826607 559013 688705 488419
13667D88419L9221k58228N76414C78891K57432q5025J33539J56922K172k87996
$$ 488419 527640 269412 845826 378891 636323 551298 684837 841759 843931 555935
13657E55935k31398J10283J67053d6858C58712K19173q6291A40469M90235m962
$$ 555935 324537 434820 601873 -46858 358712 577885 491594 140469 630704 625742
13647F25742j52318L4238L80386D15618L16154l24172L75427j41601l10961K90573
$$ 625742 473424 507662 888048 415618 731772 407600 783027 641426 330465 621038
13637F21038o1296r5121A67003M52369o1671J68375K068k17225p3058L44448l39792
$$ 621038 559742 464621 167003 619372 557701 726076 728144 510919 437861 782309 442517
13626D42517B05373D6446J01253L42330J12639L6104k86417J58524J09430j94112
$$ 442517 205373 46446 147699 490029 602668 638772 352355 510879 620309 426197
13616D26197L98021B75520P3368j63231M08181j21754A61161L26592B39426L65980
$$ 426197 824218 275520 348888 185657 593838 472084 161161 487753 239426 605406
13606F05406B99463K85346k27272K02832B61993K91034j26075j42565L53324q5494
$$ 605406 299463 584809 357537 560369 261993 553027 426952 284387 637711 552217
13596E52217l4208j84845K14404j27369k05393K17104j84130K05916A81563K40377
$$ 552217 518009 333164 547568 420199 214806 431910 247780 453696 181563 421940
13586D21940J9702p0188Q178K46986B35050J43742K72835C01742N2809A62060
$$ 421940 441642 371454 379632 626618 235050 378792 651627 301742 354551 162060
13575A17496M29959M786j20715J32785o5636B00382K66936R9927G2921M70864
$$ 117496 547455 552241 431526 564311 498675 200382 467318 567245 72921 543785
13565E43785k28760A13788K97420j63646l8795N9571A26534K96514A62315K62641
$$ 543785 315025 113788 411208 247562 208767 268338 126534 423048 162315 424956
13555D24956j9492j67906H2146K4545i7544G5776K91375j13570J50797A51057
$$ 424956 405464 237558 82146 106691 -97544 75776 367151 253581 404378 151057
13544A59860f5264B35605q194O2628j20844K26267n2189J2362j40471D4576K61583
$$ 159860 -65264 235605 227411 290039 169195 395462 343273 355635 215164 44576 306159
13533C06159o9889J84210K0177A19622M61199j82681R9572q0829A93788K53599
$$ 306159 236270 420480 440657 119622 580821 398140 497712 416883 193788 447387
13523D47387j51203r007j21472P0943n7751P7092D4192P3585C3709K66242A29393
$$ 447387 296184 287177 165705 236648 178897 255989 44192 117777 33709 299951 129393
13511H0862L49331j23789J30349K14j19325l5588a56681E35356G2773K20418e8289
$$ 80862 430193 306404 436753 436967 317642 282054 -156681 535356 72773 293191 -58289
13499E58343B79131J0334j7844M0891j2324F2825J86596o7805L67855B39236o9419
$$ 558343 279131 289465 271621 312512 300188 62825 249421 181616 549471 239236 169817
13488A69817m0475K90769j14239E8073K85203O5325k6831J37398a48029C76142
$$ 169817 129342 420111 305872 58073 343276 408601 381770 519168 -148029 376142
13477C70492p4483b0459E61739j95738R8700j71404K0125B1539L35897j35222
$$ 370492 296009 -20459 561739 366001 464701 293297 313422 21539 357436 222214
13467B22214K56817A83054k5446N48652k72243j42713J37487L2098A63664J7268
$$ 222214 479031 183054 157608 706260 434017 291304 428791 460889 163664 180932
13457A80932a6543K119E08696k09302P2929o6475n149m9644J3814q1337O5320
$$ 180932 -16543 -14424 508696 299394 372323 305848 300699 251055 264869 183532 248852
13446B48852A22391J23587K349I0306L58376j90724K7298k6795N2151J17213A94893
$$ 248852 122391 245978 248327 90306 448682 257958 285256 258461 310612 427825 194893
13434A15783P5817o5112K71007m7244j881a53393C50287m9261K52778j82863j84559
$$ 115783 191600 126488 397495 350251 348370 -153393 350287 301026 553804 370941 186382
13423A86382p1209J7597j7063K14842F0402L21182j56201b55371B22027J95894
$$ 186382 115173 132770 115707 330549 60402 381584 225383 -255371 222027 417921
13413D17921A35594R2141h9106A45355n7694J56158L82690A41801O7671n758e4509
$$ 417921 135594 227735 -89106 145355 87661 243819 626509 141801 209472 203714 -54509
13401B67314J09176J6697k1988P846m5198q6969C6721K45799M857r8387l618D8001
$$ 267314 376490 393187 371199 379045 333847 246878 36721 282520 287377 188990 185372 48001
13388a06140C89196q1977A39276K53025j67317O53C5875J13171N9268K02093b25191
$$ -106140 389196 307219 139276 392301 224984 225637 35875 149046 208314 410407 -225191
13376B62286q223j247J51899p0863J03506j81596K56476A33769K06568a3868C70862
$$ 262286 254063 252816 404715 333852 437358 255762 512238 133769 340337 -13868 370862
13364A18772J18944J21487j25823G4621b7560A76391K97683A21520K01848J40760
$$ 118772 237716 359203 233380 74621 -27560 176391 474074 121520 323368 464128
13354D64128F1625J28478a8186C24745a22790E3834L01628A57357M7010j958D1855
$$ 464128 61625 190103 -18186 324745 -122790 53834 355462 157357 204367 202409 41855
13342E78193A97087R8510q5330K05959j49978I1099K51257A42458p0564K5682
$$ 578193 197087 295597 210267 416226 266248 91099 342356 142458 71894 97576
13332I7576J33816C8743c08071G3924N8895F2875A3238K83505J82095o1745n0338
$$ 97576 231392 38743 -308071 73924 132819 62875 13238 296743 478838 417093 366755
13321C66755J78156J16085B87300K04243J83102F4513K86498b1524C39998l6439
$$ 366755 544911 660996 287300 491543 674645 64513 351011 -21524 339998 303559
13311C03559Q6073j00543j02258J49569p3400o7116M56655A92003N9219K84735
$$ 303559 389632 289089 186831 336400 263000 195884 652539 192003 251222 535957
13301E35957O6558o4194H8292L80605r2024A46728F7624J38796p4666M5631J35936
$$ 535957 602515 538321 88292 468897 376873 146728 67624 206420 131754 177385 313321
13290C13321j20962r5083J5840b80509H8585J03171H4568B1551L52102A44361
$$ 313321 192359 97276 113116 -280509 88585 191756 84568 21551 373653 144361
13279B70679D3593J7202L0499M3737J81863K37778D6863a42809D94286k27878
$$ 270679 43593 60795 91294 135031 316894 554672 46863 -142809 494286 266408
13269B66408a12109C57432p5215j26464L02121b9186I1821a31582A45349F3366
$$ 266408 -112109 357432 282217 155753 457874 -29186 91821 -131582 145349 63366
13258b5918B05809M1397A02323D2936A9586K59936j38073b76737C26670Q1861
$$ -25918 205809 247206 102323 42936 19586 279522 141449 -276737 326670 408531
13248D08531G8218J4976l2495J36604G9004J04483O1948D3301j6136K16168a25938
$$ 408531 78218 93194 60699 197303 79004 183487 245435 43301 27165 243333 -125938
13236A03319K65896J5679a209q015F11780A50916k0453J49444n7460N0007R9075
$$ 103319 369215 384894 -1209 -9224 611780 150916 130463 279907 222447 272454 371529
13225C71529A26182k7180A5606R3313a78587A05373n1995J4531L9428E1680L3565
$$ 371529 126182 99002 15606 108919 -178587 105373 53378 67909 107337 51680 85245
13214H5245J0982K92459a81235A27030K31525A17749J28175k5011A6167c26829
$$ 85245 96227 388686 -181235 127030 358555 117749 245924 220913 16167 -326829
13203I0105e5343F2132a36122a4784p1979B3396K96245j20221J48970E3765a98844
$$ 90105 -55343 62132 -136122 -14784 -86763 23396 319641 199420 348390 53765 -198844
13191e40924g9102A47985o2148a60510A75987a38959a897B27029a41923d5632
$$ -540924 -79102 147985 85837 -160510 175987 -138959 -1897 227029 -141923 -45632
13180B0535g1058B28660a8829A3782R4078a67627a5854A5448J64402b81841d7355
$$ 20535 -71058 228660 -18829 13782 107860 -167627 -15854 15448 179850 -281841 -47355
13168f185j83664A1944a25953C087c1142A07301l4703J81851g4825C51225L6364
$$ -6185 -189849 11944 -125953 3087 -31142 107301 72598 254449 -74825 351225 387589
13157C87589A167Q3616b77220g4756A62432i4146G3484a28865n9832f1035k0828
$$ 387589 1167 84783 -277220 -74756 162432 -94146 73484 -128865 -188697 -61035 -81863
13146h1863B76015A21113b43999H4030J62699A0930R2683a11561C72513C7384
$$ -81863 276015 121113 -243999 84030 246729 10930 103613 -111561 372513 37384
13135H218L09910j15315K49031I9627a25580m6303a1568o3647E9532K94302d681
$$ 8218 318128 202813 451844 99627 -125580 -171883 -11568 -75215 59532 353834 -4681
13123B00769a20709k396B4251a00993E4742J26342e6499n9463A152c25038j39585
$$ 200769 -120709 -123105 24251 -100993 54742 181084 -56499 -115962 1152 -325038 -464623
13112d64623B36425D0356M9246J19860n3513d17504b4247p0994A92549H6784l4241
$$ -464623 236425 40356 89602 209462 155949 -417504 -24247 -95241 192549 86784 52543
13101E2543J51741n2036J5124F180N8305e2547p7974B93786M5051E5407R6508
$$ 52543 204284 152248 167372 6180 64485 -52547 -130521 293786 338837 55407 151915
13090A51915K5020g7381B78909C7811J39367K4374b39971D60870A72384a7970
$$ 151915 176935 -77381 278909 37811 177178 201552 -239971 460870 172384 -17970
13079a64748C80467D1837K53332A11134O4535a2339D2393M6416L12317a00841
$$ -164748 380467 41837 295169 111134 175669 -12339 42393 88809 401126 -100841
13068C9609K01642a79284E34252a37492A91127o8367a36503m8104O3159B7232
$$ 39609 241251 -179284 534252 -137492 191127 122760 -136503 -184607 -121448 27232
13057A22815D5319d7769C38630a04020E3598a8650l22389A66492p1973D0767a97313
$$ 122815 45319 -47769 338630 -104020 53598 -18650 -341039 166492 94519 40767 -197313
13045B28611e4205A50492O3636j7295b6642n148E4999J18474J00178p3047g7724
$$ 228611 -54205 150492 214128 196833 -26642 -31790 54999 173473 273651 200604 -77724
13033A76878a02225A09483K94545j87087j8848a38841D16124A70678P0123I2955
$$ 176878 -102225 109483 404028 216941 198093 -138841 416124 170678 240801 92955
13022e1116L800A40948a06872C2467a5867j9580B26068b60774b7627C1017K13717
$$ -51116 -47316 140948 -106872 32467 -15867 -35447 226068 -260774 -27627 31017 244734
13011B44734b40850e3282k4753A23891e0115A70386C2708R0869Q485i4649A63354
$$ 244734 -240850 -53282 -78035 123891 -50115 170386 32708 123577 132062 -94649 163354
12999B57089a9823B26288h0562D0933j7940K7001R2008J08364G0323J10985b96116
$$ 257089 -19823 226288 -80562 40933 22993 49994 142002 250366 70323 181308 -296116
12987A9506a39726c92C32751B9354P8491E3848K70582H437a96463A03617q419
$$ 19506 -139726 -392 332751 29354 107845 53848 324430 8437 -196463 103617 95198
12976I5198b81649M9422B60208k75c32846a36334f0338J505A84409a32005B93932
$$ 95198 -281649 -232227 260208 259933 -332846 -136334 -60338 -58833 184409 -132005 293932
12964A83774E5171L3489N5593k4378c4577A69730b27232f712A11790K3515L9957
$$ 183774 55171 88660 144253 119875 -34577 169730 -227232 -6712 111790 135305 175262
12953A75262E4130J75657b7789j89704g1577B561J63705B6277L0065L0741L26007
$$ 175262 54130 229787 -27789 -217493 -71577 2561 166266 26277 56342 87083 413090
12942D13090j69522r8950L1922a9194A22053O0142i6591b3025H4972a04348D31316
$$ 413090 243568 144618 176540 -19194 122053 182195 -96591 -23025 84972 -104348 431316
12930e4071A49830k6983n6223j7652L6708K08774a44277A21338j4408C3489c19866
$$ -54071 149830 122847 66624 48972 85680 294454 -144277 121338 106930 33489 -319866
12918E1595d9902A47784J38741c64603G1397a17211K4368B89381g0179C632K51486
$$ 51595 -49902 147784 286525 -364603 71397 -117211 -92843 289381 -70179 3632 255118
12907B55118c090j10937e6256J8692I8679J91408m4864M9819j42935D8135i3927
$$ 255118 -3090 -114027 -56256 -37564 98679 290087 245223 295042 152107 48135 -93927
12895b10380r4942d0659j01722A77591a74189Q5107l1939O04j30036A04470e7366
$$ -210380 -305322 -40659 -142381 177591 -174189 -89082 -121021 -120417 -250453 104470 -57366
12883c7923k5810A37742L9707F7251a19895A54140h2799G3701J86387a86653I714
$$ -37923 -63733 137742 177449 67251 -119895 154140 -82799 73701 260088 -186653 9714
12871B31410a22862K3361F6307c36925a15133I2569j4187c91470a47501K7801
$$ 231410 -122862 -99501 66307 -336925 -115133 92569 78382 -391470 -147501 -119700
12861a19700A20478G379O5257A8810a29706d720C88386a03270M1697k07003C60169
$$ -119700 120478 7379 72636 18810 -129706 -4720 388386 -103270 -61573 -268576 360169
12849a27258K735a9777A9038L03652e0007B92013q1471b65808E7274a5990B39129
$$ -127258 -124523 -19777 19038 322690 -50007 292013 210542 -265808 57274 -15990 239129
12837E4640J55629J70763A25737K1418h4107C594b8105j71162h1727n4196l9739
$$ 54640 210269 381032 125737 147155 -84107 3594 -28105 -199267 -81727 -135923 -175662
12826a75662A18523E2432R4128K1232c1449B10223Q8734I5395k6393J55240K64097
$$ -175662 118523 52432 146560 167792 -31449 210223 298957 95395 69002 224242 488339
12815D88339B176J53052j9042c2611m7379H3238b32538A49867g9358j53688B16344
$$ 488339 2176 155228 136186 -32611 -79990 83238 -232538 149867 -79358 -233046 216344
12803a18971j2564A948J10129B0858c4207j65075R0578A07972P599b45774N1745
$$ -118971 -131535 1948 112077 20858 -34207 -199282 -108704 107972 115571 -245774 -194029
12792a94029d8059k80411A7348d3694k4535A44573a39951k4837D6494J08828f12
$$ -194029 -48059 -328470 17348 -43694 -68229 144573 -139951 -164788 46494 155322 -612
12780c199k09304A80451a05342b2769F3280O5697e2138B8565a77417L6327j0513
$$ -3199 -212503 180451 -105342 -22769 63280 128977 -52138 28565 -177417 -141090 -151603
12769a51603B46088f0003a496r4345A0082a12236k01579g508p1842k7228A13710
$$ -151603 246088 -60003 -1496 -95841 10082 -112236 -313815 -7508 -79350 -106578 113710
12757a25529A74281D9364a78024J3599L2850A3084L4466J82889r062a22971A12391
$$ -125529 174281 49364 -178024 -164425 -131575 13084 47550 230439 221377 -122971 112391
12745b87932J32475m3850d7696G257J41690a72662B1969J51700b81422h8298l0663
$$ -287932 -155457 -199307 -47696 7257 148947 -172662 21969 173669 -281422 -88298 -118961
12734a18961E8763A8337i8095j05792k56942A81805e4623H0761b32441A84535
$$ -118961 58763 18337 -98095 -203887 -460829 181805 -54623 80761 -232441 184535
12723a03776K2209j6229E7007J85811P4848j41075R8903j17910b48269A91763
$$ -103776 -81567 -97796 57007 242818 317666 176591 275494 157584 -248269 191763
12712a23487k8628J3950K5978b0948C36190m8318a23899N9323C02271d6185l5589
$$ -123487 -152115 -138165 -112187 -20948 336190 287872 -123899 -64576 302271 -46185 -81774
12701h1774I2213g3546b0659k07946g9005j29475B00208H0891L42015a66122D2559
$$ -81774 92213 -73546 -20659 -228605 -79005 -208480 200208 80891 422906 -166122 42559
12689A41740o5995K19827h4313p574C24052b87141E8135K16730A1539J8388O8829
$$ 141740 75745 295572 -84313 -91887 324052 -287141 58135 274865 11539 29927 98756
12678I8756f5488E9182a49110F8998N8001a83968B23524J12841A64433c8730D1993
$$ 98756 -65488 59182 -149110 68998 126999 -183968 223524 336365 164433 -38730 41993
12666A12655O0665f7768A95520f9104B38122q9636K19180H1259C6658f8814o0366
$$ 112655 173320 -67768 195520 -69104 238122 148486 367666 81259 36658 -68814 -129180
12655a29180D81000b7191n2006C32914H2872K71638A32898J24056Q7946j45651
$$ -129180 481000 -27191 -79197 332914 82872 354510 132898 256954 344900 199249
12645A99249L25199g4890P671K3810n5680A73834b91831I3780D4109K0712J62025
$$ 199249 524448 -74890 -67219 -43409 -99089 173834 -291831 93780 44109 64821 226846
12634B26846I5300Q7562b94446h0384j86513D33419B2218a89461O5985H8843g1014
$$ 226846 95300 182862 -294446 -80384 -266897 433419 22218 -189461 -123476 88843 -71014
12622A89642b07448B89030b39815H1929J88420A7674N3969K0764O5895J1707A8942
$$ 189642 -207448 289030 -239815 81929 270349 17674 71643 92407 158302 170009 18942
12610d7764C24253L04269A8169O97580E9165a91113n7591J08631n6378B68563
$$ -47764 324253 628522 18169 715749 59165 -191113 -248704 -140073 -196451 268563
12599A06729R3802h5327g960A41607c49741m4630P7220B2874f785l48065F3971
$$ 106729 200531 -85327 -7960 141607 -349741 -394371 -317151 22874 -6785 -354850 63971
12587B52493P7264A51171a9329D087K53893h1331q8170C04104j04729l0509Q477
$$ 252493 329757 151171 -19329 4087 257980 -81331 -169501 304104 199375 168866 177343
12576A77343a98604e2216D33426E9419K10239H9785d5404B968P7066L7672m4319
$$ 177343 -198604 -52216 433426 59419 269658 89785 -45404 2968 80034 117706 73387
12565G3387a68402A3595b71894i0702d507G2345J55672H2978Q0369G7705I477
$$ 73387 -168402 13595 -271894 -90702 -4507 72345 228017 82978 163347 77705 9477
12553F089b44082J18946j67593a42061B89483b29883B10833a95872e1424B26605
$$ 6089 -244082 -125136 -292729 -142061 289483 -229883 210833 -195872 -51424 226605
12542A1531R6643h6418I5246O6555c41683B1042M43668g2114H4885h3639m4599
$$ 11531 108174 -86418 95246 161801 -341683 21042 464710 -72114 84885 -83639 -128238
12531a28238H9583b69113A38617O522b22603P6056l5280N4844b0782k21927A28535
$$ -128238 89583 -269113 138617 145139 -222603 -146547 -181827 -126983 -20782 -242709 128535
12519B60724D9987K00226o4593p751B2751g8472B604K9373d8396J425m208E9911
$$ 260724 49987 250213 185620 177869 22751 -78472 2604 31977 -48396 -46971 -51179 59911
12506a77083l0048b295j04185M5695A98891a35468B21969E9727K0226e8171A02237
$$ -177083 -207131 -2295 -106480 -60785 198891 -135468 221969 59727 79953 -58171 102237
12494F4729J56276I384b73675c0684H6154A1386a70337C30454h2716E5047b25361
$$ 64729 221005 9384 -273675 -30684 86154 11386 -170337 330454 -82716 55047 -225361
12482F2193b53655A00131J0450f6751A8267i9119d380H4880J55006a48358D9061
$$ 62193 -253655 100131 110581 -66751 18267 -99119 -4380 84880 239886 -148358 49061
12470H5162J78700A21434L0313L0935J9334P9575A10819m0329O5192B044L21396
$$ 85162 263862 121434 151747 182682 202016 281591 110819 70490 135682 2044 323440
12459C23440b83505R5664i2501j47435A74230a27671K7978A56777m1644J3118
$$ 323440 -283505 -187841 -92501 -239936 174230 -127671 -99693 156777 115133 128251
12449A28251J89693a29695N0050H1207f2400k6070C07176B3786L42203A0a7773
$$ 128251 317944 -129695 -79645 81207 -62400 -88470 307176 23786 365989 10 -17773
12437F3431J10113G5662i0880C74630a2047k44830G4728L1011j2737a4461l4690
$$ 63431 173544 75662 -90880 374630 -12047 -256877 74728 105739 93002 -14461 -49151
12426d9151A20946J17700g3553j95573G476J20513C7848a33317C31933C5047c4508
$$ -49151 120946 238646 -73553 -269126 7476 127989 37848 -133317 331933 35047 -34508
12414c0641l43695A90521a32043d916k77452J01793q505A01399d85725F5522j2535
$$ -30641 -374336 190521 -132043 -4916 -282368 -180575 -189080 101399 -485725 65522 52987
12403E2987b14386o5136H7377J11450F0149j7407J8775b10076D2122b73069f0315
$$ 52987 -214386 -279522 87377 198827 60149 42742 61517 -210076 42122 -273069 -60315
12391C84493b49927f4135E1254b44803A87474p6265J33278I3656a37439d4867
$$ 384493 -249927 -64135 51254 -244803 187474 111209 244487 93656 -137439 -44867
12380a00356J4014C09655A5154b81255b5311A08749j1347M8451c2784j0114j24686
$$ -100356 -86342 309655 15154 -281255 -25311 108749 97402 145853 -32784 -42898 -167584
12369a67584L8447A58013o4409B7337q107h821C9284b12826d9478a2324B06400
$$ -167584 -129137 158013 93604 27337 19230 -8821 39284 -212826 -49478 -12324 206400
12357C346J54353B8603J7167Q5311K36634a53526H879Q8526m6371J25799h5383
$$ 3346 157699 28603 45770 131081 367715 -153526 8879 97405 51034 176833 -85383
12345B38633a5386j39609B22603j06722a58783M2198A02508K17676b41361A7866
$$ 238633 -15386 -154995 222603 115881 -158783 -116585 102508 320184 -241361 17866
12334A72617O3266K873A03085m1276C72b33200b3793A30193m4882J9356J62646
$$ 172617 235883 238756 103085 61809 372 -233200 -23793 130193 85311 104667 267313
12323B67313d0294q4040B22558a49585A3771n162a8538A67622o8760K77761A24260
$$ 267313 -40294 -124334 222558 -149585 13771 8609 -18538 167622 98862 376623 124260
12311a60760F33362j99245a29335I9009J05883l6340m1302J32855k9171A00081
$$ -160760 633362 434117 -129335 99009 204892 168552 127250 260105 230934 100081
12300f2422B04555E6021J98815J09523n0895a60058J0905D55774H4316k8981J99648
$$ -62422 204555 56021 254836 364359 313464 -160058 -149153 455774 84316 55335 254983
12289B54983A297a07610L4162A0466L0308a73593A16873J52341H1678J25680F9805
$$ 254983 1297 -107610 -73448 10466 40774 -173593 116873 269214 81678 207358 69805
12277c4122B64185o073E6828a58286A18574Q3837c2577A18330j2653f3928r2145
$$ -34122 264185 258112 56828 -158286 118574 202411 -32577 118330 105677 -63928 -156073
12266a56073e1019E5327k125a42144C46694I9345a79779A10773R2500o1657K79020
$$ -156073 -51019 55327 53202 -142144 346694 99345 -179779 110773 203273 141616 420636
12255D20636A55151J37366f0735B76456p1707K1894p3264A350J55396h2928B85176
$$ 420636 155151 292517 -60735 276456 204749 226643 153379 1350 156746 -82928 285176
12243A72534J68027r6122J57782h377B08641J67255B1260c7990C57132p7550F500
$$ 172534 340561 244439 402221 -8377 208641 375896 21260 -37990 357132 279582 6500
12231B65375A14075K41614q4102R2638A51882K0605E6317K99185j47352J67649
$$ 265375 114075 355689 271587 364225 151882 172487 56317 355502 208150 375799
12221C75799a69775D14703j43427D7742P0054K74809j39600k2644D1482j9329
$$ 375799 -169775 414703 271276 47742 117796 392605 253005 230361 41482 22153
12211B2153K16903b0792A35516M04932A0811J06251l7686M06067j66741L2371
$$ 22153 239056 -20792 135516 540448 10811 117062 79376 485443 318702 351073
12201C51073j54708K04151q8062J64360k22157F9018M34719j56198C144M72823
$$ 351073 196365 400516 312454 476814 254657 69018 503737 347539 3144 475967
12191D75967A71948M4412j9885c9813B80291M365N0522j26475q9167J18665M25751
$$ 475967 171948 216360 196475 -39813 280291 284656 335178 208703 119536 238201 663952
12180F63952I5280P7328K40209k6219A77235m780E696O51257r6972m3025A90014
$$ 663952 95280 172608 412817 386598 177235 172455 5696 656953 559981 516956 190014
12168A23570R8656q6298L60253m4138B13250L39051a21781B60863N2113B1458
$$ 123570 222226 135928 496181 452043 213250 552301 -121781 260863 312976 21458
12157B04309L1528I4950l3488K98231J7178L57855k75367K5970n3242A81332J28530
$$ 204309 235837 94950 61462 359693 376871 734726 459359 485329 432087 181332 309862
12146C09862O4553J3567a60452I8965C731J88915m9537A1395L5312a58400H2107
$$ 309862 374415 387982 -160452 98965 3731 192646 143109 11395 46707 -158400 82107
12134E1790M5187L24244A49972E1575K34233B9227J44401K10906d5434r409H8165
$$ 51790 96977 421221 149972 51575 285808 29227 173628 384534 -45434 -54843 88165
12122A07243Q781D1601L88930j33563Q0282j32159O7684E9289H093J22702D7644
$$ 107243 116024 41601 430531 296968 377250 245091 312775 59289 8093 130795 47644
12110a60222D43433c6022j6151C03600q5759P2698c67233B42947l1993c9153A33246
$$ -160222 443433 -36022 -52173 303600 217841 290539 -367233 242947 210954 -39153 133246
12098A54756A6901K9635L59508j66231l3316J11643r4784j01450J15147b4054
$$ 154756 16901 46536 406044 239813 206497 318140 223356 121906 237053 -24054
12087I2216L00656j38443b3529O529B91460b58398A27153c11149C81510j23342
$$ 92216 392872 254429 -23529 -17000 291460 -258398 127153 -311149 381510 258168
12077B58168c31044I4240d9001r2843J6387C28782E6280a9295A87153H9081f1899
$$ 258168 -331044 94240 -49001 -141844 -125457 328782 56280 -19295 187153 89081 -61899
12065A42899r547K9637Q5928H058J36553L35080B31630H8233J06275e330A9625
$$ 142899 133352 162989 248917 8058 144611 479691 231630 88233 194508 -5330 19625
12053B26929E7918N0039f5304A95194f5738D00180G6273B9296J9699K8414d55774
$$ 226929 57918 107957 -65304 195194 -65738 400180 76273 29296 48995 77409 -455774
12041C1386h565B85933n0835j8933C9221b31257E9154N0485e5850A85796b30358
$$ 31386 -8565 285933 235098 216165 39221 -231257 59154 109639 -55850 185796 -230358
12029a96567N1342H4875g1840C52739a27121L2853K1037C77518B7259e2387B4481
$$ -196567 -145225 84875 -71840 352739 -127121 -94268 -73231 377518 27259 -52387 24481
12017g3878q9797O9009B866a91926D1062i6140A11710K5838a27006A07260K48737
$$ -73878 -163675 -94666 2866 -191926 41062 -96140 111710 137548 -127006 107260 355997
12006C55997A58550E9195P5724a20499M3047J3833A31874f7473I926a15052B33687
$$ 355997 158550 59195 134919 -120499 -77452 -63619 131874 -67473 9926 -115052 233687
11994A082O1170P6739b0972G9932J3370C9602c5526M312A12049f9806j32239P7786
$$ 1082 62252 138991 -20972 79932 93302 39602 -35526 -31214 112049 -69806 -202045 -124259
11982a24259o3747m8800g2190k70333J68006G6852M5211e2891A97749b00672G1106
$$ -124259 -188006 -236806 -72190 -342523 -174517 76852 122063 -52891 197749 -200672 71106
11970D6008L85406b30611A49425M5220b26596a8640j99618A1234b43430k7342
$$ 46008 431414 -230611 149425 194645 -226596 -18640 -218258 11234 -243430 -270772
11960b70772A96060j4426e0982A18599a57906A1588J08385A1832i0814B21706
$$ -270772 196060 181634 -50982 118599 -157906 11588 119973 11832 -90814 221706
11949e8725q2696C8033b37087J06880A92711a96982I1610a77366I6915a33805
$$ -58725 -141421 38033 -237087 -130207 192711 -196982 91610 -177366 96915 -133805
11938a07851A15213j502J39419N4543c2630k73781L7979A91155b09540j20332
$$ -107851 115213 113711 253130 307673 -32630 -306411 -268432 191155 -209540 -329872
11928c29872B47053a50557k07514e8818A60204b2389j65766j38541a07759A57781
$$ -329872 247053 -150557 -358071 -58818 160204 -22389 -188155 -326696 -107759 157781
11917F2829c14386B64289H3492J3289f3842J1926j93936p1448A51755C6265b07889
$$ 62829 -314386 264289 83492 96781 -63842 -51916 -245852 -317300 151755 36265 -207889
11905C06216A02230D8607G592g3129j59307C43760A20940d2337H2521d1011R663
$$ 306216 102230 48607 7592 -73129 -232436 343760 120940 -42337 82521 -41011 -31348
11894c1348f7j25670e6877p1245A99114m3922a49599K9172B60827a73207d8039
$$ -31348 -67 -125737 -56877 -128122 199114 155192 -149599 -120427 260827 -173207 -48039
11882A19431C4023A1386a13093k0138O4426A20394A7851J22073g3251F2191B1937
$$ 119431 34023 11386 -113093 -133231 -68805 120394 17851 139924 -73251 62191 21937
11870h7897B972b65620D2643K78497c3733k35357J02064F6686b45369N519i278
$$ -87897 2972 -265620 42643 321140 -33733 -269090 -167026 66686 -245369 -239850 -9278
11858A42289a71107n7570G7606i8693M5493p1054d2411l2172k44197G899R6280
$$ 142289 -171107 -228677 77606 -98693 -53200 -124254 -42411 -74583 -318780 7899 104179
11847A04179a25621B56573a47668K9237d8503B8199a4733l87607A60830F8476
$$ 104179 -125621 256573 -147668 -118431 -48503 28199 -14733 -402340 160830 68476
11836E034c44249J14067H2057b15645C52473G6020c3800B4919c2833m2557q7096
$$ 5034 -344249 -230182 82057 -215645 352473 76020 -33800 24919 -32833 -75390 -162486
11825a62486r3843o030B24135C116L25918B9480J3811Q6946g6280C23002f1207
$$ -162486 -256329 -262359 224135 3116 329034 29480 43291 130237 -76280 323002 -61207
11813A36292M2683c92386J38302A07706C4426c3673o4001I1818e2673n1435F2424
$$ 136292 178975 -392386 -254084 107706 34426 -33673 -97674 91818 -52673 -104108 62424
11801B7283M9075c9198j49143k42414B66783j21876b05461B29837j06006B4158
$$ 27283 76358 -39198 -188341 -430755 266783 144907 -205461 229837 123831 24158
11790a60232A9617K09731a4700A54817F0966f8659m4906A59801K16161c65016
$$ -160232 19617 229348 -14700 154817 60966 -68659 -113565 159801 375962 -365016
11779i0940F4205C1697M3050a13557k2041f5297B01367J07479A3222c1005H2233
$$ -90940 64205 31697 74747 -113557 -135598 -65297 201367 308846 13222 -31005 82233
11767e6340K6890A153e9181B93057c9722B8932K75844C6667c08452a33249a3483
$$ -56340 -29450 1153 -59181 293057 -39722 28932 304776 36667 -308452 -133249 -13483
11755b43584a07010e1843C5333a41411B9672b41520J0566D7370i2343i227k84501
$$ -243584 -107010 -51843 35333 -141411 29672 -241520 -230954 47370 -92343 -9227 -293728
11744b93728B39638j02815o6744J26941C8065K19070E2816M55383c59871I6606
$$ -293728 239638 136823 70079 197020 38065 257135 52816 508199 -359871 96606
11733A07008K20101b3041j67397A53876a30594C958Q9620B9601f3108J4541B39471
$$ 107008 327109 -23041 -190438 153876 -130594 3958 93578 29601 -63108 -48567 239471
11721c29655A84543c0504A11408b5684G0974j140a71319F2999a88208c3497A033
$$ -329655 184543 -30504 111408 -25684 70974 69834 -171319 62999 -188208 -33497 1033
11709A2552I97i5249J7727k7269B20744a45580K9025D65651a55384P1083j11050
$$ 12552 997 -95249 -77522 -104791 220744 -145580 -116555 465651 -155384 -84301 -195351
11698a95351H7615L7930h841k16561B52074p8628J63175A50810G607K8498b63419
$$ -195351 87615 125545 -8841 -225402 252074 173446 336621 150810 7607 36105 -263419
11686e4716k46009C0623K37646h7540p0379C32776j57173A0055b5597A58821a99734
$$ -54716 -300725 30623 268269 -87540 -157919 332776 175603 10055 -25597 158821 -199734
11674B11840a70858B68822b10854C07424a21196A06528n2125L4303b55904H9598
$$ 211840 -170858 268822 -210854 307424 -121196 106528 54403 88706 -255904 89598
11663A37839n4224b84094B99401f1526n4813j658A51301j3622b40261A34570K2226
$$ 137839 83615 -284094 299401 -61526 -116339 -117997 151301 137679 -240261 134570 156796
11652A56796a54796r9511A40974b546j73190Q0741m4419M7243A82871a51398B10542
$$ 156796 -154796 -254307 140974 -2546 -175736 -94995 -139414 -92171 182871 -151398 210542
11640d9905j80067B81566j03338a21118G575g782k11850C22302f7982A42671P8065
$$ -49905 -229972 281566 178228 -121118 7575 -7782 -219632 322302 -67982 142671 220736
11629B20736K6375b24114J9463J01516H9067A1045a1964k54399J16374B8751P5735
$$ 220736 247111 -224114 -204651 -103135 89067 11045 -11964 -266363 -149989 28751 104486
11618A04486f4487j39474d0476j16363H5226a13887j94216A3596e1339K0581l1845
$$ 104486 -64487 -203961 -40476 -156839 85226 -113887 -308103 13596 -51339 -30758 -62603
11607f2603B76915F3082K3387M54270A36734f144q3913E0472b0631j65216E1253
$$ -62603 276915 63082 86469 540739 136734 -6144 -90057 50472 -20631 -185847 51253
11595A39914K15059a51102o3066R3000A03082J28078m2531b08580N8888B66651
$$ 139914 354973 -151102 -214168 -121168 103082 231160 188629 -208580 -149692 266651
11584h7260A12835d34439F1830O3914b78153B01382J7233D2433e0294m9572j25932
$$ -87260 112835 -434439 61830 125744 -278153 201382 218615 42433 -50294 -99866 -225798
11573b25798A16540M5246K21015g6476A87152A2993J79460b05815A57287n9834
$$ -225798 116540 161786 382801 -76476 187152 12993 192453 -205815 157287 97453
11563I7453l7O0212H097M0203L31273O5521f9412I3380A490i5168K9087d71B7603
$$ 97453 97416 157628 8097 48300 379573 445094 -69412 93380 1490 -95168 -66081 -471 27603
11549F7705R4088M444h4045j79158A40068F5667K2697L01816c2592F2577h8480
$$ 67705 161793 166237 -84045 -263203 140068 65667 88364 390180 -32592 62577 -88480
11537C6689J64576m6926J29407A02404m0535J19227N0297K1729B4062b99528A65904
$$ 36689 201265 154339 283746 102404 61869 181096 231393 253122 24062 -299528 165904
11525g5199D7488J46080J32060L11017A74027a67014A09691K0539a303F4165J64876
$$ -75199 47488 193568 325628 636645 174027 -167014 109691 130230 -1303 64165 229041
11514B29041a44829D06448a1204H4142l7059l571K9309J7624i7780p6350C8775
$$ 229041 -144829 406448 -11204 84142 47083 43512 72821 90445 -97780 -174130 38775
11502B58202p1855e0372A52615h5990B86001H644L6703N92148I4544O2934L483
$$ 258202 186347 -50372 152615 -85990 286001 8644 45347 637495 94544 157478 160961
11491A60961M3194n4540m9112J57380I1818J22518M8795f7286a2804C42001q5367
$$ 160961 204155 149615 100503 257883 91818 214336 263131 -67286 -12804 342001 256634
11480B56634j2118b152C13755A28261K97909j65766n6190I7036r646c9180I5638
$$ 256634 244516 -2152 313755 128261 426170 260404 204214 97036 87390 -39180 95638
11468B92284D5160P7868K65359j83684K33085A31258m8968P8473c8484j68272
$$ 292284 45160 123028 388387 204703 437788 131258 82290 160763 -38484 -206756
11458b06756D03778j95609J4856A6911K63782H5782b4079B8098J70520k9937M7590
$$ -206756 403778 208169 223025 16911 280693 85782 -24079 28098 198618 168681 216271
11447B16271a7896A40815N471m3559J91193G990K17581K29917A45512J37621o200
$$ 216271 -17896 140815 146286 102727 293920 7990 225571 455488 145512 283133 276933
11436B76933j02383o0933Q0455a142I0597K26660j11240m4537D6765d4513g298
$$ 276933 174550 113617 194072 -1142 90597 317257 206017 161480 46765 -44513 -7298
11424d806A67058F1290O0145e5604A95046a44788A32014A8504K10485a99234m0723
$$ -4806 167058 61290 121435 -55604 195046 -144788 132014 18504 228989 -199234 -239957
11413b39957b1411A90155O1618R4855d5711a1147B14907q9624b75654f4462j4247
$$ -239957 -21411 190155 251773 346628 -45711 -11147 214907 125283 -275654 -64462 -78709
11402g8709B91278c2589n2116H8700d12177a84522E647a72380l3778L3717A66630
$$ -78709 291278 -32589 -84705 88700 -412177 -184522 5647 -172380 -206158 -172441 166630
11390b3651k08306B57245r0369a66296B39118A17830J8336F3695d3015F0913R4048
$$ -23651 -231957 257245 166876 -166296 239118 117830 136166 63695 -43015 60913 154961
11379A54961f7147j2394n0381M1051c043l26228h371C10597c19244b6621j40830
$$ 154961 -67147 -79541 -129922 -88871 -3043 -329271 -8371 310597 -319244 -26621 -167451
11368a67451k93027h6885d365I8187N9319A0263f9318F4981J10546c18806b0089
$$ -167451 -460478 -86885 -4365 98187 157506 10263 -69318 64981 175527 -318806 -20089
11356c5585A54151a33379d46C09661D9979J22455a00102K4100A01373b4614A22357
$$ -35585 154151 -133379 -446 309661 49979 172434 -100102 -76002 101373 -24614 122357
11344A85843K24731B7410a14033A83205G9494a51173p0657C05400c85052G5238
$$ 185843 410574 27410 -114033 183205 79494 -151173 -221830 305400 -385052 75238
11333A28511a48045j82318f4492k49252f1938n9386d510l7629k14923L1082Q1699
$$ 128511 -148045 -330363 -64492 -313744 -61938 -121324 -4510 -42139 -257062 -225980 -144281
11322a44281c1519q3774l9381d7748A26221a14802k291N5054C512a91136Q685
$$ -144281 -31519 -115293 -154674 -47748 126221 -114802 -117093 -62039 3512 -191136 -182451
11311a82451j124j17625g2186C00219a16974D9928q83a17148m1834A03240K5422
$$ -182451 -183575 -301200 -72186 300219 -116974 49928 49045 -117148 -158982 103240 128662
11300A28662e2151D9310d58924a96444A88138a75989A4554c05695f9894G4334
$$ 128662 -52151 49310 -458924 -196444 188138 -175989 14554 -305695 -69894 74334
11289a1304l848I212M18643A91360G5611c60054f6881B15601b02489b4362D7527
$$ -11304 -15152 9212 427855 191360 75611 -360054 -66881 215601 -202489 -24362 47527
11277a01419q0686E049R8647e8761F9215c65186B05081a84887C20966b51896h5693
$$ -101419 -182105 5049 103696 -58761 69215 -365186 205081 -184887 320966 -251896 -85693
11265b97593A38048a12342e1002j63130a02846C9164L19584b93568A62007J95166
$$ -297593 138048 -112342 -51002 -214132 -102846 39164 358748 -293568 162007 357173
11255C57173b26920D46224A5013J3075a54781A5313L24421b49964I276Q3767c3168
$$ 357173 -226920 446224 15013 28088 -154781 15313 339734 -249964 9276 93043 -33168
11243B28470a13995L0169p2939M7493e691j62895H8239k9566N3591l6011c54334
$$ 228470 -113995 -83826 -156765 -109272 -5691 -168586 88239 58673 112264 76253 -354334
11231A78493a79201j37726B936b58461B3742d09144e8410E1769b25351L3615A5923
$$ 178493 -179201 -316927 2936 -258461 23742 -409144 -58410 51769 -225351 -191736 15923
11219b50685F1761b58242E2521c58684a31490C7564m943B542O7646A5160a35290
$$ -250685 61761 -258242 52521 -358684 -131490 37564 32621 2542 70188 15160 -135290
11207C1533c01516a15574A9603L18038A21317B3884a05276A8226c55393C4988
$$ 31533 -301516 -115574 19603 337641 121317 23884 -105276 18226 -355393 34988
11196A32015a78308H6948b29050r1733G0653l3383b14590B77917c8209H9926m0829
$$ 132015 -178308 86948 -229050 -320783 70653 37270 -214590 277917 -38209 89926 49097
11185D9097a86627O6466M7368a1292r205L0A18724c36933J31936b0900D9430b4250
$$ 49097 -186627 -120161 -72793 -11292 -20497 -20467 118724 -336933 -204997 -20900 49430 -24250
11172B4346a85754E7196j4759Q1312i6331j31531H279e6441D8116a82288d2041
$$ 24346 -185754 57196 42437 123749 -96331 -227862 8279 -56441 48116 -182288 -42041
11160b51D0297a47135q276M5892j00215L750C44783a355m44048A18060b19259
$$ -251 40297 -147135 -155411 -109519 -209734 -205984 344783 -1355 -445403 118060 -219259
11148B98182a71816B5462b42121a09807H5863b92101c8004F9215J99297f1357
$$ 298182 -171816 25462 -242121 -109807 85863 -292101 -38004 69215 268512 -61357
11137a39410O949c5063A68976b72073A28621J5245n5249K69381A308b2950n2473
$$ -139410 -132461 -35063 168976 -272073 128621 143866 88617 357998 1308 -22950 -75423
11126g5423F8493h5097K5269j39198L0463D3594C09J02878J04838A1213b75716
$$ -75423 68493 -85097 -59828 -199026 -168563 43594 309 103187 208025 11213 -275716
11114A23457b62788C0017J53370n4074O8318g819k5390C1925K62699A05147M96997
$$ 123457 -262788 30017 183387 129313 197631 -7819 -33209 31925 294624 105147 602144
11103F02144H980O7184j161J43510j03577K49008E7466J48598A8217K70510f6441
$$ 602144 8980 76164 75003 218513 114936 363944 57466 206064 18217 288727 -66441
11091B68601F2144l1065N9089O2216J07400A25136A3190J20248A7810J71158A3220
$$ 268601 62144 31079 90168 152384 259784 125136 13190 133438 17810 188968 13220
11079C65173j68848K1038K16158J7235J6972F1136a24487A00281O26229B62872
$$ 365173 196325 217363 433521 450756 467728 61136 -124487 100281 726510 262872
11068C95152E8746K05848J3482R9655l773A86511M6068H9525L35609L6975g3930
$$ 395152 58746 264594 278076 377731 373958 186511 232579 89525 425134 462109 -73930
11056D76613r6073M6205j97317J66105L35743C63517O9435Q6161J80612Q1570
$$ 476613 380540 426745 229428 395533 731276 363517 432952 519113 699725 781295
11046G81295A82496L04241K51782k85363K23853K59402P9116k78129J22304k33038
$$ 781295 182496 486737 738519 453156 677009 936411 1015527 737398 859702 626664
11036F26664J49011J51235K54991j69794J5971j40793J40517J32645K09890l88783
$$ 626664 775675 926910 1181901 1012107 1028078 887285 1027802 1160447 1370337 981554
11026I81554K65178r2242n2221J20871N3172j35194M34234p47717K72392R5743
$$ 981554 1246732 1154490 1102269 1223140 1276312 1141118 1575352 827635 1100027 1195770
11016A195770j99528J42914j99229J16475j40045q4147M00999k14563K42603k052
$$ 1195770 996242 1139156 939927 1056402 916357 832210 1233209 1018646 1261249 1259197
11006A259197j92518K9814n6034L33998l98184l1793j83677J83443r9190K90168
$$ 1259197 1066679 1096493 1040459 1374457 976273 944480 760803 944246 845056 1135224
10996A135224j20674l60736K98554P3665Q9891j13164J96829l85049J05160j7898
$$ 1135224 1014550 653814 952368 1026033 1115924 1002760 1199589 814540 919700 901802
10986I01802J53864p7195j54336Q4527K0986k7434j02250K85909l09509J50388
$$ 901802 1055666 978471 824135 908662 929648 902214 799964 1085873 776364 926752
10976I26752L72119j15989l70131L00517k39686L37186q2910J62521l06457K76727
$$ 926752 1298871 1182882 812751 1113268 873582 1210768 1127858 1290379 983922 1260649
10966A260649k04058K21433l5482L73772l26954L57032K01669k83233Q63169r0586
$$ 1260649 1056591 1278024 1242542 1616314 1289360 1646392 1848061 1564828 2427997 2337411
10956B337411J66574m4623O66875L30073J96277K14128n7150L07320J39470m11738
$$ 2337411 2503985 2459362 3126237 3456310 3652587 3866715 3809565 4116885 4256355 3844617
10946C844617m11915J6416o82314m23218j05387m65723K46470M11939o83948J85604
$$ 3844617 3432702 3449118 2766804 2343586 2238199 1772476 2018946 2430885 1746937 1932541
10936A932541j79686j28311m2912k09967m0548l08460J30060k49274J67243m41062
$$ 1932541 1752855 1624544 1581632 1371665 1331117 1022657 1152717 903443 1070686 629624
10926F29624k94975N4685P7561j42670j01158N0202M28951h9789D49461j23467
$$ 629624 334649 389334 466895 324225 223067 273269 702220 -89789 449461 325994
10916C25994A4855P164b11912I9886d7401i479A86836b8639p787A45486C727R3533
$$ 325994 14855 22019 -211912 99886 -47401 -9479 186836 -28639 -36426 145486 3727 97260
10904I7260h4157I4070J76328A12762K2793a55802B29882J44431j44645a02196
$$ 97260 -84157 94070 270398 112762 135555 -155802 229882 374313 229668 -102196
10893b5978j20262A28052a92121e1853O573A78365p8136M6567a33364J6870K1625
$$ -25978 -146240 128052 -192121 -51853 -45280 178365 100229 146796 -133364 -116494 -94869
10882i4869L8738A47133J60858R5426g4572r883B48954c9246j53185N6095c8949
$$ -94869 -56131 147133 307991 403417 -74572 -84455 248954 -39246 -192431 -136336 -38949
10870d3889j4711k60862J12666A9831J2439j5336K52374a38330A4241a81673B2918
$$ -43889 -58600 -319462 -206796 19831 32270 16934 269308 -138330 14241 -181673 22918
10858b20953j01929A72312a45197B15595o1390E2311a38511k33735d0634l4542
$$ -220953 -322882 172312 -145197 215595 154205 52311 -138511 -372246 -40634 -75176
10848g5176k13716M7324A63644a3306j46479K3179C48932c7315j09789f0634k11967
$$ -75176 -288892 -241568 163644 -13306 -159785 -136606 348932 -37315 -147104 -60634 -272601
10837b72601B03472e7144l79516d9250p6972E1185a06321j89757P1333A19286
$$ -272601 203472 -57144 -436660 -49250 -126222 51185 -106321 -296078 -224745 119286
10826b39799A79015a60767A63182p2932d0169A5527a58531j6075N1075k2440A46021
$$ -239799 179015 -160767 163182 90250 -40169 15527 -158531 -174606 -123531 -145971 146021
10814b01966H3049c4733A5569g0041j7981H708b60463e8851A79574d5386j68011
$$ -201966 83049 -34733 15569 -70041 -88022 8708 -260463 -58851 179574 -45386 -213397
10803b13397A93490K1374b14264b9996k6821F4986a20842A73229o2236b3199j36617
$$ -213397 193490 214864 -214264 -29996 -56817 64986 -120842 173229 110993 -23199 -159816
10792a59816C3496L17501n6292A25488e7882l3574A103e8393j73815G1905J42667
$$ -159816 33496 350997 294705 125488 -57882 -91456 1103 -58393 -232208 71905 214572
10781B14572c27045B03333a97413g5990A81522A4240J5447a37797e2059l09663
$$ 214572 -327045 203333 -197413 -75990 181522 14240 29687 -137797 -52059 -361722
10771c61722E4145c94620c7348k5857r5348d1707j81971q497c4262k92947b1187
$$ -361722 54145 -394620 -37348 -63205 -158553 -41707 -223678 -232175 -34262 -327209 -21187
10759a09202j7338j55283m2469B2163d844D6692J04309O3983c57315g9443A24029
$$ -109202 -126540 -281823 -324292 22163 -4844 46692 151001 214984 -357315 -79443 124029
10747h8360B28450p0497A5640b63408a28663F8800c792p1712j068b3529C51068
$$ -88360 228450 157953 15640 -263408 -128663 68800 -3792 -75504 -76572 -23529 351068
10735a17875C3854g6081C89640a62274m0721g2881c5253J0691A83533C8451I548
$$ -117875 33854 -76081 389640 -162274 -202995 -72881 -35253 -24562 183533 38451 9548
10723D7689J0321a0271k2150j71046M6277A15856B8277a02088j89708n3996a32075
$$ 47689 58010 -10271 -32421 -203467 -157190 115856 28277 -102088 -291796 -345792 -132075
10711H1797n491p871K79335f786j97497L5232h0970j58131J14725M7185L1460
$$ 81797 76306 68435 347770 -6786 -204283 -169051 -80970 -239101 -124376 -77191 -45731
10700d5731m6936l60489b10365R1682b2086E7563A7215d7508E5203b68576P1590
$$ -45731 -92667 -453156 -210365 -118683 -22086 57563 17215 -47508 55203 -268576 -196986
10689a96986J0994A25126b82803J2462J14940A09096d0046j3141A51670A587J57010
$$ -196986 -185992 125126 -282803 -270341 -155401 109096 -40046 -53187 151670 1587 158597
10678A58597A2861a31A43960a11148d2976D2760c3073G3132c0407E7194a46885
$$ 158597 12861 -131 143960 -111148 -42976 42760 -33073 73132 -30407 57194 -146885
10666b12871h4641B22221b01759D9036d35419A64777b46101d5199j30952r0455
$$ -212871 -84641 222221 -201759 49036 -435419 164777 -246101 -45199 -176151 -266606
10656b66606B45341I5054F711a48357f3963l13453a16829N6796D09619d3490p4133
$$ -266606 245341 95054 6711 -148357 -63963 -377416 -116829 -60033 409619 -43490 -117623
10645a17623n4390K3141j05584P9542O9720b4028B806a11959A58758l5200c31484
$$ -117623 -172013 -148872 -254456 -174914 -105194 -24028 2806 -111959 158758 123558 -331484
10633A74048a40995L2592E5108b615A0835b66623J18610D845K87696a33772l80036
$$ 174048 -140995 -108403 55108 -2615 10835 -266623 -148013 4845 292541 -133772 -513808
10622e13808i7437j2619k98900J40737d1030j4227a9449D6927a57702A54376F3765
$$ -513808 -97437 -110056 -408956 -268219 -41030 -55257 -19449 46927 -157702 154376 63765
10610A3034b22639e7859p261b7707l3474N224j15437I0235A0304h1896A32659
$$ 13034 -222639 -57859 -65120 -27707 -61181 -55957 -171394 90235 10304 -81896 132659
10598a09392Q421c6175A37259a71099B681e69126A24489b15357I5927b47430a12919
$$ -109392 -100971 -36175 137259 -171099 2681 -569126 124489 -215357 95927 -247430 -112919
10586I2615L6055c57504i0995P831B0781J257f3643L315k15937a16776J4448q7195
$$ 92615 128670 -357504 -90995 -83164 20781 22038 -63643 -60328 -276265 -116776 -102328 -189523
10574a89523A1789b08826j67k1168Q1843k16172a70299b2672C5283P7529a36898
$$ -189523 11789 -208826 -208993 -230161 -148318 -364490 -170299 -22672 35283 112812 -136898
10562F991a64767o0875b9561k54009b963H644J53716G325O794a96372i4838j54210
$$ 6991 -164767 -225642 -29561 -283570 -2963 8644 162360 7325 14119 -196372 -94838 -249048
10550b49048C5712a48126A0968c44824O1721G3739a139j64915l8672e7781j99454
$$ -249048 35712 -148126 10968 -344824 -283103 73739 -1139 -166054 -204726 -57781 -257235
10539b57235A1389b55882h8744C6586J50481b66078d7030D7246C752a02290k23963
$$ -257235 11389 -255882 -88744 36586 187067 -266078 -47030 47246 3752 -102290 -326253
10528c26253i9307A8780e773B8753N8837f3444q4944L4054K2836F2674c97030
$$ -326253 -99307 18780 -5773 28753 87590 -63444 -148388 -114334 -91498 62674 -397030
10516d578r1841p8548B92047c6572l35002a06877D9157J71739A4961J02636A9099
$$ -4578 -96419 -174967 292047 -36572 -371574 -106877 49157 220896 14961 117597 19099
10504i4160B48996J3433A21200o672O4915k6202C0319c3224k45404J32173j14500
$$ -94160 248996 262429 121200 114528 179443 153241 30319 -33224 -278628 -146455 -260955
10493b60955C9929b39985j6791D6794d0264p2291A09150c66140D01416b43407
$$ -260955 39929 -239985 -256776 46794 -40264 -112555 109150 -366140 401416 -243407
10482b6802I2182a89164H1183h5296l3856j4506m9946I6692m1832J89029Q5210
$$ -26802 92182 -189164 81183 -85296 -119152 -133658 -183604 96692 54860 243889 329099
10471C29099a06407l9105K9016a5187k08647d5292A84237b76146C31258c22100
$$ 329099 -106407 -145512 -116496 -15187 -223834 -45292 184237 -276146 331258 -322100
10460B04780H9950J23551J09800o0214g5202B61018B5317J29946J29146a05278
$$ 204780 89950 213501 323301 263087 -75202 261018 25317 155263 284409 -105278
10449c5124A98892G6610O5610P466a21633B8928i6216r5681P9059D979h6573L7364
$$ -35124 198892 76610 142220 149686 -121633 28928 -96216 -191897 -112838 4979 -86573 -49209
10437d9209j30751c8676a7726j81312e404B48281c95313f6096r0878A11532a42533
$$ -49209 -179960 -38676 -17726 -199038 -5404 248281 -395313 -66096 -156974 111532 -142533
10425b5013m71878H4461e7960k198A84554n824g8093k97183a05256l0361m095
$$ -25013 -496891 84461 -57960 -60158 184554 178730 -78093 -375276 -105256 -135617 -139712
10414a39712p465e1021j20310H8574Q8933a40123F4087Q6836d8371l63703a96842
$$ -139712 -147177 -51021 -171331 88574 177507 -140123 64087 150923 -48371 -412074 -196842
10402c09281G1427a09304m19201f2029B54274J2957l203p572r4450a5705A23501
$$ -309281 71427 -109304 -528505 -62029 254274 267231 264028 256456 162006 -15705 123501
10390D9274a09437p3804k7924R508d2397j14173F0465L6147J01942b23311C58220
$$ 49274 -109437 -183241 -211165 -201657 -42397 -156570 60465 96612 198554 -223311 358220
10378a11423H698O3818M3444f0896n5559A90867J90241n0633j11121k2627J0344
$$ -111423 8698 72516 115960 -60896 -116455 190867 381108 330475 219354 196727 207071
10367B07071D3535Q8906j5165K80402j44598G2330K54086M8465J01485n1428l5042
$$ 207071 43535 132441 117276 397678 253080 72330 326416 374881 476366 424938 389896
10356C89896p7218k0156k4478K567o3338R3923K16005M5487J52305j48489L20691
$$ 389896 312678 292522 268044 270611 207273 301196 517201 562688 714993 566504 887195
10345H87195l51733L26044C03791J19488k5385l5955j18734J89868j02489K22473
$$ 887195 535462 861506 303791 423279 397894 361939 243205 433073 330584 553057
10335E53057A72784J69541K10049k01133M57257j59961j00875j71130A59021K79493
$$ 553057 172784 342325 552374 351241 808498 648537 547662 376532 159021 438514
10325D38514P193l0534j32747A24527K20610R031a07461D64506G4784A5585L52943
$$ 438514 445707 415173 282426 124527 345137 354168 -107461 464506 74784 15585 368528
10314C68528q6475A7498K04899m2581R2071B8618h0646N242A21647M7437c481
$$ 368528 282053 17498 222397 179816 271887 28618 -80646 -75404 121647 169084 -3481
10302C40192A04611k9755K4717J96403A23945b3512j32074K8338A22643g5424
$$ 340192 104611 74856 99573 295976 123945 -23512 -155586 -127248 122643 -75424
10291A30403P1108C5099J15294g9381A10999N8953L9096b94913a22243A73298
$$ 130403 201511 35099 150393 -79381 110999 169952 209048 -294913 -122243 173298
10280c0454j14346C7983J469a5918j37528k63869D5540b40570j76574J77534a17138
$$ -30454 -144800 37983 39452 -15918 -153446 -417315 45540 -240570 -417144 -239610 -117138
10268A99942a49193A40629a60526n7084j00393H4822J50930c00148a48986j921
$$ 199942 -149193 140629 -160526 -217610 -318003 84822 235752 -300148 -148986 -150907
10258a50907f8785b0687k64488A32906b79461E0952O3823a45290N0905d3830k96743
$$ -150907 -68785 -20687 -285175 132906 -279461 50952 114775 -145290 -94385 -43830 -340573
10247c40573d1271c323A15429P2111e50708B3744R4469g7701B98478j16651a3729
$$ -340573 -41271 -3323 115429 187540 -550708 23744 118213 -77701 298478 181827 -13729
10235b6613B27220G873K00063j0406J14331A2619a80063E2297K21294B8051K06639
$$ -26613 227220 7873 207936 197530 311861 12619 -180063 52297 273591 28051 234690
10224B34690b79660k42306c8975k1333A16160a33191m8701B37271F8626b77245
$$ 234690 -279660 -521966 -38975 -60308 116160 -133191 -181892 237271 68626 -277245
10213b34975D26753d865B2245d9224j02779g0724k81516K573A04207a02295C9538
$$ -234975 426753 -4865 22245 -49224 -152003 -70724 -352240 -349667 104207 -102295 39538
10201b11549A21908f6576j46385j7294a4614m40896A22644g8315A94326C0178
$$ -211549 121908 -66576 -212961 -230255 -14614 -455510 122644 -78315 194326 30178
10190a14951D6366a44833d7401Q815o6325A48072a65973D4651c60353a04846l20539
$$ -114951 46366 -144833 -47401 -38586 -104911 148072 -165973 44651 -360353 -104846 -425385
10179d25385h3370I3847f7543A42525C827a49753o7697j51745e3526j42611L5144
$$ -425385 -83370 93847 -67543 142525 3827 -149753 -217450 -369195 -53526 -196137 -160993
10168a60993d2078B9871P0004b72825G2250L33465C9144K19075N9940a41496G2434
$$ -160993 -42078 29871 99875 -272825 72250 405715 39144 258219 318159 -141496 72434
10156a96386g3909C4605a31140k60167f0676j5876j42370H7373J19649a86174
$$ -196386 -73909 34605 -131140 -391307 -60676 -76552 -218922 87373 207022 -186174
10145c399j36888C7703a61987e6100j13645A07487d04422A47948a53555l72547
$$ -3399 -140287 37703 -161987 -56100 -169745 107487 -404422 147948 -153555 -526102
10135e26102h5017a1894k16420J01035r2387L0898k60151R0499a21813C23653
$$ -526102 -85017 -11894 -228314 -127279 -219666 -188768 -448919 -358420 -121813 323653
10124a01035M3913B71221a33202r018m253J7743I928c04259i3145A597b25921
$$ -101035 -57122 271221 -133202 -142220 -146473 -128730 9928 -304259 -93145 1597 -225921
10112d26308c119k43893J20152G5775a04866j77689q750c7103m55856A3805P738
$$ -426308 -3119 -247012 -126860 75775 -104866 -282555 -291305 -37103 -492959 13805 21543
10101B1543E504K56397E9216B420a48762j26732f9735C9582J4629b45377e8006
$$ 21543 5504 261901 59216 2420 -148762 -275494 -69735 39582 54211 -245377 -58006
10089b87955J7123J25593I2174i4027l5526q5219C1011b02961a0434l4208B46441
$$ -287955 -270832 -145239 92174 -94027 -129553 -214772 31011 -202961 -10434 -44642 246441
10077g2990F4106j7057e56936a80635f68q6319A524c216k39976A5746R4262j7352
$$ -72990 64106 47049 -556936 -180635 -668 -86987 1524 -3216 -243192 15746 110008 92656
10065I2656F531b51797f5543A93936a39075L9107A4017J39239c22237K9607j18925
$$ 92656 6531 -251797 -65543 193936 -139075 -99968 14017 153256 -322237 -292630 -411555
10054d11555J08227B91976e8192E685J33022O2628H900c02677d8645C5425L1387
$$ -411555 -303328 291976 -58192 5685 138707 201335 8900 -302677 -48645 35425 66812
10043F6812J90347a00084A26600n0359d10794H9115a88021P6337C46801A13955
$$ 66812 257159 -100084 126600 76241 -410794 89115 -188021 -111684 346801 113955
10032b9706n0390k54612J53994k52260j3335A06491b22431B00116a41864k34479
$$ -29706 -80096 -334708 -180714 -432974 -446309 106491 -222431 200116 -141864 -376343
10022c76343G5699b5119A24504b8852j68191C3405g7841A08206a58718A87981
$$ -376343 75699 -25119 124504 -28852 -197043 33405 -77841 108206 -158718 187981
10011C9476J41555n9474h9946N019o1092a8007A19816c13098a06231j38997i8686
$$ 39476 181031 121557 -89946 -84927 -146019 -18007 119816 -313098 -106231 -245228 -98686
9999c4409A28638n7812P4431B687N540a84314A63583k5949i3236g815I5688b41405
$$ -34409 128638 70826 145257 2687 8227 -184314 163583 137634 -93236 -7815 95688 -241405
9986G162f0415j404D849d0855A45475a57223A14338n7110B7907h277I2838a02978
$$ 7162 -60415 -61819 4849 -40855 145475 -157223 114338 57228 27907 -8277 92838 -102978
9973d8348B816a62558k690j40243A37808C0413a09231j1280N0073k81577A43074
$$ -48348 2816 -162558 -165248 -305491 137808 30413 -109231 -120511 -70438 -352015 143074
9961i5925Q600B4035J13877c84967L4765h909k46585g1217L5333A08870b00305
$$ -95925 -87325 24035 137912 -384967 -350202 -8909 -255494 -71217 -35884 108870 -200305
9949a44037A46648F7557c29514e1237l58766a62442j47474J32429A78255b29315
$$ -144037 146648 67557 -329514 -51237 -410003 -162442 -309916 -177487 178255 -229315
9938D0047J76336A03193f400E0265i8526a7984C4925b96700A4153g2066l67l5571
$$ 40047 216383 103193 -6400 50265 -98526 -17984 34925 -296700 14153 -72066 -72433 -108004
9926a08004d8359A35328e3883k54859e8049l80164A6201g7755j77457d6939A17072
$$ -108004 -48359 135328 -53883 -308742 -58049 -438213 16201 -77755 -255212 -46939 117072
9914e7175o3028B2021b44487J05638G3420d52128B59764n8764h2985B25997a49280
$$ -57175 -120203 22021 -244487 -138849 73420 -452128 259764 201000 -82985 225997 -149280
9902a96774A42249b89385I6629b57126B50180a26766q6582b2952H6962J3610d3263
$$ -196774 142249 -289385 96629 -257126 250180 -126766 -213348 -22952 86962 100572 -43263
9890c87499B93682i0965K3122C0289a96452l02005I5765a98172m1259Q2582p9888
$$ -387499 293682 -90965 -67843 30289 -196452 -498457 95765 -198172 -239431 -156849 -236737
9879b36737H6095B0205a35763H0404g5182B12780b80865j72163a68539A26109
$$ -236737 86095 20205 -135763 80404 -75182 212780 -280865 -453028 -168539 126109
9868A61183a55557H235L5429b51092J5882B5308a56368q6826F3996b75773M4371
$$ 161183 -155557 8235 43664 -251092 -235210 25308 -156368 -243194 63996 -275773 -231402
9857b31402l6239d0210A68870b424m4352m30936a53612q0123k04722M9327a53090
$$ -231402 -267641 -40210 168870 -2424 -46776 -477712 -153612 -233735 -438457 -389130 -153090
9845b32552a6828B91504i7593E3854J79698h3394B92321A40408b26403A5897b7940
$$ -232552 -16828 291504 -97593 53854 233552 -83394 292321 140408 -226403 15897 -27940
9833a22485j55519A2133J58701b12565E9538b12356j9481o9199A8568g1281B55782
$$ -122485 -278004 12133 170834 -212565 59538 -212356 -231837 -301036 18568 -71281 255782
9821a13391O795r0345A98830i427H8131b93871a39242M5108o263L3519J2550A8547
$$ -113391 -106596 -196941 198830 -9427 88131 -293871 -139242 -94134 -100397 -66878 -54328 18547
9808b55840A01870a85288H2319d06422J85803C5246i1156A45812a6478A30873
$$ -255840 101870 -185288 82319 -406422 -220619 35246 -91156 145812 -16478 130873
9797b88280E9388b81140C964a87752g6836A05024c02655A9727a64466a6681h189
$$ -288280 59388 -281140 3964 -187752 -76836 105024 -302655 19727 -164466 -16681 -8189
9785A03181h4911b658l21840A30325b12821h1330J1685p7648K8399q1774h4075
$$ 103181 -84911 -2658 -324498 130325 -212821 -81330 -69645 -147293 -118894 -200668 -84075
9773a00738j5541C7813a88151A3168b77710e4566j14963b17j2817j79530k6330
$$ -100738 -116279 37813 -188151 13168 -277710 -54566 -169529 -217 -13034 -192564 -218894
9762b18894b1759C48243c44742a48275N2364J7698f913j164j90083H0123b42088
$$ -218894 -21759 348243 -344742 -148275 -95911 -78213 -6913 -8077 -198160 80123 -242088
9750a61163B9999a87200b8447a0284j41245A93927b0134k26762f4971L0087k44969
$$ -161163 29999 -187200 -28447 -10284 -151529 193927 -20134 -246896 -64971 -34884 -279853
9739b79853O1922a05881n1568N860r4196B29775b81746J32894F3653B8868a40369
$$ -279853 -217931 -105881 -157449 -151589 -245785 229775 -281746 -148852 63653 28868 -140369
9727A07749b37986J2302B5138K18069r7547b63156d4053n1957r1044l28042I503
$$ 107749 -237986 -225684 25138 243207 145660 -263156 -44053 -96010 -187054 -515096 9503
9715e3191A015c63548G6946b65259M3863J06194B54774a19346C370b18346A45726
$$ -53191 1015 -363548 76946 -265259 -221396 -115202 254774 -119346 3370 -218346 145726
9703g081j89928p531e4019r2796B04686h3511J8231F3056f9119B00633a36978
$$ -7081 -197009 -204540 -54019 -146815 204686 -83511 -65280 63056 -69119 200633 -136978
9691d0607A0408b68612c3932A68611a90238e9666j27996j3838b8850R282j86135
$$ -40607 10408 -268612 -33932 168611 -190238 -59666 -187662 -201500 -28850 -19568 -205703
9680b05703P1768A2019i0575m8266o3539p0356F1702b06885f9272B2869R5365
$$ -205703 -133935 12019 -90575 -138841 -202380 -272736 61702 -206885 -69272 22869 118234
9669A18234e32501a94480j01412A7722g9792J4659C05696G4201d23579c0918D4774
$$ 118234 -532501 -194480 -295892 17722 -79792 -65133 305696 74201 -423579 -30918 44774
9657C5946a02062p1685C51228G5944a67297j1538d8250j4229j01419A14083Q902
$$ 35946 -102062 -173747 351228 75944 -167297 -178835 -48250 -62479 -163898 114083 122985
9646A22985K7950a50720q8418A84994a51691J5822A88201F6523a53308d700q7888
$$ 122985 150935 -150720 -239138 184994 -151691 -135869 188201 66523 -153308 -4700 -92588
9635i2588J2732k1817B534f3924j99143A38164e10206a81090J8075p5770e8175
$$ -92588 -79856 -101673 2534 -63924 -263067 138164 -510206 -181090 -163015 -238785 -58175
9623C79167b96795G1473a06395d4205C15819i6553H2561d6787C4613b57852A49855
$$ 379167 -296795 71473 -106395 -44205 315819 -96553 82561 -46787 34613 -257852 149855
9611F0406J9620a70291B26777g4752p9884k40516A63478a19769M4633A77166q4021
$$ 60406 80026 -170291 226777 -74752 -154636 -395152 163478 -119769 -75136 177166 93145
9600I3145i2889B52638b13359f6828b3210c04I8837a46403A51797a5895F479e9107
$$ 93145 -92889 252638 -213359 -66828 -23210 -304 98837 -146403 151797 -15895 6479 -59107
9587e3608j10989A74379a12251A45052d7128A8741b52095O2473c8181I0956a95418
$$ -53608 -164597 174379 -112251 145052 -47128 18741 -252095 -189622 -38181 90956 -195418
9575a5072k95716d6261A90182a30775A6273K2379J66237b7755q1711j62078J2072
$$ -15072 -310788 -46261 190182 -130775 16273 38652 204889 -27755 -109466 -271544 -259472
9564b59472i9677C60065b93765a7949k6440j50141B80849C1676i6993C68142a18584
$$ -259472 -99677 360065 -293765 -17949 -44389 -194530 280849 31676 -96993 368142 -118584
9552H0473A3200a45256A7611L63386E526J0789b36822R0341E18838a6744F6196
$$ 80473 13200 -145256 17611 380997 5526 16315 -236822 -146481 518838 -16744 66196
9540B3550i3524j50068B80307b77057a23498k5300k44239B5333K2281a76289J9448
$$ 23550 -93524 -243592 280307 -277057 -123498 -148798 -393037 25333 47614 -176289 -156841
9529a56841B43895E6307a1936j57039l127A1851a77353B12878a1892m14122a42435
$$ -156841 243895 56307 -11936 -168975 -172102 11851 -177353 212878 -11892 -426014 -142435
9517H4903c9772D13250G9120J18291a88740k9623r9356I4317M1542b55718C9371
$$ 84903 -39772 413250 79120 197411 -188740 -218363 -317719 94317 135859 -255718 39371
9505a2662j17567j5234e8903A69762a29054k78662i6460k22628H7527c8441j6417
$$ -12662 -130229 -145463 -58903 169762 -129054 -407716 -96460 -319088 87527 -38441 -54858
9494e4858A35261a56211L115r4657k72112J23302a85853c3058q4752j04515f1191
$$ -54858 135261 -156211 -153096 -247753 -519865 -396563 -185853 -33058 -117810 -222325 -61191
9482a49708P3304k1157d4776k99993a7921q6403j96095E7757h3669C7682m48a26633
$$ -149708 -76404 -97561 -44776 -344769 -17921 -104324 -300419 57757 -83669 37682 37234 -126633
9469a00421j6443G1137b26467j28903d7914j9059D8841K3657j2992a87377Q4323
$$ -100421 -116864 71137 -226467 -355370 -47914 -66973 48841 72498 59506 -187377 -103054
9458a03054g848B15620a07192B9937P4571d19773h9861j76076A694L44435i5661
$$ -103054 -7848 215620 -107192 29937 104508 -419773 -89861 -265937 1694 346129 -95661
9446a9021m89715a21207a9044F3602a50744c0504j85369D5495b31306i3608n7580
$$ -19021 -508736 -121207 -19044 63602 -150744 -30504 -215873 45495 -231306 -93608 -151188
9435a51188A32219h5822b8288C91583A11428a78884k83090M9138Q1910i3677F4202
$$ -151188 132219 -85822 -28288 391583 111428 -178884 -461974 -412836 -330926 -93677 64202
9423F1642j8238f6563I0774J49370c35409J41290n7861P7137B6586a37693M3081
$$ 61642 43404 -66563 90774 240144 -335409 -194119 -251980 -174843 26586 -137693 -94612
9412i4612B61711i8621B79210A20612b74870A4933J65065a33368A09913L4585
$$ -94612 261711 -98621 279210 120612 -274870 14933 179998 -133368 109913 144498
9402A44498a5038j27238F68N3951b93335d1271A13799k4299c41667e953m1770
$$ 144498 -15038 -142276 668 54619 -293335 -41271 113799 89500 -341667 -5953 -47723
9391d7723C8633m046j24Q4490C8291c36308h4382I4305i419p0931E693K07264
$$ -47723 38633 34587 34463 118953 38291 -336308 -84382 94305 -9419 -80350 5693 212957
9379B12957m2864B2537d18295a18615A13091c34715f9018j2428A92342d6770B7743
$$ 212957 170093 22537 -418295 -118615 113091 -334715 -69018 -81446 192342 -46770 27743
9367c1338m4255B2725O9919a95348C32370e1201n3231j51854m5620g3417j65934
$$ -31338 -75593 22725 92644 -195348 332370 -51201 -104432 -256286 -301906 -73417 -239351
9356b39351f546m1967k2668C6306g2504L3259j53433H8086i4589G923c48674J04096
$$ -239351 -6546 -48513 -71181 36306 -72504 -39245 -192678 88086 -94589 7923 -348674 -244578
9344b44578K5265J3640A0250J87688F6882J90895f1724F1602b03671e2843J4381
$$ -244578 -219313 -205673 10250 197938 66882 257777 -61724 61602 -203671 -52843 -38462
9333c8462k03735I7248e2984l9953j84510A48844n4538c36125e3703E7609P6746
$$ -38462 -242197 97248 -52984 -92937 -277447 148844 94306 -336125 -53703 57609 134355
9322A34355J04622i5898j53858n4060a0383G147b80791e4460j85936L1663k25483
$$ 134355 238977 -95898 -249756 -303816 -10383 7147 -280791 -54460 -240396 -208733 -434216
9311d34216A3634J11J46183g4599o7929q7314n266a04712A27811a30084A50911
$$ -434216 13634 13745 159928 -74599 -142528 -229842 -235108 -104712 127811 -130084 150911
9299B04755i2675m03262J05187C0501K10881F927b49243g4609F2946Q5699J48775
$$ 204755 -92675 -495937 -390750 30501 241382 6927 -249243 -74609 62946 148645 297420
9288B97420D6759h8957c337m235g65o0508C3874d10085A64549D1345e6122G7909
$$ 297420 46759 -88957 -3337 -7572 -765 -61273 33874 -410085 164549 41345 -56122 77909
9275B8640P4922l9077e8644G1800L9288g3101E4731J98897G4008b74175n7858
$$ 28640 103562 64485 -58644 71800 111088 -73101 54731 253628 74008 -274175 -332033
9264c32033P1489A3319a99943a158A17487m5367a80749M1981d7441l6341l3378
$$ -332033 -260544 13319 -199943 -1158 117487 72120 -180749 -138768 -47441 -83782 -117160
9253a17160B73906b42893A65934B8918N967a2908p2429j70007e2739J784k04268
$$ -117160 273906 -242893 165934 28918 34885 -12908 -85337 -255344 -52739 -50955 -255223
9242b55223D2522b9855A45350b68466A91623a66035j33730J2621B70433b17389
$$ -255223 42522 -29855 145350 -268466 191623 -166035 -299765 -287144 270433 -217389
9231a11760J6304j9847j92157I0735j0929a45898j89935B47647b75623o4537g5103
$$ -111760 -95456 -115303 -307460 90735 79806 -145898 -335833 247647 -275623 -340160 -75103
9219A95412E6189f9874I3547b50598i4859k0362m4746L8039A4647a91357j31532
$$ 195412 56189 -69874 93547 -250598 -94859 -115221 -159967 -121928 14647 -191357 -322889
9208c22889b0612l1205l38357A76260F886c24909a29954k31144a3501G6248K37000
$$ -322889 -20612 -51817 -390174 176260 6886 -324909 -129954 -361098 -13501 76248 313248
9197C13248r8294c8079F0419a63473n2194g2603b449j4083G5033j1034a17111
$$ 313248 214954 -38079 60419 -163473 -215667 -72603 -2449 -16532 75033 63999 -117111
9185G6870C1798a00968A55760h8472l6412A29449i3872A37097a4051D5683d6531
$$ 76870 31798 -100968 155760 -88472 -124884 129449 -93872 137097 -14051 45683 -46531
9173A89534b11878G8610l0663i5605r6532B7580b51646j25205c1136A12442b74052
$$ 189534 -211878 78610 47947 -95605 -192137 27580 -251646 -376851 -31136 112442 -274052
9161I7953J26935c20602I9853m5198J58615a55477B8790J0803J12259c30621J52009
$$ 97953 224888 -320602 99853 54655 213270 -155477 28790 39593 151852 -330621 -178612
9150a78612q4048a02941A7504a70512J9855D0564J26801a93699F996K57910r7823
$$ -178612 -262660 -102941 17504 -170512 -150657 40564 167365 -193699 6996 264906 167083
9139A67083C9010I779e0636H491L43941b01309e6319A35988a27918e0791j82124
$$ 167083 39010 9779 -50636 8491 352432 -201309 -56319 135988 -127918 -50791 -232915
9128b32915O1531m3741A09988p241i0840j15079C4418G516P769c59002f2419J7695
$$ -232915 -171384 -215125 109988 102747 -90840 -205919 34418 7516 15285 -359002 -62419 -44724
9116d4724B40942a03296j66611J20703l7648L7678o2818d4144n1507B81109b85996
$$ -44724 240942 -103296 -269907 -149204 -186852 -149174 -211992 -44144 -95651 281109 -285996
9104a5667D5585J35693g5490l14150A59386a27909O594o139E3727b20453j85143
$$ -15667 45585 181278 -75490 -389640 159386 -127909 -121315 -127454 53727 -220453 -405596
9093d05596a16020m5380d8764j24531A34567c4317C24683C2430a15771I9152e5203
$$ -405596 -116020 -161400 -48764 -173295 134567 -34317 324683 32430 -115771 99152 -55203
9081a30858a7794j91925r7658B4488g4147j24377Q3127H8751a46221A20851a42193
$$ -130858 -17794 -209719 -307377 24488 -74147 -198524 -115397 88751 -146221 120851 -142193
9069c06562J48277B13222E4393b2498j06058A1291b3196j01271B0521J12942d35989
$$ -306562 -158285 213222 54393 -22498 -128556 11291 -23196 -124467 20521 133463 -435989
9057B337b13786i2496b9356l8343r4321G7022J41282E1692O1045a86353c9330
$$ 2337 -213786 -92496 -29356 -67699 -162020 77022 218304 51692 112737 -186353 -39330
9045g3922j9159C1363H034c911j02418A04979a41690j94531q457f1335C09465
$$ -73922 -93081 31363 8034 -3911 -106329 104979 -141690 -336221 -344678 -61335 309465
9033A08669a68947G819g3069c0631m2240j89586a24832K9051j78564G7284a15392
$$ 108669 -168947 7819 -73069 -30631 -72871 -262457 -124832 -95781 -274345 77284 -115392
9021b60194J26337j39228Q2043O3172K0088G2254i7826m7006q2027m2147a9612
$$ -260194 -133857 -273085 -191042 -127870 -107782 72254 -97826 -144832 -226859 -269006 -19612
9009b2574G0888c92450A92044K56061b54967B32462C7571K06222A653c0480p2766
$$ -22574 70888 -392450 192044 448105 -254967 232462 37571 243793 1653 -30480 -103246
8998a03246j51298O1836P3673B09461Q0268H040b15963j22508C0056j2486d1597
$$ -103246 -254544 -192708 -119035 209461 289729 8040 -215963 -338471 30056 17570 -41597
8986B66112b1996j10578O865B14145a02598L481B95708g1759j02722f9703j1143
$$ 266112 -21996 -132574 -125709 214145 -102598 -99117 295708 -71759 -174481 -69703 -80846
8975h0846j57124O4274p5272Q8140k1841D2769h2419d455k12069m7634Q4744h5384
$$ -80846 -237970 -173696 -248968 -160828 -182669 42769 -82419 -4455 -216524 -264158 -179414 -85384
8962d1n937k46014C75975f9817q5653C55434b69950G4244a1061r9003J9132A2936
$$ -41 -5978 -251992 375975 -69817 -155470 355434 -269950 74244 -11061 -110064 -90932 12936
8949C3839b11063a0077D3077R9004h7052m4829d6658A22683n2328i2829d2804
$$ 33839 -211063 -10077 43077 142081 -87052 -131881 -46658 122683 70355 -92829 -42804
8937b98788L263N3768e9389l31069c2897k22925m5251O8066A06824c1756A36772
$$ -298788 -295525 -241757 -59389 -390458 -32897 -255822 -301073 -233007 106824 -31756 136772
8925g9523B1925b25685q3305j3594A24715a01433K0920D11345a05566B27523a55039
$$ -79523 21925 -225685 -308990 -322584 124715 -101433 -80513 411345 -105566 227523 -155039
8913I7871D7404L9544c6003m4239B03522M681K31905L26411N44885J218431K065632
$$ 97871 47404 86948 -36003 -80242 203522 208203 440108 766519 1311404 2529835 4595467
8902D595467L990372D221787A969316p97294j39621l01485C44696r2159l7927
$$ 4595467 8585839 4221787 1969316 1172022 1032401 730916 344696 252537 214610
8893B14610J11755A15944J30175A14530Q0684P3084a63600B09639f800C4302h9845
$$ 214610 326365 115944 246119 114530 195214 268298 -163600 209639 -6800 34302 -89845
8881f2267A45406J18733a5630p6406j5216A17548a01921C7916J88234a74364j43334
$$ -62267 145406 264139 -15630 -92036 -107252 117548 -101921 37916 226150 -174364 -317698
8870c17698a12799A87103g6653D3886M5741a63322n0246k2031A60496n5705f4050
$$ -317698 -112799 187103 -76653 43886 89627 -163322 -213568 -235599 160496 104791 -64050
8858d0107j1701j7593A98405a56322B78680i743B08338r1890J7934O1848n7480
$$ -40107 -51808 -69401 198405 -156322 278680 -9743 208338 116448 134382 196230 138750
8847A38750b19846N508j92095J54442M5891k9648g761p7296D8578f1065A79569
$$ 138750 -219846 -214338 -406433 -251991 -206100 -235748 -7761 -85057 48578 -61065 179569
$$ [...]
##END NTUPLES=NMR SPECTRUM
##END=
