
##TITLE=AC1074_TORI01_5819511_qEZrfrgrqa
##JCAMPDX= 6.0         $$ Bruker NMR JCAMP-DX V2.0
##DATA TYPE= NMR SPECTRUM
##DATA CLASS= NTUPLES
##ORIGIN= BRUKER
##OWNER= Administrator
$$ 1.72 TOPSPIN		Version 2.1
$$ 2012-03-24 18:31:17.125 -0500  Administrator@TOPSPIN
$$ Compression mode = diff/dup
##.OBSERVE FREQUENCY= 400.13188235
##.OBSERVE NUCLEUS= ^1H
##.ACQUISITION MODE= SIMULTANEOUS (DQD)
##.ACQUISITION SCHEME= undefined
##.AVERAGES= 64
##.DIGITISER RES= 22
##SPECTROMETER/DATA SYSTEM= spect
##.PULSE SEQUENCE= noesygpps1d.comp
##.SOLVENT NAME= COFFEE_meoh
##.SHIFT REFERENCE= INTERNAL, COFFEE_meoh, 1, 14.96892
##AUDIT TRAIL= $$ (NUMBER, WHEN, WHO, WHERE, PROCESS, VERSION, WHAT)
$$ ##TITLE= Audit trail, TOPSPIN		Version 2.1
$$ ##JCAMPDX= 5.01
$$ ##ORIGIN= Bruker BioSpin GmbH
$$ ##OWNER= Administrator
$$ $$ C:\Bruker\TOPSPIN/data/COFFEE/nmr/AC1074_TORI01_5819511_qEZrfrgrqa/12/pdata/1/auditp.txt
$$ ##AUDIT TRAIL=  $$ (NUMBER, WHEN, WHO, WHERE, PROCESS, VERSION, WHAT)
(   1,<2012-03-24 18:31:12.421 -0500>,<Administrator>,<TOPSPIN>,<go>,<TOPSPIN 2.1>,
      <created by zg
	started at 2012-03-24 18:19:40.921 -0500,
	POWCHK enabled, PULCHK disabled,
       configuration hash MD5:
       1A 1E CE 29 27 FD 77 03 67 4E F0 E3 C4 B2 CB 90
       data hash MD5: 64K
       9A 91 B6 1A D8 67 FC 51 CA 10 8F EE 26 7B 14 25>)
(   2,<2012-03-24 18:31:15.140 -0500>,<Administrator>,<TOPSPIN>,<proc1d>,<TOPSPIN 2.1>,
      <Start of raw data processing
       efp LB = 0.3 FT_mod = 6 PKNL = 1 PHC0 = 0 PHC1 = 0 SI = 128K 
       data hash MD5: 128K
       2E BF B1 0B 6C 06 0A B1 54 0C A7 79 76 D0 9D E6>)
(   3,<2012-03-24 18:31:16.359 -0500>,<Administrator>,<TOPSPIN>,<proc1d>,<TOPSPIN 2.1>,
      <pk PHC0 = 36.89758 PHC1 = 0 
       data hash MD5: 128K
       FA C7 56 6D EA 5C 16 81 61 D7 A5 4E CB 20 0E 20>)
(   4,<2012-03-24 18:31:16.578 -0500>,<Administrator>,<TOPSPIN>,<proc1d>,<TOPSPIN 2.1>,
      <abs ABSG = 1 
       data hash MD5: 128K
       5E D9 AF 3D 19 16 9F 31 9A 36 09 1C 83 9F 74 12>)
(   5,<2012-03-24 18:31:16.671 -0500>,<Administrator>,<TOPSPIN>,<proc1d>,<TOPSPIN 2.1>,
      <abs ABSG = 2 
       data hash MD5: 128K
       94 CD E3 B8 A9 9C C6 6F 2B 7C 9E 42 96 0B 81 9F>)
(   6,<2012-03-24 18:31:16.796 -0500>,<Administrator>,<TOPSPIN>,<proc1d>,<TOPSPIN 2.1>,
      <abs ABSG = 3 
       data hash MD5: 128K
       7A 94 C1 B5 5E 81 CF 9C 12 F7 22 19 EE EF D5 A4>)
(   7,<2012-03-24 18:31:16.968 -0500>,<Administrator>,<TOPSPIN>,<proc1d>,<TOPSPIN 2.1>,
      <abs ABSG = 4 
       data hash MD5: 128K
       0A 88 50 73 4C 00 E1 E0 50 6F 7E 38 58 4F C2 62>)
(   8,<2012-03-24 18:31:17.031 -0500>,<Administrator>,<TOPSPIN>,<proc1d>,<TOPSPIN 2.1>,
      <abs ABSG = 5 
       data hash MD5: 128K
       A8 19 A4 B1 03 32 A4 59 0A 2E AD 65 F4 4E 22 02>)
$$ ##END=
$$ 
$$ $$ hash MD5
$$ $$ 6A D9 33 C8 19 A3 10 E3 D1 B1 0F FD D1 5A 22 90
##$RELAX= 
##$RELAX= 
##$RELAX= 
##$RELAX= 
##$RELAX= 
##$RELAX= 
##$RELAX= 
##$RELAX= 
$$ Bruker specific parameters
$$ [...]
##$TP07= 0
##$TPNAME0= <>
##$TPNAME1= <>
##$TPNAME2= <>
##$TPNAME3= <>
##$TPNAME4= <>
##$TPNAME5= <>
##$TPNAME6= <>
##$TPNAME7= <>
##$TPOAL= (0..7)
0.5 0.5 0.5 0.5 0.5 0.5 0.5 0.5
##$TPOFFS= (0..7)
0 0 0 0 0 0 0 0
##$TUNHIN= 0
##$TUNHOUT= 0
##$TUNXOUT= 0
##$USERA1= <user>
##$USERA2= <user>
##$USERA3= <user>
##$USERA4= <user>
##$USERA5= <user>
##$V9= 5
##$VALIST= <valist>
##$VCLIST= <CCCCCCCCCCCCCCC>
##$VD= 0
##$VDLIST= <DDDDDDDDDDDDDDD>
##$VPLIST= <PPPPPPPPPPPPPPP>
##$VTLIST= <TTTTTTTTTTTTTTT>
##$WBST= 2048
##$WBSW= 25
##$XGAIN= (0..3)
0 0 0 0
##$XL= 0
##$YL= 0
##$YMAX_a= 18667615
##$YMIN_a= -8468571
##$ZGOPTNS= <>
##$ZL1= 120
##$ZL2= 120
##$ZL3= 120
##$ZL4= 120
##$ABSF1= 14.96892
##$ABSF2= -5.583611
##$ABSG= 5
##$ABSL= 3
##$ALPHA= 0
##$AQORDER= 0
##$ASSFAC= 0
##$ASSFACI= 0
##$ASSFACX= 0
##$ASSWID= 0
##$AUNMP= <proc_prof1d_extract.lims>
##$AXLEFT= 0
##$AXNAME= <>
##$AXNUC= <1H>
##$AXRIGHT= 0
##$AXTYPE= 0
##$AXUNIT= <>
##$AZFE= 0.1
##$AZFW= 0.1
##$BCFW= 0
##$BC_mod= 0
##$BYTORDP= 0
##$COROFFS= 0
##$CY= 15
##$DATMOD= 1
##$DC= 0
##$DFILT= <>
##$DTYPP= 0
##$F1P= 0
##$F2P= 0
##$FCOR= 0.5
##$FTSIZE= 131072
##$FT_mod= 6
##$GAMMA= 0
##$GB= 0
##$INTBC= 1
##$INTSCL= 1
##$ISEN= 128
##$LB= 0.3
##$LEV0= 0
##$LPBIN= 0
##$MAXI= 10000
##$MC2= 0
##$MEAN= 0
##$ME_mod= 0
##$MI= 0
##$NCOEF= 0
##$NC_proc= -3
##$NLEV= 6
##$NOISF1= 0
##$NOISF2= 0
##$NSP= 0
##$NTH_PI= 0
##$NZP= 0
##$OFFSET= 14.96892
##$PC= 1
##$PHC0= 36.89758
##$PHC1= 0
##$PH_mod= 1
##$PKNL= yes
##$PPARMOD= 0
##$PPDIAG= 0
##$PPIPTYP= 0
##$PPMPNUM= 2147483647
##$PPRESOL= 1
##$PSCAL= 4
##$PSIGN= 0
##$PYNMP= <proc.py>
##$REVERSE= no
##$SF= 400.13000467732
##$SI= 131072
##$SIGF1= 0
##$SIGF2= 0
##$SINO= 400
##$SIOLD= 131072
##$SPECTYP= <>
##$SREGLST= <1H.CDCl3>
##$SSB= 0
##$STSI= 131072
##$STSR= 0
##$SW_p= 8223.68421052632
##$SYMM= 0
##$S_DEV= 0
##$TDeff= 65536
##$TDoff= 0
##$TI= <>
##$TILT= no
##$TM1= 0
##$TM2= 0
##$TOPLEV= 0
##$USERP1= <user>
##$USERP2= <user>
##$USERP3= <user>
##$USERP4= <user>
##$USERP5= <user>
##$WDW= 1
##$XDIM= 131072
##$YMAX_p= 569329150
##$YMIN_p= -1178699
##$CURPLOT= <Network HP LaserJet P1505>
##$CURPRIN= <$Network HP LaserJet P1505>
##$DFORMAT= <normdp>
##$LAYOUT= <+/1D_H.xwp>
##$LFORMAT= <normlp>
##$PFORMAT= <normpl>
##$SURQMSG= 1
$$ End of Bruker specific parameters
$$ ---------------------------------
##NTUPLES= NMR SPECTRUM
##VAR_NAME=  FREQUENCY,     SPECTRUM/REAL,   SPECTRUM/IMAG
##SYMBOL=    X,             R,               I
##VAR_TYPE=  INDEPENDENT,   DEPENDENT,       DEPENDENT
##VAR_FORM=  AFFN,          ASDF,            ASDF
##VAR_DIM=   131072,        131072,          131072
##UNITS=     HZ,            ARBITRARY UNITS, ARBITRARY UNITS
##FACTOR=    0.0627417313425165, 1,          1
##FIRST=     8223.62146879498, -3306,        -146501
##LAST=      0,             1743,            -148458
##MIN=       0,             -1178699,        0
##MAX=       8223.62146879498, 569329150,    0
$$ Real data points
##PAGE= N=1
##DATA TABLE= (X++(R..R)), XYDATA
$$ [...]
60642A624803n714o084n280n660q222j1153j3091j5000j7388j8593j7747j6768
60630A484103j7410j8755j9417j9848k0498k0271j8796j7692j7538j6385j3507
60619A283986j1622j2531j3390j0756n952k868k304k093j264m77N62K584M448
60606A228323M548L914M938P628R913J1089J2130J3085J2929J1804J1026J0910
60594A342237J0651J0128R923J0030J0200J0912J2449J3897J4656J5678J7481
60583A478242J8449J7246J5419J5161J5919J5901J5647J7051J9676K1077K0424
60572A670212J9071J7892J6586J5386J4999J4934J4033J2308J0295P234K144l810
60560A811284q400j1289j3786j6192j7754j8823k0598k2862k4138k3923k2859
$$ plain form
60642 1624803 1619089 1613005 1607725 1602065 1593843 1582690 1569599 1554599 1537211 1518618 1500871 1484103
60630 1484103 1466693 1447938 1428521 1408673 1388175 1367904 1349108 1331416 1313878 1297493 1283986
60619 1283986 1272364 1259833 1246443 1235687 1229735 1226867 1224563 1222470 1221206 1220729 1221291 1223875 1228323
60606 1228323 1232871 1236785 1241723 1249351 1259264 1270353 1282483 1295568 1308497 1320301 1331327 1342237
60594 1342237 1352888 1363016 1372939 1382969 1393169 1404081 1416530 1430427 1445083 1460761 1478242
60583 1478242 1496691 1513937 1529356 1544517 1560436 1576337 1591984 1609035 1628711 1649788 1670212
60572 1670212 1689283 1707175 1723761 1739147 1754146 1769080 1783113 1795421 1805716 1812950 1815094 1811284
60560 1811284 1802884 1791595 1777809 1761617 1743863 1725040 1704442 1681580 1657442 1633519 1610660
60549A610660k1117j8616j6246j4685j2616q456l327J52J702L462O339Q887R895
60536A546034R730Q760O715M080K329K139K790L470L980M303M652N589O922P341
60522A618834O474O109P557R040Q039N231L466L523L571K437O62j497m448p479
60508A661519r152r755j1084j3449j5103j5030j4323j4389j5409j6792j7580j6529
60496A492924j3523j0615r865j0318r124n425j064K326M640N832N631N125O389
60483A462933R780J3360J5604J7128J9345K2855K7404L2182L6037L8713M1706
60472A737047M6538N2463N7285N9902O0309N7833N1530M2092L1170J9029N204
60461B220402q501j8274k2280k2416k1415j9885j6967j2348o704r58M402R691
$$ plain form
60549 1610660 1589543 1570927 1554681 1539996 1527380 1518924 1515597 1515749 1517451 1520913 1527252 1536139 1546034
60536 1546034 1555764 1564524 1571239 1575319 1577648 1579787 1582577 1586047 1590027 1594330 1598982 1604571 1611493 1618834
60522 1618834 1625308 1631417 1638974 1648014 1656053 1661284 1664750 1668273 1671844 1674281 1674943 1673446 1668998 1661519
60508 1661519 1652367 1642612 1631528 1618079 1602976 1587946 1573623 1559234 1543825 1527033 1509453 1492924
60496 1492924 1479401 1468786 1458921 1448603 1439479 1434054 1432990 1435316 1439956 1445788 1451419 1456544 1462933
60483 1462933 1472713 1486073 1501677 1518805 1538150 1561005 1588409 1620591 1656628 1695341 1737047
60472 1737047 1783585 1836048 1893333 1953235 2013544 2071377 2122907 2164999 2196169 2215198 2220402
60461 2220402 2211901 2193627 2171347 2148931 2127516 2107631 2090664 2078316 2071612 2070654 2075056 2084747
60449B084747J5463K1058K4633K5630K6108K8107L0888L2717L4237L7611M3044
60438B404243M8773N4199O0481O8193P6990Q7524J01124J17124J33008J47836
60428C299495J63351J81065K00221K19499K39001K59840K83047L09471L39448
60419E494438L72085M05769M38943M68708M88314M87811M58515L97168L06703
60410I318454J94218O8095o3692j92514l07223l96298m54103m83913m93254m87801
60400F701969m71013m46891m19248l89268l56789l23471k92013k63081k35854
60391C504341k10902j89586j71201j53636j36583j21403j08291r6403q6151p8482
60381B151703p2370o6025o0043n6186n3715n0303m6103m3177m1217l7862l3319
$$ plain form
60449 2084747 2100210 2121268 2145901 2171531 2197639 2225746 2256634 2289351 2323588 2361199 2404243
60438 2404243 2453016 2507215 2567696 2635889 2712879 2800403 2901527 3018651 3151659 3299495
60428 3299495 3462846 3643911 3844132 4063631 4302632 4562472 4845519 5154990 5494438
60419 5494438 5866523 6272292 6711235 7179943 7668257 8156068 8614583 9011751 9318454
60410 9318454 9512672 9580767 9517075 9324561 9017338 8621040 8166937 7683024 7189770 6701969
60400 6701969 6230956 5784065 5364817 4975549 4618760 4295289 4003276 3740195 3504341
60391 3504341 3293439 3103853 2932652 2779016 2642433 2521030 2412739 2316336 2230185 2151703
60381 2151703 2079333 2013308 1953265 1897079 1843364 1793061 1746958 1703781 1662564 1624702 1591383
60370A591383l0502k9964k8826k5603k2322k0594j9244j7252j5657j5015j4031
60359A352373j2244j1161j1261j0637q111n089l049j755j121j997l688l562q10
60346A277888J829J878L73k95L06J148J795K415L164M479O540Q122P795O408O024
60331A329869O472N770M205M473O981Q565P191M565K569M98k208l748k903j590
60317A370709j982l334l872l768m027m255l752l162l216l243k554j715j147j54
60303A330528J335K006J465J410K986M830N248M660M445M954N936P345Q718R303
60289A395169R520J0443J1495J0983R340Q992J0310J0965J0287J0724J3400J5747
60277A527375J5603J4317J3436J1719Q166N002M463N216N038M702N948P743Q041
$$ plain form
60370 1591383 1560881 1530917 1502091 1476488 1454166 1433572 1414328 1397076 1381419 1366404 1352373
60359 1352373 1340129 1328968 1317707 1307070 1298959 1293870 1290821 1289066 1287945 1285948 1282260 1278698 1277888
60346 1277888 1279717 1281595 1281968 1281673 1281979 1283127 1284922 1287337 1290501 1294980 1301520 1309642 1317437 1323845 1329869
60331 1329869 1336341 1342111 1346316 1350789 1357770 1366335 1373526 1378091 1380660 1381158 1378950 1375202 1372299 1370709
60317 1370709 1368727 1365393 1361521 1357753 1353726 1349471 1345719 1342557 1339341 1336098 1333544 1331829 1330682 1330528
60303 1330528 1331863 1333869 1335334 1336744 1339730 1344560 1349808 1354468 1358913 1363867 1369803 1377148 1385866 1395169
60289 1395169 1404689 1415132 1426627 1437610 1446950 1455942 1466252 1477217 1487504 1498228 1511628 1527375
60277 1527375 1542978 1557295 1570731 1582450 1590616 1595618 1600081 1605297 1610335 1615037 1620985 1628728 1636769
60264A636769P563Q412J0212J0836R992Q930P429M042r40n306p661q544r079r952
60250A662703j1176j1750j0413p733o135o791q143q502q143p592o131l698j919
60237A564577j317J14L399O082N937M839N858Q347R266Q062O911O986P547Q205
60223A644813R244J0022R549Q515Q651J0223J1759J1949J0599Q430P100Q233J1251
60210A770338J3662J4575J6039J9414K2866K4520K5765K8749L2843L6431M0223
60199B045425M5546N1017N4424N6631O0194O5159O9734P4316Q1087Q9973R8575
60188B792081J06142J14304J23554J32299J39987J48218J57794J67106J74632
60179D056117J81042J87751J94655K00113K02288K00310J94822J87182J77413
$$ plain form
60264 1636769 1644332 1652744 1662956 1673792 1683784 1692714 1700143 1704185 1703245 1697939 1690278 1681734 1672655 1662703
60250 1662703 1651527 1639777 1629364 1621631 1615496 1608705 1600562 1592060 1583917 1576325 1570194 1566496 1564577
60237 1564577 1563260 1563374 1566773 1572855 1578792 1583631 1589489 1597836 1607102 1615164 1622075 1629061 1636608 1644813
60223 1644813 1654057 1664079 1673628 1682143 1690794 1701017 1712776 1724725 1735324 1743754 1750854 1759087 1770338
60210 1770338 1784000 1798575 1814614 1834028 1856894 1881414 1907179 1935928 1968771 2005202 2045425
60199 2045425 2090971 2141988 2196412 2253043 2313237 2378396 2448130 2522446 2603533 2693506 2792081
60188 2792081 2898223 3012527 3136081 3268380 3408367 3556585 3714379 3881485 4056117
60179 4056117 4237159 4424910 4619565 4819678 5021966 5222276 5417098 5604280 5781693
60170E781693J63762J45347J24190J03127Q2730O2035M1245K1604L347j3993k9585
60159F485502m1593m9311n3312n3741n0235m3405l4709k4880j3503P4J6302L5106
60147F172295N5175P4446R2300J09945J27653J43523J56399J67857J79090J87787
60137G466470J90855J88587J83146J74190J59353J38545J14613Q9725O3786L6517
60127H805787Q714j8778m5357o9842r1014j08671j22603j31255j33292j29856
60117G963833j23324j14488j02745q8177p1281n1678k9408o539J4875L5592N7230
60106G483890P8495R6281J09821J20530J28207J30899J28489J23008J14929J02547
60096H617096Q6080O9102N4437M1119K7126J3103J658n491q047n880J274J3126
$$ plain form
60170 5781693 5945455 6090802 6214992 6318119 6400849 6462884 6504129 6525733 6529080 6515087 6485502
60159 6485502 6443909 6394598 6341286 6287545 6237310 6193905 6159196 6134316 6120813 6120887 6137189 6172295
60147 6172295 6227470 6301916 6394216 6504161 6631814 6775337 6931736 7099593 7278683 7466470
60137 7466470 7657325 7845912 8029058 8203248 8362601 8501146 8615759 8705484 8769270 8805787
60127 8805787 8814501 8795723 8750366 8680524 8589510 8480839 8358236 8226981 8093689 7963833
60117 7963833 7840509 7726021 7623276 7535099 7463818 7412140 7382732 7376193 7391068 7426660 7483890
60106 7483890 7562385 7658666 7768487 7889017 8017224 8148123 8276612 8399620 8514549 8617096
60096 8617096 8703176 8772278 8826715 8867834 8894960 8908063 8909721 8904230 8896183 8890303 8891577 8904703
60084H904703K8765M7272O8369R2640J20661J51438J82629K13187K44890K80045
60074A0334599L18515L58369L98417M38446M77824N15838N52750N88371O19952
60065A4603081O43386O56413O58979O50938O31377O00115N57997N05580M43018
60056A9950884L71243K91944K06433J15617K0857p5917j72102k63725l46076m16232
60046A9682926m73660n17311n44333n53575n48271n32547n07034m70917m26751
60037A5108527l79570l31708k81817k28925j74611j21132p0101k3058J8827N5504
60027A3571936Q6378J08612J19552J20172J13426R9810P7713M7963J4772j8212
60017A4342122n0095q0751j09567j36682j62883j87493k08425k24926k38395k50104
$$ plain form
60084 8904703 8933468 8980740 9049109 9141749 9262410 9413848 9596477 9809664 10054554 10334599
60074 10334599 10653114 11011483 11409900 11848346 12326170 12842008 13394758 13983129 14603081
60065 14603081 15246467 15902880 16561859 17212797 17844174 18444289 19002286 19507866 19950884
60056 19950884 20322127 20614071 20820504 20936121 20956978 20881061 20708959 20445234 20099158 19682926
60046 19682926 19209266 18691955 18147622 17594047 17045776 16513229 16006195 15535278 15108527
60037 15108527 14728957 14397249 14115432 13886507 13711896 13590764 13520663 13497605 13516432 13571936
60027 13571936 13658314 13766926 13886478 14006650 14120076 14219886 14297599 14345562 14360334 14342122
60017 14342122 14292027 14211276 14101709 13965027 13802144 13614651 13406226 13181300 12942905 12692801
60007A2692801k59915k67228k71445k71525k66947k58853k48500k35173k17785
59998A0395430j97755j77699j57754j35887j11566q6304o0754l4075o287K1332
59988I448681M8251P4638R9352J20588J38437J54253J67436J75424J76743J71621
59978A0775424J59888J41195J17103R0081O0438K7178q469m3493p6953j09842
59968A1132550j41104j67485j87823k03885k16128k22240k20882k13660k02266
59959I357077j86743j67697j46992j25136j00841p4321m8033k2970K767L0441
59949H517552N8646Q6145J13888J42687J71493J99333K26172K50484K68814K79472
59939A0314686K84117K83959K77001K60941K36523K05996J70353J30104Q7031
$$ plain form
60007 12692801 12432886 12165658 11894213 11622688 11355741 11096888 10848388 10613215 10395430
59998 10395430 10197675 10019976 9862222 9726335 9614769 9528465 9467711 9433636 9427349 9448681
59988 9448681 9496932 9571570 9670922 9791510 9929947 10084200 10251636 10427060 10603803 10775424
59978 10775424 10935312 11076507 11193610 11283691 11344129 11371307 11362838 11319345 11242392 11132550
59968 11132550 10991446 10823961 10636138 10432253 10216125 9993885 9773003 9559343 9357077
59959 9357077 9170334 9002637 8855645 8730509 8629668 8555347 8507314 8484344 8487111 8517552
59949 8517552 8576198 8662343 8776231 8918918 9090411 9289744 9515916 9766400 10035214 10314686
59939 10314686 10598803 10882762 11159763 11420704 11657227 11863223 12033576 12163680 12250711
59930A2250711M3255j88m2534q2447j19036j52118j80542k01966k15172k20913
59920A1079050k19863k11892j98070j80940j61536j38328j10441p9874m9105j8507
59910I710494J2438M3059P2078R8927J23429J45270J64316J80157J91296J96541
59900A0938005J97244J95898J92671J85792J75342J63492J50736J35495J18465
59891A2453140J03794R4232Q8347Q4416Q4157R0316J03093J21174J44399J73313
59881A3540381K07606K46764K90794L39034L89736M41769M94811N46960N94027
59872A7091882O32113O58826O71419O66161O40492N93447N23559M29526L14265
59863B2221690J85416N0589q5195k16536l35956m37345n18449n78477o16473o33973
$$ plain form
59930 12250711 12293966 12293778 12251244 12168797 12049761 11897643 11717101 11515135 11299963 11079050
59920 11079050 10859187 10647295 10449225 10268285 10106749 9968421 9857980 9778106 9729001 9710494
59910 9710494 9722932 9765991 9838069 9936996 10060425 10205695 10370011 10550168 10741464 10938005
59900 10938005 11135249 11331147 11523818 11709610 11884952 12048444 12199180 12334675 12453140
59891 12453140 12556934 12651166 12739513 12823929 12908086 12998402 13101495 13222669 13367068 13540381
59881 13540381 13747987 13994751 14285545 14624579 15014315 15456084 15950895 16497855 17091882
59872 17091882 17723995 18382821 19054240 19720401 20360893 20954340 21477899 21907425 22221690
59863 22221690 22407106 22457695 22372500 22155964 21820008 21382663 20864214 20285737 19669264 19035291
59853A9035291o35785o25454o02635n67269n23469m76295m27096l74790l19793
59844A4482705k63909k08094j52807r9131m7496L061N2612R9093J40791J77812
59834A4184637K09428K32489K44419K45265K34777K10294J70181J16784N3518
59825A5901792j8392r7400j78378k55202l24841l86073m36285m72892m96511n09638
59815A2726180n13396n08144m95722m78206m55750m28287l98087l67918l38037
59806H742633l07508k77151k48529k21410j94954j70212j48764j30016j12646
59797F931443r7718q7599q2447q0014p8221p6002p2750o8974o6244o4587o1362
59786F095525n4784m6812m0176l4561k8525k3503k2507k5953l1824l9177m8389
$$ plain form
59853 19035291 18399506 17774052 17171417 16604148 16080679 15604384 15177288 14802498 14482705
59844 14482705 14218796 14010702 13857895 13758764 13711268 13714329 13766941 13866034 14006825 14184637
59834 14184637 14394065 14626554 14870973 15116238 15351015 15561309 15731490 15848274 15901792
59825 15901792 15883400 15786000 15607622 15352420 15027579 14641506 14205221 13732329 13235818 12726180
59815 12726180 12212784 11704640 11208918 10730712 10274962 9846675 9448588 9080670 8742633
59806 8742633 8435125 8157974 7909445 7688035 7493081 7322869 7174105 7044089 6931443
59797 6931443 6833725 6746126 6663679 6583665 6505444 6429442 6356692 6287718 6221474 6156887 6095525
59786 6095525 6040741 5993929 5953753 5919192 5890667 5867164 5844657 5818704 5786880 5747703 5699314
59775E699314n8504o7209p3267p6772p7595p5646p1976o7556o1747n3773m4532
59764D970737l5039k4625j2882j620P739J7065K8868M2165N4075O4281P4426Q4067
59752E269257R0925R4908R8516J03100J07533J10568J11775J10056J03904R3516
59742F294058Q0678O6580N1756L7832K7135K0499J7181J6581J8444K2180K7872
59731F680796L7145N1047O7870Q5207J03197J23482J46057J69928J96123K26968
59721G887820K62462L00035L38051L77235M18566M61651N05098N46414N81165
59712A1678497O03314O05978N81164N21188M23782K96202J52834R105j21851k29903
59702A4520310l09667l61784l90270l98729l90363l69630l40797l05730k65601
$$ plain form
59775 5699314 5640810 5573601 5500334 5423562 5345967 5270321 5198345 5130789 5069042 5015269 4970737
59764 4970737 4935698 4911073 4898191 4896571 4904310 4921375 4950243 4992408 5046483 5110764 5185190 5269257
59752 5269257 5360182 5455090 5553606 5656706 5764239 5874807 5986582 6096638 6200542 6294058
59742 6294058 6374736 6441316 6493072 6530904 6558039 6578538 6595719 6612300 6630744 6652924 6680796
59731 6680796 6717941 6768988 6836858 6922065 7025262 7148744 7294801 7464729 7660852 7887820
59721 7887820 8150282 8450317 8788368 9165603 9584169 10045820 10550918 11097332 11678497
59712 11678497 12281811 12887789 13468953 13990141 14413923 14710125 14862959 14872064 14750213 14520310
59702 14520310 14210643 13848859 13458589 13059860 12669497 12299867 11959070 11653340 11387739
59693A1387739k23626j83193j44410j05639o7523l2144J078L4835O9515J02892
59683A0839524J34500J66807K01405K37059K72345L07590L43469L80114M18326
59674A3301139M59414N03249N48577N95687O46591P01987P60060Q18842Q77877
59665A9213423R36959R94913J050056J100417J143156J175085J193871J197872
59657B8005752J185667J157685J117996J072815J027472R86199R53695R34338
59649C6441619R29976R40154R63824R98659J039182J077934J108438J125309J122514
59640D5747609J094098J036760R49923Q34301O93093N34189L68431K05386N2446
59631E1516236q3050j94020k76314l28878l51327l43660l08263k49586j71308
$$ plain form
59693 11387739 11164113 10980920 10836510 10730871 10663348 10631204 10632282 10667117 10736632 10839524
59683 10839524 10974024 11140831 11342236 11579295 11851640 12159230 12502699 12882813 13301139
59674 13301139 13760553 14263802 14812379 15408066 16054657 16756644 17516704 18335546 19213423
59665 19213423 20150382 21145295 22195351 23295768 24438924 25614009 26807880 28005752
59657 28005752 29191419 30349104 31467100 32539915 33567387 34553586 35507281 36441619
59649 36441619 37371595 38311749 39275573 40274232 41313414 42391348 43499786 44625095 45747609
59640 45747609 46841707 47878467 48828390 49662691 50355784 50889973 51258404 51463790 51516236
59631 51516236 51433186 51239166 50962852 50633974 50282647 49938987 49630724 49381138 49209830
59622D9209830p5618L4900J56941K88297M28191N75511P28108Q83234J036846
59613E3266240J182671J313309J421409J498242J532462J512502J429496J276737
59605F4433068J049602P50443L93227L34m04600p98606j157715j460425j695094
59596F1110234j861165j962900k005073j994724j942646j860925j760803j653325
59588D6068673j549689j460326j394988j362464j366367j400501j450779j502044
59580C4581515j541849j560338j552151j519482j469512j407567j335298j255196
59572B2940122j172442j091035j011519r33852q59518p89572p23592o61798o05501
59563A5091293n54407n06284m60351m18309l80904l46313l13273k83158k57495
$$ plain form
59622 49209830 49134212 49169112 49326053 49614350 50042541 50618052 51346160 52229394 53266240
59613 53266240 54448911 55762220 57183629 58681871 60214333 61726835 63156331 64433068
59605 64433068 65482670 66233113 66626340 66626674 66222074 65423468 64265753 62805328 61110234
59596 61110234 59249069 57286169 55281096 53286372 51343726 49482801 47721998 46068673
59588 46068673 44518984 43058658 41663670 40301206 38934839 37534338 36083559 34581515
59580 34581515 33039666 31479328 29927177 28407695 26938183 25530616 24195318 22940122
59572 22940122 21767680 20676645 19665126 18731274 17871756 17082184 16358592 15696794 15091293
59563 15091293 14536886 14030602 13570251 13151942 12771038 12424725 12111452 11828294 11570799
59554A1570799k35800k17254k02365j91608j84259j79593j77665j78195j80494
59545I823566j84820j91508j98521k02348k02004j99772j97364j93746j87454
59536H066029j78637j67975j55773j42821j30137j17438j03829q9912p6860o3661
59526F838986m8308l1744j7356o199L798J3483K1121K6446L2161L9667M6505N0056
59514F968616N1028N1562N2432N3973N7301O2782O9221P5999Q4198R4633J06815
59503G728560J20679J36903J54756J72300J89722K09575K32619K56427K79449
59494I480990L03417L29964L57646L84405M10371M36133M60366M81382M99179
59485A3143853N14044N24747N29610N27927N19158N02773M80084M54225M27023
$$ plain form
59554 11570799 11334999 11117745 10915380 10723772 10539513 10359920 10182255 10004060 9823566
59545 9823566 9638746 9447238 9248717 9046369 8844365 8644593 8447229 8253483 8066029
59536 8066029 7887392 7719417 7563644 7420823 7290686 7173248 7069419 6979507 6902647 6838986
59526 6838986 6790678 6758934 6741578 6735379 6739177 6752660 6773781 6800227 6832388 6872055 6918560 6968616
59514 6968616 7019644 7071206 7123638 7177611 7234912 7297694 7366915 7442914 7527112 7621745 7728560
59503 7728560 7849239 7986142 8140898 8313198 8502920 8712495 8945114 9201541 9480990
59494 9480990 9784407 10114371 10472017 10856422 11266793 11702926 12163292 12644674 13143853
59485 13143853 13657897 14182644 14712254 15240181 15759339 16262112 16742196 17196421 17623444
59476A7623444L97848L66635L35719L07154K80265K53348K26020J98937J73450
59467B0162820J52717J40657J38190J42331J49972J60111J71071J78398J77432
59458B1573699J65756J41425J01487M4773k5523j04342j88457k75972l63789m47702
59448B0621355n24058n89870o42427o80228p03537p13197p09989o95597o72548
59439A4689904o42577o06521n66090n23779m80585m36058l91158l48626l09831
59430A0384679k73617k39044k06611j76055j45749j15523q7261o1338l5121o736
59420I037624K2217M9407P5100J01129J28496J57414J87774K18364K47460K75214
59410A0500199L03349L31691L57204L77231L91212L98488L97147L85911L64340
$$ plain form
59476 17623444 18021292 18387927 18723646 19030800 19311065 19564413 19790433 19989370 20162820
59467 20162820 20315537 20456194 20594384 20736715 20886687 21046798 21217869 21396267 21573699
59458 21573699 21739455 21880880 21982367 22027140 22001617 21897275 21708818 21432846 21069057 20621355
59448 20621355 20097297 19507427 18865000 18184772 17481235 16768038 16058049 15362452 14689904
59439 14689904 14047327 13440806 12874716 12350937 11870352 11434294 11043136 10694510 10384679
59430 10384679 10111062 9872018 9665407 9489352 9343603 9228080 9140819 9079481 9044360 9037624
59420 9037624 9059841 9109248 9184348 9285477 9413973 9571387 9759161 9977525 10224985 10500199
59410 10500199 10803548 11135239 11492443 11869674 12260886 12659374 13056521 13442432 13806772
59401A3806772L30444K81473K18326J46059O8686j3101r7711j80002k55001l21028
59391A3984917l77081m20537m50112m68155m77442m78302m71083m58577m43293
59382I940335m24743m01960l76380l50066l23514k97318k73395k52183k31185
59373G009591k08750j86837j67805j50973j34741j19490j05734r1922p6874o2197
59363E704268m9717l8620k7521j7119q331k3Q893J7325K4361L1537M0279M9299
59351E734631N7055O4752P4389Q5539R5930J03379J05908J02995R8463R8973J07433
59340F729447J20790J35919J53725J75151J97834K20152K44304K71260K96761
59331H545343L17359L37184L63589L98524M39075M83969N34161N88590O44585
$$ plain form
59401 13806772 14137216 14418689 14637015 14783074 14851760 14838659 14740948 14560946 14305945 13984917
59391 13984917 13607836 13187299 12737187 12269032 11791590 11313288 10842205 10383628 9940335
59382 9940335 9515592 9113632 8737252 8387186 8063672 7766354 7492959 7240776 7009591
59373 7009591 6800841 6614004 6446199 6295226 6160485 6040995 5935261 5843339 5766465 5704268
59363 5704268 5654551 5615931 5588410 5571291 5562960 5562937 5571830 5589155 5613516 5645053 5685332 5734631
59351 5734631 5791686 5856438 5930827 6016366 6112296 6215675 6321583 6424578 6523041 6622014 6729447
59340 6729447 6850237 6986156 7139881 7315032 7512866 7733018 7977322 8248582 8545343
59331 8545343 8862702 9199886 9563475 9961999 10401074 10885043 11419204 12007794 12652379
59322A2652379P01615P60189Q17897Q70590R16297R53844R78979R86382R75100
59313B0613272R48030R06940Q51964P85455P12303O36517N60596M87414M19138
59304B6921629L54773K91805K29543J67907J04442L6104l6817j11987j88923k67734
59294B7500742l44851m13898m70561n13594n42333n57247n62363n63269n62796
59285B2969830n61766n62879n69758n82282n96708o10532o23725o35189o41660
59276A7585331o40864o33020o18917n98990n74253n45708n13114m76584m38662
59267A2545219m02328l67646l32975k98443k65317k33047k00283j68205j39439
59258A0137536j14077q9830o5826m3177k2205k204J6249L1584M3671N3447O0552
$$ plain form
59322 12652379 13353994 14114183 14932080 15802670 16718967 17672811 18651790 19638172 20613272
59313 20613272 21561302 22468242 23320206 24105661 24817964 25454481 26015077 26502491 26921629
59304 26921629 27276402 27568207 27797750 27965657 28070099 28106203 28069386 27957399 27768476 27500742
59294 27500742 27155891 26741993 26271432 25757838 25215505 24658258 24095895 23532626 22969830
59285 22969830 22408064 21845185 21275427 20693145 20096437 19485905 18862180 18226991 17585331
59276 17585331 16944467 16311447 15692530 15093540 14519287 13973579 13460465 12983881 12545219
59267 12545219 12142891 11775245 11442270 11143827 10878510 10645463 10445180 10276975 10137536
59258 10137536 10023459 9933629 9867803 9824626 9802421 9800217 9816466 9848050 9891721 9945168 10005720
59247A0005720O3808O3425O0226N3626M2949K9728J5866O99j6969l5008m9451
59236A0234619n9100o5527o9426p0210o8318o4463n7345m5419l0213j4464K169
59225I692303K1951M4488O7163Q9590J13631J39237J64003J86880K08613K28596
59215A0956455K44851K57167K66691K72333K71128K62302K47545K27106J99328
59206A3204906J64716J27141R0113N4441J9852j3777m6928p9375j08283j30013
59196A3282793j44023j52769j58045j60079j59916j59618j59967j60212j60045
59187A1868119j59584j57874j53816j47935j40926j31314j17121r8846p8144n4645
59177A0627914k6927M446L7812P3288J11844J52753J94910K39272K86945L36306
$$ plain form
59247 10005720 10069528 10132953 10193179 10246805 10289754 10319482 10335348 10336047 10319078 10284070 10234619
59236 10234619 10175519 10109992 10040566 9970356 9902038 9837575 9780230 9734811 9704598 9690134 9692303
59225 9692303 9714254 9758742 9825905 9915495 10029126 10168363 10332366 10519246 10727859 10956455
59215 10956455 11201306 11458473 11725164 11997497 12268625 12530927 12778472 13005578 13204906
59206 13204906 13369622 13496763 13586876 13641317 13661169 13647392 13600464 13521089 13412806 13282793
59196 13282793 13138770 12986001 12827956 12667877 12507961 12348343 12188376 12028164 11868119
59187 11868119 11708535 11550661 11396845 11248910 11107984 10976670 10859549 10760703 10682559 10627914
59177 10627914 10600987 10605433 10643245 10716533 10828377 10981130 11176040 11415312 11702257 12038563
59167A2038563L85092M33470M81471N25283N59836N83137N93988N87736N59142
59158A6747718N08021M37602L49116K42954J23432k922j32239k61118l81590m84737
59148A7146237n68319o34764o82891p08658p13553p04749o86507o58339o22115
59139A1166342n83499n44799n03522m59924m19154l83587l49623l14867k82454
59130G324913k55261k31459k08903j88710j71362j54270j36261j20008j07055
59121E751624r4941q1941p0130o0876n1721m0730k9774k0579j1603j600P719J5397
59109E310845K3550L3216M1910M8257N5047O4566P4705Q2990R0797J00200J10024
59098F036107J18334J25860J33686J40359J44294J46447J47859J47210J43234
$$ plain form
59167 12038563 12423655 12857125 13338596 13863879 14423715 15006852 15600840 16188576 16747718
59158 16747718 17255739 17693341 18042457 18285411 18408843 18405921 18273682 18012564 17630974 17146237
59148 17146237 16577918 15943154 15260263 14551605 13838052 13133303 12446796 11788457 11166342
59139 11166342 10582843 10038044 9534522 9074598 8655444 8271857 7922234 7607367 7324913
59130 7324913 7069652 6838193 6629290 6440580 6269218 6114948 5978687 5858679 5751624
59121 5751624 5656683 5574742 5504612 5443736 5392015 5351285 5321511 5300932 5289329 5287729 5295448 5310845
59109 5310845 5334395 5367611 5409521 5457778 5512825 5577391 5652096 5735086 5825883 5926083 6036107
59098 6036107 6154441 6280301 6413987 6554346 6698640 6845087 6992946 7140156 7283390
59089G283390J36784J28195J15666R8839Q0889O4388M7964K9743J1195n209j9517
59078G972327l2567m3177m9709n2406n1998m8129m1022l2346k2619j0265N208
59067G593297K1906L8974N8164Q0169J02633J23863J45365J68614J92518K16083
59057H741586K40452K66108K91354L15668L41202L68555L94426M15867M33457
59048A1808675M47677M55499M53378M40435M15900L76797L21448K52741J75181
59039A5147731R1383M122q1245j59594k29161k89546l39443l78851m10567m36561
59029A2918268m55409m65849m70107m70950m68136m60514m49097m35331m18840
59020H824035l99457l79048l58859l37802l15674k95093k77623k61045k43250
$$ plain form
59089 7283390 7420174 7548369 7664035 7762874 7843763 7908151 7956115 7985858 7997053 7991844 7972327
59078 7972327 7939760 7896583 7846874 7794468 7742470 7694341 7653319 7620973 7598354 7588089 7593297
59067 7593297 7615203 7654177 7712341 7792510 7895143 8019006 8164371 8332985 8525503 8741586
59057 8741586 8982038 9248146 9539500 9855168 10196370 10564925 10959351 11375218 11808675
59048 11808675 12256352 12711851 13165229 13605664 14021564 14398361 14719809 14972550 15147731
59039 15147731 15239114 15243236 15161991 15002397 14773236 14483690 14144247 13765396 13354829 12918268
59029 12918268 12462859 11997010 11526903 11055953 10587817 10127303 9678206 9242875 8824035
59020 8824035 8424578 8045530 7686671 7348869 7033195 6738102 6460479 6199434 5956184
59011E956184k25901k11270j98315j84972j71699j59702j48261j36708j26491
59002D392865j18336j09988r9751q9656q2181p6383p0347o4792o1133n8332n4929
58991C507037n1968n0864n0528m9433m8326m8093m7243m4234m0044l5873l0757
58980C009674k4066j7761j3512j0222o913n165n879o635n258l021j455R17N475
58967B916179J0368J3860J7544K2702K6667K6610K3995K1368J7812J1802N647
58956C114554K503J363m79k284j741J67Q15R21L257P560J0959J2484J3316J3553
58942C176948J2338J0279Q421N871J455l678p856j1671j5958j8976j8744j6411
58930C122018j4154j1648p797l898j597M64M463R657J4081J8064K2646K6424K7606
$$ plain form
59011 5956184 5730283 5519013 5320698 5135726 4964027 4804325 4656064 4519356 4392865
59002 4392865 4274529 4164541 4064790 3975134 3892953 3816570 3746223 3681431 3620298 3561966 3507037
58991 3507037 3455069 3404205 3353677 3304244 3255918 3207825 3160582 3116348 3076304 3040431 3009674
58980 3009674 2985608 2967847 2954335 2944113 2937200 2932035 2926156 2919521 2914263 2911242 2909787 2910704 2916179
58967 2916179 2926547 2940407 2957951 2980653 3007320 3033930 3057925 3079293 3097105 3108907 3114554
58956 3114554 3117057 3118420 3117941 3115657 3113916 3114083 3114898 3115819 3119076 3126636 3137595 3150079 3163395 3176948
58942 3176948 3189286 3199565 3207986 3213857 3215312 3211634 3203778 3192107 3176149 3157173 3138429 3122018
58930 3122018 3107864 3096216 3088419 3084521 3082924 3083388 3087851 3097508 3111589 3129653 3152299 3178723 3206329
58917C206329K7566K8958L1878L5000L8730M3922M9208N2792N5292N8110O0928
58906C688713O3365O6620P0754P3267P3352P4335P8580Q3367Q5645Q7310R1307
58895D536615R6026R8546J00482J05342J12509J19167J25822J34738J44986J54441
58885E728674J64691J78440J93681K06215K16702K29766K46912K65657K84995
58876G715733L06433L29884L53319L76526M01208M27758M55659M86227N21253
58867A1374000N59923O00626O44362O92756P44561P98029Q54466R15118R76856
58858A8160697J035696J092202J148089J199533J239388J264032J272068J258041
58850B7669746J214101J137296J029182Q89234P15533N12433K91452O3688j63509
$$ plain form
58917 3206329 3233895 3262853 3294731 3329731 3368461 3412383 3461591 3514383 3569675 3627785 3688713
58906 3688713 3752078 3818698 3889452 3962719 4036071 4110406 4188986 4272353 4357998 4445308 4536615
58895 4536615 4632641 4731187 4831669 4937011 5049520 5168687 5294509 5429247 5574233 5728674
58885 5728674 5893365 6071805 6265486 6471701 6688403 6918169 7165081 7430738 7715733
58876 7715733 8022166 8352050 8705369 9081895 9483103 9910861 10366520 10852747 11374000
58867 11374000 11933923 12534549 13178911 13871667 14616228 15414257 16268723 17183841 18160697
58858 18160697 19196393 20288595 21436684 22636217 23875605 25139637 26411705 27669746
58850 27669746 28883847 30021143 31050325 31939559 32655092 33167525 33458977 33522665 33359156
58841C3359156l82183n82029p54894q97300j008215j088221j140787j170199j178172
58832B5157156j165971j138676j102766j060349j010424r54849q98012q41449
58824A6984660p84154p27732o75930o29250n85192n43555n06311m72690m39951
58815A1619895m08905l83065l62088l41521l19492k98313k78983k59506k39483
58806H728539k21221k05399j90297j75906j64027j53821j42047j28361j15669
58797G231791j04696r3002p9894o7451n5999m3378k9476j6807n695O627K1222
58786F763242L6004M9931O4498Q0319R5999J11004J26211J41666J57088J73942
58776G799904J93254K12703K30017K47624K68984K92253L13353L33711L58287
$$ plain form
58841 33359156 32976973 32394944 31640050 30742750 29734535 28646314 27505527 26335328 25157156
58832 25157156 23991185 22852509 21749743 20689394 19678970 18724121 17826109 16984660
58824 16984660 16200506 15472774 14796844 14167594 13582402 13038847 12532536 12059846 11619895
58815 11619895 11210990 10827925 10465837 10124316 9804824 9506511 9227528 8968022 8728539
58806 8728539 8507318 8301919 8111622 7935716 7771689 7617868 7475821 7347460 7231791
58797 7231791 7127095 7034093 6954199 6886748 6830749 6787371 6757895 6741088 6735393 6742020 6763242
58786 6763242 6799246 6849177 6913675 6993994 7089993 7200997 7327208 7468874 7625962 7799904
58776 7799904 7993158 8205861 8435878 8683502 8952486 9244739 9558092 9891803 10250090
58767A0250090L87118M15941M44637M77516N15054N53104N91171O33846O82609
58758A4951086P33550P85251Q41534R03643R66255J024143J076939J124455J162766
58749B3569622J187612J196391J184404J144308J071798R67295Q30874O61532
58741C1813836M63598K48108K5332j98606m15777o13867p83438r22957j033711
58732B8582518j114837j166538j193128j199163j186514j157995j119532j075678
58724A9369133j026883r73679r19407q66334q13305p59949p09194o63113o20093
58715A2017176n78436n39033n02563m68072m36115m09148l86913l65648l43535
58706G987713l22625l03947k85585k67246k51568k38717k24810k08038j91578
$$ plain form
58767 10250090 10637208 11053149 11497786 11975302 12490356 13043460 13634631 14268477 14951086
58758 14951086 15684636 16469887 17311421 18215064 19181319 20205462 21282401 22406856 23569622
58749 23569622 24757234 25953625 27138029 28282337 29354135 30321430 31152304 31813836
58741 31813836 32277434 32525542 32550874 32352268 31936491 31322624 30539186 29616229 28582518
58732 28582518 27467681 26301143 25108015 23908852 22722338 21564343 20444811 19369133
58724 19369133 18342250 17368571 16449164 15582830 14769525 14009576 13300382 12637269 12017176
58715 12017176 11438740 10899707 10397144 9929072 9492957 9083809 8696896 8331248 7987713
58706 7987713 7665088 7361141 7075556 6808310 6556742 6318025 6093215 5885177 5693599
58697E693599j78032j65744j52981j40953j30264j19075j07133r7105q9621q1683
58687D431008p1975o2950n5726m8082l9535l2946k9080k5319k1985k3612l1109
58676C988689l8977m3646m8159n4921o0305o1175o0732o2611o4408o2505n8904
58665C372346n7834n9294o0836o2345o4469o5578o4501o3282o3477o3054o0451
58654B687225n7942n7372n6274n2210m7394m5062m4474m3248m1489m0011l7664
58643B164085l3805l0454k8922k7471k4973k3234k3053k2024j9102j7197j7982
58632A895868j8477j6235j3682j3693j4855j4927j4983j6348j7190j5957j4628
58621A724893j4998j5269j3708j1919j1175r415n368j640p7J893O583J1488J3287
$$ plain form
58697 5693599 5515567 5349823 5196842 5055889 4925625 4806550 4699417 4602312 4512691 4431008
58687 4431008 4359033 4296083 4240357 4192275 4152740 4119794 4090714 4065395 4043410 4019798 3988689
58676 3988689 3949712 3906066 3857907 3802986 3742681 3681506 3620774 3558163 3493755 3431250 3372346
58665 3372346 3314512 3255218 3194382 3132037 3067568 3001990 2937489 2874207 2810730 2747676 2687225
58654 2687225 2629283 2571911 2515637 2463427 2416033 2370971 2326497 2283249 2241760 2201749 2164085
58643 2164085 2130280 2099826 2070904 2043433 2018460 1995226 1972173 1950149 1931047 1913850 1895868
58632 1895868 1877391 1861156 1847474 1833781 1818926 1803999 1789016 1772668 1755478 1739521 1724893
58621 1724893 1709895 1694626 1680918 1668999 1657824 1648409 1643041 1641401 1641324 1643217 1649800 1661288 1674575
58608A674575J2827J2530J2271J1335J1006J1936J2304J1412J1291J2203J0871
58597A804561O088J526j3l45r89K21M197P608Q645J0581J5608K0498K2620K4882
58583A925688L0134L5957L9804M4117N1091N7491O0145O2024O7220P4200P9509
58572B527380Q4189R1023R9190J06854J15578J27241J40192J52838J67156J84347
58562C795988K01550K17363K35709K59171K83374L03390L21008L39917L58043
58553F315513L70449L75721L73873L61901L36937L00121K52477J91568J17542
58544H996102L7916l9119j11578j78821k35469k76706l04805l24085l33950l33063
58534F896422l25297l14664k99340k77707k55378k38508k24573k07562j88187
$$ plain form
58608 1674575 1687402 1699932 1712203 1723538 1734544 1746480 1758784 1770196 1781487 1793690 1804561
58597 1804561 1810649 1812175 1812162 1811817 1810828 1811049 1815246 1822854 1831499 1842080 1857688 1878186 1900806 1925688
58583 1925688 1955822 1991779 2031583 2075700 2126791 2184282 2244427 2306451 2373671 2447871 2527380
58572 2527380 2611569 2702592 2801782 2908636 3024214 3151455 3291647 3444485 3611641 3795988
58562 3795988 3997538 4214901 4450610 4709781 4993155 5296545 5617553 5957470 6315513
58553 6315513 6685962 7061683 7435556 7797457 8134394 8434515 8686992 8878560 8996102
58544 8996102 9034018 8994899 8883321 8704500 8469031 8192325 7887520 7563435 7229485 6896422
58534 6896422 6571125 6256461 5957121 5679414 5424036 5185528 4960955 4753393 4565206
58525D565206j71039j55618j38564j21357j07633r5688q1589o7185n7219n0922
58515C518392m3957l6447l1833k9872k7615k5066k3450k0644j4769r283p875p796
58503C239785n087k698o023j3921k1981l1142m4778o0077p0803p6461q0893q4181
58491B741740q3608q0393p7770p4658o8682o2706o0795o0379n6339n0096m6618
58480B019696m5240m1750l6958l4653l3518k9640k4775k3491k4297k2225j8177
58469A684972j6967j8079j7154j4809j5156j7355j7356j6199j7753k0123j8448
58458A495573j4383j3454j4652j2295o812l945m166k638R97K379J591L174P290
58445A438659R904J1257J5065J9901K0724J8555J9222K2776K3650K1223K0596
$$ plain form
58525 4565206 4394167 4238549 4099985 3978628 3870995 3775307 3693718 3626533 3569314 3518392
58515 3518392 3474435 3437988 3406155 3376283 3348668 3323602 3300152 3279508 3264739 3255456 3247581 3239785
58503 3239785 3234698 3232000 3225977 3212056 3190075 3158933 3114155 3054078 2983275 2906814 2825921 2741740
58491 2741740 2658132 2577739 2499969 2425311 2356629 2293923 2233128 2172749 2116410 2066314 2019696
58480 2019696 1974456 1932706 1895748 1861095 1827577 1797937 1773162 1749671 1725374 1703149 1684972
58469 1684972 1668005 1649926 1632772 1617963 1602807 1585452 1568096 1551897 1534144 1514021 1495573
58458 1495573 1481190 1467736 1453084 1440789 1433977 1430032 1425866 1423228 1424225 1426604 1428195 1431369 1438659
58445 1438659 1448563 1459820 1474885 1494786 1515510 1534065 1553287 1576063 1599713 1620936 1641532
58434A641532K2673K2990K0860K0401K1823K0649J6279J2722J0404N812n11m276
58422A811358n942j0287j7415k2645k5167k8329l1686l1660k9548k9979l1915
58411A546785l0470k6876k6848k9670k8944k4054k0702k0160j8204j4741j3942
58400A292174j4582j0959m092j242l442l996n75J850J356J922M492N334M729P305
58386A280274J2546J4888J4188J5909K0139K1091J8521J8785K3143K5705K4368
58375A489557K3280K3163J9890J3795R668O627p81j0807j5642j5160j7225k3151
58363A503214k5647k2931k1601k3106k0703j3078p900q163p550l167l34r12Q48
58350A348970O728J0917J1702J4729K0899K3375K0512J9240K1475J9929J1843
$$ plain form
58434 1641532 1664205 1687195 1708055 1728456 1750279 1770928 1787207 1799929 1810333 1816145 1815634 1811358
58422 1811358 1805416 1795129 1777714 1755069 1729902 1701573 1669887 1638227 1608679 1578700 1546785
58411 1546785 1516315 1489439 1462591 1432921 1403977 1379923 1359221 1339061 1320857 1306116 1292174
58400 1292174 1277592 1266633 1262541 1261299 1257857 1253861 1253286 1255136 1256492 1258414 1262906 1268240 1272969 1280274
58386 1280274 1292820 1307708 1321896 1337805 1357944 1379035 1397556 1416341 1439484 1465189 1489557
58375 1489557 1512837 1536000 1555890 1569685 1579353 1585980 1585199 1574392 1558750 1543590 1526365 1503214
58363 1503214 1477567 1454636 1433035 1409929 1389226 1376148 1368248 1360085 1352535 1349368 1349034 1348122 1348970
58350 1348970 1355698 1366615 1378317 1393046 1413945 1437320 1457832 1477072 1498547 1518476 1530319
58339A530319M249Q95l405j0611j4412j2477j1372j4083j4817j1144q941j0398
58327A423803r703n628n288j0145j1577o151k024m063n791k565L42n50n4M061
58313A364667N395J503l04L538O373M792N540J2015J6950J5748J4329J6650J7372
58300A484568J4017J3280J7913K0475J7379J5964K0373K3825K2235K1780K5488
58289A697297K6283K0957J6926J7548J5322P351K396M440M811p71l367J746N151
58276A816090Q36k490J819O280M865M650J0546J4392J1101R792J6818K3479K3026
58263A941204K3838L2615M0304L8507L4767L7893M2688M2774M3640M9603N2660
58252B380493M7496M2538M3179M0021K7069J4968J2251J0355J792m234L30O172
$$ plain form
58339 1530319 1534568 1535463 1532058 1521447 1507035 1494558 1483186 1469103 1454286 1443142 1434201 1423803
58327 1423803 1414100 1408472 1403184 1393039 1381462 1375311 1373287 1369224 1363433 1360868 1361210 1360660 1360606 1364667
58313 1364667 1370062 1371565 1371261 1374799 1381172 1385964 1391504 1403519 1420469 1436217 1450546 1467196 1484568
58300 1484568 1498585 1511865 1529778 1550253 1567632 1583596 1603969 1627794 1650029 1671809 1697297
58289 1697297 1723580 1744537 1761463 1779011 1794333 1801684 1804080 1808520 1813331 1812560 1809193 1810939 1816090
58276 1816090 1816926 1814436 1816255 1822535 1827400 1832050 1842596 1856988 1868089 1877881 1894699 1918178 1941204
58263 1941204 1965042 1997657 2037961 2076468 2111235 2149128 2191816 2234590 2278230 2327833 2380493
58252 2380493 2427989 2470527 2513706 2553727 2580796 2595764 2608015 2618370 2620162 2615928 2616258 2622430
58240B622430M141K035P845J3435J1191R625J5984K0998J7688J6923K6914L6194
58228B805403L5230L5484M7552N9886N9810N6550O2250O9241O7830O7626P8651
58217C445513R0127R0614R0245R9916J08025J01810R1961R1452R0173P6202O1739
58206D437777O0976O2648N2541M3026N1390O8469P7758Q5619J03117J18772J20234
58195E282327J22282J41906J66463J78187J87680K09613K28783K26434K17507
58186F961182K24398K36589K34649K30968K46377K69425K80436K92516L25872
58177I302412L65291L87602M06778M45818M89717N14983N39293N90310O51920
58168A3694124O95604P37905Q09504Q94569R60897J022449J108803J200957J264883
$$ plain form
58240 2622430 2626571 2628606 2636451 2649886 2661077 2670702 2686686 2707684 2725372 2742295 2769209 2805403
58228 2805403 2840633 2876117 2923669 2983555 3043365 3099915 3162165 3231406 3299236 3366862 3445513
58217 3445513 3535640 3626254 3716499 3816415 3924440 4026250 4118211 4209663 4299836 4376038 4437777
58206 4437777 4498753 4561401 4613942 4656968 4708358 4776827 4854585 4940204 5043321 5162093 5282327
58195 5282327 5404609 5546515 5712978 5891165 6078845 6288458 6517241 6743675 6961182
58186 6961182 7185580 7422169 7656818 7887786 8134163 8403588 8684024 8976540 9302412
58177 9302412 9667703 10055305 10462083 10907901 11397618 11912601 12451894 13042204 13694124
58168 13694124 14389728 15127633 15937137 16831706 17792603 18815052 19923855 21124812 22389695
58159B2389695J321045J410750J522017J621410J727895J876440K040716K176243
58151C6086211K307575K484086K686051K871963L080074L375138L733367M097429
58143F0721894M505085N035427N671114O356083P144313Q135926R321201J0668046
58135A17559089J2298470J4358488J6773676J9377329K2193197K5301630K8614471
58128B56476350L2288992L7110847M3325039M8551223M7912126L7700531J9190298
58121E22555406j801886j9248317l0495558l6135270l7821475l6965779l4730522
58114C25356599l2046739k9337503k6599547k3838037k1201285j8761168j6467403
58107A57104917j4341039j2490525j0923490r533044q279700p217068o332151
$$ plain form
58159 22389695 23710740 25121490 26643507 28264917 29992812 31869252 33909968 36086211
58151 36086211 38393786 40877872 43563923 46435886 49515960 52891098 56624465 60721894
58143 60721894 65226979 70262406 75933520 82289603 89433916 97569842 106891043 117559089
58135 117559089 129857559 144216047 160989723 180367052 202560249 227861879 256476350
58128 256476350 288765342 325876189 369201228 417752451 465664577 503365108 522555406
58121 522555406 520753520 501505203 471009645 434874375 397052900 360087121 325356599
58114 325356599 293309860 263972357 237372810 213534773 192333488 173572320 157104917
58107 157104917 142763878 130273353 119349863 109816819 101537119 94320051 87987900
58100H7987900n522876m748929m058771l451878k853282k244522j686350j183495
58092F2237797o51654m8779N87384J266720K054021K838398L203392K695153J252782
58083G5435214o79304k468613l702080m333057m538167m501887m325018m063893
58075D6823195l774799l493674l213033k917571k624654k361048k121969j888909
58067B4427538j671157j492435j349529j221184j106946j020211r52012q79318
58059A4734746q02967p41615o93708o40562n82316n35808n00310m59376m14027
58050I364057l80707l58250l29490k94451k70052k57645k42070k22718k14571
58041F794103k17678k15595k05406k00453k01932j96364j83092j76331j77624
$$ plain form
58100 87987900 82465024 77716095 73657324 70205446 67352164 65107642 63421292 62237797
58092 62237797 61586143 61537364 62124748 63391468 65445489 68283887 71487279 74182432 75435214
58083 75435214 74755910 72287297 68585217 64252160 59713993 55212106 50887088 46823195
58075 46823195 43048396 39554722 36341689 33424118 30799464 28438416 26316447 24427538
58067 24427538 22756381 21263946 19914417 18693233 17586287 16566076 15614064 14734746
58059 14734746 13931779 13190164 12496456 11855894 11273578 10737770 10237460 9778084 9364057
58050 9364057 8983350 8625100 8295610 8001159 7731107 7473462 7231392 7008674 6794103
58041 6794103 6576425 6360830 6155424 5954971 5753039 5556675 5373583 5197252 5019628
58032E019628j73391j62206j57757j61948j61304j53307j50556j55107j53771
58023C590281j43107j34797j31991j23926j08625r7810r4487q7940p5862o9673
58013B522063p2608p3461o7221o2018o0849n6126m6934m2435m3654m0676l1981
58002A924100k7912l1139l2421k9362l0583l7330l9780l5610l3754l5824l2609
57991A557776k3189j8559k1512k1544j4830j0696j2779j2101n091q69m099p287
57979A405220o192o577r899q755k424o29n856q119l284j89l311m773m36K223m79
57964A346520q25M915Q659N823L817P551J0644Q771P792J0941J1796P644O177
57951A440225J1068J4282J0861P923J0712J2836R149N738Q039J0825Q872O335
$$ plain form
58032 5019628 4846237 4684031 4526274 4364326 4203022 4049715 3899159 3744052 3590281
58023 3590281 3447174 3312377 3180386 3056460 2947835 2850025 2755538 2667598 2591736 2522063
58013 2522063 2449455 2375994 2308773 2246755 2185906 2129780 2082846 2040411 1996757 1956081 1924100
58002 1924100 1896188 1865049 1832628 1803266 1772683 1735353 1695573 1659963 1626209 1590385 1557776
57991 1557776 1534587 1516028 1494516 1472972 1458142 1447446 1434667 1422566 1417475 1416606 1412507 1405220
57979 1405220 1399028 1392451 1382552 1373797 1371373 1370744 1364888 1356769 1353485 1353296 1349985 1345212 1344776 1346999 1346520
57964 1346520 1345695 1350610 1359269 1365092 1368909 1376460 1387104 1395875 1403667 1414608 1426404 1434048 1440225
57951 1440225 1451293 1465575 1476436 1484359 1495071 1507907 1517056 1522794 1530833 1541658 1550530 1556865
57939A556865O989O178P59l658l521m711j1169j6826j6735j5712j8103j9603j7111
57926A443642j6079j9867k2203j8610j5095j7128j9962j8402j6199j6998j5728
57915A247371q155o1K172J714L543N049K794L71J242J742r18j948J845M693J753
57900A263207k085j445K0k278m783l617l159p639j1973j0426p047q078j0821r547
57886A180329o086n297n842m303k817m189n034j906J433O54j228l13J45l773q487
57871A133286r523j0086j4473j8956j8153j4961j5234j7496j6669j3450j1661
57860I72624j0648q126o120o618o139j897J801O13j736j01L035L101K394N165
57846I47348Q881Q883O993P262Q003O140M545O763R395Q073N997P946J0910R617
$$ plain form
57939 1556865 1563854 1570032 1570791 1567133 1563612 1558901 1547732 1530906 1514171 1498459 1480356 1460753 1443642
57926 1443642 1427563 1407696 1385493 1366883 1351788 1334660 1314698 1296296 1280097 1263099 1247371
57915 1247371 1239216 1239155 1241327 1243041 1246584 1251633 1254427 1254798 1256040 1257782 1256864 1254916 1256761 1261454 1263207
57900 1263207 1261122 1259677 1259697 1257419 1252636 1249019 1245860 1238221 1226248 1215822 1208775 1200697 1189876 1180329
57886 1180329 1174243 1168946 1163104 1158801 1155984 1151795 1146761 1144855 1146288 1146942 1145714 1145401 1145546 1141773 1133286
57871 1133286 1123763 1113677 1099204 1080248 1062095 1047134 1031900 1014404 997735 984285 972624
57860 972624 961976 953850 947730 941112 934973 933076 934877 935490 933754 933653 936688 939789 942183 947348
57846 947348 956229 965112 972105 979367 987370 993510 998055 1004818 1014213 1022286 1028283 1036229 1047139 1056756
57832A056756O485O829Q757P229L830L125L423O98k428j367O66k383q104r462
57818A074054o809o002p213o009l328m075p240p411m887m754o911o392k893q53
57804I99277p44J053M250M991L634M100O140O156M667N090O136L683p86j841O41
57789A046447J983J510K602M722L873N82p11J13o68k463j080K615L195M5j846
57774A060919q63n47j974k218j123k171n618p893q306r462j0891r598p122q446
57760I84687j3255j5798j4273j2986j4160j4916j3698j2825j3073j2138r798q635
57748H29132q671p248m832m822p030p420m958k678j712k27J501J160k88N07L176
57733G85590M391M324N977Q690R212Q631J0821J4390J3892R064N211M181K839
$$ plain form
57832 1056756 1063241 1070070 1078827 1086056 1089886 1093011 1096434 1097132 1094704 1093337 1094003 1091620 1083516 1074054
57818 1074054 1067245 1061243 1054030 1048021 1044693 1040618 1033378 1025967 1021080 1016326 1009415 1003023 1000130 999277
57804 999277 998533 999586 1003836 1008827 1012461 1016561 1022701 1028857 1033524 1038614 1044750 1048433 1047647 1045806 1046447
57789 1046447 1048430 1049940 1052542 1057264 1061137 1061719 1061008 1061121 1060453 1057990 1056910 1059525 1062720 1062765 1060919
57774 1060919 1060056 1059509 1057535 1055317 1054194 1052023 1046405 1038512 1030206 1020744 1009853 1000255 993133 984687
57760 984687 971432 955634 941361 928375 914215 899299 885601 872776 859703 847565 837767 829132
57748 829132 820461 813213 808381 803559 796529 789109 784151 781473 779761 779534 781035 782195 781907 782414 785590
57733 785590 789981 794305 800282 808972 818184 826815 837636 852026 865918 874982 880193 884374 887213
57720H87213O85P91K405J030l014m272j697l63k211l361k337k705n199n487k409
57705H59069o35k333l714k649k194l670l579n99J407M12n86j74j225l977l665
57690H31888J502O719Q388Q904J0457J0878R204Q711J0674J1387R070P402Q635
57677I43819R529P915O948Q891J0754J0161R591J0888J1457R929R740J2998J6419
57664A079039J7375J8252K0907K2573K1556K1242K4072K7018K7535K8456L2431
57653A340456L6691L8035L8194L9810M1857M3223M6023N1079N4938N5597N6409
57642A842312O0357O5441O9734P5593Q4420R2700R8070J04193J14649J26874J37256
57631B871599J47573J61196J77237J93550K11287K31431K50939K67194K82218
$$ plain form
57720 887213 887898 888689 891094 892124 889110 884838 883141 882778 880567 877206 874869 872164 866965 861478 859069
57705 859069 858434 856101 852387 849738 847544 843874 840295 839696 841103 841515 840929 840755 839530 835553 831888
57690 831888 833390 840109 848497 857401 867858 878736 887940 896651 907325 918712 927782 935184 943819
57677 943819 953348 961263 968211 977102 987856 998017 1007608 1018496 1029953 1039882 1049622 1062620 1079039
57664 1079039 1096414 1114666 1135573 1158146 1179702 1200944 1225016 1252034 1279569 1308025 1340456
57653 1340456 1377147 1415182 1453376 1493186 1535043 1578266 1624289 1675368 1730306 1785903 1842312
57642 1842312 1902669 1968110 2037844 2113437 2197857 2290557 2388627 2492820 2607469 2734343 2871599
57631 2871599 3019172 3180368 3357605 3551155 3762442 3993873 4244812 4512006 4794224
57622D794224K97673L09608L13049L07779K94955K72246K37386J92940J42884
57613G162744Q8432L1884j9686n9874q8726j08690j19114j19742j15842j14571
57603F536815j19306j31419j52832j81469k08376k25258k32030k32503k26784
57594D826838k13434j95205j76596j58359j39536j21853j07043r2872p6839o0925
57584C484176m8068l7108k5859j5551p505R81J2346K4088L3379M2561N4796O7982
57572C586218P8755Q9006J02610J18838J34622J50358J67869J85555K00982K15265
57562E030078K29688K41143K46040K45058K38669K21989J90390J46801R7464M4095
57552F931415j3285o9607j18204j58416j93018k20786k38582k48165k53850k55330
$$ plain form
57622 4794224 5091897 5401505 5714554 6022333 6317288 6589534 6826920 7019860 7162744
57613 7162744 7251176 7283060 7263374 7203500 7114774 7006084 6886970 6767228 6651386 6536815
57603 6536815 6417509 6286090 6133258 5951789 5743413 5518155 5286125 5053622 4826838
57594 4826838 4613404 4418199 4241603 4083244 3943708 3821855 3714812 3621940 3545101 3484176
57584 3484176 3436108 3399000 3373141 3357590 3350085 3351066 3363412 3387500 3420879 3463440 3518236 3586218
57572 3586218 3664973 3753979 3856589 3975427 4110049 4260407 4428276 4613831 4814813 5030078
57562 5030078 5259766 5500909 5746949 5992007 6230676 6452665 6643055 6789856 6887320 6931415
57552 6931415 6918130 6848523 6730319 6571903 6378885 6158099 5919517 5671352 5417502 5162172
57542E162172k49696k38672k27098k15841k02630j88115j74818j61932j47498
57533C355872j33835j24416j17308j08200r7984r0760q6113q0221p2979o7339
57523B376717o2976n7190n0796m6758m4332m0800l7211l6136l5524l1560k5681
57512A907753k1985j9699j5470j1094j1089j3930j3724r778o648n348k434K327
57500A778881N328O437R436J4592J7863J8214J9022K1690K4221K6460L0420L5083
57488B007647L7211L7474L9848M4985N0148N5152O2026O9529P4604P8699Q5809
57477B643132R5012J02059J07693J16718J29166J40231J48959J59076J70812J79963
57467C992821J85691J91308J96185J94625J83983J66592J42712J09446O7998K4426
$$ plain form
57542 5162172 4912476 4673804 4446706 4230865 4028235 3840120 3665302 3503370 3355872
57533 3355872 3222037 3097621 2980313 2872113 2774129 2683369 2597256 2517035 2444056 2376717
57523 2376717 2313741 2256551 2205755 2158997 2114665 2073865 2036654 2000518 1964994 1933434 1907753
57512 1907753 1885768 1866069 1850599 1839505 1828416 1814486 1800762 1790984 1784336 1778988 1776554 1778881
57500 1778881 1784209 1790646 1800082 1814674 1832537 1850751 1869773 1891463 1915684 1942144 1972564 2007647
57488 2007647 2044858 2082332 2122180 2167165 2217313 2272465 2334491 2404020 2478624 2557323 2643132
57477 2643132 2738144 2840203 2947896 3064614 3193780 3334011 3482970 3642046 3812858 3992821
57467 3992821 4178512 4369820 4566005 4760630 4944613 5111205 5253917 5363363 5431361 5455787
57457E455787j8260o1228j01918j33267j53038j66314j76389j80560j77378j70710
57447D116725j63605j54591j42732j30341j18522j05990r3922q5610p9954p2042
57437B969416o1537n3369m8621m2382l2743k4036j8728j3714p451l016q95L753
57425B666677J2862K1717K7195L2857M1763N0985N7537O3656P1766P9833Q6023
57414C212871R2872J02790J14043J24678J35766J47860J58855J67949J76761J84239
57404D618684J85790J79626J68397J52432J27474R1853N0006O379l8186q1572
57394E460883j18416j46214j67627j84102j93237j94969j93713j91327j84562
57385C886716j72508j60027j50305j40631j28960j18098j09683j00681q9786q0838
$$ plain form
57457 5455787 5437527 5376299 5274381 5141114 4988076 4821762 4645373 4464813 4287435 4116725
57447 4116725 3953120 3798529 3655797 3525456 3406934 3300944 3207022 3121412 3041458 2969416
57437 2969416 2907879 2854510 2805889 2763507 2730764 2706728 2688000 2674286 2666835 2663819 2662924 2666677
57425 2666677 2679539 2701256 2728451 2761308 2803071 2854056 2911593 2975249 3047015 3126848 3212871
57414 3212871 3305743 3408533 3522576 3647254 3783020 3930880 4089735 4257684 4434445 4618684
57404 4618684 4804474 4984100 5152497 5304929 5432403 5524256 5574262 5580641 5542455 5460883
57394 5460883 5342467 5196253 5028626 4844524 4651287 4456318 4262605 4071278 3886716
57385 3886716 3714208 3554181 3403876 3263245 3134285 3016187 2906504 2805823 2716037 2635199
57375B635199p5833p0889o3346n6639n3773n1960m8106m3864m1058l7774l3044
57364B058913k9710k8784k6785k2407j9536j9733j8402j2968q342r024j1818j1587
57352A839817q917o867n179k710j021j156j116J2J56p50N40M135N590L837L549
57337A829920O359P369M403K740N705Q368O280L146L696N748N607N039O627Q054
57323A909061P041O486R039J2001J2702J3112J4398J3345R246P428J0533J3412
57311B037804J2296J1592J5158J8350J5941J1153R469R768Q911Q944J2263J5343
57299B186992J4561J2847J3807J4992J3651J3035J6074J8867J7500J5325J6510
57288B354161J8638J8750K0123K5408K9666K8203K5035K5612K7449K6195K4640
$$ plain form
57375 2635199 2559366 2488477 2425131 2368492 2314719 2262759 2214653 2170789 2129731 2091957 2058913
57364 2058913 2029203 2000419 1973634 1951227 1931691 1911958 1893556 1880588 1872246 1863222 1851404 1839817
57352 1839817 1830900 1824033 1818854 1816144 1815123 1813967 1812851 1812863 1813019 1812269 1812809 1816944 1822534 1826371 1829920
57337 1829920 1836279 1843648 1848051 1850791 1856496 1864864 1871144 1874290 1877986 1883734 1889341 1894380 1901007 1909061
57323 1909061 1916102 1922588 1931627 1943628 1956330 1969442 1983840 1997185 2006431 2013859 2024392 2037804
57311 2037804 2050100 2061692 2076850 2095200 2111141 2122294 2131763 2141531 2150442 2159386 2171649 2186992
57299 2186992 2201553 2214400 2228207 2243199 2256850 2269885 2285959 2304826 2322326 2337651 2354161
57288 2354161 2372799 2391549 2411672 2437080 2466746 2494949 2519984 2545596 2573045 2599240 2623880
57277B623880K7030L0392L0203K8958L0570L2078K9602K6662K7859L0098K8969
57266B946301K7674L0531L3633L1680K8339K9840L3787L4312L3042L4766L7329
57255C301234L6224L4498L7709M3280M5005M3936M5046M7289M6728M5113M5955
57244C772017M6726M4365M3200M7580N2349N1164M8482N1963N8521N9944N7439
57233D333750N8307O2338O3952O4236O8535P5210P8531P9755Q3959Q9190R0070
57222E147833Q8646R0245R2248Q8682Q2142P9065P6909O8543N5918M6711M0444
57211E957386L0670J7950Q189P86q944j8576k2324k2968k7242l2634l1844k7127
57199E823322k6463k8494k5362j8022j4405j4402j0956m323j031j63N196J4166
$$ plain form
57277 2623880 2650910 2681302 2711505 2740463 2771033 2803111 2832713 2859375 2887234 2917332 2946301
57266 2946301 2973975 3004506 3038139 3069819 3098158 3127998 3161785 3196097 3229139 3263905 3301234
57255 3301234 3337458 3371956 3409665 3452945 3497950 3541886 3586932 3634221 3680949 3726062 3772017
57244 3772017 3818743 3863108 3906308 3953888 4006237 4057401 4105883 4157846 4216367 4276311 4333750
57233 4333750 4392057 4454395 4518347 4582583 4651118 4726328 4804859 4884614 4968573 5057763 5147833
57222 5147833 5236479 5326724 5418972 5507654 5589796 5668861 5745770 5814313 5870231 5916942 5957386
57211 5957386 5988056 6006006 6014195 6014981 6006037 5987461 5965137 5942169 5914927 5882293 5850449 5823322
57199 5823322 5796859 5768365 5743003 5724981 5710576 5696174 5685218 5680895 5679864 5679701 5684897 5699063
57187E699063J9725K2421K8420L5681L6601L3071L4108L9659M1418L8701L8624
57176F067492M1304L9934L5081L4074L6545L5003K9317K6130K4868J9238J1591
57165F400577J0594J5507J8020J8470K4523L4973M1375M4800N4323O9560Q1554
57154F814276R0113J02934J18203J26172J27818J33574J43435J46936J43212J41867
57144H088540J43285J37713J25400J17881J17073J12611J02355R5905R5164R1074
57134I227001Q2700P9938Q4125Q5407Q2412Q4799R3129R6081R1064Q7638Q7381
57123A0181675Q0863O7943O0123N9018N3310M0668L1422K6957J6372j430j4609
57112A0602312k1424l4042n5362p4704r0352j12871j42124j65117j80667k01105
$$ plain form
57187 5699063 5718788 5741209 5769629 5805310 5841911 5874982 5909090 5948749 5990167 6028868 6067492
57176 6067492 6108796 6148730 6183811 6217885 6254430 6289433 6318750 6344880 6369748 6388986 6400577
57165 6400577 6411171 6426678 6444698 6463168 6487691 6522664 6564039 6608839 6663162 6732722 6814276
57154 6814276 6904389 7007323 7125526 7251698 7379516 7513090 7656525 7803461 7946673 8088540
57144 8088540 8231825 8369538 8494938 8612819 8729892 8842503 8944858 9040763 9135927 9227001
57134 9227001 9309701 9389639 9473764 9559171 9641583 9726382 9819511 9915592 10006656 10094294 10181675
57123 10181675 10262538 10330481 10390604 10449622 10502932 10543600 10575022 10601979 10618351 10616921 10602312
57112 10602312 10580888 10546846 10491484 10416780 10326428 10213557 10071433 9906316 9725649 9524544
57102I524544k25595k38121k36577k36528k40887k34129k12460j90607j71989
57093G537651j42283j00333o4607m0261j0990K7215N6378P0788Q8110J14871J33950
57082G670489J38543J45112J59474J64155J53381J46169J50132J47267J30634
57073I005356J19092J19727J12538Q9236O9921O4173N4022L2876K0829K2833J3433
57062I724036j7382m6121o2641q8844j29960j56453j57988j64673j89541k03126
57052H507307j92131j86872k00949k03016j80519j68503j79802j72790j26162
57043F896563p4869l1170N2153J93971L44045M80604O57208Q95736J133527J339936
57033A1887704J571175J839125K061186K221634K412669K613766K667398K645700
$$ plain form
57102 9524544 9298949 9060828 8824251 8587723 8346836 8112707 7900247 7709640 7537651
57093 7537651 7395368 7295035 7230428 7190167 7179177 7206392 7262770 7333558 7421668 7536539 7670489
57082 7670489 7809032 7954144 8113618 8277773 8431154 8577323 8727455 8874722 9005356
57073 9005356 9124448 9244175 9356713 9445949 9515870 9580043 9634065 9666941 9687770 9710603 9724036
57062 9724036 9706654 9660533 9597892 9509048 9379088 9222635 9064647 8899974 8710433 8507307
57052 8507307 8315176 8128304 7927355 7724339 7543820 7375317 7195515 7022725 6896563
57043 6896563 6821694 6790524 6842677 7036648 7380693 7861297 8518505 9414241 10547768 11887704
57033 11887704 13458879 15298004 17359190 19580824 21993493 24607259 27274657 29920357
57025B9920357K906098L377030L048213Q45523k855405o123175p177429n888141
57017A8053071l395468p18141J791534L922075N221740N304735M195582K232371
57009C6607499j49480k460778m234717n243102n563954n376957m792060l908896
57001D877555A982405G5248i35791k42908L33925a53006G35045R94080J028415
56992B757540J000119R53288R19672Q79311Q12217P42878O95738O52863N93643
56983A0007269N34084M90826M45965L82678L19565K76772K41671J98529J59816
56974A3057175J38581J20437R1404O4913N4298M5976K5413K998j0699k9135o4322
56963A3497039j01772j25594j46119j78898k17338k48752k77376l09488l34659
$$ plain form
57025 29920357 32826455 36203485 39251698 40097221 37241816 31118641 23941212 18053071
57017 18053071 14657603 13939462 15730996 19653071 24874811 30179546 34375128 36607499
57009 36607499 36458019 33997241 29762524 24519422 18955468 13578511 8786451 4877555
57001 4877555 1982405 75248 -935791 -1178699 -844774 -153006 735045 1729125 2757540
56992 2757540 3757659 4710947 5630619 6509930 7322147 8065025 8760763 9413626 10007269
56983 10007269 10541353 11032179 11478144 11860822 12180387 12457159 12698830 12897359 13057175
56974 13057175 13195756 13316193 13407597 13472510 13526808 13572784 13598197 13601195 13590496 13561361 13497039
56963 13497039 13395267 13269673 13123554 12944656 12727318 12478566 12201190 11891702 11557043
56954A1557043l42972l43381l45768l42208l24555l02974k88493k73838k49388
56945H743466k21981k00497j78370j47387j14271q7692o3041l4640q692R523K6799
56934G723217M8292O8358Q5319J05072J16503Q5966l326j23125k30417l10450
56924G565409l72046m18260m45749m61527m76423m87641m85854m73090m57371
56915C487448m37033m06289l69650l35729l03162k66587k29843j99780j73704
56906G65671j45922j19829j00858q4575o4406m4343l1393k2202r686L407R865
56895A55729J0687J0538O705n419k1325l3332m2133B9837b8303n6326m9847m5571
56883a80047m1968l4139k4937k0060j6987r753j92O105J0613J8063K6095K9214
$$ plain form
56954 11557043 11214071 10870690 10524922 10182714 9858159 9555185 9266692 8992854 8743466
56945 8743466 8521485 8320988 8142618 7995231 7880960 7793268 7730227 7695587 7686895 7696418 7723217
56934 7723217 7771509 7839867 7925186 8030258 8146761 8232727 8229401 8106276 7875859 7565409
56924 7565409 7193363 6775103 6329354 5867827 5391404 4903763 4417909 3944819 3487448
56915 3487448 3050415 2644126 2274476 1938747 1635585 1368998 1139155 939375 765671
56906 765671 619749 499920 399062 314487 250081 205738 174345 152143 142457 145864 155729
56895 155729 166416 176954 183659 178240 156915 123583 81450 29837 -28303 -84629 -134476 -180047
56883 -180047 -222015 -256154 -281091 -301151 -318138 -327891 -328083 -321978 -311365 -293302 -267207 -237993
56871b37993K9425L2603L7250L6472K8359J5937L20j7594l2169l8542l9875m1557
56859b27364m2140l7892l1590k8122k5557j9483j2313r434r669q202n566n090
56847d62422m974j578K575K813J311L519Q350J0499R972J0866J3042J3403J3356
56834c79268J6702K1774K3736K3299K5592L1560L7638M2553M7578N1397f094D2276
56821H6903L8223K6792J4111O322L246k4m685p991r730j2164j4596j4181j1240
56808A00986q269n026K03O289J1361J7019K5110L3045L7817M1592M6990M9954
56796C57071M4416L1721J8344O430n989j7376k3369k4337k4850k5854k4258j9971
56784B91978j6460j4133r661k304N089J1590J9024K7144L3697L9484M7762N8010
$$ plain form
56871 -237993 -208568 -175965 -138715 -102243 -73884 -57947 -57627 -75221 -107390 -145932 -185807 -227364
56859 -227364 -269504 -307396 -338986 -367108 -392665 -412148 -424461 -433895 -443564 -451766 -457332 -462422
56847 -462422 -467396 -468974 -466399 -463586 -462275 -458756 -450406 -439907 -429935 -419069 -406027 -392624 -379268
56834 -379268 -362566 -340792 -317056 -293757 -268165 -236605 -198967 -156414 -108836 -57439 -6094 42276
56821 86903 125126 151918 166029 172351 175597 175573 170888 162897 153167 141003 126407 112226 100986
56808 100986 92717 87691 87894 94183 105544 122563 147673 180718 218535 260127 307117 357071
56796 357071 401487 433208 451552 457982 451993 434617 411248 386911 362061 336207 311949 291978
56784 291978 275518 261385 251724 249420 254509 266099 285123 312267 345964 385448 433210 491220
56772D91220O5281O6025N9901M6266K4519j433k4198l9416m7660n0388m8608m5220
56760D96289m3520m2704l9072l1896k4120j7440j0905m171K112R074J8416K8568
56748C40631L6179M1102M5522M8355M5232L4483J8922J620j5806l0560l8986m0763
56736D85931l9282l7136l4300l0774k7414k3916j9385j4925j2370j0549o433Q
56724B29455N637Q976J1644J4910J8196K0862K2083J9118R647l854j5578k2555
56712C18541k6214k8053k7728k5783k4317k3856k2717k0301j8123j6953j5755
56701F8741j3930j2041j0100p710n908o009F270D97b950k563l689m659m649n143
56687b3653o391o549n148m003l809l202k121k630m976o240m782k959l245m274
$$ plain form
56772 491220 556501 622526 682427 728693 753212 751779 727581 688165 640505 590117 541509 496289
56760 496289 452769 410065 370993 339097 314977 297537 286632 282461 284573 293647 312063 340631
56748 340631 376810 417912 463434 511789 557021 591504 610426 612046 596240 565680 526694 485931
56736 485931 446649 409513 375213 344439 317025 293109 273724 258799 246429 235880 229447 229455
56724 229455 235092 244068 255712 270622 288818 309680 331763 350881 360528 356674 341096 318541
56712 318541 292327 264274 236546 210763 186446 162590 139873 119572 101449 84496 68741
56701 68741 54811 42770 32670 24960 19052 13043 6270 497 -2950 -5513 -9202 -13861 -18510 -23653
56687 -23653 -30044 -36593 -41741 -45744 -49553 -52755 -54876 -57506 -62482 -68722 -73504 -76463 -79708 -83982
56673h3982l261m35J496J243Q7l37K34J055J417J295J308J874K637L147L670M448
56657f4104M807M200L588M301N924O869O618N819M436J765j664l968m167l186
56643b8762k272j531m33J058K241K162O12j203j683q32j03K41J835N141P670P285
56627h574b961B823P808Q803P357M995L433K646J876P66p11k017j878K30K638
56612C8769L077J530O2MP46J154P93j82j234j658j496j763l016m573o113q776
56596A7324D034a4148k1663k4172k7195l0439l2295l2496l2098l1361k9723k7625
56584c03215k6090k4610k1638j7272j3292j0156o066J15O735J1219J2996J3638
56572c77636J4797J6700J8383J8841J7993J6639J5505J4667J3934J3119J1759
$$ plain form
56673 -83982 -87243 -87678 -86182 -84939 -84852 -85189 -84955 -83900 -82483 -81188 -79880 -78006 -75369 -72222 -68552 -64104
56657 -64104 -59297 -55097 -51509 -47208 -41284 -34415 -27797 -21978 -17542 -15777 -17441 -21409 -25576 -28762
56643 -28762 -31034 -32565 -32998 -31940 -29699 -27537 -26925 -28128 -29811 -30643 -30746 -30505 -28670 -23529 -15859 -8574
56627 -8574 -2961 2823 10631 19434 26791 31786 35219 37865 39741 40507 39796 37779 35901 36131 38769
56612 38769 41846 43376 43438 43442 44188 45342 46135 45953 44719 43061 41565 39802 36786 32213 26100 17324
56596 17324 4034 -14148 -35811 -59983 -87178 -117617 -149912 -182408 -214506 -245867 -275590 -303215
56584 -303215 -329305 -353915 -375553 -392825 -406117 -416273 -422339 -422224 -415489 -404270 -391274 -377636
56572 -377636 -362839 -346139 -327756 -308915 -290922 -274283 -258778 -244111 -230177 -217058 -205299
56561b05299R526P268O641P962R369R031P319O018O023O722P062O493N361M817
56547a05687N600O796O806N787N603O910Q010P506O378O191O854P449P820P846
56533a0131c518D26J622J214J815J566O10O21J975L251L439L028K786K573J693
56518B6619rj450q73K188N576O446M709L024L074L699L535L443M782O863P800
56503G9426O940N147L597L289M688O806P758P209O916P925Q835Q128O708O407
56489A69779P203P596O789N089K957J086M82J144J524N82o08n27L89L98j200l599
56473A99084n584o127m718k216o43j099k546l423l519l436l216k679k277k558
56459A55043l253l614l241k178r07k90o57j069o64m41k018m706n965m929l220
$$ plain form
56561 -205299 -195773 -188505 -181864 -173902 -164533 -155502 -148183 -142165 -136142 -129420 -122358 -115865 -110504 -105687
56547 -105687 -100087 -93291 -86485 -80698 -75095 -68185 -60175 -52669 -46291 -40100 -33246 -25797 -17977 -10131
56533 -10131 -3518 426 2048 3262 5077 6643 7253 7874 9849 13100 16539 19567 22353 24926 26619
56518 26619 26610 25160 24287 26475 32051 38497 43206 46230 49304 53003 56538 59981 64763 71626 79426
56503 79426 86366 91513 95110 98399 103087 109893 117651 124860 131776 139701 148536 156664 163372 169779
56489 169779 176982 184578 191367 196456 199413 200499 200981 202125 203649 204231 203623 203096 203485 203883 202683 199084
56473 199084 193500 187373 182655 180439 179796 178697 176151 172728 169209 165773 162557 159878 157601 155043
56459 155043 151790 148176 144935 142757 141850 141560 140903 139834 139170 138729 136711 132005 126040 121111 117891
56444A17891j933n25P71L02j850k829j010J355J448j80j207j268j588k165j743
56429A05469j57J376K132K665L710N171O095N466L530K149K873M834O030O252
56415A57595O826P661P151N324M373N200O076N739N375O093O879O616O110O582
56401B43600P863R401J1173J2419J1455Q296N590N390O436O066L478L2k428k664
56387C26107r15P66M89p59k74K312M440M509L775L598L436K619J650O95r85l107
56371C48356m221m374n413p727r287q958q166q189q345p998p833p976p350n868
56357B46651m839m379l160j280l56k93O92K059R22k789n204m259k623k846l434
56342B14862k256l72L32L65Q51J153O96P37K062L257L173K775K863K468J154L26
$$ plain form
56444 117891 115958 115433 116204 116506 114656 111827 110817 112172 113620 113440 112233 110965 109377 107212 105469
56429 105469 105312 106688 108820 111485 115195 120366 126461 131927 135457 137606 140479 145313 151343 157595
56415 157595 164421 172082 179233 184557 188930 194130 200206 205945 211320 217413 224292 230908 237018 243600
56401 243600 251463 260864 272037 284456 295911 304207 309797 315187 321623 327689 331167 331199 328771 326107
56387 326107 325192 325958 326447 325688 325414 327726 332166 336675 340450 344048 347484 350103 351753 352448 351463 348356
56371 348356 344135 339761 334348 326621 317334 308376 300210 292021 283676 275678 267845 259869 252519 246651
56357 246651 241812 237433 234273 232993 232637 232344 233036 235095 236017 233228 228024 223765 221142 218296 214862
56342 214862 212606 212234 212566 212931 213782 214935 215631 216368 218430 221687 224860 227635 230498 232966 234120 234446
56326B34446P20J263J713L419O240P980Q295R659J2853J5077J4246J1722R048
56313C36681N691J902L2Q28J833J320M44l5j150k403j419J275J721j102l196k125
56297C40297o60j122j303O96K567K371K336M170N237L464J715K947N103N104M100
56282C77022M313M399K557Q64J894M016M403L939M979O899P760P842Q107P867
56268D46861P232Q718J3160J7241J8195J7524J7034J5284J1527R007J0238J2721
56256F04742J3253J2814J3244J3047J0644Q128P563P096M785K562K516K955K138
56243G05487J861L362L897J623m06N50K136J817J991N235Q909R674R259J0624
56229G66019J2479J2799J3592J6904K0139K0636K0774K3356K6184K6755K7796
$$ plain form
56326 234446 235166 236429 238142 241561 247801 255781 264076 273735 286588 301665 315911 327633 336681
56313 336681 342372 344274 344306 345134 346967 348287 348731 348696 347546 345143 343724 344999 346720 345618 342422 340297
56297 340297 339637 338515 337212 337908 340475 342846 345182 349352 354589 358053 359768 362715 367818 372922 377022
56282 377022 381335 385734 388291 389155 391049 395065 399468 403407 408386 415285 423045 430887 438994 446861
56268 446861 454093 462811 475971 493212 511407 528931 545965 561249 572776 581783 592021 604742
56256 604742 617995 630809 644053 657100 667744 675872 683435 690531 695316 697878 700394 703349 705487
56243 705487 707348 710710 714607 716230 715824 716374 718510 720327 722318 727553 736462 746136 755395 766019
56229 766019 778498 791297 804889 821793 841932 862568 883342 906698 932882 959637 987433
56218I87433L2388L7883M0681M2760M7286N1939N3151N3125N6117O1340O5855
56207A529958P0839P8517Q6556R2029R7461J06609J17736J27462J37451J50549
56197B595167J64108J74278J83517J96638K12468K26367K37936K49187K58097
56188D497763K61102K59423K56094K49432K35948K16918J95497J70444J39389
56179F482010J05297P3032M2459J1334j8256m2793o3244q1757r6264j04838j11281
56168F195699j19470j26614j29203j30910j36663j43566j46223j46886j51455
56159D964709j59069j64457j67214j70069j71494j68867j65588j66136j67246
56150C464569j62866j54600j48297j43612j36111j26573j18958j12133j02730
$$ plain form
56218 987433 1019821 1057704 1098385 1141145 1188431 1240370 1293521 1346646 1402763 1464103 1529958
56207 1529958 1600797 1679314 1765870 1857899 1955360 2061969 2179705 2307167 2444618 2595167
56197 2595167 2759275 2933553 3117070 3313708 3526176 3752543 3990479 4239666 4497763
56188 4497763 4758865 5018288 5274382 5523814 5759762 5976680 6172177 6342621 6482010
56179 6482010 6587307 6660339 6702798 6714132 6695876 6653083 6589839 6508082 6411818 6306980 6195699
56168 6195699 6076229 5949615 5820412 5689502 5552839 5409273 5263050 5116164 4964709
56159 4964709 4805640 4641183 4473969 4303900 4132406 3963539 3797951 3631815 3464569
56150 3464569 3301703 3147103 2998806 2855194 2719083 2592510 2473552 2361419 2258689
56141B258689r3102q7376q2983p5308o7033o3276o1318n5414m7974m5220m5205
56130A534480m1322l4577l0938k9377k4408j8006j6841j9447j8224j2935j0147
56119A278258j0315p501j498J693J542L752Q928J1438J0116R735J1445J1592J0239
56106A339424J1199J3669J3199J0473R962J0932R145N953O028P779O008K335K728
56093A448834O643Q740R208J1957J5040J3926J1687J4718K0883K3395K3660K8243
56081A636934L6059M1183M5616N6064P0491Q1259Q9410J02189J18594J31376J41339
56070B550514J55109J70323J77678J76494J73795J69501J57686J41319J30129
56061D002548J24186J14752J00861Q9457P9596O2561L8202J5619k599k1519l9525
$$ plain form
56141 2258689 2165587 2078211 1995228 1919920 1852887 1789611 1728293 1672879 1624905 1579685 1534480
56130 1534480 1493158 1458581 1427643 1398266 1373858 1355852 1339011 1319564 1301340 1288405 1278258
56119 1278258 1267943 1260442 1258944 1260637 1262179 1265931 1274859 1286297 1296413 1306148 1317593 1329185 1339424
56106 1339424 1350623 1364292 1377491 1387964 1397926 1408858 1418003 1423956 1429984 1437763 1443771 1446106 1448834
56093 1448834 1455477 1464217 1473425 1485382 1500422 1514348 1526035 1540753 1561636 1585031 1608691 1636934
56081 1636934 1672993 1714176 1759792 1815856 1886347 1967606 2057016 2159205 2277799 2409175 2550514
56070 2550514 2705623 2875946 3053624 3230118 3403913 3573414 3731100 3872419 4002548
56061 4002548 4126734 4241486 4342347 4431804 4511400 4573961 4612163 4627782 4625183 4603664 4564139
56050D564139m9125n2614o0981p6334r0777j02726j18145j35200j44115j43425
56040C590697j40841j37829j29195j17483j11042j08070r9444q6663p9402p6381
56030B504347o7531n4419m8703n0232m6725l5920k7718k3738j5695n102k996q174
56018B117394p298J259N376K902M910J2606J4119P745N456R494Q555J319K33P368
56004B191438J0191O149P402J5976J8742J3003J2400K0762K4723J9345J6713K1846
55992B378690K4312K1013K2951L2225L6652L4150L7555M8574N2672M6762M5636
55981B781192N3787N7676N3284N3807O2353O5124N9552O0528P0647P3820O6763
55970C458533O6461P7625Q3804P9871Q1481R2957R8840R7053J06258J29535J45621
$$ plain form
56050 4564139 4515014 4462400 4401419 4325085 4234308 4131582 4013437 3878237 3734122 3590697
56040 3590697 3449856 3312027 3182832 3065349 2954307 2846237 2746793 2660130 2580728 2504347
56030 2504347 2436816 2382397 2333694 2283462 2236737 2200817 2173099 2149361 2133666 2128564 2125568 2117394
56018 2117394 2110096 2111355 2116731 2119633 2124543 2137149 2151268 2159013 2164469 2173963 2182518 2183837 2184070 2191438
56004 2191438 2201629 2207778 2215180 2231156 2249898 2262901 2275301 2296063 2320786 2340131 2356844 2378690
55992 2378690 2403002 2424015 2446966 2479191 2515843 2549993 2587548 2636122 2688794 2735556 2781192
55981 2781192 2834979 2892655 2945939 2999746 3062099 3127223 3186775 3247303 3317950 3391770 3458533
55970 3458533 3524994 3602619 3686423 3766294 3847775 3940732 4039572 4136625 4242883 4372418 4518039
55959D518039J47462J53667J70331J78865J74465J78143J96668K09405K09079
55950F136124K15334K32685K36981K20687K09522K16412K21646K16666K23132
55941H129189K49193K72010K83649L08022L52012L88199M07071M36019M84667
55932A1310031N24486N46264N82096O44717P02580P42375P96154Q77087R51154
55923A7676944J004089J070984J165664J249354J306191J378767J489780J602760
55915B7944533J701099J826191J992605K150100K278805K433549K642433K857905
55907D5827220L065069L333631L697862M096926M506377N009411N658846O398338
55899H1593680P206970Q177898R359330J0685546J2178639J4029055J6347506
$$ plain form
55959 4518039 4665501 4819168 4989499 5168364 5342829 5520972 5717640 5927045 6136124
55950 6136124 6351458 6584143 6821124 7041811 7251333 7467745 7689391 7906057 8129189
55941 8129189 8378382 8650392 8934041 9242063 9594075 9982274 10389345 10825364 11310031
55932 11310031 11834517 12380781 12962877 13607594 14310174 15052549 15848703 16725790 17676944
55923 17676944 18681033 19752017 20917681 22167035 23473226 24851993 26341773 27944533
55915 27944533 29645632 31471823 33464428 35614528 37893333 40326882 42969315 45827220
55907 45827220 48892289 52225920 55923782 60020708 64527085 69536496 75195342 81593680
55899 81593680 88800650 96978548 106337878 117023424 129202063 143231118 159578624
55892A59578624J9065372K2232964K6115322L0766967L5880741M1340044M7237333
55885C82217367N2405279N3270472M5687130K8841553O907349j3755667k8872046
55878E26701437l7755858m1718725m2242703m0565092l7800740l4696262l1465895
55871B60456162k8136909k4875585k1860326j9101476j6574789j4362398j2522422
55864A23022257j0970236r611172q462206p542441o768629o058676n431328m915887
55856F3261682m462991m025789l636534l325181l046218k757954k495833k299130
55848C7212052k137482j973338j828172j725423j632026j515636j401253j316859
55840B3681863j239047j143754j056273j000844r52172q84747q20943p84426p53604
$$ plain form
55892 159578624 178643996 200876960 226992282 257759249 293639990 334980034 382217367
55885 382217367 434622646 487893118 533580248 562421801 569329150 555573483 526701437
55878 526701437 488945579 447226854 404984151 364419059 326618319 291922057 260456162
55871 260456162 232319253 207443668 185583342 166481866 149907077 135544679 123022257
55864 123022257 112052021 102440849 93978643 86436202 79667573 73608897 68177569 63261682
55856 63261682 58798691 54772902 51136368 47811187 44764969 42007015 39511182 37212052
55848 37212052 35074570 33101232 31273060 29547637 27915611 26399975 24998722 23681863
55840 23681863 22442816 21299062 20242789 19241945 18289773 17405026 16584083 15799657 15046053
55831A5046053p05591o59947o35661o10091n63669n21901n10015n06735m84635
55822I847808m57209m44813m31776l98371l60454l37823l16321k79180k43726
55813F578135k29723k22134k01446j80872j77930j78126j62470j43663j40626
55804D941145j43163j35339j28356j37013j47799j42734j32091j32360j34244
55795C708046j23031j08814j06355j05873r3141p8342p6474p8997p2863o7972
55785B796184p7772r1212r1459q4727q4312q3834p2402n9248n7534n9956n4770
55774A978958m9469n4679o1372n7807n2473n6685o1323n4478m5316m6533m9732
55763A389091m2482l3569l6547m3639m0824l4198l6551m1572l6293k6330k4358
$$ plain form
55831 15046053 14340462 13680515 13044854 12434763 11871094 11349193 10839178 10332443 9847808
55822 9847808 9390599 8945786 8514010 8115639 7755185 7417362 7101041 6821861 6578135
55813 6578135 6348412 6126278 5924832 5743960 5566030 5387904 5225434 5081771 4941145
55804 4941145 4797982 4662643 4534287 4397274 4249475 4106741 3974650 3842290 3708046
55795 3708046 3585015 3476201 3369846 3263973 3170832 3092490 3016016 2937019 2864156 2796184
55785 2796184 2718412 2627200 2535741 2451014 2366702 2282868 2210466 2151218 2093684 2033728 1978958
55774 1978958 1929489 1874810 1813438 1755631 1703158 1646473 1585150 1530672 1485356 1438823 1389091
55763 1389091 1346609 1313040 1276493 1232854 1192030 1157832 1121281 1079709 1043416 1017086 992728
55752I92728k5520j8173p697o070q539l427N092O052L323O715J1592Q451K805
55739I67332M857R094M638l886n935n574j2297k1041k1362j7375j8933k2278j8773
55726H38467j3436j5317j8811j4073o774p805j2459r650l133l567p715n474J00
55713G20353o14m776l845j938q056j7160j8194j4147j5293j9264j6973j1641j2709
55700E75743j6913j4497q425q653j2774j1214o362p810j3365j3308q977r110j2188
55687D32147j0402o652r563j5765j5148r796r831j4191j3412q187p347j0199q417
55674B93237k981k061m422j751M587N640J656N99K108j023p432r152p011q389
55660B63605j1745r166k462r22m578n254k719m137q713q479l526j335j845J726
$$ plain form
55752 992728 967208 949035 941338 935268 926729 923302 928394 934446 937769 944484 956076 964527 967332
55739 967332 972189 981283 985921 982035 976100 970526 958229 937188 915826 898451 879518 857240 838467
55726 838467 825031 809714 790903 776830 770056 762251 749792 740142 737009 733442 725727 720253 720353
55713 720353 719739 714963 711118 709180 701124 683964 665770 651623 636330 617066 600093 588452 575743
55700 575743 558830 544333 535908 527255 514481 503267 496905 489095 475730 462422 453445 444335 432147
55687 432147 421745 415093 405530 389765 374617 364821 354990 340799 327387 319200 311853 301654 293237
55674 293237 290256 288195 283773 282022 286609 292249 293905 294504 296612 295589 288157 279005 271994 263605
55660 263605 251860 242694 240232 239310 234732 229478 226759 222622 213909 205430 201904 200569 198724 200450
55646B00450Q003Q599L818K539O407Q345O633O621Q509P104L630M445Q312P976
55632B91391L783K761N085M668K088L317O668M812q88k038J468J792j640j546
55618C21721K474K974p57j185L037M620J333n74J495K914J974K199L523K101o47
55603C47202L54L488K755n71k89K171J11m745m326P25J779k059l043P6J04m363
55587C39369o631n396o743j0854j0574n664m850j0657j5172j4070j2234j2300
55575B24224j0251n911n490r779j1568q495p005r897j1425q744o934q424q232
55562A12069m114j178k122k718q88n91l033l640j336j215m394m900m41L134J921
55547H6554m68j013k031m309m276j467m94k486k918n31J51k246l302j629j408
$$ plain form
55646 200450 208453 217052 220870 223409 229816 238161 244794 251415 259924 267028 270658 275103 283415 291391
55632 291391 295174 297935 303020 307688 309776 313093 319761 324573 323685 321647 323115 324907 323267 321721
55618 321721 324195 327169 326412 325227 328264 332884 334217 333643 335138 338052 340026 342225 345748 347849 347202
55603 347202 347556 351044 353799 353228 352939 355110 355221 350476 346150 346875 348654 346595 343552 343628 343732 339369
55587 339369 332738 327342 320599 309745 299171 293507 288657 278000 262828 248758 236524 224224
55575 224224 213973 208062 202572 192793 181225 172730 165725 155828 144403 135659 128725 120301 112069
55562 112069 107955 106777 104655 101937 101049 100458 97425 93785 92449 91234 86840 81940 81499 84633 86554
55547 86554 86086 85073 83042 78733 74457 72990 72496 70010 67092 66561 66712 64466 61164 59535 58127
55532E8127l573l411L83L115K997L702N699M427k62k412m67j6l114m620k332j154
55516E7089l410m494k018k00j184q89K584N050M471M509O303N468J006j567J53
55501G2871J464q6k70K828M271J215k101k652l532o256o678l258j074k841m003
55486D9898j606J04j849l059L72M865N805M574M144L845K950L495N493N257K068
55471H6356K73J662K434P04q9J653K421O13o29m91k560o761p696m471l415p000
55455F3004r043n610j781k199l408j502O91J40j30K473M407K694O15J056R39k029
55439E0317l959k018k88k348m450k484M90M4k053k348k250l841m467j811N39j334
55423A7739m789n074k576n32M74J074L26j449j355R02J394j092k199L31K323P38
$$ plain form
55532 58127 54554 51143 51526 54641 57638 61340 67039 71466 71204 68792 68325 68309 65195 60575 58243 57089
55516 57089 53679 49185 47167 46967 45783 44894 47478 52528 56999 61508 67811 73279 74285 72718 72871
55501 72871 74335 74249 73979 76807 81078 82293 80192 77540 74008 67752 61074 57816 56742 53901 49898
55486 49898 48292 48396 46547 43488 43860 48725 54530 59104 63248 67093 70043 73538 79031 84288 86356
55471 86356 86629 88291 90725 91429 91340 92993 95414 96027 95398 94907 92347 85586 77890 73419 70004 63004
55455 63004 53961 48351 46570 44371 40963 39461 40152 40292 40162 42635 47042 49736 50351 51407 52346 50317
55439 50317 46358 44340 44052 41704 37254 34770 35260 35304 33251 30903 28653 24812 20345 18534 19073 17739
55423 17739 12950 7876 5300 4768 5242 6316 6642 5193 3838 4740 6134 5042 2843 3174 5497 6235
55407F235q97O18K166M80j730j283m91k038b94j676L64k78j522p64L1j144j722
55390g005L12J801J47j478P9K062J125m62M98h22F51L95J232J834k07A448e93
55372a363j002r37J041a59K7k061j148K91n88j549p1J300m2j305N14b082b61j05
55354c66J69H18j05d06C3K011O44j194j42J861J618P68K104L829L095J375R79
55337A6981K85k185l419j127J120l51k892k547q76r87j384Q4Q68j381a074j412
55321b486R13l21k302q73J214n70l453j920K214K916K78p33L47k86k634l043j473
55304a2212j297k635k450n63N01N76J126J052j069k494l6L680L782J035p4P69
55288a0309K68j560j600J45P27j19k05K43o40j807q64J004R82qQ09K320J226j778
$$ plain form
55407 6235 5338 5956 8122 8602 6872 5589 5098 3060 -294 -1970 -1606 -1884 -3406 -4170 -4139 -5283 -7005
55390 -7005 -6693 -4892 -4745 -6223 -6144 -4082 -2957 -3419 -2921 -822 651 1046 2278 4112 3905 1448 -593
55372 -1363 -2365 -3302 -2261 -159 -132 -2193 -3341 -3050 -3638 -5187 -5258 -3958 -4000 -5305 -4791 -2082 -261 -366
55354 -366 -197 818 713 -406 33 2044 2688 1494 1352 3213 4831 5599 7703 11532 14627 16002 16981
55337 16981 17266 15081 11662 10535 11655 11304 8412 5865 4989 4002 2618 2702 3570 2189 -1074 -2486
55321 -2486 -1573 -1894 -4196 -5069 -3855 -4425 -7878 -9798 -7584 -4668 -4390 -5123 -4776 -5062 -7696 -10739 -12212
55304 -12212 -13509 -16144 -18594 -19157 -18656 -18080 -16954 -15902 -16971 -19465 -19501 -15821 -12039 -11004 -11078 -10309
55288 -10309 -10041 -11601 -13201 -13056 -12329 -12448 -12653 -12410 -13050 -14857 -15721 -14717 -13735 -13743 -12934 -10614 -9388 -11166
55270a1166k976j758n76LJ140J920O86j027o43R30J368J511L060c482a599j178
55254b777j210Q25J180j9NO94n88k779k585n20J00q68r27j72o15j464m71J221
55236a0970Q59o14k04J560J888J025J026R31j306l742k944j80N52p75j108m33
55220a4435j154k679k399q69m32j21K267M499K633j810l576j752m7Q6M20Q79l81
55203a8871k189j527R80K183K142L105M016K065j271k106j062j820l733k722Q42
55188a9968K319R45Q22L189M529L352b405D69K415M13n07L85N31r37A089C90K35
55171F25N16J532L021K958J437M59m8j616l254k714j072G92h90KA964L021Q60
55154E845L19J748J669l39r47L89N74r45j279j21m29k234j971Q55K418J269L87
$$ plain form
55270 -11166 -14142 -15900 -16476 -16473 -15333 -13413 -12727 -13754 -14397 -13467 -12099 -10588 -7528 -3482 -1599 -2777
55254 -2777 -3987 -3162 -1982 -2001 -1996 -1302 -1890 -4669 -7254 -7774 -7674 -8542 -9469 -9641 -10256 -11720 -12191 -10970
55236 -10970 -10111 -10725 -10929 -9369 -7481 -6456 -5430 -4499 -5805 -9547 -12491 -12671 -12119 -12894 -14002 -14435
55220 -14435 -15589 -18268 -20667 -21536 -21968 -22089 -19822 -15323 -12690 -14500 -18076 -19828 -19875 -19789 -19369 -18490 -18871
55203 -18871 -21060 -22587 -21607 -19424 -17282 -14177 -10161 -8096 -9367 -11473 -12535 -14355 -18088 -20810 -19968
55188 -19968 -17649 -16704 -15882 -12693 -8164 -4812 -2405 469 2884 3297 2790 3175 3706 2769 1089 390 625
55171 625 1141 2673 5694 8652 10089 10548 10500 8884 5630 2916 1844 792 -890 -888 1964 4985 5845
55154 5845 6164 7912 9581 9242 8295 8684 9258 8313 7034 6913 6484 4250 2279 3134 5552 6821 7208
55137G208J179J206n14j488p53o40j982A799H41M05Q02J494K092P60j317r03J327
55120E501J345j161k061k8J567J210J558L544M209K402J000J366J063q81j826
55105A8808p86o26k680m207l409k226k032j291M91J198M09O05K306K738J103K24
55089A0625J132J051j175k706j930j132j671j527Q0N80q01p64K363N199M647K430
55073A6401J445J412J012O87P90L55k27J137M053M999K718L44K31P69L55L13J579
55056C8373K316J151o06j797k943l631k250L07P99j119k180j251j102k732l019
55041B0316j65L231M739N266N522M054J126m6J603K952K043J045J644K129J401
55026E6860J347K710L249K222K025L063K117j536l734k160j73n64q84J128K626
$$ plain form
55137 7208 8387 9593 9079 7591 6838 6198 4216 1799 841 1246 2048 3542 5634 6394 5077 4174 5501
55120 5501 6846 5685 3624 3596 5163 6373 7931 11475 15684 18086 19086 20452 21515 20634 18808
55105 18808 18022 17396 14716 10509 7100 4874 2842 1551 2042 3240 3649 4254 6560 9298 10401 10625
55089 10625 11757 12808 11633 8927 6997 5865 4194 2667 2747 3327 2526 1762 4125 9324 13971 16401
55073 16401 17846 19258 20270 20957 21747 22102 21875 23012 27065 32064 34782 35126 35357 36126 36481 36794 38373
55056 38373 40689 41840 41234 39437 36494 32863 30613 30920 31719 30600 28420 27169 26067 23335 20316
55041 20316 20151 23382 28121 33387 38909 42963 44089 44043 45646 48598 50641 51686 53330 55459 56860
55026 56860 58207 60917 64166 66388 68413 71476 73593 72057 68323 66163 65990 65426 64542 65670 68296
55011F8296Q06j637r29J643K603J882J264M23j342k263r15P86Q06L91J128J670
54995G4612O75j33Q93K112J729R91J208Q42j202k673j711k45m04p88K40R35n07
54978G6574k127j521j00l01j279j026j94l44p23k30%r36j243L60J683N37j482
54961F7648j872j177r82p01L33M06j577l253k412p51p16j235j50J616J968J451
54945E8596J751K483K562K572K883J912q10k527j304N63L72o90l98J89q55k129
54929F5170j054J735L698M205L928K564K55r06J40J255O62j2P41R34j210l208
54913G8897j943J208K887K943L114K863R08r46J73L539N884N918M729L242K278
54898A15694L401O692R374R515Q927R729J0530R271P244O874P821Q711J0297J3427
$$ plain form
55011 68296 69102 67465 66536 68179 70782 72664 73928 74351 73009 70746 69831 70617 71423 71814 72942 74612
54995 74612 75287 75154 76047 78159 79888 80879 82087 82929 81727 79054 77343 77098 76694 75906 76146 77081 76574
54978 76574 74447 72926 72826 72525 71246 70220 70026 69682 68959 68729 68729 67793 66550 66910 68593 69130 67648
54961 67648 65776 64599 63617 62916 63249 63655 62078 58825 56413 55662 54946 53711 53561 55177 57145 58596
54945 58596 60347 62830 65392 67964 70847 72759 71949 69422 68118 68681 69053 68363 67965 68154 67299 65170
54929 65170 64116 65851 69549 73754 77682 80246 80501 79595 79735 80990 81652 81640 82381 83315 82105 78897
54913 78897 76954 78162 81049 83992 87106 89969 90877 89931 90104 93643 99527 105445 110174 113416 115694
54898 115694 119095 125787 135161 144676 153603 163332 173862 183133 190377 197251 205072 213783 224080 237507
54884B37507J6259J6894J6487J6369J4885J0613N852K933Jn294j0790j3156j3665
54871B94895j5615j8201j8078j5365j3143j2307j1529j0952j1372j1119q266m722
54859A44226l688m392l803k030j304r79J309M496N276L920L919O007P391P058
54845A67406P284R348J1768J3346J4418J4866J4102J3055J2918J2313Q939L609
54833C03372o79l315o280j0151j3344j5126j6113j5984j3880j0964r588r971j0347
54820A67630r942r283q254o563n339n655o286n520l990l201k728j672j224k623
54806I5350m157l608k157k391l851m069k722j298p3J175J074j056k587j133J024
54791F9521K81k351l134j854j243j425j12K257K628N51j263j572j606j659q43
$$ plain form
54884 237507 253766 270660 287147 303516 318401 329014 334866 337799 337800 332506 321716 308560 294895
54871 294895 279280 261079 243001 227636 214493 202186 190657 179705 168333 157214 148948 144226
54859 144226 140538 136146 132343 130313 129009 128030 129339 133835 139111 143031 146950 152957 160348 167406
54845 167406 174690 184038 195806 209152 223570 238436 252538 265593 278511 290824 299763 303372
54833 303372 302693 299378 293098 282947 269603 254477 238364 222380 208500 197536 187948 177977 167630
54820 167630 157688 148405 140151 133588 128249 122594 116308 110788 106798 103597 100869 99197 97973 95350
54806 95350 91193 87585 85428 83037 79186 75117 72395 71097 71024 72199 73273 72217 69630 68497 69521
54791 69521 69802 67451 64317 62463 61220 59795 59683 61940 64568 65119 63856 62284 60678 59019 58176
54776E8176O4m70j364m57J327J455N84J318K943K381J9o49Q78J482K63j75J048
54759F8823J534M02l6J321K569K654L015M073M022K408J439K359L809M653N338
54744A08383N759N121M390N535P768Q203O701O373Q476J0690J1447J2204J4208
54731B15258J6358J7673J8802J9898J9768J8126J5978J3133Q149J410m496q063
54719C51994j0051j1154j1226j0877j1040j0935r326p332o967p494o753n435n911
54706B37493p278o086k130J127K282L589O023P443O860O335P355R127J1470J5316
54692B98926J9332K0260J7898J5752J5518J5167J3718J3187J3885J2456P204J328
54680D64631j969m097p862j2751j6370j8160j9075j9556j9830k0366k0572j9129
$$ plain form
54776 58176 58240 57770 56406 55949 57276 58731 59315 60633 63576 65957 65976 65327 66205 67687 67950 67775 68823
54759 68823 70357 70759 70723 72044 74613 77267 80282 84355 88377 90785 92224 94583 98392 103045 108383
54744 108383 114142 119263 123653 129188 136956 145159 151860 158233 166709 177399 188846 201050 215258
54731 215258 231616 249289 268091 287989 307757 325883 341861 354994 363143 364553 360057 351994
54719 351994 341943 330789 319563 308686 297646 286711 277385 270053 263086 255592 248839 243404 237493
54706 237493 230215 224129 221999 223126 225408 228997 235020 242463 249323 255658 263013 272140 283610 298926
54692 298926 318258 338518 356416 372168 387686 402853 416571 429758 443643 456099 463303 464631
54680 464631 462662 458565 450703 437952 421582 403422 384347 364791 344961 324595 304023 284894
54668B84894j6673j5550j5888j4954j1673q589p630p104m985k345j243j639k452
54655A74169l498m503m306k844j833k032j850k40J303J241M47M16P90L28j096
54640A56492k642l458k811p37J140J106j57n34K29N59J46K40Q07M92m86m61M02
54623A50327K64p54o21N82N86m99K57L397N603M940L556L396L146J734J030K462
54607A79406M121L963L225M030N956P324P916Q405Q790Q999R265Q993P379N735
54593B73507O477R108J0387R314Q547R631J0775J0922J1980J4750J6453J5130
54581D06981J3160J3357J4356J3010R035M372j97n080r969j4067j7006j8311j7734
54568C91907j6940j8274k0814k0768j7126j3510j2516j1991r439o598o302p582
$$ plain form
54668 284894 268221 252671 236783 221829 210156 201567 193937 186833 181848 179503 178260 176621 174169
54655 174169 170671 166168 161862 159018 157185 155153 153303 153063 154366 155607 156054 156470 157260 157588 156492
54640 156492 153850 150392 147581 146844 147984 149090 148933 148399 148628 149187 149333 149573 150380 150872 150386 149925 150327
54623 150327 150591 149837 149216 149798 150384 149885 150142 153539 159142 164082 167638 171034 174180 175914 176944 179406
54607 179406 183527 187490 190715 194745 200701 208025 215941 224346 233136 242135 251400 260393 267772 273507
54593 273507 279984 289092 299479 308793 317340 326971 337746 348668 360648 375398 391851 406981
54581 406981 420141 433498 447854 460864 469899 474271 474074 468994 459025 444958 427952 409641 391907
54568 391907 374967 356693 335879 315111 297985 284475 271959 259968 250529 243931 237629 230047
54556B30047p410n359l251j788n20J84j57n31K36J524K066J946J893J760J102
54541B21742j4j548l317l875j881Q64O70k838n841n791m541m460m960m956n390
54526A73864o858p591o320m591l941l440k204j614k626l566l084k549l278m017
54512A18185l643l445m146l652o64K350K761J692J313J033l02j133J96J858J345
54497A13748j45J80J935K635K103K117K804K783K066J805J917J584J174J247R56
54482A38909j61k66K200N496O811O207N762O121O569P254Q615R692R343Q163P026
54467B27741N213K033j308l568n361p008o780m011j640k564n333o663o379o416
54453A77956o712n848m566m758n793n369l611k952m153n328m903l088o80J381
$$ plain form
54556 230047 222637 217278 214027 212239 211719 211903 211746 211215 211451 212975 215041 216987 218880 220640 221742
54541 221742 221728 220180 216863 212988 211107 211971 212641 209803 203962 198171 193630 189170 184210 179254 173864
54526 173864 167006 159415 153095 148504 144563 141123 138919 137305 134679 131113 128029 125480 122202 118185
54512 118185 114542 111097 106951 103299 102635 104985 107746 109438 110751 111784 111482 110349 110545 112403 113748
54497 113748 113603 113783 115718 118353 120456 122573 125377 128160 130226 132031 133948 135532 136706 137953 138909
54482 138909 138748 138482 140682 146178 152989 159196 164958 171079 177648 184902 193517 203209 212552 220715 227741
54467 227741 232954 234987 233679 230111 224750 217742 210962 206951 205311 202747 197414 190751 184372 177956
54453 177956 171244 165396 160830 156072 150279 144910 141299 138347 134194 128866 123963 120875 120195 121576
54439A21576J779K08j600j911j120k83Q32K358K812J423J77R53K311J884J92p73
54423A30818j076j812k073l35K284L434L136K947K684J272k31J16J620J973J168
54408A45925J110J945J966Q57j00o74j698k734k521j434q31m78O88J886J443q2
54392A45268o54k11n15j809k451j782p55J70J329K207J821O15n1L7K19N41J068
54375A45047O86j212k889k536j282j369k456k484j323n84n31j05N93N61J29L50
54359A30595Q93R51J246K493L033J097j584j686Q78L293M265M821N223M523L071
54344A63112K333K343K172K454M368O539O250L716J984K499L769M444M781M940
54330B15704M621M505N537O787O508M975L768K760N54k458m399m914n165n309
$$ plain form
54439 121576 123355 123563 121963 120052 118932 118649 119481 121839 124651 126074 126251 127204 129515 131399 131591 130818
54423 130818 129742 127930 125857 125522 127806 131240 134376 137323 140007 141279 141048 141164 142784 144757 145925
54408 145925 147035 148980 150946 151803 151703 151029 149331 146597 144076 142642 141811 141333 142021 143907 145350 145268
54392 145268 144614 144403 143888 142079 139628 137846 137091 137261 138590 140797 142618 143233 143182 143219 143438 143979 145047
54375 145047 145733 144521 141632 139096 137814 136445 133989 131505 130182 129598 129067 128962 129555 130116 130245 130595
54359 130595 131488 132439 133685 136178 139211 140308 138724 137038 137916 141209 145474 150295 155518 160041 163112
54344 163112 165445 167788 169960 172414 176782 183321 189571 193287 195271 197770 201539 205983 210764 215704
54330 215704 220325 224830 230367 237154 243662 248637 252405 255165 255719 253261 248862 243948 238783 233474
54316B33474m764m377n362o636o278m945m642m853l461r88j77j474k627k699k838
54301A77353l092k190n77%PJ437L532L295P05p90K19J262P96O92K304L799L524
54284A92276K850L539M804M966M014L014K613L098M297N009M327L454M014M911
54270B47186L763J134o9N70M43j340k670k695l431n676p070o148m912n395o577
54255B07113o805o656p221p830p474o660o087n321m109l296l208k931k278k482
54241A34755l822m541l338j151M38R73M86r79k499k717j807j273j535j708j818
54226A09464k763l839l137r13K85m58j205q15p38j914k712j648J78R76P10K77
54210I1748O4L23J353K418K207Q78j52n95j249j546PK598L323J482k56K9J114
$$ plain form
54316 233474 228710 224333 218971 212335 206057 201112 196470 191617 188156 187168 186991 185517 182890 180191 177353
54301 177353 174261 172071 171494 171494 171501 172938 176470 179765 180470 179680 179899 181161 181957 182649 184953 188752 192276
54284 192276 195126 198665 203469 208435 212449 215463 218076 221174 225471 230480 234807 238261 242275 247186
54270 247186 250949 252083 252014 252584 253027 251687 249017 246322 242891 237215 230145 223997 219085 213690 207113
54255 207113 200308 193652 186431 178601 171127 164467 158380 153059 148950 145654 142446 139515 137237 134755
54241 134755 130933 126392 123054 121903 122341 123314 123800 122821 120322 117605 115798 114525 112990 111282 109464
54226 109464 106701 102862 99725 98812 99097 98639 97434 96619 95881 93967 91255 89607 89785 90761 91471 91748
54210 91748 91812 92135 93488 95906 98113 98991 98839 98244 96995 95449 95456 98054 101377 102859 102603 102632 103746
54193A03746J390J203J133N93m23o09M11J304J438J717K286K013J007Q45J427
54178A19481P01j398k079k09J571R95o21j203j140j467j597j019r18j883k207
54163A07007o27J294J542N99J0j50n91j161j580k294l312l619k888k063j457j86
54147I0524J661K494J723N79k10j129j718o63J240J398k88q93O33J786J204J022
54131I9363K398K861Q65p78N38K620K140Q4l96O24O13p76j605j248r06j170j670
54114A03557k445l562m168l662k723j780k14J621J736k87j806j035O9q21k488
54099H1992k494j191m05N1J524L513M411M108L402K204O39K12J522K460J236o13
54083A02571q48k15n98j356p55N47P35K62O97J418Q60j13L85J354J24k863m159
$$ plain form
54193 103746 105136 106339 107472 108065 107642 107033 107444 108748 110186 111903 114189 116202 117209 118054 119481
54178 119481 120182 118784 116705 116496 118067 119062 118441 117238 116098 114631 113034 112015 111097 109214 107007
54163 107007 106380 107674 109216 109815 109825 109675 109084 107923 106343 104049 100737 97118 94230 92167 90710 90524
54147 90524 92185 94679 96402 96981 96771 95642 93924 93261 94501 95899 95611 94718 95351 97137 98341 99363
54131 99363 101761 104622 105487 104709 105247 107867 110007 110091 109695 110319 110932 110156 108551 107303 106397 105227 103557
54114 103557 101112 97550 93382 89720 86997 85217 85003 86624 88360 88073 86267 85232 85301 84480 81992
54099 81992 79498 78307 77902 77953 79477 82990 87401 91509 94911 97115 97754 97966 99488 101948 103184 102571
54083 102571 101723 101508 100910 99554 98799 99346 100081 100343 101040 102458 103318 103205 103590 104944 105068 102205 98046
54066I8046k254O76K178J832P5k487m214l418p94J092R85j50j180j839j866j020
54050H5662j1K67J76N42R05K78q38j041j55Q95J818K818L279K408Q07k61o77j001
54032I5871r52n8Q56O49k87q20j007j439j471o5K112L317L020J969O40p80j579
54015I9976j437j428k411l187k050N53K740L763M104L715K214L64m72j06N87J015
53999A07940R59K13o01m2J971L276K322N17l5N96J364K556M472N383L648P89k43
53982A35085J047K956M605O046O385M796K767K565L927M913N387O834R143J0476
53968B06932J0163R263Q326P136O288O584P152O601N706O250P729Q015P042O690
53954C09877P043O001L147R04R22J890K043J396N60o21k130l146l317l319l587
$$ plain form
54066 98046 95792 96468 98646 100478 100553 98066 93852 90434 89640 90732 91717 91567 90387 88548 86682 85662
54050 85662 85651 85918 86094 86636 87541 87819 86981 85940 85785 86680 88498 91316 94595 97003 97810 97549 96872 95871
54032 95871 94919 94861 95717 96366 96079 95259 94252 92813 91342 91277 93389 96706 99726 101695 102335 101555 99976
54015 99976 98539 97111 94700 91513 89463 90016 92756 96519 100623 104338 106552 106916 106444 106338 106925 107940
53999 107940 108899 109112 108511 108469 110440 113716 116038 116555 116520 117116 118480 121036 125508 130891 134539 135328 135085
53982 135085 136132 139088 143693 149739 156124 160920 163687 166252 170179 175092 180479 187313 196456 206932
53968 206932 217095 226358 234684 241820 248108 254692 261844 268445 274151 280401 288130 296145 303187 309877
53954 309877 316920 322921 326068 326972 327894 329784 331827 333223 333783 333162 331032 327886 324569 321250 317663
53939C17663l809m045m777n589n352m058l008k838k905k825l088l705l667k374
53925B65623o17K67l88k151l690l825k958k673l204k731n05J131j25k773l427
53910B37954j681k02n51j571j922j647r69K19J249R79m25j586j808j413m79J012
53894B27159K029J364l74j348q77L07J696L159L956L481K631K634L037K743K405
53879B54002L503N650P031P237P377P812Q011Q213Q829Q691O378K939P09j68j381
53864C34833l012l490k767k344j965L12M191O536N793M154M083N311O503P507
53850C65645Q440Q562P596O706O970Q102R313J0245J0638J0404J0199J0424R920
53837D83164P497M481L354L875L268O02j775k041j437j763k714l220l571m622
$$ plain form
53939 317663 313854 309809 305032 299443 294091 290033 287025 284187 281282 278457 275369 271664 267997 265623
53925 265623 265006 265273 264885 262734 259044 255219 252261 249588 246384 243653 243148 244279 244154 241381 237954
53910 237954 236273 236071 235520 233949 232027 230380 229411 229630 230879 231858 231433 229847 228039 226626 226147 227159
53894 227159 229188 230552 230178 228830 227953 228260 229956 233115 237071 240552 243183 245817 248854 251597 254002
53879 254002 257505 263155 270186 277423 284800 292612 300623 308836 317665 326356 332734 335673 336382 336214 334833
53864 334833 331821 328331 325564 323220 321255 321567 325758 332294 338087 342241 346324 351635 358138 365645
53850 365645 374085 382647 390243 396949 403919 412021 421334 431579 442217 452621 462820 473244 483164
53837 483164 490661 495142 498496 502371 505639 506241 504466 502425 500988 499225 496511 493291 489720 485098
53823D85098o180p457q167q348q156q289r431j0990j1617j1123j0603j0530j0305
53810C63902r659q898p762n851m177m385o222p679p720p013o051m677l608m146
53796B76054o070p748q464q609p884n752l544l193l863k893m15M22j490l426l458
53781B09667l279m517n469m041j457k92n50k95J049K250K368J519J50j162j810
53766A94131j966k417l094k913j604k17O44J464K103J449l30j170L9J715J934
53751A89768J043O24J253K458L671M182L334J720J015J907L365M535N770P147
53737B31792P739P255O841P323Q046Q360Q691R299R569R373R511R958R315O999
53723C50071M418L012K704L062M169N325M849K534O30R49K435K950J948K3k585
$$ plain form
53823 485098 478918 471461 463294 454946 446790 438501 429070 418080 406463 395340 384737 374207 363902
53810 363902 354243 345345 337583 331732 327555 323170 316948 309269 301549 294536 288485 283808 280200 276054
53796 276054 269984 262236 253772 245163 237279 231527 227983 224790 220927 218034 217619 218041 216551 213125 209667
53781 209667 206388 201871 196402 192361 190904 190612 190062 189767 190816 193066 195434 196953 197103 195941 194131
53766 194131 192165 189748 186654 183741 182137 181920 182564 184028 186131 187580 187250 186080 186119 187834 189768
53751 189768 190811 191435 192688 195146 198817 202999 206333 208053 209068 210975 214340 218875 224645 231792
53737 231792 239531 246786 253627 260950 268996 277356 286047 295346 304915 314288 323799 333757 343072 350071
53723 350071 354489 357501 360205 363267 367436 372761 377610 380144 380774 381723 384158 387108 389056 389079 386494
53708C86494n400o878o076m367l996n291o524o085m015j675n09p45j199q52l05
53693C32577o85j604j822j572k269l863m667m114l517l653l813l715m161n009
53679B88113m814l340k250k366k499j913j604j931j481K23J125l90k821l597k306
53664B58149k81J510K603K432J097k17o07k09Q48K686M400M544L497L285M344
53649B88081M872M169L942N069N872N243M802O015P697Q422R022J0383J1040R501
53635C84130P006N459M394K600J110J794M117N910O528O857P154O928O350N869
53621D56206N192M256M082N120N926N346M612N309O495O155M455L331L511M052
53607E24048M430N019N707N595M159J731p84k189j826o59l00o00J15J837K313
$$ plain form
53708 386494 381094 374216 368140 363773 359777 354486 347962 341877 337862 336187 335678 334933 333734 332882 332577
53693 332577 331892 330288 328466 326894 324625 320762 316095 311981 308464 304811 300998 297283 293122 288113
53679 288113 283299 279959 277709 275343 272844 270931 269327 267396 265915 266138 267263 266873 264052 260455 258149
53664 258149 257868 259378 261981 264413 265510 265293 264686 264477 265325 268011 272411 276955 280452 283737 288081
53649 288081 292953 297122 301064 306133 312005 317248 322050 328065 335762 344184 353206 363589 374629 384130
53635 384130 391136 396595 400989 403589 404699 406493 410610 416520 423048 429905 437059 443987 450337 456206
53621 456206 461398 465654 469736 474856 480782 486128 490740 496049 502544 508699 513154 516485 519996 524048
53607 524048 528478 533497 539204 544799 548958 550689 549905 547716 545890 545231 544931 544331 544446 546283 548596
53592E48596O79q85p29m37j844l790m263l758l844m102l266j900j332j143k66
53577E17716O86P47Q61K125K998J270k046l745k812r97M50J913L446M302M501
53562E31415M781N055M704M124M149M405M026L518M114N813P617R070R993R672
53548F12456Q075O764O874P407P378P990J0303J2532J2610J1942J3208J5498J5518
53535G48555J3157J1841J3120J4681J4510J3656J3569J3693J3257J3125J4141
53524H97305J5331J5237J3942J2642J2112J2299J2657J2503J1711J1040J1046
53513A037825J0976R762P695N906M695L557K438J596P72k12o58j99k4j235k840
53498A080054l073k039j121n36L72R99k8k368m055m063l065j928j090j152k226
$$ plain form
53592 548596 549275 548390 547661 547224 545380 541590 537327 533569 529725 525623 522357 520457 519125 517982 517716
53577 517716 518402 519149 520010 522135 525133 526403 524357 520612 517800 516803 517253 519166 522612 526914 531415
53562 531415 536196 541251 545955 550079 554228 558633 562659 566177 570291 576104 583721 592791 602784 612456
53548 612456 620531 627295 634169 641576 648954 656944 667247 679779 692389 704331 717539 733037 748555
53535 748555 761712 773553 786673 801354 815864 829520 843089 856782 870039 883164 897305
53524 897305 912636 927873 941815 954457 966569 978868 991525 1004028 1015739 1026779 1037825
53513 1037825 1048801 1058563 1066258 1072164 1076859 1080416 1082854 1084450 1085222 1085010 1084352 1084153 1084129 1082894 1080054
53498 1080054 1076981 1074942 1073821 1073285 1073657 1074656 1074628 1072260 1068205 1064142 1061077 1059149 1058059 1056907 1054681
53483A054681l132k889k412k901l342j931P66K533K908L327M150M379M144M686
53469A064967N668N415M243M702P654J0792J2129J2647J4097J6236J7755J8504
53457A194809J9431K1207K3786K6604K8756K9856L0780L2531L4554L5632L6187
53446A514133L7928M1026M3555M4219M4080M4945M7292N0346N3125N5072N6536
53435B032257N8615O1620O4187O5042O5069O6047O7915O9213O9761P0779P2433
53424B762938P3535P3776P4193P5081P5454P5012P4743P5105P5396P5278P5214
53413C585725P5027P3859P1911P0395O9343O7315O3765N9900N6574N3151M9244
53402D296209M5776M3380M1266L8571L5647L3186L1286K9900K9060K8036K5510
$$ plain form
53483 1054681 1051549 1048660 1046248 1043347 1040005 1038074 1038840 1041373 1044281 1047608 1051758 1056137 1060281 1064967
53469 1064967 1070635 1076050 1080293 1084995 1092649 1103441 1115570 1128217 1142314 1158550 1176305 1194809
53457 1194809 1214240 1235447 1259233 1285837 1314593 1344449 1375229 1407760 1442314 1477946 1514133
53446 1514133 1552061 1593087 1636642 1680861 1724941 1769886 1817178 1867524 1920649 1975721 2032257
53435 2032257 2090872 2152492 2216679 2281721 2346790 2412837 2480752 2549965 2619726 2690505 2762938
53424 2762938 2836473 2910249 2984442 3059523 3134977 3209989 3284732 3359837 3435233 3510511 3585725
53413 3585725 3660752 3734611 3806522 3876917 3946260 4013575 4077340 4137240 4193814 4246965 4296209
53402 4296209 4341985 4385365 4426631 4465202 4500849 4534035 4565321 4595221 4624281 4652317 4677827
53391D677827K1135J5895J0507M743j361p031j2080j7479k3856l0473l6264m1053
53379D560510m5267m9236n3059n6549n9148o0676o1975o4036o6698o9148p1230
53368C903488p3028p3630p1948o8660o5746o4126o3048o1726n9983n7378n3353
53357C190862m8440m3832l9566l4557k8545k2566j7408j2812q322l652J798Q415
53345B941375J5430K1677K7162L2723L8493M4064M9645N5373O0030O2438O3838
53334C412248O6931P2407P8294Q2830Q6325R0041R4838J00920J07579J13331J17709
53323D423453J22336J28661J35475J40692J44773J50007J56839J63434J68485
53314E734155J71937J73361J72498J71226J71966J73831J73435J69864J65814
$$ plain form
53391 4677827 4698962 4714857 4725364 4730107 4728746 4721715 4709635 4692156 4668300 4637827 4601563 4560510
53379 4560510 4515243 4466007 4412948 4356399 4297251 4236575 4174600 4110564 4043866 3974718 3903488
53368 3903488 3830460 3756830 3684882 3616222 3550476 3486350 3423302 3361576 3301593 3244215 3190862
53357 3190862 3142422 3098590 3059024 3024467 2995922 2973356 2955948 2943136 2934814 2931162 2932960 2941375
53345 2941375 2956805 2978482 3005644 3038367 3076860 3120924 3170569 3225942 3285972 3348410 3412248
53334 3412248 3479179 3551586 3629880 3712710 3799035 3889076 3983914 4084834 4192413 4305744 4423453
53323 4423453 4545789 4674450 4809925 4950617 5095390 5245397 5402236 5565670 5734155
53314 5734155 5906092 6079453 6251951 6423177 6595143 6768974 6942409 7112273 7278087
53305G278087J63057J59888J54213J46499J38199J29720J21300J13951J08095
53296H513009J02724R6650Q9247P9751O7804N4923M3130L1886J8886M103r936
53285I092177k2701l7265n5934p6977r7336j15961j32648j45986j54849j60452
53275H092068j64915j68840j71655j73282j74086j74225j73985j73861j73694
53266F543525j72815j71329j69933j68316j65470j61612j57853j53813j47898
53257E074486j40192j32673j26072j19168j11593j04593r8302r1337q4082p9137
53247C987337p6918p3946o7388n8686n0733m4057l7892l2547k8289k3904j8693
53236C474284j4185j1778j0356q239n678l355k91M413R253J2230J4003J7009K2144
$$ plain form
53305 7278087 7441144 7601032 7755245 7901744 8039943 8169663 8290963 8404914 8513009
53296 8513009 8615733 8712383 8801630 8881381 8949185 9004108 9047238 9079124 9098010 9102113 9092177
53285 9092177 9069476 9032211 8976277 8899300 8801964 8686003 8553355 8407369 8252520 8092068
53275 8092068 7927153 7758313 7586658 7413376 7239290 7065065 6891080 6717219 6543525
53266 6543525 6370710 6199381 6029448 5861132 5695662 5534050 5376197 5222384 5074486
53257 5074486 4934294 4801621 4675549 4556381 4444788 4340195 4241893 4150556 4066474 3987337
53247 3987337 3910419 3836473 3769085 3710399 3659666 3615609 3577717 3545170 3516881 3492977 3474284
53236 3474284 3460099 3448321 3437965 3429726 3424048 3420693 3420402 3424815 3434068 3446298 3460301 3477310 3499454
53223C499454K8206L3804L8317M1771M5021M9283N4476N9221O3130O7390P2130
53212D052203P5302P5613P4602P4244P4353P4051P3751P3784P2818O9881O6373
53201D856975O4034O2202N9186N5053N1022M7165M2703L7635L2261K6045J8499
53190E352780J0321K277n942j4524k2608k9943l7953m7618n7747o6803p4886q2350
53178D925004q8270r2048r4875r7770r9841j00427j00998j02674j03658j01790
53168C942653r8264r6002r5421r4674r3267r2614r3191r3645r2887r1261q9593
53157B911834q8459q8139q8092q6959q4105q0342p6361p1751o6661o2707o0637
53146B057621n8743n5380n1545m9011m7426m5492m3627m3026m3030m1848l9255
$$ plain form
53223 3499454 3527660 3561464 3599781 3641552 3686573 3735856 3790332 3849553 3912683 3980073 4052203
53212 4052203 4127505 4203118 4277720 4351964 4426317 4500368 4574119 4647903 4720721 4790602 4856975
53201 4856975 4921009 4983211 5042397 5097450 5148472 5195637 5238340 5275975 5308236 5334281 5352780
53190 5352780 5363101 5365378 5359436 5344912 5322304 5292361 5254408 5206790 5149043 5082240 5007354 4925004
53178 4925004 4836734 4744686 4649811 4552041 4452200 4351773 4250775 4148101 4044443 3942653
53168 3942653 3844389 3748387 3652966 3558292 3465025 3372411 3279220 3185575 3092688 3001427 2911834
53157 2911834 2823375 2735236 2647144 2560185 2476080 2395738 2319377 2247626 2180965 2118258 2057621
53146 2057621 1998878 1943498 1891953 1842942 1795516 1750024 1706397 1663371 1620341 1578493 1539238
53135A539238l6581l4707l3797l4109l5227l5510l4031l2116l1292l1023l0292
53124A170553k9865l0700l1438l0163k7623k6244k6584k7167k7121k6668k5595
53113H61385k3500k1193j9831j9175j8311j7382j6887j6351j5398j5007j5736
53102F62614j6097j4743j2856j2050j1545j0021q528q580q855p238n011n282p965
53089E33843r972j0017r603r343q077n921m688m490l272n43J299N31j574k975
53075D65198l266k947k332j996k484l099k573j151j88L09J561L384M065L210K492
53060D60183K987L827M042L860L587L026K390K239K248J626O34j7r62l158n413
53045D81099n519l875l283m788o418o639o403o765p048o602o254o668p124p056
$$ plain form
53135 1539238 1502657 1467950 1434153 1400044 1364817 1329307 1295276 1263160 1231868 1200845 1170553
53124 1170553 1140688 1109988 1078550 1048387 1020764 994520 967936 940769 913648 886980 861385
53113 861385 837885 816692 796861 777686 759375 741993 725106 708755 693357 678350 662614
53102 662614 646517 631774 618918 606868 595323 585302 576774 568194 559339 552101 547090 541808 533843
53089 533843 523871 513854 504251 494908 486831 480910 476222 471732 468460 467917 469216 469747 468173 465198
53075 465198 461932 458985 456653 454657 452173 449074 446501 445350 445162 445471 447032 450416 454481 457691 460183
53060 460183 463170 466997 471039 474899 478486 481512 483902 486141 488389 490015 490649 490632 489670 486512 481099
53045 481099 475580 471705 468422 463634 457216 450577 444174 437409 430361 423759 417505 410837 403713 396657
53031C96657p108p527p216n612m048m068n446o854p384o704m898k866j881k085
53017C22960k390k192k011k105j902j209p53r07j043o83k77l37p16j125j472j558
53001C02280j208p26m61k07J11k05j447k377j835p96j007k174k457j436l93J40
52985B85802Q94J889K175J671J265Q75m10k154k746k092j990l320m913n602n286
52970B66058l685m55K801L219M97k271k683j812j600j735r73J62J97p31j123n11
52954B55355o2q55k510l731l618k475j403j111j324j512j535j196r9J184J003
52939B36111j097l024k649o21J080K158L365L896K296m29j466m1J914K954L423
52924B47870L525K725J608J712L016L852L746L966M954N652N842O565P664P640
$$ plain form
53031 396657 389549 382022 374806 369194 365146 361078 355632 348778 341394 334690 329792 326926 325045 322960
53017 322960 320570 318378 316367 314262 312360 311151 310398 309491 308448 307765 307488 307151 306435 305310 303838 302280
53001 302280 301072 300346 299885 299678 299789 299584 298137 295760 293925 293129 292122 289948 287491 286055 285662 285802
52985 285802 286696 288585 290760 292431 293696 294571 294161 292007 289261 287169 285179 281859 276946 271344 266058
52970 266058 262373 261918 264719 267938 268435 266164 263481 261669 260069 258334 257361 257523 257720 256989 255866 255355
52954 255355 255293 254438 251928 248197 244579 242104 240701 239590 238266 236754 235219 234023 233924 235108 236111
52939 236111 235014 231990 229341 228720 229800 231958 235323 239219 241515 241086 239620 239579 241493 244447 247870
52924 247870 251395 254120 255728 257440 260456 264308 268054 272020 276974 282626 288468 295033 302697 310337
52910C10337O563O431P654P993O128L716K609K343J821J195P67N0r28j337j557
52895C53785l133n735o690m961k968k878l520k985j943k107l252l909l722l147
52881C02835k099n52O72J103J273J121m76l289m786l384r04lo78j126n77N37J763
52864B91430K273P18k614m877l849q96J105J504J588J762J414Q32R80J524J123
52849B94017l47j502j429p52m82o86n08Q08K746L495J931m72r92Q76K891L220
52833C02814K436J767J333J019J303K083K391K212K817M272M668L096J245O12
52819C34068K46q66j403K8K009K247J097O90J473J976J379K76o66j104o06O58
52803C41502J470J127N75Q10J337J517K018L247L987L413K985M175N802O030N654
$$ plain form
52910 310337 316900 323331 330985 338978 345106 348822 351431 353774 355595 356790 357557 357607 356679 355342 353785
52895 353785 350652 344917 338227 333266 330298 327420 323900 320915 318972 316865 313613 309704 305982 302835
52881 302835 300736 300184 300856 301959 303232 304353 303877 300588 295802 292418 291514 291511 290833 289707 289130 289667 291430
52864 291430 293703 294421 291807 286930 283081 282185 283290 284794 286382 288144 289558 290390 291370 292894 294017
52849 294017 293670 292168 290739 289987 289505 288819 288311 289119 291865 295360 297291 296819 295827 296703 299594 302814
52833 302814 305250 307017 308350 309369 310672 312755 315146 317358 320175 324447 329115 332211 333456 334068
52819 334068 334314 333448 332045 332073 334082 336329 337426 338116 339589 341565 342944 343220 342554 341450 340844 341502
52803 341502 342972 344099 344674 345484 346821 348338 350356 353603 357590 361003 363988 368163 373965 379995 385649
52788C85649O506P688O659L693K021L212N314O181O165O363O313M882K170n60
52774D52256k263k803k791l014l559l615k787k185l192n443p099p145o398o110
52760C93852o516o885o521n470m451m063m029l674l088k996l415l461k780k075
52746C34428j866j996k583l965n197m460j897k15j129k932l108j798q61r37j298
52731C00186j699k339k755k472k210k853l861m077l515k948k435j761j508k249
52717B63504l214l216k277j249m94j78q76k503l621l299k735l401m521m220k498
52702B25202j154j192j961k622k961k912k598k525k866k994k542k045j719p72
52688A94339Q48J430j93k569l553l240l203l805m203m172m027l452k230j358j669
$$ plain form
52788 385649 392155 399843 406502 410195 412216 415428 420742 426923 433088 439451 445764 450646 452816 452256
52774 452256 449993 447190 444399 441385 437826 434211 431424 429239 426047 420604 413505 406360 399962 393852
52760 393852 387336 380451 373930 368460 364009 359946 355917 352243 349155 346159 342744 339283 336503 334428
52746 334428 332562 330566 327983 324018 318821 314361 312464 312249 311120 308188 305080 303282 302421 301484 300186
52731 300186 298487 296148 293393 290921 288711 285858 281997 277920 274405 271457 269022 267261 265753 263504
52717 263504 260290 257074 254797 253548 253054 252876 252000 249497 245876 242577 239842 236441 231920 227700 225202
52702 225202 224048 222856 220895 218273 215312 212400 209802 207277 204411 201417 198875 196830 195111 194339
52688 194339 195187 196617 196424 193855 190302 187062 183859 180054 175851 171679 167652 164200 161970 160612 158943
52673A58943k163j511m07m00j192j191k17M78M97O22J159J712K186K439J617l85
52657A62187j683o27J504K178J305Q88J657K448K681K936L170K664J857K052L234
52642A88451M061L989L556K794J502Q04K213M979O463N304K407r76l920m936k905
52627B13786O43K461J212j598m295o429p454o575m588l569m021m247l190j916
52613A70220j555j738j920k505l626m335l958l096k620k717l242l901l961k933
52599A28113j596r73n27R17K755L099J721L97N6j90q42j070o53o72j363j336j7
52582A27819J055N17p59j220q13m28l01j52l3m5R7M85P01N11K42J92L91J036K130
52563A31425K736J786k33j599j424l36P77J431J188Q7p58n01j46r25j687l15K402
$$ plain form
52673 158943 156780 155269 154862 154462 153270 152079 151862 152340 152837 153459 154618 156330 158516 160955 162572 162187
52657 162187 160504 159877 161381 163559 164864 165752 167409 169857 172538 175474 178644 181308 183165 185217 188451
52642 188451 192512 196501 200057 202851 204353 205157 207370 212349 218812 224116 226523 225547 221627 216691 213786
52627 213786 214429 216890 218102 216504 212209 205780 198326 191751 187163 183594 179573 175326 172136 170220
52613 170220 168665 166927 165007 162502 158876 154541 150583 147487 144867 142150 138908 135007 131046 128113
52599 128113 126517 125544 125017 125934 128689 131788 133509 133906 133962 133772 132930 131860 131207 130535 129172 127836 127819
52582 127819 128874 129391 128632 127412 126599 126171 125870 125718 125685 125640 125737 126222 126923 127434 127676 127868 128259 129295 131425
52563 131425 134161 135947 135714 134115 132691 132355 133132 134563 135751 135838 135080 134579 134433 133508 131821 131506 133908
52546A33908L193J183o63J3J767K246J795K064K828K614J413P33J330K468L097
52531A59989K694J350o2k93R32K392K847K434K137K452L013L083K084L49o55L66
52515A85112K757M424M253L109K321K283K723L224L196K372J542J762K810L466
52501B25354L319K958K463J348P6q9P89J058j53j764k547k530j950l12K496N244
52485B35760O367N234K272j245l367k890r02L30J68l1N94J215J020M00j10n52
52469B44263p54k99K73j20j098r87M26J248L54r23r56k4P45J038Q22l01j923k264
52451B39520k72K584L799K595M41o16K69K016K468P77j201j088Q02K047J698J179
52435B57018J466J669R69k04j531l157l990k213J488L702K709Q51P96J741J421
$$ plain form
52546 133908 137101 138284 137621 137634 139401 141647 143442 145506 148334 150948 152361 153094 154424 156892 159989
52531 159989 162683 164033 163971 163678 164610 167002 169849 172283 174420 176872 179885 182968 185052 185401 184746 185112
52515 185112 187869 192293 196546 199655 201976 204259 206982 210206 213402 215774 217316 219078 221888 225354
52501 225354 228673 231631 234094 235442 235518 235429 236218 237276 237123 235359 232812 230282 228332 228020 230516 235760
52485 235760 242127 247361 249633 248388 245021 242131 241229 241559 241727 241696 242290 243505 244525 244925 244815 244263
52469 244263 243509 243210 243483 243363 242265 241278 241704 242952 243306 242383 241427 241403 242148 243186 244008 243707 241784 239520
52451 239520 239248 241832 245631 248226 248667 248051 248320 250336 252804 253581 252380 251292 252094 254141 255839 257018
52435 257018 258484 260153 261122 260918 259387 256230 252240 250027 251515 255217 257926 258777 259573 261314 262735
52420B62735l5o78J18J399K652L989M956M854L942L020K225J344O75O17R20J030
52404B93763O10o30k537l715k686m06K40j726l878l933k814k607l181k890j447
52389B62163j82l5p55j688k290k447k789l749m137k342N99J421p43k573j163J775
52373B41065K604Q55r98j560j573j549r13M00J356J165J13q35o76P90K167J636
52357B44047l48j071Q03L158L411J831L29m35p79l51J044K011J279l1P0J375K096
52340B58439J843J908K875L942M444M434L960L160K699K888K980K484K220K683
52326C00959K620R82p48l36J908L763M338M471M400L446K026J688K873M340N004
52311C41734M878M139K949K193K820M246M748L704K267J741K249L103L521L057
$$ plain form
52420 262735 262700 262022 262140 263539 266191 270180 275136 279990 283932 286952 289177 290521 291196 291813 292733 293763
52404 293763 294373 293743 291206 287491 284805 284399 284639 282913 279035 275102 272288 269681 266500 263610 262163
52389 262163 261981 261946 261191 259503 257213 254766 251977 248228 244091 241749 242348 243769 243026 240453 239290 241065
52373 241065 243669 244524 243526 241966 240393 238844 237931 238331 239687 240852 240965 240130 239454 240244 242411 244047
52357 244047 243699 242628 243431 246589 250000 251831 252160 251725 250946 250595 251639 253650 254929 254898 254968 256343 258439
52340 258439 260282 262190 265065 269007 273451 277885 281845 285005 287704 290592 293572 296056 298276 300959
52326 300959 303579 304561 303813 303477 305385 309148 313486 317957 322357 325803 327829 329517 332390 336730 341734
52311 341734 346612 350751 353700 355893 358713 362959 367707 371411 373678 375419 377668 380771 384292 387349
52297C87349J964J048P73J037K039M208O707P590O477N443N983O816O328N368
52283D49130N371N441L975J976J829L503M837N109N420N812N070L624L672N748
52269E10517P655P679O685O124N985N634N091M530L779L073L186M360O021P728
52255E88047R350J0344J0161R384R191R710J0066R898R618R428R520J0789J3661
52242G19167J6541J7367J6536J6343J7539J8607J8665J8876K0270K2111K3307
52231I25329K3939K4445K4691K4661K5014K6223K7920K9475L0426L0294K8961
52220A221378K7317K6474K6293K5768K4723K3962K3835K3891K3895K3958K3746
52209A495240K2754K1203J9503J7290J4373J2004J1451J1761J0810Q323N844M033
$$ plain form
52297 387349 389313 390361 391134 392171 394210 398418 405125 412715 419192 424635 430618 437434 443762 449130
52283 449130 454501 459942 463917 465893 467722 471225 476062 481171 486591 492403 497473 501097 504769 510517
52269 510517 518172 525851 532536 538660 544645 550279 555370 559900 563679 566752 569938 574298 580319 588047
52255 588047 597397 607741 617902 627286 636477 646187 656253 666151 675769 685197 694717 705506 719167
52242 719167 735708 753075 769611 785954 803493 822100 840765 859641 879911 902022 925329
52231 925329 949268 973713 998404 1023065 1048079 1074302 1102222 1131697 1162123 1192417 1221378
52220 1221378 1248695 1275169 1301462 1327230 1351953 1375915 1399750 1423641 1447536 1471494 1495240
52209 1495240 1517994 1539197 1558700 1575990 1590363 1602367 1613818 1625579 1636389 1644712 1650556 1654589
52197A654589K271P39M31Q81L65j207k064j779k082l520l982k019O76J962K473
52182A647734M087O516P667O837N784O559R421J2881J5276J6340J7304J9155K1151
52169A796712K1971K1934K2561K3961K4386K2822K0361J8413J7021J5725J4747
52158B020614J4342J4044J3305J2096J0357P871N020K672R42q88k989m727n974
52145B086685p368r007j0315j1369j2801j4174j4192j3052j2638j3732j4847j4598
52133A938592j3456j2213j0619q743p892q750j0032j0298r790r311q742p956p683
52120A813107q031p572n562l652l581m422m156k940k584l424l965l391k361j348
52106A756118k16L10j274m941q298q988p105m645l274l323m284n523o515o927
$$ plain form
52197 1654589 1656860 1657599 1658030 1658911 1659276 1658069 1656005 1654226 1652144 1648624 1644642 1642623 1643299 1645261 1647734
52182 1647734 1651821 1658337 1666004 1672841 1678625 1685184 1694605 1707486 1722762 1739102 1756406 1775561 1796712
52169 1796712 1818683 1840617 1863178 1887139 1911525 1934347 1954708 1973121 1990142 2005867 2020614
52158 2020614 2034956 2049000 2062305 2074401 2084758 2092629 2097649 2100321 2101263 2100375 2097386 2092659 2086685
52145 2086685 2079317 2070310 2059995 2048626 2035825 2021651 2007459 1994407 1981769 1968037 1953190 1938592
52133 1938592 1925136 1912923 1902304 1893561 1885669 1876919 1866887 1856589 1846799 1837488 1828746 1820790 1813107
52120 1813107 1805076 1797504 1791942 1788290 1784709 1780287 1776131 1773191 1770607 1767183 1763218 1759827 1757466 1756118
52106 1756118 1755902 1756212 1754938 1749997 1741699 1732711 1725606 1720961 1717687 1714364 1710080 1704557 1698042 1691115
52092A691115o726o139n498n071n030n559o695p970q578q283p844p987q397q397
52078A592941q180q351q552p920o768o466p385q316q294p761p433p356p548q317
52064A484294r211q973p353n796n497n907o056o057o181n618l691j478o56j201
52050A410619j585r87J00J213K650M612O693Q407R658J0554J1333J2456J4259
52037A489982J6498J8625K0415K1952K3199K4059K4691K5453K6578K8126L0119
52026A749697L2390L4442L5804L6466L6847L7326L7745L7345L5442L2380K9457
52015B135341K7479K5843K3626K1128J9342J8264J6854J4705J2573J0964R297
52004B335416O896L940J043j482l577n291o867q456r696j0155j0100j0082j0013
$$ plain form
52092 1691115 1684389 1678250 1672752 1667681 1662651 1657092 1650397 1642427 1633849 1625566 1617722 1609735 1601338 1592941
52078 1592941 1584761 1576410 1567858 1559938 1553170 1546704 1539319 1531003 1522709 1514948 1507515 1500159 1492611 1484294
52064 1484294 1475083 1466110 1458757 1452961 1447464 1441557 1435501 1429444 1423263 1417645 1413954 1412476 1411820 1410619
52050 1410619 1409034 1408047 1408147 1409360 1412010 1416622 1423315 1431722 1441380 1451934 1463267 1475723 1489982
52037 1489982 1506480 1525105 1545520 1567472 1590671 1614730 1639421 1664874 1691452 1719578 1749697
52026 1749697 1782087 1816529 1852333 1888799 1925646 1962972 2000717 2038062 2073504 2105884 2135341
52015 2135341 2162820 2188663 2212289 2233417 2252759 2271023 2287877 2302582 2315155 2326119 2335416
52004 2335416 2342312 2346252 2347295 2345813 2342236 2336945 2330078 2321622 2311926 2301771 2291671 2281589 2271576
51991B271576r550r126r372r631q530o146m181l580l425k606j206L54K246M460
51977B211283O252P184P807Q608R221R333R437R948J0469J0539J0298R797Q617
51964B328793O882N682N676N914M924K432n98l094m619n390o083p278r011j1141
51950B313089j3854j7132k0147k2200k3838k5815k7411k7477k6745k7121k8826
51939B052523l0460l1899l4493l7865l9466l8469l7429l8374l9727l9239l7808
51928A647294l7837l9239l9756l8488l6719l5709l5608l6194l7049l7251l6293
51917A237151l4980l4283l3848l2787l1183k9554k7738k5682k4451k4761k5256
51906I12628k4019k1315j9166j8480j8354j7987j7532j6938j5475j2871r928p697
$$ plain form
51991 2271576 2262026 2252900 2243528 2233897 2225367 2219221 2215040 2211460 2208035 2205429 2204223 2204577 2206823 2211283
51977 2211283 2217535 2224719 2232526 2241134 2250355 2259688 2269125 2279073 2289542 2300081 2310379 2320176 2328793
51964 2328793 2335675 2341357 2347033 2352947 2357871 2360303 2359705 2356611 2351992 2346602 2340519 2333241 2324230 2313089
51950 2313089 2299235 2282103 2261956 2239756 2215918 2190103 2162692 2135215 2108470 2081349 2052523
51939 2052523 2022063 1990164 1955671 1917806 1878340 1839871 1802442 1764068 1724341 1685102 1647294
51928 1647294 1609457 1570218 1530462 1491974 1455255 1419546 1383938 1347744 1310695 1273444 1237151
51917 1237151 1202171 1167888 1134040 1101253 1070070 1040516 1012778 987096 962645 937884 912628
51906 912628 888609 867294 848128 829648 811294 793307 775775 758837 743362 730491 720563 712866
51894G12866o706o979q122r389j0198j0398r797q130n906m431m246m496m579n206
51880F14283o771p916p289n788n340o090o543o075n595n792o276o510o423o075
51866E25800n727n886o467o346m988l816m456o129o438m687k659j972k179j939
51852D62111q09N80J259N55j297l025l492k896k205j786j524j715k601l236k341
51837D37578l52P66J15r79r22J00P58M54k30o35q96j622k986m299m747m372l908
51820D13823l504k383j99K024K965K519J497M04o56j269q85K51J170J291J026
51805D18074J228K190L250L466K875K624L373M081L408J920J291J682J690J099
51791D52251J308K431K471O16r71n39L17n90k094j251K128N255O194N601M721
$$ plain form
51894 712866 706160 699181 691059 681670 671472 661074 651277 643147 637241 632810 628564 624068 619489 614283
51880 614283 607512 599596 592307 586519 581179 575089 568546 562471 556876 551084 544808 538298 531875 525800
51866 525800 520073 514187 507720 501374 496386 492570 488114 481985 475547 470860 468201 466229 464050 462111
51852 462111 461302 461882 463141 463696 462399 459374 455882 452986 450781 448995 447471 445756 443155 439919 437578
51837 437578 437226 437992 438107 437128 436206 436306 437064 437518 437288 436653 435757 434135 431149 426850 422103 417731 413823
51820 413823 410319 407936 407737 409761 412726 415245 416742 417146 416490 415221 414336 414587 415757 417048 418074
51805 418074 419302 421492 424742 428208 431083 433707 437080 441161 444569 446489 447780 449462 451152 452251
51791 452251 453559 455990 458461 459077 458106 457567 457884 457294 455200 453949 456077 461332 467526 473127 477848
51776D77848L866L017K288J567Q36N49P28M39n56p70P67K304J662k86q84K07R03
51759D94485N07O03J809K462J516M01O01J251O03j299k766k634j357k81l42j205
51743D94354j689j382j257k031k744k168r11m62o95j67J343K442K371J817J333
51728D90154O09l43q58p74o02l35N37J749K252J682O58j84k98J068L626N103L627
51711E07671O89o11RM1j319j881l82J380J796K029L434M648L591P94j414k086
51695E18389k166k511l125l801m227l908k932k281k449k512j485J31J053Q64N3
51680D89093r34j877k533k742k425j266P52K435K191J39j857k737l350m400m998
51665D65491m345l368l281l643l281k195j231o40l53q16k240l640l915l302k567
$$ plain form
51776 477848 481714 484731 487019 488586 489422 489971 490699 491138 490582 489812 490579 492883 494545 494259 493375 493582 494485
51759 494485 494992 495595 497404 499866 501382 501783 502384 503635 504238 502939 500173 497539 496182 495901 495559 494354
51743 494354 492665 491283 490026 487995 485251 483083 482172 481710 481015 480848 482191 484633 487004 488821 490154
51728 490154 490763 490420 489562 488788 488186 487851 488388 490137 492389 494071 494729 494545 494247 495315 498941 504044 507671
51711 507671 508360 507749 507758 507799 506480 504599 504217 505597 507393 509422 512856 517504 521095 521889 520475 518389
51695 518389 516223 513712 510587 506786 502559 498651 495719 493438 490989 488477 486992 487123 488176 489040 489093
51680 489093 488159 486282 483749 481007 478582 477316 478068 480503 482694 482833 480976 478239 474889 470489 465491
51665 465491 461146 457778 454497 450854 447573 445378 444147 443507 443154 442338 440098 436458 432543 429241 426674
51650D26674j546N5J151L96j588k742k295j344o82J42J215J446L80o36l05N44
51634D20865K65p71l92K109M667N314N018O099Q563R968R112P799Q060R366J0092
51619E06134J0445J1937J4537J6188J5145J1335N670m99n357p717q374r111j0403
51606E49930j1484j2233j3081j3177j1039p450n290n680o563o239n840o614p155
51593D38085n744l749l843n777o625n095l086k549k978k781j646n37k59p74j501
51578C91141j822j555j092q51p42n32m51q25j363j418r85p34r30q74K98K445M318
51561C84028M576K970O14j015j237l79Q68J856K074J567J250K089L793N026N080
51546D13160M606M459M632M797N117N867O662O729N832M574L992M834O924R072
$$ plain form
51650 426674 425128 425183 426334 426730 425142 422400 420105 418761 418079 418221 419436 420882 421262 420626 420321 420865
51634 420865 421130 420359 419967 422076 426743 432057 437075 443174 451737 461705 470817 478616 486676 496042 506134
51619 506134 516579 528516 543053 559241 574386 585721 591391 590892 585535 577818 569444 560333 549930
51606 549930 538446 526213 513132 499955 488916 481466 476176 470496 463933 457694 451854 445240 438085
51593 438085 432341 428592 424749 418972 412347 407252 404166 401617 398639 395858 394212 393675 393416 392642 391141
51578 391141 389319 387764 386672 385821 385079 384547 384096 383271 381908 380490 379505 378771 377841 376967 377265 379710 384028
51561 384028 388604 391574 392188 391173 389936 389557 390425 392281 394355 395922 397172 399261 403054 408080 413160
51546 413160 417766 422225 426857 431654 436771 442638 449300 456029 461861 466435 470427 475261 482185 491257
51532D91257J0090R978R693R763R746R170Q184P092N896M667L773L329K984K452
51518E88074J773R39k08j506k473k830k533j277J119L867N673O294O764P780Q805
51503F20261R150R058R072R019Q275O743N165M649N745P539P983N996L016J404
51489G13075J414J104o24k514k978k284j722j711j730j535j439j781k639l833
51475F90803m921n541n951o665p592q203q451q664q648p996p265p527q500q464
51461E86415o527l838k071j736k353l196l433k576j231n53p37j092j491k397l374
51446E49810l371k674k765l811m185l215k289k315k134p85N86O46P7J72O16L94
51430E24757k68n16m12k79M46K116L545L425K328J810K283L202M536O416P933
$$ plain form
51532 491257 501347 511325 521018 530781 540527 549697 557881 564973 570869 575536 579309 582638 585622 588074
51518 588074 589847 590786 590578 589072 586599 583769 581236 579959 581078 584945 590618 596912 603676 611456 620261
51503 620261 629411 638469 647541 656560 664835 671578 676743 681392 687137 694676 702659 708655 711671 713075
51489 713075 714489 715593 714969 712455 709477 707193 705471 703760 702030 700495 699056 697275 694636 690803
51475 690803 685882 680341 674390 667725 660133 651930 643479 634815 626167 618171 610906 603379 594879 586415
51461 586415 579888 576050 573979 572243 569890 566694 563261 560685 559454 558901 558164 557072 555581 553184 549810
51446 549810 546439 543765 541000 537189 533004 529789 527500 525185 523051 522266 522852 523498 523575 523747 524363 524757
51430 524757 524489 523973 523561 523282 523728 525844 529389 532814 535142 536952 539235 542437 546973 553389 561322
51415E61322Q021P128O682P212Q111Q829R188R106Q996R747J1228J1745J0174
51402F77489P706O096N129L521J436K09J4k98j241k243l113m395o119p517q123
51387F68551q203q140q273r171j1008j2896j3618j2875j1150q905o646n060m285
51374E48321l645k927k895l691l942k740j317j179j605q09J243L039L898M251
51360E36002M093L091J914J530J372J3k431m361n119n711p018q795j0453j1461
51346D92666j1160r574q152q180q871q585p534p290p976q122p326o757o717n969
51332C80453m096k582k672l808m914n643n803n144m336m621n780o034m710l380
51318C16930l366l750l022j426k75Qj41o42j717l114m293n039n195m372k649r83
$$ plain form
51415 561322 569343 576471 583153 590365 598476 607305 616493 625599 634595 644342 655570 667315 677489
51402 677489 685195 691291 696420 699941 701377 701586 701600 701302 700061 697818 694705 690310 684191 676674 668551
51387 668551 660348 652208 643935 634764 623756 610860 597242 584367 573217 564312 557666 552606 548321
51374 548321 544676 541749 538854 535163 531221 528481 527164 525985 524380 523571 524814 527853 531751 536002
51360 536002 540095 543186 545100 546630 548002 548015 545584 541223 536104 530393 523375 514580 504127 492666
51346 492666 481506 471932 463780 455600 446729 438144 430610 423320 415344 407222 399896 393139 386422 380453
51332 380453 376357 373775 371103 367295 362381 356738 350935 345791 341455 336834 331054 325020 320310 316930
51318 316930 313564 309814 306792 305366 305091 305099 304958 304316 302599 299485 295192 290153 284958 280586 277937 276954
51302B76954k03j8L50R75J387J479J554J610J272N24L6M81J653K490K322J911
51286B94777K631M485N877N835N420O043P313P844P453O980O448N199L718L385
51272C73408M245M763M189L388K807J448j158l571m393m395n258o974p995p577
51258C52927o602o075n896n539n131n321o264p141o990n906m984m883m979m405
51244B72811l465l224l885m432l833k039J29J541J399Lj296j533j157j029j000
51229B48990n21j65r94k578l064j566P71K370K757K213J085J6j91L86O73J06m45
51212B49843J00J400J996J049p68k146k599k865l723m682m488l041j867k116k980
51197B23113k946j837n73L28P54J71j751l929m748m089l153k405j093J066L100
$$ plain form
51302 276954 276751 276733 277083 278058 279445 280924 282478 284088 285360 285884 285920 286401 288054 290544 292866 294777
51286 294777 297408 301893 307770 313605 319025 325068 332381 340225 347678 354658 361106 366305 370023 373408
51272 373408 377653 382416 386605 389993 392800 394248 393090 389519 385126 380731 375473 368499 360504 352927
51258 352927 346325 340250 334354 328815 323684 318363 312099 304958 297968 292062 287078 282195 277216 272811
51244 272811 269346 266122 262237 257805 253972 251933 252062 253603 255002 255005 253709 252176 251019 249990 248990
51229 248990 248469 248304 247310 244732 241668 240102 240873 243243 246000 248213 249298 249314 249123 249509 250182 250288 249843
51212 249843 249943 251343 253339 254388 253620 251474 248875 246010 242287 237605 233117 230076 228209 226093 223113
51197 223113 220167 218330 217757 218085 218839 219010 217259 213330 208582 204493 201340 198935 197842 198908 202008
51182B02008L933L347J725p7p84K21J897K697K595K709L130K737J218k64p39l70
51166B25983N28J933L197L128J536l26j374j623j362n82L51O79L32K3rk69p39
51149B31406n22P90K323K979K511J472Q09J404L147M595M606L797L200K260M3
51134B64820k130j686J462M510N464N063M453L347J503o0m76j67L74J248J920
51119B89645J213n26j251k99K80j174l360m136l478k721k218j570j032j063j306
51104B67004j415j821k461j965L72K900L517K387J216O29o7j238k447l308l573
51089B59730k810r82J048K391K812K065j94l021m211l088j878k776m857n640m625
51074B33964l253k228j076L6J73n44p96o9O17K96p19j445j298m62J71l10j671
$$ plain form
51182 202008 205941 209288 211013 210936 210152 210373 212270 214967 217562 220271 223401 226138 227356 227092 226353 225983
51166 225983 226511 228444 231641 234769 236305 235979 234605 232982 231620 231038 231389 232068 232400 232423 232414 232145 231406
51149 231406 230884 231674 233997 236976 239487 240959 241768 243172 246319 250914 255520 259317 262517 264777 264820
51134 264820 262690 261004 262466 266976 272440 277503 281956 285303 286806 286746 286270 286103 286477 287725 289645
51119 289645 290858 290332 289081 288782 289062 287888 284528 280392 276914 274193 271975 270405 269373 268310 267004
51104 267004 265589 263768 261307 259342 259714 262614 266131 268518 269734 270363 270296 269058 266611 263303 259730
51089 259730 256920 255938 256986 259377 262189 264254 264060 261039 256828 253740 251862 249086 244229 238589 233964
51074 233964 230711 228483 227407 227443 227616 227072 226276 226207 226824 227120 226401 224956 223658 223196 223367 223057 221386
51057B21386k489j919q15k51K33J680L635M366L029N77j285j318N81L013L905
51042B34328K651J005R05K020K445J291n33j645j256N89K847L935L311K196J966
51027B56055K468K869L226L945M450L851K490J553J553K246L393M435M194K384
51013B99112O64O65J647J824J305J609K712L019K319K322L717M832M213K678J690
50998C34328J177L60m35k29Q61J561R84n85k412m061n345n859n050k962p47J03
50982C11689o18j498j271l88k21j208k528l308l323k753j941j331r89m14Q01K294
50966B92993L404L837L532K521J445J413K549L577L545L134L240L386K744J809
50952C33129J462J252L40m08P26L574N938O301N183L820K983L084M018M966N565
$$ plain form
51057 221386 218897 216978 216163 215912 216145 217825 221460 225826 228855 229432 228147 226829 227410 230423 234328
51042 234328 236979 237984 238889 240909 243354 244645 244112 242467 241211 241800 244647 248582 251893 254089 256055
51027 256055 258523 261392 264618 268563 273013 276864 279354 280907 282460 284706 288099 292534 296728 299112
51013 299112 299776 300441 302088 303912 305217 306826 309538 312557 314876 317198 320915 325747 329960 332638 334328
50998 334328 335505 335865 335430 335201 336062 337623 338607 338022 335610 331549 326204 320345 315295 312333 311586 311689
50982 311689 311071 309573 308302 307914 307693 306485 303957 300649 297326 294573 292632 291301 290312 289898 290699 292993
50966 292993 296397 300234 303766 306287 307732 309145 311694 315271 318816 321950 325190 328576 331320 333129
50952 333129 334591 335843 336183 335775 336501 340075 346013 352314 357497 361317 364300 367384 371402 376368 381933
50937C81933O845R456J1590J0927Q510P968J0481J3136J3264J1956J1669J2484
50925E10219J2870J2702J3263J5008J7181J9429K2088K4953K7068K7952K8130
50914G30863K8431K9436L1507L4650L8335M1987M5657M9770N4418N9213O3681
50903A207948O7497P0745P4204P8953Q5031R0899R4902R7078R8896J01187J03020
50892B170360J02807R9994R5374R0045Q4425P8197P0914O2491N3246M3620L3888
50881B985361K4061J4185M860k723p547r791j0732j1591j2585j3204j3142j2878
50869B934274j3570j6293k1025k6507l1532l6259m1643m7736n3587n8865o4364
50858B522893p0365p5652p9039q1022q2911q4896q5901q4917q1791p7106p1992
$$ plain form
50937 381933 388778 398234 409824 420751 429261 437229 447710 460846 474110 486066 497735 510219
50925 510219 523089 535791 549054 564062 581243 600672 622760 647713 674781 702733 730863
50914 730863 759294 788730 820237 854887 893222 935209 980866 1030636 1085054 1144267 1207948
50903 1207948 1275445 1346190 1420394 1499347 1584378 1675277 1770179 1867257 1966153 2067340 2170360
50892 2170360 2273167 2373161 2468535 2558580 2643005 2721202 2792116 2854607 2907853 2951473 2985361
50881 2985361 3009422 3023607 3028467 3025744 3018197 3008406 2997674 2986083 2973498 2960294 2947152 2934274
50869 2934274 2920704 2904411 2883386 2856879 2825347 2789088 2747445 2699709 2646122 2587257 2522893
50858 2522893 2452528 2376876 2297837 2216815 2133904 2049008 1963107 1878190 1796399 1719293 1647301
50847A647301o7539o3745n9531n4409m9288m4978m0875l6228l1842k9092k7789
50836A141985k6349k3812k0398j6415j2061q256o329o544p703q186o964m077r37
50823I93954N68L02N52L231P131R510R776R653J0111J0448J0559J1794J4712J7852
50809A110153J9876K1459K3763K6318K7758K8094K8910L1444L5324L9270M2549
50798A434918M5667M9802N5523O2244O9039P5621Q2270Q9315R7225J06508J16773
50787B284905J26628J35535J44999J56624J69517J81218J90855J99690K08534
50778C798505K16441K22211K25662K26856K25254K20053K10403J95316J74737
50769E715438J50583J25388R9910P3741M8062K5548P099q908k3143l3421l7806
$$ plain form
50847 1647301 1579762 1516017 1456486 1402077 1352789 1307811 1266936 1230708 1198866 1169774 1141985
50836 1141985 1115636 1091824 1071426 1055011 1042950 1034694 1028365 1021821 1014118 1005932 998968 994891 993954
50823 993954 994522 994824 995376 998607 1005738 1015248 1025024 1034677 1044788 1055236 1065795 1077589 1092301 1110153
50809 1110153 1130029 1151488 1175251 1201569 1229327 1257421 1286331 1317775 1353099 1392369 1434918
50798 1434918 1480585 1530387 1585910 1648154 1717193 1792814 1875084 1964399 2061624 2168132 2284905
50787 2284905 2411533 2547068 2692067 2848691 3018208 3199426 3390281 3589971 3798505
50778 3798505 4014946 4237157 4462819 4689675 4914929 5134982 5345385 5540701 5715438
50769 5715438 5866021 5991409 6091319 6165060 6213122 6238670 6245769 6236861 6213718 6180297 6142491
50758F142491l7651l5678l2608k7775k2095j8104j7369j9609k4350l1937m2758
50747E832557n6615p2922r0732j08521j24800j38975j51102j60999j68191j72430
50737D587270j73715j71942j67110j59606j49802j37778j23902j09227r4667q0082
50727C219439o4830m8895l2785j6750q62J4339K8104M0354N1601O1861P0251P5831
50715C397658P8293P7564P3326O5395N4369M1538K8057J4549J460j0697k1754
50704C799758l2169m2211n1116n7888o2974o8212p4681q1507q7234r1323r3569
50693C056874r3248r0173q5796q1698p7450p1433o3450n4833m6238l7071k7328
50682B328156j8317j0939m610J661Q339J5815K4432L3527M1793M9166N7062O6169
$$ plain form
50758 6142491 6104840 6069162 6036554 6008779 5986684 5968580 5951211 5931602 5907252 5875315 5832557
50747 5832557 5775942 5703020 5612288 5503767 5378967 5239992 5088890 4927891 4759700 4587270
50737 4587270 4413555 4241613 4074503 3914897 3765095 3627317 3503415 3394188 3299521 3219439
50727 3219439 3154609 3105714 3072929 3056179 3055317 3069656 3097760 3138114 3189715 3251576 3321827 3397658
50715 3397658 3475951 3553515 3626841 3692236 3746605 3788143 3816200 3830749 3832209 3821512 3799758
50704 3799758 3767589 3725378 3674262 3616374 3553400 3485188 3410507 3329000 3241766 3150443 3056874
50693 3056874 2963626 2873453 2787657 2705959 2628509 2557076 2493626 2438793 2392555 2355484 2328156
50682 2328156 2309839 2298900 2294290 2295951 2304290 2320105 2344537 2378064 2419857 2469023 2526085 2592254
50670B592254P5345Q3593R1761J01178J11566J21412J29732J36387J41335J44514
50660C729077J46040J45630J42363J35685J26213J14834J01470Q5387O6295M4762
50650D837756K2087L59j8148l2480m3510n2321n8578o1144n9784n5420m9101m1618
50638D388098l4029k7675k3306k0575j8707j7701j8672k2787k9862l8464m7595
50627D088725n7509o8192p7753q3646q5216q3757q0237p4344o5903n5833m5127
50616C311208l3973k2220r742L875J8945L4834N0708O7148Q5531J05457J24549
50605C736320J41380J56926J72320J86874J99245K08799K14578K14638K08073
50596E439153J96404J81399J62748J39786J14385Q9835O7323M5549K3750K992
$$ plain form
50670 2592254 2667599 2751192 2842953 2944131 3055697 3177109 3306841 3443228 3584563 3729077
50660 3729077 3875117 4020747 4163110 4298795 4425008 4539842 4641312 4726699 4792994 4837756
50650 4837756 4859843 4860202 4842054 4809574 4766064 4713743 4655165 4594021 4534237 4478817 4429716 4388098
50638 4388098 4354069 4326394 4303088 4282513 4263806 4246105 4227433 4204646 4174784 4136320 4088725
50627 4088725 4031216 3963024 3885271 3801625 3716409 3632652 3552415 3478071 3412168 3356335 3311208
50616 3311208 3277235 3255015 3245273 3249148 3268093 3302927 3353635 3420783 3506314 3611771 3736320
50605 3736320 3877700 4034626 4206946 4393820 4593065 4801864 5016442 5231080 5439153
50596 5439153 5635557 5816956 5979704 6119490 6233875 6323710 6391033 6436582 6460332 6463324
50586F463324j5758l3023m9522o4733p7522q7615r5734j02669j08464j12383j13462
50575E602439j11222j05773r7489q7001p5453o4017n2984m2096l1739k2949j6092
50564D895624j0781p243o275p282q151q128r156j2851j7564k0291k0348j9208
50552D748346j7613j5053j1663q316m727M43P166J3431J7597J9757K0267J8508
50540D788143J4168Q533L209j983q813j8425l0089m2226n4209o6677q0136r3677
50528D417818j05551j14847j21881j26917j29520j29533j27671j24542j19972
50519C317384j14148j08345j03332r7851r0186q0783p1745o3992n6545m8746m1395
50508B440316l5041k8541k0428j1024k231M600R871J5005K1018K7919L5199M2481
$$ plain form
50586 6463324 6447566 6414543 6365021 6300288 6222766 6135151 6039417 5936748 5828284 5715901 5602439
50575 5602439 5491217 5385444 5287955 5200954 5125501 5061484 5008500 4966404 4934665 4911716 4895624
50564 4895624 4884843 4877600 4871325 4864043 4855892 4847764 4838608 4825757 4808193 4787902 4767554 4748346
50552 4748346 4730733 4715680 4704017 4695701 4690974 4691417 4698583 4712014 4729611 4749368 4769635 4788143
50540 4788143 4802311 4810844 4814053 4812070 4803257 4784832 4754743 4712517 4658308 4591631 4511495 4417818
50528 4417818 4312267 4197420 4075539 3948622 3819102 3689569 3561898 3437356 3317384
50519 3317384 3203236 3094891 2991559 2893708 2803522 2722739 2650994 2587002 2530457 2481711 2440316
50508 2440316 2405275 2376734 2356306 2345282 2343051 2347651 2357522 2372527 2393545 2421464 2456663 2499144
50496B499144M9598N6266O2239O7963P4410Q2026R0302R8759J07646J17135J26518
50485C432006J35086J43357J52259J61204J67992J70902J70121J66694J60752
50476D860373J51426J38468J23404J08760R6087Q5115P4939O5553N7729N1810
50466E813664M7480M4470M2455M0379L7151L3471L1774L3800L9038M5872N3102
50455F262656N9915O5721P0797P5921Q0449Q2009P9029P2417O3650N2590L8565
50444G003719K2281M750j4528l6137n8250p7880r4357j09286j23010j33414j38680
50433F245208j39092j35299j26858j13786r8032q1820o5498m8338l0757j4442
50423E391286p14R983J7107J9808J7780J1389O62j5037l5616n9162q2956j05497
$$ plain form
50496 2499144 2548742 2605008 2667247 2735210 2809620 2891646 2981948 3080707 3188353 3305488 3432006
50485 3432006 3567092 3710449 3862708 4023912 4191904 4362806 4532927 4699621 4860373
50476 4860373 5011799 5150267 5273671 5382431 5478518 5563633 5638572 5704125 5761854 5813664
50466 5813664 5861144 5905614 5948069 5988448 6025599 6059070 6090844 6124644 6163682 6209554 6262656
50455 6262656 6322571 6388292 6459089 6535010 6615459 6697468 6776497 6848914 6912564 6965154 7003719
50444 7003719 7026000 7030750 7016222 6980085 6921835 6843955 6749598 6640312 6517302 6383888 6245208
50433 6245208 6106116 5970817 5843959 5730173 5632141 5550321 5484823 5436485 5405728 5391286
50423 5391286 5390572 5400555 5417662 5437470 5455250 5466639 5467301 5452264 5416648 5357486 5274530 5169033
50411E169033j26745j46416j62965j74762j81495j83802j82143j77073j70056
50402C663576j62721j55259j46697j36773j26413j16350j06524r7089q8570q0603
50392B446577p1962o2459n3421m5632l8231l0579k3710j8631j4469r801m772l80
50380B072530L516P893J2909J7974K3038K8365L3388L7102L9415M1172M3101M5564
50368B405967M8758N2294N5203N7311N9807O3438O7016O8974O9466O9583O9377
50357C087194O8216O6460O5094O4131O2838O1138N9350N7203N4509N2210N1147
50346C749490N0536M9356M8469M9331N1228N2089N1757N1940N2803N2141M8486
50335D307626M2934L7074L0898K3704J5523O684k953j3568k5021l7236n0091o2826
$$ plain form
50411 5169033 5042288 4895872 4732907 4558145 4376650 4192848 4010705 3833632 3663576
50402 3663576 3500855 3345596 3198899 3062126 2935713 2819363 2712839 2615750 2527180 2446577
50392 2446577 2374615 2312156 2258735 2213103 2174872 2144293 2120583 2101952 2087483 2077682 2072910 2072530
50380 2072530 2076046 2083939 2096848 2114822 2137860 2166225 2199613 2236715 2276130 2317302 2360403 2405967
50368 2405967 2454725 2507019 2562222 2619533 2679340 2742778 2809794 2878768 2948234 3017817 3087194
50357 3087194 3155410 3221870 3286964 3351095 3413933 3475071 3534421 3591624 3646133 3698343 3749490
50346 3749490 3800026 3849382 3897851 3947182 3998410 4050499 4102256 4154196 4206999 4259140 4307626
50335 4307626 4350560 4387634 4418532 4442236 4457759 4464443 4461490 4447922 4422901 4385665 4335574 4272748
50323D272748p4599q5569r6295j06053j13083j16517j16866j14647j09879j02837
50313C236403r3979q3206p0626n7774m6413l6249k5641j4550m881K059O479Q348
50301B819970P035L016k248q702j7775k9367m0919n0377n8062o4690o9767p3065
50289B415049p5495p7100p6128p1828o6392o2341n9510n6376n2905n0079m7618
50278A719277m4300l9970l5518l1295k6983k2690j8842j5359j1960q831o127l407
50266A453995l07K957O529J1063J5892J8526J7640J5624J6183K0053K4774K8218
50254A631147L0359L1816L2706L3290L4088L4873L4968L4798L5761L7992L9778
50243B011576L9864L9196L9182L9243L7417L3124K7992K3814K0700J7635J4035
$$ plain form
50323 4272748 4198149 4112580 4016285 3910232 3797149 3680632 3563766 3449119 3339240 3236403
50313 3236403 3142424 3059218 2988592 2930818 2884405 2848156 2822515 2807965 2803084 2805143 2811622 2819970
50301 2819970 2827005 2830021 2827773 2819071 2801296 2771929 2731010 2680633 2622571 2557881 2488114 2415049
50289 2415049 2339554 2262454 2186326 2114498 2048106 1985765 1926255 1869879 1816974 1766895 1719277
50278 1719277 1674977 1635007 1599489 1568194 1541211 1518521 1499679 1484320 1472360 1463529 1457402 1453995
50266 1453995 1453688 1456645 1463174 1474237 1490129 1508655 1526295 1541919 1558102 1578155 1602929 1631147
50254 1631147 1661506 1693322 1726028 1759318 1793406 1828279 1863247 1898045 1933806 1971798 2011576
50243 2011576 2051440 2090636 2129818 2169061 2206478 2239602 2267594 2291408 2312108 2329743 2343778
50232B343778R999N568N51m868j0071j4627j8454k1347k3173k4677k7160l0788
50220B184731l4119l5977l6959l8215l9595m0277m0451m0873m1181m0199l7859
50209A759026l5356l3407l1809l0668l0553l1132l1119k9959k8291k6424k3757
50198A426551k0151j6518j3603j1340r769r223r182q348o380m179k020Q84M260
50185A320982O112N341L491K532K281J512L72KN26J074J225J055K23j644l845
50170A341239n166n317m971m671m700n603p638r803j0383q704n805l395k619l505
50156A258959m976n553m581k792j387q26o62k77O14J888L236M540N947P199P396
50141A268725O228N061N483O837O741M461K129J732K345J627q59l248l866k955
$$ plain form
50232 2343778 2353777 2359345 2359896 2355028 2344957 2330330 2311876 2290529 2267356 2242679 2215519 2184731
50220 2184731 2150612 2114635 2077676 2039461 1999866 1959589 1919138 1878265 1837084 1796885 1759026
50209 1759026 1723670 1690263 1658454 1627786 1597233 1566101 1534982 1505023 1476732 1450308 1426551
50198 1426551 1406400 1389882 1376279 1364939 1355170 1345947 1336765 1328417 1322037 1317858 1315838 1316722 1320982
50185 1320982 1327094 1332435 1335926 1338458 1340739 1342251 1342623 1342625 1343151 1344225 1345450 1346505 1346728 1345084 1341239
50170 1341239 1336073 1330756 1325785 1321114 1316414 1310811 1303173 1293370 1282987 1274283 1268478 1265083 1262464 1258959
50156 1258959 1253983 1248430 1243849 1241057 1239670 1238844 1238182 1237905 1238519 1240407 1243643 1248183 1254130 1261329 1268725
50141 1268725 1274953 1280014 1285497 1292334 1299075 1303536 1305665 1307397 1309742 1311369 1310510 1307262 1303396 1300441
50127A300441k018k219l533n054o029o561p166p967q853r939j1062j1335j0346
50114A208359r370r870j1130j1162r824r005r430r525q102o042m335k554l84J271
50100A108897K045L107M955N927M556J853l95k095l877n189n381n502o833q486
50086A093582q496o630m297k289m57Q94J106M66j84p29j328j222L35K388L190
50071A076329K604K148K834M244N674O914P966Q922R973J0844J0809R974R642
50058A168877J0510J1497J1479J0938J0657J0120Q846Q016Q769R902R576Q494
50046A287681Q851J0691J1818J1346J0814J1453J2595J3416J4361J5999J7971
50035A426996J9752K1398K3140K5243K8264L2329L6190L8400L9440M1291M4823
$$ plain form
50127 1300441 1298423 1296204 1292671 1287617 1281588 1275027 1267861 1259894 1251041 1241102 1230040 1218705 1208359
50114 1208359 1198989 1189119 1177989 1166827 1157003 1147998 1138568 1129043 1120941 1114899 1110564 1108010 1107626 1108897
50100 1108897 1110942 1114049 1119004 1124931 1129487 1131340 1130945 1128850 1124973 1119784 1114403 1108901 1102068 1093582
50086 1093582 1085086 1078456 1074159 1071870 1071413 1072307 1073413 1073879 1073695 1072966 1071638 1070416 1070751 1073139 1076329
50071 1076329 1078933 1081081 1083915 1088159 1093833 1100747 1108713 1117635 1127608 1138452 1149261 1159235 1168877
50058 1168877 1179387 1190884 1202363 1213301 1223958 1234078 1242924 1250940 1259709 1269611 1279187 1287681
50046 1287681 1296532 1307223 1319041 1330387 1341201 1352654 1365249 1378665 1393026 1409025 1426996
50035 1426996 1446748 1468146 1491286 1516529 1544793 1577122 1613312 1651712 1691152 1732443 1777266
50024A777266M9045N3157N7866O4153P1844P9880Q7266R3698J00027J07982J18517
50013B660701J30714J43198J56101J70368J85623K00343K13845K26398K37261
50004D324552K44126K44754K38065K23858K02981J77802J51157J24896J00580
49995F032771Q0979O8700O3074O0240N6613N0732M1604K7360O516k0766n3328
49984F414495q9598j26905j61436j89809k10312k22719k28009k28159k24967k18709
49974D513872k08926j96310j82589j68828j55402j43292j33404j24546j14284
49965C086291j02437r1796q4430p9099p3360o6707o0421n5442n1549m7987m4108
49954B328955l9857l5889l2567k9047k4485j9874j7010j5717j4066j1534r717
$$ plain form
50024 1777266 1826311 1879468 1937334 2001487 2073331 2153211 2240477 2334175 2434202 2542184 2660701
50013 2660701 2791415 2934613 3090714 3261082 3446705 3647048 3860893 4087291 4324552
50004 4324552 4568678 4813432 5051497 5275355 5478336 5656138 5807295 5932191 6032771
49995 6032771 6113750 6182450 6245524 6305764 6362377 6413109 6454713 6482073 6488589 6467823 6414495
49984 6414495 6324897 6197992 6036556 5846747 5636435 5413716 5185707 4957548 4732581 4513872
49974 4513872 4304946 4108636 3926047 3757219 3601817 3458525 3325121 3200575 3086291
49965 3086291 2983854 2892058 2807628 2728529 2655169 2588462 2528041 2472599 2421050 2373063 2328955
49954 2328955 2289098 2253209 2220642 2191595 2167110 2147236 2130226 2114509 2100443 2088909 2079192
49943B079192r227q237n392k133m61J6J012K845M570N911P182P857O939M722K881
49928B097677K667L886N567P016Q344J0324J3503J7254K0278K2222K4064K6557
49916B259359K9263L1668L4320L8001M2467M6859N0946N5227O0030O5178P0455
49905B783773P6183Q3213R2113J02197J12031J21507J32683J47389J64681J82255
49895C998025J99892K19486K41750K65086K88047L10584L31949L49288L59553
$$ plain form
49943 2079192 2069965 2061728 2056336 2054203 2053742 2053758 2054770 2057615 2062185 2068096 2075278 2083135 2090074 2094796 2097677
49928 2097677 2100344 2104230 2109797 2116813 2125157 2135481 2148984 2166238 2186516 2208738 2232802 2259359
49916 2259359 2288622 2320290 2354610 2392611 2435078 2481937 2532883 2588110 2648140 2713318 2783773
49905 2783773 2859956 2943169 3035282 3137479 3249510 3371017 3503700 3651089 3815770 3998025
49895 3998025 4197917 4417403 4659153 4924239 5212286 5522870 5854819 6204107 6563660
$$ [...]
##END NTUPLES=NMR SPECTRUM
##END=
