
##TITLE=AC1074_TORI01_5819511_qEZrfrgrqa
##JCAMPDX= 6.0         $$ Bruker NMR JCAMP-DX V2.0
##DATA TYPE= NMR SPECTRUM
##DATA CLASS= NTUPLES
##ORIGIN= BRUKER
##OWNER= Administrator
$$ 1.72 TOPSPIN		Version 2.1
$$ 2012-03-25 00:52:13.468 -0500  Administrator@TOPSPIN
$$ Compression mode = diff/dup
##.OBSERVE FREQUENCY= 400.13188235
##.OBSERVE NUCLEUS= ^1H
##.ACQUISITION MODE= SIMULTANEOUS (DQD)
##.ACQUISITION SCHEME= undefined
##.AVERAGES= 8
##.DIGITISER RES= 22
##SPECTROMETER/DATA SYSTEM= spect
##.PULSE SEQUENCE= zg30
##.SOLVENT NAME= COFFEE_meoh
##.SHIFT REFERENCE= INTERNAL, COFFEE_meoh, 1, 14.98061
##AUDIT TRAIL= $$ (NUMBER, WHEN, WHO, WHERE, PROCESS, VERSION, WHAT)
$$ ##TITLE= Audit trail, TOPSPIN		Version 2.1
$$ ##JCAMPDX= 5.01
$$ ##ORIGIN= Bruker BioSpin GmbH
$$ ##OWNER= Administrator
$$ $$ C:\Bruker\TOPSPIN/data/COFFEE/nmr/AC1074_TORI01_5819511_qEZrfrgrqa/20/pdata/1/auditp.txt
$$ ##AUDIT TRAIL=  $$ (NUMBER, WHEN, WHO, WHERE, PROCESS, VERSION, WHAT)
(   1,<2012-03-25 00:52:05.562 -0500>,<Administrator>,<TOPSPIN>,<go>,<TOPSPIN 2.1>,
      <created by zg
	started at 2012-03-25 00:50:58.734 -0500,
	POWCHK enabled, PULCHK disabled,
       configuration hash MD5:
       1A 1E CE 29 27 FD 77 03 67 4E F0 E3 C4 B2 CB 90
       data hash MD5: 64K
       45 F1 FA BC 39 C8 60 DB BE D2 38 E1 5D C0 5A B5>)
(   2,<2012-03-25 00:52:08.859 -0500>,<Administrator>,<TOPSPIN>,<proc1d>,<TOPSPIN 2.1>,
      <Start of raw data processing
       efp LB = 0 FT_mod = 6 PKNL = 1 PHC0 = 0 PHC1 = 0 SI = 32K 
       data hash MD5: 32K
       0D FE 91 24 FD 99 E2 86 9E 91 E4 18 CA D5 65 8B>)
(   3,<2012-03-25 00:52:09.515 -0500>,<Administrator>,<TOPSPIN>,<proc1d>,<TOPSPIN 2.1>,
      <pk PHC0 = 218.0786 PHC1 = 0 
       data hash MD5: 32K
       77 DC 6C 1D B9 67 26 D9 55 00 45 69 2D 0B FF 1C>)
(   4,<2012-03-25 00:52:09.687 -0500>,<Administrator>,<TOPSPIN>,<proc1d>,<TOPSPIN 2.1>,
      <abs ABSG = 1 
       data hash MD5: 32K
       F7 05 08 B0 80 97 A3 05 DA AE 7C 38 78 08 5A 44>)
(   5,<2012-03-25 00:52:09.796 -0500>,<Administrator>,<TOPSPIN>,<proc1d>,<TOPSPIN 2.1>,
      <abs ABSG = 2 
       data hash MD5: 32K
       06 E9 BF 2E 16 C2 7A 60 77 80 AA B2 4A 98 E5 4D>)
(   6,<2012-03-25 00:52:09.828 -0500>,<Administrator>,<TOPSPIN>,<proc1d>,<TOPSPIN 2.1>,
      <abs ABSG = 3 
       data hash MD5: 32K
       E6 17 C5 C9 E8 B8 35 E1 88 2C 60 66 63 C1 AD C6>)
(   7,<2012-03-25 00:52:09.859 -0500>,<Administrator>,<TOPSPIN>,<proc1d>,<TOPSPIN 2.1>,
      <abs ABSG = 4 
       data hash MD5: 32K
       BB 17 D7 A6 92 28 64 4E E8 2F 11 F4 A2 71 8C 21>)
(   8,<2012-03-25 00:52:09.890 -0500>,<Administrator>,<TOPSPIN>,<proc1d>,<TOPSPIN 2.1>,
      <abs ABSG = 5 
       data hash MD5: 32K
       56 D5 56 34 63 78 85 7E 96 BD 93 CE 5D 8C 02 5E>)
$$ ##END=
$$ 
$$ $$ hash MD5
$$ $$ FF 92 80 DC 10 56 CC B6 D5 14 12 A7 24 E4 34 ED
##$RELAX= 
##$RELAX= 
##$RELAX= 
##$RELAX= 
##$RELAX= 
##$RELAX= 
##$RELAX= 
$$ Bruker specific parameters
$$ --------------------------
$$ [...]
##$TP= (0..7)
150 150 150 150 150 150 150 150
##$TP07= 0
##$TPNAME0= <>
##$TPNAME1= <>
##$TPNAME2= <>
##$TPNAME3= <>
##$TPNAME4= <>
##$TPNAME5= <>
##$TPNAME6= <>
##$TPNAME7= <>
##$TPOAL= (0..7)
0.5 0.5 0.5 0.5 0.5 0.5 0.5 0.5
##$TPOFFS= (0..7)
0 0 0 0 0 0 0 0
##$TUNHIN= 0
##$TUNHOUT= 0
##$TUNXOUT= 0
##$USERA1= <user>
##$USERA2= <user>
##$USERA3= <user>
##$USERA4= <user>
##$USERA5= <user>
##$V9= 5
##$VALIST= <valist>
##$VCLIST= <CCCCCCCCCCCCCCC>
##$VD= 0
##$VDLIST= <DDDDDDDDDDDDDDD>
##$VPLIST= <PPPPPPPPPPPPPPP>
##$VTLIST= <TTTTTTTTTTTTTTT>
##$WBST= 2048
##$WBSW= 25
##$XGAIN= (0..3)
0 0 0 0
##$XL= 0
##$YL= 0
##$YMAX_a= 531425
##$YMIN_a= -627707
##$ZGOPTNS= <>
##$ZL1= 120
##$ZL2= 120
##$ZL3= 120
##$ZL4= 120
##$ABSF1= 14.98061
##$ABSF2= -5.57192
##$ABSG= 5
##$ABSL= 3
##$ALPHA= 0
##$AQORDER= 0
##$ASSFAC= 0
##$ASSFACI= 0
##$ASSFACX= 0
##$ASSWID= 0
##$AUNMP= <proc_prof1d_extract_pilot.lims>
##$AXLEFT= 0
##$AXNAME= <>
##$AXNUC= <1H>
##$AXRIGHT= 0
##$AXTYPE= 0
##$AXUNIT= <>
##$AZFE= 0.1
##$AZFW= 0.1
##$BCFW= 0
##$BC_mod= 0
##$BYTORDP= 0
##$COROFFS= 0
##$CY= 15
##$DATMOD= 1
##$DC= 0
##$DFILT= <>
##$DTYPP= 0
##$F1P= 0
##$F2P= 0
##$FCOR= 0.5
##$FTSIZE= 32768
##$FT_mod= 6
##$GAMMA= 0
##$GB= 0
##$INTBC= 1
##$INTSCL= 1
##$ISEN= 128
##$LB= 0
##$LEV0= 0
##$LPBIN= 0
##$MAXI= 10000
##$MC2= 0
##$MEAN= 0
##$ME_mod= 0
##$MI= 0
##$NCOEF= 0
##$NC_proc= -8
##$NLEV= 6
##$NOISF1= 0
##$NOISF2= 0
##$NSP= 0
##$NTH_PI= 0
##$NZP= 0
##$OFFSET= 14.98061
##$PC= 1
##$PHC0= 218.0786
##$PHC1= 0
##$PH_mod= 1
##$PKNL= yes
##$PPARMOD= 0
##$PPDIAG= 0
##$PPIPTYP= 0
##$PPMPNUM= 2147483647
##$PPRESOL= 1
##$PSCAL= 4
##$PSIGN= 0
##$PYNMP= <proc.py>
##$REVERSE= no
##$SF= 400.13
##$SI= 32768
##$SIGF1= 0
##$SIGF2= 0
##$SINO= 400
##$SIOLD= 32768
##$SPECTYP= <>
##$SREGLST= <1H.CDCl3>
##$SSB= 0
##$STSI= 32768
##$STSR= 0
##$SW_p= 8223.68421052632
##$SYMM= 0
##$S_DEV= 0
##$TDeff= 65536
##$TDoff= 0
##$TI= <>
##$TILT= no
##$TM1= 0
##$TM2= 0
##$TOPLEV= 0
##$USERP1= <user>
##$USERP2= <user>
##$USERP3= <user>
##$USERP4= <user>
##$USERP5= <user>
##$WDW= 1
##$XDIM= 32768
##$YMAX_p= 471875817
##$YMIN_p= -714922
##$CURPLOT= <Network HP LaserJet P1505>
##$CURPRIN= <$Network HP LaserJet P1505>
##$DFORMAT= <normdp>
##$LAYOUT= <+/1D_H.xwp>
##$LFORMAT= <normlp>
##$PFORMAT= <normpl>
##$SURQMSG= 1
$$ End of Bruker specific parameters
$$ ---------------------------------
##NTUPLES= NMR SPECTRUM
##VAR_NAME=  FREQUENCY,     SPECTRUM/REAL,   SPECTRUM/IMAG
##SYMBOL=    X,             R,               I
##VAR_TYPE=  INDEPENDENT,   DEPENDENT,       DEPENDENT
##VAR_FORM=  AFFN,          ASDF,            ASDF
##VAR_DIM=   32768,         32768,           32768
##UNITS=     HZ,            ARBITRARY UNITS, ARBITRARY UNITS
##FACTOR=    0.250966925370066, 1,           1
##FIRST=     8223.43324360095, -25325,       -2283
##LAST=      0,             229271,          44038
##MIN=       0,             -714922,         0
##MAX=       8223.43324360095, 471875817,    0
$$ Real data points
##PAGE= N=1
##DATA TABLE= (X++(R..R)), XYDATA
$$ [...]
23738 43666 -111277 70482 15363 119427 367420 7619 90232 -416860 139449 204346 -72980
23726 -78177 -97741 -309178 247679 -123268 -70002 -131618 84393 70625 -57355 77945 -148482
23714 -151498 -108107 207474 182299 270178 -267470 -38432 77120 233005 -154255 83643 154290
23703 154290 -13784 -127788 -160929 -96309 153576 -247710 -147103 145058 48540 322158
23693 322158 -325437 -90062 -157459 90613 -232099 108916 3657 -149186 -42490 -66499 -200673
23682 -200673 -11794 -43275 -296218 148209 -102051 -219009 97556 26563 -6420 136789 16888
23670 3516 139228 -223880 -377712 234195 63216 135465 -222884 -25232 -200754 445755
23659 35245 51711 -122693 -318397 -107188 35864 564101 -149122 241786 112178 153774
23649 153774 41427 253242 163829 -142034 -128360 52729 96711 -282472 12500 -317783 -2697
23637 40295 94139 84632 124353 147177 149857 130918 17742 -390529 -129868 -110476 50777 91324
23625 91324 -211106 -313493 67496 -91337 -43432 151854 -69234 -319135 -104005 -9750 2051
23613 123334 391108 65825 -259232 -60193 -7690 90293 -260914 -253848 31504 -54897 129394
23601 -391864 -86995 -32738 -171862 -348965 149976 25564 73477 -53694 -146953 -13837 63457
23589 239313 35066 -42852 345354 33005 -50621 4096 117850 141802 -20003 191955 36773
23577 363838 281855 101927 -13779 223342 195448 -165958 136354 -191617 116373 62166
23567 62166 -302632 -58053 -20842 9967 104200 -95775 -116933 75548 3424 174965 -170686
23555 223321 -171618 171377 119987 41135 -45789 -424514 -249417 164490 -274557 -164449
23545 -164449 104537 51447 78130 152071 300169 -276786 -164992 -230700 79591 -112917
23534 -223567 -145349 116863 -24493 4527 24638 40118 -97703 51323 68466 101981 -67976
23522 -1397 -338867 92954 -382820 168062 -51005 -81053 411774 -45731 -346014 182941 -391813
23510 -66401 189075 -189396 -156851 47401 -112367 57538 -174096 77025 -1295 30777 380042
23499 380042 -62688 243477 191814 -222679 259812 139043 -126875 -233185 -194828 -103999
23489 -103999 259538 -164706 -47026 -207474 -65472 -30599 -243486 255519 175453 246224
23479 246224 -107 307272 -124663 43114 -35010 -298595 35579 -380031 49757 -201519 -348053
23468 -348053 -124649 102749 -23724 102815 -74512 -23893 91967 -170715 -65342 -110338 331867
23456 -332228 -197443 -199578 249068 35706 163547 -232149 52214 216245 -517611 -19201
23445 -10006 -115420 -35680 375895 -148386 79408 -238341 87424 -294021 -463520 37483
23434 -169608 515363 345805 -87547 -53856 -217455 -259655 -27956 -125753 54138 -130227 -119528
23423 -119528 -60678 9522 5612 159871 -495352 -170371 -32852 -93579 -86118 -115936 -160100
23412 -160100 59245 -106415 -15 -144226 19350 -104603 -7173 -56669 135426 216490 30331
23400 31504 262894 -170185 -20309 -141157 184623 -93145 -190741 -19292 -123400 -89000 194316
23388 -180209 -172231 272001 17349 136239 59501 407450 -29637 173040 -243571 13334 -330026
23376 -74277 -170593 116673 83961 -57002 -427650 -7825 -206789 22348 19530 66849 162943
23365 162943 -299677 122224 -98787 -233907 -170069 349969 -40748 -178774 167513 124032
23355 124032 -11142 47158 -111195 -22479 -101615 -266547 -213712 176343 -140146 106862
23344 207995 17515 -60424 21949 160003 230773 -57363 -142480 41309 -109643 -24930 308264
23332 -39664 227686 -101655 -83862 310818 24069 -32498 -18166 390502 -60406 42574 -115428
23320 14080 -101239 9416 -56815 -65328 188911 288021 -89644 242469 -50497 301391 25029
23308 31231 -44770 -12184 258376 -45468 -100531 249421 103335 -197414 -47412 -378161 -238477
23297 -238477 73547 -302164 162634 46263 -178758 12123 189948 -168158 -165919 63739 30306
23285 -424448 560 1594 -43578 -267552 47409 157982 -40906 66378 239730 228510 -28792
23273 32379 98485 -1635 -153750 151019 281476 211051 -137580 -220082 -232983 120501 -83010
23261 -186958 -17093 -15207 231655 39541 -89988 -331144 -6334 -122889 -141509 128103 5221
23249 -193286 -256551 -116109 -5524 -116088 -98648 -145095 -68284 56960 -211210 -129284 296201
23237 85367 -391492 250035 -154982 28968 218178 205816 -20825 -11763 115038 -159036 -339347
23226 -339347 -171274 -385556 228774 75131 72287 -33849 -462057 -31191 -272361 -182208 176757
23214 336022 -108817 186261 22837 139845 -314211 -74969 -16337 75792 281760 14562
23203 60974 -140066 -142037 -44899 -184387 -68253 -210417 -255483 26295 49282 -135640 475564
23191 -82004 121997 -308501 -69771 -163083 -229241 -73282 -118503 66801 317747 3980 21943
23180 21943 -37342 17723 -98049 -101578 -50128 198330 65837 67481 68941 -177628 -66758 284001
23167 127453 -96705 -232268 -171630 -192626 11694 36261 -220881 -11837 -165937 313142 -217332
23155 97243 -76033 -119191 -202253 84444 -69300 -20692 -11775 -271946 24762 -173118 -63576
23143 -166532 -230724 -202262 169345 -176241 11035 -79768 -235045 309018 44250 -88641 -122158
23132 -122158 -73323 -54563 118342 -138914 212020 -120310 -7235 -61748 -188508 -10676 -49167
23121 -49167 -33263 -3195 19349 -71268 -71430 -163743 123186 43116 -51292 142171 -170427 -5893
23108 -5290 -15776 97172 -86648 114202 12459 131717 -60261 -117298 74682 -75621 63265
23096 42743 -206876 -42850 -105060 -17698 -237674 -152248 -58639 -139620 254930 383481 -37898
23084 50627 160140 21346 -158586 -96053 312262 95350 -80653 -146635 36190 -61025 206455
23072 200219 412498 -34989 -275966 9330 -68686 -180237 -171122 187534 68737 203499 135769
23061 135769 65994 -35986 -83006 -209549 -324671 -65792 -75443 42337 -112240 95190 -363711
23049 74398 -257715 31408 293133 104338 -11642 133159 199705 56997 528455 416941
23039 416941 -84356 -171302 -42840 127348 -18531 -305341 -56904 26204 145606 -183244 65227
23027 -279008 -56697 -46036 44936 168031 303367 285316 396704 -197164 74087 8638 -187064
23015 53024 -182964 340616 -55910 3322 187242 -157088 -105607 148171 -72944 -259537 -234423
23004 -234423 268122 -59420 -25101 156416 -236537 -154352 82118 -265822 -70736 388445
22993 -212246 152041 15309 189000 10019 217081 -100738 -379916 93211 94268 86840 60311
22982 60311 -105417 -157023 -63701 -113647 -102045 -98668 -138741 24610 -58397 135345 -124501
22970 112406 87144 -166518 50415 -346045 72524 22951 -160394 36670 -366018 -189777
22960 -189777 -352946 -267172 -33068 105420 -297349 -7151 -123547 61286 -38177 -41076 -224403
22949 -224403 -130454 60795 66399 -133470 7015 92375 341543 -388182 -219095 73273 -79107
22937 -13520 -70261 -377716 -136329 -4447 -133504 186083 170264 -384945 -88667 80802 -65835
22925 -76039 -46689 -241688 69922 -86265 -67105 -235410 -350012 -27795 95594 -30750 -7874
22913 219206 -85680 41557 134416 395572 -333771 -220072 255135 -54456 -120430 -96476 -111571
22902 -111571 15140 548 -97367 96757 108784 -273142 -132546 -504 -147675 98567 -167807
22890 -23469 433416 -377093 143567 -48615 105713 -157033 -121813 -155873 256393 -196882
22879 66958 91175 149819 -20408 -341441 -304804 -364183 233640 219784 -293503 -220033 280498
22867 -84877 8009 -54377 -28218 68217 223825 -92853 54349 -105042 -55376 -177076 115289
22855 -302305 -163816 -373679 121094 -146044 17079 125465 -112578 -317377 -171944 -101275
22845 -101275 -178534 -299670 146885 172225 332555 177416 -193857 -160525 -233362 -37615
22834 -369787 68578 -246363 176935 234264 -29129 -112695 167213 -302014 360910 86377
22823 -96276 73582 -280355 170457 -73202 97913 -248883 -217466 -89070 25755 -126916 52504
22811 346422 -131266 -258005 200054 -143134 55500 224088 310132 -91751 -149322 -48566
22800 -240669 -257962 -161890 77765 -149862 -121323 -196806 -146568 -431847 162708 153995 389480
22789 389480 -148358 -84102 -14905 -343844 63298 -38638 -246828 -12453 13338 -21411 -270177
22778 -270177 -218169 42476 -50256 -87358 60378 10853 30664 97915 -56963 339754 127528
22766 -32336 -17580 -343442 -65687 112355 223523 185508 90254 -66693 -475198 200034 244513
22755 244513 8939 -89573 1946 -39559 -195610 146639 -130278 -221727 -121801 131757 -64340
22743 -79527 106736 154018 -264781 164508 23694 -99241 -184656 -14267 -56508 -202443 36434
22731 -238562 9711 408118 111734 5949 221140 -219388 10125 132792 -365950 -79060 -309121
22720 -309121 123690 113072 70894 160421 -201055 -115660 -39990 324671 -296979 -70654 -41615
22709 -41615 77353 -90102 -53096 -84295 118415 191212 -350072 33465 -208915 -59512 7095
22697 -121176 -414120 61810 -58789 150217 180814 25413 -251704 -292690 -263189 -18486 -89275
22686 -89275 -115171 163362 -155841 250294 112510 -114631 -130453 132587 68744 11518
22675 41039 -296067 -253379 109591 -39890 -297630 -116620 -29478 -74147 68540 -337468 -98328
22663 187871 -171465 64656 -107314 367896 111654 44894 5442 -262590 -52777 -340255
22653 -340255 -40922 -197351 40817 25469 -91839 -105288 -224273 -60552 -77981 -251319 -5503
22641 -95151 -58802 103888 -175341 -118581 164944 -77316 107362 -158653 -94163 -28219 -221441
22630 -221441 87906 465784 -61051 109979 -29939 -78236 -144380 60135 -340133 -194361 -72269
22618 -71698 -42728 49855 -320037 241197 251237 -73471 -255654 -218935 -387026 -124668 224873
22606 81433 -168633 -145257 97139 -284064 -464365 -176673 -33170 -178204 -118815 235709
22595 -65989 -21637 -81386 -109311 47947 -451294 352069 36354 -19384 103992 -10254 -194335
22584 -194335 -199329 -2939 -97216 296084 8052 41560 -48446 -304779 -231124 -255193 -62531 264143
22571 69571 -161528 34897 -25681 -167294 10497 16428 59199 173089 89909 -36701 -165272
22560 -165272 -193627 115589 -329640 108673 41273 209017 -51219 28712 3748 175513 -153024
22548 -5238 -92839 -76824 80681 -336915 83095 60392 -354651 -309221 -17233 5056 31260 46756
22536 46756 227380 58812 34653 81392 -88477 129037 427176 -66187 -110537 -58243 125668
22524 -423059 -42626 -338365 -559508 10399 147247 -159658 -12638 8502 -468918 -211698
22513 -219438 -105535 -60016 -108831 122902 -91608 12505 39224 -249520 322478 200734
22503 200734 73133 -206875 -228848 273896 -133046 50916 -150888 -93308 -39149 -188580
22493 -188580 96482 -292957 84661 -148760 -34217 108182 -10777 -373453 56123 -253265
22482 433938 245497 71886 -140005 64744 -200358 54980 153798 -144786 -50444 -107972 -234670
22471 -234670 -160380 -38345 -322356 7403 181112 31949 81288 69105 -176215 -52831 172255
22459 226122 229605 -40480 185254 -44072 -353096 -74183 -22301 277522 17346 -88689 -25690
22447 -97175 -160776 199007 148268 191961 -176681 20830 121310 256298 -122711 -203278 110970
22435 -77623 -127554 15825 -124362 189270 130827 -50130 126824 -232792 -202058 94275 100257
22424 100257 -206419 -39471 -48057 155691 -4344 213781 -47621 -111030 106435 13729 255046
22413 255046 -97646 -314 102921 86757 -76347 351712 130728 -83359 59752 -180498 81759
22401 132524 99153 11414 63213 110673 -110074 -66169 -97061 -205411 196777 -319675 -96548
22389 -219784 -276465 -357402 -393469 120568 -69315 47445 4160 -387029 61949 -122559 61073
22377 247453 155799 226198 -118553 -153283 -90162 118619 25373 148283 -76491 -230312 -17961
22365 -32879 75690 19486 -20146 126734 45656 -4302 -123093 -314756 -87196 -331699 -127824
22353 63230 45079 -22554 6530 50736 -243561 -302606 -66736 -229708 110181 -200515 -41344
22341 -196457 -102638 36498 -152874 -237149 68543 210023 7834 -22205 35950 -250539 -117227
22329 206652 -65437 -154134 89626 169256 8913 98685 135662 107942 -149173 -206209 -199749 -111314
22317 -111314 -214440 104431 -358344 -275730 126021 98527 -178865 -181372 -344781 58490
22306 175828 -231151 142284 -322707 -57063 38876 -125423 37373 -129678 10175 -93846
22295 12517 204108 78484 -450307 -297362 -75046 -183525 23089 -158807 -181987 -280236 -143213
22284 -143213 -118898 -358355 -109119 11177 -187412 -39584 20713 -111355 39760 78746 464
22272 -199842 -109901 -12729 -9805 -149582 -204389 8206 -33795 -38850 -4710 -262166 10610 -268406
22259 -155758 80414 -241003 90114 -234556 -272569 -450287 -222147 -207672 -118574 -151321 40324
22247 -17784 94540 -199971 -170922 -270007 182433 178065 -20552 -133660 150338 -137801 99531
22235 -59939 240546 -138110 172749 -147327 -288928 -64540 -113088 -208126 320779 -89226
22224 -38358 133185 -104714 181680 -164991 -86340 -266516 123913 153829 -291994 56625
22213 -130160 50714 -352586 -101975 -13340 -106789 254584 219 -54932 -232486 -57998 150362
22201 117149 -422299 37161 -146619 74126 182663 108992 152498 41660 -119442 232793
22190 13349 165706 -125383 10210 -302297 -277902 -210030 -140898 86209 -124139 -52258 87177
22178 -137150 -193276 -381120 -48765 -375133 -130643 -136707 -31055 -322543 -114072 -135579 96638
22166 21487 -68662 117026 139136 -62310 -66495 -21736 258215 -41556 -197274 -87025 -64736
22155 -64736 4638 -104224 90182 -76903 15062 53922 -405895 301543 -115490 -79505 75412
22143 67461 -212699 -170963 -316852 16602 141915 119788 -85661 -157557 -174209 291289 243305
22132 243305 28326 25231 -200662 -410237 -89292 38914 -298735 132696 8080 85197 202671
22121 202671 52156 99802 -356656 -110384 196054 30398 -290207 -163931 16520 -134695
22110 204133 146881 -116491 76110 103135 289546 -202236 -259739 -32156 -1443 6188 105654
22099 105654 -223648 -27520 50459 -22459 -206230 36143 -142068 -203845 178911 -53848 19600
22087 150474 -466893 -273920 -302808 -92542 -29157 -294094 -306739 121919 124866 -230950 26202
22075 299850 -71722 392260 -239370 294475 230193 353037 74134 -148285 -88913 190433
22064 -56093 -33017 -203464 58191 -154791 40277 28476 103077 -124234 -219106 35657 -326121
22052 -287509 205262 46373 17310 -271589 -172995 -84471 -240514 -68667 274202 -299718
22041 -62875 -166249 -38068 -156265 -72960 -51302 54890 -65435 -193851 -15672 -34159 -134734
22030 -134734 249713 -203594 50437 50821 -57248 -209857 -98821 110135 27603 -27913 -56429
22019 -56429 -30687 -90737 -189922 79110 -71436 -79583 -2920 -187178 -397759 -37380 51642 60725
22007 60725 6016 102799 470100 -291433 -149046 -17298 -184430 6608 -371823 383213 89936
21995 -11431 191286 -37180 -27439 65330 -31415 -130617 -145666 95057 -116089 -233039 141421
21983 -119779 -209207 181287 96967 -259109 208108 -147994 -128662 -33213 161927 -473495
21972 -315084 -111475 -4457 39884 -67890 210763 -42514 -426690 146060 63502 270593 -137392
21960 -298472 -153618 68271 -175548 -398477 41149 -376465 -79309 46890 142309 -209742
21949 -148613 -394021 -40757 44299 -132263 -174975 -12703 82144 -71720 72610 58640 136990
21938 136990 184654 -283226 -17674 -418810 -283976 199490 93020 109044 -214505 292 -241434
21926 -140322 224599 -204747 -45154 -296398 118856 91451 -105288 9451 -10882 -107049 -139291
21915 -139291 102585 -60595 44607 -323021 -84724 33264 -23158 8719 41555 30076 -25825
21903 35838 21034 318747 83800 -336236 -286080 -216377 -40305 -123498 -117910 -148353 -551755
21892 -551755 44153 76179 -63230 -345221 122361 -66358 -409189 16768 -108383 -261337
21882 -261337 -67198 133424 -80632 -206713 -36569 -133495 -198340 -70439 -345431 -222007 -97863
21870 -149186 -198892 207680 -94756 23219 -347808 15363 -306943 195656 -178185 16590
21859 -4388 -64728 -46246 -254622 48555 -45108 124845 -48955 72979 -228325 188897 -198597
21847 -179232 -328907 -241410 -645866 -359292 -142396 -242181 -167734 189952 179252 -6972 -241288
21836 -241288 217935 -265701 -14711 98047 -386376 -4410 -234986 -148813 -298046 -84172 -146181
21825 -146181 -267843 -127067 -106745 -43142 227822 -208959 -82574 -93506 11985 56157 -84301
21813 -243938 112004 -37524 145054 152191 44798 55489 -101796 -116287 -2410 136981 -85569
21801 298233 -86779 310308 -78099 -199358 133164 180793 23514 -264662 -176305 51153 39777
21790 39777 232818 138859 -69526 162095 11066 -21258 327286 -246569 29543 -215056 141614
21778 -158667 65574 300581 142361 -168178 14962 133622 279714 -52127 167747 -159826
21767 -50135 -142914 -82081 77596 168354 -55327 65624 -138226 -5572 196545 -131848 36457
21755 -78682 -45927 -113876 114866 73826 98874 64661 46188 -167176 324737 -294017 -298215
21744 -298215 319721 210173 161814 76854 -30694 119894 71143 -126781 345368 -321153
21733 -302727 97702 61934 107361 -142981 171227 -107096 291345 -48619 -16684 68450 15769
21721 -283820 67439 -17391 105938 84972 -225029 -151899 -126056 -269629 -15466 68264 11847
21709 90704 -256820 -33621 197840 -251462 -388158 -208206 -188337 96604 144222 23557 17630
21698 17630 13481 61563 28173 139024 -38398 -294244 -117418 83947 -164446 -134088 -84701
21687 -84701 332919 171215 57274 -162326 -6217 -170421 146541 -225211 15159 -230321
21676 -145802 -482202 33185 -58250 -433096 124437 14118 -254277 41577 -237770 177830
21665 -25522 323432 -221576 -26811 -118670 74302 -95382 -109524 -141743 -132324 24069 302048
21654 302048 112652 -52501 -237142 -252636 -97094 -83193 -2693 -54151 -242550 -45652 19044
21642 -27681 82779 16214 137690 87352 -312390 -1917 119686 46868 -75408 235486 -208307
21630 2392 -180838 -115123 59543 -285812 -53328 38189 332592 -171007 -28979 281715 -199371
21618 114142 -216425 -144645 -53637 -5101 124382 -412881 -123231 -40658 159331 115763 -107538
21606 23134 -23580 -37068 -82907 155006 41864 -293783 -204206 -172261 -220431 -86553 -20851
21594 -222756 196908 -70334 -211154 -122809 -134415 -57085 -238816 198993 -278225 -390213
21584 -390213 -75268 170014 -353851 -268556 100148 -67753 -197548 388979 -58629 -40157
21574 -40157 -7107 157164 54026 -31981 216611 -167839 16564 331982 -96821 118082 244614
21563 244614 -138569 16661 -62412 -241586 -98331 -98238 65895 85472 22949 -153897 -166777
21552 -166777 -64524 -414385 -360961 8803 -298344 -403147 -481898 102143 -85140 -252846 183889
21540 -7923 -292538 -145681 -40676 92243 -116855 -161899 81555 -109732 -144594 -97097 -407496
21529 -407496 -338009 -149995 66460 -37388 127312 -85503 -151152 -200202 -452816 -126623 527
21517 64515 -40356 -186401 -44082 86561 173160 -115280 -19992 131445 -119063 -28681 6972
21505 57775 -142741 -198910 143780 -305510 20740 157031 -383356 170901 177530 181201 -129813
21493 -74061 -272663 -13781 168860 234607 -276268 198702 41594 -414978 23073 -9469 -125051
21482 -125051 -97030 -7195 -34374 63074 285 -50383 -273223 -43909 12065 -49866 229745 -61315
21469 -377846 -299561 -226547 -102349 98085 -227320 226915 -308327 -245223 -23559 -184659
21459 -184659 -377567 176603 125092 -252610 -176641 -163573 -110160 62764 -371745 111492
21448 -228040 -205063 148550 -302334 -21013 -263905 -119638 -68067 -17137 -51945 -147157 -103392
21437 -103392 -118738 -41590 206107 14570 102194 342574 -140234 165746 -74505 -32279 -110945
21426 -110945 -31353 233388 107993 68671 292103 382100 101082 324298 117563 -39255
21415 210418 -86798 242020 188838 229413 -241626 104646 -257954 40556 -275425 203608
21404 -379871 -53040 49019 195025 -300893 -180644 -168336 -59829 177059 -52204 16660 -5815
21392 48575 -107169 -281493 -30781 30415 -256910 100741 -30921 54194 -27149 -106982 -43434
21380 -63286 -52008 54027 -193743 166654 -106361 -211624 -51035 87641 -172221 49901 -225577
21368 22218 15518 86632 100988 -144806 41634 134492 -301821 36630 -50626 88145 193357
21357 193357 175720 -30496 111277 53061 -68057 -21456 -58239 -134410 30652 -52787 -152356
21346 -152356 68407 -40033 -250235 -191057 -106749 -74279 -417600 40910 -287398 248637 -10430
21334 1603 105504 -112361 117897 -157133 162176 -13230 192831 -56465 -107476 61199 -171420
21322 27425 -329179 -105949 -230351 -44905 40532 -100727 -62529 13435 185655 -106827
21311 205763 -126241 159612 102447 115199 -98849 85236 -55490 -484323 -40297 -51452 -151726
21300 -151726 -243074 -148295 214141 -143187 -190211 268106 -339270 -214608 -164537 -507101
21290 -507101 130844 -99489 -9400 -264944 -51891 -234165 -22526 103956 176835 -27091 -516902
21279 -516902 -162370 4360 -260573 -126456 -284777 -88620 -195719 90319 -160185 381967
21268 -227021 -205629 -237382 -34743 75472 92441 -265511 -191391 -30502 351673 -192655 199485
21256 -83454 240027 -66520 -50922 93376 -88613 105408 -47156 -188174 12564 216356 -93497
21244 -20832 -305934 44472 -83303 30921 30130 40397 137706 -251920 -171664 -283283 -174691
21233 -174691 -310885 433219 -339878 -19884 -16138 205101 -170881 302859 -100422 -106239
21223 -106239 161741 -270233 -50918 100899 183722 46454 -39713 231075 -286581 -89514
21212 -42680 -221273 -122794 -54552 -163735 -255309 -2673 34148 29445 225540 106711 77215
21201 77215 -62898 410075 -159312 36083 16428 -141970 -127599 -43963 -120677 50778 -34754
21189 -3774 168060 261601 366334 79220 -15197 -66733 -181060 92994 -45265 -425139 254856
21177 181782 64806 -56768 -386310 2909 -306157 -120247 -109351 94164 -508356 -492784 -152422
21165 -124687 -216122 -35143 -55815 -101575 46855 -507128 36492 -140845 112584 -157689 -329967
21154 -329967 -316639 41622 -19543 36057 -252624 127667 -95111 -165262 -389812 78735 -257118
21142 8615 -97602 165051 -428992 157089 -282410 -186697 -182451 40875 171074 -2347 63262
21130 -114686 -264578 -43997 27815 -285151 -204681 -274872 -62131 -12013 -173121 118071 178399
21119 178399 1499 97511 -2172 -94715 -140507 -407571 -4256 -236844 -14186 -346130 -2750 25146
21106 -201444 130094 107098 -67146 -120588 -222354 209480 -26156 254426 13210 21943 -49490
21094 35994 122940 95476 14848 -145233 -22711 -232387 181041 78049 -252992 9598 178678
21083 178678 106535 192775 -79900 14696 -191304 85220 -158891 -131324 76794 -288664 -135320
21071 64431 -45148 -92669 -345766 -37995 -259525 157411 -127823 -254755 -35698 -152054
21061 -152054 110862 326434 -341796 -90228 -128110 -296848 -69732 -43760 -220712 -84980
21050 -31325 -99233 -123529 80004 133789 28565 -38427 -113997 37199 4826 40291 253054 111468
21037 -87779 1317 80803 207913 -188783 -39386 -194604 20010 -193904 36734 -112729 37192
21025 -14383 -97707 198104 -76262 -184559 -193903 37122 180702 -227626 206992 46706 104011
21014 104011 -101985 48649 -40971 -142721 157161 -517015 -98372 -14607 -136261 -318839
21004 -318839 -192149 44810 -248949 -82648 -287368 123686 -80654 241328 72125 -63977
20993 487986 556897 173884 450546 353500 295235 -171414 102966 62768 344767 2023 198055
20982 198055 288982 -242661 -292910 -17177 114874 245332 212936 -108349 189138 -19591
20971 -103391 -74605 -134363 -18406 -285649 -70167 153407 119494 161125 -131230 -342258 -217281
20960 -217281 -211194 52976 -289801 -302655 -153991 -180075 51599 -87741 16296 94912 81621
20949 81621 31237 -33034 -6091 310949 -369737 -82346 21890 -127008 -40343 422088 -107827
20937 148070 -88945 -178392 -62976 -426479 -129944 3786 157306 -39981 225937 302103 568639
20926 568639 664151 153996 -58253 133949 -262919 -57286 119719 -5805 -168402 136760
20915 -108755 -156592 170240 -147307 -186009 -205205 -298508 -195881 146167 -41879 -249245
20905 -249245 -319318 -139266 -120766 25255 -53734 174600 -29980 15035 -42027 -78447 -185680
20894 -185680 36587 177464 -220743 172534 3468 -113252 -94814 27271 -4567 58699 -19132
20882 -219831 -260374 -48582 140991 203549 155900 -82451 -103626 -833 -109661 -332632 -144596
20870 -61684 312532 -240133 -421311 -258875 -282927 -106246 100112 85310 187183 -264985
20859 -104197 -178110 -177501 -331750 308405 253093 100173 -58167 -204808 -150750 -170851 164525
20847 -182356 -208430 -34059 -67281 56398 22090 79813 6599 67998 -351601 -385423 -169189
20835 186229 -5203 -15000 -5252 164466 -123694 -390418 -91980 -274684 -194356 167247 6083
20823 -2446 -240229 -261452 -539120 122404 -83933 152580 -10063 -192933 25609 252937 -135817
20811 40765 -131091 -278498 282547 261296 20515 120435 -312262 -51853 -728 -58900 -490127
20800 -490127 10577 -129642 -204486 -78156 -102553 -273631 -490098 232963 -133358 -293296
20790 -293296 -28202 -67075 41503 64270 -118672 294736 189107 -184401 25713 164006
20780 164006 -65970 -244545 -55039 -10102 -398265 -237103 21030 -221663 73532 -7573 -170088
20769 -170088 -51149 -13739 -209877 -262778 -247207 -176083 332388 68444 -142278 145569 -105249
20757 -46194 142400 206784 31007 -425164 -121256 112734 -854 -27422 -166185 -284991 51432
20745 -314021 -126022 7349 66475 -174743 -32454 -83198 358982 -22125 111501 -334274 2068
20733 -172872 -120346 226269 -105278 -224669 34190 115027 48051 -74337 -105578 -92534 -175259
20722 -175259 2822 -124943 -22765 -221086 -174637 -175736 143400 -125936 -122988 -220946 -208042
20711 -208042 -178619 -41729 -61811 122807 18381 -78347 -133459 -56730 -82920 -150648 -140702
20700 -140702 -50320 -355169 -55008 -106748 -236348 -251611 -337398 -93923 -281514 -166478 25258
20688 -360208 64184 -74812 -352966 -70527 274155 16775 69666 287236 -41112 -83425 -254467
20677 -254467 25856 -104986 14769 -110272 117462 -137978 -227754 -93784 -164285 -176692 -45237
20665 -41325 132175 237959 -73286 68284 280676 -353042 -261768 -42335 -65633 -162242 -24440
20653 71611 -78099 -341808 -96549 -245891 208209 48237 26675 172282 -235756 -129603
20643 -129603 -234153 -65167 168174 -13104 25604 -221497 -8607 -70537 311818 96345 48427
20632 48427 -182068 9830 -13325 -61871 -159024 110926 -18335 -22862 -46748 -310988 96110
20620 48250 -171210 -91154 -203782 225627 45093 -313149 -298902 -225363 -128215 -34832 -132904
20609 -132904 -494588 -59615 -956 -163564 -103995 -50326 -44293 -34720 -128358 -398562 -61894 163633
20596 -251757 -34198 -479666 -260345 -21677 156572 13650 71506 226685 -65733 153283
20585 -122446 127990 -380876 -101097 -261840 -110875 -202593 50525 64644 172334 12223
20574 -46166 151047 36231 -232919 191872 36 57419 -349029 60917 14119 -107386 -10715
20562 286633 -74653 -144050 -155960 -30073 -211398 -175959 -105704 -239070 100462 -29054 -270971
20551 -270971 -1510 -464402 -181601 177954 -207777 -131872 112493 -83569 -198973 -316239
20541 -316239 102339 270711 -47349 61596 -152266 -95283 -290905 -255162 15282 -382779
20530 185275 -279076 274117 -218447 203340 -226847 -92827 142716 63953 -104768 -132392
20520 -132392 44558 68474 -226113 117678 -153159 -56643 -16807 -226884 34973 -102763
20509 -293836 -329712 -404004 216852 -213908 -112965 4234 -6940 -56614 -279119 225857 -6143
20497 -316347 -138746 -93565 78184 -217361 179423 160613 -304285 75953 -141066 -304469
20487 -304469 -154651 -96584 71351 128456 197993 -181726 -88321 -395143 -65483 -148189 -56588
20475 -248043 108877 37176 -33327 -114938 53014 -42615 37075 19059 134754 -200894 70553
20463 -20048 93216 -21757 104883 125961 -135573 -90090 62996 63040 -123873 55672 160495
20452 160495 122688 -27192 30861 16834 -243499 185064 66455 -110339 -118546 199887 -141379
20440 -97036 87282 56010 183781 202892 -195523 -459717 -37253 184601 -297429 -152585
20430 -152585 70100 -253832 -62199 -302606 13457 -2736 -100323 -140995 -267274 -92639 -228699
20419 -228699 -265421 -142248 -105124 -139099 -136130 54055 53826 143494 -184921 -123388 -176009 383724
20406 1898 134293 -106888 -165346 -29317 -36854 203610 40968 188952 102786 87930 227426
20395 227426 -193820 -217171 -117182 -334452 -108996 189460 -6084 -321732 17566 13027 -460803
20383 97508 -211582 -70199 -170934 -89289 -82273 152647 -401408 -163055 466255 18259 17947
20372 17947 252565 -165638 29717 -309248 463226 -430374 -243425 129720 143995 297316
20362 297316 -36913 86374 -246946 -366724 10950 291909 -202719 104556 -211211 -105770
20352 -105770 45018 -323830 -413509 -230489 66941 -144113 20339 -54155 -76703 -313710 -148610
20340 -490 -167601 214768 -432063 180325 -125931 -186006 301536 -1835 -242295 -56945 -105958
20329 -105958 -266920 48502 90085 -42743 45320 -105615 -143158 -9241 -135185 -245459 -249290
20318 -249290 221388 -265669 -310361 -17935 -3611 6720 230566 55337 69870 76944 149073
20307 149073 -370227 182854 -220102 -386232 115036 -259235 77342 -802 433132 -410403
20296 159766 -120093 181397 -35227 -255204 79011 -18357 189225 -190376 9161 367339
20286 367339 -58670 141863 -265671 -183595 -91283 -6467 1341 -272951 -76345 -160462 14077
20274 160993 -42386 -324846 -13378 178985 -23546 56545 -115214 -327951 21984 -260252
20263 -7409 -11718 -320206 -157608 258865 248608 -143042 -195470 -260407 -478066 -216448 62439
20251 -60882 34188 259303 -114853 -408838 -30220 40936 353986 196112 -224940 -294000
20241 -294000 -139538 -457339 -25002 -190914 -202107 96394 -125219 55128 -269756 51046
20230 -60475 -169206 -130382 121873 -100601 239620 120302 -191284 213511 107440 -49570
20219 392855 -172903 144039 -63126 16862 -447411 30577 -263132 -373055 -62944 -158234
20209 -158234 533 -61435 86112 -173115 -136007 271902 -238192 -171171 -21721 -285478 124545
20197 62602 -172621 192989 -14391 -160205 89779 83749 68260 92732 -124280 -88150 -109385
20186 -109385 -257811 -180960 219363 -71447 186052 -115366 -74363 -187750 -369705 363615
20175 123695 292494 129686 -174620 -22718 5931 -110228 11242 23085 -183961 -146784 -26180
20163 -136375 -38405 -185102 -13664 -144080 -229628 -47812 55691 -205566 262482 -182494
20152 -3192 -54291 155171 -51885 47455 57381 122244 88532 67415 -3980 -316936 -178102 -134314
20140 -134314 66617 412645 -233443 -121827 -162635 394402 432965 177123 482937 448513
20130 448513 463646 363816 576476 341947 327147 328406 470917 703055 453428 254161
20120 254161 7122 -89030 -40339 -75813 -157407 95520 -28188 -22828 -273933 -373505 -13532 -84496
20108 -84496 -369195 -57416 -57547 -14549 -311746 -20891 -18573 -82839 -28126 -224743 101495
20096 -64531 171482 -303711 109452 -303196 -121046 95548 184971 -171966 73468 -55713
20085 -80686 141280 -195158 -162488 152504 -86957 -175685 -21355 237275 -205498 29131 51608
20074 51608 106602 -30553 -71640 -23773 81377 -297288 -104232 54744 160575 -156204 -227984
20063 -227984 -120593 -296486 126895 51637 75554 -688 -310865 -322594 -24680 -85818 -71166
20052 -71166 -39033 -286999 -345249 -84034 132310 -37857 59458 30522 -24239 -101155 -101695 55848
20039 140563 -132830 -390534 44040 19751 -112250 36417 61004 -168188 -370206 -4584 -144146
20028 -144146 -208336 -146368 -174663 -268665 164639 -226520 -399733 -82838 -157444 -104717 -68268
20017 -68268 213782 102003 -37672 196683 -192662 236243 -336565 -133091 11248 52140
20007 52140 25260 -327067 -98709 313195 -396180 -146689 -106883 154637 139354 -141667
19996 279747 159133 210933 45292 -139900 130533 -97842 233370 -267087 106462 -96743
19985 -94633 132556 52445 -177830 206399 286370 -78986 205204 236028 279857 -196231 325000
19973 272432 346601 -265901 67286 140137 75764 -92905 37193 -246475 55872 100236 149519
19962 149519 -105553 230407 98100 192229 69047 -688 -74652 -280617 12364 -195583 -94289
19950 225038 -127172 208073 487349 480676 175645 349750 -177150 187072 54573 113582
19940 113582 36028 12152 -28030 123952 56067 -395593 158552 38920 -128135 -150483 54944
19928 -183722 93892 -80457 141161 247252 33151 107463 244622 -101325 8257 130962 -40106
19916 -138001 -437711 -146428 -70026 -169615 -48628 -44307 97811 -301 18841 -336051 -349877
19905 -349877 60916 -147119 -45052 -7058 -380358 121211 331005 -25734 -379929 -63822 -80094
19894 -80094 164314 -22361 -56222 -205521 -203345 -163849 31311 -149395 -79294 -126646 284799
19882 -97552 -184103 -184594 -212846 -472356 -148847 -312809 -279642 76572 -230860 -19130 -137513
19871 -137513 -127698 -95801 235489 57772 -285649 -21164 117601 -527749 -273427 -152933
19861 -152933 -259929 83186 -19842 196850 56647 -13491 -140115 -196120 221913 180518 -564085
19849 -307961 -191588 -114822 -423038 68037 -25651 -246673 -20636 -214424 -156995 -26234 -370472
19838 -370472 15979 53081 -61767 -94963 -217742 254854 133908 122391 -218766 -53489 -78097
19827 -78097 -154024 -98041 -33545 -396017 -144012 40385 166390 66722 141331 74358 -244928
19815 12820 -184941 -291491 16132 25976 -137814 83866 20629 -121485 17051 -201499 -27695
19803 -91794 -71150 -84114 -185609 -132787 264705 -25273 -201559 -4204 -93027 -400234 -248410
19792 -248410 79717 105565 90370 -88861 -225115 -234196 -325071 208881 -450620 74777 304491
19781 304491 224191 -270086 -134440 330629 -257913 -65010 -166583 66253 201721 550788
19771 550788 75599 -273778 -224677 -5371 184993 -60613 -201467 -119464 325536 74273 221275
19760 221275 -218142 207248 -211673 -153180 -265144 16769 -163516 -77361 20425 -270539
19749 -280632 110145 133856 -80001 70917 -148515 -22052 -224800 209015 -182925 -11720
19738 77251 -143830 305416 50239 21877 -14506 -4501 183909 212327 111914 -173033 130556
19726 2860 -20416 -106376 3857 -163703 -102909 216634 37470 152766 -58525 16446 184149
19715 184149 281631 833519 351838 353129 345763 249153 -151561 95250 21456 96274 -115271
19703 127298 43078 -67699 150762 -311345 188166 -229829 -145425 -258814 143772 3357
19692 -358318 40123 120743 -41237 16000 145861 77789 -157152 479840 -11819 202331 180867
19681 180867 270671 70725 283086 72651 -204643 67352 33030 -46436 -88128 -261979 89031
19669 125231 -148978 -37103 -463048 -65384 289086 -423910 -79067 16320 -31983 -267376
19659 -267376 -82969 -153622 -40703 -281521 -560162 -139509 -154905 -159031 -266226 -175373 -35873
19647 155799 -9223 98509 -6367 188793 -407214 136453 -290936 -280304 -179633 176998 325336
19636 325336 275399 114100 -228890 268625 128059 -135536 63272 -115214 156129 169105
19626 169105 -334104 -131424 -260231 -94318 1879 158094 -315124 -84391 194199 -306665
19615 -202443 -196297 -282381 -360807 -199785 -86405 -90435 -31206 -356267 86523 140066 -88786
19603 -173260 -165532 146073 -111455 -80992 28612 -49058 -29719 -42898 -31322 -62370 224430
19591 102057 -133747 -109632 -23084 350360 -3153 -152873 -293024 -40457 -212764 -134519 -343633
19580 -343633 -281479 15687 -12220 47990 -82065 128419 60280 -34635 -68007 171782 -16793
19568 84923 -111020 87334 -285881 -92156 45399 -350333 -151464 -12495 424028 -150457
19557 -379764 20413 -74761 58191 -133624 -269922 -275415 22143 313108 -88111 -243003 -73064
19545 -65544 28485 -36564 -99876 -137370 -1616 122169 221735 97838 79772 172583 -104069
19533 -20648 69691 -35593 74233 -214343 -128460 -241138 103536 8545 -101783 -62892 55210
19521 -146448 -139771 -274952 -60278 152896 -527987 -195726 147475 -134686 -272489 68174
19510 -20048 124201 180619 46745 -343667 -66948 -96182 -185166 20764 -31535 -120238 -107335
19499 -107335 -184232 38306 -210486 -62197 41475 -148445 -325876 -125604 -153405 113358
19488 293421 232959 -104500 156190 -233192 -58700 -98931 -235286 109713 -177770 -61116
19477 -79090 166229 -77932 -113655 27330 -113520 271076 142030 -216412 -240517 -25343 56479
19465 34631 -234165 42566 243296 1156 -236469 -62823 -84557 -6554 -160296 -40414 -152351
19454 -152351 60462 -566713 371860 -352314 366801 113544 -150213 -126179 -248614 -154456
19444 -154456 -184758 -112278 -130517 2183 -335685 73997 -176628 169841 -7260 -82372 -101383
19433 -101383 -165221 -153919 -576645 45510 -10134 170928 -16399 -140864 -149171 -77166 -127384
19422 -127384 63386 237524 27970 -366890 98308 124671 -62293 212963 212142 16479 -264268
19410 182521 23506 -136451 -388768 -50816 85232 -423801 148921 -262711 91905 -317119
19399 -110289 -282350 -114083 -101193 -98264 251384 -84458 -10509 -82818 -217132 -263058 -136554
19388 -136554 65666 307936 -41322 -152793 -6041 -109438 -68159 -222126 155658 -77361 13883
19376 -93154 -291571 -406825 -229187 62266 -228556 88140 -221139 -189801 -351671 -295228
19366 -295228 50987 -85987 -95245 -159816 135047 -209243 -270549 -63222 -85129 -164226 5986
19354 -248267 -80512 -205995 -116797 -133312 173970 399576 -74830 -166138 -244592 221420 -127429
19342 -396326 44214 -43200 87937 -39695 -256624 -4955 -307074 -394059 -19865 -62053 63888
19330 -326831 -112275 -322701 -88122 -203095 -68459 -77536 -14848 -74708 -49779 44340 236255
19319 236255 8202 -220647 65037 -65941 -393438 -226299 211505 -25358 123451 175680 -41227
19307 99010 -40949 -43831 -159590 7030 -136186 -148542 -164840 -634039 -280653 -48887 143730
19295 -238895 69391 124493 -115672 52526 177610 -56252 -56030 105313 134156 85171 -28442
19283 297559 210094 -172868 149243 -174239 -295515 183068 -63773 -123616 -238000 29655
19272 -81434 -107116 59532 62939 -32339 -197183 -494184 30245 -300098 -16473 226891 -169881
19260 33909 -101381 140785 -57360 30102 -7446 -199961 84160 22244 -36125 -213499 -219056
19249 -219056 -87428 -85395 -231789 -110852 -387636 26416 -426910 43802 132364 -276342 173662
19237 -36669 -305342 -204502 -25057 -152313 -123869 103466 -124234 -168154 -37229 -215384
19227 -215384 74244 -70853 204421 99234 13064 -28750 62771 -165989 -203908 -126782 -46692
19215 -18667 -548857 -25339 -256617 28936 82559 -216722 86235 59120 173037 121613 36917
19203 78136 222239 173862 -166816 203916 -333453 -37499 -360610 39681 74569 -12031 -93856
19192 -93856 57529 -132922 58846 -62475 -455462 -180208 -429058 -269120 -437650 -300871
19182 -300871 44948 -80189 28354 269298 15158 -271765 251769 -138524 -186143 -11715 -51248
19171 -51248 -99996 -152466 -93352 -267006 -52755 -81650 175932 -51635 -38302 76159 -169051
19159 -58127 -326289 -43898 66716 -18856 -253341 1480 -241827 123111 256411 170663 -97895
19147 -289155 -166913 81173 280179 -106406 24259 -248726 -132013 -328006 -152670 -349112
19137 -349112 -159804 -228045 -31811 -200458 -112759 -248707 -236521 -412265 -138291 70214
19126 88301 273246 -122947 -76795 -275861 -350843 -81820 -48565 -140962 -327159 -64162 -20083
19114 48254 -48387 -300426 -37664 32934 -41173 -42631 95208 -57217 -436652 -43146 -100727
19103 -100727 -208 -155783 -453373 -59756 -146504 -290503 -370964 -246559 114794 -338580 -234525
19092 -234525 -195414 -183684 37330 33176 -11140 -50917 -95270 103568 59671 171076 -301884
19080 -26540 -137013 -388491 -27062 -111607 -278319 303548 -38393 59803 -559702 -199233
19069 74077 -263919 -319629 189909 -231705 -375879 -44321 -202814 -256981 -255265 79578 327314
19058 327314 -169743 149904 -172700 -283504 123279 34408 -292176 89326 -18224 184709
19047 20891 -88715 -385734 105790 329465 -121567 11201 -418113 -269506 -33950 -142436
19037 -142436 -255502 -118045 6243 19334 -127647 -17933 -49158 107095 19019 -264754 -339034
19026 -339034 -101602 186 -76228 97992 -191179 -333830 -20842 18856 153548 -27756 -26220
19015 -26220 -125390 -250847 -429974 -4249 206653 184403 -6135 132104 46668 95116 130518
19004 130518 57950 302858 177832 215183 330221 23926 53985 -292428 303663 -193799
18993 223140 191965 -119951 274849 89641 -265595 -174106 -40897 -1190 -238788 -29604 -24457
18982 -24457 -59104 332 -124669 121830 160496 -342077 -200713 98239 174646 35396 -156650
18970 -81732 -85477 -485079 131594 -33335 11994 105957 -252530 54369 28521 210633 -153532
18958 76801 198341 -181114 599543 813367 160286 171605 97484 -205772 91572 -95076
18947 -397681 -77289 146283 -244404 -197830 -16220 183460 -193898 -157468 -15672 38477 -199615
18935 -75933 -288384 206541 140980 96127 144393 -424309 127466 -92455 21619 58309 130841
18924 130841 200338 161447 -75714 186325 193800 48342 -111814 -117289 -66331 -103659 -66672
18913 -66672 91007 271031 -181743 14318 -49430 -150959 -95752 -202802 -167784 -312877 -178702
18902 -178702 137882 52982 -84780 33546 -40556 -730 323869 100071 197365 210956 207237
18891 207237 248779 387608 406052 106473 71301 25434 -197647 -70641 -151515 158993 -83129
18879 -55037 38232 -42626 -30852 -375374 28985 -48721 -167964 -333396 -322229 -9554 88813
18867 -73574 23217 -17275 -120097 -58460 -84991 -400740 -189280 163704 -39485 52038 84386
18856 84386 260803 -13614 54384 -125272 199310 -148940 87394 278329 269582 88843 -163527
18844 -57182 -52893 -298467 51453 95292 -7768 87161 32060 -172463 -16621 234749 265618
18833 265618 -20310 -180044 178458 -21732 -178929 -54741 149611 -217943 97203 250306
18823 250306 134507 -75252 3157 252139 -315735 98437 31025 -132992 104858 -619082
18812 -193241 -214923 14819 -281990 164768 -42699 -36222 -66288 -94348 -182723 8543 -63841
18800 332041 -177304 -169941 -133381 -266348 186012 -312371 191798 -2177 148887 -204907
18789 122389 62764 129276 -20809 -131034 -70902 -11366 24116 -25794 -191633 -35440 -237877
18778 -237877 29797 -332269 226353 -144310 -191547 -185085 -64901 -330805 -30663 -59121 192241
18766 -76610 5502 53944 -195472 -153617 -197639 -154116 160352 -229940 238730 272245 -72800
18754 -35022 -162248 160643 9848 -238298 -214213 98303 -52497 145831 -242761 -30564 -209601
18743 -209601 -75860 -209579 -157035 135149 -310034 -298500 17339 209924 -14458 -110660 -32570
18731 -14641 -93010 -116162 -61307 -519272 -106937 43222 -141163 -218340 -210220 15717 258615
18720 258615 -24565 -323549 -181974 30283 -62839 -12272 39772 -242545 -93521 56473 -216623
18708 -103846 -187928 24980 63029 300274 -213878 -388986 -22569 -68415 85364 247854 -74027
18696 -251762 -46683 -101594 47162 -23768 89136 -177814 -391683 7109 -247343 10422 90324
18685 90324 170517 -202370 -134563 -246651 -198835 -38824 70561 -51480 150996 -111537 -277258
18674 -277258 287233 -68610 -3200 325595 -189176 37022 -10093 -41183 -150395 -147774 132357
18662 -90580 284322 -113753 315521 168073 -29863 -5677 -337682 203418 -99256 -264031
18652 -264031 10898 -73622 -255086 89912 -240483 88983 -124335 -35649 -50091 -48020 -97069
18641 -97069 -108286 129690 -12832 10777 -212903 -309637 286165 119877 146193 -190630 14678
18629 -273898 -308151 51639 259152 -148418 -214011 -290611 -90344 -427640 93900 98310 -52324
18617 176156 -79248 -146965 159067 -85921 -288374 227411 280187 -98740 -261999 -63093 -8229
18605 -37382 -155664 40453 108960 46808 -216451 -174320 210455 -445688 117184 -203698
18594 -49052 155008 -48833 -190171 -125154 -43872 -197801 19435 219031 141995 -28639 -428530
18583 -428530 358 40630 245409 -200227 -89568 174690 -116962 -490042 -103598 3702 -351683
18571 -232987 -84251 -233640 159894 -55813 -92682 -278129 -87860 -57534 54375 -21296 -154766
18560 -154766 -173843 -85876 150064 -95367 -103473 -383772 24436 -305499 -203457 -22283 155873
18548 -11401 -47507 51131 -290608 -94188 106333 16697 -113707 351075 -17835 -80832 -23619
18536 19625 -19683 -98591 -205673 108080 270998 226667 -272026 -329968 18954 -167512 140024
18524 183544 276920 -150911 48561 294260 -259351 -115028 237067 28195 -70467 147181
18513 84022 -219735 -204776 -495800 48948 -71232 91905 -55338 -143629 -126700 32290 -5426
18501 87174 159210 -250854 75887 -141173 -271984 -238061 -15873 -354940 152990 -216711
18490 117204 -213873 -195548 22734 29650 89704 102040 -218932 -48276 143666 206513 343385
18479 343385 -106914 214624 141880 -321929 2541 410510 38784 466022 57586 -84622 -68510
18468 -68510 56506 117246 -42755 -119854 252128 -279441 -292004 25538 79585 63244 -94208
18456 -176799 -74504 153257 53063 -150829 176993 -31249 -150461 32860 -54539 -290626
18446 -290626 264119 155897 247413 -401400 -3762 -42173 -134419 -96044 -391608 -96660 -262686
18435 -262686 191544 86211 -25616 -43847 168826 -336944 -11340 -8937 -196155 -129767 -317976
18424 -317976 58584 -80113 -92435 -97821 97484 191312 -171158 -85076 -108097 -64187 347691
18412 18085 16948 -158699 -237749 216121 -17914 -66797 -232531 358019 111972 123216 189528
18401 189528 -256676 -68499 217136 56700 59778 -93 140968 -19973 37666 -366627 133713
18389 13757 78066 -56138 86521 105132 261461 59455 62424 124371 266989 219479 -64943
18377 -70496 126180 12901 -308762 12228 78144 -146245 25516 -83017 277064 -19443 -195311
18366 -195311 -300048 70396 -49963 65706 -131448 -88073 -211194 144049 -21725 -102898 14615
18354 169882 -297244 -243593 143555 73874 -164700 -40218 109793 -249391 71135 -366627
18343 28459 203013 99367 77515 27741 -226455 294712 -68103 -135581 -409634 129218 70736
18332 70736 33151 -25980 -173086 36294 236610 81148 -228768 -100121 -179929 -24098 -359036
18321 -359036 76632 -49594 -21714 76238 -82298 68059 39400 4109 20585 -39155 -27812 251180
18308 78605 -49032 -9393 97656 39236 75712 154104 -261029 123903 27266 234294 -25917
18296 -54961 -189283 -184842 103483 92750 265905 95190 -187360 -125269 400706 -99813 22451
18284 94176 206526 8126 -43298 -218375 52233 353696 -349515 -6538 -6231 -189989 -251860
18273 -251860 -170056 -125292 -339739 -125224 -186319 -306213 -178944 -165542 -372558 -18876
18262 162321 -21867 -242376 -49215 233991 4683 -158337 -304387 -286674 -233185 -208476 -115495
18251 -115495 -5770 287468 -264083 -46204 -25359 259955 -40891 -6804 -221559 83048 -250628
18239 -373987 80233 -396094 -130105 -85376 117976 -90316 51529 -52279 -268194 -252540 -166483
18228 -166483 -120047 177118 -28541 -281933 133786 246064 -47090 -164819 2776 140922
18218 140922 44943 125488 185754 81466 107854 -140878 -166566 -263758 -923 11247 -87296 138433
18205 89659 88432 -8268 207658 -106792 -102119 24419 -7836 105297 -123783 14657 31766 -199405
18192 -297983 1174 362255 -121471 -234268 34184 -372973 -172554 109222 273007 -98937
18181 142869 3994 81012 -56503 -49660 -28688 460122 35774 200283 -34058 132501 125756
18170 125756 -19823 158069 -16630 -15222 128374 -46789 71674 197632 70125 430753 -112053
18158 -268467 -98812 132555 150286 488367 59843 10952 -152282 85929 76555 161260 31687
18146 -41018 66020 -139298 -40399 21596 68006 184879 55817 136708 186971 21612 -29369
18134 54668 123788 267019 -122852 66262 125967 -286444 333090 197386 314215 -469262
18123 251035 -168866 -13531 -332988 -35759 90806 -208510 -23349 22102 -173717 -66484 75344
18111 -69501 -96877 31258 -493775 77286 412492 -39888 142647 126724 -106083 258485 63262
18099 370100 -8444 -446148 77173 -38374 119378 67405 -381423 146873 147883 85643 -240122
18087 -120664 -96941 -75530 18353 32597 -125645 -198619 -317211 81093 93970 43988 -163182
18075 -94953 -253900 -215955 -71564 -198060 35996 -25398 109481 -150868 91011 -163500 114717
18063 -49959 -94020 10271 324274 -21623 63209 -141461 92632 108023 -109474 -157177 344694
18051 -110758 -30855 23142 259351 -141086 -299122 -236168 135274 -136146 286197 -163373
18040 -99353 85873 144608 -295788 91353 -185159 51318 -49013 -371038 -32500 85053 1506
18028 -35169 218583 9533 -242125 -123410 -8836 66283 206685 222048 186339 349079 238124
18017 238124 133515 251035 -74921 150698 42376 -11263 -142359 -191198 -18559 -216354
18007 -216354 232636 -256275 -99063 77845 -261883 -378581 47681 -60461 174822 28540
17996 277071 -214568 -114471 230715 -35260 -257052 136547 162695 -383166 -13135 97886
17985 -70690 -43342 30473 -15806 -66690 20878 119613 115390 57422 204874 -461862 138085
17973 152414 -25495 -115020 34654 37194 -152938 174017 -54326 -163223 215486 126204 -51591
17961 -100733 -24118 -152286 69234 -221685 -29533 -54644 91107 -192218 -34413 -213774 -185911
17950 -185911 364839 178912 239311 128802 115965 120542 -51059 19452 2910 -99187 223758
17938 56304 278498 162428 17187 17381 -85365 237064 84392 -100450 -30894 -68702 -102326
17927 -102326 157311 30114 1560 -165991 -129027 -156056 -85312 -84999 129053 -70436 89671
17915 -148925 -154995 -220393 211392 134306 100876 -257188 159723 29276 98131 -183979 -263838
17904 -263838 -25897 58052 59261 25996 -236595 181329 185899 147474 136730 -257297 79015
17892 -255686 -33871 137701 -366166 -42058 -78390 -183157 125598 139935 -99589 -28755 -77246
17881 -77246 -119284 -66690 31149 -71904 92158 134936 -385101 -24030 -106522 -180208 -4322 175250
17868 278999 -59166 258418 58407 -29947 264107 -9757 483080 -1012 -238744 -197109 462575
17856 -107252 26868 134419 -5077 -22647 -53683 139948 57351 417543 -95212 153806 170671
17845 170671 -19886 406716 31622 -23826 58267 -202412 -46021 -109898 218947 -242501 -87756
17833 -96499 -212077 -163013 84761 -57827 -223826 -399671 65498 97647 -69272 -31278 131311
17821 99216 -195714 -266208 42873 44995 -123134 60257 -64667 38289 299124 60932 122516
17810 122516 9119 4642 122559 71290 168039 87982 -125924 -133710 106095 227396 -90326
17798 -129542 360015 55633 -18882 8226 98243 -12719 -74067 174665 -141354 38777 94537
17787 94537 299805 -113976 -19216 101451 129699 435400 261994 192833 -91639 -247325
17777 -247325 -237008 32717 -68157 103768 -300287 277404 -6090 -104208 198495 306253 5061
17765 -137918 178293 10565 278661 68542 186439 -184798 208779 -309174 84166 165388
17755 165388 -210425 -59843 82929 -16895 109366 190404 221120 83935 238618 18247 -26244
17743 -18036 59496 78522 195570 312096 327919 155592 -102416 -53798 -101644 -53975 528978
17731 -72343 -27492 42848 90018 -246009 -195748 14356 249394 67742 304089 16267 58228
17720 58228 -145311 336594 -49675 36561 86907 212715 257065 -9117 -203427 -123222 -25895
17708 91195 -22344 -110607 241479 -122625 155882 279793 8840 170904 19143 1487 361440
17697 361440 33610 223343 312506 -74094 -179573 -236843 86478 79238 -24964 240442 44847
17685 228757 -4886 123630 344825 -87686 65377 -263809 131449 160539 -307378 -175901
17675 -175901 76524 39385 -94224 -197829 -58877 -41367 -27494 -86902 79482 35606 111999
17664 111999 123547 153166 -51921 -34022 47879 -64396 55400 321660 63252 143947 220771
17653 220771 342296 143523 535267 172534 272013 271534 -66883 361150 131943 133183 -27626
17641 82510 54324 -6019 -65381 42962 -263199 16486 170739 138394 265997 87389 -125290
17629 3347 284249 450901 19537 82848 167849 130909 238107 -219720 -98706 -104726 287242
17617 212889 61884 -143365 84901 69409 115875 -291211 -246684 97345 -22720 461002 -6172
17605 -1179 -141766 162847 -88418 -96146 -234708 120779 179318 -28816 -144224 -42357 262814
17593 348096 170977 376925 152490 4498 43051 72397 14379 45813 170562 -141739 189480
17581 -71593 174904 15 84168 -90870 -334 253351 444559 77512 41117 353962 108298 326811
17569 326811 -80399 -104140 -18462 336046 -3050 245298 148139 33612 475728 157697 -169610
17557 -79496 117904 315083 -20544 178896 55711 79759 -92656 3299 -94136 283777 -315058
17545 132288 112220 251582 383528 335722 30139 338489 415959 253924 171122 265895 -12987
17533 405279 220642 240722 205179 316742 260946 78070 445179 398326 297154 50975 82886
17522 82886 223001 -206285 289512 223535 329751 498053 190481 183933 168423 486854
17512 486854 531785 765618 660862 1038102 1080619 907971 625684 483906 658982 512280
17502 512280 458662 458565 302649 262930 495318 139599 638968 746831 996140 1298645 434373
17490 368744 848049 489586 508804 357319 562642 389714 168992 330633 335025 -11003
17479 110597 105308 277615 367887 307152 508418 634222 245788 122862 416989 339008
17469 339008 330627 563370 295079 315841 461272 467561 406645 405798 117449 302251 403291
17458 403291 358863 235392 501477 335654 280984 602921 443184 -112603 318817 543468
17448 543468 126323 354816 433252 311143 100868 -130376 -57283 451978 186390 493870
17438 493870 335550 264097 589452 432288 395605 492205 524681 390578 506649 588789
17428 588789 711416 478328 731964 334185 568316 520242 381143 326929 365982 306441
17418 306441 69241 237715 330771 422036 465869 108838 556495 639918 355887 231674
17408 231674 569498 664850 614312 878748 297912 509235 465030 448945 441629 660364 438351
17397 438351 739679 468041 738800 652973 242913 276916 258656 376579 305882 217764
17387 217764 296392 408627 160166 102922 346470 143001 350693 506805 404449 225946
17377 225946 215754 44012 204735 380262 314757 261628 339848 515189 177538 346920
17367 346920 221510 -17574 158242 214288 412561 -34109 189780 518709 364715 318910
17357 318910 315698 274358 530540 273277 222641 10422 483665 236786 651766 42005 324308
17346 324308 177561 484827 412267 331839 471420 180129 579008 119059 497701 319923
17336 319923 91230 303511 324316 168671 88366 225634 7491 227189 62405 440752 405716
17325 405716 22275 218552 140512 351536 282114 252082 408696 6085 345390 286072 377417
17314 377417 477960 581398 529298 685012 249103 203893 419157 41007 358788 333479
17304 333479 -43282 124715 387100 81452 416442 505605 317490 191293 205133 439925
17294 439925 237023 92157 -67693 601892 435972 312771 -11293 539157 334089 306858
17284 306858 152190 269890 154074 -31313 349403 338964 256898 557433 21778 -116879
17273 14518 337302 188054 225562 150547 497084 373195 522590 201306 418304 629095
17263 629095 629569 557392 204302 163681 355545 694431 -65114 623398 424164 296843 548602
17252 548602 300764 213606 729531 760427 132574 309628 136856 212175 313116 296419
17242 296419 110450 487208 197233 61163 293773 376765 207588 220663 239285 213721
17232 213721 363419 761323 330947 115015 427186 348395 178720 502394 153485 280211
17222 280211 132523 227584 596734 28664 434459 215625 108687 433351 298688 500981
17212 500981 157514 258562 325441 407096 599909 325687 411692 172886 226387 538201
17202 538201 326412 448414 579415 390493 439504 -235893 472616 443782 723749 387837
17192 387837 111021 195609 546730 316834 535625 667631 181601 195511 233733 407806
17182 407806 459652 851569 585486 351718 267443 437837 -23514 320499 547701 451037
17172 451037 382572 496125 360662 339258 268242 574454 369202 210359 462382 692660
17162 692660 365177 442366 481769 263314 331396 256306 795731 306210 484868 292640
17152 292640 747061 293189 503765 531378 348043 421138 471326 522462 236279 622192
17142 622192 267151 418250 407139 865918 309800 220629 514050 503035 300983 453695
17132 453695 444571 764325 376824 248455 386159 735193 613060 765810 614422 604992
17122 604992 688988 438264 577442 495167 702668 686652 489279 499376 597647 427059
17112 427059 635913 916619 353959 663475 599275 656819 597055 517564 504026 735848
17102 735848 726192 564959 740893 615510 524182 333767 768065 598124 216720 1004034
17092 1004034 507170 746122 581757 446522 473650 586143 624130 626364 468182 903240
17082 903240 611086 315333 744747 802314 618286 717271 861148 885355 578790 1099572
17072 1099572 768227 785825 661067 961090 1038011 617334 828790 543646 797892 862756
17062 862756 687132 844580 855208 1094569 387378 869341 651421 1003779 1126291 1149128
17052 1149128 898705 872314 618460 863114 895951 414931 1225441 967466 625532 940044
17042 940044 1085420 751289 1048774 895278 920926 858626 795416 800775 1061727 955620
17032 955620 1178307 904258 878401 865654 922570 928668 1055529 882412 610995 1055573
17022 1055573 759295 1167565 989975 746322 976969 1045805 1127951 991968 1361616 1198533
17012 1198533 1180282 1136395 1040201 1029943 1248542 1024522 1253521 1133655 1045127 885997
17002 885997 1194571 728509 709546 1153280 893816 882109 1094080 1079616 1097068 1150765
16992 1150765 886054 1158719 1092599 1344015 1176843 1504912 1338145 1466648 1287264 1197446
16982 1197446 1464960 1393759 1454570 1096020 1440767 1447305 1507856 1558490 1425653 1391489 1318054
16971 1318054 1303185 1701478 1073857 1413632 2004248 1238019 1192578 1193343 1624027 1700343
16961 1700343 1614629 1513775 1425642 1402983 1373167 1738103 1741236 1488018 1692222 1589827
16951 1589827 1600673 1807581 1646654 1655747 1871027 1600045 1641683 1955092 1656194 1532724
16941 1532724 1649141 1801160 1836696 1971562 2031030 1837793 1684569 2003315 1929176 1642872
16931 1642872 1768095 1813147 1657084 2036021 2161109 1862019 1998643 2068509 2315100 1776726
16921 1776726 2148116 1953167 1978410 1978256 2161550 2037198 2358952 2069826 2204224 2107488
16911 2107488 2372660 2473055 2201167 2292913 2495606 2320723 2383611 2369156 2276753 2246454
16901 2246454 2568598 2639436 2564524 2820385 2907699 2623496 2861105 2627478 2848533 2757513
16891 2757513 2501558 2969093 3003484 2776800 2713853 2857974 2819399 2912362 3174644 2936254
16881 2936254 2967642 3125561 3148921 3112405 2912487 3070819 3645626 3050611 3594011 3433263
16871 3433263 3359839 3492395 3510873 3135825 3489143 3751723 3552391 3464846 3533938 3691892
16861 3691892 3458606 3884474 3919028 3931956 4124194 4200237 4411288 3938745 4215980 4154549
16851 4154549 4614065 4568371 4487172 4959743 4605448 4578439 4883295 4800804 4757321 4914646
16841 4914646 5138147 4999886 5119944 5211133 5306752 5438203 5624815 5533679 5876275 5566235
16831 5566235 5505233 5852544 5726734 6345888 6334666 6354724 6526504 6720425 6605399 6443002
16821 6443002 6759396 7409467 7084034 7587838 6873852 7609320 7675960 7615324 7630031 8002595
16811 8002595 8100528 8082065 8572528 8617032 8716180 8878193 8642518 9138340 9483992 9312187
16801 9312187 9647963 9790869 10096176 10079709 10755077 10667425 10617595 11290087 11262511 11480147
16791 11480147 11613364 12277805 12309922 12658449 12764907 13100371 13590576 13658680 14072883 14395625
16781 14395625 15035542 15065762 15531827 15658424 16574253 16852189 17216702 17689100 18018003
16772 18018003 18475010 18830278 19522524 20074752 20708641 20959777 21671048 22204734 23155115
16763 23155115 23671434 24028892 25190753 26076964 26527158 27550852 28358078 29327998 29977312
16754 29977312 31020477 32114341 33430392 34651815 35561167 36514633 37834019 39526134
16746 39526134 40677408 42301410 43644790 45612999 46846459 48658407 50410519 52146373
16738 52146373 53939126 56087623 58085019 60494432 62531720 64711795 67277563 69711901
16730 69711901 72761250 75350245 77854086 80868010 83845145 86892850 89981078 92784810
16722 92784810 95653867 98924884 102132901 105122143 108061883 110985713 113517508 116452473
16714 116452473 118815134 120917175 123147365 124828179 126255684 127418744 128255899 128734486
16706 128734486 128713948 129028745 128296488 127667368 126420393 125224543 123088100 121169897 118602929
16697 118602929 116256323 113607234 110722008 107922275 104928289 101748988 98919537 95509488
16689 95509488 92253756 89107397 86048979 83259165 80113706 77090625 74223938 71519278
16681 71519278 68654828 66140120 63437269 61098924 58777468 56499607 54462740 52502783
16673 52502783 50310975 48444646 46551031 44655949 43513201 41938100 40503581 38866844
16665 38866844 37452613 36181788 34815644 33457895 32768582 31691752 30391096 29654715
16657 29654715 28710233 27431944 26729430 25627848 25171332 24261894 23850530 22910467 21990875
16648 21990875 21580504 20579964 20474238 19912012 18939828 18688272 18205869 17711757 17253885
16639 17253885 16307232 16303838 15884171 15720739 15274501 14653444 14238886 14111256 13517862 13266901
16629 13266901 12897449 12832980 12131461 12351574 11686736 11396310 11414346 10607873 10988410 10520522
16619 10520522 10395135 10183863 9835773 9668194 9406341 9443631 9226097 8868651 8447491
16610 8447491 8441740 8389303 8279837 8076749 7630909 7740773 7267759 7391626 7415762 7411008
16600 7411008 6882830 6892848 6938420 6841631 6454703 6586267 6449948 6055425 6130299 5900060
16590 5900060 5895981 5617919 6027286 5341060 5715858 5433148 5615077 5263663 5119745 4837587
16580 4837587 4962675 4850515 4622331 4748247 4635178 4466986 4567548 4428745 4429835 4379398
16570 4379398 4197438 3921992 3839762 4066412 3768785 4212676 3548779 3518961 3692919 3926587
16560 3926587 3531808 3563244 3700379 3587745 3487794 3328417 3630349 3404639 3654504 3602966
16550 3602966 2873359 2891870 3014228 3285216 2813696 2945618 3055384 3010867 3000937 3087005
16540 3087005 3158944 2824579 3269363 2807818 2676278 2602036 2687941 2253900 2522510 2417537
16530 2417537 2695062 2186160 2464932 2243675 2352903 2550412 2186568 2322215 2432804
16521 2432804 2038191 2065980 2066256 2366353 1933654 1950799 2139140 1836637 1778591 1791177 1950777
16510 1950777 1672846 2144758 1755224 1681537 1931687 2050435 1927613 2005366 2035396 1695613
16500 1695613 1646128 1853100 1291660 1760147 1721970 1903131 1790544 1887924 1351002 1817715
16490 1817715 1581253 1720996 1697145 1934950 1287678 1322329 1345875 1358453 1763232 1254235
16480 1254235 1191030 1536293 1517344 1287564 1332619 1426051 1559165 1320590 1237860 1136050
16470 1136050 1372865 1166275 1034657 999393 1144387 1667826 1485523 1281919 926604 1257632
16460 1257632 971537 1447910 968215 703063 1286578 987894 1161609 943986 1328425
16451 1328425 1122624 1153565 1064046 1386881 1163518 1060132 966729 918800 762875 1110691
16441 1110691 1032835 852819 1098372 1111569 752831 1002255 1156494 918028 824287 746518
16431 746518 806574 1108078 736492 721416 919462 1076817 1016293 844054 956144 1083103
16421 1083103 1224377 621790 489449 796824 1057005 804896 1014786 1008218 696730 791503
16411 791503 884273 683471 728739 754261 974513 1147239 631012 819311 518610 749003
16401 749003 876977 632983 927472 843206 707067 1136927 929746 498959 666520 697229
16391 697229 421311 401310 504485 506974 572571 574620 844184 611639 569129 786300 687077
16380 687077 570794 318162 613507 416217 450398 775906 420657 529224 452213 169521
16369 645203 648195 581404 467528 597090 699821 614196 434429 763410 415162 676673
16359 676673 568044 368322 478078 734877 468562 808710 235258 439783 397485 645305
16349 645305 529926 412776 634431 648378 391101 495890 113506 675721 -39866 465287
16338 606267 452312 131698 614973 434528 536061 347179 442851 275647 326736 328478
16328 328478 248314 804093 82655 633023 250807 331981 482213 408622 35720 599612
16318 599612 313074 157076 517539 558843 487481 -2507 684234 400859 282054 258311
16308 258311 228743 515443 366633 266862 413115 314044 197166 369096 362627 87937 408798
16297 408798 653397 208796 -48196 353930 591357 489796 22808 299988 559525 530856
16287 530856 443162 112578 590619 311339 21979 578359 134663 888584 148540 504957
16277 504957 296661 502187 284272 90903 449367 258812 -11885 105820 391446 230476
16267 230476 299086 510366 360461 68255 2607 373314 287827 196699 133578 27596 -24151
16255 301648 244636 118931 319282 257204 538845 82459 310676 91146 -129129 174065
16244 199407 98406 520404 293974 379832 204339 203713 342249 182004 318300 312905 332664
16233 332664 118462 -187471 421327 363633 217039 -27405 453341 338500 212395 242138
16223 242138 307343 418160 123164 439386 164595 238477 -168762 -16148 -26684 195811
16212 -89111 100993 70391 209524 243848 366137 301886 403514 437634 236663 10544 265576
16201 265576 258805 -130515 192374 53011 247343 -106218 96039 292110 36386 325647
16191 325647 193912 211042 65249 417157 122931 205484 185478 -218817 91326 275256
16181 275256 -121598 197809 98157 420623 340766 -92078 193154 185203 161547 160230 162565
16170 162565 135868 135090 219720 436493 140712 -92329 284622 27500 55382 278795 -291586
16158 307385 -26355 213662 246525 51911 -22149 297111 250456 158515 125750 474466 330509
16147 330509 -13389 47177 93772 -164987 27409 303932 -95651 167584 197384 179590 70587
16135 218942 205921 93135 -27244 39555 74389 -363354 -178029 128828 -15195 35829 -95157
16123 173209 172200 -110369 -226507 -179727 156867 101811 363774 304806 195371 -19375 296084
16111 161040 108253 24976 111747 -99884 22787 179357 -66212 -225811 -42570 -93762 -165558
16100 -165558 75319 -41705 224466 64433 42398 -169748 196764 -110634 -74951 238792
16089 -29936 152424 162447 -270142 72926 149207 -161099 167170 69498 11307 -167474 388853
16077 -62370 -176358 -153167 179934 237502 250272 31752 -6253 -219096 64394 32710 177857
16066 177857 -54745 -89165 200184 26939 98529 -137657 -13575 214769 -391289 -182371
16055 25435 162735 -121262 -57701 -127108 -210848 117695 187668 119938 -99067 141066 261435
16044 261435 64631 -247666 495910 78656 51692 -184692 313305 -23453 8816 109035 -14771
16032 117035 27137 -86894 -155095 26408 -54680 28961 -58708 75945 75425 283700 -230949
16020 -49072 -220909 -151518 -187487 -151312 -324813 204111 337819 119979 248806 -269570
16009 -18933 79316 -356048 138039 -100920 114937 -146955 -50009 178183 61788 9321 -66125
15997 -244262 217415 201875 -273066 286029 301369 128127 255559 -79582 -53123 -21727
15986 -174872 93159 251468 -28519 -110731 138352 81417 -171387 62817 187421 186638 -10161
15974 307625 407595 343424 552624 614116 744286 945751 731352 738656 913751 545149
15964 545149 161306 79770 15429 -29937 182449 120583 188102 113828 -336115 159479 -48678
15952 -210858 -359582 50763 -275385 -93753 -172316 -80995 -138125 81434 47476 -306316 -198395
15941 -198395 -73174 -50149 346643 -99774 105514 31713 -163953 -486056 -165951 59236
15930 -72439 -149148 -227862 -168859 75867 -280594 -265063 333175 64789 78361 252154 277959
15919 277959 -2328 -210977 37940 -183159 68833 -29177 44153 63313 54356 -93691 -50733
15908 -50733 -40671 172607 -47465 -372723 -127509 102410 49516 157627 -99895 430365
15897 -58513 468284 185650 38940 -90007 -159186 -10138 -23370 211091 -33 690 116417 -52192
15884 265990 -152692 352087 -476794 -113371 -98093 -33157 -69462 271118 4926 74446 -37960
15872 -323029 12408 -64225 -26638 -125148 -266608 139633 -25101 122805 -221129 -124305 -266993
15861 -266993 194027 53129 -94262 -211060 84270 100254 50285 -114591 -114931 -14588 270085
15849 -432907 -113987 -158040 4596 -231924 -234883 -136432 59837 -220338 -19802 -90871 77816
15837 176112 -134416 -134545 196950 157801 -195609 -211266 -155373 -219574 -247891 -144770 -315113
15826 -315113 -216623 80286 234737 -26674 39330 -232605 -126909 -159135 154687 -299193
15815 -318813 -230782 -198306 267642 168858 -192874 33868 -129781 -135974 59679 -51298 252080
15803 -296989 -14646 39496 -471540 -83174 -96155 -35134 -85076 191339 -307823 103769 19168
15791 9532 136840 4861 -35465 -308765 -96841 255789 401188 -178895 -141950 -72463 19113
15779 57113 -31701 120991 -32613 -282691 209170 -212157 127107 -510497 20660 -181576
15768 -177792 155225 202487 -24391 -14738 91108 -134968 -300384 48955 -113946 -206498 170606
15756 12732 21279 55153 -33239 -328428 -14113 -168221 -835 -168392 129813 -207344 -14918
15744 -122720 31547 99317 165381 223286 4737 316110 31098 -368273 579512 88860 -39703
15732 -104552 8520 113717 32878 189891 -67974 112905 -98615 264932 145747 -164397
15721 -240568 -46117 -52932 262898 342313 150370 -351538 332579 125883 181219 -5718 83086
15709 207052 200691 203667 -130503 6077 -174761 2755 -166045 231006 -14251 -26443 185388
15697 -214975 -162185 -95374 -11914 69527 23390 -31651 -190720 -357398 -24962 47479 -24333
15685 155636 88449 -125998 -242439 -45941 -77919 -112852 -33416 20080 -20472 231322 -173235
15673 -329989 -54704 -56829 159842 172655 162859 -64564 141546 -265834 240859 -175020 88628
15661 -88356 -242078 -31203 -58686 -105221 75467 200529 -97132 -310314 -154269 -227907 145482
15649 4742 -99505 24857 -94735 406074 -178489 -28112 33354 -226355 -189 387945 -205707
15637 56328 248963 123353 158456 -86678 24994 -142163 -312993 289221 -138641 118935
15626 -288828 144279 -303900 8356 -73683 49963 -57646 -353003 -16475 -145756 -299285 -126047
15614 -22548 -22407 112453 279633 72392 -337516 17651 110080 102326 22512 259269 -421031
15602 -10126 214988 -157196 60647 -143259 65085 81339 -47608 -115301 -56352 -409108 -185488
15590 337664 27092 -59582 284250 35742 -210553 -230886 -175612 -205959 268713 -148314 -103714
15579 -103714 -420016 -220574 -176494 -84814 -28251 -255069 -38634 -264731 109672 -174756
15568 -100029 176073 -93017 -135855 -95415 -20187 -262144 -262546 109720 188540 -130297 223516
15556 -218595 44016 -193890 82797 192466 137960 -108405 -41639 -57456 -28122 49653 38445
15545 38445 -104997 -49855 195840 -30399 64679 -101139 -43790 105525 81193 -291590 128557
15533 43604 48881 -27714 28812 -30756 199992 -41793 199817 240803 155591 -270970 -135872
15522 -135872 -369953 -73448 195333 80214 -148677 -103607 10538 -66143 -15483 151108 136879
15511 136879 86408 -157274 146592 59802 214289 112406 253397 142416 253585 74077
15500 173936 -362702 276428 350729 117871 466137 183639 287320 429356 251305 256984
15490 256984 189311 226709 -13986 188279 34147 47536 27553 -309467 -12103 163175 104745
15479 104745 384405 148675 -19859 -133393 241309 235759 342347 68272 74150 133325 231775
15468 231775 285376 -51080 349429 199676 189473 279083 61658 107077 229992 582156 448215
15457 448215 575512 440503 333450 315583 258883 -34723 -138860 -77782 92208 -134847
15446 165628 36796 322528 238146 -46306 119138 -4849 254610 -30488 91927 2572 -93424
15434 -130669 144904 32005 162943 269250 219569 -15484 280521 502402 719506 892230
15424 892230 1069388 899896 400413 538924 21582 186090 183214 103675 -124454 -14264
15413 232036 50586 34108 265209 187074 -214481 -162641 198525 34050 -194593 171739
15402 164149 -86086 -107393 28414 -10413 24518 68071 -88154 -297261 307757 -167941 -15868
15390 232803 34456 57916 315634 136982 175204 -22329 -154217 -224501 -44900 18294 297284
15379 297284 97113 144080 111834 -140967 -119314 272480 252014 239107 23215 224969 -10514
15367 -166185 12074 -24225 -85773 -184798 204591 299062 257076 232672 25396 -90311 90509
15355 -3553 310192 30458 67016 -24473 -121098 151365 -14925 352966 178591 84077 -108798
15343 107615 -22313 298019 229685 -50344 185424 -74385 64713 200628 169890 -78453 -217172
15332 -217172 411856 -16506 220657 208244 155127 59019 451475 22309 79614 160181 83920
15321 83920 56505 155950 162214 58631 85126 75 194415 237437 34922 -76338 201686 217201
15309 217201 25447 521018 432516 138852 113878 -41544 89313 81244 -75806 256787 -227986
15297 255944 59997 130110 -51989 98659 152989 391578 162244 33466 -343463 -197940 62440
15285 166319 155066 -96080 -105083 294968 -179904 35657 -130986 102583 328554 -55634 -17974
15273 -243507 -68688 -25101 -133634 106435 -167773 -14988 -45645 104409 -190397 -196353 -13754
15261 61540 -383758 -46001 111141 -37590 471742 -315793 2636 107855 228265 86508 2718
15249 -17071 131881 109606 -7941 214179 -78119 126023 -228591 17890 -59945 -80614 85328
15237 424812 173654 -43970 103912 -130645 -12257 -6009 491541 134838 267451 579657
15227 579657 1276648 1664766 1226572 1280508 1294936 1019076 691577 411479 144841 241462
15217 241462 1067 238752 247749 294581 63299 -48272 -371430 211171 -156682 324779 -105057
15205 55292 123167 216560 174910 381161 290737 188868 -313707 42201 -156832 -97568 -210052
15194 -210052 51724 338363 -87651 212088 314799 70968 178850 -83419 -93231 162554 77667
15182 106234 -92641 156594 -56505 148870 173978 102054 -44310 348179 286552 379499 81979
15170 -70693 -34784 -325828 22053 -274506 144316 -68605 -91028 25177 -284895 71005 52204
15159 52204 98351 165188 139335 -107773 199118 -43334 -308273 -179170 5233 -293453 136399
15147 200234 -27637 45820 358375 69652 260106 207730 160783 -126380 126624 103499 215463
15136 215463 -38139 -42600 162126 210368 9547 73244 -153107 23814 285292 32416 238683
15125 238683 311903 213812 8894 -6070 -195989 258354 273937 275972 -40970 433987 236428
15114 236428 277020 221583 -284900 196017 -93353 288386 246219 288829 27591 379633 10165
15102 397350 348193 436258 272295 40732 327497 -46152 125013 36553 54536 42642 143033
15091 143033 246438 261589 279472 -130094 213305 187646 -45863 145555 239331 109538
15080 31675 55996 -1755 16532 110065 68487 -166092 384349 264443 -194555 174053 252638
15069 252638 394128 -8583 140005 -85705 256258 449196 -105622 450547 164495 171748
15059 171748 227992 -104503 414118 245590 -64826 123722 236752 404597 56257 537654
15049 537654 37421 298790 74817 122495 316386 557852 140065 611695 -16438 -35552
15039 -35552 460994 213430 -77406 406760 151619 410239 724248 597521 387801 17439
15028 62702 -717 219160 260248 299561 461839 403263 282382 82064 263104 190473 629693
15017 629693 735685 262386 590079 673160 480337 604603 784831 335775 674332 772762
15007 772762 399155 415345 340411 314490 488671 525518 248941 665765 673742 492078 218507
14995 526173 44930 305442 357042 160896 216748 308922 375629 741737 411365 587853
14985 587853 368477 515945 204514 752504 307553 460560 92574 462027 131140 751790
14975 751790 553566 350007 310749 438844 539319 593268 777332 395443 577132 653044
14965 653044 702341 654702 578701 732150 577902 305584 338736 456390 660489 215566
14954 624009 185404 418132 540420 424903 413537 118220 306400 94642 215998 123832
14944 123832 465152 53835 427163 -98627 318967 48086 497557 162374 365279 430417
14934 430417 646683 343438 285954 411561 372659 265875 581814 745323 517919 838058
14924 838058 896608 406664 443674 474831 545159 629653 369810 992050 880749 1104828
14914 1104828 1159363 1214445 1581878 1305940 1523262 1796096 1709373 1973069 1414192 1498334
14904 1498334 1403521 1884397 1880410 2161357 2316102 1850530 1825531 1216377 956132 972400
14894 972400 699468 727253 650437 189923 542036 435799 281641 569115 842703 429355
14884 429355 348733 105201 223382 446724 520926 528000 55942 773560 448304 623926
14874 623926 653429 547080 457035 563586 619398 614848 898764 734579 997612 884637
14864 884637 1151372 794495 640768 446139 667695 120658 605277 793279 551349 614164
14854 614164 318559 613321 1047581 468152 595213 615339 558908 505915 429720 511487
14844 511487 421565 366829 251021 226574 575780 533537 225746 519584 306000 333111
14834 333111 307332 314919 470525 622937 889457 967990 1088666 1129703 936402 1556077
14824 1556077 769072 1168672 1171513 1053011 809691 761244 346570 614101 639243 531299
14814 531299 829929 836457 451090 658058 768212 577221 531484 539116 530856 944159 633025
14803 633025 552636 833832 801766 805361 668470 833340 535111 542615 610159 706257 469843
14792 469843 793750 680451 886062 915269 907638 912172 661413 678964 740652 701743 521054
14781 521054 750621 650947 518207 487491 521828 155102 457959 775892 403150 385736
14771 385736 611185 1009307 749978 645483 652386 807413 829463 903202 768181 1074937
14761 1074937 949002 825616 834695 878040 1169206 809022 1145794 874124 620902 895280
14751 895280 744980 228968 815219 707927 549089 615230 871219 903894 533712 1009333
14741 1009333 809054 609051 566935 534901 759850 529636 397414 692912 479969 793939
14731 793939 599523 419268 892407 827772 464983 557085 589574 634405 852394 827434
14721 827434 985338 1066936 1266888 866683 754467 1337968 945829 1487905 1618218 1655219
14711 1655219 1934297 1708336 1332167 1476263 1331660 1078960 734908 892103 921438 986668
14701 986668 757838 1021153 734356 870729 643179 975608 826203 918038 1212668 1002050
14691 1002050 1439914 1314415 1091868 1421494 1618034 1740181 1789433 1600643 1668017 1511637
14681 1511637 1467648 1106650 1363005 1097801 1110213 853867 622643 1085686 1323165 1095143
14671 1095143 634189 1095274 1025993 925869 802557 1042589 889604 1339138 1272040 1086833
14661 1086833 901972 795272 877083 1298659 851637 974522 957970 994013 922710 872660
14651 872660 908199 779217 1269979 1010999 885554 703453 997301 1446657 764886 1117194
14641 1117194 1145754 1405834 1174978 967897 1643534 1309662 1591246 1361083 1019362 1302212
14631 1302212 1377722 1153411 1246558 867651 1304622 1086130 1470617 1064962 1080104 1381692
14621 1381692 1305277 1107760 1171569 1029675 1188350 1284053 1224734 1211032 1087656 1020883
14611 1020883 1260452 1375657 1320697 1384140 1318894 1222136 1349139 1772051 1152096 1161599
14601 1161599 1267813 1477895 1175756 1251020 1396327 1549226 1764045 1393635 1560807 1487356
14591 1487356 1400148 1705992 1459250 1441676 1471250 1653039 1546526 1734595 1696984 1599605
14581 1599605 1691659 1561317 1613045 1547744 1636344 2034204 1537219 1790653 1779847 1780951 1599504
14570 1599504 1702818 1660001 1983453 2005220 1995278 1884638 1822570 1749623 1968316 1900456 2057449
14559 2057449 2341284 2411797 2371573 2002708 1994256 1878656 2363292 2641033 2756268 2304018
14549 2304018 2555739 2867409 2451783 2642560 2630049 3175108 2978601 3365737 3502544 3509360
14539 3509360 4116489 4805385 4934032 5978138 7206778 9076621 13317343 19463416 30685679
14530 30685679 35487983 19039640 11088620 7059745 4863130 3891494 3671852 4083775
14522 4083775 4341242 4925064 3313555 2918307 2471004 2045813 2450370 2433734 2024506
14513 2024506 2457695 2436465 2377101 2340729 2268959 2407732 2613184 2549445 2469193 2408794 2251757
14502 2251757 2652061 2673083 2514301 2868411 2688632 2716823 2826373 2785600 2501580 3060059
14492 3060059 3142998 2865319 3165125 2818601 3010736 3073482 3240533 3322582 3067000 3281775
14482 3281775 3214070 3307736 3363970 3224604 3596854 3079378 3609305 3190888 3488585 3831888
14472 3831888 3390091 3664899 3732563 3882771 3838250 3723755 3748600 3714469 3803482 3713458
14462 3713458 4019564 4109721 3886519 4248893 4186848 4263219 4473516 4292764 4506596 4269004
14452 4269004 4342847 4489549 4677743 4569746 4623628 5077013 4741934 4525323 5018496 4750704
14442 4750704 4919655 4895131 5037410 5185134 5396834 5545775 5282393 5331191 5305351 5524805
14432 5524805 5384570 5790742 5328916 5907756 5761861 6185322 6006789 6279884 6014447
14423 6014447 6326657 6451067 6537815 6197035 6616666 7083672 6844112 6774877 6910370 7108661
14413 7108661 7299403 7108667 7309407 7817175 7775561 7786395 7876927 8233499 8285953 8380461
14403 8380461 9034605 8835752 8679219 8592271 8717498 8768841 9309769 9140247 8834083 9312260
14393 9312260 9466781 9782522 10067166 10010725 10459775 10739477 10289928 10566557 10798090 10680430
14383 10680430 11120265 11530675 11350794 11611943 11831435 11857747 11858662 12356895 12395793 12795745
14373 12795745 12927032 13052998 13487640 13532614 14224322 14418080 14625998 14549027 15282548 15285449
14363 15285449 15708569 16010547 15843026 16204763 16566002 16835263 17123637 17822977 18169463
14354 18169463 18130567 19090992 19060388 19733806 20105900 20668676 20538752 21430888 21620321 22220240
14344 22220240 22336552 22929512 23687767 24029648 24617130 25340265 25610072 25938677 26947312
14335 26947312 27804921 28472371 29047285 29788465 30456184 31709968 32564518 33263230 34153014
14326 34153014 34936948 35996599 36603959 38037452 39184075 40069535 41343641 42498736
14318 42498736 43837963 45283139 46380513 48167876 49712149 51245970 52841404 54896717
14310 54896717 56694116 58452623 60661763 62789640 65117926 67518121 69899133 72267187
14302 72267187 75311328 77805131 80937753 83748117 87444160 90614345 94629508 98494048
14294 98494048 102376888 106861196 111972024 116787739 121702292 127460753 133144883 139535500
14286 139535500 145993225 152870975 160207668 168232769 176398003 185100461 194125712 204126769
14278 204126769 213950835 225174591 236022253 248378363 261028881 273893475 287895194
14271 287895194 301778068 316230774 330523698 345345402 359746912 373888193 387489197
14264 387489197 400128875 411932113 422622209 433141198 443440612 452662799 460012059
14257 460012059 463094264 465639278 469850878 471875817 466202906 460449097 454833195 447212566
14249 447212566 436713277 425015910 413106057 400251866 386009878 372786537 358783149
14242 358783149 344504302 330340300 316384231 302614865 288920223 275691988 262936412
14235 262936412 249835577 236661627 224519881 213497637 202386271 192007643 182497643
14228 182497643 173311021 164807401 156488422 149132452 142443498 136096396 129989461 124046454
14220 124046454 118590527 113388622 108679398 103919285 99859275 95924476 92143692 88506414
14212 88506414 85108401 81645987 78643256 75633901 72980658 70362310 68014567 65624473
14204 65624473 63466031 60875407 58941705 57171593 55385553 53708818 52329116 50805675
14196 50805675 48862310 47339608 46176544 45061241 43959485 42456361 41235049 40145973
14188 40145973 39163030 37794106 37073747 35878931 35005361 33927869 32953543 32515198 31744409
14179 31744409 31103424 30190551 29327411 28365688 28003866 27420665 26608860 25689563 25398356
14170 25398356 24824568 24256440 23607121 23338814 22600941 22331397 21306983 21468532 20769103
14161 20769103 20544797 19826778 19752258 18924402 19159365 18554667 18252957 17371789 17026079
14152 17026079 17125004 16622755 16539628 16125504 16079882 15490658 15269688 15117594 14805633 14525354
14142 14525354 14123090 13809933 13720362 13937245 13158128 13184368 13021555 12733917 12353031 12287977
14132 12287977 11686718 11911565 11492691 11324599 11385671 11008972 10915179 10729328 10715685 10593085
14122 10593085 10355754 10126458 9825986 9624609 9948255 9806412 9372019 9402214 9105877
14113 9105877 8757814 8985686 8930752 8801579 8676432 8620389 8378962 8282653 8239046 8077347
14103 8077347 8207807 7872037 7386177 7507447 7515261 7311991 7136551 7115805 7285191 7201919
14093 7201919 6946442 6846824 7106814 6935118 6806323 6850735 6588796 6306234 6151110 5755959
14083 5755959 6151680 5866605 5699266 5956089 5865941 5923495 6025422 5645071 5614349 5274264
14073 5274264 5712267 5461016 5593165 5418656 5124408 5430516 5108573 4967468 5201321
14064 5201321 4995407 4783849 4944107 4539486 4786820 4967038 4759184 4696727 4410008 4646679
14054 4646679 4549483 4564563 4307655 4539416 4453803 4432176 4367905 4409880 4305199 4436427
14044 4436427 4388882 4341317 4090747 3685858 4090016 3736428 3808113 3932947 3540436 3532108
14034 3532108 3665472 3102211 3502690 3617877 3995253 3476643 3339001 3334457 3512117 3410480
14024 3410480 3046213 3337543 3075224 3364071 3085974 3300606 3151130 2960092 3078196
14015 3078196 3117303 3259821 3156613 3261552 3146440 3137649 2701581 2791253 2798647 2990298
14005 2990298 2896392 2363264 2941240 2973158 2847711 2880164 2747394 2691027 2551253 2416190
13995 2416190 2604507 2630431 2578884 2602842 2352090 2288728 2467821 2184883 2431898 2609458
13985 2609458 2614447 2375245 2435428 2265911 2738877 3203398 2683724 2904723 3235376 3348550
13975 3348550 4614338 5995021 9187915 14574318 25197053 38045038 24156245 15255884
13967 15255884 10556970 7563660 6073703 5381078 4768885 3988648 4003757 3041685 3355273
13958 3355273 3084880 3012966 2832998 2750028 2569201 2798142 2668881 2432161 2381626 2340356
13948 2340356 2493965 2190345 2273284 2547892 2293319 1876206 2204065 2072201 2190766 2158505
13938 2158505 1620654 2306362 2199416 1948693 1946898 2114978 2014837 1684169 2095209 1881175
13928 1881175 1548188 1902221 1913967 1908452 2016596 1681508 1741926 1666645 1681253 1650063 1749095
13917 1749095 1959604 1625479 1795778 1915239 1508724 1499417 1340762 1863168 1363391 1728104
13907 1728104 1567484 1713318 1464594 1331947 1226285 1452133 1774502 1536960 1672570
13898 1672570 1498030 1520373 1835269 1175829 1444327 1500450 1519450 1638773 1562270 1630154
13888 1630154 1547748 1322732 1737062 1261468 1426722 1196626 1097244 1220332 1479165 1363164
13878 1363164 1182969 1439679 1255733 1707129 1465312 1266216 1197671 972033 1236491 1057760
13868 1057760 1423088 1503874 1385460 1033470 1215461 1307104 1219862 1374469 1103007 1092605
13858 1092605 1138576 1398411 1226478 905153 1142259 1071313 1293267 1383587 1020044 1480262
13848 1480262 906756 1534606 863480 1328215 1006319 1101454 1218359 1285968 1257971 992981
13838 992981 1184331 938422 1138819 1012283 1033137 1155013 998534 953763 936558 969259
13828 969259 1038107 1026703 960743 1006990 979966 962518 1250659 1165141 869837 1028069 1172291
13817 1172291 931673 1235850 1031068 922803 1250268 1084832 823550 946841 1112342
13808 1112342 1031674 923429 802677 784811 980181 777246 1055258 1245176 862297 586695
13798 586695 896043 959408 913408 1018948 814553 1045512 1027838 1053833 958073 869051 1002953
13787 1002953 721515 777104 970692 878326 1010998 779729 917641 771443 265789 845422
13777 845422 1147306 843047 594006 865350 984383 864426 812357 614838 830061 697439
13767 697439 1045021 625507 633842 606328 515538 401627 601797 620154 643122 676022 593575
13756 593575 739257 805268 947307 570622 673440 852643 764166 507751 506251 678531
13746 678531 787423 531763 754923 693360 793692 560096 782252 710521 385236 513788
13736 513788 651096 530523 625515 616432 375416 531307 770417 614096 739037 727302
13726 727302 442678 831996 618740 593965 683295 624831 460559 521156 567076 690459
13716 690459 538790 558831 493409 617039 460867 845178 561088 416748 493250 533020
13706 533020 510194 522063 528111 759272 853687 452577 456533 605447 439043 582052 799244
13695 799244 450886 582678 648386 797835 527210 537073 576946 341189 94134 652974
13685 652974 633363 613398 726527 333819 343168 450988 481256 344666 784431 480847
13675 480847 869607 666747 471363 566988 673382 540736 510653 315168 833179 427607
13665 427607 579993 411655 545745 568873 492191 589838 195162 327472 517307 703082
13655 703082 636685 737764 285630 388629 238306 643038 292169 540068 414055 445120
13645 445120 468050 601105 962375 285335 523695 426782 424444 214778 316309 466366
13635 466366 605606 404185 278817 494502 340964 487163 221100 389664 679288 318683
13624 341215 199160 264151 509664 251691 528712 406329 553621 457593 226420 351928
13614 351928 345239 476215 436587 359323 695171 758944 55971 641094 412249 342941 410689
13603 410689 446123 633934 410394 90475 332409 409870 310047 339372 695163 898231
13593 898231 175558 419597 467267 257310 352454 275345 42106 287024 136682 239451
13583 239451 402002 145908 220017 333676 426323 833498 247644 63917 541705 306331
13573 306331 246694 455084 -74265 401494 384083 188533 330393 368377 603602 341162
13563 341162 430891 237721 105878 -161291 479317 161058 389077 375085 429248 396077
13553 396077 182497 287368 399289 55309 73661 137080 332305 82752 534486 238448
13542 386089 -27359 218666 -47848 322028 196829 540252 507041 168437 -70990 279318
13531 441977 510811 283890 258872 304709 230845 262435 122058 311426 291510 402937 185556
13519 279852 120477 451285 69846 68072 237588 63189 110737 263228 29704 130318 125284
13508 125284 74039 618445 487618 231808 655460 354982 264726 180672 402565 312519
13498 312519 423546 243146 68703 110448 417982 93495 343003 565237 189104 314186
13488 314186 185509 298376 335151 239805 181547 378243 468025 637031 494235 389054
13478 389054 61240 62575 237793 534681 249923 464245 357533 394035 648725 336195
13468 336195 324337 271123 407576 236039 299177 140855 -35043 283482 655238 55130
13457 435751 473616 -81256 166981 257443 215926 391406 435601 461611 127107 449538 205103
13445 490261 173285 178032 106507 143744 326628 235239 246907 -187471 -112880 49193 235856
13434 235856 69632 79993 78383 -90237 107057 241814 256670 317613 18855 213409 99814
13422 466935 335074 101688 138391 309240 90686 225465 559963 216552 15416 202828
13412 202828 320672 423184 222446 104197 214451 559355 250816 132545 219709 223616
13402 223616 214736 210651 199315 328104 81783 386871 14192 252392 360537 150871 263694
13391 263694 -21530 205617 213895 129316 15106 41933 -47064 625819 251037 365036 328149
13380 328149 456497 288355 192877 -53834 553649 79611 204457 130548 10079 276617
13370 276617 63586 -14405 -214491 294824 177895 23750 160728 376669 266940 185486
13360 185486 426020 269324 169448 -39852 51073 98306 238553 274141 337683 172082 275354
13349 275354 426692 277869 235076 361486 636988 204808 207159 250924 426053 340844
13339 340844 243792 278221 170156 247309 148770 546703 439548 136191 151094 65766 390113
13328 390113 190960 129693 478830 182740 176466 200294 368992 276935 500653 216607
13317 344240 315618 138549 27823 421927 353569 242462 253642 -237267 229762 301811
13307 301811 302246 71502 386907 41684 268235 248299 369658 92800 272380 345538 718778
13296 718778 480330 380252 330695 120289 431754 248131 61457 -169340 212457 -198112
13285 65451 71286 131071 -93116 237290 347080 272088 504327 58510 -77550 25063 75639
13274 75639 -152237 -72210 186813 124959 -169427 253481 -154119 123788 330015 71035
13263 109540 159474 -36103 4907 106964 278258 -233215 -192854 -59865 35507 -29958 105953
13251 39823 20330 188389 7349 371476 -42793 28811 -24880 220216 72328 -8766 -61792
13240 -61792 195853 13692 -7421 -161734 207448 412455 77781 -58563 305336 210949 -142820
13228 -163125 299700 334724 227878 -136965 82384 79032 36848 -89048 164857 -48482 389791
13216 140991 355639 429205 106128 82320 225151 115250 326370 179247 329165 -30813
13205 -423514 -42707 99834 152055 201655 280184 138604 28820 132436 -73202 184911 -67347
13193 -220586 8052 177634 204037 20785 388540 260105 -208979 355194 243873 275479
13183 275479 50776 60505 -26082 -1338 220164 -48368 20764 -193285 116788 -44810 201973
13171 -90927 219211 2568 -17176 38929 138456 -143329 78284 137382 -47076 209242 -103890
13159 176255 200994 -121589 207804 22935 337428 91537 588970 31151 -139079 50420
13148 216296 57083 92212 158530 69101 251359 99524 176602 208343 -204418 53773 -63547
13136 49244 -296192 211539 276827 -274048 263369 -91581 116680 109714 -169224 375430
13125 -168720 -31152 -293193 156210 177297 51985 275791 192507 -102714 -321999 196311
13114 15142 127699 205256 25251 115028 30566 265473 136453 -100751 -198199 107727 113105
13103 113105 160217 215585 175389 249857 44006 63777 170579 -61726 -8417 -1255 144694
13091 -91590 161871 136377 49568 8609 159297 126666 21160 -97921 138148 -31658 -84176
13080 -84176 244795 102365 -219100 -68891 91800 184159 -6926 23894 90925 15296 -118244
13068 -138549 76933 105603 31163 -10171 261385 -99248 128228 100281 -12039 249165 202816
13057 202816 154515 220891 244179 -8243 137483 108220 -81130 -186288 -179720 197451 211994
13046 211994 -57524 179344 194037 99655 62886 147729 232696 83553 167023 392713 219767
13035 219767 -291070 165999 70390 -383124 -118006 -2300 -215797 -116844 -28746 205593
13024 326931 -100544 271439 18090 101013 -62047 -279180 158104 64912 165354 37394
13013 104451 120127 341634 -29652 -84139 -162311 367532 28139 319602 184749 -319629
13002 67783 331346 450855 -67388 -119631 77227 -81370 83488 -21474 159888 -141537 27783
12990 -129058 -84969 13380 140832 18341 58528 -171375 -50050 141614 125803 178349 -11865
12978 60259 240829 -269185 -117094 -39270 62109 591322 161097 100226 340054 33010
12967 -114232 39184 212071 -8191 17361 52051 -83698 -195130 -2978 336135 228142 164703
12956 164703 34048 110826 313505 -296159 129284 -41938 201820 -208637 155919 11789
12945 84552 -25029 -71830 -33095 -107284 135943 49255 264287 129716 -162373 91802 -87120
12933 166223 48325 -121151 -84484 3227 263155 90006 141614 49250 -285925 154778 -101646
12921 -78689 -92744 63357 63722 68212 82133 -205612 -104794 107286 -206221 181568 334178
12910 334178 -101042 -231431 103635 213182 57789 -46995 -301043 30745 456517 197544
12899 -221176 191383 -78798 144133 136608 16945 345398 434498 -64250 -10988 -183919 -176875
12888 -176875 39394 483930 15307 -302966 -130962 -92879 61519 128013 -181797 -86406 -60531
12877 -60531 -63203 89621 -166291 -6994 229630 200546 204791 28056 62257 -125246 -163505 -188192
12865 -188192 -42456 317659 383002 -35012 -55404 79326 -14045 227092 -251115 226364 241277
12854 241277 120834 233298 127783 248194 -224445 -91921 -330047 265841 -135165 -130514
12844 -130514 -92565 131896 -113016 55097 60252 -127867 -109228 147618 -90715 4601 -79065
12832 165913 79827 -272260 -99145 -84607 39993 -8491 -234541 -43723 -53250 -49353 -401578
12821 -401578 131142 -304141 420365 127850 292073 -110363 -179814 -59742 19399 207562
12811 207562 154678 189169 193310 178671 -142106 -270447 -235827 -345653 -179618 -98967 59633
12799 -228616 162781 -40264 75756 -325968 -253489 141847 -4246 129011 -61848 -27470 -47331
12788 -47331 -62286 316334 -132192 225188 -30084 328369 29312 -292405 9805 400684 64985
12776 50153 137464 161213 156808 164217 -207841 -118235 240318 -333371 -564676 317336 -36305
12764 -95413 -89777 210743 -3611 -7641 -198560 -4270 -185002 58136 -146754 358667 -134053
12752 56070 13046 -224345 185834 110391 -181550 -286622 153917 -379614 -24543 -53143
12742 -53143 327376 -194419 -216405 -112467 -19681 144182 15862 -163688 -177901 -178114 -116670
12731 -116670 -154790 -168825 -74734 36092 -48184 210584 106626 -180078 130604 93846 -138983
12719 271849 -30449 -53826 45353 99812 32008 400661 182915 -427008 -126903 -303462
12709 -303462 16492 -216930 160365 -55086 -57874 139480 379466 -90120 119845 -254691
12698 -207555 -155610 -161807 322973 78722 66438 362226 -49233 331941 122286 -41777 42227
12686 60735 -39381 452324 31346 218146 12511 -220730 -119827 192434 241430 -110707
12675 212353 73804 38500 193542 106052 549042 271193 93632 -274380 -135882 -115260
12665 -115260 328973 73459 112950 415470 353767 -316032 -185054 34531 201283 314507
12655 314507 243862 22959 10990 173539 120952 299647 -4153 496081 103625 517863 92739
12643 115205 82210 251328 214608 215537 262790 -58696 168922 33824 220088 372595 -109019
12631 183632 256165 192468 453407 30631 -284331 -74033 168081 404270 190060 -75318
12620 255904 -77644 20659 2974 258690 44108 -158206 126228 185522 23067 122040 242035
12609 242035 73506 219728 -86722 458003 331354 83171 570702 -218767 308738 76647
12598 -83021 41186 -37940 120930 -48817 266993 -22085 -45348 19789 105772 -135478 151949
12586 44181 -107059 2405 -113361 222915 262994 -823 240803 30823 -102529 144307 -18915
12574 -55626 75057 322496 -157853 130540 383677 -130651 -85932 -50201 92892 -371476
12563 229871 240245 160872 -228969 -265528 -99044 -63495 -55847 32940 -198398 390810 204368
12552 204368 -221178 -513938 166473 12371 295362 5195 12380 -60069 47732 -154170 -97591
12541 -97591 154776 269805 101401 3087 249738 136230 -896 -159512 -18830 16955 19078
12530 19078 266140 -93518 294959 394876 -30640 -40380 65340 76971 -125394 -67989 -110930
12519 -110930 -78345 82913 17542 -195554 63099 171809 -109959 -109508 -189459 -280649 51152
12507 257498 254872 -523868 -318639 49069 -146665 199112 -59156 -98598 65565 125839 -20321
12495 -7451 330062 211836 -61598 -2839 216469 169881 174635 17693 39229 -167314 -15190
12483 -161529 117780 -71321 20085 -11296 -155149 -240937 -145169 58892 295465 -294578 281180
12471 46077 103279 367717 324607 390745 197748 55922 183613 -12836 53208 5966 102264
12460 102264 22053 -44398 -163729 351292 -135108 238983 -150531 138624 -51016 -79046
12450 -79046 3414 131015 118595 -17259 -135461 50061 121813 5081 111160 113110 173471 -7457
12437 560172 40946 133082 213492 19775 -87095 -80872 -150983 94302 -270329 -36821 66129
12425 -21553 -18947 105228 -6373 107178 236235 -33155 -218043 137176 93683 -76543 98019
12413 -175324 -103804 46771 -449345 -33170 14582 -317906 92834 -82007 76690 116139 -204760
12401 83853 119884 -199986 83939 -44018 4460 20404 90796 -72563 -113121 -226339 -83028
12389 43353 -113169 102241 -161588 -313769 55881 -60919 -83846 -70186 -224780 -421544
12379 -421544 -26908 152654 -111761 -35425 78177 237508 229870 -72891 74320 169768 240660
12368 240660 -157740 113551 -43869 339165 59800 -89987 109325 -6082 -120245 442985
12357 101746 10671 -72896 -206798 312314 -68049 23940 -107887 29976 137124 -31601 95239
12345 72291 -24493 98978 -5867 -60956 48652 192435 131545 174252 -143441 -153601 211367
12333 126205 32012 -77842 -386843 70569 -37504 349861 -218729 56838 -290572 321967
12322 143197 -22423 -61828 -81615 -95939 173012 484129 135418 35376 -86602 187615 261627
12311 261627 429756 -2400 192342 -10633 -192159 213709 112663 -229743 249911 280367
12301 280367 185157 371193 -46102 342168 291462 16808 57881 206487 -22875 73824 95925
12290 95925 18575 101609 366689 255632 -6647 283229 -22733 215226 258811 14752 -75312
12278 387304 -174648 -147970 79316 420153 -163206 80209 25633 -91954 -235693 407339
12267 270672 -33463 -152551 -137584 548872 571284 251929 91026 278954 197276 -53722 96192
12255 226499 48689 341269 366400 81775 -25640 281860 374958 -52764 223877 128839 136398
12244 136398 16747 196171 -346753 26956 16708 241608 258286 2768 148956 222568 -105943
12232 -137676 199836 261970 438973 187651 16507 394437 226998 125947 231533 24016
12221 61644 177158 -29686 120361 488441 -26323 135629 125738 99417 -17830 220657 191838
12210 191838 360383 258798 359244 177070 188995 339145 447659 426366 442933 533089
12200 533089 218127 211629 494482 289435 137605 359628 272611 392130 230506 -43954
12189 108003 26781 189474 -38026 284474 303621 240512 117029 182180 243096 116380 276268
12178 276268 438830 429472 299349 370862 352750 522328 148567 445405 -149774 404720
12167 345226 491910 336967 132762 -99663 332946 57917 -27164 239457 85107 211166
12157 211166 -2915 181641 41831 336873 637402 471712 216520 35874 98418 449989
12147 449989 107537 342030 56612 60618 285653 250082 274254 349270 257217 213299 315097
12136 315097 44225 206841 -290883 57896 -9067 -111647 -150874 192212 -23734 275351 271376
12125 271376 195171 277577 190833 236676 136686 -35971 393610 -11650 14495 408617 77750
12113 64716 363251 97371 59614 22967 23727 134840 -70357 318745 178275 410313 421152
12102 421152 518626 12937 -115235 220734 -174204 -109931 304882 573193 -17415 255636
12091 -147011 9086 240687 -68891 175631 50508 65558 -65488 -34442 436882 193698 152994
12080 152994 270882 110353 -174409 206382 -128710 125967 -25395 60099 -29468 69298
12069 53259 115196 127523 154073 108156 220757 -83232 215498 31357 -19539 128388 -88591
12057 134443 749630 89580 -73842 193426 161163 69958 178982 9282 -64591 -37187 145688
12045 -62381 -88462 -106416 -56834 22020 2534 -147177 -12396 66346 193788 -105993 246637
12033 17853 138188 88507 -86864 -9559 -296538 -86430 275833 164536 144626 -54478 230458
12021 -225356 133500 113118 25651 -25582 -115562 106210 -156809 -155966 -164362 95514 190014
12010 190014 203721 128670 -340798 23131 -130027 246993 110094 139793 329212 282609
12000 282609 216032 121210 24638 146936 -23531 84067 53956 153576 -116644 -37147 207621
11988 1786 -2577 7962 -21906 270455 -147811 73927 188511 8530 -163888 -108479 -133804 177718
11975 -10337 291587 75363 -82328 69137 177354 178496 -42687 -465883 220619 -239106 -99299
11963 -77312 61650 -253602 -1283 -14011 -1804 -135379 343543 396377 263687 -8761 -204548
11952 -204548 -156919 -340125 -481366 194159 -70536 252449 144921 -30659 74777 367344
11942 367344 154867 53848 -11082 37581 76321 143971 326316 -243181 -254339 -183962 -89174
11930 -85568 -187945 -16069 42178 43015 -83234 46488 145180 -27691 -229783 16076 34098 16749
11917 123346 -147954 -158588 -39128 40493 103225 -320255 -176866 43252 34698 373170 41129
11905 41543 301490 -139704 -24858 -195612 215761 -36887 -104507 -259148 48384 -175438
11894 325298 -68417 176870 -192901 120480 -109151 299437 -39850 104287 -239436 179042
11883 -89478 -117957 -9760 181040 -150356 55007 5138 -2944 -51528 -10042 15137 99925 45428
11870 57542 -11210 -345715 -39873 143649 300333 238401 107893 27333 107867 -110530 111985
11858 -330817 -195331 -266799 239091 -134871 -243213 47347 149692 -135538 6766 133739
11848 133739 -124023 132224 -89850 -174090 -292291 -200928 -158229 -284116 -18654 -12348 -333645
11837 -333645 -188009 -405590 8650 -39119 -436888 181222 -110381 -100771 -196426 -251674 -128972
11826 -128972 -199629 215329 131029 -274604 79006 -376988 -18736 238951 221221 172145 -188538
11814 -238840 -266959 -16272 207759 133969 -237713 -109011 -248619 -53586 193061 -165672
11803 -152067 -21481 321818 48995 -329085 -47417 -19862 -145738 -225452 9522 -278529 55285
11791 -188003 -17560 24700 18965 29934 78003 176120 -115468 -304127 -29497 169955 -188999
11779 -99226 -72866 166743 55885 -409423 -419346 -23457 95916 -16712 10300 -222975 20436
11767 -509946 19985 -127828 38072 -69480 -68786 -37557 -93912 -340530 -82950 120716 158384
11756 158384 -66580 -7730 149457 143908 109671 29601 -11183 60771 55919 139973 -295671 156857
11743 251748 -129042 157316 -104337 147815 -207623 -181664 22315 126537 -258357 -349097
11733 -349097 5421 113613 -324438 -94254 290169 -107891 -95982 -123829 -9445 -241418 108166
11721 143818 -112289 8728 47496 33030 -174249 193207 -16804 8701 27112 2402 -36175
11709 148245 150246 -60181 328143 15111 365054 -193499 -27188 -60458 -32941 -183110 -8462
11697 -39568 303753 129300 -124755 163139 -173156 180724 142744 101775 -159208 -38714
11686 782 -327680 61280 -189262 229604 274723 -201999 55629 95637 119305 208812 276671
11675 276671 46232 44568 -40392 -253164 99269 -238915 -121726 105932 241079 161096 -11459
11663 -181679 250953 -61766 32910 -187995 17921 5977 -213148 20486 110503 289676 31895
11651 -76395 -17973 -89458 -186301 207026 108791 94052 76346 231043 60359 276846 -20376
11639 -52959 -139143 -257646 -281479 56750 74567 -123666 -261963 184371 -77937 6663 -377420
11627 -8124 -286348 -92679 -465838 327847 -19752 -101104 -86129 -43409 -143047 124897 331256
11616 331256 81933 -34260 376392 -126249 92352 56194 207352 98375 -421768 189364
11605 -28942 13284 197708 24913 -168046 -9310 -7361 70225 -220 168573 -55363 -343884 -335007
11593 -335007 14611 -1833 -448992 -359192 128355 211326 -270919 -34534 -191665 216997 77111
11581 107410 216036 335150 -162624 324254 164479 206996 -167837 160416 -109183 -140159
11571 -140159 188934 -190289 169027 -104539 -123420 207065 246781 -148014 96546 192407
11561 192407 295326 -21903 -159304 -159821 24530 89992 231329 102817 343195 -35249 228561
11549 -198441 -151241 -326694 54382 5886 260209 242998 -20584 263585 2048 347561 190418
11538 190418 92905 260980 -52507 -263100 -63234 355575 -140197 58064 22218 220867
11528 220867 -177729 222444 143324 -134885 -37178 -15520 255461 -19624 48033 -10509 38033
11516 179776 7461 -74565 118580 110923 107534 44729 318135 59519 281126 158852 -111119
11504 357190 64583 -126097 88013 -217012 -131781 -201421 -80456 12854 -166840 80499 61393
11493 61393 99453 -18989 116941 89677 661813 377933 -159832 287493 141715 284158
11483 284158 60991 128880 345011 -17316 17913 -93312 -117678 243278 62575 225858 196486
11472 196486 240886 293982 22971 67608 74994 329722 270673 71850 251464 83901 241859
11461 241859 236684 294588 -16555 -7286 -135095 362127 191920 444713 482831 110902 115448
11450 115448 96541 93767 50240 48957 95481 510816 187145 145964 117660 5523 226935
11439 226935 210384 -10490 209113 -116076 589207 -115757 105271 168447 8187 53599 64464
11428 64464 121719 -7981 370819 -42070 165144 76532 111616 124447 -139639 -161877 278489
11416 -396517 338424 272863 419379 -32816 41523 48566 33394 66408 160208 148205 -204402
11404 370452 102299 425451 -3684 -104865 89739 -101328 204458 76747 -2088 19604 231657
11393 231657 288278 235297 46293 -13968 223733 -112941 -77069 208094 -128769 373026
11382 150849 110440 83164 399789 -226573 -39715 364311 -155881 39653 67187 -199694
11371 279431 69410 26814 -96775 131377 150674 147751 296510 -188629 -35428 18280 -33809
11359 -61485 -171900 -161776 -78759 17023 -32316 71398 493757 -84638 134245 3124 -24052
11347 38922 59017 74849 -277356 -82691 -156243 -117542 38542 61721 222986 -4548 -95741
11336 -95741 155935 -23548 -32231 -205720 -78275 120482 -105876 -291817 305270 -86458 -49950
11325 -49950 182138 -79852 -283452 -80750 110525 -289180 -205333 54690 -172052 -133489 13675
11313 74178 -100354 -145763 5462 -39525 61552 -117475 -16094 -35224 -128366 37573 -51704
11301 -169681 26647 -130930 -75109 35133 -54034 -71819 -329517 83729 155456 -289202 153348
11289 -243341 -329818 60765 -247869 -186584 -20572 240766 145780 38987 -131746 28498 -164116
11277 -24104 -123604 -60597 -67701 -260608 153385 135997 4819 -85524 -252731 -118527 -194284
11266 -194284 -201058 -249769 -145694 167243 -164991 -347930 -154487 -453810 -83446 -152432
11256 -152432 -142136 383496 207915 116881 178296 198352 -137800 -139073 64008 -259109 -36250
11244 176696 122962 217701 6635 209842 -124206 -207205 -82588 -200934 -168734 68477 192865
11233 192865 9790 146626 -13292 -17152 -86070 100073 163546 -149191 270659 -42780 -322009
11222 -322009 -149499 -43388 -88328 -29595 -242221 177919 270152 -82777 -556435 -128989
11211 -190610 -33625 105274 46282 -168375 33407 -132538 -257275 -337778 -267177 -370254
11201 -370254 -336608 44213 -82764 41507 7260 71124 -217164 -77078 -74331 -288069 -75652
11189 65186 -331705 68059 41924 -213557 30901 -237666 17467 73538 174174 -271916 185957
11177 652 -277778 -61620 -122649 16900 -89435 175324 -244822 -209641 -54858 17928 92119
11166 92119 -118654 -134759 17292 72924 -173510 339769 -119479 -377719 -291045 -233558 66492
11154 25506 266638 -23036 -714922 -158630 -131711 -194581 128177 20279 -183272 192669
11143 88750 -38876 -252513 -129411 -66363 63610 -222158 55426 273669 20742 353502 -67294
11131 -252852 5040 -34853 -47803 -48118 81463 207794 -287372 -70011 -369939 237855 -276865
11119 -60723 265081 -279944 -25967 2278 -9275 171777 546559 -159226 56637 11431 206064
11108 206064 136466 97979 -116461 -73693 -120417 77098 -357436 281694 72301 44661 218728
11097 218728 169427 395279 21388 -74282 212830 91144 -37281 298675 201228 71168 236473
11086 236473 244074 -7891 131115 410035 207228 142807 399502 -82862 548653 327550 -165630
11074 159074 145990 443832 186141 132702 346485 507777 612522 511751 254243 176237
11064 176237 -38688 -16443 439371 282980 139693 96345 410573 598371 160903 545361
11054 545361 543615 402286 591411 340295 320830 783240 495374 416021 768979 370086
11043 285830 654691 612839 911586 699833 971518 1019911 815296 1164191 1048668 614999
11033 614999 885034 1015390 1137517 1235648 1300237 923894 1313795 1197386 1128979 1223379
11023 1223379 1091481 1544457 1386306 1171054 1445047 1087850 1076496 927776 820754 1086995
11013 1086995 1513292 1023103 1338742 804933 1139096 1143694 839141 1178606 1328610 976150
11003 976150 1066958 1155236 1094718 977958 969502 779246 773956 834315 861756 644402 983927
10992 983927 763463 809459 1169026 1284654 1021106 850474 490653 935446 1113199 953208
10982 953208 731224 1023671 797623 1220418 829958 819102 849391 1077888 1320162 625154
10971 830982 1009223 1139663 748660 1243231 1222581 1538881 1242961 1231002 1124412 1343027
10961 1343027 1466193 1957005 1678432 2206143 2435541 2595143 2534973 3337250 3588584 3769212
10951 3769212 4056656 3909997 4067615 3901532 3799925 3385504 2870754 2229727 2151618 2351982
10941 2351982 1755323 1846754 1945558 1606502 2142928 1719295 1277583 1423118 1238275 1028655
10931 1028655 1094010 713170 744258 570374 570370 597890 308676 447520 84967 524084 165230
10919 592464 -19393 287983 -8843 412289 -22026 -58580 175518 155648 -225635 -60256 179525
10907 328641 19793 230256 181077 145789 -158999 171549 -235406 166767 -347534 178005
10896 74571 190925 88687 3067 57661 24266 -278267 150934 -51121 -159111 -113842 129433
10884 -242843 -190539 376041 32766 -51356 192445 -300011 -227570 -249364 -139677 54869 74624
10873 74624 14242 205815 -102562 70838 -36424 79015 243469 150190 237508 -133803 -25991
10861 119916 267944 -108623 57595 22630 184765 74666 -8488 59534 118275 -231244 75217
10849 -126935 81588 -150308 -111419 71552 11550 287438 -194682 188642 -107351 -179072
10839 -179072 -117850 145719 -212954 97125 249250 -115908 -18684 80661 -64739 -12633 -39801
10828 -39801 302355 -35197 -258992 -91301 -88783 -458127 22675 -27935 -28513 68116 -282058
10816 -140014 60307 -430474 -360956 -56340 222797 78762 40948 -320077 95073 152060 54309
10804 -89380 32140 -93575 -123184 314281 92651 131611 -146108 -4891 276219 -130668 33206
10792 -141071 71373 -20808 36758 29157 7814 239478 -58055 -168819 86062 194247 13730
10780 -152404 -140515 -102696 -203691 -267428 -113260 -139647 141959 -50695 -318068 -349024 165750
10768 -438307 9187 -21111 -216957 163267 -122078 15941 -41813 3452 -162838 67980 -415110
10756 -17192 -185223 -152744 76574 -417690 -183488 26163 -70146 87627 -179747 -10940 -295035
10745 -295035 78595 -278521 -115856 -274553 -92450 63062 -198489 202995 -140984 -189509
10735 -189509 -31054 -230024 124539 43818 -6024 -44970 183455 -275108 109126 21833 -66107
10723 -200348 -123566 81710 111071 65832 14455 44110 -54861 64566 -202849 -353878 -125235
10711 -2215 -394742 129274 213440 -42038 -261978 -86749 113721 155212 289818 4272 103388
10700 103388 -1267 249061 172995 -29145 88760 166751 -369565 -292547 6654 173762 -43189
10688 -18555 231965 -74616 -78892 -118824 -128022 -133147 -154069 -184009 -348421 49370 -230996 -203917
10676 -203917 -4387 -52479 -29387 -29632 -462579 -366337 -195267 -65323 -365777 -183724 -45265
10664 -281983 -225198 -319143 -101558 -183030 70979 21967 -128621 -76947 4570 114958 -94442
10652 -271246 75272 -166797 -34053 -182611 -112764 -111986 -176769 -158735 -52205 -144027 162269
10640 -206732 -9984 -183593 203239 -202644 -5349 -358602 160414 -166018 -132669 -130301 -65175
10629 -65175 -104905 -5873 112988 83144 -191222 -103993 -254802 111636 -21090 47542 -174131
10617 -251395 -74676 165771 -230403 -91999 -68261 -119282 -2086 -115945 -127941 -163770 -335343
10606 -335343 -498260 -186957 -235438 -350409 107298 333715 -114681 -35134 -123432 -377116
10596 -377116 -128422 325284 -27852 -102437 -250598 190968 41140 64045 56141 -342672 -19337
10584 -281512 -70035 3194 -242872 157302 -241931 -40177 -87281 -63698 132307 -148257 -92378
10573 -92378 -266978 6421 -61746 -59355 -61568 -21023 53867 -151640 2414 -70712 -242116 288172
10560 29288 -220018 -186978 41609 2407 164062 85432 117046 344387 -86652 176463 -36920
10548 -228807 -12451 20657 91780 -30138 -310885 -6725 15775 344069 -90910 68758 45165
10537 45165 -48281 30827 -72698 31025 244810 27035 -44708 14482 -157124 72130 -340334
10525 17310 130186 107353 -79670 -91380 -223615 -213096 -92523 -208987 67793 -157639 234077
10513 -18143 144468 65026 70709 -1312 -64212 -233176 -115336 142850 1902 50729 -64569
10501 -149945 -96060 -288610 -274586 105455 347017 -238989 -63436 -287826 -252709 2548 -47903
10489 64620 118 61926 155759 32900 179076 -69964 -35881 -84325 -171775 149919 24367 -160101
10476 101760 -29577 350858 -3550 56082 45391 -855 -14577 40192 -127775 79382 123347 276316
10464 276316 31972 -107805 246720 240515 356359 119562 426233 394656 271062 491990
10454 491990 91707 42799 -165470 21246 246144 109020 -207972 -295286 -36521 -79779 -44558
10443 -44558 -48288 143280 -137575 -25716 -56757 -356277 -380624 -136155 -29085 -1609 128177
10431 -81187 -17394 -104027 -62845 -162820 -187543 107055 -481800 -162402 -157321 54245 -237016
10419 -107875 -158835 13728 -202469 398984 -77398 -373729 145544 -39470 -128800 -171499 -74973
10407 -4567 52221 -66804 -91446 50827 -356813 156785 27632 40209 -281116 -202505 235948
10395 -247006 -6124 -59948 -125582 -315846 26945 32161 -132558 -76393 -178056 25187 -253284
10383 118970 -54342 135322 121890 -206433 -39897 371621 147703 94291 297054 282631
10373 282631 106023 81121 126271 440653 211919 112916 101755 53172 13849 192954 228558
10362 228558 118771 386543 299520 395973 184040 240642 542082 223547 338194 137092
10351 238873 412543 273191 623838 303697 719766 922473 528227 731038 638477 444517
10341 444517 479152 182869 110479 410198 233655 89047 291760 370713 632419 624741 467720
10330 467720 593126 579951 481137 275357 36588 465684 494795 579977 337733 201314
10320 201314 267329 460651 448996 228743 -142668 229624 396234 -87116 174026 279631
10310 279631 -124131 483763 314973 415046 -190572 210345 553819 387560 176197 445782
10300 445782 -159266 108025 348122 361328 73688 -126188 119021 -129057 -186663 87295
10289 -64751 -5273 -74449 -51051 -320322 174288 -33193 63304 -33605 41392 -410217 -104962
10277 -20966 -118020 -210694 -64124 -306881 -4208 134892 115885 12861 12630 132405 -156965
10265 74574 -73013 -212186 -313202 -347065 132399 193466 -238876 -167503 7388 -152201 52194
10253 -181478 -143507 -93839 -272668 -134054 64657 -122298 235673 -48644 -52456 94963 50314
10242 50314 394965 -143151 166407 172717 285711 42763 258446 355921 -125639 357090
10231 237992 -208178 -200404 -95783 175519 -30200 60250 251894 317800 -2148 -2118 -159513 -114827
10219 -114827 -28349 -167391 98542 -100606 -204786 -101820 189806 96795 -336332 57898
10208 -166257 -137408 -204609 75758 -200730 17334 -75875 -229122 142374 -38482 -25237 -434230
10197 -434230 -192681 78229 113110 223656 172380 -110460 -429978 -100628 -150198 17677
10186 96133 -18300 -72009 -99760 -232636 -185457 133330 -106774 -57961 -41832 20229 -101812
10174 38455 16493 110018 52161 -26054 115142 -321298 -139343 107125 -53464 -134310 215951
10162 -272946 87795 -39532 -178486 -1275 -91491 33669 97101 29994 101874 93526 109847 -136317
10149 -140459 -83708 -105136 -177545 161569 -362941 -113640 94500 -64106 -62643 -111178 -220809
10138 -220809 -250468 -351270 -84492 -22484 -41610 78856 195209 -192327 64513 -68698 -271397
10127 -271397 -86471 55780 -109333 143199 -360800 148883 104925 233983 -98341 -679179
10117 -679179 11890 21831 87120 -365493 131891 -59653 -240121 -133453 -88678 -52601 -198360
10106 -198360 -288030 -200582 -287202 -212073 185012 -117503 -153894 -35965 9730 -296371 -16474
10094 -299400 21418 322819 -138390 31579 207716 -220651 -83227 -169033 -120922 415465
10083 -32912 -376783 124162 207026 -91985 -351896 -116459 -153489 -111287 41740 151794 -31337
10071 -129314 -254276 -129754 -53941 17876 75831 59390 45750 -412041 -287585 258852
10060 -130792 -267660 217817 109845 -18168 -76246 -158376 -134320 119894 -260012 94245
10049 -140656 -245238 63809 16683 163623 -251921 -33731 -59117 -135301 -166045 85577 32038
10037 9138 -114696 24622 -44590 -374644 109808 -412863 -54015 -303436 18899 -310034 -3616
10025 193326 -89797 -237063 -276830 -223756 -315403 -21758 -159725 164873 25376 -377886 344594
10013 -6591 -32630 -65289 272098 208164 -113809 88603 -111908 81769 -189186 89996 -223289
10001 258495 -396136 -172268 -267039 -81917 -47320 109877 -123872 92120 95639 4482 48328
9990 48328 -310378 -83547 -405202 333527 -152861 254676 237343 -2780 -74967 -16359 -112227
9979 -112227 -352482 134130 -354521 -349049 142541 -130436 -78062 125589 -148581 -279493
9969 -279493 -110945 -33007 -164679 41273 -359271 -425380 52012 -98679 -71897 -27028 -221685
9958 -221685 -12421 -40925 -100430 -48963 145046 -176849 56421 -86758 23091 192168 -256372
9946 -380532 -363195 -42037 -266401 -407106 -46285 186356 -267624 -256542 -53925 -21482 38287
9934 -73123 -56283 -298720 -153493 -1247 282866 -189568 148059 -377548 285955 -90672 -56620
9923 -56620 232694 -101240 74182 -158087 28587 -151136 35293 32105 -236719 89499 -30559
9911 -204200 18390 46884 276110 -63589 -148142 -459087 257091 -94289 119246 168854 39609
9899 -71444 -142766 126053 -21691 108761 154602 -433873 104082 42922 54857 -236703 88768
9887 5542 -173407 -305365 -273422 -72075 38681 -100519 91723 -205577 -158081 -312227 -111498
9875 -359044 161787 -10743 -271159 306344 123088 -194920 244612 -92751 -34868 -19450
9865 -19450 193531 -150146 -141795 324444 33821 -46738 -98611 41911 -243144 -85858 51775
9853 -324576 -121386 -363593 108279 128087 -192476 -66760 -158438 -362791 -177326 -213959
9843 -213959 -281197 -75150 -279168 -27984 -280152 -229838 37235 197728 -124682 -138536 80182
9831 -136357 -15823 37790 134528 -218598 241193 -11188 -277754 116476 -316484 -47016 46071
9819 -64270 -40677 198838 -227082 -361132 -346693 -55258 -89917 -19247 -62606 102925 -44531
9807 -207569 147372 -80400 31942 -7929 13303 -156611 -293485 -95637 291558 -113158 -275084
9796 -275084 -128184 105369 215994 -105861 157569 90191 98243 -580659 -225870 138366
9785 -81330 205440 -186063 -57435 123210 -88812 -197318 126013 110069 38794 -58181 115292
9773 -218368 -224364 -228725 -32324 38488 74831 -176790 -230531 -31849 -286826 161527 -206149
9761 -227973 -45223 -49756 74719 -279570 29002 -256768 -109536 16411 107458 -178149 -434099
9750 -434099 322462 27382 -197615 -23457 -308077 -223420 39539 297243 -309314 -98330 35928
9738 -216497 -59645 21595 -99609 118576 344700 -274042 8574 210952 -54152 -161707 -64052
9726 -146769 77570 191370 -463725 -167665 -65665 271983 -78891 -55753 -246780 -112189
9715 -197598 78021 28796 -132301 -175888 -198142 105900 -357769 -28735 -44693 -226964 -263364
9704 -263364 155766 -214829 97928 68445 29391 42017 81895 -220842 -180590 -118327 -196575
9693 -196575 -30009 111930 -217838 -49441 -28590 119909 92007 -223624 -456924 -224821
9682 69297 -9851 -57436 -341802 -250292 42627 131911 -331248 -348566 -156 80565 -14429 107366
9669 -280985 147299 61964 -24118 -3873 -106909 117956 -190378 139569 -76007 -75428 64251
9657 23739 -147639 -321030 79507 188722 287780 93084 184879 115664 -373147 122653 27558
9645 -82137 158445 -111246 -157164 10809 -52620 -147201 218481 -228641 6046 -92009 -47859
9634 -47859 -40118 90142 39168 -245381 -167356 99815 46081 -148690 139143 -350759 138792
9622 -65832 217466 -62555 80960 4728 -288763 -2115 -111514 -314827 -33829 -219340 147319
9610 -222661 -4491 -122733 -95921 38101 48030 66611 -284703 -312759 166348 -200473 -208367
9599 -208367 -164202 23227 -315748 -94253 -332161 -266108 -200885 -32673 -186486 -229362 -38178
9587 -178675 245191 -89591 -22182 -300016 21755 -141098 -57127 19988 -139537 -178799 -19533
9575 -166726 107716 -90682 -359602 -163694 -234599 -181053 2094 138654 228559 -68556 -81426
9564 -81426 60250 -27333 330673 -435730 278810 -197488 -256517 230198 -95859 85721 -219160
9552 153360 -93403 93117 -256262 -311008 -31951 111599 -27643 -63253 -161443 -176519 -224332
9541 -224332 -411682 191508 -110650 -418758 -161169 13578 -37126 -169252 -162168 -106425 -307343
9530 -307343 67984 -69207 -293196 -144223 -393932 183257 -80733 21854 -96460 -420983 -253311
9519 -253311 -343405 198169 329727 56606 365284 -200549 -36590 24772 -260015 142937
9508 136974 22250 -554289 -257401 -140945 87343 29812 27233 24360 -355403 -280121 87029
9496 -32617 1697 -81998 242652 -239842 -239687 -76865 -32168 -48874 -322831 -97554 -299929 289549
9483 20933 -17018 -359247 -14482 374549 -342861 147221 -118914 22602 18372 -363736 -55988
9471 232771 11824 55016 -63455 203583 -171333 -423810 -402239 -82257 -101030 -196331 173512
9459 -238670 10875 86737 -242629 -207566 -272271 -321196 229889 257005 -171373 -85277 -88863
9448 -88863 -203868 -140033 125223 93402 8659 51204 137259 -275488 -89802 -113009 -14529
9436 -114172 -217437 19298 -2590 87847 306794 141833 302942 -391169 -113247 -205025 -438612
9425 -438612 -295548 31063 -111469 -86648 54259 58056 70091 -70721 -40616 24245 53870
9414 53870 -139930 -348407 196027 -122405 -176969 -71805 253348 -128209 -43260 -99105 -185166
9403 -185166 39614 62698 24346 -163672 -173154 -344812 47664 6133 19952 -48267 -122168 -31396
9390 -80888 -287409 -126584 -7847 -57121 361642 136315 59146 -146917 209225 -498954 -54102
9378 -197467 32872 -216383 24815 -33473 -135750 -42931 -90148 -253551 145018 -156551 8921
9366 -392992 -358948 -136436 -282166 -239124 -23042 -267992 -179726 -211538 100271 12626 82572
9355 82572 -213458 -31162 312920 -13579 -8001 -79069 -92222 -269130 180557 -109435 -135614
9344 -135614 -216898 180639 239423 -61736 178213 -186563 160398 -206847 98664 29630 -228912
9332 -179330 -14510 -260358 176365 -97575 -44616 -187135 -4072 170313 43765 -148854 107928
9320 -369441 189076 9349 315096 -241381 61623 -151818 14476 -260773 39114 -269687 -275036
9309 -275036 233877 -5470 -195910 259592 -124917 61655 179744 -461273 -205204 -51854
9298 -19490 132513 103958 -116663 -132921 77610 -175765 25785 -45905 36238 -64302 -268779
9287 -268779 9295 -28675 189609 231906 -24889 172061 -193421 73061 2395 48534 -234496
9275 -100520 -414150 22942 142711 -91153 221202 -123175 184721 268352 12748 130568
9265 130568 -159740 -177895 -179139 -10239 -53393 -71587 -11157 89716 -282885 234752 -43944
9253 -269163 9001 155198 -47533 -54889 47588 -246649 -254066 -110590 125304 118300 -80218 -183258
9241 -183258 238873 54061 -337076 -11344 66558 -143822 -163899 151720 73970 130215 122502
9230 122502 -329750 -120998 53828 79621 18219 36046 51102 -192119 -47950 -177227 -288691
9219 -288691 -172015 -363501 -50151 82262 -223147 -23108 48126 -211428 -16505 -97958 103309
9207 -36429 -291446 -470556 -69305 -5466 207046 -368665 -27953 -206991 8379 155363 -78296
9195 -72495 -320179 -205517 152403 40359 29786 -70572 -201461 -317695 40090 64363 -79962
9183 -289661 -153240 139684 309518 -94879 -136446 -327705 -28478 -260856 -78248 -168711 -240916
9172 -240916 -144973 -338513 -42929 178871 -67030 -320413 326412 -78411 151643 -306940
9161 -180037 -78869 -256137 10805 163882 -262331 -53085 255863 160452 211044 76409 60340
9150 60340 -142823 -52362 146243 89153 -44967 291651 119072 -4455 -322772 -43214 -263532
9139 -263532 -72023 174609 -76247 231786 142820 -269133 80282 -346621 -142153 -224421 105110
9127 52094 -90115 -309305 -152235 -60815 -41276 -118121 -302536 14063 67043 123106 -26259
9115 206264 197810 -104851 -96265 -306613 20007 -118413 -50793 -120506 -277136 -285208 359787
9103 -265022 -131250 -129508 -217795 164415 143539 -135620 -72251 -215382 124325 82561 15151
9091 58905 -452303 18026 -320584 -47799 -85157 -208750 -3071 -143485 -259822 -183835 32431
9079 -47305 -51257 -13050 -370986 25092 -168294 -83447 12115 -247966 -258474 -17930 -231129
9068 -231129 -177322 80601 -17057 89232 -13604 163695 441736 -150991 -297280 -179226 -290123
9057 -290123 223332 -533723 -10454 -241037 -307803 -399471 -141646 146897 -150058 243217
9046 29487 -36444 -11321 37871 -31593 -180399 -36865 80252 -163909 271384 -266286 49285
9034 -192192 121341 86953 -146938 -177116 261642 -214854 -74435 39326 -240242 -74656 -88076
9023 -88076 117879 173233 -95502 -372686 -112081 -47952 222267 37915 -221277 -80045 226291
9011 -69841 127899 82002 -280452 -132185 16058 397711 -221960 214358 -204636 -42845
9000 -371922 -111365 -200999 -244027 173250 -378683 -229766 83215 -57736 -66448 -126185 -105230
8989 -105230 42875 241353 -59783 -146789 114587 -2054 -25528 85889 -466988 -268390 -115239
8977 -190325 -4434 -81736 17806 34165 139978 -144541 -130289 -168457 136465 119357 -71224
8965 -122521 -64801 -408534 -146030 39779 -34642 170836 -112351 155598 -103313 190593
8954 -111431 -554727 52309 -115728 331811 -79601 152198 -374214 -98569 126798 -620192
8943 81016 -74498 -262885 -310591 97959 -194007 -82585 83716 -177472 -114239 -382010 -136566
8931 210228 -313961 -242642 -170540 -37402 -63291 -186271 -231291 -75606 172702 186873 253419
8920 253419 223409 331853 119993 380042 206390 -121228 248970 5178 440175 634589
8910 634589 174668 382669 566633 1015627 1410905 2243812 3967951 9883599 7730608
8901 7730608 3821266 2050040 1168891 380788 549884 391722 309318 404560 240153 198035
8891 198035 146739 33251 389102 152776 250024 211645 -17172 79035 -206654 -155177 -162704
8880 -162704 -24781 -28133 -284366 80071 133020 -94365 -154332 282665 57669 -127566 66350
8868 -173372 41468 86369 409802 -129767 209233 -211079 183992 -319251 133724 29733
8857 -172516 -20330 11731 -93197 92180 -226921 -51800 -355878 -192654 -157507 -44142 203915
8845 -60006 141199 -144500 -81392 -293674 -83804 -281655 164410 -59296 -11394 45933 267640
8834 267640 -271431 -363360 -18833 99570 -186072 124829 -72595 -65317 -211063 -92219 32830
8822 -563138 192304 -13361 -152556 869 -88239 251807 -232480 -7630 -69240 -75191 -102705 -143236
8810 -143236 -313071 -27105 -113284 -102835 -361224 -391186 26825 239743 109622 289584 -35575
8798 -209690 -241578 -183908 -231025 -335584 78649 -87236 -26077 -139250 -211920 -82500 -96811
8787 -96811 82577 -364747 16980 -92829 -106316 145934 -128471 194528 144271 -135244 154996
8775 -81577 -135201 -268400 91271 -6947 157704 -143635 184442 -271460 -1590 -343262 145312
8763 -382092 -314540 -89437 -50256 64733 92921 -57530 -75335 -183716 83213 -397033 -309689
8752 -309689 95240 -322922 136198 78496 -149799 38662 -22304 -121110 179266 13222 109481
8741 109481 76597 -101200 7082 15859 -194629 -42125 87211 153701 133168 -155890 -206868
8730 -206868 162704 -151944 -165346 -195689 122735 -239113 76091 166754 -134013 -51232 -136331
8719 -136331 -148936 -65 -223091 -260906 -186957 -61091 -34915 -233395 -45737 266837 -239947
8707 -222656 -120456 -551608 -150123 19590 -138086 96125 -120582 87650 -119111 73822
8696 -139266 154999 -112101 -139715 160293 -233989 -339473 125326 227494 228736 -27282
8685 102785 233573 -72339 128727 -72931 14578 -64668 -183109 -159617 -155103 -12152 205090
8673 -111526 34216 126629 146563 -375883 106271 215275 287170 -203374 165314 154472 -123262
8661 -20942 -441748 273769 855 -116788 12447 -237983 -167643 148733 -256464 -336384 -223710
8650 -223710 -166704 -140837 66591 135928 8657 -252853 -214349 -208874 -56314 -125561 173348 148586
8638 148586 -240595 -21149 -136434 167048 61561 -241395 -81593 191364 -133587 85557
8627 -44451 -168629 31667 -304559 -2556 -21421 43398 -211192 -292279 -154100 251647 -276058
8615 320913 221331 187399 241982 -216912 -196543 175113 103039 162454 -367816 4350 -243954
8603 188084 -164012 -263846 107229 54062 -48632 -74720 -102812 47121 -360380 -273764 117514
8591 75804 -55441 -129146 206193 124359 -53802 3177 100650 -118500 -84666 -67582 -150849 -46619
8578 187734 92831 147348 87550 -2374 62999 -137981 -52520 -110263 -195316 103763 95570 36712
8565 -167055 177368 -95639 -37939 -285117 310780 -180104 28982 207262 -258599 -318855
8555 -318855 -132699 -426621 224850 -184701 -327330 -2135 -306246 78701 85869 -249455 -157746
8544 -157746 166733 -173458 -192854 -233890 15300 90736 107017 -350477 -162675 -212740 -152335
8533 -152335 97182 -36756 -6761 26196 -166190 -130114 57259 -80620 107484 -379021 -18058
8521 -63161 -409059 121090 -28722 301976 17663 -85724 -68015 -338806 -471939 -24633 148625
8509 -84543 -192325 270429 -100366 65540 -321548 -257926 266066 -100959 -150752 -175748 -179810
8498 -179810 -296829 -1983 75140 188711 -120797 -332042 -232919 -40689 17684 -196696 -156542
8487 -156542 -346837 106468 -183115 -68408 13147 -175384 -107429 -51792 246990 218402 -60258
8475 215324 155622 -120649 46375 101936 -250543 12468 -178076 -135989 183885 35419 -130844
8463 156305 183224 -323168 15691 -120810 52468 -133887 86356 -114309 -33881 -55054 205046
8451 -119873 -166430 -212559 -38438 -124361 -111758 -165021 91875 -11542 508433 -42988 -81385
8440 -81385 213169 -118244 317799 192158 278484 267164 -239692 -53695 139933 -189639
8429 -347677 161551 -57722 -168234 94997 19986 10882 -271026 278854 8567 -20568 206014
8417 -469559 -300980 -200369 -26735 115499 -24112 -132360 -72967 78198 62962 159805 -245328
8405 -333089 -120741 234198 189009 -8634 -184419 -89878 168901 -299437 147411 135520 207214
8394 207214 118496 293069 -299819 -194159 -357782 -261051 230833 327686 -347344 -154752
8383 262308 20655 -447391 -23631 64200 -280262 163407 -48711 -40023 -37657 294738 -168170
8371 -360103 348137 180371 -210295 -210377 31018 -304793 77278 132256 200382 -7463 167112
8359 259793 -187440 -112797 1889 141445 68217 -150507 138307 -11243 70199 -62696 -56385
8348 -56385 33586 -213376 -116731 -237719 -8841 -316704 -251055 -141295 -205020 -9247 129258
8336 -390621 -211677 -34983 125029 -130279 25606 153424 -54881 99224 -247008 -280113 -168448
8325 -168448 -224673 137671 102574 -255646 85345 -26482 269671 -10706 141172 -201304 -181738
8314 -181738 -133352 -13902 -352545 -95908 -105857 -452765 184049 -35803 -130811 -70709 -239345
8303 -239345 -231440 110819 -144458 129520 157098 168608 -381207 14826 -516336 -55257 -195967
8292 -195967 93173 -218126 -170861 -72833 -155962 31568 405723 160694 -122443 -66919 -4698
8280 104106 -35701 -190403 -23109 -90745 -89794 -8058 -498716 -310091 -83395 -172680 136079
8268 -159959 -276013 -309198 -202451 349848 123 -129291 -363845 -60172 41861 267404 130765
8256 -254357 -151918 -25720 -18247 -112593 36692 -245860 38464 -31520 12030 -491799 273004
8244 -209648 186945 -116024 -160789 -31551 223708 -225678 -107717 -279485 199954 -99045
8233 -293272 61137 -10345 12181 86311 -174952 161280 159749 287361 43857 -3238 -57374
8222 -57374 129150 188334 -124578 -351303 348428 79005 -40021 130376 -138746 -185028 -238175
8211 -238175 -18439 -52959 -107189 24833 -293164 -311740 5302 82951 -19180 -209827 -21260
8199 214318 -235858 -232888 62625 54450 77128 54000 -149551 -41331 293795 -136893 -165495
8188 -165495 -15947 -122096 186498 -6721 -170810 250044 -331525 -176988 -45489 -85537 113126
8176 422919 -402483 -66162 -1865 -70629 -30286 -724 -123509 135943 -152640 -34865 -149295
8165 -149295 -33646 -104634 112560 41497 -148846 -45121 -229484 -157370 -61525 271544 150409
8154 150409 38066 -61773 2686 -128436 -36940 24453 -92547 -44223 -422938 371257 -174291
8142 375729 118578 -274317 141745 12448 24886 -6965 -207879 -130516 -139056 268425 -111462
8130 42637 -309133 140150 152837 -212972 -67064 -394756 160897 337927 -149301 -86495
8120 -86495 -75030 182194 -118247 -265959 -32736 -131325 63369 -214716 131262 202692 -197213
8108 -223668 -79745 88566 -129532 -191432 218038 -178727 -175340 172237 -5107 -254420 23069
8096 -41906 -477110 -136466 -375736 -116800 -304740 -282557 -222940 -113938 -536130 269259
8085 -174227 90715 -107581 178872 -138271 288021 190533 -267170 13425 -143958 158352
8074 185812 116953 -202368 -152770 187446 -61024 142564 -419523 -81925 -154424 172693 -256537
8062 -99598 -322054 -107974 -34806 157068 -393808 33671 160505 -113136 -342129 -33035
8051 -195696 -24569 -152465 -109288 -270699 53870 171039 -325351 -121196 -235700 -86266
8040 -143489 -76372 200641 -269065 -919 -155640 307531 -178042 28251 -211319 50420 91613
8029 91613 -157558 -28309 277106 -94898 -10386 -25140 73877 131933 -308070 -177711 -51171
8017 -423392 -128893 -31159 169866 -31536 120954 189472 -77419 -50253 39792 108679 141398
8006 141398 -202176 -434481 -150898 -153424 258918 -72040 201796 -161900 -4636 87680 130174
7995 130174 29723 -396856 -474285 100414 -32153 32958 63761 -321775 -114494 37488 -18381
7983 -170611 106602 42511 -113061 -15895 424785 3451 109043 -289375 -141306 -141123 -304643
7972 -304643 -210071 -139746 337865 -69815 -65157 55082 224125 -87484 -322687 125166 -150475
7960 -81600 -70819 60834 -42793 -35851 173570 166948 -164209 3184 195049 188814 48389 6290
7947 -31974 -95313 -76713 -21413 63285 -298500 235133 -105283 14310 -116865 39326 361117
7936 361117 -57714 -269207 252897 -247054 -59502 -78790 -57263 -133754 -53611 315577 262853
7925 262853 -66306 5769 -148612 222422 -201022 158886 -128583 12915 -520827 -161401
7914 -224499 13664 -16945 126523 168317 101703 -24170 -168711 24526 -135601 -68188 -155235
7903 -155235 380020 -165719 -193980 -11511 300873 158276 -94516 -194874 84083 64208 -7665
7891 156537 67179 155297 -137002 -15783 -73289 -263002 -311601 -75415 -1684 -159822 -53727
7879 -184774 -22170 -421772 91979 -80765 -396881 -76238 -70383 -107639 -208698 -156946 23726
7867 -32058 -164785 -124984 79732 -73189 -78810 -254934 -33838 123303 -3908 38639 -20379 -318995
7855 -318995 187318 -125850 205164 80058 -483176 -34912 -15978 -139574 -150178 159867
7844 -173791 -282493 128936 -187409 -248540 -325361 -148936 -137683 198215 -205215 -170890
7834 -170890 294920 -62835 -20064 -211394 -182546 93787 -74588 119273 110101 -47503 -104587
7823 -104587 -249928 -202921 -39244 80453 -77947 -222089 919 287489 110596 8753 292778
7812 292778 -51186 -193997 -64577 312040 405504 -61195 156 -4339 -176658 -29680 167957
7800 140915 -315350 98847 157693 4796 131415 80811 -37708 80349 30480 225543 -38500
7788 -220967 79120 187839 25142 1341 -363932 -6937 157187 -204698 -1218 176081 -63921
7776 282277 83621 -304304 -42833 23354 -207048 -112305 -256902 -46903 -241146 -41823 51338
7764 -27582 140431 51382 -82434 -92046 -362257 -171561 -67164 3948 -118857 -436444 72927
7752 -173879 -45329 -391137 -193118 -154488 -1885 -56472 -20969 -94200 98546 -265017 -728 -231975
7740 -231975 -264053 432398 15973 -208551 -123062 -199326 -284327 -132982 204592 -409555 270622
7728 -59579 74138 -211719 -298047 -244734 -150129 45001 9623 -171935 4947 7668 -484292 209980
7715 -370600 -224674 -238699 305883 243843 -48129 43343 46056 -248949 60343 -225094 -120253
7704 -120253 249780 -18643 -123704 10351 182231 136724 11694 109271 39269 -2643 -29225
7693 -29225 -76840 33971 -260603 -82525 298313 -162713 -370984 -194934 26277 -120663 80333
7681 -51381 -83183 -430984 -226008 -13239 19803 173306 192874 -250093 -340902 -209338 -39626
7669 -118686 -166070 184512 202503 -211363 171215 229691 191395 -235910 16920 -82298 -256910
7658 -256910 -9484 -11136 61609 28959 -77008 2495 35995 -207974 136856 47634 120439 109843
7646 109843 189818 -192984 -13533 9073 136315 202390 -196874 -495921 -154944 75681 -11073
7634 -198211 -286917 51535 34116 -142245 -120510 -70422 -269352 -59654 37397 -196558 -16707
7622 -261169 -143159 57426 150818 -62238 -44411 294651 64857 357413 -152013 -168722 162746
7610 -322347 -205611 155829 -159890 132363 -69929 -75639 92791 -104573 235973 -139595
7599 -337768 -192154 -122365 -37543 12296 139805 -397815 -78404 15470 -68232 21292 182195
7588 182195 176833 -52429 274139 24225 85541 -201277 65299 -63554 111760 -228232 -272822
7577 -272822 -213060 307882 -35285 -7478 212888 146882 -336974 -329518 86029 -41495 186094
7565 -401884 123550 -110408 -125012 166365 -113517 297707 -113978 104600 -296319 193491
7554 69533 -302873 -79397 -152732 320915 -26442 84186 -443260 -59957 46993 14808 232474
7543 232474 41036 -77976 339871 27730 122835 -308076 -132876 104256 43553 -63442 22219
7531 -254422 -427091 140075 -133439 -74838 -111972 4824 -141560 -221790 41521 -81445 24362
7519 -244482 -249624 286128 -37095 -186662 -314030 -98500 -225615 -136031 -5551 112537 107442
7508 107442 -114269 -162490 439886 19587 -279195 -276617 69306 39805 189237 -119397 -308635
7497 -308635 -90350 136483 69492 -178146 188319 -62738 150351 346225 -76257 -130369 364301
7485 -144804 154760 -311110 -106086 157615 -305287 -197658 137595 -108779 65543 243126
7475 243126 68537 -275449 -73636 -39072 -79822 101135 -31244 159611 -258105 51703 133640
7464 133640 392967 -257336 -248604 -134794 -183535 239062 -137513 195151 -271734 -190074
7454 -190074 65664 54628 -88615 190779 -209147 -42373 -122607 -334489 -84976 -241960 -143630
7443 -143630 -21171 -162621 -68072 -64723 16889 -135293 3522 228864 -93429 2570 -1563 -201192
7431 -201192 -122228 52998 -11900 -70964 -172872 -162305 -219132 -108809 -112818 49435 93495
7420 93495 137153 -379249 -198192 -199937 181455 -316146 -197220 -212839 -34367 46511 -30085
7408 69710 137214 -1627 -110011 -121761 41145 -163773 -59277 -69406 -42268 -50574 -116170 58447
7395 152725 -65664 -125986 -122532 -91096 25772 7970 23770 61881 -410648 -80221 -186455 -74019
7382 -175708 34436 448145 -39762 95488 -244741 -58391 -114161 -252552 65114 -84946 -204790
7371 -204790 -311251 -118797 248093 206565 -64822 -72440 -149783 -15989 225606 -276294 -29399
7359 50164 -55695 308938 -234217 -139165 114369 46638 -196356 -270147 -118576 -216340 20318
7347 172190 132544 86815 78719 -118791 -8558 -316490 147343 75266 -156356 48242 8355
7335 71543 -16737 -120325 -128994 64348 -4252 -150812 -149491 144452 69311 156487 -13305 420205
7322 22067 68440 130134 -294840 -18294 -264999 -428591 -37291 -178515 172143 185495 -53556
7310 51858 -264252 78351 6750 -127988 119480 -97715 -263120 -56414 -302150 182329 29006
7298 -74981 -43438 103457 79732 72785 136249 99002 -207324 173764 221091 -267794 78783
7286 154786 2322 254375 -135881 35515 33525 -58122 138177 -29132 11100 170602 268337
7275 268337 -191860 -347578 -60654 -5142 -153829 -17466 -226522 5340 374610 17226 130079
7264 130079 -73350 -5376 69478 -144052 -186016 -18231 137417 249207 -29262 22957 210743
7253 210743 176546 -201115 215657 -202446 -146400 271571 -22040 -247921 43509 23800 -154234
7241 -149542 10213 -217881 24223 32441 68979 -351065 -199690 258944 -392244 -364887 -214138
7230 -214138 -91670 38993 249271 157948 46420 63849 159812 -440246 9155 393955 3274
7218 43370 -195656 -44126 -53539 97878 -95339 -37411 -40148 -429476 -144867 181385 113749
7207 113749 -203752 282129 -69451 -177448 -33056 246023 31158 59072 -264548 -35744 224791
7195 -275827 48647 -390339 185690 44017 112946 -54114 -44076 -131835 53399 -30266 -167238
7184 -167238 -54487 68542 207017 120764 141468 -148517 -106567 94539 -74192 -209902 -373453
7173 -373453 -9778 -357941 -115651 -259322 -182166 -115836 -28012 423878 -2114 -138081 50375
7161 4835 -68896 204102 -168284 141779 179327 -205499 -6072 -137626 -32158 231076 293472
7150 293472 88388 -290165 9898 67515 99163 -151848 -427702 -9768 -47870 -302782 -53348
7138 -92197 -141372 39526 97672 3946 58603 40837 -31620 -32223 93585 -289213 246276 20477
7125 112938 -42403 137777 -291783 -278385 141119 -12558 229565 -22254 -308921 238441
7114 -69045 61898 22857 67674 -188309 88437 174355 243854 238745 -144562 -203846 175354
7102 234119 88375 -93831 -195722 -124963 -17953 5716 -131774 -281008 -30399 -310172 113277
7090 49629 14851 -407527 -5177 61507 -79916 13517 -41633 97809 172276 -56068 104010 -100198
7077 17874 116933 6143 -164890 63486 -333920 -43472 -36640 -83650 -194128 77938 -90944 179787
7064 -192168 162604 -35697 295854 -114330 -120543 -178896 -61500 -65383 105686 58763 -88878
7052 -215521 -40495 -144470 38934 -105238 -41704 -72461 -136207 -411964 -260766 82241 -182429
7040 43248 -31727 -385838 92244 43961 43077 9885 -59889 -74101 -1248 -326 -18909 -35718 43365
7026 -276729 -98462 -54611 -45738 -149253 -10084 79969 48020 -351 35771 -174450 -313562 -3528
7013 -127166 -477556 -103910 120876 -88505 -133406 -513936 -105952 83727 -356276 14093
7002 -297282 8468 156456 -209928 -122302 118342 -106731 -99728 41198 205126 251810 -88359
6990 -133569 123205 -648978 89295 139761 199670 -67832 237673 16558 -8320 172457 12722
6978 189145 -6552 -30602 174725 87868 73334 87735 -154675 -74078 54000 147428 -126373
6966 -115026 -80604 69375 224641 -90755 -14680 -162829 -8485 -123955 -28860 134804 127018
6955 127018 -183335 310212 -20757 -129647 270471 -53953 133970 199842 286838 230412 -77406
6943 144353 -244990 -45375 -23512 -272563 322586 -305573 -134350 -156 -140342 -194001 80139
6931 -54875 -54766 -90086 197068 -36246 40808 -269910 39923 -262573 21758 247973 54047
6919 216521 -76861 171903 -2354 -227565 -64040 -224942 -182075 51452 -279426 -47475 -80570
6908 -80570 -238020 33872 40817 34658 -80968 -54314 69953 -34226 15128 -321983 -215496 -200900
6896 -200900 -125685 67182 -202480 -302261 -93878 -9452 89116 85100 208436 -221660 -362065
6885 -362065 230403 -168434 171249 238941 -144826 -338920 -85557 142606 -95830 -113622
6875 -113622 -189406 81298 -121069 109987 416603 -161935 353621 140455 258837 -75086
6864 161494 -184587 41783 -13872 -210390 -19600 -202857 157164 117539 78459 520953 -109787
6852 -86784 132211 -99363 198934 265368 -263732 121674 200791 523269 -216428 -149187 -389221
6841 -389221 169046 31045 111502 -42292 209524 119148 125731 -322634 -214015 -97265 178305
6829 -19756 6126 -339227 -72248 36232 -263905 -102315 -255066 319025 -977 248024 -90694
6817 63883 -121988 185925 -79826 11439 51346 -362185 -81475 46700 -164471 -211148 -225221
6806 -225221 176415 -33316 446250 -78083 -145722 -205322 31614 -64454 -452397 67784 243891
6795 243891 -13923 -44469 28563 -321705 -38180 89334 34556 -46602 -113626 22164 -507933
6783 205491 196869 88291 195898 -28603 39412 -13652 -76205 97235 -113614 87870 -174680
6771 213873 -67319 -114762 -49934 -208326 82337 -11827 -183212 -63676 -259598 -109487 -110524
6760 -110524 -141813 -330828 -33849 153041 -199302 125757 206737 39248 -32204 -64620 -305875
6749 -305875 -72897 11738 -266156 -120044 97082 -208343 52614 -81630 -212059 77697 -138456
6737 -58606 167699 69655 200177 54915 -39635 331191 290637 -187644 -160430 23493 -152489
6725 -141883 346124 21343 -259114 -242669 153916 -90468 -350948 -38393 -193816 16843 -16137
6713 -294422 112888 -12341 184312 -131949 -242536 171752 -260089 148491 -92312 -27837
6702 237585 149956 -138632 156288 138045 -132373 -66346 -253360 -45164 122497 4926 31227
6691 31227 20233 18129 -81504 -153950 193913 -94647 -148525 -243783 -468728 26673 -449988
6679 -59899 -64911 141259 217488 147164 -57013 -190207 53459 -113778 14348 -144884 55096
6667 214405 111628 22702 158962 -215724 -189388 192213 -34559 -121347 218496 -208320
6656 -96141 -510995 -183217 -25962 -172075 -166606 -161257 106883 58193 50410 249767 -172126
6644 -157948 -209394 -325343 -44361 93774 -230833 -124368 -159787 185827 15392 166059 67292
6632 63385 -94514 67854 147027 -372343 -101723 232522 34862 -240686 192267 -56025 86341
6620 -176801 -52773 -21763 -11221 56040 -191399 108944 68493 33099 -231946 -111633 49827
6608 -60687 430950 -79273 -95243 -66483 394681 45882 -156121 276477 -112132 334872 305832
6597 305832 89074 -419734 -150224 -126934 147688 88049 -169534 217816 -147611 100092
6586 363488 -180605 -239139 123990 220759 136688 -186499 -108281 245028 -118942 167408
6575 -350773 64535 174783 -340046 -66130 9282 -73773 274564 208275 106898 -96591 39991
6563 -1828 -167600 141635 330414 -172359 6626 -183492 -363538 103491 -51499 -193071 -143395
6552 -143395 -84084 -103469 206126 226615 128233 41403 12023 136564 136265 76718 -102588
6540 -136637 -42559 269577 323108 -32315 276606 78200 275745 46101 67089 152313 -72624
6528 11312 -193496 77293 162341 33391 19848 -55799 230521 85937 -117566 -61568 -11404
6516 122210 -84055 -141106 4310 15519 -131522 -279861 -153530 163106 -65478 -281814 -389277
6505 -389277 249969 -253723 142415 74095 76486 -161124 -39296 -103598 365357 87900 -175122
6493 -119847 20083 83896 36851 -221852 242780 -11148 -72594 -88956 -38641 -29897 -224181
6482 -224181 -348109 -328606 -12020 153023 -143895 199793 16095 127121 171312 130066 37885
6470 15899 200776 171545 -81475 -47893 -190930 -234328 130545 -94572 -104865 447664 292853
6459 292853 15083 222190 136269 -10580 -205778 -190958 -156424 -65359 97111 -186468 -97470
6448 -97470 69242 162627 -11127 193652 91625 78554 81331 122579 153721 -99663 353040 -60790
6435 -63761 57268 -332640 -12170 53525 -407192 -259215 54643 -39019 292687 20502 215928
6424 215928 229273 131001 -305383 183985 -36961 98315 202099 -508180 174451 -126765
6413 -231743 -135878 16797 -155905 151696 -170506 112716 -345522 -97508 218124 58553
6402 75740 -15408 237755 131821 -212745 205955 -216130 -101589 182742 10357 -264802
6391 298427 -35119 55312 55441 -299567 -68673 -100068 -48740 7916 -81060 18920 -13762 139752
6378 204481 10737 -111010 151488 46310 178281 -97239 55780 -61630 -135416 -61729 258042
6366 -25636 -55111 -142522 148940 -364995 142683 20908 118238 -261628 10943 -116552 -258877
6355 -258877 175575 -81360 -36812 -337160 -165462 -194502 -48886 -47207 99401 -98630 -7073
6343 -7905 75293 91923 -122243 -140674 303622 26706 -32993 -174740 -147655 -71727 -233367
6332 -233367 102140 11085 39698 -4494 -44891 78160 -105920 -1211 110293 -72332 99587
6320 -213304 -281983 334000 -152819 -169851 321911 876 -79648 10209 -70634 24433 -197495
6308 -27356 -107278 -62644 -492540 -17730 41481 209491 -117779 165863 -130762 -185962 -79408
6296 -397876 35332 19192 142633 -145588 -133363 -205064 -313967 148832 -306751 245068
6285 -226338 123646 -175053 103696 -220415 -89808 -198044 -42508 17952 153838 198152
6275 198152 -36973 348114 -3283 -432083 13732 8922 270870 -143929 -152773 -317629 -4485
6263 -142338 -55206 29259 -116302 -164381 177603 164392 -43501 -330727 -164709 128813 93995
6252 93995 -108427 -1196 19605 -53344 -273682 94371 128874 71004 -265010 132221 274384
6241 274384 325365 100018 20143 -65850 313242 -16685 241363 93864 -64566 248007 174672
6230 174672 70786 -20365 -170864 114122 81218 207944 96538 -201469 162526 -443145
6219 9408 -189849 149492 -346838 19990 -19674 -346834 -61031 158015 -200082 106793 -10841
6207 -182914 -32907 -328453 110665 167769 -145583 -97959 -121837 154724 -67577 -306652 -22568
6195 -149924 28943 -171929 69040 40737 15842 190500 -7844 -79411 92727 38513 -22522
6183 -182073 -91214 -79694 -125596 76267 42268 236741 10801 -150694 -77563 115834 -1792
6171 123481 -157457 131303 85129 -38757 -71089 -52652 17955 139111 155383 8998 387442
6160 387442 229172 -35633 -236516 214279 34458 -77550 -210479 -22594 61909 -243317 180730
6148 -270658 52066 90009 -45435 -290579 145689 351848 238226 155272 16150 168756 -67854
6136 59373 181838 377799 -413025 -173578 380134 392331 -64522 -84152 -238081 -167240 425409
6124 124593 -62832 84183 -169051 -138619 -180692 36774 -267062 26086 -228005 -14903 -198979
6113 -198979 305982 -432082 219487 10699 -35744 177972 -45031 -16587 -113401 -176187 -166203
6102 -166203 136515 -166776 229878 -10691 77657 -223502 210634 -44773 94082 -445318
6091 -6236 -171416 382741 92075 -136990 -182015 -393747 179131 71946 69387 120702 -151178
6079 82880 -143577 114944 122676 -5830 42 -218528 -258464 -129617 110518 -53700 34723 -311446
6066 -446176 57762 -54863 151371 104154 62589 33882 52142 -204432 158489 -19512 173694
6054 34336 -199494 107660 -254266 -61884 257491 -57087 405202 63666 129949 35841 -76757
6042 -188791 -116544 -114835 166684 69126 -113896 312669 156765 165243 112162 -180267 -56002
6030 249814 141758 132481 -257742 -90417 290222 -193527 -192755 -124201 7466 307834 209630
6019 209630 -231913 231522 282208 -109846 3638 -133705 210120 47151 -48491 132137 89280
6008 89280 131729 152687 136149 -100750 -8208 -84155 -342345 -46972 54416 166897 20393
5996 -79758 179905 164490 452296 -114699 -133131 -361262 199031 -185439 1843 201918 -94380
5984 -42792 -51698 -28574 79036 -178864 -114611 -18112 -52618 14058 -144175 -310097 49716
5972 333326 76816 -256120 223741 -68612 -131948 -184351 230179 -41265 -34472 67208 -152818
5960 -268393 117307 -37076 -239697 44415 45103 -42577 -305366 -61685 6541 27376 -106302
5948 -10379 242350 -12640 378797 -189303 -73960 196795 11191 -144149 128095 71496 -69416
5936 -310478 23166 -89755 157577 125904 -36853 87315 -21015 -99507 -85625 -207636 312957
5924 25456 -49431 -69924 126395 -39425 -58786 -51575 -132245 -194855 329468 73628 155136 258973
5912 258973 38937 -216933 155426 -94923 -50643 -37507 110067 -117776 -9016 249588 54742
5900 18616 5914 71114 -7311 -118209 -99492 -342238 57195 -76411 163996 -116665 8285 -34676
5887 91892 39191 204946 -26202 -178147 -200807 -52142 65018 -52607 12607 -93151 85916
5875 144793 104810 193555 -155669 -119430 22566 167848 -84511 -118072 -254460 343378 -196021
5863 -21897 -139007 -401374 3616 -167187 -438951 46155 -171410 17226 167807 75901 -105436
5851 295798 285069 134447 161969 95312 -190145 -30044 74398 -71892 107299 126257 31791
5839 -179380 238623 -81247 -65940 -318783 -273399 -8066 54787 62345 239939 -42459 365430
5827 61502 -221078 168491 85367 -66984 37335 -360157 -114228 105461 -130457 -198154 332754
5815 -399542 174947 290757 -297406 -213045 164321 113633 -155066 81155 -64105 11170 36384
5804 36384 161110 -189678 -71631 305591 123265 19431 -159515 -34643 -44371 23232 -11802
5792 36367 -193561 234557 -73190 277779 205762 123198 -247451 39932 70833 28254 245108
5781 245108 68392 -58756 267468 -7814 -31734 -169415 -23910 -231589 -178123 -204124 -236388
5770 -236388 -199530 -151678 193258 -312488 -185294 -57754 324946 86041 -56259 22601 -163115
5758 156902 11192 -203028 159065 -1439 29317 -71095 181666 71808 258586 -115072 441791
5746 -37974 8688 5506 -43102 363788 333893 6669 -95467 -110342 -63324 -270261 -147769 3722
5733 -130406 405282 -310293 107539 14976 -264809 -85730 -96542 20764 -32181 143541 -182007
5721 -87646 267335 8275 198117 -62993 -235122 -58546 -180648 -239035 357935 -316595 164293
5709 -100237 126545 58757 122790 -173331 132665 122214 -99406 64143 -479304 -67460 -179889
5698 -179889 -279242 254749 -13206 -291718 233619 -30752 -110108 149986 -34186 -260892 60065
5686 85600 -243957 54104 -289778 333516 128893 202208 32852 134223 233393 201981 449204
5675 449204 108692 -204741 81262 45240 -59370 210192 80800 197312 -99546 -6278 103086
5663 212818 -71732 -10431 200369 -208256 30864 -8052 28857 72418 134532 -290360 -537131
5652 -537131 -435806 266543 278544 -139931 118592 33620 -24452 288346 129441 -210019
5641 -13667 -145976 -105804 -102807 -91630 -161505 -201778 232001 103165 131241 -391415 145244
5629 -53479 320568 -303336 -4964 -26864 -174502 -109212 359716 74284 -238651 -5021 114449
5617 -313108 -15821 -210038 63981 -104772 332627 185922 263347 -110472 274221 -11729
5606 -299898 -95894 -124592 291950 220072 102210 -10198 122770 -21144 -33112 -69305 82956
5594 325117 -133524 114630 422928 -293249 -109335 -142070 -32008 132935 131016 -239944
5583 -115386 -50784 250593 -50752 -83180 35198 -33820 91860 -288982 43874 -120979 -145507
5572 -145507 144440 -77357 -175411 99953 200512 -136171 100864 -229750 -69715 -179875
5562 -179875 47771 30616 -106212 38010 10346 -148691 -73458 -117445 40721 -47752 -150491
5551 -150491 282530 -94615 -119449 209816 -62698 -93647 -151252 177754 -127676 -267394 -169844
5540 -169844 -22952 32128 -106644 -85663 -224267 -142937 63264 -61357 -108728 21865 -245077
5528 -120909 28700 -137981 -219891 53587 -67804 82495 203291 182210 -52282 129606 -96266
5516 -50032 260958 549393 -94072 -50536 -9548 -88054 258164 -455803 -56286 -89785 -32906
5504 143097 -49234 10231 121552 106929 47296 107127 -304424 96318 266272 19516 133715
5493 133715 -207077 119244 -135204 204112 224204 -254153 160779 62300 -271175 143516
5482 -26895 -338364 12968 96948 -273089 100387 -35325 -584 -531117 224158 -183639 182588
5470 108171 -102943 -62446 199017 246331 52895 -163652 -83218 164888 -48223 21900 241793
5459 241793 66629 56351 -150904 256385 -175365 -77388 75 323302 -13381 106384 -6166
5447 198176 -62984 -140001 195354 36877 165424 3524 23915 77382 -140109 -67809 410161
5435 101005 -139305 382578 -228047 18936 -15423 64974 -14045 169796 183984 -103951 21092
5423 -92538 -103833 163300 119623 150707 -5044 -21026 -42772 86178 232928 202096 -259364
5411 164595 -201001 396641 -254298 -16401 -179434 104913 68688 -114772 -40402 55347
5400 -32912 -168177 -63026 -22880 -63615 51541 43017 160499 -121561 -315801 430368 -117583
5388 387135 -55314 263223 -334473 -130664 9137 -47293 9027 93217 174432 -171428 130511
5376 -29656 -209947 1280 -36262 -52565 -236610 218625 -245995 44443 -334792 -366331 146422
5364 39459 17053 266464 104 238671 -150874 -129873 29976 157081 -110193 73071 -201787
5352 267637 153428 177656 -154521 -101023 -327160 -370450 -41502 110105 165923 100160 70515
5341 70515 80717 -68262 -38088 -93790 70625 91071 153745 82128 -305661 -68504 47092 -84498
5328 73663 122616 -125713 -294147 130341 -5783 132771 -148847 -57633 -59502 -420948 202669
5316 81064 -139894 146074 -149690 -80016 198353 67525 -118447 -55116 -175351 76170 64440
5305 64440 144099 171744 216582 -319665 -26136 -475538 16055 85227 142109 79419 287668
5294 287668 9333 164045 -231370 -179247 -293729 140813 22941 -190223 -79036 23230 182576
5283 182576 -283710 -70947 -210216 -37935 259778 -68231 475321 136725 7974 -90882 -164126
5272 -164126 306531 -123554 137511 -112949 -232710 268997 -102261 319669 89163 318061
5262 318061 57953 157017 -27002 105272 -209727 114503 46728 195083 158362 18236 30186
5251 30186 -29843 -165366 -145213 178162 -103250 141220 -128623 -32883 -233048 219227
5240 160747 -312583 104805 -138618 280258 59986 -307427 162825 -54599 77320 -188278
5229 -93400 -192639 -294851 45120 -88355 -118348 55566 95060 148600 38173 -190947 -45601
5217 -179359 -112395 -138016 -157051 -96041 255380 -10556 470578 225289 8633 -5280 -41737
5206 -41737 -85013 -143900 -184786 -47305 147963 -135255 161444 183406 54186 130227 -111349
5194 -192616 282564 -268355 218096 -35171 -248581 -111414 109750 -104049 252707 286782
5184 286782 36607 -301676 -225249 54611 211588 -35815 54727 34454 -145291 -49638 -72247
5173 -72247 18556 -13596 -84540 -337803 85627 138199 253301 -100484 73283 246251 -115016
5161 -173001 -136389 211819 114876 -155906 -51092 -114715 -69744 -175864 31698 75886 121509
5150 121509 235096 -216400 41188 185620 58769 117106 3315 49729 -267821 206661 76276
5138 -239287 122212 155769 -171279 -175487 185145 295858 -114066 175357 34198 -65424 380985
5126 298252 185310 180381 -30739 -58661 39388 -56273 33075 -383820 152411 234177 -60045
5114 139201 -257540 174663 -388908 112434 -52421 177826 -226600 139347 -93467 29271
5103 101074 161901 -45197 52671 -95500 163374 -339739 19086 -28752 80786 -291 -123949
5092 -123949 -23874 -226618 257938 354728 -79561 9776 101496 102336 -106926 13020 197363
5081 197363 193098 -176 -170708 280377 -161216 105711 191485 -163161 280156 -41740 155078
5069 385595 -12578 -279201 -430797 38884 -14414 -408160 119848 -9855 -83068 415052 109543
5057 299601 -12181 25794 221703 -139055 -25128 46454 -34108 -453751 -219778 62005 101770
5046 101770 91956 285998 104421 245253 -330895 26897 194609 427233 236613 48077
5035 15410 -83815 16426 -14575 -109717 612207 244109 131096 35585 -263362 -23074 41247
5023 -185576 18363 -286411 223177 -138049 113819 -237282 174055 130520 276628 203196
5013 203196 19948 58857 196340 263316 -171394 287648 -254098 -155373 -48993 -146249 -138216
5002 -138216 142037 18567 140300 89911 -86810 187880 -286647 462064 -494413 211461
4991 -130714 102706 137721 91319 64348 32856 188919 -16320 192091 237969 17804 199138
4980 199138 31067 148890 218248 -107433 -12545 160546 -119030 10918 47794 169859 86488
4969 86488 -59699 -225703 21356 268326 183475 -419681 427707 -186380 -168098 132244 -8590
4957 -96476 -43101 226071 184955 228938 -292475 145127 -229989 289414 -35596 -22499 -87819
4946 -87819 85016 -145320 174476 -145263 131171 283931 -142837 -58046 88207 -179009
4935 261593 327841 -253355 156485 -184589 226195 -7209 31345 193047 -62626 -112104 239327
4923 -342629 -249724 -228258 -205411 207103 21378 265362 -399456 209074 303680 -30969 -124888
4912 -124888 -178637 62566 101425 -109590 -259415 -42419 -375 60342 -33469 -47498 153251
4900 -12604 101439 254274 164103 196090 -203848 11011 -6004 -349842 -237758 -20711 -54209
4889 -54209 79324 -226005 -68335 -100118 -18137 26558 -35450 238038 -28686 -117326 -60863
4878 -60863 -71761 238518 -44416 -146766 170012 60140 -98913 -37615 95878 223453 -200263
4866 -204837 91158 -75804 3098 381514 -338807 9042 146111 170324 -182316 -44928 -98902
4855 -98902 244152 307822 -48464 -101104 -64086 112430 59308 48238 -34320 117417 188909
4844 188909 146586 99831 -121371 -52298 191376 98937 73566 114858 161583 -365070 192774
4832 -100766 266246 120077 -169553 82775 -58274 -45177 11709 103604 77492 -571505 148881
4820 60685 118106 80845 -118937 345288 201837 -100372 95473 -122999 -200455 269390 443564
4809 443564 -174062 -87771 5533 96429 51599 63263 7413 -53789 215654 -54194 3794 -36359
4796 59372 -370918 -134633 128111 63710 80653 -7681 -36885 97863 -132589 -327858 -222162
4785 -222162 -43694 -71998 -213162 -109289 106716 139802 248655 126535 -100123 97788
4774 146507 115321 179117 198101 -15634 -18359 -254872 -272996 -309638 -142758 -267812 -89622
4762 168021 -191369 109730 -64011 -374743 20187 210867 154056 87563 -82218 -88582 -152837
4751 -152837 79334 27739 92417 -98446 -106591 157218 -30761 -154608 -53371 -59100 40566 -15409
4738 70239 155624 -92498 43431 56399 -247049 -174754 72717 -203955 3662 41916 77932 215042
4726 215042 -2575 -119525 -206553 -86228 118485 14258 178328 -93836 104634 115961 17850
4714 -127941 216380 -3263 -115058 -329906 100114 101013 -69749 -54952 -136991 -45994 56532
4702 240224 245758 68905 44725 120047 106195 -61089 -46230 413461 -120603 -45227 -152491
4691 -152491 -28876 -169394 10532 83147 37536 160611 -22564 208317 -175112 197934 163272
4680 163272 433293 -62571 -217730 22796 66571 340287 434768 -57778 282350 -133975 -405284
4669 -405284 -18300 112165 -30090 -35958 94621 -14008 28747 181952 92502 106448 -67680
4657 -218658 -260463 86073 -25857 177800 -28244 245597 26819 -42043 164034 90057 -209034
4645 -270978 137157 -250821 -141868 53562 9760 218233 -138160 -202988 -264391 -180406 153625
4633 -242271 401114 -38364 318099 100482 77412 213180 116759 -29704 133185 196454 208535
4622 208535 -217210 -149395 -91080 109867 140509 184990 -10374 103470 92287 -92572 167781
4610 75058 -12331 64837 -172325 121913 -117891 233543 -207646 334707 268840 -282586
4599 28851 -269968 -58056 -77650 -115641 -130449 57810 -308344 202021 262184 -99297 100029
4587 115661 155060 78603 11791 -182983 -166018 3108 156562 -354442 69073 68718 13038 273415
4575 273415 17889 122267 -154531 -13093 161449 -57478 52550 -86375 -337794 -179695 -305005
4564 -305005 24831 4981 -228914 84313 -129855 23183 31354 -148317 -125692 -83714 80497
4552 -110842 282915 74522 182301 127448 345878 -124890 112071 150531 -217630 -147680
4542 -147680 14363 38567 15963 165974 -156138 17049 37722 277106 -294181 -77001 -232883
$$ [...]
##END NTUPLES=NMR SPECTRUM
##END=
