
##TITLE=AC1074_TORI01_5819511_qEZrfrgrqa
##JCAMPDX= 6.0         $$ Bruker NMR JCAMP-DX V2.0
##DATA TYPE= NMR SPECTRUM
##DATA CLASS= NTUPLES
##ORIGIN= BRUKER
##OWNER= Administrator
$$ 1.72 TOPSPIN		Version 2.1
$$ 2012-03-25 01:05:47.078 -0500  Administrator@TOPSPIN
$$ Compression mode = diff/dup
##.OBSERVE FREQUENCY= 400.13188235
##.OBSERVE NUCLEUS= ^1H
##.ACQUISITION MODE= SIMULTANEOUS (DQD)
##.ACQUISITION SCHEME= undefined
##.AVERAGES= 64
##.DIGITISER RES= 22
##SPECTROMETER/DATA SYSTEM= spect
##.PULSE SEQUENCE= noesygpps1d.comp
##.SOLVENT NAME= COFFEE_meoh
##.SHIFT REFERENCE= INTERNAL, COFFEE_meoh, 1, 14.96862
##AUDIT TRAIL= $$ (NUMBER, WHEN, WHO, WHERE, PROCESS, VERSION, WHAT)
$$ ##TITLE= Audit trail, TOPSPIN		Version 2.1
$$ ##JCAMPDX= 5.01
$$ ##ORIGIN= Bruker BioSpin GmbH
$$ ##OWNER= Administrator
$$ $$ C:\Bruker\TOPSPIN/data/COFFEE/nmr/AC1074_TORI01_5819511_qEZrfrgrqa/22/pdata/1/auditp.txt
$$ ##AUDIT TRAIL=  $$ (NUMBER, WHEN, WHO, WHERE, PROCESS, VERSION, WHAT)
(   1,<2012-03-25 01:05:42.171 -0500>,<Administrator>,<TOPSPIN>,<go>,<TOPSPIN 2.1>,
      <created by zg
	started at 2012-03-25 00:54:10.671 -0500,
	POWCHK enabled, PULCHK disabled,
       configuration hash MD5:
       1A 1E CE 29 27 FD 77 03 67 4E F0 E3 C4 B2 CB 90
       data hash MD5: 64K
       A6 87 74 C7 CE AF A2 04 8D 60 83 92 57 35 EF BC>)
(   2,<2012-03-25 01:05:44.921 -0500>,<Administrator>,<TOPSPIN>,<proc1d>,<TOPSPIN 2.1>,
      <Start of raw data processing
       efp LB = 0.3 FT_mod = 6 PKNL = 1 PHC0 = 0 PHC1 = 0 SI = 128K 
       data hash MD5: 128K
       A8 0D 1A 7A B4 93 7E 15 06 00 A6 AA A4 42 71 49>)
(   3,<2012-03-25 01:05:46.187 -0500>,<Administrator>,<TOPSPIN>,<proc1d>,<TOPSPIN 2.1>,
      <pk PHC0 = 40.44617 PHC1 = 0 
       data hash MD5: 128K
       5D FB 85 52 69 C0 A8 12 FB E3 B9 D7 CC CB 51 73>)
(   4,<2012-03-25 01:05:46.750 -0500>,<Administrator>,<TOPSPIN>,<proc1d>,<TOPSPIN 2.1>,
      <abs ABSG = 1 
       data hash MD5: 128K
       0F C1 20 C4 1F ED C9 9F 75 77 B9 70 AA B2 D0 2B>)
(   5,<2012-03-25 01:05:46.828 -0500>,<Administrator>,<TOPSPIN>,<proc1d>,<TOPSPIN 2.1>,
      <abs ABSG = 2 
       data hash MD5: 128K
       56 40 D6 DC 48 DA 35 DF E8 4C 44 BE E3 43 94 A0>)
(   6,<2012-03-25 01:05:46.875 -0500>,<Administrator>,<TOPSPIN>,<proc1d>,<TOPSPIN 2.1>,
      <abs ABSG = 3 
       data hash MD5: 128K
       D2 29 6B 2B F1 19 8B EB 46 10 A5 90 73 1C F6 D0>)
(   7,<2012-03-25 01:05:46.937 -0500>,<Administrator>,<TOPSPIN>,<proc1d>,<TOPSPIN 2.1>,
      <abs ABSG = 4 
       data hash MD5: 128K
       FC C0 1B 0F C5 10 94 3B C0 34 65 AF 88 5E FF 4E>)
(   8,<2012-03-25 01:05:47.000 -0500>,<Administrator>,<TOPSPIN>,<proc1d>,<TOPSPIN 2.1>,
      <abs ABSG = 5 
       data hash MD5: 128K
       1C 9A FA 35 F2 BF 59 84 30 67 73 4C 19 E4 3C 21>)
$$ ##END=
$$ 
$$ $$ hash MD5
$$ $$ 1F C0 14 13 19 3B FA B4 8C 0A 1A DA 00 CC 08 17
##$RELAX= 
##$RELAX= 
##$RELAX= 
##$RELAX= 
##$RELAX= 
##$RELAX= 
##$RELAX= 
##$RELAX= 
$$ Bruker specific parameters
$$ [...]
##$TP07= 0
##$TPNAME0= <>
##$TPNAME1= <>
##$TPNAME2= <>
##$TPNAME3= <>
##$TPNAME4= <>
##$TPNAME5= <>
##$TPNAME6= <>
##$TPNAME7= <>
##$TPOAL= (0..7)
0.5 0.5 0.5 0.5 0.5 0.5 0.5 0.5
##$TPOFFS= (0..7)
0 0 0 0 0 0 0 0
##$TUNHIN= 0
##$TUNHOUT= 0
##$TUNXOUT= 0
##$USERA1= <user>
##$USERA2= <user>
##$USERA3= <user>
##$USERA4= <user>
##$USERA5= <user>
##$V9= 5
##$VALIST= <valist>
##$VCLIST= <CCCCCCCCCCCCCCC>
##$VD= 0
##$VDLIST= <DDDDDDDDDDDDDDD>
##$VPLIST= <PPPPPPPPPPPPPPP>
##$VTLIST= <TTTTTTTTTTTTTTT>
##$WBST= 2048
##$WBSW= 25
##$XGAIN= (0..3)
0 0 0 0
##$XL= 0
##$YL= 0
##$YMAX_a= 17183512
##$YMIN_a= -7570736
##$ZGOPTNS= <>
##$ZL1= 120
##$ZL2= 120
##$ZL3= 120
##$ZL4= 120
##$ABSF1= 14.96862
##$ABSF2= -5.58391
##$ABSG= 5
##$ABSL= 3
##$ALPHA= 0
##$AQORDER= 0
##$ASSFAC= 0
##$ASSFACI= 0
##$ASSFACX= 0
##$ASSWID= 0
##$AUNMP= <proc_prof1d_extract.lims>
##$AXLEFT= 0
##$AXNAME= <>
##$AXNUC= <1H>
##$AXRIGHT= 0
##$AXTYPE= 0
##$AXUNIT= <>
##$AZFE= 0.1
##$AZFW= 0.1
##$BCFW= 0
##$BC_mod= 0
##$BYTORDP= 0
##$COROFFS= 0
##$CY= 15
##$DATMOD= 1
##$DC= 0
##$DFILT= <>
##$DTYPP= 0
##$F1P= 0
##$F2P= 0
##$FCOR= 0.5
##$FTSIZE= 131072
##$FT_mod= 6
##$GAMMA= 0
##$GB= 0
##$INTBC= 1
##$INTSCL= 1
##$ISEN= 128
##$LB= 0.3
##$LEV0= 0
##$LPBIN= 0
##$MAXI= 10000
##$MC2= 0
##$MEAN= 0
##$ME_mod= 0
##$MI= 0
##$NCOEF= 0
##$NC_proc= -3
##$NLEV= 6
##$NOISF1= 0
##$NOISF2= 0
##$NSP= 0
##$NTH_PI= 0
##$NZP= 0
##$OFFSET= 14.96862
##$PC= 1
##$PHC0= 40.44617
##$PHC1= 0
##$PH_mod= 1
##$PKNL= yes
##$PPARMOD= 0
##$PPDIAG= 0
##$PPIPTYP= 0
##$PPMPNUM= 2147483647
##$PPRESOL= 1
##$PSCAL= 4
##$PSIGN= 0
##$PYNMP= <proc.py>
##$REVERSE= no
##$SF= 400.130004798392
##$SI= 131072
##$SIGF1= 0
##$SIGF2= 0
##$SINO= 400
##$SIOLD= 131072
##$SPECTYP= <>
##$SREGLST= <1H.CDCl3>
##$SSB= 0
##$STSI= 131072
##$STSR= 0
##$SW_p= 8223.68421052632
##$SYMM= 0
##$S_DEV= 0
##$TDeff= 65536
##$TDoff= 0
##$TI= <>
##$TILT= no
##$TM1= 0
##$TM2= 0
##$TOPLEV= 0
##$USERP1= <user>
##$USERP2= <user>
##$USERP3= <user>
##$USERP4= <user>
##$USERP5= <user>
##$WDW= 1
##$XDIM= 131072
##$YMAX_p= 546008110
##$YMIN_p= -231123551
##$CURPLOT= <Network HP LaserJet P1505>
##$CURPRIN= <$Network HP LaserJet P1505>
##$DFORMAT= <normdp>
##$LAYOUT= <+/1D_H.xwp>
##$LFORMAT= <normlp>
##$PFORMAT= <normpl>
##$SURQMSG= 1
$$ End of Bruker specific parameters
$$ ---------------------------------
##NTUPLES= NMR SPECTRUM
##VAR_NAME=  FREQUENCY,     SPECTRUM/REAL,   SPECTRUM/IMAG
##SYMBOL=    X,             R,               I
##VAR_TYPE=  INDEPENDENT,   DEPENDENT,       DEPENDENT
##VAR_FORM=  AFFN,          ASDF,            ASDF
##VAR_DIM=   131072,        131072,          131072
##UNITS=     HZ,            ARBITRARY UNITS, ARBITRARY UNITS
##FACTOR=    0.0627417313425165, 1,          1
##FIRST=     8223.62146879498, -1713,        -137132
##LAST=      0,             2179,            -138901
##MIN=       0,             -231123551,      0
##MAX=       8223.62146879498, 546008110,    0
$$ Real data points
##PAGE= N=1
##DATA TABLE= (X++(R..R)), XYDATA
$$ [...]
66758 2715776 2686562 2658914 2631987 2605176 2578711 2552667 2526029 2497516 2467084 2435826 2404627
66747 2404627 2373730 2343484 2314524 2286978 2260304 2234296 2209530 2186324 2163833 2140852 2117205
66736 2117205 2093647 2070508 2047174 2023099 1998690 1974661 1950833 1926303 1900984 1876345 1854000
66725 1854000 1833784 1813949 1793331 1772494 1752292 1732203 1711157 1689588 1669271 1650878 1632924
66714 1632924 1613919 1594725 1577682 1563670 1550949 1536993 1520735 1502841 1484424 1465985 1447422
66703 1447422 1428618 1409834 1391541 1374082 1357748 1343094 1330528 1319273 1307277 1292904 1276628
66692 1276628 1260474 1245857 1232567 1219822 1207365 1195117 1182538 1169128 1155210 1141504 1128022
66681 1128022 1114036 1099228 1084259 1069997 1056653 1044051 1032433 1022395 1013912 1005890 997092 987487
66669 987487 978317 970594 963722 955830 945508 933116 920525 909787 901817 895842 889952 882584 873814
66656 873814 865078 857540 850984 844398 837257 829858 822589 815281 807266 797993 787869 778580 771984 768097
66642 768097 764549 758863 751168 743954 739166 736356 733787 730300 725509 719042 710675 701045 691450 682865
66628 682865 675586 669584 664533 659536 653683 647216 641532 637591 634705 631403 627181 622812 619002 615371
66614 615371 610997 605554 599621 594163 589982 587334 585556 583139 578759 572485 565686 559629 554455 549644
66600 549644 544925 540292 535468 530033 524095 518386 513508 509384 505580 501916 498588 495729 492936 489378
66586 489378 484631 479399 475028 472096 469858 467270 463999 460059 455328 450292 446622 445641 446337 446114 443594
66571 443594 439604 435453 431685 428741 427124 426004 423254 418160 413015 410576 410791 411444 411270 410661 409727
66556 409727 407687 404487 401355 399091 397050 394470 391823 390023 388983 387623 384925 380582 375100 369750
66542 369750 365891 363829 362581 361071 359279 357873 357076 356404 355437 354387 353648 352948 351402 348708 345962
66527 345962 344593 344464 343954 342184 340093 338654 337202 334776 332186 331098 331512 331848 331344 330611 329774 327977
66511 327977 325223 322808 321162 318985 315680 313128 313553 316607 319876 321476 320916 318305 314311 310485 308087
66496 308087 306587 304420 301165 297969 295871 294655 293407 291419 288481 284958 281680 279258 277594 276408
66482 276408 275843 275927 275772 274147 270784 266607 262838 260352 259494 259770 259960 259258 258203 257894 258497 259107 258878
66465 258878 257689 255932 254177 252775 251352 249131 246281 244274 244196 245272 245912 245513 244341 242491 240310
66450 240310 239090 239700 240891 240603 238722 236902 235875 234840 233564 232989 233296 233383 232985 233374 234896 235651
66434 235651 234060 231284 229546 229203 229067 228640 228315 228011 227281 226510 226550 227288 227727 227301 226004 223640 220301
66417 220301 217437 216914 218603 220019 218815 214869 209818 205480 203105 203215 205392 208438 211037 212196 211324
66402 211324 208520 204885 201921 200440 200362 201357 202929 204060 203722 202103 200569 200065 200143 199816 198726 197106
66386 197106 195306 193913 193753 195089 197065 198402 198402 196968 194197 190481 186614 183194 180257 178065 177732
66371 177732 180002 183621 186052 186072 184655 183027 181056 178424 176340 176556 178874 181030 181396 180740 180739 181690
66355 181690 182647 183320 184705 187647 191588 195079 197030 197081 195234 191813 187745 184203 181578 179198 176522
66340 176522 174375 174218 176072 177950 177928 176277 174749 174126 173528 172163 170559 169541 168928 168032 166874 166009
66324 166009 165531 165022 164286 163446 162574 161939 162274 163861 165484 165363 163367 161387 161167 162507 164047 165097
66308 165097 166051 167391 168914 169890 169627 167931 165200 162174 159641 158362 158770 160295 161331 160660 158776
66293 158776 157200 156659 156764 157273 158454 159929 160390 159140 156992 155027 153270 151314 149387 147826 146101
66278 146101 143473 140316 137944 137278 138395 140997 144385 147147 147878 146394 143774 141315 139988 140512 142892
66263 142892 145783 147304 146906 145863 145659 146413 147143 147026 145963 144285 142328 140341 138692 138072 139065 141180
66247 141180 142723 142379 140814 139917 140444 141241 141033 140018 139123 138487 137575 136332 135245 134262 132603 129973
66231 129973 127352 126082 126437 127476 128145 128145 127803 127595 127934 129048 130651 131869 131919 130876 129515 128321 127006
66214 127006 125132 122931 121202 120475 120501 120551 120120 119315 118632 118440 118880 120295 123306 127973 133055 136729 138144
66197 138144 137818 136560 134652 132211 129553 126805 123802 120817 118795 118306 118796 119453 120258 121506 122752
66182 122752 123109 122395 121295 120561 120609 121563 122960 123811 123784 123980 125516 127539 127850 125512 121742 118130 115208
66165 115208 113079 112087 112072 112022 111370 110963 111850 113741 115473 116536 117261 117862 118125 117811 116695 114503 111548
66148 111548 109153 108573 109687 111535 113854 116984 120376 122584 123229 123723 125215 126765 126670 124992 123481
66133 123481 123176 123411 123408 123674 125065 127281 129201 130394 131445 132782 133919 134048 133045 131711 131167 131902
66117 131902 133118 133262 131739 129980 130080 132275 134553 135093 134288 133747 133929 133738 132281 130070 128246 127286
66101 127286 126889 126805 127199 128091 128643 127488 124097 119735 116559 115593 115967 116278 116130 115976 116009 115817 114910 113115
66083 113115 110733 108713 108245 109475 110956 111023 109576 107904 107126 107536 109124 111608 113922 114779 114070 112919
66067 112919 112164 111550 110677 109819 109342 109083 108788 108581 108571 108604 108823 109740 111211 112019 111236 109493 108145 107514
66049 107514 106761 105397 104187 104421 106590 109746 112057 112295 111026 109950 109809 109511 107787 105128 103287
66034 103287 103173 104094 104993 105579 106008 106173 105768 104852 103986 103791 104474 105812 107589 109861 112622 115441 117874
66017 117874 120038 122066 123163 122265 119915 118303 118785 120437 121945 123655 126259 128438 127933 124831 121758
66002 121758 120443 119974 119188 118967 120745 123921 126367 126976 126340 125174 123331 120504 116996 113581 111137
65987 111137 110379 111343 113127 114727 116034 117480 118861 119270 118262 116381 114389 112692 111629 111542 112098 112311
65971 112311 111832 111688 113025 115548 118004 119951 122041 124466 126174 126190 125075 124273 124269 124183 123337 122634 123976
65954 123976 128391 134890 141042 144596 144841 142896 140801 140019 140440 140701 139599 137262 135006 134094 134728 136106
65938 136106 137174 137260 136285 134652 132875 131093 129086 127006 125900 126989 130255 134142 136985 138518 139686
65923 139686 141063 141831 140498 136574 131452 127510 126224 127082 128370 128885 128742 128748 129398 130523 131490 131636 130880
65906 130880 129917 129465 129307 128673 127572 126823 126479 125283 122570 119810 119037 120178 121252 121067 120423 120611 121996
65889 121996 124322 127110 129191 129072 126699 124088 123344 124632 126670 128504 129929 130904 131655 132914 134936
65874 134936 136520 136111 133899 131768 131072 131375 131550 131118 130109 128544 126731 125485 125367 126026 126797 127565
65858 127565 128497 129347 129766 130128 131247 133168 134950 135851 136075 135961 135143 133318 131412 130926 131980 132932 132366
65841 132366 130685 129170 128231 127602 127714 129475 132516 134874 135057 133639 132249 131660 131588 131806 132482 133582
65825 133582 134691 135424 135508 134529 132164 128707 124956 121570 118865 117090 116432 116808 118047 120197 123130 125970
65809 125970 127510 127311 125943 124213 122713 122104 122919 124640 125629 124702 122497 120792 120622 121550 122693 123850
65793 123850 125427 127566 129666 130756 130249 128373 126062 124502 124684 126942 130484 133466 134065 131976 128837
65778 128837 126917 127228 128903 130350 130828 130768 130680 130202 128635 126264 124467 124226 124946 125302 124938 124673 125052
65761 125052 125463 124980 123600 122218 121697 122361 124191 127003 130276 133056 134328 133708 131935 130480 130268 130681
65745 130681 130245 128479 126598 125990 126521 127026 127175 127848 129457 130853 130588 128754 126827 125921 125856 125825 125301
65728 125301 124226 122962 122253 122717 124098 125473 126417 127485 129200 131043 131937 131457 130211 129316 129770 131788
65712 131788 134267 135392 134475 132786 131875 131597 130684 128807 126743 124736 122200 119394 117942 118919 121442
65697 121442 123891 125637 126845 127493 127516 127218 126611 124996 122172 119527 118695 119393 119645 118081 115106 111843
65681 111843 108901 106314 103949 101738 99856 98645 97968 97056 95581 94490 94919 96628 98479 100193 102445
65666 102445 105117 106707 105952 103268 100125 97574 95722 94107 92320 90628 90045 91172 93021 93719 92510
65651 92510 90409 88798 88162 88293 88825 89244 89230 89382 90888 94040 97747 100825 103090 104849 106174 107197
65635 107197 108420 110093 111824 113171 114022 113965 112151 108516 104580 102301 102454 104406 106811 108079 107117
65620 107117 104542 102576 102871 104839 106762 107878 108539 108932 108809 108166 107150 105544 103273 101202 100449 101053
65604 101053 102208 103627 105639 107998 109748 110423 110534 110677 110967 111444 112175 112733 112341 110802 108713 106726
65588 106726 105280 105010 106399 108810 110776 111594 111829 112067 112202 112330 113209 115064 116906 117949 118999 121348
65572 121348 124724 127373 128050 127122 125824 125161 125457 126239 126437 125221 122768 119903 117223 115082 114095 114748
65556 114748 116388 117416 116926 115624 114821 114935 115426 115692 115386 114084 111439 107972 105212 104553 105968 108062
65540 108062 109336 109210 107982 106252 104635 103691 103677 104351 105239 106098 106953 107839 108845 110293 112321 114194
65524 114194 114606 113078 110659 108823 107970 107468 106853 106228 105503 104135 102113 100636 101070 103197 105038 104637
65508 104637 101853 98263 95469 93754 92386 90978 90144 90682 92383 94170 95509 97167 100114 103904 106758
65493 106758 107348 106064 104354 103308 103163 103738 104815 106223 107929 109895 111540 111751 110111 107940 107265
65478 107265 108643 110665 111755 111620 110657 108919 106450 103984 102299 101185 99923 98681 98572 100189 102858
65463 102858 105626 108360 111426 114604 116887 117505 116970 116828 118105 120184 121640 122166 122931 124857 127486
65448 127486 130106 133030 136658 140037 141844 142483 143670 145838 147476 147384 146205 145156 144566 144387 144878 145762
65432 145762 145759 144061 141543 139409 137489 135020 132389 130640 129707 128692 127780 128316 130790 134083 137017 139379
65416 139379 141002 141149 139712 138118 138054 139701 141895 143604 144649 145395 146393 148134 150625 153377 156187
65401 156187 159591 163978 168563 171974 173830 175029 176316 177252 176994 175520 173450 170941 167552 163308 159103
65386 159103 155633 152562 149412 146736 145398 144957 143974 142079 140456 139767 138900 136716 133925 131877 130376
65371 130376 128260 125618 123666 122609 121481 120289 120374 121985 123251 122628 120986 120043 119968 119890 119860 120661 122159
65354 122159 123329 123813 124219 124864 125211 124604 122852 120262 117863 117220 118913 121306 121948 120267 117957 116739
65338 116739 116951 118483 121646 126265 130806 133395 133418 131689 129495 127976 127922 129449 131912 134511 136903
65323 136903 139072 140920 142365 143635 145141 147087 149423 152120 155406 159645 164874 170367 174938 178047
65309 178047 180533 183949 189280 196535 205193 214529 223773 232718 242124 252876 264703 276228 286082
65296 286082 293254 296689 295817 291756 286814 282206 277010 269853 260836 251350 242817 236133 231439 227609
65282 227609 222675 215652 207594 200232 194153 189022 184916 182408 181569 181709 182030 182035 181695 181735 183160 185747
65266 185747 187541 186763 183835 180631 178149 175888 173037 169129 163886 157767 152512 149621 148198 145712
65252 145712 141226 136472 133329 131693 130601 129993 130096 130043 128495 125384 121954 119312 117711 117001 116980 117375
65236 117375 118099 119379 121122 122404 122208 120500 118043 115463 113105 111471 110818 110385 109008 106763 105192
65221 105192 105432 106798 107727 107535 106639 105482 104155 102938 102262 101822 100490 97813 95109 94269 95593 97599
65205 97599 99020 100082 101425 102688 103004 102366 101489 100598 99412 98298 98284 99511 100620 100325 98964 97962
65189 97962 98358 100443 104191 109131 114095 117999 120816 123205 125337 126830 127670 128248 128390 127380 125372
65174 125372 123957 124571 126789 128784 129166 127821 125364 122556 120205 118874 118494 118692 119461 120932 122526
65159 122526 123114 122288 120759 119184 117416 115393 113764 112650 110586 106258 101043 98216 99227 102054 103736
65144 103736 103305 101543 99211 96731 94804 93969 93921 94254 95368 97548 99706 100554 100717 102089 105003 107633
65128 107633 108622 108660 108732 108351 106743 104584 103048 101829 99640 96471 93873 92986 93595 95348 98507 102705
65112 102705 106088 106889 105460 103637 102151 99809 95598 90666 87323 86501 87120 87825 88396 89171 90039 90735
65096 90735 91548 92907 94554 95875 96946 98468 100534 102086 101833 99428 95761 92475 91119 92239 95113
65081 95113 98573 101915 104719 106331 106399 105795 106033 107529 109180 109850 109648 109533 110328 112341 115286 118248
65065 118248 120282 121254 121597 121306 120110 118797 119162 121901 125365 127186 126645 124835 123148 122402 122993 124910
65049 124910 127593 130375 133111 136126 139703 143851 148176 151830 154039 155051 156140 158327 161515 165082
65035 165082 168774 172655 176775 181263 186166 190890 194541 197336 200969 206892 214697 222648 229176 233441
65021 233441 235402 236159 237485 240072 242773 244290 244821 245144 244859 242798 238668 233178 226970 220509 214491
65006 214491 209094 203224 195830 187657 180303 173896 167281 160462 155061 151927 149776 146859 142799 138240
64992 138240 133875 130498 128919 128881 128785 127311 124882 122898 122036 121928 122134 122656 123490 124059 123322 120627 116650
64975 116650 113159 111379 110786 110039 108794 107746 107080 106084 104588 103756 104809 107471 110179 111438 110771 108802
64959 108802 106759 105561 105165 104917 104335 103141 100897 97480 93860 91503 90831 91038 91462 92239 93386 94282
64943 94282 94570 94815 95670 96949 97994 98543 98800 99019 99298 99527 99465 99159 99164 99753 100068 98891 96320 93808
64925 93808 92355 91560 90726 90003 89988 90880 92398 93954 94595 93592 91548 90342 91487 94819 98843 101913
64909 101913 103104 102722 102050 101951 101865 100957 99852 99878 100800 101044 100397 100578 102434 104410 104858 104249 103800 103387
64891 103387 102495 102064 103549 106642 109429 110439 109394 106511 102458 98642 96306 95523 95841 97188 99081
64876 99081 99908 98661 96882 97096 99467 101693 102243 102073 102804 104678 106857 108531 109106 108248 106322 104170
64860 104170 102208 100386 99092 99109 100308 101253 100620 98480 95852 93639 92342 92188 92982 94114 95115 96052
64844 96052 97221 98539 99323 98641 96254 93448 92523 94804 99320 103862 107031 108770 109443 109369 109035 108766
64828 108766 108117 106425 104046 102279 101970 102770 103804 104473 104668 104871 105922 107947 109654 109531 107666 105445
64812 105445 103592 101628 99387 97866 98078 99994 103030 106706 110411 113369 115369 116778 117362 116060 112661
64797 112661 108870 106718 106262 105792 104196 102308 101787 103151 105085 105595 103776 100515 97454 95461 94301
64782 94301 93471 92664 91583 90130 89052 89637 92255 95590 97744 97949 97088 96799 98074 100288 101600 100862
64766 100862 99174 98865 100868 103795 105780 106369 106319 106424 107059 108049 108369 106770 103480 100615 100001 101069
64750 101069 101846 101638 101595 102783 104802 106599 107695 108126 107784 106449 104260 101765 99578 98167 97845 98638
64734 98638 100076 101260 101373 100301 98736 97546 97114 97360 98242 99833 101936 104082 106130 108448 111206
64719 111206 113699 114771 113943 112015 110607 111030 113241 115684 116429 114799 111896 109379 107840 106520 104567
64704 104567 102413 101679 103514 107080 110114 111244 111317 112038 113807 115667 116969 117999 118944 119349 118913 117833
64688 117833 116013 113017 109446 107228 107533 109255 110674 111861 113999 116806 118474 118304 117647 117489 116690
64673 116690 113943 110507 109328 111527 115181 117848 119142 120172 121381 122047 121629 120509 119131 117244 114576
64658 114576 111854 110436 110935 112690 114656 116287 117355 117376 115879 113287 111049 110502 111615 113089 113682
64643 113682 113178 112079 110860 109910 109743 110427 110902 109800 107289 105390 105870 108329 110879 112217 112470 112525
64627 112525 113345 115571 118894 121916 123412 123595 123471 123235 122313 120874 120137 120837 122349 123711 124753 125768
64611 125768 126857 128062 129507 130974 131895 132182 132445 132968 133047 131889 129643 127113 124898 123300 122549 122579
64595 122579 122951 123442 124316 125652 126911 127662 128199 128843 129176 128679 127732 127232 127406 127690 127618 127215 126653 126061
64577 126061 125557 124993 123815 121679 119060 116838 115500 115154 115871 117367 118670 118990 118851 119597 121700 124251
64561 124251 126236 127632 128974 130384 131348 131219 129771 127500 125436 124422 124563 125476 126805 128118 128636
64546 128636 127782 126028 124635 124401 125082 126046 127017 128028 129151 130465 131952 133246 133856 133724 133239 132600
64530 132600 131587 130074 128326 126572 124739 122941 121858 122134 123615 125482 126970 127625 127106 125383 123138
64515 123138 121456 120853 120967 121454 122723 125232 128275 130280 130541 130007 129858 129826 128751 126634 125171 125883
64499 125883 128319 130602 131390 130916 130335 130509 131356 132115 132189 131766 131432 131283 130875 130248 130425 132395 135918 139732
64481 139732 142713 144425 144875 144373 143613 143267 143346 143226 142339 140564 137997 134862 131867 130266 131101 134172
64465 134172 137822 140001 139886 138549 137772 138075 138268 137044 134499 131653 129028 126488 124307 123390 124136 125761
64449 125761 127228 128406 129706 130892 131051 129962 128823 128978 130189 130857 130119 129044 129299 131135 133358
64434 133358 135042 136449 138147 139854 140444 138875 135194 130949 128342 128244 129139 128782 126729 124335 122499
64419 122499 120978 120119 121362 124880 128291 129348 128845 129049 130002 129550 127011 124597 124465 125989 127052 126909
64403 126909 126522 126705 127147 127282 127266 127809 129366 131686 134077 135936 136860 136447 134595 132235 131140 132253
64387 132253 134535 136094 136211 135582 135032 135011 136062 138455 141131 142252 141315 139736 138844 138376 137621 136944 137058
64370 137058 137520 137361 136865 137263 138514 138808 137002 134505 133667 134787 135915 135584 134537 134229 134709 135015 135056
64353 135056 135723 137075 137682 136348 133614 131077 129947 130779 133667 137725 141041 142165 141317 139461 136841
64338 136841 133490 130498 129299 129851 130889 131888 133399 135343 136531 136391 135896 136090 136709 136955 136750 136578
64322 136578 136837 137899 140036 142706 144698 145600 146323 147527 148398 147887 146437 145429 145287 145170 144430 143550
64306 143550 143525 144721 146402 147265 146752 145853 146016 147177 147801 147180 146515 146958 147776 147660 146929 146929 147793 148433 148628
64287 148628 149507 151673 154145 155675 156152 156204 156235 156295 156271 155964 155631 156576 160195 165892 170834 172561 171428
64270 171428 169897 169923 171673 174303 176942 178789 179156 178011 176419 176129 178517 183583 189713 194519 196411
64255 196411 195748 194536 194772 196831 199295 200325 199261 196969 194899 194048 194660 196280 197819 198059 196777
64240 196777 195253 195210 197238 200574 204225 207642 210257 211167 209914 207322 205113 204601 205931 208487 211815
64225 211815 216061 221554 227997 234248 239181 242750 245949 249635 253652 257281 260264 263116 266582 271052
64211 271052 276356 281659 285559 286885 285780 283708 281851 279727 276079 271126 266914 264815 263448 260329
64197 260329 255371 251441 250965 253004 254453 253473 250831 248320 246886 246381 246218 245855 245096 244291 244080 244835
64181 244835 246425 248468 250565 252394 253898 255349 257056 259252 262503 267728 274990 282500 287875 290700
64167 290700 293017 296756 301475 305343 307817 310299 314160 318907 322646 323865 322434 319168 314901 310158
64153 310158 305456 301367 297940 294384 289967 285327 282167 281311 281659 281643 281232 281707 283695 286312 288317 289421
64137 289421 290333 292149 295793 301376 307761 313356 317566 320966 323916 325957 327049 328375 330838 333351
64123 333351 333864 331975 329425 327913 327435 327040 326277 325409 324865 324908 325363 325408 324236 322253 321013 321539 323346
64106 323346 325551 328174 331643 335630 339322 342537 345732 349158 352825 357146 362671 369182 375907 382727
64092 382727 390382 399290 409024 419303 430758 444102 459131 475089 491687 509118 527277 545519
64080 545519 563201 580082 596135 611241 625031 636757 645291 649557 649225 644882 637375 627102 614349
64067 614349 600377 587617 577925 570558 562587 551788 538729 525649 513841 502937 492535 483487
64055 483487 477053 473205 470315 466606 461786 457077 453665 451481 449996 449798 452161 456762 461129 463424
64041 463424 464857 468074 473889 481157 489409 499487 511307 523005 533412 543983 557019 572819
64029 572819 589672 605866 620541 633186 643805 653612 664339 676261 687381 694954 697714 696670
64017 696670 693899 690561 686008 679030 669841 660279 651866 644316 636404 627692 618752 610100 601741 593781
64003 593781 586827 581586 578442 577542 579051 583004 588799 594972 599970 603547 607193 612707 620472 629669
63989 629669 639881 651634 665371 680885 697909 716242 734970 752661 768989 785310 803043
63978 803043 822298 842684 864387 887436 910634 932370 952031 969768 985478 999034 1011018
63967 1011018 1022121 1032128 1040624 1048454 1057385 1068352 1080995 1094826 1109880 1126242 1143917 1163235
63955 1163235 1184479 1206975 1229314 1250678 1271279 1291450 1310985 1329562 1347238 1364385 1381499
63944 1381499 1398981 1416735 1434210 1451287 1468752 1487413 1507324 1528633 1552522 1580184 1611460
63933 1611460 1645735 1683800 1727291 1776451 1830129 1888151 1951968 2022446 2098604 2179343 2265113
63922 2265113 2357051 2455673 2561438 2675532 2798971 2931644 3073244 3224419 3386034 3558001
63912 3558001 3740103 3933585 4140738 4363149 4601588 4857804 5135428 5438747 5771295
63903 5771295 6136087 6536871 6978759 7467800 8010207 8612112 9279921 10020495 10840616
63894 10840616 11746204 12742029 13831184 15013183 16281854 17625822 19031726 20486597
63886 20486597 21976695 23484665 24988469 26462452 27878320 29205241 30410695 31463286
63878 31463286 32336617 33012051 33478682 33730604 33763645 33574417 33162290 32532237 31696366
63869 31696366 30673982 29490772 28177009 26764752 25285149 23766887 22235543 20713313
63861 20713313 19219415 17771129 16384250 15072124 13844344 12706514 11660912 10707024
63853 10707024 9841964 9061279 8359660 7730911 7167665 6661871 6206086 5794620 5423781
63844 5423781 5090937 4792703 4523664 4277309 4048789 3836605 3641275 3462531 3298069
63835 3298069 3144651 2999800 2862496 2732632 2609918 2493222 2381134 2273230 2170337
63826 2170337 2073131 1980868 1892001 1805940 1723666 1646610 1575274 1508942 1446391 1386762 1329954
63815 1329954 1276302 1225993 1178927 1135035 1094254 1056063 1019525 984103 950125 918231 888750
63804 888750 861850 837648 815697 794821 774216 754423 736606 721104 707275 694519 682717
63793 682717 671928 662509 655533 652071 651677 652240 651821 650219 648421 647019 645636 643568 640431 636220 631107
63778 631107 625167 618156 609591 599218 587353 574579 561162 546893 531529 515220 498488 481932
63766 481932 466051 451261 437846 425765 414646 404121 394184 385129 377206 370403 364403 358535 351995
63753 351995 344560 337020 330447 324960 319710 314163 308867 304620 301429 298692 295940 292817 288721 283313
63739 283313 277395 272608 270006 269311 269689 270788 272576 274377 274672 272339 268031 263843 261223 259441 256650
63724 256650 252345 248063 245404 244134 242750 240394 237483 234794 232787 231763 231941 233067 234371 235163 235330
63709 235330 235199 235181 235579 236577 238211 240270 242035 242277 240067 235873 231435 228183 226149 224781 224247 225244
63693 225244 227854 231388 235224 239059 242488 245218 247742 250998 255157 259448 263322 267091 271224 275883
63679 275883 281447 288559 296987 305221 312106 318458 326193 336109 347350 358929 370940 384148 399107
63666 399107 415901 434139 452790 470477 486351 500557 513580 525278 534738 540880 543035 541223
63654 541223 536197 529077 520646 511112 500759 490447 480801 471048 459539 445852 431669 418981 407946
63641 407946 397316 386626 376880 368986 362478 356205 349644 343079 337062 332162 328787 326784 325534 324798
63627 324798 325051 326653 329271 332596 336969 342616 348915 355355 362690 372026 383065 394514 406090 418776
63613 418776 432974 447861 462937 478744 495176 510302 522078 530466 536801 541609 544093 543321 538835
63600 538835 530463 518646 504867 490756 476733 462320 447559 433203 419720 407275 396710 389239
63588 389239 384714 381299 377360 372732 367784 362528 357581 354835 355775 359620 364314 368908 373848 379262
63574 379262 384521 389631 395780 403972 413983 425141 437315 450616 464819 479674 495306 511820
63562 511820 529013 547061 567132 590683 618212 648990 681799 715555 749515 783353 817012
63551 817012 850335 882989 914811 945732 975034 1001122 1022451 1038311 1048399 1052337 1050446 1044721
63539 1044721 1038036 1032174 1027071 1021795 1015530 1007652 997717 985907 973065 959881 946083 930558 912200
63526 912200 890853 867693 844576 822649 801714 781180 761298 742918 726331 711113 697019
63515 697019 684276 672997 663120 655109 649901 647778 647950 649614 652850 658021 664857 672777 681882 693042
63501 693042 707040 723992 743673 766114 791637 820170 850727 882070 914175 948427 985831
63490 985831 1025502 1065650 1105423 1144526 1181356 1213192 1238700 1258977 1275633 1289150 1299813
63479 1299813 1308826 1317265 1324853 1331068 1336740 1343131 1349777 1354541 1355584 1352077 1342986 1326584 1301715
63466 1301715 1268897 1229882 1186696 1141169 1094660 1047774 1000680 953875 908442 865610 826408
63455 826408 791506 760749 732846 706186 680313 656229 635132 617184 601614 587647 575098
63444 575098 564285 555612 549200 544819 542043 540345 539089 537829 536764 536632 537972 540757 544849 550394
63430 550394 557578 566477 577414 590912 606883 624361 642470 661150 680487 699876 718487 736014
63418 736014 752222 766321 777620 786392 793093 796957 796363 790551 780151 766181 749505 731326 713111
63405 713111 695664 678957 663114 648877 636667 625766 614917 603626 592744 583848 577873 574060
63393 574060 570512 566077 561394 557799 555886 555773 558011 562937 569426 575592 580907 586682 594458 604942
63379 604942 618432 634973 653724 673348 693574 715560 740293 767555 796828 828244 862058
63368 862058 898069 936174 976667 1019316 1062873 1106248 1149579 1193477 1237860 1282245 1326551
63357 1326551 1370406 1411776 1447277 1474227 1492113 1502099 1505509 1502932 1494618 1481452 1465168 1447431
63345 1447431 1429062 1410496 1392259 1374055 1353876 1329472 1300788 1269567 1236440 1200169 1160572
63334 1160572 1120371 1082671 1047774 1014100 981367 951042 924078 900144 879128 861670 847743
63323 847743 836127 826045 818294 814061 813378 815486 820077 827357 837241 849281 863353 879863 899123
63310 899123 920876 944546 969789 996713 1025658 1056917 1090670 1127036 1165928 1206788 1248636
63299 1248636 1290523 1331864 1372203 1410709 1445938 1475947 1498614 1512275 1516546 1512742 1503435 1491435
63287 1491435 1478811 1466342 1453630 1439906 1424973 1409319 1393132 1375272 1353505 1326059 1293212
63276 1293212 1257256 1220588 1183804 1146033 1107110 1068530 1031791 996728 962583 930090 900950
63265 900950 875300 851254 827437 804603 784050 765711 748958 734389 723360 715961 710456 704792
63253 704792 698053 690710 684125 679602 677193 675388 672456 668103 663513 660006 658041 657214 656650 655539 653700
63238 653700 651584 649531 647390 645115 643231 642221 641911 641948 642386 643165 643623 643395 643405 644963 647926 650633
63222 650633 651667 650993 649455 648030 647642 648878 651508 654713 657943 661175 664390 667364 669968 672139 673499
63207 673499 673581 672631 671805 672490 675593 681054 687562 693192 697249 701222 706916 713858 719945 724784 730737
63192 730737 739784 750758 761028 770034 779580 791021 803877 817466 832371 849451 868357 888096
63180 888096 908656 931099 956118 983204 1011377 1040147 1069666 1100491 1133486 1169398 1208016
63169 1208016 1248011 1288049 1327875 1367998 1408592 1449159 1489006 1527532 1564302 1599427 1633602
63158 1633602 1667073 1698849 1727996 1755478 1783357 1811862 1838555 1861011 1879014 1893119 1902246
63147 1902246 1904176 1897899 1884155 1863941 1837630 1805540 1768500 1727939 1685981 1644915 1605703 1567521
63135 1567521 1529860 1494533 1464247 1439562 1418830 1401131 1387575 1379485 1376873 1379184 1385933 1395912
63123 1395912 1407379 1420179 1436433 1457842 1483280 1510305 1538167 1567713 1598878 1630049 1660081
63112 1660081 1689474 1719071 1748538 1776699 1802793 1826955 1849760 1871432 1891163 1907102 1917301
63101 1917301 1920744 1917357 1907463 1891750 1871398 1847244 1818770 1784763 1745374 1702838 1659760 1617199
63089 1617199 1574867 1532657 1491330 1452019 1415655 1382688 1352791 1324914 1298218 1273004 1250237
63078 1250237 1230118 1211763 1194454 1178579 1164930 1153666 1144604 1138079 1134598 1133635 1133605 1133431 1133656 1135642
63064 1135642 1140040 1146323 1153463 1160671 1167695 1174833 1182619 1191143 1199664 1207112 1213025 1218023 1223514 1230880
63050 1230880 1240538 1251525 1262190 1271565 1279906 1287857 1295553 1302818 1309797 1316820 1323918 1330995 1338221
63037 1338221 1345618 1352371 1357306 1360190 1362008 1363857 1366017 1368236 1370314 1372175 1373939 1376218 1379908 1385232
63023 1385232 1391349 1397300 1403065 1409292 1416365 1424357 1433663 1444845 1457710 1471325 1485452 1501399 1520766
63010 1520766 1543601 1568540 1594659 1622308 1651925 1683008 1715003 1748584 1785104 1825057 1867953
62999 1867953 1913460 1961588 2011831 2063481 2117221 2175132 2238266 2305111 2373524 2443528 2517055
62988 2517055 2595227 2676927 2759875 2842036 2922020 2999290 3074575 3149478 3225157 3301444 3377177
62977 3377177 3451029 3522210 3590945 3658307 3725076 3790802 3854375 3915212 3972980 4026131 4071682
62966 4071682 4106837 4130182 4140991 4138223 4121007 4089754 4046062 3991494 3926846 3852696 3770517
62955 3770517 3683220 3594524 3507601 3424306 3345737 3273130 3207669 3149732 3099206 3056787 3024169
62944 3024169 3002487 2991101 2988305 2992715 3003554 3020145 3041964 3068939 3100907 3136750 3174735 3213841
62932 3213841 3254228 3296165 3338979 3381372 3422445 3461983 3499939 3536012 3569489 3598969 3622272
62921 3622272 3637267 3643063 3639869 3627415 3604155 3568601 3521027 3463077 3395950 3319885 3235410 3144106
62909 3144106 3047852 2948126 2846451 2744840 2645279 2549173 2457490 2370796 2288931 2211422 2138584
62898 2138584 2071420 2010001 1952923 1899059 1849009 1804099 1764752 1730556 1700775 1673705 1646558
62887 1646558 1617612 1587946 1559715 1533324 1507881 1483815 1462928 1445652 1430132 1414533 1398797
62876 1398797 1383551 1368563 1352948 1336084 1317985 1299653 1283056 1269525 1257892 1245445 1230954
62865 1230954 1215626 1200936 1187139 1174382 1163538 1154954 1147618 1140545 1133858 1127695 1121337 1114501 1108277
62852 1108277 1103482 1099046 1093403 1086733 1080501 1075306 1070492 1065453 1060156 1054754 1049793 1046507 1045730 1046659
62838 1046659 1047614 1047860 1047820 1047839 1047751 1047481 1047064 1046113 1044090 1041086 1037628 1033916 1030015 1026530 1024113 1022373 1020150
62821 1020150 1017038 1013782 1011037 1008443 1005259 1001518 998330 997113 998307 1000546 1001473 999813 996373 992707
62807 992707 989432 986490 984339 983694 984241 984683 984142 982803 981191 979585 978122 976742 974920 972149 968757
62792 968757 965686 963393 961512 959492 956997 953830 950077 946146 941997 936635 929358 921417 915315 912199
62778 912199 910896 909783 908593 907894 907668 907086 905148 901047 894481 886319 878682 873774 872591 874775 879159
62763 879159 884084 887740 889068 888457 887206 886220 885388 884146 882365 880667 879946 880607 882368 884877 888377
62748 888377 893385 899752 906496 912861 919231 926670 935804 946581 959103 974084 992043 1012308 1033450
62735 1033450 1054910 1077700 1103171 1131484 1161871 1194025 1228335 1264773 1302571 1341524 1382854
62724 1382854 1428193 1478254 1533111 1593219 1659232 1730985 1807525 1888307 1973804 2064873 2161960
62713 2161960 2265038 2373824 2487737 2605752 2726397 2847911 2968397 3085827 3197877
62704 3197877 3301924 3395458 3476301 3542121 3590205 3618601 3627343 3617475 3588814 3540040 3471561
62693 3471561 3386945 3290590 3185030 3071544 2952191 2829611 2705501 2581080 2458778 2341688
62683 2341688 2231102 2125974 2025216 1929381 1839680 1756384 1678845 1606509 1539520 1478638 1424536
62672 1424536 1376668 1333016 1291646 1252430 1216583 1184864 1157153 1133391 1113606 1096966 1082119
62661 1082119 1068747 1057701 1049351 1042980 1038188 1035720 1036279 1039425 1044228 1050210 1057265 1065567 1076060
62648 1076060 1090174 1108473 1130334 1155362 1184145 1217057 1253379 1292484 1335065 1382288 1434351
62637 1434351 1490805 1551783 1617966 1689680 1766734 1848812 1935318 2025184 2117521 2212120 2308653
62626 2308653 2405613 2500584 2591171 2675108 2749841 2812721 2861479 2894191 2909408 2907044 2888746
62615 2888746 2856514 2811033 2751954 2679570 2595748 2503466 2406096 2306737 2207431 2108923 2011654
62604 2011654 1916803 1825948 1740003 1658959 1582321 1509350 1439463 1373135 1311902 1256544 1205793
62593 1205793 1157963 1113475 1074335 1041069 1011673 983986 957705 933286 910099 886967 864019
62582 864019 842872 824957 810252 797515 785221 772396 759043 745821 733089 720574 708284
62571 708284 697334 689104 683532 678818 673097 666182 659647 655439 654364 655499 656945 657405 657132 657207 658112
62556 658112 659486 661257 664209 668940 674782 680464 685699 691519 699119 708939 720845 734464 749126
62543 749126 764153 779707 796946 816891 839349 863332 888367 915143 945093 979565 1018984
62532 1018984 1062383 1108033 1155065 1204419 1257893 1316431 1379494 1445527 1512406 1577815 1640140
62521 1640140 1699025 1754381 1804726 1847186 1879358 1900770 1912354 1914941 1908393 1891839 1864674 1827620
62509 1827620 1782878 1733050 1680077 1625331 1570004 1514619 1458615 1401643 1345246 1292245 1244425
62498 1244425 1201714 1163452 1128988 1096805 1064772 1032309 1001232 973430 948638 925412 903325
62487 903325 882883 863918 845512 827313 809744 792963 776721 761304 747738 736877 728827 723141
62475 723141 718937 715164 711679 709870 711180 715031 719244 722690 726534 732586 741524 753169 767430 784001
62461 784001 801654 818801 834845 850654 867890 888050 911716 938303 966833 997272 1030735
62450 1030735 1068019 1108488 1151105 1196186 1245177 1298603 1354943 1411740 1467077 1519639 1568185
62439 1568185 1611851 1650574 1684166 1710927 1728198 1734766 1731844 1721020 1702072 1674034 1638020 1597472
62427 1597472 1555243 1511656 1466049 1419088 1372508 1327306 1283444 1241121 1201281 1164863 1132285
62416 1132285 1103610 1078449 1055859 1035281 1017530 1003789 993463 984212 974542 965227 957436 950611
62404 950611 943408 936058 930353 927418 926794 927782 930526 935293 941577 948561 955961 963930 972550 981869 992045
62389 992045 1003021 1014362 1025718 1037050 1048011 1057536 1064602 1069062 1071184 1070718 1067114 1060356 1050749
62376 1050749 1038121 1022355 1004773 987718 972167 956665 939416 920668 902156 884851 868403
62365 868403 852516 837663 824226 811930 800626 791051 784254 780455 778721 777770 777111 777544 780365 785855
62351 785855 792786 799768 806808 815055 825302 837361 850662 864605 878342 891159 903228 915197
62339 915197 926836 936964 945005 951650 957529 962279 965645 968550 971929 975148 976747 976390 974857 972385
62325 972385 968441 963317 958578 955351 953229 951683 951715 955108 962491 973132 986330 1001932 1019418 1037744
62311 1037744 1056965 1079490 1108720 1146162 1190219 1237916 1287585 1339835 1396341 1458067 1524605
62300 1524605 1594894 1668340 1745110 1825225 1907409 1989056 2067555 2141491 2210275 2272589 2325641
62289 2325641 2366336 2393096 2406399 2407783 2398863 2381329 2357000 2327062 2291319 2248966 2200182 2146362
62277 2146362 2088733 2027757 1964539 1901843 1842503 1787102 1734312 1683292 1634493 1588119 1543284
62266 1543284 1499377 1457234 1418320 1383569 1353441 1328039 1306337 1286278 1266708 1248568 1233353
62255 1233353 1221168 1211245 1203495 1198186 1194613 1191421 1187916 1183964 1179059 1172851 1166149 1159888 1153338 1144843
62241 1144843 1134222 1122900 1111868 1101283 1092028 1085474 1081084 1076244 1069591 1062895 1058616 1057075 1057265
62228 1057265 1058997 1062646 1067700 1073191 1079154 1086396 1095213 1105349 1116709 1129069 1141567 1153615 1166033
62215 1166033 1180235 1196592 1214629 1234499 1256992 1281959 1307834 1333256 1358666 1386164 1418209
62204 1418209 1456478 1501352 1552053 1607319 1666245 1728770 1795608 1867515 1944253 2024344 2106218
62193 2106218 2189169 2272321 2352928 2426978 2491600 2545584 2587359 2614226 2624707 2620355 2604048
62182 2604048 2577491 2541547 2497867 2448354 2393456 2332699 2266972 2199071 2131863 2066892 2004805
62171 2004805 1946198 1891801 1842403 1798561 1760036 1725835 1695351 1669040 1647332 1629395 1613829
62160 1613829 1600165 1588777 1579620 1572015 1565505 1560082 1555693 1552196 1549560 1547493 1545289 1542838 1541394
62147 1541394 1542432 1546074 1551398 1557845 1565437 1574104 1584011 1596215 1611828 1630717 1652214 1676882 1706174
62134 1706174 1740169 1776974 1814777 1853530 1894116 1936603 1979891 2022820 2065415 2109061 2154988
62123 2154988 2202117 2246984 2286451 2320049 2349015 2373909 2394414 2410827 2424244 2435455 2445131
62112 2445131 2454996 2467313 2482933 2501070 2521164 2543911 2570384 2601297 2637166 2677918 2722023
62101 2722023 2767061 2811272 2853487 2891677 2923184 2946879 2963912 2975964 2983878 2988207 2989611 2988022
62089 2988022 2982612 2973240 2960960 2946672 2930455 2912874 2895757 2880861 2868675 2859178 2852720 2849357
62077 2849357 2848269 2848740 2851037 2855649 2862456 2871421 2883241 2898485 2916707 2937241 2960217 2986002 3014250
62064 3014250 3044405 3076731 3112051 3150777 3192884 3238448 3287568 3340035 3395498 3453508 3512874
62053 3512874 3571688 3628857 3685330 3742908 3801954 3861088 3919232 3977236 4037019 4099367 4163070
62042 4163070 4226378 4289043 4352404 4417535 4484180 4551981 4621800 4694810 4770891 4849337 4930811
62031 4930811 5017002 5108195 5202678 5298837 5396293 5494441 5591552 5686569 5780666 5875867 5972816
62020 5972816 6071051 6170721 6272628 6376639 6480943 6582957 6680563 6772855 6860524 6945699
62010 6945699 7031044 7118605 7209011 7301249 7393409 7484353 7574658 7665242 7755194 7841811 7922723
61999 7922723 7997065 8064693 8125445 8179276 8225881 8264081 8293004 8313978 8329572 8340239 8343651
61988 8343651 8338044 8324370 8304120 8276963 8242275 8201663 8158163 8113780 8069341 8025788 7983860
61977 7983860 7943056 7902613 7863232 7826625 7793720 7764501 7738981 7716990 7697395 7678921 7661464
61966 7661464 7645522 7630758 7616344 7602156 7588363 7574403 7559930 7546321 7535511 7527472 7520567 7514480
61954 7514480 7511084 7512023 7516985 7524923 7535617 7549148 7564710 7580816 7596325 7610983 7625387 7640605
61942 7640605 7657187 7674200 7689526 7701160 7707937 7709148 7703952 7691075 7668717 7635032 7589139 7531382
61930 7531382 7462285 7382064 7291896 7194929 7094843 6993692 6892001 6790370 6689844 6591098
61920 6591098 6494568 6401093 6311223 6224191 6138977 6056292 5978122 5905349 5837228 5773222 5713724
61909 5713724 5658626 5606699 5557052 5510105 5466583 5426582 5390025 5356968 5327049 5299785 5275808
61898 5275808 5256471 5241584 5228893 5216862 5206961 5202140 5203821 5211474 5224416 5242666 5266309 5295278
61886 5295278 5330045 5371795 5421550 5479280 5543741 5612980 5685313 5760214 5838099 5919048 6002122
61875 6002122 6086327 6171865 6259841 6350731 6443430 6535685 6625193 6710424 6790947 6867492 6941969
61864 6941969 7017320 7096781 7182783 7276674 7379972 7495662 7627716 7779324 7952359 8148824
61854 8148824 8372190 8626717 8915646 9240453 9601897 10001552 10442165 10926474 11455870
61845 11455870 12030536 12650868 13318290 14034415 14799820 15613736 16473836 17374824 18306358
61836 18306358 19251336 20184113 21068522 21858084 22501003 22948610 23163451 23125019 22833181
61827 22833181 22308281 21586486 20712095 19730806 18685603 17613964 16545971 15504462 14506566
61818 14506566 13564216 12683533 11865818 11110680 10418188 9788100 9218347 8705270 8244799
61809 8244799 7832721 7464434 7135357 6841685 6580627 6350330 6149821 5978391 5834596
61800 5834596 5716118 5620790 5547291 5494729 5462109 5448393 5452391 5472271 5505703 5550703 5605632
61789 5605632 5668123 5734838 5802624 5869039 5931193 5984972 6026372 6053271 6065512 6064067 6050991
61778 6050991 6029429 6002434 5971793 5938941 5906986 5880789 5864506 5859270 5863334 5874033 5889326 5907621
61766 5907621 5926588 5942672 5952073 5951894 5939866 5913323 5869687 5808595 5732993 5647570 5556412 5462411
61754 5462411 5368194 5276630 5190434 5111826 5042644 4984515 4938864 4906838 4889172 4886266 4898745
61743 4898745 4927758 4974168 5037426 5115964 5208848 5316377 5439037 5576965 5730890 5902482
61733 5902482 6092848 6301511 6527903 6773325 7040415 7331200 7646912 7989598 8362698
61724 8362698 8769993 9215074 9702252 10237227 10826527 11476841 12195117 12988620 13864398
61715 13864398 14828838 15887855 17046956 18310764 19682347 21162416 22747814 24429581
61707 24429581 26191601 28009539 29848446 31658817 33373937 34911792 36182485 37099755
61699 37099755 37594516 37627537 37197278 36339443 35118320 33613847 31909492 30083915 28206274
61690 28206274 26333609 24509421 22763841 21115599 19574825 18145307 16826204 15614010
61682 15614010 14504661 13494255 12577870 11748273 10996683 10315169 9697994 9140494 8637210
61673 8637210 8181807 7768802 7394744 7057348 6753762 6479986 6231744 6005263 5796987
61664 5796987 5603072 5419888 5245238 5078615 4919796 4767305 4618856 4473433 4332420
61655 4332420 4198193 4071886 3952925 3840316 3733547 3632256 3536024 3444938 3359750 3280879
61645 3280879 3207651 3138988 3074484 3014180 2957514 2903222 2850460 2799481 2750958 2704878 2660410
61634 2660410 2616835 2574388 2533977 2496139 2460677 2427462 2397093 2370112 2345826 2322732 2300075
61623 2300075 2278254 2257707 2238426 2220815 2205863 2193813 2183547 2174031 2165650 2159431 2155714 2154343
61611 2154343 2155395 2158869 2164423 2172273 2183288 2196639 2208009 2211889 2205737 2190836 2169585 2143736
61599 2143736 2115216 2086597 2059785 2035275 2013373 1995165 1981703 1973030 1968600 1967972 1970641 1975837
61587 1975837 1983037 1992176 2002962 2014374 2025122 2034225 2041190 2046207 2050310 2054787 2060262 2066621 2073573
61574 2073573 2080647 2087094 2092797 2099147 2107925 2119369 2132375 2146372 2161448 2176391 2188141 2193933
61562 2193933 2192931 2185320 2171150 2150997 2126703 2100269 2072462 2043225 2012918 1982516 1952965 1924840
61550 1924840 1898233 1872725 1847957 1824310 1802289 1781256 1759913 1738346 1718397 1701440 1686906
61539 1686906 1673581 1661229 1650265 1641031 1634250 1630959 1630796 1631494 1631506 1632313 1636562 1644426 1653492 1662110
61525 1662110 1671277 1682892 1697542 1714755 1734533 1757545 1783912 1812560 1842374 1873843 1908833
61514 1908833 1948386 1991474 2036833 2085367 2139192 2198362 2260276 2322881 2386945 2454366 2525556
61503 2525556 2599402 2674322 2747934 2816566 2876617 2926121 2964492 2992034 3010989 3025867 3040792
61492 3040792 3056645 3071889 3085505 3097720 3108537 3117420 3124331 3129449 3131837 3129868 3123197 3112968
61480 3112968 3099911 3083562 3063694 3041259 3017512 2993301 2969712 2948388 2930491 2916055 2904951
61469 2904951 2897918 2896070 2899823 2908764 2922432 2940954 2965105 2995925 3034283 3080937 3137055 3204017
61457 3204017 3282160 3370244 3467132 3573916 3693577 3828597 3979744 4147240 4332153 4536166
61447 4536166 4760507 5005531 5271066 5556917 5863181 6189999 6536593 6900381 7276928
61438 7276928 7660225 8042250 8412285 8757428 9064375 9321091 9517623 9646746 9705031 9693857
61428 9693857 9619335 9490642 9317474 9108479 8871841 8616710 8352912 8088847 7830222 7581002
61418 7581002 7344682 7124161 6921322 6737628 6574697 6433569 6313935 6214814 6135729 6076618
61408 6076618 6037064 6016116 6012456 6024206 6049183 6086014 6134514 6194393 6264170 6341905 6426235
61397 6426235 6515885 6608873 6703087 6797133 6889982 6980672 7069201 7156758 7243958 7329805 7413665
61386 7413665 7497228 7582847 7670565 7758395 7844884 7929539 8011184 8087983 8159217 8225283 8285860
61375 8285860 8339716 8386296 8425624 8456341 8475770 8482569 8477924 8463625 8440454 8408936 8369997 8324155
61363 8324155 8271521 8213437 8152734 8091467 8029647 7967078 7905259 7846537 7792637 7745130 7706132
61352 7706132 7676943 7656514 7642450 7633149 7627976 7625901 7625198 7624406 7622627 7618970 7612526 7602995 7590741
61339 7590741 7576265 7560263 7544433 7531957 7526922 7532996 7552301 7585475 7633120 7697298 7781428 7888872
61327 7888872 8021982 8182268 8370702 8587677 8833218 9107372 9409873 9739361 10093416
61318 10093416 10469202 10863187 11269751 11680362 12084001 12468080 12819443 13125785 13376695
61309 13376695 13563451 13679096 13720574 13690856 13597278 13447070 13245356 12997296 12709999 12391088
61299 12391088 12046736 11682539 11305425 10923244 10542680 10168494 9804532 9454440 9121195
61290 9121195 8806332 8509724 8230259 7967313 7721758 7495111 7287720 7098552 6926683
61281 6926683 6771846 6633407 6510265 6402394 6311180 6237343 6179710 6137046 6109818 6098790
61271 6098790 6102796 6119405 6147043 6184808 6230700 6281860 6336611 6394648 6455019 6515375 6573629
61260 6573629 6629051 6681113 6728492 6770153 6806616 6839176 6868318 6893741 6915533 6934313 6950176
61249 6950176 6962413 6970655 6975461 6976983 6973379 6961614 6940232 6910595 6874768 6832739 6782693 6723798
61237 6723798 6657483 6585631 6508690 6426507 6340420 6253328 6167534 6083268 5999770 5917505 5838889
61226 5838889 5766748 5702279 5644816 5593543 5549018 5512643 5484989 5465185 5451763 5443450 5439082 5437432
61214 5437432 5437342 5437652 5436988 5434362 5430310 5426978 5426664 5430500 5438571 5450749 5467056 5487669 5512909 5542906
61200 5542906 5577021 5613900 5652454 5692743 5735959 5783901 5838481 5901294 5973479 6056174 6150821
61189 6150821 6258391 6378313 6508719 6647480 6791783 6936357 7073153 7193546 7290256 7356617
61179 7356617 7385125 7368513 7302892 7189559 7033843 6842820 6624305 6387073 6140522 5892914
61169 5892914 5649690 5413807 5187684 4974051 4774703 4589439 4417214 4257850 4111792
61160 4111792 3978780 3858046 3749497 3653327 3568441 3492675 3424758 3364813 3312708 3267404 3228441
61149 3228441 3196542 3171886 3153107 3139005 3130065 3127008 3128874 3134108 3143018 3157548 3178456 3203898
61137 3203898 3230984 3257763 3283347 3306920 3327283 3343272 3354359 3360881 3363649 3363236 3359534 3351907
61125 3351907 3339695 3322707 3301436 3276686 3248841 3217823 3183954 3148184 3110704 3069979 3024335
61114 3024335 2974378 2922587 2870328 2816420 2759024 2698067 2635452 2573631 2514168 2456924 2400548
61103 2400548 2344523 2290420 2239906 2191774 2142824 2091972 2041678 1994712 1951464 1911442 1875316
61092 1875316 1843701 1815327 1788351 1762498 1737960 1712947 1684551 1652156 1618369 1586375 1557587
61081 1557587 1531980 1509318 1489498 1472514 1458615 1448139 1440950 1436288 1433257 1431349 1430695 1431918 1435392
61068 1435392 1440518 1446292 1452674 1460709 1471020 1483040 1496120 1510478 1526484 1543773 1561633 1579522
61056 1579522 1596803 1612915 1628276 1643858 1659338 1673068 1684718 1696309 1709230 1721740 1731162
61045 1731162 1737287 1741504 1743576 1741926 1736899 1731149 1726125 1720161 1710893 1698143 1683536 1668372 1652766
61032 1652766 1636186 1618191 1599016 1579661 1560887 1542085 1521862 1499899 1477556 1456449 1436970
61021 1436970 1418367 1399683 1380546 1361641 1344629 1331111 1321378 1314289 1308323 1302601 1297224 1293065
61009 1293065 1290993 1290947 1291979 1293497 1295897 1299467 1303359 1306550 1309365 1312980 1317544 1321940 1325618 1329718
60995 1329718 1335753 1343676 1351874 1359034 1365581 1372914 1381396 1389775 1396986 1403877 1412201 1422305 1433073
60982 1433073 1444170 1456946 1472745 1491544 1512724 1535941 1560686 1586317 1613380 1643616 1677677
60971 1677677 1713797 1749659 1784568 1818988 1853221 1887662 1923184 1959982 1997008 2033824 2072026
60960 2072026 2113408 2157552 2202596 2247588 2292868 2339029 2387043 2438755 2495833 2558767 2627947
60949 2627947 2704841 2790858 2886012 2990052 3103830 3227993 3361537 3503624 3656037 3821847
60939 3821847 4002202 4196034 4402243 4620472 4850733 5094452 5355424 5637916 5944385
60930 5944385 6276668 6638376 7034132 7467452 7941637 8462123 9036371 9673357 10386051
60921 10386051 11192878 12113421 13163437 14356361 15706988 17229777 18937342 20848568
60913 20848568 22998268 25432578 28194883 31317562 34805099 38575454 42381582 45811680
60905 45811680 48437384 50032494 50685034 50712270 50474821 50253005 50227391 50468952 50874136
60896 50874136 51122557 50776158 49500462 47239427 44207285 40735477 37122983 33580690
60888 33580690 30243160 27186716 24438352 21990640 19821991 17907754 16221383 14736508
60880 14736508 13431247 12287552 11286493 10407280 9630691 8940909 8324489 7770189 7269691
60871 7269691 6816415 6403849 6026418 5680919 5365132 5075843 4810018 4566707 4345372
60862 4345372 4142805 3953806 3774577 3603841 3441265 3286782 3141051 3004751 2877543
60853 2877543 2758896 2649218 2548685 2455885 2369349 2289571 2217572 2152313 2091791 2036145 1987150
60842 1987150 1944537 1905121 1866159 1827920 1792470 1761347 1734815 1712128 1692027 1673699 1657234
60831 1657234 1642537 1628486 1614311 1601094 1590319 1581416 1572472 1563038 1554249 1545990 1535932 1522030
60819 1522030 1504624 1485498 1466030 1446676 1427136 1406490 1384175 1361244 1339867 1321365 1305456
60808 1305456 1291470 1279200 1268384 1258528 1249732 1242869 1238438 1235898 1234464 1234009 1234978 1238044 1244025 1253454
60794 1253454 1265911 1280249 1295624 1311970 1329597 1348955 1370666 1394992 1421161 1447933 1474999
60783 1474999 1503183 1533076 1564088 1595121 1625621 1655473 1684124 1710266 1732504 1750231 1763731
60772 1763731 1773479 1779708 1782939 1784500 1785758 1786881 1787081 1785934 1783481 1779024 1771179 1759640 1745771 1730861
60758 1730861 1714916 1697803 1680340 1663225 1645911 1627599 1608490 1589083 1569137 1548415 1527560
60747 1527560 1507230 1487426 1468865 1453724 1443297 1435833 1428527 1421082 1415491 1412911 1412773 1414690 1419048
60734 1419048 1425491 1432756 1440594 1450396 1463427 1479502 1497624 1516715 1535547 1553165 1569844 1586820
60722 1586820 1604981 1624470 1645081 1665799 1684448 1699550 1712490 1726092 1740864 1754453 1765301
60711 1765301 1775030 1786288 1799634 1813646 1827052 1839670 1851850 1863929 1875912 1887271 1897338
60700 1897338 1905920 1913015 1918077 1920457 1920557 1919555 1917941 1915364 1911947 1908465 1904982 1900623 1895143 1889483
60686 1889483 1884268 1878873 1872553 1865345 1857275 1847814 1836899 1825504 1814371 1803033 1790822 1778055
60674 1778055 1765489 1753448 1742188 1732206 1723386 1714669 1705503 1696805 1689548 1683124 1676219 1668618 1660965
60661 1660965 1653273 1645073 1636780 1629539 1623640 1618294 1613169 1608953 1606006 1603519 1600744 1598262 1597161 1597324
60647 1597324 1597455 1596696 1595481 1594588 1593976 1592899 1590716 1587140 1581952 1575070 1566849 1557660 1547051 1533942
60633 1533942 1517971 1500106 1481520 1462417 1442612 1422798 1404287 1387372 1370759 1352946 1333836
60622 1333836 1314730 1297028 1281159 1266631 1252854 1239800 1227956 1217925 1210307 1205622 1203790 1203775
60610 1203775 1204443 1205869 1209098 1214501 1221222 1228498 1236441 1244988 1253181 1260364 1267290 1275019 1283452 1291937
60596 1291937 1300658 1310237 1320522 1331002 1341998 1354228 1367489 1380977 1394695 1409340 1424968 1440841
60584 1440841 1456373 1471147 1484528 1496738 1510009 1526780 1546561 1566216 1583667 1599775 1616137
60573 1616137 1632806 1649180 1665765 1683701 1703155 1723106 1742356 1760091 1775835 1789262 1799865
60562 1799865 1806713 1808968 1806566 1799943 1789448 1775864 1760883 1745657 1729081 1709271 1686932 1665421
60550 1665421 1646819 1629712 1611899 1593770 1577664 1565097 1556064 1550198 1547067 1545772 1545658 1547317 1551666
60537 1551666 1557977 1563778 1566911 1567119 1565525 1563225 1560781 1558790 1558360 1560431 1564506 1568722 1571960 1575485
60523 1575485 1581538 1590426 1600162 1609045 1617365 1626156 1635453 1644376 1652006 1657588 1660745 1662085 1662701 1662475
60509 1662475 1659829 1653789 1645332 1635872 1625478 1613611 1600757 1588054 1575812 1563582 1551349 1539572
60497 1539572 1528295 1517241 1506663 1497244 1489265 1482688 1477945 1475871 1476908 1481024 1488190 1498263 1510648
60484 1510648 1524935 1541826 1562567 1587331 1614929 1644418 1676521 1713084 1755399 1803145 1854806
60473 1854806 1908955 1965052 2022697 2079983 2133030 2177573 2210856 2231864 2240443 2237011 2223080 2201308
60461 2201308 2174818 2146793 2120547 2099172 2084465 2076236 2073092 2074176 2080211 2092600 2111409 2134539
60449 2134539 2159349 2184934 2212274 2242258 2274464 2308301 2344647 2385574 2432702 2486443 2546868
60438 2546868 2614838 2692110 2780561 2881532 2995957 3124991 3270206 3433058 3614470 3815279
60428 3815279 4036740 4279965 4545108 4831914 5141307 5475877 5838623 6231478 6654561
60419 6654561 7105232 7576226 8053754 8516880 8938626 9288998 9539665 9668670 9663371 9521746
60409 9521746 9253225 8878270 8424851 7922740 7399018 6876248 6371468 5895056 5451088
60400 5451088 5040059 4661740 4316056 4002660 3720640 3468290 3242828 3040961 2860194
60391 2860194 2699171 2556457 2429742 2316602 2215359 2124750 2043528 1970972 1907025 1851173
60381 1851173 1801676 1756500 1714481 1674969 1637011 1599838 1563846 1530216 1499552 1471468 1445370
60370 1445370 1421051 1398427 1377113 1356544 1336531 1317685 1300982 1286598 1273541 1261018 1249828
60359 1249828 1241489 1236136 1232350 1229069 1226408 1224432 1222642 1221347 1222133 1225889 1231296 1236190 1239538 1241187
60345 1241187 1240833 1238692 1236518 1236477 1239085 1243203 1247715 1252219 1256560 1260947 1266384 1273808 1282689 1291454 1299412
60330 1299412 1307426 1316521 1326546 1336418 1345113 1352191 1357752 1361952 1364386 1364114 1360679 1354929 1348456 1342437
60316 1342437 1337287 1333020 1329401 1325951 1322357 1318772 1315387 1311990 1308341 1304801 1302250 1301567 1303272 1307176
60302 1307176 1312168 1316959 1321430 1326691 1333497 1341333 1349405 1357543 1365479 1372384 1378268 1384952 1394239 1405666
60288 1405666 1417529 1429668 1443491 1459106 1474299 1487177 1498514 1510457 1523597 1536398 1547242
60277 1547242 1556138 1564304 1572647 1580976 1588502 1594784 1600134 1605278 1610870 1617234 1624212 1631180 1637600 1643686
60263 1643686 1650201 1657359 1664174 1669104 1671201 1670612 1668127 1664182 1658139 1648927 1636907 1624582 1614412
60250 1614412 1606141 1597520 1587739 1578691 1572366 1568516 1565685 1563188 1560891 1558251 1555155 1553091 1553978 1557934
60236 1557934 1563314 1568758 1574193 1579957 1586008 1592181 1598573 1605583 1613944 1624440 1637082 1650743 1664040
60223 1664040 1676260 1687219 1696975 1706263 1716474 1728349 1741170 1753950 1766851 1780637 1795426 1811056
60211 1811056 1828161 1847606 1868962 1890634 1911665 1932795 1955860 1982673 2014272 2050608 2091116
60200 2091116 2135886 2185753 2240911 2300385 2363659 2431832 2506125 2586113 2670828 2761037 2858942
60189 2858942 2965912 3081867 3206665 3340672 3484040 3636640 3798727 3970463 4150889
60180 4150889 4338539 4532886 4733596 4938098 5141361 5338658 5527592 5707061 5875407
60171 5875407 6030190 6168834 6288797 6387825 6464803 6520176 6555270 6571522 6570395 6553434 6522226
60160 6522226 6478885 6426887 6370984 6315895 6265049 6220490 6183806 6157266 6144168 6147672 6169124
60149 6169124 6208164 6264796 6340445 6436223 6551137 6683161 6831237 6994697 7171027 7355840
60139 7355840 7545034 7735497 7923415 8103306 8269425 8417465 8544683 8649175 8729351 8783497
60129 8783497 8809781 8807366 8777409 8722283 8644097 8545034 8428932 8301210 8166993 8030356 7895535
60118 7895535 7767600 7651357 7550369 7467260 7403945 7361279 7339542 7339840 7364134 7413172 7484998
60107 7484998 7575962 7682570 7801881 7930663 8064889 8199821 8330353 8451721 8560413 8654511
60097 8654511 8733229 8796361 8843943 8875957 8892460 8894596 8885499 8869819 8852517 8838451 8832618 8839758
60085 8839758 8863570 8906850 8972378 9063153 9181909 9330861 9511589 9724685 9970091 10248686
60075 10248686 10563157 10916370 11309138 11740382 12208900 12713765 13253264 13824493 14423459
60066 14423459 15044052 15677117 16311995 16938949 17548715 18130152 18670557 19158934 19587352
60057 19587352 19948722 20235301 20440519 20560798 20594357 20539446 20395390 20164955 19854719 19473655
60047 19473655 19032263 18542651 18018459 17474387 16925569 16386368 15868817 15382199 14934078
60038 14934078 14530955 14177602 13876549 13628932 13435502 13296342 13210033 13173587 13183043 13233811
60028 13233811 13320483 13436185 13571886 13716733 13859970 13992805 14108172 14199255 14259517 14284567
60018 14284567 14273330 14227066 14147657 14036697 13895357 13724822 13527167 13305696 13063993 12805145
60008 12805145 12532687 12251732 11967841 11684875 11405178 11131766 10868901 10620369 10388582
59999 10388582 10175794 9984884 9818374 9677702 9564000 9478535 9421836 9393300 9392237 9418504
59989 9418504 9471634 9550065 9651744 9774814 9917237 10076119 10247391 10425454 10603156 10773047
59979 10773047 10928949 11065787 11178299 11261189 11310664 11324822 11302656 11244029 11150726 11025995
59969 11025995 10872670 10693056 10491111 10273432 10047530 9820220 9597804 9386060 9188893
59960 9188893 9008092 8845309 8703498 8585852 8494258 8429381 8391388 8380087 8395334 8437923
59950 8437923 8509269 8609826 8738655 8894806 9078077 9287953 9522585 9778811 10052041 10336012
59940 10336012 10623853 10909287 11185360 11442431 11670096 11862030 12017009 12134484 12211406
59931 12211406 12244516 12233452 12179842 12085231 11952047 11785393 11592046 11378572 11151900 10920356
59921 10920356 10692018 10472569 10266326 10078550 9915023 9779762 9674646 9600821 9559025 9548995
59911 9548995 9569973 9621590 9703140 9812419 9946262 10101545 10274437 10459432 10650846 10845150
59901 10845150 11040581 11234566 11422639 11599859 11762426 11908307 12037325 12150659 12249540
59892 12249540 12334667 12407430 12471161 12530505 12590124 12654842 12730439 12823325 12939697 13085520 13266561
59881 13266561 13487584 13752146 14063750 14426113 14841087 15307113 15820962 16380112 16981703
59872 16981703 17619087 18280426 18950395 19612041 20246795 20833646 21349093 21768969 22072268
59863 22072268 22244908 22280422 22178089 21942509 21585709 21127396 20590642 19997108 19366412
59854 19366412 18717722 18069268 17436364 16831072 16263051 15739322 15264047 14840296 14471711
59845 14471711 14161157 13908483 13711508 13568940 13480801 13446284 13462897 13527649 13637371 13787589
59835 13787589 13972250 14184623 14417237 14660747 14903881 15134565 15340298 15507680 15622958
59826 15622958 15673731 15650288 15546465 15360787 15097093 14763399 14370079 13928935 13452461 12952479
59816 12952479 12439676 11924768 11418497 10928903 10459588 10012366 9590764 9199069 8838778
59807 8838778 8508429 8206947 7935049 7693164 7479974 7293610 7132598 6994833 6876796
59798 6876796 6774438 6684098 6602283 6525544 6451068 6377065 6302791 6228799 6156751 6088155 6023698
59787 6023698 5964458 5912722 5870098 5835433 5806145 5780963 5759540 5739784 5717764 5690365 5656218
59776 5656218 5614080 5562565 5502220 5436038 5367004 5296458 5225546 5156867 5093809 5039188 4995024
59765 4995024 4962438 4941078 4929670 4927900 4937123 4958859 4993317 5039579 5096163 5161059 5232180 5308354
59753 5308354 5389441 5475644 5567674 5667266 5775750 5891307 6008623 6121761 6226575 6320512
59743 6320512 6401876 6470364 6527162 6573524 6610008 6637963 6660811 6682651 6705918 6731370 6760237
59732 6760237 6795754 6842588 6905111 6986110 7086830 7208190 7351984 7520895 7717778 7945448
59722 7945448 8206938 8505125 8841818 9217547 9632321 10086246 10579203 11109759 11673500
59713 11673500 12261165 12857377 13440164 13980727 14444482 14796164 15008871 15071780 14991429 14787538
59703 14787538 14487671 14122348 13720105 13304147 12892648 12500677 12139851 11816423 11531899
59694 11531899 11286667 11082427 10921131 10802896 10725668 10686378 10682302 10711978 10775110 10871457
59684 10871457 11000279 11161415 11356106 11585676 11849935 12148105 12480946 12850706 13259286
59675 13259286 13707878 14198362 14733735 15316995 15950491 16636134 17375241 18168418 19016671
59666 19016671 19922069 20885715 21905126 22974674 24087865 25237320 26412559 27599599
59658 27599599 28783085 29947970 31080246 32169057 33209469 34202689 35154197 36073434
59650 36073434 36974575 37874416 38787758 39725354 40695305 41702963 42747543 43819959 44904602
59641 44904602 45981614 47026906 48012414 48908953 49689460 50330710 50815217 51134424 51290616
59632 51290616 51295823 51169793 50938695 50633060 50284471 49923394 49579057 49278923 49046751 48901861
59622 48901861 48860644 48937627 49144561 49489908 49980007 50619581 51410255 52349304 53429998
59613 53429998 54641460 55966897 57382064 58854731 60343270 61794687 63145588 64326845
59605 64326845 65268738 65905450 66181875 66062674 65538146 64623916 63357802 61796525 60009540
59596 60009540 58069041 56041706 53986543 51955054 49988499 48114214 46345786 44685982
59588 44685982 43127678 41652603 40232134 38831933 37418540 35966127 34462336 32910911
59580 32910911 31329185 29742099 28176181 26655172 25197425 23815400 22516833 21305740
59572 21305740 20182466 19144229 18186867 17306162 16497824 15757509 15081435 14466134 13907218
59563 13907218 13399403 12938167 12520288 12142398 11800475 11491417 11213632 10964972 10741251
59554 10741251 10537816 10351322 10178789 10016083 9858820 9704055 9549768 9393314 9231699
59545 9231699 9063224 8888018 8707405 8523420 8338260 8153344 7969376 7787997 7612708
59536 7612708 7447352 7294082 7153224 7024483 6907769 6803587 6713046 6636825 6574032 6523213
59526 6523213 6484604 6459823 6448927 6449563 6459808 6479849 6509565 6546375 6587317 6631848 6680687 6733074
59514 6733074 6787268 6842937 6901057 6961958 7025488 7092872 7166643 7248718 7340030 7441980 7556732
59503 7556732 7685877 7829968 7989599 8166076 8360966 8575699 8811631 9069960 9351831
59494 9351831 9658775 9992372 10352970 10739638 11152002 11590866 12055820 12543379 13048898
59485 13048898 13569194 14101261 14639035 15173771 15697870 16206660 16696279 17161863 17598905
59476 17598905 18005319 18381195 18726982 19042287 19325760 19575799 19792149 19977759 20139099
59467 20139099 20284187 20420001 20551574 20683250 20820139 20967367 21127105 21296318 21467567
59458 21467567 21631280 21776135 21887899 21950166 21947676 21868701 21704686 21449697 21101699 20663758
59448 20663758 20143229 19550461 18898577 18202938 17479262 16742303 16006147 15283957 14586062
59439 14586062 13919183 13288545 12699629 12156635 11660392 11209477 10802907 10440361 10120345
59430 10120345 9839838 9595784 9385923 9208384 9061603 8944760 8857483 8799149 8769029 8766857
59420 8766857 8792672 8846300 8927481 9036245 9172842 9337648 9531204 9753650 10004008 10280920
59410 10280920 10584166 10914060 11268790 11643547 12032638 12430731 12830918 13222818 13593724
59401 13593724 13930612 14220472 14450728 14611400 14696305 14701324 14623058 14460937 14219730 13908452
59391 13908452 13537727 13119444 12667263 12194618 11711884 11226544 10745373 10274966 9820833
59382 9820833 9387647 8979788 8599882 8247147 7918920 7613783 7332046 7073794 6838232
59373 6838232 6624785 6433221 6262558 6111084 5977510 5861158 5761289 5677259 5608930 5555785
59363 5555785 5515906 5486960 5467909 5458757 5459132 5468227 5485775 5511918 5546488 5589372 5640957 5701201
59351 5701201 5769101 5844363 5928580 6022658 6123309 6224077 6320389 6412817 6505852 6605134 6715911
59340 6715911 6842325 6986903 7150930 7335576 7542327 7772213 8024703 8297465 8587851
59331 8587851 8895973 9226575 9586931 9982815 10417827 10896488 11425267 12009209 12649379
59322 12649379 13345035 14096378 14903380 15763426 16671708 17621868 18603567 19600548 20593662
59313 20593662 21565499 22500820 23384529 24202630 24945413 25608053 26189021 26689939 27115868
59304 27115868 27472722 27763945 27990740 28154034 28253561 28285876 28246187 28132089 27943307 27678604
59294 27678604 27336366 26919127 26435694 25898936 25323445 24724546 24115800 23505645 22897497
59285 22897497 22292893 21692418 21093545 20490314 19876691 19249589 18609156 17958324 17302517
59276 17302517 16648179 16001073 15366878 14752599 14165185 13608792 13085150 12596203 12144157
59267 12144157 11729266 11350201 11007036 10701625 10434465 10203069 10003880 9834131 9691714
59258 9691714 9575125 9483931 9417749 9374743 9352568 9350225 9366995 9400149 9446159 9503804 9573256
59247 9573256 9652064 9734908 9817604 9898426 9974882 10042110 10095630 10133508 10155150 10160465 10151024 10129552
59235 10129552 10097166 10053371 9999764 9941475 9883968 9830590 9784092 9747932 9724692 9715551 9722962
59224 9722962 9751736 9805734 9885140 9988356 10114837 10264636 10437081 10631654 10848577 11086589
59214 11086589 11341136 11606106 11876109 12145696 12407813 12655074 12881999 13084454 13257152
59205 13257152 13392945 13484764 13528359 13524251 13477867 13397330 13290769 13165768 13030130 12890886
59195 12890886 12751958 12614142 12477468 12342175 12207668 12072877 11938277 11805635 11675249
59186 11675249 11545434 11415560 11287803 11165244 11050153 10945037 10853450 10778739 10723556 10691480
59176 10691480 10687364 10715087 10776576 10873967 11011114 11191967 11418875 11693310 12016600 12388983
59166 12388983 12809120 13275002 13783558 14328511 14899946 15486079 16073128 16642715 17171852
59157 17171852 17637200 18018453 18297965 18460579 18496148 18400937 18175785 17825209 17359732 16796871
59147 16796871 16157729 15463420 14734833 13992437 13253487 12530471 11833516 11172244 10553429
59138 10553429 9978771 9447327 8958935 8513597 8109262 7742680 7411596 7114168 6847224
59129 6847224 6607025 6391247 6198561 6026916 5873667 5736908 5615429 5507885 5412940 5329623
59119 5329623 5256866 5193713 5140590 5099009 5069171 5049145 5037249 5033827 5039756 5054814 5078653 5111746
59107 5111746 5153988 5203605 5258911 5320234 5389285 5467719 5556913 5657499 5768192 5886567 6011802
59096 6011802 6145036 6286361 6433463 6584062 6737424 6892334 7045973 7196175 7342372
59087 7342372 7482596 7611913 7725784 7822893 7902900 7963956 8004933 8027874 8035433 8027656 8004208
59076 8004208 7968385 7925929 7880769 7834534 7789449 7749067 7716475 7693962 7684183 7689950 7713293 7755878
59064 7755878 7819369 7904176 8009308 8135047 8284154 8458761 8658005 8880910 9129622 9406784
59054 9406784 9710985 10037853 10384968 10752918 11141856 11549354 11971120 12401296 12832065
59045 12832065 13254706 13660627 14039634 14378228 14662064 14880007 15024445 15089141 15069960 14967991
59035 14967991 14789952 14545375 14244472 13897643 13514274 13101374 12664374 12208934 11741059
59026 11741059 11266536 10791674 10323289 9866044 9420848 8987937 8570585 8173668 7799402
59017 7799402 7446714 7114167 6801221 6507102 6230668 5971363 5728667 5501132 5287610
59008 5287610 5088697 4905158 4735672 4578023 4431711 4297320 4174083 4060174 3954822
58999 3954822 3858138 3769545 3688439 3615526 3551094 3492618 3436555 3382146 3331028 3283444 3237358
58988 3237358 3191293 3145640 3101000 3057400 3015504 2976783 2942126 2911599 2885429 2863910 2846825
58977 2846825 2834291 2827323 2825792 2826799 2827211 2827140 2828787 2832712 2837896 2845001 2856565 2873594 2894246 2916308
58963 2916308 2938910 2961519 2983112 3002821 3019949 3033335 3042225 3047682 3051621 3054603 3056052 3056273 3056552
58950 3056552 3057571 3059469 3063277 3070612 3082012 3096821 3114162 3132547 3149221 3161685 3169583 3173743
58938 3173743 3174111 3170133 3162186 3150858 3135878 3117703 3099183 3083579 3071814 3063599 3059850 3061416 3066564
58925 3066564 3072611 3079483 3089010 3101543 3116118 3133318 3154909 3180936 3210036 3242272 3278661 3318157
58913 3318157 3358362 3399420 3444146 3493861 3546872 3601685 3659223 3721272 3788841 3862261 3940682
58902 3940682 4021310 4101424 4181460 4264209 4351158 4441664 4535207 4631937 4731354 4833222 4939730
58891 4939730 5054076 5176981 5307171 5444926 5592094 5748745 5913180 6085666 6269110
58882 6269110 6465611 6675428 6899828 7141710 7402439 7680974 7977190 8293511 8632337
58873 8632337 8994381 9380575 9793264 10234649 10706285 11210931 11752867 12335767 12962252
58864 12962252 13635771 14360482 15138916 15972102 16862170 17811983 18821468 19886693 21003047
58855 21003047 22166525 23370896 24605446 25855480 27102153 28321091 29483539 30559398
58847 30559398 31517430 32323907 32946058 33359171 33549140 33509573 33241425 32756875 32079471
58838 32079471 31237923 30261476 29180844 28028290 26833131 25618730 24404767 23209314
58830 23209314 22046878 20927245 19858202 18847036 17897838 17010045 16181552 15411205 14697110
58821 14697110 14035440 13422835 12857554 12336552 11853883 11403832 10983435 10590546 10222115
58812 10222115 9876202 9553131 9252711 8972646 8711494 8470498 8250215 8047691 7859365
58803 7859365 7684665 7524355 7377321 7241659 7117549 7006647 6909565 6825784 6754999 6696979
58793 6696979 6651203 6617855 6597883 6591070 6595718 6611321 6639677 6682200 6738175 6807012 6890110 6988850
58781 6988850 7102673 7230763 7373844 7532837 7707498 7897822 8105065 8330174 8573179
58772 8573179 8835210 9118725 9424397 9750427 10096837 10467963 10868657 11300364 11763222
58763 11763222 12259812 12794302 13369767 13988988 14656409 15376660 16151978 16982912 17870352
58754 17870352 18814991 19815881 20870823 21976306 23124771 24302789 25493122 26676788
58746 26676788 27831425 28929355 29939490 30830407 31571039 32131453 32486709 32620657 32526352
58737 32526352 32205821 31671747 30947459 30062343 29046975 27932294 26749661 25528058 24291499
58728 24291499 23060253 21852436 20682123 19557366 18482377 17460853 16495815 15587996
58720 15587996 14736682 13941274 13200509 12511413 11870628 11275504 10722663 10207203 9724977
58711 9724977 9274082 8852635 8456980 8083916 7732906 7404176 7096338 6807776 6538551
58702 6538551 6288677 6056063 5838319 5635224 5447369 5273786 5113018 4965110 4830377
58693 4830377 4707444 4594571 4491795 4399780 4317671 4243970 4178423 4121263 4071696 4028835 3992884
58682 3992884 3963654 3939021 3916474 3894912 3873336 3848983 3818492 3780067 3733514 3679643 3620756
58671 3620756 3559998 3498832 3436659 3373668 3311698 3251117 3189646 3126068 3062488 3000747 2939146
58660 2939146 2875236 2809680 2744856 2681655 2620101 2560985 2504289 2447942 2390934 2335943 2286167
58649 2286167 2241050 2197679 2154879 2113525 2074552 2039134 2009059 1984150 1960889 1936252 1911406
58638 1911406 1889161 1869497 1850384 1831378 1813432 1796583 1780651 1766819 1755720 1745358 1733830
58627 1733830 1722642 1714314 1707983 1700570 1691301 1681969 1673491 1665234 1657139 1649762 1642612 1634931 1627654 1622565
58613 1622565 1620258 1620763 1624935 1632995 1642889 1652414 1661917 1672902 1685340 1698449 1712527 1727651 1742084
58600 1742084 1754336 1765156 1775115 1782180 1784518 1784025 1784134 1785709 1787962 1791750 1798686 1808357 1819650 1833698
58586 1833698 1852476 1875630 1901655 1931024 1965192 2003811 2045943 2092698 2145556 2203411 2264523
58575 2264523 2330160 2402958 2482830 2567960 2658802 2757614 2864790 2979167 3101566 3234987
58565 3234987 3381744 3543135 3721020 3916785 4129501 4357851 4603012 4867014 5149652
58556 5149652 5449971 5769166 6108235 6463429 6827135 7192265 7552450 7898767 8219530
58547 8219530 8502571 8734996 8902446 8993144 9003130 8935319 8794929 8589106 8329652 8031596
58537 8031596 7708458 7370939 7028817 6690590 6361683 6045730 5746714 5467247 5206380
58528 5206380 4962492 4737145 4533000 4349409 4183520 4034338 3902247 3786009 3683806
58519 3683806 3595801 3522037 3459410 3404545 3357987 3321507 3293000 3268365 3246789 3229553 3215230
58508 3215230 3201233 3189030 3182551 3181758 3182424 3181694 3179139 3172914 3159701 3138262 3108618 3068339 3014455
58495 3014455 2948722 2876420 2800371 2720658 2639455 2560806 2485735 2412537 2341708 2275654 2213743
58484 2213743 2152999 2093868 2040116 1992697 1948729 1906834 1868330 1832671 1797084 1761651 1729788
58473 1729788 1702648 1677636 1653321 1631234 1611936 1593746 1576188 1560351 1545221 1528072 1509053
58462 1509053 1491098 1474937 1458729 1442739 1429376 1418158 1405882 1392638 1382580 1377597 1375083 1373106
58450 1373106 1372931 1375143 1377882 1380446 1384599 1391357 1400297 1412358 1428964 1448150 1466312 1484035 1505293
58437 1505293 1530692 1556883 1582934 1611512 1642938 1673916 1703263 1732987 1762295 1786428 1803265
58426 1803265 1815541 1824782 1828700 1826561 1821399 1814382 1802188 1782522 1757435 1728966 1696439 1660380
58414 1660380 1624270 1589875 1555345 1520163 1487523 1459480 1434069 1409368 1386275 1365425 1345633
58403 1345633 1327147 1312166 1300538 1289363 1278196 1269947 1265263 1261003 1255867 1252392 1251643 1251050 1249456
58390 1249456 1249396 1252415 1256920 1262341 1270533 1281580 1293359 1306655 1325247 1349361 1374603 1398902 1424669
58377 1424669 1452578 1479622 1505328 1533144 1562891 1588218 1604602 1613878 1618086 1615179 1604271 1589015
58365 1589015 1572036 1551481 1526520 1500864 1477468 1455161 1433725 1416710 1405784 1397666 1389985 1384884
58353 1384884 1383784 1384263 1385430 1390691 1401729 1415224 1428832 1444713 1463910 1483077 1500202 1517636
58341 1517636 1535875 1550371 1558163 1561720 1562616 1557741 1545796 1531308 1518012 1504303 1489292 1476907
58329 1476907 1469371 1462761 1453753 1444913 1438889 1433515 1427410 1424244 1426387 1430134 1432095 1434548 1439713 1444817
58315 1444817 1447919 1452605 1461611 1471530 1479064 1486874 1498103 1510783 1522697 1535985 1551897 1566886
58303 1566886 1579011 1592258 1609530 1627563 1643866 1662026 1684527 1707007 1725661 1744075 1766604
58292 1766604 1791132 1814452 1838581 1865448 1891290 1912391 1930490 1946738 1956748 1957828 1954799 1952523
58280 1952523 1949056 1942193 1935834 1933393 1931894 1929247 1930287 1938596 1949463 1958190 1968246 1983785 2001432
58267 2001432 2017382 2035549 2060411 2088555 2115422 2143598 2176294 2209637 2239924 2271547 2309055
58256 2309055 2348280 2384127 2420175 2461346 2503842 2541711 2576836 2613177 2647667 2676117 2701653
58245 2701653 2728199 2752460 2771466 2790664 2814908 2839020 2857420 2875528 2901122 2931926 2962586
58234 2962586 2996203 3037504 3082032 3124026 3167979 3220454 3277329 3331276 3385096 3445415 3510011
58223 3510011 3573868 3641171 3718661 3803483 3890024 3982153 4086153 4198290 4311901 4429594
58213 4429594 4555552 4683315 4804724 4923512 5046301 5167789 5279036 5382711 5485655
58204 5485655 5584614 5674691 5764045 5864217 5973286 6084194 6201649 6334441 6479228 6628941
58194 6628941 6789130 6968447 7161046 7356428 7558825 7778737 8013754 8256604 8513538
58185 8513538 8795050 9096860 9410061 9741222 10101891 10487720 10889869 11317625 11786644
58176 11786644 12293766 12826912 13390658 13997704 14644610 15321686 16037884 16810001 17636658
58167 17636658 18509604 19440599 20449320 21535228 22690103 23926346 25261806 26688944
58159 26688944 28192132 29783048 31484402 33292463 35193756 37205554 39360085 41662888
58151 41662888 44109802 46731018 49572993 52652840 55981207 59616020 63642329 68118134
58143 68118134 73100245 78706917 85092894 92385003 100715385 110294911 121368732 134118444
58135 134118444 148695792 165319646 184223937 205537559 229357405 255941215 285728555
58128 285728555 319259109 357186859 399912247 446142974 491158092 527050836 546008110
58121 546008110 544419071 524330806 491357959 451455472 409158103 367526720 328529018
58114 328529018 293182370 261724485 233973432 209607691 188238178 169456412 152936999
58107 152936999 138459710 125829159 114840814 105328832 97174779 90251009 84407769
58100 84407769 79527148 75540913 72381632 69958021 68193904 67057806 66541329 66646166
58092 66646166 67421152 68973690 71344911 74267732 77015532 78580534 78164922 75617685
58084 75617685 71432210 66342151 60934734 55571648 50493207 45859377 41717353 38026807
58076 38026807 34738656 31819382 29221004 26885263 24781382 22902624 21228270 19723358
58068 19723358 18371091 17170210 16102061 15132139 14242618 13433462 12693175 11997818 11338667
58059 11338667 10723659 10151440 9609404 9096666 8623649 8188418 7776868 7386519 7027345
58050 7027345 6698778 6387894 6090662 5813628 5554228 5300622 5052170 4820120 4606859
58041 4606859 4403633 4209555 4033705 3877063 3730710 3593307 3472489 3367419 3267234
58032 3267234 3168353 3076657 2991291 2903095 2810914 2723293 2642104 2559950 2475338 2394958 2319130
58021 2319130 2240265 2157883 2080446 2010262 1940894 1871549 1809709 1757158 1707110 1657418 1613217
58010 1613217 1574521 1534698 1493470 1458142 1429751 1401193 1371314 1347449 1331185 1314731 1294698
57999 1294698 1276717 1262962 1247500 1227921 1209799 1195553 1180042 1161148 1144042 1131026 1117350
57988 1117350 1100797 1085588 1073333 1059675 1043147 1028033 1015650 1002176 987669 977535 972287
57977 972287 965588 955323 947112 943964 942080 939856 941247 946730 950356 949502 948752 950713 951839 950751
57963 950751 951780 956624 961111 963940 970047 981409 992770 1000549 1008162 1018615 1029398 1038525 1048277
57950 1048277 1059350 1068448 1075004 1083070 1093439 1101305 1104879 1108696 1115201 1120775 1123512 1127028 1132629
57937 1132629 1135222 1131203 1123308 1113834 1100292 1081824 1062782 1045685 1027524 1007111 989047 976012
57925 976012 964048 950082 937334 928461 920045 909134 899098 893610 890563 887159 885482 887661 890685
57912 890685 891526 892749 897678 904234 908722 911867 916154 920702 923364 924715 925963 925976 923913 921498 919618
57897 919618 916306 911051 906973 905587 903669 898603 892466 887245 880458 869594 857020 846413 837783
57884 837783 829746 823244 819227 815803 811341 807553 806322 806338 805603 804197 801943 796736 787891 777854 768013
57869 768013 756239 740909 723739 706262 687509 667674 649923 635826 623095 610583 601145 596507
57857 596507 593662 589750 586387 585734 586379 586643 588024 591774 595971 599571 605300 614774 624727 632083 638830
57842 638830 647638 656507 662514 667533 675304 685570 695698 705670 717000 728851 739457 749371 759483
57829 759483 767851 772241 773718 774266 773183 769453 765156 762557 760026 754867 748252 743307 739999 735856
57815 735856 730265 724277 717453 708656 699139 691668 687337 685726 686853 690365 694227 696731 698511 700621
57801 700621 702570 704298 707557 712801 717156 718288 717866 718337 718878 717781 716366 716913 718751 719852 720393
57786 720393 721345 721564 719897 718434 719847 722915 724285 723530 722968 723506 723965 723687 722785 720611 716717 712385
57770 712385 708693 704290 697557 689458 681542 672686 660815 646481 631817 617166 601663 585975 571526
57757 571526 557943 543961 529864 516672 504193 492235 482159 474616 467330 458008 447967 440059
57745 440059 434549 429889 426022 423780 422474 421329 421997 426314 432717 438180 442763 448972 457624 467597
57731 467597 478814 491931 505448 516403 523899 529452 534311 538781 543298 547505 549268 547442 544694
57718 544694 544628 546941 548418 547788 546314 544224 540049 533445 525745 517811 509932 503380 499337 496705 493687
57703 493687 490947 490407 491659 492681 493555 496218 500879 506018 511786 520072 531050 542794 554396 566285
57689 566285 577296 584790 588292 590016 591312 591623 591511 593374 597990 603263 607744 612833 620071 628599
57675 628599 636853 644873 653496 662872 673049 684595 697468 710529 723245 736878 753125 772447
57663 772447 794181 817304 840620 863245 885458 908539 933713 961755 993114 1027296 1062547
57652 1062547 1097485 1132764 1169973 1209527 1251085 1295377 1343661 1395670 1450106 1507102 1568314
57641 1568314 1634533 1705133 1780142 1861028 1948999 2044227 2147273 2259892 2383780 2519613
57631 2519613 2667761 2829078 3004745 3196045 3404218 3629799 3872332 4131444 4407480
57622 4407480 4700006 5006224 5321845 5642336 5961561 6269869 6555436 6807208 7015412
57613 7015412 7170954 7267865 7307276 7297202 7247993 7169029 7068728 6953814 6826019 6679977
57603 6679977 6505747 6294645 6044937 5764446 5467881 5170001 4880415 4604475 4346969
57594 4346969 4112448 3902600 3715945 3550582 3405693 3280489 3173676 3084238 3011127 2952022
57584 2952022 2904084 2866210 2839143 2823251 2817677 2821732 2835520 2859065 2892325 2936250 2992352 3061096
57572 3061096 3142144 3236165 3344755 3468487 3606685 3759317 3927351 4110906 4308687 4519678
57562 4519678 4743729 4979662 5223944 5471526 5716525 5951278 6165918 6349641 6492021
57553 6492021 6583614 6617450 6591267 6507852 6372823 6192693 5974974 5728758 5464106 5190643
57543 5190643 4916186 4645789 4382246 4128193 3887310 3662595 3454147 3259984 3078678
57534 3078678 2909898 2753072 2607484 2473726 2353087 2244959 2146276 2054188 1968309 1889960
57524 1889960 1820028 1757751 1700813 1646710 1594730 1546371 1503033 1464011 1427886 1395016 1366899
57513 1366899 1343546 1323359 1305379 1289760 1276174 1263820 1253165 1245575 1240743 1236437 1231578 1227883
57501 1227883 1227706 1231630 1238856 1248485 1259634 1271579 1284718 1300472 1319639 1341683 1365959 1392572
57489 1392572 1421693 1453151 1487142 1524336 1564994 1609093 1657558 1712027 1773075 1840079 1913387
57478 1913387 1995152 2087244 2189573 2301289 2422450 2553607 2694797 2846142 3008760 3184132
57468 3184132 3372820 3574148 3786266 4005750 4227620 4446388 4656658 4852249 5025281
57459 5025281 5166794 5268398 5323854 5330507 5290167 5208202 5091021 4944183 4772599 4581645
57449 4581645 4377635 4167456 3957719 3753625 3558306 3373452 3200476 3040604 2894048
57440 2894048 2759938 2637273 2525650 2425121 2335874 2257924 2190604 2132615 2083159 2042626
57430 2042626 2011356 1988128 1970998 1959532 1955079 1958610 1969259 1985258 2005609 2030707 2062010 2101328
57418 2101328 2149872 2207783 2274774 2350906 2436414 2531410 2636554 2753401 2883024 3024674
57408 3024674 3176763 3338643 3510091 3689287 3872520 4055453 4233008 4397973 4541437
57399 4541437 4655263 4733149 4769458 4759084 4699891 4594702 4450340 4275263 4078113 3866983
57389 3866983 3648648 3428356 3210503 2999095 2797539 2608502 2433798 2273556 2125622
57380 2125622 1987069 1856862 1736225 1626065 1525069 1431069 1343447 1263171 1190703 1124732
57370 1124732 1063225 1005253 951415 902485 858043 816811 778161 742645 710892 682681 657352
57359 657352 634393 613175 592839 572974 553770 535084 516358 498047 481939 468924 457441
57348 457441 445386 432684 420581 409300 398149 387444 378419 371257 364767 358014 350868 343041 334163
57335 334163 324901 316504 309110 301895 294951 289353 285000 280116 273665 266981 262137 259765 259306 260412
57321 260412 262998 266356 269116 270115 269073 266649 263967 261832 260290 259099 258219 257465 256199 254221 252551
57306 252551 252309 253004 253046 252036 251441 252743 255733 258946 261074 261724 261472 261485 262679 265019 267752 270088
57290 270088 271430 271571 271392 272794 276958 282943 288883 294181 299470 304916 310177 316125 324902 337482
57276 337482 352255 366840 380528 394169 408385 422987 437905 453567 469903 485656 499454
57265 499454 511498 523488 536635 550361 563491 576126 589501 604332 620388 637533 656054
57254 656054 675780 695844 715482 734216 751406 766962 782433 799845 819195 838773 858364
57243 858364 880136 905405 932339 958227 982651 1007150 1033037 1060954 1091466 1124719 1160250
57232 1160250 1198091 1239075 1283224 1329177 1376284 1425955 1479779 1537709 1599378 1665618 1736944
57221 1736944 1811847 1888342 1966101 2045264 2124151 2199975 2270997 2336188 2393502 2440307 2475162
57210 2475162 2497792 2507950 2505803 2492924 2471597 2443600 2410692 2375439 2340463 2307548 2278339
57199 2278339 2254763 2237828 2227294 2223452 2227474 2238751 2253845 2269929 2287560 2308012 2329517 2348579
57187 2348579 2363777 2375953 2385630 2392801 2398770 2406008 2416428 2431392 2452858 2482794 2521832 2569588
57175 2569588 2625473 2687993 2754470 2822747 2892083 2961213 3027232 3088066 3144647 3199184 3252847
57164 3252847 3306563 3362091 3420248 3479762 3539837 3602235 3668988 3739824 3813825 3891749 3974512
57153 3974512 4061118 4150224 4242042 4336713 4432691 4528761 4625639 4723576 4820619 4915218 5008069
57142 5008069 5099142 5185729 5265961 5341342 5413116 5479406 5539237 5596163 5653954 5711416 5765417
57131 5765417 5816423 5866907 5916793 5964901 6012786 6062812 6114255 6165300 6216829 6270154 6323256
57120 6323256 6373633 6422769 6473323 6523787 6570143 6610520 6643877 6666780 6676885 6677790 6675480 6671638
57108 6671638 6665156 6657948 6653835 6653332 6654902 6659875 6670959 6687082 6704505 6721659 6738525 6753302 6764459
57095 6764459 6774091 6784568 6793977 6799311 6801297 6801113 6795348 6779376 6752844 6717151 6671578 6617445 6561736
57082 6561736 6510195 6460672 6409063 6356615 6304476 6246838 6178043 6101697 6024232 5944186 5856469
57071 5856469 5761573 5660664 5546791 5411793 5257428 5089222 4904346 4696584 4467853 4222801
57061 4222801 3957279 3664597 3347458 3010039 2643613 2234092 1778298 1278290 726097
57052 726097 110342 -568242 -1305107 -2109343 -2995156 -3963169 -5009676 -6146704 -7391698
57043 -7391698 -8745809 -10206112 -11790936 -13528262 -15429895 -17506111 -19794368 -22341344
57035 -22341344 -25172684 -28325339 -31902581 -36054208 -40913081 -46595195 -53230738 -60907653
57027 -60907653 -69579935 -79101520 -89327580 -100072085 -111015129 -121928842 -133171068
57020 -133171068 -145758398 -160587694 -177425998 -194702186 -210258866 -222234861 -229402120
57013 -229402120 -231123551 -227369163 -218786031 -206558845 -192069353 -176599621 -161177872
57006 -161177872 -146489160 -132842323 -120258985 -108637697 -97862229 -87829100 -78469185
56999 -78469185 -69774926 -61779601 -54502365 -47930544 -42041862 -36807384 -32171701 -28060269
56991 -28060269 -24411592 -21183076 -18329273 -15799339 -13556337 -11576961 -9830988 -8280275
56983 -8280275 -6897989 -5670077 -4577560 -3595322 -2708657 -1913926 -1202147 -557692 26721
56973 549569 1015778 1437963 1821765 2163840 2465135 2733118 2970396 3173942 3346302 3495611
56963 3495611 3624232 3729022 3812705 3883164 3941480 3982582 4008214 4027602 4044382 4054041 4055320
56952 4055320 4053235 4049182 4038231 4017906 3990129 3952803 3898526 3823573 3730552 3621604 3497283
56941 3497283 3363234 3230359 3107450 3000218 2916927 2866988 2852884 2867973 2898753 2921816
56931 2921816 2903854 2818642 2666964 2472579 2259471 2041087 1828128 1632401 1459236 1305824
56921 1305824 1170215 1053952 954159 862053 772395 687144 607735 531392 457340 389312 329195
56910 329195 274645 225051 183531 151177 125505 106211 96238 95737 101211 112065 131837 161517
56898 161517 197773 238908 286098 337122 384941 424218 453875 472682 478793 474896 467544 459889
56886 459889 450764 441388 436113 435299 434367 431757 431183 434221 437453 439297 443299 452004 463473 476317
56872 476317 492452 512403 533236 553076 572011 586613 589751 578595 557403 530327 497345 459699
56860 459699 422881 390594 361115 333044 309524 293191 281579 270994 260942 251847 242748 234239
56848 234239 229565 229757 231406 231790 232431 235235 239068 242522 246304 250722 254838 260083 270488 287154
56834 287154 306570 326495 349184 376719 407745 441285 479278 522611 568708 615484 663330
56823 663330 710615 751589 781711 801227 811169 810270 798625 780104 758035 732492 704547 678711
56811 678711 657839 639889 623280 611400 607942 611451 618523 629258 645559 666966 692228 722881
56799 722881 761446 807160 855496 899817 932031 945225 938760 918663 891154 858591 823109 789764
56787 789764 762706 741454 724167 711903 706885 709345 718835 736135 761496 793623 832426 879848
56775 879848 936196 999018 1067165 1141277 1217229 1283247 1327250 1344155 1334091 1298612 1242966
56764 1242966 1177710 1112513 1050134 989891 933991 886402 848267 818764 798359 787360 783439
56753 783439 784373 791355 806292 828152 855408 889585 932327 980600 1028041 1069046 1098572 1110941
56741 1110941 1103251 1078497 1042051 997094 946536 896273 851771 813042 777031 743433 714359
56730 714359 690159 669785 653950 643856 638043 634432 634362 640723 653087 668378 685334 704312 723128
56717 723128 736707 740812 733715 715415 688307 657538 627382 597914 567677 538080 511850 488710
56705 488710 466359 444885 426592 412102 400011 389903 382408 376652 370661 364023 357576 351180 344527
56692 344527 339348 337847 339345 340934 340830 338888 335011 329764 325484 324017 324153 323676 322634 322034 320951
56677 320951 318034 314509 312428 311099 308469 304932 302462 301025 299137 296958 295384 293146 288504 283132
56663 283132 280477 280542 279882 276663 272323 268206 263837 258768 253310 247253 240356 233898 229305 225735 221543
56648 221543 217459 215484 215372 215188 214714 215194 216258 216357 215859 216426 217429 216211 211965 206402 200562 193939
56632 193939 186829 180618 175499 170511 166060 163962 164870 167789 171881 176595 180566 182805 184478 187182
56618 187182 190216 192006 193199 195556 198755 201385 204072 208189 212164 212754 209809 206438 204693 204299 205190
56603 205190 207706 210376 211035 210386 211335 214882 219855 226484 236658 250627 266915 285668 308586 335421
56589 335421 364140 394998 430862 472892 519096 567521 617353 666277 710238 746872 776306
56578 776306 798162 810966 815089 813045 806093 793528 775786 755029 732127 706318 678536 651715
56566 651715 627013 602854 578461 555062 532985 511108 490128 472802 459664 447757 434955
56555 434955 422414 411567 401898 393145 386559 382361 378717 374695 371599 370087 368798 367140 366638 367998
56541 367998 369476 369615 369112 368647 367450 365470 364437 365299 366780 367760 368818 370352 371472 371874 372549 373719
56525 373719 374403 374687 375808 377295 376902 374319 372051 371689 372194 372846 374737 378065 381062 382970 385197 388300
56509 388300 390868 392567 395047 398459 400525 400711 401854 405659 409959 412635 415097 419412 424859 429754
56495 429754 434073 437936 440087 440351 441229 444742 449838 454897 460347 466741 472807 477603 482106 486459 488179
56480 488179 485566 480607 476119 472360 468636 465691 463816 460907 455212 448077 441520 435232 428520 422914
56466 422914 419893 417916 414620 410296 406461 402704 397924 393244 390696 389977 389070 387210 384923 382178 378692
56451 378692 375132 372003 368361 363457 358540 355316 353685 352455 350985 348853 345676 342658 342375 345478
56437 345478 349652 353278 357617 363550 369016 372256 375090 379956 385723 389485 390866 391672 392702 393775
56423 393775 395598 398838 402359 404789 406822 409862 413705 417720 422818 429769 436891 441863 444817 447583
56409 447583 451062 455320 460876 467822 474961 481686 489249 498398 507532 515137 522138 529717 536765 541739
56395 541739 545196 548214 550260 550876 551451 552910 553681 552467 550885 550788 551126 550231 549057 549278 550301 551121
56379 551121 552916 556576 559726 559590 556993 554319 551438 547053 542115 538304 534766 529777 523868 517932
56365 517932 510366 499886 489147 481439 475633 468651 461120 455880 452372 447526 441283 436322 432778 428054
56351 428054 421756 416381 412992 410328 408206 407868 408850 409207 408692 408278 407139 404003 400810 400721 402885 403649
56335 403649 402726 403449 406725 409623 410754 412357 415729 418745 419530 419109 419015 419201 419425 419884 419746 417849 415387
56318 415387 415088 417350 419943 421641 423221 425011 426639 429150 434000 440024 444839 448956 454767 461645
56304 461645 466363 468546 471278 475635 479095 480435 481936 485214 488850 491817 495651 501333 507136 511303
56290 511303 514161 516330 517615 518829 521974 527394 533103 537668 541327 544056 545557 547476 552351 559760
56276 559760 566722 572422 579150 588016 597286 605737 614208 622923 630783 638386 648396 661865 677144
56263 677144 693016 709603 725756 739383 751191 764358 779575 794122 806677 819019 831925
56252 831925 843565 853355 863325 874014 882892 888647 893352 898692 903656 907698 912436 918309 923057 925542
56238 925542 927856 931837 936641 941399 947120 954448 962712 972346 984850 999271 1012629 1025091 1040535
56225 1040535 1060507 1082025 1103176 1126294 1153271 1182257 1211825 1244318 1282058 1323883 1368252
56214 1368252 1416158 1468183 1522220 1577081 1635115 1698561 1766644 1839015 1918549 2007843 2106094
56203 2106094 2212262 2328105 2455274 2592611 2739249 2897365 3069178 3254115 3451287
56194 3451287 3661308 3882991 4111779 4344293 4581013 4821568 5060877 5293021 5515354
56185 5515354 5725466 5917516 6085242 6225807 6337552 6417153 6462509 6475822 6460890 6420238
56175 6420238 6357550 6279240 6190099 6090336 5979915 5862363 5741134 5615842 5485651 5352748
56165 5352748 5218704 5081024 4937302 4789540 4640390 4488494 4331642 4171204 4009289
56156 4009289 3845021 3678226 3513436 3355281 3202776 3053012 2907519 2769864 2639698
56147 2639698 2514831 2397120 2290640 2195291 2107308 2024985 1949276 1879849 1815089 1755161 1701013
56136 1701013 1651264 1603812 1559423 1520208 1485800 1454355 1425829 1400996 1378847 1358156 1339832
56125 1339832 1324738 1311318 1298424 1287918 1281274 1276359 1271083 1267297 1267374 1270043 1273701 1280642 1293385
56112 1293385 1309623 1325382 1340546 1356661 1372161 1384806 1396429 1410235 1425457 1439316 1451964
56101 1451964 1464745 1476001 1483521 1489020 1495474 1502245 1507438 1512557 1520109 1529202 1538236 1549019 1563369
56088 1563369 1578916 1593919 1612927 1641479 1678040 1717525 1760259 1810901 1870812 1938274 2014366
56077 2014366 2101890 2199975 2306139 2422301 2552532 2696219 2849273 3010032 3177422 3344997
56067 3344997 3503601 3649118 3782066 3901810 4007756 4104100 4195908 4281236 4353229 4408300
56057 4408300 4445926 4462903 4455848 4428280 4387807 4337182 4274917 4202810 4124665 4038285 3936869
56046 3936869 3818480 3687541 3547991 3402388 3256961 3119567 2992362 2873052 2762628
56037 2762628 2664882 2579435 2502682 2434724 2377873 2329318 2283130 2238722 2199566 2164672 2129548
56026 2129548 2094735 2065022 2040765 2018174 1997280 1981169 1968343 1954762 1942565 1937611 1939084 1940949
56014 1940949 1942888 1949891 1961532 1972054 1981204 1994544 2012587 2030025 2046399 2067053 2092528 2117460
56002 2117460 2141070 2168293 2199246 2228233 2254737 2284865 2320184 2355504 2389385 2426244 2466326
55991 2466326 2504213 2539218 2576799 2617992 2658144 2697595 2742475 2793161 2843317 2892130 2945870
55980 2945870 3005398 3064224 3121264 3183365 3252656 3323582 3394991 3472559 3556433 3639304 3719951
55969 3719951 3806011 3900197 3996680 4094239 4199637 4314462 4431992 4550608 4676834 4811861
55959 4811861 4949115 5088604 5239146 5402727 5571319 5742677 5923811 6115398 6309192
55950 6309192 6504966 6713217 6936645 7166508 7402054 7655236 7930492 8218500 8515949
55941 8515949 8832623 9172671 9528699 9901362 10304553 10743537 11208270 11695879 12218496
55932 12218496 12781098 13374137 13996918 14665246 15386694 16152070 16960985 17830903 18770581
55923 18770581 19770584 20830840 21969985 23195516 24493452 25860297 27315260 28867755
55915 28867755 30505517 32230216 34071230 36048233 38156223 40405118 42836135 45480846
55907 45480846 48346450 51463671 54906070 58740718 63010133 67790273 73215057 79417262
55899 79417262 86506354 94637375 104032137 114888775 127340376 141547018 157749718
55892 157749718 176195698 197129603 220933862 248152280 279275616 314592239 354132323
55885 354132323 397047211 440233286 477624212 501891172 508004730 495761192 469176222
55878 469176222 433760364 394274069 354132674 315661918 280264815 248516859 220458518
55871 220458518 195907010 174551362 155966849 139729316 125519348 113084964 102176635
55864 102176635 92578530 84145663 76751568 70238824 64460646 59325818 54761753 50673635
55856 50673635 46977820 43637772 40629519 37903101 35409667 33133993 31067046 29173803
55848 29173803 27417842 25791839 24295637 22908359 21608636 20399369 19286509 18253778
55840 18253778 17281983 16373296 15533640 14750075 14007545 13309965 12663565 12056503 11475291
55831 11475291 10925001 10413506 9931440 9466971 9025269 8614336 8225762 7848071 7485875
55822 7485875 7147954 6828968 6520237 6226271 5953518 5694331 5438897 5192180 4962813
55813 4962813 4745588 4530992 4322231 4127088 3942059 3759985 3585066 3425452 3278518
55804 3278518 3137326 3004159 2884424 2774597 2669118 2572029 2489246 2416472 2346894 2283744
55794 2283744 2233247 2192227 2154540 2122588 2100249 2080794 2053865 2018934 1981042 1939592 1892486
55783 1892486 1845210 1804308 1766967 1727592 1689192 1657850 1631431 1604183 1577232 1554194 1531593
55772 1531593 1503908 1473393 1445093 1417058 1385132 1352294 1323454 1295997 1265352 1234930 1210331
55761 1210331 1188225 1161300 1130416 1102139 1077911 1055027 1034495 1018503 1003675 986008 969010
55750 969010 958128 950972 941883 932239 926992 924842 921370 918376 920448 925277 926761 924981 923925 922241
55736 922241 915742 906617 900517 896277 887680 873981 859949 846860 831966 815714 801296 788012
55724 788012 772702 756659 743840 733662 722543 710807 701030 691774 680370 669727 664633 663160
55712 663160 659198 651574 643122 633083 618628 602155 588749 577711 564582 550157 539265 531874
55700 531874 523787 515265 510444 508485 503634 494105 483075 470860 454206 433942 415698 401931 390015
55687 390015 378824 370472 364959 359748 355322 354803 357397 358369 356022 352894 349960 345736 341227 339592
55673 339592 340632 341516 342746 347233 353615 357046 356766 356417 356700 354396 349094 344115 339975 333562 324759
55658 324759 317365 312249 305980 297580 290382 285703 280877 275351 272744 274734 278321 281174 284533 288959
55644 288959 292297 293908 296293 300637 304982 308297 312043 316487 319810 322062 325637 330744 334818 337294
55630 337294 340480 344764 347643 348535 349919 352664 354813 356078 358827 363406 367022 368548 370047 372519
55616 372519 374609 376458 379972 384025 384185 378849 371346 364781 359319 355631 355936 359726 363045 363981 364748
55601 364748 366801 368341 368455 369317 372193 375306 377603 380647 384779 387361 386956 385658 385301 384755 382825
55586 382825 380436 378111 374384 368328 360787 352020 341249 329296 318278 307971 296195 283340 272360
55573 272360 263538 253798 242367 232469 225858 220205 213719 207958 203925 199563 193371 186744 180708 174001
55559 174001 166392 160172 156464 153609 150879 149943 150923 151067 149336 148246 149077 149311 147107 144385 143057
55544 143057 142096 140825 141157 143790 145784 144767 142236 140147 137808 134908 133956 136434 139563 140070 138527
55529 138527 137249 136671 136555 137935 140947 143218 143025 141663 140394 137929 133446 129179 127200 126269 124669
55514 124669 123486 124184 125444 125462 125168 126203 127817 128651 129698 132681 137140 141655 146243 151128 154807
55499 154807 155754 154684 153203 151796 150773 151232 153198 154688 154385 153375 152743 151665 149404 146842 144441
55484 144441 141335 138106 137543 140478 143691 144349 143982 145581 149186 152976 156507 160281 163926 167109 170533
55469 170533 174201 176679 177726 179199 181633 182681 181049 179171 179573 181180 181611 180507 178098 173266 165763
55454 165763 157853 150960 143177 132859 122087 113469 105932 96944 86836 77661 69622 61812 54870
55441 54870 49938 46506 43938 43291 44912 46190 44742 42082 41187 42025 42492 42181 42167 42306 41594 40085 38177
55424 38177 35419 32137 30360 30832 31209 29719 28332 29541 32339 34470 36369 39448 42559 43880 44558
55409 44558 46808 49781 50959 50355 49869 49720 48958 48310 49028 49958 49223 47880 48495 50961 52936 53579 53754
55392 53754 53484 52387 51558 51876 51625 49118 46368 46416 48112 47635 44538 42238 42766 44918 47540 50788
55376 50788 53838 54897 54026 53011 52275 50928 49864 51524 56159 61248 64907 67152 67690 65607 61780
55361 61780 58831 57924 57813 57328 56563 55514 53932 52682 52964 54026 53920 52460 51305 51284 52088 54381 59497
55344 59497 66699 73122 76857 78276 78346 77672 77082 77148 77178 76340 75264 74679 73482 70518 67359 66566 67858
55327 67858 68754 68365 67610 66292 63267 59378 56943 56158 55013 52927 51482 51257 50872 49691 48746 48556
55311 48556 48540 48891 50446 52463 53167 52687 52787 53433 52598 49881 47385 46260 45178 43095 40952 39713
55295 39713 39022 38668 39266 40765 42232 43518 45113 46280 45672 43891 42838 42424 40785 38057 36728 37486
55279 37486 37888 36306 34201 33104 32161 30493 29489 30716 33301 35215 35868 36071 36702 38339 40929 43016
55263 43016 42802 40626 38873 38792 39118 38466 37325 36914 37698 39686 42567 44897 44943 43048 41561 41877 43208
55246 43208 44679 46621 49009 50648 50922 50802 51212 51860 52395 53206 54326 54900 54388 53086 51228 48948
55230 48948 47180 46940 47618 47857 48097 50092 53672 56364 56781 56113 55596 54820 53505 52723 53127 53714 53511
55213 53511 53029 53171 54019 55239 56395 56601 55364 53763 53114 52711 51078 49226 49804 52863 55417 55739
55197 55739 55053 54214 52083 48535 45998 46087 47310 47923 48621 50473 52539 53551 53975 54395 53852 51771 49760
55180 49760 49489 50388 51267 52498 54560 56128 55866 54883 55218 56936 58617 59717 60573 61054 61061 61494 63011
55163 63011 64654 65419 66212 68377 70968 71494 69134 65582 62777 61192 60389 60077 60374 61481 63053 63861
55147 63861 62782 60388 58579 58259 58400 57863 56949 56534 56851 57816 59425 61099 61831 61772 62487 64715 66995
55130 66995 67364 65558 62867 60812 60550 62359 64902 66031 65081 63459 62513 61938 60862 59306 57943 57396
55114 57396 58195 60347 62659 63710 63642 63670 63853 63135 61714 61328 62752 64838 66411 67037 65765 61726 56689
55097 56689 54265 55383 57054 56821 55832 55991 56786 56980 57061 57692 57681 55881 53554 52640 53087 53937 55583 58698
55079 58698 62215 64590 66097 67778 69108 68855 67479 66624 66723 66952 67207 68447 71285 75448 80315 85079
55063 85079 88965 92041 94999 97531 98118 96206 93224 90565 88081 85557 83978 84016 84752 85240 85908 87221
55047 87221 88583 89776 91670 94144 95270 94155 92642 92435 92631 92145 92384 94912 98207 99519 98614 97179
55031 97179 95910 94906 95571 99071 103684 106602 107802 109351 111520 112465 111597 110370 109554 108275 106164
55016 106164 104344 103818 104545 106238 108500 110236 110588 110392 111218 113132 114856 115749 116041 115585 114115 112436
55000 112436 111631 111308 110260 108628 107825 108498 110088 112102 114350 116166 116813 116455 115576 113945 111318 108377
54984 108377 105687 102678 99225 97124 98113 101230 104055 105769 107047 107851 107671 107331 108189 109844 110771 110835
54968 110835 111004 110995 109620 107269 105717 105534 105981 107337 110679 115036 117380 116293 113667 112004 111719 111794
54952 111794 111471 110614 109631 109552 111098 113582 115738 117434 119169 120343 119860 118311 117608 118288 118932 118497 117521
54935 117521 116752 116287 116340 117308 118666 119258 118950 118714 118970 119223 119364 119810 120300 120117 119629 120074 121607 123056
54917 123056 123830 124580 125804 127317 129274 132194 135611 138081 138984 139297 140377 142887 146802 151445 155808
54902 155808 159906 165299 172910 181030 187139 191063 194547 198449 202639 208136 216533 227074 236855 244629
54888 244629 252264 261849 273355 285828 298994 312823 326911 340769 353359 362274 365157 362216
54876 362216 355642 346540 334519 320393 306744 294917 283701 271899 260198 249484 239269 228995
54864 228995 219184 210127 200966 191273 182154 174814 169406 166156 166088 169338 173992 177809 180228 181883 183324
54849 183324 185135 188207 192934 198934 206258 215851 228187 242561 258333 275651 294082 311613 325956
54836 325956 336139 342276 344688 343808 339978 332776 321408 306273 289295 272371 256417 241955 229279
54823 229279 217663 205807 193706 182948 174703 168561 163715 159902 156755 153668 150900 149432 149035
54810 149035 147835 144597 140212 136185 132867 129882 127139 124512 121585 118507 116202 115185 115006 115249 115897
54795 115897 116366 115577 113661 112234 112197 112411 111333 108888 105950 103172 101136 100591 101604 103196 104500 105547
54779 105547 106462 106816 106403 105869 106077 107439 109909 112747 114322 113377 110604 107858 105916 104391 103615 104654
54763 104654 107175 109220 109651 109160 108568 108026 108293 110577 114331 117331 118890 120958 124900 129329 132500
54748 132500 134892 137788 141159 144776 149883 157666 167052 175850 183370 190483 197822 205401 213475 222611
54734 222611 233206 245592 259901 275386 290876 306361 322838 340184 356689 371196 383705
54723 383705 393039 396266 392244 383869 374865 365723 354684 341396 327476 314310 302371 292226 284429
54710 284429 278521 273412 268556 264019 260069 257432 257001 258522 260727 263482 268323 275845 284266 292037
54696 292037 300243 310766 323566 337602 352997 370165 388015 405169 421949 438941 454581 466642
54684 466642 475452 482998 489113 491042 487049 478220 466333 451831 434520 414642 392744 369697 347291
54671 347291 327643 311437 297464 284107 270730 257767 246224 236899 229433 222398 214995 208155
54659 208155 203229 200132 197702 195279 192950 190706 188411 186172 183952 181353 178577 176889 177200 178838
54645 178838 180573 182007 183051 183098 181983 180807 180477 180350 179611 178980 179448 180284 180178 179585 180006 181438 182487
54628 182487 182676 182769 182984 182818 182622 183509 185423 186904 187068 186590 186604 187850 190880 195759 201350 206038 209328
54611 209328 211897 214410 217310 221425 227359 234424 241375 248048 255105 262497 269516 276070 282504 288439
54597 288439 293333 298019 304025 311338 318487 325040 332359 341508 351873 362379 372810 383316 393678
54584 393678 403691 413639 424013 435249 447557 460224 471386 479458 484560 487435 487264 482074 471381
54571 471381 457065 441359 425172 408631 391933 375131 358132 341473 326355 313483 302422
54560 302422 292295 282551 273095 264434 257733 253956 252758 252738 252706 252203 251183 250075 249970 251834 255442
54545 255442 259508 262603 263560 261775 258104 254807 253451 253259 252543 251100 249915 249040 247329 244102 239715
54530 239715 234576 228828 222852 216897 210515 203524 197069 192340 188714 184706 180320 176665 173553 169596
54516 169596 164804 161017 159309 158760 158265 157887 157818 157663 157434 157760 158356 157654 154797 150966 148055 147000 147778
54499 147778 149822 151951 153085 153666 155323 158650 162432 165567 168437 171681 174784 176776 177398 176884 175537
54484 175537 174237 174460 176934 180879 185146 189462 194127 199318 205260 212292 220148 227948 235369 243052
54470 243052 251215 258734 264328 268012 270536 271882 271219 268177 263475 258180 252624 246153 238010 228529
54456 228529 219202 211323 204989 199814 195860 192958 189772 184983 179238 174474 171340 168738 166132 164669
54442 164669 165329 167317 169095 169924 169607 167867 165103 162911 162584 163388 163331 161562 159227 157969 158267 159422
54426 159422 160693 161966 163252 164023 163692 162845 163220 165881 169948 173819 177158 180740 184640 187694 188951
54411 188951 188906 188954 189931 191202 191137 188907 185929 184787 186316 188750 190298 191248 192487 193455 193311 192974 193825
54394 193825 195006 194322 191653 189147 187888 186528 183789 180385 177716 176169 175387 174929 174131 172552 170991
54379 170991 170873 172308 173914 174697 174757 174144 172565 170528 169124 168398 167564 167040 168326 171280 173526 173457 172054
54362 172054 170808 169671 168371 168095 170217 174293 178728 182713 186450 190086 193262 195222 195032 192660 190081
54347 190081 189944 192565 195663 197712 199881 203668 208363 212417 216050 220743 226938 233791 240651 247397
54333 247397 253685 259168 264208 269344 274108 277158 277580 275666 272783 270778 270853 272409 273387 272103 268428
54318 268428 263177 257222 251426 246420 241986 237350 232315 227322 222404 217251 212401 208949 206742 204318
54304 204318 201159 198592 197789 198345 199510 201354 203846 206179 207972 209766 211453 211710 210244 209200 210841
54289 210841 214765 218654 220942 221778 222375 224402 228851 234397 238063 238712 238683 240751 244791 248958 252717
54274 252717 256660 260291 262352 263168 264624 267549 270514 271459 269491 265112 259621 254353 249781 245396 240747
54259 240747 235962 230889 224685 217158 209624 203331 197808 191830 185352 179346 174319 170088 166565 163657
54245 163657 160811 157624 154515 152062 150186 148593 147253 145734 143102 139429 136302 134667 133326 131063
54231 131063 129209 130128 133588 136519 136498 134083 131680 131238 133083 135909 137730 137514 135893 133970 132012
54216 132012 129909 127989 126398 124311 121013 117433 115562 116450 119369 122587 124465 124519 124017 124895 127534
54201 127534 130562 133236 136512 140794 144223 144778 142883 140381 138037 135824 134638 135617 138185 140566 141942
54186 141942 142657 142810 142244 141470 141036 140433 139136 138148 138804 140612 142033 142951 144482 146681 148355 148892 148414
54169 148414 146401 142403 138169 136747 138879 142058 143680 143459 142317 140755 139208 138469 138624 138562 137421
54154 137421 135815 134968 135175 135520 134764 132466 129625 127995 128190 128913 128771 128090 127866 127791 126934 125845 126076
54137 126076 127709 129162 129609 129925 131000 132654 134517 136426 137599 136867 134328 131504 129441 127856 126534
54122 126534 126203 127370 129314 130849 131301 130516 128771 126985 126037 125626 124695 123144 122158 122684 124453 126581
54106 126581 128167 128369 127032 125348 124732 125006 124794 123623 122281 121161 119922 119059 120035 123065 126223 127743
54090 127743 128129 129056 130996 132871 133548 132966 132035 131769 132323 132885 132834 132615 132826 132986 132235 130898 130119 130170
54072 130170 130418 130799 131777 132830 132585 130848 129031 128056 127048 124647 120602 115787 111634 109822 111258
54057 111258 114888 118492 120975 122944 124897 126014 125139 122064 117571 113058 110102 109431 110324 111817 114073
54042 114073 117411 120668 122307 122838 124127 126447 128311 129210 130227 131590 132032 131282 130853 131417 131613 130601
54026 130601 129634 129844 130430 130479 130606 131243 131145 129485 127748 127517 127711 126187 123084 120497 119566 119932 121550
54009 121550 124891 129295 132808 134044 133296 131875 131156 131996 134218 136792 139040 141148 143124 144151 143850
53994 143850 143181 143212 143864 144904 147230 151877 158391 165434 172382 179212 185518 191003 196370 202296 207879
53979 207879 211479 212967 213957 216025 219704 224969 231495 238568 245773 253674 262859 272576 281405 289040
53965 289040 296200 302909 308211 311857 315203 319965 326745 334905 343089 349761 354143 357077 360275 364247
53951 364247 367451 368003 365931 363234 361726 361243 360197 357650 354309 351212 348019 343371 336907 330083 324672
53936 324672 320996 317943 314256 309518 304288 299525 295642 292085 288229 284535 282193 281639 282141 282744 282794
53921 282794 281645 278986 275626 272830 270604 267800 264191 261086 259385 258368 257159 256085 255701 255738 256080
53906 256080 257612 260659 263454 263665 261098 257716 255255 253935 253298 253221 253927 255584 257950 260218 261548
53891 261548 261903 261967 262143 262374 262986 264693 267479 270625 274171 278973 284748 289653 292825 295983 301312 308914
53875 308914 317465 326041 333894 339691 342839 344759 347141 349588 350634 350453 350723 352158 353974 355668 357675
53860 357675 360221 362993 366028 369626 373477 377172 381568 388242 397397 407436 416738 424848 432010 438755
53846 438755 446071 454765 464392 473776 482664 491909 501848 511522 519692 525690 529062 529298 526451 521553
53832 521553 516206 511901 509331 507754 505420 501372 496488 492023 487685 482147 474924 466367 456233 443911
53818 443911 430209 417379 406803 397754 388835 379609 370418 361599 353499 346507 340520 334927 329405
53805 329405 324147 318961 312868 305139 296402 288325 282190 277827 273766 268541 262087 255764 250914 247784
53791 247784 245947 244960 244002 241717 237422 232001 226661 221412 215932 211363 209691 211242 214088 216172 217000
53776 217000 217117 216982 216745 216314 215379 213916 212637 212229 212304 211999 211465 211696 212887 214113 214896 215903 217638
53759 217638 219420 220402 220983 222566 226085 231032 235790 238900 240294 241210 242755 244861 246934 248842 250796
53744 250796 253017 256283 261817 269381 276362 280421 282591 285939 291451 297276 302155 307305 314062 321616
53730 321616 328469 334899 342553 352220 362905 372681 379967 384671 388553 393604 399639 404437 406704 407678
53716 407678 408957 410000 409108 406142 402782 400339 398538 396527 394104 391663 389519 387495 384889 380905
53702 380905 375460 369536 364423 360612 357573 354511 351120 347614 344142 340355 335838 331086 327506 325874
53688 325874 325121 323429 320360 317076 314426 311792 308130 303345 298182 293357 289194 285693 282596 279730
53674 279730 277334 275564 273737 270907 267439 265114 265157 266906 268962 270987 273530 276514 278791 279291 278087
53659 278087 276230 274884 274827 276562 280505 286613 293840 300645 306577 312921 321114 330790 340138 347960 354452
53644 354452 360087 364886 369099 373644 379288 385838 392433 398195 402645 406173 410154 415699 422137 427683
53630 427683 431882 436296 442300 449357 456332 463430 471487 479877 486579 490630 493566 497974 505024 513633
53616 513633 521757 528096 532553 535386 536618 536601 536580 537805 540158 542503 544469 546892 550165 553134 554473
53601 554473 554504 554804 556220 558002 558789 557960 556024 554082 552860 552051 550723 548485 545956 543862 542043 539743
53585 539743 536681 533447 530907 529518 529129 529227 529444 529958 531205 533018 534292 533846 531670 529097 527708 528181
53569 528181 530131 532835 535946 539578 543956 549091 554593 559658 563470 566065 568603 572242 576769 581012
53555 581012 584674 588923 594804 601962 609513 617401 626023 635153 644278 653755 664644 677421 691519
53542 691519 705976 719880 732427 743334 753187 762925 773202 784683 798348 814569 832176 849286
53530 849286 864874 878980 891947 904415 917500 931675 945732 957961 968233 977874 987790 997829
53518 997829 1007681 1017055 1025196 1031609 1037193 1043266 1049655 1055174 1059734 1064201 1068271 1070669 1071774 1073718
53504 1073718 1077056 1079449 1078902 1076444 1074088 1071818 1068462 1064357 1061159 1059455 1058253 1056585 1054297 1051441
53490 1051441 1048073 1044613 1041494 1038524 1035313 1032273 1030567 1031094 1033857 1038025 1042262 1045383 1047037 1047660
53476 1047660 1047836 1048325 1050494 1055475 1062533 1069536 1075668 1082621 1092383 1105014 1119524 1135717 1153745
53463 1153745 1172611 1190701 1207679 1224724 1243082 1263348 1285929 1311112 1338588 1367738 1398436
53452 1398436 1431015 1465556 1501855 1539954 1580060 1621963 1665174 1709647 1755844 1803951 1853473
53441 1853473 1903937 1955788 2010246 2067990 2128113 2188914 2249962 2312720 2378545 2446784 2515742
53430 2515742 2584849 2654426 2723894 2792090 2859500 2928155 2998722 3069424 3138684 3207234 3276654
53419 3276654 3347304 3418801 3491082 3563693 3635380 3705761 3776155 3847058 3915835 3978832 4035239
53408 4035239 4087272 4137090 4185142 4231124 4274677 4315034 4351513 4384740 4416400 4447651 4478414
53397 4478414 4507963 4535260 4558964 4578107 4592504 4601732 4604315 4599095 4587006 4570117 4549170 4523400
53385 4523400 4492596 4457808 4419740 4377767 4330997 4279449 4223960 4165861 4106724 4047332 3986573
53374 3986573 3922423 3854483 3784750 3715474 3647076 3578750 3510498 3443789 3380326 3320624 3263907
53363 3263907 3209279 3156828 3107386 3061400 3018689 2979507 2945034 2916230 2892827 2874172 2860558
53352 2860558 2852928 2851689 2856674 2867869 2885267 2908184 2935588 2967087 3003006 3043728 3089561 3140812
53340 3140812 3197171 3257370 3320344 3386475 3456836 3531472 3609500 3690800 3776560 3867957 3964966
53329 3964966 4066510 4171360 4279184 4391453 4510916 4639235 4775274 4916474 5061526
53320 5061526 5210681 5364009 5520888 5681213 5845423 6012751 6180716 6347170 6511974
53311 6511974 6675896 6838663 6999025 7156191 7310017 7459643 7602848 7737414 7862990
53302 7862990 7981064 8092970 8198426 8296354 8386463 8468961 8543034 8607029 8660460 8704314 8738553
53291 8738553 8760572 8767313 8757990 8733568 8694364 8639483 8567962 8479090 8372141 8247441 8107705
53280 8107705 7957095 7798955 7635260 7467692 7297735 7125905 6952283 6777936 6604694
53271 6604694 6433693 6265289 6100020 5938156 5778440 5619058 5460172 5304001 5152136
53262 5152136 5004363 4860575 4722169 4590605 4465893 4347554 4236144 4132802 4037891 3950875
53252 3950875 3871015 3797514 3729447 3666242 3608070 3555432 3508522 3467086 3430566 3398426 3370693
53241 3370693 3347839 3329568 3314188 3300155 3287921 3279137 3274346 3272936 3275182 3282326 3294004 3307427
53229 3307427 3320438 3334314 3352392 3376745 3407293 3443342 3484510 3530232 3579566 3632002 3687967
53218 3687967 3748236 3812914 3881087 3951509 4023553 4097125 4171456 4244759 4315914 4386010 4456908
53207 4456908 4528279 4597345 4661932 4722665 4781559 4839321 4894753 4946156 4992629 5034359 5072102
53196 5072102 5106069 5134990 5156498 5168681 5171143 5164802 5151060 5130761 5103106 5065756 5016978 4957739
53184 4957739 4890830 4818056 4739397 4654868 4565707 4473229 4377848 4279998 4181038 4082386 3984498
53173 3984498 3887441 3791768 3698127 3606474 3516282 3427062 3338267 3249297 3160154 3071631 2984348
53162 2984348 2898066 2812356 2727439 2643854 2561673 2480681 2401283 2324989 2253782 2188583 2128021
53151 2128021 2069341 2011257 1955366 1903722 1855577 1808061 1759930 1712878 1668847 1627675 1587925
53140 1587925 1548508 1508713 1468189 1427964 1390276 1356235 1324493 1293103 1261614 1230478 1199607
53129 1199607 1168863 1139047 1110868 1083465 1055397 1026840 999516 974429 950601 926136 899973
53118 899973 872746 846437 822833 801875 781903 761904 742766 725644 709923 693900 677034
53107 677034 660522 645855 633692 623839 615384 606847 597024 585864 574216 562919 552463 543176
53095 543176 535093 527855 521164 515031 509187 502725 494990 486552 478804 472804 468894 466923 466196 465491 463799
53080 463799 461114 458255 456100 454998 454373 452759 449046 444077 440310 439351 440480 441984 443001 443381 442694
53065 442694 440546 437484 434722 433326 434191 438031 444462 451684 458119 463979 470331 477173 483462 488618
53051 488618 492787 495852 497345 497355 496569 495293 493234 490269 486769 483138 479495 475608 470701 463829 455172
53036 455172 446429 439040 432483 425311 417356 409646 402551 395550 388816 383415 379501 375703 371000 366015
53022 366015 361657 357476 352418 346661 341702 338724 337537 336990 335835 333263 329276 324814 321203 319110
53008 319110 317934 316408 313897 311021 308897 307855 307224 306303 305131 304208 303960 304584 305979 307536 308534 309039
52992 309039 309825 311072 311778 311132 309816 309016 308480 306701 303071 299000 296428 295738 295485 293991 290944 287436
52976 287436 284609 282530 280583 278584 276787 274918 272171 268553 265332 263574 262957 262638 262467 262501 262078 260562
52960 260562 258494 256818 255218 252490 248504 244590 241771 239745 238065 237315 238297 240520 242288 242344 241087
52945 241087 240063 240357 241658 242959 243869 244598 244827 243662 241331 239913 241266 244620 247359 248050 247687 247917
52929 247917 249097 250400 251034 250889 250496 250731 252266 255096 258827 263341 268808 274979 280977 286075 290460
52914 290460 295048 300584 306878 312991 318378 323834 330895 340058 350025 358930 365884 371003 374558 376731
52900 376731 377913 378607 379176 379856 380634 380859 379682 377346 375303 374290 373042 369833 364717 359272 354621
52885 354621 350884 348095 346254 344524 341699 337740 333796 330556 327683 325084 323517 323324 323487 322741 321074
52870 321074 319499 318652 318118 317024 315048 313009 312437 314135 317121 319421 319999 319435 318696 317935 316844 315621
52854 315621 314873 314767 314844 314854 315388 317298 320445 323456 325019 325117 324482 323230 321012 318586 317972 320322 324498
52837 324498 328518 331667 334236 335988 336277 335529 335261 336347 338111 339375 339719 339476 339022 338448 337698 336837
52821 336837 336161 335945 336272 337513 340722 346487 353193 357725 358653 357750 357538 358456 359434 359944 359871 358376 354943
52804 354943 351133 349398 350204 351976 353776 356278 360000 364364 368808 373208 376875 378847 379658 381260 384589
52789 384589 388728 393021 398249 404835 411558 417301 422644 428331 433493 437082 440172 444936 451598 457999
52775 457999 462162 463923 463954 462482 459506 455348 450407 444806 438671 432300 425629 417892 408441 398038
52761 398038 388909 382986 380095 378210 375521 371825 367821 363860 360055 356956 355022 353534 350979 346653
52747 346653 341231 335733 330685 326380 323126 320784 318534 315432 311125 306166 301930 299786 299618 299536 297807
52732 297807 294886 292621 291689 290925 289110 286184 282607 278841 275813 274585 274874 274911 273471 271264 269704
52717 269704 269116 268898 268651 268264 267326 265408 262828 260480 258847 257494 255605 252876 249895 247530 245878
52702 245878 244128 241758 239345 237571 235935 233390 229974 226801 224461 222427 220028 217032 213361 209256
52688 209256 205729 203716 202645 200882 197698 193772 189815 185987 182695 180517 179015 177069 174772 173564
52674 173564 174073 175318 176447 177586 178273 176986 173439 169763 167975 167592 167155 166804 167595 169248 170440 170852
52658 170852 171298 172099 172766 173054 173032 172294 170450 168353 167563 168413 169609 170065 170278 171570 174527 178594 182840
52641 182840 186811 190595 194252 197570 200641 204181 208610 213176 217000 220583 224914 229182 231162 230321
52627 230321 228750 228201 227832 226006 222709 218844 214548 209906 206225 204654 204195 202818 200235 197983 196915
52612 196915 196005 193533 188508 181246 173564 167915 165197 163794 161795 159477 158382 158605 158606 157370 155265
52597 155265 153013 151173 150396 150749 150996 149989 148497 148071 148337 147345 144783 142884 143388 145242 146207 145552
52581 145552 144231 143352 143398 144251 145185 145268 144393 143577 143783 144674 144906 143648 141781 141524 144354 148994 152124
52564 152124 151759 149376 147970 148742 150695 152655 154128 154617 153960 153415 154743 157853 160749 162132 162652 163221
52548 163221 163653 163569 163322 163202 162888 162436 162731 164168 165954 167445 169053 170870 171690 170829 170033 171869 176401
52531 176401 180949 183303 183972 184932 187114 189751 191655 192474 192843 193730 195696 198554 201510 203710 205030
52516 205030 206511 209700 215149 221671 227418 231448 233877 235019 235372 236243 239045 243465 247302 248887 249039
52501 249039 249824 251949 254292 255819 256914 258484 260446 261754 261716 260747 259686 258759 257564 255950 254523
52486 254523 254284 256025 259855 264735 268524 269398 267623 265312 264031 263349 262159 260403 258658 256952 255285
52471 255285 254606 255745 257628 258231 257427 257443 259980 264077 267358 268499 267905 266837 266448 267079 268030 268382 268151
52454 268151 268072 268333 268385 268036 267723 267567 267252 267120 268145 270277 271987 272169 271453 270892 270440 269700 269221 269854
52436 269854 271482 273486 275916 279071 282414 285050 286896 288215 288331 286244 282503 279167 277668 277713 278558
52421 278558 280242 283094 286927 291273 295704 299481 301675 302267 302463 303225 304030 303851 302853 302150 302126 302122 301848
52404 301848 302049 303319 305089 306383 306951 306995 306411 305206 304312 304854 306474 307376 306382 304202 302189 300527
52388 300527 298434 295686 293130 291655 291265 291305 291156 290536 289368 287637 285425 282979 280631 278635 277184
52373 277184 276589 276957 277521 276954 275139 274071 275770 279388 281749 281028 278565 276628 275826 275566 275576 275674 275175
52356 275175 274022 273552 274559 275529 274608 272666 272277 273924 275605 276456 278255 282314 286955 289682 290617 292226
52340 292226 296329 302595 309378 314860 317750 318071 317294 317080 317920 319375 321184 323445 325944 327967 328934
52325 328934 328937 328812 329865 333225 339000 346159 353397 359947 365420 369359 371563 372741 374224 376648 379165
52310 379165 380436 380557 381453 384741 389500 393230 395145 397299 401771 407917 413570 417941 421798 425438 428330
52295 428330 430680 433565 437333 441366 445659 451029 457376 463389 468588 474101 480559 486690 491057 493899
52281 493899 496225 498376 500709 504541 510755 518148 524586 529389 533452 537525 541667 545926 550250 553891
52267 553891 556135 557550 559506 562554 566355 570978 577041 584444 592162 599684 607754 617198 627728 638395
52253 638395 648777 659348 670975 684245 698972 714150 728646 742154 755413 769549 785292
52242 785292 802633 820991 839852 859461 880709 904065 928923 954298 979867 1005906 1032473
52231 1032473 1059242 1086070 1113245 1141060 1169443 1198037 1226427 1254290 1281491 1308055 1334078
52220 1334078 1359825 1385767 1412062 1437966 1462288 1484649 1505797 1526427 1546207 1564261 1580165
52209 1580165 1594108 1606509 1617762 1627896 1636243 1642035 1645699 1648849 1652568 1656346 1659200 1660968 1661720
52196 1661720 1660703 1657065 1651292 1644935 1639098 1634096 1630257 1627981 1627054 1626856 1627401 1629437 1633535 1639758 1648065
52181 1648065 1658226 1669471 1681236 1694265 1709940 1728238 1747315 1765544 1783163 1801594 1821907
52170 1821907 1844429 1868826 1893742 1916992 1937180 1954987 1972108 1989025 2004519 2017440 2028148
52159 2028148 2037780 2046587 2053554 2057632 2058873 2058267 2056755 2054642 2051727 2047614 2041785 2033766 2023463 2011229
52145 2011229 1997415 1982023 1965098 1947356 1930066 1914105 1899321 1885056 1871226 1858590 1847752
52134 1847752 1838221 1828930 1819651 1811366 1804958 1800075 1795691 1791339 1787250 1783642 1780591 1778259 1776383 1773794
52120 1773794 1769484 1764231 1760060 1757831 1756316 1754020 1750874 1747519 1743907 1739594 1734811 1730394 1726876 1724181
52106 1724181 1721846 1719015 1714700 1708710 1702086 1696030 1690641 1685022 1678251 1669918 1660378 1650972 1643429 1638313
52092 1638313 1634401 1630102 1625014 1619573 1613863 1607602 1600757 1593315 1584867 1575288 1565432 1556232 1547421 1538145
52078 1538145 1528586 1519940 1512873 1506930 1501415 1495829 1489398 1481267 1471604 1461818 1453306 1446375 1440445 1434816
52064 1434816 1429075 1423271 1417823 1412991 1408576 1404523 1401482 1400083 1399805 1399368 1398317 1397562 1398302 1400996 1405423
52049 1405423 1411085 1417402 1424011 1431047 1438839 1447485 1457269 1469259 1484656 1503433 1524213 1545711 1567864
52036 1567864 1591518 1617457 1645815 1676050 1707450 1739872 1773666 1808563 1843233 1876615 1909132
52025 1909132 1941678 1973943 2004968 2034991 2065231 2095770 2125147 2152444 2178334 2203393 2226640
52014 2226640 2246617 2263025 2276472 2287467 2296497 2304233 2310547 2313934 2313083 2308783 2303265 2297803 2291889
52001 2291889 2284567 2275450 2264320 2250983 2236213 2222038 2210208 2200685 2192372 2185038 2179502 2175783 2172207
51988 2172207 2167312 2162006 2158691 2158348 2159688 2161398 2163900 2168198 2174132 2180979 2188996 2199022 2210826 2223142
51974 2223142 2235201 2247022 2258223 2267881 2275858 2283107 2290195 2296542 2301599 2305825 2309814 2313158 2314819
51961 2314819 2314135 2311060 2306013 2299832 2293162 2285462 2275293 2262054 2246623 2229745 2210673 2188231 2162589
51948 2162589 2135061 2106680 2077799 2048574 2018813 1987632 1954215 1918791 1882196 1844876 1807162
51937 1807162 1770028 1734211 1698711 1661548 1622341 1582945 1545032 1508154 1470871 1432804 1394705
51926 1394705 1357255 1320824 1285896 1252619 1220091 1187120 1153907 1122102 1092936 1065837 1039171
51915 1039171 1011925 984432 957811 932953 909837 887760 866389 846399 828545 812271 796062
51904 796062 779300 762924 747870 733801 720067 707031 695370 684629 673867 663612 655771 651172
51892 651172 648186 644341 638604 631648 624554 617828 611336 604638 597456 589974 582518 575065 567523 560304
51878 560304 553974 548348 542801 537473 533188 529858 526044 520683 514415 508594 503785 499837 496542 493346
51864 493346 489143 483389 477060 471748 468166 466148 465424 465489 465233 463714 461137 458339 455722 453425 451976
51849 451976 451812 452408 452760 452465 451576 449909 447496 445295 444335 444325 444090 443162 441989 440859 439727 438913 438799
51832 438799 438834 437964 436091 434078 432315 430365 428159 426480 425908 426013 425751 424105 420591 415975 412265 410921
51816 410921 411260 411572 411477 411970 413459 415318 417235 419354 421000 421061 420083 420327 423165 427876 433486 440035
51800 440035 447175 453301 457384 460292 463058 465114 465663 465628 466446 467639 467412 465464 463637 463635 465289 467291
51784 467291 468721 469467 469807 469858 469344 467999 466373 465844 467412 470824 475170 479861 484566 488725 491912 494431
51768 494431 496961 499642 501950 503431 504253 505055 506317 507768 508570 508423 508272 509294 511287 512945 513717 514330
51752 514330 515226 515638 514802 513084 511236 509443 507950 507709 509266 511477 512356 511084 508485 505842 503925
51737 503925 502976 502841 502949 502562 501150 498633 495618 493400 493154 494911 497806 501284 505198 508784 510823
51722 510823 511348 512024 514023 516557 518350 519505 520739 521674 521354 519988 518760 517977 516690 514295 511571
51707 511571 509828 509721 511134 513685 517062 520995 525025 528426 530667 531895 532378 531536 528467 523752 519607
51692 519607 517444 516178 513844 510164 506460 503596 501278 499196 497706 497128 497115 497103 497060 497664 499597 502358
51676 502358 503913 502298 497814 492873 489456 487614 486663 486486 486772 486245 483942 480599 477688 475677 474219
51661 474219 473291 472918 472319 470595 467999 465492 463390 461329 459176 456992 454500 451556 448732 446682 445427
51646 445427 444993 445863 447747 448888 447993 446119 445187 445381 445673 446182 448026 451108 454126 456789 460172 464708
51630 464708 469629 474682 480666 487825 495345 502924 511392 521199 531718 542559 554251 567075 580392
51617 580392 593468 605498 614369 617159 612952 604042 593479 582419 570561 557863 544688 531150
51605 531150 517539 504830 493934 484832 477024 470247 464228 458456 452747 447453 442724 438316 434464
51592 434464 431953 430742 429489 427089 423821 420305 416353 411659 406731 402204 397996 394078 391335 390680
51578 390680 391872 394044 396729 399517 401428 401788 401242 400914 400963 400916 400848 401117 401380 401095 400703 401103 402146 402951
51560 402951 403674 405595 409143 412939 415267 415720 415066 414343 414478 416146 419444 424000 429437 435188 439962
51545 439962 442424 442925 443766 447157 453373 461318 470217 479939 490212 500519 510718 520956 530923 540010
51531 540010 548425 557428 567911 579173 589557 597919 603957 607496 608416 607434 606052 605128 603913 601151
51517 601151 596925 592805 590253 589515 590211 592296 595842 600200 604095 606849 609210 612736 618470 626387 635894
51502 635894 646358 657080 667251 676363 684459 691598 697400 701637 704991 708429 711753 713588 713168 711553
51488 711553 710755 712105 715546 719613 721785 719922 714335 707821 702897 699480 695954 691589 686659 680871
51474 680871 673395 664551 655997 648828 642598 636578 630871 625658 620320 614229 607932 602727 599140 596321
51460 596321 592835 587881 581893 576207 572101 570027 569630 570092 570259 568964 565927 562199 559120 557047 555643
51445 555643 555066 555855 557632 558817 557976 554997 550871 546949 544315 543086 542230 540712 538919 538235 539278
51430 539278 541358 543641 545936 548266 550684 553697 557807 562451 566564 570565 576407 584928 594384 602664
51416 602664 609922 617715 626333 634497 641553 648544 656791 666230 675503 683147 688569 692305 695585 699382
51402 699382 703683 707690 710632 712320 713119 713489 713369 711985 708544 703151 696677 689711 682125 673753 664944
51387 664944 656112 647174 637724 627480 616430 604942 593866 584048 575542 567722 560169 552872 545565
51374 545565 537862 530494 525436 523985 525242 527227 529037 531154 533961 536957 539564 542026 545164 549426
51360 549426 554313 558656 561392 562065 560656 557302 552404 546640 540284 532820 523873 514369 505810 498342
51346 498342 490481 481031 470459 460102 450800 442637 435227 427926 420532 414069 409827 407165 403406 396703
51332 396703 388070 379685 372196 364900 357811 351997 347978 345051 342285 339315 336099 332755 329723 327342
51318 327342 325127 322122 318093 313808 309974 306486 303015 299872 297717 296451 294933 292293 289448 288567
51304 288567 290561 293566 294770 293444 291234 289647 288663 288070 288688 291239 294945 298340 300937 303344 306242
51289 306242 310010 314779 319992 324400 327360 329834 333419 338797 345761 354094 363347 372190 379222 384433
51275 384433 389020 393773 398379 402201 404895 406246 406137 404813 402660 399730 395963 391699 387402 383012
51261 383012 378188 373052 367966 362616 356063 348043 339653 332402 326736 321742 316320 310442 304951 299975
51247 299975 294187 286539 278468 272990 271144 270577 268404 264420 260541 258178 257493 258446 260837 263461 264713
51232 264713 264334 263592 263559 264044 264296 263971 263352 263231 264509 267230 270122 271800 272250 272391 272424 271648 269961 268448
51214 268448 268164 269001 270027 270482 270346 270247 270729 271251 270415 267768 264912 263900 264810 265824 265453 263662 261015
51197 261015 258006 255319 253560 252401 250936 249177 248206 248461 248761 247566 244577 240806 237713 236474 237277
51182 237277 238849 239337 238221 236993 237609 240518 244347 247076 247424 245684 243489 242375 242395 242440 241856 241159
51166 241159 241090 241597 242073 242214 242474 243850 247127 251991 257001 260822 263177 264226 263660 261398 258796 257880
51150 257880 259143 261067 262058 261961 261573 261646 262744 265179 268549 271916 274789 277449 280199 282974 285781 288718
51134 288718 291376 293089 294074 295497 297948 300627 302510 303639 304743 306090 307247 307660 307154 306125 305191
51119 305191 304276 302325 298760 294898 292633 291700 289838 286111 282464 281036 281316 281204 279872 278134 276718
51104 276718 275618 274822 274374 273932 273356 273493 275152 277494 278736 278598 278764 280499 282939 284317 284011 282677
51088 282677 281051 279513 278400 277786 276923 274740 271202 267721 265812 265557 265644 264706 262398 259440 257059 256250
51072 256250 256979 257980 257811 256327 254638 253490 252380 250698 249002 248287 248420 248237 247099 245532 244395
51057 244395 244157 245004 246828 248912 250242 250304 249205 247198 244803 243183 243459 245413 247662 249239 250257
51042 250257 250994 251339 251521 252363 254234 256458 258300 259942 262041 264876 268328 272051 275284 277248 278295
51027 278295 279983 283315 287476 290927 293268 295319 297789 300578 303171 305131 306437 307694 309709 312469
51013 312469 315028 316853 318687 321390 324488 326811 328365 330557 334458 339571 344585 348720 351947 354186
50999 354186 354809 353198 349768 346164 344094 343940 344710 345201 344818 343450 341301 338951 336920 334932 332274
50984 332274 329033 326163 323979 321554 318281 315166 313685 313928 314847 315862 317234 319155 321395 323791 326188
50969 326188 328089 329213 330344 332639 335959 338783 340012 340055 339872 339934 340671 343038 347562 353144 357824 360838
50953 360838 363153 365771 368299 369824 370667 372356 375804 380314 384756 389168 394668 402151 411591 422349
50939 422349 433438 443670 452331 459954 467873 476799 486378 496261 506913 518906 531957 545381 559237
50926 559237 574352 591009 608201 624746 641149 659717 682246 707901 734271 760604 788800
50915 788800 820563 854831 889420 924540 962894 1006400 1054567 1106450 1162448 1223280 1288556
50904 1288556 1357643 1431112 1510165 1594964 1684376 1777033 1871942 1968466 2066361 2165554 2265244
50893 2265244 2363350 2457247 2544867 2625078 2697691 2763507 2823529 2877329 2922606 2956987 2980017
50882 2980017 2993082 2998047 2996518 2989778 2978607 2963528 2945838 2927927 2911778 2897375 2883123 2867464
50870 2867464 2849485 2828478 2803794 2774990 2741452 2702146 2656410 2604707 2547888 2485901 2417948
50859 2417948 2343829 2264564 2181847 2097419 2012816 1929020 1846415 1765557 1687896 1615183 1548165
50848 1548165 1486266 1428463 1374206 1323817 1278457 1239344 1206346 1177444 1150244 1124065 1100180
50837 1100180 1079994 1063395 1048953 1035473 1023280 1013885 1008218 1005338 1003313 1001218 999664 999418 1000529
50824 1000529 1002995 1007158 1012862 1019164 1025692 1033423 1043364 1055313 1068836 1084548 1103161 1123803 1144607
50811 1144607 1164755 1184912 1205950 1228366 1252824 1280123 1310449 1343509 1379437 1418848 1462086
50800 1462086 1509214 1560733 1617580 1680258 1748475 1821684 1899730 1983281 2073954 2173651 2283399
50789 2283399 2403351 2534166 2677343 2833421 3000788 3177373 3362763 3557520 3761154
50780 3761154 3972039 4188619 4409060 4630063 4847595 5058611 5260635 5449825 5621108
50771 5621108 5770495 5896092 5996987 6072666 6123764 6152144 6160042 6150202 6126579 6093418 6053690
50760 6053690 6009956 5966507 5928362 5897463 5871608 5847733 5824476 5800743 5773758 5739996 5696795
50749 5696795 5641863 5572461 5486551 5384031 5265858 5132893 4986645 4830059 4666158 4496652
50739 4496652 4323239 4149644 3980897 3820757 3670935 3532566 3407253 3296555 3201460 3122521
50729 3122521 3059988 3013797 2983760 2969551 2970120 2983663 3008729 3045050 3092741 3150965 3217653 3289878
50717 3289878 3364037 3436503 3504862 3567973 3624133 3669991 3702231 3719796 3723546 3714670 3694773 3666700
50705 3666700 3633053 3593491 3545029 3485613 3416266 3339394 3256541 3168824 3078460 2988340 2900263
50694 2900263 2814527 2731238 2651261 2575980 2506859 2445412 2392903 2349629 2314766 2287239 2266643
50683 2266643 2253235 2247354 2249178 2258755 2275764 2299353 2328942 2365435 2411003 2467171 2533540 2608928
50671 2608928 2693187 2786966 2889997 3000845 3118603 3243701 3376340 3514829 3656194 3797900
50661 3797900 3938258 4075478 4207178 4330752 4443654 4543339 4627436 4694099 4741955 4769950
50651 4769950 4777746 4766322 4737956 4695809 4643827 4586499 4527657 4469301 4412265 4358264 4310429
50640 4310429 4271173 4240022 4214293 4191572 4170708 4150598 4129277 4104650 4075183 4038994 3993128
50629 3993128 3935191 3865885 3788924 3708255 3626121 3544082 3464634 3390791 3324518 3266582 3217851
50618 3217851 3180001 3154892 3143843 3147688 3167194 3203193 3256299 3326464 3412917 3514999 3633174
50607 3633174 3768770 3922462 4093324 4279323 4477922 4685766 4898447 5111039 5318334
50598 5318334 5514436 5693494 5851836 5988529 6102926 6192942 6257162 6297543 6317887 6319996
50588 6319996 6303379 6268632 6218779 6156605 6082525 5996077 5898241 5791492 5678799 5563496 5449037
50577 5449037 5337939 5231557 5131440 5039998 4959250 4889765 4831489 4784642 4749073 4723471 4705877
50566 4705877 4694270 4686120 4678438 4669233 4658409 4646671 4634172 4620680 4606094 4590067 4572033 4552454
50554 4552454 4533377 4517095 4505098 4498814 4499942 4508664 4522525 4538565 4556026 4575526 4596167 4615067
50542 4615067 4629709 4639290 4643576 4641511 4631276 4610973 4579154 4535278 4479565 4411962 4331602 4238087
50530 4238087 4133001 4019378 3899966 3776708 3651365 3525574 3400563 3277883 3160065
50521 3160065 3049307 2945747 2848311 2757149 2673734 2598452 2529857 2467092 2411669 2365771 2329674
50510 2329674 2301869 2281050 2266891 2259240 2257619 2261732 2271861 2288537 2312096 2342533 2379566 2422896
50498 2422896 2472592 2529248 2593566 2665811 2745713 2832935 2927587 3030318 3141751 3261754 3389511
50487 3389511 3524484 3667000 3817413 3974834 4137172 4302354 4468687 4633530 4792146
50478 4792146 4938959 5070452 5186686 5289704 5380769 5459752 5527151 5585677 5638953 5688975
50468 5688975 5735596 5778264 5817289 5853457 5887526 5920402 5952950 5985461 6018434 6054298 6096904
50457 6096904 6148236 6206635 6269287 6335320 6404872 6475958 6544332 6606372 6660276 6704174 6734883
50446 6734883 6749437 6746642 6726234 6687394 6629047 6551152 6455083 6343313 6219438 6088071 5953884
50435 5953884 5820741 5692023 5571378 5462458 5367885 5288938 5226312 5180839 5153046 5141877
50425 5141877 5143927 5154294 5168593 5184041 5198363 5207856 5207138 5190872 5155311 5098141 5017738 4913427
50413 4913427 4786438 4640096 4478905 4307539 4130551 3952383 3776865 3606355 3441686
50404 3441686 3283431 3133267 2993609 2865671 2748361 2639652 2538966 2447755 2367646 2298308
50394 2298308 2237412 2182688 2133843 2092270 2058883 2032735 2012162 1996771 1987378 1984085 1985627 1991086
50382 1991086 2001156 2016762 2037099 2060048 2084313 2110349 2139496 2173009 2211629 2255045 2301722
50371 2301722 2350071 2400006 2452778 2509251 2568931 2630699 2693725 2757555 2822015 2887422 2954324
50360 2954324 3022516 3090571 3156672 3219880 3280487 3339301 3396643 3451971 3504510 3554371 3602923
50349 3602923 3651876 3702056 3753129 3804193 3854391 3903306 3951274 3999132 4047239 4094720 4139838
50338 4139838 4180965 4217084 4247728 4272717 4291566 4302920 4304932 4296492 4277589 4248254 4207894 4156035
50326 4156035 4092782 4017927 3930727 3831857 3724854 3614255 3502723 3391281 3281841 3177718
50316 3177718 3081538 2994137 2915759 2846948 2787999 2739017 2701085 2675951 2663688 2661567 2665906 2674098
50304 2674098 2684205 2693678 2699595 2699553 2691471 2673242 2643753 2603960 2556027 2501473 2440904 2375360
50292 2375360 2306973 2238021 2169805 2102718 2036984 1973039 1911335 1852170 1795993 1743728 1696364
50281 1696364 1653964 1615466 1579835 1547173 1518226 1493217 1471898 1454500 1441736 1433659 1429242 1427264
50269 1427264 1427170 1429100 1433624 1441333 1451986 1464243 1477153 1491826 1510459 1533552 1559208 1585478
50257 1585478 1612136 1639713 1668271 1698127 1730619 1766689 1805183 1843817 1881585 1919248 1957615
50246 1957615 1996333 2034497 2071636 2107798 2143011 2176802 2208188 2236276 2260910 2282431 2300797
50235 2300797 2315473 2326195 2332948 2334852 2330073 2317816 2299857 2279219 2257610 2234874 2210355 2183730
50223 2183730 2154629 2122557 2087572 2050465 2012124 1973137 1934090 1895729 1858540 1822323 1786242
50212 1786242 1749294 1711118 1672654 1635756 1601757 1570551 1541274 1513406 1486817 1461265 1436688
50201 1436688 1413828 1393846 1377243 1363638 1352497 1343545 1336488 1330914 1326570 1323427 1321490 1320878 1321968
50188 1321968 1325003 1329672 1335333 1341427 1347185 1351429 1353493 1354191 1354876 1355434 1354254 1350558 1345731 1341520 1337617
50173 1337617 1332074 1324006 1314922 1307134 1301447 1296799 1291743 1285780 1279239 1272473 1265604 1258901 1252889 1247797
50159 1247797 1243258 1238873 1234814 1231409 1228412 1225417 1223095 1223179 1226627 1232271 1237988 1243012 1248457 1255558
50145 1255558 1264063 1272510 1279442 1283982 1285805 1285355 1283987 1283242 1283658 1284462 1284409 1282643 1278901 1273479 1267257
50130 1267257 1261288 1255996 1250955 1245666 1240214 1234859 1229256 1222630 1214733 1206292 1198353 1191255 1184263 1176245
50116 1176245 1166806 1156650 1146598 1136462 1125528 1114268 1104816 1099242 1097711 1098550 1099584 1099191 1097057
50103 1097057 1094697 1094515 1097350 1101439 1104672 1107019 1109364 1110664 1108507 1102660 1095908 1090391 1084851 1076955
50089 1076955 1067114 1058171 1051745 1046664 1041217 1035608 1031461 1029638 1029427 1029817 1030990 1034104 1039620 1046376
50075 1046376 1052677 1058001 1062990 1068005 1072658 1077001 1082246 1089632 1099062 1109436 1119971 1130609 1141380
50062 1141380 1152055 1162536 1173191 1184586 1196850 1209317 1220966 1231339 1240866 1250053 1258854 1267374
50050 1267374 1276727 1288087 1300875 1312928 1322791 1331115 1339722 1350271 1363976 1381329 1401375 1422165
50038 1422165 1442567 1462913 1483560 1504220 1525590 1550227 1580188 1614546 1650731 1687842 1727125
50027 1727125 1769646 1815205 1863765 1916397 1974301 2037887 2107232 2182645 2264453 2353084 2449672
50016 2449672 2555897 2673015 2801656 2942538 3096400 3263106 3441980 3633468 3839147
50007 3839147 4058996 4289292 4524107 4758226 4987444 5206455 5408224 5586368 5737821
49998 5737821 5863120 5965021 6047496 6115315 6173151 6224346 6270447 6311514 6345934 6369509 6375402
49987 6375402 6355975 6305244 6220034 6099822 5946519 5764305 5558745 5335694 5101379 4863230
49977 4863230 4629191 4405241 4193810 3994969 3808655 3635192 3474400 3325449 3187901
49968 3187901 3062146 2948574 2846745 2755533 2673600 2599357 2530859 2466541 2406357 2351898 2304777
49957 2304777 2264757 2229748 2197844 2168995 2144410 2124646 2108781 2095137 2082154 2068825 2055328
49946 2055328 2043423 2035348 2031730 2030933 2030702 2030000 2029116 2028731 2029257 2030539 2031780 2032200 2032024 2032350 2033836 2036251
49930 2036251 2039520 2044217 2050392 2056872 2062813 2069420 2079070 2092887 2110043 2129231 2149964 2172418 2196882
49917 2196882 2223812 2254060 2288651 2328286 2372899 2421749 2474197 2530479 2591460 2657734 2729535
49906 2729535 2807568 2893069 2986753 3088521 3198682 3318750 3450591 3595494 3754717 3930186
49896 3930186 4123855 4336871 4569982 4824214 5100446 5398618 5717481 6054019 6402390
49887 6402390 6754238 7100808 7434193 7746602 8030875 8283937 8508882 8711780 8896854
49878 8896854 9066018 9221599 9366391 9500436 9619514 9716941 9785108 9815293 9798596 9729001
49868 9729001 9605220 9429691 9207299 8945414 8653134 8338756 8008243 7666413 7318542
49859 7318542 6970042 6625441 6288237 5960992 5644996 5340790 5049721 4774348 4516798
49850 4516798 4277478 4055835 3851394 3663386 3490288 3330708 3184212 3050545 2928599
49841 2928599 2816836 2714250 2620222 2533864 2454065 2379770 2309699 2242418 2177304 2114867 2055450
49830 2055450 1998281 1942624 1889223 1839470 1793400 1749652 1707378 1667142 1629681 1594728 1561618
49819 1561618 1530459 1502098 1477167 1455600 1437049 1421295 1407976 1396167 1384735 1373514 1363894
49808 1363894 1357693 1355202 1354683 1354135 1353348 1353971 1357608 1364216 1372468 1381478 1391811 1404672 1420391 1438088
49794 1438088 1456725 1475995 1496142 1517588 1541114 1567784 1598040 1631268 1666976 1706099 1750448
49783 1750448 1801103 1858020 1921033 1990551 2067424 2152916 2248690 2356001 2474934 2605250 2748022
49772 2748022 2905517 3079295 3269166 3474079 3692968 3924027 4163578 4405873 4643564
49763 4643564 4868345 5072219 5249214 5396383 5513797 5604414 5673814 5728790 5775175 5816657
49753 5816657 5854965 5889836 5918197 5933857 5928461 5893019 5819625 5703627 5545186 5348632 5120456
49742 5120456 4868449 4601984 4331059 4063811 3805242 3558377 3325714 3109282 2910380
49733 2910380 2729766 2567288 2421026 2287960 2166171 2055669 1956667 1868063 1788182 1715910
49723 1715910 1650397 1590635 1536205 1487496 1444194 1404431 1366555 1331030 1299410 1271877 1246882
49712 1246882 1222906 1199566 1177162 1156067 1136475 1118087 1100203 1082657 1066247 1051644 1038393
49701 1038393 1025700 1013654 1002783 992904 983550 975174 968620 963363 957559 950367 943346 938837 937316
49688 937316 936836 934993 931221 927076 924375 923280 922531 921323 920198 919903 920225 920577 921088 922305 924132 925804
49672 925804 926841 927553 928652 930556 932868 934455 934605 934234 935091 937367 939054 938362 935856 933321 931512
49657 931512 930254 930004 931595 934539 937023 937779 936876 934701 931486 928153 926295 926633 928269 930056 932020
49642 932020 934880 938641 942318 944857 946031 946663 948178 951671 957159 963777 970592 977007 982575 987003
49628 987003 990496 993695 997069 1000560 1003831 1006594 1008698 1010228 1011507 1012721 1013515 1013350 1012301 1011236 1011020
49613 1011020 1011705 1012615 1013194 1013648 1014567 1015843 1016426 1015733 1015080 1016774 1021502 1027426 1032255 1035358 1037299 1038308
49597 1038308 1038472 1038880 1041135 1045471 1050174 1053184 1053772 1052742 1051546 1051261 1051915 1052752 1053356 1054247 1056050 1058518
49581 1058518 1060969 1063301 1065884 1068799 1071923 1075407 1079194 1082400 1084207 1085218 1086857 1089525 1092476 1095540
49567 1095540 1099537 1104557 1109190 1112366 1115092 1119325 1125695 1133167 1140618 1147882 1155382 1163464 1172190 1181319
49553 1181319 1190470 1199590 1209185 1219671 1230603 1241004 1250621 1260468 1271889 1285304 1300214 1316283
49541 1316283 1333939 1353657 1375065 1397262 1420034 1444359 1471527 1501890 1534355 1566893 1597878
49530 1597878 1627601 1658481 1693013 1731208 1770673 1809507 1848446 1889652 1934195 1981509 2030849
49519 2030849 2082214 2135800 2191312 2248198 2306346 2366388 2429253 2495189 2563292 2632542 2703354
49508 2703354 2777402 2855561 2936801 3019581 3103524 3188995 3275690 3362581 3448867 3534126 3617799
49497 3617799 3699312 3778525 3855510 3930134 4002295 4071946 4138164 4198766 4251762 4296833 4334750
49486 4334750 4365995 4390820 4409814 4423072 4429305 4427303 4418183 4404893 4389517 4372241 4352871 4332039
49474 4332039 4310727 4289714 4269691 4250953 4232997 4215528 4199824 4187918 4180397 4176209 4174745 4176767
49462 4176767 4183031 4193418 4207888 4227174 4251939 4282078 4316892 4354904 4393631 4431263 4468984
49451 4468984 4509904 4554954 4601363 4645953 4688173 4728527 4765581 4796463 4819560 4835019 4842965
49440 4842965 4842726 4833714 4815869 4789178 4753663 4709748 4657903 4598063 4530155 4455014 4374105 4288483
49428 4288483 4198584 4104878 4008200 3909650 3810683 3712870 3616896 3522050 3427410 3333362 3241445
49417 3241445 3152921 3068083 2986777 2908930 2834494 2763285 2695029 2629559 2567223 2509056 2455817
49406 2455817 2406566 2358923 2311444 2265146 2222034 2182698 2146182 2111689 2079281 2049024 2020583
49395 2020583 1993938 1969638 1947985 1928526 1910725 1894682 1880825 1869062 1858604 1848542 1838453
49384 1838453 1828408 1818594 1809180 1800627 1793800 1789280 1786603 1784701 1783135 1782400 1782910 1784300 1786076 1788455
49370 1788455 1792121 1797539 1804780 1813641 1823522 1833664 1843962 1855316 1868842 1884987 1903588 1924388
49358 1924388 1947234 1972319 2000490 2032417 2066651 2099091 2125603 2145346 2161019 2175963 2191636
49347 2191636 2207821 2224322 2241854 2261520 2283890 2308718 2335392 2363421 2392382 2421796 2451552
49336 2451552 2482220 2514238 2546802 2578374 2608598 2638922 2670860 2704304 2738057 2771298 2803869
49325 2803869 2835672 2866688 2897322 2928075 2958951 2989728 3020495 3051478 3082627 3113972 3146086
49314 3146086 3179600 3214492 3250412 3287415 3325722 3364988 3404596 3444610 3485788 3528690 3573417
49303 3573417 3620192 3669451 3721090 3774154 3827648 3881445 3936254 3992931 4052057 4114004 4179054
49292 4179054 4247115 4317383 4388736 4460960 4535285 4613101 4694216 4777188 4861460 4948318 5039443
49281 5039443 5135372 5235867 5340944 5450702 5564612 5681700 5801171 5922520 6045679 6171422
49271 6171422 6300871 6433888 6568624 6703390 6838144 6973276 7107757 7239740 7368409
49262 7368409 7493770 7614948 7730189 7838608 7940561 8035928 8123068 8199886 8265175 8318732
49252 8318732 8361012 8392956 8415486 8428860 8432879 8427731 8414156 8393144 8366210 8335568 8302873 8267919
49240 8267919 8229948 8190319 8152386 8118200 8086631 8055715 8025780 7999253 7978103 7962610 7952294
49229 7952294 7946842 7946001 7949352 7956635 7968173 7984760 8006936 8034150 8064737 8097122 8131021 8167031
49217 8167031 8205112 8244179 8283300 8322344 8360855 8396881 8427631 8451082 8466528 8473854 8472846 8463124
49205 8463124 8444219 8415601 8376676 8326922 8266159 8194990 8114847 8027258 7933054 7832650 7726951
49194 7726951 7617366 7504893 7389959 7273345 7156568 7040951 6926962 6814884 6705544
49185 6705544 6599826 6497980 6400012 6306250 6216792 6130756 6046824 5964481 5884104 5806091 5730606
49174 5730606 5658094 5589218 5524028 5461727 5401381 5342339 5283891 5225283 5166651 5109530 5055728
49163 5055728 5005655 4958176 4912174 4867937 4826794 4789614 4755953 4724724 4695529 4669119 4646512
49152 4646512 4627762 4611672 4596697 4582154 4568648 4557361 4548856 4542495 4537065 4531946 4527579 4524750
49140 4524750 4523705 4524192 4526280 4530715 4538236 4548677 4561040 4574357 4588347 4603306 4619836 4638846
49128 4638846 4661420 4688083 4718155 4750187 4783114 4816738 4851060 4885544 4919365 4952283 4985048
49117 4985048 5018870 5054458 5091399 5128525 5165030 5201192 5237705 5274483 5310669 5345945 5381207
49106 5381207 5417592 5455273 5493685 5532566 5572130 5612334 5652602 5692442 5732080 5772354 5814142
49095 5814142 5857881 5903510 5950833 5999827 6050423 6102193 6154750 6208474 6264054 6321068 6377802
49084 6377802 6433216 6488444 6545447 6604568 6664429 6723959 6783319 6842584 6900679 6956204 7008669
49073 7008669 7058301 7105327 7150161 7194057 7238631 7284485 7330548 7374950 7416412 7454781 7490498
49062 7490498 7523826 7554665 7582919 7608743 7632390 7654008 7673683 7691422 7707055 7720485 7732201
49051 7732201 7743102 7753471 7762526 7769418 7774336 7778146 7781399 7784439 7788139 7793472 7800296 7807454 7814299
49038 7814299 7821250 7828621 7835990 7843478 7852762 7865640 7881912 7899816 7918514 7938994 7962099 7986762
49026 7986762 8011118 8034762 8058821 8083848 8108728 8132021 8153569 8174173 8194401 8214473 8234745
49015 8234745 8255167 8274319 8290045 8301449 8309717 8316830 8323981 8331158 8337237 8340293 8338852 8333442 8326203
49002 8326203 8318500 8309723 8298873 8286194 8272320 8256684 8237997 8215868 8190971 8164096 8135976 8107496
48990 8107496 8078908 8049135 8016994 7982808 7947683 7911610 7873867 7835284 7798522 7765485 7735535
48979 7735535 7706704 7677742 7648541 7619453 7590871 7563073 7536255 7510989 7488343 7468607 7450242
$$ [...]
##END NTUPLES=NMR SPECTRUM
##END=
