
##TITLE=AC1076_TOSA01_5835558_o7BCo1VUUa
##JCAMPDX= 6.0         $$ Bruker NMR JCAMP-DX V2.0
##DATA TYPE= NMR SPECTRUM
##DATA CLASS= NTUPLES
##ORIGIN= BRUKER
##OWNER= Administrator
$$ 1.72 TOPSPIN		Version 2.1
$$ 2012-04-10 10:32:42.500 -0500  Administrator@TOPSPIN
$$ Compression mode = diff/dup
##.OBSERVE FREQUENCY= 400.13188235
##.OBSERVE NUCLEUS= ^1H
##.ACQUISITION MODE= SIMULTANEOUS (DQD)
##.ACQUISITION SCHEME= undefined
##.AVERAGES= 64
##.DIGITISER RES= 22
##SPECTROMETER/DATA SYSTEM= spect
##.PULSE SEQUENCE= noesygpps1d.comp
##.SOLVENT NAME= COFFEE_meoh
##.SHIFT REFERENCE= INTERNAL, COFFEE_meoh, 1, 14.96864
##AUDIT TRAIL= $$ (NUMBER, WHEN, WHO, WHERE, PROCESS, VERSION, WHAT)
$$ ##TITLE= Audit trail, TOPSPIN		Version 2.1
$$ ##JCAMPDX= 5.01
$$ ##ORIGIN= Bruker BioSpin GmbH
$$ ##OWNER= Administrator
$$ $$ C:\Bruker\TOPSPIN/data/COFFEE/nmr/AC1076_TOSA01_5835558_o7BCo1VUUa/12/pdata/1/auditp.txt
$$ ##AUDIT TRAIL=  $$ (NUMBER, WHEN, WHO, WHERE, PROCESS, VERSION, WHAT)
(   1,<2012-03-27 23:39:27.171 -0500>,<Administrator>,<TOPSPIN>,<go>,<TOPSPIN 2.1>,
      <created by zg
	started at 2012-03-27 23:27:55.203 -0500,
	POWCHK enabled, PULCHK disabled,
       configuration hash MD5:
       1A 1E CE 29 27 FD 77 03 67 4E F0 E3 C4 B2 CB 90
       data hash MD5: 64K
       56 4C A8 50 8D 80 23 1D A3 09 C4 5D 7C 64 4B 62>)
(   2,<2012-03-27 23:39:32.515 -0500>,<Administrator>,<TOPSPIN>,<proc1d>,<TOPSPIN 2.1>,
      <Start of raw data processing
       efp LB = 0.3 FT_mod = 6 PKNL = 1 PHC0 = 0 PHC1 = 0 SI = 128K 
       data hash MD5: 128K
       6B 77 05 87 0F D7 6B 12 D5 40 BC 90 36 85 5E E9>)
(   3,<2012-03-27 23:39:34.015 -0500>,<Administrator>,<TOPSPIN>,<proc1d>,<TOPSPIN 2.1>,
      <pk PHC0 = 36.73828 PHC1 = 0 
       data hash MD5: 128K
       A8 86 D8 FD 3E 7E A3 94 3F 99 43 05 06 43 08 EC>)
(   4,<2012-03-27 23:39:34.890 -0500>,<Administrator>,<TOPSPIN>,<proc1d>,<TOPSPIN 2.1>,
      <abs ABSG = 1 
       data hash MD5: 128K
       90 BD FE F7 EA 19 92 7A A2 78 BB 5B 4E D0 ED EA>)
(   5,<2012-03-27 23:39:35.031 -0500>,<Administrator>,<TOPSPIN>,<proc1d>,<TOPSPIN 2.1>,
      <abs ABSG = 2 
       data hash MD5: 128K
       33 79 19 4B 5C 81 05 7D 25 8E 7E 9A 05 4A 60 85>)
(   6,<2012-03-27 23:39:35.140 -0500>,<Administrator>,<TOPSPIN>,<proc1d>,<TOPSPIN 2.1>,
      <abs ABSG = 3 
       data hash MD5: 128K
       2C 80 04 F6 60 CF 17 6A BA D0 CA 61 06 31 05 5B>)
(   7,<2012-03-27 23:39:35.187 -0500>,<Administrator>,<TOPSPIN>,<proc1d>,<TOPSPIN 2.1>,
      <abs ABSG = 4 
       data hash MD5: 128K
       67 B3 D3 F6 50 73 57 D5 3A F7 EB 32 9C 10 AE A8>)
(   8,<2012-03-27 23:39:35.250 -0500>,<Administrator>,<TOPSPIN>,<proc1d>,<TOPSPIN 2.1>,
      <abs ABSG = 5 
       data hash MD5: 128K
       B3 A3 C1 07 55 50 8F E9 5D 9F 46 90 66 2F E8 8E>)
(   9,<2012-03-27 23:39:36.968 -0500>,<Administrator>,<TOPSPIN>,<audit>,<TOPSPIN 2.1>,
      <user comment:
       ICON-NMR User ID: COFFEE
       data hash MD5: 128K
$$ [...]
##$TP07= 0
##$TPNAME0= <>
##$TPNAME1= <>
##$TPNAME2= <>
##$TPNAME3= <>
##$TPNAME4= <>
##$TPNAME5= <>
##$TPNAME6= <>
##$TPNAME7= <>
##$TPOAL= (0..7)
0.5 0.5 0.5 0.5 0.5 0.5 0.5 0.5
##$TPOFFS= (0..7)
0 0 0 0 0 0 0 0
##$TUNHIN= 0
##$TUNHOUT= 0
##$TUNXOUT= 0
##$USERA1= <user>
##$USERA2= <user>
##$USERA3= <user>
##$USERA4= <user>
##$USERA5= <user>
##$V9= 5
##$VALIST= <valist>
##$VCLIST= <CCCCCCCCCCCCCCC>
##$VD= 0
##$VDLIST= <DDDDDDDDDDDDDDD>
##$VPLIST= <PPPPPPPPPPPPPPP>
##$VTLIST= <TTTTTTTTTTTTTTT>
##$WBST= 2048
##$WBSW= 25
##$XGAIN= (0..3)
0 0 0 0
##$XL= 0
##$YL= 0
##$YMAX_a= 15696317
##$YMIN_a= -7213106
##$ZGOPTNS= <>
##$ZL1= 120
##$ZL2= 120
##$ZL3= 120
##$ZL4= 120
##$ABSF1= 14.96864
##$ABSF2= -5.58389
##$ABSG= 5
##$ABSL= 3
##$ALPHA= 0
##$AQORDER= 0
##$ASSFAC= 0
##$ASSFACI= 0
##$ASSFACX= 0
##$ASSWID= 0
##$AUNMP= <proc_prof1d_extract.lims>
##$AXLEFT= 0
##$AXNAME= <>
##$AXNUC= <1H>
##$AXRIGHT= 0
##$AXTYPE= 0
##$AXUNIT= <>
##$AZFE= 0.1
##$AZFW= 0.1
##$BCFW= 0
##$BC_mod= 0
##$BYTORDP= 0
##$COROFFS= 0
##$CY= 15
##$DATMOD= 1
##$DC= 0
##$DFILT= <>
##$DTYPP= 0
##$F1P= 0
##$F2P= 0
##$FCOR= 0.5
##$FTSIZE= 131072
##$FT_mod= 6
##$GAMMA= 0
##$GB= 0
##$INTBC= 1
##$INTSCL= 1
##$ISEN= 128
##$LB= 0.3
##$LEV0= 0
##$LPBIN= 0
##$MAXI= 10000
##$MC2= 0
##$MEAN= 0
##$ME_mod= 0
##$MI= 0
##$NCOEF= 0
##$NC_proc= -3
##$NLEV= 6
##$NOISF1= 0
##$NOISF2= 0
##$NSP= 0
##$NTH_PI= 0
##$NZP= 0
##$OFFSET= 14.96864
##$PC= 1
##$PHC0= 36.73828
##$PHC1= 0
##$PH_mod= 1
##$PKNL= yes
##$PPARMOD= 0
##$PPDIAG= 0
##$PPIPTYP= 0
##$PPMPNUM= 2147483647
##$PPRESOL= 1
##$PSCAL= 4
##$PSIGN= 0
##$PYNMP= <proc.py>
##$REVERSE= no
##$SF= 400.13000479153
##$SI= 131072
##$SIGF1= 0
##$SIGF2= 0
##$SINO= 400
##$SIOLD= 131072
##$SPECTYP= <>
##$SREGLST= <1H.CDCl3>
##$SSB= 0
##$STSI= 131072
##$STSR= 0
##$SW_p= 8223.68421052632
##$SYMM= 0
##$S_DEV= 0
##$TDeff= 65536
##$TDoff= 0
##$TI= <>
##$TILT= no
##$TM1= 0
##$TM2= 0
##$TOPLEV= 0
##$USERP1= <user>
##$USERP2= <user>
##$USERP3= <user>
##$USERP4= <user>
##$USERP5= <user>
##$WDW= 1
##$XDIM= 131072
##$YMAX_p= 549002635
##$YMIN_p= -467049700
##$CURPLOT= <Network HP LaserJet P1505>
##$CURPRIN= <$Network HP LaserJet P1505>
##$DFORMAT= <normdp>
##$LAYOUT= <+/1D_H.xwp>
##$LFORMAT= <normlp>
##$PFORMAT= <normpl>
##$SURQMSG= 1
$$ End of Bruker specific parameters
$$ ---------------------------------
##NTUPLES= NMR SPECTRUM
##VAR_NAME=  FREQUENCY,     SPECTRUM/REAL,   SPECTRUM/IMAG
##SYMBOL=    X,             R,               I
##VAR_TYPE=  INDEPENDENT,   DEPENDENT,       DEPENDENT
##VAR_FORM=  AFFN,          ASDF,            ASDF
##VAR_DIM=   131072,        131072,          131072
##UNITS=     HZ,            ARBITRARY UNITS, ARBITRARY UNITS
##FACTOR=    0.0627417313425165, 1,          1
##FIRST=     8223.62146879498, 4857,         -125314
##LAST=      0,             8201,            -126321
##MIN=       0,             -467049700,      0
##MAX=       8223.62146879498, 549002635,    0
$$ Real data points
##PAGE= N=1
##DATA TABLE= (X++(R..R)), XYDATA
$$ [...]
$$ plain form
60635 1463700 1457065 1448087 1437623 1425649 1411161 1393670 1374328 1355199 1337529 1320839 1303652 1285062
60623 1285062 1265677 1247010 1229997 1214365 1199543 1185578 1172676 1160423 1148503 1138043 1131062
60612 1131062 1128158 1127607 1127277 1126740 1127009 1128928 1132585 1137740 1143900 1150325 1156811 1164338 1174017 1185373 1196481
60597 1196481 1206044 1214649 1223574 1232945 1241618 1248693 1254641 1260883 1268512 1277554 1287312 1297161 1306950 1316857
60583 1316857 1327143 1337994 1349285 1360458 1370997 1381099 1391606 1403151 1415722 1429117 1443335
60572 1443335 1458262 1473440 1488625 1504305 1521225 1539475 1558415 1577380 1596104 1614391 1631501
60561 1631501 1645954 1656072 1661120 1662007 1660515 1657562 1652506 1644354 1633320 1620784 1607868 1594486 1580008
60548 1580008 1564699 1550210 1538260 1528923 1520813 1513284 1507626 1505153 1504760 1503781 1501175 1498310 1496205 1493562
$$ packed form
60635A463700o635q978j0464j1974j4488j7491j9342j9129j7670j6690j7187j8590
60623A285062j9385j8667j7013j5632j4822j3965j2902j2253j1920j0460o981
60612A131062k904n51l30n37K69J919L657N155O160O425O486P527R679J1356J1108
60597A196481R563Q605Q925R371Q673P075N948O242P629R042R758R849R789R907
60583A316857J0286J0851J1291J1173J0539J0102J0507J1545J2571J3395J4218
60572A443335J4927J5178J5185J5680J6920J8250J8940J8965J8724J8287J7110
60561A631501J4453J0118N048Q87j492k953n056q152j1034j2536j2916j3382j4478
60548A580008j5309j4489j1950r337q110p529n658k473l93r79k606k865k105k643
$$ plain form
60534 1493562 1488497 1481166 1473630 1467739 1463957 1461636 1459675 1457504 1456140 1457658 1462936 1470590 1478667 1486416
60520 1486416 1493581 1499323 1503375 1507349 1513072 1519904 1525417 1528610 1530884 1533717 1537009 1540171 1543429 1547215
60506 1547215 1551047 1553723 1554327 1552897 1550462 1548233 1546206 1542868 1537078 1529801 1522933 1516812 1510409 1504039
60492 1504039 1500192 1501009 1506079 1513483 1522092 1532105 1544099 1558468 1575591 1596005 1620332 1649045
60480 1649045 1682046 1718809 1759439 1805205 1857191 1914728 1976226 2041170 2109640 2179564 2246024
60469 2246024 2304163 2351772 2388361 2412871 2423515 2419440 2401764 2373356 2338177 2300412 2263511
60458 2263511 2229926 2201517 2179611 2164703 2157010 2157295 2166029 2181608 2200918 2222569 2248296 2280096
60446 2280096 2317005 2356154 2396421 2439535 2487705 2541558 2600806 2665944 2738584 2820368 2912053
$$ packed form
60534A493562n065p331p536n891l782k321j961k171j364J518N278P654Q077P749
60520A486416P165N742M052L974N723O832N513L193K274K833L292L162L258L786
60506A547215L832K676O04j430k435k229k027l338n790p277o868o121o403o370
60492A504039l847Q17N070P404Q609J0013J1994J4369J7123K0414K4327K8713
60480A649045L3001L6763M0630M5766N1986N7537O1498O4944O8470O9924O6460
60469B246024N8139M7609L6589K4510J0644m075j7676k8408l5179l7765l6901
60458B263511l3585k8409k1906j4908p693K85Q734J5579J9310K1651K5727L1800
60446B280096L6909L9149M0267M3114M8170N3853N9248O5138P2640Q1784R1685
$$ plain form
60435 2912053 3013917 3127084 3254172 3398154 3560493 3740635 3937169 4148923 4375229
60426 4375229 4616340 4874174 5152003 5453006 5779598 6134189 6519312 6935791 7380362
60417 7380362 7844148 8311405 8758717 9156778 9475318 9688137 9775849 9727778 9544628 9239810
60407 9239810 8836609 8362634 7845215 7308852 6773499 6253650 5759074 5296378 4869717
60398 4869717 4480833 4129615 3814808 3534096 3284251 3062217 2865916 2693516 2542422
60389 2542422 2409657 2292712 2189237 2096579 2012728 1937381 1870892 1812360 1759794 1711941 1668696
60378 1668696 1629760 1594074 1560722 1529170 1498416 1467221 1435848 1406488 1381088 1359458 1340212
60367 1340212 1322833 1307614 1293902 1279806 1264244 1248604 1235542 1226211 1219367 1213306 1207868 1203821
$$ packed form
60435B912053J01864J13167J27088J43982J62339J80142J96534K11754K26306
60426D375229K41111K57834K77829L01003L26592L54591L85123M16479M44571
60417G380362M63786M67257M47312L98061L18540K12819Q7712m8071j83150l04818
60407I239810m03201m73975n17419n36363n35353n19849m94576m62696m26661
60398D869717l88884l51218l14807k80712k49845k22034j96301j72400j51094
60389B542422j32765j16945j03475r2658q3851p5347o6489n8532n2566m7853m3245
60378A668696l8936l5686l3352l1552l0754l1195l1373k9360k5400k1630j9246
60367A340212j7379j5219j3712j4096j5562j5640j3062r331o844o061n438m047
$$ plain form
60355 1203821 1200935 1197959 1194619 1192369 1192409 1193941 1195287 1196088 1197357 1199716 1202649 1205385 1207674 1209648 1211605
60340 1211605 1213930 1216707 1219580 1222460 1226072 1231085 1237049 1243043 1249148 1256281 1264589 1272964 1280300 1286432
60326 1286432 1291644 1296000 1299342 1301395 1301807 1300647 1298701 1296564 1293605 1288808 1282555 1276461 1271375 1266814
60312 1266814 1262644 1259915 1259148 1258930 1257354 1254374 1251803 1251305 1253043 1255967 1258796 1261023 1263501 1267787 1274512
60297 1274512 1282763 1291421 1300440 1310144 1319907 1328578 1336015 1343279 1351223 1359656 1368038 1376337 1384955 1394265
60283 1394265 1404424 1415350 1426735 1438220 1449481 1459875 1468252 1473690 1476478 1477831 1478579 1478694 1478274
60270 1478274 1478258 1479541 1481770 1483766 1485170 1487020 1490414 1495041 1499494 1502758 1504813 1505761 1505032 1501977 1496930
60255 1496930 1490965 1484527 1477021 1468216 1459613 1453606 1451144 1450722 1450028 1448294 1446628 1446245 1446933 1447486 1447242
$$ packed form
60355A203821k886k976l340k250M0J532J346Q01J269K359K933K736K289J974J957
60340A211605K325K777K873K880L612N013N964N994O105P133Q308Q375P336O132
60326A286432N212M356L342K053M12j160j946k137k959m797o253o094n086m561
60312A266814m170k729p67k18j576k980k571m98J738K924K829K227K478M286O725
60297A274512Q251Q658R019R704R763Q671P437P264P944Q433Q382Q299Q618R310
60283A394265J0159J0926J1385J1485J1261J0394Q377N438K788J353P48J15m20
60270A478274j6J283K229J996J404J850L394M627M453L264K055R48p29l055n047
60255A496930n965o438p506q805q603o007k462m22o94j734j666l83O88N53k44
$$ plain form
60240 1447242 1446801 1447257 1449108 1451940 1454902 1457419 1459678 1462641 1467361 1474097 1482064 1490142 1497662 1504542
60226 1504542 1511059 1517882 1526070 1536477 1548999 1562800 1577356 1592900 1609596 1626657 1642724 1657097
60214 1657097 1670274 1683415 1697711 1714249 1733801 1756212 1780295 1804992 1830664 1858673 1889631
60203 1889631 1922713 1957109 1993453 2033138 2076657 2123641 2174492 2230775 2293484 2361793 2434389
60192 2434389 2511554 2594977 2685742 2783615 2888618 3002222 3126118 3260357 3403823 3556452
60182 3556452 3719771 3894705 4079809 4272647 4472237 4678689 4890481 5103608 5313959
60173 5313959 5519243 5717685 5906030 6080266 6237742 6377138 6496792 6594646 6669895 6723139
60163 6723139 6754598 6763673 6751054 6720183 6675894 6622369 6562958 6500961 6439737 6382662 6333549
$$ packed form
60240A447242m41M56J851K832K962K517K259K963M720O736P967Q078P520O880
60226A504542O517O823Q188J0407J2522J3801J4556J5544J6696J7061J6067J4373
60214A657097J3177J3141J4296J6538J9552K2411K4083K4697K5672K8009L0958
60203A889631L3082L4396L6344L9685M3519M6984N0851N6283O2709O8309P2596
60192B434389P7165Q3423R0765R7873J05003J13604J23896J34239J43466J52629
60182C556452J63319J74934J85104J92838J99590K06452K11792K13127K10351
60173E313959K05284J98442J88345J74236J57476J39396J19654R7854P5249N3244
60163F723139L1459R075j2619l0871m4289n3525n9411o1997o1224n7075m9113
$$ plain form
60152 6333549 6296269 6273115 6264309 6270050 6292428 6334423 6397591 6481794 6586674 6712009 6856582
60141 6856582 7017771 7192673 7379124 7575346 7778638 7984162 8184938 8373780 8545882
60132 8545882 8699078 8831212 8938255 9016035 9063130 9080651 9069478 9029237 8960308 8865684 8750273
60121 8750273 8619158 8477039 8328889 8180419 8037618 7905685 7788305 7688180 7608128 7550961
60111 7550961 7518134 7509378 7524153 7562355 7622798 7702233 7797475 7907655 8032520 8168668 8309240
60100 8309240 8447454 8578994 8700941 8810384 8904953 8983364 9044600 9087661 9113103 9124041
60090 9124041 9124950 9120070 9113434 9109558 9113221 9128837 9160273 9210727 9282637 9378480 9501803 9656369
60078 9656369 9843955 10064239 10317561 10606658 10934756 11302926 11710522 12157480 12644811
$$ packed form
60152F333549l7280k3154q806N741K2378M1995O3168Q4203J04880J25335J44573
60141F856582J61189J74902J86451J96222K03292K05524K00776J88842J72102
60132H545882J53196J32134J07043P7780M7095J7521j1173m0241o8929r4624j15411
60121H750273j31115j42119j48150j48470j42801j31933j17380j00125q0052n7167
60111G550961l2827q756J4775L8202O0443P9435R5242J10180J24865J36148J40572
60100H309240J38214J31540J21947J09443R4569P8411O1236M3061K5442J0938
60090I124041R09m880o636l876L663J5616L1436N0454P1910R5843J23323J54566
60078I656369J87586K20284K53322K89097L28098L68170M07596M46958M87331
$$ plain form
60069 12644811 13172947 13740394 14343655 14977268 15633743 16304207 16979397 17649838 18305290
60060 18305290 18934505 19525475 20065907 20544190 20950783 21278759 21522773 21677769 21738995
60051 21738995 21703013 21568648 21337827 21016299 20613341 20140389 19610492 19039305 18445249
60042 18445249 17846653 17258216 16690632 16153204 15655447 15205836 14810055 14471182 14190971
60033 14190971 13970264 13808507 13703571 13652201 13650397 13693380 13775334 13888980 14025063 14172419
60023 14172419 14319225 14454936 14571330 14662038 14721752 14746596 14735043 14687601 14605299 14489064
60013 14489064 14340748 14163781 13961905 13737838 13493974 13233693 12960790 12678013 12387668
60004 12387668 12093708 11801739 11516513 11240683 10976738 10728900 10501968 10298833 10120064
$$ packed form
60069A2644811N28136N67447O03261O33613O56475O70464O75190O70441O55452
60060A8305290O29215N90970N40432M78283M06593L27976K44014J54996O1226
60051B1738995l5982j34365k30821l21528m02958m72952n29897n71187n94056
60042A8445249n98596n88437n67584n37428m97757m49611l95781l38873k80211
60033A4190971k20707j61757j04936n1370j804M2983Q1954J13646J36083J47356
60023A4172419J46806J35711J16394R0708N9714K4844j1553m7442q2302j16235
60013A4489064j48316j76967k01876k24067k43864k60281k72903k82777k90345
60004A2387668k93960k91969k85226k75830k63945k47838k26932k03135j78769
$$ plain form
59995 10120064 9965714 9836958 9736138 9665591 9626175 9616800 9635848 9682979 9758675 9861935
59985 9861935 9989555 10138148 10305566 10489233 10683824 10881691 11075210 11257955 11424203
59976 11424203 11568363 11684895 11768389 11814352 11820674 11787918 11717639 11611081 11470221 11299240
59966 11299240 11103845 10889592 10661824 10426606 10190457 9959341 9738675 9533533 9347518
59957 9347518 9181994 9037942 8918205 8826300 8763328 8727946 8719524 8739536 8789617 8870243 8981995
59946 8981995 9125985 9301656 9505757 9734942 9987969 10263392 10555836 10856423 11156600
59937 11156600 11449890 11730014 11989189 12219184 12413301 12567080 12677994 12745002 12767855 12746403
59927 12746403 12680867 12572816 12425461 12243269 12032218 11800645 11558676 11315900 11079739
$$ packed form
59995A0120064j54350j28756j00820p0547l9416r375J9048M7131P5696J03260
59985I861935J27620J48593J67418J83667J94591J97867J93519J82745J66248
59976A1424203J44160J16532Q3494M5963O322l2756p0279j06558j40860j70981
59966A1299240j95395k14253k27768k35218k36149k31116k20666k05142j86015
59957I347518j65524j44052j19737r1905o2972l5382q422K0012N0081Q0626J11752
59946H981995J43990J75671K04101K29185K53027K75423K92444L00587L00177
59937A1156600K93290K80124K59175K29995J94117J53779J10914O7008K2853k1452
59927A2746403o5536j08051j47355j82192k11051k31573k41969k42776k36161
$$ plain form
59918 11079739 10856232 10651457 10471124 10319009 10196684 10105008 10045334 10019221 10027594 10070402
59908 10070402 10146561 10253742 10388379 10546294 10723452 10916201 11121038 11334227 11551462
59899 11551462 11767780 11978096 12178249 12365656 12539027 12697579 12840615 12967756 13079502
59890 13079502 13177754 13265849 13347998 13428657 13512636 13605649 13714174 13844511 14002227 14192575
59880 14192575 14420820 14691754 15009266 15376689 15796824 16270787 16796947 17371395 17988848
59871 17988848 18642088 19320498 20009639 20691890 21346614 21949992 22476380 22901209 23203595
59862 23203595 23368004 23386039 23257978 22992199 22602674 22107206 21527307 20887320 20211320
59853 20211320 19520110 18830750 18157704 17513331 16907568 16348054 15840673 15389784 14998316
$$ packed form
59918A1079739k23507k04775j80333j52115j22325r1676n9674k6113Q373M2808
59908A0070402P6159J07181J34637J57915J77158J92749K04837K13189K17235
59899A1551462K16318K10316K00153J87407J73371J58552J43036J27141J11746
59890A3079502R8252Q8095Q2149Q0659Q3979R3013J08525J30337J57716J90348
59880A4192575K28245K70934L17512L67423M20135M73963N26160N74448O17453
59871A7988848O53240O78410O89141O82251O54724O03378N26388M24829L02386
59862B3203595J64409J8035j28061k65779l89525m95468n79899o39987o76000
59853B0211320o91210o89360o73046o44373o05763n59514n07381m50889l91468
$$ plain form
59844 14998316 14668182 14400487 14195190 14050904 13965425 13936164 13960011 14033394 14152834 14314757
59834 14314757 14514006 14742713 14990999 15248344 15503798 15745147 15958580 16129338 16242925
59825 16242925 16286719 16251616 16132974 15930627 15648660 15294919 14879529 14413130 13906899 13374013
59815 13374013 12829397 12286449 11754083 11237422 10740719 10268761 9825970 9415246 9037747
59806 9037747 8693197 8380564 8099089 7848740 7629420 7439843 7277261 7137904 7017609
59797 7017609 6912805 6821233 6741056 6669135 6601201 6534251 6467775 6402138 6337143 6273150 6212218
59786 6212218 6156547 6106593 6062026 6023466 5991357 5963755 5937204 5909607 5880313 5847511 5807679
59775 5807679 5758301 5699657 5633434 5561149 5484712 5407310 5332625 5263527 5201853 5148737 5104913
$$ packed form
59844A4998316l30134k67695k05297j44286q5479k9261K3847P3383J19440J61923
59834A4314757J99249K28707K48286K57345K55454K41349K13433J70758J13587
59825A6242925M3794l5103j18642k02347k81967l53741m15390m66399n06231n32886
59815A3374013n44616n42948n32366n16661m96703m71958m42791m10724l77499
59806I037747l44550l12633k81475k50349k19320j89577j62582j39357j20295
59797G017609j04804r1572q0177p1921o7934o6950o6476o5637o4995o3993o0932
59786F212218n5671m9954m4567l8560l2109k7602k6551k7597k9294l2802l9832
59775E807679m9378n8644o6223p2285p6437p7402p4685o9098o1674n3116m3824
$$ plain form
59764 5104913 5071242 5048996 5038993 5040676 5052912 5075312 5107559 5147910 5194237 5246788 5308157
59753 5308157 5380012 5461455 5551122 5649016 5755062 5867282 5982771 6099427 6215360 6327385
59743 6327385 6431601 6525267 6607391 6677990 6737651 6787437 6828565 6862579 6892243 6921373 6953006
59732 6953006 6988454 7029053 7078152 7140387 7219466 7317599 7436705 7579173 7747501 7943882
59722 7943882 8170073 8427475 8717847 9044277 9410582 9819148 10270096 10763046 11298230
59713 11298230 11874179 12484198 13115047 13746795 14351533 14893356 15333741 15640815 15796311
59704 15796311 15797441 15655867 15395109 15045237 14636239 14194492 13743356 13303665 12891492 12516308
59694 12516308 12182886 11894712 11654760 11463929 11320659 11222681 11168495 11157031 11186743 11255681
$$ packed form
59764E104913l3671k2246j0003J683J2236K2400L2247M0351M6327N2551O1369
59753E308157P1855Q1443Q9667R7894J06046J12220J15489J16656J15933J12025
59743F327385J04216R3666Q2124P0599N9661M9786M1128L4014K9664K9130L1633
59732F953006L5448M0599M9099O2235P9079R8133J19106J42468J68328J96381
59722G943882K26191K57402K90372L26430L66305M08566M50948M92950N35184
59713A1298230N75949O10019O30849O31748O04738N41823M40385L07074J55496
59704A5796311J130j41574k60758l49872m08998m41747m51136m39691m12173l75184
59694A2516308l33422k88174k39952j90831j43270r7978n4186j1464K9712O8938
$$ plain form
59684 11255681 11362276 11505688 11685339 11900292 12149390 12432219 12749798 13104039 13496650
59675 13496650 13929022 14403119 14921819 15488096 16104287 16772300 17493943 18270806 19104498
59666 19104498 19997393 20952251 21970064 23048497 24183064 25369018 26600385 27866748
59658 27866748 29152276 30438905 31710278 32952829 34154966 35307583 36406414 37453836
59650 37453836 38458670 39434501 40397279 41362422 42342308 43345222 44375393 45432557 46510606
59641 46510606 47596502 48670366 49706588 50675930 51548824 52298940 52905275 53352900 53634286
59632 53634286 53751592 53717451 53552687 53282987 52937235 52546962 52144661 51761091 51423713
59623 51423713 51156692 50980828 50912909 50965994 51151096 51478337 51956140 52589570 53379794 54324674
$$ packed form
59684A1255681J06595J43412J79651K14953K49098K82829L17579L54241L92611
59675A3496650M32372M74097N18700N66277O16191O68013P21643P76863Q33692
59666A9104498Q92895R54858J017813J078433J134567J185954J231367J266363
59658B7866748J285528J286629J271373J242551J202137J152617J098831J047422
59650C7453836J004834R75831R62778R65143R79886J002914J030171J057164J078049
59641D6510606J085896J073864J036222R69342Q72894P50116O06335M47625K81386
59632E3634286J17306l4141j64764k69700l45752l90273m02301l83570l37378
59623E1423713k67021j75864o7919N3085J85102L27241M77803O33430P90224R44880
$$ plain form
59613 54324674 55418901 56652652 58009138 59462333 60975973 62504003 63991545 65375699
59605 65375699 66586996 67553236 68206170 68489527 68366348 67824082 66876317 65560528 63932531
59596 63932531 62059357 60012332 57861323 55670568 53495960 51383138 49365872 47465051
59588 47465051 45688699 44032684 42481481 41009282 39582460 38164251 36721721 35233609
59580 35233609 33695574 32119365 30526378 28940594 27385043 25880721 24444754 23088080
59572 23088080 21815746 20629903 19532013 18522287 17598487 16756412 15991232 15297811 14670344
59563 14670344 14102678 13589253 13125465 12707084 12329589 11988269 11679151 11399852 11149093
59554 11149093 10924884 10723256 10539088 10367850 10206003 10050046 9896285 9741784 9584710
$$ packed form
59613E4324674J094227J233751J356486J453195J513640J528030J487542J384154
59605F5375699J211297R66240O52934K83357j23179n42266r47765j315789j627997
59596F3932531j873174k047025k151009k190755k174608k112822k017266j900821
59588D7465051j776352j656015j551203j472199j426822j418209j442530j488112
59580C5233609j538035j576209j592987j585784j555551j504322j435967j356674
59572B3088080j272334j185843j097890j009726r23800q42075p65180o93421o27467
59563A4670344n67666n13425m63788m18381l77495l41320l09118k79299k50759
59554A1149093k24209k01628j84168j71238j61847j55957j53761j54501j57074
$$ plain form
59545 9584710 9423409 9255987 9081519 8901182 8717468 8532359 8346812 8161956 7980301
59536 7980301 7805259 7639443 7483690 7338185 7204378 7084987 6981676 6893558 6818804 6757149
59526 6757149 6709646 6676324 6655551 6645898 6647422 6660629 6685143 6719832 6763395 6814316 6871003 6932437
59514 6932437 6998004 7066469 7136133 7206571 7279292 7356021 7437280 7523602 7617328 7721923 7839713
59503 7839713 7971208 8116574 8276969 8454364 8650578 8866603 9102686 9359335 9638424
59494 9638424 9942841 10274646 10633902 11019736 11431971 11870985 12336093 12824771 13333483
59485 13333483 13858698 14396711 14942456 15488627 16026523 16548348 17048786 17524078 17970133
59476 17970133 18382697 18759330 19099920 19404702 19672842 19903685 20098480 20260152 20392302
$$ packed form
59545I584710j61301j67422j74468j80337j83714j85109j85547j84856j81655
59536G980301j75042j65816j55753j45505j33807j19391j03311q8118p4754o1655
59526F757149m7503l3322k0773r653J524J3207K4514L4689M3563N0921N6687O1434
59514F932437O5567O8465O9664P0438P2721P6729Q1259Q6322R3726J04595J17790
59503G839713J31495J45366J60395J77395J96214K16025K36083K56649K79089
59494I638424L04417L31805L59256L85834M12235M39014M65108M88678N08712
59485A3333483N25215N38013N45745N46171N37896N21825N00438M75292M46055
59476A7970133M12564L76633L40590L04782K68140K30843J94795J61672J32150
$$ plain form
59467 20392302 20499581 20588660 20667864 20745903 20831078 20930566 21048990 21187481 21344309 21515506
59457 21515506 21693752 21867075 22019872 22135582 22198349 22193335 22107449 21930922 21658393 21289148
59447 21289148 20827123 20280573 19660988 18982015 18259175 17509289 16748793 15992293 15252769
59438 15252769 14542001 13869414 13240725 12658898 12126382 11645435 11216390 10836873 10503281
59429 10503281 10212493 9962210 9750628 9576249 9437493 9332307 9258617 9215191 9201589 9217272
59419 9217272 9261498 9334165 9435986 9567416 9727895 9916528 10133246 10379013 10654914 10960846
59409 10960846 11294677 11652494 12029720 12421727 12823132 13226730 13623389 14002591 14352558
59400 14352558 14660267 14912401 15096887 15203874 15226190 15160144 15006385 14769802 14458465 14082635
$$ packed form
59467B0392302J07279Q9079P9204P8039Q5175R9488J18424J38491J56828J71197
59457B1515506J78246J73323J52797J15710O2767n014q5886j76527k72529l69245
59447B1289148m62025n46550o19585o78973p22840p49886p60496p56500p39524
59438A5252769p10768o72587o28689n81827n32516m80947m29045l79517l33592
59429A0503281k90788k50283k11582j74379j38756j05186p3690m3426j3602J5683
59419I217272M4226P2667J01821J31430J60479J88633K16718K45767K75901L05932
59409A0960846L33831L57817L77226L92007M01405M03598L96659L79202L49967
59400A4352558L07709K52134J84486J06987K2316o6046j53759k36583l11337l75830
$$ plain form
59390 14082635 13654171 13185872 12690707 12180937 11666974 11156518 10655244 10168709 9702975
59381 9702975 9262863 8850394 8465808 8109448 7781722 7481893 7208362 6960135 6736945
59372 6736945 6538025 6361751 6206372 6069988 5949947 5843730 5750846 5672718 5610184 5562014
59362 5562014 5526308 5502285 5489858 5488228 5495980 5512374 5537701 5572211 5615154 5665198 5721789 5785933
59350 5785933 5859466 5943355 6036524 6135920 6237275 6336417 6431474 6524800 6622106 6728898 6848147
59339 6848147 6981731 7132718 7304730 7499585 7716856 7955112 8212129 8484726 8771135
59330 8771135 9074494 9402582 9763371 10161790 10600856 11084058 11615398 12198242 12835358
59321 12835358 13529483 14282803 15095929 15967472 16893635 17867441 18878655 19914584 20960128
$$ packed form
59390A4082635m28464m68299m95165n09770n13963n10456n01274m86535m65734
59381I702975m40112m12469l84586l56360l27726k99829k73531k48227k23190
59372F736945j98920j76274j55379j36384j20041j06217r2884p8128o2534m8170
59362E562014l5706k4023j2427j630P752J6394K5327L4510M2943N0044N6591O4144
59350E785933P3533Q3889R3169R9396J01355R9142R5057R3326R7306J06792J19249
59339F848147J33584J50987J72012J94855K17271K38256K57017K72597K86409
59330H771135L03359L28088L60789L98419M39066M83202N31340N82844O37116
59321A2835358O94125P53320Q13126Q71543R26163R73806J011214J035929J045544
$$ plain form
59312 20960128 21996904 23004053 23961953 24855948 25676987 26419948 27082217 27663221 28164170
59303 28164170 28587942 28938984 29222089 29440043 29592294 29676013 29687921 29624809 29483250 29260025
59293 29260025 28953247 28563595 28095799 27559829 26969737 26339854 25681479 25002759 24310133
59284 24310133 23608201 22898448 22179746 21451001 20713123 19968630 19220365 18471449 17726271
59275 17726271 16991002 16272762 15578114 14912282 14279741 13684976 13131826 12621842 12154006
59266 12154006 11726577 11338808 10990419 10680050 10405306 10164255 9955947 9779148 9631383
59257 9631383 9509838 9412861 9339821 9289569 9259763 9248049 9253276 9274806 9310812 9358053 9413450
59246 9413450 9475202 9541943 9611461 9680717 9746575 9805892 9855328 9891924 9913869 9920507 9912256 9891237
$$ packed form
59312B0960128J036776J007149R57900Q93995Q21039P42961O62269N81004N00949
59303B8164170M23772L51042K83105K17954J52251Q3719J1908o3112j41559k23225
59293B9260025l06778l89652m67796n35970n90092o29883o58375o78720o92626
59284B4310133p01932p09753p18702p28745p37878p44493p48265p48916p45178
59275A7726271p35269p18240o94648o65832o32541n94765n53150n09984m67836
59266A2154006m27429l87769l48389l10369k74744k41051k08308j76799j47765
59257I631383j21545r6977p3040n0252k9806j1714N227K1530L6006M7241N5397
59246I413450O1752O6741O9518O9256O5858N9317M9436L6596K1945O638q251k1019
$$ plain form
59234 9891237 9861261 9826097 9787965 9748530 9710793 9678652 9654981 9641732 9642009 9660266 9699850 9761608
59222 9761608 9845378 9951431 10079784 10229686 10401011 10594961 10811940 11049232 11301812 11564664
59212 11564664 11833113 12101620 12363862 12613740 12844844 13048865 13216138 13338740 13412891
59203 13412891 13438669 13418696 13357709 13262406 13140387 12998824 12844044 12681853 12517451 12354745
59193 12354745 12195926 12041933 11893381 11750983 11615149 11485394 11360391 11238597 11118883
59184 11118883 11001059 10886355 10777551 10678234 10591622 10519975 10464901 10428129 10412278 10421268 10459722
59173 10459722 10531585 10639456 10785511 10972580 11203705 11481068 11806117 12180433 12605403
59164 12605403 13080751 13603705 14168955 14768117 15388982 16016088 16632051 17217662 17751283
$$ packed form
59234I891237k9976l5164l8132l9435l7737l2141k3671j3249K77J8257L9584O1758
59222I761608Q3770J06053J28353J49902J71325J93950K16979K37292K52580K62852
59212A1564664K68449K68507K62242K49878K31104K04021J67273J22602P4151
59203A3412891K5778j9973o0987r5303j22019j41563j54780j62191j64402j62706
59193A2354745j58819j53993j48552j42398j35834j29755j25003j21794j19714
59184A1118883j17824j14704j08804r9317q6612p1647n5074l6772j5851Q990L8454
59173A0459722P1863J07871J46055J87069K31125K77363L25049L74316M24970
59164A2605403M75348N22954N65250N99162O20865O27106O15963N85611N33621
$$ plain form
59155 17751283 18210082 18572995 18822464 18944375 18928828 18772392 18478979 18058160 17523611
59146 17523611 16893376 16189565 15435684 14653714 13863300 13081882 12324062 11600988 10920603
59137 10920603 10287651 9703288 9166348 8676178 8233385 7837169 7483409 7166734 6883334
59128 6883334 6630370 6403931 6199771 6015691 5851352 5705815 5576865 5462758 5363010 5277113
59118 5277113 5203684 5141267 5089011 5046297 5012512 4987458 4971275 4963884 4965125 4975258 4994473 5021956
59106 5021956 5056439 5097714 5146771 5204291 5269900 5343082 5423966 5512771 5609159 5712607 5823138
59095 5823138 5941387 6067906 6202176 6341879 6483471 6624008 6762366 6898228 7030152
59086 7030152 7155203 7270194 7372658 7460795 7533292 7589238 7627924 7649060 7653715 7644576 7624515
$$ packed form
59155A7751283M58799L62913K49469J21911j5547j56436k93413m20819n34549
59146A7523611o30235p03811p53881p81970p90414p81418p57820p23074o80385
59137A0920603o32952n84363n36940m90170m42793l96216l53760l16675k83400
59128F883334k52964k26439k04160j84080j64339j45537j28950j14107r9748q5897
59118E277113p3429o2417n2256m2714l3785k5054j6183p391J241J0133J9215K7483
59106E021956L4483M1275M9057N7520O5609P3182Q0884Q8805R6388J03448J10531
59095E823138J18249J26519J34270J39703J41592J40537J38358J35862J31924
59086G030152J25051J14991J02464Q8137P2497N5946L8686K1136M655r139k0061
$$ plain form
59075 7624515 7595268 7558321 7516519 7473683 7432972 7396983 7369200 7353671 7352848 7367070 7396702 7443591
59063 7443591 7509762 7595881 7701945 7828750 7977745 8149965 8345935 8566236 8811299 9080672
59053 9080672 9372931 9686314 10019360 10371466 10743136 11134951 11545281 11968792 12397359
59044 12397359 12822238 13235003 13626534 13985496 14298078 14549745 14728442 14827162 14843804 14778900
59034 14778900 14634328 14414580 14128271 13786827 13401155 12979730 12529496 12057500 11571276
59025 11571276 11078307 10585722 10100035 9626414 9168130 8727087 8304937 7903463 7524058
59016 7524058 7167229 6832635 6519354 6226290 5952786 5698775 5463799 5245964 5042697
59007 5042697 4852705 4676394 4513972 4364112 4225232 4097218 3980771 3875555 3780174 3693660
$$ packed form
59075G624515k9247l6947m1802m2836m0711l5989k7783j5529q23J4222K9632M6889
59063G443591O6171Q6119J06064J26805J48995J72220J95970K20301K45063K69373
59053I080672K92259L13383L33046L52106L71670L91815M10330M23511M28567
59044A2397359M24879M12765L91531L58962L12582K51667J78697R8720J6642o4904
59034A4778900j44572k19748k86309l41444l85672m21425m50234m71996m86224
59025A1571276m92969m92585m85687m73621m58284m41043m22150m01474l79405
59016G524058l56829l34594l13281k93064k73504k54011k34976k17835k03267
59007E042697j89992j76311j62422j49860j38880j28014j16447j05216r5381q6514
$$ plain form
58997 3693660 3615661 3545240 3480777 3421232 3366381 3315604 3267699 3222310 3180261 3141662 3104553
58986 3104553 3066328 3025946 2984177 2942421 2902057 2864364 2830179 2799717 2773148 2750995 2733561
58975 2733561 2720312 2710271 2702831 2698040 2696388 2698305 2703498 2710935 2720095 2731897 2747461 2766177 2786238
58962 2786238 2806822 2828016 2848477 2865248 2876866 2884892 2891238 2895525 2896403 2894205 2890882 2888384 2888272
58949 2888272 2891619 2897798 2904560 2910984 2919322 2932116 2948469 2965057 2980055 2993806 3006075 3015057
58937 3015057 3019436 3019680 3016834 3011433 3003799 2994247 2982926 2970626 2959624 2952541 2950351 2952482 2958415
58924 2958415 2967789 2979389 2991865 3005652 3022766 3044499 3070443 3099669 3131531 3165349 3200717
58913 3200717 3238242 3278926 3323015 3370617 3422833 3480636 3543027 3608219 3676404 3749250 3826728
$$ packed form
58997C693660p7999p0421o4463n9545n4851n0777m7905m5389m2049l8599l7109
58986C104553l8225m0382m1769m1756m0364l7693l4185l0462k6569k2153j7434
58975B733561j3249j0041p440m791j652J917N193P437R160J1802J5564J8716K0061
58962B786238K0584K1194K0461J6771J1618Q026O346M287Q78k198l323k498j12
58949B888272L347O179O762O424Q338J2794J6353J6588J4998J3751J2269Q982
58937C015057M379K44k846n401p634r552j1321j2300j1002p083k190K131N933
58924B958415R374J1600J2476J3787J7114K1733K5944K9226L1862L3818L5368
58913C200717L7525M0684M4089M7602N2216N7803O2391O5192O8185P2846P7478
$$ plain form
58902 3826728 3906676 3987851 4071158 4157465 4246433 4338186 4433746 4532757 4633042 4733846 4837674
58891 4837674 4947477 5063827 5186473 5316892 5457183 5607519 5766745 5934865 6113280
58882 6113280 6303181 6505369 6721290 6952699 7200565 7465599 7749591 8054818 8382179
58873 8382179 8731158 9101724 9495291 9913807 10359052 10833301 11339981 11883134 12466351
58864 12466351 13092296 13763054 14480812 15248235 16068106 16942757 17874118 18863951 19913014
58855 19913014 21019491 22178545 23383333 24625391 25893199 27170388 28435335 29661866
58847 29661866 30820180 31877988 32801979 33559480 34120803 34462672 34571376 34443608 34085560
58838 34085560 33512350 32747490 31820339 30762259 29604587 28378568 27114028 25836329
$$ packed form
58902C826728P9948Q1175Q3307Q6307Q8968R1753R5560R9011J00285J00804J03828
58891D837674J09803J16350J22646J30419J40291J50336J59226J68120J78415
58882F113280J89901K02188K15921K31409K47866K65034K83992L05227L27361
58873H382179L48979L70566L93567M18516M45245M74249N06680N43153N83217
58864A2466351O25945O70758P17758P67423Q19871Q74651R31361R89833J049063
58855A9913014J106477J159054J204788J242058J267808J277189J264947J226531
58847B9661866J158314J057808R23991P57501N61323L41869J08704j27768l58048
58838C4085560n73210p64860r27151j058080j157672j226019j264540j277699
$$ plain form
58830 25836329 24565407 23318233 22110661 20955642 19860844 18829575 17863560 16963860
58822 16963860 16129880 15359005 14647364 13990420 13383329 12821690 12301965 11820682 11373606
58813 11373606 10956294 10565260 10198308 9854173 9532338 9232739 8955103 8698625 8462396
58804 8462396 8245612 8047181 7865680 7699882 7548765 7411051 7285720 7173141 7074636 6990546
58794 6990546 6919717 6861144 6814817 6780420 6756725 6743467 6742678 6756809 6786250 6829927 6887671 6960659
58782 6960659 7049744 7154516 7273979 7407441 7554875 7717107 7895506 8091027 8303819 8534122
58772 8534122 8782946 9051457 9340339 9650389 9983068 10339772 10721199 11128264 11563234
58763 11563234 12029283 12529418 13066474 13643644 14264223 14931219 15647705 16416932 17241327
$$ packed form
58830B5836329j270922j247174j207572j155019j094798j031269r66015q99700
58822A6963860q33980p70875p11641o56944o07091n61639n19725m81283m47076
58813A1373606m17312l91034l66952l44135l21835k99599k77636k56478k36229
58804H462396k16784j98431j81501j65798j51117j37714j25331j12579r8505q4090
58794F990546p0829n8573m6327l4397k3695j3258p89J4131K9441M3677N7744P2988
58782F960659Q9085J04772J19463J33462J47434J62232J78399J95521K12792K30303
58772H534122K48824K68511K88882L10050L32679L56704L81427M07065M34970
58763A1563234M66049N00135N37056N77170O20579O66996P16486P69227Q24395
$$ plain form
58754 17241327 18121889 19059136 20053810 21105421 22210108 23360357 24546052 25754554
58746 25754554 26969432 28169287 29327297 30411740 31388252 32223469 32887692 33355315 33605265
58737 33605265 33623596 33406699 32962266 32307937 31469119 30476254 29361532 28156623 26892277
58728 26892277 25597878 24299259 23016640 21765066 20556223 19399005 18299096 17259503
58720 17259503 16281771 15366222 14511552 13715363 12975155 12288218 11650925 11059058 10508748
58711 10508748 9996364 9517767 9068898 8647449 8253138 7885816 7543643 7223505 6923028
58702 6923028 6641738 6380049 6137394 5911898 5701989 5507398 5327820 5161424 5006101
58693 5006101 4861810 4730011 4610664 4501517 4400821 4308953 4226427 4151870 4083335 4020480
$$ packed form
58754A7241327Q80562R37247R94674J051611J104687J150249J185695J208502
58746B5754554J214878J199855J158010J084443R76512Q35217O64223M67623K49950
58737C3605265J8331k16897m44433o54329q38818r92865j114722j204909j264346
58728B6892277j294399j298619j282619j251574j208843j157218j099909j039593
58720A7259503r77732r15549q54670p96189p40208o86937o37293n91867n50310
58711A0508748n12384m78597m48869m21449l94311l67322l42173l20138l00477
58702F923028k81290k61689k42655k25496k09909j94591j79578j66396j55323
58693E006101j44291j31799j19347j09147j00696r1868q2526p4557o8535o2855
$$ plain form
58683 4020480 3964129 3914481 3870854 3832315 3797419 3763978 3730229 3695629 3659627 3620579 3577047
58672 3577047 3529388 3478853 3425838 3370343 3313568 3257442 3202725 3148652 3094193 3038659 2981425
58661 2981425 2922331 2862291 2802525 2743160 2683337 2622561 2561268 2500209 2439894 2380477 2321894
58650 2321894 2264438 2209382 2158216 2110933 2066063 2022910 1982621 1946300 1913340 1882709 1854674
58639 1854674 1829850 1807436 1785815 1764311 1743114 1722195 1701683 1682747 1666623 1652964 1640229
58628 1640229 1627414 1614622 1602485 1591963 1584070 1578817 1574968 1571486 1568284 1564829 1559585 1552257 1545212
58615 1545212 1540836 1538534 1536287 1534242 1534521 1537895 1542862 1547967 1553072 1558214 1562993 1567505 1572721 1579641
58601 1579641 1588843 1600450 1613527 1626011 1636398 1644985 1652436 1658167 1661793 1665295 1671670 1681812 1694539
$$ packed form
58683D020480n6351m9648m3627l8539l4896l3441l3749l4600l6002l9048m3532
58672C577047m7659n0535n3015n5495n6775n6126n4717n4073n4459n5534n7234
58661B981425n9094o0040n9766n9365n9823o0776o1293o1059o0315n9417n8583
58650B321894n7456n5056n1166m7283m4870m3153m0289l6321l2960l0631k8035
58639A854674k4824k2414k1621k1504k1197k0919k0512j8936j6124j3659j2735
58628A640229j2815j2792j2137j0522p893n253l849l482l202l455n244p328p045
58615A545212m376k302k247k045K79L374M967N105N105N142M779M512N216O920
58601A579641R202J1607J3077J2484J0387Q587P451N731L626L502O375J0142J2727
$$ plain form
58588 1694539 1709333 1727065 1748148 1771992 1798563 1828799 1863140 1901023 1941999 1986351 2034572
58577 2034572 2087234 2145044 2208066 2275466 2347041 2424128 2507785 2597308 2692312 2794978 2907883
58566 2907883 3030660 3161447 3301093 3453094 3619656 3800757 3997242 4211903 4446750
58557 4446750 4701657 4976434 5271979 5588473 5924227 6276793 6643178 7018180 7394041
58548 7394041 7761879 8111343 8428617 8697542 8904325 9040099 9099107 9077479 8975716 8800887
58538 8800887 8564815 8280651 7961127 7617899 7260906 6898958 6541054 6195525 5867332
58529 5867332 5557764 5267501 4998495 4752316 4528369 4324851 4140429 3974365 3826227
58520 3826227 3696035 3583570 3487095 3403873 3332034 3270607 3217760 3170803 3128193 3089803 3054983
$$ packed form
58588A694539J4794J7732K1083K3844K6571L0236L4341L7883M0976M4352M8221
58577B034572N2662N7810O3022O7400P1575P7087Q3657Q9523R5004J02666J12905
58566B907883J22777J30787J39646J52001J66562J81101J96485K14661K34847
58557D446750K54907K74777K95545L16494L35754L52566L66385L75002L75861
58548G394041L67838L49464L17274K68925K06783J35774N9008k1628j01763j74829
58538H800887k36072k84164l19524l43228l56993l61948l57904l45529l28193
58529E867332l09568k90263k69006k46179k23947k03518j84422j66064j48138
58520C826227j30192j12465r6475q3222p1839o1427n2847m6957m2610l8390l4820
$$ plain form
58509 3054983 3022274 2991381 2963321 2937977 2913474 2888747 2864722 2841990 2819070 2793908 2765316
58498 2765316 2731926 2691534 2642964 2587561 2527893 2465990 2403358 2341337 2280605 2221376 2164485
58487 2164485 2111144 2061517 2014946 1971526 1931688 1894315 1857521 1821508 1788226 1757743 1727625
58476 1727625 1696711 1666857 1639658 1613895 1587657 1560857 1534240 1508062 1483332 1462197 1445273
58465 1445273 1430215 1414547 1398231 1381987 1364958 1345980 1325732 1305804 1286807 1268943 1253154
58454 1253154 1240052 1228729 1218151 1208820 1201922 1197792 1196199 1196889 1198834 1200255 1200559 1201199 1203906 1209322
58440 1209322 1217843 1229928 1244677 1260012 1275297 1291990 1310852 1330706 1350991 1373158 1398017
58429 1398017 1423974 1449492 1474867 1499693 1521004 1536366 1546810 1554244 1557823 1555492 1547499 1535499
$$ packed form
58509C054983l2709l0893k8060k5344k4503k4727k4025k2732k2920k5162k8592
58498B765316l3390m0392m8570n5403n9668o1903o2632o2021o0732n9229n6891
58487B164485n3341m9627m6571m3420l9838l7373l6794l6013l3282l0483l0118
58476A727625l0914k9854k7199k5763k6238k6800k6617k6178k4730k1135j6924
58465A445273j5058j5668j6316j6244j7029j8978k0248j9928j8997j7864j5789
58454A253154j3102j1323j0578r331o898m130j593O90J945J421L04O40K707N416
58440A209322Q521J2085J4749J5335J5285J6693J8862J9854K0285K2167K4859
58429A398017K5957K5518K5375K4826K1311J5362J0444P434L579k331p993j2000
$$ plain form
58417 1535499 1519418 1498068 1472185 1444244 1415695 1386580 1357382 1329066 1301632 1274507 1248066
58406 1248066 1223124 1199475 1176666 1155813 1138867 1126191 1116179 1107127 1098424 1090205 1082813 1076412
58394 1076412 1070664 1065370 1061574 1060852 1063172 1066905 1071271 1076966 1083799 1090007 1095078 1101074 1109700 1120053
58380 1120053 1130864 1143021 1158110 1176174 1196643 1219756 1245260 1271278 1296208 1320140 1342749
58369 1342749 1361574 1374270 1381051 1383227 1381046 1374775 1366134 1356664 1346193 1334548 1322945 1311922
58357 1311922 1300051 1286794 1274612 1265939 1260043 1255346 1252870 1254600 1260007 1266995 1275104 1285289 1297701
58344 1297701 1311929 1328109 1345576 1361765 1374551 1384273 1391548 1394947 1393138 1387444 1379823 1370108 1357720
58331 1357720 1344249 1331648 1319537 1306791 1293966 1281679 1268766 1254829 1242308 1232819 1223681 1211699
$$ packed form
58417A535499j6081k1350k5883k7941k8549k9115k9198k8316k7434k7125k6441
58406A248066k4942k3649k2809k0853j6946j2676j0012r052q703q219p392o401
58394A076412n748n294l796p22K320L733M366N695O833O208N071N996Q626J0353
58380A120053J0811J2157J5089J8064K0469K3113K5504K6018K4930K3932K2609
58369A342749J8825J2696O781K176k181o271q641r470j0471j1645j1603j1023
58357A311922j1871j3257j2182q673n896m697k476J730N407O988Q109J0185J2412
58344A297701J4228J6180J7467J6189J2786R722P275L399j809n694p621r715j2388
58331A357720j3471j2601j2111j2746j2825j2287j2913j3937j2521r489r138j1982
$$ plain form
58319 1211699 1198442 1187898 1180531 1173648 1166532 1161286 1159375 1160881 1166515 1176986 1190915 1206251 1222961
58306 1222961 1241695 1261130 1279521 1297444 1316018 1334021 1350034 1365739 1383568 1402623 1420513
58295 1420513 1437735 1456454 1476380 1495679 1514645 1534593 1554414 1572154 1588644 1605445 1620440
58284 1620440 1629708 1632885 1632700 1630283 1625023 1617952 1611065 1604190 1596612 1590636 1589495 1592925 1598893 1608050
58270 1608050 1621922 1638402 1654084 1669726 1688232 1708681 1727995 1747303 1770556 1797450 1823932
58259 1823932 1849581 1878218 1910765 1943581 1974930 2007568 2043695 2082208 2121927 2162905 2203686
58248 2203686 2241643 2276608 2309958 2340036 2363003 2378356 2389344 2398259 2405908 2414975 2428586 2445701
58236 2445701 2463067 2481264 2503609 2529779 2556392 2583414 2613879 2647576 2681325 2715466 2753681
$$ packed form
58319A211699j3257j0544p367o883p116n246j911J506N634J0471J3929J5336J6710
58306A222961J8734J9435J8391J7923J8574J8003J6013J5705J7829J9055J7890
58295A420513J7222J8719J9926J9299J8966J9948J9821J7740J6490J6801J4995
58284A620440R268L177j85k417n260p071o887o875p578n976j141L430N968R157
58270A608050J3872J6480J5682J5642J8506K0449J9314J9308K3253K6894K6482
58259A823932K5649K8637L2547L2816L1349L2638L6127L8513L9719M0978M0781
58248B203686L7957L4965L3350L0078K2967J5353J0988Q915P649R067J3611J7115
58236B445701J7366J8197K2345K6170K6613K7022L0465L3697L3749L4141L8215
$$ plain form
58225 2753681 2796251 2840012 2885202 2935872 2993259 3055375 3123336 3200970 3287573 3378080 3471183
58214 3471183 3570249 3675515 3782706 3890365 4001081 4114155 4224414 4329778 4432907 4534109
58204 4534109 4630099 4721324 4813228 4908812 5007121 5110320 5224649 5352960 5493742 5648542
58194 5648542 5822403 6015821 6224248 6446390 6684561 6936207 7194685 7460115 7740312
58185 7740312 8039389 8354626 8685759 9037335 9410073 9799820 10206714 10635451 11085493
58176 11085493 11551957 12037397 12551259 13096662 13670232 14276496 14929091 15635498 16393998
58167 16393998 17207800 18087871 19039134 20058471 21149010 22321360 23578552 24916330
58159 24916330 26340911 27869081 29508533 31257375 33125778 35136518 37299432 39606946
$$ packed form
58225B753681M2570M3761M5190N0670N7387O2116O7961P7634Q6603R0507R3103
58214C471183R9066J05266J07191J07659J10716J13074J10259J05364J03129J01202
58204D534109R5990R1225R1904R5584R8309J03199J14329J28311J40782J54800
58194E648542J73861J93418K08427K22142K38171K51646K58478K65430K80197
58185G740312K99077L15237L31133L51576L72738L89747M06894M28737M50042
58176A1085493M66464M85440N13862N45403N73570O06264O52595P06407P58500
58167A6393998Q13802Q80071R51263J019337J090539J172350J257192J337778
58159B4916330J424581J528170J639452J748842J868403K010740K162914K307514
$$ plain form
58151 39606946 42059383 44672144 47455053 50413200 53576945 57006194 60760729 64897415
58143 64897415 69503113 74694918 80577119 87232956 94768839 103330172 113070351 124155065
58135 124155065 136804677 151268039 167731570 186310161 207142645 230462884 256686581
58128 256686581 286653497 321662161 362493325 407461647 451170978 485814464 504664615
58121 504664615 505138251 489214204 461505094 426968262 389636864 352314742 316672530
58114 316672530 283506055 253097015 225511489 200727768 178676618 159275226 142417904
58107 142417904 127924708 115544485 105029681 96177143 88795990 82689693 77690146
58100 77690146 73670694 70512664 68096207 66331624 65164289 64562625 64569659 65353929 67063166
$$ packed form
58151C9606946K452437K612761K782909K958147L163745L429249L754535M136686
58143F4897415M605698N191805N882201O655837P535883Q561333R740179J1084714
58135A24155065J2649612J4463362J6463531J8578591K0832484K3320239K6223697
58128B56686581K9966916L5008664M0831164M4968322M3709331L4643486J8850151
58121E04664615M73636j5924047k7709110l4536832l7331398l7322122l5642212
58114C16672530l3166475l0409040k7585526k4783721k2051150j9401392j6857322
58107A42417904j4493196j2380223j0514804q852538p381153o106297m999547
58100G7690146m019452l158030k416457j764583j167335o01664P034P84270J709237
$$ plain form
58091 67063166 69494172 71923190 73370147 73112485 71005229 67406434 62886236 57980091
58083 57980091 53078478 48413720 44094070 40151545 36578418 33349512 30440493 27837000
58075 27837000 25525560 23481572 21674222 20078530 18674256 17437622 16342872 15368431
58067 15368431 14494607 13700248 12969210 12295397 11674375 11095041 10546315 10026228 9536796
58058 9536796 9075303 8638222 8228418 7850148 7500913 7175483 6873697 6596799 6339681
58049 6339681 6093961 5855935 5625609 5401403 5181776 4968709 4763884 4564731 4369353
58040 4369353 4181578 4005901 3841287 3684997 3538252 3402681 3275391 3153369 3038923
58031 3038923 2934959 2838469 2744504 2653195 2567151 2485077 2403787 2323716 2246945 2172271 2097356
$$ packed form
58091F7063166K431006K429018J446957k57662k107256l598795m520198m906145
58083E7980091m901613m664758m319650l942525l573127l228906k909019k603493
58075B7837000k311440k043988j807350j595692j404274j236634j094750r74441
58067A5368431q73824p94359p31038o73813o21022n79334n48726n20087m89432
58058I536796m61493m37081m09804l78270l49235l25430l01786k76898k57118
58049F339681k45720k38026k30326k24206k19627k13067k04825j99153j95378
58040D369353j87775j75677j64614j56290j46745j35571j27290j22022j14446
58031C038923j03964r6490r3965r1309q6044q2074q1290q0071p6771p4674p4915
$$ plain form
58020 2097356 2023241 1952039 1882931 1815112 1751612 1695175 1643217 1591857 1542120 1497079 1455724
58009 1455724 1415114 1376215 1342109 1312278 1283749 1256186 1231032 1207417 1183838 1162360 1146404
57998 1146404 1135482 1126328 1117787 1110401 1102657 1092043 1078754 1064661 1049919 1034322 1020283 1010354
57986 1010354 1003018 994805 985399 976918 969380 960785 950883 941463 933565 927284 923236 921451 920154 918245
57972 918245 917361 918862 920760 920576 919112 918310 917523 915320 912889 912119 912138 911279 910568 911799 914137 916222
57956 916222 919585 926011 933503 939019 943429 949401 956001 960070 961751 963908 966749 967791 966941 967092 969410
57941 969410 971988 973561 975013 976844 978334 979527 981013 981548 978627 971559 961570 949151 933857 916388
57927 916388 898187 879243 858749 837642 818118 801160 786723 775532 768158 763059 758052 753029
$$ packed form
58020B097356p4115p1202o9108o7819o3500n6437n1958n1360m9737m5041m1355
58009A455724m0610l8899l4106k9831k8529k7563k5154k3615k3579k1478j5956
57998A146404j0922r154q541p386p744j0614j3289j4093j4742j5597j4039r929
57986A010354p336q213r406q481p538q595r902r420p898o281m048j785j297j909
57972I18245q84J501J898j84j464q02p87k203k431p70J9q59p11J231K338K085
57956I16222L363O426P492N516M410N972O600M069J681K157K841J042q50J51K318
57941I69410K578J573J452J831J490J193J486N35k921p068r989j2419j5294j7469
57927I16388j8201j8944k0494k1107j9524j6958j4437j1191p374n099n007n023
$$ plain form
57915 753029 749012 745787 743119 742885 746762 752710 756986 758963 760879 763525 765511 766346 767019 767600 767112
57900 767112 765617 763857 761227 756678 751076 746110 741509 735909 729554 723320 716034 705887 693836 682540
57886 682540 672692 663477 655780 651415 649659 647942 645644 644054 643193 642082 641491 642672 643718 641079 634678
57871 634678 627787 621791 614792 605579 595077 583508 569967 555464 542683 531930 520879 509054
57859 509054 498992 492051 486657 481791 478733 478084 478413 479285 482444 488537 495658 502652 510945 521518
57845 521518 532829 543301 553259 562851 570690 576266 581465 588012 595492 603067 610850 618257 623457 625977
57831 625977 627632 629472 630137 628680 626523 624814 622184 617154 610756 604658 598491 591216 583666 577533
57817 577533 572822 568128 562681 556611 550073 543501 538062 534745 533508 533872 535377 537029 537618 537313 537662
$$ packed form
57915G53029m017l225k668k34L877N948M276J977J916K646J986Q35O73N81m88
57900G67112j495j760k630m549n602m966m601n600o355o234p286j0147j2051j1296
57886F82540r848r215p697m365j756j717k298j590q61j111n91J181J046k639o401
57871F34678o891n996o999r213j0502j1569j3541j4503j2781j0753j1051j1825
57859E09054j0062o941n394m866l058o49L29Q72L159O093P121O994Q293J0573
57845E21518J1311J0472R958R592P839N576N199O547P480P575P783P407N200K520
57831F25977J655J840O65j457k157j709k630n030o398o098o167p275p550o133
57817E77533m711m694n447o070o538o572n439l317j237L64J505J652N89l05L49
$$ plain form
57802 537662 539438 541843 544400 548066 553568 559951 565538 569209 570393 569214 567039 565327 563693 560803
57788 560803 557250 555324 555445 555329 553488 551083 549188 546672 542362 537199 532636 528698 525130 522601 521187
57773 521187 519424 516572 514188 513673 513657 511642 506961 500386 492028 481542 469633 457600 445763 433545
57759 433545 420660 407356 394141 381940 371587 362574 353362 343437 333772 324839 315912 307012 299596
57746 299596 294217 289465 284513 280797 279535 279331 278119 276071 274765 274745 275740 278232 282881 289293 296943
57731 296943 306302 317296 327638 334759 338951 342865 348205 354398 360122 364758 368514 372219 376606 380959
57717 380959 383122 381740 377729 372716 367110 360890 355029 350555 346967 343193 339473 336819 335165 333592
57703 333592 332037 331347 331867 333186 335067 337487 340131 342845 346315 351261 357310 363621 370180 377465 385129
$$ packed form
57802E37662J776K405K557L666N502O383N587L671J184j179k175j712j634k890
57788E60803l553j926J21j16j841k405j895k516m310n163m563l938l568k529j414
57773E21187j763k852k384n15j6k015m681o575q358j0486j1909j2033j1837j2218
57759D33545j2885j3304j3215j2201j0353r013r212r925r665q933q927q900p416
57746B99596n379m752m952l716j262k04j212k048j306k0R95K492M649O412P650
57731B96943R359J0994J0342P121M192L914N340O193N724M636L756L705M387M353
57717C80959K163j382m011n013n606o220n861m474l588l774l720k654j654j573
57703C33592j555o90N20J319J881K420K644K714L470M946O049O311O559P285P664
$$ plain form
57688 385129 392063 397635 402097 405954 409552 413058 416389 419467 422821 427324 433074 439324 445758 452804
57674 452804 460438 467981 475594 484470 494817 505253 515296 526863 541806 559239 576982 594578
57662 594578 613150 633082 653738 675142 698253 723555 750501 778361 806861 836227 867238
57651 867238 900814 937044 975292 1015638 1059176 1106236 1155627 1206592 1260322 1318432 1381073
57640 1381073 1447683 1518415 1593649 1673409 1758672 1852008 1955261 2067700 2188113 2317664
57630 2317664 2458897 2612899 2779454 2959223 3153758 3363943 3590464 3835254 4100184
57621 4100184 4384210 4683500 4994182 5312952 5634745 5951318 6252184 6525688 6759811
57612 6759811 6944615 7075214 7151882 7177532 7156381 7094530 6999173 6875470 6724341 6543517
$$ packed form
57688C85129O934N572M462L857L598L506L331L078L354M503N750O250O434P046
57674D52804P634P543P613Q876J0347J0436J0043J1567J4943J7433J7743J7596
57662E94578J8572J9932K0656K1404K3111K5302K6946K7860K8500K9366L1011
57651H67238L3576L6230L8248M0346M3538M7060M9391N0965N3730N8110O2641
57640A381073O6610P0732P5234P9760Q5263R3336J03253J12439J20413J29551
57630B317664J41233J54002J66555J79769J94535K10185K26521K44790K64930
57621D100184K84026K99290L10682L18770L21793L16573L00866K73504K34123
57612F759811J84804J30599P6668K5650k1151o1851r5357j23703j51129j80824
$$ plain form
57602 6543517 6330382 6084635 5810127 5515172 5210620 4907161 4613920 4338035 4083869
57593 4083869 3852720 3644351 3458736 3295714 3153797 3030813 2925401 2836775 2763466 2703638
57583 2703638 2656277 2620713 2595475 2579343 2573303 2579473 2597690 2624793 2657988 2697683 2746368 2805931
57571 2805931 2876952 2959883 3055691 3165264 3288808 3426291 3578453 3746645 3930912 4128746
57561 4128746 4337152 4555931 4786898 5028758 5274210 5513099 5736691 5937203 6104955
57552 6104955 6229012 6300932 6316575 6275086 6178323 6031408 5842175 5619599 5373147 5112376
57542 5112376 4845101 4576007 4308463 4047228 3797781 3563460 3344930 3142126 2954965
57533 2954965 2782484 2623275 2476824 2342961 2220336 2107239 2003551 1909800 1824597 1745350
$$ packed form
57602F543517k13135k45747k74508k94955l04552l03459k93241k75885k54166
57593D083869k31149k08369j85615j63022j41917j22984j05412q8626p3309n9828
57583B703638m7361l5564k5238j6132o040O170J8217K7103L3195L9695M8685N9563
57571B805931P1021Q2931R5808J09573J23544J37483J52162J68192J84267J97834
57561D128746K08406K18779K30967K41860K45452K38889K23592K00512J67752
57552F104955J24057P1920J5643m1489r6763j46915j89233k22576k46452k60771
57542E112376k67275k69094k67544k61235k49447k34321k18530k02804j87161
57533B954965j72481j59209j46451j33863j22625j13097j03688r3751q5203p9247
$$ plain form
57523 1745350 1671480 1604369 1543743 1486874 1432451 1382724 1340166 1303799 1270516 1238703 1208853
57512 1208853 1181501 1156333 1133125 1112326 1094524 1079736 1067180 1055692 1044771 1035227 1028318 1024441
57500 1024441 1023340 1025228 1030639 1039424 1051133 1066290 1085762 1108590 1131944 1153925 1175497 1199152
57488 1199152 1226606 1258234 1293824 1333171 1376316 1423541 1474967 1530480 1590603 1656844 1730208
57477 1730208 1809848 1894516 1985085 2084069 2192659 2309823 2434658 2568177 2712111 2866979
57467 2866979 3031926 3205590 3386505 3573017 3762787 3951836 4134125 4302576 4450182
57458 4450182 4569730 4653771 4696609 4696293 4653775 4570929 4450942 4299838 4125506 3935159 3735139
57447 3735139 3532466 3334083 3144198 2964079 2794557 2637019 2492099 2359577 2239844
$$ packed form
57523A745350p3870o7111o0626n6869n4423m9727m2558l6367l3283l1813k9850
57512A208853k7352k5168k3208k0799j7802j4788j2556j1488j0921r544o909l877
57500A024441j101J888N411Q785J1709J5157J9472K2828K3354K1981K1572K3655
57488A199152K7454L1628L5590L9347M3145M7225N1426N5513O0123O6241P3364
57477A730208P9640Q4668R0569R8984J08590J17164J24835J33519J43934J54868
57467B866979J64947J73664J80915J86512J89770J89049J82289J68451J47606
57458D450182J19548Q4041M2838l16m2518q2846j19987j51104j74332j90347k00020
57447C735139k02673j98383j89885j80119j69522j57538j44920j32522j19733
$$ plain form
57438 2239844 2133563 2039772 1956453 1883220 1821090 1769174 1724109 1683681 1648702 1620265 1597617
57427 1597617 1580349 1570521 1570441 1579407 1594308 1612692 1634196 1659955 1691810 1731270 1778291 1831703
57415 1831703 1891295 1958533 2034863 2120740 2216852 2324610 2444353 2574372 2712813 2859469
57405 2859469 3014736 3177804 3346612 3518305 3688628 3851610 4000446 4127879 4225683 4285645
57395 4285645 4302445 4274986 4204891 4095238 3951187 3779917 3588578 3383169 3169572 2953800
57385 2953800 2740368 2532076 2332222 2145095 1973084 1815054 1668833 1533691 1409286
57376 1409286 1294232 1187529 1089941 1002189 923012 850510 784135 723773 668215 616290 568339
57365 568339 524887 484942 447286 412315 380777 351683 323342 295663 269561 244783 220181
$$ packed form
57438B239844j06281r3791q3319p3233o2130n1916m5065m0428l4979k8437k2648
57427A597617j7268r828q0Q966J4901J8384K1504K5759L1855L9460M7021N3412
57415A831703N9592O7238P6330Q5877R6112J07758J19743J30019J38441J46656
57405B859469J55267J63068J68808J71693J70323J62982J48836J27433R7804N9962
57395D285645J6800k7459p0095j09653j44051j71270j91339k05409k13597k15772
57385B953800k13432k08292j99854j87127j72011j58030j46221j35142j24405
57376A409286j15054j06703r7588q7752p9177p2502o6375o0362n5558n1925m7951
57365E68339m3452l9945l7656l4971l1538k9094k8341k7679k6102k4778k4602
$$ plain form
57354 220181 195623 171927 149303 127442 106721 87849 70698 54835 40668 28644 17869
57343 17869 6984 -3936 -13820 -22530 -31066 -40075 -49371 -58650 -67523 -75177 -81081 -85662 -89313 -91324
57329 -91324 -90970 -89297 -88698 -90859 -95790 -102299 -108638 -113356 -116433 -119174 -122525 -126295 -130345 -135041 -139816
57314 -139816 -143030 -144480 -146336 -149978 -153610 -155027 -155294 -157293 -161552 -165908 -168736 -170297 -171319 -172418
57300 -172418 -174639 -178538 -182820 -185751 -187727 -190552 -194409 -197573 -199211 -200563 -203133 -207356 -213085 -219710
57286 -219710 -225687 -229722 -232702 -236843 -242623 -248204 -252231 -255459 -258876 -261728 -262542 -261271 -259490 -258802 -259513
57271 -259513 -260604 -260784 -259677 -257737 -254943 -250377 -243757 -236516 -230219 -224404 -217084 -207071 -194863 -181685
57257 -181685 -168562 -155885 -142788 -127324 -108187 -85957 -61958 -36632 -9950 17561 45502 74632
$$ packed form
57354B20181k4558k3696k2624k1861k0721j8872j7151j5863j4167j2024j0775
57343A7869F984c936r884q710q536r009r296r279q873p654n904m581l651k011
57329i1324L54J673N99k161m931o509o339m718l077k741l351l770m050m696m775
57314a39816l214j450j856l642l632j417k67j999m259m356k828j561j022j099
57300a72418k221l899m282k931j976k825l857l164j638j352k570m223n729o625
57286b19710n977m035k980m141n780n581m027l228l417k852q14J271J781O88p11
57271b59513j091j80J107J940K794M566O620P241O297N815P320J0013J2208J3178
57257a81685J3123J2677J3097J5464J9137K2230K3999K5326i950A7561K7941K9130
$$ plain form
57245 74632 105944 139206 173447 207963 241669 272669 300331 326998 355751 386951 418746 450335
57233 450335 482806 517074 553085 590952 631092 673252 717140 763889 815169 870792 928791
57222 928791 987775 1047548 1107391 1165453 1219995 1269838 1313648 1350400 1380489 1404730 1422199
57211 1422199 1430680 1429361 1419456 1401997 1376732 1343687 1304354 1260709 1214017 1164908 1113842 1061548
57199 1061548 1009822 961489 918332 879331 842196 806360 773291 744362 719909 700019 684694
57188 684694 673441 666074 663563 666686 674296 684455 696753 711809 729061 746890 764435 781151
57176 781151 794941 803159 805732 805394 804579 803836 803444 804793 809798 820192 837279 860950 889207 920114
57162 920114 953940 992046 1034485 1080413 1129917 1183224 1238852 1294892 1351372 1408783 1464877
$$ packed form
57245G4632L1312L3262L4241L4516L3706L1000K7662K6667K8753L1200L1795L1589
57233D50335L2471L4268L6011L7867M0140M2160M3888M6749N1280N5623N7999
57222I28791N8984N9773N9843N8062N4542M9843M3810L6752L0089K4241J7469
57211A422199Q481j319r905j7459k5265l3045l9333m3645m6692m9109n1066n2294
57199A061548n1726m8333m3157l9001l7135l5836l3069k8929k4453j9890j5325
57188F84694j1253p367k511L123P610J0159J2298J5056J7252J7829J7545J6716
57176G81151J3790Q218K573l38q15p43l92J349N005J0394J7087K3671K8257L0907
57162I20114L3826L8106M2439M5928M9504N3307N5628N6040N6480N7411N6094
$$ plain form
57151 1464877 1515799 1560191 1599517 1634724 1665544 1692902 1718677 1742791 1763607 1781684 1800272
57140 1800272 1821778 1846755 1876587 1913575 1957257 2003879 2050799 2098643 2147968 2196828 2243245
57129 2243245 2287533 2330491 2371681 2411129 2450681 2491896 2534030 2575109 2613451 2647417 2675605
57118 2675605 2698259 2716980 2732628 2745247 2756052 2767084 2778423 2787921 2793816 2795202 2790064 2776079
57106 2776079 2754107 2728132 2701250 2674341 2648427 2624492 2600298 2571292 2535979 2497044 2456317
57095 2456317 2412625 2365995 2319821 2276634 2235218 2194126 2154811 2118918 2085299 2051702 2016583
57084 2016583 1977316 1929465 1869760 1797416 1711381 1609572 1492233 1362347 1220495 1062162
57074 1062162 881603 675090 438947 168343 -139822 -486176 -872672 -1303779 -1782538
$$ packed form
57151A464877N0922M4392L9326L5207L0820K7358K5775K4114K0816J8077J8588
57140A800272K1506K4977K9832L6988M3682M6622M6920M7844M9325M8860M6417
57129B243245M4288M2958M1190L9448L9552M1215M2134M1079L8342L3966K8188
57118B675605K2654J8721J5648J2619J0805J1032J1339R498N895J386n138j3985
57106B776079k1972k5975k6882k6909k5914k3935k4194k9006l5313l8935m0727
57095B456317m3692m6630m6174m3187m1416m1092l9315l5893l3619l3597l5119
57084B016583l9267m7851n9705p2344q6035j01809j17339j29886j41852j58333
57074A062162j80559k06513k36143A68343a39822l46354l86496m31107m78759
$$ plain form
57065 -1782538 -2309534 -2887290 -3521437 -4216230 -4973930 -5800590 -6707390 -7704208 -8797134
57056 -8797134 -9994306 -11308117 -12749021 -14323702 -16043175 -17927266 -19998270 -22276723
57048 -22276723 -24786685 -27558032 -30619710 -33998699 -37731670 -41873019 -46490205 -51661991
57040 -51661991 -57487751 -64090703 -71606826 -80177666 -89953489 -101084876 -113698648 -127890448
57032 -127890448 -143745954 -161353321 -180777465 -202007862 -224889674 -249058922 -273996170
57025 -273996170 -299315174 -325110222 -351873187 -379733943 -407546373 -432746339 -452293627
57018 -452293627 -463972462 -467049700 -462023660 -449999093 -432269099 -410202093 -385224248
57011 -385224248 -358753600 -332076509 -306186262 -281631599 -258481371 -236472852 -215266389
$$ packed form
57065a782538n26996n77756o34147o94793p57700q26660r06800r96818j092926
57056h797134j197172j313811j440904j574681j719473j884091k071004k278453
57048b2276723k509962k771347l061678l378989l732971m141349m617186n171786
57040e1661991n825760o602952p516123q570840r775823j1131387j2613772j4191800
57032a27890448j5855506j7607367j9424144k1230397k2881812k4169248k4937248
57025b73996170k5319004k5795048k6762965k7860756k7812430k5199966j9547288
57018d52293627j1678835l077238N026040J2024567J7729994K2067006K4977845
57011c85224248K6470648K6677091K5890247K4554663K3150228K2008519K1206463
$$ plain form
57004 -215266389 -194649893 -174610094 -155298798 -136955065 -119822742 -104089842 -89865409
56997 -89865409 -77184132 -66016724 -56280338 -47855916 -40608707 -34400634 -29095105 -24563165
56989 -24563165 -20690392 -17377518 -14536502 -12089527 -9970737 -8125506 -6508204 -5082358
56981 -5082358 -3820803 -2701913 -1705161 -811155 -4183 727407 1392230 1995852 2541719
56972 2541719 3034226 3479913 3884505 4250829 4581327 4880508 5152756 5399662 5622028
56963 5622028 5823142 6007664 6178494 6336981 6484831 6622913 6748718 6857878 6948617 7023063
56953 7023063 7084431 7134869 7176183 7210630 7240024 7264704 7283564 7294465 7295095 7284862 7266389 7244414
56941 7244414 7223259 7206426 7198970 7208403 7239874 7287231 7327558 7326224 7251146 7086119 6833678
$$ packed form
57004b15266389K0616496K0039799J9311296J8343733J7132323J5732900J4224433
56997h9865409J2681277J1167408R736386Q424422P247209O208073N305529M531940
56989b4563165L872773L312874K841016K446975K118790J845231J617302J425846
56981e082358J261555J118890R96752h11155d183G27407O64823O03622N45867
56972B541719M92507M45687M04592L66324L30498K99181K72248K46906K22366
56963E622028K01114J84522J70830J58487J47850J38082J25805J09160R0739P4446
56953G023063O1368N0438M1314L4447K9394K4680J8860J0901O30j0233j8473k1975
56941G244414k1155j6833p456R433L1471M7357M0327j334p5078j65027k52441
$$ plain form
56930 6833678 6508267 6128542 5714380 5286069 4861713 4454074 4070197 3713541 3385718
56921 3385718 3086711 2814824 2567174 2340427 2131489 1938133 1759196 1594345 1443826
56912 1443826 1308222 1187836 1082036 989340 908135 837158 775606 723206 679871 644810 616459
56901 616459 594123 579248 573924 578021 588718 602760 618068 633046 645691 654173 657679 656215
56889 656215 650086 639958 626895 612035 596422 581033 566351 552049 537972 525509 517154 514496
56877 514496 517269 524374 534958 548429 564575 584180 608714 638628 671978 704467 730308 743694
56865 743694 741252 723887 695581 660162 620089 578159 538330 503640 474336 449163 427573 409598
56853 409598 394561 381667 371609 366010 364932 366019 366615 366097 365794 367151 370401 374657 378853 382528
$$ packed form
56930F833678l25411l79725m14162m28311m24356m07639l83877l56656l27823
56921C385718k99007k71887k47650k26747k08938j93356j78937j64851j50519
56912A443826j35604j20386j05800r2696q1205p0977o1552n2400m3335l5061k8351
56901F16459k2336j4875n324M097J0697J4042J5308J4978J2645Q482L506j464
56889F56215o129j0128j3063j4860j5613j5389j4682j4302j4077j2463q355k658
56877E14496K773P105J0584J3471J6146J9605K4534K9914L3350L2489K5841J3386
56865G43694k442j7365k8306l5419m0073m1930l9829l4690k9304k5173k1590j7975
56853D09598j5037j2894j0058n599j078J087N96n18l03J357L250M256M196L675
$$ plain form
56839 382528 385884 389163 392189 394640 396730 399406 403821 410680 420127 432285 447925 468608 496071
56826 496071 531370 574225 622649 673083 721452 764758 801683 831656 853965 868393 876297 880060
56814 880060 881439 880990 879048 876453 874209 873088 873694 876243 880179 884869 891062 901078 917200 940295
56800 940295 970038 1005456 1044509 1083651 1118505 1144979 1159778 1160857 1148448 1125630 1097192 1067547
56788 1067547 1039483 1014290 992590 975142 963001 956736 955722 959065 967464 983215 1007718 1039798
56776 1039798 1077327 1119820 1168216 1222377 1279852 1336698 1388068 1428018 1450669 1452959 1435991
56765 1435991 1403453 1359596 1308977 1256624 1206698 1161099 1120274 1085008 1056444 1034715 1018903
56754 1018903 1008586 1004492 1007384 1017198 1033581 1056514 1086099 1122492 1165998 1215585 1266199 1308569
$$ packed form
56839C82528L356L279L026K451K090K676M415O859R447J2158J5640K0683K7463
56826D96071L5299M2855M8424N0434M8369M3306L6925K9973K2309J4428P904L763
56814H80060J379m49j942k595k244j121O06K549L936M690O193J0016J6122K3095
56800I40295K9743L5418L9053L9142L4854K6474J4799J079j2409k2818k8438k9645
56788A067547k8064k5193k1700j7448j2141o265j014L343Q399J5751K4503L2080
56776A039798L7529M2493M8396N4161N7475N6846N1370L9950K2651K290j6968
56765A435991l2538m3857n0619n2353m9926m5599m0825l5266k8564k1729j5812
56754A018903j0317m094K892R814J6383K2933K9585L6393M3506M9587N0614M2370
$$ plain form
56742 1308569 1333448 1336619 1319812 1287785 1245527 1197394 1146966 1096878 1049169 1005632 967175
56731 967175 933271 903193 877733 858559 845872 838058 833965 834166 839342 848792 861620 878281 899288
56718 899288 922459 942579 954121 954097 942710 922181 895134 863654 829474 794676 761512 731308
56706 731308 704060 679435 657655 639055 623375 610009 598442 588041 578127 568973 562012 557977
56694 557977 555243 551162 545016 538633 534030 531475 530148 529620 529997 531166 532639 533963 534835 535055 534813
56679 534813 534991 536636 539884 543583 546245 547357 547615 547802 547775 546885 545235 543990 544112 545091 545235 543156
56663 543156 538823 533239 527382 521607 515976 510898 507041 504551 502746 500841 498638 496256 493725 491481
56649 491481 490733 492297 495151 497191 497556 497286 497417 497428 496143 493377 490048 487224 485635 485639 486974 488748
$$ packed form
56742A308569K4879L171j6807l2027m2258m8133n0428n0088m7709m3537l8457
56731I67175l3904l0078k5460j9174j2687p814m093K01N176R450J2828J6661K1007
56718H99288K3171K0120J1542k4j1387k0529k7047l1480l4180l4798l3164l0204
56706G31308k7248k4625k1780j8600j5680j3366j1567j0401r914r154o961m035
56694E57977k734m081o146o383m603k555j327n28L77J169J473J324Q72K20k42
56679E34813J78J645L248L699K662J112K58J87k7q90j650j245J22R79J44k079
56663E43156m333n584n857n775n631n078l857k490j805j905k203k382k531k244
56649D91481p48J564K854K040L65k70J31J1j285k766l329k824j589MJ335J774
$$ plain form
56633 488748 490085 490639 490463 489866 489546 490112 491115 491273 490145 488915 488864 489638 489743 488301 485640 482529 479681
56616 479681 477865 477798 479640 482796 486218 488907 490479 491436 492561 494016 495334 496282 497055 497481 496849 494857
56600 494857 492065 489038 485687 481864 477926 474253 470800 467586 464966 462897 460553 457233 453200 449263
56586 449263 446014 443697 442098 440267 437229 433340 430019 427773 425710 423512 422525 423709 425744 426558 425975
56571 425975 425498 426167 428064 431420 436557 442672 447986 451394 453162 453939 453893 452955 451256 449216 447488 446656
56555 446656 446707 447020 447090 446731 445517 442888 439279 436175 434405 433261 431908 430705 430353 430797 431813 433530
56539 433530 435321 435478 433493 431585 432262 435108 437759 439356 441064 443519 445844 447372 448589 449971 451349
56524 451349 452819 454980 457761 460007 460741 460295 460074 461720 466237 473110 480420 486467 491184 495526 500221
$$ packed form
56633D88748J337N54j76n97l20N66J003J58j128j230n1P74J05j442k661l111k848
56616D79681j816o7J842L156L422K689J572R57J125J455J318R48P73M26o32j992
56600D94857k792l027l351l823l938l673l453l214k620k069k344l320m033l937
56586D49263l249k317j599j831l038l889l321k246k063k198r87J184K035Q14n83
56571D25975m77O69J897L356N137O115N314L408J768P77m6r38j699k040j728q32
56555D46656N1L13P0l59j214k629l609l104j770j144j353j203l52M44J016J717
56539D33530J791J57j985j908O77K846K651J597J708K455K325J528J217J382J378
56524D51349J470K161K781K246P34m46k21J646M517O873P310O047M717M342M695
$$ plain form
56509 500221 505837 513001 521192 528005 531284 531753 532190 534266 537581 541492 546221 552039 558767 566304 574613
56494 574613 583113 591037 598219 604651 609798 613551 617212 621940 626697 629551 630786 632773 636633 640835
56480 640835 643360 643482 641104 636181 629611 623156 617577 611851 604925 597284 590314 584964 581420 579166
56466 579166 577008 573792 569411 564598 559880 555505 551944 549300 546513 542475 537743 533801 530781 527472
56452 527472 523480 519743 516687 513521 509722 505810 502277 499024 496146 494047 492494 490748 488825 487451
56438 487451 486679 485782 484514 483276 482280 481945 483684 488305 493718 496442 495715 494142 493942 494681 495258 495903
56422 495903 497216 499035 501264 504227 507427 509662 511130 513555 517329 520449 521567 522235 524553 528143
56408 528143 531151 533175 535527 539296 544529 550840 557655 564159 569716 574121 577337 579711 582438 586549
$$ packed form
56509E00221N616P164Q191O813L279M69M37K076L315L911M729N818O728P537Q309
56494E74613Q500P924P182O432N147L753L661M728M757K854J235J987L860M202
56480F40835K525J22k378m923o570o455n579n726o926p641o970n350l544k254
56466E79166k158l216m381m813m718m375l561k644k787m038m732l942l020l309
56452E27472l992l737l056l166l799l912l533l253k878k099j553j746j923j374
56438D87451p72q97j268j238r96l35J739M621N413K724p27j573k00P39N77O45
56422D95903J313J819K229K963L200K235J468K425L774L120J118O68K318L590
56408E28143L008K024K352L769N233O311O815O504N557M405L216K374K727M111
$$ plain form
56394 586549 591229 594482 595715 596167 596432 595387 592400 588923 586738 585919 585480 584925 584357 584197 585407 588647
56378 588647 592599 594545 593357 590471 587365 583939 580184 577366 576100 574952 572518 569493 567227 565529
56364 565529 563355 560478 557135 553182 548922 545538 543321 540629 536052 530564 526120 523177 520990 519206
56350 519206 517649 515576 512842 510976 511494 513793 516211 518435 521264 524569 527166 528558 529453 530609 532162
56335 532162 533927 535580 536810 537854 539432 541667 543739 545110 546269 547683 548957 549685 550125 550326 549575
56320 549575 547475 544673 541941 539545 537910 537603 538069 538000 537672 539216 543554 548681 552210 554035 555251
56305 555251 556113 556643 557853 560661 564568 568777 573438 578538 582947 586108 589420 594343 600181 605215 608914
56290 608914 611545 612908 613095 613498 615385 618405 621844 626156 631749 637611 642867 648443 655346 662495 668307
$$ packed form
56394E86549M680L253J233M52K65j045k987l477k185q19m39n55n68j60J210L240
56378E88647L952J946j188k886l106l426l755k818j266j148k434l025k266j698
56364E65529k174k877l343l953m260l384k217k692m577n488m444k943k187j784
56350E19206j557k073k734j866N18K299K418K224K829L305K597J392Q95J156J553
56335E32162J765J653J230J044J578K235K072J371J159J414J274P28M40K01p51
56320E49575k100k802k732k396j635l07M66o9l28J544M338N127L529J825J216
56305E55251Q62N30J210K808L907M209M661N100M409L161L312M923N838N034L699
56290F08914K631J363J87M03J887L020L439M312N593N862N256N576O903P149N812
$$ plain form
56275 668307 673343 679276 686147 692950 700268 709972 722381 735596 747695 758138 767340 776330 786515
56262 786515 798393 810752 822198 833009 844504 857298 871232 886136 901551 916626 931375
56251 931375 946867 962991 977428 988355 996929 1005390 1013969 1021419 1027404 1032370 1035999 1037841 1038820
56238 1038820 1040359 1042710 1045655 1049940 1056313 1064052 1072114 1080862 1091177 1102991 1116393 1132863 1153377
56225 1153377 1176344 1199433 1222545 1247168 1273957 1302963 1335174 1371627 1411811 1454853 1501317
56214 1501317 1551942 1605904 1662490 1723283 1790342 1863344 1940941 2023804 2113788 2211091 2314949
56203 2314949 2426407 2547816 2680323 2824217 2980765 3150985 3333478 3526364 3730641
56194 3730641 3948666 4179830 4420666 4668754 4923403 5182527 5441754 5696595 5942720
$$ packed form
56275F68307N036N933O871O803P318R704J2409J3215J2099J0443R202Q990J0185
56262G86515J1878J2359J1446J0811J1495J2794J3934J4904J5415J5075J4749
56251I31375J5492J6124J4437J0927Q574Q461Q579P450N985M966L629J842R79
56238A038820J539K351K945M285O373P739Q062Q748J0315J1814J3402J6470K0514
56225A153377K2967K3089K3112K4623K6789K9006L2211L6453M0184M3042M6464
56214A501317N0625N3962N6586O0793O7059P3002P7597Q2863Q9984R7303J03858
56203B314949J11458J21409J32507J43894J56548J70220J82493J92886K04277
56194C730641K18025K31164K40836K48088K54649K59124K59227K54841K46125
$$ plain form
56185 5942720 6174023 6383313 6565530 6718250 6839140 6925366 6975807 6991825 6975835 6930902
56175 6930902 6861259 6770988 6662406 6537636 6401072 6257966 6111173 5961466 5810127 5658441
56165 5658441 5505409 5348995 5189455 5028731 4866969 4702489 4535015 4366247 4197451
56156 4197451 4029037 3862105 3697727 3535209 3373924 3216451 3066942 2926700 2794302
56147 2794302 2669448 2553340 2445475 2343584 2247079 2157563 2075803 2001047 1933209 1872685
56137 1872685 1818116 1767443 1721043 1680581 1644925 1610611 1576418 1544134 1514831 1487941 1464139
56126 1464139 1445306 1430985 1418303 1405974 1395225 1386522 1378854 1372634 1369699 1369898 1371161 1373434 1378929
56113 1378929 1387883 1397788 1407573 1418880 1432380 1446457 1460483 1475814 1492609 1509188 1525378 1542822
$$ packed form
56185E942720K31303K09290J82217J52720J20890Q6226N0441J6018j5990m4933
56175F930902o9643r0271j08582j24770j36564j43106j46793j49707j51339j51686
56165E658441j53032j56414j59540j60724j61762j64480j67474j68768j68796
56156D197451j68414j66932j64378j62518j61285j57473j49509j40242j32398
56147B794302j24854j16108j07865j01891r6505q9516q1760p4756o7838o0524
56137A872685n4569n0673m6400m0462l5656l4314l4193l2284k9303k6890k3802
56126A464139j8833j4321j2682j2329j0749q703p668o220k935J99J263K273N495
56113A378929Q954R905R785J1307J3500J4077J4026J5331J6795J6579J6190J7444
$$ plain form
56101 1542822 1561068 1577177 1590354 1603051 1616262 1627740 1636589 1645679 1657445 1670737 1683998 1698464
56089 1698464 1716038 1736622 1759373 1784301 1811276 1840060 1872432 1911612 1958512 2011298 2069496
56078 2069496 2135587 2211766 2298489 2397140 2510636 2639908 2782707 2936697 3100269 3269248
56068 3269248 3436493 3596401 3746961 3886659 4013178 4126576 4230195 4326609 4415033 4492870
56058 4492870 4556064 4597704 4611274 4597417 4564063 4518622 4463423 4398959 4326213 4243755 4147142
56047 4147142 4033810 3905315 3763828 3611053 3452263 3296513 3150202 3014110 2888296
56038 2888296 2775198 2675824 2587705 2509460 2443151 2389538 2345057 2306129 2272549 2244168 2218257
56027 2218257 2192750 2168439 2145894 2124158 2104334 2089912 2081248 2074096 2065847 2058782 2055083 2053493
$$ packed form
56101A542822J8246J6109J3177J2697J3211J1478Q849R090J1766J3292J3261J4466
56089A698464J7574K0584K2751K4928K6975K8784L2372L9180M6900N2786N8198
56078B069496O6091P6179Q6723R8651J13496J29272J42799J53990J63572J68979
56068C269248J67245J59908J50560J39698J26519J13398J03619R6414Q8424P7837
56058D492870O3194M1640J3570j3857l3354m5441n5199o4464p2746q2458r6613
56047D147142j13332j28495j41487j52775j58790j55750j46311j36092j25814
56038B888296j13098r9374q8119p8245o6309n3613m4481l8928l3580k8381k5911
56027B218257k5507k4311k2545k1736j9824j4422q664p152q249p065l699j590
$$ plain form
56015 2053493 2053335 2056850 2064872 2075032 2086766 2103051 2124530 2147220 2168863 2192117 2218357 2243989
56003 2243989 2266464 2288476 2312452 2336178 2357748 2379617 2403925 2428957 2453963 2482054 2514381
55992 2514381 2546910 2577039 2607916 2642045 2676428 2708621 2741914 2779746 2820530 2862884 2910262
55981 2910262 2965154 3024124 3083968 3147548 3218218 3293646 3370481 3450004 3533916 3619762 3705858
55970 3705858 3795680 3892085 3992217 4093030 4196598 4305217 4417122 4531867 4653721 4784719
55960 4784719 4920852 5060291 5208536 5370208 5543129 5726083 5924278 6140581 6369268
55951 6369268 6605350 6852169 7112836 7382712 7658108 7944109 8245761 8560115 8885333
55942 8885333 9228731 9596546 9984342 10386762 10807957 11252826 11717363 12198250 12703001
$$ packed form
56015B053493j58L515Q022J0160J1734J6285K1479K2690K1643K3254K6240K5632
56003B243989K2475K2012K3976K3726K1570K1869K4308K5032K5006K8091L2327
55992B514381L2529L0129L0877L4129L4383L2193L3293L7832M0784M2354M7378
55981B910262N4892N8970N9844O3580P0670P5428P6835P9523Q3912Q5846Q6096
55970C705858Q9822R6405J00132J00813J03568J08619J11905J14745J21854J30998
55960D784719J36133J39439J48245J61672J72921J82954J98195K16303K28687
55951F369268K36082K46819K60667K69876K75396K86001L01652L14354L25218
55942H885333L43398L67815L87796M02420M21195M44869M64537M80887N04751
$$ plain form
55933 12703001 13240078 13808298 14406975 15046802 15738969 16483096 17277709 18132447 19057434
55924 19057434 20051013 21111001 22247240 23469583 24774959 26160684 27639061 29224733
55916 29224733 30920899 32733552 34684913 36795223 39065335 41494775 44101306 46904775
55908 46904775 49911622 53139736 56642788 60489377 64740962 69477463 74821421 80904576
55900 80904576 87829854 95693812 104618401 114729997 126149444 139056924 153741569
55893 153741569 170548873 189828658 211984508 237497942 266824483 300359451 338555594
55886 338555594 381652959 428490345 475111056 514889533 540901676 549002635 539259331
55879 539259331 515011219 480866836 441194879 399501988 358286842 319094558 282752285
$$ packed form
55933A2703001N37077N68220N98677O39827O92167P44127P94613Q54738R24987
55924A9057434R93579J059988J136239J222343J305376J385725J478377J585672
55916B9224733J696166J812653J951361K110310K270112K429440K606531K803469
55908D6904775L006847L228114L503052L846589M251585M736501N343958O083155
55900H0904576O925278P863958Q924589J0111596J1419447J2907480J4684645
55893A53741569J6807304J9279785K2155850K5513434K9326541L3534968L8196143
55886C38555594M3097365M6837386M6620711L9778477K6012143Q100959r743304
55879E39259331k4248112l4144383l9671957m1692891m1215146l9192284l6342273
$$ plain form
55872 282752285 249670485 220024326 193811290 170898684 151073361 134046674 119458762
55865 119458762 106943921 96200811 86984613 79060442 72203994 66233093 61003321 56381464
55857 56381464 52251359 48535382 45182020 42138096 39353626 36802186 34471231 32338063
55849 32338063 30374622 28566989 26909269 25385089 23974289 22671104 21476730 20379149
55841 20379149 19357455 18400876 17507254 16668057 15871275 15115136 14403795 13732868 13092742
55832 13092742 12482212 11905650 11360624 10841064 10348704 9888845 9458255 9049111 8661332
55823 8661332 8299456 7960817 7638228 7331039 7042564 6769842 6507004 6255775 6021924
55814 6021924 5803902 5595276 5395603 5208489 5031269 4857030 4685390 4521807 4367651
$$ packed form
55872B82752285l3081800k9646159k6213036k2912606j9825323j7026687j4587912
55865A19458762j2514841j0743110r216198p924171o856448n970901n229772m621857
55857E6381464m130105l715977l353362l043924k784470k551440k330955k133168
55849C2338063j963441j807633j657720j524180j410800j303185j194374j097581
55841B0379149j021694r56579q93622q39197p96782p56139p11341o70927o40126
55832A3092742o10530n76562n45026n19560m92360m59859m30590m09144l87779
55823H661332l61876l38639l22589l07189k88475k72722k62838k51229k33851
55814F021924k18022k08626j99673j87114j77220j74239j71640j63583j54156
$$ plain form
55805 4367651 4219601 4077016 3941250 3809485 3677734 3548297 3426410 3311660 3200560
55796 3200560 3095005 2999704 2913301 2830482 2751072 2678756 2612282 2546103 2478546 2411775 2345189
55785 2345189 2276575 2208474 2145715 2087720 2030500 1974881 1925293 1881670 1840104 1800490 1766081
55774 1766081 1736220 1706790 1677179 1649699 1622866 1592483 1558877 1525974 1493656 1458113 1419466
55763 1419466 1381831 1345926 1308793 1271225 1238311 1211696 1187817 1164765 1144636 1127982 1111941
55752 1111941 1095250 1079837 1066362 1053235 1040874 1031921 1026408 1021552 1017051 1015820 1018747 1023250 1027698
55739 1027698 1032848 1038496 1042998 1046375 1049576 1050726 1046670 1038349 1029931 1022391 1012623 999126 983770
55726 983770 967441 948761 927966 907692 889096 871221 854605 841452 831772 823477 816541 812810
$$ packed form
55805D367651j48050j42585j35766j31765j31751j29437j21887j14750j11100
55796C200560j05555r5301q6403q2819p9410p2316o6474o6179o7557o6771o6586
55785B345189o8614o8101o2759n7995n7220n5619m9588m3623m1566l9614l4409
55774A766081k9861k9430k9611k7480k6833l0383l3606l2903l2318l5543l8647
55763A419466l7635l5905l7133l7568l2914k6615k3879k3052k0129j6654j6041
55752A111941j6691j5413j3475j3127j2361q953n513m856m501j231K927M503M448
55739A027698N150N648M502L377L201J150m056q321q418p540r768j3497j5356
55726I83770j6329j8680k0795k0274j8596j7875j6616j3153r680q295o936l731
$$ plain form
55714 812810 811372 808519 802932 796717 790776 783313 773465 762367 750251 736723 724289 717085 715346
55701 715346 715363 715605 718400 724568 730835 733919 733242 728364 717828 702144 684334 666018 646048 623988
55687 623988 601565 579643 557258 534660 513957 495665 477903 460050 443988 430798 419373
55676 419373 409149 401089 395288 390795 388221 388994 391561 392191 390203 388455 387886 385942 381677 377914 376402
55661 376402 374850 371033 366227 362230 358285 353329 348388 344379 340145 334858 329978 326903 325066 324107
55647 324107 325406 329559 334671 339071 343623 349654 356728 364089 372127 380710 388124 393284 397129 400529
55633 400529 402908 404335 406741 411390 416986 421691 425226 427908 429742 431615 435025 439201 440861 438478
55619 438478 434580 432071 430481 427797 423968 420281 416817 412782 408373 404403 400780 396862 392749 389193
$$ packed form
55714H12810j438k853n587o215n941p463r848j1098j2116j3528j2434p204j739
55701G15346J7K42K795O168O267L084o77m878j0536j5684j7810j8316j9970k2060
55687F23988k2423k1922k2385k2598k0703j8292j7762j7853j6062j3190j1425
55676D19373j0224q060n801m493k574P73K567O30j988j748n69j944m265l763j512
55661C76402j552l817m806l997l945m956m941m009m234n287m880l075j837r59
55647C24107J299M153N112M400M552O031P074P361Q038Q583P414N160L845L400
55633D00529K379J427K406M649N596M705L535K682J834J873L410M176J660k383
55619D38478l898k509j590k684l829l687l464m035m409l970l623l918m113l556
$$ plain form
55605 389193 386809 385976 386594 387541 387635 387499 388996 392393 395678 397228 397496 397580 397851 398553 400032 401707 402379
55588 402379 401891 400814 398452 393377 386185 379253 373259 366410 357768 348598 339549 329347 317702 306951
55574 306951 299008 292772 286132 278785 271714 265676 261355 259134 257512 253702 246995 239655 233479 227598
55560 227598 220860 214127 208681 204379 200878 198748 197940 197058 195528 194462 194007 192110 187675 182812 180053
55545 180053 179224 178914 179113 180275 181428 181431 180861 180774 180867 180553 180393 180700 180244 178256 176337 176336 177575 178207 178212 178966
55525 178966 180652 182174 183091 183963 185164 186589 187970 188523 187267 184717 183048 183435 184482 184494 183881 183876 184296
55508 184296 184331 184455 185859 188836 193098 198626 204780 209701 212185 213247 214488 215916 216707 216853 216471 214650
55492 214650 210656 205485 200714 196693 193178 190590 189167 187991 186482 185731 186644 187911 187651 186201 185328
$$ packed form
55605C89193k384q33O18R47R4j36J497L397L285J550K68Q4K71P02J479J675O72
55588D02379m88j077k362n075p192o932n994o849q642r170r049j0202j1645j0751
55574C06951p943o236o640p347p071o038m321k221j622l810o707p340o176n881
55560B27598o738o733n446m302l501k130q08q82j530j066m55j897m435m863k759
55545A80053q29l10J99J162J153Ln70q7R3l14j60L07m56j988j919jJ239O32NP54
55525A78966J686J522R17Q72J201J425J381N53j256k550j669L87J047J2o13nM20
55508A84296L5J24J404K977M262N528O154M921K484J062J241J428P91J46l82j821
55492B14650l994n171m771m021l515k588j423j176j509p51R13J267k60j450q73
$$ plain form
55477 185328 185375 185107 183826 181928 179862 178219 178346 181147 185534 189484 192259 194308 195569 195451 194222
55462 194222 193073 193038 194748 198533 203494 207225 207941 206442 204725 203232 200798 196837 192013 186973 181641
55447 181641 175680 168756 160659 151936 143890 137216 131337 125835 121529 119119 117710 115831 113090 109790
55433 109790 105850 101357 97225 94039 91099 87852 85186 83909 83007 81125 78950 78343 79732 82019 84479
55418 84479 86957 88650 88600 87373 86679 87247 88369 89474 90804 92361 93339 92919 91015 88192 85308 83025
55402 83025 81279 79570 77891 76672 75777 74689 73997 75193 78352 81526 83323 84592 86635 89331 92057
55387 92057 94751 96891 97230 95933 95084 95534 95342 93176 90905 90249 89128 84650 78294 74477 74711 76520
55371 76520 77798 78882 80212 81074 81292 81760 82808 84137 86419 90684 95956 99827 101628 102809 103949
$$ packed form
55477A85328M7k68j281j898k066j643J27K801M387L950K775K049J261j18j229
55462A94222j149l5J710L785M961L731P16j499j717j493k434l961m824n040n332
55447A81641n961o924q097q723q046o674n879n502m306k410j409j879k741l300
55433A09790l940m493m132l186k940l247k666j277r02j882k175o07J389K287K460
55418H4479K478J693n0j227o94N68J122J105J330J557R78m20j904k823k884k283
55402H3025j746j709j679j219q95j088o92J196L159L174J797J269K043K696K726
55387I2057K694K140L39j297q49M50j92k166k271o56j121m478o356l817K34J809
55371G6520J278J084J330Q62K18M68J048J329K282M265N272L871J801J181J140
$$ plain form
55356 103949 103876 102296 100926 101064 101862 101830 100477 97927 94613 91867 91140 92055 92738 92397 91991 92112 92142 91983
55338 91983 92583 93880 94072 92078 89226 87448 87009 87011 87011 87200 87760 88728 89759 89827 88218 86079 85632 87408
55320 87408 89533 90298 90102 90052 89877 88291 84767 80185 76234 74512 75495 78025 80318 81651 82464 83077
55304 83077 83370 83638 84395 85095 84317 81642 78315 75798 74653 74944 76398 77820 77585 75337 72307 69755
55288 69755 68127 67813 69184 71411 72746 72842 73572 76493 80498 83065 83268 82480 82408 83314 84216 84289 83646 82632
55270 82632 80673 76772 71618 68139 68696 72246 75562 76913 77109 77281 77446 77523 78151 79796 82049 84220
55254 84220 85781 86162 85178 83670 82620 81695 80007 78194 78027 79710 81352 81796 82312 84566 88136 91008
55238 91008 91613 89660 86001 82426 80763 81409 83261 85242 87029 88120 87589 85470 83366 82907 84184
$$ packed form
55356A03949p3j580j370J38P98l2j353k550l314k746p27R15O83l41m06J21L0j59
55338I1983O00J297J92j994k852j778m39K%J89N60R68J031O8j609k139m47J776
55320H7408K125P65j96n0j75j586l524m582l951j722R83K530K293J333Q13O13
55304H3077K93K68P57P00p78k675l327k517j145K91J454J422k35k248l030k552
55288F9755j628l14J371K227J335R6P30K921M005K567K03p88p2R06R02P3o43j014
55270H2632j959l901n154l479N57L550L316J351J96J72J65P7O28J645K253K171
55254H4220J561L81r84j508j050r25j688j813j67J683J642M44N16K254L570K872
55238I1008O05j953l659l575j663O46J852J981J787J091n31k119k104m59J277
$$ plain form
55223 84184 86079 87372 87319 86131 85179 85780 87456 88404 87819 86557 85318 83737 81791 80588 80899 81981
55207 81981 82654 82570 81854 80675 79745 79988 80933 80668 78284 75296 73757 73944 74751 75305 75292 74745 74555 76139
55189 76139 79466 82213 82101 79521 76770 75226 74314 72948 70995 69336 69027 70262 72015 73126 73709
55174 73709 74704 76090 76841 76897 77666 79787 81871 82498 82238 82458 83275 84114 85383 87944 91256 93509 93574
55157 93574 91808 89128 86288 84010 82943 83281 84813 87183 89863 92264 94205 95758 96421 95244 92244
55142 92244 88920 86728 85737 85340 85435 86213 87582 89461 91903 94281 95318 94732 93834 93511 92626 89759 85696
55125 85696 82737 82004 82831 84322 86001 87083 86685 85140 83906 83738 83780 82946 81579 81278 83194 86711
55109 86711 89803 90911 90487 90292 91122 91871 91085 88674 85682 83182 81917 82182 83258 83641 82620 81064
$$ packed form
55223H4184J895J293n3j188r52O01J676R48n85j262j239j581j946j203L11J082
55207H1981O73q4p16j179r30K43R45k65k384k988j539J87Q07N54j3n47j90J584
55189G6139L327K747j12k580k751j544r12j366j953j659l09J235J753J111N83
55174G3709R95J386P51N6P69K121K084O27k60K20Q17Q39J269K561L312K253O5
55157I3574j766k680k840k278j067L38J532K370K680K401J941J553O63j177l000
55142I2244l324k192r91l97R5P78J369J879K442K378J037n86q98l23q85k867m063
55125H5696k959p33Q27J491J679J082l98j545j234j68M2q34j367l01J916L517
55109H6711L092J108m24j95Q30P49p86k411k992k500j265K65J076L83j021j556
$$ plain form
55093 81064 80013 79293 78272 77125 76277 75435 74432 74387 76579 80419 83881 85880 87029 88179 89350 90209
55077 90209 90586 90461 90276 91143 93702 96854 98679 98648 97884 97265 96592 95945 96435 98683 101505 103194 103603
55060 103603 103972 104940 105711 105305 103897 102496 101792 101808 102423 103547 104692 104988 104010 102226 100298 98501 97354
55043 97354 98098 101412 105944 109425 111300 113064 115812 118851 121189 122974 124616 125678 125787 125708 126380 127543
55027 127543 128359 128813 129452 130303 131080 132037 133536 135141 136150 136713 137467 138340 138676 138323 137673 136897 136118 136127
55009 136127 137806 140838 143865 145977 147294 148175 148724 149043 149182 148780 147473 145688 144316 143596 143013 142280
54993 142280 141692 141363 140703 138943 135948 132518 130055 129540 130445 130984 129927 127835 126119 125484 125878 127305
54977 127305 129708 132451 134867 136964 138702 139020 136806 132720 128921 126961 126887 128179 130312 132279 132921
$$ packed form
55093H1064j051p20j021j147q48q42j003m5K192L840L462J999J149J150J171Q59
55077I0209L77j25j85Q67K559L152J825l1p64o19o73o47M90K248K822J689M09
55060A03603L69R68P71m06j408j401p04J6O15J124J145K96r78j784j928j797j147
55043I7354P44L314M532L481J875J764K748L039K338J785J642J062J09p9O72J163
55027A27543Q16M54O39Q51P77R57J499J605J009N63P54Q73L36l53o50p76p79R
55009A36127J679L032L027K112J317Q81N49L19J39m02j307j785j372p20n83p33
54993A42280n88l29o60j760k995l430k463n15R05N39j057k092j716o35L94J427
54977A27305K403K743K416K097J738L18k214m086l799j960p4J292K133J967O42
$$ plain form
54962 132921 132335 131986 132857 134195 134697 134304 134130 134793 135345 134102 130619 126690 124870 125751 127354 127708 127245
54945 127245 127715 129537 131649 133574 135871 138323 139427 138533 137228 137446 138988 139990 139407 137958 136636
54930 136636 135205 132673 128949 125526 124231 125390 127602 129387 130502 131291 131554 131067 130868 132732 137027
54915 137027 141971 145521 147461 149245 152133 155808 158547 158669 156120 152769 150916 151554 154246 158248 163032
54900 163032 167895 172002 175145 177922 181027 184912 190167 197459 206675 216736 226715 236715 247232
54887 247232 258009 268179 277557 287377 299414 314296 330808 346913 361255 373263 382014 385967
54875 385967 384243 377542 367214 354175 339451 324861 311741 299251 285398 269887 254742 241961
54863 241961 231886 224365 219879 218249 217126 213412 206377 198506 193131 191729 193425 196291 198775 200514
$$ packed form
54962A32921n86l49Q71J338N02l93j74O63N52j243l483l929j820Q81J603L54m63
54945A27245M70J822K112J925K297K452J104q94j305K18J542J002n83j449j322
54930A36636j431k532l724l423j295J159K212J785J115P89K63m87j99J864M295
54915A37027M944L550J940J784K888L675K739J22k549l351j853O38K692M002M784
54900A63032M863M107L143K777L105L885N255P292R216J0061R979J0000J0517
54887B47232J0777J0170R378R820J2037J4882J6512J6105J4342J2008Q751L953
54875C85967j724o701j0328j3039j4724j4590j3120j2490j3853j5511j5145j2781
54863B41961j0075p521m486j630j123l714p035p871n375j402J696K866K484J739
$$ plain form
54849 200514 202446 206014 211766 218628 224953 230395 236351 244434 255116 268222 283892 301818 319879
54836 319879 335050 346058 353829 358886 359781 355137 345992 334604 321754 306914 290669 275206 262120
54823 262120 251054 240819 230795 220970 211642 203491 197100 192014 187002 181601 176605 172748 169688
54810 169688 166806 164368 163157 163174 163217 161803 158382 153734 149211 145537 142524 140037 138691 139103 140793
54795 140793 142451 143122 142639 141254 139566 138586 139032 140510 141932 142601 142347 141011 138538 135418 132264 129217
54779 129217 126451 124795 124774 125463 125536 125200 125696 127013 127679 127079 126352 126417 126572 125992 125409 126263 128874 132290
54761 132290 135353 137320 138136 138711 140283 142844 144917 145578 145978 147969 151785 156032 159599 162549 165233
54746 165233 167564 169556 171905 175468 180332 185720 190922 196054 201643 207678 213664 219776 227228 236935
$$ packed form
54849B00514J932L568N752O862O325N442N956Q083J0682J3106J5670J7926J8061
54836C19879J5171J1008P771N057Q95m644r145j1388j2850j4840j6245j5463j3086
54823B62120j1066j0235j0024r825r328q151o391n086n012n401m996l857l060
54810A69688k882k438j211J7M3j414l421m648m523l674l013k487j346M12J690
54795A40793J658O71m83j385j688r80M46J478J422O69k54j336k473l120l154l047
54779A29217k766j656k1O89P3l36M96J317O66o00p27O5J55n80n83Q54K611L416
54761A32290L063J967Q16N75J572K561K073O61M00J991L816M247L567K950K684
54746A65233K331J992K349L563M864N388N202N132N589O035N986O112P452R707
$$ plain form
54732 236935 248443 260893 274553 290346 308146 326652 344834 362367 378574 392080 401858 407770
54720 407770 409888 408169 403019 395400 386200 376170 366300 357143 347861 337242 325772 315272 306275
54707 306275 297467 288305 280525 276074 274979 276331 279965 285714 292142 297780 303151 310129 319488 330144
54693 330144 340592 350190 359428 369835 383215 399983 418509 436867 454689 472368 489045 502681
54681 502681 512003 517162 518488 515749 508889 498582 485640 470545 453789 436128 418102 399611
54669 399611 380303 360421 341171 324041 309498 296468 283680 271413 261058 252795 244875 235980
54657 235980 227352 221520 219376 219524 220148 220427 220255 219579 218356 216654 214672 212768 211181 209433 206633
54642 206633 202931 200062 199552 200801 201811 201590 200966 201211 202828 205649 209154 212400 214360 214746 214301 214236
$$ packed form
54732B36935J1508J2450J3660J5793J7800J8506J8182J7533J6207J3506R778N912
54720D07770K118j719n150p619r200j0030r870r157r282j0619j1470j0500q997
54707C06275q808r162p780m451j095J352L634N749O428N638N371O978R359J0656
54693C30144J0448R598R238J0407J3380J6768J8526J8358J7822J7679J6677J3636
54681E02681R322N159J326k739o860j0307j2942j5095j6756j7661j8026j8491
54669C99611j9308j9882j9250j7130j4543j3030j2788j2267j0355q263p920q895
54657B35980q628n832k144J48O24K79j72o76j223j702j982j904j587j748k800
54642B06633l702k869n10J249J010k21o24K45J617K821L505L246J960L86m45o5
$$ plain form
54626 214236 215531 218445 222230 225541 227607 228838 229928 230802 231058 231013 231498 232825 234668 236755 238958
54611 238958 240926 242457 244216 247304 252143 258373 265642 273775 282362 291074 300272 310367 320626 329546
54597 329546 336356 341199 343979 344536 344288 346142 351645 359134 365707 370399 374461 379230 385037 392066 400953
54582 400953 412016 424642 437986 451925 466818 482431 497404 509943 518968 524429 526486 524539
54570 524539 517497 505058 488429 469529 449741 429733 410214 392198 376310 362225 349176 336968
54558 336968 326274 317948 312206 308382 305270 301743 297407 292841 289044 286542 285187 284833 285879 288885
54544 288885 293704 299082 302948 303278 299374 292736 286147 281257 277235 272174 265479 258305 252088 247457
54530 247457 244279 241792 238699 234036 228213 222588 218007 214405 211624 209585 207615 204840 201560 199091
$$ packed form
54626B14236J295K914L785L311K066J231J090Q74K56m5M85J327J843K087K203
54611B38958J968J531J759L088M839O230P269Q133Q587Q712R198J0095J0259Q920
54597C29546O810M843K780N57k48J854N503P489O573M692M062M769N807P029Q887
54582D00953J1063J2626J3344J3939J4893J5613J4973J2539R025N461K057j947
54570E24539p042j2439j6629j8900j9788k0008j9519j8016j5888j4085j3049j2208
54558C36968j0694q326n742l824l112l527m336m566l797k502j355l54J046L006
54544B88885M819N378L866L30l904o638o589m890m022n061o695p174o217m631
54530B47457l178k487l093m663n823n625m581l602k781k039j970k775l280k469
$$ plain form
54516 199091 197736 195971 192453 187923 184295 182436 181657 180870 179518 177712 176106 175447 175860 176745 177452 177545
54500 177545 176515 174215 171828 171295 173185 176010 178125 179308 180014 180331 180585 181650 183524 184667 184149
54485 184149 183506 185014 188884 193645 198566 203951 209464 214013 217276 219915 222431 225282 229900 237639
54471 237639 247458 256396 262936 268419 274497 280638 285122 287393 288280 288472 287718 285275 280636 273979 266175
54456 266175 258117 250108 242317 235581 230792 227382 223426 217711 211077 205246 200866 197054 192568 187186
54442 187186 182210 179479 179417 180322 180292 179596 180120 182613 185751 188123 189740 190951 191155 189734 187556 186306
54426 186306 186566 187368 187565 186940 185942 184994 184363 184479 185991 189315 194068 199150 203549 206912 209243 210515
54410 210515 211009 211591 212935 214663 215875 216300 216225 215650 214502 213683 214748 218129 222395 225576 226654 225593
$$ packed form
54516A99091j355j765l518m530l628j859p79p87j352j806j606o59M13Q85P07R3
54500A77545j030k300k387n33J890K825K115J183P06L17K54J065J874J143n18
54485A84149o43J508L870M761M921N385N513M549L263K639K516K851M618P739
54471B37639R819Q938O540N483O078O141M484K271Q87J92p54k443m639o657p804
54456B66175q058q009p791o736m789l410l956n715o634n831m380l812m486n382
54442A87186m976k731o2R05l0o96N24K493L138K372J617J211K04j421k178j250
54426A86306K60Q02J97o25r98r48o31J16J512L324M753N082M399L363K331J272
54410B10515M94N82J344J728J212M25p5n75j148q19J065L381M266L181J078j061
$$ plain form
54394 225593 222730 218612 214016 209759 206633 205307 205710 206652 206792 206007 205171 204768 204630 204856 205747 206613 205914
54377 205914 203139 199618 197016 195947 196396 198213 200341 200651 197906 193446 189889 188370 187912 187269 186422
54362 186422 186142 186834 188290 190258 192778 195729 198276 199365 199092 199068 200746 203737 206518 208514 210603
54347 210603 213697 217900 222926 228270 232937 236325 239585 244713 251851 258787 263721 267214 270708 274460
54333 274460 277948 281204 284552 287961 291665 296457 302170 306764 308253 306924 304471 301714 298602 295709
54319 295709 293810 292051 288339 281904 274249 267230 261294 255895 250546 244994 239180 233515 228781 225532
54305 225532 223915 223826 224580 224819 223763 222432 222423 223422 223294 221094 218699 218595 220973 223968 226120 227503 228828
54288 228828 230572 233116 236865 241750 246956 251511 255147 258507 262544 267628 273131 277911 281337 283786
$$ packed form
54394B25593k863m118m596m257l126j326M03R42J40p85q36m03j38K26Q91Q66o99
54377B05914k775l521k602j069M49J817K128L10k745m460l557j519m58o43q47
54362A86422k80O92J456J968K520K951K547J089k73k4J678K991K781J996K089
54347B10603L094M203N026N344M667L388L260N128P138O936M934L493L494L752
54333B74460L488L256L348L409L704M792N713M594J489j329k453k757l112k893
54319B95709j899j759l712o435p655p019n936n399n349n552n814n665m734l249
54305B25532j617q9P54K39j056j331rR99j28k200k395j04K378K995K152J383J325
54288B28828J744K544L749M885N206M555L636L360M037N084N503M780L426K449
$$ plain form
54274 283786 286041 288315 290086 290889 290952 290695 289760 287081 282337 276937 272811 270146 266969 261395 253864
54259 253864 246712 241734 238665 235952 232462 228219 223762 219124 213625 206653 198478 190181 182951 177616
54245 177616 174500 173099 171956 169613 166006 162363 159517 156942 153848 150481 147628 145367 143153 140984
54231 140984 139615 139575 140517 141616 142142 141508 139306 135648 131440 128119 126915 128038 130492 132918 134754
54216 134754 136326 137877 139098 139808 140435 141375 142438 143443 144844 147074 149671 151772 153153 154078 154456
54201 154456 154048 153348 153281 153961 154531 154436 154113 154199 154809 155935 157856 160589 163369 165256 166121 166559 166936 166979
54183 166979 166469 166014 166636 168446 170120 170155 168551 166636 165190 163586 161203 158913 158331 160034 163300 167222
54167 167222 171094 173925 174791 173954 172830 172442 172395 171554 169199 165454 161270 158106 156932 157231 157593 157503 157902
$$ packed form
54274B83786K255K274J771Q03O3k57r35k679m744n400m126k665l177n574p531
54259B53864p152m978l069k713l490m243m457m638n499o972q175q297p230n335
54245A77616l116j401j143k343l607l643k846k575l094l367k853k261k214k169
54231A40984j369m0R42J099N26o34k202l658m208l321j204J123K454K426J836
54216A34754J572J551J221P10O27R40J063J005J401K230K597K101J381R25L78
54201A54456m08p00o7O80N70r5l23Q6O10J126J921K733K780J887Q65M38L77M3
54183A66979n10m55O22J810J674L5j604j915j446j604k383k290n82J703L266L922
54167A67222L872K831Q66q37j124l88m7q41k355l745m184l164j174K99L62r0L99
$$ plain form
54150 157902 159739 162716 165801 168121 168827 166952 162425 156804 152100 149088 147440 147023 148015 149881 151380
54135 151380 151946 152211 152771 153158 152544 150909 149032 147732 147566 148792 150951 152740 152955 151584 149608 147899
54119 147899 146802 146512 147107 148133 148889 149241 149438 148997 146795 142800 138891 137084 137464 138688 140009 141740
54103 141740 143987 146113 147506 147992 147467 146081 144864 144998 146285 147452 148320 150311 154042 157764 159450
54088 159450 159557 160296 162668 165534 167310 167208 165045 161408 158263 157838 160098 162333 162072 159680 157298
54073 157298 155994 155086 153922 153021 153032 153350 152480 149698 145866 142501 140322 139043 138464 139080 141067 143055
54057 143055 142920 140169 136862 135403 135715 135374 132641 128554 125681 125426 127260 130113 133458 136841 139315
54042 139315 140052 139167 137522 135995 135226 135443 135933 135236 132759 129933 128801 129614 130857 131563 132368 133961
$$ packed form
54150A57902J837K977L085K320P06j875m527n621m704l012j648m17R92J866J499
54135A51380N66K65N60L87o14j635j877j300j66J226K159J789K15j371j976j709
54119A47899j097k90N95J026P56L52J97m41k202l995l909j807L80J224J321J731
54103A41740K247K126J393M86n25j386j217J34J287J167Q68J991L731L722J686
54088A59450J07P39K372K866J776j02k163l637l145m25K260K235k61k392k382
54073A57298j304r08j164r01J1L18q70k782l832l365k179j279n79O16J987J988
54057A43055j35k751l307j459L12l41k733m087k873k55J834K853L345L383K474
54042A39315P37q85j645j527p69K17M90o97k477k826j132Q13J243P06Q05J593
$$ plain form
54026 133961 135717 136642 136829 137197 138351 140263 142514 144338 144966 144442 143487 142222 140009 137243 136103 138164
54010 138164 141983 144512 144683 144198 144867 146484 147700 147875 147600 147970 149606 151923 153348 152873 151369 150772
53994 150772 152059 154681 157788 161057 164341 167530 170996 175319 180334 185217 189670 193990 197702 199297
53980 199297 198295 196819 198051 203203 210604 217670 223278 228282 234189 241635 250116 259018 268327 277949
53966 277949 286853 293816 299039 304081 309923 315936 321069 325240 328965 332363 335289 337923 340416 342280
53952 342280 342973 342976 343463 344760 345801 345399 343569 341209 338777 335801 331727 326836 322044 317972 314604 311811
53936 311811 309734 308303 306788 304444 301533 299155 297822 296607 293984 289404 283901 279180 276164 274352
53922 274352 272548 270185 267739 265868 264533 263262 261965 261044 260825 261228 261963 262807 263782 265167 267016 268556
$$ packed form
54026A33961J756R25J87L68J154J912K251J824O28n24r55j265k213k766j140K061
54010A38164L819K529J71m85O69J617J216J75k75L70J636K317J425m75j504n97
53994A50772J287K622L107L269L284L189L466M323N015M883M453M320L712J595
53980A99297j002j476J232N152P401P066N608N004N907P446Q481Q902R309R622
53966B77949Q904O963N223N042N842O013N133M171L725L398K926K634K493J864
53952C42280O93LM87J297J041m02j830k360k432k976m074m891m792m072l368k793
53936C11811k077j431j515k344k911k378j333j215k623m580n503m721l016j812
53922B74352j804k363k446j871j335j271j297r21k19M03P35Q44R75J385J849J540
$$ plain form
53906 268556 268653 267306 266099 266513 268293 270217 271910 273789 275537 275969 274648 272549 270740 269303 267993
53891 267993 267247 267929 270367 273895 277158 278920 279049 278682 278985 280026 281473 283933 288461 294826 301443
53876 301443 307262 312673 318422 324706 331513 338583 344689 348277 349428 349883 350464 349839 346836 342706 339817
53861 339817 339130 340305 343394 348646 355021 360600 364700 368502 373395 379614 386622 393911 401228 408559
53847 408559 416079 423815 431532 439235 447322 455648 462959 468058 471155 473359 475242 476740 478033 479321
53833 479321 479854 478300 474232 468562 462517 456839 451783 447062 441993 436539 431810 428356 424282 416613
53819 416613 404737 391159 378622 367960 359126 352390 347265 341677 333947 325026 317347 311813 307143
53806 307143 301903 295846 289188 281846 273925 266272 260018 255816 253569 252543 251757 250656 249351 247824
$$ packed form
53906B68556R7j347j207M14J780J924J693J879J748M32j321k099j809j437j310
53891B67993p46O82K438L528L263J762J29l67L03J041J447K460M528O365O617
53876C01443N819N411N749O284O807P070O106L588J151M55N81o25l003m130k889
53861C39817o87J175L089N252O375N579M100L802M893O219P008P289P317P331
53847D08559P520P736P717P703Q087Q326P311N099L097K204J883J498J293J288
53833D79321N33j554m068n670o045n678n056m721n069n454m729l454m074p669
53819D16613j1876j3578j2537j0662q834o736n125n588p730q921p679n534m670
53806C07143n240o057o658p342p921p653o254m202k247j026p86j101j305j527
$$ plain form
53792 247824 245299 241113 236058 231871 229248 227286 225209 223536 222778 221970 219746 216454 213858 212690 211843
53777 211843 210478 209810 211801 216481 221381 223500 221466 216203 210296 206545 206269 208601 211574 213856 215213
53762 215213 215781 215718 215571 216162 217842 220393 223730 227864 231941 234290 234160 232798 231995 232024 231941 231662 232615
53745 232615 236068 241561 247472 252706 257350 261848 266006 269021 270544 271524 273768 278567 285904 294994
53731 294994 305039 315128 323944 330440 334938 338970 343753 349032 353608 356819 359399 362867 367960 373597
53717 373597 377615 378793 378022 377253 377587 378637 379426 379266 377847 375117 371298 366698 361460 355787 350297
53702 350297 345669 341942 338664 335715 333415 331788 330434 329312 328900 329266 329702 329772 329883 330085 329055 325425
53686 325425 319831 314546 311053 308963 307285 305578 303604 301054 298335 296563 295862 294559 291156 286511
$$ packed form
53792B47824k525m186n055m187k623j962k077j673p58q08k224l292k596j168q47
53777B11843j365o68J991M680M900K119k034n263n907l751k76K332K973K282J357
53762B15213N68o3j47N91J680K551L337M134M077K349j30j362q03K9q3k79R53
53745B32615L453N493N911N234M644M498M158L015J523R80K244M799P337R090
53731B94994J0045J0089Q816O496M498M032M783N279M576L211K580L468N093N637
53717C73597M018J178p71p69L34J050P89j60j419k730l819m600n238n673n490
53702C50297m628l727l278k949k300j627j354j122m12L66M36P0J11K02j030l630
53686C25425n594n285l493k090j678j707j974k550k719j772p01j303l403m645
$$ plain form
53672 286511 282800 280718 279165 277562 276777 277341 278303 278875 280016 283086 287511 291042 292115 291051 289153
53657 289153 287654 287475 288988 291779 295325 299972 306484 314515 322420 328961 334536 340226 346117 351158
53643 351158 354453 356324 358150 361407 366696 373505 380894 388300 395654 403041 410594 418503 426609 434222
53629 434222 441013 447909 456215 465682 474221 479903 482601 483480 483755 484545 487118 492144 498652 504462 508022
53614 508022 509725 511374 514310 517983 520447 520467 518895 517640 517558 518044 518448 518871 519347 519179 517702 515200
53598 515200 512606 510681 509707 509508 509595 509681 510031 510710 510734 509028 506259 504376 504018 503800 502799 502133 503043 504759
53580 504759 505694 505690 505483 504789 502726 499762 497582 497037 497565 498460 499387 499727 498935 497794 498137 500989 505899
53563 505899 511931 518197 523494 526975 529490 532994 538189 543910 549179 554502 560533 566797 572698 578812
$$ packed form
53672B86511l711k082j553j603p85N64R62N72J141L070M425L531J073j064j898
53657B89153j499j79J513K791L546M647O512Q031P905O541N575N690N891N041
53643C51158L295J871J826L257N289O809P389P406P354P387P553P909Q106P613
53629D34222O791O896Q306R467Q539N682K698Q79K75P90K573N026O508N810L560
53614E08022J703J649K936L673K464K0j572j255q2M86M04M23M76j68j477k502
53598E15200k594j925r74j99Q7Q6L50O79K4j706k769j883l58k18j001o66R10J716
53580E04759R35mk07o94k063k964k180n45N28Q95R27L40p92j141L43K852M910
53563E05899O032O266N297L481K515L504N195N721N269N323O031O264N901O114
$$ plain form
53549 578812 586015 593933 601297 607601 613702 620941 630210 641629 654713 668884 683859 699270 714091
53536 714091 727246 738892 750212 761657 772358 781790 791020 801436 812968 824495 835501 846376
53524 846376 857359 868144 878499 888569 898495 908219 917653 926624 934761 941752 947570 952199 955603
53511 955603 958320 961505 965591 969244 970585 969451 967694 967225 968504 970958 973899 976595 978230 978547 978178
53496 978178 977770 977112 975679 973784 972464 972248 972662 973082 973431 973840 974322 975191 977079 979792 981651 981023 978350
53479 978350 975750 974592 974642 975740 978905 984946 992972 1001421 1009820 1018410 1026644 1033590 1039884 1047947 1059838
53464 1059838 1075583 1093711 1112606 1131221 1149488 1168530 1189846 1213877 1239747 1266478 1293815
53453 1293815 1321808 1350505 1380521 1413157 1449217 1488051 1528262 1569110 1610883 1654179 1699225
$$ packed form
53549E78812P203P918P364O304O101P239R269J1419J3084J4171J4975J5411J4821
53536G14091J3155J1646J1320J1445J0701R432R230J0416J1532J1527J1006J0875
53524H46376J0983J0785J0355J0070R926R724R434Q971Q137O991N818M629L404
53511I55603K717L185M086L653J341j134j757m69J279K454K941K696J635L17l69
53496I78178m08o58j433j895j320k16M14M20L49M09M82Q69J888K713J859o28k673
53479I78350k600j158N0J098L165O041Q026Q449Q399Q590Q234O946O294Q063J1891
53464A059838J5745J8128J8895J8615J8267J9042K1316K4031K5870K6731K7337
53453A293815K7993K8697L0016L2636L6060L8834M0211M0848M1773M3296M5046
$$ plain form
53442 1699225 1745861 1794089 1844589 1898458 1956057 2016457 2078443 2141662 2205959 2270224 2333319
53431 2333319 2396155 2461149 2528998 2597314 2663410 2727446 2791773 2858012 2925751 2993503 3059911
53420 3059911 3124399 3187598 3250900 3314999 3379250 3442989 3506665 3570664 3633640 3693290 3748580
53409 3748580 3800177 3848845 3894544 3937073 3976546 4012984 4046257 4076586 4104458 4129988 4152958
53398 4152958 4173311 4190876 4204789 4214227 4219708 4222593 4223068 4219737 4211513 4198730 4181721 4159464 4130711
53385 4130711 4095885 4056789 4014738 3970006 3922932 3874483 3825289 3774724 3721359 3664165 3603176
53374 3603176 3539432 3474528 3410039 3346930 3285391 3225205 3166270 3108734 3052851 2998966 2947733
53363 2947733 2900091 2856700 2817367 2781297 2748207 2719111 2695734 2678949 2667809 2660234 2654809 2651956
$$ packed form
53442A699225M6636M8228N0500N3869N7599O0400O1986O3219O4297O4265O3095
53431B333319O2836O4994O7849O8316O6096O4036O4327O6239O7739O7752O6408
53420C059911O4488O3199O3302O4099O4251O3739O3676O3999O2976N9650N5290
53409C748580N1597M8668M5699M2529L9473L6438L3273L0329K7872K5530K2970
53398D152958K0353J7565J3913R438N481K885M75l331q224j2783j7009k2257k8753
53385D130711l4826l9096m2051m4732m7074m8449m9194n0565n3365n7194o0989
53374C603176o3744o4904o4489o3109o1539o0186n8935n7536n5883n3885n1233
53363B947733m7642m3391l9333l6070l3090k9096k3377j6785j1140p575n425k853
$$ plain form
53351 2651956 2653329 2660090 2672148 2689154 2711530 2739738 2772940 2809647 2849911 2895550 2947366 3003173
53339 3003173 3059905 3117161 3177384 3242854 3313981 3390463 3472265 3558598 3647394 3737230 3829242
53328 3829242 3926047 4029110 4138081 4252250 4371394 4495144 4622625 4753145 4886580 5022844
53318 5022844 5161654 5303113 5447749 5595375 5744332 5892434 6038454 6182305 6324148
53309 6324148 6463889 6601245 6735571 6865470 6989041 7104720 7211768 7310061 7399707 7480815
53299 7480815 7553344 7617283 7673103 7721586 7762517 7793822 7812921 7819034 7813378 7796993 7769423 7729967
53287 7729967 7679066 7617334 7543863 7456646 7354643 7238686 7110582 6972307 6826157 6674816
53277 6674816 6520914 6366760 6214200 6063901 5914833 5765504 5616128 5468843 5325416
$$ packed form
53351B651956J373O761J2058J7006K2376K8208L3202L6707M0264M5639N1816N5807
53339C003173N6732N7256O0223O5470P1127P6482Q1802Q6333Q8796Q9836R2012
53328C829242R6805J03063J08971J14169J19144J23750J27481J30520J33435J36264
53318E022844J38810J41459J44636J47626J48957J48102J46020J43851J41843
53309F324148J39741J37356J34326J29899J23571J15679J07048R8293Q9646Q1108
53299G480815P2529O3939N5820M8483M0931L1305J9099O113n656j6385k7570l9456
53287G729967n0901o1732p3471q7217j02003j15957j28104j38275j46150j51341
53277F674816j53902j54154j52560j50299j49068j49329j49376j47285j43427
$$ plain form
53268 5325416 5185407 5047147 4910016 4775096 4643906 4517178 4394996 4277761 4166748
53259 4166748 4063507 3968559 3880853 3798810 3721765 3649971 3583464 3521722 3464439 3411715 3363124
53248 3363124 3317501 3274361 3234979 3201299 3174013 3152259 3134869 3121201 3110826 3103143 3097593 3094027
53236 3094027 3092764 3094357 3099176 3106977 3116937 3128336 3141269 3156662 3175510 3198033 3223521 3251240
53224 3251240 3281729 3316814 3357775 3403785 3452902 3504415 3559198 3617711 3678863 3741365 3804988
53213 3804988 3869574 3933694 3995573 4055053 4113593 4172368 4230957 4287719 4340772 4388902 4432265
53202 4432265 4472147 4509438 4543503 4573060 4597702 4617682 4632610 4641554 4644338 4641582 4633209 4618100
53190 4618100 4595719 4567098 4533487 4494726 4449694 4397844 4339527 4275148 4204893 4129339 4049743
$$ packed form
53268E325416j40009j38260j37131j34920j31190j26728j22182j17235j11013
53259D166748j03241r4948q7706q2043p7045p1794o6507o1742n7283n2724m8591
53248C363124m5623m3140l9382l3680k7286k1754j7390j3668j0375p683n550l566
53236C094027j263J593M819P801R960J1399J2933J5393J8848K2523K5488K7719
53224C251240L0489L5085M0961M6010M9117N1513N4783N8513O1152O2502O3623
53213C804988O4586O4120O1879N9480N8540N8775N8589N6762N3053M8130M3363
53202D432265L9882L7291L4065K9557K4642J9980J4928Q944K784k756q373j5109
53190D618100k2381k8621l3611l8761m5032n1850n8317o4379p0255p5554p9596
$$ plain form
53179 4049743 3967635 3884448 3801421 3719183 3637245 3554437 3470394 3386426 3304571 3225844 3149759
53168 3149759 3075463 3002743 2931744 2862322 2794256 2727807 2663423 2600934 2539512 2478337 2416845
53157 2416845 2354603 2291899 2230546 2173134 2120944 2073220 2028722 1987014 1947638 1909166 1870325
53146 1870325 1831457 1793669 1756835 1719816 1682536 1646438 1612464 1579775 1547081 1514269 1481848
53135 1481848 1449512 1416395 1382671 1349865 1319156 1289803 1259754 1227843 1195080 1163595 1134515
53124 1134515 1107222 1080653 1054642 1029542 1005073 980447 955660 931775 909516 887983 865367
53113 865367 840822 815396 791104 769291 749792 731454 713336 695480 678662 663547 650088
53102 650088 637704 625937 614937 605215 596845 588994 580466 570715 560241 550160 541533 534771 529208
$$ packed form
53179D049743q2108q3187q3027q2238q1938q2808q4043q3968q1855p8727p6085
53168C149759p4296p2720p0999o9422o8066o6449o4384o2489o1422o1175o1492
53157B416845o2242o2704o1353n7412n2190m7724m4498m1708l9376l8472l8841
53146A870325l8868l7788l6834l7019l7280l6098l3974l2689l2694l2812l2421
53135A481848l2336l3117l3724l2806l0709k9353l0049l1911l2763l1485k9080
53124A134515k7293k6569k6011k5100k4469k4626k4787k3885k2259k1533k2616
53113H65367k4545k5426k4292k1813j9499j8338j8118j7856j6818j5115j3459
53102F50088j2384j1767j1000r722q370p851q528r751j0474j0081q627o762n563
$$ plain form
53089 529208 523489 517011 510825 506341 503266 499932 495851 492610 491467 491254 489801 486637 482995 479673
53075 479673 476355 472844 469500 466223 462386 458287 455531 455107 455798 455424 453421 451399 451126 452517 453918
53060 453918 454121 453621 453797 455220 457299 459362 461260 462776 463485 463835 465485 469514 474795 479253 482489
53045 482489 485970 490590 495154 497668 497307 494667 490731 486102 480943 475279 469363 463665 458300 452729
53031 452729 446450 439778 433357 427111 420344 412910 405603 399271 394011 389317 384668 379969 375603 371805
53017 371805 367802 362213 354857 347420 341507 336818 332354 328649 327037 327014 326276 323639 320225 317296 314706
53002 314706 312212 310639 310496 310715 310181 309627 310621 313200 315731 316838 316387 314815 312452 309562 306348 302838
52986 302838 299131 295594 292587 290327 289219 289703 291418 293151 294148 294787 295356 294964 292590 288673 284674
$$ packed form
53089E29208n719o478o186m484l075l334m081l241j143k13j453l164l642l322
53075D79673l318l511l344l277l837m099k756m24O91l74k003k022k73J391J401
53060D53918K03n00J76J423K079K063J898J516P09L50J650M029N281M458L236
53045D82489L481M620M564K514l61k640l936m629n159n664n916n698n365n571
53031D52729o279o672o421o246o767p434p307o332n260m694m649m699m366l798
53017C71805m003n589p356p437n913m689m464l705j612k3p38k637l414k929k590
53002C14706k494j573j43K19n34n54R94K579K531J107m51j572k363k890l214l510
52986C02838l707l537l007k260j108M84J715J733R97O39N69l92k374l917l999
$$ plain form
52971 284674 281386 278601 276154 274287 273013 272014 271162 270369 268907 265771 260979 255908 252087 250057 249501
52956 249501 249849 250412 250330 248852 245876 242272 239666 239474 241585 244087 244850 243573 242035 242225 244396 246981
52940 246981 248184 247627 246586 246744 248685 251555 253998 255228 255329 254998 255173 256546 259056 261912 264203
52925 264203 265373 265270 264225 263139 262997 264053 265871 268155 270937 273897 276394 278596 281652 285985 290233
52910 290233 292993 295120 298982 305427 312663 318421 322277 325443 329213 334349 341256 349677 358209 365024
52896 365024 369426 372316 374918 377445 379394 380723 381987 383295 383855 383017 381315 379983 379619 379687 379125 377006
52880 377006 372984 367706 362717 359277 357196 355204 352360 348647 344416 339974 335758 332248 329667 328168
52866 328168 328027 328855 328959 326742 322925 320169 320092 321601 322618 322405 321621 321047 321172 322378 324668 327481
$$ packed form
52971B84674l288k785k447j867j274r99q52p93j462l136m792n071l821k030n56
52956B49501L48N63q2j478k976l604k606j92K111K502P63j277j538J90K171K585
52940B46981J203n57j041J58J941K870K443J230J01l31J75J373K510K856K291
52925B64203J170j03j045j086j42J056J818K284K782K960K497K202L056M333M248
52910B90233K760K127L862O445P236N758L856L166L770N136O907Q421Q532O815
52896C65024M402K890K602K527J949J329J264J308N60q38j702j332l64O8n62k119
52880C77006m022n278m989l440k081j992k844l713m231m442m216l510k581j499
52866C28168j41Q28J04k217l817k756p7J509J017k13p84n74J25J206K290K813
$$ plain form
52850 327481 330148 332138 332841 331973 330553 330436 332297 334932 336996 338376 339260 339234 338370 338015 339107 340563
52834 340563 340755 339854 339229 339138 338767 338270 338979 341304 344021 346138 348221 351178 354632 357224 358147 357933 357869
52817 357869 358709 359837 359960 358875 358037 358850 360934 362847 364008 364959 366092 367303 368794 371116 374235
52802 374235 377387 380004 382186 384302 386765 389997 393870 397287 399011 398850 397571 396178 395993 398579 404188
52787 404188 410704 415621 418929 422583 427298 431724 435065 438642 443982 450754 457604 463968 470067 475870
52773 475870 480928 484714 486539 485767 482697 478627 474556 470324 465367 459628 453285 446364 439090 432036
52759 432036 425469 419209 413332 408191 403444 398148 392319 387264 383557 379911 375125 370142 366707 364637
52745 364637 362010 357923 353558 350287 348023 345978 344045 342664 341766 340527 338106 334265 329364 324030
$$ packed form
52850C27481K667J990P03q68j420j17J861K635K064J380Q84k6q64l55J092J456
52834C40563J92r01o25r1l71m97P09K325K717K117K083K957L454K592R23k14o4
52817C57869Q40J128J23j085q38Q13K084J913J161R51J133J211J491K322L119
52802C74235L152K617K182K116K463L232L873L417J724j61j279j393j85K586N609
52787D04188O516M917L308L654M715M426L341L577N340O772O850O364O099N803
52773D75870N058L786J825p72l070m070m071m232m957n739o343o921p274p054
52759D32036o567o260n877n141m747n296n829n055l707l646m786m983l435k070
52745C64637k627m087m365l271k264k045j933j381q98j239k421l841m901n334
$$ plain form
52731 324030 318936 314720 311807 310120 309012 307739 306023 304033 301951 299854 297895 296210 294653 292986
52717 292986 291247 289540 287526 284658 280924 276858 272889 269253 266451 265035 264843 265106 265384 265660 265593 264681
52701 264681 263349 262799 263351 263904 263467 262250 260701 258590 255752 252724 249723 245924 240801 235322 230754
52686 230754 227080 223856 221848 222110 223795 224586 223460 221552 219927 217865 214005 208216 201691 195871 191756
52671 191756 189580 188581 187570 186163 185163 185482 187216 190000 193535 197198 199761 200367 199659 199248 200043 201585
52655 201585 202981 203898 204454 204654 204333 203358 201552 198687 195079 192087 191320 193094 196094 198783 200650 201775
52639 201775 202018 201563 201896 205011 211358 219273 226622 232405 236735 240268 243970 248514 253296 256765 258321
52624 258321 259168 260635 262327 262833 261677 259637 257431 255047 252235 248864 244856 240460 236442 233307 230451
$$ packed form
52731C24030n094m216k913j687j108j273j716j990k082k097j959j685j557j667
52717B92986j739j707k014k868l734m066l969l636k802j416j92K63K78K76o7r12
52701B64681j332n50N52N53m37j217j549k111k838l028l001l799n123n479m568
52686B30754l674l224k008K62J685P91j126j908j625k062l860n789o525n820m115
52671A91756k176r99j011j407j000L19J734K784L535L663K563O06p08m11P95J542
52655B01585J396R17N56K00l21r75j806k865l608k992p67J774L000K689J867J125
52639B01775K43m55L33L115O347P915P349N783M330L533L702M544M782L469J556
52624B58321Q47J467J692N06j156k040k206k384k812l371m008m396m018l135k856
$$ plain form
52609 230451 226743 221841 216277 210564 205091 200664 197960 196235 193651 189256 183854 178616 173853 169721
52595 169721 167150 167008 168712 170574 171504 171862 172635 174261 176149 177055 176038 173342 170244 167752 165685
52580 165685 163376 161048 159960 161181 164578 168985 172958 175408 176055 175608 175258 175694 176677 177632 178354 178908
52564 178908 179154 178824 178064 177453 177343 177442 177269 176833 176590 176837 177411 177918 177984 177242 175425 172782 170308 169171
52546 169171 169714 171116 172220 172686 173210 174649 177128 180092 182936 185390 187456 189232 190647 191096 189738
52531 189738 186733 183935 183455 185367 187660 188728 189030 189838 191382 193168 195319 198306 201744 204746 207347
52516 207347 210334 213614 216061 217325 218633 221222 224954 229092 233486 238105 242166 244826 246429 248048
52502 248048 249815 250585 249569 247679 246763 247618 249250 250287 250805 252174 255071 258388 260568 261366 261566 261579
$$ packed form
52609B30451l708m902n564n713n473m427k704j725k584m395n402n238m763m132
52595A69721k571j42J704J862R30L58P73J626J888R06j017k696l098k492k067
52580A65685k309k328j088J221L397M407L973K450O47m47l50M36R83R55P22N54
52564A78908K46l30p60o11j10R9j73m36k43K47N74N07O6p42j817k643k474j137
52546A69171N43J402J104M66N24J439K479K964K844K454K066J776J415M49j358
52531A89738l005k798m80J912K293J068L02Q08J544J786K151K987L438L002K601
52516B07347K987L280K447J264J308K589L732M138M394M619M061K660J603J619
52502B48048J767P70j016j890r16Q55J632J037N18J369K897L317K180P98K00J3
$$ plain form
52486 261579 261403 261586 262816 264470 264892 263557 261972 262002 264094 267302 270054 270774 269101 266990 267294 270489
52470 270489 273998 275436 275224 275101 275514 275913 276452 277658 279054 279672 279572 279553 279770 279895 280144 280833 281355 281054
52452 281054 280663 281280 282182 281426 278658 275679 273988 273367 273226 273722 274824 275652 275599 275108 274693 274139 273345 272960
52434 272960 273395 273973 273798 272887 271897 271387 271975 274448 278909 284165 288625 291535 292988 293286 292989 293157 294768
52417 294768 297794 301245 304070 305827 306581 306438 305278 303124 300823 299812 300597 301748 301280 299054 296955
52402 296955 296674 298185 300553 303242 306181 309404 313111 317419 321680 324794 326621 328258 330359 332067
52388 332067 332311 331503 331128 332159 334501 337475 340167 341850 342797 344159 346357 348113 347940 345999 343450
52373 343450 340537 336667 332198 328640 326680 325157 322619 319143 316042 314362 314163 314784 315242 314686 313111
$$ packed form
52486B61579j76J83J230J654M22j335j585L0K092L208K752P20j673k111L04L195
52470B70489L509J438k12j23M13L99N39J206J396O18j00j9K17J25K49O89N22l01
52452B81054l91O17R02p56k768k979j691o21j41M96J102Q28n3m91m15n54p94l85
52434B72960M35N78j75r11r90n10N88K473M461N256M460K910J453K98k97J68J611
52417B94768L026L451K825J757P54j43j160k154k301j011P85J151m68k226k099
52402B96955k81J511K368K689K939L223L707M308M261L114J827J637K101J708
52388C32067K44q08l75J031K342K974K692J683R47J362K198J756j73j941k549
52373C43450k913l870m469l558j960j523k538l476l101j680j99O21M58n56j575
$$ plain form
52358 313111 311591 311445 313084 315760 318228 319531 319387 318319 317467 317940 320063 323230 326546 329536 332161
52343 332161 334255 335390 335556 335729 337187 340086 343043 344497 344323 343878 344481 346147 347865 348994 350122
52328 350122 352419 356220 360518 364078 366697 368991 371115 372466 372860 373351 375240 378531 381927 384422 386448
52313 386448 389246 393342 397903 401642 404180 406334 409077 412487 416015 419549 423665 428712 434184 439373
52299 439373 444293 449487 454993 460000 463733 466465 469431 473695 479110 484415 488383 490984 493351 496528
52285 496528 500306 503556 505829 508290 512586 518778 525030 529629 532757 535701 538874 541697 544196 547422
52271 547422 551879 556708 561036 565103 569263 572928 575663 578580 583211 589403 595719 601782 608810 617692
52257 617692 627775 637861 647380 656369 665349 675500 687819 701609 714759 726069 736554 748101
$$ packed form
52358C13111j520j46J639K676K468J303j44j068q52M73K123L167L316K990K625
52343C32161K094J135J66J73J458K899K957J454j74m45O03J666J718J129J128
52328C50122K297L801M298L560K619K294K124J351L94M91J889L291L396K495K026
52313C86448K798M096M561L739K538K154K743L410L528L534M116N047N472N189
52299D39373M920N194N506N007L733K732K966M264N415N305L968K601K367L177
52285D96528L778L250K273K461M296O192O252M599L128K944L173K823K499L226
52271E47422M457M829M328M067M160L665K735K917M631O192O316O063P028Q882
52257F17692J0083J0086R519Q989Q980J0151J2319J3790J3150J1310J0485J1547
$$ plain form
52245 748101 761794 777918 796377 816230 835788 854327 873262 894805 919732 947075 975519
52234 975519 1004413 1033769 1064018 1095602 1128305 1161229 1193683 1225714 1257457 1288635 1319155
52223 1319155 1349605 1380473 1411322 1441192 1469341 1495156 1518026 1538034 1556246 1573655 1590378
52212 1590378 1606402 1622194 1637478 1650153 1657942 1661145 1662700 1665404 1669751 1674289 1677077 1676733 1673099
52199 1673099 1667338 1661015 1655000 1649544 1644978 1641521 1638594 1635260 1631367 1627606 1624494 1622042 1620469 1620409
52185 1620409 1622267 1626048 1631879 1639943 1649756 1660351 1671534 1684261 1699327 1716176 1733455 1750412
52173 1750412 1767414 1785378 1805061 1826675 1849758 1873223 1895556 1915200 1931198 1943732 1953773
52162 1953773 1962039 1968550 1973307 1976680 1978636 1978142 1974094 1966402 1955591 1942020 1926586 1911501 1898695
$$ packed form
52245G48101J3693J6124J8459J9853J9558J8539J8935K1543K4927K7343K8444
52234I75519K8894K9356L0249L1584L2703L2924L2454L2031L1743L1178L0520
52223A319155L0450L0868L0849K9870K8149K5815K2870K0008J8212J7409J6723
52212A590378J6024J5792J5284J2675P789L203J555K704M347M538K788l44l634
52199A673099n761o323o015n456m566l457k927l334l893l761l112k452j573o0
52185A620409J858L781N831Q064R813J0595J1183J2727J5066J6849J7279J6957
52173A750412J7002J7964J9683K1614K3083K3465K2333J9644J5998J2534J0041
52162A953773Q266O511M757L373J956m94m048p692j0811j3571j5434j5085j2806
$$ plain form
52149 1898695 1887264 1873936 1856471 1835517 1812856 1789236 1764704 1739821 1715355 1691380 1667717
52138 1667717 1644844 1623497 1603705 1585063 1567733 1552390 1539253 1527825 1517545 1508096 1499227 1490991
52126 1490991 1484170 1479661 1477174 1475192 1472595 1469707 1467163 1464349 1459969 1454144 1448873 1445888 1444766 1443890
52112 1443890 1442662 1441683 1441002 1439548 1436675 1433116 1429710 1426056 1421315 1415570 1409405 1402637 1394626 1385608
52098 1385608 1376690 1368649 1361661 1356019 1351945 1348610 1344442 1338727 1332067 1325189 1318324 1311937 1306789 1302687
52084 1302687 1298279 1292880 1287609 1283851 1281348 1278703 1275157 1270885 1266021 1260526 1254916 1250130 1246493 1243442
52070 1243442 1240337 1237033 1233656 1230362 1227385 1224859 1222558 1220149 1217722 1215694 1214303 1213606 1213856 1215276
52056 1215276 1217415 1219478 1221553 1224924 1230573 1237743 1244613 1250235 1255265 1260905 1267932 1276983 1288899 1303993
$$ packed form
52149A898695j1431j3328j7465k0954k2661k3620k4532k4883k4466k3975k3663
52138A667717k2873k1347j9792j8642j7330j5343j3137j1428j0280r449q869q236
52126A490991o821m509k487j982k597k888k544k814m380n825n271k985j122q76
52112A443890j228r79o81j454k873l559l406l654m741n745o165o768q011r018
52098A385608q918q041o988n642m074l335m168n715o660o878o865o387n148m102
52084A302687m408n399n271l758k503k645l546m272m864n495n610m786l637l051
52070A243442l105l304l377l294k977k526k301k409k427k028j391o97K50J420
52056A215276K139K063K075L371N649P170O870N622N030N640P027R051J1916J5094
$$ plain form
52042 1303993 1321420 1340182 1360591 1383813 1409961 1437704 1466048 1495511 1526923 1560144 1594837
52031 1594837 1631543 1670631 1710754 1749783 1787087 1823560 1859445 1893653 1925518 1955804 1985306
52020 1985306 2013562 2039696 2063599 2085471 2104890 2121076 2133618 2142375 2147332 2149184 2149458 2149198 2147818
52007 2147818 2143924 2136944 2127469 2116263 2103502 2088793 2071644 2052290 2032373 2014276 1999304 1986908
51995 1986908 1975953 1965989 1956724 1947208 1936757 1926420 1918421 1914012 1912479 1912256 1912457 1913359 1915952 1921199
51981 1921199 1929428 1940326 1953353 1967711 1981954 1994537 2005390 2016322 2029179 2043875 2058720
51970 2058720 2072176 2083755 2093800 2103085 2112150 2120326 2125956 2128273 2128454 2127964 2126508 2122671 2116006 2107211
51956 2107211 2096635 2083911 2068846 2051320 2030454 2005411 1977163 1948095 1919443 1890194 1858770
$$ packed form
52042A303993J7427J8762K0409K3222K6148K7743K8344K9463L1412L3221L4693
52031A594837L6706L9088M0123L9029L7304L6473L5885L4208L1865L0286K9502
52020A985306K8256K6134K3903K1872J9419J6186J2542Q757M957J852K74k60j380
52007B147818l894o980r475j1206j2761j4709j7149j9354j9917j8097j4972j2396
51995A986908j0955r964r265r516j0451j0337p999m409j533k23K01R02K593N247
51981A921199Q229J0898J3027J4358J4243J2583J0853J0932J2857J4696J4845
51970B058720J3456J1579J0045R285R065Q176N630K317J81m90j456l837o665q795
51956B107211j0576j2724j5065j7526k0866k5043k8248k9068k8652k9249l1424
$$ plain form
51945 1858770 1824675 1788347 1750693 1713184 1677027 1641512 1604337 1564390 1523340 1483770 1446594
51934 1446594 1411011 1376032 1341121 1305994 1270835 1236295 1202595 1169028 1134982 1100966 1068011
51923 1068011 1036607 1006844 979032 953314 929043 905268 881711 858772 836884 816281 796931
51912 796931 778260 759495 740785 723327 707837 693634 679931 667079 655419 643725 630355
51901 630355 615724 602220 591535 583164 575652 568234 561062 554710 549656 545521 540912 534913 528651
51888 528651 524210 521793 519278 515005 509784 505357 501897 498160 493502 488657 484604 481428 478328 474264
51874 474264 468679 461895 454897 448618 443535 439907 437887 437183 436965 436371 434877 432212 428452 424330 420880
51859 420880 418482 416624 414742 412641 410073 406836 403762 402595 404006 406296 406939 405056 401711 398357
$$ packed form
51945A858770l4095l6328l7654l7509l6157l5515l7175l9947m1050l9570l7176
51934A446594l5583l4979l4911l5127l5159l4540l3700l3567l4046l4016l2955
51923A068011l1404k9763k7812k5718k4271k3775k3557k2939k1888k0603j9350
51912G96931j8671j8765j8710j7458j5490j4203j3703j2852j1660j1694j3370
51901F30355j4631j3504j0685q371p512p418p172o352n054m135m609n999o262
51888E28651m441k417k515m273n221m427l460l737m658m845m053l176l100m064
51874D74264n585o784o998o279n083l628k020p04k18n94j494k665l760m122l450
51859D20880k398j858j882k101k568l237l074j167J411K290O43j883l345l354
$$ plain form
51845 398357 395877 394678 394577 394630 393954 392691 391465 390201 388387 386192 384165 381969 378866 375646 374481
51830 374481 376078 378252 378346 376209 373698 372085 371303 371244 372181 373661 374214 372813 370026 367334 365828 365760
51814 365760 366663 367422 366734 364303 361452 360001 360493 361936 363277 364539 366266 368451 370706 373148 376260
51799 376260 379689 382175 383277 384461 387508 392182 396513 399278 401022 402479 403408 403744 404751 407677 411785
51784 411785 414979 416219 416249 416047 415726 415227 415006 415494 416584 418057 419884 421718 422812 423026 423382 424962
51768 424962 427696 430789 433883 437086 440206 442896 445377 448090 450567 451630 451051 450166 450236 450799 450428 448775
51752 448775 447057 446510 447002 447312 446357 444017 441240 439535 439911 441800 443259 442630 440112 437594 437106 439616
51736 439616 444890 451832 458782 464124 467139 468301 468659 469051 469827 470928 472017 472845 473757 475512 478329
$$ packed form
51845C98357k480j199j01N3o76j263j226j264j814k195k027k196l103l220j165
51830C74481J597K174R4k137k511j613p82n9R37J480N53j401k787k692j506o8
51814C65760R03P59o88k431k851j451M92J443J341J262J727K185K255K442L112
51799C76260L429K486J102J184L047M674M331K765J744J457R29L36J007K926M108
51784D11785L194J240L0k02l21m99k21M88J090J473J827J834J094K14L56J580
51768D24962K734L093L094L203L120K690K481K713K477J063n79q85P0N63l71j653
51752D48775j718n47M92L10r55k340k777j705L76J889J459o29k518k518m88K510
51736D39616N274O942O950N342L015J162L58L92P76J101J089Q28R12J755K817
$$ plain form
51721 478329 481378 483604 484837 485794 487258 489634 492966 496784 500220 502924 505605 508857 511710 512548 511658
51706 511658 511622 514449 519338 524139 528122 532134 536732 541722 547433 554796 563604 571899 577977 582321 586710
51691 586710 591833 596542 599271 599499 597802 595053 591879 588656 585707 583313 581472 579848 578181 576719
51677 576719 575850 575381 574678 573566 572493 571565 570116 567850 565830 565459 566597 567458 566404 563237 558795 554092
51661 554092 550128 547697 546653 545671 543314 539341 534669 530202 526047 521898 517825 514400 512002 510200
51647 510200 508142 505664 503605 502620 502020 500438 497591 494617 492622 491693 491566 492243 493345 493752 492876 491725
51631 491725 491657 492488 492897 492507 492408 493592 496020 499433 504008 509734 516038 522587 529735 537659 545687 552937
51615 552937 559001 563582 566157 566637 565758 564216 561987 559076 556232 554065 551936 548608 543651 537479 530427
$$ packed form
51721D78329L049K226J233R57J464K376L332L818L436K704K681L252K853Q38q90
51706E11658l6K827M889M801L983M012M598M990N711P363Q808Q295O078M344M389
51691E86710N123M709K729K28j697k749l174l223k949k394j841j624j667j462
51677E76719q69m69p03j112j073r28j449k266k020l71J138Q61j054l167m442m703
51661E54092l964k431j044r82k357l973m672m467m155m149m073l425k398j802
51647E10200k058k478k059r85o00j582k847k974j995r29j27O77J102M07q76j151
51631D91725o8Q31M09l90r9J184K428L413M575N726O304O549P148P924Q028P250
51615E52937O064M581K575M80q79j542k229k911k844k167k129l328m957o172p052
$$ plain form
51600 530427 522672 514644 506642 498331 489565 481260 474372 468314 461640 454116 446805 440180 433712 427552
51586 427552 423030 420777 419641 418256 416564 414984 413129 410308 406546 402431 398761 396916 398261 402096
51572 402096 405429 406212 405796 406515 407838 407110 403761 400301 398703 398006 396494 394407 393066 392604 392253 392211
51556 392211 393658 396878 400535 403026 403929 403975 404082 404544 404941 404822 404562 405301 407888 412137 417241 422472
51540 422472 427282 431327 434928 439080 444388 450341 456219 462397 469990 479215 488750 496829 502571 506429
51526 506429 509888 514614 521262 528964 536365 542964 548852 553460 555714 555598 554389 552805 550069 545659
51512 545659 541060 538395 537678 536808 534462 531871 531367 533948 538715 544063 548926 553247 557699 562917 568939
51497 568939 575633 583329 592249 601355 608871 614340 619202 624645 629829 633077 634077 633756 632647 630740
$$ packed form
51600E30427p755q028q002q311q766q305o888o058o674p524p311o625o468o160
51586D27552m522k253j136j385j692j580j855k821l762m115l670j845J345L835
51572D02096L333P83m16P19J323p28l349l460j598o97j512k087j341m62l51m2
51556C92211J447L220L657K491R03M6J07M62L97j19k60P39K587M249N104N231
51540D22472M810M045L601M152N308N953N878O178P593R225R535Q079N742L858
51526E06429L459M726O648P702P401O599N888M608K254j16j209j584k736m410
51512E45659m599k665p17q70k346k591n04K581M767N348M863M321M452N218O022
51497E68939O694P696Q920R106P516N469M862N443N184L248J000l21j109j907
$$ plain form
51483 630740 628528 626672 624606 621128 616737 613827 613815 615384 616576 617394 618973 621018 621753 620290 617648
51468 617648 615184 613024 610466 607205 603717 600720 598447 596267 593169 588887 584256 580125 576398 572705
51454 572705 569415 566942 564516 560985 556781 553664 552217 550969 548574 545511 542812 540403 537920 536150
51440 536150 536055 536946 537286 537175 538424 541929 546325 549807 552108 553918 555287 555615 554890 554165 554802 557411
51424 557411 561213 564306 565151 564223 563732 565411 569163 574174 580301 587388 594032 598620 601517 604843 609802
51409 609802 615517 621078 627479 636354 647412 658317 667065 673593 679008 684053 688720 692845 696592 700341
51395 700341 704202 707615 709507 709167 707034 704481 702705 701811 700884 698751 694730 688858 681567 673215 663962
51380 663962 654011 643761 633692 624262 615881 608643 602071 595496 588718 581817 574247 565034 554445
$$ packed form
51483F30740k212j856k066l478m391k910j2J569J192Q18J579K045P35j463k642
51468F17648k464k160k558l261l488k997k273k180l098m282m631m131l727l693
51454E72705l290k473k426l531m204l117j447j248k395l063k699k409k483j770
51440E36150r5Q91L40j11J249L505M396L482K301J810J369L28p25p25O37K609
51424E57411L802L093Q45r28m91J679L752N011O127P087O644M588K897L326M959
51409F09802N715N561O401Q875J1058J0905Q748O528N415N045M667M125L747L749
51395G00341L861L413J892l40k133k553j776q94r27k133m021n872p291q352r253
51380F63962r951j0250j0069r430q381p238o572o575o778o901p570r213j0589
$$ plain form
51367 554445 544668 537846 533746 530310 526232 521991 518584 516506 516200 518150 521853 525660 528458 530844
51353 530844 533930 537679 541133 543743 545493 546138 545363 543585 541618 539375 535672 529637 521892 514021 507092
51338 507092 500741 493629 484882 475228 466369 458991 451849 443342 433586 424238 416421 409619 402594 394735
51324 394735 386474 378959 373279 369331 365475 360140 353793 348431 344951 342124 338709 335454 333910 333893 333348
51309 333348 330723 326517 322342 319143 316626 313913 310409 306243 302081 298471 295529 293366 292409 292771 293480
51294 293480 293156 291700 290649 291433 293747 296147 297847 299200 300652 302126 303687 306022 309666 314182 318768
51279 318768 323332 328220 332997 336478 338380 340116 343280 347821 352508 356810 361386 366731 372369 377698
51265 377698 382747 387493 391150 392924 393050 392272 390565 387405 383241 379596 377163 374672 370410 364288 357557
$$ packed form
51367E54445r777o822m100l436m078m241l407k078l06J950L703L807K798K386
51353E30844L086L749L454K610J750O45p75j778j967k243l703o035p745p871o929
51338E07092o351p112q747r654q859p378p142q507r756r348p817o802p025p859
51324C94735q261p515n680l948l856n335o347n362l480k827l415l255j544j7n45
51309C33348k625m206m175l199k517k713l504m166m162l610k942k163r57L62P09
51294B93480l24j456j051P84K314K400J700J353J452J474J561K335L644M516M586
51279C18768M564M888M777L481J902J736L164M541M687M302M576N345N638N329
51265C77698N049M746L657J774J26p78j707l160m164l645k433k491m262o122o731
$$ plain form
51250 357557 350773 343185 334306 325237 317792 312689 309016 305275 300655 295598 291533 289885 290855 293025
51236 293025 294345 293584 290940 287577 284770 283168 282471 281857 280905 279904 279136 278304 277116 275956 275339 274924
51220 274924 273824 271800 269470 267392 265698 264591 264329 264569 264621 264610 265386 266991 268246 268467 268568 269571
51204 269571 270902 271342 271008 271092 271934 272630 272493 271763 270734 269253 267279 264993 262137 258270 254005 250990
51188 250990 250032 250153 250197 250527 252105 254469 255922 255631 254396 253144 251802 250345 250033 252372 256910 261082
51172 261082 262542 261064 257975 254595 251867 250729 251683 254082 256822 259745 263448 267613 270657 271522 270853
51157 270853 269805 268668 267508 267283 269004 272105 274795 276074 276677 278106 281304 285977 290501 292830 292430
51142 292430 291150 291444 293973 297722 301911 306401 310432 312652 312921 312812 313601 314693 314695 313253 311220 309705
$$ packed form
51250C57557o784p588q879r069p445n103l673l741m620n057m065j648R70K170
51236B93025J320p61k644l363k807j602o97o14r52j001p68q32j188j160o17m15
51220B74924j100k024k330k078j694j107k62K40N2j1P76J605J255K21J01J003
51204B69571J331M40l34Q4Q42O96j37p30j029j481j974k286k856l867m265l015
51188B50990r58J21M4L30J578K364J453k91j235j252j342j457l12K339M538M172
51172B61082J460j478l089l380k728j138R54K399K740K923L703M165L044Q65o69
51157B70853j048j137j160k25J721L101K690J279O03J429L198M673M524K329m00
51142B92430j280K94K529L749M189M490M031K220K69j09P89J092Kj442k033j515
$$ plain form
51126 309705 309534 310950 313127 314446 313908 312122 310590 310408 311780 314114 316195 316892 316195 315083 313990
51111 313990 312032 308331 303524 299262 296566 295196 294235 292649 289540 284677 278867 273445 269324 266687
51097 266687 265445 265664 267487 270635 273954 275850 275686 274536 273897 273754 272886 271068 269799 270304 271932 273366
51081 273366 274596 276701 280102 283931 286939 288346 288035 286468 284288 281650 278271 274355 270825 268246
51067 268246 266171 264126 262522 261879 261811 261713 261895 262959 264433 265084 264497 263398 262507 262017 262150 263197 264730
51050 264730 265603 265195 264274 264358 266391 269919 273293 274947 274914 274881 276286 278699 280631 281538 282212 283433 285141
51033 285141 286946 288548 289571 289791 289816 290871 293554 297191 300630 303335 305560 307811 310198 312029 312134
51018 312134 310105 307256 305929 307628 311890 316812 320393 321621 320853 319332 318235 318154 319329 321815 325213
$$ packed form
51126C09705j71J416K177J319n38j786j532j82J372K334K081O97o97j112j093
51111C13990j958l701m807m262k696j370r61j586l109m863n810n422m121k637
51097B66687j242K19J823L148L319J896j64j150o39j43q68j818j269N05J628J434
51081B73366J230K105L401L829L008J407l11j567k180k638l379l916l530k579
51067B68246k075k045j604o43o8r8J82J064J474O51n87j099q91m90J33J047J533
51050B64730Q73m08r21Q4K033L528L374J654l3l3J405K413J932R07O74J221J708
51033B85141J805J602J023K20K5J055K683L637L439K705K225K251K387J831J05
51018C12134k029k849j327J699M262M922L581J228p68j521j097q1J175K486L398
$$ plain form
51003 325213 328802 332237 335555 338275 339505 339525 340123 342254 344328 344273 342625 341903 343222 345247 346480 346918
50987 346918 347120 347248 347527 348321 349234 349340 348736 348655 349488 350067 349619 349055 349431 350352 351047 351981 354023 356737
50969 356737 358826 359901 360672 361681 362802 363743 364231 363968 363277 363445 365539 369144 373064 376956 381256 385795
50953 385795 389614 392310 394597 397351 400863 405103 409839 414246 417274 418880 420311 422817 426638 431600
50939 431600 438033 446377 456223 466411 476157 485670 495688 506714 518783 531768 545762 561157
50927 561157 578245 596681 615500 633905 652033 670794 690974 712684 735734 760261 786761
50916 786761 815600 846709 879774 914625 951558 991535 1035939 1085694 1140442 1198909 1260305
50905 1260305 1325158 1394701 1469786 1550580 1636759 1727568 1822016 1919533 2020202 2123848 2229110
$$ packed form
51003C25213L589L435L318K720J230K0N98K131K074n5j648p22J319K025J233M38
50987C46918K02J28K79P94R13J06o04q1Q33N79m48n64L76R21O95R34K042K714
50969C56737K089J075P71J009J121R41M88k63o91J68K094L605L920L892M300M539
50953C85795L819K696K287K754L512M240M736M407L028J606J431K506L821M962
50939D31600O433Q344R846J0188R746R513J0018J1026J2069J2985J3994J5395
50927E61157J7088J8436J8819J8405J8128J8761K0180K1710K3050K4527K6500
50916G86761K8839L1109L3065L4851L6933L9977M4404M9755N4748N8467O1396
50905A260305O4853O9543P5085Q0794Q6179R0809R4448R7517J00669J03646J05262
$$ plain form
50894 2229110 2333886 2436525 2536058 2631441 2721186 2803515 2876312 2937194 2984626 3019172 3042930
50883 3042930 3057422 3062544 3057538 3042274 3017435 2984343 2945113 2902374 2858214 2813548 2768731 2724379
50871 2724379 2681279 2639819 2599808 2560638 2521488 2481520 2439907 2395549 2347197 2294469 2238387
50860 2238387 2180139 2119591 2056012 1990016 1923345 1856572 1788652 1719494 1651445 1587128 1526960
50849 1526960 1470077 1416701 1367868 1323315 1281503 1241963 1206257 1176038 1151060 1129581 1110120
50838 1110120 1092346 1076688 1063558 1052927 1044392 1037506 1031939 1027527 1024550 1023895 1026292 1031229 1037275
50825 1037275 1043724 1051072 1059457 1067676 1074718 1081510 1089985 1100845 1113306 1126619 1140611 1154909 1169056
50812 1169056 1183707 1200608 1221003 1244731 1271100 1299757 1330456 1362920 1397529 1435515 1477922
$$ packed form
50894B229110J04776J02639R9533R5383Q9745Q2329P2797O0882M7432L4546K3758
50883C042930J4492N122n006j5264k4839l3092l9230m2739m4160m4666m4817m4352
50871B724379m3100m1460m0011l9170l9150l9968m1613m4358m8352n2728n6082
50860B238387n8248o0548o3579o5996o6671o6773o7920o9158o8049o4317o0168
50849A526960n6883n3376m8833m4553m1812l9540l5706l0219k4978k1479j9461
50838A110120j7774j5658j3130j0631q535o886n567m412k977o55K397M937O046
50825A037275O449P348Q385Q219P042O792Q475J0860J2461J3313J3992J4298J4147
50812A169056J4651J6901K0395K3728K6369K8657L0699L2464L4609L7986M2407
$$ plain form
50801 1477922 1524670 1574937 1628064 1683972 1743327 1807694 1879039 1958535 2046108 2141401 2244928
50790 2244928 2358004 2481886 2617379 2765051 2925294 3097968 3282160 3476516 3679947
50781 3679947 3891992 4112210 4339179 4570440 4803481 5036080 5265065 5485280 5690744
50772 5690744 5876783 6040223 6177725 6285191 6359493 6400206 6409302 6389678 6344442 6276980 6191102
50761 6191102 6091250 5982865 5872053 5764191 5662610 5568509 5481724 5401320 5325841 5253582
50751 5253582 5182689 5110923 5035637 4954321 4865237 4767471 4660647 4544798 4420480 4288937
50741 4288937 4152236 4013089 3874013 3736582 3601796 3471278 3347602 3233167 3129255
50732 3129255 3036612 2956520 2890615 2839711 2803291 2780177 2769277 2769754 2781150 2803703 2838115 2884381
$$ packed form
50801A477922M6748N0267N3127N5908N9355O4367P1345P9496Q7573R5293J03527
50790B244928J13076J23882J35493J47672J60243J72674J84192J94356K03431
50781C679947K12045K20218K26969K31261K33041K32599K28985K20215K05464
50772E690744J86039J63440J37502J07466P4302M0713R096j9624m5236o7462q5878
50761F191102r9852j08385j10812j07862j01581r4101q6785q0404p5479p2259
50751E253582p0893p1766p5286q1316q9084r7766j06824j15849j24318j31543
50741D288937j36701j39147j39076j37431j34786j30518j23676j14435j03912
50732C129255r2643q0092o5905n0904l6420k3114j0900M77J1396K2553L4412M6266
$$ plain form
50720 2884381 2940751 3004074 3071112 3139311 3206456 3270322 3329101 3381774 3427408 3464271 3490475
50709 3490475 3505599 3510840 3507219 3494539 3472828 3443923 3410191 3371864 3326963 3274156 3214534 3150122
50697 3150122 3081753 3009400 2933928 2857346 2781482 2707369 2636109 2569655 2510288 2459448 2417119
50686 2417119 2382117 2353099 2329647 2312549 2302914 2301140 2307013 2320638 2342771 2374049 2414363 2463281
50674 2463281 2520670 2586513 2660488 2742560 2834005 2936950 3052099 3177204 3308535 3443819
50664 3443819 3583181 3727183 3874787 4023568 4170961 4314319 4450107 4574217 4683431
50655 4683431 4775942 4850189 4903794 4934242 4940333 4922653 4882879 4823165 4746268 4655948 4557016
50644 4557016 4454850 4354489 4259706 4172583 4093706 4022612 3958217 3899412 3845767 3797592 3754819
$$ packed form
50720B884381N6370O3323O7038O8199O7145O3866N8779N2673M5634L6863K6204
50709C490475J5124N241l621j2680k1711k8905l3732l8327m4901n2807n9622o4412
50697C150122o8369p2353p5472p6582p5864p4113p1260o6454n9367n0840m2329
50686B417119l5002k9018k3452j7098r635j774N873J3625K2133L1278M0314M8918
50674B463281N7389O5843P3975Q2072R1445J02945J15149J25105J31331J35284
50664C443819J39362J44002J47604J48781J47393J43358J35788J24110J09214
50655D683431R2511P4247N3605L0448O091j7680l9774n9714p6897r0320r8932
50644D557016j02166j00361r4783q7123p8877p1094o4395n8805n3645m8175m2773
$$ plain form
50633 3754819 3715661 3676709 3634738 3588377 3537812 3483124 3423599 3358926 3290553 3221313 3154004
50622 3154004 3090816 3033839 2985056 2945468 2915026 2894003 2884046 2887311 2904818 2936153 2980565 3037877
50610 3037877 3108685 3194343 3296615 3416564 3553555 3705785 3871679 4050075 4238957 4434851
50600 4434851 4633888 4832739 5027720 5213492 5383836 5534296 5663736 5773112 5863120 5933537
50590 5933537 5984453 6017154 6033243 6033255 6016735 5983597 5934924 5872481 5798073 5713556 5621040 5522899
50578 5522899 5421965 5321724 5225559 5135353 5051447 4974447 4906420 4849577 4804226 4768858 4741857
50567 4741857 4722241 4708908 4700220 4694516 4690332 4686078 4680338 4672710 4663608 4652961 4639885 4624078 4606922
50554 4606922 4590516 4575974 4563316 4552975 4546787 4547035 4554480 4567599 4583954 4602177 4622121 4643039
$$ packed form
50633C754819l9158l8952m1971m6361n0565n4688n9525o4673o8373o9240o7309
50622C154004o3188n6977m8783l9588l0442k1023r957L265J7507L1335M4412N7312
50610C037877P0808Q5658J02272J19949J36991J52230J65894J78396J88882J95894
50600D434851J99037J98851J94981J85772J70344J50460J29440J09376R0008P0417
50590E933537N0916L2701J6089J2j6520l3138m8673o2443p4408q4517r2516r8141
50578E522899j00934j00241r6165r0206q3906p7000o8027n6843m5351l5368k7001
50567D741857j9616j3333q688n704m184m254n740p628r102j0647j3076j5807j7156
50554D606922j6406j4542j2658j0341o188K48P445J3119J6355J8223J9944K0918
$$ plain form
50542 4643039 4662417 4677081 4684997 4685453 4678062 4662255 4636978 4599848 4547253 4476968 4390738 4292948
50530 4292948 4186570 4071737 3948463 3819002 3686692 3553874 3422069 3292997 3168088
50521 3168088 3047767 2932618 2824760 2726668 2638819 2559689 2488097 2424377 2369147 2322036 2282105
50510 2282105 2248781 2221891 2201353 2187332 2180326 2180605 2187591 2200174 2217738 2240714 2269983 2305854
50498 2305854 2348054 2396912 2453951 2520424 2595472 2676858 2763928 2858871 2964408 3081118 3207884
50487 3207884 3344042 3489568 3643374 3802918 3965879 4131162 4297686 4462804 4622453
50478 4622453 4772529 4909928 5032945 5141348 5236176 5319348 5393480 5461597 5526094 5587561
50468 5587561 5645151 5698525 5749028 5798495 5847311 5894466 5939572 5984246 6031293 6082942 6140198
$$ packed form
50542D643039J9378J4664P916M56p391j5807k5277l7130n2595p0285q6230r7790
50530D292948j06378j14833j23274j29461j32310j32818j31805j29072j24909
50521C168088j20321j15149j07858r8092q7849p9130p1592o3720n5230m7111l9931
50510B282105l3324k6890k0538j4021p006K79O986J2583J7564K2976K9269L5871
50498B305854M2200M8858N7039O6473P5048Q1386Q7070R4943J05537J16710J26766
50487C207884J36158J45526J53806J59544J62961J65283J66524J65118J59649
50478D622453J50076J37399J23017J08403R4828Q3172P4132O8117O4497O1467
50468E587561N7590N3374N0503M9467M8816M7155M5106M4674M7047N1649N7256
$$ plain form
50457 6140198 6203374 6272439 6346596 6424057 6502721 6580993 6657569 6730378 6796070 6850745 6891170
50446 6891170 6915270 6921590 6908524 6874301 6817983 6740438 6644042 6531495 6405448 6269417 6128192
50435 6128192 5986528 5847895 5715307 5592936 5485545 5396186 5325479 5273255 5239603 5223704
50425 5223704 5222735 5232892 5250725 5272641 5293777 5308442 5311504 5298787 5266707 5212642 5135502 5035289
50413 5035289 4912480 4768757 4608014 4435429 4255302 4070564 3884356 3700873 3524011
50404 3524011 3355803 3196762 3047328 2908404 2780618 2663618 2556420 2458578 2370881 2294572
50394 2294572 2229743 2174827 2127879 2087938 2054788 2027928 2006614 1990703 1980656 1976636 1978148 1984601
50382 1984601 1995566 2010453 2028553 2049713 2074595 2104004 2138043 2175875 2216196 2258197 2302431
$$ packed form
50457F140198O3176O9065P4157P7461P8664P8272P6576P2809O5692N4675M0425
50446F891170K4100O320j3066l4223n6318p7545r6396j12547j26047j36031j41225
50435F128192j41664j38633j32588j22371j07391q9359p0707n2224l3652j5899
50425E223704r69J0157J7833K1916K1136J4665L062j2717l2080n4065p7140j00213
50413E035289j22809j43723j60743j72585j80127j84738j86208j83483j76862
50404C524011j68208j59041j49434j38924j27786j17000j07198r7842q7697p6309
50394B294572o4829n4916m6948l9941l3150k6860k1314j5911j0047m020J512O453
50382A984601J0965J4887J8100K1160K4882K9409L4039L7832M0321M2001M4234
$$ plain form
50371 2302431 2350461 2403180 2459728 2518505 2578788 2640599 2703457 2766452 2829623 2894002 2959840
50360 2959840 3025699 3089908 3152274 3213827 3275357 3336679 3396917 3455111 3510984 3565427 3619818
50349 3619818 3674569 3728863 3782146 3835259 3889515 3945200 4001638 4058279 4114836 4170436 4223483
50338 4223483 4272592 4317129 4356567 4389696 4414855 4430830 4437142 4433338 4418229 4390217 4348467 4293400
50326 4293400 4225816 4145900 4053588 3949743 3836536 3716862 3593937 3471225 3351801 3237558
50316 3237558 3129663 3029870 2940583 2863418 2798567 2745933 2705879 2678229 2661430 2653622 2653837 2661092
50304 2661092 2672758 2684918 2694090 2697671 2693109 2678129 2652060 2615972 2571190 2518584 2459461 2395969
50292 2395969 2329838 2261474 2191057 2119940 2050276 1983653 1920769 1861955 1807153 1755581 1706412
$$ packed form
50371B302431M8030N2719N6548N8777O0283O1811O2858O2995O3171O4379O5838
50360B959840O5859O4209O2366O1553O1530O1322O0238N8194N5873N4443N4391
50349C619818N4751N4294N3283N3113N4256N5685N6438N6641N6557N5600N3047
50338D223483M9109M4537L9438L3129K5159J5975O312l804j5109k8012m1750n5067
50326D293400o7584p9916r2312j03845j13207j19674j22925j22712j19424j14243
50316C237558j07895r9793q9287p7165o4851n2634m0054k7650j6799p808K15P255
50304B661092J1666J2160R172L581m562j4980k6069l6088m4782n2606n9123o3492
50292B395969o6131o8364p0417p1117o9664o6623o2884n8814n4802n1572m9169
$$ plain form
50281 1706412 1659947 1617480 1579820 1546512 1516675 1489970 1466448 1445974 1428466 1414421 1404594
50270 1404594 1399089 1397107 1397657 1400271 1405081 1412512 1422950 1436431 1452429 1470055 1488593 1507887 1528331
50257 1528331 1550630 1575469 1603035 1632733 1663533 1694732 1726324 1758686 1792206 1827196 1863854
50246 1863854 1902064 1941412 1981338 2020927 2058650 2093075 2124316 2154077 2183554 2211640 2235921
50235 2235921 2255080 2269337 2278679 2282016 2278678 2269812 2257415 2242384 2224269 2202667 2178118 2151640
50223 2151640 2123949 2095186 2064898 2032177 1996203 1956953 1915234 1872036 1828029 1783778 1740125
50212 1740125 1698094 1658371 1620855 1584710 1549009 1513662 1479784 1448909 1421564 1396680 1372625
50201 1372625 1348913 1326775 1308029 1293496 1282637 1274491 1268479 1264113 1260341 1255831 1250110 1244107 1239389
$$ packed form
50281A706412m6465m2467l7660l3308k9837k6705k3522k0474j7508j4045r827
50270A404594n505j982N50K614M810P431J0438J3481J5998J7626J8538J9294K0444
50257A528331K2299K4839K7566K9698L0800L1199L1592L2362L3520L4990L6658
50246A863854L8210L9348L9926L9589L7723L4425L1241K9761K9477K8086K4281
50235B235921J9159J4257R342L337l338q866j2397j5031j8115k1602k4549k6478
50223B151640k7691k8763l0288l2721l5974l9250m1719m3198m4007m4251m3653
50212A740125m2031l9723l7516l6145l5701l5347l3878l0875k7345k4884k4055
50201A372625k3712k2138j8746j4533j0859q146o012m366l772m510n721o003m718
$$ plain form
50188 1239389 1236940 1236776 1238386 1241069 1243762 1245033 1243846 1240481 1236386 1232824 1229752 1226242 1221787 1216690
50174 1216690 1211169 1204702 1196746 1187694 1178587 1169983 1161569 1152801 1143444 1133535 1123509 1114524 1108038 1104504
50160 1104504 1102695 1100743 1097859 1094887 1093263 1093610 1095235 1096789 1097462 1097597 1098230 1100100 1103224 1107313 1112230
50145 1112230 1117926 1124130 1130221 1135305 1138523 1139663 1139507 1139225 1139203 1138822 1137512 1135543 1133417 1130904 1127373
50130 1127373 1122961 1118758 1115622 1113216 1110558 1107365 1104464 1102750 1101809 1099835 1095088 1087440 1078394 1069642
50116 1069642 1061812 1054510 1047086 1039150 1030666 1021988 1013717 1006353 1000246 995934 994101 994789 997007 999675
50102 999675 1002651 1006136 1009299 1010545 1009406 1007111 1004533 1000462 993161 983278 973785 966527 959928 951011
50088 951011 939151 926890 917163 910617 905834 901301 896511 891617 886981 883335 881743 882625 884837 886382
$$ packed form
50188A239389k449j64J610K683K693J271j187l365m095l562l072l510m455n097
50174A216690n521o467p956r052r107q604q414q768r357r909j0026q985o486l534
50160A104504j809j952k884k972j624L47J625J554O73J35O33J870L124M089M917
50145A112230N696O204O091N084L218J140j56k82k2l81j310j969k126k513l531
50130A127373m412m203l136k406k658l193k901j714r41j974m747p648r046q752
50116A069642p830p302p424p936q484q678q271p364o107m312j833O88K218K668
50102I99675K976L485L163J246j139k295k578m071p301r883r493p258o599q917
50088I51011j1860j2261r727o546m783m533m790m894m636l646j592Q82K212J545
$$ plain form
50074 886382 886438 886324 887893 891194 894551 897017 899754 904431 911126 918717 926677 935141 943526 950697 956893
50059 956893 964120 973801 985019 995841 1005544 1014631 1023494 1032124 1040653 1049014 1056364 1061888 1066078 1070387
50045 1070387 1075830 1082653 1090896 1100117 1108907 1116058 1122167 1128823 1136294 1143532 1150557 1159011 1169722 1181612
50031 1181612 1194080 1208745 1227106 1247642 1267243 1285064 1303166 1323591 1346478 1371164 1397387
50020 1397387 1424827 1452752 1481012 1510599 1542579 1577045 1613551 1651920 1692061 1733650 1776724
50009 1776724 1822239 1871325 1924102 1979802 2038047 2099474 2164979 2234759 2308349 2385452 2466536
49998 2466536 2552660 2644996 2744646 2852694 2969952 3096377 3231027 3372931 3521878 3677887
49988 3677887 3839711 4003837 4164758 4316073 4451820 4567831 4662603 4736980 4793004 4833150
$$ packed form
50074H86382N6j14J569L301L357K466K737M677O695P591P960Q464Q385P171O196
50059I56893P227R681J1218J0822R703R087Q863Q630Q529Q361P350N524M190M309
50045A070387N443O823Q243R221Q790P151O109O656P471P238P025Q454J0711J1890
50031A181612J2468J4665J8361K0536J9601J7821J8102K0425K2887K4686K6223
50020A397387K7440K7925K8260K9587L1980L4466L6506L8369M0141M1589M3074
50009A776724M5515M9086N2777N5700N8245O1427O5505O9780P3590P7103Q1084
49998B466536Q6124R2336R9650J08048J17258J26425J34650J41904J48947J56009
49988C677887J61824J64126J60921J51315J35747J16011R4772P4377N6024M0146
$$ plain form
49978 4833150 4860380 4878140 4889626 4896921 4900714 4900265 4893166 4875325 4841898 4788604 4712417 4611627
49966 4611627 4486210 4338589 4173646 3997469 3815923 3634204 3456901 3287544 3127909
49957 3127909 2978255 2838535 2709232 2591062 2484400 2389126 2304564 2229226 2161183 2099271
49947 2099271 2043677 1994827 1952090 1914274 1881029 1852608 1828017 1804534 1779861 1754251 1729814
49936 1729814 1707951 1687995 1668203 1647519 1626277 1605508 1585837 1567207 1549736 1534335 1521854
49925 1521854 1511650 1501844 1491343 1480912 1471821 1464209 1457458 1451585 1447284 1444863 1444083 1444955 1447892 1452980
49911 1452980 1459801 1468196 1478584 1491450 1506984 1525255 1546082 1568639 1591935 1615974 1641732 1669626
49899 1669626 1698764 1728479 1760018 1795715 1836420 1880538 1925860 1971865 2019926 2071759 2128234
$$ packed form
49978D833150K7230J7760J1486P295L793m49p099j7841l3427n3294p6187j00790
49966D611627j25417j47621j64943j76177j81546j81719j77303j69357j59635
49957C127909j49654j39720j29303j18170j06662r5274q4562p5338o8043o1912
49947B099271n5594m8850m2737l7816l3245k8421k4591k3483k4673k5610k4437
49936A729814k1863j9956j9792k0684k1242k0769j9671j8630j7471j5401j2481
49925A521854j0204r806j0501j0431r091p612o751n873m301k421p80Q72K937N088
49911A452980O821Q395J0388J2866J5534J8271K0827K2557K3296K4039K5758K7894
49899A669626K9138K9715L1539L5697M0705M4118M5322M6005M8061N1833N6475
$$ [...]
##END NTUPLES=NMR SPECTRUM
##END=
